##TITLE=Analysis number 324501
Compound Code cc 56604
Book Reference 508/26
Project Code adrs
Chemist Name antons
##JCAMPDX= 6.0         $$ Bruker NMR JCAMP-DX V2.0
##DATA TYPE= NMR SPECTRUM
##DATA CLASS= NTUPLES
##ORIGIN= Bruker BioSpin GmbH
##OWNER= nmr
$$ XWIN-NMR		Version 3.5
$$ Thu Nov 23 15:00:16 2006 GMT Standard Time (UT+0h)  MAYBRIDGE\nmr@NMR_250MHZ
##.OBSERVE FREQUENCY= 250.131544655141
##.OBSERVE NUCLEUS= ^1H
##.ACQUISITION MODE= SIMULTANEOUS (DQD)
##.ACQUISITION SCHEME= undefined
##.AVERAGES= 16
##.DIGITISER RES= 18
##SPECTROMETER/DATA SYSTEM= dpx250
##.PULSE SEQUENCE= zg30
##.SOLVENT NAME= CDCl3
##.SHIFT REFERENCE= (INTERNAL, CDCl3, 0, 16.4641)
##AUDIT TRAIL= $$ (NUMBER, WHEN, WHO, WHERE, WHAT)
$$ ##TITLE= Audit trail, XWIN-NMR		Version 3.5
$$ ##JCAMPDX= 5.01
$$ ##ORIGIN= Bruker BioSpin GmbH
$$ ##OWNER= nmr
$$ C:\u/data/dgb/nmr/ADRS/940/pdata/1/auditp.txt
$$ ##AUDIT TRAIL=  $$ (NUMBER, WHEN, WHO, WHERE, WHAT)
(   1,<2006-11-23 14:59:39.99 +000>,<MAYBRIDGE\nmr>,<NMR_250MHZ>,
      <created by zg, POWCHK disabled, PULCHK disabled
       configuration hash MD5:
       49 4B E0 1D 92 C2 6B 37 9F E6 65 BC 52 41 86 1D
       data hash MD5: 64K
       8C 05 92 28 68 26 23 C2 A9 54 27 BF 6D 7D 89 9B>)
(   2,<2006-11-23 14:59:57.62 +000>,<MAYBRIDGE\nmr>,<NMR_250MHZ>,
      <Start of raw data processing
       ef LB = 0.3 FT_mod = 6 PKNL = 1 SI = 32K 
       data hash MD5: 32K
       F7 9A 5A D3 07 C6 34 07 0A 60 3A 22 96 E9 2C 41>)
(   3,<2006-11-23 14:59:59.56 +000>,<MAYBRIDGE\nmr>,<NMR_250MHZ>,
      <apk 
       data hash MD5: 32K
       F4 0D 07 2C C8 4B B6 FD DC 1F 97 57 90 83 DF FF>)
(   4,<2006-11-23 15:00:00.51 +000>,<MAYBRIDGE\nmr>,<NMR_250MHZ>,
      <abs ABSG = 5 
       data hash MD5: 32K
       52 08 4F 57 01 4D 0D AC DC 0B 61 E2 19 63 F4 22>)
$$ ##END=
$$ 
$$ hash MD5
$$ 60 12 D6 3A D6 5D 8B A8 8A 45 9A 16 AC 3E CD 23
##$RELAX= 
##$RELAX= 
##$RELAX= 
##$RELAX= 
##$RELAX= 
##$RELAX= 
##$RELAX= 
$$ Bruker specific parameters
$$ --------------------------
##$DU= <C:\u>
##$EXPNO= 940
##$NAME= <ADRS>
##$PROCNO= 1
##$TYPE= <nmr>
##$USER= <dgb>
##$AMP= (0..31)
100 100 100 100 100 100 100 100 100 100 100 100 100 100 100 100 100 100 
100 100 100 100 100 100 100 100 100 100 100 100 100 100 
##$AQSEQ= 0
##$AQ_mod= 3
##$AUNM= <au_zg>
##$AUTOPOS= <14 >
##$BF1= 250.13
##$BF2= 250.13
##$BF3= 250.13
##$BF4= 250.13
##$BF5= 500.13
##$BF6= 500.13
##$BF7= 500.13
##$BF8= 500.13
##$BYTORDA= 1
##$CFDGTYP= 0
##$CFRGTYP= 5
##$CHEMSTR= <none>
##$CNST= (0..31)
1 1 145 1 1 1 1 1 1 1 1 1 1 1 1 1 1 1 1 1 1 1 1 1 1 1 1 1 1 1 1 1 
##$CPDPRG= <>
##$CPDPRG1= <>
##$CPDPRG2= <>
##$CPDPRG3= <>
##$CPDPRG4= <mlev>
##$CPDPRG5= <mlev>
##$CPDPRG6= <mlev>
##$CPDPRG7= <mlev>
##$CPDPRG8= <mlev>
##$CPDPRGB= <>
##$CPDPRGT= <>
##$D= (0..31)
0 1 0 0 0 0 0 0 0 0.06 0 0 0 0 0 0 0.0002 0 0 0 0 0 0 0 0 0 0 0 0 0 0 
0 
##$DATE= 1164293978
##$DBL= (0..7)
120 120 120 120 120 120 120 120 
##$DBP= (0..7)
150 150 150 150 150 150 150 150 
##$DBP07= 0
##$DBPNAM0= <>
##$DBPNAM1= <>
$$ [...]
##$SUBNAM7= <"">
##$SUBNAM8= <"">
##$SUBNAM9= <"">
##$SW= 20.6930455092707
##$SWIBOX= (0..15)
0 0 3 0 0 0 0 0 0 0 0 0 0 0 0 0 
##$SW_h= 5175.983436853
##$TD= 65536
##$TD0= 1
##$TE= 683.16
##$TE2= 300
##$TE3= 300
##$TEG= 300
##$TL= (0..7)
0 120 120 120 120 120 120 120 
##$TP= (0..7)
150 150 150 150 150 150 150 150 
##$TP07= 0
##$TPNAME0= <>
##$TPNAME1= <>
##$TPNAME2= <>
##$TPNAME3= <>
##$TPNAME4= <>
##$TPNAME5= <>
##$TPNAME6= <>
##$TPNAME7= <>
##$TPOAL= (0..7)
0.5 0.5 0.5 0.5 0.5 0.5 0.5 0.5 
##$TPOFFS= (0..7)
0 0 0 0 0 0 0 0 
##$TUNHIN= 0
##$TUNHOUT= 0
##$TUNXOUT= 0
##$USERA1= <user>
##$USERA2= <user>
##$USERA3= <user>
##$USERA4= <user>
##$USERA5= <user>
##$V9= 5
##$VALIST= <valist>
##$VCLIST= <CCCCCCCCCCCCCCC>
##$VD= 0
##$VDLIST= <DDDDDDDDDDDDDDD>
##$VPLIST= <PPPPPPPPPPPPPPP>
##$VTLIST= <TTTTTTTTTTTTTTT>
##$WBST= 1024
##$WBSW= 4
##$XGAIN= (0..3)
0 0 0 0 
##$XL= 0
##$YL= 0
##$YMAX_a= 470481
##$YMIN_a= -417642
##$ZGOPTNS= <>
##$ZL1= 120
##$ZL2= 120
##$ZL3= 120
##$ZL4= 120
##$ABSF1= 16.46411
##$ABSF2= -4.229063
##$ABSG= 5
##$ABSL= 3
##$ALPHA= 0
##$AQORDER= 0
##$ASSFAC= 0
##$ASSFACI= 0
##$ASSFACX= 0
##$ASSWID= 0
##$AUNMP= <proc_1d>
##$AZFE= 0.1
##$AZFW= 0.1
##$BCFW= 0
##$BC_mod= 0
##$BYTORDP= 0
##$COROFFS= 0
##$CY= 12.5
##$DATMOD= 1
##$DC= 0
##$DFILT= <>
##$DTYPP= 0
##$F1P= 14.0000005364418
##$F2P= -0.99999901652339
##$FCOR= 0.5
##$FTSIZE= 32768
##$FT_mod= 6
##$GAMMA= 0
##$GB= 0
##$INTBC= 1
##$INTSCL= 1
##$ISEN= 128
##$LB= 0.3
##$LEV0= 0
##$LPBIN= 0
##$MAXI= 10000
##$MC2= 0
##$MEAN= 0
##$ME_mod= 0
##$MI= 0
##$NCOEF= 0
##$NC_proc= -4
##$NLEV= 6
##$NOISF1= 0
##$NOISF2= 0
##$NSP= 0
##$NTH_PI= 0
##$NZP= 0
##$OFFSET= 16.46411
##$PC= 1
##$PHC0= -46.59398
##$PHC1= 6.978884
##$PH_mod= 1
##$PKNL= yes
##$PPARMOD= 0
##$PSCAL= 4
##$PSIGN= 0
##$REVERSE= no
##$SF= 250.13001447854
##$SI= 32768
##$SIGF1= 0
##$SIGF2= 0
##$SINO= 400
##$SIOLD= 32768
##$SREGLST= <1H.CDCl3>
##$SSB= 0
##$STSI= 32768
##$STSR= 0
##$SW_p= 5175.98343685301
##$SYMM= 0
##$S_DEV= 0
##$TDeff= 65536
##$TDoff= 0
##$TI= <Analysis number 999999
Compound Code 99
Book Reference 9
Project Code 9>
##$TILT= no
##$TM1= 0
##$TM2= 0
##$TOPLEV= 0
##$USERP1= <user>
##$USERP2= <user>
##$USERP3= <user>
##$USERP4= <user>
##$USERP5= <user>
##$WDW= 1
##$XDIM= 32768
##$YMAX_p= 539764202
##$YMIN_p= -110012
$$ End of Bruker specific parameters
$$ ---------------------------------
##NTUPLES= NMR SPECTRUM
##VAR_NAME=  FREQUENCY,     SPECTRUM/REAL,   SPECTRUM/IMAG
##SYMBOL=    X,             R,               I
##VAR_TYPE=  INDEPENDENT,   DEPENDENT,       DEPENDENT
##VAR_FORM=  AFFN,          ASDF,            ASDF
##VAR_DIM=   32768,         32768,           32768
##UNITS=     HZ,            ARBITRARY UNITS, ARBITRARY UNITS
##FACTOR=    0.157963299565203, 1,           1
##FIRST=     4118.16792779506, 0,            0
##LAST=      -1057.81550905795, 0,           0
##MIN=       -1057.81550905795, -110012,     0
##MAX=       4118.16792779506, 539764202,    0
$$ Real data points
##PAGE= N=1
##DATA TABLE= (X++(R..R)), XYDATA
$$ [...]
28359b148n281Q059j7555N084j7576J0221J1079l2066L907M1423k262k2491j5175
28346c4781m411L632J1959J9321J4595l0753j2551J9792K1568k166k1244o751
28334b1790J4827J5425K6431J6224k7230J860J3334j1516J257N696j3052n41p432
28321A3493O544K983q454K5209L008m967n744o680j1304J2495J6775r584N024
28308C8798O328R183l7545l2998o302l830m361J7959J1550J932J320J0177M629
28295A6840O222j460j7150k1541n765L727Q121J9297q705J1855j8169L045q824
28282a2507j3930L802O018l542J8304L1287Q322Q924n926k9444j2641N40J2499
28269A1706r914l175l262q036K0949l62J620j3365k2846k2805K8737J6580M662
$$ y = [-2148, -7429, 630, -16925, -11841, -29417, -19196, -8117, -40183, -36276, 5147, 2885, -19606, -34781, -39192, -35560, -23601, -4280, 10315, -20438, -32989, -13197, 8371, 6205, -15039, -21790, -6963, 8462, 34893, 51117, 23887, 25747, 39081, 27565, 28822, 34518, 21466, 20925, 13493, 20037, 23020, 14566, 39775, 42783, 37816, 32072, 25392, 14088, 26583, 43358, 33774, 38798, 45126, 54309, 16764, -16234, -22536, -26366, -30727, -12768, -1218, 714, 2034, 12211, 16840, 23062, 21602, 4452, -17089, -22854, -19127, -11006, 8291, -414, 11441, -6728, -3683, -12507, -26437, -22635, -16617, -20159, -1855, 29432, 37754, 46678, 40752, 11308, -1333, -793, 11706, 1792, -1383, -4645, -12681, 8268, 7906, 9526, -3839, -26685, -49490, -20753, -4173, 489]
28256D89J3886O901J3687m515j2383r260Q13o539K0500J0804j1011k7687n548
28243i863j1771L358J7800j2382j3996L0095j8793j5615J1507K4007L1214O347
28231D1908j2250l0159j9270L252L047J195p807J3681p066J1264K187j2960K2832
28218I854K1689R442n110l2850l087m936o909J7073L0147K4369k3147j6563L150
28205B3122J7938o187k0400M188k749k6894m824J275j2327Q807K924J2665R537
28192G075j3215J3617J0814J080j0023l9185J9747M3956K780J496m081p515k7232
28179f86k4173J5257o438l2558J6585K4967J2717R224L3242n982k2156j0086J1792
28166B1705p757j4116m325J1776j86N590L0165N688p974k4504J1347J3193l1249
$$ y = [489, 14375, 21276, 34963, 30448, 18065, 8805, 9618, 3079, 23579, 34383, 23372, -4315, -9863, -21634, -18276, -476, -12858, -26854, 3241, -15552, -31167, -19660, 4347, 35561, 41908, 29658, -501, -19771, -16519, -13472, -12277, -20084, -6403, -13469, -2205, -18, -12978, 9854, 31543, 40985, 35875, 3025, -62, -4998, -11907, 5166, 35313, 59682, 36535, 19972, 23122, 41060, 34873, 14473, 18661, 15912, -10982, -15806, -14531, -26858, -18051, -15127, -2462, 7075, -6140, 7477, 18291, 19371, 9348, -29837, -10090, 33866, 36646, 38142, 34061, 26546, -686, -24859, -9602, -16040, -48598, -32013, -7046, 5671, 14895, 48137, 42155, 19999, 9913, 21705, 13948, -168, -4493, 7283, 7097, 12687, 42852, 48540, 40566, 16062, 27409, 40602, 9353]
28153I353j1824O353O494m504O879j4428j1023K726k5724j248O764Q416Q440J982
28139a1344m465l133j0999L2143M1677m3983l4025K9732K1201N53k5966J0430
28127A821J9577k529k6748m4492j1018o238j156K1410O5853m467J5453K0886j9797
28114B8555p842j6014m774J560j1939N27J5582Q492k3215l4204K5078J6426K717
28101I49J5575p126q653j0965l899K2515r04k1877J4057k629l306j7876J9814
28088d325J947l0440N227K8943j2225m0155m266K4354j4770L96K0284K6376m278
28075b932O313j974K18j0435R979J5017j8267k0429O922n620K0795J691J3399
28062A4677L2007j2700k8868j2596L443P699n471j7371J6920O562j4755J4870
$$ y = [9353, -2471, 3882, 10376, 5872, 12751, -1677, -12700, -9974, -35698, -36946, -30182, -21766, -13326, -11344, -15809, -18942, -29941, 2202, 43879, -104, -34129, -4397, 16804, 17357, -8609, 1821, 21398, 18869, -7879, -52371, -63389, -69627, -70783, -49373, 16480, 12013, 27466, 48352, 28555, 20713, 4699, -75, 1485, -10454, -9927, 5655, 14147, -9068, -43272, -18194, -1768, 949, 16524, 9398, 745, -10220, -14119, 8396, 7492, -14385, -328, -2957, -6263, -24139, -4325, -2378, -32818, -27591, 1352, -10873, -51028, -55294, -30940, -45710, -45314, -25030, 1346, -2932, 3381, 1407, 1625, -8810, 1169, 16186, -2081, -22510, -15588, -21208, -413, 1278, 14677, 46684, 33984, 5116, -7480, -4037, 3662, -1809, -19180, -2260, 4302, -10453, 4417]
28050D417J1488J0984l403j6934J1219m972l65l437j4983l8844r065L8247K0429
28037D781M357P202j249j342k0357r342L026K6689J9839J350J6216l3131N839
28024B3878O266r352n7198K511J5304K4225K2168L686J3772m294j7405K4693J6944
28011F5198j4990k1274j3170O702n394k9737J6142J3521K6149j8360N787R19k0811
27998A0682J1202j2152O318R073J7260J0060k6423l1443J4653J371J3503K2502
27986D6606O642k0662n0651l9949J0109K2997R692M694j762K2611R412n394n143
27973I202k603n1K2345J1638J7272P75N484j0197k3654j7797l524p516j6921N782
27959i765K0181J2454k748J1951L301k0614k1230j591j2963O704J8964K312r720
$$ y = [4417, 15905, 26889, 23486, 6552, 17771, 12799, 12434, 8997, -5986, -44830, -53895, -15648, 4781, 9138, 16340, 15091, 13749, -6608, -15950, -12924, 13765, 33604, 34954, 51170, 18039, 23878, 30144, 20792, -36406, -33895, -18591, 5634, 27802, 31488, 45260, 40966, 23561, 48254, 65198, 50208, 28934, 15764, 22466, 17072, -12665, 3477, 16998, 43147, 24787, 30574, 31493, 10682, 21884, 9732, 16050, 25123, 42383, 52443, 26020, -5423, 9230, 10601, 24104, 46606, 53248, 32586, -18065, -58014, -47905, -24908, -15216, -10522, -12284, 10327, 19739, 14345, 9202, 6599, 6548, 28893, 40531, 57803, 58578, 64062, 53865, 30211, 12414, 8890, 1374, -15547, -9765, 10416, 22870, 20122, 32073, 35374, 14760, -6470, -8061, -21024, -14320, 4644, 6956, -2764]
27946b764k945O98j7916l61n311J2549K8486J4190o790J5497r669j1294n946K1985
27932C0409j2390L40K8206j0786k588L17l742k2138l1557l0757K4805K5415j2587
27919a7053j1755J3442K9674L9539J1222k3191l2924K713n788m541Q838J6761
27907B6937p46k6404j3400J0998M886n628O26K3437r643k0873O818j7236Q592
27894a1636K5445j1303j8224j3678j500J7174j691k701K0397K790J9398j0221
27882A4250j8145o834o319M441N340l155J615Q270J9942N232J0346p09J9359L4229
27868H7862M669k7672n510j538m7539j5570j0789j6061Q550r00J2253k745j88
27855a5178J2002j628K9279k1110l8242J2131J5478K3401n621j9707k2773j6555
$$ y = [-2764, -5709, -5011, -22927, -23288, -28599, -16050, 12436, 26626, 19836, 35333, 25664, 14370, 8424, 30409, 18019, 18359, 46565, 35779, 33191, 33508, 29766, 7628, -23929, -54686, -29881, -4466, -17053, -28808, -15366, 14308, 53847, 65069, 41878, 8954, 11667, 5879, 1338, 10176, 26937, 26191, -213, -13613, -2615, 2271, -3357, -2731, 20706, 11063, -9810, -2992, -20228, -11636, 13809, 2506, -15718, -29396, -30896, -13722, -15413, -18114, 2283, 5073, 24471, 14250, -3895, -10729, -17048, -12607, -7267, -10422, -8807, -537, 19405, 24637, 34983, 34274, 53633, 87862, 92531, 64859, 59349, 57811, 10272, -5298, -16087, -32148, -23598, -24498, -12245, -14990, -15178, -3176, -4804, 24475, 3365, -34877, -22746, -7268, 16133, 10512, -9195, -31968, -48523]
27843d8523K284K9368K7166J4042k4822k5035j3575L0722M2801J9914Q405m259
27831E8488j7360j3166j6495J8263J5994K42k6452j8217j814K3908R543j5414
27819A7520j1058L4250k4560l0876L2403K7299j3928k7670k2225N786k0340M049
27807b9350J348j1668L0731L992R674R78j3286j6084J7880O464k0315m62J0267
27794i831K6841j0628o99J0709J2179K317L768m1421m0119P419J1250n25L5352
27781F612O241j8544j961p436j1027q58K9623j1523k238O939n832K6618K6026
27768D2640l710j8747M394p666l2458m256j4137P686J5611l071j0606j0786l574
27755c8680K0748N20Q891j616l708O805K7848L816r159j2440L691n835J7423n1
$$ y = [-48523, -46239, -16871, 10295, 24337, -485, -25520, -39095, -8373, 34428, 54342, 62747, 58488, 41128, 27962, 11467, 29730, 45724, 45966, 19514, 1297, -517, 23391, 32934, 17520, 6462, 40712, 16152, -14724, 17679, 44978, 31050, 3380, -18845, -13059, -33399, -29350, -28002, -39670, -8939, -4947, 4727, 5705, -7581, -23665, -5785, 679, -19636, -20098, -9831, 17010, 6382, 5683, 16392, 28571, 30888, 34656, -6765, -46884, -39465, -28215, -28740, 6612, 12853, -5691, -7652, -15088, -26115, -26973, 2650, -8873, -11111, -4172, -10004, 16614, 42640, 38930, 20183, 24577, 16911, -15547, -19803, -33940, -26254, -10643, -13714, -24320, -35106, -38680, -17932, -17412, -8521, -10137, -13845, -7040, 20808, 24624, 15465, 3025, 6716, 881, 18304, 18253]
27741A8253j338l4825l86J8724J5620J4718k5503m0253N230J4189J7208k12p577
27728f152J1758J7976J3861K6388Q296j9043r826q835j1915o010J1193p082r345
27715A1264N083J0994k723j2M073J9850J6362n3080k2635j4687K1482J1104r68
27702F107J1521J2324J5390m031o96J2663N060l6790j8435J2982R831j3834k7286
27689a5194j9610M775J1572K2114j63O377N926j8266m134L642M481m519n703J5035
27675F333K9382Q037j0085j7048j3187j2534j2014o486j2972Q491K0429j231J6434
27662C549j813j3664j394P319m716P73l980P778j2546p718K1990L18j507J696
27648c915o998p259j6847L5897L3335p83j6054j6875j489K844R929p141J855n221
$$ y = [18253, 16915, -17910, -18296, 428, 16048, 30766, 5263, -34990, -29760, -15571, 1637, 1425, -6152, 5606, 23582, 37443, 63831, 72127, 53084, 43258, 34423, 22508, 16498, 27691, 20609, 11264, 16347, 27341, 24618, 24606, 28679, 48529, 64891, 11811, -10824, -25511, -4029, 7075, 6107, 17628, 29952, 45342, 41311, 40615, 53278, 58338, 21548, 3113, 16095, 25926, 12092, -15194, -34804, -30029, -18457, 3657, 3494, 9871, 15797, -2469, -6603, -2961, 1520, -2999, -8702, 6333, 35715, 43752, 33667, 16619, 3432, -9102, -21116, -27602, -40574, -32083, -11654, -12885, 3549, 1736, -11928, -13322, -6003, -10719, -9946, -13926, -6148, -18694, -26412, -4422, -4104, -5611, -3915, -10913, -18172, -35019, 878, 34213, 33430, 17376, 501, -988, 1856, 11785, 4644, 6499, 1278]
27634A278j9604L150J5854O719K7456q117j2832P423K5111K2089l2829j1729O091
27621C0060j4203l5033r293J0928O789N900j0420j039k966L6921j6087m880M134
27608H11J5896J0080K2822M032n1904j5887m505O005K267r332J8441l404N543
27595H65j2065J7925j7459j1244J3036K2388o251k9958m364o030l61k4200p963
27582f5681P823J283o802j827J6622J3612n891L3719P306J6096j5149n2004m962
27569e5855L3275J746k6267o3K1302J4215K1680k2253j0798M707J7547L534j612
27556A158j9071k980R531J9130J1483j9976j2963k472K8239N932p541p829m763
27543b122n57o608l5845o318J4535k0337J9217J5660J8333j2701J2292J8654J4789
$$ y = [1278, -18326, -15176, 678, 7397, 34853, 26736, 13904, 21327, 46438, 68527, 35698, 23969, 30060, 15857, -19176, -28469, -17541, -10752, -4852, -15272, -16311, -19277, 17644, 1557, -3323, 811, 16707, 26787, 49609, 53641, 1737, -14150, -18655, -12650, -10383, -19715, -1274, -4678, 865, -11200, 6725, -10734, -21978, -8942, 13446, 7195, -22763, -27127, -33157, -33518, -57718, -65681, -57858, -56575, -63377, -65204, -48582, -34970, -40861, -7142, 164, 16260, 1111, -50893, -55855, -22580, -20834, -47101, -47164, -25862, -11647, 10033, -12220, -23018, -18311, -764, 2770, 1158, -17913, -20893, -11362, 7768, 19251, -725, -13688, -16160, 12079, 18011, 10470, 2641, -2122, -2679, -9287, -45132, -51450, -36915, -57252, -38035, -22375, -4042, -16743, -4451, 14203, 28992]
27530B8992m2378k8749J9093K5651r252p980K8908K8225j1148j6k0811r393q177
27517g035j2391n803K0020J2804N20J723J0908J4886j6225m0277j0952l964o484
27504d2270K8147n156M3731K3473l2674k6378p56K7780o50m512j3993P109j5722
27491a1871J2634J5221R078r220M372p550k5284K978J9296K9229K0412l887k5908
27478B9500k6528J7488J4505k0408K2874Q212k1621j9628J2831K1577j025j7579
27466B0198k8189j3687J1662R269Q111K844k7757j9292J1138p111Q368l647n628
27453c3721N00N930l540J1349J2261J4639j738k602R213k8727N346K7646o11j1574
27439D371j1921k2975K258K0079j3966k719j0864p068K3790m062j0403J1993K7782
$$ y = [28992, -13386, -42135, -23042, 2609, -6643, -14623, 14285, 42510, 31362, 31346, 10535, 1142, -7035, -19426, -25229, -5209, 7595, 8115, 9838, 20746, 35632, 19407, -20870, -31822, -35786, -42270, -14123, -19279, 24452, 47925, 15251, -11127, -11883, 15897, 15247, 10735, -3258, 3851, -11871, 763, 15984, 25062, 15842, 20214, 12664, -12620, -9642, 9654, 38883, 59295, 55408, 29500, 2972, 20460, 34965, 14557, 37431, 45643, 24022, 4394, 17225, 38802, 37777, 20198, -7991, -21678, -10016, -747, 7364, 10208, -17549, -36841, -25703, -32814, -24446, -28093, -33721, -33221, -27291, -30831, -19482, -7221, 7418, 5680, 3078, 12291, -16436, -11090, 16556, 15945, 4371, -7550, -30525, -28267, -8188, -22154, -24873, -35737, -42805, -19015, -23077, -33480, -21487, 6295]
27426F295K6j5863j3013l733r929J0241K7264O213J1312o680j3790k178J3248
27413I413K3407j1583j3970r950j1319J3212K287j3462l8904k0388Q1886M1170
27401E1799j3419j4245k233j308j583J9030O351j1511n964J1771l7387j0910K7424
27388A7815M78R339N08Q097l095K1031J5864j0275j4657j5172k8544l107Q87K373
27374A542m30l6610j5046K8845L9384J7063j316l902M156k0681k7873J688P41
27361a2439J251l768O544J4825K5892j6911k5932J4974P209j7686p414J0543K1832
27348A8920M493k6067m855J0954p17M390Q130k1833l6659j4805J9129K2257K3517
27335F854K538m526r633K533j800R48j5998R04j330N476K9719R875j3330k555
$$ y = [6295, 6321, -9542, -22555, -26288, -36217, -25976, 1288, 7501, 18813, 12133, -1657, -3835, 9413, 32820, 21237, 7267, -2683, -14002, -790, 1497, -11965, -50869, -71257, 10629, 51799, 38380, 24135, 21902, 20594, 19011, 38041, 44392, 32881, 26917, 38688, 1301, -9609, 17815, 18293, 27632, 28140, 36237, 33142, 54173, 70037, 59762, 45105, 29933, 1389, -1718, -831, 1542, 1112, -35498, -50544, -21699, 17685, 34748, 33432, 29530, 33686, 13005, -14868, -13180, -12439, -11188, -14956, -8412, 6413, 32305, 15394, -10538, 4436, 11645, -6041, -13455, -2912, 18920, 23413, -2654, -7509, 3445, 2728, 7118, 15248, -6585, -43244, -58049, -38920, -16663, 6854, 9392, 4866, -4767, -2234, -4034, -3086, -19084, -18180, -19510, -14034, 15685, 25560, 12230, 9675]
27321I675j5275j963R705K438j529P236k7825Q892j3163J555J0209j0233l054
27308b3332L6378J1937J1694j3636j6368j2903R647k6547p700J1828J2305J4779
27296H082l058p746K0128o184J1466J0680l0245j7931K236K434Q075K6349R025
27283C3311k225q431J7533J1574Q428n118j6353n0408R16J039J7815m875j3096
27270i890L582j1750J5865J8826k356j3479r343j00O624p447K4426J6121j8255
27257A2824K0405L240j7959j2309k7508j7659k7841J4700L7824K9100L7276p246
27245D4847j1765j2428p795O281P577l4063k3907K747P927P155l594p671J3548
27232a1141J2512P03M716K6640r303j1603q178O669J9850k2801k9047J8640M1721
$$ y = [9675, -5600, -7563, 2142, 4580, 3051, 10287, -17538, -8646, -21809, -20254, -10045, -20278, -23332, 13046, 24983, 36677, 23041, 6673, -6230, 3417, -23130, -30830, -19002, -6697, 8082, 5024, -2722, 17406, 11222, 22688, 33368, 3123, -14808, -12572, -10138, -2063, 24286, 33311, 31086, 22655, 40188, 51762, 60190, 55072, 38719, -11689, -10773, -9734, 8081, 3206, -9890, -6308, -18058, -2193, 16633, 14277, 798, -8545, -8645, -2021, -9468, 14958, 31079, 12824, 33229, 36469, 18510, 6201, -21307, -38966, -66807, -52107, -14283, 14817, 52093, 44847, 33082, 20654, 12859, 19140, 26717, -7346, -31253, -28506, -20579, -13424, -17018, -24689, -11141, 1371, 2074, 6790, 33430, 24127, 12524, 4346, 11015, 30865, 8064, -20983, -2343, 39378]
27219C9378J2877p549j4564N348j4493p801J5718N942P56j5180j4884R816M201
27206A9565K0374J4282j1497m00n825K184Q458K244j318k0170j9028k5357J617
27193a4871n806N366J2765m691o540J9330o065j2550j53P016q188k2020m433q902
27179d9742J5703Q121o318J6970N724K2212k99M074j8876k3878j204l961K5631
27166e843K8189j1974K9799n31o298o220j1766j1681Q589k9202k4039K4355P221
27153i401J5145K4542J7534k6729l0595J5381J9159p126o540O206j0285L727r492
27140A526n335J0321J8940M78j8600j976J7495L318J617J717J1277P41j5924l588
27126B2007r270l0985k79N0360J4762k1090p871J3389q085l0434J3992p745k0763
$$ y = [39378, 52255, 44706, 30142, 35490, 20997, 13196, 28914, 34856, 35612, 20432, 5548, 15364, 19565, 39939, 54221, 42724, 42324, 36499, 38683, 47141, 49385, 48067, 27897, 8869, -16488, -14871, -20677, -15311, -2546, -7237, -13777, 5553, -512, -13062, -13215, -6199, -14387, -36407, -40840, -49742, -34039, -25918, -32236, -15266, -9542, 12670, 12371, 16445, -2431, -26309, -27513, -31474, -5843, 22346, 10372, 40171, 39640, 33342, 27122, 15356, 3675, 12264, -16938, -40977, -16622, -9401, 5744, 30286, 47820, 21091, -9504, 5877, 25036, 17910, 11370, 17576, 7291, 11018, 1526, -3809, 6512, 25452, 25930, 7330, 5354, 22849, 26167, 27784, 29501, 40778, 41519, 25595, 22007, 12737, -18248, -18527, 31833, 46595, 25505, 17634, 31023, 22938, -7496, 6496, -1249, -22012]
27113b2012o551J0166J7852K290K585j0596j93n671j5599K378J5561J653k2969
27100c1106r505k3278J199L6977J4097K6671j779Q282l458K321k776j45j5335
27087B165m081p014J4382R656J892J0111J0433l8577j6469j6765P12r212j1918
27074e4685K1827K1279j5921n209K8993j44r262J1648j9786q80J819K8485K3692
27061C1856J3972j2153p796j0619j2939k8529j9500K4138M687l93o025j5823M437
27048c4687K4558J5209J6135k331j6197k9471P571J7282j0143j5188m29P841L2904
27035A3054N738o130K6338K0300k073L966k957k9372k276j3269j1791j1719Q616
27022a575k2978j5641m083K1901M686J2434J0012J6603j514j438R027M729k2379
$$ y = [-22012, -28563, -18397, -545, 1745, 4330, -6266, -6459, -12130, -27729, -25351, -9790, -8137, -31106, -40611, -63889, -62690, -25713, -11616, 15055, 13276, 21558, 18100, 20421, 17645, 17500, 2165, -1916, -8930, 5452, 15108, 17000, 27111, 37544, -1033, -17502, -34267, -33555, -42767, -54685, -32858, -11579, -27500, -32709, -3716, -3860, -13122, -1474, -21260, -22140, -20321, 8164, 31856, 45828, 33675, 25879, 15260, 2321, -26208, -45708, -21570, -16883, -17276, -23301, -39124, -34687, -10129, 5080, 21215, 18884, 2687, -26784, -19213, -1931, -12074, -27262, -27691, -19850, 13054, 18792, 12662, 39000, 59300, 57227, 61193, 58236, 28864, 26588, 13319, 1528, -10191, -1575, -24553, -40194, -44277, -22376, -17690, -5256, 4756, 21359, 19845, 18407, 27434, 32163, 9784]
27009I784k0191K1439k195R898K6706k9764j6623p165J6890N160r026j0450k6581
26996c2118j2058l939M1605K5248J3950l88k6221k7854J8078P386j4489J6753
26984E953K9993J6915j3927K773k3054j8175J2299J0266k4096j8751L4259P830
26972B2285m2979J4898R11L2526o476k6337K2120n924q771Q451o7o571J341k4138
26958a8731J9310Q878J0611j5599k3282m184O041J8869o964K2665j9176K817j4832
26945a3577m0006J344J9352O433L6136J7025m743l4331j1917L0545J4987j7098
26933D150k9642L515J7227J9417L368m394n42j2397j9117K3018P031j3174k6725
26920b8265N736J0507J1820K1657J6707n681K0810q867m2969j0705K4929K0595
$$ y = [9784, -10407, 11032, 8837, 18735, 45441, 15677, -946, -8111, 8779, 13939, 4913, -5537, -32118, -44176, -48115, -6510, 18738, 32688, 32300, 6079, -21775, -3697, 3689, -10800, 5953, 35946, 52861, 38934, 41707, 18653, 478, 12777, 23043, -1053, -19804, 14455, 22285, -20694, -5796, -4885, 27641, 21165, -5172, 16948, 11024, 2253, 10704, 10637, 4066, 5407, -18731, 579, 9457, 20068, 4469, -18813, -22997, -16956, 1913, -5051, 17614, -1562, 1255, -13577, -53583, -52239, -32887, -26454, 9682, 26707, 21964, -12367, -24284, 6261, 21248, 4150, -25492, -21977, -4750, 14667, 18035, 13641, 13099, 702, -18415, 4603, 11634, -1540, -28265, -22529, -12022, -202, 21455, 38162, 32481, 53291, 44424, 1455, -9250, 15679, 36274]
26908C6274p139L0584j3087j9464j9237j5310Q235L567j788K7614L58K067q941
26895B3733N203k0081m4081j1370K0307m071L1278L0750j6429P9J28p888K5490
26882C3048J7433J0508o6l4527k2753J5318J2084O109o178o815K0159M544L293
26869E2157K1047k150l0542o184j2682o56p623j7459O19J0348J4685j439j1093
26856I028R384L0502o800j6919j7584J1465q230k2476l1899k9946M641J730J9198
26843d7906J82J9812L0500J5503J2503p173n0490k4884j189m399K26K8587J4693
26830a4035j3095P420q93k706J510J2938J7759o930J677j2564q982K794J1467
26817c640L523N289P334J1506k2081l251j4117l2590m247j006M410P983K1838
$$ y = [36274, 29135, 59719, 46632, 27168, 7931, -7379, 856, 4423, 2635, 30249, 30607, 32674, 23733, 28936, 8855, -35226, -46596, -26289, -30360, 918, 31668, 15239, 15318, 15446, 7558, 33048, 50481, 60989, 60923, 26396, 3643, 18961, 31045, 37154, 30976, 24161, 44320, 48864, 52157, 73204, 71054, 40512, 34328, 21646, 20990, 13367, -4092, -3473, 6875, 21560, 20121, 9028, 18412, 48914, 42114, 25195, 7611, 19076, 10846, -11630, -43529, -73475, -68834, -67104, -47906, -47724, -27912, 2588, 18091, 30594, 23421, -27069, -51953, -53142, -57541, -57315, -28728, -14035, -27130, -19710, -20603, -23309, -21799, -8861, 8898, 1968, 3645, -8919, -17901, -15107, -3640, -117, 5172, 12506, 24012, 1931, -1320, -15437, -48027, -52274, -53280, -48870, -40887, -19049]
26804a9049J3650K7436p057j3370p068L1285K2229l956j0811k9109r971J515R336
26791E060K3791O566k0746k0860J2091q537j1923k5501N106K6870k8669K7498
26779i254Q282j3647p563K1746L8932m608j6957J5028K2998j5403l0751N140o007
26766G936l134M067L754o003m262J0021k5313j9356R966J2214J5801J0044l7424
26753b1689k4341J9714j1284n542K1394Q088O395o69k7834k0405J6179L7425K6877
26740B4308k4342P823J0159p734J40j6554n671k2487q313j9102R722K2735j203
26727c0519j5084n729K9665K4529k6025j2372j0333M7991N1200J6065k6652j52
26715D2584j0238j508j8096m773j4920O551j2624Q122J9348l073J3284k3003n153
$$ y = [-19049, -5399, 22037, 14980, 1610, -5458, 25827, 48056, 44100, 33289, 4180, -5791, -4276, 5060, 28851, 35417, 14671, -6189, 5902, -2635, -14558, -40059, -34953, -8083, -36752, -9254, -972, -14619, -22182, -436, 38496, 33888, 16931, 31959, 54957, 39554, 8803, 13943, 7936, 4802, 8869, 12623, 6620, 2358, 12379, -12934, -32290, -22324, -10110, 5691, 15735, -21689, -46030, -26316, -37600, -43142, -21748, -13660, -7265, -7934, -35768, -56173, -39994, -2569, 24308, -34, 7789, 17948, 10214, 10354, -6200, -11871, -34358, -42671, -61773, -52051, -29316, -30519, -45603, -51332, -21667, 2862, -23163, -35535, -45868, 2123, 53323, 69388, 42736, 42584, 32346, 30838, 12742, 7969, -6951, -400, -13024, -4902, 14446, 11373, 24657, 1654, -3499]
26702c499p202R638K1357Q26j982k7638J4580J90l7866K3015K3353J3568q989
26689A9351j0200j7758J3836K2948j7117J4969k479q977j6165J665j570j2735
26677a4232K674R762q891L85J562k445l686m015n547L4303J0270k704J0995N991
26663C4422j2136j6516O64K8111k3441m4254m68J5479K3323l39L070J2336l62
26650A9889J4308M772m905k3939K6250N383k0036m35k231L0245J3k1397l1501
26637c584k4114j9118J3512R672J149k048j5292L776L4406r74j9597J3389j6791
26624b5614K657J3532L1615M270J6564M109k9749l0089O375K9769L7273J786j1755
26611E0743j3344l0407j3240J0360k344J5544k934k7074O589M599k6740N532L045
$$ y = [-3499, -10701, -1063, 20294, 21120, 19138, -8500, 6080, 6270, -31596, -8581, 14772, 28340, 19351, 9151, -8607, 5229, 28177, 11060, 26029, 23550, 14573, -1592, 73, -1497, -14232, -11558, -1796, -10687, -10302, -8740, -11185, -14871, -18886, -24433, 9870, 20140, 17436, 28431, 34422, 22286, 5770, 6434, 34545, 11104, -33150, -33618, -18139, 5184, 4845, 7915, 20251, 19889, 34197, 38969, 34064, 10125, 36375, 41758, 21722, 21287, 19056, 49301, 49314, 27917, -3584, -27698, -46816, -33304, -23632, -22483, -24531, -39823, -36047, -1641, -2615, -22212, -8823, -25614, -22957, -9425, 22190, 26460, 43024, 47133, 17384, -12705, -6330, 23439, 60712, 62498, 50743, 37399, 6992, -6248, 4112, 1768, 17312, 14378, -12696, -6107, -1508, -28248, -22716, -19671]
26598a9671k0879J1575J3093N754J7201O958p363k638p158l726m949Q415j7009
26585b0397R920o922p547J1842K4089J348J213j0236j111J4786M716p364m0086
26572b5749j3350L9589J6367j992p184j5669l0546J6437K2867N55J1686j0095
26560B916P689J77k7006l6137R221L4822R082N910j252k0033p933j1220k1287
26547e5051j5148K8686J0168j0260J6725M3576K9055J9436L137k5709j2626R599
26535D1588j6358k8357p940L524j9948J216J1462K6175l237L254k435j7134n127
26522a3317L4645p872j4444n138N660K474J3335J161l7180k2688J7367j1459Q068
26509b9388J0858R828J210k6010K3971Q607k7887J5730j682k2477j8089J4427
$$ y = [-19671, -40550, -28975, -15882, -10128, 7073, 14031, 6668, 4030, -3128, -6854, -11803, -3388, -20397, -10477, -17399, -24946, -13104, 10985, 12333, 13546, 3310, 2199, 16985, 21701, 14337, -25749, -39099, 490, 16857, 14865, 7681, -7988, -38534, -22097, 770, 1325, 13011, 2916, 10605, 10782, -16224, -52361, -43140, -8318, 764, 6674, 5422, -14611, -22544, -33764, -55051, -70199, -41513, -31345, -41605, -24880, 18696, 47751, 67187, 70324, 44615, 31989, 41588, 25230, -3127, -11067, -7543, -27491, -26275, -14813, 11362, 8125, 11379, 8944, -8190, -13317, 21328, 13456, -988, -6126, -466, 2008, 15343, 16504, -20676, -43364, -25997, -37456, -29388, -18530, -8702, -7492, -33502, -9531, -924, -28811, -13081, -14763, -37240, -55329, -40902]
26497d0902J9917N145J3942j792N274j7481R837J1152P22k4696q960J5533K5991
26484A3682j6609j2463m725L762Q968J1992m894M965O020K7809L5278J9525j5753
26471G7557k0687L251q608l500j4921k4068k7419r529L1190L3599k7150n046Q688
26458A3357J2617K0354J2250k781J4620j7551l1888J385j4382j4249O811Q299
26446H842K474N247R283m332k700O201j3671k8328l7582k7414O98R876J4862L9759
26432a6785K7687L9982k222j9841M430l3050q795j0664k3605J3500K0281j1220
26420b0302p177J1859M040j2335L2302l967k2323J9403j1305j7934J3356m09l64
26407a5156K1860K2401q206o387P132O119m237k1681k3857m274J6260R411L8626
$$ y = [-40902, -20985, -15840, -1898, -3690, 1584, -15897, -6060, 5092, 5814, -18882, -27842, -12309, 13682, -2927, -15390, -20115, -16353, -7385, 4607, -287, 4678, 10698, 38507, 73785, 93310, 77557, 56870, 60121, 51513, 48013, 33092, 9024, -18395, -27924, 3266, 36865, 9715, 4669, 13357, 25974, 46328, 58578, 55797, 70417, 52866, 20978, 22363, 7981, -6268, 543, 8842, 11316, 16563, 25846, 21514, 18814, 25015, 11344, -16984, -54566, -81980, -81282, -71406, -56544, -16785, 10902, 50884, 48662, 28821, 33251, 201, -8594, -19258, -42863, -29363, -9082, -20302, -27479, -15620, -11580, -23915, 8387, 4420, -17903, 1500, -9805, -27739, -14383, -14792, -15156, 6704, 29105, 20899, 14512, 21644, 27763, 23526, 1845, -22012, -26286, -10026, -615, 38011]
26394C8011J1226k2180m8811L5359N0444K0262l875j1483r127J1396P421j8942
26382E9701k5716M992L474l9740L217J1064q031j6856j1972J0096P625R348j5586
26369h384P169K5149l542m369k672j0000j9696n147L836K0734K7255J7385J5012
26356F2730k4633k0688O958j5274j5863j5447R408O314Q674o347K1940m723k081
26343A0968k333j8138K353L190J0752K0647N915K401J8552m0726j3307K8940J0298
26330C9512k5664k4436j9911j9383j3145R807K1111r052J1713J4311J7601J7757
26318B0221J327J2799N152J3821N840j5514k4408l2247j7933K332J2921j3238
26306b8927J1255o673J3251J000Q992J1865J3179J6889P309j6538o705j4515j0198
$$ y = [38011, 49237, 27057, -21754, 13605, 64049, 84311, 80436, 68953, 59826, 71222, 78643, 59701, 33985, 38977, 42451, 2711, 5928, 16992, 8961, -7895, -19867, -9771, -2146, 7202, -8384, -1215, 23934, 20392, 16023, 13351, 3351, -16345, -21492, -17656, 3078, 30333, 47718, 62730, 38097, 17409, 24367, 9093, -6770, -22217, -12809, -6495, 2179, -4168, 17772, 13049, 10968, 8635, -9503, -7150, -3960, 6792, 27439, 33354, 35755, 54307, 13581, 274, 29214, 39512, 13848, -10588, -30499, -49882, -63027, -53220, -32109, -41161, -29448, -15137, 2464, 20221, 21548, 34347, 39499, 53320, 59160, 43646, 19238, -13009, -30942, -28610, -15689, -28927, -17672, -24345, -11094, -10094, -1102, 10763, 23942, 40831, 48140, 31602, 24897, 10382, 184]
26293A84j3508m160j0956R909J3072j021k6246k358M3194J6741k5365o918L531
26280c901j1237J6700Q542P344P024J0702k0488j3486q952K2716R513j3752j9020
26267h295j1278P066J6086J8926K2312k4549k4937j7257J1804m184L668P903M684
26254A949k1697O97Q415j089j2513L784K1928L6724r794k0102m5662j100L919
26241c4541L416j0505J0691K4865j1022l2495o201J8910N1299K6186l404K6790
26229F3989P980r637p848k4989k3031j1154K41K651O242J2069j5005r129L1242
26216B3621K4595k6855j7647r705k44J8416j8896N716K1947j0523j9546o876K8
26203a5969M117J2604M1723J7170j1964o8739o874L8574K2594j1750N086K5077
$$ y = [184, -13324, -17484, -28440, -18531, -5459, -6480, -32726, -35084, 8110, 24851, -514, -7432, -3901, -15138, 1562, 10104, 17448, 24472, 35174, 14686, 1200, -7752, 14964, 24477, 10725, -8295, -19573, -12507, 3579, 22505, 44817, 20268, -4669, -21926, -10122, -14306, -10638, -2735, 1949, -19748, -19051, -10636, -11725, -24238, -20454, 1474, 38198, 28404, 8302, -37360, -38460, -34541, -31125, -41630, -30939, -6074, -17096, -49591, -55792, -36882, 14417, 40603, 37199, 63989, 71969, 62332, 54484, 29495, 6464, -4690, -4449, -1798, 4444, 16513, 1508, -7621, 23621, 48216, 21361, 3714, -5991, -6235, 12181, -6715, -999, 20948, 10425, -9121, -15997, -15969, -11852, 752, 42475, 59645, 47681, -21058, -27932, 10642, 33236, 21486, 26572, 51649]
26191E1649j3737n0690j1730o655p925K8374R381n407k6575r100J5980K1995j9641
26178b4081k2531J0388K5489R499r09k3582j1938j4889K0142K8680o215k3372
26166c3319q336o921r034r120N108K7794L3832J0336j5954N230j8974p83K2097
26153A956L487K0156J8512j6218n098o214n796Q89N981k7515j2525j8918M100
26140c7203J2917n077j1845R402O116P252O247L2021N446j8040k9210j1468J7796
26127a5646L2434K887L6358l693k0784J0858l425k2990k8990R628j1640L541M1065
26114B9603J2326l4978K923K9827j5684j5074p807J1075J1895l5878l5464k2345
26102f9581J3312K6928M846L3038K4602p508k1595j7910K1663L5605j5587p357
$$ y = [51649, 37912, -12778, -24508, -31163, -39088, -10714, -1333, -6740, -33315, -42415, -26435, -4440, -24081, -46612, -36224, -10735, -1236, -2145, -25727, -37665, -52554, -32412, -3732, -9947, -33319, -41655, -48576, -57610, -66730, -61622, -33828, 4, 10340, -5614, -384, -19358, -20141, 1956, 5443, 25599, 44111, 27893, 22795, 16581, 10785, 11674, 17655, -9860, -22385, -41303, -37203, -24286, -29363, -41208, -31806, -25690, -18438, -12191, 19830, 25276, 7236, -21974, -33442, -15646, 16788, 19675, 56033, 52340, 31556, 42414, 38989, 15999, -12991, -3363, -15003, -11462, 29603, 41929, 6951, 9874, 39701, 24017, 8943, 1136, 12211, 24106, -11772, -47236, -69581, -56269, -29341, -24495, 8543, 33145, 25637, 4042, -13868, 7795, 43400, 27813, 20456]
26090B0456j3292K5871L313k3161j9100J4385L958n402j1170j5881K4578q28l958
26077b31j8207J7720J5147o168Q585p92k9827N655J6246K0827K682J597j0165
26064B3069j0148j2760J4959K570R073l6206j0898K780P906J0721Q983j1945k66
26051b162L798M2846M288k9734j2337R304N536m213J7041Q527p917K757l938j6988
26037A6808l097k029k372K404l0543j9969l005N221R106K9827K2743J7464J0835
26024E3393m293l2327k0081P47M344L816Q599P133p820m593p686P514m379j1654
26010g287j9164M654L8415k3950n457R707P500J503k587k7713k9924l797o215
25997f4315L3608L0029J7083J5023P718o159J4589j6241j4558k0596k508j4733
$$ y = [20456, 7164, 33035, 36348, 13187, -5913, 8472, 12430, 7028, -4142, -20023, 4555, 3727, -231, -18438, -718, 14429, 8261, 16846, 16054, -13773, -8118, 8128, 28955, 31637, 33234, 23069, 12921, 161, 15120, 17690, 26763, -9443, -20341, -17561, -9655, 1066, 10049, -1896, -2162, 1636, 44482, 48770, 19036, 6699, 16003, 21539, 17326, 34367, 42894, 34977, 37734, 33796, 16808, 13711, 11682, 9310, 11714, -18829, -38798, -41803, -36582, -27476, 2351, 25094, 42558, 53393, 49100, 16773, -3308, -2561, 1783, 5599, 14198, 21331, 13511, 8918, 1232, 8746, 4367, -7287, -26451, -21797, 16618, -7332, -12789, -3082, 4418, 5921, 3334, -24379, -54303, -58100, -64315, -30707, -678, 16405, 31428, 39146, 32987, 47576, 31335, 16777, -3819, -6327, -21060]
25985b1060k9275J1087K1281L0192Q464l7272p273k528K5567R403j8783J940J0624
25972B367j2709l1201J6931L3997l642j4661k5138J6622J2883N404J557m352N434
25959C492K1002k4687m343o752K796j554o544k4140L874K6222j7933k2694j4459
25946f5720L6501K3336J3484k1654k5863q714L9092K4783j03k7731m889J1682
25934e796K0987M879j6508o938m2425n858K6196J4067k9517J9917K5622N415l7507
25921b7466J1438L9792K6202j7855j2927j0694n980o569J4520M400j0293j3835
25909i267n564J1945P937K473n963j0918k015P877J0210q15l0177L841K1485O948
25895G997k1438K2328K4841p34l982j0350j6817k8118J0210n058K6028j0490j2844
$$ y = [-21060, -50335, -39248, -17967, 12225, 20689, -16583, -23856, -26384, -817, 8586, -10197, -8257, 2367, -10342, -41543, -24612, 9385, 5743, -8918, -34056, -17434, -4551, 853, 2410, -1942, 3492, 24494, -193, -4536, -11288, -8492, -10046, -16590, -40730, -36856, -10634, -28567, -51261, -65720, -29219, -5883, 7601, -14053, -39916, -48630, -9538, 15245, 15142, -12589, -17478, -5796, 15191, 20070, 3562, -3376, -45801, -51659, -25463, -11396, -40913, -20996, 4626, 10041, -27466, -16028, 23764, 49966, 32111, 19184, 8490, 2510, -4059, 10461, 14861, 4568, -9267, -14831, -2886, 5051, 7524, 1561, -9357, -11372, -3495, 6715, 5900, -24277, -20436, 1049, 7997, -13441, 8887, 33728, 32994, 29012, 18662, 1845, -26273, -16063, -21121, 4907, -5583, -18427]
25882a8427q148R216J3605R688J3559p206K0267Q132l038j0304k6582J0378m330
25869F810K0550j6241k3979k3666j7494J43J4431K9474L2846J4800j2918n440
25857A9316J9094Q471N601k6299k3542j4061j291R160M865r294j7599N751J4776
25844e052J1127k6816l938J7624K0641o81j1891j2942m208O241j0357k442L266
25831a9428J0062J9021K4230R84k3414j8536l1992J2003J6944J5482r736P765
25819C385o339k6992J3140K7448K267j0804j4311K172J3984J0502J8863j3218
25807B0097J741r226k0720K0436L726k0248J768K5447p791k889m5564m1774M5167
25794b9830K289j9711J872K8116J0327p106O969J7971K4838k802j7560l046k0173
$$ y = [-18427, -26575, -17359, -3754, 5934, 19493, 12287, 32554, 40686, 37648, 27344, 762, 11140, 6810, 27360, 11119, -12860, -36526, -54020, -53877, -39446, -9972, 22874, 37674, 24756, 19316, 38410, 46881, 52482, 26183, 2641, -11420, -12711, -3551, 1314, -7980, -25579, -19828, -5052, 6075, -20741, -24679, -7055, 13586, 12905, 1014, -11928, -16136, -9895, -20252, -22694, -19428, -9366, 9655, 33885, 34869, 11455, -7081, -39073, -27070, -10126, 5356, -4380, 3385, -2954, -29946, -16806, 10642, 12909, 2105, -12206, -10034, 3950, 14452, 33315, 20097, 21838, 12612, -8108, 12328, 16054, -4194, -2426, 23021, 15230, 12341, -33223, -74997, -29830, -27541, -47252, -45380, -17264, -6937, -14043, -7074, 10897, 35735, 32933, 15373, 12327, -7846]
25781g846k87J2635m99o238J3654J5392j2281n152j8866j368J3215j273j8829
25768a7743J4080J1397j5168k8897K6459O434j776K4180J5217l247m0522j7674
25756b7260j9029L5617L1218j9793P975P419N812k6475k1721K815N684J5369l02
25743b671J3625J3877k0642r507O485j0546O65j612J7702p457p846L781p415j1614
25729b3175p256L0588K2354n745J8324j4199j5996N451k2570P252J7706Q849k252
25716A9331j4209o988m30P349m808J5267m341k2233J7014K238K2790K6374j6769
25703D0585l0131Q904k4032j8821l040P142J9154l802m975J8111p999l5807j7588
25690e2299M7943L3424q932m6145l0032K696J0574j1020J6714K4034q080q989
$$ y = [-7846, -8133, 4502, 4003, -2235, 11419, 26811, 14530, 9378, -9488, -10856, 2359, 1086, -17743, -3663, 7734, -7434, -36331, -9872, -3438, -5214, 18966, 34183, 30936, -9586, -27260, -46289, -10672, 20546, 753, 8728, 16147, 21959, -4516, -26237, -23422, -17738, -2369, -2671, 10954, 24831, 4189, -5318, 1167, -9379, -8714, -10326, 7376, -81, -7927, -4146, -11561, -23175, -30431, 157, 22511, 16766, 35090, 20891, 4895, 10346, -12224, -4972, 12734, 21583, 19331, 5122, -1866, -2296, 5053, 245, 15512, 11171, -11062, 5952, 8190, 30980, 57354, 40585, 10454, 19358, -4674, -23495, -26535, -19393, -239, -4041, -9016, 9095, 1096, -34711, -52299, -4356, 29068, 20136, -26009, -56041, -53345, -42771, -53791, -37077, -13043, -21123, -30112]
25678c0112Q475K965M575l894K8793J5257l4597k9765K0978K0657m527o99K6466
25665B4572L4048J0317j8315r361R817K3598l5167n1928k4555J0921k669Q812
25653a9910K1778q282j7186l3887j9762J9112N8486K9855r0j2194j8797j9168
25641b0045J6826J2229M447q679j6001K8207J9807N19O51k5637j7977J670J2327
25628H344q809k7025m831M2422L444k463J5877J50o525k4382k1081J1977K0129
25615G227O071J5676j3097j692Q237K3913P738k5798J055j1679j022j0272p927
25602a570P626M737j909R762p066K4591j4888m012N657r034j1193R431j8399k4395
25588c0662k0691j0722j392K6512K2107J9207M29K3521L2182j3203k9574L087
$$ y = [-30112, -21637, -18672, -14097, -17991, 10802, 26059, -8538, -38303, -17325, 3332, -1195, -1894, 24572, 58620, 68937, 50622, 41261, 51078, 74676, 39509, -12419, -36974, -26053, -28722, -19910, 1868, -6414, -23600, -57487, -77249, -58137, 349, 30204, 30114, 17920, -877, -20045, -3219, 9010, 13457, 4778, -11223, 16984, 36791, 37310, 37961, 12324, -5653, -3983, 8344, -465, -27490, -32321, 10101, 13545, 11082, 26959, 27109, 20584, -3798, -24879, -12902, 7227, 13298, 28974, 15877, 14185, 22422, 46335, 54073, 28275, 29330, 17651, 16629, 6357, -1570, 6056, 10793, 8884, 18646, 11580, 36171, 21283, 17271, 22928, 13894, 2701, 12132, -6267, -30662, -51353, -62075, -63467, -36955, -14848, 4359, 4788, 28309, 60491, 47288, 17714, 20801]
25576B0801n948k0976n923L6174J3032J7377k6004j8758p845l4982J6878K3654
25564G480j540L0557j192q111O506j1266j0834J3198m919q295k2987q184J737
25551a7850O000k968J0836j0520J4287J7019k4914l098k3789q372n421L9537J3464
25538D211p026k6544j0225K5169J2509k2159j0140K9399N314K5896N382l1014
25526G72K503M1171k199l7127j1553M644K4796J75j1526Q56N52R555K7819q200
25512D2238m4988j3728R050k758K2060J1743k8957j7781j4794J9800K4817p23
25500E979J1298J4817M961R500m758j7619l618k30j6192j6708n112L9146q674
25487A2790l2827l489K1999j4682j8441Q71K1481J9788q408j2816N932J7802K4561
$$ y = [20801, 14853, -6123, -12046, 24128, 37160, 54537, 28533, 9775, 1930, -33052, -16174, 7480, 5940, 36497, 35305, 27194, 33700, 22434, 11600, 24798, 19879, 11584, -11403, -19587, -17850, -11850, -14818, -3982, -14502, -215, 16804, -8110, -11208, -34997, -43369, -48790, -9253, 4211, -2815, -29359, -39584, -14415, -1906, -24065, -34205, -4806, 508, 26404, 31786, 772, 3275, 44446, 42247, 5120, -6433, -1789, 23007, 23182, 11656, 12512, 13064, 22619, 50438, 42238, -2750, -16478, -7428, -10186, 11874, 23617, -5340, -23121, -37915, -18115, 6702, 5979, 17277, 32094, 37055, 46555, 41797, 24178, 20560, 20330, 4138, -12570, -17682, 21464, 12790, -20037, -23526, -1527, -16209, -34650, -33779, -12298, 7490, -918, -13734, -7802, 10000, 34561]
25474C4561m552l1625m9153K0285K4451K624j5782j0519K0052n857P442q435j5516
25461c2024L606M6006k2037k9013l8135l723L7602J6377j826k7066K217K1385
25449b6631J5684L314p8j6274q078P570J1155O149j4345K515J745m641j0454o799
25435c9168K0333m897q347k723P372L515K4173j7744P516O402J8215j748J2428
25422B5327j3351n276j1401J0825O567j046j5308m649j7321J3889L5342P025J2810
25409D3433j9919l1951j776P88j6043P914M322R06j9281J7804K4701R044j0836
25396I106O381j8149K789K644N409j2014J9361Q078q434K199j1356j5762k9297
25383c9045j7180J6594K6695p502N255O903m63J644j3289j2404l509n16L5189
$$ y = [34561, 30009, -1616, -50769, -30484, -6033, -3409, -19191, -29710, -9658, -15515, -8073, -16508, -32024, -28418, 17588, -4449, -33462, -71597, -75320, -37718, -21341, -23167, -50233, -48016, -26631, -10947, -7633, -7711, -23985, -32063, -24493, -13338, -7189, -21534, -19019, -17274, -21915, -32369, -39168, -18835, -23732, -32079, -34802, -27430, -23915, 258, -17486, -9970, -3568, 14647, 12899, 25327, 11976, 6700, -4701, 6124, 12691, 11645, -3663, -8312, -25633, -11744, 23598, 30623, 43433, 23514, -8437, -10213, -9425, -25468, -17554, -13232, -12326, -31607, -13803, 10898, 19942, 9106, 15487, -2662, 127, 2771, 8180, -3834, 15527, 23605, 15171, 17370, 6014, -9748, -39045, -56225, -39631, -12936, -20438, -15183, -8280, -8743, -7099, -20388, -32792, -36301, -36817, -1628]
25370a628J486l3026J799L882m156M320L453J9785K0627k6181j0717p321m882
25357c2559j5453K3106L0081j3048k0350j2876K0366N172j1206q461j111J3341
25345b2998O615L7604K4876j5797j1480l7251p379J6986j5308k688o28j5241j093
25332d3782K450L2646K0047L322n73r350L026m133l7040k2043J8355Q402L7449
25319H776K9370j0360j1121j2310o659j0205m375M494J6561J5493J881j8999k024
25306E22J0336l404J3050K753r887j8424j7792J0708j4920J3386J2792p188P670
25293c98K3030m816j2582R39j2642l722J8058P780J6917k8793o844k077J0807
25280E657N978l5216J8388K4793O374N077l985J152K2003j6517k8592p207k0046
$$ y = [-1628, -142, -33168, -31369, -27487, -31643, -27323, -23870, -4085, 16542, -9639, -20356, -27677, -32559, -48012, -24906, 5175, -7873, -28223, -41099, -20733, -15561, -26767, -35228, -36339, -22998, -16383, 21221, 46097, 30300, 18820, -18431, -25810, -8824, -24132, -26820, -27448, -42689, -43782, -41332, -8686, 11361, 14683, 14110, 4760, 7786, 3653, -33387, -55430, -37075, -28673, 8776, 38146, 27786, 16665, 4355, -2304, -12509, -16884, -12390, 4171, 19664, 21545, 2546, 522, 10858, 7454, 20504, 23257, 13370, -5054, -22846, -12138, -27058, -13672, -880, -8068, -398, 22632, 17816, 5234, 6173, -6469, -10191, 7867, 15647, 32564, 3771, -3073, -5150, 5657, 11635, -23581, -5193, 19600, 25974, 31051, 27066, 28218, 50221, 33704, 5112, -2095, -22141]
25267b2141q703L9343J5480N7J5709L916q848j3742M411k6557k8262J3332n863
25254b1868n95r204J9623k0044M970k4712k8059l404j4380J7511M8321J2313j2050
25241c1578J8196L0495J8179q220l2985k3183r794L248O944L848K1295Q782m983
25228B44m601L403Q143n654j665J530j3354J340J8290O160q301J0099j1805o637
25214b808Q501J8643m409k7252L883Q301J2138M584r194j9301o113K6052K0060
25201C3085j9957q243Q74m119R58l4023J4979m842j0729L3186O319l4613j7733
25188d4858J0023N2382J5507K5441r086j8201P121j2278m5979m447K9862J9299
25176B4786k7532l7883Q267L9779J495N350L0248p996m9323r450J2754K4789Q781
$$ y = [-22141, -30844, 8499, 23979, 24036, 39745, 43661, 34813, 21071, 25482, -1075, -29337, -16005, -21868, -22463, -31667, -12044, -32088, -27118, -51830, -79889, -83293, -97673, -80162, -31841, -19528, -31578, -13382, 17113, 35292, 27072, -5913, -29096, -38890, -35642, -28698, -24850, -3555, 5227, 244, -4357, -954, 7189, 1535, -130, 1400, -11954, -10614, 7676, 13836, 5535, 15634, 3829, -2808, 5693, 24336, 19927, -7325, -3442, 4859, 16997, 21581, 12387, -6914, -13027, 13025, 33085, 13128, 4885, 5759, 1640, 2598, -31425, -16446, -21288, -32017, 1169, 7488, -27125, -44858, -34835, 17547, 33054, 58495, 49409, 31208, 38329, 26051, -19928, -24375, 5487, 24786, -2746, -40629, -32362, 7417, 8912, 14262, 44510, 36514, -12809, -22259, -9505, 15284, 24065]
25163B4065K1817j3097q651j2837o619k5011j5089J7709R190K1264L2001m682
25151D0060j4494j8892N336Q251r91j3885p632q81K5511o012J640j4748K712k1312
25137a5337p79m556K5508O336j6816J6996J2359k3417M140L197j3419J610j8906
25124b3084j5215M164K1167P311R573k1461Q908M659r045j3486k1008R005J3095
25111b5417J3142m269k170j7685M7133Q260k3098l691K7369K7545k3127m6338
25099b2346j1482J7605J2331m26k1195J0820j3442k1127J7187K4135J606J0972
25087D638k0945n0k0657J1460K4779O778n577k0755j6684P684L4570J1546O485
25074B3272l1858l5977J7850k610M349J083J067j0259m254L587j6176p283L051
$$ y = [24065, 45882, 32785, 24134, 11297, 4678, -20333, -35422, -17713, -8523, 12741, 44742, 40060, 25566, 6674, 12010, 20261, 19270, 5385, -2247, -3128, 22383, 16371, 18011, 3263, 5975, -15337, -16116, -20672, 4836, 11172, -5644, 11352, 23711, 294, 4434, 7631, -5788, -4178, -23084, -38299, -34135, -12968, -5657, 3916, -17545, -8637, -3978, -13023, -26509, -47517, -38512, -25417, -12275, -16544, -18714, -36399, 10734, 18994, -4104, -7795, 19574, 47119, 23992, -22346, -33828, -16223, -3892, -4318, -25513, -14693, -28135, -49262, -32075, -7940, -6334, 4638, -16307, -16357, -37014, -25554, -775, 6003, 426, -20329, -37013, -29329, 5241, 16787, 23272, -8586, -44563, -26713, -29323, -24974, -23891, -22824, -33083, -37337, -33750, -49926, -57209, -54158]
25061e4158L0676N486J1587p707l5194J9841L0249K9350o458m309N094j4446l7975
25048b7964j3790K564n618L7117L3609J3696j6156m635J9299j3658l5590n896
25036a7022q437j2717j2847J6706L9758Q435K301m800k1278q377J1162K8826Q961
25023C0671j8785j5116j2319J8981j4881j3215J7656J3k0925o695O875N215N980
25010a6545K8247l332r779j9449m3946N418M0750j1253p345J4139J4129L034K2077
24997A6145k2943j587j171m406M30k669m567N475r382J4135L85K3396J3847j7627
24983I461n1532j1930M061p243O422K6395R330k30l142k6789L343L2155K0922
24970A1223o40m711q186J5445L2415L387q924q851j4997J012j2340p172l5109
$$ y = [-54158, -23482, -17996, -6409, -14116, -49310, -29469, 780, 30130, 23672, 19363, 24457, 10011, -27964, -41754, -39190, -44808, -7691, 25918, 39614, 23458, 18823, 38122, 24464, -11126, -17022, -25459, -38176, -51023, -34317, 5441, 13876, 16177, 11377, -9901, -18278, -7116, 21710, 30671, 11886, -3230, -15549, 3432, -11449, -24664, -7008, -6995, -27920, -34615, -27740, -22525, -16545, 11702, 8370, -1409, -20858, -64804, -59386, -18636, -29889, -37234, -23095, -8966, -5932, 16145, -6798, -8385, -9556, -13962, -13532, -16201, -20768, -15293, -24675, -10540, -10155, 13241, 27088, 9461, -42071, -54001, -49940, -57183, -50761, -24366, -15036, -15266, -18408, -45197, -41854, -9699, 11223, 10583, 5872, -2314, 13131, 45546, 48933, 40009, 31158, 16161, 17173, 4833, -2339, -37448]
24957c7448o370R440J0663M747q063J0649L1161p69N232K524j1519l52m748K681
24943G828J441n186k2234j0942j9451k057N259J1544J9308R762m023m043M864
24930g930Q444j6400J2670l878J6115L9293R986N378m3201m8986n920J9993K014
24917a2422k6620j6322K6417J5023k8017O445r063M74Q322L074j372O371Q685
24904a9005j330K911j900K87k3202P952n447J6612K4047j2222j8481P114N374
24891a7290o556l41L3706j4926j9122K0116P003J4195J85L258n828j8509K5283
24878B1174k618k3997l776j1862K068l6675p85J6645J6184J2242P986K3302l3243
24865a3355j8342L5020k44j7030K1023J2740n889J4772Q857k0194j2612n625j8812
$$ y = [-37448, -43818, -34378, -23715, -18968, -27031, -16382, 14779, 14010, 19242, 21766, 10247, 9895, 5147, 7828, 9269, 4083, -18151, -29093, -48544, -50601, -45342, -33798, -14490, -4728, -8751, -12794, -7930, 514, -15886, -3216, -7094, 9021, 48314, 58300, 63678, 20477, -28509, -34429, -14436, -12422, -39042, -55364, -28947, -13924, -41941, -35496, -44559, -44085, -35763, -32689, -34061, -27690, -19005, -20335, -17424, -19324, -19037, -42239, -34287, -39734, -23122, 925, -11297, -29778, -22664, -17290, -23846, -24187, 9519, -5407, -24529, -4413, 2590, 16785, 16970, 20228, 14400, -4109, 21174, 18556, -5441, -9217, -21079, -19011, -55686, -56471, -39826, -23642, -11400, -3414, 19888, -13355, -31697, 3323, 3079, -13951, 7072, 19812, 13923, 28695, 37552, 17358, 4746, -879, -19691]
24852a9691K3497L0209j3132l4760k5058k2020J7109p421Q044K0455K7519M148
24840H899J3083L1287q337o075j841J3972M222j2913k0757n428k8499k0915L8207
24827D905K6541J0933K1369j9015j5846j1787M649J2424k2720j0592k7357k8026
24815e4522L599J0705J645j1692q660J4083K4388R648O558M748j732j836n482
24802h550K0525L34p46k5357j296J6340n174n947j1097p110j9180K0408J9216
24789g634n410l0833J6411J5323P513k4544j6530J9791J8089k398N513J0499N839
24776A1629o493k1953R149L4877N628J8799J6936j5211j5539j2328k1287q732
24764d525j1864O878J8540J3613J673q79r938K356K4267K1065j1462k2263J1598
$$ y = [-19691, 3806, 34015, 20883, -13877, -38935, -60955, -43846, -51267, -43223, -22768, 4751, 8899, 21982, 53269, 44932, 38857, 37016, 50988, 55210, 42297, 21540, 16112, -12387, -33302, 4905, 31446, 42379, 63748, 44733, 28887, 17100, 21749, 34173, 11453, 861, -26496, -54522, -50923, -40218, -38573, -50265, -58925, -44842, -20454, -10806, -4248, 500, -1232, -3068, -8550, 11975, 12309, 11563, -13794, -15090, 1250, -3924, -9871, -20968, -28078, -47258, -26850, -7634, -13044, -43877, -27466, -12143, -4630, -29174, -45704, -25913, -7824, -10222, -4709, 5790, 11629, 5136, -16817, -7668, 27209, 32837, 51636, 68572, 53361, 37822, 25494, 4207, -4525, -16389, -9511, 9029, 22642, 24315, 23436, 13498, 15854, 40121, 61186, 49724, 27461, 39059]
24751C9059k8946l4341o381J4718L7943J282J4564O613k5891k7406N283p512k3624
24738c4639K6808R723m738p090J907j2246J929R234j0692r923K6068j3658j4291
24725c1608J226k2066K6909J3247J8683r183k9283R389Q907n094P236L0968j860
24712A7471l0532k9395p838l900L7099j1579k0818N898L4751Q592j0578M008j5576
24699b2397j2191J8283n10j451J0324m717j6556p937L072K0606J8295j0069Q416
24686C168L47j1854n768Q988J614j6603K89J4349J1214j6984k2223K7859J1986
24673F382n346j4219k3363O733O661M259N256K3490o494k839K788j488j997j0673
24659a0850k2734j4733J1121P192P13J1471n255p81j2723m57K3661J6622j4499
$$ y = [39059, 10113, -24228, -30609, -15891, 22052, 23334, 37898, 44511, 18620, -8786, -3503, -11015, -34639, -7831, 1892, -2846, -9936, -8029, -20275, -18346, -9112, -19804, -29727, -3659, -17317, -31608, -30382, -52448, -25539, -12292, 6391, -2792, -32075, -22686, -13779, -18873, -11637, 19331, 17471, -13061, -42456, -50294, -54194, -17095, -28674, -49492, -43594, -8843, -251, -10829, -6821, -22397, -34588, -16305, -16815, -18266, -7942, -12659, -29215, -37152, -34080, -13474, 4821, -5248, 3168, 3515, -8339, -14107, -5119, -3505, -20108, -19819, -5470, 5744, -11240, -33463, -5604, 6382, 1036, -13183, -36546, -29813, -23152, -18893, -13637, 9853, 3359, 520, 3308, 1820, -177, -10850, -33584, -48317, -37196, -30004, -29291, -17820, -23075, -23856, -36579, -37036, -13375, 3247, -11252]
24646a1252j8162J7811j142K923J6181O588l769J1358o238l678n426j2891j4651
24633b2348p66j6081J0615L090K6024O531j2690m440k0271j8710K529Q080L3392
24620e045J4545p027O226j0952m3922L403J2746o720J3841L0507N466J2008j6283
24607H793j8613o523m484K2029j4734k0592J1216K7895L738M39Q478M098j8778
24594B962k8396P145J9282j3520l321J2539j9956J6222J9669k278m945k1271J5996
24581A28m082l2897j9685K0779L8131K4942k0808J355p560R399j8149l1535J6887
24568b3095R571L3359k198j8256j5517j1076k588K531j39L1248M1197N271O319
24555E6627J764k0258j7653j9743l145k6002k496m941o185K4780L3734j3561O866
$$ y = [-11252, -29414, -11603, -12745, -9822, 6359, 12947, 9178, 20536, 14298, 10620, 5194, -7697, -22348, -23114, -39195, -28580, -25490, 534, 7065, -5625, -10065, -30336, -49046, -46517, -38437, -5045, 9500, 2473, 8699, -2253, -46175, -42772, -30026, -36746, -22905, 7602, 13068, 25076, 8793, -9820, -16343, -20827, 1202, -13532, -34124, -22908, 4987, 8725, 9164, 17642, 21740, 2962, -25434, -18289, 993, -12527, -15848, -3309, -23265, -7043, 12626, 10348, 5403, -15868, 128, -3954, -36851, -56536, -35757, 2374, 27316, 6508, 7863, 303, 9702, -8447, -39982, -23095, -13524, 19835, 17637, -619, -16136, -27212, -29800, -27269, -27408, 3840, 45037, 50308, 56627, 58391, 38133, 20480, 737, -2408, -28410, -30906, -35847, -42032, -17252, 16482, 2921, 9787]
24542I787J037j0781R53O770q984J726N09m276k7040N096J1230J4478K4445K0000
24528D4950o639l2276M003J3744j4429k7447j2061j5846j509K818J3327J0403
24516b0962l269r020J5278K4922O437M522j6290o208O167j2680l8352j2869K6836
24503c5488L0185P63j1900M475j3084j2003l3277k0449K2077K5494k748K4895
24491b1060k235m273O387k0882j6028K456K5897J5920j1142k7356J0311M81M2767
24478A243K026K560j125J8163l914j1812k393j671J4573j1821k3301R382L6936
24465B8846M85l3538r009K439M532J1794J2935J1051L524n994l7467j4272j1181
24452c5855P290J5485Q333j1817l3525J8421J6321O131j7019n672K3853m757l3043
$$ y = [9787, 10824, 43, 996, 7766, -1218, 508, 1017, -3259, -30299, -25203, -13973, 505, 24950, 44950, 38311, 6035, 10038, 23782, 9353, -18094, -30155, -46001, -47510, -44692, -31365, -20962, -24231, -33251, -17973, 6949, 13386, 17908, 1618, -4590, 1577, -11103, -49455, -62324, -35488, -5303, -4540, -16440, -11965, -25049, -37052, -70329, -90778, -68701, -43207, -45955, -21060, -23295, -27568, -21181, -42063, -58091, -55635, -29738, -13818, -24960, -52316, -42005, -41524, 1243, 3269, 5829, 4704, 22867, 18953, 7141, 4748, 3077, 17650, 5829, -17472, -8090, 28846, 29331, -4207, -13216, -10777, -6245, 5549, 18484, 29535, 33059, 27065, -10402, -24674, -35855, -28565, -13080, -4747, -16564, -50089, -31668, -15347, -9216, -26235, -31907, -8054, -12811, -45854]
24439d5854J2683L6459Q77k5856L059R318M171L596j5496k7768N118J1630J8660
24426i403M649R007K089Q668L2j6810m362k061j6758J9726l500P723m794K998
24412b796r297j8499p357J6773K1433K4717p405k1733n953J5676N067k0153q2
24399i609j2803n693K4065R380k422j6391o733j1932L3635l175k6900J3006J7522
24386A950J5291J0439j5673o199l0102J5192J9020P691m518j6479O953J905k8862
24373b3392j8166k905q339O506J2123r443j341O64j620J738J4742N335m879Q308
24359b0669K2003K4577O009j8852j0503m023r809o15l1878j3091K2332J9618n598
24346b0499q684n815N979k272j411K6987K9357J4497j7286O840k4812l3898j3022
$$ y = [-45854, -33171, 3288, 4165, -21691, -18632, -9314, -5143, -1547, -17043, -44811, -39693, -28063, -9403, -4754, 4253, 6342, 15010, 15042, -1768, -6130, -8191, -24949, -5223, -8723, -1000, -5794, -2796, -12093, -30592, -37949, -21176, 257, 24974, 17569, -4164, -10117, 5559, 10626, -9527, -9609, -22412, -28105, -4040, 5340, 2918, -13473, -20206, -32138, 1497, -1678, -28578, -15572, 1950, 17241, 27680, 12007, 5808, -24294, -9102, 9918, 17609, 13091, -3388, 3565, 5470, -23392, -41558, -44463, -52802, -46296, -34173, -43616, -44957, -44293, -45913, -44175, -29433, -24098, -28977, -20669, 1334, 25911, 31920, 13068, 2565, -1458, -11267, -11882, -43760, -56851, -34519, -14901, -20499, -29183, -34998, -29019, -31291, -32702, -5715, 23642, 38139, 20853, 27693, 2881, -31017, -44039]
24333d4039O296K6838p706q098L790J2131J5499j1571M188n069k01k893K364L79
24319h092j1160o301P847K1767j0908l1067r112L9074L3193J6588j1255n253r158
24306A6163q968j5293l94J2332m661J212k8177P284K7000K1035k8403o587j6713
24293b4170m7855j4506O786K4180J8212M978J9298J4076o368l320l844J1381j8399
24280a9551j849J277k1082K7815k704j0282J5288q039k7745L105J8373j5806R077
24267c2123M3963O19l6451k1394J1589j956l3425J9443J8985K5251m295M330k039
24254g503J5311P428Q412J2953K92m926j1069M723M24J7048j5210j4890p012j4262
24240h281K9891J49k7724j4928r608M9401L4026l0049l1736K0586j6101R681Q407
$$ y = [-44039, -37743, -10905, -18611, -26709, -22919, -10788, 4711, -6860, -2672, -7741, -7942, -10835, -8471, -8092, -19252, -25553, -17706, 4061, -6847, -37914, -47026, -7952, 25241, 41829, 30574, 25321, 16163, 7195, -8098, -8492, 3840, -821, 391, -27786, -20502, 6498, 27533, -870, -7457, -24170, -72025, -86531, -79745, -55565, -37353, -32375, -13077, 999, -5369, -8689, -12533, -1152, -19551, -21400, -20123, -41205, -13390, -16094, -26376, -11088, -19127, -46872, -43767, -25394, -41200, -32123, 11840, 12459, -23992, -45386, -33797, -35753, -69178, -49735, -30750, -5499, -9794, -5464, -7503, 7808, 15236, 23648, 36601, 36893, 31967, 20898, 25621, 26045, 43093, 27883, 12993, 5981, -8281, 21610, 21759, -5965, -20893, -30501, 18900, 52926, 22877, -8859, 11727, -4374, 5307, 13714]
24227A3714K8459k783k0827M567j3449l3373p541J3188N682m11j0907k969o073
24214c2723j1552J5000K2748K1225R642k0194m1445R319M5272J4058j4622l3821
24202a7093J7056R185N357j0631j9058J6788N791j973j3876M29j8096L667O979
24189a5475j5704N130r455Q145J6545j3495l22O922L2223r825M244L705j6415
24176c777k1156J0565J1261q222j3939r959J4700n678n669k484J221J2460K3815
24163C138j548l8496k4224K8551L3755K5403L164m167k407J3846J690j1451j9519
24150G735q823j3354K314K4521j3427K073K059o706p663k1599O918M4254n244
24137A3058o833R766j3550K8151K38m7018k1562J0568K3458j499M475p957m1368
$$ y = [13714, 42173, 39390, 18563, 23130, 9681, -23692, -31233, -18045, -12363, -12774, -23681, -26650, -32723, -44275, -29275, -6527, 14698, 24340, 4146, -37299, -27980, 17292, 31350, 16728, -17093, -37, 9148, 14505, 3874, -15184, 1604, 7395, 5422, -8454, -8025, -26121, -22454, -15475, -31179, -26049, -35504, -27359, -10814, -24309, -24631, -17709, 14514, 4689, 8933, 12638, -3777, -24933, -14368, -3107, -11329, -25268, -35227, -20527, -26205, -31874, -34358, -33137, -20677, 3138, 1590, -36906, -61130, -32579, 1176, 26579, 29743, 25576, 23169, 37015, 38705, 27254, 7735, -1088, -14442, -12128, 12393, -1034, 1039, 3098, -3608, -11271, -32870, -25952, 18302, 13058, 6225, 15991, 2441, 30592, 30830, -16188, -37750, -27182, -3724, -5223, -748, -8705, -50073]
24124e0073P850K2102l720k455J4667k0089L834K7779j1378N469m846R092O0347
24111E8579k156m4758l3827n445r929K9529n288q111K0115R678p800n456k0985
24098b5854j2937J4488j8899k681J5328L608L6144J9087O56k0304k6591m739j6049
24085c8743k5137K6647J5321k7257J3784K7541j9831j2097L1245Q475K959Q509
24073A1416L991m427q733J475j7323k6088o019J3564J3393l133J7349J2827j3907
24060e615J0608j683l790j8310k0894J549J7071l961M698p576j3947K1958k765
24047b2657J3274J838J8623N411o277J6425K89j9437m873J888k2669q789j7920
24034d4874j372J1528j952M911Q231k6520m45J2719J9767J4198j4583L576K4715
$$ y = [-50073, -42223, -20121, -23841, -26296, -11629, -31718, -27884, -105, -11483, -6014, -10860, -1768, 58579, 56423, 11665, -22162, -27607, -37536, -8007, -13295, -21406, -1291, 8387, 587, -4869, -25854, -38791, -24303, -43202, -45883, -30555, -26947, 9197, 28284, 28940, 8636, -17955, -22694, -38743, -63880, -37233, -21912, -49169, -35385, -7844, -27675, -39772, -8527, -52, 2907, 11416, 15407, 10980, 2247, 3722, -13601, -39689, -45708, -32144, -18751, -21884, -4535, 8292, -5615, 4993, 3310, -480, -18790, -39684, -38135, -21064, -25025, -20327, -27903, -41850, -19892, -22657, -9383, -7545, 11078, 16489, 10212, 26637, 26926, 7489, 2616, 4504, -18165, -26954, -44874, -46246, -34718, -36670, -31759, -23528, -50048, -50493, -37774, -18007, -3809, -18392, -14816, 9899]
24021I899L3491k2082m7611J4811K3826K093m341N385j9016j5813L29n337j583
24008b5949K5953K2368j3829l3984J3031K7413L206q760q917k9477j7950P20J3288
23995c2887P370K4486M346J2986j2340p165j1395l0948j5484R460L4547L150K336
23982a1538j1610L401j557N262K1061k923n445j7025j0176K460J8176l545j8842
23969c2301m966K126J9796L380k1347k2242J7284P573J3152k875k2645M66K9401
23956a3198m068J9501j1527j9586k8031q81K8674J868M4876L2313j7624j6356
23944A5961Q952Q12l2018j8242k952O894r108L184k656K1734J6888O470j7613
23931a694j0462j3023r699K3506J5999n103j1718j5431K130R897j915j5976l525
$$ y = [9899, 43390, 21308, -26303, -11492, 12334, 14427, 10086, 15471, -3545, -19358, -19029, -24366, -25949, 4, 22372, 8543, -25441, -12410, 15003, 18209, 9449, 532, -28945, -46895, -46175, -32887, -25517, -1031, 3315, 16301, 3961, -3204, -14599, -45547, -61031, -51571, -17024, -13874, -11538, -23148, -19747, -21304, -16042, 5019, 2096, -3349, -20374, -30550, -28090, -9914, -13459, -32301, -37267, -35141, -15345, -11965, -33312, -55554, -38270, -30697, -17545, -20420, -43065, -42599, -13198, -17266, 2235, -9292, -28878, -56909, -57790, -29116, -27248, 17628, 49941, 32317, 15961, 24913, 25725, -6293, -24535, -27487, -20593, -29701, -26517, -29173, -7439, 9449, 15919, -1694, -12156, -25179, -34878, -11372, 4627, -476, -12194, -27625, -25495, -15598, -17513, -33489, -37014]
23918c7014m221J6859K5505K2042j0608l052j5150k0987k0842L787J9257J5082
23906i342q13j7070K0982Q739j5321O766J068r663N975k545k93Q638J6193j5790
23892b476J6315r306k4952J8898J3204r013R666K5702j7998q472q184k880J350
23879A854j5445k0716R417J5877k253n986k3370J1567K6715n562j8318k872R090
23866b0002j4513L272J882J1539J5615j4978l951K3652j9579M960Q044K8363O064
23853C0368l0367j1840J0710O907n944j3751J2018k1538q32k1346k3241M0163
23841b8693Q315K807K1724k799J9426l300K520p2k074J5725j7433j8860J7949
23828A5235J525J4961p594l4496N63j984l15K5350n672q663R546K313r364r003
$$ y = [-37014, -41235, -24376, 1129, 23171, 12563, 9511, -5639, -26626, -47468, -43681, -24424, -9342, -10155, -27225, -6243, 2496, -12825, -6059, -4991, -14654, -8679, -11224, -11517, -2879, 13314, -2476, 13839, 4533, -20419, -1521, 11683, 2670, 12336, 38038, 20040, 11568, 3384, 504, 1854, -13591, -34307, -24890, -9013, -11266, -17252, -40622, -29055, -2340, -7902, -26220, -29092, -20002, -34515, -31243, -29361, -17822, -2207, -17185, -21136, 2516, -17063, -12103, -4059, 24304, 30368, 1, -11839, -1129, 5778, -166, -13917, -1899, -23437, -24269, -45615, -68856, -28693, -20378, -17571, 4153, 1354, 20780, 17480, 20000, 19928, 17854, 33579, 16146, -2714, 15235, 16760, 31721, 24127, -10369, -9806, -11790, -12105, 13245, 7573, -1090, 8456, 10769, 1405, -7598]
23814g598j0999q84r461K3927J8985j5032l1771j3934J4572J1738R050K796M00
23801h211p279j5372J0569J8070R167L729l149l600p724j2368J5213J1853k5453
23788a4555j4574L3110K810k1981J9785M756o930k7294R586m928J0829K9735L4858
23775E5207j7742k3719j2435O12J8216M793q466l449k1087l434R661O606K0222
23762B4985M049l2567p152r265j2124p183R748O992j8075q88J2401J2175j0481
23749b7385m006Q945J0294J7153J1129l1445k2247k803K9887o922l67L9856O996
23736B9085l9483N360K857k1964J2330O82k00K9760L291j8108J3385J253r931
23723H317j6327q171M750K864l272R155J018p956l356J3505q054j2038k16Q701
$$ y = [-7598, -18597, -19481, -28942, -5015, 13970, -1062, -32833, -46767, -32195, -20457, -11407, -8611, -8211, -15490, -30862, -20293, -2223, 6944, 10673, 7524, 3924, -3800, -16168, -955, 10898, -14555, -29129, 3981, 6791, -15190, 4595, 9351, 2421, -24873, -15287, -20215, -9386, 20349, 55207, 37465, 13746, 1311, 1923, 20139, 24932, 16466, 13017, -8070, -11504, -1843, 4763, 24985, 29034, -3533, -10685, -19950, -32074, -39257, -29509, -22517, -40592, -41480, -29079, -16904, -27385, -31391, -22446, -12152, 5001, 16130, -15315, -37562, -40365, -10478, -17400, -17767, 22089, 29085, -10398, -5038, -2181, -24145, -11815, -11133, -11333, 18427, 21718, 3610, 16995, 18248, 8317, -8010, -16181, -11431, -8567, -11839, -2684, -1666, -9622, -12978, 527, -7527, -19565, -19781, -11080]
23709a1080J2305j1139k1416q760J3000K4424k8163k1112k438M708K3140j6009
23697d2540l3698J4779P798K0094R682J0131r192m161N672R259J1678k3308l2602
23684e6408L5226L0597j892j2441k6078K5013J8802o819m134r255M596j1124j0949
23671b4866M034L413K5888J021j490J7028L608q85j2528r511k4939J5571j3214
23658a6870m322m938J5512q429j7470j2127k053J3255J3861R106r804j987Q759
23645a7507K8164J873J5625K0760l1080k2984j4812R912K5294J6812k1774j5175
23633d892p261J0931K280j9543r323R915m26r430K499P39j8323J5331K0295L779
23619c429k6820J24K4890P363P542R942k762j4668R999J8467J108k9925L672J5791
$$ y = [-11080, 1225, -9914, -31330, -40090, -27090, -2666, -30829, -51941, -54379, -49671, -26531, -42540, -76238, -61459, -53661, -33567, -23885, -13754, -22946, -27107, -21435, -12176, -498, -23806, -56408, -21182, 9415, 7523, -4918, -30996, -5983, 12819, 6000, 1866, -7389, -2793, -13917, -24866, -20832, -17419, 8469, 9490, 8000, 25028, 28636, 27751, 15223, 5712, -19227, -3656, -16870, -21192, -26130, -10618, -19047, -36517, -48644, -50697, -37442, -23581, -14475, -24279, -26266, -17507, 10657, 12530, 28155, 48915, 17835, -5149, -19961, -10049, 15245, 32057, 10283, -4892, -12153, -1222, 1058, -18485, -27808, -17893, -18319, -27749, -25250, -24511, -42834, -27503, -7208, -3429, -30249, -30125, -5235, 2128, 9670, 19612, 16850, 2182, 12181, 30648, 31756, 1831, 5503, 21294]
23605B1294N44l645j0358j2174j1930Q290n777k7270j0547K4610r268J6027J116
23592a9088l046p987r908J0030K930J896L4626K1926J184k3289k1187J3782J3494
23579A5363j3431j214m716j4568L406q73O880K4693L0777n630k5922J5323l556
23566B6532n925P262J3915k5837k2904J0751P729k0868j8116k3675K1569L197
23554b6370J4263M232M397Q455o378J1016k594j2526j9789M028K0115J2976N25
23541A2350j590q425M487j7285k299j5063J8839J7134j2325j0330n533j847l115
23528b5002o396J9713j125k5854p281K1363j6802l0246N332M8142j1203l0789
23516f0148J7691L0063r99Q068j7172j410K9981M358j8890j6252m559j0267K3608
$$ y = [21294, 21838, 18193, 7835, -4339, -16269, -7979, -13756, -41026, -51573, -26963, -36231, -20204, -19088, -22134, -30121, -40029, -29999, -27069, -25173, 9453, 31379, 32563, 9274, -11913, 1869, 15363, 1932, 718, -3998, -18566, -15160, -16033, -9153, 15540, 46317, 40687, 14765, 30088, 26532, 20607, 27869, 41784, 15947, -6957, 3794, 11523, -9345, -27461, -51136, -29567, -26370, -12107, -7875, -3478, 4977, -1401, 9615, 7021, -5505, -25294, -21266, -1151, 11825, 12350, 10760, 2335, 6822, -10463, -12762, -27825, -8986, 8148, -4177, -14507, -20040, -21887, -25002, -31398, -11685, -12810, -38664, -45945, -24582, -41384, -71630, -66298, -18156, -29359, -60148, -42457, -12394, -13393, -5325, -22497, -23907, 6074, 10432, -8458, -24710, -29269, -39536, -15928]
23503a5928m26J8589L9366l760o543j8679j8770j4060N654j5554P639J2596P382
23490b494j8377J186J5966n123k0099m490q016k29P353J6964O623j9702k3383
23477e3821O756J9868j0774K5037K3788O141q575K329m955Q180R896j6274j53
23464G443M1389L285l6083n5677p619P606k272J8040J9210J679j4793k4333m739
23451d6864J5672K913M613L6446J2558j1386N267k5972j6050K8493L556Q712J5753
23438C3711j23o611p156k3092k6640k4561J1371K6714L6596R117k6048N458J9121
23425B7857J7909m0688j1807M056j8000P193J3753r411q502N106m394J0708Q188
23412A968P694K0623J6350j3853k4032l999q637J1738J470J8937J3298j9704J2059
$$ y = [-15928, -16354, 2235, 41601, 37841, 31298, 12619, -6151, -20211, -14557, -30111, -22472, -9876, -2494, -20871, -19685, -3719, -8842, -28941, -33431, -41447, -41676, -34323, -17359, -10736, -30438, -53821, -47065, -27197, -37971, -12934, 10854, 16995, 8420, 10749, 5794, 13974, 23870, 7596, 7443, 48832, 52117, 16034, -39643, -47262, -39656, -41928, -23888, -4678, -2999, -17792, -42125, -46864, -31192, -28279, -23666, 12780, 25338, 13952, 19219, -6753, -22803, 5690, 9246, 17958, 33711, 33588, 26977, 19821, -3271, -29911, -54472, -43101, -16387, 20209, 29326, 3278, 8736, 27857, 45766, 5078, -6729, -2673, -20673, -13480, 273, -9138, -17640, -12534, -16928, -6220, 1968, 9662, 30285, 46635, 32782, 8750, 4751, -3886, 7852, 9322, 28259, 41557, 21853, 33912]
23399C3912m07j6149k0723j7075J6559M2609O755j4293K245j59j0970j8114k1366
23386a7176j6449K6924l158J12K5635K8233k3164k940Q483l5326k2947o019O088
23373c1704L4214K0789j7263l6628k3777J0685J3514j1598j9090j7224K709n038
23361h0411J9984M0124J6549j6819M779J1588j8747k6064O024O886J595l381r160
23348d7053J5008J1355j2451K4837L2658m096o131M930R945j2370m090K3105n0960
23335a5313j2944L930R205K5707l37j9999J2532Q247k1241k6521o297J956O877
23322c4198J0524K5140J0730j467j3515q244J8516J4078J2428K583k2800l2170
23310a8395j7222K5932K1227j4769n900j922P052k5247p579J8971J6812j322K075
$$ y = [33912, 33505, 17356, -3367, -20442, -3883, 38726, 45481, 31188, 33433, 33274, 22304, 4190, -17176, -33625, -6701, -9859, -9747, 15888, 44121, 20957, 18017, 26500, -8826, -31773, -37792, -31704, 2510, 23299, 6036, -30592, -54369, -43684, -30170, -41768, -60858, -78082, -75373, -80411, -60427, -20303, -3754, -20573, -15794, -4206, -22953, -49017, -42993, -36107, -34512, -37893, -47053, -32045, -20690, -33141, -8304, 24354, 20258, 14127, 19057, 29002, 16632, 12542, 35647, -15313, -28257, -24327, -15122, 10585, 10248, -9751, 2781, 11028, -10213, -36734, -43031, -41075, -34198, -23674, 1466, 12196, 10729, -2786, -11030, 7486, 21564, 33992, 36575, 13775, -18395, -35617, -9685, 11542, -3227, -9127, -11049, -3997, -29244, -36823, -17852, -1040, -2362, -287]
23297b87M9458K4761k4782k8235l1105K34J3563j682J7822j1142L752j8423k2485
23284b8551l880L519K7917J2017q084p185J5615q972j624O752j7664J018o28O952
23270b798m803J3568M3719L137j5099j409k3431j2626J6394Q393k1541j9952r852
23257b6300J9693m366k4592M972L0938L454k3870k8118l742j6570j534K5038K8441
23244a6556M526j3081L035K3353J5304P913k1095k6988p873J3076J5633J8087
23232A5334r825j1212K842N563L0030j4430p173j6764m4806l638K7737J5916J1873
23219A447K4971k481o453K2045K0235j4272n570k1224K413q417j9218J7128r987
23206F17J3850J8598J2260m7185l244J6916J2325K631j1246j5442p567L205J2132
$$ y = [-287, 49171, 73932, 49150, 20915, -10190, -9956, 3607, 1925, 19747, 8605, 12357, -6066, -28551, -32431, -28912, -995, 11022, 2938, -4247, 11368, 2396, 772, 7524, -10140, -9122, -9750, -2798, -7601, 5967, 49686, 52823, 37724, 36315, 12884, 258, 16652, 25045, 3504, -16448, -26300, -6607, -10973, -35565, -30593, 345, 3799, -20071, -48189, -51931, -68501, -70035, -44997, -16556, -12030, -25111, -22076, 1277, 16581, 24494, 3399, -23589, -31462, -18386, -2753, 15334, 5509, -5703, -2861, 2702, 32732, 18302, 11129, -5635, -50441, -54079, -26342, -10426, 1447, 26418, 23937, 17484, 39529, 59764, 45492, 39922, 18698, 21111, 12694, -6524, 10604, 617, 14467, 33065, 45325, -1860, -5104, 11812, 24137, 26768, 15522, 80, -7487, -4282, 7850]
23193G850J483J5456k659l2041j4508m005L2353P926j9822k4027J0447K0439Q755
23180G647N96n237j628k8199K1293J9543m510P136L682j4858k8237k1249M302
23167c9719J6261m491J8547k10j9125J0714J5451J6704j75j1190N365K6055J8978
23154E3165J74l4224k4503N08Q1k992n468K8136J8256P087J2627j6874l5169j9313
23140a8509R971K2087q949K7495K975Q069j728j7219j4764q684K5512R052Q59
23127C6167k9593j3422l3725j056M5388J1604k3983k6528l5181j7644L6740N0137
23115a096r00P233J0368K5770N075l0798o248J1407k7541p434J3193K9021J7835
23102D5885K367N758N41j9143r461k5490Q229O851j0358J560n18k2666j3382l0265
$$ y = [7850, 9333, 24789, 22130, -9911, -24419, -28424, 3929, 11855, -7967, -31994, -21547, -1108, 7647, 8243, 3006, 1378, -26821, -5528, 14015, 9505, 16641, 20323, 5465, -22772, -44021, -39719, -23458, -27949, -9402, -9612, -28737, -18023, -2572, 14132, 13957, 2767, 8132, 34187, 53165, 53339, 19115, -5388, -4880, -4799, -7791, -13259, 14877, 33133, 40220, 52847, 35973, 804, -18509, -8538, 13549, 4600, 32095, 35070, 43139, 41411, 24192, 9428, 744, 26256, 35308, 36167, 6574, -6848, -40573, -41629, 3759, 15363, -8620, -35148, -70329, -87973, -51233, -1096, -1996, 5237, 15605, 41375, 46450, 15652, 9404, 20811, -6730, -14164, -971, 28050, 45885, 48252, 54010, 54551, 35408, 25947, 457, 8686, 15537, 5179, 6739, 6221, -16445, -29827, -60092]
23088f0092K3177J683J6537k942N680j850j6599P528K982J2940L432k229J048
23075h705r243J2689O245L3704K420j4562k0824j1029J6875K1271J0632n182j0917
23062B3374l6268K613K3318j3099J437J0069j4971l561J3885j1709j6215L227
23050a7900R926K792m510J0373Q354j031N091O793l46k511n33j024k3188P885
23036A71K3568J2276k6069k3302n597j1830j586P089n579M399k753J3954j579
23023a6838J1751N439O799K7937L8238m057l3093r278J8552j3859Q087R851j3757
23010C5772q994j803k2569o837p792j1528l831L4233K3068j4322j6775J310j5639
22997a5707r802J4005J4907J8710M349j4724j1858J0811k3077m0951k6100N807
$$ y = [-60092, -36915, -35232, -18695, -21637, -15957, -17807, -34406, -26878, -23896, -10956, -7524, -9753, -8705, -17948, -5259, 986, 34690, 37110, 22548, 1724, -9305, 7570, 28841, 39473, 34291, 23374, -12894, -10281, 13037, -62, 1375, 11444, -3527, -7088, 6797, -4912, -21127, -17900, -7974, -5182, -9692, 681, 9035, 8004, 13095, 19888, 19542, 17031, 16498, 15474, -7714, 171, 23739, 36015, 9946, -13356, -18953, -30783, -32369, -25280, -30859, -26460, -29213, -15259, -16838, -5087, 352, 7151, 35088, 73326, 69269, 36176, 26898, 45450, 31591, 39678, 49529, 35772, 26778, 24975, 2406, -4431, -12223, -23751, -27582, 6651, 29719, 15397, -1378, -68, -15707, -25509, -11504, 3403, 22113, 26462, 11738, -120, 10691, -12386, -53337, -79437, -73630]
22985g3630K6540K7531p390R285J7308K9372k02l2058n189j4460l241K5929K363
22972B158J3228k303l1016n817q174K1771L0271k1386l898K870J1244N406K2279
22959C6633N365l8034j7597O455j1080J5207K0677K5344J2768n291k0808P564
22947C7203m716k3457O131J3531K1549K3452J0832k285j6906j1537l3280k4179
22935c662R456L7905K8536r345J9867j2718l9715N326J0895p984M936M613l3512
22922A4598k5306K2837P947N868p331J7914P971r720K6925P039K1822m3612k6483
22909B0469K2192Q859J3609K2726p43J2785p148l5088m9300P797R627q506LJ3570
22895C0852J52M423K0810M446p600j112R754L3422K5326o433m859L582K5530Q580
$$ y = [-73630, -47090, -19559, -26949, -17664, -356, 29016, 28814, -3244, -8433, -22893, -26134, -205, 2158, 15386, 13083, -17933, -23750, -31924, -10153, 20118, -1268, -5166, -2296, 8948, 14354, 36633, 41998, 3964, -13633, -7178, -18258, -3051, 17626, 42970, 55738, 50447, 29639, 37203, 32487, 9030, 15161, 28692, 50241, 73693, 84525, 82240, 65334, 53797, 20517, -3662, 5794, 43699, 72235, 62890, 82757, 70039, 30324, 35650, 46545, 38561, 43497, 48110, 14598, -10708, 12129, 20076, 25944, 18613, 36527, 44498, 34778, 61703, 68742, 90564, 46952, 20469, 42661, 51520, 65129, 87855, 87112, 99897, 92749, 57661, 8361, 16158, 25785, 17279, 17282, 30852, 31004, 35427, 56237, 60683, 53083, 51971, 61725, 95147, 120473, 114040, 109181, 112763, 138293, 146873]
22881A46873J188k2794J3520L1761J0380K033L7315L1091M1675N2583N5036N0167
22869D50828Q4156J60360K08956L30397M58093M80222L44452K06556O2626J3969
22859B800615R7011J03270n5784k11723l97023m37363l73496l29973k56246j70059
22849G69229j13139q7543p7122q9666m0324k0655n5309l1389J1886J6736o61n5534
22837B26509m1483J7736J1390j1233j5760q001n1805j7095K2135k951M35J5738
22825A45615m383j1604P57J7255K253R187m353n065J380k7016r283R392j2106
22812A12029j1141j764j2042n951K712l775n865r256J3833J6492M196r063j0129
22799H0276j8963j5134k241J8435k5575J1327K0250R029j3123M603N298o87p893
$$ y = [146873, 148061, 125267, 138787, 170548, 180928, 182961, 220276, 251367, 293042, 345625, 400661, 450828, 534984, 695344, 904300, 1234697, 1692790, 2173012, 2517464, 2724020, 2786646, 2800615, 2897626, 3000896, 2945112, 2733389, 2336366, 1899003, 1525507, 1195534, 939288, 769229, 656090, 568547, 491425, 401759, 361435, 340780, 285471, 254082, 265968, 282704, 282043, 226509, 185026, 202762, 214152, 202919, 187159, 179158, 127353, 110258, 132393, 129442, 129877, 145615, 141232, 129628, 130385, 147640, 149893, 159080, 154727, 149662, 151042, 124026, 114743, 124135, 112029, 100888, 99124, 87082, 81131, 83843, 80068, 74203, 64947, 78780, 95272, 99468, 90405, 80276, 61313, 46179, 43938, 62373, 36798, 48125, 68375, 77404, 64281, 68884, 74182, 73495, 65602]
22786F5602k858q288q867r762L948j245J6812P808j8881l631J934Q931K9303R860
22772I0666J1963Q69K98p658k9115j2010l49J2187M367K3616j8211j541K1958
22759I7040K1842N964L480o074P329l6006j7778J009j1829m3070k4615J0430M244
22746A1966J5136j1578K7079n272k4875J367J0353K4817K819l2639k1285j6818
22734a8930R201J8786J6689K9581J5737N758j8095k061n293J6155J2104J0196
22722H9828q274K758P84L041n368j0222j7069J8122N57M887j2970j7829p562Q159
22708D8842J3534J9566n152l8034l1953Q152J1162N443j931j1972J0116q032j3475
22695F266R620k6302r133J9424L4035J4701L62R899o468k8134J664m043K0743
$$ y = [65602, 62744, 54456, 45589, 35827, 39775, 38530, 55342, 63150, 44269, 40638, 42572, 51503, 80806, 90666, 102629, 103498, 103796, 96138, 67023, 55013, 54664, 66851, 71218, 94834, 76623, 75082, 97040, 118882, 124846, 128326, 122252, 129581, 93575, 75797, 76806, 64977, 21907, -2708, 7722, 11966, 27102, 15524, 42603, 37331, 12456, 13823, 24176, 48993, 51812, 19173, -2112, -18930, -9729, 9057, 25746, 55327, 71064, 76822, 58727, 56666, 51373, 67528, 79632, 89828, 81554, 84312, 85096, 88137, 82769, 72547, 55478, 73600, 74157, 79044, 66074, 48245, 40683, 48842, 62376, 81942, 76790, 38756, 6803, 14955, 26117, 31560, 29629, 17657, 27773, 19741, 6266, 15886, -10416, -19549, -125, 33910, 48611, 48973, 58872, 52404, 24270, 25934, 21891, 42634]
22682D2634Q065J8166M450J6483l184R993r334R487J470r840Q266P150n689j1154
22668H6963j3607n502q128K524J0431M797J5549J1544J5720R453j5002k3535p63
22655I0444J6052M819n227j3201p8r849K448j1670J0753j550n335L208k4929l601
22641E2284J8012n18l1868J0433M6322M288r081J1558L348r771r960J1117n715
22628I0449j9111Q192L2045L2584k2510j1781J3925J3797p690p741k1784l630
22616I6745J6572r196j3469J6642J0526j6264l6950k0392m1461o8817m3948J4228
22604i5784J6724L971j2203p095K364j3657R762L5389L5813K9043L7293J2319
22592E3939J0335l119O32j6001K0610M5095J6699j2487r390j417J7557P186j1924
$$ y = [42634, 50699, 68865, 73315, 89798, 86614, 96607, 87273, 96760, 98230, 88390, 96656, 103806, 98117, 86963, 73356, 67854, 59726, 62250, 72681, 77478, 93027, 104571, 120291, 129744, 114742, 91207, 90444, 106496, 111315, 106088, 92887, 92809, 82960, 85408, 73738, 84491, 82941, 77606, 80814, 55885, 52284, 70296, 69778, 37910, 48343, 94665, 98953, 89872, 101430, 104778, 95007, 85047, 96164, 90449, 71338, 79530, 111575, 144159, 121649, 109868, 123793, 137590, 129900, 122159, 100375, 96745, 113317, 104121, 90652, 107294, 117820, 101556, 64606, 44214, 2753, -66064, -110012, -95784, -79060, -75089, -87292, -94387, -92023, -105680, -95918, -60529, -24716, 4327, 41620, 53939, 64274, 61155, 61787, 45786, 66396, 111491, 128190, 115703, 106313, 104896, 122453, 129639, 117715]
22579A17715J6753J7300j2194p260L6004J1342j3568j0059Q725L752J2716m0018
22567A41208j882J9148m435L276J0790m902j2008J0741M4840M529L7550M4708
22555B93563M0357R5732Q7127Q9089O5700L3040M147m780J2082K2889m3956l3311
22543F61679o0457q0069j05674m9212o5115k7653Q578M121j444j6435k3212k906
22531B42201K6335J3857j9169J2657J8318r370o250K3639J2374K1241m475l6869
22519B94489l0463R61j5271l5445j4546L0852J8156k5674J6307L8398j2848l313
22507B61603K2135K4234N468m351K0760J7189L3622J2677O99m0306k3763K1340
22495C51307L5087L438J0481J7585O846k848R453N0202K0897j0148k0144l6206
$$ y = [117715, 134468, 151768, 139574, 132314, 168318, 179660, 166092, 156033, 164758, 168510, 181226, 141208, 139326, 158474, 154039, 157315, 168105, 163203, 151195, 161936, 206776, 211305, 248855, 293563, 333920, 429652, 516779, 605868, 671568, 704608, 708755, 703975, 716057, 738946, 694990, 661679, 601222, 521153, 415479, 366267, 301152, 273499, 282077, 286198, 284754, 268319, 245107, 242201, 268536, 282393, 263224, 275881, 294199, 284829, 278579, 302218, 314592, 335833, 331358, 294489, 264026, 264987, 249716, 214271, 199725, 230577, 248733, 223059, 239366, 277764, 264916, 261603, 283738, 307972, 313440, 309089, 329849, 347038, 380660, 393337, 394036, 353730, 329967, 351307, 386394, 389832, 400313, 417898, 424744, 421896, 431349, 481551, 502448, 492300, 472156, 435950]
22483D35950j1204R141Q624K598j3680l1643k7610j2593l2315k6888k1490j2736
22471B66154k2286j1567l424P795K7670M1880K2819j1780J1097J6296p81J7300
22459C61173L7375M7927P4421M8692L5871K3856K283n23p312j4482m083j310l3980
22446E69908o3144p8265r2345n1703j9355j6979K5113L149q705J7717K9021n281
22434C09131J7206K2226K512r590K116R41J3149q107Q438L3434P6178J14313J42794
22421G24741M1377L2370Q4708R4526Q3180M0817J379k9304m6768k0678j7439k7477
22409I61432l2026l7843m0755j7804J475N1764L5774L0256K4101Q503Q340J4236
22397A007453J8484M8846J00029N3354M1654K9856j9681Q106N2455M3968L9300
$$ y = [435950, 424746, 433887, 442511, 445109, 431429, 399786, 372176, 359583, 327268, 300380, 278890, 266154, 243868, 232301, 228877, 236672, 264342, 306222, 329041, 317261, 328358, 344654, 343873, 361173, 398548, 446475, 520896, 569588, 605459, 629315, 631598, 631075, 623763, 609281, 605198, 603888, 569908, 506764, 428499, 336154, 284451, 265096, 248117, 273230, 276379, 267674, 285391, 314412, 309131, 326337, 348563, 351075, 341485, 343601, 344542, 357691, 349584, 358022, 391456, 467634, 581947, 724741, 766118, 798488, 883196, 977722, 1060902, 1101719, 1103098, 1073794, 1027026, 1006348, 988909, 961432, 929406, 891563, 850808, 833004, 834479, 886243, 922017, 952273, 976374, 984877, 993217, 1007453, 1025937, 1074783, 1174812, 1228166, 1269820, 1299676, 1279995, 1288101, 1340556, 1384524, 1423824]
22386A423824L5875K7807L4983Q1572J02428Q2086J20396K06896K84787M11732
22376B812386N66579N30737L53000J79413J0859O3765J95055R5356l3642k36880
22366D536628l82788l83121l25349k50135r6990o2815k2122m469R431L2338K4404
22355C075012K5908N6122N9278R6884Q5164J14640J34694J27927J32383J28463
22345D036475J21483R3083J03922J58525J42960J62300J91026J80977J99770K35889
22335E626410K33236K59776K71161L15127M01665L39463L35604L69931M15171
22326H567544M40588N03828N88608P07891P89282Q52165R45871J035242J195078
22317A5626097J372809J600168J898013K276633K757599L444370M492181N654520
$$ y = [1423824, 1459699, 1487506, 1522489, 1604061, 1706489, 1788575, 1908971, 2115867, 2400654, 2812386, 3378965, 3909702, 4262702, 4442115, 4452974, 4516739, 4711794, 4807150, 4773508, 4536628, 4153840, 3770719, 3445370, 3195235, 3098245, 3035430, 3013308, 3008839, 3018270, 3050608, 3075012, 3100920, 3157042, 3216320, 3313204, 3398368, 3513008, 3647702, 3775629, 3908012, 4036475, 4157958, 4251041, 4354963, 4513488, 4656448, 4818748, 5009774, 5190751, 5390521, 5626410, 5859646, 6119422, 6390583, 6705710, 7107375, 7446838, 7782442, 8152373, 8567544, 9008132, 9511960, 10100568, 10808459, 11597741, 12449906, 13395777, 14431019, 15626097, 16998906, 18599074, 20497087, 22773720, 25531319, 28975689, 33467870, 39122390]
22309C9122390O451132O573952P017428P787503R348424J2695485J7593915K5805767
22301A32395996M0813468O2966918Q6938416Q6238232N4630091K9718574j931971
22294D91769724k749718J9827786J4246810j1518263m0809395p6614432q2917687
22287C11234825p0350151n6089998m0527160k7629763j8983028j3272580r582273
22280G4799872p265401n767438m938015m309407l742458l281907k953989k615973
22272C9925284k326424k103709j831414j643455j528699j366123j257391j183052
22264B6685017j077989j015732r29514q88823q31096p79516p27193p16225o53656
22255A9065273o10136n58869n50695n47363n45777n09538m70158m51222m59075
$$ y = [39122390, 45573522, 52147474, 59164902, 66952405, 76300829, 88996314, 106590229, 132395996, 173209464, 236176382, 323114798, 409353030, 463983121, 493701695, 491769724, 489020006, 508847792, 523094602, 511576339, 470766944, 394152512, 311234825, 240884674, 184794676, 144267516, 116637753, 97654725, 84382145, 74799872, 67534471, 61767033, 56829018, 52519611, 48777153, 45495246, 42541257, 39925284, 37598860, 35495151, 33663737, 32020282, 30491583, 29125460, 27868069, 26685017, 25607028, 24591296, 23661782, 22772959, 21941863, 21162347, 20435154, 19718929, 19065273, 18455137, 17896268, 17345573, 16798210, 16252433, 15742895, 15272737, 14821515, 14362440]
22246A4362440m22903m35501m58067m47626m37757m44858m54741l99868l96069
22237A0465050l62759l00954k49655k12436k37654k55902k27010k20956k41909
22228H155815k42108k15917j85249j04585o5710j4920J14257K62020L36492K07026
22218H247121O7119j06726j56265m9708o34j50019k71818m48209n13139m65425
22208F152297l70997l34653k79938j87241j43985j49806j32925r7689q2155r8920
22198D273988q5884o3128n7478n3336o9328j12470r5868o6374m4559m2932n4286
22187C528345p6659r5421o3331o7412n7551l9917n2537p8619o0753p0617q0812
22176B784716m7985m9386n2132j9951l3139o032J9065J2789J0621J0850O243K4922
$$ y = [14362440, 13939537, 13504036, 13045969, 12598343, 12160586, 11715728, 11260987, 10861119, 10465050, 10102291, 9801337, 9551682, 9339246, 9101592, 8845690, 8618680, 8397724, 8155815, 7913707, 7697790, 7512541, 7407956, 7342246, 7327326, 7441583, 7703603, 8040095, 8247121, 8314240, 8207514, 8051249, 8001541, 8000907, 7850888, 7579070, 7130861, 6617722, 6152297, 5781300, 5446647, 5166709, 4979468, 4835483, 4685677, 4552752, 4455063, 4372908, 4273988, 4188104, 4124976, 4067498, 4014162, 3944834, 3832364, 3736496, 3670122, 3625563, 3582631, 3528345, 3451686, 3356265, 3292934, 3225522, 3167971, 3128054, 3075517, 2996898, 2936145, 2865528, 2784716, 2736731, 2687345, 2635213, 2615262, 2582123, 2576091, 2595156, 2607945, 2618566, 2629416, 2635659, 2660581]
22164B660581q860k2742m1653l3982n4277q3547r3741p1357r4993p2475n4765
22153B028189k8005m3834m8224k9252k3256l3658m1849n2523j8543m5238r6612
22142A567195j10471j14778o7380m2223m6991q4214q1345o2382l7664J8680M6475
22131I84902j686Q789K0956P389R790J815O731L572j4245k6706J752J4542j6694
22118A000907k2955m161l6795k2889j3890l2757m5486k5683m3949j8915n1621
22107F81806n8458k4238j8012m3567m6935k0032k093K5563k24j3356j7164n561
22095D57729l395O005j344k5201j3140R594K1980o823k0628m415K0057r20q353
22082D31146l586J5464j2102R613r37j8281J5532l491j9689l8828j5162L7345
$$ y = [2660581, 2651721, 2628979, 2587326, 2553344, 2499067, 2415520, 2321779, 2250422, 2155429, 2082954, 2028189, 2000184, 1956350, 1908126, 1878874, 1855618, 1821960, 1780111, 1727588, 1709045, 1663807, 1567195, 1456724, 1341946, 1274566, 1232343, 1185352, 1101138, 1019793, 957411, 919747, 938427, 984902, 983216, 992005, 1012961, 1020350, 1030140, 1031955, 1038686, 1042258, 1028013, 1001307, 1003059, 1017601, 1000907, 977952, 973791, 936996, 914107, 900217, 867460, 821974, 796291, 752342, 733427, 681806, 623348, 599110, 581098, 537531, 490596, 470564, 468471, 494034, 493810, 480454, 463290, 457729, 454334, 460339, 458995, 433794, 420654, 430248, 452228, 445405, 424777, 420362, 440419, 439499, 431146, 427560, 443024, 430922, 440535, 439598, 421317, 436849, 433358, 413669, 374841, 359679, 397024]
22070C97024q47q873j8424k5030J5653K1056J5768J9915L3139N4413P1009N0665
22058F25468K5596k4624o5325n1208k7731l233j9403n2855k7832J4358K1516P244
22046D21971K2489O4772R3512O8801L2342L5391j6886p3389r2213q2739n7447
22035D16604k6249j7982j4426l6213n0428K816J0384Q234m002j78j8521l3096
22023B36943M219j783R933o248l364q746j4831j6344p624J3598j1593k6198P36
22010A68698J9035j805J5239J326r067j0748j498o563K3439j0611j0970j1101
21998A65374K3935J2066J0952Q942J3648j8885K9432j2398R223N1584J6155o175
21986C03853o759n027l499J6634k6889k0128l6536o4426k9797j8819R666j4124
$$ y = [397024, 396177, 387304, 368880, 343850, 359503, 380559, 396327, 416242, 449381, 503794, 574803, 625468, 651064, 626440, 561115, 509907, 482176, 478943, 459540, 406685, 378853, 393211, 414727, 421971, 444460, 509232, 602744, 671545, 703887, 739278, 722392, 649003, 556790, 474051, 416604, 390355, 372373, 357947, 321734, 271306, 274122, 284506, 292740, 288738, 288560, 270039, 236943, 241162, 239379, 249312, 243064, 239700, 230954, 216123, 199779, 192155, 205753, 194160, 167962, 168698, 187733, 185928, 201167, 202493, 193426, 182678, 181180, 174617, 198056, 187445, 176475, 165374, 189309, 201375, 212327, 221269, 234917, 216032, 245464, 233066, 242289, 293873, 310028, 303853, 297094, 292067, 288568, 305202, 278313, 258185, 221649, 157223, 127426, 108607, 118273, 104149]
21974A04149p435J5712m74j5499j4386K00K3740p622j3562k008J6017P413k835
21961A03410j8201J92q489Q989q078R259j8956m1693j6185j1413J9467K7372m404
21948D1270m577j7541q142J5558J0894J4015n800k4432J2289K716J734L617j357
21935D0244j1185n828m151P247L7830K6690L609R466q151l3887m3074J0214J4887
21922D3911l8274K935J5093k094o817K048J6077j6321j4727l545L5987K5635J1094
21909G1002J6502j0903k0245k3861p392j9195L032N383K6963Q500K1692k8987
21897D2491m465k402J8841O008k6828n299J4631k2999l406L3758r708k5121j5857
21884c56R303j6794q687L2402L843J0526k3676l1664j5710J9368O593k053j452
$$ y = [104149, 96714, 112426, 111952, 96453, 82067, 82267, 106007, 98385, 84823, 82815, 98832, 106245, 103410, 85209, 85401, 76912, 85901, 77823, 87082, 68126, 26433, 10248, -1165, 18302, 45674, 41270, 36693, 19152, 11010, 26568, 37462, 51477, 45677, 21245, 33534, 36250, 37984, 41601, 40244, 29059, 23231, 19080, 26327, 64157, 90847, 94456, 103922, 95771, 61884, 18810, 29024, 43911, 5637, 8572, 23665, 21571, 14754, 16802, 32879, 16558, 1831, -1714, 34273, 59908, 71002, 87504, 76601, 56356, 32495, 25103, 5908, 8940, 14323, 41286, 49786, 71478, 42491, 38026, 35624, 54465, 60473, 33645, 28346, 42977, 19978, 16572, 50330, 40622, 15501, -356, 8947, -7847, -16534, 15868, 19711, 30237, 6561, -25103, -40813, -21445, -14852, -16905, -18357]
21871a8357K3599L9537m624K592q154k9009n187K1757K823J2374r046k4862K4208
21858B7651M5770r92n137j3709J183o983l056k4125l2306n582o900J4861L2421
21845B3096J0036K479n528J5116K4592k22q918j1747l523l0961k1422r803n5962
21832g2767q25N621k798j7137n170L5807K3787J6499n587K2293j0293K470n899
21819a3999J9927k618J1379J7001J6147r939k8739j5598M812K820q848M610J2759
21806I714J4161J427j3421p493J1063j473L728j2850j1373K0474J5149K1978J6126
21793F7210K208l983k9444j2977m966M220j1064j1244m805l115P308J1880j8456
21780g228J8903M0746L1527p473k2675j4195k203m1521J6992K1456j3569j4272
$$ y = [-18357, 5242, 44779, 40155, 42747, 34593, 5584, 397, 22154, 24977, 37351, 28305, 3443, 27651, 73421, 72429, 67292, 53583, 54766, 47783, 44727, 20602, -11704, -17286, -24186, -9325, 23096, 33132, 35611, 30083, 45199, 69791, 69569, 60651, 48904, 45381, 14420, -7002, -16805, -72767, -73592, -67971, -70769, -87906, -93076, -57269, -33482, -16983, -22570, -277, -10570, -8100, -13999, 5928, 3310, 14689, 31690, 47837, 37898, 9159, -6439, -1627, 1193, -7655, -3045, 9714, 23875, 25302, 11881, 4388, 15451, 13978, 17706, 4856, -6517, 13957, 29106, 51084, 67210, 69418, 65435, 35991, 23014, 18048, 22268, 11204, -40, -4845, -7960, -652, 11228, -7228, 11675, 52421, 83948, 76475, 53800, 39605, 37402, -4119, 12873, 34329, 20760, 6488]
21768F488N305j7381m172J6828K4116q21J7922N842j4298j735J3280j2258j725
21755C7391J0573j8300J1293J6580J7601K5295K0403j0206O543j4047J9442k49
21743A22319J1465M696L3037K4491J685j6135j227O431j1040K3297J5507K5386
21731B39912O8149P7561P5958O1326J18578J93521L02149M34702N00440L87805
21721B460101K48491P1458k6527Q2443R9187m1006j75695l85966m64815m21795
21711A445876l19870k29376j86967j40569o4804o4102o6796j8825l574l2954k5452
21700B92587k5792J1962o869j7666r539N879j6434k3783k6109j1404j4618j0353
21688A47861M894j3579j9871k174j1960r05P932j5075j6073L704k539R671o846
$$ y = [6488, 11793, -5588, -9760, 7068, 31184, 30363, 48285, 54127, 39829, 38094, 51374, 39116, 37391, 47964, 29664, 40957, 57537, 75138, 100433, 120836, 110630, 117173, 103126, 122568, 122319, 133784, 138480, 171517, 196008, 197693, 181558, 180331, 186762, 175722, 199019, 214526, 239912, 308061, 385622, 461580, 522906, 641484, 835005, 1137154, 1571856, 2072296, 2460101, 2708592, 2780050, 2753523, 2835966, 2935153, 2894147, 2718452, 2332486, 1867671, 1445876, 1126006, 896630, 709663, 569094, 504290, 440188, 373392, 354567, 350993, 318039, 292587, 266795, 278757, 271888, 254222, 244683, 250562, 234128, 210345, 184236, 172832, 158214, 147861, 152755, 139176, 119305, 117131, 105171, 104266, 112198, 97123, 81050, 84754, 82215, 91886, 85040]
21675H5040J0778R527N404j695m4662r478L068p563k0861P521J5020j2314P131
21662D6916L3115L139p698j2556l9502J2501J4598K6424m052k8652k8194n78J591
21649A7052Q441L712k3749l958J1513n098J2264L3247P346k7663l9829K269K7966
21636B3513K2524J0148j3330K271j3294l725L2100q891m0241k6579K5182K8012
21624C7690J1641K826L038k1513k3712P175Q35M923K931K4000k998j8974L192
21611C1054K7378J7981o174j7848o714J1909m359l8583j5920M902M164O485j2642
21598A633j7571o378k1226j3703R78J2584K3453Q343J2758j2487K8840K3889j2073
21585B9040k6126m863k3065m765J9311n968j293M078J3485j4992Q356r449K327
$$ y = [85040, 95818, 105345, 110749, 109054, 64392, 54914, 57982, 50419, 29558, 37079, 52099, 39785, 46916, 80031, 83170, 75472, 62916, 23414, 35915, 50513, 76937, 72885, 44233, 16039, 15461, 17052, 25493, 29205, 5456, 1498, 13011, 7913, 20177, 53424, 60770, 33107, -6722, -4453, 23513, 46037, 56185, 42855, 45126, 31832, 28107, 60207, 51316, 11075, -15504, 9678, 37690, 49331, 52157, 55195, 33682, 9970, 17145, 17980, 22903, 25834, 49834, 46836, 27862, 31054, 58432, 76413, 70239, 52391, 45677, 57586, 53227, 14644, -1276, 3626, 7790, 14275, 1633, -15938, -22316, -43542, -57245, -56267, -43683, -20230, -11887, 871, -11616, 17224, 41113, 29040, 2914, -1949, -25014, -29779, -10468, -16436, -17729, -13651, -166, -15158, -6802, -16251, -13924]
21572a3924J7416J2101k824l015R234j1226j4647k232j6178q505Q388J7916P441
21559e5j7341R22J4469n851K676M0207j4781l2280k067p550o023K3669K062k872
21545d815J348J561J8207R304p992o081j6650J0695K808r911J0885J8082j1420
21532A6021K1685p993k0794m1257p662J0653L843N288J849K9478J125l3427j0534
21519c1725J7198J3058J4356k0518L3341Q737l0348j6596J1578k318q862R816
21507b283N036K496J1536p412j4518K7631L0260j1551j6174R62K9397k5120n1502
21494b1242r268M568m000k0524j230K1018L1692J7202K696P961j8k9309k7816
21481b8270k0290j420L5213M015P988k0564K4489J5057K484J0442p487k5259j6372
$$ y = [-13924, 3492, 15593, 12769, 9754, 18988, 7762, -6885, -9117, -25295, -33800, -25412, -7496, -55, -17396, -16474, -2005, -7856, -5180, 35027, 20246, -12034, -14101, -21651, -27674, -4005, -1943, -4815, -3467, -1906, 16301, 25605, 17613, 11532, -5118, 5577, 8385, -1526, 9359, 27441, 16021, 37706, 29713, 8919, -32338, -40000, -29347, -25504, -20216, -18367, 11111, 12236, -21191, -31725, -14527, -1469, 12887, -7631, 25710, 34447, 4099, -12497, -919, -3237, -12099, -2283, 2753, 5249, 16785, 9373, -5145, 22486, 52746, 41195, 25021, 25983, 55380, 30260, -21242, -30510, -25942, -29942, -50466, -51696, -30678, 1014, 18216, 20912, 28873, 28855, -454, -28270, -48560, -49980, -14767, -10752, -2764, -23328, 1161, 16218, 18702, 29144, 21657, -3602, -19974]
21468a9974k677K9684L573J0279J4244J6762l70n304q364m4373r348J3336O472
21455C940J0778J5035j8498j2541J4785k8443O377R313J705j2774K2693k82j449
21442A0639k0092k5392O145K8243P35J1975j457J1091L72K387O039p606j8140
21429D939j911K5987j6635k2066p755o965J925K4682j6857o038K4142R696R117
21416B2261p490q427J1720j937j5014J6016L5103J1515k4582l0119M367L5413
21404D8826j881j8235j7468j4095q894O313J3584j5943j9558K702K3803J2837
21392A1991J1523k4111l1057L942Q727j7095l4926n289L5247L3559q559J2063
21380c985p664Q560L162k5809P512O77l6696j4496K1357K9932J3260J2149R330
$$ y = [-19974, -22651, 7033, 10606, 20885, 35129, 51891, 51521, 46217, 37853, -6520, -15868, -2532, 3940, 14718, 29753, 11255, -1286, 13499, -14944, -8567, 746, 2451, -10323, 12370, 12088, 10639, -9453, -34845, -28700, -457, 278, 12253, 10796, 21887, 22259, 24646, 30685, 23079, 4939, 3028, 29015, 12380, -9686, -17441, -24406, -22481, 2201, -14656, -20694, 3448, 13144, 22261, 14771, 6344, 18064, 16127, 1113, 17129, 52232, 63747, 39165, 9046, 13413, 48826, 46945, 28710, 11242, -2853, -11747, -5434, 8150, -7793, -27351, -24649, -846, 11991, 23514, -597, -31654, -27712, -18985, -36080, -71006, -76295, -41048, -7489, -16048, -3985, -11649, -3089, 73, -25736, -18224, -17547, -54243, -68739, -47382, -17450, -4190, 7959, 17289]
21367A7289k3014J0753j0352J89Q550j5986K7158j8964k3970M82j8713k0177N075
21354f1680J6963Q990l668K3310q120m051K2648l4250o730j293O405k2977m440
21341f8893l581J7408K7040J7994J6287k310j5473L7541L0891k0710o688P221
21329C6727l262k6228j503n526J3671J0034p778K023j576j0505m8452r38M055
21316c9258L937O849j124j311L0641P250j694N074o627k776j047k543o788j4623
21302b4040r549J0825l430n551J6513p66J3716P128j4950j3835k7382L369K7503
21289b0449j9121j6968N217K838J8057j6531j8302K3169M2094o319r04j4915Q944
21276a3190L6107N222k9880j5495o518N522K123r581o451K5240Q211j4015k036
$$ y = [17289, -5725, 5028, -5324, -5135, 3415, -12571, 14587, -4377, -28347, -27865, -46578, -66755, -61680, -44717, -35727, -39395, -16085, -24205, -28256, -5608, -39858, -46588, -47881, -41476, -64453, -68893, -72474, -55066, -28026, -10032, 6255, 3945, -11528, 26013, 56904, 36194, 29506, 36727, 33465, 7237, 5734, 208, 13879, 23913, 16135, 18158, 16582, 6077, -42375, -43313, -39258, -35321, -28472, -29596, -30907, -266, 6984, 5290, 10364, 3737, 961, -86, -2629, -9417, -24040, -33589, -22764, -26194, -31745, -15232, -15998, -2282, 4846, -10104, -23939, -51321, -47952, -20449, -39570, -56538, -51321, -48483, -30426, -46957, -65259, -42090, 4, -6315, -7219, -22134, -13190, 22917, 28139, -1741, -17236, -23754, -18232, -16109, -25690, -32141, -6901, 1310, -12705, -14741]
21263a4741K9804O021j3533m49q532J7567J689j4231r876L174J1830N080O729
21250B0532k2472k3252J7766J5701J6298j2821q242j393k2835J5053J0708K1410
21238B6453N237J5289o963k1326k7273M61R97k8752k9014K2179J3863J3677J1037
21225d135m487k0952l177L2882J2502k617L280O475j9866k2161L099j0677K27
21212b9607L5363J6669L522j5010r329j5485M83n070k1819l2384j920J3283M6271
21199a5033K2511o21q944J512Q835N612K1228L4227j0326m9067j2782Q982k4008
21186a7874R750L630j7077J7307n22p172J0374J9942K4424P477k2758n969j4783
21173F749p428n165R977k695l7342j591N888L533J5600n695j4922l748j436Q145
$$ y = [-14741, 15063, 21084, 7551, 7102, -1430, 16137, 17826, 3595, -6281, -3107, 8723, 13803, 20532, -1940, -25192, -7426, 8275, 24573, 11752, 3510, 2117, -20718, -5665, 5043, 26453, 31690, 46979, 40016, 18690, -8583, -8122, -7125, -35877, -64891, -42712, -28849, -15172, -4135, -8622, -29574, -32751, 131, 12633, 10016, 13296, 19771, -95, -22256, -19157, -29834, -29607, 5756, 22425, 25947, 10937, 1608, -13877, -13394, -18464, -40283, -72667, -74587, -61304, -15033, 7478, 6857, -2087, -575, 8260, 13872, 35100, 69327, 59001, 9934, -2848, 6134, -17874, -8124, -4494, -21571, -4264, -4786, -11958, -1584, 18358, 42782, 50259, 27501, 21532, 6749, -679, -5844, 4133, 1438, -35904, -37495, -31607, -28074, -12474, -18169, -33091, -36839, -38275, -30130]
21159c0130o317O901K3774K3835p148j2060L8233J1129p553J934K358l5382o016
21146C558J5487m4878N337J3351N833j3083j8194R751K6965j1294j684K525q262
21133a4588O453k35k9680n42k033L383k1922j7557K1530K7396J0293k898j4104
21120c4504n358J432m128N323L1060M2352j6968l877Q008j4191n041j3372K185
21107g079n810q592J2999J5011q056j8091r257L054J8402K1144j0630m811l3252
21094c4968J6374n327k2288n424J0923L5431L225l335n434J0044j9487m002J9851
21081d417r86j3157k1100j0682K5105J6991K068o44l1364j3228R533K3713j832
21068b0000m230j0958m547j441j7460J3898L5097k673l732J064k6847J4468K2160
$$ y = [-30130, -36447, -29546, -5772, 18063, 10915, -1145, 37088, 48217, 40664, 42598, 44956, 9574, 3558, 19045, -25833, -20496, -7145, -1312, -14395, -32589, -22838, 4127, -7167, -8851, -6326, -14588, -8135, -8370, -38050, -38592, -40625, -37242, -59164, -76721, -55191, -27795, -17502, -20400, -34504, -39862, -38430, -42558, -37235, -6175, 36177, 19209, 15332, 23340, 9149, 4108, -9264, -7079, -12889, -21481, -8482, 6529, -1527, -19618, -28875, -25821, -7419, 13725, 3095, -1716, -34968, -18594, -23921, -46209, -51633, -40710, -5279, -2054, -5389, -10823, -779, -20266, -24268, -4417, -5403, -18560, -39660, -50342, -25237, -8246, -6178, -6822, -38186, -51414, -41881, -18168, -20000, -24230, -35188, -39735, -41176, -58636, -44738, -9641, -12314, -16046, -14982, -41829, -27361, -5201]
21055e201L605L323L4967j772Q767J5919l486q946k7555j6661j0358j2259J5195
21042d462M437Q306r761j8171M187J4270q841n649K0334R665J250J3362K931j3611
21028A8247j0027k0214J8676o439k1588O114j001l460L143j3517J172O872J1797
21015a0225j676j9132P007R859J493k0853m594K080j305k704j170j3273j559K5103
21001c0949K3806o44o353J9861P609J0828j1118k1061k0754O36j2453J965K1508
20988a7119P60K0058L4042L770l1013j2627J1549J6516j8738n1161k1475J1679
20976e3759L053K5611J3599o478L1948rl1377j5024k3207o704M3382K4890j0645
20963d720m3650j8619J3762J0752J3738K0091Q016K3941K0958m9593l2660L632
$$ y = [-5201, -1596, 1727, 36694, 34922, 43689, 59608, 56122, 47176, 19621, 2960, -7398, -19657, -4462, -25, 8281, -1480, -19651, -15464, -1194, -10035, -15684, 4650, 14315, 15565, 28927, 31858, 18247, 8220, -11994, 6682, 243, -21345, -15231, -16232, -19692, -16549, -30066, -28894, -22022, -10225, -11901, -31033, -24026, -14167, -12674, -33527, -38121, -36041, -37346, -40050, -41220, -54493, -56052, -30949, -7143, -7787, -14140, 5721, 13330, 24158, 13040, -8021, -28775, -28139, -40592, -38627, -17119, -16359, 3699, 37741, 41511, 10498, -2129, 9420, 25936, 7198, -43963, -65438, -53759, -50706, -25095, -11496, -17974, 13974, 13965, -17412, -32436, -55643, -62347, -18965, 5925, -4720, -48370, -66989, -53227, -42475, -28737, -8646, -630, 23311, 44269, -5324, -37984, -34352]
20951c4352J5971J572O169J8761J4735j447Q546l5338k7642j0111R0J8704J3801
20938a0541l169J972n682L052l144O547K0387j0956M397J7961j3246q026n405
20925e853j9674Q249P207O539K6680o374r274J3762k8766j7426J2139j0254q900
20912c1945R836P482k8046M633Q312L8136K6757j6483j1305O551o890m052k8222
20899b5236j4532J140J0899K5040R487k0462j3705K6760o72P269n672j278j6914
20886a7876j5230n405J1338J3841K638L48j694J8609l640O659N705j8417k2800
20873b5924J8039R873N406N769J2094j5670n510J1640j6717k9826k5854Q835K4205
20860b3640J4555j1866m434L200J4207L0415o436j8101j513k198O967J5325J9603
$$ y = [-34352, -18381, -16809, -10640, 8121, 22856, 21409, 29955, -5383, -33025, -43136, -43046, -24342, -10541, -13710, -11738, -17420, -14368, -17512, -10965, 9422, -1534, 2863, 20824, 7578, -448, -5853, -25527, -17278, -10071, -3532, 23148, 16774, 7500, 21262, -7504, -24930, -12791, -23045, -31945, -22109, -14627, -42673, -38040, -29728, 8408, 35165, 18682, 7377, 13928, 7038, 2986, -25236, -39768, -38628, -27729, -2689, 6798, -13664, -27369, -609, -1281, 5988, 316, -962, -17876, -33106, -38511, -27173, -13332, -10694, -10346, -12040, 6569, 2929, 9588, 15293, -3124, -25924, -7885, 1988, 7394, 13163, 25257, 9587, 4077, 15717, -1000, -30826, -56680, -47845, -23640, -9085, -20951, -25385, -22185, -7978, 22437, 16001, -2100, -3613, -5811, 1156, 16481, 36084]
20847C6084n627K151M060k4845j7559p827R657N839j6120j8192o17K2739J1610
20834A353J2134o798M024j827j4151r56k4661L760J4198J7708J3480Q440J685
20821B8389j8130p699j8334j5968n755J1045j6572q463L3035p440M437j9568O846
20808c4177K3300p387J9073L814k9359q571J4798K4193p421J5445Q511K1225p847
20795C5597r730j5466k2011L950P139j868j0298J7435m58j1554j4045K2888k937
20782a358K140j828k3996k905K121O619n009J028K9951r704o902j6519K1839N457
20768I34k1597l4546j9177J8732K4402K5281k1665l648r609k0790L87R970j2938
20755f4264L065L4797K0937k936k167R715r277p622m987j3611K4209l4907J0751
$$ y = [36084, 30457, 32608, 36668, 11823, -5736, -13563, -3906, 1933, -14187, -32379, -32996, -10257, 1353, 13487, 6689, 10713, 8886, -5265, -6221, -30882, -27122, -12924, 4784, 18264, 26704, 28389, 10259, 2560, -15774, -31742, -37497, -26452, -43024, -51487, -18452, -25892, -21455, -41023, -34177, -10877, -18264, 809, 4623, -24736, -33307, -18509, 5684, -1737, 13708, 22219, 43444, 35597, 25867, 10401, -11610, -7660, -521, -2389, -12687, 4748, 4290, -7264, -21309, 1579, -1358, 782, -1046, -25042, -27947, -25826, -19207, -24216, -23188, 6763, -2941, -9843, -26362, -4523, 934, -20663, -55209, -74386, -55654, -31252, -5971, -27636, -31284, -40893, -61683, -61296, -51326, -64264, -61199, -26402, -5465, -8401, -10568, -853, -10130, -17752, -22739, -36350, -12141, -47048, -36297]
20742c6297J4516J253K5658J7626j8706r854j9212k8318j5376M598L5272J7472
20730a1368j9224l923R996k245k1092M396J6083K1060j9640j8069k569K5609J954
20717a9032J5656J1109j4194j7111j1485J21Q036j9087K0460J3650j9105L3689
20705B707K3172k3848n4192j7837L2059L129j7074j6647M57Q347K6263p810p109
20692d8383L2664N052k3570j874J8970K2952K3783p769k3805j0367J0603Q217
20680F473j0001j1145J1246k9790r454J6427J4418L3060j7105k8063k981j1726
20668c8641J6043N372J27k6768j5099K8097l981m750j9081K524O975L527o513
20655e2168K4211k4843j4376K3273M477Q069P741j3827j2476j428j788Q564m691
$$ y = [-36297, -21781, -20528, 5130, 22756, 4050, -5804, -25016, -53334, -68710, -64112, -28840, -11368, -30592, -34515, -24519, -26764, -47856, -43460, -27377, -6317, -25957, -44026, -46595, -20986, -19032, -3376, 7733, -6461, -23572, -35057, -34936, -26900, -45987, -25527, -11877, -30982, 2707, 25879, 2031, -52161, -69998, -37939, -34810, -51884, -68531, -68074, -59727, -33464, -41274, -48383, -15719, -10667, -34237, -36111, -17141, 5811, 29594, 21825, -1980, -12347, -1744, 6473, -3528, -14673, -3427, -33217, -42671, -26244, -11826, 21234, 4129, -23934, -26915, -38641, -22598, -17226, -17099, -43867, -58966, -30869, -34850, -39600, -58681, -56157, -49182, -45655, -52168, -27957, -52800, -67176, -43903, -39426, -31357, -23616, -37443, -49919, -51347, -53135, -44571, -49262]
20642d9262J3103J1954J4472j6016k3707l743J2092R145J6312K8072j4449o446
20630h473J026q555m647k689q216j2624J4344j5013l848J0749k323n413K1248
20617b4434J540j1200j5013p510J2058M693j1698K1638L488P275J3205j4245J0404
20604i799K3029L184L8660L071j3938k2359m2512j9244l998J1377p437j778J7871
20591b3873j6774N668J3842J933J0034J6951N406J2613m303k1065j9891Q643p499
20578a8315l2052J3405m776Q693K9423r84K3377k9783k6638J1315Q614Q990o105
20565a4836j3399j635q071J0064R561J667j9898m015K5296O977j1064L037R700
20552f616l0944j5343j1669j2024N843K7303J9310o294j7160l645n28j1753p709
$$ y = [-49262, -36159, -24205, -9733, -25749, -49456, -53199, -41107, -31962, -15650, 12422, -2027, -8473, -7447, -16002, -20649, -23338, -31554, -44178, -29834, -44847, -48695, -37946, -40269, -45682, -24434, -22894, -34094, -49107, -56617, -44559, -39866, -51564, -29926, -26438, -19163, -5958, -20203, -9799, 13230, 16414, 55074, 58145, 44207, 21848, -20664, -39908, -43906, -32529, -39966, -41744, -23873, -40647, -34979, -21137, -19204, -9170, 7781, 13187, 25800, 21497, 432, -19459, -10816, -18315, -50367, -36962, -41738, -33045, -3622, -4606, 18771, -11012, -37650, -26335, -17721, -8731, -14836, -28235, -29870, -37941, -27877, -18316, -16649, -36547, -40562, -15266, -8289, -19353, -16316, -6616, -37560, -52903, -64572, -76596, -70753, -43450, -24140, -30434, -47594, -51239, -51767, -63520, -71229]
20539g1229J33Q960J1787K749r340j162K1398J3227L0869L3002k0355j3206n908
20526I25j6880j2599m935m680P387O079P330m976J8849L1455k2099k1163M197
20513a1110J221L595j6518p938L0188L3719j0497k1415J2881r15r548j7330n112
20500a8779J4112k6563p023J9346M632k954j9423J3663k849N075j4403j181n043
20487d1390j4842L425L4901K0125J5911j5893k1437k997l836m558J5523O57j0215
20474b4626R894k447l8947q107K2753K7107j138J6798n40m5748j1119L2759k658
20461b6019n887J160j4466N871M374o397R674q935j0803J9262J5488k5250n4394
20448i6322J5340L0138R059K6852K6512J0774p550l9868n4049j0976J7075M6229
$$ y = [-71229, -71096, -62136, -50349, -47600, -56940, -58102, -36704, -23477, 7392, 40394, 20039, 6833, 925, -15955, -28554, -33489, -38169, -30782, -24703, -17373, -22349, -3500, 27955, 5856, -15307, -11110, -9889, -6294, -22812, -30750, -562, 33157, 22660, 1245, 14126, 13211, 3663, -13667, -18779, -4667, -31230, -38253, -18907, -14275, -17229, -36652, -22989, -25838, -20763, -35166, -36347, -41390, -56232, -52807, -17906, 2219, 18130, 2237, -19200, -22197, -26033, -30591, -15068, -14411, -24626, -14732, -17179, -56126, -64233, -41480, -14373, -15511, 1287, 747, -45001, -56120, -23361, -26019, -31906, -30746, -45212, -39341, -34967, -41364, -31690, -40625, -51428, -32166, -16678, -41928, -96322, -80982, -50844, -41785, -14933, 11579, 22353, 14803, -25065, -79114, -90090, -73015, -26786]
20436b6786k520J831P087q207L2674O235n961j1666o731l8695j335K7816p731
20423c3989M494k1268Q161J2388J9123J0803j94j1425R3j0046K3284r948m4386
20410e2910J2736m318j1199k049L4489J1297j822k4766j5172J1064j649j3844
20398e8143r540J5803L6615L467j2507J4254K1065R68j6738n308N39j0987j0025
20385c0537m136k5049m364l8J2482J0615Q325j963j784Q044L024p529M804Q639
20371a9467J0550o54j9060J3940m593k0134K31P343J1702M851N652j2319j5429
20358c7387J8983Q757L643P414J0568r50J970j6572o980J2471P515k2158k2154
20345c4880J8280J7835J119j3936K280Q843k155K237j1027j999J9982J7073j4304
$$ y = [-26786, -29306, -27475, -20388, -28595, 4079, 10314, 4353, -7313, -14044, -52739, -54074, -26258, -33989, -29495, -50763, -42602, -30214, -11091, -288, -482, -11907, -11814, -21860, 1424, -8524, -52910, -40174, -44492, -55691, -57740, -23251, -11954, -13776, -38542, -53714, -42650, -44299, -58143, -67683, -51880, -15265, -11798, -24305, -10051, 11014, 11982, -4756, -10064, -9525, -20512, -30537, -34673, -59722, -64086, -64124, -51642, -41027, -32702, -34665, -36449, -28405, -25381, -32910, -28106, -19467, -8917, -9571, -28631, -14691, -19284, -39418, -39187, -31844, -20142, -15291, -9639, -21958, -37387, -18404, -9647, -6004, 1410, 11978, 11028, 12998, -3574, -10554, 1917, 9432, -12726, -34880, -16600, 1235, 2354, -11582, -9302, -459, -2614, -377, -11404, -13403, 6579, 23652, 9348]
20332I348k1672k7399j5589n043K021M2089K1459J084j2215N454J0856k9726k2349
20319d1682O161J4550J2535Q57o700K4276M374l1760k5868J9123M299k8533k962
20306e1330L4085K2018l593j9155q318m379m271r434J098L0631J426j1645o962
20293b9829j2873j2652k8188J2158L3663K6550J954k857j5096r112j4229L598
20281d6913J7785J8961L224J399j3826k2712R164K8943K9586j1939l1630n760
20269b3718j137J5782N205J8955M826P416K469l1448k1464J4191O73Q657l2804
20256c2397K477J7207j3095N713M500k4237J5661l532j0340k4020p404M0830K7275
20243a362j68m857n970k3404j6839J6111K3459J5026J0478r673K6362K1281n197
$$ y = [9348, -12324, -39723, -55312, -60355, -58334, -16245, 5214, 6298, -5917, -463, 10393, -19333, -41682, -35521, -20971, -8436, -7579, -14279, 9997, 14371, -17389, -43257, -24134, -19835, -48368, -51330, -17245, 4773, 1180, -17975, -26293, -30672, -34943, -44377, -43279, -12648, -11222, -22867, -29829, -42702, -55354, -83542, -71384, -37721, -11171, -9217, -12074, -27170, -36282, -50511, -46913, -29128, -10167, -6943, -5544, -19370, -42082, -32918, -3975, 25611, 13672, -17958, -23718, -24855, -9073, -3868, 15087, 19913, 27329, 29798, -1650, -23114, -8923, -8250, 407, -32397, -29920, -12713, -25808, -20095, -15595, -39832, -24171, -27703, -38043, -62063, -69467, -28637, -1362, -1530, -6387, -12357, -35761, -52600, -36489, -13030, 1996, 12474, 2801, 29163, 50444, 45247]
20230D5247j0016l1440m2466k5851N4665R463J576m329k3424k8127N540J3330
20218c5832J8379q072j7148J1877K5022J5383j2339l1200P276J0037M055q020
20206b0582l2951j0954N457J7560q361j6264J6508L0907J1054J5883j6533j7997
20194b6273L117K094J9551j1954k9671L219J6535J4968j3826L458k0304Q153n381
20181c6314Q833M9179R987j0101j1009j7562j3420j0728j2844Q55o870K9437j9235
20168c9792j8978j9698M063L7329K4087O825r331l839J958P074Q11k0583J1524
20155a8550K166Q718J6651j3545j5881P522J6267q275l1811L302j4344m979O612
20142d6147J0116j1960k09L756N876J747Q579q353K4376o61j388L662o003O476
$$ y = [45247, 35231, 3791, -38675, -64526, -9861, -398, 1178, -3151, -26575, -54702, -49162, -35832, -17453, -25525, -42673, -30796, -5774, 9609, -2730, -33930, -26654, -16617, -12562, -20582, -53533, -64487, -59030, -41470, -49831, -66095, -49587, -18680, -7626, 8257, -8276, -26273, -23156, -21062, -1511, -13465, -43136, -39917, -23382, -8414, -22240, -18782, -39086, -30933, -36314, -27481, 21698, 31685, 21584, 10575, -6987, -20407, -31135, -43979, -43124, -49994, -20557, -39792, -58770, -78468, -74405, -37076, -12989, -6164, -15495, -19334, -17376, -10302, -9491, -30074, -18550, -16384, -7666, 8985, -4560, -20441, -12919, 3348, -4927, -36738, -33436, -47780, -52759, -46147, -36031, -47991, -48200, -44444, -38568, -36821, -28242, -36595, -12219, -12880, -14268, -10606, -16609, -10133]
20128a0133J5078j5374j9541Q139J9658K0838r191M296k085L059k8142j5547j0943
20115c9888l192P929j6442J0912K8876N222J4488J0463J9344J6433q214k3134
20103B2797j6945k8182j9340j4801j195K3815M7701K9210m447K656J158P152j3588
20090C5991j3552m936k279q728j1545J241J9264K0526j1198j5358m657r067j5770
20077b0068k457J087p113l1229j7667M039l8O68N242J4344J2951K8517J9631K370
20063A0277l78o685m0272k588K5045J20J6244J1355K972k3434k675N181K5382
20050B0544n01k0044k1592k6824J9579K9827K7494L180j5407r695K988l9143r320
20037c8914j6527J5659J5510M776M6029K0927m912j6910M146R562R609m967l984
$$ y = [-10133, 4945, -10429, -29970, -21831, -2173, 18665, 9474, 13770, 11685, 14744, -13398, -28945, -39888, -43080, -35151, -51593, -40681, -11805, -6583, 7905, 18368, 37712, 54145, 45931, 22797, 5852, -22330, -41670, -56471, -57666, -33851, 13850, 43060, 38613, 41269, 42427, 49579, 35991, 22439, 17503, 15224, 6496, -5049, -3808, 15456, 35982, 24784, 9426, 4769, -4298, -20068, -22525, -21438, -28551, -59780, -77447, -73408, -73446, -72778, -67536, -53192, -40241, -11724, 7907, 10277, 9899, 3214, -37058, -39646, -14601, -14481, 1763, 13118, 16090, -7344, -10019, -4838, 20544, 20043, -1, -21593, -48417, -28838, 989, 28483, 31663, 16256, 6561, 9549, -29594, -38914, -55441, -39782, -24272, -19496, 26533, 47460, 42548, 25638, 29784, 39346, 48955, 43988, 40004]
20024D0004j3640k0207j6807k2093J1277k676j6336k391K4609M8375j6322M69
20012A4262k5115j5191J3273K2122j7954J4143O847n177J479O074K8423J4208
20000E7394j7426k4914k0200r06o556Q733P938j3987o163r503N781M170o438k1254
19986d3331j4346K0603P590l8650N266K2164l190K799j2808r461J6831K4632N098
19973a6803j0776N799P244l8306l4969j4784J2269J2054J3293K5917k926l94R984
19960c2398k4245j2311j5580r59M3685K7244Q960M850O232J8026n254L717M59
19947B2426j5004j0262j0832l4458j5616J4218N928j931L180K6137O092L870Q530
19934B278j2120n166k1782J4399L1950n164j429N565O067j4495j2737n494K304
$$ y = [40004, 26364, 6157, -10650, -32743, -21466, -24142, -40478, -42869, -18260, 30115, 13793, 14262, -10853, -26044, -12771, 9351, -8603, 5540, 12387, 7210, 8689, 14763, 43186, 57394, 39968, 15054, -5146, -6052, -12608, -3875, 4063, -9924, -16087, -25590, -19809, -15639, -22077, -43331, -57677, -37074, -29484, -68134, -62868, -40704, -43894, -41095, -53903, -63364, -46533, -21901, -16803, -27579, -21780, -14536, -52842, -87811, -102595, -90326, -78272, -64979, -39062, -41988, -42382, -32398, -56643, -68954, -84534, -85493, -41808, -14564, -5604, -754, 5478, 23504, 18250, 21967, 22426, 7422, -2840, -13672, -48130, -63746, -49528, -43600, -45531, -42351, -16214, -10122, -6252, 2278, -9842, -15008, -36790, -22391, 9559, 4395, 2966, 8531, 14598, 103, -12634, -18128, -15824]
19921a5824j1655k3296M015j2705P877L4924k5794j8916K2493M34P061P947M8253
19908B4814j5230l0308J4470J3760Q797m5081l1132k0461K1655J3593j2421l68
19896e7912J001K9867N155J1657J0109K3151K332k2081l4399j9459r097J1814
19884d7862J7895L4859J0615N43k3281Q187K4667n224j0604P362J3338k7385k1195
19871a8085m232J6158J1513L8683j1035k5991j3379j4486j0792R147J3271l4891
19859d4119j3632N2586O956k980m651j7995l122J2063J2065J0801P73M48j6415
19846g222J1364k4951m911J0750J2074j8654j187k3602j2333L9084K8012k3046
19834a4622l5596j4778O259J1397J7873j2322j0123m3035J3195K803M271J9384
$$ y = [-15824, -27479, -50775, -46760, -59465, -51588, -16664, -42458, -61374, -38881, -38447, -31386, -23439, 24814, 9584, -20724, -6254, 7506, 16303, -28778, -59910, -80371, -58716, -45123, -57544, -57912, -56911, -27044, -21889, -10232, -123, 23028, 25360, 3279, -31120, -50579, -59676, -47862, -29967, 4892, 15507, 16050, -7231, 956, 25623, 20399, 9795, 17157, 30495, 3110, -18085, -22317, -6159, 5354, 44037, 33002, 7011, -6368, -20854, -31646, -22499, -9228, -44119, -57751, -5165, 1791, -1189, -5840, -23835, -26957, -14894, -2829, 7972, 8745, 9193, -7222, 4142, -20809, -25720, -14970, -2896, -21550, -22737, -46339, -58672, -19588, 8424, -14622, -50218, -64996, -58737, -47340, -29467, -41789, -51912, -94947, -81752, -78949, -74678, -55294]
19822e5294J7066k212P274J2560J676j4641P38J5229K4179o321l2452j7960J3965
19809c6193J7618Q692J969j0028J5106k645J152j771J4290j8233j9470k4798R696
19796d4615L3552J6119L0063P094J1680j9063l6346l2032k285L907J6159p506
19784b3273l385J2643J8882j1593N857O323L887m507j1069n3668k1613n28J0925
19771g1119L2803l0462j7753K7305N848Q692L1055n98M172l3454j0276N029K4520
19758b4238K636j5808L003J3501J941R121R853n835r593l6727R712P39M048j1258
19744d8905j6990J8186L1021J2134O898m176l407n669p668j6904J209K1717J7965
19731E411n022R692k5769j5647O221K87P214j1105K43j7387K2994L3345N111Q86
$$ y = [-55294, -38228, -40440, -33166, -20606, -18930, -33571, -32833, -17604, 6575, 254, -32198, -50158, -36193, -18575, -9883, -7914, -17942, -2836, -5481, -4329, -6100, 8190, -10043, -29513, -54311, -44615, -11063, 5056, 35119, 42213, 53893, 34830, -1516, -33548, -35833, -31926, -15767, -23273, -26658, -14015, 4867, -6726, -869, 5454, 9341, 4834, -6235, -59903, -81516, -82044, -71119, -38316, -68778, -86531, -59226, -53378, -44686, -13631, -14229, -10057, -43511, -53787, -48758, -24238, -21602, -37410, -34407, -20906, -18965, -9844, 9, -5826, -15419, -52146, -42434, -41695, -37647, -48905, -65895, -47709, -16688, -4554, 2344, -1832, -5239, -10908, -18576, -35480, -34271, -12554, 5411, 389, 10081, -15688, -31335, -25114, -24827, -17613, -28718, -28475, -45862, -22868, 10477, 15588, 16474]
19717A6474k3026j8361J7137k52k7716R59k8072l7088K4032O0961l458Q72J2305
19704e233m699r604j0293J7787Q444k4340k1962J0790M5994K6639l2542k9495
19692b8514j6589K4027L9085p405l3422j1049k1356j0044L6464J7608K6776j3040
19680B541l0723k6349K5306K0350n057l4194J3347j1295n277K0564J8862j2176
19668b4101j2668M638k1248q250J4356p860J9396M0651J9954m1130n837j1692
19656c3791M051j05r152k7945J5632K6315J8903p569R094Q937j2287Q92L3256
19643B6231j8705m281K7493k0743l898q769m169j3996J968p437J5042K8585k082
19630A5239j8026j6290r605L126L302P059k5534r876J0064Q546r663J1432j5709
$$ y = [16474, -6552, -24913, -7776, -8028, -35744, -34785, -62857, -99945, -75913, -14952, -18410, -17538, -5233, -9932, -19536, -29829, -12042, -3598, -27938, -49900, -39110, 6884, 33523, 981, -28514, -45103, -21076, 18009, 10604, -22818, -33867, -55223, -65267, -28803, -11195, 15581, 2541, -28182, -54531, -29225, -8875, -13932, -48126, -34779, -46074, -51351, -30787, -11925, -24101, -36769, -32131, -53379, -61629, -47273, -55133, -35737, 4914, 24868, -16262, -22099, -33791, -29740, -29845, -38997, -66942, -51310, -24995, -6092, -13661, -4567, 4370, -7917, -7025, 26231, 7526, 3245, 30738, 9995, 6097, -2672, -6841, -20837, -18869, -26306, -11264, 17321, 15239, -2787, -19077, -28682, -25556, -22254, -15195, -40729, -50605, -40541, -31995, -41658, -30226, -45935]
19617d5935M94q73L1796K6350q482N41M347k5588j7124K427K2382L297r293J1217
19603d444K640k3574J1100L5278J8468l0173k7181P537K2265k037j2778K388J2286
19590A1775n041j3817j1522j4141J5726K1442j0342p326J4361J9665L738j158
19578B3360j2939j9223J1190Q557k067K1658m753k4304m427O34q633q152L2886
19565A3787J5410r855r705N030J7864M62j8634j9411J1697L6702j2114j1530j0634
19552I069J473j7217J1503k086l2750K1432L2987k314j3292R851M234L578O648
19539C3116j7567N191j973M346p057K0505j5600R409j0799j2965r206k449P455
19526B406J0390K0440l7111J2595j1737n47J1030K8312Q204l971J6061J6069Q478
$$ y = [-45935, -45441, -46314, -14518, 11832, 3350, 3891, 8238, -17350, -34474, -32047, -9665, -6368, -15661, -4444, -1804, -25378, -14278, 21000, 39468, 9295, -17886, -10349, 11916, 9879, -2899, -511, 11775, 6734, -7083, -18605, -32746, -17020, 4422, -5920, -13246, 1115, 20780, 24518, 23360, 10421, -8802, 2388, 10945, 8878, 30536, 25783, 1479, -2948, -2314, -10947, -19099, 13787, 29197, 19342, 9637, 14667, 32531, 32993, 14359, -5052, 6645, 43347, 31233, 19703, 9069, 10542, -6675, 4828, 2742, -30008, -8576, 24411, 22097, 8805, 18656, 22890, 26468, 33116, 15549, 20740, 18767, 23113, 16056, 36561, 20961, 30370, 19571, 6606, -2600, -5049, 2406, 12796, 33236, -3875, 8720, -3017, -3564, 7466, 35778, 43982, 40011, 56072, 72141, 80619]
19513H0619j0935O236L2168l774j2333K0406J9424m81n846m200j6774j520k344
19500A00646J3669J5764k718J989L995K3014J9449M061K7771J0909q27J3301J8792
19487B49815K4918K4029L6534K7667L0072L7564L5765L3030N7066N7368P3977
19476F87805Q6025J28841J67007K13027L39205N42238Q64050J272048J351019
19467E651265N42227m10164o38226n07557j20066M58942R76197Q44544j59344
19458F637818q38024r20583q18395n35446k27836R0318N32551R92170J262713
19449F175286P77762l19636p24931o24417l27500K13930P86359R06031M562q90003
19439E977443j086215j024539r01435o51113l99437k56961k07278j30108r1036
$$ y = [80619, 69684, 75920, 108088, 104314, 91981, 112387, 131811, 131330, 125484, 121284, 104510, 102990, 100646, 114315, 130079, 127361, 129350, 133345, 156359, 175808, 179869, 207640, 218549, 217722, 231023, 249815, 274733, 298762, 335296, 362963, 393035, 430599, 466364, 499394, 556460, 613828, 687805, 773830, 902671, 1069678, 1282705, 1621910, 2164148, 3028198, 4300246, 5651265, 6193492, 5783328, 5145102, 4637545, 4517479, 4976421, 5952618, 6797162, 6637818, 5799794, 4879211, 4060816, 3525370, 3297534, 3387852, 3920403, 4912573, 6175286, 6953048, 6633412, 5908481, 5284064, 4956564, 5170494, 5956853, 6862884, 6867446, 5977443, 4891228, 3866689, 2965254, 2314141, 1914704, 1657743, 1450465, 1320357, 1229321]
19430A229321j01785j30742q3701m8596l2144k2697m5367m6897k7252l8681j9349
19419F32110k9135l3700k9398k5187k9768j2766l1147l8572j9377p889O40J3686
19407C89497j0405p595l7327j7321J690R226k1848n692n520l3656k0739k2191
19395B18119O108k526m1342k8036J7911N677r779k1394j7337l846l11J7474M091
19382A44809O607J2588o570k5055r951r63J7690J1428k4350l5124p024j2438m030
19369F7617J5770M3252J6795j7111o152j6271J5243M545q214r760r669O207n005
19356I7247J5174r432p622j6147k3598J5180J9019J5250J1973K40r079k4931k3641
19343E9633K761j5250j337N086L1643K5634r70l5237l2729k856K2635m55q627
$$ y = [1229321, 1127536, 996794, 913093, 864497, 832353, 809656, 764289, 717392, 690140, 651459, 632110, 602975, 569275, 539877, 514690, 484922, 472156, 441009, 402437, 383060, 375171, 375811, 389497, 379092, 371497, 334170, 316849, 318539, 327765, 305917, 300225, 294705, 261049, 240310, 218119, 224227, 221701, 180359, 152323, 170234, 175911, 166132, 144738, 127401, 123555, 123244, 140718, 144809, 151416, 164004, 157434, 132379, 122428, 121465, 139155, 150583, 126233, 91109, 84085, 71647, 67617, 83387, 126639, 143434, 126323, 120171, 103900, 119143, 123688, 115474, 105714, 96045, 102252, 97247, 112421, 102989, 95367, 79220, 55622, 70802, 89821, 105071, 117044, 117284, 108205, 83274, 59633, 62394, 47144, 45807, 50893, 82536, 108170, 107200, 71963, 39234, 36378, 59013, 58558, 49931]
19330D9931R783j3517k3083j8374K1083Q681j7455K5347J7135N083j5805j863
19318D6946j9410j898K6264R351J7662r181p505j5184O622j8048l1074j9068M400
19305a0123J7598L7484O722j3761J6628R998j8697L904M187K0743p325k992J3256
19292G7622Jl3732j1577r000L9223j0471j4003o108p402j0473k7643j5120L0043
19279A360M4673K1559N925K2083o211J1116L6222M0019P1864M954j2428j3845
19267B27291l5087k8025j3809K4652K5857K2047K7031k7165m0940n5634m1838
19256H4380q139r554l9749M817J8665q776j5928j5027J6730Q930N062N923J0024
19243E7358j4507k0025j6752k770R734k285K5736J423k0548j4143l988k5633j3872
$$ y = [49931, 59714, 46197, 23114, 4740, 25823, 34504, 17049, 42396, 59531, 64614, 48809, 46946, 27536, 25638, 51902, 61253, 78915, 69734, 62229, 47045, 53667, 35619, 4545, -14523, -10123, 7475, 44959, 51681, 37920, 54548, 64546, 45849, 49753, 53940, 74683, 67358, 64366, 77622, 77623, 43891, 32314, 23314, 62537, 52066, 38063, 31955, 24553, 14080, -13563, -28683, 1360, 46033, 67592, 73517, 95600, 89389, 100505, 136727, 176746, 248610, 253564, 241136, 227291, 192204, 164179, 150370, 175022, 200879, 222926, 249957, 222792, 181852, 126218, 84380, 76241, 66687, 26938, 31755, 50420, 41644, 25716, 10689, 27419, 36349, 41411, 47334, 57358, 42851, 22826, 6074, 3304, 13038, 10753, 36489, 37912, 17364, 3221, -767, -26400, -40272]
19230d0272k281J7097K3250j3760j2670K1527k012l365L328j1832p278n461n672
19217c9401q62m022Q527J9918p228L687L9085J8119j2937J063l1516k1696o012
19204c3275P082L4924m608j8783J2386K5336j0072r596J7469J6441q827N718m439
19191B9756k1142p890j9060J6543j534j1716K619K1268j2313l4591j1786R552
19179d0294J4533K2044K2599j4189j4913K8765j7319r091L1386R369l2910k1284
19167b1304l978P984j9365j0548j7624J641J3182J8206j038L1957M8023Q277k5979
19154B9434l4449k2439K0049L3258k245r248J0765j0665l6615j5302J0779J9705
19142f973J5136l5618k0070N395M1672j4641k820p893J35j1338J4446J2774j9450
$$ y = [-40272, -42553, -25456, -2206, -15966, -28636, -7109, -9121, -12486, -9158, -20990, -28268, -33729, -39401, -40263, -44285, -35758, -15840, -23068, -19381, 19704, 37823, 24886, 25949, -5567, -27263, -33275, -26193, 8731, 4123, -14660, -2274, 23062, 12990, 3394, 20863, 37304, 28477, 34195, 29756, 8614, 724, -18336, -1793, -3327, -15043, -12424, 8844, -3469, -38060, -49846, -40294, -25761, -3717, 18882, 4693, -10220, 18545, 1226, -7865, 23521, 32890, -20, -21304, -25282, -17298, -36663, -47211, -64835, -63194, -50012, -31806, -32844, -887, 47136, 55413, 29434, -5015, -27454, -7405, 25853, 23608, 14360, 25125, 14460, -22155, -37457, -26678, -6973, 8163, -27455, -47525, -42130, -458, -15099, -17919, -25812, -25677, -37015, -22569, -9795, -29245]
19129b9245k3496j9172N515J3705P306K6470j3942Q104J8681j1717k0963J6798
19117b1956K495K5757P717J0420j7880m811j340k4259j6135K6858J7110m780Q677
19104G873O868n011o495nj7868J9334O88j2997J6312N99j6977q729N69J6160J3105
19089A3426p345q722k3183K1241J5985p998J6694P684L190M673j7454k5946j7747
19076b5502J3714K8944l87K2860M108j9215K8474k646K302j111l43P982m9014
19063A0166j2091N254q153K068J9p207j7019j0668l4469K5541L8298N153J6076
19050A2968Q654j6694q553j2478m350R709M3617L3697j5206l1230o262J1397m686
19037B0583q386p780j7563M435q061j5181l767K4484J6576j2540k1334J0581L1515
$$ y = [-29245, -52741, -71913, -66398, -52693, -45387, -18917, -32859, -24755, -6074, -17791, -38754, -21956, -19461, 6296, 14013, 24433, 6553, 1742, 402, -23857, -39992, -13134, 3976, -804, 7873, 14741, 9730, 3235, 3230, -14638, 4696, 5384, -7613, 8699, 9298, -7679, -16408, -15839, 321, 13426, 6081, -2641, -25824, -4583, 11402, 3404, 20098, 27782, 30972, 35645, 18191, -7755, -25502, -11788, 17156, 16769, 39629, 43737, 24522, 52996, 50350, 52652, 51541, 51198, 59180, 10166, -1925, 3329, -4824, -2756, -2737, -9944, -26963, -37631, -72100, -46559, -8261, -3108, 12968, 21622, 4928, -3625, -16103, -20453, -10744, 32873, 66570, 51364, 20134, 13872, 25269, 20583, 12197, 4417, -13146, -8711, -16772, -31953, -35720, -11236, 5340, -7200, -28534, -17953, 13562]
19024A3562J6196O404k3147j1254R470j2552p67r109J5432j2938j8077M712J5229
19011f839J9115L3013j8966k7110J9450K5570k9513l7478j9270j200M445J3789
18999b4994L272J0110k2888M452l043J4633K1125j3997j3095j2126K7520K1806
18987A2775k5675k78L5205N893K1619o194p110j8734J1335P730q879k3268j8772
18974a4353k4839o230N680M0914J5817j1520K0767J0773j214k1964O921j3028
18962G724K059M346j2924K5249K2827R884k0286q540K329j9619k2599j8137N081
18949b2606O916k4586l83L644j908K2306L2713M129j0192j1383m489k330k698
18936a0867k6634r552K6735J7741J2904o503P904K9280P929l460o894O300R429
$$ y = [13562, 29758, 36162, 13015, 1761, 11231, -1321, -2088, -11197, 4235, -8703, -26780, -22068, -6839, 12276, 45289, 26323, -787, 18663, 44233, 14720, -22758, -42028, -43228, -38783, -24994, -21722, -11612, -34500, -30048, -33091, -18458, 2667, -11330, -24425, -36551, -9031, 12775, -12900, -13178, 22027, 27920, 49539, 43345, 36235, 17501, 28836, 36566, 27687, 4419, -14353, -39192, -45422, -39742, 1172, 16989, 5469, 26236, 37009, 35795, 13831, 20752, 7724, 9783, 14129, 1205, 26454, 49281, 59165, 38879, 30339, 32668, 13049, -9550, -27687, -22606, -15690, -40276, -40659, -37015, -38923, -16617, 16096, 20225, 10033, -1350, -5839, -8169, -10867, -37501, -47053, -20318, -2577, 10327, 3824, 11728, 41008, 48937, 45477, 38583, 44883, 54312]
18923E4312k2757j0137L464j8454R155m448m108M085Q493l604K1881K0996J4023
18910G2901p670j1738m327j8582L736K8083l125J3409N054J5816j4471K750l680
18897G8156k8268l2600k0117K8765J5768M641l2098r894K1248N960J326Q079m723
18884C6243j4664M7K298K1302o878P146J6454K3088K2151O609k9054k1902J3577
18871G6417m219k237m92J1435J3532j2098j7247m91O231j9080L323J0625r467
18858E6232L0513L5831k686L184j8316j7570M426o231Q318O737L288j0604k674
18845I0448j9403p275J5678j6137J549J6057M755k4971J1908K2205q709k0157
18833F5948L470O10j0928P442L639j2559M066j0634O785K8723J0215o604j5425
$$ y = [54312, 31555, 21418, 24882, 6428, 15583, 11135, 7027, 11112, 19605, 16001, 37882, 58878, 72901, 65231, 53493, 49166, 30584, 34320, 62403, 59278, 72687, 77741, 93557, 79086, 81836, 78156, 49888, 17288, -2829, 25936, 41704, 46345, 14247, 4353, 25601, 31561, 32887, 40966, 36243, 21579, 21626, 23924, 45226, 38348, 45494, 61948, 85036, 107187, 113796, 84742, 62840, 76417, 72198, 69961, 69469, 80904, 94436, 82338, 65091, 64600, 70831, 51751, 55074, 65699, 56232, 86745, 122576, 119890, 123074, 104758, 87188, 91614, 85383, 93701, 100438, 103726, 93122, 90448, 71045, 63770, 79448, 63311, 64860, 80917, 85672, 60701, 72609, 94814, 86105, 65948, 69418, 70028, 59100, 66542, 70181, 57622, 61688, 51054, 57839, 86562, 96777, 90173, 74748]
18820G4748N724J5909m093j2925O535Q265n410K0874J3851R007O2266N1077K2641
18807B68469L8136Q839J9581K7696l0383l5940P097J026m2252l5542p0K4877J1937
18794B63471J3620k3652J5106M6712Q1419Q8562J25279J76523L16021L83662L08540
18783A795263J68851M8756j53640l17445l05551k36597k15496j61080q9929n5394
18773D77738k1199k2542j0760M3989J07857N4402m5754m5195k8032l7385m2120
18762D30999k4453j523n037j0063M5978N1743M2978K2337K8142Q6677J36255J97274
18750A001307K90377M13315N04297M46418L90361K41688o1224l36603m33678l58131
18740B098127j74524p827j0968j62666k53040k71906k34954j91020j69208j00264
$$ y = [74748, 80472, 96381, 92288, 79363, 85898, 94163, 88753, 109627, 123478, 132485, 194751, 245828, 268469, 306605, 315444, 335025, 362721, 332338, 296398, 303495, 304521, 262269, 226727, 226657, 251534, 263471, 277091, 253439, 268545, 315257, 396676, 485238, 610517, 787040, 1103061, 1486723, 1795263, 1964114, 2012870, 1859230, 1541785, 1236234, 999637, 784141, 623061, 533132, 477738, 456539, 433997, 423237, 467226, 575083, 629485, 583731, 538536, 510504, 473119, 430999, 406546, 405023, 399986, 389923, 435901, 487644, 530622, 552959, 581101, 667778, 804033, 1001307, 1291684, 1704999, 2209296, 2655714, 3046075, 3287763, 3226539, 2889936, 2456258, 2098127, 1923603, 1915776, 1904808, 1742142, 1489102, 1217196, 982242, 791222, 622014, 521750]
18730E21750l6816p792l2825j3852J1401n206j5801l9331q222J9860K5789K802
18718D21757m799m167L9180M8541N2493L7872J10628J59593K10201L18269L53615
18707A743183J85264k6417l9957j6433O9738J12714L62k12435l15674k95253k53016
18696I52076j91550j44055r1394o6771n0946n3700q474j1834k5680k1701o663
18685B79308O964l297q685o870j8945j9006J2323j4872k5599J8900j5821j5690
18673A88710K0362N719M214M031R019n222J9661k1966K581J9326k1340m5315j4625
18660A65155j8532l5517n015o853n950m078R787J1710R409J9742N473l866N193
18647A46658k2563k9921R776J6739k9902n53Q862J7865Q616j881k7442j0197J7605
$$ y = [521750, 484934, 477142, 444317, 430465, 441866, 436660, 420859, 381528, 373306, 393166, 418955, 421757, 416958, 412791, 451971, 500512, 553005, 590877, 701505, 861098, 1071299, 1389568, 1743183, 1928447, 1902030, 1862073, 1845640, 1915378, 2028092, 2028454, 1816019, 1500345, 1205092, 952076, 760526, 616471, 525077, 458306, 407360, 353660, 345186, 333352, 307672, 285971, 279308, 286272, 282975, 274290, 267420, 248475, 229469, 241792, 226920, 201321, 220221, 204400, 188710, 209072, 214791, 219005, 223036, 232055, 226833, 246494, 224528, 227109, 246435, 225095, 179780, 165155, 146623, 111106, 106091, 99238, 93288, 89210, 98997, 110707, 120116, 139858, 145331, 141465, 146658, 124095, 94174, 103950, 120689, 90787, 90234, 99096, 116961, 125577, 123696, 96254, 86057, 103662]
18634A03662L077j857O621o454Q380m994J9581J5888p922k5790N66K1116J8874
18621A50748l4260k318k910n892J0923J3094K2097J8677J2528k7848L686J972
18609A60497n024K158o866r33K1682J5082K3410K1914k4550j1462k3584j2982
18597A59342Q774K4266j4148j6460j4909p47n441K1278q481R46K7488P637k870
18584A86675j0870j1095j6095J0802l373K5398J9374J1613oJ9171L3514J2179
18572B77287j6196P503j30j0852M6850L7082K3205L8464m556N587j1568k335K9588
18559D19929L4094K7549K5611N6593N0722M2423N2951J08438J24758J17090J98424
18548A258582L15637M91648Q03715R52909O94979M25965L0427l51565k85800N33
$$ y = [103662, 106739, 104882, 111503, 105049, 113429, 108435, 128016, 143904, 135982, 110192, 110758, 131874, 150748, 116488, 114170, 111260, 105368, 116291, 129385, 151482, 170159, 182687, 154839, 158525, 160497, 155473, 157631, 150765, 149832, 171514, 186596, 210006, 231920, 207370, 195908, 172324, 159342, 168116, 192382, 178234, 161774, 146865, 146118, 140677, 161955, 153474, 154420, 181908, 189545, 186675, 175805, 164710, 148615, 159417, 156044, 181442, 200816, 212429, 212423, 231594, 265108, 277287, 261091, 268594, 268464, 257612, 304462, 341544, 364749, 403213, 398657, 404244, 392676, 390341, 419929, 454023, 481572, 507183, 563776, 614498, 656921, 709872, 818310, 943068, 1060158, 1258582, 1574219, 2065867, 2869582, 3822491, 4517470, 4943435, 4973862, 4622297, 4336497, 4337030]
18538D337030K97080M14660J95198j8887m48620p82317p58745o24998m74392k99930
18528A836079k23019j46102n1909m5299l2417j6809L9332L0240N7288J14209J57955
18517A719548K33002L56506N80460Q73628J177042J038638N76384K17634l79843
18508F392999n55242k09629K07562M87353L04062M3173l68731r30657j047523
18499D323367q57614o83807n00653l18455k19138j25330p0467m3085m6373n5548
18489A402897o4646n4970o862j3974k8221l1778p2965p0260j0924J3841J6637
18478A078775o301K4603l2968j1953P130m7491o1723m2202l4082m7432m5210l7748
18466G43398l3677k8947j7037l991J1112j3590K600L8929J00309P2992N9724L8930
$$ y = [4337030, 4634110, 5048770, 5243968, 5225081, 4776461, 3994144, 3235399, 2610401, 2136009, 1836079, 1613060, 1466958, 1415049, 1369750, 1337333, 1320524, 1359856, 1390096, 1447384, 1561593, 1719548, 1952550, 2309056, 2889516, 3763144, 4940186, 5978824, 6555208, 6772842, 6392999, 5837757, 5628128, 5835690, 6323043, 6627105, 6670278, 6301547, 5370890, 4323367, 3465753, 2781946, 2281293, 1962838, 1743700, 1618370, 1547903, 1504818, 1458445, 1402897, 1338251, 1283281, 1276419, 1262445, 1234224, 1202446, 1129481, 1059221, 1048297, 1062138, 1078775, 1072474, 1097077, 1064109, 1052156, 1059286, 1011795, 950072, 907870, 873788, 826356, 781146, 743398, 709721, 680774, 663737, 659746, 670858, 657268, 659868, 698797, 799106, 872098, 931822, 970752]
18454I70752Q901K0817p9314j03752j16418r7925n0771l4112k8154k8114l3189
18443D28721j0346Q749L8091Q947M4541Q8465N6805J5209K5516J5531k9391j9605
18431F71233q991L004Q343M1375P892K4803K019o7337n9507o8513m0820k2489
18419D91012j8805j7469k776J8809l398k7591j1546J3980L392J3259j3160k4346
18407D21361j4876J7711L0371L3049L0412L5731M6912K8775N0247N8078J00236
18396H38007J24170J10497N5630K449K6360m9601n6793m8898o9781m9735o5396
18385H16909o8085o2087l7136m2602j7583n169J9366L1650P9456M2735J7622P061
18373G82137M6060K0666J0547j2182J7070L1684k5862l2687K1269N2209L3474
$$ y = [970752, 979653, 1000470, 921156, 817404, 700986, 603061, 552290, 518178, 490024, 461910, 428721, 418375, 427124, 465215, 474162, 518703, 607168, 663973, 679182, 704698, 720229, 690838, 671233, 662242, 665246, 673589, 714964, 722856, 747659, 749678, 682341, 622834, 554321, 513501, 491012, 472207, 454738, 451962, 470771, 467373, 439782, 428236, 442216, 445608, 458867, 445707, 421361, 406485, 424196, 454567, 487616, 518028, 553759, 600671, 629446, 679693, 737771, 838007, 962177, 1072674, 1128304, 1130753, 1157113, 1107512, 1050719, 1001821, 932040, 882305, 816909, 748824, 686737, 649601, 606999, 589416, 584247, 603613, 635263, 714719, 757454, 775076, 782137, 828197, 848863, 859410, 847228, 864298, 895982, 870120, 837433, 858702, 910911, 944385]
18362I44385Q0717J15811J11016O9848N0597K6867m2854r5279j28647r0495o1455
18351I80511l4645m5204n9865k7812j2694N177p2J7600L9832K3358R830j875K8620
18338I22761N5807N140j5873p798J251n832M0748M9201L9608N1871J20675Q2291
18326A339850J12199J29387M6842J7421Q728j7818k3644q80J3859K3270L7520
18315A686734J7550M7603N4766j5392m0536J2383J6085M5720P4488R1055J01480
18304B091936R6634P6804R4692J19388J39723J95984J81383K79061L92175N48131
18294D215911P50352Q51058M90146K9512l4005J06015L01530K04919l05204n19140
18284F091094m95979m09902k30063q194J65804L69810O16009Q50024R34664R42725
$$ y = [944385, 1025102, 1140913, 1251929, 1321777, 1372374, 1399241, 1356387, 1261108, 1132461, 1041966, 980511, 945866, 900662, 840797, 812985, 800291, 805468, 805396, 822996, 862828, 886186, 896016, 894141, 922761, 978568, 983708, 967835, 960037, 961288, 955456, 996204, 1045405, 1085013, 1136884, 1257559, 1339850, 1452049, 1581436, 1628278, 1645699, 1654427, 1636609, 1612965, 1612085, 1625944, 1649214, 1686734, 1704284, 1751887, 1806653, 1791261, 1750725, 1763108, 1779193, 1824913, 1899401, 1990456, 2091936, 2188570, 2265374, 2360066, 2479454, 2619177, 2815161, 2996544, 3275605, 3667780, 4215911, 4966263, 5817321, 6307467, 6336979, 6302974, 6408989, 6710519, 6915438, 6610234, 6091094, 5595115, 5185213, 4955150, 4946956, 5112760, 5482570, 6098579, 6948603, 7883267, 8825992]
18274H825992N36977j26126k52122r6K52980L00170p0080l05325l21617k02846
18264H637907L6255L42549P07269J011437R27262N19653M42528O40246R94227
18255A4259333J267500J224352J189156J113469J106980J092803J144635J497228
18247B3895456K178618L206684M663335O814524J0067031J5255478K3887242L7164896
18239A27133264N1547415N0516573K6362297K715235k9173856m4904328m1828760
18232A42367840l4423874k5948627j7477631j1482151p594246m968095l186036
18225C7287180j905736j034461m80928j94165J8819K30032M74754J009304J788822
18216C7193621K376067K657260K852592K785913K928781L802795N160388P167188
$$ y = [8825992, 9362969, 9236843, 8984721, 8984625, 9237605, 9537775, 9467695, 9162370, 8840753, 8637907, 8674162, 9016711, 9723980, 10735417, 11662679, 12182332, 12624860, 13265106, 14259333, 15526833, 16751185, 17940341, 19053810, 20160790, 21253593, 22398228, 23895456, 26074074, 29280758, 33944093, 40758617, 50825648, 66081126, 89968368, 127133264, 178680679, 229197252, 255559549, 258274784, 229100928, 184196600, 142367840, 107943966, 81995339, 64517708, 53035557, 45441311, 40473216, 37287180, 35381444, 34346983, 33866055, 33671890, 33690709, 33920741, 34395495, 35404799, 37193621, 39569688, 42226948, 45079540, 47865453, 50794234, 54597029, 59757417, 66924605]
18208F6924605J0344392J5325713K3382817L7313436O0534120R1321263J12411381
18201D17557727Q5319656L6886819k0018488p9203096r3376525q1631604o6519163
18194A99015326m8231608l2572774k2015030j5047453j0323429p212727n151202
18187E8461103l789525k965379k653247k559589k620499k628530k356371j918059
18179C6969904j475844j078907p75888o95693p57235q56808r52014r22893p67689
18170B8686933n11578k28848J19470M53804N20648P22425J076226J045303P03964
18161C2588347L15453j36967j27004J50754K99935O89711J223967J593067J781803
18152C8379066K103997K791947L863739N240940O829131R019683J3010414K0199557
$$ y = [66924605, 77268997, 92594710, 115977527, 153290963, 213825083, 305146346, 417557727, 502877383, 539764202, 519745714, 440542618, 347166093, 265534489, 199015326, 150783718, 118210944, 96195914, 81148461, 70825032, 63612305, 58461103, 54671578, 51706199, 49052952, 46493363, 43872864, 41244334, 38887963, 36969904, 35494060, 34415153, 33639265, 32943572, 32186337, 31329529, 30377515, 29454622, 28686933, 28175355, 27946507, 28065977, 28519781, 29040429, 29762854, 30839080, 31884383, 32588347, 32903800, 32766833, 32639829, 32790583, 33090518, 33780229, 35004196, 36597263, 38379066, 40483063, 43275010, 47138749, 52379689, 59208820, 68228503, 81238917, 101438474]
18144A01438474L3004971N2790895P4403653P5793279K6310873j6848895j5762306
18137C31130944M629523K7181083K3264565k8302060n8382070n8963160n3372251
18130A87186574m2703205k9386058j9514359j3229653r212055o672436n000732
18123F1468076l777511k758196k083874j535279q36744r8732M18337O67560J298000
18114E2761637K486099M410750P727593J2201591J6335208J5258748P519532Q741141
18106A27442299J8727710K7934396K0922455m317730j2511143m866476P098775
18099A80430286J5912872J311727k3786301l0106694k8042578k4603585j8208784
18092G2906943j2319237q406695n922145m385463l494026k876746k387432k042676
$$ y = [101438474, 134443445, 187234340, 261637993, 337431272, 363742145, 346893250, 331130944, 335760467, 362941550, 386206115, 357904055, 299521985, 240558825, 187186574, 144483369, 115097311, 95582952, 82353299, 73141244, 66468808, 61468076, 57690565, 54932369, 52848495, 51313216, 50476472, 50377740, 50796077, 51463637, 52761637, 55247736, 59658486, 67386079, 79587670, 95922878, 111181626, 118701158, 127442299, 146170009, 174104405, 195026860, 190709130, 178197987, 173331511, 180430286, 196343158, 197654885, 173868584, 143761890, 115719312, 91115727, 72906943, 60587706, 52181011, 46258866, 41873403, 38379377, 35502631, 33115199, 31072523]
18084C1072523j727671j493944j281264j075009r11161p87329p51158p39234p29828
18075B1575925o16229n77820o29660o17639p38847p77182p59457p07279o42014
18066A5509798n35330m97214m34314l90602l47406l52535l85423m07586l71429
18057A1787959l29595l03805l48350l06194k18467j77218k27518k76259k86900
18048I313653k73479l01608l63389l30872k96630k32388j36821q0051q3274j18353
18038G096788j32043j49828j47915j36141j44411j23309p3696r3174j22300r8137
18028E875834o8392r6398j36260p6664p8514j26774j40523j43587j40186j17329
18018D751207n6755o7209l0743j7114m6761p7174r3311r6524m6870k8443o8574
$$ y = [31072523, 29344852, 27850908, 26569644, 25494635, 24583474, 23796145, 23044987, 22305753, 21575925, 20959696, 20381876, 19752216, 19134577, 18395730, 17618548, 16859091, 16151812, 15509798, 14974468, 14477254, 14042940, 13652338, 13304932, 12952397, 12566974, 12159388, 11787959, 11458364, 11154559, 10806209, 10500015, 10281548, 10104330, 9876812, 9600553, 9313653, 9040174, 8738566, 8375177, 8044305, 7747675, 7515287, 7378466, 7298415, 7215141, 7096788, 6964745, 6814917, 6667002, 6530861, 6386450, 6263141, 6189445, 6096271, 5973971, 5875834, 5807442, 5711044, 5574784, 5498120, 5419606, 5292832, 5152309, 5008722, 4868536, 4751207, 4694452, 4627243, 4596500, 4579386, 4532625, 4455451, 4362140, 4265616, 4218746, 4190303, 4121729]
18007D121729q4166o0990m8575l0260o1257q1489r2521q7737j01119n0597p6092
17996C346926o3180p1201o9008n7524l0674l7712l2145m0038m5006q6644j28141
17985B685653j21444r8585n1056o0456m2608k4796K443N150J9149L7066j7335
17974B333181m5968k7926q20m5940m1851k0259j8440j0948l2630n6211n3767j0034
17962A968387l2511m0551o2879j4961l2850l9832J074J328l5115j1132m0832k0720
17950A639406l1272o7751p6832p7961n1758m1602o6676n3831j3453j7954q478
17939A131838J4987K5752L4675N7145Q2652R7150R1987N6266J3253K1248N909
17928A632862r3420j31133j08813j15796q2532n4276m4808k2074j4140n145m884
$$ y = [4121729, 4037563, 3976573, 3927998, 3897738, 3836481, 3754992, 3662471, 3574734, 3473615, 3423018, 3346926, 3283746, 3212545, 3143537, 3086013, 3055339, 3017627, 2985482, 2945444, 2900438, 2813794, 2685653, 2564209, 2465624, 2414568, 2354112, 2311504, 2286708, 2289151, 2294301, 2313450, 2350516, 2333181, 2287213, 2259287, 2258467, 2212527, 2170676, 2150417, 2131977, 2121029, 2088399, 2032188, 1978421, 1968387, 1935876, 1895325, 1832446, 1817485, 1784635, 1744803, 1745877, 1747205, 1712090, 1700958, 1660126, 1639406, 1608134, 1540383, 1463551, 1385590, 1333832, 1292230, 1225554, 1171723, 1158270, 1140316, 1131838, 1146825, 1172577, 1207252, 1264397, 1347049, 1444199, 1536186, 1592452, 1605705, 1626953, 1632862, 1539442, 1408309, 1299496, 1183700, 1101168, 1046892, 1002084, 980010, 965870, 960725, 955841]
17917I55841m1209m9838j6789l5063j7436k4026j4987k6761k2730k3936R376r24
17905F91518j4936P485L2819K9258Q88J0508N3266P0319R2756P6908O6235P6967
17893A193991L9181P686o7160p3306q0774m0645Q997J4812O3501Q8563k5100r6395
17881A033351r8416r5618p4856m3364n3415l0081k0524l6276j4938j6581k1355
17870E27927J8629J8282k1773J5126j0415l0567k8561M213j2477J38k799r009
17858D68714j0744L858L054J3548K70k135L1692N2796O1696Q0286Q8356J7222
17846H08613n1118p0739r8954o5794k8952k1875k1825j4263O912j1546k6751J0481
17834D14189J5605J1114N4777n291k5283j64J6213J4872O479k1337o1807l8911
$$ y = [955841, 914632, 864794, 848005, 812942, 795506, 771480, 756493, 729732, 707002, 683066, 692442, 691518, 676582, 684067, 716886, 746144, 747032, 757540, 810806, 881125, 973881, 1050789, 1117024, 1193991, 1233172, 1240858, 1173698, 1100392, 1019618, 978973, 987970, 1002782, 1066283, 1154846, 1129746, 1033351, 934935, 839317, 764461, 721097, 667682, 637601, 617077, 580801, 565863, 549282, 527927, 546556, 564838, 543065, 558191, 547776, 517209, 488648, 492861, 480384, 480522, 477723, 468714, 457970, 461828, 464882, 478430, 478700, 476565, 508257, 561053, 622749, 703035, 791391, 808613, 757495, 686756, 587802, 522008, 493056, 471181, 449356, 435093, 442005, 430459, 403708, 414189, 429794, 440908, 495685, 490394, 465111, 464947, 481160, 496032, 502511, 481174, 419367, 380456]
17822C80456j7079k5887l2814p61N371K6726j1512l5414o408J7836J6164P213
17810C23891N418m585l3547k7465Q656J1256q92m8602j2562K7979L2692P391j2452
17797B77178l88J6587N4466J1145l1251k6590j8879j480Q352k9901k9493J949
17785B31695J8308J187l8299J6624K1065r598L619p512k571j3141j3323k1945
17773A86109j9534p870K3226j712j6155N724J4389K385l616r186K185J0878M725
17760A91548J8892j452K1470k26k6566j780n443m7218k1099K2796J4328M4231
17748B09481K4423j192n99l8176j5982M031o579j3286M876O095j6342m38k2435
17735A33877L20R155K6081P27L1268j609m3747k5302N15J939j5840L781M452K2624
$$ y = [380456, 363377, 337490, 304676, 303915, 309286, 336012, 324500, 289086, 282678, 300514, 316678, 323891, 329309, 324724, 291177, 263712, 272368, 283624, 282732, 234130, 221568, 249547, 282239, 289630, 277178, 276790, 293377, 347843, 358988, 327737, 301147, 282268, 280788, 289140, 259239, 229746, 231695, 250003, 251190, 212891, 229515, 250580, 240982, 244601, 237089, 234518, 221377, 208054, 186109, 166575, 158705, 181931, 180219, 164064, 169788, 184177, 186562, 182946, 173760, 175945, 186823, 191548, 210440, 208988, 230458, 230232, 203666, 201886, 196443, 149225, 128126, 150922, 165250, 209481, 233904, 232712, 232113, 193937, 177955, 181986, 175407, 162121, 166997, 173092, 156750, 156312, 133877, 134197, 143352, 169433, 170160, 201428, 199819, 156072, 130770, 131285, 133224, 117384, 121165, 125617, 148241]
17721A48241K420j943j2033J5530Q802L0614K1734j1424m1516L057o720K4701
17709A81463K5469p705o423k5629j9837q081M2144J8901P336K6263j544R369K2133
17696B63859L4935J6601q197M498K546k4312l3098K6621L6730J9447J6833N9489
17684D15952M8529J03424J48576K32855L27115M22028L69233J87333N0420j92344
17674B113121l47542l47426k94385k28623j68198j20141j04238m1117L102o529
17664D58024l142l2468j869J3673l137N500K22j1095k1096k1173K3245K1129j2608
17651D15205L0755M5474N6011Q3451R4764J51428J63761J94836K80355L49422
17641A865462K51319J11772q0785l03857l44673l06939k35911j75352j53826j04868
$$ y = [148241, 150661, 148718, 136685, 152215, 161017, 191631, 213365, 201941, 160425, 163482, 156762, 181463, 206932, 199227, 192804, 167175, 147338, 139257, 181401, 200302, 207638, 233901, 232357, 241726, 263859, 298794, 315395, 307198, 311696, 314242, 289930, 256832, 283453, 320183, 339630, 356463, 415952, 464481, 567905, 716481, 949336, 1276451, 1698479, 2067712, 2255045, 2305465, 2113121, 1765579, 1418153, 1123768, 895145, 726947, 606806, 502568, 461451, 464553, 458024, 454882, 422414, 420545, 434218, 431081, 436581, 436803, 425708, 404612, 383439, 406684, 427813, 415205, 445960, 491434, 547445, 630896, 725660, 877088, 1040849, 1235685, 1516040, 1865462, 2116781, 2228553, 2147768, 1843911, 1499238, 1192299, 956388, 781036, 627210, 522342]
17631E22342o9352r411l206j3432l0818p244k2211m3942n892l1239k3115M993
17619B67473j3399k7388k5927L637M249M0862J5342J5652O3102L4272j4271j5134
17607C48470k1067l4784j7728k9316l2886Q203q350j2467l0292j763L619J8141
17595A89780n439jj4054j1808l1270k0935K5013O548Q479L609J3641q792J0541
17582A65312L3167N170J4623L6173M7652N8266O3942P279l0186m1579n2564n3371
17570B53884m7623k4427m996O370M418n995J3723j841j5967p56l304l251P35j8595
17556A52375J7102R388K1790M763p589j0674L1045L540R75R407J8725J9136K9837
17543B99820L7552O0950R9213J45652K43025L10694L00837Q9418m9726o2097J8137
$$ y = [522342, 452990, 443579, 440373, 426941, 396123, 388879, 366668, 322726, 316834, 285595, 262480, 267473, 254074, 226686, 200759, 204396, 208645, 249507, 264849, 280501, 343603, 377875, 363604, 348470, 327403, 292619, 274891, 245575, 212689, 220892, 212542, 200075, 169783, 168020, 171639, 189780, 184341, 184340, 170286, 158478, 127208, 106273, 131286, 137834, 146313, 149922, 163563, 154771, 165312, 198479, 203649, 218272, 254445, 302097, 360363, 424305, 431584, 401398, 359819, 307255, 253884, 206261, 181834, 176838, 183208, 187626, 181631, 195354, 193513, 177546, 176790, 173486, 170235, 170970, 152375, 169477, 178865, 200655, 205418, 197829, 187155, 218200, 221740, 222715, 232122, 250847, 269983, 299820, 337372, 398322, 497535, 643187, 886212, 1196906, 1497743, 1587161, 1537435, 1475338, 1493475]
17532A493475J08738J01814p1623k22923k32500k38858k04999j32225r8309p4640
17522D27950n7757k278R836J0346j2010k8834J0184j5458k8666K641L6724Q884
17510C61562j1719R745J0422K2460M1186L6851Q9730J61029K69625K96191J96222
17499A483304k6579j18245m5876N8211J52898N9582j38660k47798k34680j95296
17489G46861j60576r6605l8519k6087m0659m8602k1342k0036n032k415J5332M2729
17477C45049K6464L6624M0194K9696j7437k4435n2863n7983m0327k5765m4121
17466B15096k254j8277m355p347j1187j5089R69N649J9214J1982l1070l2336j4899
17453A16096J33O903R546j3418R456M0060J8164J3296L6139M2895O5923M0675
$$ y = [1493475, 1602213, 1704027, 1632404, 1409481, 1176981, 938123, 733124, 600899, 502590, 427950, 370193, 367915, 377751, 388097, 376087, 347253, 357437, 341979, 313313, 315954, 352678, 361562, 349843, 359588, 370010, 392470, 433656, 470507, 560237, 721266, 990891, 1287082, 1483304, 1456725, 1338480, 1292604, 1350815, 1503713, 1563295, 1424635, 1176837, 942157, 746861, 586285, 489680, 451161, 425074, 384415, 335813, 314471, 294435, 289403, 286988, 302320, 345049, 371513, 408137, 448331, 478027, 460590, 436155, 383292, 325309, 284982, 259217, 215096, 212842, 194565, 190210, 182863, 171676, 156587, 157556, 163205, 182419, 194401, 163331, 130995, 116096, 116229, 123132, 132678, 119260, 128716, 168776, 186940, 200236, 236375, 279270, 345193, 385868]
17441C85868l1191j1340m4943n9313m4138j9472j970j9285n036k3838N889k0291
17429A10940R266j1874m797J8353J7628l7386j5562K9068k258k4774J1830J6530
17417A16964J2505k9497k9065M051M4710L8033j5340j5664k2487j3460J2598J1649
17405A14997L012k1566Q584J7577m1991O778J6680k3973P521J1941j0706L952
17393I2806J6717j8974r409J3678J2523j4721l07k4004P08P808L1174K0084J818
17380A29901j0444j9029k3965j3074L4550K2846k0029l4393j8994K2515K8678
17369I8562M4179k9130m0054l2630k673j0871k5958k996K8956K7204J2745j1329
17357E6005j5492O051q590n157L37J5700M807P118j695J0516L528J0325O499K274
$$ y = [385868, 354677, 343337, 298394, 239081, 194943, 175471, 173501, 154216, 149180, 125342, 131231, 110940, 120206, 108332, 103535, 121888, 139516, 102130, 86568, 115636, 113378, 88604, 100434, 116964, 129469, 99972, 70907, 74958, 119668, 157701, 142361, 126697, 104210, 90750, 103348, 114997, 118009, 96443, 105027, 122604, 80613, 87391, 104071, 80098, 87619, 99560, 88854, 92806, 109523, 90549, 81140, 94818, 107341, 92620, 92313, 68309, 69017, 76825, 107999, 128083, 129901, 119457, 100428, 76463, 63389, 97939, 120785, 100756, 66363, 47369, 69884, 98562, 142741, 113611, 73557, 40927, 38254, 27383, 1425, -1571, 27385, 54589, 67334, 56005, 40513, 46564, 37974, 32817, 33154, 48854, 53661, 60779, 59084, 69600, 73128, 83453, 89952, 92226]
17343I2226m125o369J0937R083l5822j485k554J5493J4078j5777R207p597j5839
17330F1456k6025q297j0908n876J0450J4561J0697K4602K9815J2465k9386j9704
17318F3850o95L1924R728M564k6743k1387o284R278J0429J8774N758l9378l7750
17305B2068o562J5735L1506k0987k7619L2193K2494o651m49J0844j2527O40L0366
17292I1051o515j5562j2015l482j9891M174J1376k559j9840J3287j486k319J6530
17279E2749j4690k669Q875M421K9185j2453o09L163m659K5958M183j9899J0923
17266H4478j5113J4708K5693k0035m2854j5516J1621R706Q982J5942M644k9002
17254E3254j8293l859L763K8576l879J3944P085j2898P178p305j3203O135j7184
$$ y = [92226, 88101, 81732, 92669, 101752, 65930, 64445, 61891, 77384, 91462, 75685, 84892, 77295, 61456, 35431, 27134, 16226, 10350, 20800, 35361, 46058, 70660, 100475, 112940, 83554, 63850, 63155, 95079, 104807, 109371, 82628, 61241, 54957, 64235, 74664, 93438, 99196, 59818, 22068, 15506, 31241, 62747, 41760, 14141, 46334, 68828, 62177, 61728, 72572, 60045, 60685, 91051, 84536, 68974, 56959, 53477, 33586, 37760, 49136, 46577, 26737, 40024, 38538, 36219, 52749, 38059, 35390, 44265, 48686, 77871, 65418, 64809, 67972, 63313, 89271, 93454, 73555, 84478, 69365, 84073, 109766, 89731, 46877, 31361, 42982, 52688, 61670, 77612, 82256, 53254, 34961, 31102, 34865, 63441, 59562, 73506, 80591, 67693, 74871, 67566, 54363, 60498, 43314]
17241D3314J5242M259M380l642k698k0754j7325L1941K6144Q127l1801j9720j2106
17228B5361J3217K3403l193j5686m207P937r974q84J4657p448O179K1829R098
17215H0289k4544k8334R326J387K940M482K100l822K1805K7763J2858k8548k4879
17202E2823j0388R568Q243J0194p065k1828M680l929p141N415J6558j9620j7790
17189A9720j443N764K0642N114j8813M267j6898J901J1231J02L7320K3785J9129
17176A11821k591j4135K140k9779k1831R567R968N880J02o851R263j7092p698
17163D8764J1755r083M289L555K0636j5385l333j6726k029K295m598J9961J1636
17150G1737m0708k0511M399R07p84K2309J2465k336k2115j7283O081j0451j7184
$$ y = [43314, 58556, 62815, 67195, 63553, 60855, 40101, 22776, 54717, 80861, 88988, 57187, 37467, 25361, 38578, 61981, 58788, 43102, 38895, 46832, 36858, 35974, 50631, 43183, 49362, 71191, 80289, 55745, 27411, 36737, 38124, 41064, 45546, 47646, 43824, 65629, 93392, 106250, 77702, 52823, 42435, 52003, 60246, 70440, 63375, 41547, 46227, 42298, 35157, 40572, 57130, 37510, 19720, 18277, 24041, 44683, 49797, 30984, 35251, 18353, 20254, 31485, 31587, 68907, 92692, 111821, 109230, 95095, 97235, 67456, 45625, 55192, 65160, 71040, 71142, 64291, 73554, 56462, 48764, 60519, 51436, 55725, 59280, 79916, 64531, 61198, 44472, 42443, 44738, 40140, 60101, 71737, 31029, 10518, 14917, 15824, 15040, 37349, 49814, 47478, 25363, 8080, 14161, 3710, -13474]
17137a3474p812J7884L9168R931k9933J1794Q732q56J391j31j1164k0120J7484
17124B2894M1621L0600l6891j4002j7117Qk852P519k451J949k4203l8508J6174
17111a5259J7791K3192M40N54K0359p489j8078q656K13O658j4691J142K7428J266
17097C4870P144j3964K2880J314j3269j738J8837o722J0328J4553j7933j9194
17085C7106l344O758J9545L983R382k0661j5917j5363J1273j470j8926l002J4563
17072B3927K147L5637R846J8719j1501j2954N060J7724O211K86l9479k6376R845
17059C9092J7792k4063M238L6173o49j3490k2902k6253M0732n13l4505J3623L21
17046B9596K3819q794k2493k0381m984O444J2077o201k656J1984K2889K490j4651
$$ y = [-13474, -21286, -3402, 35766, 45697, 15764, 27558, 36290, 35434, 36825, 36694, 25530, 5410, 22894, 64515, 95115, 58224, 44222, 27105, 27113, 24261, 31780, 29329, 31278, 7075, -31433, -15259, 2532, 25724, 26164, 26718, 47077, 39588, 21510, 12854, 13067, 19725, 5034, 6176, 33604, 34870, 42014, 28050, 50930, 52244, 38975, 37237, 56074, 49352, 59680, 74233, 56300, 37106, 33762, 40520, 60065, 64048, 73430, 52769, 36852, 21489, 32762, 31292, 12366, 9364, 23927, 26074, 61711, 71557, 90276, 78775, 65821, 70881, 88605, 94816, 95102, 55623, 29247, 39092, 56884, 32821, 37059, 73232, 72583, 59093, 36191, 9938, 50670, 50157, 15652, 29275, 29596, 53415, 44621, 22128, 1747, -3237, 3207, 15284, 9083, 6427, 18411, 41300, 43790, 29139]
17033B9139j2869J4730P720m234k8598M853J0186J7661n366P939R769p904M658
17020D7684J2652k3147j6597K4656R241L1879K8611m4467j3021o341k099K6299
17008G5350J901K6962N74m838j4533j9412P462J8700M5560O0513L8697M4466Q8582
16995C69984J11563J22346O2509k6687n8091r8538q3991q2337p8084o0721J3974
16984A91927L7177k5155m3167m0907j338j72j2514k638j5238k1328J4378q558
16972G2467l6698j5108J2486O555j0135K4309L2784j283k3388p77O808N012J689
16959G4721j083J576r446k0081n020q448j9078j4754J8785M2763J2886K6677O689
16946A06187k1348P170R948j0279J3715K1421k7614l159o93R548m867n988j13
$$ y = [29139, 16270, 31000, 38720, 34486, 5888, 10741, 20927, 38588, 33222, 41161, 50930, 43026, 47684, 60336, 37189, 20592, 45248, 54489, 86368, 114979, 70512, 57491, 51150, 49051, 75350, 77251, 104213, 104787, 99949, 85416, 66004, 73466, 92166, 137726, 198239, 236936, 281402, 369984, 481547, 603893, 666402, 639715, 581624, 483086, 399095, 316758, 238674, 177953, 191927, 229104, 203949, 160782, 119875, 118537, 118365, 105851, 103213, 87975, 66647, 81025, 72467, 35769, 20661, 33147, 39702, 29567, 53876, 86660, 85377, 61989, 61212, 68020, 73032, 74721, 73638, 75214, 65768, 45687, 40667, 32219, 13141, -1613, 17172, 59935, 72821, 99498, 106187, 84839, 92009, 101957, 91678, 105393, 126814, 99200, 96041, 95348, 104896, 100029, 94041, 93928]
16933I3928K0368m135j0394j5396O083Q64j9048J0491r420O157R010l9J9200N879
16919A13548j4835M895j3129O883O259n823k419O873j1529r492R120l071J81r181
16905G8280P608J4486K3575J5153O647k722P642K7720L6678j3034Q211R4637J28178
16892D33059J02300P3662J5568k1719l1240p0521o4206l0925J761R645J2170K2653
16880D52207O7388N5614J36209J71597K60886L89217O10927Q65436Q30153K32937
16870D072571l99172o50202o41117n85951m63548l28684j97558j30173j03844
16861E72322o5660m6439k8799l8226o2740l8865j7508j8270k6095j2820M945K1877
16849B43722L719J2122j1659k2742k1475j8019J8226R679r066p199j4751k3612
$$ y = [93928, 114296, 110161, 99767, 84371, 90454, 91318, 72270, 82761, 73341, 79498, 88508, 88469, 107669, 113548, 98713, 103608, 90479, 97362, 103621, 97798, 95379, 102252, 90723, 81231, 90351, 87280, 87461, 78280, 85888, 100374, 123949, 139102, 145749, 143027, 150669, 178389, 215067, 202033, 210244, 304881, 433059, 535359, 609021, 624589, 602870, 571630, 501109, 436903, 405978, 407739, 417384, 429554, 452207, 519595, 575209, 711418, 883015, 1143901, 1533118, 2144045, 3009481, 3839634, 4072571, 3673399, 3023197, 2382080, 1796129, 1332581, 1003897, 806339, 676166, 572322, 506662, 460223, 431424, 393198, 330458, 291593, 274085, 255815, 229720, 216900, 221845, 243722, 247441, 259563, 247904, 225162, 203687, 185668, 203894, 213573, 204507, 197308, 182557, 158945]
16837A58945k095J3812k1753j2037p736k6456k6803J7013J0585O449L1006k1296
16825A19634j6140K8713J9434l2802J709J611M045J6854l927j1548m362Q81j3112
16812A10990j301O647k777R886l3388k459j989o022J6397j9312j5473J3801m151
16799G0849m1798j1167P466J2789J3923K5403M2829j7195r399j7307r568J292
16787F8117k5995j1958J8642L1459j6636j9358J94k0k2832l0102j3744K9591J4493
16774B1851J5859J4066J780M47k220R793K6335J6310j2022j9326n382r49p088
16761E9454n343m153o513j4421J0460L0926j4404l3613J0877L8539K246l127j0342
16748F0586k5473J8875n531k1555K2703K834j3669j393o474K5241j4570m572J782
$$ y = [158945, 156850, 170662, 148909, 136872, 129136, 102680, 75877, 92890, 103475, 109924, 140930, 119634, 103494, 132207, 151641, 118839, 120548, 122159, 126204, 143058, 139131, 127583, 123221, 124102, 110990, 109689, 116336, 113559, 123445, 90057, 87598, 85609, 79587, 95984, 76672, 61199, 75000, 70849, 29051, 17884, 25350, 38139, 52062, 77465, 120294, 103099, 93700, 76393, 66825, 68117, 42122, 30164, 48806, 80265, 63629, 44271, 44465, 44445, 21613, -8489, -22233, 7358, 21851, 37710, 51776, 53556, 54003, 51783, 61576, 87911, 104221, 92199, 72873, 67491, 66542, 59454, 54111, 49958, 43445, 29024, 39484, 70410, 56006, 22393, 33270, 71809, 74055, 70928, 60586, 35113, 53988, 48457, 26902, 49605, 52439, 38770, 37377, 30903, 56144, 41574, 37002, 38784]
16735C8784l557O688P54l711J3214O787K298R757j3966p607r343j9222j6204j8016
16721a3344J4423L3228J2746j9509l404L371N599j295l0287R230J5497J332K7577
16708E5164p484p498j1055M872K0573k1553r470J623j2814j2455K1967J2622R028
16695D3520K361J1744k6101j0655j766q169R071j125L5446j3212q38K508K03K809
16681D5796M723k3844k8673K0100Q122j7728j049K854r153L0389L3342j0336o452
16668D8091j6348k3248l7383j6238L449J4101K4021K1193O006J536L2163k1206
16656C6137L919k1977N487p316p737k014j7320L535o040j4460L2553M8511j0183
16643D3095l5426O933J1756J5107K0334j72j2545r431o326l2913p32P315r450
$$ y = [38784, 35227, 41915, 42669, 38958, 52172, 58959, 61257, 71014, 57048, 49441, 40098, 20876, 4672, -13344, 1079, 34307, 47053, 27544, 24140, 27511, 33110, 31815, 1528, 10758, 26255, 27587, 55164, 47680, 40182, 29127, 33999, 54572, 33019, 23549, 25172, 12358, -97, 21870, 34492, 43520, 45881, 57625, 31524, 20869, 19103, 10934, 20005, 18880, 54326, 41114, 40276, 42784, 42987, 45796, 50519, 26675, -1998, 18102, 26224, 8496, 7447, 10301, 1148, 31537, 64879, 54543, 48091, 31743, 8495, -28888, -45126, -41677, -27576, -3555, 17638, 23644, 25180, 57343, 36137, 40056, 18079, 23566, 16250, 8513, 6499, -10821, -7286, -13326, -27786, 4767, 53278, 43095, 7669, 14602, 26358, 41465, 61799, 61627, 49082, 39651, 33325, 412, -320, 6995, -2455]
16630b455J3448M0542K1108k6382l0174J3224o511m207L1125r043m560m181p462
16617B4472K4422J8532j4171l8052R105k6265m8989N19K7180R109K665R167J8260
16604A5954j3327q330r002J4899M9602j0805k3880Q108J1328K9126P244k7307
16592D3610k3279J221m110M289R758q820k5739j0161K172O383Q581j5033p062
16579a8190O969K0630o912R264p767j4422R843m808P839J6736l073j9012j4455
16566a7358j928J0898R830O170q213K1292M608j6655j6986K0676j412k1553j4481
$$ y = [-2455, 10993, 51535, 72643, 46261, 16087, 29311, 22800, 18593, 49718, 40675, 36115, 31934, 24472, 48894, 67426, 53255, 15203, 24308, -1957, -50946, -50427, -23247, -14138, -11473, -2306, 15954, 2627, -5703, -14705, 194, 49796, 38991, 15111, 23219, 34547, 63673, 70917, 43610, 20331, 21552, 17442, 21731, 31489, 22669, -3070, -13231, -11059, -4676, 3905, -11128, -18190, -11221, 9409, 2497, 11761, 3994, -10428, -585, -5393, 2446, 19182, 16109, -2903, -17358, -19286, -8388, 1442, 7612, -601, 20691, 25299, 8644, -8342, 12334, 10922, -10631, -25112]
$$ [...]
##END NTUPLES=NMR SPECTRUM
##END=
