##TITLE=Analysis number 323947
Compound Code cc 63646
Book Reference 510/4
Project Code adrs
Chemist Name jimp
##JCAMPDX= 6.0         $$ Bruker NMR JCAMP-DX V2.0
##DATA TYPE= NMR SPECTRUM
##DATA CLASS= NTUPLES
##ORIGIN= Bruker BioSpin GmbH
##OWNER= nmr
$$ XWIN-NMR		Version 3.5
$$ Thu Nov  9 16:34:50 2006 GMT Standard Time (UT+0h)  MAYBRIDGE\nmr@NMR_250MHZ
##.OBSERVE FREQUENCY= 250.131544655141
##.OBSERVE NUCLEUS= ^1H
##.ACQUISITION MODE= SIMULTANEOUS (DQD)
##.ACQUISITION SCHEME= undefined
##.AVERAGES= 16
##.DIGITISER RES= 18
##SPECTROMETER/DATA SYSTEM= dpx250
##.PULSE SEQUENCE= zg30
##.SOLVENT NAME= CDCl3
##.SHIFT REFERENCE= (INTERNAL, CDCl3, 0, 16.522)
##AUDIT TRAIL= $$ (NUMBER, WHEN, WHO, WHERE, WHAT)
$$ ##TITLE= Audit trail, XWIN-NMR		Version 3.5
$$ ##JCAMPDX= 5.01
$$ ##ORIGIN= Bruker BioSpin GmbH
$$ ##OWNER= nmr
$$ C:\u/data/dgb/nmr/ADRS/2560/pdata/1/auditp.txt
$$ ##AUDIT TRAIL=  $$ (NUMBER, WHEN, WHO, WHERE, WHAT)
(   1,<2006-11-09 16:34:21.12 +000>,<MAYBRIDGE\nmr>,<NMR_250MHZ>,
      <created by zg, POWCHK disabled, PULCHK disabled
       configuration hash MD5:
       49 4B E0 1D 92 C2 6B 37 9F E6 65 BC 52 41 86 1D
       data hash MD5: 64K
       BC 1B 57 1E 5C 52 23 78 01 2E C8 31 46 02 68 AF>)
(   2,<2006-11-09 16:34:38.35 +000>,<MAYBRIDGE\nmr>,<NMR_250MHZ>,
      <Start of raw data processing
       ef LB = 0.3 FT_mod = 6 PKNL = 1 SI = 32K 
       data hash MD5: 32K
       B5 3E D1 25 87 8E D9 28 8C AE BB 27 E7 B0 28 CE>)
(   3,<2006-11-09 16:34:40.18 +000>,<MAYBRIDGE\nmr>,<NMR_250MHZ>,
      <apk 
       data hash MD5: 32K
       E1 94 A3 B4 44 35 A5 92 C8 86 BA 44 30 E7 B9 41>)
(   4,<2006-11-09 16:34:41.04 +000>,<MAYBRIDGE\nmr>,<NMR_250MHZ>,
      <abs ABSG = 5 
       data hash MD5: 32K
       EA 9D 1C C0 F4 AC 33 EC 8D 5A AF CA 81 D5 62 AF>)
$$ ##END=
$$ 
$$ hash MD5
$$ A4 C0 9E 89 14 BF E9 FE DD CF 28 14 39 2A D5 6C
##$RELAX= 
##$RELAX= 
##$RELAX= 
##$RELAX= 
##$RELAX= 
##$RELAX= 
##$RELAX= 
$$ Bruker specific parameters
$$ --------------------------
##$DU= <C:\u>
##$EXPNO= 2560
##$NAME= <ADRS>
##$PROCNO= 1
##$TYPE= <nmr>
##$USER= <dgb>
##$AMP= (0..31)
100 100 100 100 100 100 100 100 100 100 100 100 100 100 100 100 100 100 
100 100 100 100 100 100 100 100 100 100 100 100 100 100 
##$AQSEQ= 0
##$AQ_mod= 3
##$AUNM= <au_zg>
##$AUTOPOS= <1 >
##$BF1= 250.13
##$BF2= 250.13
##$BF3= 250.13
##$BF4= 250.13
##$BF5= 500.13
##$BF6= 500.13
##$BF7= 500.13
##$BF8= 500.13
##$BYTORDA= 1
##$CFDGTYP= 0
##$CFRGTYP= 5
##$CHEMSTR= <none>
##$CNST= (0..31)
1 1 145 1 1 1 1 1 1 1 1 1 1 1 1 1 1 1 1 1 1 1 1 1 1 1 1 1 1 1 1 1 
##$CPDPRG= <>
##$CPDPRG1= <>
##$CPDPRG2= <>
##$CPDPRG3= <>
##$CPDPRG4= <mlev>
##$CPDPRG5= <mlev>
##$CPDPRG6= <mlev>
##$CPDPRG7= <mlev>
##$CPDPRG8= <mlev>
##$CPDPRGB= <>
##$CPDPRGT= <>
##$D= (0..31)
0 1 0 0 0 0 0 0 0 0.06 0 0 0 0 0 0 0.0002 0 0 0 0 0 0 0 0 0 0 0 0 0 0 
0 
##$DATE= 1163090059
##$DBL= (0..7)
120 120 120 120 120 120 120 120 
##$DBP= (0..7)
150 150 150 150 150 150 150 150 
##$DBP07= 0
##$DBPNAM0= <>
##$DBPNAM1= <>
$$ [...]
##$SUBNAM6= <"">
##$SUBNAM7= <"">
##$SUBNAM8= <"">
##$SUBNAM9= <"">
##$SW= 20.6930455092707
##$SWIBOX= (0..15)
0 0 3 0 0 0 0 0 0 0 0 0 0 0 0 0 
##$SW_h= 5175.983436853
##$TD= 65536
##$TD0= 1
##$TE= 683.16
##$TE2= 300
##$TE3= 300
##$TEG= 300
##$TL= (0..7)
0 120 120 120 120 120 120 120 
##$TP= (0..7)
150 150 150 150 150 150 150 150 
##$TP07= 0
##$TPNAME0= <>
##$TPNAME1= <>
##$TPNAME2= <>
##$TPNAME3= <>
##$TPNAME4= <>
##$TPNAME5= <>
##$TPNAME6= <>
##$TPNAME7= <>
##$TPOAL= (0..7)
0.5 0.5 0.5 0.5 0.5 0.5 0.5 0.5 
##$TPOFFS= (0..7)
0 0 0 0 0 0 0 0 
##$TUNHIN= 0
##$TUNHOUT= 0
##$TUNXOUT= 0
##$USERA1= <user>
##$USERA2= <user>
##$USERA3= <user>
##$USERA4= <user>
##$USERA5= <user>
##$V9= 5
##$VALIST= <valist>
##$VCLIST= <CCCCCCCCCCCCCCC>
##$VD= 0
##$VDLIST= <DDDDDDDDDDDDDDD>
##$VPLIST= <PPPPPPPPPPPPPPP>
##$VTLIST= <TTTTTTTTTTTTTTT>
##$WBST= 1024
##$WBSW= 4
##$XGAIN= (0..3)
0 0 0 0 
##$XL= 0
##$YL= 0
##$YMAX_a= 482339
##$YMIN_a= -685943
##$ZGOPTNS= <>
##$ZL1= 120
##$ZL2= 120
##$ZL3= 120
##$ZL4= 120
##$ABSF1= 16.522
##$ABSF2= -4.171173
##$ABSG= 5
##$ABSL= 3
##$ALPHA= 0
##$AQORDER= 0
##$ASSFAC= 0
##$ASSFACI= 0
##$ASSFACX= 0
##$ASSWID= 0
##$AUNMP= <proc_1d>
##$AZFE= 0.1
##$AZFW= 0.1
##$BCFW= 0
##$BC_mod= 0
##$BYTORDP= 0
##$COROFFS= 0
##$CY= 12.5
##$DATMOD= 1
##$DC= 0
##$DFILT= <>
##$DTYPP= 0
##$F1P= 14.0000005364418
##$F2P= -0.99999901652339
##$FCOR= 0.5
##$FTSIZE= 32768
##$FT_mod= 6
##$GAMMA= 0
##$GB= 0
##$INTBC= 1
##$INTSCL= 1
##$ISEN= 128
##$LB= 0.3
##$LEV0= 0
##$LPBIN= 0
##$MAXI= 10000
##$MC2= 0
##$MEAN= 0
##$ME_mod= 0
##$MI= 0
##$NCOEF= 0
##$NC_proc= -3
##$NLEV= 6
##$NOISF1= 0
##$NOISF2= 0
##$NSP= 0
##$NTH_PI= 0
##$NZP= 0
##$OFFSET= 16.522
##$PC= 1
##$PHC0= 162.981
##$PHC1= 5.137983
##$PH_mod= 1
##$PKNL= yes
##$PPARMOD= 0
##$PSCAL= 4
##$PSIGN= 0
##$REVERSE= no
##$SF= 250.13
##$SI= 32768
##$SIGF1= 0
##$SIGF2= 0
##$SINO= 400
##$SIOLD= 32768
##$SREGLST= <1H.CDCl3>
##$SSB= 0
##$STSI= 32768
##$STSR= 0
##$SW_p= 5175.98343685301
##$SYMM= 0
##$S_DEV= 0
##$TDeff= 65536
##$TDoff= 0
##$TI= <Analysis number 999999
Compound Code 99
Book Reference 9
Project Code 9>
##$TILT= no
##$TM1= 0
##$TM2= 0
##$TOPLEV= 0
##$USERP1= <user>
##$USERP2= <user>
##$USERP3= <user>
##$USERP4= <user>
##$USERP5= <user>
##$WDW= 1
##$XDIM= 32768
##$YMAX_p= 405710239
##$YMIN_p= -48487
$$ End of Bruker specific parameters
$$ ---------------------------------
##NTUPLES= NMR SPECTRUM
##VAR_NAME=  FREQUENCY,     SPECTRUM/REAL,   SPECTRUM/IMAG
##SYMBOL=    X,             R,               I
##VAR_TYPE=  INDEPENDENT,   DEPENDENT,       DEPENDENT
##VAR_FORM=  AFFN,          ASDF,            ASDF
##VAR_DIM=   32768,         32768,           32768
##UNITS=     HZ,            ARBITRARY UNITS, ARBITRARY UNITS
##FACTOR=    0.157963299565203, 1,           1
##FIRST=     4132.6476996994, 0,             0
##LAST=      -1043.33573715361, 0,           0
##MIN=       -1043.33573715361, -48487,      0
##MAX=       4132.6476996994, 405710239,     0
$$ Real data points
##PAGE= N=1
##DATA TABLE= (X++(R..R)), XYDATA
$$ [...]
16839b2487M380N120j571k361m634N433N278k177j2929o601j010K220J1507K90
16825a9542l915j457o264J2617L948Q92N731M065r82l710l600J920n121j663K521
16810a4560m456k382q246J3553J2973o175k904n723j1189m818Q572M661N543N053
16796a0098R717k316q449j0787o899N487N913L682k878P99l18j1447J926J1525
16782a4143q27j3146O165J7701j096k567l91O195k725M70N469q194j2811n147
16768b5047M670N813m966j0332j108l573mL797N475k268k422N605M647m801l066
16753b7580l631Q21J2078J164n094l942N517n514m313N339J3612J084j7501J076
16739b6884O411l241L003J519p364n338k055k208K737J0607M191j3601m372J0991
$$ plain form
16839 -22487 -18107 -12987 -14558 -16919 -21553 -16120 -10842 -13019 -25948 -32549 -33559 -31339 -19832 -19542
16825 -19542 -23457 -24914 -31178 -18561 -14613 -13721 -7990 -3925 -4907 -8617 -12217 -10297 -15418 -17081 -14560
16810 -14560 -19016 -21398 -29644 -16091 -3118 -9293 -12197 -17920 -29109 -33927 -25355 -20694 -15151 -10098
16796 -10098 -381 -2697 -11146 -21933 -28832 -23345 -17432 -13750 -16628 -15829 -16147 -27594 -25668 -14143
16782 -14143 -14970 -28116 -21951 -4250 -5346 -7913 -8304 -2109 -4834 -4364 1105 -7089 -19900 -25047
16768 -25047 -20377 -14564 -19530 -29862 -30970 -34543 -34547 -30750 -25275 -27543 -29965 -24360 -19713 -24514 -27580
16753 -27580 -31211 -30390 -18312 -17148 -22242 -26184 -20667 -26181 -30494 -25155 -11543 -10459 -27960 -26884
16739 -26884 -20473 -23714 -20711 -19192 -26556 -31894 -33949 -36157 -33420 -22813 -18622 -32223 -36595 -25604
16725b5604n81J69m76L018k286M614M294j851k46m72L866N42j048j054m523j505
16709b3143O004q006n005M34M568R225P700J0540J131k781P91j606j1275n936
16695a7359m395K595L378p225K348P968o047M069L685j232k741J941p656n997
16681b6668J4042P445j42n231o05M062j6741N81N583r127K975j739K179J77N448
16666a7761R344Q382k949n237p522n316M445M7q785N874Q876J440n358M855L02
16651i363m914j2350L668M36p757L743K753m663L979o82j338l088K241N687K036
16636a9612K201J45R269P155n6L703n766n709J842P933J3676j2268j0728l378
16622a1593J326n841j1138j0698n790J0158J0432l193Q45P089o613j2937k065
$$ plain form
16725 -25604 -26185 -26016 -26492 -23474 -25760 -21146 -16852 -18703 -18949 -19421 -15555 -15013 -16061 -17115 -21638 -23143
16709 -23143 -17139 -25145 -30150 -29716 -25148 -15923 -8223 2317 3448 667 1458 -148 -11423 -17359
16695 -17359 -21754 -19159 -15781 -23006 -20658 -12690 -18737 -14668 -10983 -12215 -14956 -13015 -20671 -26668
16681 -26668 -12626 -5181 -5323 -10554 -11159 -7097 -23838 -23257 -17674 -26801 -23826 -25565 -23386 -23209 -17761
16666 -17761 -8417 -35 -2984 -8221 -15743 -21059 -16614 -16567 -25352 -19478 -10602 -9162 -14520 -9665 -9363
16651 -9363 -14277 -26627 -22959 -22523 -30280 -26537 -23784 -28447 -24468 -25150 -26488 -29576 -27335 -21648 -19612
16636 -19612 -17411 -17266 -7997 -842 -898 2805 -2961 -8670 -6828 1105 14781 2513 -8215 -11593
16622 -11593 -10267 -16108 -27246 -37944 -43734 -33576 -23144 -26337 -25492 -18403 -25016 -37953 -40018
16609d0018N006N784L913l361R860L330mq434p42M341k938q605J4384L330j0727
16594b4881j0123O004M205Q265k157l13k868q093j100J6083K683J795k819M61
16580a2858J0274o769m164Q25M829N809O87N985m166m167N031o311n904l205q814
16565b2918K143K882q030R41L052J3461p929o995J682M579M95q253L041P132j611
16550a6328J94L479m814m53L975p29P311n320r013J502K527M353l010r972j5944
16535d2242o245J7331M840m285n324k24P296J0405J6719r915j5298l899J277j109
16521c0673P671Q667l193k922J179K823J492M390P26j2190r034P463O188L162
16507a4251k20k472n036l816M348P780l217j706P695l590L957k929l465o760K731
$$ plain form
16609 -40018 -35012 -29228 -25315 -28676 -18816 -15486 -15490 -23924 -24666 -20325 -23263 -31868 -17484 -14154 -24881
16594 -24881 -35004 -29000 -24795 -16530 -18687 -19000 -21868 -29961 -31061 -14978 -12295 -10500 -13319 -12858
16580 -12858 -2584 -9353 -13517 -12692 -7863 -2054 -1367 4618 452 -3715 1316 -4995 -10899 -14104 -22918
16565 -22918 -20775 -17893 -25923 -24982 -21930 -8469 -16398 -23393 -21711 -17132 -16637 -24890 -21849 -14717 -16328
16550 -16328 -16134 -12655 -17469 -17922 -13947 -14676 -7365 -12685 -21698 -20196 -17669 -13316 -16326 -26298 -42242
16535 -42242 -48487 -31156 -26316 -30601 -35925 -36149 -28853 -18448 -1729 -11644 -26942 -30841 -29564 -30673
16521 -30673 -23002 -14335 -17528 -20450 -19271 -16448 -14956 -10566 -9840 -22030 -31064 -23601 -17413 -14251
16507 -14251 -14471 -16943 -21979 -25795 -21447 -13667 -16884 -18590 -10895 -14485 -10528 -13457 -16922 -23682 -20951
16492b0951Q278m51J944M07m497p104K632j478q102Q76n127J634R025n63J885
16477b1592k655M54o281O201K94K217J975k946o333m850N572Q528m19L250K311
16462a4274l054o405m350Q808J1080j790J362K293j263m603J038L35j669K85j1884
16447b4091j874R40Q48k205p700J3276J0609l246O99n708n308N831R972L056k752
16432g653J097M364m958r297j3375n4Q603L834R98Q967K422o388r76K715n508
16417a5209j892K065O244p846q197j1068k489L406J868J0607M067L365o321N746
16403a5654J1106N576j2072o803J843Q14q677j3657m922Q94N365J2146J0941P472
16389e628j979M64O409n641j2203o470m790m60M011N738k034P323O273r697o124
$$ plain form
16492 -20951 -12673 -13124 -11180 -10773 -15270 -22374 -19742 -21220 -29322 -28446 -33573 -31939 -22914 -23477 -21592
16477 -21592 -24247 -23793 -30074 -23873 -23579 -21362 -19387 -22333 -28666 -33516 -27944 -19416 -19835 -16585 -14274
16462 -14274 -17328 -23733 -28083 -19275 -8195 -9985 -8623 -6330 -7593 -12196 -11158 -10823 -12492 -12207 -24091
16447 -24091 -25965 -25025 -24177 -26382 -34082 -20806 -10197 -13443 -12744 -18452 -23760 -17929 -7957 -4901 -7653
16432 -7653 -6556 -2192 -7150 -16447 -29822 -29876 -21273 -17439 -16441 -7474 -5052 -11440 -12416 -9701 -15209
16417 -15209 -17101 -15036 -8792 -16638 -24835 -35903 -38392 -34986 -33118 -22511 -18444 -15079 -21400 -15654
16403 -15654 -4548 1028 -11044 -17847 -16004 -15190 -23867 -37524 -42446 -41552 -36187 -24041 -13100 -5628
16389 -5628 -7607 -7143 -734 -6375 -18578 -25048 -29838 -30298 -26287 -20549 -22583 -15260 -8987 -18684 -24808
16374b4808Q878K0469O697n191q020k621l528o018j0395k487r85J075Q397Q04
16360a7733L289m209o652j477K806K460M727J255o612J804L304J5950J959j211
16346c40p664n447R06L898j4760n902P765Q450O042J343L58m067J271m861p316
16331b0324k08Q58P843Q698N789m472j0816j3438j0219j513K0597O865Q382k356
16317d314o365K642O864J2597k977n656j613p798n835r853j391k779O199j069
16303b1348l60r68m870R672K547r234J011q176M372K779J2907M919j9M217l148
16288e699m40o186r526K115L108Q245m742M708J963p761K504o013P146J460o059
16273a5177o885N145P109q463K181L116l679j8790K729J0871K490l161L541N403
$$ plain form
16374 -24808 -15930 4539 11236 6045 -1975 -4596 -8124 -14142 -24537 -27024 -28009 -26934 -18537 -17733
16360 -17733 -14444 -18653 -25305 -26782 -23976 -21516 -16789 -15534 -22146 -20342 -17038 -1088 871 -340
16346 -340 -8004 -13451 -12545 -8647 -23407 -29309 -21544 -13094 -7052 -5709 -5351 -9418 -8147 -13008 -20324
16331 -20324 -20532 -19674 -11831 -3133 2656 -1816 -12632 -26070 -36289 -37802 -17205 -10340 -1958 -4314
16317 -4314 -10679 -8037 -1173 11424 8447 2791 1178 -6620 -12455 -22308 -23699 -26478 -20279 -21348
16303 -21348 -21708 -22676 -27546 -17874 -15327 -24561 -23550 -31726 -27354 -24575 -11668 -6749 -6768 -2551 -5699
16288 -5699 -6139 -12325 -21851 -19736 -16628 -8383 -13125 -8417 -6454 -14215 -11711 -17724 -10578 -9118 -15177
16273 -15177 -22062 -16917 -9808 -18271 -16090 -12974 -16653 -35443 -32714 -21843 -19353 -22514 -18973 -13570
16259a3570M026O28K242l302o133k328M924m686n795P960m663N859q850M914J4367
16244d407J121L121k986j2357o72p415P428M856L688r193M689j593k459Q89n103
16229b0393M232L501j655j4122k019M840J580O124L15L118P526j500J164L655
16215c634Q89K996K620r533m835M374r55L431j079K211j0008q424n225l303k986
16200c3461k522m69L190P938O479l557q895j724J850j117O82M823P98P127N426
16185a3432M217J450m699k045R286p455l413l091q26l143P75M01K549n183j741
16170b6350M293o324L215k823k301K591M006K583l269r65K659o860n882K852O172
16155b6403J1679K377j49m656p676P965N505K37K518r81j0637k2L832J0166N110
$$ plain form
16259 -13570 -9544 -8916 -6674 -9976 -16109 -18437 -13513 -18199 -23994 -16034 -20697 -14838 -23688 -18774 -4407
16244 -4407 -3286 -165 -3151 -15508 -16180 -23595 -16167 -11311 -7623 -16816 -12127 -13720 -16179 -15290 -20393
16229 -20393 -16161 -12660 -14315 -28437 -30456 -25616 -24036 -17912 -17597 -14479 -6953 -8453 -7289 -3634
16215 -3634 -2745 251 2871 -6662 -11497 -7123 -8078 -4647 -5726 -3515 -13523 -21947 -27172 -30475 -33461
16200 -33461 -35983 -36452 -33262 -25324 -18845 -22402 -31297 -33021 -31171 -32288 -31606 -26783 -25985 -18858 -13432
16185 -13432 -9215 -7765 -12464 -14509 -5223 -12678 -16091 -19182 -20008 -23151 -22376 -21975 -19426 -24609 -26350
16170 -26350 -22057 -28381 -25166 -27989 -30290 -27699 -23693 -21110 -24379 -25344 -22685 -29545 -35427 -32575 -26403
16155 -26403 -14724 -12347 -12496 -17152 -24828 -16863 -11358 -11121 -8603 -9584 -20221 -20243 -16411 -6245 -1135
16140a135j398R49o288p171K021N476N42m395q847N257k898q929m99N31j75J6752
16124a0207l234q953l470L208P783k14O729j2118r49N603J088M366K478j715J0945
16109A340l073j2384P53R642N253j646j3223n04N537q902m799l438P254O070R200
16094b920l428n465m166k229K787P625K848L176n756n644M984M665p077p337n811
16079b3748k343N268J0465P639l180k669n673M308J74O96o359k485j486m947K039
16064b2301J1160n261o268p900k365K815l032Q796J4155Q028p593k603j1328j1919
16050c5616K483P286M94l111O082Q909N634Q375q503l129p636p565n096L40l65
16035c1418L516J4851m128m271m11O127N018J246J503K721j3143l650L490j487
$$ plain form
16140 -1135 -2533 -1584 -7872 -15043 -13022 -7546 -7004 -11399 -20246 -14989 -17887 -26816 -27315 -26784 -26959 -10207
16124 -10207 -13441 -22394 -25864 -22656 -14873 -15087 -8358 -20476 -21425 -15822 -14734 -10368 -7890 -9605 1340
16109 1340 -1733 -14117 -13364 -3722 1531 -115 -13338 -13842 -8305 -17207 -22006 -25444 -18190 -12120 -2920
16094 -2920 -6348 -11813 -15979 -18208 -15421 -7796 -4948 -1772 -7528 -13172 -8188 -3523 -10600 -17937 -23748
16079 -23748 -26091 -20823 -10358 -2719 -5899 -8568 -14241 -9933 -9759 -9063 -15422 -17907 -19393 -24340 -22301
16064 -22301 -11141 -16402 -22670 -30570 -32935 -30120 -33152 -24356 -10201 -2173 -9766 -12369 -23697 -35616
16050 -35616 -33133 -25847 -25353 -28464 -22382 -13473 -7839 536 -7967 -11096 -18732 -26297 -31393 -31053 -31418
16035 -31418 -27902 -13051 -17179 -21450 -21861 -15734 -10716 -9470 -7967 -5246 -18389 -22039 -18549 -20036
16021b0036k048Q171J103M454o81J296o577n754O161K559L991n332J586m88k513
16006a4108L328K156j124m395m081j1740j998P495J1661P194p72m692M4p123q342
15991b6497l595N795J0956l670M363Q928r631m87k278M534K230k821p636J212
15977a8597j810R405M74r235L221K30O610L335L690K589Q883j287Q802l882r365
15962C063j0945j312j501K046j1858L119j510m299M223K375o476J983R328l589
15948a5353n522M485J545K426m354k633L751M548k040j9004p660R063O675M59
15934b3614L338J0892Q068p216p291q75N205n33L608N59J132L314p693m727M013
15919a1820n305J433N211j562n323j692M099K833J1421M597j1165k454p691m9
$$ plain form
16021 -20036 -22084 -13913 -12810 -8356 -9037 -7741 -14318 -20072 -13911 -11352 -7361 -12693 -11107 -11595 -14108
16006 -14108 -10780 -8624 -9748 -14143 -18224 -29964 -31962 -24467 -12806 -5612 -6384 -11076 -11032 -18155 -26497
15991 -26497 -30092 -24297 -13341 -17011 -12648 -3720 -13351 -13838 -16116 -11582 -9352 -12173 -19809 -18597
15977 -18597 -20407 -11002 -10528 -19763 -16542 -16312 -9702 -6367 -2677 -88 8795 7508 16310 12428 3063
15962 3063 -7882 -9194 -10695 -8649 -20507 -17388 -18898 -23197 -18974 -16599 -23075 -21092 -11764 -15353
15948 -15353 -20875 -16390 -14845 -12419 -16773 -19406 -15655 -11107 -13147 -32151 -39811 -30748 -24073 -23614
15934 -23614 -20276 -9384 -1316 -8532 -15823 -16698 -11493 -12026 -8418 -7859 -6727 -3413 -11106 -15833 -11820
15919 -11820 -17125 -15692 -10481 -12043 -17366 -19058 -14959 -12126 -705 3892 -7273 -9727 -17418 -17467
15905a7467Q133J0105l819j5128J223O871R934K15K954j1446o692M160L850J429
15891e678p282k785N288l599J97J1661m915k940O223R496P350l515j0288j3394
15877a4181j937M215l371K737K63j541L021o050m172J0710J38o567L48k845o439
15862b5671M843N769j054N13P076k578R49J239l989k433m454R45P598P59n879
15847a6367j598N530k802l233M424M825l810M889P729r17q011K679L976n265l895
15832a1846L414j3404j5307N298J6116J3322J6j602p273r404n287P170L850J1383
15818c554l09q438j081l201n879N573L028L51m463K603p62L613J7232j195n359
15803a841l971P7p455j0271l652J976K427J261n382K934O784J908K977N248q301
$$ plain form
15905 -17467 -9334 771 -3048 -18176 -16953 -10082 -148 67 3021 -8425 -15117 -10957 -7107 -5678
15891 -5678 -12960 -15745 -10457 -14056 -13859 -2198 -7113 -10053 -3830 5666 13016 9501 -787 -14181
15877 -14181 -16118 -11903 -15274 -12537 -12274 -13815 -10794 -16844 -21016 -10306 -10168 -16735 -16387 -19232 -25671
15862 -25671 -20828 -15059 -16113 -15600 -8524 -11102 -10153 -8914 -12903 -15336 -19790 -18845 -11247 -10488 -16367
15847 -16367 -17965 -12435 -15237 -18470 -14046 -9221 -13031 -8142 -413 -1330 -9341 -6662 -2686 -7951 -11846
15832 -11846 -8432 -21836 -37143 -31845 -15729 -2407 -2391 -3993 -11266 -20670 -25957 -18787 -14937 -3554
15818 -3554 -3863 -12301 -13382 -16583 -22462 -16889 -13861 -13510 -17973 -15370 -16132 -12519 4713 3518 -1841
15803 -1841 -5812 -5735 -13190 -23461 -27113 -25137 -22710 -21449 -26831 -23897 -17113 -15205 -12228 -6980 -15281
15788a5281j499l169n289j378M259l347o66P026M112m284R587J2324j059p706
15774f370O16N15l689q604j1159J009L973N750Q083K651o58o074l261J0738Q45
15759e635r22O673n745M019K380j394j0715m61R460k420L904O764r060r749m732
15744a7633L826k879R59R413m376p188k965L499P172j230L522L460J452j1008
15730a3976k904N753P460L444r93j148j1776r527l7P54Q649P48K986J949N685
15715b933O764m471L143Q525K351o085o331j5327j5668K54Q222Q219K16J280Q986
15700b855l57j0952l119K835N269n677O357N105J0087P046p611m937q879j8575
15686b6263k662N805J938J3826L180r949m874N368N013l951N200k862j364O204
$$ plain form
15788 -15281 -16780 -19949 -25238 -26616 -22357 -25704 -26370 -19344 -15232 -19516 -9929 2395 1336 -6370
15774 -6370 -5754 -5239 -8928 -17532 -28691 -27682 -23709 -17959 -9876 -7225 -7883 -13957 -17218 -6480 -5635
15759 -5635 -6557 116 -5629 -1610 770 -624 -11339 -11800 -2340 -4760 -856 5908 -3152 -12901 -17633
15744 -17633 -13807 -16686 -15727 -6314 -10690 -17878 -20843 -17344 -10172 -11402 -7880 -4420 -2968 -13976
15730 -13976 -16880 -11127 -3667 -223 -1216 -2364 -14140 -23667 -23704 -22950 -14301 -13553 -10567 -8618 -2933
15715 -2933 3831 -640 2503 11028 13379 7294 963 -14364 -30032 -29778 -21556 -13337 -13121 -11841 -2855
15700 -2855 -3212 -14164 -17283 -14448 -9179 -14856 -8499 -3394 6693 13739 6128 1191 -7688 -26263
15686 -26263 -28925 -23120 -21182 -7356 -4176 -14125 -18999 -13631 -8618 -12569 -7369 -10231 -11595 -5391
15672e391l577MP562K206k222k025J84O540M661o749j1701L825k91J672R7L37
15656d868j87n143P3l81L215k480N22J100j0683k4N440O698K009m82K269L923
15640A001N1j253o218M147n565n54J7478L225K327p967j4034L66P768m051n814
15625i093K415n051L80P319p306r937l786K03O493L917n344r45m880j372J1754
15610a5233o19J910M593L953k201J927l788n186k84P852N182M846j60P333m843
15595E282m513o07J288M526m206j665q250O17j224m369m770n099P449k232l154
15580b0927m236O772N492N79O712l944m772O108Q053q185k097N578L615j907k507
15565e666l051R127J0301l355N75j086j1818j0885r02P734o83n072K660M826k626
$$ plain form
15672 -5391 -8968 -8964 -1402 804 -1418 -3443 -3259 3281 7942 1193 -10508 -6683 -6974 -5302 -5205 -4868
15656 -4868 -5055 -10198 -10125 -10506 -7291 -9771 -9249 -8149 -18832 -18856 -13416 -6718 -4709 -5191 -2922 1001
15640 1001 1052 -201 -6419 -2272 -7837 -8391 9087 12312 14639 6672 -7362 -6996 772 -3279 -9093
15625 -9093 -6678 -11729 -11349 -4030 -11336 -21273 -25059 -24856 -18363 -14446 -19790 -20735 -25615 -26987 -15233
15610 -15233 -15852 -13942 -9349 -5396 -7597 -5670 -9458 -14644 -14928 -7076 -1894 2952 2792 10125 5282
15595 5282 769 162 1450 5976 1770 105 -8145 -7528 -8752 -13121 -17891 -22990 -15541 -17773 -20927
15580 -20927 -25163 -18391 -12899 -12320 -5608 -9552 -14324 -8216 -163 -8348 -10445 -4867 -1252 -3159 -5666
15565 -5666 -8717 410 10711 7356 7931 6845 -4973 -15858 -16760 -9026 -9709 -14781 -12121 -7295 -9921
15550i921P61P936P242j777o403O173j112N508p507j6143O305L805k026O317p713
15535h555r109J2939R758n84j1044m834K368n418r698R611J34J4965O89j0842
15521i620k922p251n261m448K395R356Q965O34o89J1794J428n35o77r332n535
15506a1698l240n10k058r24o624L254J1246N141J351m815m592l777k076M994Q470
15491e858r8N868N157o307j142N15p178j544j862n17n499k212N79K42J4366R895
15475D405M259K625j5157j2338M846K157O763O650o90q410L650m097k759r83L054
15460f025k141j181M418J1222l428K774Q884k610p528M531O93M543L149m907r865
15445B529j0417J0250L387k937n409r528m066P817P925j2234M997O836N26o023
$$ plain form
15550 -9921 -9160 -1224 6018 4241 -2162 4011 2899 8407 900 -15243 -8938 -5133 -7159 -842 -8555
15535 -8555 -17664 -4725 5033 4449 -6595 -11429 -9061 -14479 -24177 -14566 -14432 533 1222 -9620
15521 -9620 -12542 -19793 -25054 -29502 -27107 -17751 -8786 -8152 -8841 2953 4381 3846 3169 -6163 -11698
15506 -11698 -14938 -15448 -17506 -18430 -25054 -21800 -10554 -5413 -4062 -8877 -13469 -17246 -19322 -14328 -5858
15491 -5858 -5956 -88 5069 -1238 -2380 -1865 -9043 -10587 -12449 -12966 -18465 -20677 -20098 -19856 -5490 4405
15475 4405 8664 11289 -3868 -16206 -11360 -9203 -2440 4210 3520 -4890 -1240 -5337 -8096 -9079 -6025
15460 -6025 -8166 -9347 -4929 6293 2865 5639 14523 11913 4385 8916 9609 14152 17301 12394 2529
15445 2529 -7888 2362 5749 2812 -2597 -12125 -16191 -8374 -449 -12683 -7686 -850 -324 -6347
15431f347j1193K762O943K51J907N723Q532j0572o268P65O580O724Q710l690j4778
15416c951o977Q659J0780m076q484r182O8N546n634L076J2142Q833p262m673k718
15401c853r397K291N390Q460O109j385m502p26K176l00k080O216q093p417m813
15386a1924p09J2398M865r907L846J1013j207r361j2970k367M851M211J0496K2080
15372B5315L30j4531l929n443m730Q172P055l75K031O886J586j3768n466j390
15358A743O114j151j0953m90o675M351J1831J6005N064j0446j0553K849P089o212
15344H566j4509j637N797J0727m332m60m203r23N098K986J7718L865j4298o293
15330H102n04J132K43n483r627o718l153P752P849J5407m147j6750q40j057J1811
$$ plain form
15431 -6347 -17540 -14778 -7835 -7584 -5677 46 8578 -1994 -8262 -7497 -917 5807 14517 10827 -3951
15416 -3951 -10928 -2269 8511 4435 -4049 -13231 -13163 -7617 -13251 -10175 1967 10800 3538 -1135 -3853
15401 -3853 -13250 -10959 -5569 2891 9000 7615 3113 2387 4563 4263 2183 8399 306 -7111 -11924
15386 -11924 -12633 -235 4630 -5277 -1431 9582 8375 -986 -13956 -16323 -11472 -7261 3235 25315
15372 25315 25645 11114 7185 1742 -2988 5184 12239 11864 13895 20781 22367 8599 3133 1743
15358 1743 7857 6706 -4247 -4737 -11412 -7061 4770 20775 25839 15393 4840 7689 14778 8566
15344 8566 -5943 -7580 -1783 8944 4612 4152 -51 -974 4124 7110 24828 28693 14395 8102
15330 8102 7598 8730 8973 3490 -6137 -12855 -16008 -8256 -407 15000 10853 -5897 -6737 -7794 4017
15315D017M147Q48j194K592l024K702N066K09l328r364k985p229n620J221p69
15300a2711j07J05M209k527O077R215O67j1198m716L052J3822N633q376r181k24
15285f260J4848R478J459j22K624p790j4286o993J3065Q530j1266j6595o502N140
15271a4670O548J2409K251K593O646N234l841n102m115p940L416n032j041m75
15257c119k002m035m490N452Q617Q340j738o915m029l936p22J2230Q167J153j0727
15242B246p06M948L421K263P437j220m654l847N162J008n327K06l782j1161j04
15227d110p132K359N508j02M117K064r09k525P713L978M829o051K91l261N843
15212A2612k624Q133j0102j7241L378R976j525J470p483K920O331J0185k213n381
$$ plain form
15315 4017 8164 9012 7818 10410 7386 10088 15154 15363 12035 2671 -314 -7543 -13163 -11942 -12711
15300 -12711 -12818 -12713 -8504 -11031 -4954 4261 4928 -6270 -10986 -7934 5888 11521 3145 -6036 -6260
15285 -6260 8588 18066 19525 19403 22027 14237 -49 -7042 6023 14553 3287 -13308 -19810 -14670
15271 -14670 -8122 4287 6538 9131 15777 21011 17170 12068 7953 13 3429 -1603 -2644 -3119
15257 -3119 -5121 -9156 -13646 -8194 423 8763 7025 110 -3919 -7855 -8577 3653 11820 12973 2246
15242 2246 1540 6488 9909 12172 19609 18389 13735 9888 15050 16058 10731 10937 7155 -4006 -4110
15227 -4110 -11242 -8883 -3375 -3477 640 2704 1795 -730 6983 10961 15790 9739 10030 6769 12612
15212 12612 9988 18121 8019 -9222 -5844 4132 2607 4077 -3406 -486 5845 16030 13817 8436
15198H436j110K668k556p595m787M796N759K49r450l603O432K0582k287j2939
15184D595r74L482O807J790k391j512P053K991P391k048q017M264j062l224o240
15169A2905o002k327P535J690L895o544l303j327R646l8R956L693n374j541J8046
15154D0910N932n727r749n788p84K753j0373j0525k94J1231M256L690N964O048
15140C7544K789j0214k106k511m960k023k897n022K468N995o753j401r08J1882
15126B1883K067K101O76r715o343j831Q514j102J12Q063j3721O487K1154j945
15112C6400l609M704j2555K662J6886R000J0202P719N875p656J0369J1588J0845
15099A02430N683Q227N290J2423K7260K3982L4485N6999O8707Q8570J15733J20348
$$ plain form
15198 8436 7326 9994 7438 -157 -4944 -148 5611 5860 -3590 -7193 -761 19821 17534 4595
15184 4595 3621 7103 13910 15700 13309 11797 18850 21841 29232 27184 19167 23431 22369 19145 12905
15169 12905 6903 4576 12111 13801 17696 11152 7849 6522 16168 16130 26086 29779 24405 22864 40910
15154 40910 46842 41115 31366 25578 24794 27547 17174 6649 6355 17586 21842 25532 31496 37544
15140 37544 40333 30119 28013 25502 20542 18519 15622 10600 13068 19063 12310 10909 10001 21883
15126 21883 23950 26051 26727 17012 10669 8838 17352 16250 16362 24425 10704 17191 38345 36400
15112 36400 32791 37495 24940 27602 44488 53488 63690 71409 77284 69628 79997 91585 102430
15099 102430 108113 116340 121630 134053 161313 185295 219780 276779 345486 434056 549789 670137
15087F70137J05663Q0920N3586J2988k4066n9706q5137j11761j23183j07382q9475
15076C22584p0860n7743l3322k3683j7676j2093j258j0301o840m482J596r911
15064G6011q743j1065p787m101k713j700k479n49k572m903k228J325R95N200Q345
15049D3036p972L155m0j0021m300l247L660J0327o148k049n0R39K267P94j0008
15034B0343J882K307n161r085N71J277N56k074o444M602L489L481O419O304j475
15019B6992p833K736l357j385L292k950M992q288M509r308m886L174Q476O942
15005B3106K5k100R400P034m069p753k500j048j934R291Q621m131P291K21k812
14990C8642q231j0430l076Q057O506l849M764p20M113J049K590p039n768r534
$$ plain form
15087 670137 775800 856720 910306 923294 899228 839522 754385 642624 519441 412059 322584
15076 322584 251724 193981 160659 136976 119300 107207 105949 95648 88808 84326 85922 76011
15064 76011 67268 56203 48416 44315 41602 39902 37423 36874 34302 29399 27171 28496 29491 34691 43036
15049 43036 35064 38219 38179 28158 23858 20611 24271 34598 28450 26401 26351 27290 29557 30351 20343
15034 20343 22225 24532 19371 10286 10857 12134 12690 10616 4172 8774 12263 15744 22163 28467 26992
15019 26992 19159 21895 18538 17153 20445 17495 22487 14199 18708 9400 4514 7688 16164 23106
15005 23106 23131 21031 30431 37465 33396 25643 23143 22095 20161 29452 38073 33942 41233 41454 38642
14990 38642 30411 19981 16905 24962 31468 27619 32383 31663 35776 36825 39415 32376 26608 17074
14976A7074l460P324P881J556p783p164J1765J5843Q898j3158p435r764n290P303
14962B3590k272m056l602m518N276R210l4J093r348O678r17m474j395m775l117
14947G339p741L951J446O778J0963J5685J5203q846p380k621J610O472o095j9566
14933A7198o20Q663p178J566Q980N455o034m893l031J0816J3140J559p078n881
14919C2662j765K985P62Q947L587J696R26j1929K290J0201n825K853M659m119
14905D7930J035m709L534Q180J421Q019R181J6453N329R362R714J5177J5842K7603
14891A74071J8648J1693J9722K6356O102K761j1515j6840j6410k2575j8408j3957
14879A59648k5386j6351j6533j3510o191J174K793p377p480L978L899J0188K260
$$ plain form
14976 17074 13614 20938 28819 30375 22592 15428 27193 43036 51934 38776 31341 21577 16287 23590
14962 23590 21318 17262 13660 9142 14418 23628 23594 24687 15339 22017 21100 16626 15231 10456 7339
14947 7339 -402 3549 4995 11773 22736 38421 53624 44778 37398 34777 36387 42859 36764 17198
14933 17198 16578 25241 18063 19629 28609 34064 28030 23137 20106 30922 44062 45621 38543 32662
14919 32662 30897 33882 34644 43591 47178 48874 49800 37871 40161 50362 44537 47390 52049 47930
14905 47930 48965 44256 47790 55970 57391 65410 74591 91044 96373 105735 115449 130626 146468 174071
14891 174071 192719 204412 224134 250490 256592 259353 247838 230998 214588 192013 173605 159648
14879 159648 134262 117911 101378 87868 81677 82851 85644 78267 70787 74765 78664 88852 91112
14866I1112q199p628j1090n634n639M687j0207k4575j44P593J4548j518j0185
14853C3121j0852j1114L900R883M218j967R256M819O57L373m637m123k433Q829
14839D2930J816k68o172K022l629k0443q79p260K170J38O710J3730Q808J1272
14825E0945O51Q217J3288R338K395J0423J6801J6703N454Q240J4781L360j047
14812A59549j1794q94M311o481J39N916M256N651p557n39O309N441J90J0137J245
14797A75879k2647k402K760O810P90q605j2194J31J838L07P992P408P113p099
14783A58081M756J5076R668P603K07L527J1840m654j0273n768o028j5763p821
14770A60451J2232L92M474R566K08L951J0015J9758K2554J7249K0675K3104J5514
$$ plain form
14866 91112 82913 75285 64195 58561 52922 57609 47402 22827 22683 30276 44824 43306 33121
14853 33121 22269 11155 15055 24938 29156 27189 36445 41264 41921 45294 40657 36534 34101 42930
14839 42930 44746 44478 38306 40328 36699 16256 15377 8117 10287 10425 17135 30865 39673 50945
14825 50945 51596 59813 73101 82439 84834 95257 112058 128761 134215 142455 157236 160596 159549
14812 159549 147755 146861 151172 144691 144830 150746 155002 160653 153096 152557 158866 164307 164497 174634 175879
14797 175879 153232 150830 153590 160400 161190 152585 140391 140522 142360 142667 150659 158067 165180 158081
14783 158081 162837 177913 187581 195184 195391 198918 210758 206104 195831 190063 184035 168272 160451
14770 160451 172683 173075 177549 187115 187323 191274 201289 221047 243601 260850 281525 304629 320143
14757C20143J7537M496k665p216j3766p040o77K069n102j4115j3673O410J5694
14744C02095l786j8488m548O265P628j5677l438N753k645J6703J0990j617J1121
14731C10356R167J4234K2430P032L521J1449P38L887r21p406K916j991L078P489
14717C85979Q340P618O746J8899k810O008J1204J6408J9726K0147K8664J6378
14705E43307J6101J7105J6592K2318J9295K4610K0336J9751K2184J3607K4075
14694G59281K6057K5001K5108K1037K1205K6729M0008M0950L5182L5040L8956
14683A094554L2047K9639L8162K9834L3096N0811N7164N8542N3088P2173Q0830
14672A629940Q9683J03468R6676J02148J19243J21991J15870J30236J40943J61432
$$ plain form
14757 320143 337680 342176 339511 332295 318529 311489 310812 312881 307779 293664 279991 286401 302095
14744 302095 298309 279821 275273 281538 289166 273489 270051 275804 273159 289862 300852 299235 310356
14731 310356 319523 333757 356187 363219 366740 378189 378927 382814 381893 374487 377403 375412 378490 385979
14717 385979 394319 401937 408683 427582 424772 430780 441984 458392 478118 498265 526929 543307
14705 543307 559408 576513 593105 615423 634718 659328 679664 699415 721599 735206 759281
14694 759281 785338 810339 835447 856484 877689 904418 944426 985376 1020558 1055598 1094554
14683 1094554 1126601 1156240 1194402 1224236 1257332 1308143 1365307 1423849 1476937 1549110 1629940
14672 1629940 1719623 1823091 1919767 2021915 2141158 2263149 2379019 2509255 2650198 2811630
14662B811630J78492K01168K26579K46551K74727L32851L94531M65925N53304
14653E685758O78568Q38141J009845J192387J385563J586136J835117K183400
14645A6394915K671752L436090M639210O543518R472904J3545026J8291952K2297351
14637I7292718K3842120K2126529J7997608J2855635O839145p81181r456676j7036148
14629A53679750k1467107k2333547k0728941j8052787j4982200j1705343q629300
14622C5780525o204793m521176l433813k723170k264918j946348j703797j482326
14614A1500184j266494j090073r34450p89606o66622n61298m86315m15463l60951
14605D928912l17671k91134k66861k38578k01637j74509j75864j67842j46454
$$ plain form
14662 2811630 2990122 3191290 3417869 3664420 3939147 4271998 4666529 5132454 5685758
14653 5685758 6364326 7202467 8212312 9404699 10790262 12376398 14211515 16394915
14645 16394915 19066667 22502757 27141967 33685485 43158389 56703415 74995367 97292718
14637 97292718 121134838 143261367 161258975 174114610 180953755 180172574 170715898 153679750
14629 153679750 132212643 109879096 89150155 71097368 56115168 44409825 35780525
14622 35780525 29575732 25054556 21620743 18897573 16632655 14686307 12982510 11500184
14614 11500184 10233690 9143617 8209167 7419561 6752939 6191641 5705326 5289863 4928912
14605 4928912 4611241 4320107 4053246 3814668 3613031 3438522 3262658 3094816 2948362
14596B948362j21925j13324j12283j04084r7259q5061p9691q2235p1064o6273
14586B015163o4185o5740o5177o4290p5385p8319o5348o5633o0296n6124n4817
14575A299849m4412n9559m7426k6507l1490l7300l9944m3189l6241m4384l3927
14564H55470l4473l0261k9160r913o360j6321j6621j7876j4356j2201r470j6438
14552F42020k0537k5236j6634q836k4126l1375k6276k2353j0224j6555k1052m267
14540D14549j4536j1384r157k2940j1178j0533j0532n518n587M221J146l862M01
14527C15090m865j4078j1626j4484j2936k230j0064q186j4108r263j487Q671O196
14514B26630M501J4643J7139K0049J9383J9486K6970J0529N711R329j754k2261
$$ plain form
14596 2948362 2826437 2713113 2600830 2496746 2399487 2314426 2234735 2152500 2081436 2015163
14586 2015163 1950978 1885238 1820061 1755771 1680386 1602067 1536719 1471086 1410790 1354666 1299849
14575 1299849 1255437 1195878 1148452 1121945 1090455 1053155 1013211 970022 933781 889397 855470
14564 855470 820997 790736 761576 751663 745303 728982 712361 694485 680129 667928 658458 642020
14552 642020 621483 596247 579613 570777 546651 515276 489000 466647 456423 439868 418816 414549
14540 414549 400013 388629 379472 356532 345354 334821 324289 318771 313184 317405 318551 314689 315090
14527 315090 310225 296147 284521 270037 257101 254871 244807 236621 222513 213250 211763 220434 226630
14514 226630 231131 245774 262913 282962 302345 321831 348801 359330 365041 374370 372616 350355
14502C50355l0071j9637k8309l1738k6011j5250k4905k2999j6429k726J29p088
14490A25321j4843j9891p741L533J185j7791m342O286N417r271o241n28n32J565
14476F2127o522m504n228r728n677P758r383p017p691j4918o736M287J779O278
14462D825N643l11j8579j285L964j040L800k011k566r484j2392n379N153O519
14448b3143N220R362J1904J1747J3917J1736J4565M775k754O497R490N806p00
14435G8422j908O267n232m258j2218N54j1646n836p947p088m353j602j851L777
14421B5081K359O477k250R39L783j003Q274Q938l587l784O10m518q415o425m966
14406B1513j7748p284P43P860j273j9772n010K767q863O596R527K268q48N622
$$ plain form
14502 350355 320284 300647 272338 240600 214589 199339 174434 151435 135006 132280 132409 125321
14490 125321 110478 90587 82846 86379 87564 69773 65431 71717 77134 67863 61622 61094 60562 62127
14476 62127 55605 51101 45873 36145 30468 38226 28843 21826 14135 -783 -7519 -3232 -1453 4825
14462 4825 10468 10157 -8422 -9707 -5743 -6783 -2983 -4994 -7560 -17044 -29436 -34815 -29662 -23143
14448 -23143 -17923 -8561 3343 15090 29007 40743 55308 60083 57329 63826 73316 79122 78422
14435 78422 76514 82781 77549 73291 61073 61627 49981 44145 36198 29110 24757 23155 21304 25081
14421 25081 27440 33917 31667 32606 36389 35386 43660 52598 49011 45227 45837 41319 32904 26479 21513
14406 21513 3765 -3519 -2776 5084 3811 -15961 -20971 -18204 -27067 -20471 -10944 -8676 -9524 -3902
14392c902J455j218J374J608P26O432J0048L287l654Q04R913J194j975k782l535
14377A9775j833m330r112m295o622j1540m060k992j95P722P66j1428j3907L751
14363c8300Q814O607Q851J1434k881n031K385K731K803L875o02n838n89M607m315
14348e449k749N306o51l434N865Q89m324j0032j117M112J2009Q143J57P458J498
14333A7681o409j4608l779m848l161p340j1038L131N033J4853J0899K772j938
14320A248j431j794m857M557j858J325k453L930M154l113j298j0114q826J623
14306a8907J2172n228p956L58j856L085P38N280J1027K815n527m283N193N890
14292B801n981j415l015m986K12P91P121M122k620k642L08j003P136q819n019
$$ plain form
14392 -3902 -2447 -3665 -2291 -683 43 6475 16523 19810 16156 16960 26873 28067 26092 23310 19775
14377 19775 17942 13612 4500 205 -6417 -17957 -22017 -25009 -25204 -17482 -16716 -28144 -42051 -38300
14363 -38300 -29486 -22879 -14028 -2594 -5475 -10506 -8121 -5390 -2587 1288 686 -5152 -5741 -1134 -5449
14348 -5449 -8198 -2892 -3543 -6977 -1112 -223 -4547 -14579 -15696 -11584 425 8568 8725 16183 17681
14333 17681 11272 -3336 -7115 -11963 -15124 -22464 -33502 -30371 -25338 -10485 414 3186 1248
14320 1248 -183 -1977 -6834 -2277 -4135 -2810 -5263 -1333 2821 -292 -1590 -11704 -20530 -18907
14306 -18907 -6735 -11963 -19919 -19561 -21417 -18332 -17594 -12314 -1287 1528 -3999 -8282 -3089 2801
14292 2801 -3180 -4595 -7610 -12596 -12384 -11593 -4472 -350 -2970 -5612 -5304 -6307 829 -7990 -13009
14277a3009K850M832j0872n267K321o712Q454R14k040K22m349k795L069J835J552
14262a8995J938L92J532M720J0068O604n473q03K193m32J339P550o581j5069K058
14247h959k595o863J2035K590l187O010l123k764K217J720p421Q876P123k226
14233C433J099p906M93P634n190k524N139J435k575O480R235m291l829n404r344
14218f115J1080J6958K323o088j1177K463J991m480j060j315j999O529N789N562
14204B0461P419m509n299P31k051p302j193k368Q200J0839Q449N677P011Q122
14190E4187J6238J7701R028J4850J8511J7594L6943N3075P2830Q4116Q6304J06228
14178E87605R9682R5333P2278M4377J0718j8730p5196j00119j13081j14121r1831
$$ plain form
14277 -13009 -10159 -5327 -16199 -21466 -19145 -25857 -17403 -16489 -18529 -18307 -22656 -25451 -22382 -20547 -18995
14262 -18995 -17057 -16665 -15133 -10413 -345 6259 786 -17 2176 1744 3083 10633 4052 -11017 -8959
14247 -8959 -11554 -18417 -6382 -3792 -6979 -969 -4092 -6856 -4639 -2919 -10340 -1464 5659 3433
14233 3433 4532 -3374 -2881 4753 -437 -2961 2178 3613 1038 7518 16753 12462 8633 3229 -6115
14218 -6115 4965 21923 24246 18158 6981 9444 11435 6955 5895 4580 2581 9110 14899 20461
14204 20461 27880 23371 18072 18803 16752 9450 8257 5889 14089 24928 33377 39054 46065 54187
14190 54187 70425 88126 97154 112004 130515 148109 185052 238127 310957 395073 481377 587605
14178 587605 687287 782620 854898 899275 909993 891263 816067 715948 602867 488746 396915
14167C96915r0925o8410m1891k6816l4250k0086j2681j3456j2184o000j6391o461
14155D7364o899j2577j0728n986j0474q531J346N830P809M020M269K837l407p088
14141G785j3022K991R035p140n234l5o21r251l20M084M187m14n402R690P157p122
14125c632l277R932m572q740k282N414l237k621p324j0073J0839J112n554k456
14111b6471M917k681J6233K710q716l647M554j868m639J010J85m267l365O064
14097a9981J2108o431K04N902O870r539n352k510Q010j064l18j0164p602P573
14083b2294R472j047q020k989j726Q424Q730M821L784j380p631j887M299L620
14069c824p541r116K129J743j938L508j173L011K105k163K778M116L418r294o77
$$ plain form
14167 396915 305990 237580 195689 168873 134623 114537 101856 88400 76216 70216 53825 47364
14155 47364 40465 27888 17160 11174 700 -7831 -6485 -655 7154 11174 15443 18280 14873 7785
14141 7785 -5237 -2246 6789 -351 -5585 -5620 -6241 -15492 -15812 -11728 -7541 -7955 -13357 -3667 3490 -3632
14125 -3632 -6909 3023 -1549 -10289 -12571 -7157 -10394 -13015 -20339 -30412 -19573 -18461 -24015 -26471
14111 -26471 -21554 -24235 -8002 -5292 -14008 -17655 -13101 -14969 -19608 -18598 -18413 -22680 -26045 -19981
14097 -19981 -7873 -14304 -14100 -8198 -1328 -10867 -16219 -18729 -10719 -11783 -12101 -22265 -29867 -22294
14083 -22294 -12822 -13869 -21889 -24878 -26604 -18180 -9450 -4629 -845 -2225 -9856 -11743 -7444 -3824
14069 -3824 -11365 -20481 -18352 -16609 -18547 -15039 -16212 -13201 -11096 -13259 -10481 -6365 -2947 -12241 -12918
14054a2918m725k14l177M64l825m511j253K109O720L598Q334J4829J0031j3687
14040A775j0515j0419o524K831M01J3733J1170P09L296q152j120k332n193k131
14026a2471K744k910l824J2851P280K560M92j734O036o846m259m525m765J3099
14012C728R63j0509q401R425l000j0773m284K605P90J549R547N810K34j534Q116
13997D266M315j2196m478n43j466q560J0173R321j0683l60n835k42n17n421M059
13982a8167Q380K25M139J965p083m659k634j2486Q805N244M064J0933M432m052
13968h94M68N479o151n219l603q6P908J346j0861q097l548M813M178J1692J37
13953b438j3680p333J3390K341L721J153p127m803o44j130J4496M335m931q464
$$ plain form
14054 -12918 -17643 -17857 -21034 -20570 -24395 -28906 -30159 -28050 -21330 -17732 -9398 5431 15462 1775
14040 1775 -8740 -19159 -25683 -22852 -22451 -8718 2452 3161 6457 -1695 -2815 -5147 -10340 -12471
14026 -12471 -9727 -12637 -16461 -3610 3670 6230 6722 4988 11024 4178 -81 -4606 -9371 3728
14012 3728 4691 -5818 -14219 -4794 -7794 -18567 -22851 -20246 -19456 -17907 -8360 -2550 -2316 -3850 4266
13997 4266 8581 -3615 -8093 -8636 -10102 -18662 -8489 832 -9851 -10211 -16046 -16288 -16805 -22226 -18167
13982 -18167 -9787 -9562 -5423 -3458 -10541 -15200 -17834 -30320 -21515 -16271 -12207 -1274 3158 -894
13968 -894 -426 5053 -1098 -6317 -9920 -10006 -2098 -752 -11613 -19710 -23258 -18445 -14267 -2575 -2438
13953 -2438 -16118 -23451 -10061 -7720 -3999 -2846 -9973 -14776 -15420 -16550 -2054 2281 -2650 -11114
13939a1114j763O514L957k128N957N322q973p844R282J275o76j0576l718K190
13925a2295k449M336Q263j336o579J2868J0554j0132q449L926J568j08J950L985
13911F102p624o667o3n661R551k930l428J455P219K834K882K298o176l462r74
13896d644J726r13j824n249m388P424L806p118L658J0751j356L913R390r094q11
13881E271J933Q027M345p113l824j343M661M696l950j2923k880m263Q043L444
13867D124K442k862n643j655J1023J028m442k337k449j146O203R611N433m745
13853A4585o370p26J221K278J212P499O56j656j593N081N911N753R83p837q110
13838A8887j319j366K883L846Q604J071N489n00l412K094O438J1812j831j265
$$ plain form
13939 -11114 -12877 -6363 -2406 -4534 1423 6745 -2228 -10072 -790 485 -191 -10767 -14485 -12295
13925 -12295 -14744 -10408 -2145 -3481 -10060 2808 13362 3230 -5219 -1293 275 167 2117 6102
13911 6102 -1522 -8189 -8252 -13913 -4362 -7292 -10720 -9265 -2046 788 3670 5968 -208 -3670 -4644
13896 -4644 -2918 -3831 -5655 -10904 -15292 -7868 -4062 -11180 -7522 3229 1873 5786 15176 6082 5271
13881 5271 7204 15231 19576 12463 8639 7296 11957 16653 12703 -220 -3100 -7363 680 4124
13867 4124 6566 3704 -1939 -3594 7429 8457 4015 1678 -771 -1917 4286 13897 19330 14585
13853 14585 8215 7489 8710 10988 12200 19699 20355 18699 17106 22187 28098 33851 34834 26997 18887
13838 18887 17568 16202 19085 22931 31535 32606 38095 37595 34183 36277 42715 54527 52696 51431
13824E1431l834q152j938R267N187L527R433P498L902R54o505J122J935N484N704
13809H5015m11l008l948j137j997J825P445j690n140K511J0013J6208N199L237
13795A14122L922Q117m122K101l186l175O818O499M336J889R33N982r03R634J736
13780A54703N451O961J3970J2017L901J7382K1640K5892L8042N3145P1796J06089
13768E30989J44165J71344J97991K18687K08477J51144Q6627r6q6023j41596j82136
13757A299573j94806j91029j81463j52682j22905q0927n0841l5836l6572l6579
13747B15933k1634j5948k0221j4320o273j4743m719l343K146j5126o536j1682
13735H3534m779N800k34j0378j7448R213J877q808L847J797m329l529p390q582
$$ plain form
13824 51431 47597 39445 37507 46774 51961 55488 64921 72419 76321 77275 70770 71892 73827 79311 85015
13809 85015 84604 81596 77648 76511 74514 76339 83784 82094 76954 79465 89478 105686 110885 114122
13795 114122 118044 126161 122039 124140 120954 117779 124597 131096 135432 137321 138254 144236 143333 152967 154703
13780 154703 160154 167115 181085 193102 197003 214385 236025 261917 299959 353104 424900 530989
13768 530989 675154 846498 1044489 1263176 1471653 1622797 1709424 1709328 1623305 1481709 1299573
13757 1299573 1104767 913738 732275 579593 456688 375761 324920 289084 252512 215933
13747 215933 194299 178351 158130 143810 137537 122794 118075 114732 116878 101752 95216 83534
13735 83534 78755 84555 84321 73943 56495 65708 67585 58777 62624 64421 60092 56563 49173 40591
13721D0591k334J3939R249j442m931r045j3415o665J0063R484P936Q14l369n513
13707D5362p924j4600K157J6061K690p939j608m897N253K513n603N793O525P02
13693D4485J3458J7140K9376J5556J3240J1810P043r39j4311r492k3233j8016
13681H6117j9073o440L736j0769j3475q787n258l459J86k509N079L400j0754j0250
13667G744J356K843P949m14j4796r284l923L669P465O414l673R092l021o521J656
13652F556p333j21Q857M215N978N4L373k591o390K415l098k284r492N759L20N492
13636A1710M113r018J763q222n601R360j2001J600N945j006j893Q027J226j056
13622D947m311K163J2092M720J526n47m508j3417l274P737J815k957m388J501
$$ plain form
13721 40591 38257 52196 61445 60003 55072 46027 32612 25947 36010 45494 53430 54244 50875 45362
13707 45362 37438 22838 24995 41056 43746 35807 34199 29302 34555 37068 31465 37258 43783 44485
13693 44485 57943 75083 104459 120015 133255 145065 152108 151169 136858 127366 104133 86117
13681 86117 67044 60604 64340 53571 40096 31309 26051 22592 22778 20269 25348 28748 17994 7744
13667 7744 9100 11943 19892 19478 4682 -4602 -8525 -4856 2609 9023 5350 14442 11421 4900 6556
13652 6556 -777 -898 7959 12174 18152 18206 21579 18988 12598 15013 11915 9631 139 5898 6218 11710
13636 11710 15823 6805 8568 346 -5255 4105 -7896 -6296 -351 -1357 -3250 4777 6003 4947
13622 4947 636 2799 14891 19611 21137 20590 16082 2665 -609 7128 8943 5986 1598 3099
13608C099l954q243Q413J0241n168n70O136k388o518J334j538N364j945j369O533
13593I427j419l211j068k658M050j323L222J1395J525j6828j4790J53R027M392
13579A894K531n973O53J3K433j828n11M139p15k168o584k376J0876K050o806Q97
13563a475n770j0743L942J2989l637k078J955O064K580rm41r563m675J908j7j400
13547a0370O721K923M902Q45j205j3799j5419n746R379J3343j712j049m26R248
13533b365P283n042J21M436q961K74n24r826j246K215J932l67R818J0664j320
13518G092n787K983j1346p903O406O806n793m110N120q30o76q06M996J712K527
13503C91l108j0970N345O578L512J648l560m166n80P798N378l314l910j3445n916
$$ plain form
13608 3099 -855 -9098 -685 9556 4388 3818 9954 7566 1048 2382 844 6208 4263 2894 9427
13593 9427 8008 4797 3729 1071 5121 3798 7020 18415 19940 3112 -11678 -11525 -2498 1894
13579 1894 4425 -1548 -895 -882 1551 -277 -788 3351 2636 468 -6116 -8492 2384 4434 -2372 -1475
13563 -1475 -7245 -17988 -14046 -1057 -4694 -6772 -4817 1247 3827 3818 3377 -6186 -10861 -8953 -8970 -10370
13547 -10370 -3649 -726 4176 5021 3816 -9983 -25402 -31148 -21769 -8426 -10138 -11187 -11613 -2365
13533 -2365 4918 -124 -3 4433 -4528 -4254 -4778 -14604 -15850 -13635 -11703 -12070 -2252 8412 7092
13518 7092 1305 4288 -7058 -14961 -8555 -1749 -7542 -11652 -6532 -7362 -8038 -8844 -3848 -2136 391
13503 391 -2717 -13687 -8342 -1764 1748 3396 -164 -4330 -4910 2888 8266 4952 1042 -12403 -18319
13488a8319j644K425J0210O398l978k62K314N982J0483P727q969o602j3311q2
13474g628P396l498L116N053j515n150K837O970K043p302q948j965N379J3730
13460A0518N00n766J368n364m173o115J0637J0600k220j5430j994l530N300N273
13446c96O459L035r056K982N945k915j5972n292m009k925R655M919K860j523L142
13431c091Q923j0136o295r202o49J6463M640k685K77p736J1530J1451q594q604
13417c708M495Q639k063K444L814k156j5366q197N301m657L739O884l342q375
13403a2548J739k527N576L678m883o605n036j2468N258J3760R174N954l028k160
13389d116Q911K663j67Q32J608J471J839l088l062o00k669J1778L027j2505p583
$$ plain form
13488 -18319 -19963 -17538 -7328 -930 -4908 -5170 -2856 3126 13609 21336 12367 5765 -7546 -7628
13474 -7628 -232 -3730 -614 4439 2924 -2226 611 7581 9624 2322 -6626 -8591 -3212 10518
13460 10518 11018 5252 6620 1256 -2917 -9032 1605 12205 9985 -5445 -7439 -10969 -5669 -396
13446 -396 6063 9098 42 3024 8969 6054 -9918 -15210 -19219 -22144 -12489 -7570 -4710 -6233 -3091
13431 -3091 5832 -4304 -10599 -19801 -20450 -3987 653 -2032 -1755 -9491 2039 13490 4896 -3708
13417 -3708 787 9426 7363 9807 13621 11465 -3901 -12098 -6797 -11454 -7715 -831 -4173 -12548
13403 -12548 -10809 -13336 -7760 -4082 -8965 -15570 -20606 -33074 -27816 -14056 -4882 1072 -1956 -4116
13389 -4116 4795 7458 7291 8123 9731 11202 13041 9953 6891 6291 3622 15400 18427 5922 -1661
13374a661L243j0481l500k536Q295R321K372j803q453O957N018O146K720J32j269
13359A4501q162M186m367L228M969j2205m668j589P902r77m509Q071K260j2427
13345c787j0094N009L943J184M529P562M24K594p0j0571j8061j0693N830J2153
13331a0048P370M172P839O207J03J880l943k837n898m508O31J331M534P975K061
13316A6869l641K939J20Q40m322k234Q657k842j867l315p159q391N276J2279N911
13301A9120J984Q97J551j3297k37J664k46k860q862j0501R977N719N445P881m595
13286A3640K409q393k947n941j723J740N044K194l117N585o425M271L384M8l520
13271F249k340Q013L941J903R17l278l953o166k943O906K741n79j252m81N884
$$ plain form
13374 -1661 1582 -8899 -12399 -14935 -6640 2681 5053 3250 -5203 1754 6772 12918 15638 15770 14501
13359 14501 6339 10525 6158 9386 14355 2150 -2518 -4107 3795 2818 -1691 6380 8640 -3787
13345 -3787 -13881 -8872 -4929 -3745 784 8346 8770 11364 11294 723 -17338 -28031 -22201 -10048
13331 -10048 -2678 1494 9333 15540 15643 17523 13580 10743 4845 337 968 2299 6833 14808 16869
13316 16869 13228 16167 16287 17127 12805 10571 19228 16386 14519 11204 4045 -4346 930 13209 19120
13301 19120 21104 22001 23552 10255 10018 11682 11436 8576 -286 -10787 -810 4909 10354 18235 13640
13286 13640 16049 7656 4709 -1232 -2955 -1215 3829 6023 2906 8491 2066 6337 9721 9769 6249
13271 6249 3909 11922 15863 17766 18683 15405 11452 5286 2343 9249 11990 11411 10159 9678 15562
13256A5562O030j14o824j1406o624L895p87j796M259L639Q99l958p67P013N313
13241A4334o284O329L340l57m395j085n150L052M262p018o586o261Q475O269L412
13226A2337q94o139J193l826k104O157K082j681O762J40p101l444l376l185K802
13211b77Q527p284j222N06K783Q192J859p755k487J710O027o084j0156K910O894
13196D143l491o259q50O781R032j0348M128J838j534j2436n59P306m580J183O309
13181F63R644o90q34M109N991M532N865n531n519J323J848m895m012p637j184
13166C673N728K998j26k2K529k172R68j144k711Q3L594l167m02k384K413P46m759
13149E845O858J473L476L111N031k047J443j303l409n144k369R158R843L138q624
$$ plain form
13256 15562 21592 21478 14654 3248 -3376 519 -268 -2064 2195 5834 6733 2775 2008 9021 14334
13241 14334 8050 14379 17719 17362 12967 11882 6732 9784 14046 7028 442 -5819 2656 8925 12337
13226 12337 11443 5304 6497 2671 567 6724 8806 7125 13887 14027 6926 3482 106 -3079 -277
13211 -277 8250 966 -256 250 3033 11225 13084 5329 2842 4552 10579 4495 -5661 -2751 4143
13196 4143 652 -5607 -6457 324 9356 -992 3136 4974 3440 -8996 -9555 -2249 -6829 -5646 663
13181 663 10307 9617 8783 12892 18883 23415 29280 23749 18230 19553 21401 16506 12494 4857 3673
13166 3673 9401 12399 12273 12251 14780 12608 13576 12432 9721 9804 13398 10231 9829 7445 9858 10604 5845
13149 5845 12703 14176 17652 20763 25794 23747 25190 23887 20478 15334 12965 22123 31966 35104 26480
13134B6480j5073J905M485Q634J629q068L011K942m176j3875m333O399M201k020
13120A2141o107M497R833n62K746k342k9M757j914J956Q057n085m511J186L410
13105B8033q5O925k615n735r36j515k487M891R6k343q614j504K864M382J0799
13090C2156O043o707o354k767o238n264J1566J6507L14m398o530O35o46P640o68
13075C5289J663j051q868j485P451l282r66q128Q061Q283P41q911k45M101K113
13060C4766m432k10l555k740n024n218N764K643n76K012K070P852Q395k946k692
13045C6109K142K825N606K992O215R119n43O502N438N034J3683J5417J9740J4549
13031A44828J3488K6182L8298L6553O8750R6935J11742J23213J17707R3150N4416
$$ plain form
13134 26480 11407 13312 17797 26431 28060 19992 23003 25945 21769 7894 3561 9960 14161 12141
13120 12141 6034 10531 20364 19802 22548 20206 20177 24934 23020 24976 33033 27948 23437 24623 28033
13105 28033 27948 34873 32258 26523 25587 24072 21585 26476 26572 24229 15615 14111 16975 21357 32156
13090 32156 38199 31492 25138 22371 16133 10869 22435 38942 39256 34858 28328 28963 28317 35957 35289
13075 35289 36952 35901 27033 25548 32999 29717 28751 20623 28684 36967 37708 28797 28552 32653 34766
13060 34766 30334 30124 26569 23829 18805 13587 19351 21994 21418 23430 25500 33352 41747 38801 36109
13045 36109 38251 41076 46682 49674 55889 65008 64465 70967 76405 81439 95122 110539 130279 144828
13031 144828 158316 184498 222796 259349 328099 425034 536776 659989 777696 870846 925262
13020I25262K6479j3204o4126r3017j06625j13312j07627r8513o5894m9785l9965
13009A99673k7167j2876j5871j7882j2865p56n337j2180j3411j4840n55m269r448
12996E2216k125R52J932l109p734n248M782N133O793k268o779n062Q81Q070K849
12981E1283n468k888L358o561k574j583N421K750n214k760k424k673N279l442
12967C2504O667m554N018J0694N739n414m214n555o784J676L458L346j714j248
12953C9619L671J10j2184l568J1902j642k476J181K070N55J185l210o394M822
12939C5641N890o703p349n265J928J0331P798J664K394k323r368L278R741l473
12925D4184J00j104j551L405J481P17k678j0492j1787p431m860N754O039M776
$$ plain form
13020 925262 951741 938537 874411 781394 674769 561457 453830 355317 289423 239638 199673
13009 199673 172506 159630 143759 125877 113012 112256 106919 94739 81328 66488 65933 61664 52216
12996 52216 50091 51043 52975 49866 42132 36884 41666 46799 53592 51324 44545 39483 40364 48434 51283
12981 51283 45815 42927 46285 39724 37150 35567 40988 43738 38524 35764 33340 30667 35946 32504
12967 32504 39171 34617 39635 50329 56068 50654 46440 40885 34101 35777 39235 42581 40867 39619
12953 39619 43290 43400 31216 27648 39550 37908 35432 36613 38683 39238 40423 37213 30819 35641
12939 35641 41531 34828 27479 22214 24142 34473 42271 43935 46329 44006 34638 37916 47657 44184
12925 44184 44284 43180 41629 45034 46515 47232 44554 34062 22275 14844 9984 15738 21777 26553
12911B6553J0148R202J530k670n098P13M175J09l873P094n995q922J624M332q188
12896C0734M611K0077Q931N14j0459m630l491K259p211K281J8818J0445m663p467
12882F0749k645m798q063L08l73l589J0982M419m904J764m499P475P778N157R682
12867G9443J2764N317R703J2323J1023n36J0431R346J6678K5650K5457L5426J5504
12854B68529M912L381m302k4779l1042j4907j9689j9306j8782j2498k5195j4963
12842I1359j4202k103R451N343k359M497k07o40J302n214k971M898j0995k499
12828G5660K972j5995j537K357r394k015l859J660J655J0595q19n593n712M1L27
12813E0343O12J895M764K708J252j127n49J3o932r04p921p619j5792L352O661
$$ plain form
12911 26553 36701 45903 47433 44763 39665 40378 44553 44662 40789 47883 41888 32966 34590 38922 30734
12896 30734 35345 55422 64353 64867 54408 49778 46287 48546 41335 43616 62434 72879 68216 60749
12882 60749 58104 53306 45243 45551 45178 41589 52571 56990 52086 53850 49351 56826 64604 69761 79443
12867 79443 92207 97524 107227 119550 130573 130037 140468 149814 166492 192142 217599 253025 268529
12854 268529 273441 276822 272520 247741 216699 201792 182103 162797 144015 131517 106322 91359
12842 91359 77157 75054 84505 89848 87489 91986 91779 91139 92441 87227 84256 89154 78159 75660
12828 75660 78632 62637 61100 63457 54063 52048 48189 49849 51504 62099 61280 55687 49975 50016 50343
12813 50343 50955 52850 57614 60322 61574 60447 59898 59911 52979 52075 44154 36535 20743 24095 30756
12798C0756l536J889M21J2109J8730N260P666J0922J0201J0673J1488O037J0481
12785A33097J3649P997J2905L956j890m28M722M8m399j1172L449L870Q283J4033
12771A88120O57K135l12j2364l662M093N805O09K384q658q476j2735L56J475m002
12756A55425k270J0857J4407N82l257L604Q986L718k95J250M359O702k235n887
12742A95946j0769j0463l42Q674J2477M553k976j1076Q406J2090J0570P475K2087
12729B46652R482P508K4767K2186J9576K1698J4756N430l429j1087p733n956r241
12716C34609j0595l554L903m285m881N503p645R090K507j736J89j4306p589Q913
12702C10123M347J5570J0938N745M690P364J1276J8090p59L109N912O541J9662
$$ plain form
12798 30756 27220 29109 29530 41639 60369 65629 73295 84217 94418 105091 116579 122616 133097
12785 133097 146746 154743 167648 171604 169714 169286 174008 174056 169657 158485 161934 165804 174087 188120
12771 188120 188777 190912 190600 178236 174574 178667 184472 185081 187465 178807 170331 157596 157952 159427 155425
12756 155425 153155 164012 178419 179001 175744 179348 188334 192052 191757 193007 197366 204068 201833 195946
12742 195946 185177 174714 174372 183046 195523 200076 197100 186024 194430 206520 217090 224565 246652
12729 246652 256134 263642 288409 310595 330171 351869 366625 372055 368626 357539 349806 343850 334609
12716 334609 324014 320460 324363 320078 315197 320700 313055 322145 324652 322916 323105 308799 301210 310123
12702 310123 314470 330040 340978 346723 351413 358777 370053 388143 387384 390493 396405 402946 422608
12689D22608K135j2780j775O509M346N747o62K639Q977Q674J4751J2460J4201
12676D87830K4236K0470J9994L0794K4213K5302K1268K2526K1118J1482J3336
12665G22569Q434J1986J6699J5958K4901K4339K0465K0817L1423M3552L2744L5082
12653A008969L7788L2331L2691L8670M1515K9132L8422M7551M7527M4875M5126
12642A444597N6868P0595Q0572R5224Q7425J04272J11165J24569J38212J37904
12632B451403J45685J71213J81117K05586K30292K52774K85909L25043L83800
12623D632822M72778N62303P04725Q69798J025039J165359J277812J376831J501805
12614A3589272J657370J885749K290432L043694M255683O196117R143603J3234313
$$ plain form
12689 422608 424743 411963 410188 416697 421043 426790 426128 428767 437744 446418 461169 473629 487830
12676 487830 512066 532536 552530 583324 607537 632839 654107 676633 697751 709233 722569
12665 722569 731003 742989 759688 775646 800547 824886 845351 866168 897591 941143 973887 1008969
12653 1008969 1046757 1079088 1111779 1150449 1191964 1221096 1259518 1307069 1354596 1399471 1444597
12642 1444597 1501465 1572060 1652632 1747856 1835281 1939553 2050718 2175287 2313499 2451403
12632 2451403 2597088 2768301 2949418 3155004 3385296 3638070 3923979 4249022 4632822
12623 4632822 5105600 5667903 6372628 7242426 8267465 9432824 10710636 12087467 13589272
12614 13589272 15246642 17132391 19422823 22466517 26722200 32918317 42061920 55296233
12606E5296233J8003533K1832334K3020369K1565499J8380897J3599111O744535
12599A78442511j803846j0381275j6995071k0523080k1465738k0584637j8292069
12592F8396795j5004919j1364319q089691n623996l983792k947411k281399j910257
12584A7191011j689610j555227j412257j274295j112581r50065p80138o08967
12576G807871m70473l43777k70464k48703k51713k85903l35452l74743l70711
12567D855932l58159l51580l17910k83844k46730k11124j76547j47637j49989
12558B612412j38588j21808j11536j00507r9516q1190p9994q9824o7818o8710
12548A652921p7254q3430n3088n5237n3873m3612m1328n0855n6261m4978k9425
$$ plain form
12606 55296233 73299766 95132100 118152469 139717968 158098865 171697976 178442511
12599 178442511 176638665 166257390 149262319 128739239 107273501 86688864 68396795
12592 68396795 53391876 42027557 33937866 28313870 24330078 21382667 19101268 17191011
12584 17191011 15501401 13946174 12533917 11259622 10147041 9196976 8416838 7807871
12576 7807871 7337398 6993621 6723157 6474454 6222741 5936838 5601386 5226643 4855932
12567 4855932 4497773 4146193 3828283 3544439 3297709 3086585 2910038 2762401 2612412
12558 2612412 2473824 2352016 2240480 2139973 2040457 1959267 1879273 1789449 1721631 1652921
12548 1652921 1575667 1492237 1439149 1383912 1330039 1286427 1245099 1194244 1137983 1093005 1063580
12537A063580l2110k7915l4668m2699m2766k8975k2242k7365k3588k3729j8129
12526G39394j0906j7062j8907k369m171j0311n6n206j0502j7169r457k6678j4968
12513E91632j4460j9953j6768j4661k3395l3973k2670k3130k4103k1841j4073
12502C62605j0777p806P20Q300K462k462j0389k4140j6992r387j7451n570Q239
12489B77352n053j1725o101p558j4923l866K150K887R620R487J736K1991L4075
12476C10072K0779J5953J7078M864N638n820k0451k4786l1922k7873j7055j0827
12464B35650j8998k1922k2521j7233j6474p153L490j3982q952j6880j993N042
12452I8074j869j0568j254k028k505m41j357j981N246n156j3264J354l29j7094
$$ plain form
12537 1063580 1031470 1003555 968887 926188 883422 854447 832205 804840 781252 757523 739394
12526 739394 728488 711426 692519 690150 685979 675668 675612 670406 659904 642735 633278 606600 591632
12513 591632 577172 557219 540451 525790 502395 468422 445752 422622 398519 376678 362605
12502 362605 351828 344022 344742 353042 355504 353042 342653 318513 301521 292134 274683 269113 277352
12489 277352 272299 260574 254473 246915 231992 228126 230276 233163 242783 252270 254006 275997 310072
12476 310072 330851 346804 363882 368746 374384 368564 348113 323327 291405 263532 246477 235650
12464 235650 216652 194730 172209 154976 138502 131349 134839 120857 111905 95025 93032 98074
12452 98074 96205 85637 84383 82355 79850 79409 78052 76071 81317 76161 62897 64251 63922 46828
12438D6828K859L249r991j4933n015j84j2562J90m03o925K227J948p551N110M914
12423I761q916j3270n617j534Q29K741Q141r28Q908K681J5449J7980J3314M605
12409E4144K383R469P708l526L847J1596Q493k956L403p87r119n510o544j5100
12395E7501p948q39o044m891m235m680N8L217K1120L258l995m58r016j299Q527
12380E0276r03k635J679P61j0441Q3L31j828r771p414r116J038N119P355M658
12365B9192m144k57j0626M4J0501P843J1930L153j521j0921J574K445K423o380
12351C5256J400p218j85l612j325R7J1477J951j3905o517J68k392o334p26n782
12336B353N198L154o98k073J1302J8919J009l932J3059K2640K5852L6586N2329
$$ plain form
12438 46828 49687 52936 42945 28012 22997 22813 10251 10441 10038 3113 5340 7288 -263 4847 9761
12423 9761 845 -12425 -18042 -19576 -18747 -16006 -7865 -8793 115 2796 18245 36225 49539 54144
12409 54144 56527 65996 73704 70178 74025 85621 94114 91158 94561 93774 84655 79145 72601 57501
12395 57501 49553 48714 42670 37779 33544 28864 28922 32139 53259 56517 52522 52064 43048 41749 50276
12380 50276 49373 46738 48417 49178 38737 38820 39151 37323 27552 20138 11022 12060 17179 24534 29192
12365 29192 25048 24791 14165 14209 24710 32553 44483 47636 46115 35194 36768 39213 41636 35256
12351 35256 36656 29438 29253 25641 24316 24413 35890 37841 23936 17419 17587 15195 8861 8135 2353
12336 2353 7551 10705 10007 7934 19236 38155 39164 35232 48291 70931 96783 133369 185698
12323A85698P5823M5761P337m9847o8588o4005m3726k8467j6852R84N630R25o756
12310D3917j3651q824O097Q985m57o827n380P343M49J3844o995j6231j2489o332
12296C449J468n578n636n616J2050J6718J9196J9315J1542P477J9936K2913K3158
12283A40392K8899N6597J00057J42788J96518J89360P1507p1238j83110k05681
12273D66089j40324r8332n7080l6745r865j4972k0765L178o582k1287j3146r03
12261D9266l881j1128o157j998J275M485J5753L758m450j689k604m6J424N65L849
12246D8422M394N452P491J4533J1781J1655J9852L4583M9508Q0414J39797J86960
12234F14842K05989J25351j7645j38533k05681j82664j14184o1856k5640l0856
$$ plain form
12323 185698 261521 307282 314619 264772 196184 132179 88453 59986 43134 44118 49748 50673 43917
12310 43917 30266 21442 27539 36524 36067 29240 23860 31203 31652 45496 38501 22270 9781 3449
12296 3449 4917 -661 -6297 -11913 137 16855 36051 55366 66908 74385 94321 117234 140392
12283 140392 169291 225888 325945 468733 665251 854611 926118 854880 671770 466089
12273 466089 325765 227433 170353 133608 123743 108771 88006 91184 84602 63315 50169 49266
12261 49266 45385 34257 28100 26102 27377 31862 47615 51373 46923 45234 42630 42584 44008 44573 48422
12246 48422 52816 58268 65759 80292 92073 103728 123580 158163 207671 288085 427882 614842
12234 614842 820831 946182 928537 790004 584323 401659 287475 225619 199979 169123
12224A69123l2202k0882j6866j1340r885O135J4156N623j4589o855l902O786j5587
12211F9715n263l517J591j1501j3286L970r622k126J924p522R33L373J8253K3074
12197F9996Q223P524J5556K3433K7565M2529O2827P5001O7082K5620k7633o1601
12185C36122n5794k9181M655K6196M4723Q8914J02907J09212R0588R7548Q3086
12174H98976M6834m750n2655r2594r9908j01748j10566r2252p9996o9149m6941
12163A95251l2164k5203j2142j5861j7774j4258n300l473j0894J180K647K723
12151F4732q16j4605L492p259M041J443M57K159j1287p87n48j4190j2972q092
12137E768N57n032m503M794l982q28r03K858m604k989O784j313K748L815k666
$$ plain form
12224 169123 136921 116039 99173 87833 77948 84083 98239 103862 89273 82418 78516 85302 69715
12211 69715 64452 60935 62526 51025 37739 41709 32087 29961 31885 24363 25296 28669 46922 69996
12197 69996 78219 85743 101299 124732 152297 194826 257653 332654 399736 425356 397723 336122
12185 336122 280328 251147 255802 281998 326721 415635 518542 627754 718342 815890 898976
12174 898976 945810 941060 888405 795811 695903 594155 483589 391337 311341 242192 195251
12163 195251 163087 137884 125742 109881 92107 77849 72549 69076 58182 59362 62009 64732
12151 64732 63916 49311 52803 45544 49585 51028 51485 53644 42357 41570 41022 26832 13860 5768
12137 5768 6325 1293 -3210 1584 -2398 -3226 -4129 -1271 -5875 -8864 -2080 -3393 -645 3170 504
12122E04j76q95K492N653k692N95n175O471J4587j569k075j128j0132M171L661
12107A4292l556J0357Q246O776L953P61K807J0297P262J354J018J2872K0000K1433
12093A17872K0616J5383P607K1763L0756M6777P8532R3026J15203J47464J61868
12082H56867J60557J44779J04752N4298j3112o8351j19120j48835j49982j53915
12072F67938j47246j12269q7945p1536m8073k7199k9023k3950k846j452j9430
12061I6969j1211q899j5729r199j1044r991M825n078r242P281J3694q499p557
12048B6320L487N013r172l134K949j753j898J658j7770k425J0906J251l454m359
12034G619n488o538p814k977K100J940l829O906J0868K365K226m53j11J794Q577
$$ plain form
12122 504 328 -567 1925 7578 4886 5481 306 6777 21364 19795 17720 16592 6460 10631 14292
12107 14292 10736 21093 29339 36115 40068 40829 43636 53933 61195 62549 63567 76439 96439 117872
12093 117872 138488 153871 161478 183241 213997 260774 339306 432332 547535 694999 856867
12082 856867 1017424 1162203 1266955 1321253 1308141 1239790 1120670 971835 821853 667938
12072 667938 520692 408423 320478 248942 200869 173670 144647 120697 117851 116399 96969
12061 96969 85758 76859 61130 51931 40887 30896 35721 30643 21401 28682 42376 33877 26320
12048 26320 29807 34820 25648 22514 25463 23710 21812 23470 5700 3275 14181 15432 11978 7619
12034 7619 2131 -4407 -12221 -15198 -13098 -11158 -14987 -8081 2787 5152 7378 6925 6814 8608 17185
12019A7185p903K436l656K1184K3833K0480M0675M5958O1159P0192L5881k1531
12007C05893o5302p0374o4181k6250q281k3502j4782j2212l941r02m078j1620
11995D68o800R655R890q568o905k48l608o434k709Q425J1003o933k01M403K122
11980C560L898R331l332j1082o586O820K745q035j0203j056R380M385j605j712
11966c492O617K086m001j507M340M85k280J0327L082j86L4k488p014n710O006
11951F299J4152q803r498m884K731j981o405n25J1332k403j3952p324K546m440
11937b3155P650P597p09M872O856l683r049R073J653o580K455j889L185M43k322
11922c603Q700L759l120l036j640L711N787k840r18O62J051k522p629n092n470
$$ plain form
12019 17185 9282 11718 8062 29246 53079 73559 114234 160192 221351 291543 327424 305893
12007 305893 240591 170217 106036 79786 71505 48003 33221 21009 17068 16166 12088 468
11995 468 -6332 3323 13213 4645 -2260 -2508 -6116 -12550 -15259 -6834 4169 -2764 -2965 1438 3560
11980 3560 7458 16789 13457 2375 -4211 2609 5354 -2681 -12884 -13940 -4560 -175 -1780 -3492
11966 -3492 3125 5211 1210 -297 4043 4528 2248 12575 15657 15471 15505 13017 6003 293 6299
11951 6299 20451 11648 2150 -2734 -3 -1984 -8389 -8914 2418 15 -13937 -21261 -18715 -23155
11937 -23155 -15505 -7908 -8617 -3745 3111 -572 -9621 -548 1105 -5475 -3020 -4909 -1724 -1281 -3603
11922 -3603 5097 8856 5736 2700 1060 4771 10558 7718 6800 7462 8513 5991 -1638 -6730 -12200
11907a2200j388N751O282j81k069r959m099k218j427R980L385N239q08R66j266
11892d012q502l202J207o693P676o24J2580O372m745O87Q06q36M652l245J006
11877C127N609J2803J0371j3571j2099N411O194j576o834k914M39p927m915J448
11863d434k1j0980K702J342N601J44m466M659k396K623n267J321L88L1J818P605
11847F70l339o418p48J0909K902l713M268N954j4766l539r1r482J0207M997n350
11832g539k139L190R615l36k820J2111k905j4390j1031P661l24P03p23J915K816
11817d196j075J410l281N542P679k305l443M333J480n000r19p076J942O70N51
11802c688R414j942o384l65k905j2081r173M663m042O989Q022N306O778O34R38
$$ plain form
11907 -12200 -13588 -7837 -1555 -1736 -3805 -13764 -17863 -20081 -21508 -11528 -8143 -2904 -3712 -2746 -4012
11892 -4012 -12514 -15716 -14509 -21202 -13526 -14150 -1570 4802 57 744 1550 714 5366 2121 3127
11877 3127 8736 21539 31910 18339 6240 11651 17845 16269 9435 6521 6960 -967 -5882 -4434
11863 -4434 -4455 -15435 -12733 -11391 -5790 -5646 -10112 -5453 -7849 -5226 -10493 -9172 -8784 -8753 -6935 670
11847 670 -2669 -9087 -9835 1074 3976 263 4531 10485 -4281 -7820 -7911 -17393 -7186 -2189 -7539
11832 -7539 -9678 -6488 3127 2791 -29 12082 9177 -5213 -16244 -8583 -8907 -8204 -8927 -7012 -4196
11817 -4196 -5271 -3861 -7142 -1600 6079 3774 331 4664 6144 1144 225 -6851 -4909 -4239 -3688
11802 -3688 5726 3784 -2600 -2965 -5870 -17951 -27124 -22461 -26503 -19514 -11492 -6186 592 1226 2164
11787B164l295n644j294J0402j050n611k652o135k828N702M181p213M705O980
11773a588K667k999m725M477M294j430k849k326J062R577j557j633r427j675k649
11758a0781k001k840M846K567O14L551L010L466J013R120k977j1094j1532n481
11744a8519K562J1315P49n770q25M623K494R78N391O304p161K857m061K86L883
11729E106j429q811Q471J419k109j142K799q59L8q236M944L399k434k253J243
11714A46K869Q957N471Q153n280o045o652m397r939j2730K383J2118J0651J042
11700F747O1l14k010k567m40P531N589J0699m610p847k217r824k732J970j6076
11685a6040k693J3347J22j036M435L506l51p007r53M221N342J199j626M43j0212
$$ plain form
11787 2164 -1131 -6775 -8069 2333 1283 -4328 -6980 -13115 -15943 -10241 -6060 -13273 -8568 -1588
11773 -1588 1079 -1920 -6645 -2168 2126 696 -2153 -4479 -3417 6160 4603 2970 -6457 -8132 -10781
11758 -10781 -12782 -15622 -10776 -8209 -7595 -4044 -1034 2432 3445 12565 9588 -1506 -13038 -18519
11744 -18519 -15957 -4642 -3893 -9663 -10488 -5865 -3371 -2393 2998 9302 2141 4998 937 1223 5106
11729 5106 3677 -5134 3337 4756 2647 1505 4304 3445 3483 -4753 191 3590 1156 -1097 146
11714 146 3015 11972 17443 25596 20316 14271 7619 3222 -6717 -19447 -17064 -4946 5705 6747
11700 6747 6808 6494 4484 1917 1477 9008 14597 25296 20686 12839 10622 798 -1934 36 -16040
11685 -16040 -18733 -5386 -5264 -6300 -1865 1641 1290 -5717 -6670 -2449 2893 4092 2466 2909 -7303
11670g303o144O406j243n754j778J3889O173j6167o333M451J1411R779j934l449
11656B004l077L608O231j909M434j752M106M183M642L251q086j3297n779L102
11642A661J479j519j272l275j791Q052L998r353n338L357n586m938M192J051j56
11627i438M70O23M077K518K659O31m667P24O283n029p980Q57R956K021q14j890
11611A001j256J105O262J925N129k688n724o90O580m438j4662k145Q548K025l690
11596b718o251p529N953O893J33o53P851l394o938r706N895J5926M966l718j724
11581D986J2198K509k416q114p176o664k568J959J2380K3o656Q1N313Q446Q97
11566A5198k800N904p357o028p10M10j0403n875O558O235r319L421M614P253p669
$$ plain form
11670 -7303 -13447 -7041 -8284 -14038 -15816 -1927 4246 -11921 -18254 -13803 -2392 7387 5453 2004
11656 2004 -1073 2535 8766 6857 11291 9539 13645 17828 22470 25721 17635 4338 -1441 1661
11642 1661 3140 1621 349 -2926 -4717 3335 7333 -2020 -7358 -4001 -9587 -14525 -10333 -9282 -9438
11627 -9438 -8968 -8345 -4268 -1750 909 1540 -3127 -2403 3880 -1149 -9129 -8272 1684 3705 2891 1001
11611 1001 -255 850 7112 9037 14166 11478 5754 5064 11644 7206 -7456 -9601 -1053 972 -2718
11596 -2718 -8969 -16498 -10545 -3652 -3519 -4172 3679 285 -6653 -16359 -10464 5462 10428 6710 4986
11581 4986 17184 19693 17277 9163 1987 -4677 -7245 -5286 7094 7117 461 542 5855 14301 15198
11566 15198 12398 18302 10945 4917 4207 4617 -5786 -11661 -5103 1132 -8187 -4766 -152 7101 -568
11551e68k605p215Q329m045l447J1336J1695L114j0465k580p220L828J671M806
11537F634J527j601l153k236r765M620m218m488K984J2325R086K49k977J016p741
11522B262p804l029r469J2057J1466K966r932k980L898O724K496n04l891r432
11508e172l041l385j394Q845R227J582l059j0394o052M212L193N767m288j0213
11494a4172m466Q0L803O005n92J459K993n202N683L996J212j592N854K433M744
11479A2238O736Q93k582o785q239k386q791J058N863K109J506n28j919j16M864
11464C921q12o584j3895O102P493K894k699o673j668Q093K035r007K978J1996
11450D174Q617k204o180p366P056O17n976Q779R83J136j025L98J434R47p329m085
$$ plain form
11551 -568 -3173 -10388 -2059 -6104 -9551 1785 13480 16594 6129 3549 -3671 157 1828 6634
11537 6634 8161 6560 3407 1171 -8594 -3974 -8192 -12680 -9696 2629 11715 11964 8987 10003 2262
11522 2262 -5542 -8571 -18040 -5983 5483 8449 -1483 -4463 -565 6159 8655 8151 4260 -5172
11508 -5172 -8213 -11598 -12992 -4147 5080 6662 3603 -6791 -12843 -8631 -5438 329 -3959 -14172
11494 -14172 -18638 -18558 -14755 -8750 -9342 -7883 -4890 -10092 -4409 -413 799 -793 5061 7494 12238
11479 12238 18974 19867 17285 10500 2261 -125 -8916 -7858 -1995 114 1620 1092 -827 -943 3921
11464 3921 3109 -3475 -17370 -11268 -3775 -881 -3580 -10253 -11921 -3828 -1793 -10800 -7822 4174
11450 4174 12791 10587 4407 -2959 4097 4714 -1262 7517 8500 9636 8611 9009 10443 11390 4061 -24
11434b4N729J813o002K518Q969j445j470n51K86M738N694p213o492k92K555J113
11418I926m341K945m535q914L468O628l37J327o295O403Q106o322R36k560N100
11403A1535K256l746l898m138l455j788L03J360J0239K609r170N045k311j92K834
11388G483o186l688O554Q688K860m431m086k432k101p75N497L981M519J436n288
11373A2031p532L780R379l641n832o374n02K097o115l327M505R373N014J053o125
11358G784j842J891j723K347N313N241N390J509m319N598P704j4879K746J961
11344B4721L975R93o822p819o442j332P389j187k044L818M502n913P103Ro874
11329A4077q842l421K718M406K091q74M34k486P153J8113j0937l090M047Q25p251
$$ plain form
11434 -24 5705 7518 1516 4034 13003 11558 10088 9537 9823 14561 20255 13042 6550 6258 8813 9926
11418 9926 5585 8530 3995 -4919 -1451 5177 4840 6167 -128 6275 14381 8059 8995 6435 11535
11403 11535 13791 10045 6147 2009 -1446 -3234 -2931 -1571 8668 11277 2107 7152 4841 4649 7483
11388 7483 1297 -2391 4163 12851 15711 11280 7194 4762 2661 1886 7383 11364 15883 17319 12031
11373 12031 4499 8279 17658 14017 8185 1811 1309 3406 -2709 -6036 -1531 7842 12856 13909 7784
11358 7784 5942 7833 6110 8457 13770 19011 24401 25910 21591 27189 34893 20014 22760 24721
11344 24721 28696 29689 22867 15048 8606 7274 14663 13476 11432 15250 19752 13839 20942 20951 14077
11329 14077 5235 1814 4532 8938 11029 10155 10589 8103 15256 33369 22432 19342 23389 24214 16963
11314A6963n290O264n346o769J7502j5967j002R965L247l121l764N333P690N30
11300B6235j0671l964M171J2354l769r426J441J2821K044J290L140M094j1764
11287B7996n941l073k59l318O469O835r17Q69N088k577m878m361o24J217N41N46
11271B3613L126L686m011m296n732M312J1620M650L25L316r267m443O32N531J249
11256C4311l174J1944o592l414k012K357M682j9274N54K534k304k673J2134M697
11242C3770l761j983J5244J3968J952J055j793r285N545m323J601J1066j62L269
11228F6163N848m771J2664L478P647o810j1038l172k708j2398M415J3516O544
11215G9378O04m166j0104P506L829Q44M143k251j082K627J2703J4523O354P861
$$ plain form
11314 16963 11673 17937 12591 5822 23324 7357 6355 16320 19567 16446 12682 18015 25705 26235
11300 26235 15564 11600 15771 28125 24356 14930 16371 29192 31236 32526 35666 39760 27996
11287 27996 22055 18982 18723 15405 21874 28709 27792 28661 33749 31172 26294 21933 21309 22526 23067 23613
11271 23613 26739 30425 26414 22118 16386 20698 32318 36968 37293 40609 31342 26899 27531 33062 34311
11256 34311 31137 43081 36489 33075 31063 33420 38102 18828 19382 21916 19612 16939 29073 33770
11242 33770 30009 28026 43270 57238 59190 60245 58452 49167 54712 50389 51990 63056 62894 66163
11228 66163 72011 67240 79904 83382 91029 84219 73181 70009 67301 54903 59318 72834 79378
11215 79378 79982 75816 65712 73218 77047 77891 82034 79783 78701 81328 94031 108554 114908 122769
11201A22769j812k332j3276J181J0393Q880K722M066K346K905O751Q97n171p9
11187A40240N127m41k917L119M300M771J0064K429k979M012Q84R17q207J3N952
11172A67284P109M88o27Q68l603m755J280O571K58l866R265n142l724J218k202
11157A70422J23j0403n154J1900P788J136m149q414r690p072j2253l281M768L358
11143A39079J592M578O115n357n069n819J45J091k187j937l946J872Q575J9656
11129A58388K531j7217k797J392K321Q26r563r392n353o663q029q756j285M025
11115A00428l513R670N754K927k305p484l783k543k973j0211k316j410n352N991
11101H2880J092j07o634J319l223l021J433M487m236P92K727n42j028J218P07
$$ plain form
11201 122769 120957 118625 105349 106530 116923 125803 128525 132591 134937 137842 144593 145490 140319 140240
11187 140240 145367 144926 142009 145128 149428 154199 164263 166692 163713 167725 168609 169526 161319 161332 167284
11172 167284 174393 174881 174254 175122 171519 166764 168044 174615 174873 171007 180272 175130 171406 172624 170422
11157 170422 170545 160142 154988 166888 174676 175812 171663 163249 153559 146487 134234 130953 135721 139079
11143 139079 140671 145249 151364 146007 140938 135119 135264 136355 134168 132231 128285 130157 138732 158388
11129 158388 160919 143702 140905 142297 144618 145444 135881 126489 121136 114473 106444 97688 96403 100428
11115 100428 96915 106585 112339 115266 112961 105477 101694 99151 96178 85967 83651 82241 76889 82880
11101 82880 83972 83865 77231 78550 75327 72306 73739 78226 73990 74782 77509 76967 75939 77157 77864
11086G7864J7410O689o195j3426j5467L191P668Q474N176q844m137k673R906k533
11072H3103j8640l510R266R092l077k119L283Q701n702j0527l947N27P579M038
11058G8067o228n060M671P693n967r130p507M199J2070J4303M025o548l145O414
11044H7857J9307K5249J2827J3432J1958m219j1268j4677k0339j1983j4661j4895
11032G8588j0375n415N015k614J818m972n579j791L039O795J2992J606l288L095
11018G8914J3864J75L018L159J2068J5713R732O142L517j2981o136j4692j5240
11005I7253k168o356l166K363J420L439l832P028J2416M703m512j8592j2242m491
10991G3263k0848j7925r464L216L422M708K36N049R442J4337J641N385K004P248
$$ plain form
11086 77864 95274 101963 95768 82342 66875 70066 77734 86208 91384 82540 78403 75730 85636 83103
11072 83103 64463 60953 70219 79311 76234 74115 77398 86099 80397 69870 65923 66450 74029 78067
11058 78067 71839 66779 71450 79143 73176 64046 56539 60738 72808 87111 91136 84588 81443 87857
11044 87857 107164 132413 145240 158672 170630 166411 155143 140466 120127 108144 93483 78588
11032 78588 68213 62798 67813 65199 67017 62045 56466 54675 57714 64509 77501 79107 75819 78914
11018 78914 92778 92953 95971 99130 111198 126911 136643 142785 146302 133321 127185 112493 97253
11005 97253 95085 88729 85563 87926 89346 92785 88953 95981 108397 113100 108588 89996 77754 73263
10991 73263 52415 34490 25026 28242 31664 36372 36608 41657 51099 65436 67077 72462 74466 81714
10977H1714K510k5m23K258k283P994L266O767J1021M648J4806Q688Q3P653J4504
10962A63181K6657K4996L4319M4843O9509R7598J44902K08385L15794M20367L99301
10951A949852K05226q1172l30727m33134l63639k49398j66503j14888o6526m3360
10941C05731m1706l4871k8160j8648j8549m622K500L25o722n997j6486j7856k5130
10928H9809n454l076o48j367K985n122m173K534j117n926j1402K292n334m698
10914D9303M567J2536R445l965j956J2789L866m514k726L830L736m84q433k533
10900G5461N184M824K204m461j99N103R800N029O536R77j5865j0420q846K599
10886G7926O168j1225m864l913m62r105j0691L267R082J179j7j68p014j128M4
$$ plain form
10977 81714 84224 84199 83776 86034 83751 91745 95011 101778 112799 117447 132253 140941 141024 148677 163181
10962 163181 189838 214834 249153 293996 363505 461103 606005 814390 1130184 1550551 1949852
10951 1949852 2155078 2073906 1743179 1310045 946406 697008 530505 415617 349091 305731
10941 305731 264025 229154 200994 182346 163797 159175 161675 162000 155278 149281 132795 114939 89809
10928 89809 84355 81279 80631 79264 82249 77127 72954 75488 74371 68445 57043 59335 54001 49303
10914 49303 53870 66406 75851 71886 69930 82719 86585 82071 79345 83175 86911 86427 77994 75461
10900 75461 80645 85469 87673 83212 83013 88116 97916 102945 109481 110458 94593 84173 75327 77926
10886 77926 84094 72869 68005 64092 63630 54525 43834 47101 56183 57362 57345 57177 50163 49035 49079
10871D9079J5783Q299j879n838P598O405n605p093J581J3589J4914l446j3483
10858G9904j731M55m091m742o741j24q905p417r305K44N125q732N243J578L171
10843D3932J0638J4218J0929J6325J7176J5884K868k2371l0969k1175j2815r41
10831D3699P137R50J0154M885k008K66P571m135j317l699O501P956o72L528K254
10816H3070L869r91L593k24m775m487l759n04o338k180Q919J2673M108m201r70
10801H7803J067R081J3727J7015K2902J3662J6178q626R439K2060K4801L6407
10789B65516O0784P3508Q8073O0139j961m8531p9257q2935n8379m2536l4634k2558
10777A77229j5125j5940r146j1799q294J084J1475J6012N59l559m617J200N224
$$ plain form
10871 49079 64862 73161 71282 65444 73042 79447 73842 66749 68330 81919 96833 93387 79904
10858 79904 78173 78628 74537 69795 63054 62930 54025 46608 37303 37547 42672 33940 39183 40761 43932
10843 43932 54570 68788 79717 96042 113218 129102 131970 109599 78630 57455 44640 43699
10831 43699 50836 51786 61940 66825 64817 65083 72654 68519 67202 63503 70004 77960 77288 80816 83070
10816 83070 86939 85948 89541 89317 84542 80055 76296 75792 69454 67274 76193 88866 92974 88773 87803
10801 87803 88870 97951 111678 128693 151595 165257 181435 172809 182248 204308 229109 265516
10789 265516 326300 399808 487881 548020 546059 497528 418271 335336 276957 234421 199787 177229
10777 177229 162104 146164 137018 125219 116925 118009 129484 145496 146055 142496 137879 139079 144303
10764A44303j589K657M036m950r792j4459j4005j1434j4405k2859q710l167J1000
10751E6626N580Q759J4512R704J1968M502J123p271n049p488n90M962J4687R313
10737A21338k098j2791k4900k8745k4678p87J0525J4797J7505K0854J3811J2646
10725A17477P103l156l499K063J1319M0352M6925L4481J9066J237q710R371R822
10712B83851l010q280m964l760l101L782M723N555M010jM376K764O075O619L672
10697C02311l181j3568j4942q065K611n3j2932p500n848l739J638Q532J5904Q971
10683B70139J6306J9806J0914R83m049j4527r625P567Q050l026r747l307l615
10670B85869n94Q217J7913O386j1201l957J401q12L139J5797O1342R8124Q3265
$$ plain form
10764 144303 142714 145371 149407 144457 134665 120206 106201 94767 80362 57503 48793 45626 56626
10751 56626 62206 70965 85477 95181 107149 111651 112774 105503 100454 92966 92376 97338 112025 121338
10737 121338 119240 106449 81549 52804 28126 27339 37864 52661 70166 91020 104831 117477
10725 117477 124580 121424 117925 119988 131307 171659 218584 253065 272131 273368 264658 274029 283851
10712 283851 280841 272561 267597 263837 260736 264518 269241 274796 278806 278805 283181 285945 292020 298639 302311
10697 302311 299130 285562 270620 262555 265166 265113 252181 244681 238833 235094 236732 245264 261168 270139
10683 270139 286445 306251 317165 318148 314099 299572 289947 297514 305564 302538 292791 289484 285869
10670 285869 285275 293492 311405 317791 306590 302633 304034 303222 306361 322158 383500 481624 564889
10657E64889O6504M5387L05m8012n6289m4160k8779j2442L664M573Q63L614Q392
10644E08509k59j285j4756k3565j5639k387M515N068P609R667Q117R166J4177
10631E08937J1714J4909K4958K7283K0558J2508j869k900J0442O609R629J6289
10619F59067k67M353k265L173j963K212P372P487K4242K4818J6428K5377L4699
10606H04733M4559M4518M0491L0952K2686K3598K6926K0357K4861J9083J6404
10595A119168K0032L7808M6527L7164L3185K9587K9341K4293M4307M2344N0155
10584A513911N3841N8692O4814M5567N0897P0586Q8029R8882Q5390P2129P5159
10573B277897J03786J17022J15336J35335J66967J69640J86756J98393K04815
$$ plain form
10657 564889 631393 676780 677085 629073 572784 528624 499845 487403 491067 495640 496503 500117 508509
10644 508509 508250 506965 492209 468644 453005 450618 455133 460201 467810 477477 485594 494760 508937
10631 508937 520651 535560 560518 587801 608359 620867 618998 616098 626540 633149 642778 659067
10619 659067 658800 663153 660888 664061 662098 664310 671682 679169 703411 728229 744657 770034 804733
10606 804733 849292 893810 934301 965253 987939 1011537 1038463 1058820 1083681 1102764 1119168
10595 1119168 1139200 1177008 1223535 1260699 1293884 1323471 1352812 1377105 1421412 1463756 1513911
10584 1513911 1567752 1626444 1691258 1736825 1787722 1858308 1946337 2045219 2130609 2202738 2277897
10573 2277897 2381683 2498705 2614041 2749376 2916343 3085983 3272739 3471132 3675947
10564C675947K13827K28293K53593K75728L20544L73008M17734M61257N13864
10555F733795N84726P04422Q88466J102994J283185J298362J201579J136619J210996
10546A6145144J544332K075857K794509L780678N079891O935083R723597J4003988
10538F2083079K0652684L1101022M7210372O8711349Q4984962P0646947K0319824
10531D05710239l4240147p4594412q2370585o2976734m1027775k6131651j7469233
10524F6899702j2577803r562313p402856n747401m457402l442476k632394j968263
10516A9108794j453438j216818j224260j327975j385949j284924j108186r26064
10508I181180p71128o31071n37433m59320m14797l83114l56366l07251k88026
$$ plain form
10564 3675947 3889774 4118067 4371660 4647388 4967932 5340940 5758674 6219931 6733795
10555 6733795 7318521 8022943 8911409 10014403 11297588 12595950 13797529 14934148 16145144
10546 16145144 17689476 19765333 22559842 26340520 31420411 38355494 48079091 62083079
10538 62083079 82735763 113836785 161047157 229758506 314743468 385390415 405710239
10531 405710239 371470092 296875680 214505095 151528361 110500586 84368935 66899702
10524 66899702 54321899 44759586 37356730 31609329 27151927 23709451 21077057 19108794
10516 19108794 17655356 16438538 15214278 13886303 12500354 11215430 10107244 9181180
10508 9181180 8410052 7778981 7241548 6782228 6367431 5984317 5627951 5320700 5032674
10499E032674k73792k42836k12780j78915j54029j48404j51042j56184j52195
10490C362497j28074j22311j20704j25179j16523j13010j01884q2865q3370q9405
10480B279172q5177q3188q1710p6046p2983o8660p2682o6906o0957l9901n2622
10469A518340n5431n5933o1876n6629n5300n1196l0106k7105k6565k4216j3898
10458A060085m247j1844j8701j7302j5837k9010k3855l5467l8333m2783k5521
10447G97185l8158k1224j6864k4297l1429m0197l0417j2381j2439k4805j4599
10436E30375m893l469Q653l310j1934j6635p112q665j1922j4980p636j9451k7878
10423D01143k0346j8735k5216j9491j0454R275R401p92J0181J2767R123m056K624
$$ plain form
10499 5032674 4758882 4516046 4303266 4124351 3970322 3821918 3670876 3514692 3362497
10490 3362497 3234423 3112112 2991408 2866229 2749706 2636696 2534812 2451947 2368577 2279172
10480 2279172 2193995 2110807 2029097 1953051 1880068 1811408 1738726 1671820 1610863 1570962 1518340
10469 1518340 1462909 1406976 1345100 1288471 1233171 1181975 1151869 1124764 1098199 1073983 1060085
10458 1060085 1055838 1043994 1025293 1007991 992154 963144 939289 903822 865489 822706 797185
10447 797185 759027 737803 720939 696642 665213 625016 594599 582218 569779 544974 530375
10436 530375 525482 522013 530666 527356 515422 498787 491675 483010 471088 456108 448472 429021 401143
10423 401143 380797 362062 336846 317355 306901 316176 325577 324785 334966 347733 356856 352800 355424
10410C55424K2012L0469N5365R1906J07609O7762r923q2000r8134p8669o2971
10399C98850n2526k9883k2805j4654o546j2197j3853j6507k8365p869n589j6623
10387A71433k0395j9302q313j2227j4085Q86j264R864J4151J3976p067m876J2379
10374A35160n63k3659j5134j4577k1160j3860r749p647o222L59J4413Q592J6722
10361F2675M808L98J4677J5180J4155R838R306k06o148q501j0839j7994k8416
10348E8933k1438L960J2827J9962J9347J1761M248K432k498o513j838K0542K5039
10335A46764J6519O864J4622j755k7427k1469j3876l3868j9175n699N111J3605
10323H0216J934o544J349p843q394P73J0133J1575M927J1497J2711N520j744q022
$$ plain form
10410 355424 377436 407905 463270 555176 662785 730547 720624 638624 540490 461821 398850
10399 398850 346324 316441 293636 278982 272436 260239 246386 229879 201514 193645 188056 171433
10387 171433 151038 131736 123423 111196 97111 97997 96733 106597 120748 134724 127657 122781 135160
10374 135160 134597 110938 95804 81227 60067 46207 36458 28811 22589 22948 37361 45953 62675
10361 62675 67483 67881 82558 97738 111893 121731 131037 130831 124683 116182 105343 87349 58933
10348 58933 37495 41455 54282 74244 93591 105352 109600 112032 109534 103021 101183 121725 146764
10335 146764 163283 170147 184769 183014 155587 134118 120242 86374 67199 61500 66611 80216
10323 80216 82150 75606 76955 69112 60718 61491 71624 83199 88126 99623 112334 117854 116110 108088
10309A08088j5810j4002k1372j8250J59q84j2187k775o27N946N711p809m390j016
10295B0782l281j0502l85J5048O257n84r799J553O403O841M742O990j655J1155
10281E3565O375j414m779j2932j1771n03o269l089j672l215p794j0493m082m494
10267a2567l118L774K264J2536R120M837O359p712l275J870O894Q787K860q93
10253C1736o829m560m490J22N179J03M032O946O895J486k266l630k82k506L527
10238C5463P445M630J2023J0558J0464j469j0694p055o220j1096j2267L426K124
10225C7332j705J5914K386J5279K0099J9567J2665J1948M723J6242J4503J5495
10213A84448J6881J5648J4603K1863K3439K4640K7623L1623O1681Q4547J09998
$$ plain form
10309 108088 92278 78276 56904 38654 38813 37929 25742 22967 22340 28286 33997 26188 21798 20782
10295 20782 17501 6999 6614 21662 27919 27335 17536 19089 25492 32333 37075 44065 42410 53565
10281 53565 59940 58526 53747 40815 29044 28541 22272 19183 17511 14296 6502 -3991 -8073 -12567
10267 -12567 -15685 -11911 -9647 2889 12009 16846 23205 15493 12218 14088 20982 29769 32629 31736
10253 31736 24907 20347 15857 15979 21158 21261 25293 32239 39134 40620 38354 34724 34442 31936 35463
10238 35463 42908 47538 59561 70119 80583 79114 68420 61365 55145 44049 31782 35208 37332
10225 37332 35627 51541 53927 69206 89305 108872 121537 133485 138208 154450 168953 184448
10213 184448 201329 216977 231580 253443 276882 301522 329145 360768 422449 506996 616994
10202F16994J56273K36227L47859M98329P17370R75020J094252Q61153K44495
10193E747972m51703r53155j073349q93227o24933m13902k61319j80961j49157
10184G46266j26916r3912o2825n7068n0353k7856k3903l5592k4646k4459k9485
10173A89251j8506p539j4807j4018j8265j4421l350N307j342j6975l358m064j1472
10160F6441q174n963R03k573N594K282j220k118k212L64L419M046K614L041m784
10145F1660m075p819M3m471n680J2295M280j0513k07P027m699N284J251J988P413
10130F3777l72J414K3462J1907K295P57j0639O36J6323Q051Q266J6051K7068K4415
10116A93411L2751N1779P4519J14260J60043K51703L65934M44615L55437R9228
$$ plain form
10202 616994 773267 1009494 1357353 1855682 2573052 3548072 4642324 5503477 5747972
10193 5747972 5296269 4343114 3269765 2376538 1751605 1337703 1076384 895423 746266
10184 746266 619350 525438 462613 405545 355192 327336 303433 267841 243195 218736 189251
10173 189251 170745 163206 148399 134381 116116 101695 98345 103652 102310 85335 81977 77913 66441
10160 66441 58267 52304 53207 50634 56228 58510 57290 55172 52960 53324 56743 60789 63403 66444 61660
10145 61660 57585 49766 49809 45338 39658 51953 56233 45720 45513 52540 47841 53125 54376 56364 63777
10130 63777 63405 64819 88281 100188 102483 103240 92601 93237 109560 117611 125877 141928 168996 193411
10116 193411 226162 277941 352460 466720 626763 878466 1244400 1689015 2044452 2143680
10106B143680j95607l98666m19352l18651k19370j43938r3783o8295m9345l6196
10096B00477j9261k1934k0943r773j3582N07n547j2177j9517o456K198j8424j1966
10083D3602m073J74K406k731N936L757O429K058K540j4660j1620j9403j2224l313
10069a122j0968m937L797k036p41Q275Q171J0016J3731j0521j6421q765l173l844
10055a8538M764N385J222P05L064L0l820p640j460J1398L357K74j683q371k480
10040a3793O635M587L385L285j1127l007l783K808M602L084Q015j530q083j5762
10026b0684m629J2110Q854P818j898p603p320J458J332p96o323k933J1705k908
10012a1817n844J431P959O690M501J92P533k971r224n821k515k344k800L880r265
$$ plain form
10106 2143680 1948073 1549407 1130055 811404 592034 448096 354313 286018 236673 200477
10096 200477 181216 159282 138339 128566 114984 115491 109944 97767 78250 71794 73992 55568 43602
10083 43602 39529 39703 42109 39378 45314 49071 55500 57558 60098 45438 33818 14415 2191 -1122
10069 -1122 -12090 -17027 -13230 -15266 -16007 -7732 439 10455 24186 13665 -2756 -11521 -14694 -18538
10055 -18538 -13774 -8389 -7167 -6462 -3398 -3368 -7188 -14828 -16288 -4890 -1533 -1259 -2942 -11313 -13793
10040 -13793 -7158 -2571 814 4099 -7028 -10035 -13818 -11010 -6408 -3324 4691 3161 -4922 -20684
10026 -20684 -25313 -13203 -4349 3469 1571 -6032 -13352 -11894 -10562 -11358 -17681 -20614 -8909 -11817
10012 -11817 -17661 -16230 -8271 -1581 2920 3112 10645 7674 -1550 -7371 -9886 -12230 -15030 -11150 -20415
9997b0415r825L348L729J60m352l173L323K953k001N288J022r318k19o3J0128
9982a9415P196j7977l564N708J952O187N896M249O992K824L487o781j2011K376
9968a2881m175M56J856j507o017m883K66O994O554j755L096m116P401O875R569
9953G733k517l682o815K16n923j451m987Q100k15j993q547K554J993K981J0140
9938b413j0814N55M967j725o073j785P876l07p016M448Q736j628j3224r706N842
9923b2267J3376K853m300q936N127l93M293j158l301k580P199J923K706M27j362
9908f393K13N13l238j0002J0688R680O809R000k130j79m035r529p676j3411O284
9893a3406O053k333m097Q255L098n260k758j0569j07m477O713K820k286Q813K69
$$ plain form
9997 -20415 -30240 -26892 -23163 -23003 -27355 -30528 -27205 -24252 -26253 -20965 -19943 -29261 -29480 -29543 -19415
9982 -19415 -12219 -30196 -33760 -28052 -26100 -19913 -14017 -9768 -2776 48 3535 -3246 -15257 -12881
9968 -12881 -17056 -16600 -14744 -16251 -22268 -27151 -26885 -19891 -13337 -15092 -11996 -16112 -8711 -1836 7733
9953 7733 5216 1534 -5281 -5065 -10988 -12439 -17426 -9326 -9541 -11534 -20081 -17527 -15534 -12553 -2413
9938 -2413 -13227 -12672 -7705 -9430 -15503 -17288 -9412 -9719 -16735 -12287 -3551 -5179 -18403 -28109 -22267
9923 -22267 -8891 -6038 -10338 -19274 -14147 -14540 -10247 -11405 -14706 -17286 -10087 -8164 -5458 -5031 -6393
9908 -6393 -6180 -5667 -8905 -18907 -8219 1461 8270 17270 15140 14961 10926 1397 -6279 -19690 -13406
9893 -13406 -7353 -9686 -13783 -5528 -2430 -7690 -10448 -21017 -21124 -25601 -18888 -16068 -18354 -9541 -9272
9878i272j352J0665k807j2047r594J058Q095J262p962N788J2369L164J008k937
9864b562L191j0732n146M172n340J122R308P679O7l612J0240M436m617o499j874
9849a67R560K770J09m180j0336j533m57K161R250r96j2184O349q016l832j015
9834a2517O552J2598O310p6j1222N840p953k393O937R27o869O738o855J713L468
9819C198q196p02k290l239r59l511K979L835j847O906K819N533O295L273J390
9804A5484K264r011p591M603m55m277j989L419k309O779Q996l82N45K367m432
9789A4011n506j022p64n90K457O176j0413m226J051N798n360n522j549J0033R53
9774E527l365P856O583q291K189Q506O587L956j629p995j339M527O8j6600j5703
$$ plain form
9878 -9272 -10624 41 -2766 -14813 -24407 -23349 -15254 -13992 -21954 -16166 -3797 -633 375 -2562
9864 -2562 629 -10103 -15249 -11077 -16417 -15295 -5987 1692 1759 -1853 8387 12823 8206 1707 -167
9849 -167 9393 12163 12272 8092 -2244 -3777 -4234 -2073 7177 6181 -6003 346 -7670 -11502 -12517
9834 -12517 -5965 6633 12943 12867 1645 7485 -468 -2861 4076 5003 -1866 4872 -1983 -270 3198
9819 3198 -4998 -5700 -7990 -11229 -12188 -15699 -12720 -8885 -10732 -3826 -1007 4526 10821 14094 15484
9804 15484 17748 8737 1146 5749 5294 1017 -972 2447 138 6917 15913 15531 16076 18443 14011
9789 14011 8505 7483 6719 6129 8586 14762 4349 123 1174 6972 1612 -3910 -5459 4574 5527
9774 5527 2162 10018 16601 8310 10499 19005 25592 29548 27919 19924 18585 23112 23180 6580 -9123
9759i123n255l38P236O288j11o330L001m073k695M138j016p714j654J2333J341
9744c972l521J381o323m993K862R834l42j80l774J504J1060L172J173R45K200
9729A1026Q058O852J7105K8874J8948K6657K6199K3024P646p610k0135k4962k7921
9716I3761k1443j7026j5706j2940r223k526r929n835n079m149Q387J713k690M094
9702A409j2307j4935K243J4255J1011M026o019o367M470J064j138J113m178K64
9688e089O766n343J91n609r80J138j5297j719K200K418K385P713k08j378q01N746
9672g867O442j480p480M01P22O2M845O533m725k070R28k780m338J673L181K639
9656c314P17K549m460j1180p37R676Q162O829o145J281J800J699K399m017o670
$$ plain form
9759 -9123 -14378 -14716 -7480 -1192 -1303 -7633 -4632 -8705 -11400 -7262 -8278 -15992 -17646 -5313 -3972
9744 -3972 -7493 -6112 -12435 -17428 -14566 -4732 -5074 -5254 -9028 -7524 3536 6708 7881 8826 11026
9729 11026 19084 25936 43041 71915 90863 117520 143719 166743 174389 166779 146644 121682 93761
9716 93761 72318 55292 39586 26646 17423 14897 4968 -867 -5946 -10095 -1708 5 -2685 1409
9702 1409 -10898 -25833 -23590 -9335 1676 5702 -317 -6684 -2214 -1150 -2288 -1175 -5353 -5089
9688 -5089 1677 -3666 -3475 -9084 -10064 -8926 -24223 -25942 -23742 -21324 -18939 -11226 -11434 -12812 -13613 -7867
9672 -7867 -1425 -2905 -10385 -9984 -9262 -9200 -4355 2178 -2547 -4617 -3689 -6469 -10807 -9134 -5953 -3314
9656 -3314 -2597 -48 -4508 -15688 -16425 -6749 1413 8242 2097 3378 5178 6877 9276 5259 -1411
9641a411j3562n615j696P954L995l494J32j749N875J535o888O411Q117l758k25
9626d379L852m832p426M910M90L802O028j204k726q35n516p697L81n319Q690M060
9610g721j3390L76J8149Q668k010R26j6510j0811J157N050J306m122L189j519
9596a7262K876l655N509P364J1117p472q982j430K810k140K206O195O242N485
9582H863J437P152P937p112j0176n148o256K72k619M139P008J085J487L666n828
9567E907j04J008j146q2N593j055j3828j4655J178J6993P831k951P514O899q318
9552A0784r884j0799L10J917k28M564k006J0694M760p689k468L502j904J040q501
9537e908k060k181k940J785M953l122J0035J6770N47q644k964r168o713r189j338
$$ plain form
9641 -1411 -14973 -20588 -22284 -14330 -10335 -13829 -13697 -15446 -9571 -8036 -14924 -8513 -396 -4154 -4379
9626 -4379 -527 -5359 -12785 -7875 -7385 -3583 2445 1241 -1485 -2320 -7836 -15533 -15152 -20471 -11781 -7721
9610 -7721 -21111 -20735 -2586 6082 4072 4998 -11512 -22323 -21166 -16116 -14810 -18932 -15743 -17262
9596 -17262 -14386 -18041 -12532 -5168 5949 -1523 -10505 -11935 -9125 -11265 -9059 -2864 3378 8863
9582 8863 10300 17452 25389 18277 8101 2953 -3303 -3031 -5650 -1511 5497 6582 8069 11735 5907
9567 5907 5803 6811 5665 5583 11176 10121 -3707 -18362 -17184 -191 7640 4689 12203 19102 10784
9552 10784 900 -9899 -9589 -7672 -7900 -3336 -5342 5352 10112 2423 -45 3457 1553 2593 -5908
9537 -5908 -7968 -10149 -13089 -11304 -6351 -9473 562 17332 17879 9235 6271 -2897 -9610 -18799 -20137
9522b0137J595O020N144J11n47J0185L556N695n02P08o256l286l227M443J1389
9507A4891j190M86L463q563l309j1018J946J0945Q862j839n846k69l630O187K214
9492A3330J619l476l192K988O02k744j0853j994J1084N041r024k390L824l659
9478A156J0003K625j463J038K325j705j2300p144J2897n1J325N845R306r26m451
9463A8480M754l433o703L06N871P980l338R525J0027j4884j7547O31l243K085
9449A0511j515M082J212l476o272j0771N294L929K307N692Q558m577n467L332
9435A2839K267L120N648L210o899M461R05L539K08p495K463O522K238j5875M057
9420B1208M189m085j0331j310J886M140R411j0229p663K784l245n439L464L659
$$ plain form
9522 -20137 -18542 -12522 -7378 -7267 -7814 2371 5927 11622 11120 11828 5572 2286 -941 3502 14891
9507 14891 13701 14187 17650 9087 5778 -5240 -3294 7651 16513 14674 8828 8559 4929 11116 13330
9492 13330 14949 11473 8281 11269 11871 9127 -1726 -3720 7364 12405 3381 991 4815 1156
9478 1156 11159 13784 12321 13359 15684 13979 1679 -5465 7432 7381 8706 14551 23857 22931 18480
9463 18480 23234 19801 13098 13404 19275 27255 23917 33442 43469 28585 11038 11669 8426 10511
9449 10511 8996 13078 14290 10814 4542 -6229 -935 2994 5301 10993 19551 14974 9507 12839
9435 12839 15106 18226 23874 27084 20185 24646 25551 29090 29298 21803 24266 30788 33026 17151 21208
9420 21208 25397 21312 10981 9671 11557 15697 25108 14879 7216 10000 6755 1316 4780 8439
9406H439J45l149J679r29N770K415Q328j700p421m780R89p92M989m51r416r518
9390e402N8R563P274O372J660o605n459n065M20L180J805r446L718M515O267N9
9374A2914l523K846m68k124M276J4496J05p838k716n235j0546j779M923J7477
9360B2808M554n939j181q159p83L168J983O2o134k152J1811J120L872M365o395
9345B3000o520M299j706q688k167O849j025P780R39n912j099K929J215J117q997
9330A2014m686K419M621m719j570J0269Q462K903O644K935K694N084Q024o663
9316D8431p988p468o128P812N882L868k628K195k980r006k542p358N550P463P296
9301D2399m994j177n275k578l861J796O048O30L024k506L666N626n892l494J2072
$$ plain form
9406 8439 8584 5435 7114 6185 11955 14370 22698 20998 13577 8797 9786 8994 13983 13532 4116 -5402
9390 -5402 -5344 4219 11493 17865 19525 12920 7461 2396 2816 5996 7801 -1645 2073 6588 12855 12914
9374 12914 9391 12237 11769 9645 13921 28417 28522 20684 17968 12733 2187 408 5331 22808
9360 22808 27362 21423 20242 12083 11300 14468 16451 16513 10379 8227 20038 21158 25030 29395 23000
9345 23000 16480 20779 19073 10385 8218 15067 14042 21822 22761 16849 15750 18679 19894 21011 12014
9330 12014 7328 9747 14368 9649 8079 18348 26810 29713 36357 39292 41986 47070 55094 48431
9316 48431 40443 32975 26847 34659 40541 44409 41781 43976 40996 31990 29448 22090 27640 35103 42399
9301 42399 37405 36228 30953 28375 24514 26310 32358 32988 36012 33506 37172 42798 36906 33412 45484
9286D5484J2282j2117j5551J135J066p16N547O674M008L3n031m78J922l000k630
9271C8628l78r177K033Q548L160j968L578N180l335q777Q60J176k912N973J4978
9256E7567K548j0716n776p580j665J654K433P092J5409Q247j292O700p343j0104
9242E7174l83J412p43j2230M045Q772P604J576k147r472l197k710o36R936L582
9227F2583N008n799j0873P90L452N982L595J0116N004J619N607M025n683L986
9213H9412Q920J0606J4926M290P683M051n327J2082R335N484j2238r902o075r35
9199A32312K370l581j4974q273l340j0510m405R672L728j2681j4678n876M323
9186G4087J9764L336J456M600o491n819p917j1213O865J4392K031l374n968J482
$$ plain form
9286 45484 57766 45649 30098 31233 32299 31583 37130 43804 47812 47845 42814 42336 44258 41258 38628
9271 38628 38250 29073 31106 39654 42814 40846 44424 49604 46269 37492 38352 39528 36616 42589 57567
9256 57567 60115 49399 43623 36043 34378 36032 38465 45557 60966 69213 67921 74621 67278 57174
9242 57174 56791 58203 57460 45230 49275 58047 65651 67227 65080 55608 52411 49701 49065 59001 62583
9227 62583 67591 61792 50919 51709 55161 61143 64738 74854 79858 81477 87084 91109 85426 89412
9213 89412 98332 108938 123864 128154 135837 139888 134561 146643 155978 161462 149224 139322 133247 132312
9199 132312 134682 131101 116127 107854 104514 94004 89599 99271 102999 90318 75640 69764 74087
9186 74087 93851 97187 98643 103243 96752 90933 83016 71803 78668 93060 95091 91717 85749 87231
9172H7231N389r62L616j3185j92Q805L400q525l818K35o777N466R321j316k238
9157H6450Q625L602r64J0292j0918j2237j591M438J381J0155N60n248N181M998
9143A04724J09K985n443J543J3062J6969o03l916J3937M700J727J507k737J281
9129A49845J1506k985m13R374J6034p355k330l470l90L854K024K656M472l879
9115A78943N97j0392L393J2172l28N919J500J380n639L333J5749N792M096N688
9101B22203L756O63k155L436n351K636L064r42P604N193L695M868J3222j034l759
9086B57099l948k765L629M248M969J0570Q783K031J0719j806K150K5659K2924
9073C44262J1839l75p685q597r67N625J909l484L673J7341Q033l395R25P560N892
$$ plain form
9172 87231 92620 91658 95274 82089 81897 90702 94102 85577 81759 81994 75217 80683 90004 88688 86450
9157 86450 95075 98677 97713 108005 97087 84850 83259 87697 89078 99233 99793 94545 99726 104724
9143 104724 104833 107818 102375 103918 116980 133949 133346 129430 143367 148067 149794 151301 148564 149845
9129 149845 161351 158366 157953 167327 183361 176006 173676 170206 169816 173670 175694 178350 182822 178943
9115 178943 179540 169148 172541 184713 184385 190304 191804 193184 187545 190878 206627 212419 216515 222203
9101 222203 225959 226622 224467 227903 222552 225188 228252 227310 234914 240107 243802 248670 261892 260858 257099
9086 257099 253151 250386 254015 258263 263232 273802 282585 284616 295335 293529 295679 321338 344262
9073 344262 356101 355726 348041 339444 338477 344102 346011 342527 346200 363541 371574 368179 369104 376664 382556
9058C82556M647L595N381R05m389j101O430Q470J7202J9632P818M505K770P395
9044D65816J4803N868O182J5271J0368Q450R798J3183J1317R924P0R354J3875
9031E94279J5572J3581K0043J9506K0874L3159J896J0055K7139K0264K5307L1857
9019H33532K1455J8115J7844L0600L0193K2167J8944K4139K8826L7338L9631M0255
9007A163039M5118N6528L7827L7010M8324M9547M9000N9588O5754N5868O1570
8996A729173O9829Q3605P9795P0924Q9250R5006J00874J13012J26135J37024J36678
8985B831305J65704J76081J75046J86160K03097K20804K43388K79620L06477L33334
8975E121016L67836M13734M51955N09487N74111O46430P28916Q40301R59090J103103
$$ plain form
9058 382556 387203 390798 396179 397084 392695 391594 398024 406494 423696 443328 451146 455651 458421 465816
9044 465816 480619 486487 492669 507940 518308 526758 536556 549739 561056 570980 571050 580404 594279
9031 594279 609851 623432 643475 662981 683855 717014 718910 728965 756104 776368 801675 833532
9019 833532 854987 873102 890946 921546 951739 973906 992850 1016989 1045815 1083153 1122784 1163039
9007 1163039 1208157 1264685 1302512 1339522 1387846 1437393 1486393 1545981 1611735 1667603 1729173
8996 1729173 1799002 1882607 1962402 2033326 2122576 2217582 2318456 2431468 2557603 2694627 2831305
8985 2831305 2997009 3173090 3348136 3534296 3737393 3958197 4201585 4481205 4787682 5121016
8975 5121016 5488852 5902586 6354541 6864028 7438139 8084569 8813485 9653786 10612876 11715979
8965A1715979J291289J495428J734288K032250K408546K856027L341072L892885
8957C0767764M500686N090027N562721N766529N492168M606019L072175J020284
8949F5878373j229832l250130m699863n465038n630654n382059m883115m296139
8941C1041543l733146l213860k741544k347442k021772j727946j497768j293204
8933A2464861j118349r74955q67459p64388o70704n97232n39272m89025m30530
8924F012947l82120l63439l23003k74492k57380k45976k27389k09898j91361j67897
8914C369992j59264j45472j39268j36600j15091j17840j17091j07767r4390q3742
8904B153467p8944p9275p2629p3889o9606o1445n5535m3925n6429o4121n1254
$$ plain form
8965 11715979 13007268 14502696 16236984 18269234 20677780 23533807 26874879 30767764
8957 30767764 35268450 40358477 45921198 51687727 57179895 61785914 64858089 65878373
8949 65878373 64648541 61398411 56698548 51233510 45602856 40220797 35337682 31041543
8941 31041543 27308397 24094537 21352993 19005551 16983779 15255833 13758065 12464861
8933 12464861 11346512 10371557 9504098 8739710 8069006 7471774 6932502 6443477 6012947
8924 6012947 5630827 5267388 4944385 4669893 4412513 4166537 3939148 3729250 3537889 3369992
8914 3369992 3210728 3065256 2925988 2789388 2674297 2556457 2439366 2331599 2237209 2153467
8904 2153467 2074523 1995248 1922619 1848730 1779124 1717679 1662144 1618219 1561790 1497669 1446415
8893A446415n4315n3322m9512l3052m2951l4946k7902l5866m6669l5882l5316
8882I96682l0211l0234k4534k4880k4897k1888j4471j1332k6023j9454j8698j2954
8870G37106k1600k7836j7425j6324k5035k3683j4623m954n523j6998l1788k0019
8858E11298n2j2693j7219n572j0606k3738l211l656p824o058j244J034r255q769
8844D02435j652j6019j6694j2135p232K54l723n938P34j279n242j2022o375L468
8830C18580K363l781K219R384J763j4451n380r756M085o02j2394k227j5021r544
8816B65238j0175j2825r427n898o163j6850j4198p799M150o29m640K273J28k817
8802A80368k082j0984p275k191J595L607P531m263j3111o872o455q825j0359p870
$$ plain form
8893 1446415 1392100 1338778 1289266 1256214 1213263 1178317 1150415 1114549 1067880 1031998 996682
8882 996682 966471 936237 911703 886823 861926 840038 825567 814235 788212 768758 750060 737106
8870 737106 715506 687670 670245 653921 628886 605203 590580 585626 580103 563105 531317 511298
8858 511298 511246 498553 481334 475762 465156 441418 438207 434551 426727 420669 419425 420459 411204 402435
8844 402435 400783 384764 368070 355935 348703 348957 345234 339296 340030 338751 333509 321487 315112 318580
8830 318580 320943 317162 319381 328765 330528 316077 310697 300941 305026 304424 292030 289803 274782 265238
8816 265238 255063 242238 232811 226913 220750 203900 189702 181903 186053 185424 180784 183057 183185 180368
8802 180368 178286 167302 160027 157836 159431 163038 170569 166306 153195 146323 139868 131043 120684 112814
8788A12814J556P154l376m720K825j175r46q864o430J895K00R13j882K876q380
8773I4460r119j576k942R753P261J5275P493j3088m899l635n261Q268M462n419
8759A01033K562M842P721M403o926o752q75O834P859N504L691k323q881j8524
8745A00168k403K436J145j1764J72o207j621o85J777n218m47N909L563J2779p615
8730I1989n975n784k837o01r02O733J672l04P178O418K673L834N483P571O425
8715A23573p126j8178q562j667l741j0593j6569n872J0139J0255K517O060m33
8702G9803j654Q0N684n220q659p009J487O126N689k796P80l524n304J638M786
8687G1907M781Q97L957j699l348P046Q226J0244J0731r674o635m569J3852J6129
$$ plain form
8788 112814 114370 121524 118148 113428 116253 115078 114132 105268 98838 100733 100933 101846 99964 102840 94460
8773 94460 85341 83765 80823 90576 97837 113112 120605 107517 102618 98983 93722 101990 106452 101033
8759 101033 103595 108437 116158 120561 113635 106883 106008 112842 120701 126205 129896 127573 118692 100168
8745 100168 97765 100201 101346 89582 89754 83547 81926 81241 83018 77800 77353 83262 86825 99604 91989
8730 91989 86014 80230 77393 76792 75890 82623 84295 83991 91169 97587 100260 104094 109577 117148 123573
8715 123573 116447 98269 89707 88040 84299 73706 57137 51265 61404 71659 74176 80236 79803
8702 79803 78149 78229 83913 78693 70034 63025 64512 70638 76327 73531 74311 70787 65483 67121 71907
8687 71907 76688 77585 81542 79843 76495 83541 91767 102011 112742 103068 96433 91864 105716 121845
8673A21845J9459J2436K0426J9572K3255N5478R0354J46146K09070K15887J03713
8662A037641m9506j62593k07653j61683r9867o5524m3185k5110k2920j0255m084
8651A85261m06m194L012J2819p60K90j005K402J5047J3174J1232Q490J4407K7240
8637B87009J0812p943l131J015j3704n829p042k533l333P401J9193L4633M8932
8624C65480R1710J44374K39535L76813M63897L06959q091k76765m46811l88655
8614H68446k57818j47615q9746p4532n4249k7512k9245k4000j8413j0724l653
8603A30939j1788j368r82j3278j6301k74P600r202q533Q176N109O977J630j0180
8589H8525N828R934Q453K425N265R642L185J7143L4202M2383N8781J01680J52330
$$ plain form
8673 121845 141304 153740 174166 193738 216993 272471 362825 508971 718041 933928 1037641
8662 1037641 988135 825542 617889 456206 356339 290815 247630 222520 199600 189345 185261
8651 185261 184855 180661 183673 196492 195732 196022 195017 197419 212466 225640 236872 245362 259769 287009
8637 287009 297821 289878 286747 287762 274058 268229 261187 258654 255321 262722 281915 316548 365480
8624 365480 457190 601564 841099 1217912 1681809 1988768 1980677 1703912 1257101 868446
8614 868446 610628 463013 373267 298735 244486 216974 187729 163729 145316 134592 130939
8603 130939 119151 117783 116801 103523 87222 86948 94548 85346 76813 84989 90098 97075 98705 88525
8589 88525 94353 104287 112740 115165 120430 130072 133257 150400 184602 226985 285766 387446 539776
8576E39776J97449J85503O1654q3506j96749k13846j42642q1647m5783l8282k6111
8565A55816k2367j1202p444j5967j7174q076O109k445p567o651k108Q874n324
8552F4474j0780r967j4862q558k968J624J0392O374P137m648j0214k208N143R769
8538D0708K225l152k692J19j348k196L172o016n967n032J873K503K586J420M671
8523C2874j5614o471P478q15J697M898J962m803K601o311l146M321J5285o075
8509B7881q726n03R734NM514Oj606K653r98l077J082K123M279p900k944N409r853
8492B2079j3801M78j006l142p057q863k706l70n347J032O792Q018L501J912M154
8477E674n422n979j160N91P571N292J583N937Q950L078O666L082r190j20M249
$$ plain form
8576 539776 737225 922728 984382 900876 704127 490281 347639 265992 220209 181927 155816
8565 155816 133449 122247 114803 98836 81662 73586 79695 77250 69683 63032 60924 69798 64474
8552 64474 53694 43727 28865 20307 17339 18963 29355 35729 42866 38218 28004 25796 30939 40708
8538 40708 42933 39781 37089 37208 35860 33664 36836 30820 24853 19821 21694 24197 26783 28203 32874
8523 32874 17260 10789 18267 17452 19149 24047 26009 21206 23807 17496 14350 18671 33956 27881
8509 27881 19155 18652 28386 28391 32905 32911 31305 33958 32960 29883 30965 33088 37367 29467 26523 31932 22079
8492 22079 8278 8756 7750 4608 -2449 -11312 -14018 -14388 -19735 -18703 -11911 -3893 -392 1520 5674
8477 5674 252 -5727 -6887 -6296 1275 6567 8150 14087 23037 26115 32781 35863 26673 26553 30802
8462C0802r100j2825j2829n46q867k961K506K748J2775P680j0298J591Q119R611
8448A8406L17l657Q69o438m429m983k195P640J098l676J711m596R662O013Q69
8433A6611m886r026L226Q216N545J319j966n564k880j59j1494l14P059M192L998
8418A3877p682p361M86O065p767p930j768R91j0734r08M385R982N396K490N202
8403D724M29j653j310k565j0198j0715Q547R155l276K953Kn212M660R306k552
8388B295L058Q828k737l791m187n207L365o542n902M763L691P10J765K537k191
8373D55l625P985m273p455p214k923J1084J595j3064Q348J3238P737m157j051
8359F680J604L04l970L080O785N573l202k510o961p496n005O870P114n051M567
$$ plain form
8462 30802 21702 8877 -3952 -4498 -13365 -16326 -13820 -11072 1703 9383 -915 676 8795 18406
8448 18406 18723 15066 15935 9497 5068 85 -2110 5530 6628 2952 4663 67 9729 15742 16611
8433 16611 11725 2699 5925 14141 19686 21005 19039 13475 10595 10436 -1058 -1372 5687 9879 13877
8418 13877 6195 -1166 -680 5385 -2382 -10312 -12080 -11089 -21823 -22731 -18346 -8364 -2968 -478 4724
8403 4724 5153 3500 2190 -375 -10573 -21288 -12741 -3586 -6862 -3909 -3907 -9119 -4459 4847 2295
8388 2295 5353 14181 11444 7653 3466 -1741 1624 -4918 -10820 -6057 -2366 -1656 109 2646 455
8373 455 -3170 4815 542 -6913 -14127 -17050 -5966 -4371 -17435 -9087 4151 11888 7731 6680
8359 6680 8284 8588 4618 7698 14483 20056 16854 14344 7383 -113 -5118 1752 8866 3815 8382
8344H382l653K382k461j55R426P366r547j1382n261q563q341L295K765R899J2215
8329F367P86m825o394J84N995n651j992m737Q721R233K475q250j4185p429P907
8314a1795N859m159o90J1285K771k658k509j732K979R55K591p44k466L617p19
8299B585J562N258N924J461o947n773K120O121j1604n387L440M030o002L904k032
8284a340r787J925J0525N308M940J958j753J513n893k827p130N46O665l133M304
8269E821J98j2419M662J4101L986m453n010n836M801N400q045m151K395Q055O159
8254A5664j2298q144k407m626N79J1429J4656K270j1160o708p589o015R05j863
8240a5307Q139J7995P222m366M589n902j3947o69p757M005M932P122l931r015
$$ plain form
8344 8382 4729 7111 4650 4495 13921 21287 11740 358 -4903 -13466 -21807 -18512 -15747 -5848 6367
8329 6367 7153 2328 -4066 -3882 2113 -3538 -5530 -10267 -1546 7687 10162 1912 -12273 -19702 -11795
8314 -11795 -5936 -10095 -10785 500 3271 613 -1896 -3628 -649 306 2897 2153 -313 3304 2585
8299 2585 4147 9405 15329 16790 9843 4070 6190 12311 707 -4680 -1240 2790 -3212 692 -1340
8284 -1340 -11127 -9202 1323 6631 11571 13529 11776 13289 7396 4569 -2561 -2015 4650 1517 5821
8269 5821 6019 -6400 -1738 12363 16349 11896 6886 1050 5851 11251 3206 -945 1450 9505 15664
8254 15664 3366 -4778 -7185 -11811 -11232 197 14853 17123 5963 -745 -8334 -14349 -13444 -15307
8240 -15307 -7168 10827 18049 13683 18272 12370 -1577 -2246 -10003 -5998 -1066 6056 2125 -6890
8226f890J827Q704p091o534J3924O807n865P597M718p644q895l830K378L754K162
8211E122J621N980j113q91p661O11M450j05l634n966M781J0327n990m119k685
8196G28P378m747j0093o701J779Q1O813K597K808J1799K508J640j649m036K179
8181A3084j404j254l85p51l794J97K952M099M209N87M549M482o091j7604K549
8166E425N126K722l840j0096l777j923m559k451J1704P840Q794N420J739j4131
8152G993j2997R50J1397K163k345m590o378j100J25n095k298J1630N452n792n51
8137a436M324J310o973k41k85N304J745O494M462j598K384J590j3859j2143J1678
8122B756Q678L425o871n025j0404j904P122o717R121M632K322n195O224L182P3
$$ plain form
8226 -6890 -5063 3641 -3450 -9984 3940 10747 4882 12479 17197 9553 658 -3172 -794 2960 5122
8211 5122 6743 12723 11610 10719 3058 3669 8119 8014 4380 -1586 3195 13522 7532 3413 728
8196 728 8106 3359 -6734 -13435 -11656 -11575 -4762 -2165 643 12442 14950 16590 14941 10905 13084
8181 13084 11680 10426 10041 9290 5496 5693 8645 12744 16953 17540 22089 26571 20480 2876 5425
8166 5425 10551 13273 9433 -663 -4440 -6363 -10922 -13373 -1669 6171 14965 20385 22124 7993
8152 7993 -5004 -4054 7343 9506 7161 2571 -3807 -4907 -4782 -9877 -12175 -545 4907 -885 -1436
8137 -1436 2888 4198 -2775 -3016 -3301 2003 3748 10242 14704 13106 15490 17080 3221 -8922 2756
8122 2756 11434 14859 7988 2963 -7441 -9345 -2223 -8940 181 4813 7135 1940 8164 11346 11419
8107A1419m964l016O483L161J887L913q974n991J16J900O345O936m394j812k487
8092A0522o100j380n886J2538O8j357M375J5539k595p506J0540Q593p757m586
8078B5008J426J6316k70k1484n354L415J835n110K076l122O384J0751P549r93
8064C8427j035l80k698m280Q078j34j0270P295j694o334k99k266m730m83L719
8049B2916J795J0926M463K721J699K546M297%P831p09m35j88K196o224m015K054
8033E1873N608q625q450o97R331r808o522K643j254k554n737l578K582M23Q798
8018C4033Q827n202r628j13J3680Q962k742r394n565L88O533K211J0118Q180J3872
8003G4160r61j683l585n223k285j698J157n860j557q440r96j0385J01O141M675
$$ plain form
8107 11419 6455 3439 9922 13083 14970 18883 9909 3918 4034 5934 12279 19215 14821 13009 10522
8092 10522 4422 3042 -2844 9694 9762 8405 12780 28319 25724 18218 28758 37351 29594 25008
8078 25008 26434 42750 42480 20996 15642 19057 20892 15782 17858 14736 21120 31871 39420 38427
8064 38427 37392 37012 34314 30034 38112 37978 27708 35003 33309 26975 26676 24410 19680 19197 22916
8049 22916 24711 35637 40100 42821 44520 47066 51363 51363 59194 58485 58050 57862 60058 53834 49819 51873
8033 51873 57481 48856 40406 39709 49040 39232 32710 35353 34099 31545 25808 22230 24812 25235 34033
8018 34033 42860 37658 28030 27917 41597 50559 47817 38423 32858 33246 39779 41990 52108 60288 74160
8003 74160 73199 71516 67931 62708 60423 58725 59882 54022 52465 44025 43029 32644 32745 38886 43561
7988D3561o496k631J304R64p39J968M863K751K189j3422j506N807K740K561j994
7973D1920m364l988J09O622m239K260P485M838k315J567K249K805n46L631L912
7958F1946K619j729o900o311j217n59p379Q411J372q369q187Q223L565l700p518
7943C4267r946P159L354J456j0107K876k159j3581o091Q311M630o556j1026K821
7929E408J1298J2287L800m150l220J651K173q311m555p676l474K393J1798N05
7915A9927L553L583J068k026J140o183k860n85N23j94N31J72l72R64O391j210
7899B4422j1484p577L221Q767k393n431j3848l501p561k660J5871J5376j5p17
7885A2470N760m368p866J547P357N611j1764k133k679p348o397j060J0466R591
$$ plain form
7988 43561 37065 34434 35738 36702 35963 37931 42794 45545 47734 34312 32806 38613 41353 43914 41920
7973 41920 37556 33568 33677 40299 36060 38320 45805 50643 48328 49895 52144 54949 54403 58034 61946
7958 61946 64565 62836 55936 49625 48408 47849 40470 48881 50253 41884 33697 41920 45485 41785 34267
7943 34267 24321 31480 34834 36290 26183 29059 26900 13319 7228 15539 20169 13613 2587 5408
7929 5408 16706 28993 32793 28643 25423 27074 29247 20936 16381 8705 5231 7624 19422 19927
7915 19927 23480 27063 28131 26105 27245 21062 18202 17617 18140 17946 18477 18649 18277 19241 25632 24422
7899 24422 12938 5361 8582 17349 14956 9525 -4323 -7824 -15385 -18045 -2174 13202 13187 12470
7885 12470 18230 13862 5996 7543 14900 20511 8747 6614 3935 -3413 -9810 -10870 -404 9187
7871I187l93j1372r901M540K574k247n382M487M827J005j3487j4443m679K329
7857c2955J7838O143L920j990m2j186j010J3216n513q445K487M873J3699J113
7843A2148n965K264p547j1596p392K16K232M364l638P994J6277N595n074p604
7829B274l747n183n897k59k149J2056R016m419J644j691K037R567l51j314k361
7814I223m892q797j9k106n223p626k251J0598R731J129n427Q360J799p222m947
7799g670m681L43k148j7531j246J2569M716L897J959M019K501m74l408k788l937
7784a3879P863P088J691L686N22k986j070l230J1383R541r071j1134o011M872
7770g35k053o76J099m43k025M637Q86J36n805j48k395L378n470K982J682l182
$$ plain form
7871 9187 8794 -2578 -12479 -7939 -5365 -7612 -12994 -8507 -3680 -2675 -16162 -30605 -35284 -32955
7857 -32955 -15117 -8974 -5054 -7044 -7086 -8272 -9282 3934 -1579 -10024 -7537 -2664 11035 12148
7843 12148 6183 8447 900 -10696 -18088 -17872 -15640 -11276 -14914 -6920 9357 14952 9878 2274
7829 2274 -1473 -6656 -12553 -12812 -14961 -2905 6111 1692 3336 1645 3682 13249 12898 11584 9223
7814 9223 4331 -4466 -4485 -6591 -11814 -19440 -21691 -11093 -1362 -233 -5660 2700 4499 -2723 -7670
7799 -7670 -12351 -12008 -14156 -31687 -32933 -20364 -15648 -11751 -9792 -5773 -3272 -3746 -7154 -9942 -13879
7784 -13879 -6016 1072 2763 6449 6971 3985 2915 -315 11068 20609 11538 404 -5607 -735
7770 -735 -2788 -3464 -2365 -2808 -4833 -196 690 826 -4979 -5127 -7522 -4144 -9614 -6632 -4950 -8132
7754h132r01m579J1025j404n13L352l252n750J1670J1199p360j1251J754M136
7740fQ37M334l513J842k070j2269m152L488L854k139R066J5099P579j5235o178
7725E37O010P66j2364j59q97j6122n545j209J0661J1874l037j277M686M668o348
7710g756l687Q060q72j485l069r26J2123m40k535R05L48k194l21q209O317l421
7694g162J610N951P21L903o693m713o845n750j2428Q629Q654M897P872J1180j501
7679H325p544n375n947M832Q356q751O138Q380j12r453j806j031N388r492j2871
7664b0963P016M288p258l626J397O027L825R260r79K667L203j956n452q38K345
7649a044l517q035p827N47M373o740p505M595m109p869R51k578N096J8900m593
$$ plain form
7754 -8132 -9033 -13612 -2587 -3991 -4504 -1152 -4404 -10154 1516 12715 5355 -5896 -4142 -6
7740 -6 831 5165 1652 3494 1424 -10845 -14997 -11509 -7655 -9794 -728 14371 21950 6715 537
7725 537 6547 7313 -5051 -5210 -6107 -22229 -27774 -28983 -18322 -6448 -9485 -10762 -6076 -1408 -7756
7710 -7756 -11443 -3383 -4255 -5740 -8809 -9735 2388 1948 -587 318 666 -1528 -1849 -10058 -3741 -7162
7694 -7162 -5552 399 1120 5023 -1670 -6383 -13228 -18978 -31406 -22777 -14123 -9226 -1354 9826 8325
7679 8325 781 -4594 -10541 -5709 2647 -6104 34 8414 8302 -1151 -2957 -3988 1400 -8092 -20963
7664 -20963 -13947 -9659 -16917 -20543 -19146 -13119 -9294 -34 -1013 1654 4857 2901 -2551 -3389 -1044
7649 -1044 -4561 -12596 -20423 -19876 -15503 -22243 -29748 -25153 -29262 -37131 -36180 -38758 -33662 -14762 -19355
7634a9355K436o98Q58O435j728Q98p939M367M24n70q115M216j216p791J5646J1930
7618b02k203J064p406q32J037k149k413P934j1033o407R712N240k17l962n522
7603a7359K219N695o264O835K140j023L396j9220n344M137O916K963L301p88p616
7588b0012j212M692P631n995l451R817R941q160K496O41p374o059N748K857k455
7573a0895K754J0640m096m092j437O07J465l531j7403O077Q115L946J161k3n375
7558a2087N587M956O907o883J391K080Q22M361N932l273j0846R43Q34l38R434
7543I820j829o574j5003O584N061m812m956N861J990N816j698m559q17n361J0456
7528b1l290j2996M709k761J671O368M549K879l710k093l302N74P761Q381N119
$$ plain form
7634 -19355 -16919 -17617 -16759 -10324 -12052 -11154 -19093 -14726 -14302 -14872 -22987 -18771 -19987 -27778 -12132 -202
7618 -202 -2405 -1341 -8747 -9579 -8542 -10691 -13104 -5170 -16203 -22610 -12898 -7658 -7875 -11837 -17359
7603 -17359 -15140 -9445 -15709 -8874 -6734 -7757 -4361 -23581 -28925 -24788 -17872 -14909 -11608 -12396 -20012
7588 -20012 -21224 -16532 -8901 -14896 -18347 -8530 1411 -6749 -4253 -3612 -10986 -17045 -11297 -8440 -10895
7573 -10895 -8141 2499 -1597 -5689 -7126 -6519 -5054 -8585 -25988 -19911 -11796 -7850 -6689 -6712 -12087
7558 -12087 -6500 -1544 5363 -1520 -129 1951 2773 7134 13066 9793 -1053 -110 724 386 9820
7543 9820 7991 1417 -13586 -7002 -1941 -6753 -11709 -5848 -3858 1958 260 -4299 -5116 -10477 -21
7528 -21 -3311 -16307 -11598 -14359 -12688 -6320 -1771 1108 -2602 -4695 -7997 -7423 338 8719 13838
7513A3838k250n703p647j2486n881O149J1185k039p314J629O08K652l677j732
7499a2668P062L902Q913k062k014l135l738l743o041j28K177m802P854L937j946
7484f432p968j235J0484k981o480j496K677r67n076n7N443M901R51j8729M76L474
7468b3015K45J2446j378M80p531n189M152Q778P710k526m521j0080k973N703J0854
7453f845N538j000O204k721J573m900O112M167l960J176m261p560r162k690K247
7438a6082m098N37K951O985n557R522k109L563M380q20n134q390k566L178Q395
7423e245J826K064J250p746r7k931j756P099n687J1776K738j3980j0938p39O687
7408a5679N486O8O064p193r169j314M36l053j09l47M071Q699k464M822R865K883
$$ plain form
7513 13838 11588 5885 -1762 -14248 -20129 -13980 -2795 -4834 -12148 -10519 -9911 -7259 -10936 -12668
7499 -12668 -5606 -1704 7209 5147 3133 -2 -3740 -7483 -13524 -13652 -11475 -16277 -8423 -4486 -6432
7484 -6432 -14400 -15635 -5151 -8132 -14612 -16108 -13431 -14398 -19474 -19531 -14088 -9187 -8236 -26965 -26489 -23015
7468 -23015 -22770 -10324 -11702 -11222 -18753 -23942 -19790 -11012 -3302 -5828 -10349 -20429 -23402 -17699 -6845
7453 -6845 -1307 -2307 3897 1176 2749 -2151 3961 8128 4168 5344 1083 -6477 -15639 -18329 -16082
7438 -16082 -20180 -19643 -16692 -9707 -15264 -5742 -7851 -4288 92 -728 -5862 -14252 -16818 -13640 -5245
7423 -5245 -3419 -1355 -105 -7851 -7948 -10879 -12635 -5536 -11223 553 3291 -10689 -21627 -22366 -15679
7408 -15679 -10193 -10125 -4061 -11254 -20423 -21737 -21301 -24354 -24463 -24810 -20739 -12040 -14504 -9682 183 3066
7392C066o337n293L38n57L458j853p19P945o783j0237J34L423Q125K536j837k75
7376d866o820M17r165K519N994L050m447n476N155j125J0403L424n725J359l333
7361h636N080m365q755K288L891k12R40m049K095P537j24M745j0561j1543M599
7346a7070J2151m467J687K470M291J07o624n891P844m6j0091J866k361q695j165
7331b5994P652J4785j0743k539J2325K003l821M58r218m17O207Q867n996l980
7317a0411n174J387P734M411j002j3094k545Q010j0435k1K402K033M382K318J349
7302h656l864j052R513o820j0539L864N556J203o002m277J2125K520m795n587
7288a6811J237K433p720N276R999Q53R33m716o626o37J084K396J934L06L396l732
$$ plain form
7392 3066 -3271 -8564 -8226 -8783 -5325 -7178 -7897 48 -6735 -16972 -16838 -13415 -5290 -2754 -4591 -4866
7376 -4866 -11686 -11269 -20434 -17915 -11921 -8871 -13318 -18794 -13639 -14764 -4361 -937 -6662 -5303 -8636
7361 -8636 -3556 -7921 -16676 -14388 -10497 -10709 -9769 -13818 -11723 -4186 -4310 435 -10126 -21669 -17070
7346 -17070 -4919 -9386 -7699 -5229 -938 -831 -7455 -13346 -5502 -5548 -15639 -13773 -16134 -24829 -25994
7331 -25994 -18342 -3557 -14300 -16839 -4514 -2511 -6332 -5874 -15092 -15509 -9302 -435 -6431 -10411
7317 -10411 -15585 -14198 -6464 -2053 -3055 -16149 -18694 -10684 -21119 -21140 -18738 -16705 -12323 -10005 -8656
7302 -8656 -12520 -13572 -4059 -10879 -21418 -17554 -11998 -10795 -16797 -21074 -8949 -6429 -11224 -16811
7288 -16811 -15574 -13141 -20861 -15585 -5586 -4733 -3800 -8516 -15142 -15779 -14695 -12299 -10365 -10059 -6663 -10395
7272a0395p04n017M206R5m801L476M757R227n233n972l269K103l520L062L723
7257h262K783R101L623j102o943L25n844k416l129K585j2926p390N429J0166R600
7242d400O601Q449k475q657K006l089j1489L300K798o632j2554J1044J0480J0899
7228F281P081j0573m716j359q805M870L523P834L814K588n679k991O08j934J10
7213F52j242K990L418j166m28K01j2808l904k724P450L014l455m552N106J3712
7198F264M227j9666j2438N435J4236J1664l42r496o886k04M229o919N31P20m059
7183a2704J728R516K614j244O406k947j2110k046L349K24q707m887M110K078N87
7168a4033L209L098N049k805m298k143K903k004N611L330l762M706L700R749o859
$$ plain form
7272 -10395 -11099 -16116 -11910 -11815 -16616 -13140 -8383 844 -4389 -10361 -13630 -11527 -15047 -11985 -8262
7257 -8262 -5479 3622 7245 6143 -800 -475 -6319 -8735 -11864 -9279 -22205 -29595 -24166 -14000 -4400
7242 -4400 2201 10650 8175 -482 1524 -1565 -13054 -9754 -6956 -13588 -26142 -15098 -4618 6281
7228 6281 13362 2789 -1927 -3286 -12091 -7221 -3698 4136 7950 10538 4859 1868 2476 542 652
7213 652 -590 2400 5818 4652 4224 4425 -8383 -12287 -15011 -7561 -4547 -8002 -12554 -7448 6264
7198 6264 10491 -9175 -21613 -16178 -1942 9722 9380 -116 -7002 -7206 -2977 -9896 -9365 -8645 -12704
7183 -12704 -10976 -1460 1154 -90 6316 3369 -8741 -10787 -7438 -7214 -15921 -20808 -16698 -14620 -14033
7168 -14033 -10824 -7726 -2677 -5482 -9780 -11923 -9020 -11024 -5413 -2083 -5845 -1139 2561 12310 5451
7153E451m475l730n845n13m076q109K044Q467N009j444o079j106J758l26k517
7138a5491J654P429l708M546L116Q8m255k06K232k852J688O437m434n295m258
7123a3309j0180j668M787J1864N243l610K935m19j564O732M550m873m333j670
7109e515o727k251L997K700N318L793K779J36k734J205m264j1911r46M030J331
7094i059Q77j253j441N861J999K991R878m462k785n085p894J627J419P238r25
7079a014n65m573R179L066n610n553m26k133j592J562k774o414J427K763L506
7064i151l103K437J5139j0686j3881R885P475K872R990l972n077l959r505q106
7050a9642k754M013J593K111O056J1438L430m8l902j0458N660J371M91J273N081
$$ plain form
7153 5451 976 -2754 -8599 -9112 -13188 -21297 -19253 -10786 -5777 -7221 -13300 -14406 -12648 -12974 -15491
7138 -15491 -13837 -6408 -10116 -5570 -2454 -2366 -6621 -6827 -4595 -7447 -5759 678 -3756 -9051 -13309
7123 -13309 -23489 -25157 -20370 -8506 -3263 -6873 -3938 -4357 -5921 811 5361 488 -3845 -5515
7109 -5515 -12242 -14493 -10496 -7796 -2478 1315 4094 4230 1496 2701 -1563 -13474 -14420 -10390 -9059
7094 -9059 -8182 -9435 -10876 -5015 -3016 -25 9853 5391 2606 -2479 -10373 -8746 -7327 -89 -1014
7079 -1014 -1579 -6152 3027 6093 483 -5070 -5496 -7629 -9221 -7659 -10433 -16847 -15420 -12657 -9151
7064 -9151 -12254 -9817 5322 -5364 -19245 -9360 -1885 987 10977 7005 1928 -2031 -11536 -19642
7050 -19642 -22396 -18383 -16790 -14679 -8623 2815 6245 6197 2295 -8163 -2503 -1132 -641 632 5713
7035E713j756m855n171O247p60j0936j1998P351P293J741N450p895l610J090p884
7020a9980L022J2754K891n52m29q193p833k517k369Q519J584j2850j561P137O460
7005a3917O023o09j1791L31J1240o772n105K003J2142K039n239q676j216O311
6991a3236J944K989R594Q10j310l341r01P140K463m29n471M197P370l536j4197
6976e914J662J0526k241l232R70l652l766k631Q810r0l152q726J6K068k557N254
6960f655J556l674P8M777J4045m415q642r625M066O837J445M346J1384j484j6262
6945b223n309k99k719K024K482j250k187o525R65p168n307r096Q935Q504L027
6930a6146N451Q452n107n365L926O292L100L512m167j747J681k807l906J0216
$$ plain form
7035 5713 3957 -898 -6069 178 -582 -11518 -23516 -16165 -8872 -7131 -1681 -9576 -13186 -12096 -19980
7020 -19980 -16958 -4204 -1313 -1865 -2294 -10487 -18320 -20837 -23206 -14687 -13103 -25953 -27514 -20377 -13917
7005 -13917 -7894 -8503 -20294 -19963 -8723 -15495 -20600 -18597 -6455 -4416 -9655 -18331 -19547 -13236
6991 -13236 -11292 -8303 1291 2101 791 -2550 -3451 3689 6152 5723 252 4449 11819 8283 -5914
6976 -5914 -4252 6274 4033 801 1771 -1881 -5647 -8278 532 442 -2710 -11436 -11420 -9352 -11909 -6655
6960 -6655 -5099 -8773 -8695 -3918 10127 5712 -2930 -12555 -8489 -1652 -207 4139 15523 14039 -2223
6945 -2223 -7532 -7831 -10550 -8526 -6044 -7294 -9481 -16006 -15041 -22209 -27516 -36612 -27677 -19173 -16146
6930 -16146 -10695 -2243 -7350 -12715 -8789 -2497 603 4115 -52 -1799 -118 -2925 -6831 3385
6916C385P215R707m955j0216k656K811j1363r902P459k535k034p248j055O130
6902a5257l193j112k865K56L05J5236M734o243P067M105Q490j4482j1017l41q68
6887a5185J562P033O02J330K333r707p620j030L096L186P640J0653N291j1225
6873b041m573m478K270k367l317l228n616P649Q537j59j817j286l87P95K762o378
6857a3634J2047N863J266k022p986M69j34P576q348P227o591M49M80k89M138o392
6841e881j0382O276Q602J711J311M931K807p403j4193M964J1355N470l683L200
6827I085m967l785l908l765l135M466K570J458L334n590j04L739J054n305j3378
6812a8231m984m503J8448L327L986l426l749Q128L658R92L5j219q288L405N690
$$ plain form
6916 3385 10600 20307 15352 5136 2480 5291 -6072 -15974 -8515 -11050 -13084 -20332 -21387 -15257
6902 -15257 -18450 -19562 -22427 -22171 -21866 -6630 -1896 -8139 -1072 3033 11523 -2959 -13976 -14317 -15185
6887 -15185 -13623 -6590 -5988 -4658 -2325 -12032 -19652 -20682 -17586 -14400 -6760 3893 9184 -2041
6873 -2041 -6614 -11092 -8822 -11189 -14506 -17734 -23350 -15701 -7164 -7323 -9140 -10426 -10813 -10018 -7256 -13634
6857 -13634 -1587 4276 5542 3520 -4466 -3997 -4131 3445 -4903 2324 -4267 -3818 -3338 -3627 511 -5881
6841 -5881 -16263 -9987 -1385 326 1637 6568 9375 1972 -12221 -7257 4098 9568 5885 9085
6827 9085 4118 333 -3575 -7340 -10475 -6009 -3439 -1981 1353 -4237 -4341 -602 452 -4853 -18231
6812 -18231 -23215 -27718 -9270 -5943 -1957 -5383 -9132 -1004 2654 3646 3681 2462 -5826 -2421 3269
6797C269K170O049P193m250p966J534l407j0335M10J287k347O260O613n840J258
6782A898Q746P304J3833L6n191q272q182L831J636j4749p098k781J0878J0106
6768A1995K979j4483n047l241o29K847J0030M024j1858k563k183m171l90J0229
6754b461O177j632O081J413o408k500K934j643q756K710j104Q090P436l560m916
6739A861J142m91Rj466n031N526J950M972M012l028n639l154J502r053k849Q543
6723a194q023q373n334K603K627k304p881M786J491J135N124j057n509O084R191
6708f634K225N029O534j2807o722L691L887L377O317Om508n84P342o549j2587
6693a1983K722N729J2175n321o04O18j355j860p912l817n233K365L398Q465n023
$$ plain form
6797 3269 5439 11488 18681 14431 6465 7999 4592 -5743 -5333 -4046 -6393 -133 6480 640 1898
6782 1898 10644 17948 31781 31817 26626 18354 10172 14003 15639 890 -6208 -8989 1889 11995
6768 11995 14974 491 -4556 -7797 -8426 -5579 4451 8475 -3383 -5946 -8129 -12300 -12690 -2461
6754 -2461 3716 2084 8165 9578 3170 670 3604 1961 -6795 -4085 -5189 2901 10337 6777 1861
6739 1861 3003 2512 2521 1055 -3976 1550 3500 8472 12484 9456 3817 663 2165 -6888 -9737 -1194
6723 -1194 -9217 -17590 -22924 -20321 -17694 -19998 -27879 -23093 -21602 -20467 -15343 -16400 -21909 -15825 -6634
6708 -6634 -4409 620 7154 -5653 -12375 -8684 -4797 -1420 4897 4903 395 -189 7153 604 -11983
6693 -11983 -9261 -3532 8643 3322 2718 3336 1981 121 -7791 -11608 -16841 -14476 -11078 -2613 -7636
6678g636j0028j427K675j325j152j457k794q70N372K73q976K881J0137O118L950
6663d259J2679K629j1349o871R217Q823r740j430q682L13J495n931m04m974M09
6648a8075P904R999m906L687K033n792j587K714M768K382l86l003j3081k93N372
6633h264K186P904j484j2899r160J273P267K789K414n126O079l183J389l231L569
6618h477k225Q84k250k985R550n536j8j125L638J303N053J556k307l971j1031
6603a7941K331J1540L728R63M512j269n415q220j854J0352O912m646j605O338
6589E726p148p053N250n39o950m666J3458J1803Q948K935r664p124j134j40n650
6574a948j3560j809n010P743P649k638O412P209P454J780j1609M770K145J027
$$ plain form
6678 -7636 -17664 -19091 -16416 -17741 -18893 -20350 -23144 -24014 -18642 -18369 -27345 -24464 -14327 -8209 -4259
6663 -4259 8420 11049 -300 -7171 2046 10869 1129 -301 -8983 -8670 -7175 -13106 -13510 -18484 -18075
6648 -18075 -10171 -172 -5078 -1391 642 -5150 -6737 -4023 745 3127 2741 -262 -13343 -13636 -8264
6633 -8264 -6078 1826 342 -12557 -21717 -20444 -13177 -10388 -7974 -13100 -7021 -10204 -8815 -12046 -8477
6618 -8477 -10702 -9818 -12068 -15053 -5503 -11039 -11057 -12182 -8544 -7241 -2188 -632 -2939 -6910 -17941
6603 -17941 -15610 -4070 -342 621 5133 3864 -1551 -9771 -11625 -1273 5639 993 -612 5726
6589 5726 -1422 -8475 -3225 -3764 -10714 -15380 -1922 9881 18829 21764 12100 4976 3842 3702 -1948
6574 -1948 -15508 -17317 -22327 -14584 -6935 -9573 -3161 4048 11502 13282 1673 6443 8588 9615
6560I615q040j392N108K313J859j3715n450K64N865K073N519K881j834m542K628
6545C152r29l27N204r645l748N307Q310O081r213q371N357r448L117J5411R36
6530A1194j934M78o695q701k347N731n40k948m76K131P274M013j239L145J0283
6515A9369j3099j4363o407J063J120o89M228M250j432L599N121L797j760m489
6501C08l804o820j141n742K922l823J364k014j224Q56M564J0231N483j68k947
6486a955l90p924l173m447M042O631M857N774o474m905l236j255R242p218o261
6471a6692Q297l332K139r56n281k327O920j601k555N49k371l38R733J847k124
6456h092L671N790p04j2274p39N065j725k971O269p37p545q621m360N135J3252
$$ plain form
6560 9615 1575 183 5291 7604 9463 -4252 -9702 -9438 -3573 -1500 4019 6900 5066 524 3152
6545 3152 2223 1896 7100 -2545 -6293 -986 7324 13405 4192 -4179 1178 -8270 -5153 10258 11194
6530 11194 9260 9738 3043 -5658 -8005 -2274 -2814 -5762 -6238 -4107 3167 7180 5941 9086 19369
6515 19369 6270 -8093 -14500 -13437 -12317 -13006 -8778 -4528 -5960 -2361 2760 6557 4797 308
6501 308 -3496 -10316 -11457 -17199 -14277 -18100 -16736 -18750 -19974 -19118 -14554 -4323 1160 992 -1955
6486 -1955 -2345 -10269 -13442 -17889 -13847 -7216 -2359 3415 -3059 -7964 -11200 -12455 -3213 -10431 -16692
6471 -16692 -8395 -11727 -9588 -10544 -15825 -18152 -11232 -12833 -15388 -14839 -17210 -17548 -7815 -5968 -8092
6456 -8092 -4421 1369 665 -11609 -12348 -7283 -9008 -11979 -5710 -6447 -13992 -22613 -26973 -21838 -8586
6441h586N955j6914j2584N114J3017Q175P659J4109J0939N061L212j3182p088
6428A4887q776p589l514m586o036n993J5170M183n613o715J0306K158m613O22
6414f109M263n488j2962p05J1886R793m639l679l689j047L471K431P658K984r363
6399e195m699k313N291P534J7703r853k701r4P281O257m971r919j4606o9L163
6384g191J595P732R335M402J723p327n650m26m475n209M973J224M501p018j443
6369c254j676N630q553N547o002J2577Q56p125l830M449K801M329m254l621n167
6354g293m280N137J1397q85n711N183L177o595M136O762L948P117j290j4087j7748
6339a1032M026K614r273n818J0544J1796J230n95J165k105K90j848O150m802k876
$$ plain form
6441 -8586 -2631 -19545 -32129 -27015 -13998 -5823 1836 15945 26884 31945 35157 21975 14887
6428 14887 6111 -1478 -4992 -9578 -15614 -21607 -6437 -2254 -7867 -14582 -4276 -2118 -6731 -6109
6414 -6109 -1846 -7334 -20296 -21001 -9115 678 -3961 -7640 -11329 -12376 -8905 -6474 1184 4168 -5195
6399 -5195 -9894 -12207 -6916 618 18321 8468 5767 5673 12954 19211 14240 4321 -10285 -10354 -7191
6384 -7191 -5596 2136 11471 15873 17596 10269 4619 4193 -282 -5491 -518 706 5207 -1811 -3254
6369 -3254 -4930 700 -7853 -2306 -8308 4269 5125 -2000 -5830 -1381 1420 5749 1495 -2126 -7293
6354 -7293 -11573 -6436 4961 4076 -1635 3548 6725 130 4266 11028 14976 22093 20803 6716 -11032
6339 -11032 -7006 -4392 -13665 -19483 -8939 2857 4087 3492 4657 2552 2842 994 7144 2342 -534
6324e34P153N05j470k495m028K263o065L315Q827M54j0180j2689L733O027j188
6309f372n524O790O071j072r836M595L001Q70n740j5931N779R992L528J044Q54
6294a951J263J370m598J815o819L251q255n901l722L851P012J068J2731J819K24
6279C158n183k658k490n351j582P61l085Q571O318M707N50m928p721o722J1670
6264c985J3262J553q587j322N893Q88r526j0917J434N999j531j979L087O113L32
6249G14M338j285K18Q520J0225o856k224L079K218K73j0680j5863P68P2m984L833
6233g634r30L708P965M487o917p327j982Q10m279J0246l303l680k017J064K480
6218g309J0830j550j5802j2004R977Q988n820K044P493o73l810P339l683l562
$$ plain form
6324 -534 6619 7124 5654 3159 -869 1394 -4671 -1356 7471 7925 -2255 -14944 -11211 -5184 -6372
6309 -6372 -11896 -5106 965 -107 -9943 -5348 -2347 -1477 -7217 -23148 -17369 -7377 -3849 -2805 -1951
6294 -1951 -688 682 -3916 -2101 -8920 -5669 -13924 -19825 -23547 -19696 -12684 -11616 1115 2934 3158
6279 3158 -2025 -4683 -7173 -12524 -14106 -13345 -16430 -7859 -1541 3166 3716 -1212 -8933 -15655 -3985
6264 -3985 9277 10830 2243 921 6814 7702 -1824 -12741 -11307 -5308 -6839 -8818 -5731 382 714
6249 714 5052 3767 3985 12505 22730 15874 13650 16729 18947 19220 8540 -7323 -6555 -6483 -11467 -7634
6233 -7634 -8564 -4856 3109 7596 679 -6648 -8630 -7820 -12099 -1853 -5156 -8836 -10853 -9789 -7309
6218 -7309 3521 1971 -13831 -25835 -15858 -6870 -12690 -10646 -3153 -3826 -7636 -297 -3980 -7542
6204g542k9j52J4161Q295O760p583j6333q864J571N236K677R192j063n768j1241
6189a0683o256o57L659N324Q569n696j7611k053R928N562O772q022k437L803l248
6174a3046m72R213n348l512J472J3103N365m651q343L68q38k559P851m418j283
6159g098r62j795M146Q678O630K266J967m893p436N347k839L918q735j7128p089
6144b5023L722N079K473K019l609J2754J783R06o323m913M773j52L050M237j224
6129d48n643K989m340l249P989M364r536N383Q308o899l451J316r119r022O182
6114a5176J705N680O867N370L111Q833k500j2293r231q247l012j476N160J656
6100a3553k664R541N303q97n473o430m396J916J2572m24l671M145p232q20M696
$$ plain form
6204 -7542 -7571 -7723 6438 14733 21493 13910 -2423 -11287 -9716 -4480 -1803 7389 6326 558 -10683
6189 -10683 -16939 -17596 -13937 -8613 -44 -5740 -23351 -25404 -15476 -9914 -3142 -11164 -13601 -9798 -13046
6174 -13046 -13518 -4305 -9653 -13165 -11693 1410 6775 2124 -6219 -5851 -6689 -9248 -1397 -5815 -7098
6159 -7098 -8060 -9855 -5709 2969 9599 11865 13832 8939 1503 6850 4011 7929 -806 -17934 -25023
6144 -25023 -21301 -16222 -13749 -11730 -15339 -2585 -802 104 -6219 -11132 -6359 -6511 -3461 776 -448
6129 -448 -6091 -3102 -7442 -10691 -2702 1662 -7874 -2491 5817 -1082 -4533 -3217 -12336 -21358 -15176
6114 -15176 -13471 -7791 -924 4446 7557 16390 13890 1597 -7634 -15881 -18893 -20369 -15209 -13553
6100 -13553 -16217 -6676 -1373 -2270 -7743 -14173 -18569 -16653 -4081 -4505 -8176 -4031 -11263 -12083 -7387
6085g387N405K286M92K167Q30j1785p07J816q77m63P172Q667n796j0296n463K512
6069a1427K184M629L91R949J1347k591r743J331n132m129K115r30P673N585o850
6054D402j1529l571N596P273P906r52o734q066k654k918M762q188r79M074M394
6039g184p460n713O585O051l491j0142j352N270J1268J4333P169j1199m956M327
6025C506P635J041K922p457r828J409O107J143r969K783j437J999O929P519p434
6010F868K455j530k951M745o645p604L138N076j634L775M428J097l895J210J964
5995A0497N764k875p051j1590N652o910m787M878N722P252o1j609L705J617P016
5980A7220N042M752r103j1250q609o812J1313O659k053o152L193o97J265J071
$$ plain form
6085 -7387 -1982 304 796 2963 3793 -7992 -8699 -6883 -7760 -8223 -1051 7616 1820 -8476 -13939 -11427
6069 -11427 -9243 -4614 -4223 5726 17073 14482 4739 6070 938 -3191 -1076 -2006 5667 11252 4402
6054 4402 -7127 -10698 -5102 2171 10077 9125 2391 -5675 -8329 -11247 -6485 -14673 -15652 -11578 -7184
6039 -7184 -14644 -20357 -13772 -7721 -11212 -21354 -22706 -17436 -6168 8165 15334 4135 -821 3506
6025 3506 11141 12182 15104 7647 -2181 -772 5335 6478 -3491 -708 -2145 -146 6783 14302 6868
6010 6868 9323 7793 4842 9587 2942 -4662 -1524 3552 1918 5693 10121 11218 7323 8533 10497
5995 10497 16261 13386 6335 -5255 397 -6513 -11300 -6422 -700 6552 6491 4882 8587 10204 17220
5980 17220 22262 27014 17911 6661 -1948 -8760 2553 9212 7159 1007 4200 3503 4768 5839
5966E839o411q853k370Q482L296J945O488L878p459r90l338l528l528J3569k14
5951F806n212P738L138j3073j604j485K621O634M289O9K039j5J290j1020l061
5936h46R49n129m578m641k050k222K092N217j561J1064O181l228p282J444O967
5921B377l440k942P701K954n1q64J544J676q619j0549p761j401M236J3011K413
5906B85l323k66L690k094P075J538l792k246M620k629m299O77K677l341l492k201
5890g121K056Q075K955P226l808r11o402q739m431Q142k341j913J709N984K891
5875C372q886l99R51L690L480L759L740m393M397n744j0094J167J5308l349j1287
5860d288Q658J687O053k454j2909k484O932K087j434k407O462J395j129Q4L88
$$ plain form
5966 5839 -572 -9425 -11795 -3313 -17 1928 8416 12294 4835 3845 507 -3021 -6549 7020 6806
5951 6806 1594 9332 12470 -603 -2207 -3692 -1071 5563 9852 9921 11960 11945 13235 2215 -846
5936 -846 103 -5026 -9604 -14245 -16295 -18517 -16425 -11208 -12769 -1705 4476 1248 -6034 -4590 2377
5921 2377 -1063 -4005 3696 6650 6599 5735 7279 8955 336 -10213 -17974 -19375 -15139 -2128 285
5906 285 -3038 -3304 386 -1708 5367 6905 3113 867 5487 2858 -1441 -764 1913 -1428 -4920 -7121
5890 -7121 -5065 3010 5965 13191 9383 8472 2070 -6669 -11100 -2958 -5299 -7212 -5503 481 3372
5875 3372 -5514 -5913 -4962 -1272 2208 5967 9707 5314 9711 3967 -6127 -4960 10348 6999 -4288
5860 -4288 4370 6057 12110 9656 -3253 -5737 1195 3282 1848 -559 5903 7298 6169 6253 6641
5845F641N575P863j2357j662j098p868N527k400q470n06R755l202M929J19J0375
5830A3221o405k695k393r261P182q50L032Q144j555j842J808k559l912j358m753
5815d196q00L984N397p309M263Q013L030o034o516j7632K89N944K906J2251O726
5800A0316p138k683r77R209j962K802k06j0419q579L030P035p4J004q20o340r8
5784e900o712L9l236J4487N753o704J165J272M715j653n831Q82J720p274j17o42
5768h036l672M725O536J202J2749P480p800r551L344M468m791n210k990l795j039
5753f380o454p49J2379L018K372J71J1928J1605o034m014o153q982K0L607l342
5738B992k4Q84k745q686n37M232o134O401O134J875K927k499r741q836r81J930
$$ plain form
5845 6641 12216 20079 7722 6060 4962 -2906 2621 221 -8249 -8755 1000 -2202 2727 2846 13221
5830 13221 6816 4121 1728 -7533 -351 -1201 1831 9975 8420 6578 8386 5827 1915 557 -4196
5815 -4196 -4996 -1012 4385 -2924 1339 9352 12382 6348 -168 -17800 -17511 -11567 -8661 3590 10316
5800 10316 3178 495 -482 8727 6765 9567 9361 -1058 -9637 -6607 428 354 1358 538 -5802 -5900
5784 -5900 -12612 -12573 -15809 -1322 4431 -2273 -1108 164 4879 3226 -2605 -1723 -3 -7277 -7394 -8036
5768 -8036 -11708 -6983 -447 755 13504 20984 13184 3633 6977 11445 6654 1444 -1546 -5341 -6380
5753 -6380 -12834 -13583 -1204 1814 4186 4357 16285 27890 21856 17842 11689 2707 2727 6334 2992
5738 2992 2968 3852 1107 -7579 -8116 -3884 -10018 -3617 2517 4392 7319 4820 -4921 -13757 -14738 -12808
5722a2808O286L906m031j983P595J0423n931j5188k58N982n789q017J127Q657
5708a0029K75k115J787J714K020R539J015r669J768J4366n007q108p129J401J914
5693f258J344M749j448K678J227p009M226J4205N726j2256m843k250j904q861
5679a0674k26O765K761p215l344R885N577l164M847J87j422P921p888j7584l372
5664a6946P701N260J39K889L300j334p664m540K279k41K61k550R729P413J481
5649G177K876r735J746J765n80l028l216o108L309j1005j391L002N871M074n953
5634a1196j130J9615K64O627J705l26l407L76K513J040r16p503n893P703P497
5619A6969p103j974Q279q534j2951R647Q113k916o249j785j190R49L048l6m100
$$ plain form
5722 -12808 -6522 -2616 -6647 -8630 -1035 9388 3457 -11731 -11989 -6007 -11796 -19813 -18686 -10029
5708 -10029 -9754 -11869 -10082 -8368 -6348 3191 4206 -5463 -3695 10671 5664 -2444 -9573 -8172 -6258
5693 -6258 -4914 -165 -1613 1065 2292 -4717 -491 13714 19440 7184 2341 91 -1813 -10674
5679 -10674 -10900 -4135 -1374 -8589 -11933 -2048 3529 365 5212 5399 3977 11898 4010 -13574 -16946
5664 -16946 -9245 -3985 -3846 -957 2343 1009 -6655 -11195 -8916 -9157 -8896 -11446 -1717 5696 7177
5649 7177 10053 318 2064 3829 3249 221 -2995 -9103 -5794 -16799 -18190 -15188 -9317 -5243 -11196
5634 -11196 -12326 7289 7553 14180 15885 15559 12152 12528 15041 16081 15165 7662 1769 9472 16969
5619 16969 9866 7892 16171 7637 -5314 4333 12446 9530 3281 1496 306 1255 4303 4267 167
5604A67j064J116J955M362q30k180p058J083r288j1113M492J2712Q881J453n751
5589a063r164N268R513K94n366P9K797p215q189r36O067K378K039Q86n291n121
5573a3024K426N697J935o603r006R141R948j771J2121L755k097k538j2814j2043
5559a4873L970M052r33O95j745K988L700m95O663N05l649j0407j138K495K510
5544e662M998M450l955m680o054k43J7522J7518l654n185k839j0142p164L923
5530a167l442K821J120J394J03O155K372q292j834K638l057m507j428j490K747
5515e867J903j0234k787K3559O514j3970J778j784k58Q02L395L009l566n857k578
5500e941m693J899J541K072L563L706M177Q004o783p988o75M48K394j735q917
$$ plain form
5604 167 -897 219 2174 6536 5706 3526 -3532 -2449 -11737 -22850 -18358 -5646 3235 4688 -1063
5589 -1063 -10227 -4959 4554 4848 -518 -439 2358 -4857 -13046 -13982 -7915 -5537 -3498 -2612 -7903 -13024
5573 -13024 -10598 -4901 -2966 -9569 -18575 -9434 514 -1257 10864 14619 12522 9984 -2830 -14873
5559 -14873 -10903 -6851 -7784 -7089 -8834 -5846 -2146 -2641 4022 4527 878 -9529 -10667 -8172 -5662
5544 -5662 -664 3786 -169 -4849 -10903 -11146 6376 23894 20240 15055 12216 2074 -5090 -1167
5530 -1167 -4609 -1788 -668 726 829 6984 9356 1064 -770 1868 -1189 -5696 -7124 -8614 -5867
5515 -5867 -3964 -14198 -16985 6574 13088 -882 896 -888 -1146 -344 3051 6060 2494 -3363 -5941
5500 -5941 -10634 -8735 -7194 -5122 -1559 2147 6324 14328 7545 -443 -1118 -670 1724 -11 -8928
5485h928n913o204J0865M439L944R418O542q874m067p506p252q89J7276j151p224
5470e524r640M176J1787N720k387N907l858m859m27L323P839p689j8519o031J1183
5455h999M523N369R532J636l712p22k893j031r467r716L221M044k893j733J480
5440a1361L707J249j478O799M962n661q078p924J546n999M987J1521p0r50K976
5425c774j477L126N564P086n924o951n06R73Q607P847l678o212j557r548l52L445
5409c331N915J065O704n674n251m240R32J889q3p124l863j2020m124Q206R301
5394a1698M075L850j939O030J2156P4J923K211n995j0777m767n250p091L542K729
5379a0927L030q93K261K597Q723O426n205r505o975l825M626J0781L354L434n958
$$ plain form
5485 -8928 -14841 -21045 -10180 -5741 -1797 7621 14163 5289 1222 -6284 -13536 -14425 2851 1700 -5524
5470 -5524 -15164 -10988 799 6519 4132 10039 6181 1322 895 4218 12057 4368 -14151 -20182 -8999
5455 -8999 -4476 893 10425 12061 8349 7627 4734 3703 -5764 -15480 -12259 -8215 -11108 -12841 -11361
5440 -11361 -7654 -6405 -7883 -1084 3878 -1783 -9861 -17785 -16239 -22238 -17251 -5730 -5800 -6750 -3774
5425 -3774 -5251 -2125 3439 10525 4601 -2350 -2856 -1883 6724 14571 10893 4681 3124 -6424 -6776 -3331
5409 -3331 2584 3649 10353 4679 -572 -4812 -3880 -1991 -2074 -9198 -13061 -25081 -29205 -20999 -11698
5394 -11698 -7623 -3773 -5712 318 12474 12548 14471 16682 10687 -90 -4857 -10107 -17198 -13656 -10927
5379 -10927 -7897 -8790 -6529 -3932 4791 11217 6012 -3493 -10468 -14293 -9667 1114 4468 7902 1944
5364A944l732k431O145p893o633M779J692n213k159J0758n37j2180o198N428k867
5349a9097K646R239r731o391M29M545J1332J0584N491j2912l814M270K937m814
5335e286l608o693J991L071L312J830K974k732M362N403K40n952p046J2650J204
5320E720m703r699O897O425l564L522K339l088p662r704P861J0128O7J530j738
5305D331K588J117q614K885K065P0n032L09J149L712K739L686p254j1908K940
5290e217M428N636K047j846q691r464K494Q986R221j000j2118N282O271J2014
5276A8043o528p686m76J2916J2794K223p569k694j1568j2612j552K899q92n475
5262h177j934O576Q050O13o922l781o360K79R404j809l380K620J057K156j609
$$ plain form
5364 1944 -1788 -4219 1926 -5967 -12600 -7821 -6129 -11342 -13501 -2743 -3280 -15460 -21658 -16230 -19097
5349 -19097 -16451 -7212 -16943 -23334 -22905 -18360 -7028 3556 9047 -3865 -7679 -3409 -472 -5286
5335 -5286 -8894 -15587 -13596 -10525 -7213 -5383 -2409 -5141 -779 4624 4864 -1088 -8134 4516 5720
5320 5720 1017 -8682 -1785 4640 1076 4598 6937 3849 -3813 -13517 -5656 4472 4539 6069 4331
5305 4331 6919 8036 -578 2307 4372 4442 -590 -281 868 4580 7319 11005 3751 -8157 -5217
5290 -5217 -789 4847 6894 5048 -3643 -13107 -10613 -1627 7594 6594 -5524 -242 6029 18043
5276 18043 11515 3829 3353 16269 29063 31286 23717 21023 9455 -3157 -4709 -1810 -2702 -8177
5262 -8177 -10111 -3535 4515 5128 -1794 -5575 -11935 -11656 -2252 -4061 -7441 -4821 -3764 -1608 -3217
5247c217j2446q500J7319J5748M528N608l219j4937k566M567l437p327M91M478
5233b910L253O76n063j071N255J3508j4325j8303R630N502k899J12r96R038q7
5218A320j0034n83N464L850L03n077O617k951K958J122j582N201J475n390j5332
5203a2639k376k126P653k077M690j394q45J108J5189J840K593j167L852Q72o162
5188I011n904L665J351l728m135P170K595m308m363P678K459p792m695k60J240
5173a6j3663n930N900O160M823q2M144L195l730p826q653M16N418N837M57J359
5157b191Q603M328N455l247q768o517J1535k607q934n274j616j210J948P186l689
5142d998o914n159M634R562k237O8J2362J744j0551j3755k397P003J785L103K831
$$ plain form
5247 -3217 -15663 -24163 -6844 8904 13432 19040 15821 884 -1682 2885 -552 -7879 -7388 -2910
5233 -2910 343 1019 -4044 -5115 140 13648 -677 -18980 -9350 -3848 -6747 -6635 -7631 1407 1320
5218 1320 -8714 -9297 -3833 17 320 -4757 1860 -1091 1867 2989 1407 6608 8083 2693 -12639
5203 -12639 -15015 -17141 -9488 -11565 -6875 -8269 -9114 -8006 7183 9023 11616 10449 14301 15173 9011
5188 9011 3107 6772 8123 4395 260 7430 10025 5717 1354 9032 11491 3699 -996 -1256 -16
5173 -16 -13679 -19609 -13709 -7549 -2726 -2808 1336 4531 801 -7025 -15678 -15262 -9844 -4007 -3550 -2191
5157 -2191 6412 10740 16195 12948 4180 -2337 9198 6591 -2343 -7617 -9233 -10443 -8495 -1309 -4998
5142 -4998 -11912 -17071 -12437 -2875 -5112 -5044 7318 9062 -1489 -15244 -17641 -10638 -8853 -5750 -2919
5127b919O03Q656M330j604q360p585q889o451P203N120O715l578m459p546K387
5112a6377J1564R400O587O059o823j221o805N96r3L338M445N473r24p641o026
5097A552q166o465J066Q453j883M505M280j0468p954j657k50K790J1923k189q190
5082a2653L252N903P669n14K512P258k05j5335p665o105j95J2469P887k085M59
5067B652k749j0656l223K999Q35J340J700M008P942J4371L820k232K392j582o347
5052A5270K598n849j901j192m346J144K695k960k378q840r020R410O331m269J509
5037a798n33J283K698j1571N573K848o097n703k433L078Q317K021J0110J3175
5023B0968o071q699k867J0762n810o348m977m878N060Q261j692l828L506k346
$$ plain form
5127 -2919 -2316 6340 10670 9066 706 -6879 -15768 -22219 -15016 -9896 -3181 -6759 -11218 -18764 -16377
5112 -16377 -4813 4587 11174 17233 10410 9189 2384 2980 2887 6225 10670 16143 15219 7578 1552
5097 1552 -6614 -13079 -12013 -3560 -5443 -938 3342 -7126 -15080 -16737 -16987 -14197 -2274 -4463 -12653
5082 -12653 -9401 -3498 4171 3657 6169 13427 13222 -2113 -9778 -15883 -16078 -3609 4278 2193 2652
5067 2652 -97 -10753 -13976 -10977 -10142 -8802 -7102 -3094 4848 19219 23039 20807 23199 21617 15270
5052 15270 17868 12019 10118 8926 4580 5724 8419 5459 3081 -5759 -14779 -5369 962 -3307 -1798
5037 -1798 -2331 -1048 1650 -9921 -4348 -1500 -7597 -13300 -15733 -12655 -4338 -2317 7793 20968
5023 20968 14897 6198 3331 14093 8283 1935 -3042 -7920 -2860 5401 3709 -119 3387 1041
5009A041n785O668J246r74K591L097k511P02J962N431N998N239N745q254p479
4994A4717n517l811L351N947j0514o410k059l390O413l64M290J445j75L137q95
4979F165M05q59q352l574J244n084M49j156J0977M516o625q674L306P278o785
4964f769J826l823j951P643M661m875N095M919J938q12K270l381N666N293m011
4949A3689r289j4709q378N988K497K651K56R029Q94J320N334J770J520o88o326
4934E558j0913l994M065R642J451J181m796K788Q82p203l167L757N876k046j2339
4919i258k148M46r122P243K477K633M937J0445R60n112J839M759r285m483N078
4904A409L501k273k714Q86o731M465O161J77L327l050j0974L179O552Q411N342
$$ plain form
5009 1041 -4744 1924 3170 2196 4787 7884 5373 6075 8037 13468 19466 24705 30450 22196 14717
4994 14717 9200 5389 8740 14687 4173 -2237 -4296 -7686 -1273 -1637 2653 4098 3923 7060 6165
4979 6165 6570 5711 -2641 -6215 -4971 -10055 -9606 -10762 215 4731 -1894 -10568 -7262 16 -6769
4964 -6769 -4943 -8766 -10717 -3074 1587 -3288 1807 6726 8664 7852 10122 6741 12407 17700 13689
4949 13689 4400 -10309 -18687 -12699 -10202 -7551 -7295 1734 2628 3948 9282 11052 12572 11884 5558
4934 5558 -5355 -9349 -5284 4358 5809 6990 2194 4982 5864 -1339 -4506 -749 5127 3081 -9258
4919 -9258 -11406 -10960 -20082 -12839 -10362 -7729 -2792 7653 8613 3501 5340 10099 814 -3669 1409
4904 1409 4910 2637 -77 809 -5922 -1457 4704 4881 8208 5158 -5816 -2637 3915 12326 17668
4889A7668j0680j145j1026J078J2878J877n235N33k649j0749j2241P053J5116
4876B478k616n361m8M487P407P154J0893o84r462m67O612J1233j326j5652q767
4861E881J797R73K663m972K88J070n802q604l140J881q47Q38J0954Q590n96l842
4845G132m672N386m505j2280k519k736L096n7J743m12K481k103J559k7P905l287
4829c296l66Q892l594o126p814K964l724L257M61N96K312J951Q755j606J710O434
4813A0806M994k593p135o94K287l701o810R72O710L659M403K031J126L277o173
4798A3159j1572q408L275J0553k864m023n302O923L570p926M52j572N909k83k471
4783e80L477K241j37J306k199l585L701J868k135k327K10l977J075r92L160L765
$$ plain form
4889 17668 6988 5843 -5183 -4105 8773 10650 5415 5948 3299 -7450 -19691 -12638 2478
4876 2478 -138 -5499 -5547 -1060 6347 13501 24394 23710 14248 13781 20393 31626 30300 14648 5881
4861 5881 7678 8651 11314 6342 6630 7700 1898 -6706 -9846 -7965 -8812 -7974 2980 11570 10974 7132
4845 7132 2460 7846 3341 -8939 -11458 -14194 -11098 -11155 -9412 -9824 -7343 -9446 -7887 -7914 -9 -3296
4829 -3296 -3662 5230 1636 -4490 -12304 -9340 -13064 -9807 -9346 -8750 -6438 -4487 4268 2662 4372 10806
4813 10806 15800 13207 6072 5378 7665 3964 -2846 -1874 4836 8495 12898 14929 16055 19332 13159
4798 13159 1587 -6821 -3546 7007 4143 120 -5182 1741 5311 -2615 -2163 -3735 2174 1891 -580
4783 -580 2897 5138 5001 6307 4108 523 4224 6092 3957 1630 1840 -2137 -1062 -2054 1106 4871
4767D871P090J220o041n005N844o191o139O241K792j0948p495J235M422P438M24
4752b42o737M709n786q190J563J0292K388p66o517p397J0141P172Q431o568J109
4737C602o924q320m535P300o124L597J983P094L467J0963m316q644j874J123K51
4722a357R60M295m152j0715p168J854O358J2431K359j918l364r301n655P082Q689
4707C98M077q366r89k832n991L814Q597r358J566L739J656k518j425L971o035
4692i696P898J365l67O314L234k741J442N78N48l489n322M05L091n828J629K615
4676A676q412l603M454J643j632L170M587k4q909p627J825j282K667N321L40J544
4660d262M051N23j056k715o570R78j156j953P382M407N151j267L854L569n951
$$ plain form
4767 4871 11961 13181 7140 2135 7979 1788 -4351 1890 4682 -6266 -13761 -12526 -8104 -666 -242
4752 -242 -6979 -2270 -8056 -16246 -14683 -4391 -2003 -2769 -9286 -16683 -6542 630 9061 2493 3602
4737 3602 -3322 -11642 -16177 -8877 -15001 -11404 -9421 -2327 1140 12103 7787 -857 -2731 -1608 -1357
4722 -1357 -397 3898 -254 -10969 -18137 -16283 -9925 2506 4865 2947 -417 -9718 -15373 -8291 398
4707 398 4475 -3891 -4880 -7712 -13703 -9889 -1292 -10650 -9084 -5345 -3689 -6207 -7632 -3661 -9696
4692 -9696 -1798 -433 -800 5514 8748 6007 7449 8027 8575 5086 -236 169 3260 -2568 -939 1676
4676 1676 -6736 -10339 -5885 -4242 -5874 -2704 1883 1859 -7050 -14677 -12852 -14134 -11467 -6146 -5806 -4262
4660 -4262 -211 312 -744 -3459 -10029 -9051 -10207 -12160 -4778 -371 4780 3513 7367 10936 4985
4645D985j4469o800J043k751j442R726R257K267q034k467J233j479N231N917j891
4630C26k817j092N503m610m649n189o407Q411P792J9975j009o883j511K243j306
4615H777n104J947n478M244K981P07j636n485o155O715J016O959j7634o229o25
4600a5000Q807m756j605Q295J0436Q757l064l079K808q990j678M64j224M817K591
4585G579K859r400r866j492O867J2061L37j730l153n111M87K039O823l811N810
4570A0299M917J789k0558r414J0905Q949K88j2290m289J6323L165p134J487l646
4556G91O694J1387n64j157K909M186r260n085Q538j700j8673m089N205J506L105
4541C793M562j2855K001L05n045j669K667L227j509o8L378o049P557J564n608
$$ plain form
4645 4985 -9484 -16284 -15241 -17992 -19434 -9708 -451 1816 -6218 -8685 -7452 -8931 -3700 2217 326
4630 326 -2491 -3583 1920 -2690 -7339 -12528 -18935 -10524 -2732 17243 16234 9351 7840 10083 8777
4615 8777 3673 5620 142 4386 7367 8074 6438 953 -5202 1513 2529 9488 -8146 -14375 -15000
4600 -15000 -6193 -10949 -12554 -4259 6177 14934 11870 8791 11599 2609 931 1395 171 4988 7579
4585 7579 10438 1038 -8828 -10320 -3453 8608 8945 7215 4062 -1049 -562 1477 8300 4489 10299
4570 10299 15216 17005 -3553 -12967 -2062 6887 7175 -5115 -9404 6919 10084 2950 4437 791
4556 791 7485 18872 18308 17151 20060 24246 14986 9901 18439 16739 -1934 -6023 -818 688 3793
4541 3793 8355 -4500 -2499 -2194 -7239 -8908 -6241 -3014 -4523 -4591 -1213 -7262 295 1859 -3749
4526c749Q965k559O327O107M568O213m842j2859J604p607l970P176k3j755J3969
4511A7565j536p201o854j316J1054r107p391m069o63q46L689j508j082P255q6
4496b096k991L127K090r269j0458n842n611Q548N117O37j885o517O590O752O817
4481d991J7144L295j3503j1336O915K634k273n136L986L67m587Q94J6442o291
4467C560L261J721r086k089M440L99K254m241j976Q560P361m564o204l230p414
4452g248O159m639l414O639L971Q308L547k778o540J084n400j5642l218P296J017
4437a0858k002J0977L117m422L532l869q02M578L995l641l510o91J1509Q470j0138
4422F245k969M852q1k848k522O400n316r717L95M889L095N0L858l071j463J10
$$ plain form
4526 -3749 5216 2657 8984 15091 19659 25872 21030 8171 9775 2168 -1802 5374 5351 3596 17565
4511 17565 16029 8828 1974 658 11712 2605 -4786 -8855 -9518 -10364 -6675 -8183 -9265 -2010 -2096
4496 -2096 -5087 -1960 130 -9139 -19597 -25439 -31050 -22502 -17385 -16748 -18633 -25150 -18560 -11808 -4991
4481 -4991 12153 15448 1945 -9391 -2476 158 -2115 -7251 -3265 -2898 -7485 -6591 9851 3560
4467 3560 6821 8542 -544 -2633 1807 2206 4460 219 -1757 6803 14164 9600 3396 166 -7248
4452 -7248 -1089 -5728 -9142 -2503 1468 9776 13323 10545 4005 5089 -311 -15953 -19171 -11875 -10858
4437 -10858 -12860 -1883 1234 -3188 344 -3525 -4327 251 4246 605 -2905 -3596 7913 16383 6245
4422 6245 3276 8128 8047 5199 2677 9077 3761 -5956 -5561 -672 2423 2473 6331 3260 1797 1907
4406A907m099j4072j782Q760l262P094O648n777l988M096J33P445R791l808M353
4391A3439j762m781K908K756m533l555K81j631o336J202Q294N608J609P428M678
4376B5605P26n200r652k750l286L18R39o265p370j1488M343R92o82j772M936L314
4360g292m837J1661Q813m745R581L259n099r954q911k023N029L114R603l152n951
4345i04n786K695Q007k037K532J108m851J0351J313r993m681J6125R282m688j2642
4330E831p693R656Q506m445q183j3319o914N838Q245P35p914n271P862M758R309
4315G001M371j108j3178l336Q556M741L115O761o208p57M892m8m031j1065m703
4300d997M503j36J192o523l068q4k622L631J3735R935j915m749J388K842n134
$$ plain form
4406 1907 -2192 -16264 -18046 -9286 -12548 -5454 1194 -4583 -8571 -4475 -4342 3103 12894 9086 13439
4391 13439 11677 6896 9804 12560 8027 4472 4753 3122 -3214 -2012 6282 11890 13499 20927 25605
4376 25605 26331 21131 11479 8729 5443 5761 6700 435 -6935 -18423 -14080 -13088 -13770 -15542 -10606 -7292
4360 -7292 -12129 -468 8345 3600 13181 16440 11341 1387 -7524 -9547 -4518 -1404 8199 5047 -904
4345 -904 -6690 -3995 4012 1975 4507 5615 764 11115 12428 2435 -2246 13879 23161 18473 5831
4330 5831 -1862 7794 16300 11855 3672 -9647 -16561 -10723 -2478 -1743 -9657 -14928 -7066 -2308 7001
4315 7001 11372 10264 -2914 -6250 2306 7047 10162 16923 10715 9958 14850 14802 10771 -294 -4997
4300 -4997 -494 -630 562 -5961 -9029 -9113 -11735 -8104 5631 15566 13651 8902 10290 13132 7998
4285G998r987j653J1954l320p1L864R68J2149M428j5494n509O056j2835k16O563
4270D895j048o898k019r23l149L30J1236N773l070p814j1174L19Q177j152J3790
4255G273L972j970l786p620n84k337L978M983K228p230k320n592P333O719j258
4240C789k356O673J0278K489N247R34j9309j0960N931Q040O73l575Q577p227n865
4225C339q73Q199L224l28k896j4846l904L250K638n29j236Q329L17q59J904J831
4209G560j916J1861j794j1134l906K408o354j1052J3947N113m243K503k499Q76
4195A370j590j387J392q438J04J996N82N794J667P596r97K41J341M753J215J79
4179A5818j194q229m783m833K44j133j129k32M621m862m709J1391L268M409K087
$$ plain form
4285 7998 -1989 -3642 8312 4992 4921 8785 9753 21902 26330 10836 5327 11383 -1452 -1668 4895
4270 4895 3847 -3051 -5070 -5993 -9142 -8812 2424 8197 5127 -2687 -13861 -13542 -5365 -6517 7273
4255 7273 11245 9275 5489 -2131 -2715 -5052 -1074 3909 6137 -1093 -3413 -9005 -1672 5047 3789
4240 3789 1433 8106 18384 20873 26120 27054 7745 -3215 2716 10756 11429 7854 16431 9204 3339
4225 3339 2466 10665 13889 13561 10665 -4181 -8085 -4835 -2197 -2726 -3962 4367 4684 3825 5729 7560
4209 7560 5644 17505 15711 4577 671 3079 -3275 -14327 -380 4733 490 2993 494 1370
4195 1370 -220 -1607 -215 -8653 -8549 -6553 -5971 -177 1490 9086 8089 8330 9671 14424 15639 15818
4179 15818 14624 6395 1612 -3221 -2977 -4110 -5239 -5471 -850 -5712 -10421 970 4238 8647 10734
4164A0734L538N25o269o507o54o494m994K09R862p712J268J725K467P98Q875K866
4148A0237J3439K422M248j2736q156K436L214n823r379q00N540R31M385N23O050
4133A6531p97r462j3731J5119J0889l354p422q232l140J514l617L014L162Q59
4119A333M183N937J745m907r482P261L125K507q043J69l88q65j0873O215P565
4104E482m346q869l751N913O035J0002P223m309j0209l88O09K264m125k690m383
4089e542n26j628L274L756Q198L149M399o467k391L55m884m50M4j94j436N111
4073D768M480M39l997o762k357P28P44N931p03l119m169o278j265Q017m32j1589
4057a5564M656J424o859N625J609q431m399J2040J5973N18j0597p850M668J314
$$ plain form
4164 10734 14272 14797 8528 2021 1367 -5127 -10121 -9912 -50 -7762 -6494 -4769 -2302 -1504 7371 10237
4148 10237 23676 26098 30346 17610 9454 11890 15104 9281 -98 -898 4642 5573 9958 10481 16531
4133 16531 15734 6272 -7459 7660 18549 15195 7773 -459 -3599 -2085 -5702 -2688 474 1333
4119 1333 5516 11453 13198 8291 -1191 6070 9195 11702 3659 3828 3440 2575 -8298 -2083 5482
4104 5482 1136 -7733 -11484 -5571 464 10466 17689 13380 3171 2783 3392 5656 1531 -1159 -5542
4089 -5542 -6068 -7696 -4422 -666 7532 10681 15080 8613 6222 6577 1693 1243 1287 1093 -343 4768
4073 4768 9248 9687 5690 -1072 -3429 -2701 -1957 3974 3271 152 -4017 -10295 -11560 -3543 -3975 -15564
4057 -15564 -10908 -9484 -16343 -10718 -9109 -17540 -21939 -9899 6074 6592 -4005 -11855 -7187 -5873
4043e873J795Q651M153j0704J90J982m420k218Q884J84r928j800J1920O41o561
4028c104l233o31n000O302N309q663j099N797R791K708j584l720R207j501m584
4013E995M235N622j706n443n394j217j213r844j755L056J305M318K371k226P38
3998a158J317n860J414J285L624Q946O815m24k623O608N208r551j0603j3777J108
3983g671m48j348R8j137P073N775l366q505J2558P765N37Q367m306j2191K703
3968E904K131n676l697K585j928M042P310n277o268N124Q230K299k427n532K268
3953I088o930M018j132k92Q074r542j459L051r387k471q00m322n130L019O820
3938g395K513M647J2269Q46j584k297M374P04n707K973k703L361P461n494j0035
$$ plain form
4043 -5873 -4078 4573 8726 -1978 -1788 194 -4226 -6444 2440 2624 -7304 -9104 2816 3457 -3104
4028 -3104 -6337 -6968 -11968 -5666 -357 -9020 -10119 -4322 5469 8177 6593 2873 12080 10579 5995
4013 5995 10230 15852 14146 8703 3309 2092 879 -8965 -10720 -7664 -6359 -2041 330 -1896 -1158
3998 -1158 159 -5701 -4287 -3002 622 9568 16383 15959 13336 19944 25152 15601 4998 -8779 -7671
3983 -7671 -8119 -9467 -9369 -10506 -3433 2342 -1024 -9529 3029 10794 11331 19698 15392 3201 5904
3968 5904 8035 2359 -1338 1247 -681 3361 10671 5394 -874 4250 12480 14779 12352 6820 9088
3953 9088 2158 6176 5044 4752 12826 3284 1825 4876 -4511 -6982 -7782 -12104 -17234 -14215 -7395
3938 -7395 -4882 -235 12034 12880 11296 8999 13373 14077 8370 11343 8640 12001 19462 13968 3933
3923C933o475J785J5782L418p076J178L276K489o523r942k488J88M185J536m390
3908H76j627P789P193P606M190l426R167p098j1343q49O585p6k521L815j1538
$$ plain form
3923 3933 -2542 -757 15025 18443 11367 12545 15821 18310 11787 1845 -643 -455 3730 5266 876
3908 876 -751 7038 14231 21837 26027 22601 31768 24670 13327 12478 19063 18987 16466 20281 8743
$$ [...]
##END NTUPLES=NMR SPECTRUM
##END=
