##TITLE=Analysis number 324045
Compound Code mo 00800
Book Reference a
Project Code adrs
Chemist Name new century
##JCAMPDX= 6.0         $$ Bruker NMR JCAMP-DX V2.0
##DATA TYPE= NMR SPECTRUM
##DATA CLASS= NTUPLES
##ORIGIN= Bruker BioSpin GmbH
##OWNER= nmr
$$ XWIN-NMR		Version 3.5
$$ Tue Nov 14 10:02:11 2006 GMT Standard Time (UT+0h)  MAYBRIDGE\nmr@NMR_250MHZ
##.OBSERVE FREQUENCY= 250.131544655141
##.OBSERVE NUCLEUS= ^1H
##.ACQUISITION MODE= SIMULTANEOUS (DQD)
##.ACQUISITION SCHEME= undefined
##.AVERAGES= 16
##.DIGITISER RES= 18
##SPECTROMETER/DATA SYSTEM= dpx250
##.PULSE SEQUENCE= zg30
##.SOLVENT NAME= CDCl3
##.SHIFT REFERENCE= (INTERNAL, CDCl3, 0, 16.522)
##AUDIT TRAIL= $$ (NUMBER, WHEN, WHO, WHERE, WHAT)
$$ ##TITLE= Audit trail, XWIN-NMR		Version 3.5
$$ ##JCAMPDX= 5.01
$$ ##ORIGIN= Bruker BioSpin GmbH
$$ ##OWNER= nmr
$$ C:\u/data/dgb/nmr/ADRS/140/pdata/1/auditp.txt
$$ ##AUDIT TRAIL=  $$ (NUMBER, WHEN, WHO, WHERE, WHAT)
(   1,<2006-11-14 10:01:44.89 +000>,<MAYBRIDGE\nmr>,<NMR_250MHZ>,
      <created by zg, POWCHK disabled, PULCHK disabled
       configuration hash MD5:
       49 4B E0 1D 92 C2 6B 37 9F E6 65 BC 52 41 86 1D
       data hash MD5: 64K
       5B C1 09 14 C5 F9 97 1C 69 83 DD 75 E7 CB 2D 4A>)
(   2,<2006-11-14 10:02:00.89 +000>,<MAYBRIDGE\nmr>,<NMR_250MHZ>,
      <Start of raw data processing
       ef LB = 0.3 FT_mod = 6 PKNL = 1 SI = 32K 
       data hash MD5: 32K
       DA A8 17 D4 2D 7E F0 79 BD 3B 14 1F A6 A0 9A DD>)
(   3,<2006-11-14 10:02:03.14 +000>,<MAYBRIDGE\nmr>,<NMR_250MHZ>,
      <apk 
       data hash MD5: 32K
       27 F4 7A 57 09 63 E5 FA 77 6C 30 6E AA 96 3C 85>)
(   4,<2006-11-14 10:02:03.87 +000>,<MAYBRIDGE\nmr>,<NMR_250MHZ>,
      <abs ABSG = 5 
       data hash MD5: 32K
       95 42 15 A4 6F 57 B3 7B 7D 4A 73 46 69 DD D2 DA>)
$$ ##END=
$$ 
$$ hash MD5
$$ 60 CC F4 77 E0 24 E0 5B 5A 25 92 E7 AC 6D 6D 79
##$RELAX= 
##$RELAX= 
##$RELAX= 
##$RELAX= 
##$RELAX= 
##$RELAX= 
##$RELAX= 
$$ Bruker specific parameters
$$ --------------------------
##$DU= <C:\u>
##$EXPNO= 140
##$NAME= <ADRS>
##$PROCNO= 1
##$TYPE= <nmr>
##$USER= <dgb>
##$AMP= (0..31)
100 100 100 100 100 100 100 100 100 100 100 100 100 100 100 100 100 100 
100 100 100 100 100 100 100 100 100 100 100 100 100 100 
##$AQSEQ= 0
##$AQ_mod= 3
##$AUNM= <au_zg>
##$AUTOPOS= <15 >
##$BF1= 250.13
##$BF2= 250.13
##$BF3= 250.13
##$BF4= 250.13
##$BF5= 500.13
##$BF6= 500.13
##$BF7= 500.13
##$BF8= 500.13
##$BYTORDA= 1
##$CFDGTYP= 0
##$CFRGTYP= 5
##$CHEMSTR= <none>
##$CNST= (0..31)
1 1 145 1 1 1 1 1 1 1 1 1 1 1 1 1 1 1 1 1 1 1 1 1 1 1 1 1 1 1 1 1 
##$CPDPRG= <>
##$CPDPRG1= <>
##$CPDPRG2= <>
##$CPDPRG3= <>
##$CPDPRG4= <mlev>
##$CPDPRG5= <mlev>
##$CPDPRG6= <mlev>
##$CPDPRG7= <mlev>
##$CPDPRG8= <mlev>
##$CPDPRGB= <>
##$CPDPRGT= <>
##$D= (0..31)
0 1 0 0 0 0 0 0 0 0.06 0 0 0 0 0 0 0.0002 0 0 0 0 0 0 0 0 0 0 0 0 0 0 
0 
##$DATE= 1163498503
##$DBL= (0..7)
120 120 120 120 120 120 120 120 
##$DBP= (0..7)
150 150 150 150 150 150 150 150 
##$DBP07= 0
##$DBPNAM0= <>
##$DBPNAM1= <>
$$ [...]
##$SUBNAM7= <"">
##$SUBNAM8= <"">
##$SUBNAM9= <"">
##$SW= 20.6930455092707
##$SWIBOX= (0..15)
0 0 3 0 0 0 0 0 0 0 0 0 0 0 0 0 
##$SW_h= 5175.983436853
##$TD= 65536
##$TD0= 1
##$TE= 683.16
##$TE2= 300
##$TE3= 300
##$TEG= 300
##$TL= (0..7)
0 120 120 120 120 120 120 120 
##$TP= (0..7)
150 150 150 150 150 150 150 150 
##$TP07= 0
##$TPNAME0= <>
##$TPNAME1= <>
##$TPNAME2= <>
##$TPNAME3= <>
##$TPNAME4= <>
##$TPNAME5= <>
##$TPNAME6= <>
##$TPNAME7= <>
##$TPOAL= (0..7)
0.5 0.5 0.5 0.5 0.5 0.5 0.5 0.5 
##$TPOFFS= (0..7)
0 0 0 0 0 0 0 0 
##$TUNHIN= 0
##$TUNHOUT= 0
##$TUNXOUT= 0
##$USERA1= <user>
##$USERA2= <user>
##$USERA3= <user>
##$USERA4= <user>
##$USERA5= <user>
##$V9= 5
##$VALIST= <valist>
##$VCLIST= <CCCCCCCCCCCCCCC>
##$VD= 0
##$VDLIST= <DDDDDDDDDDDDDDD>
##$VPLIST= <PPPPPPPPPPPPPPP>
##$VTLIST= <TTTTTTTTTTTTTTT>
##$WBST= 1024
##$WBSW= 4
##$XGAIN= (0..3)
0 0 0 0 
##$XL= 0
##$YL= 0
##$YMAX_a= 514537
##$YMIN_a= -290852
##$ZGOPTNS= <>
##$ZL1= 120
##$ZL2= 120
##$ZL3= 120
##$ZL4= 120
##$ABSF1= 16.522
##$ABSF2= -4.171173
##$ABSG= 5
##$ABSL= 3
##$ALPHA= 0
##$AQORDER= 0
##$ASSFAC= 0
##$ASSFACI= 0
##$ASSFACX= 0
##$ASSWID= 0
##$AUNMP= <proc_1d>
##$AZFE= 0.1
##$AZFW= 0.1
##$BCFW= 0
##$BC_mod= 0
##$BYTORDP= 0
##$COROFFS= 0
##$CY= 12.5
##$DATMOD= 1
##$DC= 0
##$DFILT= <>
##$DTYPP= 0
##$F1P= 14.0000005364418
##$F2P= -0.99999901652339
##$FCOR= 0.5
##$FTSIZE= 32768
##$FT_mod= 6
##$GAMMA= 0
##$GB= 0
##$INTBC= 1
##$INTSCL= 1
##$ISEN= 128
##$LB= 0.3
##$LEV0= 0
##$LPBIN= 0
##$MAXI= 10000
##$MC2= 0
##$MEAN= 0
##$ME_mod= 0
##$MI= 0
##$NCOEF= 0
##$NC_proc= -5
##$NLEV= 6
##$NOISF1= 0
##$NOISF2= 0
##$NSP= 0
##$NTH_PI= 0
##$NZP= 0
##$OFFSET= 16.522
##$PC= 1
##$PHC0= -37.24767
##$PHC1= -9.009788
##$PH_mod= 1
##$PKNL= yes
##$PPARMOD= 0
##$PSCAL= 4
##$PSIGN= 0
##$REVERSE= no
##$SF= 250.13
##$SI= 32768
##$SIGF1= 0
##$SIGF2= 0
##$SINO= 400
##$SIOLD= 32768
##$SREGLST= <1H.CDCl3>
##$SSB= 0
##$STSI= 32768
##$STSR= 0
##$SW_p= 5175.98343685301
##$SYMM= 0
##$S_DEV= 0
##$TDeff= 65536
##$TDoff= 0
##$TI= <Analysis number 999999
Compound Code 99
Book Reference 9
Project Code 9>
##$TILT= no
##$TM1= 0
##$TM2= 0
##$TOPLEV= 0
##$USERP1= <user>
##$USERP2= <user>
##$USERP3= <user>
##$USERP4= <user>
##$USERP5= <user>
##$WDW= 1
##$XDIM= 32768
##$YMAX_p= 495444391
##$YMIN_p= -647849
$$ End of Bruker specific parameters
$$ ---------------------------------
##NTUPLES= NMR SPECTRUM
##VAR_NAME=  FREQUENCY,     SPECTRUM/REAL,   SPECTRUM/IMAG
##SYMBOL=    X,             R,               I
##VAR_TYPE=  INDEPENDENT,   DEPENDENT,       DEPENDENT
##VAR_FORM=  AFFN,          ASDF,            ASDF
##VAR_DIM=   32768,         32768,           32768
##UNITS=     HZ,            ARBITRARY UNITS, ARBITRARY UNITS
##FACTOR=    0.157963299565203, 1,           1
##FIRST=     4132.6476996994, 0,             0
##LAST=      -1043.33573715361, 0,           0
##MIN=       -1043.33573715361, -647849,     0
##MAX=       4132.6476996994, 495444391,     0
$$ Real data points
##PAGE= N=1
##DATA TABLE= (X++(R..R)), XYDATA
$$ [...]
27214 -118293 -90767 -187892 -243840 -38228 36745 21579 -63591 -84705 42532 283063 219660
27203 219660 -46263 -346027 -288012 -187936 -292707 -303470 -234692 -85561 4602 93063
27193 93063 63336 -21145 -140763 -305215 -112399 -5655 -45793 -96362 -69702 -150419 -413536
27182 -413536 -289311 -71507 31153 21098 10589 31947 117700 204612 59804 -709 -12199
27171 -12199 49526 -18863 -152110 -138723 -43884 16692 84459 122460 41049 71347 102650
27160 102650 148970 162646 124633 129931 46777 -59854 -95000 -17555 -82101 -97755 12498
27149 12498 -52047 -51668 89648 222373 93075 73505 53264 25622 -18062 -217792 -214860
27138 -214860 -221687 -81363 9870 20627 9907 327 -7524 -90535 -110037 -127998 -126847 28372
27126 28372 26047 -43110 -130718 -138157 10468 -19510 -18659 -89106 -244570 -286106 -193037 -77468
27114 -77468 5527 44016 64197 59417 177937 236845 181813 137767 186161 117874 -63978
27103 -63978 7150 123553 81860 57254 5367 78749 -25296 -182386 -1989 195646 275800
27092 275800 256065 191619 279667 410562 490954 404045 211957 190981 210569 56619 72560
27081 72560 126349 111020 137711 79031 -109712 -102860 39655 48662 21027 26175 82912 178219
27069 178219 213623 260246 273127 337234 267572 49414 36418 129227 112154 47456 -82860
27058 -82860 55608 104236 124636 11746 200160 187116 170197 214911 261975 198008 188162
27047 188162 82912 151937 237789 337679 399585 380897 273366 316336 221283 300906 371691
27036 371691 341818 269173 192730 27483 -3479 -69372 -63102 -40549 16279 -58101 -93304
27025 -93304 -46285 -40078 -149120 -65580 43968 81857 162243 229119 173604 75501 -97683
27014 -97683 -93068 5625 -23067 -42165 -202171 -149214 -55887 67676 227973 142009 -82047
27003 -82047 -30386 60444 61317 -76223 26961 24000 30658 -5558 -62458 -73529 53103 75956
26991 75956 98950 36239 -59167 24819 72333 -60633 28832 73964 46672 102042 95430 97209
26979 97209 35321 218541 399779 409977 256673 121037 123037 82350 72690 57415 6443
26968 6443 143208 65561 -6139 -114314 -142552 -165614 -281481 -153166 -70829 -90683 1300
26957 1300 -51480 1299 91140 26095 -48304 -83800 46354 86209 -94880 -146819 -237609
26946 -237609 -189233 54942 214658 39247 -103987 -95616 -59475 12433 97463 63153 48481
26935 48481 67306 104759 227204 266000 156702 50593 55161 126229 109839 116944 119121 141297
26923 141297 126201 16401 28556 38174 44152 185531 115284 626 27924 99215 301699
26912 301699 254654 329911 409583 187693 -47641 -77771 22261 47748 26363 -11229 -33829
26901 -33829 -57750 -80127 -37764 -20758 118 47452 86215 27461 -49520 188904 228015
26890 228015 -134711 -403342 -311418 -2698 -60416 -103738 -140999 -44772 7238 -99571 -37503
26879 -37503 127798 251211 123792 -5806 -87887 -8113 -66146 -193816 -260827 -168948 198693
26868 198693 229833 109402 -204797 -154300 71406 66790 12994 -22372 -36779 -23041 -3880
26857 -3880 76466 133409 51565 18479 37444 13059 110133 208999 152473 81296 -127234 -274244
26845 -274244 -394632 -421057 -301191 -192142 -170264 -174378 -299371 -110024 121882 231881
26835 231881 91546 -24290 -27043 -33641 -39424 -87990 -85950 -50437 -116014 -98355 -23898 218332
26823 218332 327499 134957 -36951 -18378 21718 -135523 -218810 -137397 -72254 -99041 -7753
26812 -7753 92559 159878 163304 196281 201293 -6594 -85021 24366 58540 -96306 34356
26801 34356 46098 25824 -55902 -3021 160639 294741 177835 45101 1393 47891 27466
26790 27466 49974 -97009 -25438 53724 50545 -63387 -160142 -276667 -255925 -183820 -38718
26779 -38718 111657 161873 49930 163601 -61482 -143492 -29630 -12315 90789 191588
26769 191588 73367 -142738 -166043 -69177 -94128 34916 -29066 -67815 -105161 -103909 -33835
26758 -33835 -53003 63601 173549 73816 -97790 -117195 -201947 -252530 -85123 24111 38651
26747 38651 148310 95507 29555 90248 227534 297530 113280 32051 47262 212773 199749
26736 199749 -96231 -235613 -93994 -63242 6942 26338 -10864 -38785 -12711 75328 134744
26725 134744 121655 28958 2930 -12292 3478 -67017 -97933 98426 35822 -195363 -236486
26714 -236486 -118768 -12016 -10209 -88889 -141512 -190273 -12645 -125286 -231169 1330
26704 1330 211584 211733 110192 113211 15630 -52981 61821 92681 -81743 -244142 -170092
26693 -170092 -281415 -171233 -13221 -32571 82696 161592 234898 244405 194862 -20450 -161116
26682 -161116 -97903 -203286 -317609 -360197 -324816 -329147 -221473 -185163 -118950 -127193 -56518
26671 -56518 80950 92228 -53498 -242226 -201674 -62572 -32231 -108016 -121153 70417 268293
26660 268293 243198 174035 92142 17188 -42877 -80834 -77617 72818 6097 -126321 -257872
26649 -257872 -99758 39789 19801 -77119 28701 30254 -15865 -76667 46069 121159 101305
26638 101305 203937 148597 121484 57237 -106653 -13123 41321 173179 133945 -100232 -189875
26627 -189875 -187142 -105340 11393 158099 93752 66503 -101316 -42852 65572 23586 90718
26616 90718 175725 152501 83565 59772 19925 -40183 -199744 -298936 -225993 -167369 -161323 -46294
26604 -46294 73216 105512 111260 45842 81618 144940 52081 -61409 -86699 -82967 -23276 59318
26592 59318 86989 -28043 -185330 -39176 284765 445704 322469 190779 169027 214019
26582 214019 63231 -96544 -117849 -45434 12412 50355 119157 2853 -66523 -13266 41783
26571 41783 88132 26119 32456 107630 50821 -79113 -178825 -272441 -168795 -200217 -116992
26560 -116992 -41539 10876 3899 -20376 -111821 -156839 -175825 -84666 79736 56983 -32178
26549 -32178 -102649 -59339 -31462 137927 222098 142509 52766 111216 154424 124217 92124
26538 92124 122304 16776 24488 19989 136464 189165 250575 264684 23386 -72766 -160416
26527 -160416 -145966 -176643 46000 254592 272240 165230 81279 194757 159588 72988 18615
26516 18615 108461 39867 -31654 14746 25052 54621 45580 -6473 -83829 -116531 44271 147097
26504 147097 110625 45786 19412 -27728 -41123 146483 211807 119205 67571 -149062 -97532
26493 -97532 38548 -25046 -36850 -48702 -144285 -177529 -23634 114391 44765 -61667 -862
26482 -862 -65697 -30090 127840 38833 -25467 20483 139825 226035 268494 180892 184872 173583
26470 173583 114865 42462 -32386 -209612 -254346 -304255 -488468 -397372 -124184 196101 320522
26459 320522 242263 72230 -46052 -17336 -9664 78203 25544 -33328 -141579 -70870 41760
26448 41760 -23772 68262 211914 39758 75009 148655 168179 137852 218846 339831 363888
26437 363888 318919 88747 116334 56434 40798 -14495 -106206 -295 111838 54656 143247
26426 143247 90719 -24926 -11581 136017 37467 -47561 34257 -73420 -66695 103631 45739
26415 45739 -119199 -50343 -1723 -3613 -44307 -106526 -55383 -109911 -141731 -40034 -52947
26404 -52947 -126024 -53235 136670 20983 -40800 135891 181307 169 -59689 103277 241215
26393 241215 336485 155886 -11612 20153 -18027 74756 102096 73345 -78685 -90514 -63720
26382 -63720 -184424 -213265 -174043 -101964 70297 351809 459961 484161 477600 314622 93720
26371 93720 1239 17053 -51084 -256111 -272652 -282084 -345144 -144749 119846 87679 -93870
26360 -93870 -203282 -233956 -180345 -14993 71415 -78024 69429 155008 139822 28193 -64286
26349 -64286 -1714 5646 -110514 -240176 -189189 -144191 -187069 -132336 -107870 -93193 -50141
26338 -50141 -159190 -71729 92140 53061 75738 91614 83670 44172 12468 103121 7269
26327 7269 -217485 -168721 -55791 66169 165562 116100 -28889 -181891 -188958 -94763 30453
26316 30453 191248 308250 287370 227148 163124 59582 12632 94429 55756 44967 32831
26305 32831 62125 202685 216635 314431 288686 165356 -38481 -72562 -119951 -42242 117888
26294 117888 154568 239754 333300 339520 160669 289475 328371 299715 93109 -6852 -79585
26283 -79585 -107441 23141 80921 47213 -36114 -18043 -29669 5244 40315 -23886 -75116
26272 -75116 -105742 35719 117272 64383 73569 34325 71684 146368 221428 172545 70723
26261 70723 116608 46670 29971 60275 149861 127022 66934 -40094 -129513 -10668 196265
26250 196265 193414 184876 250974 254498 67398 8324 -14481 32528 -96585 -163068 -68013 -17309
26238 -17309 -122238 -216603 -259837 -173544 -6571 -16200 -173107 -90667 -16968 12715 63784
26227 63784 119523 -38747 25060 116073 69335 22337 -125555 -317954 -349426 -285547 -131118
26216 -131118 -76549 34318 172949 143835 -33799 -197528 -36616 96977 18729 -16519
26206 -16519 -22309 22218 16773 152151 106320 62531 18549 24984 62610 113782 42871 8883
26194 8883 -17705 -16750 16630 -3252 76839 -49232 -100967 -86912 -33111 -2787 -21028 -61383
26182 -61383 -24731 104223 170922 259130 253688 134490 47636 181850 127260 80968 36650
26171 36650 119940 180097 157900 171099 114720 34352 -39553 -58894 -34428 111206 233368
26160 233368 181060 -51352 26437 -26992 -38646 -50691 -45396 -74544 -131930 -247187 -105922
26149 -105922 -24630 -71657 91387 86476 -51451 -119501 -112833 -25789 -32740 -67777 -39753 -126521
26137 -126521 -120367 -213595 -258153 -207758 -197398 -141426 -93075 25025 73546 -21941 -92089
26126 -92089 -90296 -62148 -38163 27782 62420 -135224 -177401 -111585 -163613 -82642 105475
26115 105475 101360 111646 42088 -11263 -14139 51175 45803 81215 -21576 -79156 41898 43491
26103 43491 76262 99270 -3371 -19790 79343 216224 323939 277059 65883 -63000 -176666
26092 -176666 -266122 -106319 72822 -6765 -175131 -87939 149311 175653 164635 176595 59037
26081 59037 -71357 25736 117725 239871 257305 189601 19059 -8502 150693 298915 239056
26070 239056 47541 13159 -56381 -217505 -208718 30813 126763 -4425 54819 198838 229293
26059 229293 21874 117696 137287 70500 83768 188567 233000 152889 48300 32504 -84704
26048 -84704 -194077 -197576 -123499 -18750 61453 89994 189358 120413 -51973 -198773 -8997
26037 -8997 174713 71215 29880 -18763 24194 -42715 -96944 -140411 -243205 -301654 -202417
26026 -202417 -274183 -224200 -165873 -233958 -154275 -176836 -127214 -170176 -25851 130290 39726
26015 39726 -176025 -171470 -152236 -171116 -120463 -106371 -36446 -39986 -21055 -89799 -152889 -94651
26003 -94651 11843 -82311 -252677 -294621 -189478 -206823 -189010 -188649 -265612 -130130 -79737
25992 -79737 -192977 -137298 -10519 182554 377448 399006 317675 38577 41041 -26991 -41424
25981 -41424 -255854 -240670 -265080 -282786 -290227 -424911 -394530 -207001 -56759 -7787 61008
25970 61008 130491 204354 267205 370980 414433 335374 157705 11995 -172555 -83420 212984
25959 212984 213450 30470 72363 136408 26357 17035 110495 114526 205947 227999 141503 67529
25947 67529 54172 68326 101979 67080 147099 95181 33229 202231 212059 117461 100135 84506
25935 84506 107253 17001 -11937 25487 76810 95753 138577 292253 173948 9046 1152
25924 1152 125829 34555 -66059 27751 278059 296510 68600 -78145 -23581 -17950 -3212
25913 -3212 61233 120480 -964 -40068 -126305 -92840 8607 -98474 -185531 -61017 18994
25902 18994 94585 1877 93126 47654 -33556 -40700 -14304 22917 -109843 -110331 -2337 34353
25890 34353 -9258 105571 156668 27244 -2646 -132300 -307246 -215063 -86196 -86369 -15653
25879 -15653 142433 292495 299386 270303 124496 150174 228281 129121 60884 131980 91140
25868 91140 113026 42710 -55575 93275 150673 85889 -59788 138586 392634 439282 281127
25857 281127 205163 248948 274052 89962 20066 -66272 72735 138893 135271 53901 227387
25846 227387 325534 422079 322325 133583 186769 234379 254117 5200 -208207 -268953 -312847
25835 -312847 -284388 -124988 -114318 -166561 -68789 1719 -14711 -69361 -8304 50048 69103
25824 69103 121681 -39248 -223505 -138552 -38495 -122597 -128778 -47585 18548 70965 62243
25813 62243 159783 154619 141904 133523 152310 66981 -23260 -188107 -267531 -219581 3051 121454
25801 121454 158261 87266 -36655 -54251 23800 -159701 -57531 -5155 -145201 -140209 -58697
25790 -58697 17667 73511 90221 -119304 -212294 -279725 -426061 -407744 -420920 -298553 -50939
25779 -50939 128718 207992 240038 192684 75477 -77913 -143993 -72546 -720 -40710 -76
25768 -76 50485 -34293 -458 -82648 -52344 -34773 -42134 27138 10839 -92524 -106548 15461
25756 15461 79258 172889 59417 -138169 -90009 44393 -24093 44902 148315 157216 90549
25745 90549 45223 85190 91537 77312 54017 198031 172133 50638 118410 176730 74011
25734 74011 -171200 -186999 18088 120696 80825 56013 26481 77940 266472 305328 296786
25723 296786 166955 189673 262083 215520 58982 22922 34465 12003 40984 197673 49410
25712 49410 -86230 -377318 -237290 -197571 -189704 -208331 -43053 -4544 259651 242133 188261
25701 188261 169024 -20354 -132221 -281703 -24650 85641 -4867 -62854 -36073 16056
25691 16056 -71236 -73259 -101505 -50090 -149316 -83118 -21355 -140894 -158667 -94183 172688
25680 172688 116648 27601 11297 -2432 32221 29852 59859 -11011 -41855 -62298 55445
25669 55445 89586 55439 -36770 54819 152991 -38198 -33954 10506 78030 105334 -34694
25658 -34694 -137347 -125278 -210803 -189889 -161975 -217119 -146737 -337 103854 124448 160512
25647 160512 97247 -79877 -41594 320406 477125 385882 156428 186723 135068 145779 282907
25636 282907 172213 173076 34475 -11743 53147 98880 701 7720 111286 113464 -47290
25625 -47290 -115358 -306423 -257589 -78116 -42051 7071 -90735 -143673 -121196 -40876 -83756
25614 -83756 -241546 -175334 -93289 -69849 13518 108129 27561 -52585 -150273 -100703 -117077
25603 -117077 34932 162074 95982 156710 218732 105218 -71711 -180882 -167155 -67017
25593 -67017 -226073 -264425 35314 204176 159371 115176 -10695 -109029 -90192 -111268 -223101
25582 -223101 -275513 -115517 -95608 57458 213280 115147 80479 149980 266575 226586 -41901
25571 -41901 -241445 -121701 -105927 -55975 3650 4500 138341 267395 21803 -80080 -10977
25560 -10977 -103517 -262122 -165272 -99408 -49740 -41662 -82468 -155416 -133287 -92615 -169299 -257530
25548 -257530 -106639 -24202 -113428 -219908 -235463 -91456 17510 51577 53110 89334 70055
25537 70055 38260 129238 219641 102577 91206 -63655 -384301 -366420 -273554 -27325 62846
25526 62846 -51765 -86867 116689 239415 56708 -67203 -17835 -86854 -32685 -98598 -12217
25515 -12217 -28050 -117733 -172913 -242724 -307306 -241616 -274257 -136142 -29435 -29379 -78377 -8357
25503 -8357 146010 87368 -6437 26014 -31231 131675 314361 118746 6010 108213 -9675
25492 -9675 -320733 -360883 -258618 -55709 26621 -121514 -206355 -103844 -119925 -131215 -65836
25481 -65836 -87290 -106695 -64344 -125503 -43992 22464 133854 182190 157662 60574 135980
25470 135980 41122 -118029 -161554 -176410 -21381 68274 219593 305511 286331 258966 10872
25459 10872 -30999 54820 162609 11083 -168797 -360960 -293538 -115070 92899 -60576
25449 -60576 9845 25253 -10055 -108498 -276403 -444032 -458083 -442056 -506229 -408814 -374963
25438 -374963 -238360 -187366 -191532 -164583 -232631 -261334 -211615 -216889 -232947 -292803 -138436
25427 -138436 -169772 -176140 -167178 -156726 -146434 -333631 -318742 -149423 -103245 29028 178484
25416 178484 126866 -67974 -75133 73616 293352 371823 199466 27840 28531 -108040 -210296
25405 -210296 -103472 -9005 -16028 -84313 -246355 -289620 -218808 -105695 34918 169796 163421
25394 163421 57622 21871 -43885 48973 139007 253238 36861 -77601 -86363 -14361 -72429
25383 -72429 -30759 705 970 -43906 37218 118152 43695 65776 14852 6329 -45034 25949
25371 25949 34537 169208 193265 111910 -13887 -60417 -117982 -227309 -234448 -218124 -355242
25360 -355242 -356592 -91390 182476 228499 195410 250986 237582 116143 51938 -22380 -103919
25349 -103919 -117987 -23523 -52204 50513 149283 54498 -173401 -133043 -2768 15383 -64884
25338 -64884 -122315 -222733 -166264 -67186 -257998 -370681 -387352 -394032 -426233 -203770 -146556
25327 -146556 -102799 -153317 -76722 27688 240911 260367 67738 13067 28112 37549 49298
25316 49298 169312 359028 313992 134349 23473 -93495 -55624 15274 91941 189513 303373
25305 303373 357899 348563 248870 97451 125409 116967 -84633 -111777 -57985 -120127 -171767
25294 -171767 -251077 -189989 -230914 -228463 -172658 -127929 -68743 -149246 -234718 -149487 -137561 -174151
25282 -174151 -174432 -277852 -215360 -73680 61510 173193 -35828 -66748 5228 140472 30543
25271 30543 -53731 40472 63126 -25979 -119394 -287212 -333822 -126426 -74042 195765 198041
25260 198041 92287 -3959 96049 63585 -52278 -2695 -26863 73604 302619 415307
25250 415307 478086 360014 256476 271367 149941 40039 -111884 -66541 37896 -42414
25240 -42414 -498 84766 -7270 -186370 49682 175566 -24277 -41294 -67655 -167559 1233
25229 1233 39737 -15059 10500 114334 273309 247943 138989 125764 178254 192425 267248
25218 267248 375736 294481 28582 -172299 -131155 -47254 -15456 -74317 -124915 -59454 -79522
25207 -79522 -80829 -109 1129 152818 103384 80958 34869 65369 80903 86292 19153 6507
25195 6507 259110 189465 -59258 -93290 65163 155412 168588 36677 -30175 -62155 -119346
25184 -119346 44360 12908 -59917 -75155 -140925 -196123 -133318 -597 144414 -42199 -294304
25173 -294304 -388164 -320405 -155790 -59203 -91821 -152161 -203880 -129847 194706 196618 114601
25162 114601 78965 125529 169315 -27473 77346 112524 -12536 -129763 -296244 -165993
25152 -165993 -76336 -46014 -51411 9035 9842 -99767 -186543 -145755 -169779 -324717 -340071 -73024
25140 -73024 62417 -56806 -151978 -204852 -219362 -230141 -21792 22138 -58328 -16055 -4036
25129 -4036 45844 -107922 3492 156031 103516 -26413 -3406 -13398 -8778 103650 162199
25118 162199 124631 -87935 -100974 78506 -93915 -318458 -364655 -306951 -96976 -114482
25108 -114482 -88643 -62419 -154686 -126216 -40236 9658 -22110 -193014 -181045 -127218 -57819
25097 -57819 61469 126165 -73457 -29943 260154 325354 178029 152127 128852 -546 -38490
25086 -38490 105649 210576 332121 308382 165862 36443 158740 222711 344259 397410
25076 397410 275763 97599 -89173 -146786 -262318 -328470 -298294 -398534 -263951 -112365
25066 -112365 -74712 -153930 -25483 53843 38204 95116 45560 -71264 -278574 -459366 -407693
25055 -407693 3228 193424 252033 85662 -21472 19825 -44214 -259198 -479942 -403491
25045 -403491 -202533 -197696 -165062 -132375 -159326 -111961 76180 132984 85101 122507 164049
25034 164049 -19913 -57854 -30754 71642 -26112 -75690 -23332 10114 44269 33433 71749
25023 71749 147929 63757 71184 113472 56286 -34536 -29902 -28051 -60977 -193660 -196968 18170
25011 18170 16166 74909 44185 138230 353520 224501 196345 178903 200298 45218 -69668
25000 -69668 -60118 -18348 -21500 -51728 -203512 -252727 -71301 -10930 -23157 213114 139732
24989 139732 23423 23276 107905 158744 141210 87824 113768 76391 49660 33460 177062
24978 177062 96436 34800 -44548 -18436 30117 -15424 -53200 -48250 -21530 -105713 -49744 -53065
24966 -53065 83567 141037 161768 55456 12332 81227 207006 158760 199847 3987 -225519
24955 -225519 -76924 62214 94209 56563 20279 -70811 -60402 -30618 -127309 91390 151246
24944 151246 60116 168142 9931 -113516 -88465 -132797 -56511 38045 77889 188495 114540
24933 114540 75858 156208 195586 182924 201924 306869 276412 203089 118636 190172 -5422
24922 -5422 -173391 -353407 -112358 44906 -164433 -188844 -206492 -189320 -227387 -184504 -62008
24911 -62008 32306 200753 251893 250017 241893 77628 64151 -4009 142902 236262 198191
24900 198191 246515 97169 -82613 -56898 112709 117095 8345 -48784 -19107 82802 31987
24889 31987 -119003 -271025 -230024 -130322 -44223 -63063 -74211 -204966 -284761 -265243 -190744
24878 -190744 -49133 -154918 -225470 -83428 -105187 -34726 -55767 21403 13611 56383 -88477
24867 -88477 -261433 -332601 -342948 -190938 -118517 -94220 34068 182238 195017 84737 -26015
24856 -26015 -121819 -195600 -285937 -253193 -128505 -63501 73293 35609 -154158 -205907 -142282
24845 -142282 -5357 7236 -59535 -138651 -17549 -23778 -213819 -235776 -208688 -169862 -37314
24834 -37314 53983 44315 97637 -70281 -56079 -59189 -56791 -50410 108413 59754 -59769 108402
24822 108402 164035 205349 235917 240983 246075 140102 68704 59536 -133370 -328113 -236716
24811 -236716 -250219 -252732 -86088 -84839 -258534 -236741 -88227 -4382 18087 -2374 -370574
24800 -370574 -504593 -587320 -521346 -353589 -161739 1053 80678 148904 156315 21689 -122555
24789 -122555 232 114760 157491 218493 117323 -1063 -10195 227170 335864 247834
24779 247834 206990 -2922 -156039 5924 100079 220244 77799 6398 -147147 -244554
24769 -244554 -8312 247772 196183 4133 19213 82099 32623 -109844 -221342 36324
24759 36324 273339 344992 362424 230313 157063 111450 43864 141486 126314 -29635 -100034
24748 -100034 167388 210383 16774 -198107 -421571 -471568 -336807 -174845 -212969 -100820
24738 -100820 -52469 -63038 -102767 41522 102450 135031 206328 49096 20464 77506 100463
24727 100463 190457 228702 127199 112158 633 -215664 -214096 -336629 -380452 -342773 -257073
24716 -257073 -215487 -144396 -205708 -197919 -216144 -125148 -24927 -16190 -10185 33132 -72354 6414
24704 6414 110984 -2971 -62404 -93235 -1050 -36266 -110663 -141625 -177758 -349117 -414637
24693 -414637 -211445 -79693 19926 -76969 -88018 -40419 -140902 -276298 -256531 -18530
24683 -18530 55462 36149 -90662 -134227 -167068 -105981 97365 107076 37461 -63185 -25864
24672 -25864 -186731 -108850 -77278 -129737 -49356 98882 64536 -88597 -46566 -216918 -223355
24661 -223355 -63119 -159929 -67245 240688 227464 195469 278477 346532 297360 176172 41265
24650 41265 34741 -83551 -171206 -108817 -129621 -156855 -78508 -83846 -73930 995 -10182 -133431
24638 -133431 -60072 -31437 -114889 -45051 -17984 -151509 -101710 -34204 -47078 -23090 -98668
24627 -98668 -245491 -146423 -55640 34668 158963 120350 97932 -4965 76495 175505 94809
24616 94809 51691 -32773 -194453 -127082 -131671 -87506 -543 49795 -43293 -54792 -10466 -1528
24604 -1528 9229 104338 83336 12508 -60711 153803 86771 -117640 -159210 29363 30218 -55760
24592 -55760 -23907 -21108 -23854 -48951 -27291 6053 -37323 107497 230942 152948 32970
24581 32970 99278 142105 22812 62658 6931 29511 118201 122860 154567 121007 -2190
24570 -2190 -27629 17277 40645 79556 -5489 94813 -91215 -307989 -414117 -309981 -148853
24559 -148853 -124027 -166931 -142371 -51622 -205050 -236179 -97114 25242 -2205 75284 230734
24548 230734 52708 -110822 -48546 161539 161899 66314 -99458 -55038 73008 258453 294937
24537 294937 166269 278248 282949 178561 134276 222402 235984 156021 110656 165414 73684
24526 73684 25977 106775 112698 -33326 108722 90877 134711 -19235 -171268 -137433 121028
24515 121028 178714 -61406 -146500 -38695 -122450 -214786 -224435 -223467 -284978 -232816 -197973 -138158
24503 -138158 -15136 -84119 -105402 -117744 6239 37155 32576 -1346 18571 55756 129966
24492 129966 85463 41430 -153805 -327219 -263741 -53010 96381 -67658 -115597 -85539
24482 -85539 75314 141727 43965 93307 -53754 -97477 -37551 -7462 -10624 -99086 15053
24471 15053 148987 249753 131364 124464 -2518 -4610 -91247 -187239 -87372 -31401 -135340
24460 -135340 -276542 -158624 21253 34331 -75574 -91424 68368 96998 -183559 -334545
24450 -334545 -309941 -106324 -53834 -92221 22167 37657 -104838 -131860 73074 126593 194212
24439 194212 102123 117739 41047 -55885 -175992 -189709 -87213 -74161 -42443 -50351 -47811
24428 -47811 -55905 -38685 -66108 -79978 -75412 45365 25578 41141 -117793 -239634 -161604
24417 -161604 -123455 28456 121383 71246 -56080 -14429 -24261 -130116 -49285 -76659 -50018
24406 -50018 -144384 -207697 -353220 -380970 -285862 -267035 -193725 -202279 -204262 -147983 -121977 48828
24394 48828 142858 167057 72702 87132 298725 201317 -7997 26811 45223 -57733 -96003
24383 -96003 -25587 -78273 -91572 -11786 2608 -136048 -30726 -74067 -34597 175957 180751
24372 180751 -81008 -301122 -345541 -133104 -46263 -91737 -186154 -277447 -272088 -335308 -412719
24361 -412719 -310989 -191414 -252362 -312627 -176811 -45311 -119325 -137177 49405 90562
24351 90562 -4213 26042 65631 42331 84523 121846 10685 -90230 -144819 15712 108918
24340 108918 148483 -59085 -173699 -109180 -124307 -124699 -92035 -115237 -102131 -11110 -32714
24329 -32714 -167413 -39983 146191 244264 166079 80088 137527 127581 18944 -113586 29386
24318 29386 548 -94214 -224318 -135357 -102473 -261691 -399260 -436252 -390958 -321557 -266560
24307 -266560 -168484 -229155 -260444 -272653 -187378 -122806 8483 -29792 -139553 -159211 -153950
24296 -153950 -176255 -26050 111706 59769 -14416 182 5847 -88496 -122647 -39896 -51525
24285 -51525 74308 160544 89751 -140082 -261234 -161792 -31200 188896 250275 260347 185315
24274 185315 155657 136737 118745 -170783 -274318 -328682 -492973 -257532 -106602 59835
24264 59835 -88919 -183684 -199042 -121784 -141772 -109454 -56634 -158769 -145234 41998 63527
24253 63527 106830 -75556 21576 52506 -31256 173074 141895 -6705 -43746 -147539 -276846
24242 -276846 -194076 -126642 -200516 -217416 -113087 -128167 -79756 -175274 -45022 88758 123578
24231 123578 218554 187966 189702 177810 182436 280172 162084 -85973 -243467 -207366 -230966
24220 -230966 -286077 -183386 -121190 -108590 -142427 88492 270466 308096 318676 51818 -100984
24209 -100984 -111478 -181594 -139922 -223756 -276198 -301789 -222671 -137147 125100 265253 224280
24198 224280 81678 28375 5541 144045 164564 84296 44880 74495 105172 36333 115901
24187 115901 137026 268289 285745 248626 259956 341335 202386 57038 71572 -29134 -64328
24176 -64328 17685 -26363 42349 143613 235633 233670 200016 138144 96778 88062 21331 15620
24164 15620 -27091 -98429 -3608 66473 269138 441290 241508 59308 -117536 -146330 -100670
24153 -100670 -236003 -180708 -27342 25162 45843 -147479 -107351 -48268 -48255 -215623 -277523
24142 -277523 -311921 -382845 -259953 -302504 -231423 -169163 -242206 -294044 -251906 -103581 -55755
24131 -55755 111381 130455 200301 147600 6157 52977 80405 61373 119189 202857 31524
24120 31524 114874 177766 84007 22857 -175104 -133629 -109077 -233990 -299109 -253525 -158705
24109 -158705 7635 -29169 28142 32767 -9177 -14365 -34044 -93700 -136486 -130373 -187050 -91182
24097 -91182 -29323 53495 63849 92395 61115 52687 -17092 777 -112135 -278292 -189839
24086 -189839 -34311 75294 30183 38525 21122 11579 29351 20955 86965 77833 13951 64472
24074 64472 173684 163684 161241 198938 -57186 -75132 72818 8703 118670 51598 -144048
24063 -144048 -99921 -88206 -22815 32915 97606 67352 -114274 -89888 3244 -45616 -173802
24052 -173802 -274281 -198209 -104169 -67735 -174208 -128658 -115678 -275556 -226003 46453 159321
24041 159321 118269 66320 164012 214172 253417 182680 24573 66556 23684 10728 90610
24030 90610 2541 -134650 -158035 -53042 59994 146462 118619 68963 163178 155216 95316
24019 95316 -1275 -33873 -158051 -221749 -92407 -37913 50650 56472 -40394 82136 140928
24008 140928 40633 -111321 -38478 3585 -34498 -24506 -43864 57907 100893 155466 125427
23997 125427 79468 -55810 -112792 -136405 -100638 -176593 36883 170776 191823 135807 -101785
23986 -101785 -78537 -1795 34655 20397 29663 -59573 -107953 -43427 -59632 -149366 -55036 5351
23974 5351 101380 59232 -39798 -174293 -138369 -67540 -151429 -74197 139682 385544 477972
23963 477972 409018 249835 85358 9793 -126365 -219622 -71092 51040 107902 59546
23953 59546 -88505 -216092 -176485 -3396 173680 190059 -5017 6327 -25004 -7540 -26132
23942 -26132 -156577 -341303 -302186 -174086 -213998 23358 -11395 -32189 89680 112186 -44712
23931 -44712 -136658 62564 107155 -32301 -161170 -246190 -148666 -13758 121488 60024 163969
23920 163969 97149 -122553 -145834 -157093 -45256 -41292 -148270 -220174 -192811 -110606 -263183
23909 -263183 -306168 -280122 -89543 -41505 -100705 -12402 -133824 -100690 -62395 -80726 -83844
23898 -83844 -11608 -29160 -58370 -85350 -174746 -138780 5441 99000 141561 251596 312057
23887 312057 224602 -26693 -128798 46606 52269 120348 -42036 -179867 -74004 55324
23877 55324 132586 -39300 5094 -53951 -100381 -1123 -125837 -295456 -304299 -274899 -57938
23866 -57938 -11293 -62258 26663 93945 89151 51461 34597 145957 182507 79262 93249
23855 93249 73275 189269 173517 62155 -166058 -382552 -429975 -398473 -349742 -192768 -160104
23844 -160104 -168812 -66047 -158280 -176040 -106729 -218674 -153220 -247015 -308357 -353935 -324678
23833 -324678 -271749 -213007 -250726 -183652 -147065 -230301 -339437 -241386 -152964 4647 -80617
23822 -80617 -114987 -245036 -385181 -349352 -214083 -83714 -195971 -38615 124068 145349
23812 145349 -87510 -120913 -17358 114078 172748 108165 15719 -152812 -266748 -248901
23802 -248901 -303522 -135661 -11485 21538 159536 134051 -96316 -218945 -148793 -190730
23792 -190730 -232471 -268218 -158451 -164907 -305891 -262127 -404839 -360627 -166289 72621 149704
23781 149704 37870 -66944 -39564 4088 91676 94083 162346 163856 77904 36215 -66665
23770 -66665 23469 22005 67368 34349 50547 89930 67013 77783 88231 181480 321521 333751
23758 333751 345848 179406 -46818 -168656 -79946 130415 77869 49021 167800 160817 78638
23747 78638 196211 264292 100655 89406 78479 81760 126935 28290 37878 -33851 -50524 -143602
23735 -143602 -67251 -98742 -150945 -71963 -55809 13538 155000 189813 173438 142899 189710
23724 189710 2942 -43323 -178703 -334540 -295647 -95780 75844 -3597 -197541 -237719
23714 -237719 -219492 -62286 -57647 -112968 -165223 -395430 -580696 -413372 -139969 117495
23704 117495 40013 1470 -196373 -214726 -158698 -91703 75240 254339 215630 126573 -114830
23693 -114830 -76619 -110915 -219216 -200154 -348164 -210792 -239996 -200479 -146319 -126730 -7325
23682 -7325 31224 138621 45539 -149087 -415979 -426080 -287997 -201515 -308226 -366600 -414692
23671 -414692 -239256 -89457 -209407 -183195 -139150 -211198 -303788 -191495 -139591 -43263 -47503
23660 -47503 -62825 -23790 -62131 -128257 -51131 20049 -74390 -210560 -274883 -112692 -41325
23649 -41325 -35675 -34242 43951 113553 142753 108823 -21695 -119515 -38141 -52769 -167549 -35985
23637 -35985 -8407 262459 406318 380618 443124 531054 468899 312667 189520 176762 -35140
23626 -35140 -92395 -98448 -183768 -234403 -177189 -196512 -123317 -14162 -24697 164233 183766
23615 183766 183112 165061 157308 42716 19830 5320 39546 55679 5118 90269 40623 73881
23603 73881 68576 87697 97005 247599 105704 42933 136699 144865 61337 -130112 -114309 -29828
23591 -29828 124652 145545 -16857 -120124 -76558 119205 213224 39576 -269973 -326441
23581 -326441 -169746 -117940 -70870 -77032 3728 -135820 -170411 -165887 40358 251531 180292
23570 180292 -369 -84377 -52067 -123705 -166304 -130521 38626 15725 -93399 -48425 133806
23559 133806 -73929 -140082 -38906 120270 199640 167279 79480 -51017 -164540 -151994
23549 -151994 -132466 -15500 55632 29340 -130729 -310306 -306234 -272245 -428951 -450422 -297599
23538 -297599 -250830 -313325 -305693 -272428 -305783 -252731 -215288 -107030 -14410 73001 14552
23527 14552 -26352 -63767 -129520 -195023 -72394 95417 72341 -2436 -138597 -204857 -133102
23516 -133102 -109307 -216336 -157812 -61950 -3572 -69406 -210078 -128563 -52778 -159416 23358
23505 23358 168990 122941 199813 227662 221388 79940 85991 22309 -206969 -223726 -150931
23494 -150931 -186217 -232982 -379929 -458807 -374551 -369008 -227028 -173299 -162862 -131539 -137592
23483 -137592 -106996 -171795 -186503 -137034 -186151 -222477 -13228 64691 34869 43616 -3750
23472 -3750 167903 263646 278797 159227 37379 -86266 -13498 202966 269023 167208 127340
23461 127340 122080 158664 185876 199814 178508 79119 88055 130541 238327 264793 296508 158561
23449 158561 25771 -113311 -138471 316 -154066 -364586 -291694 -181222 -111592 -99949
23439 -99949 -28582 -70088 16809 1724 30021 106834 295491 486986 490232 303698 2175
23428 2175 -71622 90742 118414 72193 -12793 -72228 -234967 -325290 -344178 -352642 -277374 -310186
23416 -310186 -457202 -245816 -61963 128715 174216 113381 -41880 29970 12090 10747 -73213
23405 -73213 -62524 10889 66180 103993 139069 91985 2097 -15046 1420 -114667 -48126
23394 -48126 11298 -87827 -80668 -154975 -42983 -21654 -117759 -209469 -136962 -161568 -236866 -72630
23382 -72630 -19246 -48371 -124282 -148328 5893 104846 49450 45123 5278 16909 -10267 -101382
23370 -101382 35946 212952 132962 64749 11983 154116 294777 478382 409430 340360
23360 340360 234037 22694 -29023 -163646 -193444 -158901 -78054 -108143 -113143 -58264 49283
23349 49283 59092 -9376 106851 160899 61195 -32142 73192 77031 -78534 102914 256673
23338 256673 222004 131306 -51613 28956 89495 54809 35917 134561 179492 129428 116858
23327 116858 70903 64343 73848 31569 71010 -57576 -87771 62670 87731 16440 34543
23316 34543 70059 45955 -14693 -66847 -177531 -191208 -48384 23089 91668 179389 252389
23305 252389 94877 -68675 -291338 -201316 48439 134895 118817 -224292 -357783 -254290
23295 -254290 -228303 -263282 -323473 -252596 -44226 19929 93459 -43578 -216105 -230689 -5805
23284 -5805 183328 82032 -3968 -18010 7647 -31243 -86526 -82260 -25102 -93284 -146215 -276668
23272 -276668 -266343 -137600 26134 37053 41072 -54255 -120072 -56027 67086 58979 45495
23261 45495 116585 205471 284146 267309 45655 -66540 11510 65022 120459 180409 158766
23250 158766 -1127 -244316 -232642 -73098 -35169 -162053 -65101 -31914 10405 48520 146417
23239 146417 193362 194336 77915 85524 113847 64459 38125 -31607 147836 176740 133245 120085
23227 120085 129754 122443 108549 92056 -87721 -196038 -395341 -244985 48186 -7641 -84112
23216 -84112 -72365 13686 -44383 -7663 8438 -90543 25929 -32030 -8657 -38170 -145365
23205 -145365 -118497 -147837 -185694 -251623 -84232 97826 13390 -54391 -178171 -265379 -234780
23194 -234780 -49145 164085 246677 279480 296745 154135 -32151 -73877 85020 90139 94734
23183 94734 146806 111720 66720 38978 161484 35631 -225348 -210838 -63276 55668 191764
23172 191764 149196 159079 22208 -80893 -164688 -156857 -67355 -76161 -34940 71379 22092
23161 22092 103421 45873 125845 -3225 9024 126140 139825 227728 242967 174855 156081
23150 156081 198910 242795 79538 -80538 549 30040 128299 94177 10192 -154296 -149711
23139 -149711 -29886 87463 -78437 -124824 102229 207227 32715 -111729 11322 191817
23129 191817 113619 102463 95082 231386 402096 348050 142118 189378 253127 347463 205707
23118 205707 302443 230941 -23981 -92408 -75377 -13902 -12369 -58116 92536 125797 143431
23107 143431 223045 165924 132527 117486 -86883 -128341 -19353 -99238 -110801 -79794 -40110
23096 -40110 72121 -3201 -49803 -7415 -33023 74681 251334 249829 40453 -143040 66272
23085 66272 201248 183630 230104 319667 180896 -62023 -132606 -80383 -103566 -204455 -150144
23074 -150144 -39048 -66926 -62782 -119366 -223416 -212329 -92785 -17736 -40281 -104226 -138586
23063 -138586 -237224 -237672 -117123 -30730 2366 49847 -48536 -1476 565 -28876 -131137 -250798
23051 -250798 -147397 -199842 -212075 -299285 -309073 -195758 -128117 -42011 5989 -19818 -282903
23040 -282903 -203630 83725 70105 -98626 -47689 88610 245902 122034 -32014 48170
23030 48170 201245 270694 172954 -35768 -15183 42277 317511 318489 290459 227580 61253
23019 61253 10444 -68310 -184514 -217853 -142106 88649 101314 53592 25676 12302 130354
23008 130354 114252 15288 -124232 -193225 -136549 -194065 -166584 -177881 -160827 -78535 132026
22997 132026 254269 185815 187819 197274 55457 43467 162198 110940 -84165 -69198 -165576
22986 -165576 -129099 -132626 -130831 120214 269292 424976 434515 227567 -44734 -228713 -228553
22975 -228553 -120618 -65976 -18194 -3220 -49099 -89614 -80398 -49121 -133106 -76938 34210
22964 34210 73031 24506 -136241 -140372 -167539 -159277 -130929 -228253 -401319 -391080 -184352
22953 -184352 -92462 1713 58740 98255 131495 30439 -52814 -27102 110112 126515 -110177
22942 -110177 -232584 -220687 -31161 -72611 -13799 116221 137616 196068 315256 259161 11383
22931 11383 -50890 2691 -4960 -85293 -305532 -300143 -229354 -18840 10585 -88596 -10069 16692
22919 16692 73809 109031 71388 -85783 -134826 -116710 -180897 -113165 -38683 -155269 -218473
22908 -218473 -312078 -107859 -141225 -339325 -362921 -247571 -130093 -150371 -208827 -102979
22898 -102979 -144435 -59175 21208 -96009 -185926 -231417 -113449 -95504 -77498 -60569 -46903
22887 -46903 167969 231952 88245 15882 -23921 -20629 -34903 -16655 11091 -61279 -62791 24276
22875 24276 194440 190424 169487 136954 100097 87811 96434 19850 -94431 77566 150794
22864 150794 121344 93236 -42590 69093 3412 -123920 -48036 -56059 -139074 -326725 -330235
22853 -330235 -276114 -52394 124041 16476 14056 -86191 -133274 -3912 -35655 -203924
22843 -203924 -178881 -154924 -181103 -128706 -126061 -222345 -133955 -121696 -112909 -76776 -68959 -22184
22831 -22184 20488 39420 38373 -85671 -185682 19167 96124 50728 62109 -111820 -157996
22820 -157996 -24595 84620 58728 -94332 -47706 -74395 -165002 -72466 -147662 -189047 -64776
22809 -64776 -93446 -170385 -88225 -74161 -171425 -182096 -276810 -411151 -238670 -31747 -45638
22798 -45638 13359 -60633 -95624 -123424 5760 81408 129731 183836 191945 134724 -160773
22787 -160773 -509439 -500932 -371698 -301212 -324875 -280506 -323932 -93710 25392 14934 -66477
22776 -66477 -268828 -395293 -417235 -450622 -531925 -647849 -533634 -425175 -188808 -115646
22766 -115646 -116459 -36608 21392 14425 57546 152636 16222 -186845 -118061 -293635 -174413
22755 -174413 -125673 -151652 -149959 -196231 -21314 115806 99679 66669 -25085 -28939 27546
22744 27546 -59027 -119422 -130324 -108757 -179633 -38628 92393 150151 112980 -33215 -163585
22733 -163585 -295114 -353157 -262687 -198066 -87135 92906 -155314 -259331 -137994 4310
22723 4310 -99447 -102517 51742 93978 35888 -5894 42716 -27403 -87441 15763 79457
22712 79457 -81076 -37066 -12641 -158444 -241737 -29067 -64610 -112948 -158465 -4556 176971
22701 176971 181233 133439 -66089 -73778 -110274 -44949 512 -169153 -205365 -150252 -73232
22690 -73232 65799 113944 60815 -66643 -232519 -268065 -75947 4943 -13064 73486 -45268
22679 -45268 -68316 -90874 46367 108173 166971 239054 209611 31979 -152864 -159785 -137205
22668 -137205 -250883 -205415 -113520 8798 63809 71557 134539 -78292 -100485 -191537 -109433
22657 -109433 -34435 78648 57787 68342 23405 120925 222224 101389 -177563 -342445
22647 -342445 -152776 -190295 -287552 -383923 -263087 -45429 99955 14012 -190231 -179095
22637 -179095 -214108 -360808 -224665 1039 95174 68638 -17123 -100007 -118071 -168494 -124038
22626 -124038 -97172 -259909 -301598 -199516 -125250 -32650 25409 96995 142759 129420 156349
22615 156349 137594 51944 710 -112351 -30203 -224008 -358959 -335617 -244941 -173038 -79528
22604 -79528 -64604 36698 39612 -49093 -182197 -248762 -118945 39662 -112331 -284137 -354480
22593 -354480 -353928 -253364 -79694 58721 98232 207853 257389 157556 107916 91466 -15338
22582 -15338 18897 104818 -62709 -74966 -1331 149869 137406 -30650 -171427 -129530 9239
22571 9239 83697 -12327 -135202 -202816 -157955 -44042 -138411 -334298 -158246 -66028 -106866
22560 -106866 8948 67627 45106 -63544 -274545 -370549 -323151 -306137 -296723 -235608 -201031
22549 -201031 -118066 -22864 -30278 146011 84297 -35672 104187 162122 187033 197830 162075
22538 162075 7101 -177378 -149070 -204708 -162445 37623 239390 234839 -23790 -165066
22528 -165066 -140617 -65953 -91336 -144483 -211494 -7355 -17783 -35888 -269660 -376696 -457272
22517 -457272 -420060 -265233 -297607 -270949 -252617 -211470 -264831 -280241 -268322 -261296 -331172
22506 -331172 -389615 -377036 -198877 79303 129701 161449 169542 152832 249749 185726 35312
22495 35312 -134180 -156946 -178259 -77997 125216 228869 125601 89914 24184 -87007
22485 -87007 -51321 170462 162021 123984 32536 -969 -1839 -185476 -327346 -309571 -268865 -166417
22473 -166417 -139698 -96554 -98432 -126987 -52223 296476 294566 56811 -14206 104216 61013
22462 61013 166883 7303 -212002 -190227 -13946 56236 16306 -121710 -87380 -29114 -141556
22451 -141556 -296549 -328300 -344230 -288555 -119164 52835 57130 42171 -185811 -105894 -108485
22440 -108485 -66161 -130277 -88852 -42117 -101502 -159389 -209750 -212817 -113643 -104786 -261477 -110690
22428 -110690 104043 154912 1639 -108897 -179688 -299131 -346919 -250654 -215991 -98778
22418 -98778 112438 122553 25855 126349 277948 161652 211614 136560 -63669 -82252 34252
22407 34252 115974 275536 282555 239175 -25750 -13644 135458 80027 59507 146247 -419
22396 -419 -191422 -389000 -367957 -341601 -241682 -344112 -447847 -545311 -502925 -357821 -273789
22385 -273789 -153157 -59043 -170355 -280290 -320900 -258023 -140460 17984 -36776 75702
22375 75702 108594 -111820 -369954 -340721 -232606 -302280 -364971 -306989 -271297 -198391 -3411
22364 -3411 114380 93160 67820 62697 168255 96030 -15286 -138222 -171938 -96297 -52154
22353 -52154 -117348 -147086 -78847 -130505 -217971 -121167 59771 112715 -34084 130398 143319
22342 143319 39323 48445 27648 36828 17215 78393 55138 -26777 -171576 -159917 -66895
22331 -66895 -111932 -198507 -203399 -89195 -99182 -100124 -157655 -152476 -243482 -346640 -362119 -364143
22319 -364143 -276026 -296566 -543378 -626761 -600373 -314605 -327805 -413309 -434555 -436665 -475525
22308 -475525 -288894 -164372 -218476 -189915 -59223 66836 45500 72822 82430 93248 84201
22297 84201 -40073 -62577 72357 78537 71482 157367 121005 22247 -135577 -283596 -273509
22286 -273509 -481071 -499399 -446845 -375514 -201288 -309728 -241454 -145884 -104049 -65769 9570
22275 9570 -105987 4925 -20411 -66780 -96067 -128919 -34201 -105438 -137475 85251 86862
22264 86862 94217 154685 163850 205764 61079 -107552 -78987 -139363 -90328 73922 181373
22253 181373 211097 -108235 -334837 -180117 -85407 -61921 -117111 -92482 -245436 -250539 -188345
22242 -188345 -87113 -24441 -74089 -141331 -133066 -47809 88613 -3828 -189508 -149743 -57943
22231 -57943 36058 -13586 -29945 -100499 -326193 -450968 -459306 -297078 -259283 -264533 -64568
22220 -64568 -108183 -29572 8708 -39468 -36449 -134330 -86815 -72431 -155216 -182326 -163247 -183439
22208 -183439 -78305 -52492 -40834 119393 70180 -35391 -128220 -129794 -144749 -105305 -54613
22197 -54613 -3370 -86996 -108119 18837 110543 84214 6209 -115155 -36337 158261 78233
22186 78233 82634 131398 22748 -14475 23723 60275 97760 48129 -72002 -100941 -109048 -210123
22174 -210123 -148896 -69514 -112431 -86465 52590 175056 46451 -64763 -242045 -322376
22164 -322376 -266091 -119253 -94701 -109747 -222485 -20747 104547 129864 90979 87634 149481
22153 149481 75860 -38484 63470 -95548 -199362 -151880 -158000 -166989 -269966 -311379 -248429
22142 -248429 -209156 -290549 -176524 -213099 -168850 -108756 -170044 -121797 -42899 -80043 -233865
22131 -233865 -183262 -300200 -254972 -79438 -53165 -134435 -73603 -126629 -108667 -110716 -152317
22120 -152317 -171467 -154713 -128973 -125484 -96663 -217739 -322063 -440738 -403431 -280216 -170677
22109 -170677 -162694 -249740 -219635 -107068 -38274 -46484 -55272 -79223 -143340 -145499 -106311 -44694
22097 -44694 93210 84980 -104440 -198934 -277141 -339986 -334849 -319267 -347147 -261588 -274547 -153476
22085 -153476 -51253 -201410 -364333 -262795 -120226 -88165 -45733 85668 52988 -133722
22075 -133722 -185650 -178465 -34387 3808 96989 -6770 -91041 -25423 44997 132893 175236
22064 175236 201693 179569 124525 180187 67006 -11872 -79143 -129559 -215295 -297466 -174112
22053 -174112 -111262 -88555 -8015 24710 -79433 -205857 -186225 -67327 -22380 25542 192341
22042 192341 231287 91033 44414 82735 159681 187969 170661 197464 153669 80429 -118979
22031 -118979 -100109 -56661 -169984 -240523 -124037 115296 179583 205046 144299 110291 96970
22020 96970 56598 51302 159431 204267 275257 117754 8288 -176555 -187899 -4075 -67688
22009 -67688 -207706 -143955 -12118 108382 59293 133596 265558 114332 156484 125549 21894
21998 21894 5236 95218 147478 218285 224215 238630 166374 -51802 -129395 76853 189852
21987 189852 169780 118535 115424 64091 2358 -34231 30299 90501 -123928 -236347 -202792
21976 -202792 -201914 -235384 -164314 5371 24182 124748 -87372 -290555 -153510 -153718 -193651
21965 -193651 -139647 -175579 -199218 -142009 -99115 -133699 -282254 -234277 -114254 -31092 73194
21954 73194 -70 -71498 -38034 66037 22084 -185492 -141904 -91192 -161327 -29425 -83096
21943 -83096 -182873 -269953 -335158 -291947 -423708 -243875 -174655 -221286 -326449 -194661 -243443
21932 -243443 -386897 -261094 -210972 -184199 -125398 -168782 -122069 -57490 -46475 -97913 -209997
21921 -209997 -210578 -149029 -141770 -107559 -41999 -63648 -74351 -104540 82637 157803 280354 287661
21909 287661 305727 183930 111022 227861 188349 51004 -92277 -268987 -339907 -234713
21899 -234713 -41377 77436 3980 65193 -56381 -172882 -224608 -233245 -267030 -198558 -107713
21888 -107713 -85977 -194336 -11898 229412 199535 176750 259971 142903 -23770 -56283
21878 -56283 -18147 22858 101832 83455 98452 -32119 -19320 -86799 -116855 -265836 -224791
21867 -224791 -165513 -113046 -96779 -67102 -1054 -135542 -74965 -154206 -48480 -28086 -47570
21856 -47570 21716 34041 -85452 -161532 2214 15835 -85853 -100 -29339 -118524 -93645
21845 -93645 33092 -51910 -126444 -113906 -187935 -184325 3067 144011 101083 94444 190406
21834 190406 119634 122214 86536 13978 11937 89060 277753 272315 311701 180186 -55991
21823 -55991 17364 149955 198915 -11812 -93599 43977 157926 -74818 -178290 -126420
21813 -126420 -172326 -216396 -257991 -245067 -112408 -128838 -44286 37826 -1330 -127353 -136621
21802 -136621 -204284 -129978 91528 48757 -162415 -152501 -152528 -197536 -127254 -122282 -312660 -248380
21790 -248380 -93099 -35869 -51157 83044 318693 379330 356084 292788 84321 -232696
21780 -232696 -161670 70035 85312 78331 72155 99324 238 -195509 -306872 -233117 -103006
21769 -103006 6126 11122 -170506 -227951 -218598 -64056 100251 157088 6753 -70004 -65902
21758 -65902 -143125 -167738 -193039 -248917 -236048 -92036 -175079 -181087 123211 319568 293970
21747 293970 175002 42653 65224 127250 169403 194439 -14875 -47174 135061 41943 35707
21736 35707 22143 -39831 -69719 35162 -19693 -9621 -70950 -94403 30870 -2359 -161589
21725 -161589 -60144 155857 231355 12304 -68602 -79195 -100172 -106898 -45197 90267 -24830
21714 -24830 24670 11435 -4327 153127 53168 -165999 -212565 -247857 -290016 -255474 -155121
21703 -155121 -100062 -256150 -339741 -369990 -261389 -232463 -250632 -215352 -131963 -200993 -166500
21692 -166500 21131 35628 -183993 -413453 -377566 -370143 -475883 -455920 -138634 3787
21682 3787 58535 23283 -113933 -170567 -34251 102177 -26332 66712 145155 104479 -132866
21671 -132866 -303489 -333697 -404574 -312478 -201163 -110973 -226536 -283902 -137553 -99825 -88652
21660 -88652 -44603 61622 95301 151174 -65914 -287855 -231188 145160 228505 73892 -107223
21649 -107223 -237554 -79082 93834 154127 155943 -56177 -111733 -111599 -108025 -159575 -21270
21638 -21270 48480 111387 11398 86416 -83667 -366298 -570235 -516972 -561498 -446475 -422696
21627 -422696 -463693 -412031 -360232 -373404 -223969 -209029 -423799 -387096 -196996 -138290 -287827
21616 -287827 -379217 -375891 -266127 -34811 101870 16750 -71488 113051 129947 -31037 57381
21605 57381 39088 -46375 -126325 -182429 -145754 -163336 -38693 141655 143035 200075 9092
21594 9092 -48586 26089 99340 116185 30289 97883 181238 159668 86760 115674 18943 -151752
21582 -151752 -129674 -138208 -193257 -201774 -174173 -231221 -234388 -77541 -162867 -130859 -72667 -5657
21570 -5657 132365 113955 20718 -47874 -24992 -101100 -156939 -68451 -3917 113929 26115
21559 26115 42022 -143092 -339800 -368531 -289846 -310258 -260787 -279512 -214180 -113814 -161151
21548 -161151 -261753 -242973 -440085 -504442 -445177 -323998 -319042 -334764 -178827 -29392 -215929
21537 -215929 -234363 -185018 -170721 60272 44781 24188 -226951 -357087 -152213 -126768 -266499
21526 -266499 -293192 -85212 58038 -10027 27496 -186884 -283285 -266645 -186509 -81180 -41668
21515 -41668 -187419 -150908 -301365 -160680 -184845 -226911 -119584 -118266 -156280 -109295 5311
21504 5311 35693 -82362 -336388 -350100 -279926 -106509 109898 278776 408017 301133
21494 301133 158714 169807 138117 153529 153975 204428 187830 190677 228628 276745 213623 94926
21482 94926 3964 -88696 -275198 -257930 -246263 -345660 -347355 -317867 -215410 77578 112835
21471 112835 -31050 -86866 16663 66210 161689 204989 32382 -180588 -226267 -243696 -165379
21460 -165379 -146766 -126953 -110776 -135437 -184695 -273782 -280689 -196592 -203842 -310814 -263560 -52498
21448 -52498 115135 72569 -6834 -39157 1517 76633 -61274 -113242 -6626 -61528 -129346
21437 -129346 -205368 -279662 -207858 -21816 65074 79471 99273 67245 32912 74994 51827
21426 51827 175333 218736 30886 -131444 145630 183917 42435 -163650 -210540 -266414
21416 -266414 -172670 -144871 -85918 -75673 -195470 -343459 -277992 -254384 -152599 -80021 -50313
21405 -50313 -21286 -85447 -21879 -58657 -108500 -146875 -190509 -126351 13232 -43909 -143231
21394 -143231 -52647 -25402 141558 255839 339434 168500 87195 11012 -63379 -99435 -32761
21383 -32761 -90042 78589 50990 -24073 -68518 -160453 -179191 -257657 -294369 -304627 -274901
21372 -274901 -241930 -258876 -288187 -234731 -147866 -199751 -179729 -211214 -223264 -92507 -29477
21361 -29477 99854 222129 86233 26902 -51163 -273038 -190778 -43744 -47886 -176207 -303585
21350 -303585 -181416 -89466 -167113 -183647 -265162 -290870 -211085 -210056 -348951 -378549 -382420
21339 -382420 -263916 -120477 11623 -92023 -236652 -114539 154627 246633 278632 136252
21329 136252 14687 2303 -125169 -118503 -108272 -189622 -200068 -142599 -134057 -196628 -151853
21318 -151853 -64671 -85852 -144942 -52433 51453 68353 -20541 12037 27432 -47798 -124483
21307 -124483 -76458 -92693 -130805 -199073 -123266 -141702 -30523 3904 -203969 775 42415
21296 42415 56206 -66649 33431 -3807 -49365 -56976 7669 38224 109846 245405 171842
21285 171842 14193 65401 223874 220131 128832 92535 69866 50585 -108875 -266183 -270539
21274 -270539 -322520 -345594 -219369 -230104 -79996 -101921 -354176 -263781 -136674 -248792
21264 -248792 -248053 -168641 -66640 55480 36903 -30396 154915 7490 -115335 -220296 -141805
21253 -141805 19091 43805 4407 63511 144524 149432 201627 180253 68757 -17209 -98931
21242 -98931 -55404 72611 220326 270312 290524 292279 241630 176821 267767 333749 47203
21231 47203 24486 -78808 -8877 26690 96976 173141 272624 190094 53290 102401 142343
21220 142343 29441 26463 -60219 -87569 -49045 -69736 -29235 -52542 -105135 -175327 -276105
21209 -276105 -168206 14423 37493 -7373 -19437 -13957 -107379 -70272 -69083 -53766 -148790
21198 -148790 -316209 -137434 49341 33579 -133355 -119608 -97631 -164174 -378654 -385531 -260678
21187 -260678 -39620 -53990 -141669 30626 164652 103197 13996 -34639 -147995 -128430 -103644
21176 -103644 -79853 -129282 -180007 -198893 23684 186046 152758 183994 120804 -31518 -84111
21165 -84111 -56945 -138596 -82411 -61684 18647 227412 367008 269853 123982 6258 -93186
21154 -93186 -15443 122972 76020 -109743 -244562 -408889 -356716 -246030 53067 226628
21144 226628 300465 118343 58501 12087 -57028 2165 -60109 -53238 -38430 -318170 -347770
21133 -347770 -74239 -131559 -248864 -282987 -232897 -77114 -6071 48389 78937 105188 -92842
21122 -92842 -174704 -232661 -198460 -249380 -352806 -245759 -182562 -284025 -297620 -208540 -129481
21111 -129481 -114374 -160950 -148400 119206 34122 53649 -13823 -66775 -117855 -63198 -83277
21100 -83277 -147559 -123819 -133271 -161125 -222557 -201413 -44173 -127627 -187745 -1828 121966
21089 121966 30366 87799 224968 134962 -36678 -159621 -95788 -12206 7752 77122 43625
21078 43625 95524 110195 102275 260998 248609 159364 200292 216133 173398 50593 40259
21067 40259 75765 35067 -94041 -204860 -191139 42395 100636 128513 66311 10572 -36007
21056 -36007 -81058 -263918 -335166 -287349 12449 68173 52821 125356 199168 211079 179169
21045 179169 59522 58729 -18062 -85993 -68924 -36936 45883 52898 41855 25328 8755 127775
21033 127775 271992 181466 -55613 -34749 76113 47283 -133427 -212727 -135218 31237
21023 31237 13206 29800 -8510 -31506 -83538 -139067 -179942 4898 142921 1962 -260025
21012 -260025 -214419 -96736 7347 22751 66405 48699 165358 190173 -34215 -175979
21002 -175979 -140337 -179719 -52150 -44490 64957 127863 184311 303585 278899 161256 106593
20991 106593 196089 163921 21923 81522 -205454 -246057 -118444 9330 41627 64831 48812
20980 48812 -41163 -110577 -92352 -38040 80572 37564 92215 175735 146262 21198 -133326
20969 -133326 -109750 20306 256365 198635 67756 200232 311182 180276 133539 93790
20959 93790 -56836 24879 -15893 22404 130197 149952 161658 -31187 -83270 -170275 -314517
20948 -314517 -146007 34433 39594 82584 158866 101939 -40644 -90072 74433 133579 -99175
20937 -99175 -137741 -198206 -191287 -95427 -56858 -9032 74582 53773 9744 44961 -19934 89048
20925 89048 70465 3470 -1881 47077 -19043 19290 58526 125864 287448 222266 30740
20914 30740 -84107 -154965 -146856 -136690 -312308 -263388 -82142 -7841 -1610 134594 137113
20903 137113 -4564 -151710 -149470 -127212 -35234 -11401 -282143 -261458 -60430 -120865 -148743
20892 -148743 -183547 -206036 -92055 -116127 -92849 -8593 57994 394 -106112 -104940 -136025
20881 -136025 -210751 -40673 102365 71840 128066 175912 150477 135876 236175 206756 217133
20870 217133 71079 8006 21833 -75932 -58794 -33603 -43173 -102739 -127007 -86297 212
20859 212 74816 191643 268934 165924 -6519 -126609 -269381 -175402 -5973 128491 45420
20848 45420 196890 148166 185716 150181 3788 -73614 32083 115516 46846 10650 91737
20837 91737 59960 108348 209898 37202 -107504 -89532 -21786 81402 202363 258602 229877
20826 229877 193138 107774 155450 141994 102094 129991 76232 45550 288259 248645 9488
20815 9488 -46965 4854 66543 126918 71451 113176 135353 4497 -120193 -166551 -342813
20804 -342813 -379147 -269563 -203784 -43762 116412 93791 -55894 -140580 -96225 -4334 -46326
20793 -46326 41968 124945 72453 -54718 -217481 -102836 240472 284275 222249 164125 126315
20782 126315 -32798 -257637 -437882 -547131 -462352 -239295 -36512 95527 46413 9572
20772 9572 148675 201810 140290 41290 26472 135500 27049 58179 137622 141427 186284
20761 186284 209706 293864 198460 245209 197074 254840 262418 449717 415898 234570 56975
20750 56975 -55427 129137 295972 460487 406999 181247 71818 125603 102168 -50895
20740 -50895 -124118 47808 138102 15397 26110 97432 206301 184534 30266 -57261 -75238
20729 -75238 61795 152522 177870 275 -94974 -108696 -183397 -217501 40684 107300 -55955
20718 -55955 -32145 28892 -60022 -79614 -13191 -16806 -90250 23222 235870 244353 276061 230821
20706 230821 176176 242997 261842 320847 340265 168263 229336 202060 -23405 -242388 -287090
20695 -287090 -228686 -13693 187910 322228 308825 289346 420012 432745 305101 175622
20685 175622 52940 75758 46739 88251 66312 169542 289926 193026 -40055 -42150 90442
20674 90442 134852 172898 189359 110180 92934 141186 165324 206077 107848 301257 265972
20663 265972 165446 244752 259042 204659 172492 210557 331386 449848 434092 325006 162479
20652 162479 125528 61370 32969 96383 254459 367931 457796 279146 160426 135956 86379
20641 86379 149012 272073 471635 435903 163829 51399 35991 58333 200984 258321 210684
20630 210684 259025 335915 166479 -9160 116570 368714 396620 265672 112459 -42264
20620 -42264 13748 70492 218100 288064 152561 170131 342690 282467 440097 525029 460403
20609 460403 368772 466655 438060 384420 343480 358095 401061 434178 412670 431010 487784
20598 487784 294185 336966 321568 237867 229215 193748 103835 244446 406570 514349 330969
20587 330969 433372 635877 554030 402266 368886 393993 362113 402344 430784 363438 257253
20576 257253 342311 253062 310827 263214 253577 292427 487850 581528 440842 372000 354070
20565 354070 318346 276931 167130 215922 257224 85470 39811 203463 396565 317971 123622
20554 123622 423503 593671 629890 690862 458429 355166 425946 586810 527827 459077
20544 459077 266915 258836 243551 99427 25986 175353 203783 204306 207969 289622 281864 194402
20532 194402 256418 418002 455006 377884 260711 112682 87462 17677 66165 193899 314630
20521 314630 239253 136425 245875 315987 310585 81350 144858 189273 177133 150303 255013
20510 255013 392662 407314 446520 547620 360693 114153 115568 73371 273224 281097 254711
20499 254711 379763 393679 390773 288167 322726 412399 483040 612470 545475 340906 281084
20488 281084 382861 419162 450987 453991 602008 597701 602290 440828 390739 383641 259476
20477 259476 203139 170350 245022 337801 458889 514251 529905 398469 234920 388993 341159
20466 341159 427449 531497 628368 783518 849476 830038 694592 744690 662056 384073 424788
20455 424788 422126 272769 152074 111908 273898 567081 641228 587059 533806 522434 436754
20444 436754 542428 552275 425609 363891 452050 522727 686791 507539 385241 361165 408794
20433 408794 293286 173806 244742 407471 635680 653964 565968 442712 348115 406771
20423 406771 585512 539429 400745 282801 272361 248647 259300 414916 549741 533599
20413 533599 546739 562721 556228 601328 673961 711407 676038 589686 467446 391287 249796
20402 249796 350690 466778 503577 569809 578634 777534 870665 733445 817600 859158 828816
20391 828816 694682 557975 502083 545245 586811 421858 376419 441071 627953 795055
20381 795055 681396 590390 607877 573667 670417 650482 505259 519972 538707 594093 578981
20370 578981 528162 552377 679386 772118 812157 869202 900720 975652 776657 616496 636778
20359 636778 647452 521599 677673 778619 698296 720026 881026 890669 683241 624387 653950
20348 653950 784359 809859 743986 604763 594073 536898 595950 789249 779377 876886 958181
20337 958181 858207 752515 647262 677759 631357 633647 670911 659614 499113 550534 765438
20326 765438 935787 1138457 1118361 1090726 1056326 978903 900703 858505 886931 902665 849916
20315 849916 652829 606443 640556 732974 773717 787411 839121 895226 1041926 959246 869080
20304 869080 868560 974967 1165908 1287746 1238296 1043139 869891 834723 630688 714200 853363
20293 853363 787654 941020 971530 862908 901475 953438 951735 1078385 1228694 1180313 949415
20282 949415 919444 916662 933119 994896 992150 1031115 972093 859101 847786 890996 1056983
20271 1056983 873869 884709 1015436 1042369 1002663 926905 783648 897168 934287 939285 1088059
20260 1088059 1152139 1214182 1034461 980854 1017627 1101811 1115164 1159910 1219917 1315640 1344076
20249 1344076 1179277 1003743 1170847 1245475 1176430 1193408 1265448 1359078 1237602 1060367
20239 1060367 1176791 1369631 1295389 1152915 1033815 1058626 1234147 1407845 1406532 1293435
20229 1293435 1339014 1590788 1684786 1731922 1539883 1328652 1238331 1503410 1670583 1568547
20219 1568547 1389873 1314443 1273298 1235922 1367805 1526162 1446686 1407809 1266178 1374258
20209 1374258 1361550 1233998 1344058 1383978 1656274 1698235 1620291 1573710 1494837 1515020 1371847
20198 1371847 1587351 1593631 1596297 1640589 1655513 1754500 1834453 1923203 1848551 1600137 1464408
20187 1464408 1503151 1569366 1720325 1861607 1970856 1945961 1913841 1877947 1817519 1760798 1772769
20176 1772769 1843681 1792509 1818156 1921645 1847595 1845451 1899140 2097799 2095657 2096567 2041266 2059972
20164 2059972 2233803 2289534 2280824 2154111 2169728 2141699 1978662 2036471 2113827 1997040 1880106
20153 1880106 1898519 1984149 1977888 1894808 2102286 2201433 2245462 2351637 2451004 2446004 2311339
20142 2311339 2222946 2211285 2409600 2461497 2384259 2438759 2631543 2724030 2711131 2621485 2753350
20131 2753350 2720357 2843789 2886306 2797585 2610370 2674631 2776571 2776624 2814600 2900954 3098916
20120 3098916 3074657 2940419 3008433 3102922 3239283 3259149 2959505 3028493 3163184 3211211
20110 3211211 3105071 3111722 3253573 3486594 3412683 3113499 3083187 3161121 3139918 3058625 2987643
20099 2987643 2959096 3161376 3266777 3163246 3004015 3016090 3027159 2903209 2882818 2889236
20089 2889236 3016688 3100433 3094089 3133036 3276853 3380418 3460499 3370430 3450424 3428262 3622636
20078 3622636 3540436 3550029 3471499 3389302 3538447 3533755 3692765 3811309 3797283 3734598 3670523
20067 3670523 3712656 3722000 3863583 3859341 4122055 4143226 3882525 3885927 4035050 4052253 4034063
20056 4034063 4149825 4190039 4239383 4444617 4484279 4503059 4521879 4557142 4504145 4338127 4397488
20045 4397488 4526914 4543007 4540815 4448034 4405659 4490191 4406658 4505184 4574559 4606931 4659709
20034 4659709 4669828 4814973 4934605 4952788 5114981 5136076 5004913 5030860 5052912 5193082
20024 5193082 5498273 5559994 5639776 5591780 5618816 5629384 5487412 5366798 5409262 5331347 5275685
20013 5275685 5403286 5618391 5915635 6118904 6152059 6118068 5998165 6063751 6111089 6130679
20003 6130679 6194923 6318525 6347866 6318167 6346962 6384223 6451149 6420516 6383963 6389758 6543878
19992 6543878 6764379 7024069 7160696 7141988 7058741 7143991 7313612 7276144 7341080 7315995
19982 7315995 7405449 7579796 7759244 7766744 7745396 7635201 7656067 7898912 8298321 8203885
19972 8203885 8223388 8451923 8541090 8690579 8768858 8804876 8885427 9160181 9358254 9300640
19962 9300640 9267325 9565162 9693620 9650310 9684465 9846829 9912589 9984911 10026638 10144098
19952 10144098 10376795 10476713 10612503 10717895 10953064 11060095 11039477 11060341 10950808 11070809
19942 11070809 11136849 11315125 11438425 11498945 11616578 11669644 11922540 12184543 12361742 12609425
19932 12609425 12713913 12844962 12857937 12973917 13026925 13383760 13675186 13722454 13785290 13869964
19922 13869964 14056408 14354193 14331599 14275508 14470379 14801148 15034127 15109680 15180388 15408426
19912 15408426 15609974 15793186 15941072 16275240 16419388 16451301 16586782 16745433 17173948
19903 17173948 17449744 17626103 17749421 17842955 18115713 18494498 18563259 18571746 18749661 19076766
19893 19076766 19365893 19539762 19791784 20062220 20324557 20520621 20699039 20859594 21107176
19884 21107176 21518080 21837980 22031698 22251071 22396595 22626526 23006820 23262510 23653100
19875 23653100 23796237 23871363 24057537 24260287 24616496 24966836 25262865 25573690 25822914
19866 25822914 26094261 26206930 26440183 26780806 26974747 27161625 27454412 27793212 28239782
19857 28239782 28618700 28824099 28927372 29248941 29564416 29883544 30233798 30356562 30475063
19848 30475063 30694414 30889003 31123089 31294392 31622630 31964142 32281382 32580300 32709592
19839 32709592 32687752 32718204 32924758 33273307 33581473 33974585 34173844 34452613 34570747 34546855
19829 34546855 34887492 35214665 35143459 35129862 35294880 35456943 35608012 35744546 35951434 36103330
19819 36103330 36063261 36160231 36298053 36231505 36244676 36218142 36266348 36456894 36470067 36451396 36467470
19808 36467470 36371487 36291303 36514325 36633035 36712833 36688605 36457935 36216139 36022092 36031490
19798 36031490 36009719 35887221 35832764 35853104 35744196 35560617 35454993 35475795 35497006 35292918
19788 35292918 35045555 34664817 34487183 34412522 34368018 34164537 33882351 33649393 33611557 33601580
19778 33601580 33355842 33113186 32760714 32589880 32434162 32065318 31781357 31625230 31329647
19769 31329647 31118069 30867111 30792561 30693820 30523564 30370373 30125476 29535754 29262915 28927470
19759 28927470 28533130 28239000 28056230 27682171 27351173 27258822 27142365 27009502 26797848
19750 26797848 26414731 26146639 26022484 25779819 25472808 25121202 24925130 24690815 24479987
19741 24479987 24224246 23835094 23645791 23422110 23271686 23102524 22725984 22413682 22168851
19732 22168851 21879039 21649398 21335278 21147870 21082823 20897377 20738600 20612379 20445719
19723 20445719 20108546 19760377 19604900 19388269 19379378 19352199 19233683 18981489 18451619 18217874
19713 18217874 18242287 18124356 17741305 17429721 17216234 17048518 16846515 16777665 16820498 16530594
19703 16530594 16112320 15924381 15736913 15643667 15522792 15414175 15266205 15108549 14962179
19694 14962179 14686666 14530001 14216475 14103228 14020663 13868846 13767425 13692740 13546428 13325450
19684 13325450 13238776 13259777 13219516 13214589 13011307 12729715 12707474 12714798 12448327 12121944 11927548
19673 11927548 11847863 11664741 11623988 11736223 11635907 11440656 11209473 10941094 10604299 10477843
19663 10477843 10387351 10397440 10203766 10032030 10042105 10137621 10174814 10070840 9837018 9904703
19653 9904703 10006563 9793234 9441095 9282676 9272939 9180750 9108319 9067124 9076673 9187533 9117347
19642 9117347 8934286 8755883 8688407 8695219 8355982 8269458 8126497 8065349 7989976 7867983
19632 7867983 7973444 7918764 7753347 7715443 7696441 7621542 7511855 7440923 7321389 7388084
19622 7388084 7446966 7319659 7181417 7078550 6913279 6671410 6647063 6609633 6534401 6493232
19612 6493232 6358907 6536715 6544585 6412951 6311593 6496319 6621130 6448409 6362520 6283151
19602 6283151 6122099 5927508 5871223 5633271 5485679 5556358 5690163 5850456 5797943 5800849
19592 5800849 5822659 5747202 5726093 5530788 5285515 5386078 5489893 5436206 5314469 5365148
19582 5365148 5437035 5442011 5234297 5094935 4920958 4986406 4965882 4968096 4994554 4957755 5055551
19571 5055551 5017117 4929545 4856208 4805788 4739552 4639662 4659966 4710221 4655428 4674858 4667111
19560 4667111 4515992 4564524 4545866 4471188 4256931 4242000 4238601 4420993 4401346 4469242 4384695
19549 4384695 4317749 4243254 4205297 4237081 4240834 4033650 3862430 3864162 3781937 3743257 3676935
19538 3676935 3617889 3663067 3694341 3736625 3622058 3624749 3830966 3817152 3713897 3586352 3487526
19527 3487526 3342781 3325522 3406096 3243239 3093746 3019994 3061192 3228628 3291706 3366261
19517 3366261 3631520 3805078 3721946 3640271 3700153 3710155 3635361 3579507 3549979 3356545 3263891
19506 3263891 3404054 3394533 3455395 3567416 3621536 3694271 3870105 3946124 3828202 3810432 3847329
19495 3847329 3900549 3737361 3419711 3228691 3147649 3029630 3024869 3040417 2875453 2682878
19485 2682878 2840283 3020293 3063999 3091762 3161561 3033066 2741806 2746261 2654541 2591192 2747691
19474 2747691 2885865 2826215 2664346 2553894 2517383 2358491 2349538 2362754 2259615 2412419
19464 2412419 2478082 2503248 2497072 2476759 2459456 2341613 2420433 2520165 2336241 2285082 2293588
19453 2293588 2221561 2193934 1963603 1902742 1971241 2042258 2105518 1953806 2004849 1957539 2060189
19442 2060189 2156177 2297408 2535009 2533237 2420390 2388574 2272612 2258844 2285988 2205523 2074015
19431 2074015 2110606 2186717 2211511 2075861 1997542 1919849 1988265 2060186 2073197 2094095 2094321
19420 2094321 2088678 1944094 1788994 1722071 1805029 1947348 1940111 1964778 1834884 1794891 1910022
19409 1910022 2004124 2089258 2012386 1917909 1825391 1550898 1506675 1578513 1498218 1558678 1674843
19398 1674843 1700593 1677028 1486256 1607604 1739356 1871338 1909350 1810253 1696424 1647730
19388 1647730 1697357 1688755 1672183 1697960 1767054 1797541 1598243 1494224 1426245 1522990 1758602
19377 1758602 1735884 1672134 1616960 1632120 1610234 1378703 1465268 1403748 1365280 1345035 1361362
19366 1361362 1431231 1538761 1656085 1582140 1558804 1487025 1373838 1316850 1458916 1702459
19356 1702459 1791798 1628830 1374464 1104906 1145005 1310773 1401674 1485576 1483937 1361085
19346 1361085 1339177 1178989 1198997 1344579 1176482 1259385 1299785 1314869 1411628 1312843 1248673
19335 1248673 1327895 1155367 1049869 1036325 1138524 1185244 1294865 1280516 1296760 1349493
19325 1349493 1332693 1258417 1162743 1166040 1106755 1027683 1008908 1272700 1373468 1059856 968946
19314 968946 1172137 1146989 1124527 1106414 1020022 1132531 1200586 1162451 1228455 1465744 1636683
19303 1636683 1546259 1402401 1347111 1281981 1171031 1053337 1043588 1060301 1071575 1051990 947457
19292 947457 923719 1226862 1242675 910563 824020 977485 1256267 1489937 1480107 1339981
19282 1339981 1258440 1280307 1132622 1070382 967226 1019991 945261 922329 745141 818015 868917
19271 868917 967832 845709 875370 932560 874297 851738 884867 951385 1007960 1049266 1146102
19260 1146102 1054313 962174 952849 882334 776667 951215 935304 956071 1015451 905144 832009
19249 832009 943538 1024482 1087544 907235 826414 1055950 1024141 1001514 1185994 1171014 1132812
19238 1132812 1109625 1018847 933664 951388 992447 994803 963734 832790 706976 861100 1016576
19227 1016576 873470 640665 648862 736830 849084 872059 838636 821103 784825 767804 689036
19216 689036 471736 621172 917836 988763 894125 858439 683209 544048 513704 561487
19206 561487 754061 790355 756994 664780 766324 950649 947345 943827 888598 721458 580984
19195 580984 637291 659301 717117 719395 769753 694825 628594 640685 656151 807708 982740
19184 982740 1199955 1423367 1658636 1885236 1834846 1709763 1791702 1962273 2155520 2195573
19174 2195573 1985041 1698297 1446237 1359670 1183572 1097069 941508 822937 827324 807373
19164 807373 947075 875654 877374 689302 674801 612038 534125 622569 597581 730145 633671
19153 633671 574364 711738 706856 687910 693193 597248 612416 774457 695139 803042 923795
19142 923795 928898 983571 1047757 1048926 972200 959710 1148676 1276448 1231792 1326297 1547561
19131 1547561 1933014 1951774 1878344 1825212 1891235 2148869 2391209 2349146 2114016 1910122
19121 1910122 1692078 1625996 1581085 1403783 1124720 949679 908872 943007 983575 802454
19111 802454 711537 705213 767545 779262 706104 623064 593031 568013 710442 686747 667094
19100 667094 744523 778060 697786 543486 560320 691619 658003 506230 395334 344926 278610
19089 278610 381962 687430 883037 822471 674095 559849 458624 539144 680568 721999
19079 721999 613949 464450 344233 279552 295565 417314 419034 335014 383325 467512 461555
19068 461555 333433 250345 212541 240105 139687 123561 231594 389508 442173 507663 529960
19057 529960 698020 805540 827754 772797 686727 854367 757539 524762 431750 544058
19047 544058 587115 626673 620972 503113 516590 419131 477018 698846 685863 549171 445169
19036 445169 461746 666544 671548 535732 487453 540341 507741 492013 553610 602573 659621
19025 659621 695034 592814 536303 516315 648162 619635 639232 594970 515556 419065 572233
19014 572233 582754 408840 466501 489939 475112 537778 496996 484805 389696 458640 556992
19003 556992 458225 449428 397930 326017 276883 310828 413676 389988 438432 613213 562435
18992 562435 365309 340259 473666 509558 477705 456745 264064 348324 528071 465729 445703
18981 445703 390904 388301 288900 264928 514861 586535 572950 555182 672036 772914 741239
18970 741239 717127 589040 483517 300725 -9631 -49019 197577 293195 366061 521813
18960 521813 418645 295946 282094 298775 311814 337588 340558 364479 244943 191403 353664
18949 353664 366241 340165 310515 272761 238889 311876 222361 162666 314437 370759 379953
18938 379953 426605 548202 577090 606322 476127 347520 328005 313396 523624 664751
18928 664751 626031 565947 649625 682895 676656 548616 606449 588966 657437 490988 471409
18917 471409 611660 581031 549189 565646 430262 438218 371955 354656 384054 377299 524404
18906 524404 618398 374697 397787 337913 458270 527514 571889 565194 464556 381591 430777
18895 430777 569131 522680 546074 550645 534460 380510 380259 417078 570148 523541 324139
18884 324139 192226 261107 464106 578570 469871 512754 591128 600599 606320 593288 641968
18873 641968 583779 438855 433128 345172 353606 414323 438233 349636 352866 274179 105784 139828
18861 139828 372509 519241 585653 701174 714198 376212 392882 329482 211180 158497
18851 158497 67826 12212 4749 81965 132207 173790 55883 136537 213197 243696 265106
18840 265106 377158 287092 359776 333861 299530 439318 520842 429349 447769 416521 612840
18829 612840 689002 584135 520261 531022 563739 658278 714934 834825 945521 972119 1010253
18818 1010253 1148129 1322849 1519073 1613279 1603310 1713788 1783755 1787820 1982100 2162212
18808 2162212 2025039 1759222 1453803 1100153 846227 684915 763079 609920 627449 690652
18798 690652 602042 536703 538749 567761 401671 457114 590501 753686 764977 711355 639805
18787 639805 524681 547473 599798 604320 579813 509602 522377 598960 791531 1023088 1055414
18776 1055414 1097942 984783 860625 1099642 1263351 1478350 1722324 2009610 2520151 3058396
18766 3058396 3356695 3155917 2795299 2662929 2711411 2681640 2424834 2129696 1792312 1571955
18756 1571955 1378281 1148319 920224 980668 1010425 1110526 1109634 908043 893034 1075457
18746 1075457 1122623 1242188 1230608 1215445 1062210 982381 904715 957890 1065894 935368
18736 935368 925256 927838 958966 1067474 1136550 1220381 1134680 1441391 1653798 1892828 2086479
18725 2086479 2305907 2504937 2567527 2569666 2431425 2233139 2123994 2156892 2125597 2189798
18715 2189798 2405113 2758493 2939426 3096243 3369939 3606937 4066231 4262531 4382723
18706 4382723 4824879 5283440 5545594 5955175 6236108 6551534 6853370 6975223 7231036
18697 7231036 7677458 8126308 8410071 8627428 8957099 9565074 10431587 11390359 12376774
18688 12376774 13557604 15069403 16985507 19927361 24220149 30522104 40077421 53482288
18680 53482288 70829833 91925869 118658582 152498959 188120869 212281814 222127011
18673 222127011 232510480 255957929 285620734 296944987 274162446 234524683 205226521
18666 205226521 192687273 182719556 158535003 122585919 90554562 68703136 54596609
18659 54596609 45382703 38968317 34048815 30461349 27771957 25640120 24056474 23046526
18651 23046526 22494199 22091856 21646073 21079311 20845187 20827510 20661064 20196668 19725633
18642 19725633 19598952 19792769 20083369 20688870 21670950 23218400 25587653 28772250 33451587
18633 33451587 40408602 50763519 65266205 83979699 107087863 136600101 174114747
18626 174114747 213381310 240028557 250974046 262562387 288477948 320840173 332573385
18619 332573385 306915078 262864132 229785948 215185822 203298375 176025778 136026870
18612 136026870 100302407 76082182 60248723 49585848 42205771 36850796 32637889
18605 32637889 29214534 26142206 23513559 21319739 19659963 18302380 17130901 16209521
18597 16209521 15343697 14909691 14504146 13981613 13151026 12208796 11529522 10934314 10419439
18588 10419439 9764082 9111317 8636473 8095392 7700560 7288471 6902698 6527829 6169828
18579 6169828 5918488 5946782 6008724 5689510 5372329 5244278 5075051 4870523 4794340 4766140
18569 4766140 4454333 4231799 4141122 4211924 4213517 4206773 4270313 4164559 3877887 3883299 3991638
18558 3991638 3899446 3780568 3743823 3664254 3518202 3444674 3380555 3387519 3254780 3236088 3187604
18547 3187604 2986047 2802351 2649188 2530863 2599601 2531947 2406524 2383986 2295785 2282603
18537 2282603 2066373 1974885 1927358 1860766 1885382 1968116 1882904 1768069 1768824 1672280 1615502
18526 1615502 1577585 1551396 1588226 1459843 1346516 1340750 1383112 1301647 1452153 1472079 1438971
18515 1438971 1364400 1291276 1403123 1248119 1193895 1217104 1216530 1335382 1499584 1553674 1399384
18504 1399384 1381563 1425314 1533392 1545185 1737187 1885296 1670696 1605374 1606949 1684389 1733754
18493 1733754 1781071 1893478 1532866 1272386 1125980 1138085 1220901 1016288 1021361 1208689
18483 1208689 1329642 1156583 896372 913256 831370 744475 620617 701905 759934 802594
18473 802594 735684 698323 820436 899131 917888 940180 731909 452255 553805 702205
18463 702205 767340 665515 579618 507764 524392 659851 754067 787953 721560 702520 636021
18452 636021 668612 672812 581273 579382 480408 523174 612323 729738 666760 552604 790566
18441 790566 697922 569147 592150 740531 683551 585416 609834 572522 635962 565231 489562
18430 489562 719135 815137 900293 941280 794117 719076 837951 1013791 1244193 1176409
18420 1176409 1016375 833813 849205 1009612 1134892 1153161 1029156 901330 800836 671136
18410 671136 789491 751384 875219 1020579 1039221 1030827 1146973 1279339 1249359 1092433
18400 1092433 1113629 1038778 1112604 1090708 1107516 1221482 1198086 1131739 1124538 1119964 975919
18389 975919 977788 1115455 1137219 1070053 1069751 1203568 1397999 1324416 1335134 1279011 1422738
18378 1422738 1516239 1344629 1353810 1480098 1426837 1241315 1293647 1483557 1407061 1458532 1582341
18367 1582341 1489576 1530842 1576357 1339673 1320343 1219827 1041175 1028688 1029612 997571 954020
18356 954020 956021 868837 790673 893075 1043719 1063427 945955 1108544 1423183 1586660
18346 1586660 1528703 1556083 1609509 1608492 1693166 1680051 1872719 1970339 1854922 1947500 2088293
18335 2088293 2183327 2221871 2374023 2491465 2538101 2783995 2845062 3189333 3509754 3900059
18325 3900059 4398574 5034579 5719584 6245549 6627483 7198260 7634609 7933968 8306616
18316 8306616 8861836 9224725 9731155 10064429 10758011 11700289 12822800 14561940 16974238
18307 16974238 19876810 24136006 30678815 40373928 54932474 75171174 101142220 133378039
18299 133378039 174896998 220871593 256912968 272792589 281734037 276802239 267571043
18292 267571043 267510556 260406953 238081415 210448357 164806597 117187049 84464476
18285 84464476 64271750 51546920 43247693 37375970 33170395 29846004 27373866 25757188
18277 25757188 24878477 24320648 24019332 23912407 23738753 23682288 23651555 23693501 23681936 23940915
18267 23940915 24141248 24654101 25277791 25746062 26111251 26666406 27894568 29885659 32391907
18258 32391907 36149885 42131137 51798937 67116315 89375916 118596540 154631690
18251 154631690 200937673 255421388 304433379 328517842 339512813 338167051 322641411
18244 322641411 316832462 312041420 288852018 258602454 212113122 153772601 109752639
18237 109752639 81938020 64556510 53252449 45556034 39700634 34922103 31360070
18230 31360070 28655175 26210623 24339451 22926404 21826507 20809142 20079673 19393721
18222 19393721 18692655 18016940 17636740 17354793 16812637 15763513 14377974 12995620 11745047
18213 11745047 10687599 9947915 9248781 8905936 8521668 8043254 7667500 7549057 7374808
18204 7374808 7142845 7068440 6948774 6759606 6475375 6397239 6420810 6340521 6282454 6165845
18194 6165845 6004521 5904555 5792127 5820157 5933503 5807294 5546210 5510691 5520155 5505594
18184 5505594 5492672 5406608 5449857 5674894 5759455 5818305 6031888 6108294 6242962 6432866
18174 6432866 6676146 6973257 7393107 8367738 9460079 10275544 10840231 11549045 11973661
18165 11973661 12209976 12279311 12161647 12434026 13236693 14027793 14974562 16216799 17737673
18156 17737673 19819589 22590041 26024682 30696066 37378346 47114437 61023140 79614151
18148 79614151 103383428 132158921 165724856 199807503 222502345 225433377 211845741
18141 211845741 184368965 147935058 116185617 96390106 87381971 87251757 95163804
18134 95163804 110568034 132990288 162530741 200202788 243455682 283451875 309826235
18127 309826235 323285740 328304461 326313422 320319443 306449468 282513647 249710677
18120 249710677 207634813 166740603 138657761 124707690 123439839 134877404 160054325
18113 160054325 198716733 245902738 300898108 371945297 440922801 455541812 385210966
18106 385210966 305584724 234946309 174544279 130294499 100942366 81784564 68367980
18099 68367980 58658637 51336980 45318955 40245650 36054712 32528706 29708818 27413878
18091 27413878 25393597 23793844 22547599 21498691 20515240 19745689 19192381 18638856 18104968
18082 18104968 17506541 16470993 15173940 14037217 13004030 12230436 11664419 10951787 10423180
18073 10423180 9997809 9589036 9265178 8868011 8333738 8014515 7774549 7588635 7493783
18064 7493783 7316498 7117910 6935886 6681929 6470946 6418646 6257791 5913795 5629580 5442817
18054 5442817 5397877 5284713 5191365 5093022 5083624 5072464 4782291 4544758 4464622 4311788 4160201
18043 4160201 4032993 3847040 3633087 3538193 3491853 3522709 3485585 3325695 3069658 2961226
18033 2961226 2970623 3130375 3085981 2998939 3017832 3024246 3037822 2833271 2752851 2867804 2731639
18022 2731639 2496841 2474733 2644337 2761970 2718791 2668403 2656354 2691070 2712747 2712640 2567308
18011 2567308 2503994 2491158 2466336 2608036 2477664 2429322 2348313 2341170 2424110 2493099 2313150
18000 2313150 2141084 2043049 2128071 2125944 2276458 2311338 2221449 1975604 1745989 1518583
17990 1518583 1329692 1460644 1446439 1425739 1473602 1468776 1582263 1788732 1785598 1871391 1803350
17979 1803350 1691263 1522179 1367107 1407027 1609244 1737778 1573692 1380606 1424383 1376871
17969 1376871 1231735 1288406 1237502 1146256 1235921 1286369 1201648 975743 1014877 1222702 1326668
17958 1326668 970018 630988 534620 671299 790598 879304 903351 871085 839434 811237
17948 811237 970385 952699 994723 1053759 1081813 991391 1009173 952232 1006562 989508 1018199
17937 1018199 924715 932811 1039468 1197570 1289545 1349745 1407774 1287831 1180886 1093738 1232901
17926 1232901 1197924 1089230 1227826 1178081 1016105 806211 675355 735966 754792 642560
17916 642560 662872 640176 690297 814199 995304 992886 960857 967372 1017070 912543 933198
17905 933198 707704 650038 697347 625007 656889 875866 1076027 1123281 1036936 1144934 1102976
17894 1102976 850342 792104 954928 845808 802333 678625 674144 743021 798451 835080 681335
17883 681335 617212 845581 762051 669670 565256 712172 758429 828285 970542 901383 852647
17872 852647 906378 875219 944254 837599 612797 482670 662475 886536 913667 896847
17862 896847 781373 704115 882202 1130151 1111657 1120461 1096678 991587 980867 1013662 1109405
17851 1109405 1377639 1523939 1605285 1707208 1568522 1506483 1336393 1380197 1396486 1200502
17841 1200502 1099462 912141 945800 1013371 1147917 1166701 1188199 1071517 1154863 1115585
17831 1115585 1103839 1021979 942148 918723 1067371 1215690 1300000 1311256 1349945 1253089 1217644
17820 1217644 1315974 1526069 1718183 1745144 1993766 2040206 1948757 2066498 2392185 2637231
17810 2637231 2947620 3429001 3920186 3952813 3592259 3441710 3501170 3649118 4093820 4700240
17800 4700240 5213880 5514126 5112395 4666276 4435639 4339851 4384838 4581689 4875106 5259529
17790 5259529 5611047 6116555 6592732 7113718 7914509 8839817 10054175 11639163 13816038
17781 13816038 16986975 21029433 26791408 35727387 49731992 70607407 100045683 136385265
17773 136385265 174961898 220407139 275410496 313154575 278611319 195198043 129674737
17766 129674737 89881677 66198808 51446304 41674424 35102528 30525503 27260662
17759 27260662 24702360 22461585 20525395 18657281 17207995 16290820 15794214 15718914 15767128
17750 15767128 15765768 15793346 15696331 15576847 15973280 16866482 17986731 18870706 19230363 18901111
17740 18901111 18011653 17214330 17362967 18192927 19764126 21988760 24737556 28571925 33676603
17731 33676603 40347124 50122920 65284504 88558685 123010139 170305638 227915517
17724 227915517 294792865 373090910 453528218 495444391 463285017 369514608 255092748
17717 255092748 173027162 122994209 92540023 73177327 59827808 50351789 43559732
17710 43559732 38432735 34224987 30874616 28241146 26138207 24713470 23811550 22901702
17702 22901702 21884643 20655115 19537509 18337614 17205530 16302656 15774931 15749779 16018127
17693 16018127 16307633 16365287 16219801 15911895 15602770 15663410 16302903 17312924 18477968
17684 18477968 19921953 21570080 23690089 27006056 32280079 40776063 53830362 73580167
17676 73580167 99367437 127557357 158917485 199155261 235546088 228600010 168335842
17669 168335842 111969538 76550748 55712728 42734072 34259554 28352545 23984905
17662 23984905 20686640 17894402 16023678 14407263 13077631 11889900 11017374 10247355
17654 10247355 9436521 8639525 7983600 7480874 7034265 6688299 6600062 6593530 6592303 6823144
17644 6823144 6833935 6778541 6489967 5819096 5325453 5176486 5115311 4928834 4824020 4902428
17634 4902428 4801467 4499751 4122854 3716851 3518224 3339282 3288152 3140538 3112062 3104780
17624 3104780 2858080 2576993 2485449 2559383 2650592 2590920 2460326 2283706 2231458 2164104
17614 2164104 2203136 2233133 2190103 1964570 1886511 1829945 1822171 1793606 1832311 1645170 1548229
17603 1548229 1663369 1737974 1590282 1618152 1691377 1657606 1812257 1888456 1822124 1875095 1937163
17592 1937163 1950785 1677813 1491077 1481125 1390147 1306372 1397724 1402718 1273510 1178086 1017474
17581 1017474 925104 966526 894675 840078 878751 684607 597791 808478 959147 866836 768946
17570 768946 712325 813154 935440 979466 929274 818684 894976 1045431 1150481 1290775
17560 1290775 1345678 1530539 1674284 2045082 2121827 1886226 1708861 1559502 1447587 1411094
17550 1411094 1321525 1372252 1503584 1627007 1723433 1756951 1889159 2189790 2535032 2672526
17540 2672526 2769686 2712361 2597369 2599884 2454280 2217310 1916231 1696415 1391141 1361475
17530 1361475 1213094 1086659 1197029 1268663 1231020 1213907 1296217 1237490 1282058 1440556
17520 1440556 1570638 1685400 1599938 1411496 1085365 890784 809907 662339 808843 873906
17510 873906 975821 978004 891475 703950 609322 585567 587203 599834 677646 600650 607704 579873
17498 579873 477189 331489 283812 269861 322737 455137 555772 513498 464468 320134
17488 320134 285664 121499 106794 181574 264551 438110 547599 480734 450708 381633 554980
17477 554980 574669 443617 372337 308243 426307 411345 444223 398303 384342 343849 333691
17466 333691 571884 507866 421267 338065 392900 352218 387969 384091 299992 398157 473324
17455 473324 434107 371421 301616 271677 217591 265162 306832 558576 875589 1043718 1058879
17444 1058879 1223750 1400251 1299915 1124082 829894 574917 479182 530730 476799 384374
17434 384374 342941 493144 606347 656367 734410 530393 501478 602912 570191 506482 526442
17423 526442 523579 464731 362125 87736 70291 212670 353305 479871 448013 303654
17413 303654 378909 383344 446646 622957 577691 537779 520612 362167 313864 392881 401694
17402 401694 378794 315999 302356 440274 595137 611411 611336 692565 679963 644471 544346
17391 544346 468175 550464 543729 644933 686127 603470 519627 586184 523673 511862 449134
17380 449134 386369 468486 517115 700688 683488 750336 792445 942234 775674 648290 593502
17369 593502 356265 230118 308473 153074 277324 325428 297451 383192 457747 355142
17359 355142 259700 270040 330198 338634 286773 426271 432260 335487 329358 528947 495658 489082
17347 489082 403515 287158 276961 359902 366656 391647 316704 318835 91464 103798 102728 214697
17335 214697 314559 360120 279904 160687 142415 237181 103556 87787 169317 245658 335384
17324 335384 378964 333310 175446 -1894 49357 195240 426446 356636 389336 512923
17314 512923 537392 496774 330015 285839 260490 285850 477397 587361 689165 613466 713042
17303 713042 797696 850979 886375 855506 822628 672205 601956 749448 711147 526526 300688
17292 300688 307145 449026 540199 614245 578518 561573 558872 463056 462063 527948 455639 463693
17280 463693 625122 858365 963707 1023094 902028 714977 815302 1006652 1097678 992277
17270 992277 909040 798810 840142 1044866 1031701 1048740 1346012 1618822 1874422 2106610
17260 2106610 2234318 2363767 2196627 1903904 1616251 1352341 1148982 1072436 960662 962091
17250 962091 1039039 1168958 1057928 1025668 1127929 1181844 1036521 1053097 1158590 1235262
17240 1235262 1279228 1192514 1010448 906688 825535 964355 925925 795963 752408 908274
17230 908274 983233 861483 1014357 1304793 1281484 1273100 1451512 1609259 1496305 1282321
17220 1282321 1215706 1365870 1530702 1947690 2253141 2407796 2501488 2940498 3450414 3969221
17210 3969221 3981136 3892306 3506190 2886954 2305955 2099762 2086456 2021377 1935110 1989929
17200 1989929 2185393 2325922 2263317 2212938 2391448 2307935 2356589 2443735 2589718 2771218
17190 2771218 2764756 2777193 2796169 3043907 3502604 3636745 3916351 4093384 4297873 4661616
17180 4661616 5177399 5671960 6205431 6935951 7668024 8077745 8221601 8522862 9112197
17171 9112197 10103856 10875498 11357940 12296233 13720655 15228730 17030824 18924725 21461356
17162 21461356 24868546 29625690 36260442 45658890 59636439 80081343 107007228 138369733
17154 138369733 172783033 212780043 252699236 267312835 234860847 179601451 135650468
17147 135650468 109797174 97831742 96213427 104184930 121608150 147263179 178402401
17140 178402401 215116707 259781618 302919468 317362931 293586110 263535473 251295490
17133 251295490 258976621 281175916 297098855 275660269 219389295 164570486 128526281
17126 128526281 108697961 100505098 101778723 112096792 130434910 154355814 181359283
17119 181359283 213283129 246805270 260360966 230262656 173305172 123659220 90587208
17112 90587208 69705729 56248608 46811804 40049659 35150793 31342192 28164481 25766622
17104 25766622 24042920 22807737 21838311 20642619 19282877 17825607 16651605 15546009
17096 15546009 14438463 13337473 12416529 11684560 11219951 10785970 10432914 10398227 10115773
17087 10115773 9422357 8600172 8115557 7917864 7521785 7009707 6823086 6495307 6145401
17078 6145401 5957502 5694964 5446917 5266141 5198466 4947700 4743334 4684825 4625515 4385908
17068 4385908 4160069 3931733 3789912 3709570 3765711 3537274 3435473 3465576 3278734 3086844
17058 3086844 2962645 2697167 2558238 2517507 2447511 2474003 2406848 2217470 2318218 2373688
17048 2373688 2269634 2069321 2158342 2143904 2122258 2060134 1892098 1844024 1885459 1667473
17038 1667473 1548124 1728722 1933874 2004331 1998107 2053465 1960697 1798568 1548883 1335530
17028 1335530 1455816 1509986 1672591 1695577 1629825 1554443 1430689 1381350 1277899 1247296
17018 1247296 1395863 1396490 1274831 1136391 1289421 1355499 1334708 1322586 1332859 1203521 944678
17007 944678 957547 1028256 869550 933866 1195654 1195598 970733 909337 775859 701148 713487
16996 713487 720666 743107 683432 814553 816480 828093 779465 677628 571147 582893 709643
16985 709643 693935 636954 600246 374797 425817 405318 457498 465112 335226 348371 512527
16974 512527 704952 580345 457435 658911 681740 660417 665002 528789 419304 393778
16964 393778 460179 343307 195817 190964 85783 54326 172347 332043 218370 157500
16954 157500 235928 309496 352705 253594 287337 323548 244044 222921 348512 386767 218613
16943 218613 -47793 -26738 289721 412874 457206 438716 486743 426427 357786 411015 529943
16932 529943 548721 467533 424401 362563 309421 211261 188974 180348 222420 258939 373707
16921 373707 399570 346642 462291 404964 601783 581958 352313 269180 385391 462430 353886
16910 353886 237405 297625 394808 501452 418827 230536 28842 -3711 189443 261410
16900 261410 93911 72955 196306 293128 507058 429874 280291 256438 282261 410381
16890 410381 401943 185419 57005 154434 313404 384369 282112 264836 353966 499781 547166
16879 547166 456230 296209 115835 152365 121329 84710 71855 -176249 -162720 -68422 -113833
16868 -113833 -123702 -107995 -32156 -16661 62565 95346 97926 39780 -5362 164001 284596
16857 284596 265563 105390 75579 1874 -158192 -116449 -98184 19226 156072 281297
16847 281297 64946 -120031 -23479 126985 233273 243382 135418 140917 246351 348721
16837 348721 210006 21084 -27953 25300 -95351 -103910 -11264 82635 90161 157802 284592
16826 284592 320355 84401 -92475 -24510 -62651 -777 44701 38941 73867 100935 115324
16815 115324 135720 329861 315788 253049 262069 132680 173927 149261 182641 321016 372891
16804 372891 252068 160912 31072 15012 -38051 117678 416968 449951 195940 180588
16794 180588 108258 77233 150852 193250 130254 46580 51803 -95396 -39666 271715 410655
16783 410655 46346 -97857 -102058 42694 201705 231904 113928 8370 51198 76986
16773 76986 182844 92788 -42729 -115790 -99521 190956 302786 255377 109609 -100879
16763 -100879 -35433 98537 92404 48477 59211 -68806 -29380 113929 187620 85067 117016
16752 117016 84733 27015 -11654 -19405 149740 250135 218995 163469 28089 -120255 -134960
16741 -134960 -115350 -77867 -18592 24016 94871 81852 99365 112102 156406 272454 172842
16730 172842 107328 180126 329208 267397 33040 32430 -15445 32761 160657 158335 -6003
16719 -6003 -39612 85290 185089 280159 215307 131046 106974 -34238 -37274 -33267 -1272 -47033
16707 -47033 -63415 59895 177023 86746 120081 179962 25247 -123753 -212519 -146788 -29781
16696 -29781 119204 110645 22243 -127592 -205847 -180030 -151021 -278832 -231259 -190653 -120073
16685 -120073 72536 13724 -170006 -155789 -10008 129720 53283 -22982 132314 78929
16675 78929 165698 101408 -79329 -83894 35145 97104 193349 302594 228437 82554 148335
16664 148335 61107 -72554 -32482 144699 305022 338829 359473 342089 191312 -28204
16654 -28204 -23322 -42553 -40309 -85447 21956 337101 439819 364143 259915 235273 87790
16643 87790 79128 109165 26115 120718 186374 208737 228219 192650 137132 33826 2630 18468
16631 18468 34898 132212 183330 85145 -31428 -330186 -183444 156937 312657 465483
16621 465483 500981 316233 160573 145736 -38701 -104450 -112793 -21758 97265 136189 12413
16610 12413 12276 146914 115986 156544 276366 360252 252967 207398 290082 558910 816046
16599 816046 1172707 1315164 1501868 1459323 1130437 863750 638656 730225 585898 642759
16589 642759 867670 912463 1022710 1200393 1180694 1217050 1232906 1336103 1469441 1517783
16579 1517783 1422863 1526861 1777396 1808610 1518896 1169008 868801 697193 787901 730606
16569 730606 659712 872944 1096189 1201630 1330202 1549376 1710404 1750001 1616806 1133099
16559 1133099 783723 580579 365295 190178 160892 190070 279310 416649 487381 499676
16549 499676 422216 328475 171800 8872 85618 76240 140046 55094 30541 14967 5440
16538 5440 86417 38214 60442 -70678 -65207 1253 -31616 -60952 85657 261723 325936
16527 325936 269252 86446 -40423 -102784 -37252 -100451 50992 -116520 -40234 78053
16517 78053 -1217 -12674 -66882 -12529 -24529 -24081 35237 99326 209695 4108 -72533 -17221
16505 -17221 -33721 -29775 -45485 -71565 -105285 -118775 -75514 100563 347123 510497 573187
16494 573187 354723 180825 66501 -29744 124310 267498 275718 176044 109732 -2803
16484 -2803 94450 217791 207380 132845 52376 -45034 -234543 -239313 -77313 -189549 -246920
16473 -246920 -122415 77940 155585 129130 280211 321293 367804 287668 274986 299128 285166
16462 285166 190514 300115 280973 141639 91757 219725 291091 207303 191709 277332 314138
16451 314138 278167 190119 61971 -26530 -192216 -156667 35219 173031 234241 207112 188747
16440 188747 171276 131237 -7726 -45089 -60269 -1579 235146 361621 144079 173229 282032
16429 282032 267431 267713 83523 108300 44579 -70058 -81546 -221134 -43605 225568 86691
16418 86691 -58493 -121095 -81065 23731 145485 211397 338489 379283 183965 -49316
16408 -49316 -263104 -236550 -87118 -34704 -10079 -135896 -16737 112531 -23536 -84991
16398 -84991 -82012 -52287 -22309 36071 85502 74554 -10339 -232889 -370557 -194825 -11831
16387 -11831 21199 18087 -88112 -198084 -242315 -139101 69598 134584 127900 67006 39759
16376 39759 157735 207675 145490 103465 112749 128832 192374 285298 106255 -205337 -206917
16365 -206917 -58062 72975 198614 13315 -82094 -214548 -223516 -102193 -40576 -107754
16355 -107754 -239482 -303300 -299338 -164450 24521 -14705 -98024 -78529 -164914 -191372 -182001
16344 -182001 14219 131855 15621 35585 38669 -16410 64805 209323 107723 242352
16334 242352 404947 357357 420773 193066 -79670 -202258 -111685 28588 185527 280859
16324 280859 358117 296389 160692 200487 127539 -65436 -185340 -138250 -340763 -342327 -304998
16313 -304998 -187535 -145753 -103365 -50957 -75092 -209426 -79959 156259 318366 188046
16303 188046 46967 135149 253960 297973 335738 355923 409222 320225 290872 286083 188701
16292 188701 96210 55223 -100588 11546 109146 167523 195299 194751 68317 21701 44050
16281 44050 72914 -59315 -50366 -16668 35868 -35716 59254 45397 54945 28328 -131368 -176116
16269 -176116 -43620 42760 205933 166912 154622 177726 25413 87797 250594 112551
16259 112551 31981 -32671 60385 109980 -82348 -280517 -390843 -277211 -237168 -151399 -279815
16248 -279815 -250882 -124333 88555 147409 61537 -132395 -4247 118738 108571 50760
16238 50760 161696 302943 316285 216130 74108 64398 -100994 -61375 48874 64317 111557
16227 111557 79881 4490 11223 118661 24006 33393 -51863 -104090 -158067 -211818 -57724
16216 -57724 132026 181724 90219 -15315 -36466 -48400 -191575 -314637 -168841 -211514 -27773
16205 -27773 -13723 -100680 -171419 -251201 -235242 -250280 -295404 -186057 -197416 -146229 -86054
16194 -86054 -51672 -104431 -11490 140895 91112 44636 -44906 -147453 -59225 56932 -37694
16183 -37694 -136283 -32019 -1887 -61040 39012 72823 -132558 -149797 -132072 -89775 -138705
16172 -138705 -118169 -150294 -210215 -220457 -185519 -161137 -329785 -261318 -39350 -24423 83078
16161 83078 306975 410708 505569 373191 176397 132700 224134 224097 179739 80630 132014
16150 132014 147874 78825 320810 340252 203820 213546 100235 -27106 35175 29 -38276
16139 -38276 129781 131327 103057 48576 224154 266948 264805 124288 116317 157759 49427
16128 49427 -19225 -29421 -89415 -45887 -89694 6262 27713 113926 2020 -131334 -170125
16117 -170125 -160490 -242797 -153667 -15789 -95934 -262745 -262019 -99807 39487 -3808 -66620
16106 -66620 -28955 44445 54559 -30426 -26858 68939 302614 229438 -11270 -127804 -266849
16095 -266849 -81776 59712 -53913 -258538 -376451 -422053 -396869 -416035 -194041 7180
16085 7180 144546 82507 -23992 -102378 -26774 87390 94273 -68950 -13060 28653 -149585
16074 -149585 -261890 -292118 -180013 -211956 -106200 -47077 -63057 -204605 -229675 -189533 -48588
16063 -48588 156993 188924 4103 -31212 -154666 -148703 -160291 -105613 93630 74162 10509
16052 10509 8135 -31039 -115359 -59844 94964 78209 59708 104626 105407 90473 98761 116173
16040 116173 91445 129326 19277 4072 151849 199432 188856 75595 -97999 -250385
16030 -250385 -100689 146792 191566 84400 66293 167016 247049 139519 126645 184521
16020 184521 355961 323986 143127 168136 231495 166811 92198 -93753 -83431 -76822 -21774
16009 -21774 -5830 -154953 -168169 -219470 -213303 -71892 -102902 -253089 -278241 -61400 67695
15998 67695 -13524 -85783 -169887 -94531 -21709 -33390 52875 24514 -65460 -101417 -297905
15987 -297905 -491431 -561793 -552721 -427529 -235918 -254120 -56753 108356 54526 -2135 -152416
15976 -152416 -345749 -265340 -193542 -139433 -182051 -105969 -111120 -56309 -104496 -49903 -118800
15965 -118800 -306431 -240677 69695 160757 -57276 89413 131314 61229 153773 267113
15955 267113 310148 174832 -109279 -233324 -249480 -107502 44812 107907 204050 272688
15945 272688 250327 244864 284505 339885 190240 36597 -86897 -163164 -279579 -222555 34234
15934 34234 103898 160990 58995 31408 211024 152905 287984 435691 313497 361562 354273
15923 354273 191227 43756 34162 47641 132110 101777 -8476 -86960 -192364 -264309 -181956
15912 -181956 -92706 -63487 19384 92441 80149 91463 124290 4932 -22468 76610 259617
15901 259617 130685 -34930 -92448 -58062 -139449 -57858 104641 197671 139228 21903 -59637
15890 -59637 30691 65003 -82351 -189683 -15015 251538 235043 204835 190456 128971 17616
15879 17616 -99082 -181950 -238972 -336838 -340096 -326189 -418724 -354605 -354661 -428668 -365081 -372317
15867 -372317 -321655 -235528 -241208 -151965 59957 106590 59316 -62667 -13573 -150278 -279380
15856 -279380 -244037 -82009 -121941 -241643 -271562 -358490 -155624 -100760 -133119 -122426 11394
15845 11394 147313 200276 179029 153635 191581 9295 -145123 -115185 -171223 -196156 -234859
15834 -234859 -142710 130855 272208 200521 131505 103683 161057 165647 68856 146180 134933
15823 134933 27364 73940 11776 -33283 20889 173834 214863 -105909 -307691 -189201
15813 -189201 -55981 -8687 -20875 -38849 -47875 -9065 -11774 9221 28680 73895 208279
15802 208279 307707 205565 107009 3306 -127677 -46672 114037 89473 125019 10718
15792 10718 -122807 -99549 102392 -90608 -216169 -93140 72268 36752 -24674 31907
15782 31907 64613 -15054 -13633 15023 -6566 -179634 -278424 -95207 181770 158773 -10561
15771 -10561 -227925 -226075 -232508 -200145 -181962 -23796 148922 172929 68151 72976 28940
15760 28940 -102898 -35579 -147761 -274322 -88098 -7381 -22946 -70209 -46036 -60903 -98096
15749 -98096 -235768 -162305 -107640 48569 124250 31542 23704 128146 169537 66165 -52774
15738 -52774 -35213 -129678 -304503 -273878 -134995 2157 59652 79128 -55975 -117401 -38143
15727 -38143 641 -99632 -245680 -348140 -245825 -151802 -166436 -95812 59214 1554 -72644
15716 -72644 -321562 -293439 -112735 866 24830 -49770 58370 87970 135693 94284 -89774
15705 -89774 -156350 -168823 -144125 -164369 -291525 -138525 -33067 -106297 -37175 -50647 -79656
15694 -79656 -105179 -218245 -301183 -107178 54118 -68317 -83 10590 139384 160396 243269
15683 243269 139168 200735 114427 -80358 63940 180120 256712 85395 124329 40993
15673 40993 43327 44598 2669 26074 -33738 13901 -3784 -34330 -41451 2412 190059 110569
15661 110569 -209845 -237900 16815 -8197 -103284 -76596 11394 143172 135208 13330 -67131
15650 -67131 -8956 -17483 -57521 -100378 47547 229572 219638 -38665 29236 136270 43083
15639 43083 -84488 21762 -93616 -87675 24683 102796 -64924 -55225 44744 133782 138132
15628 138132 75909 -73403 -129099 -176026 -221635 -412388 -331072 -211738 -193819 -162379 51800
15617 51800 309541 208094 125084 44174 -44243 -184297 -95548 -119408 -196461 -163998 -27695
15606 -27695 -25815 -221933 -279269 -218518 -119199 -90584 -87651 -15659 -2907 -96885 -210382 -89372
15594 -89372 -103500 -162167 -213597 -120976 52181 94247 -75714 -103229 -20796 28989 7038
15583 7038 188068 304414 223973 184626 161009 128382 174652 58860 69398 -79017 -144696
15572 -144696 -38059 -35982 -33686 48598 -43583 -102405 26131 16419 -16314 -112376 -168720 -191182
15560 -191182 -231994 -217686 -254728 -115078 -58273 -57623 97138 62517 108765 67580 -44931
15549 -44931 -115481 35133 132347 157625 268865 159197 92047 112272 66313 -89774 -146688
15538 -146688 -189112 -43797 111039 198241 169944 -42823 -272415 -252663 -153190 20200
15528 20200 117988 -47015 -286075 -303322 -274591 -276268 -56198 -6660 -74263 59580 138518
15517 138518 23574 91137 26572 -132187 -168580 -256837 -335637 -233953 -52760 14454 74077
15506 74077 -3625 -25424 84121 198731 -86698 -112064 -259229 -476798 -478302 -387574 -382203
15495 -382203 -293952 -240420 -40500 -37820 68185 204917 87152 -5266 -11577 131760 172070
15484 172070 61426 -5960 112327 106518 26901 -65146 -209025 -232918 -288125 -253104 -185373
15473 -185373 -44259 14151 -111389 -54952 27327 -14433 49919 94438 -39557 -14619 -116690
15462 -116690 -181113 -104696 68601 103587 -29759 -91033 -103153 37355 5335 -22956 -49945
15451 -49945 -257340 -146097 76157 -46986 -55017 147325 244049 143720 16008 -19634
15441 -19634 45606 25199 -30972 -24163 208724 213019 -62294 -113945 -64915 -141826 -136994 -148305
15429 -148305 -132975 -56794 -94145 -102095 -59 220900 272770 77297 -64335 -42912 -16982
15418 -16982 161789 415912 305720 104096 52725 47896 129472 113831 115534 237970 216189
15407 216189 -6201 -147864 -74610 133952 99503 57233 182221 255110 -47270 -167207
15397 -167207 -127308 -273443 -187638 66154 145713 -70815 -163479 -31368 152313 127954
15387 127954 11408 34301 -37782 -53607 -112920 -148136 -124967 -20956 -121995 -164181 -157486
15376 -157486 -7313 155855 144582 1381 -112539 101110 74257 57063 104813 126317
15366 126317 27974 -5558 -74402 -85387 -106185 -87503 -52569 21356 198380 337323 235505
15355 235505 126470 78654 147169 204671 244142 288257 335272 172863 189629 226381 186357
15344 186357 112743 43991 -26372 -58011 -10384 6284 -148579 -145981 -64650 -35620 -51266
15333 -51266 -115660 -192927 -156775 -18236 -115292 -170279 -221658 -132993 -130549 -207050 -131689 27818
15321 27818 23422 -194648 -196968 -206507 -95827 109628 44763 16768 27714 30117 72120 -116409
15309 -116409 -280449 -167820 -5296 53958 13971 -42190 -30645 -32141 54359 24124 -165184
15298 -165184 -234071 -44512 18445 -222961 -214224 -48146 38581 -87973 -220702 -241079 -161543
15287 -161543 11408 -22931 -95266 -143861 -114255 -43195 -127117 -140301 -126566 -197007 -264503
15276 -264503 -159211 -134603 9884 6523 -152999 -345498 -398387 -142475 -39559 -77408
15266 -77408 -115365 -94450 98340 108311 15881 102631 128679 98636 146826 -9627 49667
15255 49667 79788 -72841 -252106 -194153 -114810 -153684 -148964 -56121 70337 103574 -7369
15244 -7369 -9610 5777 33486 70197 209947 61108 43942 219886 65619 -166113 -269180
15233 -269180 -121101 -5642 3584 -89720 -184484 -192095 -138372 22449 73653 192966 153187
15222 153187 5487 -11852 -111204 -209330 -171041 -780 187692 175587 191583 366887 320122
15211 320122 171150 84013 47552 -77484 -250375 -329551 -332732 -218277 -77620 -104234 -62817
15200 -62817 33632 124922 190767 37900 119823 78760 80431 166652 74113 -826 -123874
15189 -123874 -186127 -157685 -84184 -100651 -40447 65988 -15648 -82305 -71633 -142978 -210681
15178 -210681 -114940 -29103 1524 11337 -24114 63759 110464 111961 94023 3093 54938 296
15166 296 -56158 139512 144675 131561 36124 -96 24876 -39557 -53007 53164 105096 31851
15154 31851 5124 8900 -11632 107411 172529 104180 147857 149897 103263 -6233 -168896
15143 -168896 -219987 -110058 -67080 -123973 -824 48866 69307 42785 -33914 -176053 -192587
15132 -192587 -95931 -111428 -5967 102416 102965 25375 169513 268459 233634 61443 45644
15121 45644 59937 84582 -1664 141964 315058 189159 83148 -134629 -200364 -254325 -187273
15110 -187273 -25527 -2439 88120 78917 81919 126066 -5548 -72283 -35829 61567 -119244
15099 -119244 -305991 -230748 -128988 -84000 -61357 26911 -19202 -51849 -52570 -25126 -251673
15088 -251673 -351502 -154808 -39151 171175 240999 200275 93105 49680 83827 138367 223152
15077 223152 206806 126996 130498 154987 236427 121744 30706 -16331 -184228 -78959 63086
15066 63086 -95579 -268896 -211933 -8372 102758 72426 119290 201001 143496 81988 -54553
15055 -54553 -185219 -50534 -152439 -269005 151694 299966 57017 -7291 117783 172169
15045 172169 67149 46640 248137 292697 6615 -149386 -193361 -282293 -350680 -236735
15035 -236735 -165230 -60465 -85451 -169496 -86853 98861 112166 12377 -169244 -230910 -140343
15024 -140343 -141099 82176 116205 -34392 -62246 -197483 -93589 -84373 75648 14858 -11764
15013 -11764 101821 9740 -93779 8791 152146 81355 22537 -181702 -264517 -176978 -69908
15002 -69908 -104951 -45578 -53657 -85413 19410 86274 52262 95424 32439 -1904 -111487
14991 -111487 -143709 -72442 -115034 -303425 -374236 -251461 -170946 -145087 -118358 -150621 -88686
14980 -88686 15514 120505 110160 5103 -111936 -75561 -32464 -9436 -18388 -7176 43839
14969 43839 54265 96756 153765 158363 -18296 -73582 -139077 -107104 -103223 -210438 -240801 -127766
14957 -127766 67450 108004 -50362 -22007 130727 222261 124053 -58038 -14238 54189 -50207
14946 -50207 -62592 90062 216409 229972 144639 96510 111917 97352 77159 -38238 -149630
14935 -149630 -262443 -368609 -463558 -336236 -269922 -89752 -105995 -199982 -52810 -46259 -171180
14924 -171180 -247051 -207898 -111025 17624 95213 106227 152319 181245 99253 91737 -89026
14913 -89026 -90606 37381 -120184 -63464 -119475 -184246 -265318 -296948 -85017 -111108 -177603
14902 -177603 -141461 -93935 70041 229715 118443 221454 361870 385844 220009 64444
14892 64444 54397 32128 -10927 -128821 -308111 -235899 -64334 6334 76346 120906 182915
14881 182915 184013 80601 -31626 -95538 -260456 -169173 -92206 -106288 -66738 65961 69746
14870 69746 40177 113230 98522 109846 3150 -61758 3291 30864 62915 131205 161837
14859 161837 -23744 -254087 -329424 -152830 -156020 -285556 -396459 -217962 -129650 -67782
14849 -67782 -21940 -120968 -38934 8664 21196 99819 153662 157614 197766 133188 53570 -73045
14837 -73045 -322453 -213432 -116444 37092 162526 78002 -58699 17360 -31890 -104021 -49165
14826 -49165 162318 109336 171909 234220 289704 207744 215423 220767 201073 135640 10788 68272
14814 68272 194599 119702 119298 227838 146043 653 -82073 -103185 -35183 -27120 107151
14803 107151 155220 -23999 -201816 -262519 -191216 -45575 -96939 -44805 80752 151318 86856
14792 86856 108650 117946 237492 70995 -48723 -1768 121179 130927 -84730 -93226 -2946
14781 -2946 -172943 -186812 -157052 -163943 -281297 -311605 -114975 -23560 -139258 -268107 -27373
14770 -27373 188831 -24260 -170746 -255217 -81277 4765 -12777 3642 -91549 -274420 -236226
14759 -236226 -228772 36255 43122 -108966 -226202 -246880 -265176 -104157 3820 -26482 -197329
14748 -197329 -149504 -30352 5551 26448 -160738 -209316 -148975 5256 130673 -25181
14738 -25181 -86149 -132976 -199427 -223113 -97073 -169214 -274511 -119197 -313635 -419690 -304857
14727 -304857 -42171 -40068 -68042 12845 10284 108106 33953 77869 68843 51146 68506 153934
14715 153934 185402 168589 -113150 -115577 -68249 66610 56413 -31824 -139518 -319921 -403980
14704 -403980 -237584 5676 -31398 8502 13422 -71632 107763 61617 38160 95861 123913
14693 123913 99943 -116898 -39290 13480 -40682 -208742 -111504 -14854 -55777 -86114 -17190
14682 -17190 -85505 -49743 70574 157828 -71785 -13879 26212 128299 227552 58668 -173896
14671 -173896 -416260 -513384 -464800 -223073 -137962 -138729 20889 -43003 58217 -123739 -1384
14660 -1384 171889 217415 290130 102554 85672 184745 218485 239831 75883 -41319 178030
14649 178030 290845 276982 343090 395609 291513 185860 -64033 -106401 79902 106352
14639 106352 -23039 -165980 -195178 -94347 75512 56876 -93644 -168498 -245891 -217524
14629 -217524 -217985 -134448 -110923 -203319 -214957 -194062 -283056 -346463 -260407 -26665 41374 73086
14617 73086 21435 -82721 -64821 -112795 -117728 39078 64226 39588 39544 208685 149235 83562
14605 83562 121882 44363 -4384 124311 155860 114481 229817 171762 31073 -132230 -210807
14594 -210807 -142621 -173520 -268722 -210489 -70036 -52477 -3243 -17405 -27164 -124291 -146346
14583 -146346 -54355 49815 69977 77127 77089 105106 37014 216788 483717 632905 440484
14572 440484 339901 305000 178481 208712 286678 290453 149476 2484 46105 241709 257554
14561 257554 309646 262281 70717 -40380 52679 48687 -8437 -85148 -212210 -159282 -15998
14550 -15998 -58350 -55902 623 -181624 -253613 -116433 -49086 27235 -80548 -175798 -195416
14539 -195416 -107380 -124600 -206705 -111832 -183231 -215021 -234503 -62286 -90140 -157309 53554
14528 53554 153740 140345 -73802 -239945 -125840 -88517 -156402 74168 29717 -134691
14518 -134691 -77900 -131909 -215903 -273627 -135337 -124263 -185627 -216864 -256046 -183785 -316051
14507 -316051 -455182 -493526 -289921 -179878 -161117 -103635 -80733 -132593 45495 -33518 -15136
14496 -15136 79781 -90891 -158192 -229425 -199955 -278531 -324576 -382515 -385340 -388467 -299953 -74392
14484 -74392 55821 106897 137188 168577 192088 44184 -81505 -34461 -56930 -77533 -46202
14473 -46202 -72335 -158362 -195977 -111116 -11374 159034 150953 49944 13151 -61821 -20042
14462 -20042 -32147 -210816 -253056 -54551 -2147 -43504 17712 27838 126480 10093 -18367
14451 -18367 -35029 18885 96766 170078 7557 -68440 -100614 11762 111244 -35166 -143321
14440 -143321 -24387 3857 -75768 -190248 -208019 -114674 -137687 -66154 -109273 -32886 -38413
14429 -38413 52600 -84694 -106599 -29946 -337751 -452342 -466621 -399588 -232369 -145968 -106836
14418 -106836 -92732 51723 26388 73603 122889 42353 -11042 92572 137310 7716 -108287
14407 -108287 -155209 -251276 -252560 -128675 -203939 -84825 -64954 -44279 46435 51538 38346
14396 38346 100675 51238 158208 170393 157549 168046 29732 -85945 -40144 5568 430
14385 430 -16839 128076 712 -222233 -189370 -46733 -72457 2296 95608 340347 379758
14374 379758 160529 102359 76717 44277 63535 332802 252522 89296 -51783 -240588
14364 -240588 -154668 -50927 45566 20591 188817 156571 219143 227513 100966 -50009 -111150
14353 -111150 63609 219319 224768 221457 303388 297869 236915 290244 205755 234213 132563
14342 132563 122759 119244 111598 54346 77066 91637 33780 -36038 -48296 -64480 17911 52976
14330 52976 85355 -7205 -164562 -255570 -120848 -86907 6422 188206 23491 -164828 -92291
14319 -92291 21390 -124160 -231449 -41799 -7994 -129693 -81246 35917 -15851 24397
14309 24397 144247 98468 29401 -34659 -97747 60964 128406 188428 272697 9870 -69998
14298 -69998 -6486 -135320 -118366 116677 118714 89412 47468 3000 -2534 61432 124144 134598
14286 134598 95538 26203 19693 -19553 -66140 -120112 -86394 -35 -61514 -88003 -116031 -133503
14274 -133503 -56436 -48715 -117999 -13957 -29743 -101649 -182033 -307621 -256182 -75504 -67989
14263 -67989 -14868 28370 -123548 -211994 -31100 5660 38414 72419 -45116 -103616 86103
14252 86103 156823 134463 181502 150928 58193 -148058 -198617 -101163 -29457 73684 -100069
14241 -100069 -250583 -303654 -205205 74753 110113 106936 142692 235 -243469 -130319 -119087
14230 -119087 -87196 40422 -24957 -136521 -22324 92171 122362 80393 -55243 -69348
14220 -69348 22807 -33421 -24860 -74870 -119594 -130521 -102940 -235003 -249472 -80199 20233
14209 20233 86517 212513 185809 4570 -114005 -97197 -88320 -167473 -188640 -221734 -249138
14198 -249138 -139941 -201999 -409013 -314235 -97745 -130500 -66022 124684 179369 261993 344126
14187 344126 127241 24052 33289 852 -14112 -168810 -105772 -103436 -49897 -23495 -122842
14176 -122842 -78920 -21572 -80872 -116734 -127100 -103270 -251814 -112216 25876 73855 6332
14165 6332 -165901 -253867 -69048 20297 -93905 -13545 29069 157148 113023 148833 90304
14154 90304 263703 228423 60414 23564 64244 249049 289075 178592 -132 -47216 42367
14143 42367 71450 -28816 -35012 -70643 -26940 122233 211870 230193 220384 113583 76334
14132 76334 12878 54560 -19145 -162121 -22068 75692 147717 136535 104350 171951 18816
14121 18816 -56608 -22814 -26265 -11427 22754 -28496 -162724 -43277 15626 -35570 -194896
14110 -194896 -162013 -332289 -326640 -197955 -194908 -204778 -189164 -85773 147629 308692 327767
14099 327767 197479 110588 54449 -25202 -96606 -269507 -224924 -110505 -8828 -167625
14089 -167625 -251093 -120350 -124097 7102 19682 -174514 -263191 -57691 53231 3661 -157025
14078 -157025 -281200 -292490 -184702 -79701 -29723 85544 245351 268351 260427 71692
14068 71692 -119765 -216933 -357937 -268316 -45892 -104053 -73515 12455 -54170 -302339 -348305
14057 -348305 -170069 -124317 49690 72005 16651 -119819 -97682 -16038 136126 340766
14047 340766 416471 259296 84137 89577 157646 12328 -29745 43600 -19494 54069 144606
14036 144606 182632 179321 274581 292372 365498 295997 163987 133461 159251 124149 74146
14025 74146 -86197 -15382 45343 -101332 -50562 -3949 -103494 -113908 -83468 -50656 -72597
14014 -72597 -220701 -203729 -165495 -116320 -198096 -190745 -210764 -183883 -48381 94268 205193
14003 205193 73980 -142433 -236820 -255189 -182654 -107908 -84789 34870 -121474 -169088 -87546
13992 -87546 -90354 24483 -42117 -251403 -128103 123779 93918 75782 113742 41639 13280
13981 13280 30366 -53898 -71329 56239 105162 -94376 -111140 -338814 -367867 -315575 -251001
13970 -251001 -202580 -176751 -89214 -164515 -159883 -149301 -220232 -161763 -131811 -165601 -115011 -95032
13958 -95032 -255503 -138117 -94047 -63376 -15900 85733 -40024 -158290 -55342 -49666 8375
13947 8375 57888 -143857 -235056 -186813 -90741 -75337 -48303 -64504 -56159 -22716 18157 -34515
13935 -34515 -107523 -37769 63589 20190 57910 39636 -38175 -166488 -171582 -161369 60920
13924 60920 112340 15392 -38674 19060 22313 -140838 -52512 -102847 -45636 165416 34828
13913 34828 -10279 141716 55563 49141 137753 77913 -73031 -155528 -217313 -121869 -28092
13902 -28092 36403 38583 -74050 -62672 -158803 -226642 -341310 -384275 -255227 -369789 -476339
13891 -476339 -322286 -263919 -277394 -171829 17411 81820 -39806 -63797 81327 174913
13881 174913 47395 -62130 24206 114723 55686 -130237 -209957 -151763 13679 -138291
13871 -138291 -119493 -155831 21007 69827 -32716 99550 38295 -101230 -117028 -9163
13861 -9163 -93103 -119287 -160192 -417558 -433775 -368765 -376027 -278861 -154356 -98143 -55540 170174
13849 170174 243761 345852 111955 -143861 -168729 -176992 -210134 -247115 -249777 -59535 -133123
13838 -133123 -134563 66135 98909 -17655 8307 85456 346227 229743 -45616 -58516 61153
13827 61153 34315 -88557 -88582 -78812 -202568 -169445 -46396 115296 -12855 -122315 -51063
13816 -51063 -116826 -57613 21239 -159836 -132446 -107596 -312029 -316006 -282924 -344770 -327840
13805 -327840 -322085 -371054 -330864 -204957 -62436 -33407 -65219 128398 147402 161042 102318
13794 102318 45902 -213364 -254128 -251928 -276884 -191146 -131446 -6737 142343 350941 244090
13783 244090 129388 -28670 62429 167278 117475 233099 146180 82662 -3886 56867 110378
13772 110378 99282 -7917 -125499 -145583 -117010 -111340 -193062 -179778 -162840 -177569 -80689
13761 -80689 14602 221147 165756 116426 113419 93018 107371 140541 -83999 -10465 139640
13750 139640 247577 70342 19293 15873 -23416 -39661 74689 275723 215568 154232 45107
13739 45107 -77690 -53372 206392 250986 -50 -96702 -82604 -79070 -193572 -93233 -225691
13728 -225691 -95207 18622 -108030 -113993 -65230 -144665 -226995 -356398 -426003 -309285 -271175
13717 -271175 -220424 -276471 -283297 -254985 -319680 -318997 -172176 10558 -30064 293 -23841 61124
13705 61124 -8845 88510 92413 78756 153028 267422 186044 69462 5235 -33174 1781
13694 1781 -75776 -82058 -264802 -268681 -182731 8591 73776 132630 248271 301048 32694
13683 32694 -256348 -305735 -312218 -272627 -251091 -48874 -128136 -132517 -270138 -138634 -42476
13672 -42476 -12904 -187764 -61247 -40880 -103625 -93775 -44532 34813 -66604 -138439 -57238
13661 -57238 88730 90942 82574 132379 111823 -50696 -152881 -264969 -293555 -395491 -202048
13650 -202048 -74080 -92994 -61554 -151087 -217056 -112852 -42964 59767 -88517 -211952
13640 -211952 -381711 -217170 -177159 -118897 -54333 -84692 41890 295686 103913 -59675
13630 -59675 -39095 -185133 -185491 -161075 -144315 -98084 -177587 -318958 -281319 -306261 -295984 -368790
13618 -368790 -234690 -19199 76082 193631 172291 -163400 -323759 -450686 -428866 -69244
13608 -69244 315629 327280 252001 208920 44171 -315935 -358924 -236848 -100027 37852
13598 37852 -40807 -163389 -136276 -110474 -160508 -142018 -127183 -8175 77098 183003 219800
13587 219800 135022 124953 42247 -40062 -60911 50397 52688 5637 104978 -1558 -41354
13576 -41354 -108056 -145454 -165299 -138060 -192752 -171956 -136352 -157968 -44646 -64478 -44059
13565 -44059 -6083 -124514 -53472 -146592 -281906 -213321 -280266 -344562 -244858 -60204 -71222
13554 -71222 -79025 59314 -75391 -203887 -311356 -438123 -466923 -255459 -186368 -85673
13544 -85673 29054 63164 -27667 -128812 -167062 -68691 24471 -39973 32645 71199 61137
13533 61137 -38321 -4549 47453 229403 117899 -24330 -166808 -288377 -153323 -117139
13523 -117139 -38653 -88051 -48802 -68722 -174370 -181656 -142916 3405 89 49202 -28981
13512 -28981 -123760 -219468 -239608 -223085 -217709 -132144 -85974 -167104 -245714 -109939 -68990 -174739
13500 -174739 -141928 -80656 -76317 -97748 -91337 -87725 -134306 -122545 26558 221392 273028 384458
13488 384458 353299 244035 52752 -80518 -86290 -157190 -142427 5562 41381 18595 253616
13477 253616 210844 -9742 -92249 -262490 -216997 8043 21510 -4306 -10133 172831 285563
13466 285563 55451 -54438 -106136 -142460 -36930 35997 96800 98092 -37451 -141711 -120850
13455 -120850 -154531 -163960 -42928 83553 192222 64662 -5640 -5521 60368 22860 44049
13444 44049 22442 35835 106150 68804 19614 142475 245168 179603 123073 1961 -30526
13433 -30526 -67820 -25532 -152909 -287826 -137235 11343 107853 53088 -138825 -282936
13423 -282936 -303021 -380700 -172952 -68421 -192052 -349256 -396427 -221612 -125723 -264132
13413 -264132 -315354 -321296 -131891 100780 185793 107671 146928 57141 59341 105406 161028
13402 161028 -27418 -191394 -130448 90490 380982 455287 325559 177420 93131 -9628
13392 -9628 28241 18491 -78357 171631 139690 125198 136048 238881 242723 128169 157278 267229
13380 267229 217051 48688 67146 73951 110935 87656 56181 -98233 -82177 -190615 -151116
13369 -151116 48100 230017 250810 267637 29478 -88730 44713 58351 111871 220692
13359 220692 115711 -45520 -107497 45448 218640 178443 -109924 -295470 -363573 -261419
13349 -261419 -71732 49403 124185 233330 313281 181741 93022 127870 34051 -224447
13339 -224447 -218912 -76405 -168735 -299769 -305052 -218349 -25912 1616 -123413 -9661 -130429
13328 -130429 -279926 -219160 -278103 -363047 -297623 -164457 -85491 8776 -75510 -80280 -33880
13317 -33880 -94783 -171601 -187992 -217552 -142984 -83211 -78169 -136265 -192390 -205011 -5936 82441
13305 82441 -110975 -82830 -16562 92202 89007 -73025 -104117 37899 56313 27970 -94042
13294 -94042 -46671 -58424 44557 -112422 -125604 -7004 155660 137164 93194 114657 86136
13283 86136 -62731 -63153 98027 134694 -77551 -19882 127426 72352 -94308 -145694 -95747
13272 -95747 -24708 25069 143024 115582 92293 -29566 -101558 -195448 -212996 -156723 -69960
13261 -69960 127555 132432 -9957 -70493 17918 64599 110028 120390 78733 169581 273657
13250 273657 389756 350217 114449 -61682 -114256 -276343 -250661 -194837 -269578 -112475
13240 -112475 71394 -61594 -261604 -240580 -159694 -96920 -65924 58483 140401 273357
13230 273357 173034 85466 -51700 -50492 -44257 123953 102750 62555 -27600 -122907 -49707
13219 -49707 -27953 -85294 -48638 15628 979 -126206 -118065 -56043 -57797 -252196 -158731 -173164
13207 -173164 -190670 55322 209714 201998 175200 150805 97898 28173 -192387 -361399 -145813
13196 -145813 150522 71535 -68422 24564 147369 162457 -44190 -122060 -85483 -56916 -139888
13185 -139888 -194121 -219419 -24236 1197 -77743 -141919 -101724 -2207 139417 107808 21289
13174 21289 16724 14241 131217 78495 -106192 -103811 70870 -83529 -154530 -81530 -212364
13163 -212364 -265361 -108597 -44127 -42987 -191665 -166764 8972 -12593 -98523 -118244 7877
13152 7877 178960 60332 -9621 -164895 -246812 -179349 -94834 -16406 -170788 -285289 -370733
13141 -370733 -221596 -94020 -74561 -85239 -94449 33031 23475 -24466 -167866 -40413 -5082
13130 -5082 21555 63228 1097 168464 98367 -51968 -130351 -128983 -476 113446 47764
13119 47764 108600 78533 22323 70969 56912 -89206 -256952 -306464 -332379 -283659 -210664
13108 -210664 -166674 -186044 -42168 -8918 -16874 3749 -23139 -184817 -325594 -206908 -88366
13097 -88366 -178172 -119270 128396 197421 68457 -42691 28769 85378 -3675 -104191 -21810
13086 -21810 105453 81646 96919 65902 145822 246870 171980 157753 16737 -132050 26143
13075 26143 43993 64237 73801 73067 98372 138127 135684 152875 272082 137880 -45310 4395
13063 4395 31964 46832 -77731 -173935 -126844 -51782 -116629 -160964 -177674 -206857 -179696 -226020
13051 -226020 -125698 59559 4720 -58161 24783 133548 178624 264934 134108 -18851
13041 -18851 -1387 -166548 -156757 -147281 -283590 -264671 -140607 -126847 -119293 -153540 -136930 15362
13029 15362 -11501 -77231 -73280 -160575 -296115 -395246 -467928 -416713 -273962 -227098 -133656
13018 -133656 -130121 -152751 -130229 -60436 -53746 -98567 -100270 -146995 -334349 -293320 -144069 -170742
13006 -170742 -139774 76108 232153 295418 120281 59820 -57175 -66829 8012 -63639 -82305
12995 -82305 -86153 -205779 -143888 -103108 -318458 -396657 -196891 -721 -116684 -99039 -17961
12984 -17961 27943 -1826 31117 -61195 -118771 51513 11328 -72483 -99971 -61133 -85244
12973 -85244 -113120 10541 -49933 -236138 -117287 -65654 -164132 -184281 -157004 -151636 -124815
12962 -124815 -318420 -298017 -394886 -482475 -335903 -124648 -35939 18484 64488 182136 265965
12951 265965 135758 96066 -132103 -441632 -405991 -265617 -125428 -7465 -109333 -322952
12941 -322952 -288081 -192107 -176346 -112096 -127439 -148361 -135773 -215124 -238033 -155189 6197
12930 6197 62701 227450 282628 249260 73698 43925 -143575 -142743 -4129 -26150 58216
12919 58216 122306 299418 217659 70927 -71992 -34959 159425 221547 128945 -109911 -247691
12908 -247691 -81568 -33736 63392 -70162 -263019 -212679 -25471 -63723 -154160 -97937 60972
12897 60972 116484 83525 -19740 97240 281829 185460 112154 -81172 30175 42788 74176
12886 74176 51079 -126944 -218394 -248686 -202452 -96819 -131101 -91655 -72742 -100934 -86260
12875 -86260 -48090 78513 53383 -66459 -20185 -29987 84888 74495 115839 33029 20247
12864 20247 1179 63282 -17609 -78064 -14212 51441 23862 148612 87691 16838 14919 -96843
12852 -96843 -256316 -121064 119174 122486 7785 175085 164183 -31853 -168133 -204219
12842 -204219 -192455 31742 323763 344573 308616 273291 79551 -23761 -96019 -256314
12832 -256314 -258372 -273137 -294647 -195159 -54732 520 58257 269017 293714 95027 139289
12821 139289 74850 -49035 -239816 -232634 -194034 -200800 -89192 73923 314097 268382 113680
12810 113680 83822 61530 -98534 -356750 -325222 -27661 477 231666 230860 187540 -6295
12799 -6295 -17792 71454 -103329 -197307 -109786 -189910 -36922 8011 71482 -16152 -17693 11262
12787 11262 -78216 -84913 -130655 -71427 -73068 -198110 -310205 -322833 -347111 -347774 -233713 -17874
12775 -17874 42210 40044 -45134 -104987 5843 149828 343359 339633 154676 -37231 -109630
12764 -109630 32267 131200 63050 146344 188354 204757 161309 33970 -18359 -127818 -25019
12753 -25019 -53484 -34766 -89023 5415 -35992 -218220 -264822 -162527 -149723 -32020 202941
12742 202941 158098 -21215 -39943 -26336 6647 74205 -3391 -123851 -34090 26155 -14651
12731 -14651 -103819 -67894 -174386 -81178 -41499 -123733 -69591 28471 -83336 -157990 -301954
12720 -301954 -330244 -185866 -237026 -273864 -169022 4852 120831 -4805 -138877 -271102
12710 -271102 -194577 -24772 308153 503806 575291 361214 228970 93751 -37442 -276402
12700 -276402 -400288 -382038 -318313 -182582 -218094 -14244 87115 5955 66738 145045 -53097
12689 -53097 -103023 -258331 -301557 -173298 -190519 -143047 -14424 -6200 -99600 -109378 -132558
12678 -132558 -296865 -305056 -298335 -290195 -115983 79329 120818 -47236 -32029 69587 77316
12667 77316 83371 23810 -50218 -53327 -20042 -66958 -3580 26086 194710 219597 29305 -134782
12655 -134782 -151330 -114955 -21137 -20007 -158239 -270016 -188608 56911 27734 -9883 -120518
12644 -120518 -116879 -94316 -122203 -96897 -72640 -225374 -259685 -163583 -110571 -104815 -106535 33193
12632 33193 19003 -55786 -106217 -207612 -248794 -89501 -22194 -4876 -163966 -143868 167423
12621 167423 197262 57319 -4936 184431 170447 169636 196347 211970 173789 20844 -25907
12610 -25907 -111628 -162863 -230585 -385897 -341039 -97416 78954 247738 195144 81064 -178643
12599 -178643 -304458 -276390 -84039 -125405 -106191 100045 134552 175820 162265 -141776 -216193
12588 -216193 -123846 -191436 -259758 -60852 111498 144497 -4744 9850 208386 294972 276429
12577 276429 268268 150298 -128773 -229893 -131812 -230011 -270587 -354660 -202089 -43869 47506
12566 47506 90172 -190974 -252155 -25383 197474 170259 62527 145296 154106 154956 158518 96672
12554 96672 39366 -17644 -26101 41009 -72618 -33146 -187963 -400009 -360315 -75498 3875
12543 3875 -31154 -123876 -108664 -69977 50955 52305 -50940 -115105 -45740 -18335 -125764
12532 -125764 -73845 78225 -14325 -50373 60409 181970 80236 -120021 -41355 -52350
12522 -52350 -152025 -191037 -169319 -158675 -6417 -539 -179348 -112445 -64948 -87201 -94349 19404
12510 19404 -46825 -51718 60744 71957 58133 -116051 -171589 -137476 36151 113541 120460
12499 120460 118921 135425 23802 -62537 -304733 -251578 -255848 -251430 -250086 -133834 -114027 -193236
12487 -193236 -346010 -494770 -369414 -185235 -252162 -192567 -107443 9645 53629 83242
12477 83242 67036 -8217 112033 180161 35806 -69737 -106721 -88861 -50584 86850 77784
12466 77784 104489 106394 17576 -14620 35838 111369 44877 22597 -54461 -72195 -5045 155246
12454 155246 105690 -24888 -121300 -148841 69274 118530 173073 165223 76259 -44858 -35558
12443 -35558 -50175 -53332 -14459 133382 290174 244582 186048 162874 259532 310481 248941
12432 248941 166730 52442 -15794 60690 188164 184950 -46837 75266 150882 70130 -17804
12421 -17804 -35380 155748 359147 204901 -18217 47880 65696 70727 -20056 163526 227468
12410 227468 261242 227610 198859 267770 393720 190817 -12925 186053 161451 134483 111922
12399 111922 60957 91022 58513 -49094 -16562 117375 96068 -19317 -25065 -4675 11760
12388 11760 63050 192561 246279 113095 63328 39075 -18845 57294 138429 20362 217728
12377 217728 214891 200751 171770 77004 13175 123038 58659 -128262 -205380 -257356 -158049
12366 -158049 -85334 -57001 -107065 21431 53721 146082 302289 289555 212993 345118 360769
12355 360769 210157 263108 224461 194712 241040 233625 248516 183165 202506 195376 150085 -105949
12343 -105949 -366579 -339775 -233574 -132887 -180435 -217139 -201910 45178 195528 216946
12333 216946 199172 238410 293987 102075 -97313 -21294 143720 132753 150715 234638 180546
12322 180546 69264 103392 83528 55440 202827 108989 -8409 170391 227514 241204 27262
12311 27262 -22486 15942 -71633 -244224 -229646 -82088 -152131 -128783 -14536 194588 273925
12300 273925 163690 99612 79122 101792 65428 -5946 32563 86065 178114 34485 -48926
12289 -48926 7692 107840 77955 32935 -37717 -9405 -24011 -11419 60421 59816 26606 44984
12277 44984 97456 127030 91367 75542 -7839 -110258 -48145 3921 37425 -15270 -110465
12266 -110465 376 -6319 47785 37984 13285 -61416 -52388 163330 317600 378044 354941
12255 354941 253642 223726 179807 227223 -34789 -153304 -200792 -263619 -215987 -209178 -338421
12244 -338421 -415324 -385625 -257151 -223608 -240755 -140323 -61557 19192 -24294 50417 69536
12233 69536 -67205 -168013 -144432 -95980 -154067 -40807 88317 -14752 17182 45022 161163
12222 161163 162191 241318 158779 46793 -67399 -14237 -75450 -93208 -132445 -203125 -229891
12211 -229891 -73417 31119 172005 335762 342729 207190 87670 3917 -135254 -210661
12201 -210661 -75567 53393 138334 249078 406137 136652 -45886 -169890 -157810 41730
12191 41730 36746 -19273 -85092 -113887 -76361 -213128 -210318 -3372 19759 -88363 -57424
12180 -57424 -33027 -133980 -194460 -139789 -42231 -53427 -25753 60010 27733 86333 310136
12169 310136 231717 174526 138575 29977 -101868 -137958 -180699 -106206 22962 -89204 -188383
12158 -188383 -231103 -109699 -104085 -141453 -93120 -65499 -107656 -76557 -39173 -45819 87599
12147 87599 225433 242405 272166 -5747 -288352 -138479 127016 108508 -186708 -187634 -38117
12136 -38117 -67099 -145124 -222195 -227455 -117720 -132729 -27900 207678 161154 -84994 -182100
12125 -182100 -109699 -95155 -160353 -193749 -85815 38950 139124 203233 174204 77179 -114015
12114 -114015 -209927 -228975 -201744 -234776 -124663 -27506 38257 159772 231288 168448 -156778
12103 -156778 -275868 -249869 -420189 -386091 -241638 -69425 -123131 -99799 -127060 -189769 -72749
12092 -72749 -7457 -32963 -160228 -428108 -372190 -292252 -185168 39055 12858 -14886 59294
12081 59294 154115 103494 -40048 -156783 -53222 11069 100282 198483 239432 113389 2182
12070 2182 124051 137234 245393 218164 193157 18209 -5313 123381 358240 273647 99075
12059 99075 11202 -33072 52816 67917 -75019 -59820 -58553 -98309 21263 -20177 -46295
12048 -46295 -8924 -40375 -74057 19268 -18586 -92037 -93258 -65943 -128163 -127206 -79923 -49445
12036 -49445 105786 68724 27034 -94560 -299881 -294093 -163920 -20696 -9099 -51862 985
12025 985 -68499 -172654 -200285 -88380 48601 82114 124870 295841 215063 185717 125706
12014 125706 -30184 -32747 16311 68683 55805 -52317 -71212 31996 49213 -5705 -10567
12003 -10567 -135814 -96102 -40390 -91550 -105926 -241840 -248235 -107860 -30714 -35553 -65942
11992 -65942 82287 90719 51269 26221 -136917 -297263 -379221 -372816 -268475 -220983 -104747
11981 -104747 20417 -37045 73653 222998 105929 268634 348664 164286 51152 -6011
11971 -6011 -139217 -216899 -103208 -23487 -198615 -366440 -263894 -181547 -114353 -152558 -141895
11960 -141895 -182363 -98798 -91683 -112492 5281 -186425 -383300 -266397 -99582 -48777 -152206
11949 -152206 -15060 38209 -45955 -169773 -218961 -126986 182517 24289 -51420 48976
11939 48976 40960 -40886 -196801 -304454 -248736 8203 -85360 -91702 -47666 96133 86941
11928 86941 99828 -20792 -109192 -24525 -143419 -104563 148297 155100 68522 202653 97682
11917 97682 12777 21544 24155 -104598 -108284 -189948 -228688 -209699 -172363 -140104 -121427 -1250
11905 -1250 55773 228679 150867 142647 229979 86246 -31722 -63352 2806 -22402 -170236
11894 -170236 -155538 -77454 -89155 -217602 -239022 -33060 67015 144052 93979 -85530 -135085
11883 -135085 9215 -63688 -203564 -140033 6457 -87656 -48304 25093 -84551 -184229 -127913
11872 -127913 56277 -55562 -253081 -410327 -306208 -218560 -159529 -142373 -14301 123639
11862 123639 62750 146134 132990 142660 132088 -69846 -254284 -184275 -6326 215983 256169
11851 256169 72383 -133630 -224098 -304551 -331167 -282420 -132335 48171 9441 37788 62118
11840 62118 35317 103121 257960 326728 103715 -15616 16246 206667 182952 2943 -134082
11829 -134082 -64852 30774 14625 -116900 -248562 -412227 -487643 -489286 -421270 -317576 -94080
11818 -94080 44710 29563 -40771 -213693 -160627 -106650 -87866 -8074 35723 -65855 -92654
11807 -92654 51108 81870 160768 163804 268387 211797 73666 -4044 -79208 -54107 -28296
11796 -28296 -45164 -51822 67507 33089 85357 43710 192083 159271 142267 67581 4318
11785 4318 -731 -45129 -28354 -160110 -258829 -305372 -252846 -186315 -30330 61085 -16469 -73911
11773 -73911 -199674 -162106 -160376 -126377 -189651 -55165 -6220 -23142 38471 26683 -32184
11762 -32184 -15565 -81228 -165783 63622 143167 126893 226937 136546 -57603 -170228 -227047
11751 -227047 -229662 -210838 -314877 -98718 87226 -4353 14604 14859 75964 -26393 81723
11740 81723 82242 -104820 -104065 -4175 25424 6920 197561 109573 107963 205693 201232 116009
11728 116009 272026 258065 61985 96404 7220 -51265 -71140 -128614 -87231 -22018 -127385
11717 -127385 -65111 69964 -101993 -63097 -10077 -94919 -160926 -271551 -137002 -8275
11707 -8275 96969 44932 77018 37106 -32887 -41672 -136251 -8762 35644 -47929 -175640
11696 -175640 -32640 107725 15513 -57697 77013 196409 104450 -163847 -232302 -200469
11686 -200469 -107747 56702 107761 -22674 115985 115816 246150 235990 15584 -84458 -947
11675 -947 -26307 -97699 -46091 -9306 88945 242694 244601 190318 77066 70716 94665 -120762
11663 -120762 -126025 -157252 -146731 -92564 -9622 90054 87442 97185 159815 186955 143402 105415
11651 105415 94864 68944 181443 235431 162723 99878 156305 153789 244583 285632 257911
11640 257911 184993 33336 38994 55323 74437 -29940 -164363 -66609 -29217 -123914 -45044
11629 -45044 114347 170439 104925 90859 -16571 -71740 -21179 -25355 -247497 -339420 -254534
11618 -254534 -162258 -194134 -133344 -202818 -107534 -37796 -48980 -134847 -14092 123393 64312
11607 64312 -76862 -6389 168867 83486 50410 111302 131060 50141 -58748 -131039 -136866
11596 -136866 -108825 -75885 7098 161545 111766 81829 66164 204539 180755 115668 103620
11585 103620 127956 54838 -103358 -88758 -69405 -94767 -83571 -50802 -31189 69140 45041
11574 45041 -123149 -137444 -112956 -158296 -119114 126661 144140 103165 93828 87299 43695 60703
11562 60703 -4256 78515 40843 76242 228946 -40071 -32419 80035 155632 175232 148118
11551 148118 47523 25025 234646 340033 218213 321791 351716 288593 197881 183509
11541 183509 270365 245816 -36488 -260580 -296259 -155795 -215279 -306274 -162481 -84180 -80777
11530 -80777 -52693 -67089 -109956 -279319 -280838 -203682 -47325 81539 92811 -32674 -29740
11519 -29740 70597 149556 115803 64402 57900 128194 135916 92950 37330 -80336 -188638
11508 -188638 11737 297897 259746 78309 -35091 -40592 -55473 -179286 -205322 -184282 -123090
11497 -123090 -22787 -120447 -134025 -160944 -223322 -243751 -143396 -189509 -139606 119815 156205
11486 156205 122883 68028 -44077 -78002 -90045 -106059 64943 93683 50572 30376 -60084
11475 -60084 -109440 -146221 -187342 -133467 64744 -104875 -316240 -310830 -306917 -238840 -105550
11464 -105550 -93205 -57049 82568 -76495 -216786 -121112 -143719 -105172 -173754 -193035 -235553
11453 -235553 -98074 -4000 -51341 -190852 -278277 -12026 5718 59252 125133 140881 78334
11442 78334 145054 133191 102895 -698 -144779 -99163 -73377 -53567 -236275 -212308 -215965
11431 -215965 -450249 -512774 -478177 -186022 21469 167329 78855 2293 -118114 -264587
11421 -264587 -338009 -298575 -17607 25432 -86397 -104240 59506 2391 150029 307440
11411 307440 127790 -48489 -177431 -135273 -187121 -181892 -60304 -88305 -45796 36989 170002
11400 170002 81847 51655 -125853 -67130 -108421 -178982 44349 -2462 -179754 -71008 140637
11389 140637 209852 65903 179576 351566 223655 178994 294613 184672 134130 130017
11379 130017 17909 -105261 -180299 -107920 -99915 -40671 147138 284428 3094 -166065
11369 -166065 -156144 -142966 -65333 -64306 -184841 -115120 -11583 13034 -5005 -31827 -86323
11358 -86323 -99024 3905 -58648 -125011 -197447 -294366 -288131 -288245 -279825 -181612 -80638 -65519
11346 -65519 -286537 -382541 -289523 -218544 -147007 -2446 -101276 -52037 99686 92570 130690
11335 130690 33668 -252511 -258435 -148922 39651 161905 162923 189374 187354 199848 133789
11324 133789 22594 -96864 35762 85968 154126 91523 -61006 -126314 -116437 -117859 -130928
11313 -130928 -14078 28373 -31898 -66781 -45529 -85580 11133 31415 -68779 7727 140275
11302 140275 214228 136929 92185 87753 3021 -58168 -49339 -32277 -56247 -25377 -262719 -282747
11290 -282747 -141192 86587 64806 10559 -6154 -11516 60911 71140 37712 36959 -27244 -99456
11278 -99456 -75461 -80658 -130114 -124153 -24198 182098 89181 49700 120220 27786 8246 -172771
11266 -172771 -165025 -127731 -183878 -187638 -8228 157424 90898 -117191 -109776 28370 306255
11255 306255 282986 224049 367042 303722 322221 308297 171314 -9060 -119128 28043
11245 28043 127123 66466 -79928 -86072 32598 133091 324068 268710 172818 172526 97012
11234 97012 4498 59967 -26062 -131794 -146248 -141872 -74456 -44264 96442 135963 693
11223 693 -69733 36903 20823 -108161 -193740 -281554 -348643 -342250 -197172 -192369 -129638 -11285
11211 -11285 130189 183495 134970 9303 42450 111397 102671 47433 7926 10973 278793
11200 278793 400833 356327 159970 135341 174610 112298 58431 165663 303794 289878 187184
11189 187184 116189 79236 161815 300119 188889 -18585 -13426 -60957 -208316 -208866 -150275
11178 -150275 -74016 22070 -52861 -258 42881 -42432 -74033 -132958 -140731 -81177 -39259 9828
11166 9828 -47242 -113506 -105329 22340 -1032 25254 64571 -14954 -147574 -236755 -98684
11155 -98684 -151328 -178808 -143330 -169724 -93118 9318 29569 22666 130647 169366 -20642
11144 -20642 -208211 -190245 -134711 -320546 -412911 -137668 -129043 -188269 -143176 78025 158046
11133 158046 -38056 -86803 4818 -46965 -51929 -4920 73385 161911 176527 61633 65073
11122 65073 -39114 -187250 -24284 38897 -111998 -227827 -219127 -179779 -97791 34560 57049
11111 57049 -41310 -141405 -158232 -41029 14302 -48574 -1698 -28429 -82530 -109073 -167841
11100 -167841 -247875 -423468 -368077 -171615 -116191 -109956 -90583 -7364 108415 31534 37030
11089 37030 -57810 -43993 104803 12128 -76382 -122568 -223556 -219389 -74723 -76533 -107379
11078 -107379 -95539 -92679 7798 81039 258425 204165 67777 123996 92290 -92080 -106199
11067 -106199 -125898 -65222 -33817 23406 93949 2882 -105578 -93455 117832 111420 -6743
11056 -6743 -84257 -221290 -287545 -482737 -287585 -84667 -108509 8126 217972 225662 208322
11045 208322 211640 32751 -56398 14386 72269 44631 20491 30021 -10342 -75317 -92346 40072
11033 40072 199040 215064 187284 203079 293502 155670 -3633 -75713 -82263 -81318 -119863 -127712
11021 -127712 -100332 -27656 -10373 -62589 -176410 -171333 -82198 100390 200578 121195 37068
11010 37068 -34257 62093 105490 197906 312108 107756 25052 72138 168856 227748 169809
10999 169809 94357 145549 154128 23563 -32612 87949 -113617 -37521 -154461 -404770 -475154
10988 -475154 -240470 -121978 -50938 -45059 -37678 -60020 -134710 -83195 63339 -130530 -334568
10977 -334568 -274541 -288488 -243682 -267587 -210479 -141009 -99107 8296 96197 29300 -47080
10966 -47080 106538 178765 -59505 -239995 -83637 -148369 -181659 -127719 164685 255638 318688
10955 318688 416560 386320 251626 223520 256015 176577 40602 146006 80454 -50772 -117920
10944 -117920 -170046 -55225 -12923 -163318 -276819 -275586 -262183 -179151 -13407 93401 213237
10933 213237 331170 389202 391840 162369 95766 154553 145368 98086 -47109 -66547 -91346
10922 -91346 -277284 -207356 65835 164724 31408 163352 211684 196063 287314 363390 315232
10911 315232 269331 230644 244022 326786 288561 307752 6923 -64315 642 -203120 -208480
10900 -208480 -129248 38972 -85005 -184670 -256272 -286205 -238948 -162169 -22705 -48547 -207705
10889 -207705 -401932 -353944 -250494 -296384 -79808 110679 13218 -85696 -49863 -103659 -226846
10878 -226846 -264484 -192603 -44110 -175658 -255030 -225588 -264418 -234422 -130356 -36297 -10279
10867 -10279 -65290 -173051 -78598 -41187 -38030 125342 -35170 -87767 5655 98468 75313
10856 75313 -48002 -115531 -121023 -121459 -117681 -151840 -173744 -70750 144014 156760 45503 -39449
10844 -39449 -76138 -235793 -363816 -163401 -140038 -250511 -284373 41975 129916 49656 92747
10833 92747 27054 -139867 -269430 -169748 -44442 -60388 -95318 -16114 -159445 -166712 -127290
10822 -127290 -195639 -204078 92943 228653 132905 65405 44187 -27569 -30227 -52905 27049
10811 27049 350369 402947 267686 200244 97880 -36957 -33858 -75423 -91236 -43304 -151741
10800 -151741 -45584 -11509 190961 157426 150590 86977 -22993 -40546 -71117 45849 9975
10789 9975 -65247 -25905 43190 115081 48844 -18952 11609 -35542 -52276 -114913 -164311 -223315
10777 -223315 -351179 -338359 -343733 -132886 22598 23335 -250283 -225006 -86945 59477 306582
10766 306582 430677 412682 317175 224558 92829 -25456 -226485 -280587 -97676 -90686 -147044
10755 -147044 -216647 45236 93348 -42700 -195501 -94546 -65239 -162136 -175963 -92070 47174
10744 47174 79802 62628 -41175 -211709 -173119 -73583 -181655 -231018 -214447 -213153 -129160
10733 -129160 -162745 -214378 -157185 -65000 121453 84197 98726 92567 34401 72999 208597
10722 208597 131187 67014 -38154 88955 11439 -2452 -58002 -214730 -183155 -157767 -220983
10711 -220983 -207086 -238123 -133113 -9739 77601 -39663 45542 -92699 -149499 -147839 -269634
10700 -269634 -202082 -179153 -337135 -296918 -286938 -196857 -186035 -193346 41643 110518 -8052
10689 -8052 25992 -100543 -80057 144292 104242 142229 47138 -97374 -50380 -15861 42783
10678 42783 129771 177214 152399 140421 166145 153745 185599 202097 156118 254894 182367 148239
10666 148239 225987 179856 28704 6462 158829 199640 102340 81043 201497 289357 285267
10655 285267 208947 83891 -114674 -364500 -319962 -82229 -55854 -163216 -207573 -89785
10645 -89785 67841 73821 67127 -10830 -133838 -147774 -21723 61316 -51492 93520 209042
10634 209042 96908 -107815 -88008 97790 204730 230507 173835 191699 350509 291447
10624 291447 -1192 -39821 84488 -29633 -111350 13495 134873 -6924 -172579 -137256
10614 -137256 -192427 -172310 42023 120360 229502 292099 277763 279106 178292 67241 -28849
10603 -28849 93482 144322 32628 -64086 -75860 -7983 103476 73450 93160 88682 33396
10592 33396 -12321 -55254 81556 94144 63833 171888 175084 -102827 -168477 -91214 -132917
10581 -132917 -159536 -143660 -136652 -118337 -30646 -80803 -195206 -342956 -453853 -349547 -217627
10570 -217627 -244072 -266815 -248667 -96520 -189213 -354276 -236728 -165039 -217310 -122438 -174993
10559 -174993 -314888 -241296 -229660 -260571 -251259 -220458 -153631 -148775 -128654 -35989 -52050 -44588
10547 -44588 54582 185538 224874 220161 142697 75991 122149 198268 88484 235883 376772
10536 376772 384588 304689 259452 269824 257696 87763 -85357 -218928 -236392 -167403 -129825
10525 -129825 91773 64709 -215005 -188746 -46891 143250 98776 -149703 -276103 -262787
10515 -262787 -265082 -160337 -96205 -64041 -219160 -242742 -119161 -3757 -62466 -23301 -84723
10504 -84723 -28793 -28047 -81013 -110234 -164811 -72808 16302 -27294 34579 -25011 -130430 -102069
10492 -102069 -108430 -137074 -346501 -301241 -254522 -284696 -176511 -4868 -51356 -8722 135078
10481 135078 164983 -9633 -92271 -23817 -11052 -139475 -177769 -124462 -188134 -131038 -18500
10470 -18500 -35612 -98018 -163173 -134656 30901 -16277 -43496 -88303 -164973 -210266 -42889
10459 -42889 179869 127703 87447 37763 -125990 -287783 -224794 -43823 95251 112538 22590
10448 22590 -55623 -235108 -327923 -379117 -239228 -63018 -22257 -31817 -141091 -178558 -141780
10437 -141780 -17200 21477 14037 136977 247961 130854 106119 141869 21799 113368 226923
10426 226923 137399 141964 74579 -237073 -262602 -195941 -153277 -218605 -90866 -77456 -52874
10415 -52874 36871 -7483 14866 44483 65 31506 84573 8352 129069 170184 191594
10404 191594 -65004 -249436 -319601 -125747 109881 77687 12509 2309 14945 -247839
10394 -247839 -339353 -410547 -180744 -128391 -201809 -102096 46974 59310 -64600 -91969 -124132
10383 -124132 -210504 -258898 -321303 -254124 -39412 74843 80571 -28890 -213496 -196993 -175320
10372 -175320 -70268 -102743 -80743 56401 91256 146782 123688 -12876 35492 -17606 -93232
10361 -93232 -145669 7917 120256 61492 -6644 -17506 129851 152327 121603 77316 132434
10350 132434 190501 114472 -102970 -204804 -145046 -49005 9941 -3321 100449 204891 258842
10339 258842 196016 210214 101518 -74081 -49909 -122212 -66318 -94792 -28032 -78509 -240057
10328 -240057 -136894 -16377 -71568 134552 123201 -58513 -102780 -170819 -296056 -388004
10318 -388004 -172623 68477 21829 74318 141738 150099 104731 94349 77868 214155 209440
10307 209440 195533 95529 24631 -30275 88816 88472 121122 17524 -158099 -116013 -112956
10296 -112956 -85158 13914 114222 146746 234281 329035 201862 170173 80932 13866 34499
10285 34499 76975 965 -36150 -18475 -216556 -151864 -142920 -51337 586 21800 99308 -7050
10273 -7050 7433 -16286 -30651 -130401 -80501 149282 121500 -60672 -61443 -36547 134681 42619
10261 42619 -15371 -73451 -83143 -74127 -34164 -139555 -100581 18971 -26162 -75504 5364 3116
10249 3116 -67326 -133157 -103703 -39321 -2697 153571 192176 164511 176394 148058 204863 322076
10237 322076 522941 594309 621323 453149 492418 542518 445340 282582 113975 17375 53710
10226 53710 187635 124732 -60559 -54960 15213 47995 36439 -151716 -110043 40065 63032
10215 63032 94479 -31612 -238889 -281232 -56823 55793 -76239 -208149 -327823 -118353
10205 -118353 -114633 -78943 -30137 69131 4812 -113775 -51347 -81033 -18903 -7148 23003
10194 23003 -33093 -95142 63616 79600 208944 105665 210851 191960 -32132 -18927 56698
10183 56698 74517 241189 238906 342602 314779 296368 286386 334113 387310 157357 -32856
10172 -32856 -33671 -111758 -196907 -101716 -35656 -88805 -123066 57354 80644 187953 203406 156162
10160 156162 275545 376030 394865 458627 199897 185410 317809 419823 334945 83401
10150 83401 -41505 6220 71220 83943 85631 230775 138776 25473 30757 -50089 -193348
10139 -193348 13496 157464 212728 13221 105808 94177 124978 108837 36023 -507 -10230
10128 -10230 -147179 -101908 29475 40978 163690 204419 192694 194546 28589 -21997 -106605
10117 -106605 -167292 -208443 -178198 -47879 -40787 43028 20288 -231910 -401850 -349820 -233327
10106 -233327 -92340 -84380 -181661 -293360 -384710 -331349 -138111 102185 68488 1113 -46896
10095 -46896 -269786 -191073 52384 -54883 -268307 -311205 -230390 -153051 -210976 -185317 -157280
10084 -157280 -132393 -26676 140725 226866 151146 -88351 -400245 -294401 78808 328663
10074 328663 397557 335050 345063 417013 408871 415668 384599 267794 274402 120593 109263 9096
10062 9096 -8408 -68440 -203423 -159380 -62520 -70692 -63147 -100274 -72203 -47787 191058 329905
10050 329905 373863 250237 -49117 -9873 -68366 -79935 -42765 1853 -35756 -31756 -111130
10039 -111130 -114963 99778 81413 -87667 -37622 -1271 -18463 64506 -21699 -89354 66388
10028 66388 139258 71865 -101950 -7196 132910 181278 126529 257011 129998 57105 40156
10017 40156 75099 46745 128724 207352 60540 -95674 -63266 78904 7065 37071 22550
10006 22550 94365 140498 -47346 -58495 157023 228433 142838 83701 17055 33089 6767
9995 6767 31787 95320 128582 109010 115418 159099 154768 62441 232442 101159 45681 -87312
9983 -87312 -5093 62970 136205 12222 -148057 -106333 224024 382703 283006 300670 310022
9972 310022 338800 239288 126725 275087 218596 79247 120062 254767 250094 205832 246871
9961 246871 266171 291868 192369 64085 -23388 19898 -112795 -101357 -127567 -260191 -124352
9950 -124352 4714 -67329 -123522 -93623 46085 84584 152113 181923 34812 152720 230332
9939 230332 143847 124081 54265 -137907 -121564 -55052 -112442 -243138 -252811 -324831 -310307
9928 -310307 -313638 -289899 -254955 -172816 -76767 32194 124428 227279 133323 38815 -3964
9917 -3964 24009 52603 5773 -191962 -243424 -97995 181640 193348 84312 73364 69856
9906 69856 50249 -13936 33777 85996 -3022 -34490 77708 23649 129721 186678 63629
9895 63629 59430 241939 253643 132870 78275 43982 18503 -76340 57022 140721 135143 124602
9883 124602 10319 101071 253577 336828 307970 65562 87585 189752 189049 264573 311257
9872 311257 392032 240240 101259 184338 178466 -59582 -244643 -88948 17620 58427 34314
9861 34314 -31182 -40032 -106259 -114771 -54796 94724 -25724 -74758 -120844 86498 167493 238191
9849 238191 265437 251670 177006 212363 168121 55068 89506 109788 9207 -55043 129218
9838 129218 319530 373952 283037 153415 162291 44327 95935 146163 -12378 -4119 168047
9827 168047 258618 187151 96980 -91639 -214193 -305091 -302707 -131161 157833 167849 157979
9816 157979 223138 358338 174651 22951 -25221 132369 204090 180673 125842 215284 163482
9805 163482 -12093 31704 144424 265035 314618 122383 189997 63687 -152327 -55359
9795 -55359 76175 201972 165205 4430 30504 -11558 -91414 -91712 -8146 -17339 -161 -36738
9783 -36738 37826 84800 47330 -52256 -21923 -4927 8959 9414 -26503 -115853 -142150 -62335
9771 -62335 -150637 -237817 -234742 -74947 226372 330446 116676 38801 -44467 -155664 -233533
9760 -233533 -163750 -132935 -67342 -32052 -61901 -172818 -169799 -211463 -160330 -143427 -161378 -63195
9748 -63195 93914 288002 279706 209125 84770 121575 92129 137478 -53582 145792 196223
9737 196223 -68992 -152694 -173599 -208549 -122233 -4675 13888 -201853 -249811 -179554 5602
9726 5602 23306 1769 -12129 138934 310243 370825 278734 26069 -166263 -133075 47146
9715 47146 -30392 -206606 -199435 -269678 -141014 67080 251410 235647 -34172 -101728 -154998
9704 -154998 -157393 -34310 -46852 -90420 -170909 -221257 -244225 -272414 -290779 -175204 -29227
9693 -29227 106068 130953 -84468 -188617 22242 166487 30166 -152213 -184260 -141492
9683 -141492 122764 189602 170527 90508 94433 6728 -27829 24408 12859 -64350 -125518 42266
9671 42266 247248 247079 344736 346756 82662 -104058 -101543 -67134 190848 271998 332809 168561
9659 168561 -26269 -1110 153295 154162 199903 118463 117577 173766 142176 222307 107937 -6137
9647 -6137 -25308 -50859 -51040 -148168 58807 132539 -69456 -161752 -164371 -163546 -93530 41596
9635 41596 196977 244352 182014 121869 65183 20065 18296 -9238 16911 -195687 -197360 -197464
9623 -197464 -129655 38157 12148 22121 -36495 -175036 -230388 -126399 -104702 -243045 -324254
9612 -324254 -205675 -219784 -273891 -403081 -326737 -100678 230544 260668 160333 127085 202397
9601 202397 201043 265337 423312 433340 425859 309221 247733 253214 286724 196930 214 -153168
9589 -153168 -145835 42710 42685 69733 63459 98028 177979 93986 108768 23155 -60028 -198705
9577 -198705 -312357 -505164 -490864 -372760 -145998 -66555 -92991 -142562 -21049 -24977 -62955
9566 -62955 -72822 -120723 55122 231646 147086 151986 89720 -90559 114772 183626 92401
9555 92401 10186 97896 227875 159279 99362 -18548 -84404 -94153 -160840 -152819 -68917 43866
9543 43866 203549 -41364 -209103 -13294 161153 241470 187428 258724 234377 124330 309477
9532 309477 145712 -93258 -47474 214583 90802 -13436 -15447 -16449 -142994 -14155 69846
9521 69846 83634 -22655 59118 10449 36094 -61761 -19172 125941 55335 23685 -80550
9510 -80550 -100430 -83169 -108811 -72345 -67626 -63451 -73356 -42233 -54686 163685 198945 251841
9498 251841 185621 136803 58551 -72567 -54093 -59185 -26494 137018 381291 428820 256913
9487 256913 442311 536201 328741 59132 -52544 -196710 -246956 -178759 -308186 -203704
9477 -203704 -119289 -220283 -257638 -97417 -32417 22775 -73384 -198502 -2791 64676 77324
9466 77324 52928 109415 163679 41760 -39818 -112629 10590 219643 -19064 -180538 -29074
9455 -29074 100597 135045 61158 94139 290244 409069 298798 221188 156151 162241 186344
9444 186344 155037 2526 -44001 -152161 25718 257912 179035 18426 752 14425 -4789
9433 -4789 3435 33344 167298 253497 270681 197908 -63168 -140280 -162691 -289399 -285571 -280367
9421 -280367 -291926 -158591 -150329 -237588 -240714 -146200 16006 1943 -137136 -82695 189820
9410 189820 342658 371415 353040 252971 37489 -72450 -19880 121269 241180 245823 180676
9399 180676 44302 89107 -52101 -22409 142810 293619 170324 11608 54671 -28736
9389 -28736 -544 82380 113876 176985 95806 139756 195274 398053 523008 393022 221639
9378 221639 106207 61973 199505 184151 232256 188347 207159 411087 352951 260136 297762
9367 297762 259706 117946 -4744 80393 128596 64216 59093 157529 172207 176968 236582 178005
9355 178005 181649 324941 341718 240587 131527 148059 322393 262915 241505 230730 248695
9344 248695 270576 168009 81897 99125 288188 254523 383266 321669 211729 181909 56650
9333 56650 59459 167879 148283 -36859 -180636 29388 125128 190222 141091 61141 91977
9322 91977 41130 -56709 5756 -53039 -110401 7260 64290 137476 183154 323327 384739
9311 384739 222617 108896 95466 185783 165504 69180 -45878 -11812 203420 156557 188577
9300 188577 244595 160911 112308 274541 306291 257312 145659 129867 186212 198225 131684
9289 131684 64393 147162 154506 232552 337832 316332 132337 161644 139600 165815 170272 95014
9277 95014 191089 230996 278329 387129 467251 370167 297361 192003 188200 348366 657131
9266 657131 755218 559377 338367 264841 352811 436386 392920 301268 377945 248726 137100
9255 137100 24086 -132755 -258400 -300329 -134432 295698 422780 407259 433560 434508 414257
9244 414257 249497 283093 306827 259613 337862 390813 509598 511619 476174 491116 303239
9233 303239 249094 68381 95663 289835 199515 96478 69086 239854 157415 136551 97912
9222 97912 75164 199076 317847 391905 325319 23132 -232176 -231714 112198 116988 61883
9211 61883 72682 41447 159706 176243 102536 297572 461392 583432 433164 369988 326193
9200 326193 328059 281887 437898 539454 531969 475266 253602 266812 182954 306935 600500
9189 600500 688803 717909 701167 466448 336459 261512 282212 346128 313432 313746 363600 407813
9177 407813 295872 194644 207299 245255 338851 367546 370870 489811 353225 243926 272230
9166 272230 273591 264417 308867 201956 174682 192586 255570 439505 617338 705308 823135
9155 823135 923527 922492 668305 660894 838399 726206 384141 342707 478809 498939 347365
9144 347365 317166 176447 271483 533186 515094 554726 604369 578054 731463 677954 644948
9133 644948 752769 910923 964389 935069 855775 930522 990315 975856 803871 836865 900311
9122 900311 981068 1275326 1448395 1369619 1319221 1338619 1398313 1572890 1588079 1804437 2114695
9111 2114695 2230747 2326639 2437645 2561271 2664387 2817996 3175614 3426279 3921231 4634118
9101 4634118 5382549 6369325 7524761 9018492 11190083 14643663 20279051 28861728 41166385
9092 41166385 55566368 70152478 89376917 111942993 123767958 96070302 59213664
9085 59213664 36213769 23764063 16747173 12560297 9827342 7987763 6773036 5878854
9077 5878854 4903698 4204252 3631819 3041544 2549935 2285401 2159995 1874657 1546104 1418915
9067 1418915 1424498 1340366 1093363 901337 777088 648300 614789 843453 906433 862332 627295
9056 627295 483107 498113 642266 666974 481849 503668 472137 371843 196894 238119 415716
9045 415716 800348 995849 834731 628752 559208 498218 370896 269745 124251 76456
9035 76456 87036 -72887 -113673 -33662 22651 -41018 -17146 125091 214149 289674 270341
9024 270341 322309 222638 17912 -136103 -218096 -191551 -131167 -187366 -227215 -8906 54785
9013 54785 74530 216895 179736 134683 14749 -10446 -29976 40679 -125246 -76191 36995
9002 36995 164129 274142 212871 221748 77551 244743 129926 91357 157573 205624 232066
8991 232066 123579 44193 -26990 -84108 55999 164851 93053 138893 180967 44216 -10513
8980 -10513 49321 180271 234711 191345 88857 -98867 -240190 -186550 -53280 -60537 -73364
8969 -73364 -89158 -76088 -152157 -156648 -108557 -95025 -94177 -49811 -51290 -105282 -111838 -97598 -218749
8956 -218749 -312904 -224513 -231470 -202893 -164910 -109309 39296 117233 161545 53979 -67348
8945 -67348 -93451 -111313 -108034 -80231 -29313 11682 69516 133367 293651 361894 201947 124036
$$ [...]
##END NTUPLES=NMR SPECTRUM
##END=
