##TITLE=Analysis number 324393
Compound Code mo 01292
Project Code adrs
Chemist Name ugmt
##JCAMPDX= 6.0         $$ Bruker NMR JCAMP-DX V2.0
##DATA TYPE= NMR SPECTRUM
##DATA CLASS= NTUPLES
##ORIGIN= Bruker BioSpin GmbH
##OWNER= nmr
$$ XWIN-NMR		Version 3.5
$$ Mon Nov 20 13:55:58 2006 GMT Standard Time (UT+0h)  MAYBRIDGE\nmr@NMR_250MHZ
##.OBSERVE FREQUENCY= 250.131544655141
##.OBSERVE NUCLEUS= ^1H
##.ACQUISITION MODE= SIMULTANEOUS (DQD)
##.ACQUISITION SCHEME= undefined
##.AVERAGES= 16
##.DIGITISER RES= 18
##SPECTROMETER/DATA SYSTEM= dpx250
##.PULSE SEQUENCE= zg30
##.SOLVENT NAME= DMSO
##.SHIFT REFERENCE= (INTERNAL, DMSO, 0, 16.522)
##AUDIT TRAIL= $$ (NUMBER, WHEN, WHO, WHERE, WHAT)
$$ ##TITLE= Audit trail, XWIN-NMR		Version 3.5
$$ ##JCAMPDX= 5.01
$$ ##ORIGIN= Bruker BioSpin GmbH
$$ ##OWNER= nmr
$$ C:\u/data/dgb/nmr/ADRS/670/pdata/1/auditp.txt
$$ ##AUDIT TRAIL=  $$ (NUMBER, WHEN, WHO, WHERE, WHAT)
(   1,<2006-11-20 13:55:26.50 +000>,<MAYBRIDGE\nmr>,<NMR_250MHZ>,
      <created by zg, POWCHK disabled, PULCHK disabled
       configuration hash MD5:
       49 4B E0 1D 92 C2 6B 37 9F E6 65 BC 52 41 86 1D
       data hash MD5: 64K
       BC 73 EA 0D 56 45 86 C3 49 E5 30 9B 0D A6 16 91>)
(   2,<2006-11-20 13:55:41.25 +000>,<MAYBRIDGE\nmr>,<NMR_250MHZ>,
      <Start of raw data processing
       ef LB = 0.3 FT_mod = 6 PKNL = 1 SI = 32K 
       data hash MD5: 32K
       C3 BE C5 68 4C 6E C4 7E 2A 26 09 40 C4 37 B5 8F>)
(   3,<2006-11-20 13:55:43.52 +000>,<MAYBRIDGE\nmr>,<NMR_250MHZ>,
      <apk 
       data hash MD5: 32K
       6A 3F 9E ED 3A 2D F2 08 85 B1 6D E6 F2 1A B4 0A>)
(   4,<2006-11-20 13:55:44.32 +000>,<MAYBRIDGE\nmr>,<NMR_250MHZ>,
      <abs ABSG = 5 
       data hash MD5: 32K
       26 CC B3 57 E7 E3 E9 09 27 32 31 AE FD 68 8D F4>)
$$ ##END=
$$ 
$$ hash MD5
$$ 80 93 9C EB 80 52 0D 0E 6E E9 9C 30 BA 05 84 07
##$RELAX= 
##$RELAX= 
##$RELAX= 
##$RELAX= 
##$RELAX= 
##$RELAX= 
##$RELAX= 
$$ Bruker specific parameters
$$ --------------------------
##$DU= <C:\u>
##$EXPNO= 670
##$NAME= <ADRS>
##$PROCNO= 1
##$TYPE= <nmr>
##$USER= <dgb>
##$AMP= (0..31)
100 100 100 100 100 100 100 100 100 100 100 100 100 100 100 100 100 100 
100 100 100 100 100 100 100 100 100 100 100 100 100 100 
##$AQSEQ= 0
##$AQ_mod= 3
##$AUNM= <au_zg>
##$AUTOPOS= <20 >
##$BF1= 250.13
##$BF2= 250.13
##$BF3= 250.13
##$BF4= 250.13
##$BF5= 500.13
##$BF6= 500.13
##$BF7= 500.13
##$BF8= 500.13
##$BYTORDA= 1
##$CFDGTYP= 0
##$CFRGTYP= 5
##$CHEMSTR= <none>
##$CNST= (0..31)
1 1 145 1 1 1 1 1 1 1 1 1 1 1 1 1 1 1 1 1 1 1 1 1 1 1 1 1 1 1 1 1 
##$CPDPRG= <>
##$CPDPRG1= <>
##$CPDPRG2= <>
##$CPDPRG3= <>
##$CPDPRG4= <mlev>
##$CPDPRG5= <mlev>
##$CPDPRG6= <mlev>
##$CPDPRG7= <mlev>
##$CPDPRG8= <mlev>
##$CPDPRGB= <>
##$CPDPRGT= <>
##$D= (0..31)
0 1 0 0 0 0 0 0 0 0.06 0 0 0 0 0 0 0.0002 0 0 0 0 0 0 0 0 0 0 0 0 0 0 
0 
##$DATE= 1164030925
##$DBL= (0..7)
120 120 120 120 120 120 120 120 
##$DBP= (0..7)
150 150 150 150 150 150 150 150 
##$DBP07= 0
##$DBPNAM0= <>
##$DBPNAM1= <>
##$DBPNAM2= <>
##$DBPNAM3= <>
$$ [...]
##$SUBNAM6= <"">
##$SUBNAM7= <"">
##$SUBNAM8= <"">
##$SUBNAM9= <"">
##$SW= 20.6930455092707
##$SWIBOX= (0..15)
0 0 3 0 0 0 0 0 0 0 0 0 0 0 0 0 
##$SW_h= 5175.983436853
##$TD= 65536
##$TD0= 1
##$TE= 683.16
##$TE2= 300
##$TE3= 300
##$TEG= 300
##$TL= (0..7)
0 120 120 120 120 120 120 120 
##$TP= (0..7)
150 150 150 150 150 150 150 150 
##$TP07= 0
##$TPNAME0= <>
##$TPNAME1= <>
##$TPNAME2= <>
##$TPNAME3= <>
##$TPNAME4= <>
##$TPNAME5= <>
##$TPNAME6= <>
##$TPNAME7= <>
##$TPOAL= (0..7)
0.5 0.5 0.5 0.5 0.5 0.5 0.5 0.5 
##$TPOFFS= (0..7)
0 0 0 0 0 0 0 0 
##$TUNHIN= 0
##$TUNHOUT= 0
##$TUNXOUT= 0
##$USERA1= <user>
##$USERA2= <user>
##$USERA3= <user>
##$USERA4= <user>
##$USERA5= <user>
##$V9= 5
##$VALIST= <valist>
##$VCLIST= <CCCCCCCCCCCCCCC>
##$VD= 0
##$VDLIST= <DDDDDDDDDDDDDDD>
##$VPLIST= <PPPPPPPPPPPPPPP>
##$VTLIST= <TTTTTTTTTTTTTTT>
##$WBST= 1024
##$WBSW= 4
##$XGAIN= (0..3)
0 0 0 0 
##$XL= 0
##$YL= 0
##$YMAX_a= 366493
##$YMIN_a= -425512
##$ZGOPTNS= <>
##$ZL1= 120
##$ZL2= 120
##$ZL3= 120
##$ZL4= 120
##$ABSF1= 16.522
##$ABSF2= -4.171173
##$ABSG= 5
##$ABSL= 3
##$ALPHA= 0
##$AQORDER= 0
##$ASSFAC= 0
##$ASSFACI= 0
##$ASSFACX= 0
##$ASSWID= 0
##$AUNMP= <proc_1d>
##$AZFE= 0.1
##$AZFW= 0.1
##$BCFW= 0
##$BC_mod= 0
##$BYTORDP= 0
##$COROFFS= 0
##$CY= 12.5
##$DATMOD= 1
##$DC= 0
##$DFILT= <>
##$DTYPP= 0
##$F1P= 14.0000005364418
##$F2P= -0.99999901652339
##$FCOR= 0.5
##$FTSIZE= 32768
##$FT_mod= 6
##$GAMMA= 0
##$GB= 0
##$INTBC= 1
##$INTSCL= 1
##$ISEN= 128
##$LB= 0.3
##$LEV0= 0
##$LPBIN= 0
##$MAXI= 10000
##$MC2= 0
##$MEAN= 0
##$ME_mod= 0
##$MI= 0
##$NCOEF= 0
##$NC_proc= -4
##$NLEV= 6
##$NOISF1= 0
##$NOISF2= 0
##$NSP= 0
##$NTH_PI= 0
##$NZP= 0
##$OFFSET= 16.522
##$PC= 1
##$PHC0= -60.307
##$PHC1= 7.247989
##$PH_mod= 1
##$PKNL= yes
##$PPARMOD= 0
##$PSCAL= 4
##$PSIGN= 0
##$REVERSE= no
##$SF= 250.13
##$SI= 32768
##$SIGF1= 0
##$SIGF2= 0
##$SINO= 400
##$SIOLD= 32768
##$SREGLST= <1H.DMSO>
##$SSB= 0
##$STSI= 32768
##$STSR= 0
##$SW_p= 5175.98343685301
##$SYMM= 0
##$S_DEV= 0
##$TDeff= 65536
##$TDoff= 0
##$TI= <Analysis number 999999
Compound Code 99
Book Reference 9
Project Code 9>
##$TILT= no
##$TM1= 0
##$TM2= 0
##$TOPLEV= 0
##$USERP1= <user>
##$USERP2= <user>
##$USERP3= <user>
##$USERP4= <user>
##$USERP5= <user>
##$WDW= 1
##$XDIM= 32768
##$YMAX_p= 576875888
##$YMIN_p= -258279
$$ End of Bruker specific parameters
$$ ---------------------------------
##NTUPLES= NMR SPECTRUM
##VAR_NAME=  FREQUENCY,     SPECTRUM/REAL,   SPECTRUM/IMAG
##SYMBOL=    X,             R,               I
##VAR_TYPE=  INDEPENDENT,   DEPENDENT,       DEPENDENT
##VAR_FORM=  AFFN,          ASDF,            ASDF
##VAR_DIM=   32768,         32768,           32768
##UNITS=     HZ,            ARBITRARY UNITS, ARBITRARY UNITS
##FACTOR=    0.157963299565203, 1,           1
##FIRST=     4132.6476996994, 0,             0
##LAST=      -1043.33573715361, 0,           0
##MIN=       -1043.33573715361, -258279,     0
##MAX=       4132.6476996994, 576875888,     0
$$ Real data points
##PAGE= N=1
##DATA TABLE= (X++(R..R)), XYDATA
$$ [...]
14071A7912P633q140J1850q126j3400j1203j9774J0268N932j7544j7082J433j225
14058d1466J2634K076j336j7660J8396k698J0297J9533K2862L0169p564m0250
14046D993j6651j1501k6611k5671j5769j3678p274K2900R514M448R703J5117j218
14033e1698J0031p288J733K4238O690K0069r555j7590p50J8680O476O35k83J0094
14019A1482j0155K454k450K4013o407j6369k5458K690J9104L283q44K9697J2927
14006D3967J159j8195j5368j6374R00J1046K223L2979n707k6206q907l462j1793
13993a3738j9686J7806K1598K0713L4354j0782j9337l210L194j7107j72K2227
13981C5860K1503K1316O258J5l4231j1282J7800k0221l6116j4701J2493J8567
$$ plain form
14071 17912 25545 17405 29255 21129 7729 -3474 -23248 -12980 -7048 -24592 -41674 -40241 -41466
14058 -41466 -28832 -26756 -28092 -45752 -27356 -30054 -19757 -224 22638 52807 45243 4993
14046 4993 -11658 -23159 -49770 -75441 -91210 -104888 -112162 -89262 -79748 -75300 -65597 -50480 -51698
14033 -51698 -41667 -48955 -47222 -22984 -16294 3775 -5780 -23370 -24120 -5440 1036 1671 1388 11482
14019 11482 1327 3781 1331 25344 18937 2568 -22890 -20200 -1096 2187 1343 31040 43967
14006 43967 45126 26931 11563 -4811 -3911 7135 9358 42337 36630 10424 1517 -1945 -13738
13993 -13738 -33424 -15618 5980 26693 61047 50265 30928 27718 30912 13805 13633 35860
13981 35860 57363 78679 84937 84952 50721 39439 57239 37018 902 -13799 -1306 17261
13969A7261L4779K1389P958j9884n0985k2819J8420K3557K6375k6203k6055j4748
13957a0955j2941j2926K1715Q381j4200j3182J2956M4897J9094j8026p213j8575
13945i75O315J8439k0455l6955J117Q502o888J5346j0527M917J7427M211m253
13932c779q617K9154p194k1964p820P593L478Q8K6578n451j0264j577N027n4389
13918d9137k5601O364K960J4595J8337q312J6173L3651r258k8637K534J6799j7089
13905b6621k3479J8804L006K3386j9317j9740O255K5850q73N074p778n778J4998
13892f213N396j0696n536K4218j502j6305j6399J3932L5263j1502k1567p974J7566
13879a319k647N368J247k9455p377R471J3859L5803K2692j2410j3289k6928R336
$$ plain form
13969 17261 52040 73429 81387 61503 10518 -12301 6119 29676 56051 29848 3793 -10955
13957 -10955 -23896 -36822 -15107 -6726 -20926 -34108 -21152 23745 42839 24813 17600 -975
13945 -975 5340 23779 3324 -33631 -32514 -24012 -30900 -15554 -26081 -21164 -3737 474 -3779
13932 -3779 -12396 16758 9564 -12400 -20220 -12627 -9149 -9061 17517 12066 1802 225 5252 -49137
13918 -49137 -74738 -68374 -65414 -50819 -32482 -40794 -24621 9030 -228 -28865 -26331 -9532 -26621
13905 -26621 -50100 -31296 -28290 -4904 -24221 -43961 -37706 -11856 -12729 -7655 -15433 -21211 -6213
13892 -6213 -817 -11513 -17049 7169 5667 -10638 -27037 -13105 22158 10656 -10911 -18885 -1319
13879 -1319 -3966 1402 2649 -26806 -34183 -24712 -10853 24950 47642 35232 21943 -4985 4351
13866D351l190L5238R345o1286j0113N1350K4268O349k76j7332m3219j9434J0829
13853a3120L6175J346j7152M0432J4238j3809k4023j6632K941J576J5027j5113
13841A1886n2130r015K2450J8949L015N082j3733J9768k8371j3086K3479q298
13829b0004Q19J6486M1970J9479j4336J6628J5607j8414J1998L4072L8511J1094
13817A53910Q091M8952L9706P5171R2034Q4419R8192Q2125P5181K8191k4260l2825
13805G28887p9823j00192j10709q2358m5352q4688o2826j8083l9944m2508p80
13794F1624q52j1864J0003J3724J1914k3684p841j9597p624J3774k4590j0841
13782D146J2871L0360j2949j471L7492k0599j2608L797j5716j2113J1204N399
$$ plain form
13866 4351 1161 36399 45744 -15542 -25655 25695 49963 56312 56036 38704 -4515 -23949 -13120
13853 -13120 23055 24401 7249 47681 61919 48110 24087 7455 10396 11972 26999 11886
13841 11886 -40244 -49259 -26809 -7860 -4845 237 -13496 6272 -22099 -35185 -11706 -20004
13829 -20004 -19185 -2699 39271 58750 44414 61042 76649 58235 70233 104305 142816 153910
13817 153910 162001 210953 250659 325830 417864 502283 600475 682600 757781 785972 761712 728887
13805 728887 649064 548872 438163 355805 310453 225765 162939 144856 104912 62404 61624
13794 61624 60772 48908 58911 72635 84549 60865 53024 33427 25803 39577 14987 4146
13782 4146 17017 47377 34428 32957 70449 49850 37242 41039 25323 13210 24414 29813
13770B9813j3144r336J6646J7942j1190P127L167O582k855k5175k3127M301j2345
13757a1594p34K2044J0405j3523q840J4660k7655k6040J9694L0197L369j7296
13745e313k708K1750R366Q01J147j3309r825r941Q009L4831n60l0749l0082j5645
13731d2228j115L190M2347j1083k6934o639q534K501n604P95J9277p541j0056
13718e1624J4390q512Q418L8698J2385k3570l2020l39L586J6768M9556J3100k3236
13705A7600j5517r801Q653L560k5512k51J7210K3212N002k023O14k4189p138k0168
13691b8748k119j4289J0966J8472K7955L195r807K87m788N163j3803n683m736
13678a7935J3295L1440N738m3185k2670L1711P618o691n595q50n359l729J3442
$$ plain form
13770 29813 16669 7333 23979 41921 30731 37858 41025 47607 44752 19577 -3550 751 -11594
13757 -11594 -12328 9716 20121 6598 -2242 12418 -15237 -41277 -21583 8614 11983 -5313
13745 -5313 -8021 13729 23095 23896 25043 11734 1909 -8032 -23 34808 34248 3499 -26583 -42228
13731 -42228 -43343 -40153 2194 -8889 -35823 -42462 -50996 -48495 -54099 -53304 -34027 -41568 -51624
13718 -51624 -37234 -45746 -37328 1370 13755 -9815 -41835 -42174 -38588 -21820 27736 40836 17600
13705 17600 2083 -7718 935 4495 -21017 -21268 -4058 19154 24156 22133 22747 -1442 -8580 -28748
13691 -28748 -30867 -45156 -34190 -15718 12237 15432 5625 5912 1124 6287 -7516 -13199 -17935
13678 -17935 -4640 26800 32538 -10647 -33317 -1606 6012 -679 -6274 -7124 -12483 -16212 -2770
13665b770J9420O719k2j851l486k0610j0906J3270J0693k6713r213J9597K1415
13652A5543J8730J0932L739k5009m5549j5857l036j364K6147J9324R267L63j966
13639A1264m99J3265r287k2339L998N613Q565k0550k2243K554J9220N270n209
13626a0378m614j3787m839J2728J4100q323o421L0988L2332k1325m290k971j5450
13613b250R890k3456j8257P89l683J1650J5081P818j1615Q358L0224j8419p740
13600a610k0242k4107Q88M473j336L175J6547J2510J9853l850l0203J2591P452
13587c859j1280J654J2828M325j7519k7728j6893K5636K8229K0935M2375l6229
13575B2474l4940n88q955J1473j5373k9350N830J275Q407K3269K1682o77l4426
$$ plain form
13665 -2770 16650 23369 23347 21496 18010 -2600 -13506 -236 10457 -16256 -25469 -5872 15543
13652 15543 34273 45205 48944 23935 -21614 -37471 -40507 -41871 -15724 3600 12867 13230 11264
13639 11264 10765 24030 14743 -7596 -3598 2015 10580 -9970 -32213 -29659 -10439 -5169 -10378
13626 -10378 -14992 -28779 -33618 -20890 -6790 -15113 -21534 9454 41786 20461 16171 13200 -2250
13613 -2250 7640 -15816 -34073 -33284 -36967 -25317 -10236 -2418 -14033 -5675 24549 6130 -1610
13600 -1610 -21852 -45959 -45071 -40598 -41934 -38759 -22212 -9702 10151 6301 -23902 -11311 -3859
13587 -3859 -15139 -13485 -657 3668 -13851 -41579 -58472 -32836 -4607 16328 58703 22474
13575 22474 -12466 -13054 -22009 -10536 -25909 -55259 -49429 -48154 -39747 -16478 5204 4527 -29899
13562b9899k7155J0922K7071J3219N623k953J0788P690J4692j7237N819K7580
13550D6160n59j8877j5185J419J3574n11k3224n541q689R778N7931J9362l4198
13537D1440j8829m419j6459J934j0773J258J2019o178m0163K0841l651J063J8224
13524c693O554J1088l1325m373Q246l618l6641m091L9629M0872J3932j4523K8826
13511E0883K8004q709l0995l4300j4424j3188O40K2146J3786K591k2309k4275
13499c0150J1654k3741j2726J3075m399q614k5431j5714J2586K604L2751K4144
13487b3961J5258k458J4566k300j1826K562j3290k0749J5070J6480r280N82N080
13474a4266J0329J4005J7251k3842k880O960J8491J547q757J7143j3551P479l1421
$$ plain form
13562 -29899 -57054 -46132 -19061 -5842 -219 -3172 7616 15306 29998 12761 18580 46160
13550 46160 45601 26724 11539 12958 26532 26021 2797 -2744 -11433 -1655 56276 75638 41440
13537 41440 22611 18192 1733 3667 -7106 -5848 6171 -7 -40170 -19329 -22980 -21917 -3693
13524 -3693 2861 13949 -17376 -21749 -13503 -17121 -53762 -57853 -18224 22648 36580 22057 50883
13511 50883 78887 70178 39183 4883 -9541 -22729 -22089 57 13843 16434 -5875 -30150
13499 -30150 -18496 -42237 -54963 -41888 -46287 -54901 -80332 -96046 -83460 -80856 -48105 -23961
13487 -23961 -8703 -11161 3405 1105 -10721 -8159 -21449 -42198 -27128 -10648 -19928 -19346 -14266
13474 -14266 -3937 10068 27319 3477 597 7557 26048 27595 18838 35981 22430 29909 -1512
13461a512J1048K7033J4898n089l911k2003n2087M036J6758P641R847R975J2105
13448B8739j5185k4352P704R008j0390M0038K7731j0442o038N356k6877k2617
13436B675K8043L9148k1371k1450m137J2759k7136O583N68l422j3160j1502j7375
13423b9777J9740k668j674K0985K7566j8580J4759j1204k1573J2586n061J9859
13411B4958J4795j0933k287k1209m302l5250p057K3723J6662k28L653O684L6178
13398D5387L536O726m06o334l836j2119M225M362j0025m460J5184j1359l6268
13385e387K263J8919J0693R607J1100k2820l1705J6567J4232o344j3363P375l864
13372G273R354J164j0548l108p221L682K6307L3710n802j5295q701j3231J7027
$$ plain form
13461 -1512 9536 36569 51467 46378 42467 20464 -31623 -27587 -10829 -3188 6659 16634 28739
13448 28739 13554 -10798 -3094 5914 -4476 35562 63293 52851 46813 52169 25292 2675
13436 2675 30718 69866 48495 27045 22908 35667 8531 15114 15682 12260 -900 -12402 -29777
13423 -29777 -10037 -12705 -14379 6606 34172 15592 30351 19147 -2426 10160 5099 24958
13411 24958 39753 28820 26533 5324 1022 -34228 -41285 -17562 -900 -1128 2525 9209 45387
13398 45387 48923 55649 55243 48909 45073 32954 37179 41541 31516 27056 42240 30881 -5387
13385 -5387 -3124 15795 26488 36095 47195 24375 -7330 9237 23469 17125 3762 11137 7273
13372 7273 16627 17791 7243 4135 -3086 596 26903 60613 54811 39516 30815 17584 34611
13359C4611M469l2356L382k842P769j0679j853Q385J804K1467K5125j3778l8824
13346F680n213j416j3512J7079M1874J2733k4413l5609l608R547J3383n651K2591
13333C4465R574k027j5891j4143J91o432J8471M233k7228r172J0406k239R415
13320I623j3215J8030l490q601J070J444j3009L9141K4065K1633k3835o934j4509
13307C1413j550K0523o700k6837l092J883J1039L246j0957l7082Q272K6502L1398
13294D8058K2761j4862p72O793M670j7001j439l2323l6114K1882J6257o272q365
13281C273R576p4r201R052K9671l2878k0488J4153J7668Q79j3136l258O220L5126
13267D6583K4118j9197K0037J8920o570l8125j21q95p811o886j0267o488N566
$$ plain form
13359 34611 39080 6724 10106 7264 15033 4354 2501 10886 12690 34157 59282 45504 6680
13346 6680 1467 51 -13461 3618 45492 58225 33812 -1797 -5405 4142 17525 11874 34465
13333 34465 44039 42012 26121 11978 12169 5737 24208 28441 1213 -7959 2447 208 9623
13320 9623 -3592 14438 10948 2347 3417 4861 -8148 30993 55058 76691 52856 45922 31413
13307 31413 29863 50386 43686 16849 13757 15640 26679 29925 18968 -18114 -9842 16660 48058
13294 48058 70819 55957 55185 61978 66648 49647 48208 15885 -20229 1653 17910 11638 3273
13281 3273 12849 12775 3574 12626 42297 9419 -11069 3084 20752 21631 8495 5237 11457 46583
13267 46583 70701 51504 71541 90461 83891 45766 45645 44750 36939 30053 19786 13298 18864
13254A8864r272j8678J5951q292J8540K0364K552j7967J404J3833M793k5195j8064
13241a167k4294j4396J178K5825k1622Q100J2158J0217r497n009L3613K559m552
13228A3113K5200R552j2331p119Q104j2012l050k0648O632J1326N217p445M722
13215B1261J308j5853j5669K635J8114J0841j0685J967K2J0155P430J261K786
13202C5573o688k973k6070K1577j3123l4381j2752K2039R441N3248J9343m0585
13190B4649k4635j0932j059K8110M407j0681r060Q475O388K66N377N28P293r991
13176A9135j6802k034O059k1845j826j6963L1920K5520r221k6507l573J2924J7725
13163A4512O999j2770J1721L3511o950j0300j586j4984J5739L5635l359l536J3496
$$ plain form
13254 18864 9592 -9086 6865 -1427 17113 37477 40029 22062 23466 37299 42092 16897 -1167
13241 -1167 -25461 -39857 -38679 -12854 -34476 -26376 -14218 -4001 -13498 -18507 15106 17665 13113
13228 13113 38313 47865 35534 28415 36519 24507 21457 809 7441 18767 23984 16539 21261
13215 21261 22569 6716 -8953 -6318 11796 22637 11952 13919 13941 24096 31526 32787 35573
13202 35573 28885 25912 -158 21419 8296 -26085 -38837 -16798 -7357 45891 65234 24649
13190 24649 14 -10918 -11977 16133 20540 9859 799 9274 15662 15928 21305 21833 29126 19135
13176 19135 2333 299 6358 -15487 -17313 -34276 -2356 23164 13943 -12564 -16137 -3213 14512
13163 14512 21511 8741 20462 53973 47023 36723 35137 20153 35892 71527 68168 64632 78128
13150G8128n388k9189o049N749J736o339J9023J6716k0788k7162J1448m91N700
13137D3094R019j0214k0502j2248L9727K0772r466k0114R59k314j9483L942Q22
13124B3994R252K8910j0696j6628j1290j2115J3874q33j905j4949K5519J3016
13112D6149j2446k8703k707n072J5424K3988o78q411p184J0880J3724j3922J3326
13099D4368l9323o556K2413J1010J7384O851J1205O449J2728J3216n760k4125
13087F9860l9469j6510L330J2884k3824K3104K2150L531P761J1837J1956Q184
13075I4794j3423l3117q002l9060k280m311J1448J7105R386L4115R762J5600J6237
13062A08254q47n4827l9233K6564J9361k0572j58j361J9957pn580q691j1839l3802
$$ plain form
13150 78128 72740 43551 37502 43251 44987 38648 57671 74387 53599 26437 37885 37394 43094
13137 43094 52113 41899 21397 9149 48876 69648 60182 40068 41027 38713 19230 23172 23994
13124 23994 33246 62156 51460 34832 23542 11427 25301 24468 22563 7614 33133 46149
13112 46149 33703 5000 2293 -2779 12645 36633 35955 27544 20360 31240 44964 31042 44368
13099 44368 5045 -1511 20902 31912 49296 56147 67352 73801 86529 99745 93985 69860
13087 69860 30391 13881 17211 30095 6271 29375 51525 55056 62817 74654 86610 94794
13075 94794 81371 48254 40252 1192 -1088 -5399 6049 23154 32540 66655 76417 92017 108254
13062 108254 107407 52580 13347 39911 59272 38700 38542 37181 57138 57131 51551 42860 31021 -2781
13048b781p461r144n683J4232J3681J2406K7669M4402J679j0111M784j654j5660
13035F6359O949J1675k0847k1950l0158J7622J178p246J4689O88r723j983J3378
13022D0631k469M986K2574Q858R791k0611q766o93o370R448J4827j242L08L342
13008G4614k3670l428j7798r570J7408J7440k9089k4875L197j439O291k871Q943
12995A5153K0151J4511J0352L577k7484p742K1011J0940m032k613R288j0685P691
12982F0118n297Q443K19r091K5676j5197k3832q335m105L1492M254L157K0730
12969H8232L08j4914q998j1281j3130p45L460M837J6199N899k2081j3966m424
12956B9396L0695J3862k7960K325q40J1098P294Q086j1730j2146j5809j0189K9961
$$ plain form
13048 -2781 -10242 -19386 -25069 -10837 2844 15250 42919 87321 89000 78889 83673 82019 66359
13035 66359 73308 84983 64136 42186 12028 29650 30828 23582 38271 38959 29236 27253 40631
13022 40631 38162 43148 65722 74580 84371 63760 54994 54301 47931 57379 72206 70964 71272 74614
13008 74614 50944 47516 29718 20148 37556 54996 25907 1032 4229 2790 9081 6210 15153
12995 15153 35304 49815 60167 63744 36260 28518 49529 60469 56437 53824 63112 52427 60118
12982 60118 54821 63264 63483 54392 80068 64871 41039 32704 28599 60091 64345 67502 88232
12969 88232 88540 73626 64628 53347 40217 39472 42932 47769 63968 69867 47786 33820 29396
12956 29396 60091 73953 45993 48318 47478 58576 65870 73956 62226 50080 34271 24082 54043
12943E4043J4632l514m28j3897k4493j1947K8341L1853j5517k004J1392K737j5034
12930E6164J3168M527k009J2887J932l0974r193M0387p0K16j4593l25o359j7790
12916D7968J8898M369j9052N703N9691M5303l6208k5970O038j1331k8103r352
12904E7954M038Q83J5956j4141o785j085k0315M857m031J0531O664o965j6841
12891C0720J1873J228L7911K3958k2066M677J9367K9768M0782M2209j1042k6579
12879A82806J1533J541r08l0231l1768j6448O384r165j3002j1973K4923l005k4288
12866H6399k0329j9901j6883L4833M3895q320k1868q824N441j6205K418M7804
12854A08460p301k7306N16r630K631p185Q183j302J9822O681J0132J1728K4222
$$ plain form
12943 54043 68675 65161 64733 50836 26343 14396 42737 74590 59073 57069 68461 71198 56164
12930 56164 69332 73859 71850 84737 86669 55695 46502 86889 86819 87035 72442 72117 65758 47968
12916 47968 66866 71235 52183 57886 117577 162880 126672 100702 106740 95409 67306 57954
12904 57954 61992 62875 78831 64690 57905 56820 36505 41362 37331 47862 54526 47561 30720
12891 30720 42593 43821 81732 105690 83624 88301 107668 137436 178218 220427 209385 182806
12879 182806 194339 195880 194972 164741 132973 116525 122909 113744 100742 88769 113692 110687 86399
12866 86399 66070 46169 29286 64119 108014 99694 77826 69002 74443 58238 60656 108460
12854 108460 101159 73853 74369 64739 67370 60185 68368 67066 86888 93569 103701 115429 139651
12841A39651J9411j4688J2776L7602J5827L0162K788K1430M148R833l3542l3928
12829B11470k3488k573J6948N250l957p195M287r03K4945L4711Q59k1391N355
12816B44318K1635n751k7776k5700j5988l4350o231q073l2145R727L693j6188
12804A07171k5460J6387J6238j952J1723j1162J6526L2285K9655L4830L0946k5561
12792B31626J5536M7341N0562Q623J5782P486j5701m8860n2687m656K5309J6710
12780B97071K8128K7376L6201L4638M1265M2348L6083J2297J447k1062m8852n4119
12768D32821p1273m1788l6063k2472P30j0637j3644j5798k199n712j0438l774
12756A99753P196j6390j5221K3530L7257K9963N5137K1416k2786m6536J1356K8376
$$ plain form
12841 139651 159062 144374 157150 194752 210579 240741 243529 264959 269107 278940 245398 211470
12829 211470 187982 185409 202357 207607 203650 196455 200742 199839 224784 259495 260354 238963 244318
12816 244318 265953 260202 232426 206726 190738 156388 150157 142084 109939 119666 123359 107171
12804 107171 81711 98098 114336 112384 124107 112945 129471 161756 191411 226241 257187 231626
12792 231626 247162 294503 345065 353688 369470 376956 361255 312395 259708 255052 280361 297071
12780 297071 325199 352575 388776 423414 464679 507027 543110 555407 556854 535792 486940 432821
12768 432821 361548 319760 283697 261225 261955 251318 237674 221876 219677 213965 203527 199753
12756 199753 206949 190559 175338 198868 236125 266088 321225 342641 319855 273319 284675 313051
12744C13051J7900l0259m1908j8921J2355L4080O107o013M752L5752N6970P1279
12732D55145O2422M4507M9005M1890j448j4290m3614p1577o3880p6753q0428k1771
12720B79208o431j2546k7585r057j053L5156p993K8699K5635K9702L0499M7134
12708D11368O0657Q9934M7717K9628J2788l6052r4035o9369p8600n5852l5606
12697B82578k6090k7961M217L4727J0301J1911J094n097K5446J2367J5863J2185
12685C51541J4292n255n1312j7003J4451O380N324k8589l3155j076o457K0365
12673B69506j9542j24Q972k5051O465M7601K4392M5082N8158N8522P0313N4322
12661E98616M5403L0105J6935k0379r8297j02851p5000j4247j0135j1255n376
$$ plain form
12744 313051 330951 300692 258784 239863 252218 286298 292405 286392 291144 326896 383866 455145
12732 455145 517567 562074 611079 652969 651521 637231 593617 522040 458160 381407 300979 279208
12720 279208 272777 260231 232646 223589 222536 257692 249699 278398 304033 333735 364234 411368
12708 411368 472025 561959 609676 639304 652092 616040 522005 452636 374036 318184 282578
12697 282578 256488 228527 232744 267471 277772 289683 290777 285680 311126 323493 339356 351541
12685 351541 365833 360578 309266 292263 306714 313094 318418 289829 256674 255598 249141 269506
12673 269506 249964 249840 258812 233761 240226 287827 312219 357301 415459 473981 544294 598616
12661 598616 644019 674124 691059 670680 572383 469532 394532 380285 370150 358895 353519
12650C53519k1029j7129J8211J5146M3581L5244N782m569j6270l072k8875n6691
12638C23848k3691L330j0638j3125j7475l0107j1210J2019Q667Q275J682L4127
12626B85702j0234K582J7641j306M121J1203K7957L4049P371L4637p871j1265
12614C94587p005l3939m662r619p829J932L686O045p082n763j1042J8619K4858
12601C62786J6238J0283P456J2936n076m2928l9859m0235l9510k16K9249J8887
12589B90011P867O019m260j8512l380J2038J4825J5055M382q710N854K9827P424
12576C58440j2648m9183m7434l356k2712l5213o715r591L4334K1741J7419J6231
12564B61313J1211L2030K7829j252n756J2537K0601J8747J7598J0490P030j8739
$$ plain form
12650 353519 332490 315361 333572 348718 392299 427543 433325 428756 412486 409414 380539 323848
12638 323848 300157 303487 292849 279724 262249 232142 220932 232951 241618 249893 251575 285702
12626 285702 275468 278050 295691 294385 298506 309709 337666 371715 379086 413723 405852 394587
12614 394587 387582 353643 348981 339362 331533 333465 337151 343196 336114 330351 319309 337928 362786
12601 362786 379024 389307 396763 409699 404623 361695 321836 281601 242091 241875 271124 290011
12589 290011 297878 303897 299637 281125 277745 289783 304608 319663 324045 315335 321189 351016 358440
12576 358440 345792 296609 249175 245819 223107 187894 181179 171588 205922 227663 245082 261313
12564 261313 272524 304554 332383 331131 325375 337912 358513 377260 394858 405348 412378 393639
12552C93639j8065j1137j8331m347r771L991J3755l6794l9649j7535K572Q676
12540B67004J4527o48N3012L4808K3994L1k3764J3443j3213l3372n6436k4546
12528B54840J776K4100o902P306n822R630K2028J4862O36K3962K3229K2001K1552
12515D13198L9573L0150Q049N6633M9027J9986j4800k9950l0204m9457o0805n7376
12503C74024J651J4863R936K4726M7516M6808J7349l980M8342K2541l2321k3587
12491E47868k4543k7982n796K1967p42r549o395j1076k7263j1440J0814n382j551
12478D48930J5563j0818K2377J3019K9833R013J278K3321O2566N4850Q6634R6931
12466H53497P3982M7315J9521P246r420n0324n2714m5470j7940k4040L4558P3100
$$ plain form
12552 393639 375574 364437 346106 341759 331988 335979 349734 312940 273291 255756 258328 267004
12540 267004 281531 280883 333895 368703 392697 392728 368964 382407 369194 335822 279386 254840
12528 254840 256616 280716 273814 281120 275298 284928 306956 321818 322454 346416 369645 391646 413198
12515 413198 452771 482921 490970 547603 596630 616616 601816 571866 541662 492205 431400 374024
12503 374024 375675 390538 400474 425200 472716 519524 536873 532893 581235 603776 571455 547868
12491 547868 523325 495343 489547 511514 510772 501223 494828 483752 456489 445049 455863 450481 448930
12478 448930 464493 453675 476052 489071 518904 527917 529195 552516 615082 669932 756566 853497
12466 853497 927479 974794 994315 1001561 992141 941817 889103 843633 825693 801653 836211 909311
12454I09311J20652J15618R6800Q7655J11211N9620Q559o4858m8460N455M1624
12443A443187P8948J33087J73668K93095M08813N83031R02312J238221J445370
12434F699732J484225J373042J175611R21909N22906l13648j528671k206571j942668
12425F185867j338805p99436m43992k80640j75774j08207n8816o7061r6639j32106
12415B684391j92073j98103j40294o7914j3320M6567J04537J50673J52093J24347
12405B650904J05858P6173N5496N3462J09606J83167K12640L23710M95670O57066
12395D923752R05474J352661K000515L021330M225962N033489N039435M554015
12387C1056633L956064L130642J804192j328208n978920q071638o136824l473974
$$ plain form
12454 909311 1029963 1145581 1242381 1330036 1441247 1500867 1509426 1444568 1396108 1401563 1443187
12443 1443187 1522135 1655222 1828890 2121985 2530798 3113829 4016141 5254362 6699732
12434 6699732 8183957 9556999 10732610 11654519 12177425 11863777 10335106 8128535 6185867
12425 6185867 4847062 4047626 3603634 3322994 3147220 3039013 2980197 2913136 2816497 2684391
12415 2684391 2492318 2294215 2153921 2086007 2072687 2119254 2223791 2374464 2526557 2650904
12405 2650904 2756762 2832935 2888431 2941893 3051499 3234666 3447306 3771016 4266686 4923752
12395 4923752 5829226 7181887 9182402 12203732 16429694 21463183 26502618 31056633
12387 31056633 35012697 38143339 39947531 38619323 32640403 24568765 18431941 14957967
12379A4957967j520365j85223Q99712J964077L057484L707890L724034L376544
12371B9982120K760311J927932N90530j935750n028305o290119n205033l533973
12363A3267713k272747j460087r49090o98194n10361l44396k64088j80392n9746
12354F528612J12237K24412L85226O35494R22903J443978K226803L341780M629368
12345B0450813N402619N290975M787543M170607L322740J806757j866649o455295
12337C6910110p578103m958540j966944L64261K539558N014833Q141400J1346273
12329D9812848J3151512J2813697J1399669R484625O848194K360312p026584j8363323
12321H0480950k1930928j6658466j0409415o333267l886526k529691j694083j102320
$$ plain form
12379 14957967 13437602 13252379 14152091 16116168 19173652 22881542 26605576 29982120
12371 29982120 32742431 34670363 35260893 33325143 28296838 22006719 16801686 13267713
12363 13267713 10994966 9534879 8585789 7887595 7377234 7032838 6768750 6588358 6528612
12354 6528612 6640849 6865261 7250487 7885981 8808884 10252862 12479665 15821445 20450813
12345 20450813 25853432 31144407 35931950 40102557 43425297 45232054 43365405 36910110
12337 36910110 29332007 24373467 22406523 22770784 25310342 30325175 38466575 49812848
12329 49812848 62964360 75778057 87177726 96662351 103510545 105870857 98844273 80480950
12321 80480950 58550022 41891556 31482141 25148874 21262348 18732657 17038574 15936254
12313A5936254o84947k86716K40423R66559J913723K953423L726328L999083L882670
12304C2646800L587470L189769K473911O54361k190777m084564l749483k446530
12296C0080957j388742j038769j666428k346729j974669q57814M31141J799586
12288B3038533L542852N910071Q987541J2029009J3542504J2947156J1399874
12281I1397540R343493O443515J321984q803085j9621516k1630408j5621346r516299
12273C3313878n620630l292337j868006r10864j48806N82353J572209L089322
12265B6717119N358588Q366541J1463158J3162968J2709677J1279148R361262
12258I8418461O721207K143018p541846j8724884k1479932j5888297r869602n909171
$$ plain form
12313 15936254 15251307 14964591 15205014 16171573 18085296 21038719 24765047 28764130 32646800
12304 32646800 36234270 39424039 41897950 42552311 40361534 36276970 32527487 30080957
12296 30080957 28692215 27653446 25987018 23640289 21665620 20807806 21238947 23038533
12288 23038533 26581385 32491456 41478997 53508006 67050510 79997666 91397540
12281 91397540 100741033 107184548 108506532 99703447 80081931 58451523 42830177 33313878
12273 33313878 27693248 24400911 22532905 21622041 21473235 22055588 23627797 26717119
12265 26717119 32075707 40442248 51905406 65068374 77778051 89057199 98418461
12258 98418461 105139668 107282686 99740840 81015956 59536024 43647727 33778125 27868954
12250B7868954l444984j929160q12521J46802P57383J147529J494073K017682
12242B7245758K639383L176200L052895K046948J299193J272050J231002O39530
12234D2602959j058117l999397o236303o064550m379174k729315j543704p09790
12226A5882609r9925M57153J026697J762915K927542M716337P386168J0598541
12218D4658037J3206605J3726319J2537934J0793724Q443178N102432k148732
12211A06319497j4111708k2143663j9491049j2693083p492332m125112j846871
12204B4415679l3124J743681L230620L889370L756387L325823K775962J895246
12196D4999644j30m234061q420727q534179n759321l463542k121798j359504r41582
$$ plain form
12250 27868954 24423970 22494810 21682289 21829091 22586474 23734003 25228076 27245758
12242 27245758 29885141 33061341 36114236 38161184 39460377 40732427 41963429 42602959
12234 42602959 41544842 37545445 31309142 25244592 20865418 18136103 16592399 15882609
12226 15882609 15782684 16239837 17266534 19029449 21956991 26673328 34059496 44658037
12218 44658037 57864642 71590961 84128895 94922619 103365797 108468229 106319497
12211 106319497 92207789 70064126 50573077 37879994 30387662 26262550 24415679
12204 24415679 24382555 26126236 29356856 33246226 37002613 40328436 43104398 44999644
12196 44999644 44999514 40765453 32344726 23810547 18051226 14587684 12465886 11106382 10164800
12187A0164800p02507n24760l86547k81770j83428L5099J94652L70071N51626
12178I237236Q68551J353250K042960K983091L818613M268227M127232L674166
12170C2373326L023784K095934M04340k744208n773898o289607m661116k824694
12162A5603861j351637k08918R13995K245436L637535M696532M784309M264912
12154C4586025L632827K830988J563814j586741o483634r101323p309345m501627
12146A3630984k730807j743762j175823q50993o60054n22101m85002l89338k70951
12137D802153j43905r2108o0848l7284q0454q9935m3993p4850k06901k53719j92338
12126C525818q3077k2905l069J7072J9326N9865J09508J68143K47630L51505N37493
$$ plain form
12187 10164800 9462293 8937533 8550986 8269216 8085788 8120887 8315539 8685610 9237236
12178 9237236 10105787 11459037 13501997 16485088 20303701 24571928 28699160 32373326
12170 32373326 35397110 37493044 37897384 35153176 29379278 23089671 18428555 15603861
12162 15603861 14252224 14043306 14957301 17202737 20840272 25536804 30321113 34586025
12154 34586025 38218852 41049840 42613654 41026913 34543279 25441956 18132611 13630984
12146 13630984 10900177 9156415 7980592 7129599 6469545 5947444 5462442 5073104 4802153
12137 4802153 4658248 4566140 4505292 4468008 4387554 4297619 4253626 4178776 3971875 3718156 3525818
12126 3525818 3442741 3419836 3416767 3433839 3453165 3513030 3622538 3790681 4038311 4389816 4927309
12115D927309Q03074J171495J512269J605529J480838J310882J044921O64962
12107A4521279j06508j386483k478102k476336j730230j123930p25049m96797
12099C997844l38152k41783k22630j58088j34415q8366j9925O9585Q3443N5397
12089C002910M9736J6396J7755K035j01208j92950k05368r2244m3880n1602o4021
12078B337559k2978k144L736N9926N1414L6866N040K1042M5392Q489o7260r5730
12066B381352l4522m0913n4913m3226j4104j1296j2097J4991j7533p140m89K1178
12054B181288p19r878O18L1634L7457M5039O6945N5135P2717P6346p059j4643
12042B534880Q221r4k6341k9114m8332j8770K7365n494J8858O0415M7286L5369
$$ plain form
12115 4927309 5730383 6901878 8414147 10019676 11500514 12811396 13856317 14521279
12107 14521279 14414771 13028288 10550186 8073850 6343620 5219690 4494641 3997844
12099 3997844 3659692 3417909 3195279 3037191 2902776 2814410 2794485 2864070 2947513 3002910
12089 3002910 3052646 3069042 3086797 3088832 2987624 2794674 2589306 2497062 2453182 2401580 2337559
12078 2337559 2314581 2312437 2316173 2376099 2427513 2464379 2469419 2490461 2535853 2544342 2477082 2381352
12066 2381352 2346830 2305917 2251004 2207778 2193674 2182378 2170281 2185272 2167739 2160599 2160110 2181288
12054 2181288 2180569 2170691 2171309 2202943 2240400 2285439 2352384 2407519 2480236 2556582 2549523 2534880
12042 2534880 2543101 2543007 2516666 2487552 2439220 2420450 2447815 2442321 2461179 2521594 2568880 2604249
12030B604249O4651Q5100R8164M5025K9932P085J0937l8726o0884n1368k1574
12019B772591j2319P050L1854R782Q937L114L65L7044J0873Q831K0485M8963K8778
12006B976348m243J5244L4234K9936K9298J3650Q437J7785L9918J6993J642J5350
11994C194592J9948K8471K4479L0206M0822N0070L9499M3581N7102K7574N2431
11983C608775N5526L7107M0849J9993j4761k8210R864J8803J4150R796J3538L8653
11971C824083L4941J0163J0199M815L6768N9750M9026L3148L1863P639K4248O192
11959D132835J141j9571r136R842L4134N7417N4633L7265N2927J0963J9616K592
11947D384658Q379j277J9178K4892Q027L2050L2469R642O781n675K656K4232N8792
$$ plain form
12030 2604249 2668900 2754000 2852164 2897189 2927121 2934206 2945143 2906417 2845533 2794165 2772591
12019 2772591 2760272 2767322 2799176 2808958 2817895 2821009 2821374 2858418 2869291 2878122 2898607 2947570 2976348
12006 2976348 2972105 2987349 3021583 3051519 3080817 3094467 3102904 3120689 3160607 3177600 3179242 3194592
11994 3194592 3214540 3243011 3267490 3297696 3338518 3388588 3428087 3471668 3528770 3556344 3608775
11983 3608775 3664301 3701408 3742257 3762250 3747489 3719279 3729143 3747946 3762096 3771892 3785430 3824083
11971 3824083 3859024 3869187 3879386 3884201 3920969 3980719 4029745 4062893 4094756 4102395 4126643 4132835
11959 4132835 4133976 4114405 4105269 4115111 4149245 4206662 4261295 4298560 4351487 4362450 4382066 4384658
11947 4384658 4393037 4391760 4410938 4435830 4443857 4475907 4508376 4518018 4524799 4519124 4521780 4546012 4604804
11934D604804L8253J6220J7284K3322L5160J3284j4064J3322j9642k9593m2488
11923D655862j1879l406N819r697k6674K0090L2173L5130j0371Q353j1539m4156
11911D639705m7409n9128n2296m5873j6351O535j5168j6404j1827j3243k5828
11900D342713J4480N004k4411m2293k2683J1877k8769n7716l0847J5927M715k0707
11888D167290J2776J6256K1717M796j0383k6395n3625r1593n4830j3999k3824
11877C948186n1304N774N151J0580N5469K8591K2011J7774M0661P670p0655j16290
11865C903618j16802j11653p8476o1329o7567n4746m8821m0245r679j4601m3361
11854C256338n5966l3103k4917j729L0836K4570K1477l0945n6676l5762o5707
$$ plain form
11934 4604804 4643057 4659277 4676561 4699883 4735043 4748327 4734263 4747585 4727943 4698350 4655862
11923 4655862 4643983 4640577 4646396 4636699 4610025 4630115 4662288 4697418 4687047 4695400 4683861 4639705
11911 4639705 4592296 4533168 4480872 4434999 4418648 4425183 4410015 4393611 4381784 4368541 4342713
11900 4342713 4357193 4362197 4337786 4295493 4272810 4284687 4255918 4198202 4167355 4183282 4187997 4167290
11888 4167290 4180066 4196322 4218039 4222835 4212452 4186057 4132432 4040839 3986009 3972010 3948186
11877 3948186 3896882 3902656 3907807 3918387 3973856 4002447 4024458 4042232 4082893 4090563 4019908 3903618
11865 3903618 3786816 3675163 3596687 3535358 3467791 3413045 3364224 3323979 3314300 3299699 3256338
11854 3256338 3200372 3167269 3142352 3140623 3171459 3196029 3217506 3186561 3129885 3094123 3028416
11843C028416n4955j7302J3305k3370k9099l6786n0552j9429k4054o1464k4822
11832B699888K053K527K9214Q154N6720O7535J1495L6129K3295N827o3765j11694
11820B767378j49724j03587o2642n4053l7606j2881l4779m8599k2589J6030R944
11809B266892R423L1718N1964J1385K5020N8800J7575o216o5594j02694p2862
11798B225411p6817r7907o9827k1814m875j7815L917j3919K1113p846m2375k1789
11786A875457p147Q58l4594j8216Q322L593o675j9721k9111k4651l4591k6912
11774A686612l1644k8851l2453q241j0403o113J489l4657K8574M9065P9076P6717
11762A769171L9167L3382M1679O942j0214k5593n1460j13305p7531k9760q3228
$$ plain form
11843 3028416 2973461 2956159 2969464 2946094 2916995 2880209 2829657 2810228 2786174 2724710 2699888
11832 2699888 2701941 2704468 2733682 2741836 2798556 2866091 2877586 2913715 2937010 2942837 2879072 2767378
11820 2767378 2617654 2514067 2451425 2397372 2359766 2346885 2312106 2263507 2240918 2256948 2266892
11809 2266892 2276315 2308033 2359997 2371382 2396402 2455202 2472777 2466561 2400967 2298273 2225411
11798 2225411 2148594 2050687 1980860 1959046 1954171 1936356 1940273 1926354 1947467 1939621 1897246 1875457
11786 1875457 1868310 1869168 1834574 1816358 1824680 1828273 1821598 1801877 1772766 1748115 1713524 1686612
11774 1686612 1654968 1626117 1593664 1585423 1575020 1568907 1570396 1535739 1564313 1613378 1692454 1769171
11762 1769171 1808338 1841720 1883399 1890341 1880127 1854534 1803074 1689769 1612238 1582478 1499250
11751A499250l6921j3382j6176j5285n6P835j9840k6299k514J7876j4473m0416
11739A339599n1849k7277n760m9320n1895k4585j0831P294l636n251K6228J522
11727A144239m2824k1509j9740j3659L3715K7413L2657K9295L609q958J3800l324
11715A174714j0145Q08q244j2651j5968p609j5088m8820m4692j5742k0372O062
11703I82253K6798J2326L2687K0826l793j6854j942j0722l7568l7709n7266m7623
11691H61413j0901k1051l1266r684J8242j7750R112k7208j5999o662K7263J4370
11679G89879k9244k063J7695j3737j0229M666j9200j6318j7865K665K0584k662
11667G24171Q526j8225l2386l1771o83K0526K8558J272k9912j7639L645K3625
$$ plain form
11751 1499250 1462329 1448947 1432771 1417486 1417430 1425265 1405425 1379126 1376612 1394488 1380015 1339599
11739 1339599 1287750 1260473 1254713 1205393 1153498 1128913 1118082 1125376 1121740 1116489 1142717 1144239
11727 1144239 1101415 1079906 1060166 1046507 1080222 1107635 1140292 1169587 1173196 1164238 1178038 1174714
11715 1174714 1164569 1165377 1157133 1144482 1128514 1120905 1105817 1056997 1012305 996563 976191 982253
11703 982253 1009051 1021377 1054064 1074890 1071097 1054243 1052301 1041579 1004011 966302 909036 861413
11691 861413 850512 829461 798195 788511 806753 789003 798115 770907 754908 748246 775509 789879
11679 789879 760635 758572 776267 762530 752301 756967 737767 721449 703584 706249 726833 724171
11667 724171 732697 714472 682086 650315 649632 670158 698716 699988 670076 652437 656082 679707
11655F79707q071k5585k0475q60K1667k882k6897K667j304l4638k2113r128J2556
11642E64644K1261l3630m668n591j946j862j83N893K198j5439N477l70J5872j753
11628E49903N169k524j9385k1078L852J351K108q748j3479j3003j3660j0764R222
11615D68964J4376j1454J0891O156j3241l9672k8324M1783J3428R76J9432j6540
11603D66775r821O630j1072M7499j3631q998J7258j3307j0588k3233k981j851
11591D42680N706M028r818l9858l419K1152j1379l1464m32K7675J3684K6969J818
11578D47342R91R120j5036n7676Q385K2286J5093p252p923K7525j5662r097k2438
11565C95658k855k918q466K56j64K2564K5750l9589l5743m95j2602j9322j3966
$$ plain form
11655 679707 671636 646051 625576 624716 646383 643501 616604 619271 617967 583329 561216 552088 564644
11642 564644 585905 552275 547607 542016 540070 538208 538025 543918 546116 530677 536154 535784 551656 549903
11628 549903 555072 552548 533163 512085 515937 517288 519396 510648 497169 484166 470506 459742 468964
11615 468964 483340 471886 482777 488933 475692 436020 407696 449479 462907 463883 483315 466775
11603 466775 456954 463584 452512 500011 486380 477382 494640 481333 470745 447512 444531 442680
11591 442680 448386 452414 442596 402738 399319 420471 409092 377628 377196 404871 418555 445524 447342
11578 447342 448333 457453 442417 384741 393126 415412 430505 423253 415330 442855 427193 418096 395658
11565 395658 392803 389885 381419 381675 381511 404075 429825 390236 354493 353998 341396 322074 308108
11552C08108J6467K5120K6119Q898j0423j3753j2337K1436K0367j424L7299k0663
11540D05214m328m463j4039q267k9077k156L0869R617j4177J0361R929j1895j4855
11527C62733M22K1895L1928j0473k6736m455O355K770m696m848j0354r326n038
11514C50177J0132K2579j8954q054j6648Q91l737J8203Q810m5428r730J8491K1288
11501C48020m059k5445R491L5465N363J454J5598J1l0852R052M31j595K123j9749
11487C45308L097P232k6405J3175K0182M580N405q301K330P514N219Q256K1847
11474D09439K5452l0209k2496j1890M164p721K2042R053j3971k621K3416Q813
11462D13471J951j3349k681K2224j0437l2765k337K4612J2451K7879L8807q641
$$ plain form
11552 308108 324575 349695 375814 384712 374289 360536 348199 369635 390002 388578 425877 405214
11540 405214 400886 396423 382384 374117 345040 342884 373753 383370 369193 379554 389483 377588 362733
11527 362733 363155 385050 416978 406505 379769 375314 381669 384439 379743 374895 364541 355215 350177
11514 350177 360309 382888 363934 355880 339232 340123 336386 354589 363399 317971 308241 326732 348020
11501 348020 343961 318516 328007 363472 368835 370289 385887 385898 355046 364098 364529 362934 365057 345308
11487 345308 348405 355637 329232 342407 362589 367169 372574 364273 366603 374117 379336 387592 409439
11474 409439 434891 404682 382186 370296 374460 366739 388781 397834 383863 381242 404658 413471
11462 413471 415422 402073 399392 421616 411179 378414 376077 400689 413140 441019 479826 471185
11450D71185J4400L125j0424j4411K8596n192k1540J3775Q893J1130J7077L3747
11438E50361J9122l0897j0769K0029R404k1915k0029j3007J3735L0429J0894k055
11426E55302q504R76J9502O847K0322r560P578K6305K317L826K1858J2656j1304
11413F48121J8830L2319J0999M2589K1465J9998J6403P114J9824L0638K2915M2807
11401I34022K9869K5948M8068K9120L3747Q773K1748M4532M1149M9878M9714O9745
11389A386313N3574N4645M7065R2383N5734R6890J28612J01161J33440J37231
11379B287048J33605J67896K09427K43485K38465K02114K19186K04151K08425
11370D113802K09903K17219J86952J33136N9089N1931j1309q0961q3881j12543
$$ plain form
11450 471185 485585 488710 478286 463875 492471 487279 465739 479514 488407 499537 516614 550361
11438 550361 569483 538586 527817 547846 557250 535335 515306 502299 516034 546463 557357 555302
11426 555302 546798 547774 567276 574123 594445 584885 592463 618768 621085 624911 646769 659425 648121
11413 648121 666951 699270 710269 752858 774323 794321 810724 817838 837662 868300 891215 934022
11401 934022 963891 989839 1037907 1067027 1100774 1109547 1131295 1175827 1216976 1266854 1316568 1386313
11389 1386313 1439887 1494532 1541597 1633980 1689714 1786604 1915216 2016377 2149817 2287048
11379 2287048 2420653 2588549 2797976 3041461 3279926 3482040 3701226 3905377 4113802
11370 4113802 4323705 4540924 4727876 4861012 4920101 4972032 4960723 4879762 4795881 4683338
11360D683338j32481j55203j63133j36760j22185j12465j26738r5708n3783j4713
11350C570169l7188k4670j673K6462N3592R4333Q4473Q4360J04762J53665J92784
11339D301069K30466K52667K73679L26636L54363L86793M26349M97354N22915
11330G572291N55071O38827O52326O44267O49673O58704O45825N89273M75821
11321A3082078L12659J35110l1056j74529k93188m13021n31913n90647o09388
11312A0886105o14406o11831n79630n24342m69585m49998l84004l10881k93777
11303F647651k59401j87611j51420j39900j17640p6335j5409L3697L9524Q6472
11293E859628J50600J72301K27248L02389L65759L92159M40675M83004N03163
$$ plain form
11360 4683338 4550857 4395654 4232521 4095761 3973576 3861111 3734373 3638665 3584882 3570169
11350 3570169 3532981 3508311 3506638 3533100 3586692 3681025 3765498 3849858 3954620 4108285 4301069
11339 4301069 4531535 4784202 5057881 5384517 5738880 6125673 6552022 7049376 7572291
11330 7572291 8127362 8766189 9418515 10062782 10712455 11371159 12016984 12606257 13082078
11321 13082078 13394737 13529847 13498791 13324262 13031074 12618053 12086140 11495493 10886105
11312 10886105 10271699 9659868 9080238 8555896 8086311 7636313 7252309 6941428 6647651
11303 6647651 6388250 6200639 6049219 5909319 5791679 5715344 5699935 5733632 5773156 5859628
11293 5859628 6010228 6182529 6409777 6712166 7077925 7470084 7910759 8393763 8896926
11284H896926N31349N53044N89351N99478N93649N68475N50195N04950L90812
11275A3778229K58440P3481r8726k30536l63849m88688n89952o85273o93840o92250
11265A0267036o92437o55058n87302n32084n06689m97738m02198l57526l19294
11256E716710l09624k66559k14259j64278j60467j53079j43231j13867m9094m8221
11246D094031k0979j6021N2245P8793J26751J42140J35357J20733J62365J46794
11236E022209J42012J07776P1599M8579O0690R7185P6806M5841o4621q2590j15150
11225E410336j57998k08560k47665k58327k44538k28656k41332k32022k33830
11216C357408k07401j98058k14634j58518j66144j44535j05356j03992r4564p2586
$$ plain form
11284 8896926 9428275 9981319 10570670 11170148 11763797 12332272 12882467 13387417 13778229
11275 13778229 14036669 14110150 14011424 13780888 13417039 12928351 12338399 11653126 10959286 10267036
11265 10267036 9574599 8919541 8332239 7800155 7293466 6795728 6393530 6036004 5716710
11256 5716710 5407086 5140527 4926268 4761990 4601523 4448444 4305213 4191346 4142252 4094031
11246 4094031 4073052 4057031 4109276 4188069 4314820 4456960 4592317 4713050 4875415 5022209
11236 5022209 5164221 5271997 5343596 5392175 5452865 5550050 5626856 5672697 5608076 5525486 5410336
11225 5410336 5252338 5043778 4796113 4537786 4293248 4064592 3823260 3591238 3357408
11216 3357408 3150007 2951949 2737315 2578797 2412653 2268118 2162762 2058770 1964206 1891620
11206A891620p8504j00528r8410n2594j8832n6601q6476m0192J3140n243m0506
11195A326874k0141K105j6667r35l1101n4164m1249m7552q4135n5378n6610m8631
11183H72416j2555j6192l4205l2624j1254k9578m4862r644n383l3151k3316K517
11171F22169k5158j0565J458j9809K0180k1252l0523N452L7665j481k0703j8300
11159E39133k8278j3759l917N307J5071k2854j312M0071K6754l3053j6727o96
11147E05740J1012p115J3956J715l1207j2018O476o2311m7526O799J0486j1391
11135C84616J5801j211N738j146l0269k7255O493N853j3840k0152l1901k0648
11123B72079l863j4945K7345L111N600j9292j3071J2838J2419L3720j7258j9243
$$ plain form
11206 1891620 1813116 1712588 1614178 1561584 1542752 1486151 1399675 1359483 1372623 1367380 1326874
11195 1326874 1306733 1308838 1292171 1291236 1260135 1205971 1164722 1117170 1033035 977657 921047 872416
11183 872416 859861 843669 809464 776840 765586 736008 691146 681502 676119 642968 619652 622169
11171 622169 597011 586446 587904 568095 588275 567023 536500 541952 579617 578136 557433 539133
11159 539133 510855 497096 493179 498486 513557 490703 489391 529462 556216 523163 506436 505740
11147 505740 516752 509637 523593 525308 494101 482083 488559 426248 378722 385521 396007 384616
11135 384616 400417 399206 404944 403798 373529 346274 352767 358620 344780 324628 292727 272079
11123 272079 268216 253271 280616 283727 289327 270035 256964 269802 282221 315941 298683 279440
11111B79440r987J3733L0375j4102k3208j2631k179J5786j7370r310J8000j7704
11099B50843m6485M176K3426J7808J7994m279N693j1594j7857l719J3031n7j0897
11086B38083l911m840j5776j7216Q046j9155J9121J1605k4343j3943J5888J6847
11074B10406j697j5961k8658k0716K3183N6549K6435j4361k0549l591M932k5256
11062A90716l2939j8557j2068o937q40o622L1018K5411j8707j5393m403J7149
11050A47828J563j185L3033J4776j0760k61j0824K7209K8772R803k5994K380J5671
11037B32011J8785j5068O502J9816j7341K4476J0222k6098l4554J7655K023Q596
11025B47025L8072J8695n501j3947l2752n812k9184m2530K3551K9495J471n066
$$ plain form
11111 279440 269453 283186 313561 299459 276251 263620 261441 277227 259857 250547 268547 250843
11099 250843 204358 208534 231960 249768 267762 263483 269176 257582 239725 236006 249037 248980 238083
11086 238083 234172 229332 213556 196340 204386 185231 204352 215957 191614 177671 193559 210406
11074 210406 208709 192748 164090 143374 166557 223106 249541 235180 214631 211040 215972 190716
11062 190716 157777 139220 127152 120215 119375 112753 143771 169182 150475 135082 130679 147828
11050 147828 149391 148206 181239 196015 185255 184994 174170 201379 230151 239954 213960 216340 232011
11037 232011 250796 235728 242230 262046 244705 269181 279403 253305 218751 236406 238429 247025
11025 247025 285097 303792 298291 284344 251592 245780 216596 174066 197617 227112 228583 223517
11013B23517k8839k655O939q736n613k8870k0673Q729k665J3365K6366r716O402
11000A77551p394l6925M133n331Q952r054j1530k2898j0819q284J5490J9871j8241
10987I5521p452K6595N774k2333J4779J3438J3492l053j7004k5722m0987L820
10975E6868O957k5293n494Q197K380K0438m781J3608N170q867p970J2152M0073
10962A13438J621j1896l1163n191Q705J34j1772J4367m99r020n752J4327n61j3927
10948F2811J7848j7230j5638n933J5452M939J8518Q980R908K328O653k8966j2685
10935F6985K6650m014j044j1229q302J3017J0634K2361j1347l622p208J2187j5430
10922H9638k425J2462j778K7107J6302J2028j2767k1658k2796k6906n106O992
$$ plain form
11013 223517 194678 192023 198962 190226 184613 155743 135070 143799 141134 154499 180865 171149 177551
11000 177551 170157 133232 137365 132034 140986 131932 120402 97504 86685 78401 93891 113762 95521
10987 95521 88069 114664 120438 98105 112884 126322 139814 136761 119757 94035 53048 56868
10975 56868 63825 38532 33038 41235 43615 64053 59272 72880 78050 69183 61213 73365 113438
10962 113438 115059 103163 72000 66809 75514 75648 63876 78243 77744 68724 62972 77299 76738 62811
10948 62811 80659 63429 47791 41858 57310 62249 80767 89747 99655 101983 108636 79670 66985
10935 66985 93635 89621 88577 77348 69046 82063 92697 115058 103711 100089 92881 105068 89638
10922 89638 87213 99675 97897 125004 141306 153334 140567 118909 96113 69207 64101 71093
10910G1093P447p133L056O66Q759J443l5303J3231J8364K4594K0833R131K0281
10897A56462M368k3682J1592O082l1468l5766J0700J9802k5755q164J489j0078
10885G5582m775K0370J4509J4613J232l115j2494r626J1046n14J8926L477r348
10872A19883l988j0334K224J2033K9741k2933j3681J275J7723k1075k0576j2841
10860G7451J1002o181Q487J2160J1748R28J3718P083l1156o366M456J3456R783
10847A26569J294j0811r997j5161O509m37k393L220J0348J7736q085q682k6417
10834H3693q514K5002M1185M546n140p943k1652q972L0799J6357k4648j2304k3088
10821H9321j3627m066L2603J2509j33p684K5305k825j4062k9119k3831q347J8826
$$ plain form
10910 71093 78540 71407 74463 75129 83888 85331 50028 63259 81623 106217 127050 136181 156462
10897 156462 160830 137148 148740 154822 123354 87588 98288 118090 92335 84171 85660 75582
10885 75582 70807 91177 105686 120299 121531 118416 105922 96296 107342 106828 125754 129231 119883
10872 119883 115895 105561 107785 119818 149559 126626 112945 114220 131943 110868 90292 77451
10860 77451 88453 82272 90759 102919 114667 115595 129313 136396 105240 98874 103330 116786 126569
10847 126569 127863 117052 107055 91894 98403 97966 95573 98793 109141 126877 118792 110110 83693
10834 83693 75179 100181 141366 145912 140772 132829 111177 102205 133004 149361 124713 112409 89321
10821 89321 75694 71628 104231 116740 116607 108923 134228 131403 117341 88222 64391 56044 74870
10808G4870P786p300q794N469K40j6824j8701l863K0671O2446M572j0203j5040
10795I5329p139k5693l9514j6073L1062N308M1248J5432n403p035k4245l9944
10783B3333J6181Q555J6110R038j1399o201J394J609K1775K6728j6358k9919J0372
10770G1218K2525k1752j3553m297L3226m5r654J0241J9267k4889q992j9183K958
10757E7070O432L558j3068j2158j5850K6033J8984j1712k9908r928J0444L3531
10745F3428O3876K1615l1771p137j9312j9297j4676L443n295k0663m289L2222
10733F2144p49L0407L5064j0762N237m504k3708j0419o391O062p460J8395K5294
10720A18610J9615J2810J3465r327R67P258j255N512q30j2244m2027J2680L2446
$$ plain form
10808 74870 82656 75356 66562 72031 72271 55447 36746 32883 53554 116000 120572 110369 95329
10795 95329 88190 62497 22983 6910 37972 43280 84528 99960 94557 87522 63277 23333
10783 23333 39514 48069 64179 73217 61818 55617 57011 58620 80395 107123 90765 60846 71218
10770 71218 93743 71991 58438 54141 87367 87322 77668 87909 107176 82287 73295 54112 57070
10757 57070 63502 67060 53992 41834 25984 52017 71001 59289 29381 19453 29897 63428
10745 63428 127304 148919 117148 110011 90699 71402 56726 60169 54874 34211 29922 62144
10733 62144 61395 91802 126866 116104 121341 116837 93129 82710 76319 82381 74921 93316 118610
10720 118610 138225 151035 164500 155173 156140 163398 162143 167655 166825 154581 112554 125234 157680
10707A57680Q571k4566l585M419q898q393K5330J4824j257q028p113k426K0941
10694A67499M161j1121L1954L716k6981K857J2996k0644r535n1Q396j617J1041
10681A72671j7259k1667J1651J7298O229J0563L9627L569m8097l9469J0393j694
10669A43815j4460K5926L4830R922o011J2240J3272K5469L3427L74j4609j5248
10657B48947l6315k2398L0078K1971K502K1724K0028L668j0307J0678J153J0187
10645C01916J9406J4707L1926J5339J2299K9073N0972M3631L1513P2525L4821
10634F58128L1266N7920Q6361N8733R1474J40408J64574K20103L01166L87912
10624B198045M85474O59054Q02672Q60818Q88069Q60889P80085N88786L85610
$$ plain form
10707 157680 166251 141685 138100 142519 133621 125228 150558 165382 164125 156097 148984 146558 167499
10694 167499 171660 160539 192493 196209 169228 172085 185081 164437 154902 154851 163247 161630 172671
10681 172671 155412 133745 145396 162694 168923 179486 219113 222682 174585 135116 145509 143815
10669 143815 129355 155281 190111 200033 194022 206262 219534 245003 278430 278804 264195 248947
10657 248947 212632 190234 220312 242283 244785 266509 286537 290205 279898 290576 291729 301916
10645 301916 321322 336029 367955 383294 395593 424666 475638 519269 550782 623307 658128
10634 658128 689394 747314 833675 892408 983882 1124290 1288864 1508967 1810133 2198045
10624 2198045 2683519 3342573 4145245 5006063 5894132 6755021 7535106 8123892 8509502
10615H509502J54487o845J08009M37644Q08524J165607J419373J485036J424154
10606A5505491J234120Q40822K57977m31571q26447o64012m0830O82834J278007
10597A7836391J625173J647817J438914J055792M12143n16680j597095k165742
10589A9736713j994040j285818n16857N5534M50899N84608M59794J80512k45041
10580A7426304q92992j563886j893437j700550j223064p38264l50218j41992o6085
10571H855816o6933k03555m14890o83156r61974j055883r63788q23330o20713
10562C061594m36481l18358k46498k12400j62472j20628j07405j05363r1838j01283
10552A158868r7022n0549k9956n9393l1959k0033m6082o0742l7083j2774N519
$$ plain form
10615 8509502 8663989 8657144 8765153 9202797 10011321 11176928 12596301 14081337 15505491
10606 15505491 16739611 17580433 17838410 17406839 16580392 15916380 15875550 16558384 17836391
10597 17836391 19461564 21109381 22548295 23604087 24016230 23499550 21902455 19736713
10589 19736713 17742673 16456855 15939998 15995532 16446431 17031039 17490833 17671345 17426304
10580 17426304 16533312 14969426 13075989 11375439 10152375 9414111 9063893 8921901 8855816
10571 8855816 8788883 8585328 8170438 7487282 6525308 5469425 4505637 3682307 3061594
10562 3061594 2625113 2306755 2060257 1847857 1685385 1564757 1457352 1351989 1260151 1158868
10552 1158868 1061846 1011297 981341 921948 889989 869956 823874 763132 726049 713275 718794
10541G18794l6042n3313j8958l1954m7732j7162k7954k4079k1948O216m462k8509
10529D12897m0938j6507j9680Q697J039J845l0587N929j57j1438n587p274p944
10516B90295l9528r939l499n274R114N745M251M113l1907k2650k772j5039j1736
10503A71174k4022n707P99L1375K0191k7616n5811o975L3804J2424p603K8720
10491A70753K4796K813j9694j0383j1423k1813J4467N4773L242J9098N822j7279
10479B15172J2528M7693J9599j2934j1224k3782k9014k39P941J2919Q536K0715
10467B67910n040r11j778l0136j9697J5668m687j0345K12J3720R430J6259l4221
10454B16384k8743j8768j5j04n987j2747o163J2997k959k2621j5975q986J5254
$$ plain form
10541 718794 682752 629439 610481 578527 530795 513633 485679 461600 439652 445868 441406 412897
10529 412897 371959 355452 335772 344469 345508 347353 316766 322695 322538 311100 305513 298239 290295
10516 290295 250767 240828 237329 232055 241169 246914 251165 255278 223371 200721 197949 182910 171174
10503 171174 147152 141445 142244 173619 193810 166194 110383 103408 137212 149636 142033 170753
10491 170753 195549 198362 178668 168285 156862 135049 149516 204289 207531 226629 232451 215172
10479 215172 227700 275393 294992 282058 270834 247052 218038 217799 225740 238659 247195 267910
10467 267910 262870 261959 260181 230045 210348 226016 221329 210984 211196 224916 234346 250605 216384
10454 216384 187641 168873 168858 168754 162767 150020 143857 156854 153895 131274 115299 106313 121567
10441A21567Q053j2992j6216j295J3270J6996l545m3273j1040j0591k5444J1189
10429D6679J1735K7853j4268k5077L7855J1539m1213k3211m483K261L108l3370
10417e92j2853K9145K2734q055L854K7590j4363j5665o004q355m699J2826K634
10404B8197Q841L075O061o116j7788k3288K3018J8590k2706q186R514J5111J125
10391C5448J2780j8099K510J7917j1699p770l912J6571N77j6831J336r674k3922
10378d768J0382R948K2094k3768o385J7364k7259R518M1194n459j3204o489m71
10365B2697R952p151k0274J3445K2894k4574l8310J2738K1896J6908P411j6258
10353B1374j8413Q400R046J0026J4456j4553j4858R510j036p871j6958J4483k484
$$ plain form
10441 121567 129620 116628 100412 99117 112387 129383 125838 82565 71525 60934 35490 46679
10429 46679 58414 86267 71999 46922 84777 96316 55103 31892 27409 29670 32778 -592
10417 -592 -13445 15700 38434 30379 34233 61823 47460 31795 25791 17436 12737 25563 28197
10404 28197 37038 40113 46174 40058 22270 -1018 22000 40590 17884 9698 19212 34323 35448
10391 35448 48228 30129 32639 50556 38857 31087 27175 43746 44323 27492 28828 19154 -4768
10378 -4768 5614 15562 37656 13888 7503 24867 -2392 7126 48320 42861 29657 23168 22697
10365 22697 32649 25498 5224 18669 41563 16989 -21321 -8583 13313 30221 37632 21374
10353 21374 2961 11361 20407 30433 44889 30336 15478 24988 23952 16081 -877 13606 11122
10340A1122m757M837J6841J5059j1256l0542N004J8577n59j6760j3835j1747J5341
10327b675Q695P943J3273k703r093J993l459l4288j1972L3632K10k32J8598L853
10313B3775j1445j1739j5772L779J6350K1953J0546m180k0189J4506l5193j2685
10301b0294J5062K0724K449j2051l6009J1394J6947J2059q318k3249J820K7941
10289H475J5523r220L214J6845l0143r702l678j654J8479L835k2499j1627k5676
10276d7828J3083J0496j7337j5104L1495K8773J444k0215J0721M5355P860j5124
10264C3619Q850J297j2432P299Q809k3970j6634K0810O855j1992k7709q456N710
10251g944L1121n211j3009l5505K700M8089O09n123j0861k1090L941J4267k502
$$ plain form
10340 11122 6365 11202 28043 43102 31846 1304 6308 24885 24326 7566 -6269 -18016 -2675
10327 -2675 6020 13963 27236 24533 15440 17433 13974 -20314 -32286 1346 1556 1324 19922 23775
10313 23775 12330 591 -15181 -11402 4948 26901 37447 33267 13078 27584 -7609 -20294
10301 -20294 -5232 15492 17941 5890 -30119 -18725 -1778 10281 1963 -21286 -19466 8475
10289 8475 23998 14778 17992 34837 4694 -5008 -8686 -10340 8139 11974 -10525 -22152 -47828
10276 -47828 -34745 -24249 -41586 -56690 -25195 3578 5022 -15193 -4472 40883 48743 33619
10264 33619 42469 43766 31334 38633 47442 23472 6838 27648 34503 22511 -5198 -13654 -7944
10251 -7944 23177 17966 4957 -30548 -27848 20241 20850 15727 4866 -16224 -12283 1984 -518
10238e18j2102l547N687K1406L1028Q620j404l5136k1374j1030O835K8855J8309
10225C5629j613J0322j225n3569j8085k3166j2223J5635Q921j660K1915o898n670
10212c1687q184o555K2952O677J4101l689K5216L428K6367J0970r809j0853k2617
10199A6317j0594j4041p414J9849K3877j1906M349J3l0102J077O577k6546J1097
10186a7447L613L6507l963J1394j0405j9876R827K0919J4807j3497k9571N565
10174G873J9604N0320J4914N952J2813p988N98K2195j54j4526j8539M804Q917
10161A06783K1449L8233J7751P19n909l209j5823L195j4457k3048q568k3151J436
10148I5401J869n910K14K2050N24J2204p258M342j2874l0821m1402o22j5258l225
$$ plain form
10238 -518 -12620 -16167 -10480 10926 41954 50574 49170 14034 -7340 -18370 -11535 17320 35629
10225 35629 34016 44338 43113 -10456 -28541 -51707 -63930 -48295 -39374 -41034 -19119 -26017 -31687
10212 -31687 -39871 -46426 -23474 -16797 -2696 -6385 18831 22259 48626 59596 49787 38934 16317
10199 16317 5723 -8318 -15732 4117 27994 16088 20437 20450 -9652 -8575 -1998 -28544 -17447
10186 -17447 -13834 22673 18710 30104 19699 -177 9650 30569 45376 31879 2308 7873
10174 7873 27477 77797 92711 98663 111476 103488 104086 126281 126127 111601 93062 97866 106783
10161 106783 128232 166465 184216 184935 179026 175817 159994 163189 148732 125684 117116 93965 95401
10148 95401 97270 91360 91574 113624 114148 126352 119094 123436 110562 79741 38339 37717 22459 19234
10134A9234J1967K4190L251k3448R542K2657m146l7890q907L775J8651K863j8826
10121B2913j8381j0877J1454j1773q329Q862K3908L263l88k102J4853O925J0902
10108E1230j5954k0229p515p702p836J2357P457J0591P7k1451k0079j3039j8460
10095e0553j1482K2695M5702K2542J1782K731j0456j5803k0915m096L2375R405
10083C3927o814J3485m797j9880l12J1813o844J074n353R749P177j7169j5468
10070E88J2856Q073j6238L982j3639j5234P48k2033j1121k826J3924K5585J1944
10057c391M357j4335j0228P62L4398L1829l1688n3903q003J7185O617K0919L2799
10044B7318J6570q700l2681j9407P79j9P400J5705K3484o921k1453L229K5969
$$ plain form
10134 19234 31201 55391 58642 35194 44736 67393 63247 25357 16450 20225 38876 41739 22913
10121 22913 4532 -6345 5109 -6664 -14993 -6131 17777 21040 20652 18550 33403 40328 51230
10108 51230 35276 15047 7532 -170 -8006 4351 11808 22399 22476 1025 -19054 -32093 -50553
10095 -50553 -62035 -39340 6362 28904 40686 43417 32961 17158 -3757 -7853 24522 33927
10083 33927 27113 40598 35801 15921 15609 27422 20578 21652 16299 26048 33225 16056 588
10070 588 13444 21517 5279 9261 -4378 -19612 -18864 -40897 -52018 -54844 -40920 -15335 -3391
10057 -3391 966 -13369 -23597 -22835 11563 43392 11704 -42199 -50202 -33017 -26400 -5481 27318
10044 27318 43888 35188 2507 -16900 -16121 -16140 -8740 6965 30449 23528 2075 5304 31273
10031C1273k1419k1044n746K313k098L0614R877Q021j778l3188J418P229j7541
10018a2069j4338P787J0835R421k494n142K1915j2827J0194l2850k9548J0099
10006c9017m563K0153K7887L945L347m906k52n324j0744j3908J0059P327K2350
9993A6354J4350j3898J492J6n697o88m740j3928J2195k2798j6331l722O292L2545
9979A442r978J516k560k6733l0226O28L9759K7880Q885J1650j3552k8296k0229
9966c9814N61J8481M8241K9806j8700k8643J5653J8142j2012j2618k5540j418
9954g861J985P633k2716l68J5092k541J671o493J5582j043p622J0051j9187n023
9940b0840k423L0165N805J1987K9187K5404r673O10N837L115l6467m4124R029
$$ plain form
10031 31273 9854 -11190 -16936 -14623 -16721 13893 23770 31791 30013 -3175 -1757 5472 -12069
10018 -12069 -26407 -18620 -7785 1636 -858 -6000 15915 3088 13282 -19568 -49116 -39017
10006 -39017 -43580 -23427 4460 8405 11752 6846 6594 1270 -9474 -23382 -13323 -5996 16354
9993 16354 30704 16806 18298 18314 12617 11929 7189 -6739 5456 -17342 -33673 -37395 -31103 1442
9979 1442 -8536 -7020 -9580 -36313 -66539 -65911 -26152 1728 10613 22263 8711 -19585 -39814
9966 -39814 -39253 -20772 27469 57275 38575 9932 25585 43727 31715 19097 -6443 -7861
9954 -7861 -5876 1757 -20959 -21327 -6235 -8776 -7105 -13598 1984 941 -6681 3370 -15817 -20840
9940 -20840 -23263 6902 12707 24694 53881 79285 69612 70222 76059 79174 42707 -1417 7612
9927G612J9841Q508m246J03P23R08k374j9549j0402p341j4965K0600K3397o152
9913A6663J95l5745k4129O557Q356K3723J9982L3301m479l3531k0588Q10P919
9900i66m092K0927J2513k2206k0409j5331k3208m368J9833K1733j1400j8965l3638
9887g9577J8789N4453k509j1075q992P826j1282l9677Q612M2637L5599M311k3407
9874d292L13J0481r137j4085m5613J5578L0432K450J9935L2910N378J913o876
9861C9387k2460j5425k6082j0450K020k1591j163K5129J7655J0889Q221J583j9943
9848a2230r981R924M1480J4135j5789L69r010J0500M656R007j2060J6464K568
9835E0033k9414k7076k461J7791J8017J535p906k1234L8355q374l3957q572O124
$$ plain form
9927 7612 27453 35961 31715 31818 32541 33449 31075 11526 1124 -6217 -21182 -582 22815 16663
9913 16663 16858 -18887 -43016 -36459 -28103 -4380 15602 48903 44424 10893 -9695 -8885 -966
9900 -966 -5058 15869 28382 6176 -14233 -29564 -52772 -57140 -37307 -15574 -26974 -45939 -79577
9887 -79577 -60788 -6335 -8844 -19919 -28911 -21085 -32367 -72044 -63432 -20795 14804 19115 -4292
9874 -4292 -3979 6502 -2635 -16720 -62333 -46755 -16323 -13873 6062 38972 44350 46263 39387
9861 39387 16927 1502 -24580 -35030 -33010 -54601 -55764 -30635 -12980 -2091 6130 7713 -12230
9848 -12230 -22211 -12287 29193 43328 27539 27908 18898 29398 34054 43061 31001 47465 50033
9835 50033 20619 -6457 -8918 8873 26890 28425 20519 -715 37640 29266 -4691 -13263 -7139
9822g139J9097k305K969J8414J2030j4383q411j2861N110J3551o924R355q174
9809B0329K871Q735J793m217k5914j141J565r901l947j378j6370j3160K103r451
9795d8083J0818R105J570J7668L6138L884J0737J0910l63j9413k9269q485L239
9782a544j1574J1093J6984J3221J7799k467k2775K9909l521M994l1855j8237o314
9769d287J1769K65K465j8501O605j5667L3874J9676o238r389l805j3092k616r258
9755h199q536m106j014K5122J5162l627J3903j375m325j115l64M314L842j4514
9741A5168K2615n917j9647l283K20n681j1237j2025O312J3833l2424k1776J0074
9728d3768J8569p365Q301l928J0707K9627j890K541j4474j5635K790J5187j069
$$ plain form
9822 -7139 11958 9653 12622 31036 43066 28683 20272 7411 12521 26072 19148 28503 20329
9809 20329 23200 31935 33728 29511 3597 2456 4021 -5880 -9827 -11205 -27575 -40735 -38632 -48083
9795 -48083 -37265 -28160 -26590 -8922 27216 31100 41837 52747 52384 32971 3702 -4783 -1544
9782 -1544 -13118 -2025 14959 28180 45979 43512 20737 50646 47125 52119 20264 2027 -4287
9769 -4287 7482 7747 10212 -8289 -1684 -17351 16523 36199 29961 20572 16767 3675 1059 -8199
9755 -8199 -16735 -20841 -21855 3267 18429 14802 28705 27330 23005 21890 21526 25840 29682 15168
9741 15168 37783 31866 12219 8936 9156 3475 -7762 -19787 -13475 358 -32066 -53842 -43768
9728 -43768 -25199 -32564 -24263 -28191 -17484 12143 10253 12794 -1680 -17315 -14525 662 -407
9715d07j9098j8852l921J1785K6684L767J4212p790k1509J731q848J9863L0397
9702B8014j589K2937r747l9059k3293o290L3516K6262l444j503Q606J808o832
9689B9386p865p654J7259j0468k1875p853J2348r244J3059p190n884n598j7846
9676b9425K804K1727K3838j8435l3348j937K1142K041k1800n97L1002R093j6405
9663a0300l069l968m922j4898K6496M6316J6154J1436M5734L8879L0207Q40K1905
9650B00810J5094M5426M1534k3983r2048p9372l6898k0957k990j6664j0493N082
9638B4541L1335J2409k7210l5783q476K3464K2968j0548j1459O994o090l6035
9626a3890R685J0738j4107k0666j0852J3896J8623J8133n923k8599M647P900L7340
$$ plain form
9715 -407 -19505 -38357 -42278 -30493 -3809 -42 14170 6380 -15129 -13398 -22246 -2383 28014
9702 28014 26425 49362 39615 556 -22737 -29027 4489 30751 27307 25804 34410 36218 29386
9689 29386 21521 13867 31126 20658 -1217 -9070 3278 -5966 7093 -97 -5981 -11579 -29425
9676 -29425 -26621 -4894 18944 509 -32839 -34776 -13634 -11593 -33393 -33990 -2988 6105 -10300
9663 -10300 -13369 -17337 -22259 -37157 -10661 35655 51809 63245 108979 147858 178065 178905 200810
9650 200810 215904 261330 302864 278881 186833 107461 70563 49606 46616 29952 19459 24541
9638 24541 55876 68285 41075 5292 -3184 20280 43248 32700 21241 28235 22145 -13890
9626 -13890 -4205 6533 -7574 -28240 -39092 -25196 -6573 11560 5637 -22962 -18315 -10415 26925
9613B6925O655j5827r667m165j717J2562O236l003l5533j0994j6399L2776M9302
9600C7151J5784J8757j1963k2715j1470j9333J6275M473q696j8717L596Q461K6452
9587C8055J5568k7822l2958k7950M147K7995M53k3891l035J5960p035j3814J2970
9574b1357o339o810R892K8186N605k966k3244j1629n33J7886K3186k9818j9552
9561c7493J3304L2671k346j1347M0891J5686k3990l0123K712P582k2803J0537
9549d719K8557p961L619m116j5374K2023K0547l2106j578L5710O853k2645r809
9536A9001L175j0318L484j8028k6673l953j784K085M2699R467J0913N949k3457
9523A2560J4782N421k2559K1904j3371j3963K670J76j37R958Q689K0012j429J434
$$ plain form
9613 26925 33580 17753 8086 3921 2204 14766 21002 17999 -17534 -28528 -44927 -12151 37151
9600 37151 52935 71692 59729 37014 25544 6211 22486 26959 18263 -454 3142 11603 38055
9587 38055 53623 25801 -7157 -35107 -30960 -2965 -2512 -26403 -29438 -13478 -20513 -34327 -21357
9574 -21357 -27696 -34506 -24614 3572 9177 6211 -17033 -28662 -29195 -11309 11877 -17941 -37493
9561 -37493 -24189 8482 6136 -5211 35680 51366 27376 -2747 -35 7547 -15256 -4719
9549 -4719 23838 15877 19496 15380 6 22029 42576 10470 8892 44602 51455 28810 19001
9536 19001 22176 11858 15342 -2686 -29359 -33312 -35096 -33011 9688 19155 30068 36017 12560
9523 12560 27342 32763 10204 32108 18737 4774 7444 7620 7483 17441 26130 46142 44713 46147
9509D6147r881k4842K142J0131l752l681k3856o854J1110P184J0187j1871J599
9496C763p194M562J7585p940l0744j852L4652J7382k6565j0475J368R385O213
9483A0140N839k7109k0584M0251J35k292o884J6727K8967N44j7115j7574O613
9470A7658J6142j0935m2225j9927L481J3987M0392K1669k968p649p237K6140J8442
9457F6970j0642j3019j8881l181j3566j6125Q970K9458K0547o986j3876J1194
9445D0863K0468J3736k2933N862n766r996k9940j3811J8879J6815J0330J1575
9433E6082L6365o769j2232K4076k3917k02p360j0450L7816J4359j0185j1244k2956
9420F3383j2404j4077l1503j2620j7377m10J4106L7707l49k0311j347k1763o332
$$ plain form
9509 46147 36266 11424 13566 23697 19945 16264 -7592 -14446 -3336 3848 14035 2164 3763
9496 3763 -3431 1131 18716 10776 -19968 -21820 12832 30214 3649 -6826 -5458 3927 10140
9483 10140 15979 -11130 -31714 8537 8672 6380 -504 16223 45190 45734 28619 11045 17658
9470 17658 33800 22865 -19360 -39287 -35806 -21819 18573 40242 37274 29625 22388 48528 66970
9457 66970 56328 43309 24428 21247 7681 -8444 526 29984 50531 43545 29669 40863
9445 40863 61331 75067 52134 57996 52230 42234 12294 -1517 17362 34177 44507 56082
9433 56082 92447 85678 73446 97522 73605 73403 66043 55593 93409 107768 97583 86339 63383
9420 63383 50979 36902 5399 -7221 -24598 -25008 -10902 26805 26456 6145 4798 -16965 -23297
9407b3297P356j5492P729Q882q762k1438q002L889J5389J4400K832j8369R059
9394b5824L5021J6224j8758k5405J4190K239r086R727K8954K302j2698N970Q995
9381C1851K1877Q859O773m607j3233l1056k0118m781R008o589j832j2935R502
9368g281J7323J0943J333K4934k819l3379l2315r387k648P68N758L1012P880m183
9354G939l4005k0593O847J0610K7487J0482n659n921j3668L385J8936J3648j3016
9341F472K2253K4619l4547j2685r261k4189K3587M5475M817N542j979j2105J9838
9328E7837L503k9000r058o811k2186N121j6829j056M757o019M86J6660K765L3403
9314C3573j1108k9626o440R491P931J6638K4695j3368l5659N276K1965R844j6652
$$ plain form
9407 -23297 -15941 -31433 -23704 -14822 -23584 -45022 -53024 -49135 -33746 -19346 -16514 -34883 -25824
9394 -25824 9197 25421 6663 -18742 -4552 -2313 -11399 -1672 27282 29584 16886 22856 31851
9381 31851 53728 62587 69360 64753 51520 20464 346 -4435 4573 -2016 -3848 -16783 -7281
9368 -7281 10042 20985 22318 47252 44433 11054 -21261 -30648 -33296 -32528 -26770 4242 12122 7939
9354 7939 -26066 -46659 -39812 -29202 -1715 8767 3108 -2813 -16481 -13096 5840 19488 6472
9341 6472 28725 53344 18797 6112 -3149 -27338 -3751 41724 46541 52083 50104 37999 57837
9328 57837 61340 32340 23282 16471 -5715 -594 -17423 -18479 -13722 -19741 -19255 -2595 170 33573
9314 33573 22465 -7161 -13601 -4110 3821 20459 45154 31786 -3873 1403 23368 33212 16560
9301A6560L109n441O817O516k179j1979q27R875J1234R476M0294K0143l873Q330
9287A08055j1684r232j4647k4164k7170J8861j3547k52R79k9151o066m559j3170
9274b5747j8006J0738L3244o99o18j4122j1654K4200K5976j3160j5788J4627N874
9261A4865q113P066j4443k5984J4754N3519L6571r494j5225j164m846n247j0718
9248C1541L064r338M215j091k3741j8588J6469j6213K5896K0854J6311K805j4268
9235C7916L7339J4925O211L672K8216R762j2486n664l8381l1688j6601l413o371
9222B3437J02j206j2975P607j0568k2996K0090J9876q545j2855j2610j5878k263
9209b8784J5643R427p524M1817J9488n8798j2477K4505O599J5548Q532k3321j6198
$$ plain form
9301 16560 19669 14228 21045 27561 25382 13403 12576 22451 33685 43161 83455 103598 99725 108055
9287 108055 96371 87139 72492 48328 21158 40019 26472 26220 27199 -1952 -8018 -12577 -25747
9274 -25747 -43753 -33015 229 -470 -1088 -15210 -26864 -2664 23312 10152 -5636 8991 14865
9261 14865 6752 13818 -625 -26609 -11855 41664 78235 68741 53516 52352 47506 42259 31541
9248 31541 34605 25267 29482 28391 4650 -13938 2531 -13682 12214 33068 49379 52184 37916
9235 37916 75255 90180 96391 100063 128279 138041 125555 119891 81510 49822 33221 29808 23437
9222 23437 23539 22333 9358 16965 6397 -16599 3491 23367 14822 1967 -10643 -26521 -28784
9209 -28784 -13141 -3714 -11238 30579 50067 -8731 -21208 3297 9896 25444 33976 10655 -5543
9196e543J0015q397J2095M080J5475J2831p109l0857k5998K499L5645J0658j7741
9183G653j3793K1612k317j1598P858n25j0987p594k3439R751R786M311J9396J4903
9169B5017K4779Q360l053J526j6168j4745j0306K0077J4968k0123l6223l767r453
9156a9111P974R521m142K2582j3184o614K1887L199J1072J310J5830N513k3993
9143C1844M547N187j0414k5777J8083J7546J8812j1415q157j0313J3447O887J5804
9130F6081l424j4043k5486k1933j1267m822J6214J4653k3176j6849m610Q554L1744
9117A1636L0982j35K0904K1203l5155m5419j0314Q59J795o329J0318K1497J7932
9104C9774j1634j7286n781J7879j1290L207J7605m382j3421O590M838p885K1371
$$ plain form
9196 -5543 4472 -3925 8170 12250 27725 40556 33447 2590 -23408 -20909 14736 25394 7653
9183 7653 -6140 15472 13155 1557 9415 8890 -2097 -9691 -33130 -23379 -13593 -9282 10114 25017
9169 25017 49796 58156 55103 56629 40461 25716 15410 35487 50455 30332 -5891 -9658 -19111
9156 -19111 -11137 -1616 -5758 16824 3640 -2974 18913 22112 33184 34494 50324 55837 31844
9143 31844 36391 41578 31164 5387 23470 41016 59828 48413 40256 29943 43390 50277 66081
9130 66081 62657 48614 23128 1195 -10072 -14894 1320 15973 -7203 -24052 -28662 -20108 11636
9117 11636 42618 42483 63387 84590 49435 4016 -6298 -5439 -3644 -9973 345 21842 39774
9104 39774 28140 10854 5073 22952 11662 14869 32474 28092 14671 21261 26099 18214 39585
9091C9585J0975q339r996k05r244l9930p944M5883J921m519J1988j7583K6362
9078C8954L455k1697j9561l089J3466j1584q583J4517K0002J2278l393K59J8525
9065E3549m377k4608J456j5986p752j865R02j3611L7669J9484r439l6350m888
9052e816K860l900M1093o933o449m028j268L227l352o610r091j5942j2293N390
9038b3112P748Q23J2086N80j6599K6754Q451q980j0328K035L0486N0988R767l0594
9024F0105l6353k8355j4335j4776J174M5305K4496j262m950J1841n279j530L009
9011C9090j0046k889L070j2302L0942q233q340J2894K9255o161k6919k5071k7168
8998a1878P998L0439K0486j4438j6932L882J0255j070k4580k2915M116K6832M2528
$$ plain form
9091 39585 50560 42221 32225 32020 22776 -17154 -25098 20785 22706 18187 30175 12592 38954
9078 38954 42409 20712 1151 -1938 11528 -56 -8639 5878 25880 38158 34765 35024 53549
9065 53549 49172 24564 26020 10034 2282 417 1319 -12292 25377 44861 35422 -928 -5816
9052 -5816 -2956 -6856 34237 27304 20855 16827 15559 18786 15434 8824 -267 -16209 -28502 -23112
9038 -23112 -15364 -14541 -2455 -1875 -18474 8280 16731 7751 -2577 -542 29944 80932 90699 60105
9024 60105 23752 -4603 -18938 -33714 -32540 12765 37261 35999 31049 42890 37611 36081 39090
9011 39090 29044 26155 29225 16923 47865 39632 31292 44186 73441 67280 40361 15290 -11878
8998 -11878 -3880 26559 47045 32607 15675 19557 29812 28742 4162 -18753 -14637 12195 54723
8985E4723J1683j6834n22j6746K24q900m551L013k903o921R25K5268J9658o598
8971E1519k4165k6766K704l259k572j0499J4977J2302o807N0193K4392j309k395
8958G8315R131j2157j6316J916k129P156K461J1016K6328j7823Q544m406q001
8945H4035n26j8108k3378k9025j4358J0927M681J5178j0425M413j140Q576n716
8932B5134q160l385k7525k0123P83J1541J5115J1832K4775N893l199J0945J0707
8919E4333K1156j6011j5196J9130K8102r69J323j8210j5078L470j2319O722J7457
8906G3910o92j7195J4148Q992j4193j5465J7476K7733J6290J6090J1581J2845
8894A51520K8006L5588L9162N4436J21891J66356J73885J88643J80531J57468
$$ plain form
8985 54723 66406 49572 49050 32304 32528 23628 19077 22090 19187 12266 13191 38459 58117 51519
8971 51519 27354 588 3292 33 -2539 -13038 1939 14241 7434 57627 82019 80710 78315
8958 78315 87446 75289 58973 60889 58760 65916 68377 79393 105721 87898 96442 92036 84035
8945 84035 83509 65401 42023 12998 -1360 9567 14248 29426 19001 23414 22274 30850 25134
8932 25134 16974 13589 -13936 -34059 -33276 -21735 -6620 5212 29987 35880 32681 43626 54333
8919 54333 75489 59478 44282 63412 91514 90545 91868 73658 58580 62050 49731 56453 73910
8906 73910 73218 56023 70171 79163 64970 49505 66981 94714 111004 127094 138675 151520
8894 151520 179526 215114 254276 308712 430603 596959 770844 959487 1140018 1297486
8884A297486J38446Q1001p0651j94322k63078k55881j84273j06553p8009n6737
8874C07429l4093M172m4190m7107j9361n564j0587j1133N066J521k2038J0241
8862A34356M4712J9126K8244M6650M0199j030N207J1478L4936L8673L1022J7670
8850D51243M2500L2020P2526J39580J53553K23396L22112L69182L53655L42554
8840B502321K81286J78705K9663k36499n22244n99678m75053l01393j81304j08583
8830E67221r8394q8687m2046j4157N520l3369l3433r511j2308j0782j0439j0098
8818B09517q653L704o519J6059K7898M939J0772L8020J9869L5267L0138N4605
8806D35616O4236M1499N8243P5725Q7711O4479J01104J13991J35318J38487J29886
$$ plain form
8884 1297486 1435932 1516933 1446282 1251960 988882 733001 548728 442175 364166 307429
8874 307429 273336 277508 233318 186211 166850 161286 150699 139566 144632 146153 124115 134356
8862 134356 179068 198194 226438 273088 313287 312257 317464 328942 363878 402551 433573 451243
8850 451243 493743 525763 598289 737869 891422 1114818 1436930 1806112 2159767 2502321
8840 2502321 2783607 2962312 2991975 2755476 2233232 1633554 1158501 857108 675804 567221
8830 567221 468827 380140 338094 323937 329457 296088 262655 253144 240836 230054 219615 209517
8818 209517 200864 204568 198049 214108 242006 246945 257717 295737 315606 350873 381011 435616
8806 435616 499852 541351 599594 675319 763030 827509 928613 1042604 1177922 1316409 1446295
8795A446295J04291R2328m1812j78600k43632k48891k03130j34789r2140n0280
8785D49640p7984p7782n9455j7525j515j6928o073K3389m039j1854J2339r632
8773B02581M485J3724j5735P774J464o026K0554L201l3242k6850l230o425K9153
8760A91428N8001K9249O971m129n851K4238L3327L1711J3548p895J8077M5644
8748D34319J1317O769M2431L4071L6821l6257l182K0117R933k7230m4919n3226
8736D30964m4400l5536l1117m5711m5890k6681O081J5454P995K570O628j8111
8724B22246k0995l42o40J5456k9271l1294O004J767N025o115j1202M4778N0649
8711B46066K6127k524n074K0934K8155J8516N716N5375N8206O9277R7786O6266
$$ plain form
8795 1446295 1550586 1642914 1601102 1422502 1178870 929979 726849 592060 499920 449640
8785 449640 371656 293874 234419 216894 215379 198451 192378 215767 211728 199874 212213 202581
8773 202581 207066 220790 205055 212829 214293 208267 228821 232022 198780 171930 168700 162275 191428
8760 191428 249429 278678 285649 281520 275669 299907 333234 364945 378493 370598 388675 434319
8748 434319 445636 452405 494836 528907 565728 529471 526289 546406 556339 529109 484190 430964
8736 430964 386564 351028 319911 274200 228310 201629 207710 223164 231159 233729 240357 222246
8724 222246 201251 200909 200269 215725 186454 155160 161164 162931 167956 161841 150639 195417 246066
8711 246066 272193 269669 264595 285529 313684 332200 337916 393291 451497 520774 618560 684826
8699F84826O3144K7934P613Q931L3263k508l9904r4862j46618j24653q6233m3914
8687B87019l7235Q49q555k7581m6598l1184k7106n3396k4349l4821l4453j5051
8675e2461K779J2833L3372M6339P2631L8505K1225M2706M1231L9538P618j569
8663C04747q304J7827R664J4546M0668p679j265O1108R1152O1999O28J8744j1707
8650E92128k5214l4743m2441q7030m3446k3601m0881n5749o3903k2834Q204j1370
8638A49120n6981o6179n2067o7362o2020l5759n0184j6847K5318M6198P2717O1542
8626e2504J08405P4304M8780j1597j3314P459N5580J00955J15948J83588L14738
8615I32342L18363K60737K95461K02684l062j68873k15037j84437j48989j46067
$$ plain form
8699 684826 747970 775904 783517 792448 825711 823203 783299 688437 541819 417166 330933 287019
8687 287019 249784 250633 242078 214497 167899 136715 109609 56213 31864 -2957 -37410 -52461
8675 -52461 -49682 -36849 -3477 42862 115493 153998 175223 217929 259160 298698 306316 304747
8663 304747 296443 314270 323934 338480 379148 371469 370204 431312 522464 584463 585091 603835 592128
8650 592128 566914 532171 489730 402700 359254 335653 294772 239023 175120 152286 160490 149120
8638 149120 92139 25960 -26107 -93469 -155489 -191248 -241432 -258279 -232961 -186763 -114046 -52504
8626 -52504 55901 130205 178985 167388 154074 161533 217113 318068 434016 617604 932342
8615 932342 1250705 1511442 1806903 2009587 2006525 1837652 1622615 1438178 1289189 1143122
8605A143122j42129j17663o6095k2353o977l7953l7512q441K2279j1572k2937
8594F91769o5787p1024n1216r3206o3482J4672M992j374P690R698K1750L3338
8582D37820J1656k545r799p471R046J8024J10605J84761K35287K53083M70383
8571A710850O89143O38799N64270M86691J89843j83701m91599m94815l61758k68582
8561B479141j96218j39039q3702p6129p5679m7474L023l940K3931K0399j6784
8550A887529j7412L137J4439K2490L3647N0394N3247J03591J42324J61462J59379
8539B614227J65714J40802J06285R5717l25p5980m0132J5564R4808J52546J91552
8528C460778K47415L45051L56603L38835K88573K59123J66589j3758j11133q3896
$$ plain form
8605 1143122 1000993 883330 817235 794882 787905 749952 712440 703999 726278 714706 691769
8594 691769 625982 554958 503742 410536 347054 361726 366718 365344 373034 382732 404482 437820
8582 437820 449476 446931 437132 429661 438707 456731 567336 752097 987384 1240467 1710850
8571 1710850 2399993 3038792 3603062 4089753 4279596 4095895 3604296 3109481 2747723 2479141
8561 2479141 2282923 2143884 2060182 1984053 1908374 1860900 1863923 1859983 1883914 1904313 1887529
8550 1887529 1870117 1873254 1887693 1910183 1943830 1994224 2047471 2151062 2293386 2454848 2614227
8539 2614227 2779941 2920743 3027028 3122745 3122420 3046440 3006308 3021872 3116680 3269226 3460778
8528 3460778 3708193 4053244 4409847 4748682 5037255 5296378 5462967 5449209 5338076 5254180
8518E254180r156N0186J07780J65886K38481L21827L72757M38111N31309O03398
8508H074759O73481P74586Q83719J008218J149766J351954J623601J967386K480815
8499A9988285L149012M077056N655810Q313910J2499038J8871461K7268585L4897782
8491A34720939L7598571L4946845L0345623K4399817J6680175J278770k7754644
8484B52216096n4044154n5118713l9774117k5533485j6322088j0797291p504442
8477D3121806n356993l933864k988161k284045j763859j385341j066091p97677
8469B3545775n65091l22333p3495J95442N34246Q07070J135562J486543J812811
8460B8556530K161042K608292L261330M101089N286439O786785Q674614J1232887
$$ plain form
8518 5254180 5245024 5295210 5402990 5568876 5807357 6129184 6501941 6940052 7471361 8074759
8508 8074759 8748240 9522826 10406545 11414763 12564529 13916483 15540084 17507470 19988285
8499 19988285 23137297 27214353 32870163 41184073 53683111 72554572 99823157 134720939
8491 134720939 172319510 207266355 237611978 262011795 278691970 279970740 252216096
8484 252216096 198171942 143053229 103279112 77745627 61423539 50626248 43121806
8477 43121806 37764813 33830949 30842788 28558743 26794884 25409543 24343452 23545775
8469 23545775 22980684 22658351 22584856 22780298 23314544 24121614 25257176 26743719 28556530
8460 28556530 30717572 33325864 36587194 40688283 45974722 52761507 61436121 72669008
8452G2669008J5012301K0825832L0114276M4434749O2101608P4384041P2787834
8445C92329649O3322428N3194545M1090046K6939220j4643983q6741103j27856901
8438C47633901j05466951o8169541m2461840k7128113j8308464j3063712r555403
8431F3479877p136758n544922m491976l604515k901219k395477k200299k059770
8423C3144941j737077j265571p98353m22753j03954J86346M86470Q28512J228524
8414C1547085J682197K233191K952666M012941N489697P509505J0118200J3347125
8406G8892607J7309561K2275030K8344365L4213122L6157166L1982668K4556867
8399B73731386J6597200R167623j124378k3456251n0530459n8517151m5688622
$$ plain form
8452 72669008 87681309 108507141 138621417 183056166 245157774 319541815 392329649
8445 392329649 455652077 508846622 549936668 576875888 562231905 475490802 347633901
8438 347633901 242166950 173997409 131535569 104407456 86098992 73035280 63479877
8431 63479877 56343119 50798197 46306221 42701706 39800487 37405010 35204711 33144941
8423 33144941 31407864 30142293 29343940 28921187 28817233 29003579 29490049 30318561 31547085
8414 31547085 33229282 35462473 38415139 42428080 47917777 55427282 65545482 78892607
8406 78892607 96202168 118477198 146821563 181034685 217191851 249174519 273731386
8399 273731386 290328586 299496209 298371831 274915580 224385121 165867970 120179348
8392A20179348l0206960j9543535j3038006r148029o696077n027043l926912l159396
8384B9433390k589878k154612j850329j624220j491957j390950j197518r59226
8376A6174700p80992o54004n18013m42231l63004k57067r6977N6370K72656N27413
8366A3918851Q59814J254694J663161K126854K508432K938718L201604K750598
8358C1222726J834747R39031L0620j176617k614534l768528m076820l622847k924411
8349A5843367k285764j787321j361819j023770q48032p01473n67461n12601m72190
8340F282936m05573l66049l29420k81136k58972k19265k08666j75429j43130j29870
8330C765426r3036r9877r7762o2847o3806n7951M2562K07350L52268N52951O78970
$$ plain form
8392 120179348 89972388 70428853 57390847 48242818 41546741 36519698 32592786 29433390
8384 29433390 26843512 24688900 22838571 21214351 19722394 18331444 17133926 16174700
8376 16174700 15393708 14739704 14221691 13779460 13416456 13159389 13062412 13118782 13391438 13918851
8366 13918851 14778665 16033359 17696520 19823374 22331806 25270524 28472128 31222726
8358 31222726 33057473 33996504 34027124 32850507 30235973 26467445 22390625 18767778 15843367
8349 15843367 13557603 11770282 10408463 9384693 8536661 7835188 7267727 6755126 6282936
8340 6282936 5877363 5511314 5181894 4900758 4641786 4422521 4213855 4038426 3895296 3765426
8330 3765426 3672390 3572513 3474751 3411904 3348098 3290147 3332709 3540059 3892327 4445278 5124248
8319E124248P14820M33707P2830K57948K87104m91949j206142r78761n34666l19481
8309C359658k46009j97792j61326j40914j12996p3044n0523n5457n6257m5702
8299B219638n5668m1957p6167j11501j06457q2983r7286p5435o6633o2127m6512
8288A396912p519o999r5J0365J850N840N693J6728N6205J05232J51127K66843
8276B002182L40968L36484L04555J56179M6317Q2372P977l64136n38056m09212
8266A965630k38552j78004j04784r2270n5210j781j806J1191J2396L9342L2965
8255A389117K8397K3910j5226q3205j12889r6387r5831p8842q0197l0972k5561
8244H22314j2057p92k8339l9378k7531r823l6338j1680j4699K1076K6744L7424
$$ plain form
8319 5124248 5839068 6272775 6345605 6603553 6890657 6398708 5192566 4213805 3679139 3359658
8309 3359658 3113649 2915857 2754531 2613617 2500621 2427577 2377054 2321597 2265340 2219638
8299 2219638 2163970 2122013 2045846 1934345 1827888 1744905 1647619 1572184 1505551 1443424 1396912
8288 1396912 1389393 1382394 1382299 1392664 1394514 1400354 1406047 1422775 1478980 1584212 1735339 2002182
8276 2002182 2343150 2679634 2984189 3140368 3186685 3269057 3277034 2912898 2374842 1965630
8266 1965630 1727078 1549074 1444290 1352020 1296810 1295029 1293223 1304414 1316810 1356152 1389117
8255 1389117 1417514 1441424 1426198 1342993 1230104 1133717 1037886 959044 878847 847875 822314
8244 822314 810257 809465 781126 741748 714217 704394 668056 656376 641677 662753 689497 726921
8232G26921N0111P819j6331j3038p667n081j9779l3109l4631n1352k3302L054
8220E83615j3692l8141n334L4306K4895J7432L2448J8702L3775M3358L1773N632
8208G68769k5585p0161n1565n990j6717p978k1461j0717l7464k8881J31L227Q946
8195E04554r233O432j7713m4187k2435l8301k8776J8343R3l4795k0222k4953l0186
8182B58621k6813j5586Q331L7674M4624M0148k5046l6839j1878L0125K1822P440
8170C32623qN32J2721j650l575K241m5712l4421L3110M2491J2183O042R244j2759
8156C53062l3461k5907J100j0708l1800K298N32M143m566l1498j2425j4619m5910
8143A50241m1359j9037l9858j652j3976j0709K5336M7882N5664M2907J6349k7002
$$ plain form
8232 726921 777032 784851 768520 755482 747815 742734 722955 689846 655215 603863 580561 583615
8220 583615 569923 531782 526448 560754 585649 603081 635529 654231 688006 731364 763137 768769
8208 768769 743184 673023 621458 615468 598751 590773 569312 558595 521131 492250 492381 495608 504554
8195 504554 495321 501753 484040 439853 417418 379117 350341 368684 368777 333982 313760 288807 258621
8182 258621 231808 216222 224553 262227 306851 346999 321953 285114 273236 303361 325183 332623
8170 332623 332615 333147 345868 344218 340643 342884 297172 262751 295861 338352 350535 356577 365821 353062
8156 353062 319601 293694 294794 284086 252286 254584 255116 259259 254693 223195 210770 196151 150241
8143 150241 108882 89845 49987 48335 34359 23650 48986 96868 152532 195439 211788 184786
8131A84786k1881J1573J2437M8474J1055k3312J4158J7816N991O725j2897M743
8119B59668j4092J0589K6501m17m3924J7864K2979j5972r06l2572j0938j0814
8107B07966j7814L6947L0952l1764j8127P575q17P55l3186J5336K2507q881L1173
8094B42622N3848O8284J12892J79628J99198K06398J90619J57439J29383O6890
8084A607201J176j51007k44662k63504j80862j02452j00968p0895o0187k2339
8074D11501j1307k0645n846j8483k2583o909n673q985K3720N578M30L952L0559
8061C75309K3160p441j5039k9652J466J8349Q087K5116J7778L8788L7422N7997
8049E51340R4020J89049K23571L13102M07378L89877L52730L16517K64314J11368
$$ plain form
8131 184786 162905 174478 186915 235389 246444 223132 237290 255106 261097 267822 254925 259668
8119 259668 245576 256165 282666 282249 238325 256189 279168 263196 262290 229718 218780 207966
8107 207966 190152 227099 258051 226287 208160 215735 214918 215673 182487 197823 220330 211449 242622
8094 242622 296470 364754 477646 657274 856472 1062870 1253489 1410928 1540311 1607201
8084 1607201 1608377 1457370 1212708 949204 768342 665890 564922 494027 433840 411501
8074 411501 400194 379549 373703 355220 332637 325728 320055 311070 334790 340368 340798 344750 375309
8061 375309 398469 391028 375989 346337 347803 366152 374239 399355 417133 455921 493343 551340
8049 551340 645360 834409 1057980 1371082 1778460 2168337 2521067 2837584 3101898 3213266
8039C213266j05589m50877o27811n44394l54759k35993j31597j08142j11606l4649
8029E07849n0421k9554k2790k1743n65l862p321j2932k1303j007p594R624K0970
8016C59351k778j7029l533j9510k6710J2653K1578J3253R29J925M9224O0035N8442
8003E07830J06232J53112K04193K29535K04253K09160J34703O8627J7588j17052
7993A718181k63660l22436k36099j79674j24341r4465r2438n3206k4864m5992
7983B81006j9436L338L138J5462l1102l0921q270j2268p280l5302n248o628k9905
7970A16584J1368L040J1657R521p838L686J9172J5509J7273j024K1144k8455l1110
7957A60527L3252J6188j057K581L7377K5174L835j289o977j4662m183j0654l7796
$$ plain form
8039 3213266 3107677 2656800 2028989 1484595 1129836 893843 762246 654104 542498 507849
8029 507849 457428 427874 405084 383341 382776 378914 371593 358661 337358 336351 328757 338381 359351
8016 359351 356573 339544 336011 316501 289791 302444 324022 337275 338204 340129 389353 449388 507830
8003 507830 614062 767174 971367 1200902 1405155 1614315 1749018 1817645 1835233 1718181
7993 1718181 1454521 1132085 895986 716312 591971 497506 405068 351862 326998 281006
7983 281006 261570 264908 268046 283508 252406 221485 213215 200947 193667 158365 153117 146489 116584
7970 116584 127952 130992 142649 152170 144332 148018 167190 182699 199972 198948 220092 191637 160527
7957 160527 193779 209967 208910 211491 248868 274042 277877 276588 269611 254949 250766 240112 202316
7944B02316M86k5034q966j5429k0331n376j3708j0310K3734j1170l6600L934L2585
7931A16131L4223J7105k0339j3194J6352j0031k3599J4336J6493P176l09j1040
7919A43304P173J1267k565k865l5512R202M1641q892r764P611P733k9143j1399
7906A27791q789k6560K781J606J3765j4155q693l2993p905J037p560K2975M070
7893F7370j593j371r227p193q070j0592J2605J1067N29k0953q88L5015J3153k592
7879G7260J2273J3258J6804j2867j3254M769r269r559l132j8052k215o471o654
7866D2891j0126k216J2104j2696K7789l880M89L0098J5283J5774r638j2272K524
7853I6124r972k3073P914K5402O956j479k6112l2918j0116K9271J0030J641J1861
$$ plain form
7944 202316 202802 177768 168802 153373 133042 127666 113958 103648 127382 116212 79612 83546 116131
7931 116131 150354 167459 147120 133926 150278 140247 116648 130984 147477 154653 154344 143304
7919 143304 150477 161744 159179 156314 120802 130004 171645 162753 152989 160600 168333 139190 127791
7906 127791 119002 92442 95223 96829 110594 96439 87746 54753 46848 47885 40325 63300 67370
7893 67370 65777 64406 55179 47986 39916 29324 41929 52996 53525 32572 31684 66699 79852 77260
7879 77260 89533 102791 119595 106728 93474 98243 88974 79415 76283 58231 56016 49545 42891
7866 42891 32765 30549 42653 29957 57746 53866 54355 84453 99736 115510 105872 93600 96124
7853 96124 86152 63079 70993 96395 103351 101872 75760 42842 32726 61997 72027 73668 85529
7840H5529j6068J975Q572K012q092k1557j4957j0251L171J0436J7330J0025k1805
7827D6320o660l321k9871R837M0307J7975k1942k9883o566m490L7978o242l244
7814D0198J6561J7953j994j0820J059L027P169q713K2508m692k6748L719n658
7801E3569o2L353o565P246J236l8666o294j6181Q099M765o539K7635J1224p448
7787C5372k856j54J119L1638n184J5158j5387j8721m995N061J7187M5912J1290
7774A15440l3420p189k7427J8913K6936j304k3779K012l481p033Q538j4342k8821
7761B5043l2464j3157K5704J6414k2004Q469K2855r628K6005q383k5170J7003
7749C0687J1101k4410P665K8698j2865r246j0308N220Q031M28l6716R417K2906
$$ plain form
7840 85529 69461 71436 80008 82020 73928 52371 37414 27163 30334 40770 58100 68125 46320
7827 46320 39660 36339 6468 16305 56612 74587 52645 22762 16196 11706 49684 43442 40198
7814 40198 56759 74712 72718 61898 62957 65984 73153 64440 86948 82256 55508 59227 53569
7801 53569 53507 56860 50295 57541 58777 20111 13817 -2364 5735 10500 3961 31596 42820 35372
7787 35372 32516 32362 33481 65119 59935 75093 59706 40985 35990 41051 58238 104150 115440
7774 115440 82020 74831 47404 66317 93253 91949 68170 70182 66701 59668 68206 53864 25043
7761 25043 -7421 -20578 5126 21540 -464 8005 30860 21232 47237 38854 13684 30687
7749 30687 41788 17378 25043 53741 40876 31630 21322 26542 34573 35001 -1715 7702 30608
7736C0608K1167p6L686j4324Q286K6609K3326k872k2615j7966j4178J1066k9488
7723B3229j4320J0999k8023o291L3791K7124M456o71J2175n625Q662j6633k4999
7710B3874j27l1713j1353L2919K0649K6073o920k0248n129p278K697J5597j0732
7697B8309j9593Q360K6770m796k0170j5387j5986j643K0759r645J854k979l0643
7684c4790l48M5902K2661P137L382J3663j5239j2708j1727l436l566M512o134
7671I309l941j1809o82J4210N367J0659J1595M32m157J129l7989J2288M0690J5342
7657F2443P05o454o398j470j2444j8007K5481n795j1619J1193k089j0159J0004
7644C5391O086j3885k1573k9749j124k3706J2783K9063M007p346J2150r61j0783
$$ plain form
7736 30608 51775 51699 55385 41061 49347 75956 99282 96410 73795 55829 41651 52717 23229
7723 23229 8909 19908 -8115 -14406 19385 46509 50965 50294 62469 56844 65506 48873 23874
7710 23874 23747 -7966 -19319 13600 34249 60322 53402 33154 28025 20747 23444 39041 28309
7697 28309 8716 17076 43846 39050 18880 3493 -12493 -14136 6623 -3022 -1168 -4147 -34790
7684 -34790 -35138 10764 33425 40562 43944 57607 42368 29660 17933 14497 10931 15443 9309
7671 9309 5368 -6441 -7123 7087 12454 23113 34708 35140 30983 32112 -5877 6411 47101 62443
7657 62443 63148 56694 50296 48826 36382 18375 43856 38061 26442 37635 35546 25387 35391
7644 35391 41477 27592 6019 -23730 -24854 -48560 -35777 -6714 -2707 -10053 2097 1136 -9647
7631i647J1876K6404J5986J5940K0301q421n8l956j7498p225R456j4293L40j2806
7617B6399k897J2877m5601q332K6456L1406K2368J0854k8379l2880M7606J5546
7605G5423k1145J4967j2972O22r02O926m351l6245l4427k5356Q312L1356L8858
7592D1066J762P423K5300m680j0379j5265j3889j4110J6536j0087k4776p86Q479
7579F594L2523K2313O315j06r818j9374j2423K019m85K695R590j7357k6899L5648
7565C1235m169j4421p263r992p168P500K1659j881o427K5289r250k9505J4641
7552A0248Q959k2014q505J3217L8858J3235l69j5172m897K5429k889m32j494r796
7538D4378r707J0030p785K0124k9586k8135O983J5826L5658L37J278Q180l6790
$$ plain form
7631 -9647 2229 28633 44619 60559 80860 72439 72381 68425 50927 43702 53158 38865 39205 26399
7617 26399 23502 36379 -9222 -17554 8902 40308 62676 73530 45151 12271 59877 75423
7605 75423 54278 69245 56273 56895 55993 62919 58568 22323 -12104 -37460 -29148 2208 41066
7592 41066 42828 50251 75551 70871 60492 45227 31338 17228 33764 23677 -1099 -1885 6594
7579 6594 39117 61430 67745 67639 57821 38447 26024 28043 27558 30253 39843 22486 -4413 31235
7565 31235 27066 12645 5382 -4610 -11778 -4278 17381 15500 9073 34362 25112 -4393 10248
7552 10248 19207 -2807 -11312 1905 40763 53998 53629 38457 33560 58989 56100 55668 54174 44378
7538 44378 34671 44701 36916 57040 27454 -681 6302 22128 57786 58123 59401 67581 30791
7525C0791j0187K9040J57R956j5030k923J8440J3627P440k2908k2081M268k0312
7512B0278L277K55m452l720J5583j096j1805N325L76K421k0112j2465K644J0816
7498G325J5988k898m465J2984n806j3327O494j5255K3685O464j5820J2446Q366
7485C6181J1182j940j4844k4633j125J1305L539k2174m625K0970o451k0590j3896
7472b7101K3272R718J9481R139o611Q899J7292n176j4809k9842J8185J3449J2578
7459D8474K6294p974m7459j9190M648k707O463O174N64K258l365j0039l1877M394
7445b3342K8428J3212J4766M2589n522l2712k249M886j5826O479N264k6524j5108
7432e659k38o80J8812K9693L176j0487l5010l4565k082L4425K2545J187j3924
$$ plain form
7525 30791 20604 49644 49801 59757 44727 41804 60244 73871 81311 58403 36322 40590 20278
7512 20278 23555 23810 19358 15638 31221 30125 18320 23645 24021 26442 6330 -6135 -3491 7325
7498 7325 23313 20415 15950 28934 23128 9801 16295 1040 24725 31189 15369 27815 36181
7485 36181 47363 45423 30579 5946 4821 16126 19665 -2509 -7134 13836 7385 -13205 -27101
7472 -27101 -3829 5889 25370 34509 27898 36797 54089 48913 34104 4262 22447 35896 48474
7459 48474 74768 66794 19335 145 4793 2086 8549 14723 15287 17545 14180 4141 -27736 -23342
7445 -23342 5086 18298 33064 75653 70131 37419 35170 40056 24230 30709 35973 9449 -5659
7432 -5659 -5897 -6577 12235 41928 45104 34617 -393 -34958 -37040 -2615 19930 21117 7193
7419G193J1452K5286r253n033k5280J0165J5201j4264k0576k2796J1424K7208
7407A0727N750p260k1062R229M0921J9709J3402k886j7661j2360n199P722k9230
7394A1802l966O457k0902o544J1921J8553q953J7110N728j264m944m274R394j031
7380B9087m701L0068K7942l959Q74J1808k1371k2140J124p710j014j7317j6428
7367F263M167m542K2495m785J0472q793o846J4985k3800k1127K8128j6580k1469
7354b1432J8123K0701K249P304Q017J7365k0366n4263N039K1246K3318R972Q475
7341D5748m2459k3970J2228k0031J5620l910j5464O919M7659L9852K096m1743
7329B2545J2357j1600M105k4977k9353J1260L2930K2068J4470N443m835j5557
$$ plain form
7419 7193 18645 43931 34678 29645 4365 14530 29731 15467 -5109 -27905 -16481 10727
7407 10727 16477 9217 -11845 -2616 38305 58014 71416 68530 50869 38509 33310 41032 11802
7394 11802 7836 14293 -6609 -13153 -1232 17321 8368 25478 31206 29942 24998 20724 30118 29087
7380 29087 24386 54454 82396 78437 79311 91119 69748 47608 48732 41022 40008 22691 6263
7367 6263 10430 5888 28383 23598 34070 25277 18431 33416 9616 -11511 16617 37 -21432
7354 -21432 -3309 17392 19641 26945 34962 52327 31961 -22302 -17263 3983 27301 37273 45748
7341 45748 3289 -20681 -8453 -28484 -12864 -16774 -32238 -25319 22340 62192 64288 22545
7329 22545 34902 23302 27407 2430 -26923 -15663 17267 39335 53805 59248 54413 38856
7317C8856r988l984l3223P956J6028m875j8143k4162n430K9437J9581p044r659
7304d650O654L6695j2053l1417j8581o382J8053M3176K3855l033J2403p983k8743
7291B7994j6469L408k999J5153q521l1095J5239j3810j8258l529J4907L147J7386
7278B553M4314l883k7247j5912m697J0277J712n381L8851j5718k125m273R385
7265B7856M685R939k174k5269K2905L43j7974N24l1305K4016N74J3309J2626Q702
7251D8757k2677k7532J1632K8823r289n3036j8586J4953N1536K4444l045O961
7239E2941j0995r838J1693n831j742K933j0721m2183q274j1218l377L9268Q240
7226A0896j4674j941J5445Q41p852O743N505O085m487q895j6506k71j3176K2476
$$ plain form
7317 38856 28868 24884 -8339 -383 15645 10770 -7373 -31535 -36965 -7528 12053 5009 -4650
7304 -4650 2004 38699 26646 -4771 -23352 -29734 -11681 31495 55350 52317 64720 56737 27994
7291 27994 11525 14933 11934 27087 18566 -12529 2710 -11100 -29358 -32887 -17980 -14833 2553
7278 2553 46867 42984 15737 -175 -4872 5405 7117 1736 40587 24869 22744 18471 27856
7265 27856 32541 42480 40306 15037 37942 38285 20311 20835 -10470 13546 14120 27429 40055 48757
7251 48757 26080 -1452 10180 39003 29714 -23322 -41908 -26955 24581 49025 45980 52941
7239 52941 41946 32108 43801 37970 36228 39161 28440 -13743 -22017 -33235 -36612 2656 10896
7226 10896 -3778 -5719 9726 10567 2715 9458 14963 21048 16561 7666 -8840 -9111 -22287 189
7212A89L5624K3108N925j3432n304k779l852K3452P317k7267k7010Q208K297q501
7198A7975k4774M745k8345k5514K0722K0913K9383k2482k3457J3454n060M283
7186a8157J2095J273k0341K5899J0193j0241j4944J4099L0615m207j233k704K1611
7173D3958J1676j5005j745n406K1418j5594n5073q364j4612j0229Q712K7141K428
7160a0695k885k538j6320j0838J0362m640J5250K5361j533k2130j4046J3006K496
7147a9150k7678K132K1552J0442k2557J8084J4329j0149L646M408Q662K0052J8649
7134D2422r993l86J9801k949k9010O60K0949k0858j4286J5438n29l9624j1496
7121b9861L474k451Q138j6323P401K8102n621K3678J8044k1387o194J8916o51
$$ plain form
7212 189 35813 58921 64846 51414 46110 43331 39479 62931 70248 42981 15971 24179 26476 17975
7198 17975 -6799 -2054 -30399 -55913 -35191 -14278 15105 -7377 -30834 -17380 -22440 -18157
7186 -18157 -6062 -4789 -25130 769 10962 721 -14223 -124 30491 26284 25051 22347 43958
7173 43958 55634 40629 38884 33478 54896 39302 -15771 -24135 -38747 -48976 -40264 -13123 -10695
7160 -10695 -13580 -16118 -32438 -43276 -32914 -37554 -22304 3057 1524 -20606 -34652 -21646 -19150
7147 -19150 -46828 -44696 -23144 -12702 -35259 -17175 -2846 -12995 -9349 -4941 3721 23773 42422
7134 42422 32429 32043 51844 48895 19885 20545 41494 20636 6350 21788 21259 -18365 -29861
7121 -29861 -26387 -28838 -20700 -37023 -29622 -1520 -7141 16537 34581 13194 7000 25916 25265
7108B5265k9243O57j3320r290K004J3742J2276j2207j9527J017J362J8409j7789
7095b6644r932l996L0002N760p129M6918J5109k5020m924K2870l91k8117j3640
7082H66j6217k1947N808j470N369J9751k209j082J052J198N350L472J4725k5368
7068a0702k7191J3875K8405K7721j9658j733m721n837j326l1687K8721O705k011
7055E61j7772P205p577K0396R956k6674k646K1667J9376j6167j4644M49J6955
7042A1085J5635k5783J705J4944j2276j0162K320n870j0032L390j0592L74j0057
7029c5319J1540M5377P140k0986j0203J136Q993J6190O656K1126o294k1702k3040
7016F14J004j3381q382m101k739K9384L5280o57k352k3673k0311j7470M254J2863
$$ plain form
7108 25265 -3978 -3321 -16641 -25931 -23927 -10185 2091 -10116 -29643 -28626 -27264 -8855 -26644
7095 -26644 -36576 -40572 -10570 -4810 -11939 34979 50088 25068 20144 43014 42623 14506 866
7082 866 -15351 -37298 -31490 -32960 -27591 -7840 -10049 -11131 -10079 -8881 -3531 -59 14666 -10702
7068 -10702 -37893 -24018 4387 32108 12450 10717 5996 159 -1167 -32854 -4133 2572 561
7055 561 -17211 -10006 -17583 2813 12769 -13905 -16551 5116 24492 8325 -6319 -5870 11085
7042 11085 26720 937 2642 17586 5310 -4852 -2532 -8402 -18434 -15044 -25636 -25262 -35319
7029 -35319 -23779 21598 28738 7752 -2451 -1315 7678 23868 30524 51650 45356 23654 614
7016 614 1618 -11763 -20145 -24246 -26985 2399 37679 37022 34670 10997 -9314 -26784 -22530 -9667
7002i667L4453L141J0068k580L08k5948m6063K1284j4205j8542j5840R751L6419
6989a7421l331J0227k9943k6406k6413j941P781L8696K6144K2743k5197l9203
6977f4264P805L2611K7397M988K897J0196R26J3754Q066n655j3823j2753j3288
6964a143j4407J7612O459J0094j5510j6166J3330Q710n998Q713J2087K0240K9681
6951G3702k8485l2649K828j1772o381K215L678R224k3350l2183J5533K1110K4102
6938A7572n479l895j2548j8168k2346N939J5840m148p299J7693J5157J0419j6123
6925g386j1243J1587R985j9684j4407l1k64J4208K1174j988l37J3151j5241J0272
6911I796Q427j2833K116Q781P436k485k9323r324J4624K9745j8859M955M399p110
$$ plain form
7002 -9667 24786 27927 37995 35415 35723 9775 -36288 -15004 -29209 -47751 -63591 -53840 -17421
6989 -17421 -20752 -10525 -40468 -66874 -93287 -95228 -87447 -48751 -22607 136 -25061 -64264
6977 -64264 -56459 -23848 3549 8537 11434 21630 22556 36310 44376 38721 24898 12145 -1143
6964 -1143 -15550 2062 8521 18615 3105 -13061 269 8979 2981 11694 23781 44021 73702
6951 73702 45217 12568 15396 3624 -2757 -542 3136 12360 -10990 -43173 -27640 -6530 17572
6938 17572 12093 8198 -4350 -22518 -44864 -38925 -23085 -27233 -34532 -16839 -1682 8737 -7386
6925 -7386 -18629 -7042 2943 -16741 -31148 -31179 -31443 -17235 3939 1951 1614 14765 -476 9796
6911 9796 18223 5390 7506 16287 23723 21238 -8085 -17409 -2785 26960 8101 13056 17455 10345
6897A0345R188n386q205N423K1943J699q664p038l263N38k4509l712J1723J9600
6883A9682p015J2044K5686J936m1665k1790J2738R545k6341R406K5091k2683j7869
6870b1235R206L355R975j6574j4965K330K396J8729L4171m260o965J4672l727
6857B7108j8581N773N777J0709K058j2408l0036J459K5760j2629q105m541k490
6844a0146M107r462p616J1892K1354r966Q842j557N697n295k5693p624j7048O489
6830c6026P177j0736L4338J5977k0250o402r219J5562K5654j9443r939J5235L0799
6817C2727J0372k2745l947l926P484p854j4772j1333l131J5986J9684P755o077
6804B0223K844K557O064j8893j0934N325R445k7078k3506J5684M2563M470j5496
$$ plain form
6897 10345 19533 14147 5942 11365 33308 35007 26343 19305 16042 16580 -7929 -11641 82 19682
6883 19682 12667 24711 50397 52333 10668 -11122 1616 11161 -15180 -5774 19317 -3366 -21235
6870 -21235 -12029 -8674 1301 -15273 -30238 -27908 -25512 -6783 27388 23128 16163 30835 27108
6857 27108 8527 14300 20077 30786 32844 20436 -9600 -8141 17619 4990 -3115 -7656 -10146
6844 -10146 -6039 -15501 -23117 -11225 10129 163 9005 7448 13145 7850 -17843 -25467 -42515 -36026
6830 -36026 -28849 -39585 -5247 10730 -9520 -15922 -25141 -9579 16075 -3368 -13307 1928 32727
6817 32727 43099 20354 16407 12481 19965 12111 -2661 -13994 -17125 -1139 18545 26300 20223
6804 20223 23067 25624 31688 12795 1861 7186 16631 -10447 -33953 -18269 24294 28764 13268
6791A3268j8796K7022R65j2834j2O779N440K0099l3492m3229q236o137j4371O768
6777e6766M9338P186j1676J2527o473l2860k8170J833J2796K5002J1969K4944
6765I650J248j1152l058j2545k285J8353j3936l721J9342J0988M497j918J3637
6752B9100j2608j2106n239k0051K4868J642k1407R550P477k895Q52L7956l621
6739C3518j7656j1037o905P537j6962J9898L9306k5008o2714j3314j2395J9028
6727d6704J8427J2197P924m67J0136L4478j2844j7524R902l891k1896J3944M58
6714D140K6004m721q186P932m7994j1812q744Q637P643K2623J2571j0984q568
6701a1459P065N137o636j7705o060q432j5256j0400K8473n616j8433O578p284
$$ plain form
6791 13268 -5528 21494 22459 9625 9613 16392 21832 41931 8439 -34790 -43026 -49163 -63534 -56766
6777 -56766 -7428 -242 -11918 609 -5864 -38724 -66894 -65061 -52265 -27263 -15294 9650
6765 9650 10898 -254 -3312 -15857 -18142 211 -13725 -17446 1896 12884 17381 15463 29100
6752 29100 16492 4386 -853 -20904 3964 5606 -15801 -6251 1226 -1669 -817 37139 33518
6739 33518 15862 4825 -2080 5457 -11505 8393 47699 22691 -40023 -53337 -65732 -46704
6727 -46704 -28277 -16080 -8156 -8623 1513 35991 23147 5623 15525 11634 -10262 3682 4140
6714 4140 30144 25423 17237 25169 -22825 -34637 -43381 -34744 -27101 -4478 8093 -2891 -11459
6701 -11459 -4394 743 -5893 -23598 -29658 -38090 -53346 -63746 -35273 -40889 -59322 -52744 -60028
6688f0028R678L2625L4295J5250j944p546k0326k6103k1412J0471M655l000P506
6675b5879o527K5498K6477O508p999j1264K387Q65n823j9185k4134J0495K9558
6662I77N271N079r120J174l582l1056J4313L5684N451J1571j4017j1276L575J557
6648A5601J4257m799j5592J0108l172r128M6916J3518j0782k6198n340j1237j436
6635A2716r59m0211j7884J8674o314N215R084J944J8245L949k0318k4548K1Q707
6621c1679p301K0136J9544o082J0783J5509Q061l6948j15K0790l5589k532K2286
6608c137R75j7828J1931n096J6649J6168k4092l318q040o213j2080n524J9299
6595b0306j998M428k4978p460p338p706J3420K1949M3390J3569k532P54K0299
$$ plain form
6688 -60028 -50350 -17725 16570 31820 29876 22330 2004 -24099 -45511 -35040 -30385 -33385 -25879
6675 -25879 -32406 -6908 19569 26077 18078 6814 9201 10066 4243 -14942 -39076 -28581 977
6662 977 6248 11327 2207 3381 -201 -31257 -16944 18740 24191 35762 21745 10469 14044 15601
6648 15601 29858 25059 9467 19575 16403 7275 54191 67709 56927 30729 25389 14152 12716
6635 12716 11757 -28454 -46338 -27664 -33978 -28763 -19679 -17735 510 4459 -15859 -40407 -40386 -31679
6621 -31679 -38980 -18844 700 -5382 5401 20910 28971 -7977 -8092 12698 -22891 -25423 -3137
6608 -3137 -2162 -19990 -8059 -13155 3494 19662 -4430 -7748 -15788 -22001 -34081 -39605 -20306
6595 -20306 -22304 -17876 -42854 -50314 -57652 -65358 -51938 -29989 13401 26970 24438 25192 45491
6582D5491K050j9054j0578l0640j7803M8837L0442J292m706j1694j9317k3497
6570i177P120j5349j3845l200J8539K3131J249j120N966k0338k8799O716L4086
6557D979K1158k6176l387o305j2744L1949m247J554J3321k229k3798p951o769
6544b0645L098l339Q73j773K167K0411J1282q908l3879k6450K2006J4314l274
6531b4117j2823j0501J4628j2328n603L6087K8950p11j1234q396L4262O511l0518
6518D207j346j6721J9964p616k1798J2428J5598l717K7023K9733l500j8351j4477
6505B1427j0088p352J6358J9681j2051j2102k2603k572K217J1737M900M918k1138
6492f668j4427j1273K028K6928P746K8229n102j7646o426l1622J6493N8344J7003
$$ plain form
6582 45491 47541 28487 17909 -12731 -30534 18303 48745 50037 45331 33637 14320 -9177
6570 -9177 -2057 -17406 -31251 -34451 -15912 7219 8468 7348 13314 -7024 -35823 -29107 4979
6557 4979 26137 -39 -3426 -9731 -22475 9474 5227 6781 20102 17873 -5925 -13876 -20645
6544 -20645 -17547 -20886 -20013 -21786 -19619 792 12074 3166 -30713 -57163 -35157 -20843 -24117
6531 -24117 -36940 -47441 -32813 -45141 -50744 -14657 14293 13582 2348 -6048 28214 34725 4207
6518 4207 2861 -13860 6104 -1512 -23310 -10882 4716 999 28022 57755 54255 35904 21427
6505 21427 11339 3987 20345 40026 27975 15873 -6730 -9302 -7085 4652 9552 14470 -6668
6492 -6668 -21095 -32368 -30340 -3412 4334 32563 27461 9815 3389 -28233 -11740 46604 63607
6479F3607j4984j6739m9661k5820J3729J5032J715K156m910j0161K2589m180j4379
6466b2006K2799K2971k7862k9887J2862J0022p391N95O806m67N358k4948J331
6453b9817K5499L461M210j2197J2377q836j2364J399J4076J7788j4966l1741q576
6440c9687m37L207n295N46k529K1311j1729j586j378j1267j0647n7k508N7148
6426d908L4806j5123m1100L703n094q463n818L0093K3652j3685j8695J1790J603
6413g239J6864P971l4945k6990p149N954J9687k613p939j494M770n419m359m836
6399d7737M673k661j0615K1323J844J6416o419N117P166l94j4829J4234m526k5661
6385d2069j8453K1349N916j4396N87r199K1972Q669P939J4471J8507M143k5687
$$ plain form
6479 63607 48623 31884 -17777 -43597 -29868 -14836 -13121 -10965 -15875 -26036 -3447 -7627 -22006
6466 -22006 793 23764 -4098 -33985 -21123 -11101 -18492 -17897 -11091 -11558 -6200 -31148 -29817
6453 -29817 -4318 -857 3353 -8844 3533 -5303 -17667 -16268 -2192 15596 630 -31111 -39687
6440 -39687 -40124 -36917 -42212 -41666 -44195 -22884 -34613 -36199 -37577 -48844 -59491 -59548 -62056 -4908
6426 -4908 29898 14775 -26325 -22622 -27716 -36179 -41997 -11904 11748 -1937 -20632 -8842 -7239
6413 -7239 9625 17596 -17349 -44339 -51488 -45534 -25847 -28460 -36399 -37893 -33123 -38542 -42901 -47737
6399 -47737 -43064 -45725 -56340 -35017 -33173 -16757 -23176 -18059 -10893 -11287 -26116 -11882 -16408 -42069
6385 -42069 -60522 -39173 -33257 -47653 -47066 -56265 -34293 -25624 -17685 -3214 15293 19436 -6251
6372f251j4175k3759K4489K1260k2402k2403J235O989j3677j5324P817L0045N0412
6359B4256N45L191K45j2546J6752k2530q179q527q78J2111K1541j7837m611r73
6345B560R930k6864k0427J4962J2217K780N77K3768J9790N861j719j8240l1724
6332f529K7253J818J77Q710J8263n276p505M957k733L6129k4783m4803j8917l075
6318a6314J9463J1810J0488l378p445J4736o289j0508j9804j2130j5580M563L0994
6305F06K2541O37k8033k275l315k7265R614J6258k0343q694K5056M3533n947n3644
6291c1271k0630K2313L0994l278k0669j0536N753P485J5046O437q025K1986p550
6278H055k2692p555q03k3041K743L2771j7470j1056J5077j6361N556j244J1988
$$ plain form
6372 -6251 -20426 -44185 -19696 1564 -20838 -43241 -42006 -35017 -48694 -64018 -56201 -26156 24256
6359 24256 24801 27992 28237 15691 32443 9913 1734 -6793 -7671 4440 25981 8144 3533 2560
6345 2560 12490 -14374 -34801 -19839 -7622 -4842 -4265 19503 39293 45154 43435 25195 -6529
6332 -6529 20724 22542 22719 31429 49692 44416 36911 41868 39135 75264 50481 5678 -13239 -16314
6318 -16314 3149 14959 25447 22069 14624 29360 23071 12563 -7241 -19371 -34951 -30388 606
6305 606 23147 23784 -4249 -6524 -9839 -37104 -27490 -11232 -31575 -40269 -15213 28320 22373 -31271
6291 -31271 -51901 -29588 1406 -1872 -22541 -33077 -27324 -19839 -4793 1644 -6381 15605 8055
6278 8055 -14637 -22192 -22995 -46036 -43293 -10522 -27992 -39048 -23971 -40332 -34776 -36020 -24032
6265b4032J1941N318j2845R938M28K6267n110j3656j5304J5454J436j7545K541
6252a5169J9967K1718l950j2087Q72J0979J5884j6752L150j6116M89J5944R475
6239C4404n487Q443k8027l5724j0210J8746L597k2399o159m465p614K2910J5402
6226a6583j1815J8258K4780J9174j1767k3674n565J2421P827j3841k3116j4094
6214c7995j2779j666J8161J1528M4333N228k8224k2569J2160M134J3n160j8954
6201c1790J7503L0504R10N955K650O069J6966k2523k2405l057L012J6067j4798
6188E063j6000J5999P095k4990j3044R799J4588K2876J5235O925m169k7682L37
6175A2032J2356j4466j9768j863K9293o922n815L0268j2045m6769m070K4001J5635
$$ plain form
6265 -24032 -12091 -6773 -19618 -9680 -9252 17015 11905 -1751 -17055 -1601 -165 -17710 -15169
6252 -15169 4798 26516 22566 10479 11351 22330 38214 21462 24612 8496 8985 24929 34404
6239 34404 28917 37360 9333 -26391 -36601 -17855 -14258 -36657 -42816 -47281 -54895 -31985 -16583
6226 -16583 -28398 -10140 14640 33814 22047 -1627 -7192 5229 13056 -785 -23901 -37995
6214 -37995 -50774 -52440 -34279 -22751 21582 26810 -1414 -23983 -11823 -7689 -7676 -12836 -31790
6201 -31790 -14287 16217 17127 23082 25732 31801 48767 26244 3839 782 3794 19861 5063
6188 5063 -10937 5062 12157 -12833 -25877 -16078 -1490 21386 36621 43546 39377 11695 12032
6175 12032 24388 9922 -9846 -11709 17584 10662 4847 35115 23070 -23699 -27769 -3768 11867
6162A1867O522p611J0385M133j0608n564j1702j8042j5753P598R925n412L5442
6149A1180l945p202L1569J0651j68j8659R435n238k5795J7242J401l2588l5103
6136d7220k2309J3823K9960J0230L709J3253J0209j5029K668K3288k9583l0976
6124c7977L719J7576p265j366q547J8002J819j1403J5508p775J4475l185j2519
6111a8938L5791j157l1120j8673K6131L7981p266p268P230J791J912n262J385
6098B2537r2j7417J178K047j0007Q271M955l6702k9165j0419J9475J1787K2487
6085a1065K2348J2756k8775j7292j0413J1976L8791L968o451o337j0660M540K745
6072F131J7442O804m807o553j0158j8309J3674K6378K6525j7996j4011k0393J679
$$ plain form
6162 11867 18389 10778 21163 25296 14688 9124 -2578 -20620 -36373 -28775 -18850 -24262 11180
6149 11180 7235 33 31602 42253 42085 23426 32861 27623 1828 19070 20471 -12117 -47220
6136 -47220 -69529 -55706 -25746 -15516 -11807 1446 11655 -3374 -706 22582 -7001 -37977
6124 -37977 -34258 -16682 -23947 -25313 -33860 -15858 -14039 -25442 -9934 -17709 -3234 -6419 -18938
6111 -18938 16853 15696 -15424 -34097 -7966 30015 22749 15481 22711 24502 26414 21152 22537
6098 22537 22445 5028 6206 8253 -1754 6517 11472 -25230 -54395 -64814 -45339 -33552 -11065
6085 -11065 11283 24039 -4736 -22028 -32441 -20465 18326 22294 15843 9506 -1154 3386 6131
6072 6131 23573 30377 25570 19017 8859 -9450 4224 30602 57127 39131 25120 4727 6406
6059F406K9462k7987j0670k622J0183O751j2053R351J0373j570j1733N623k12
6046A1302l0155k4004J3785J4379m796j654j0747k7402J4122O1553K4806r277
6034C1912j2365j8028K232K832j060n574l9634o768J5552K0873J2100n053j1962
6021a4943J6644N904k9601P927Q587j9840J2094J4855J5235K0685k3095k2573
6009h121j7117J4545K8866k60j5919o296n697L0292k1136l446K896n04K681K276
5995C060L256j2145O754j049Q440j0089j5696K618J6764K22l5736J899K5324K702
5981c676r608L354J9235j2226j4491K999Q14J0955j206K3675K5223P747m3590
5968I205k8241r907K0060J9014O767K3494J260j5481l4687q982j6960L2133n980
$$ plain form
6059 6406 35868 7881 -2789 -5411 4772 11523 -530 8821 19194 17624 5891 11514 11302
6046 11302 -18853 -42857 -29072 -14693 -19489 -21143 -31890 -59292 -45170 16383 41189 31912
6034 31912 19547 1519 3751 6583 5523 -51 -39685 -46453 -30901 -10028 2072 -2981 -14943
6021 -14943 1701 7605 -21996 -14069 -5482 -25322 -13228 1627 16862 37547 14452 -8121
6009 -8121 -25238 -10693 18173 17913 1994 -4302 -9999 20293 -843 -4289 -1393 -1897 784 3060
5995 3060 6316 -5829 925 -124 8316 -1773 -17469 -14851 1913 2135 -33601 -31702 -6378 -3676
5981 -3676 -13284 -9930 9305 -2921 -17412 -14413 -13599 -2644 -3850 19825 45048 52795 9205
5968 9205 -19036 -28943 -8883 10131 16898 40392 41652 26171 -8516 -17498 -34458 -2325 -8305
5955h305l9113j0215L3570j8816K3063L0518N907L302n416J4542P951k1215j4300
5942A473k6341M87J1747J2318q670j4998J20R276N068J2326J2410o220l3716j5512
5928d0232J4372j354Q237J7463P129k3725o670q848r881J7136j5900k6652L3992
5915c4933J1341J3478R594k221J2877K742l5475K615O706q583M894M061j6203
5902b9107j7657N178J4206L2935o189M68J346J0031j4391o221j869r41j1795n314
5888b9320J3113J2450O507j096j483k9296k7943J691J5518K3285L464j4959j5005
5875d3074q338K0782J6799q161K2844K0830K3017j9583k1721k6535J5201L3672
5863B5733J7986J618K780j9678j6466M654j8573j4028K062j5329O352L679j7280
$$ plain form
5955 -8305 -47418 -57633 -24063 -42879 -19816 10702 16609 19911 14495 29037 36988 15773 1473
5942 1473 -24868 -24381 -12634 -316 -8986 -23984 -23864 -14588 -9520 2806 15216 8996 -24720 -40232
5928 -40232 -25860 -27214 -18977 -1514 5615 -18110 -24780 -33628 -43509 -26373 -42273 -68925 -34933
5915 -34933 -23592 -10114 -520 -2741 10136 12878 -22597 -19982 -13276 -21859 -16965 -12904 -29107
5902 -29107 -46764 -41586 -27380 5555 -634 -166 1180 11211 -3180 -9401 -11270 -12211 -24006 -29320
5888 -29320 -16207 -3757 2750 1654 171 -29125 -57068 -55377 -39859 -16574 -13110 -28069 -43074
5875 -43074 -51412 -30630 -13831 -21992 852 21682 44699 25116 3395 -23140 -7939 25733
5863 25733 43719 45337 48117 28439 11973 16627 -1946 -15974 -13912 -29241 -22889 -19210 -36490
5850c6490J6350j502k2357K1371J6589k400k4374o567j235J3959J3530k5078l75
5837c8579K7302J3914P905L2874L0979k687q065k5611k3761j7704m1414M595Q195
5824c2057L1683K1003m266k8129j5631j9919J0349K6326j6561P171q292n620N624
5811b8319J3289J1167k573L020n411L1228J6696P741j4733l218k0642J0240l2341
5798a3856j0419J8755J5528r985j1263k162q035j8110J2680M1271J3453P321j2596
5785B2582j1556k0840R943O337N397k3806l7042j8542L00l491N440K3299J6638
5772b5341K1187J1942m55J1277n266l5986r686J945K0762R033J3093m139n314
5759C052k0627l7408K1369P092j7264J596j6487O712K1054K3335r693k4398K7242
$$ plain form
5850 -36490 -20140 -21642 -43999 -22628 -6039 -8439 -32813 -39380 -40615 -26656 -13126 -38204 -38579
5837 -38579 -11277 2637 10542 43416 74395 71708 63643 38032 14271 -3433 -44847 -40252 -32057
5824 -32057 -374 20629 16363 -11766 -27397 -47316 -36967 -10641 -27202 -20031 -28323 -33943 -28319
5811 -28319 -15030 -3863 -6436 -3416 -8827 22401 39097 46838 32105 28887 8245 18485 -13856
5798 -13856 -24275 -5520 10008 23 -11240 -13402 -21437 -39547 -26867 14404 27857 35178 22582
5785 22582 11026 -9814 129 6466 11863 -11943 -48985 -67527 -67227 -70718 -65278 -41979 -25341
5772 -25341 -4154 7788 7333 18610 13344 -22642 -32328 -30383 -9621 -588 12505 8366 3052
5759 3052 -17575 -54983 -33614 -26522 -43786 -42190 -58677 -51965 -30911 -7576 -17269 -41667 -14425
5746a4425R885o011r395J5965K3997k0021q110J2298P569Q440j0145k7254n868
5733b3075J6032j686j451K4283k6053j0397P160N362J8634K7847j3765k928L1329
5720E1292j7666r671J7774j5314l3541q36j447p851J0377q921j4978P716J0955
5707a2111j6361N492N611K7293K0885j0603l1859j3036K067k0971k3643K39O1998
5694d999L3515k1042n285j1331l3810K6458K8853j3662l2157J421K8227K1674
5682A7862P212K3954j0389l9258j2295P854l695j0776J1541n37k4207J4281Q825
5669i628j5652J4369J1142j8696j2294j7051J1989P726K7713j46R669j3034k4972
5656b8865K1977J0548K133R912M633j8084j3362R046k7720m802Q756J0794K063
$$ plain form
5746 -14425 -4540 -10551 -19946 -3981 20016 -5 -8115 4183 11752 20192 10047 -17207 -23075
5733 -23075 -7043 -8729 -10180 14103 -11950 -22347 -15187 -9825 8809 36656 22891 19963 51292
5720 51292 33626 23955 41729 26415 -7126 -7962 -9409 -17260 -6883 -15804 -30782 -23066 -12111
5707 -12111 -28472 -22980 -17369 9924 30809 20206 -11653 -24689 -22622 -43593 -67236 -66997 -4999
5694 -4999 28516 7474 2189 -9142 -42952 -16494 12359 -1303 -33460 -32039 -3812 17862
5682 17862 25074 49028 38639 -619 -12914 -5060 -8755 -19531 -7990 -8527 -32734 -18453 -9628
5669 -9628 -25280 -10911 231 -18465 -30759 -47810 -35821 -28095 -382 -528 9141 -3893 -28865
5656 -28865 -6888 3660 5793 15705 20338 2254 -11108 -2062 -29782 -34584 -25828 -15034 -12971
5643a2971O657J2954K2453o514j0948l1199l049J6731J6288L3977N65m766P504
5630D7682j0463k2540j2911p506n976l4040J1046m439m057p438j6398J1219K5042
5617c0779R742L3548L623l5522j1907M039J4768j4294J3888K781P316K2294l568
5604A5929j1049j1109m401n662j4614n517J7890J0310O96N984J0912P963q57j9563
5590c088k28J3770j7193k8464m739O974q012K4785K4616j1553p560j4165j2097
5577c6954M825L4120J9128j2312O470O063L463L1155L242r094j5906l0308l6283
5564c2391j6922m064J9694J8007J4512K5871R252m779j7833J839L1137O54l2019
5551A2958k1079K7850n480j9037q620K0244P290l0333l4202J2426K1734K083N003
$$ plain form
5643 -12971 -6314 6640 29093 22579 11631 -19568 -22617 -5886 10402 44379 44944 40178 47682
5630 47682 37219 14679 1768 -5738 -11714 -45754 -34708 -39147 -43204 -50642 -67040 -55821 -30779
5617 -30779 -21037 12511 16134 -19388 -31295 -27256 -12488 -26782 -12894 -10113 -2797 19497 15929
5604 15929 4880 -6229 -10630 -16292 -30906 -36423 -18533 -8223 -7527 -1543 9369 17332 16475 -3088
5590 -3088 -3316 10454 -6739 -35203 -39942 -32968 -40980 -16195 8421 -3132 -10692 -24857 -36954
5577 -36954 -32129 1991 21119 8807 15277 21340 24803 55958 59200 50106 34200 3892 -32391
5564 -32391 -49313 -53377 -33683 -15676 -1164 24707 33959 29180 11347 13186 44323 44977 12958
5551 12958 -8121 19729 14249 -4788 -13408 6836 14126 -16207 -50409 -37983 -16249 -14166 -9163
5538i163l246j0869j1085K7758J857J3943J1361J950j7614l5108j8042J098j9690
5525f6850K9114L2302p435n512J182k9207k3354J2623R509L2786M0524O925J6636
5512D9243q126k6528l2538j3847K7003J8608o901l9378q130K1113K698J6732j1364
5499a1415j2051j3242j5850Q505M775K888O273J7321j2287P560J9725J7077k6780
5486g501j9085P910o845M150J0086J2456Q055J3629J1316q138M586O423j7494
5473A9548l706P562R136n816l0940k3857q907q51K0855j897o913R304n442q167
5459c0091r237L6825O66N701K5448j6809n155j9628o177r936P285N871k631r260
5445b7128j1548L4818J7978q554j4903j630J6661J7444l103j2851j9530j9096
$$ plain form
5538 -9163 -12409 -23278 -34363 -6605 -4748 9195 20556 22506 4892 -30216 -48258 -47160 -66850
5525 -66850 -37736 -5434 -12869 -18381 -17199 -46406 -69760 -57137 -47628 -14842 25682 32607 49243
5512 49243 41117 14589 -17949 -31796 -4793 13815 6914 -32464 -40594 -19481 -16783 -51 -11415
5499 -11415 -23466 -36708 -52558 -44053 -39278 -36390 -30117 -12796 -25083 -17523 2202 19279 -7501
5486 -7501 -26586 -18676 -25521 -21371 -11285 1171 9226 22855 34171 26033 30619 37042 19548
5473 19548 15842 23404 32540 26724 -4216 -28073 -36980 -37831 -16976 -18873 -25786 -16482 -21924 -30091
5459 -30091 -39328 -2503 -1837 3864 29312 12503 7348 -12280 -18457 -28393 -21108 -15237 -17868 -27128
5445 -27128 -38676 -3858 14120 5566 -9337 -10967 5694 23138 20035 7184 -12346 -31442
5433c1442R587L3526J4219n184k1948j9633j5884M5594K0927j2240j3830p128
5421c436J4014p85k9182j4569K1649J5783J1354J613j190j7154j4244J6322L0832
5408C1007q094q687m222q646J9000p26l1570j1630J307N163J7379k3512r366K0411
5394a2186K8776J2113k4652J8853p710j6443K101m444l337K2506j8982n620J0842
5381A817m159k5867n69l313J1590k708Q672J8986K2968J9818k8924k0708k480
5368d877O31j8805j284k051P45o572K2847M771O985K2948Q673j1866k7144p622
5354a2621O858m667M477o448J0045K7133p983L530M341j8789j6667j6510J060
5341b6241k649o492L794q656L984j4551j172R321K8849m266J1593J8093o848K65
$$ plain form
5433 -31442 -21855 11671 25890 20706 -1242 -20875 -36759 8835 29762 17522 3692 -3436
5421 -3436 10578 9793 -19389 -33958 -12309 3474 14828 16441 15251 -1903 -16147 175 31007
5408 31007 22913 14226 10004 1358 20358 19632 -11938 -23568 -22261 -17098 281 -23231 -32597 -12186
5394 -12186 16590 28703 4051 22904 15194 -1249 852 -3592 -6929 15577 -3405 -9025 1817
5381 1817 -2342 -28209 -28778 -32091 -20501 -23209 -14537 4449 27417 47235 18311 -2397 -4877
5368 -4877 -4246 -23051 -24335 -26386 -25641 -32213 -9366 -4595 2390 25338 34011 22145 -4999 -12621
5354 -12621 -5763 -10430 -5953 -12401 -2356 24777 16794 20324 24665 5876 -10791 -27301 -26241
5341 -26241 -28890 -35382 -31588 -40244 -36260 -50811 -51983 -42662 -13813 -18079 -6486 11607 4759 5024
5327E024K101N189L826j4977j2925j6088Q843J4399M462K6056O803j525j3360
5314A7828r742l859k3663J2435Q19m438j6477P116j1503J1601n699J6406L0460
5301B1284J2702j1667j8085O013j4033j6106j1541j8589n943L7186k496m015o180
5288c1470q728J0892K2171j0849l1528J5599K7743J3013L9550M667o603k7430
5276A7027q820J452j8218j76M780O828J5033l7402o660m230k0990O35M035J6094
5262c0612j0317n88M363K4210q57J0960k289k6333o584K5790k5014k6619j0248
5249g4138K1192j0514o413M788J47K7181L5256J0948k4255L75n815L755l373L4254
5235A3388K1386N54k1134m741J9449j7441k0253j3928k69l8676q96J0105J7923
$$ plain form
5327 5024 7125 12314 16140 1163 -11762 -27850 -19007 -4608 -146 25910 32713 31188 17828
5314 17828 8086 4227 -19436 -7001 -6182 -10620 -27097 -19981 -31484 -19883 -25582 -9176 21284
5301 21284 33986 22319 4234 10247 -3786 -19892 -31433 -50022 -55965 -18779 -21275 -25290 -31470
5288 -31470 -40198 -29306 -7135 -17984 -49512 -33913 -6170 6843 46393 51060 44457 17027
5276 17027 8207 9659 -8559 -8735 -3955 2873 17906 -19496 -26156 -30386 -51376 -50741 -46706 -30612
5262 -30612 -40929 -41517 -37154 -12944 -13801 -2841 -5130 -31463 -38047 -12257 -37271 -63890 -74138
5249 -74138 -52946 -63460 -69873 -65085 -64938 -37757 -2501 8447 -15808 -15433 -21248 -17493 -20866 13388
5235 13388 34774 35328 14194 9453 28902 11461 -8792 -22720 -22989 -61665 -62561 -52456 -34533
5222c4533L1601k770n957m2347j6802Q958J7665J1225m184l9850K0827L2727J3372
5209a0068p39k1965M390J0348K228K2850J9675j5556k0433L624j9163o259K271
5196b8797k39r819R521K8197L2467k131o87k3876j8753n377n526L6772J5987J2382
5182D0121j8951r666j9243r609K530J9366Q197j431k9218o393L712J3355n343
5169a2573j4054Q203L345o884k5501J4499L280p855J0873o723R249J3882k3142
5156c3401j1142K8826J4552j5569q134n692j6923n426J98L6194M7299N051l0373
5143E460o309J8573K8184j908m2020j5042p779K5720Q164k1343j4807j204J4155
5130a0156Q525M295j8028P536p499O979J0570J279R319R611k5714k446R332J6491
$$ plain form
5222 -34533 -2932 -5702 -11659 -54006 -70808 -61850 -44185 -32960 -37144 -76994 -56167 -23440 -10068
5209 -10068 -10807 -32772 -28382 -18034 -15806 7044 26719 11163 -9270 -5646 -24809 -31068 -28797
5196 -28797 -29036 -38855 -29334 -1137 31330 29199 28512 4636 -14117 -19494 -25020 11752 27739 40121
5182 40121 21170 11504 -7739 -17348 -14818 4548 12745 11314 -17904 -24297 -20585 -7230 -12573
5169 -12573 -26627 -18424 -15079 -21963 -47464 -32965 -29685 -37540 -26667 -33390 -24141 -10259 -33401
5156 -33401 -44543 -15717 -1165 -16734 -24868 -30560 -47483 -52909 -52711 -16517 30782 35833 5460
5143 5460 -849 17724 45908 44000 1980 -13062 -20841 4879 13043 -8300 -23107 -24311 -10156
5130 -10156 -1631 2664 -15364 -7828 -15327 -8348 2222 3501 12820 22431 -3283 -5729 3603 20094
5116B0094J0745j8395k4394N319L1292J4228k9304k9806l6261j856L3301J2956
5104a2081J4702L0028r155o4801j1823J3330P31J1313K8332K527r346k0288n977
5091c2508p267J6252M214K5871j513k2556k1678L924l482J745N616J6386K3567
5078H571K3987p30j7984l1022k9447k5969M811K0938R261L4841K6806j8969j9053
5065a3959m96J4982p62J0065k0548m438K726m138J654Q466r209j5115j226L1283
5051g15P636k0137j4308k5841J8579j5651k475J9064K3731k6570l471P029J4528
5038a8601K4234j0862L334j0113k3492J7323j1840m760J3441j5969M394j1981
5026d4892P464M9139P463j680l0389j9585n432J6340N548q398j1397j6623o269
$$ plain form
5116 20094 30839 12444 -11950 -6631 24661 38889 9585 -20221 -56482 -58338 -25037 -12081
5104 -12081 2621 32649 23494 -41307 -53130 -39800 -39069 -27756 576 3103 -6243 -26531 -32508
5091 -32508 -39775 -23523 -19309 6562 5049 -17507 -39185 -35261 -38743 -36998 -31382 -14996 8571
5078 8571 32558 31828 13844 -17178 -46625 -72594 -67783 -46845 -37584 -2743 24063 5094 -13959
5065 -13959 -14455 527 -235 9830 -10718 -15156 -12430 -16568 -14914 -6448 -15657 -30772 -31998 -715
5051 -715 6921 -13216 -27524 -53365 -34786 -50437 -52912 -33848 -10117 -36687 -40158 -33129 -18601
5038 -18601 5633 -5229 -1895 -12008 -35500 -18177 -30017 -34777 -21336 -37305 -32911 -44892
5026 -44892 -37428 11711 19174 17494 -12895 -32480 -37912 -21572 -16024 -24422 -35819 -52442 -58711
5013e8711J0039N3878m119j1131J1638o915O766j6389j0849j0853j5458L6355
5001a5749M3147j0483k3030j5542j9752R208j4445k5281j424P289j4064J527J3351
4988f5248L4485K7587J5234j4727k5185k51Q357j667k8063J7609J1743j9182n346
4975d4654j697K586j4900n771K4036k553J2262J8942L958j6009l9384J0111K6027
4962b7046J8451K1310J5530n185k0497k1616j513L190n331k0710L2902K2337p874
4949C948Q615j0945k5704q616k206l7366Q266K8147K903p335R153J415J6191J818
4935a1716p087P050l038Q677q946j1969Q896Q791J8441k944l7498k3873R143K5519
4921b0554j894K3261N268M678n580m038P275p086L185K2147j5604j7266M899N068
$$ plain form
5013 -58711 -48672 5206 1087 -10044 1594 -5321 1445 -14944 -25793 -36646 -52104 -15749
5001 -15749 27398 16915 -6115 -21657 -41409 -32201 -46646 -71927 -73351 -66062 -80126 -78599 -65248
4988 -65248 -30763 -3176 12058 -2669 -27854 -28105 -19748 -21415 -49478 -31869 -20126 -39308 -44654
4975 -44654 -46351 -43765 -58665 -64436 -40400 -42953 -30691 -11749 -7791 -23800 -63184 -53073 -27046
4962 -27046 -8595 12715 28245 23060 2563 -19053 -20566 -17376 -22707 -43417 -10515 11822 3948
4949 3948 12563 1618 -24086 -32702 -34908 -72274 -64008 -35861 -32958 -40293 -31140 -29725 -13534 -11716
4935 -11716 -18803 -11753 -14791 -6114 -15060 -27029 -18133 -9342 9099 6155 -31343 -55216 -46073 -20554
4921 -20554 -22448 813 6081 10759 5179 1141 8416 1330 4515 26662 11058 -6208 -1309 3759
4907C759M105r118k2278q579J5796K7525j4485p091j6789l505J7451N838K512
4894d859O009j9911j3854R08J0474J9976J3312k0255j6024q421R492L704J363
4881a8086O287M063Q285Q34J8462r431j0488m101j3583j2614j8891K1857K3711
4868c695P000J4352j2555k3470o915J5851Q357P490K4848J1430K426k731j4709
4855B7679j6265R806R140m4067k1045j1232k6937Q894M4336L0014K824p84j4436
4842b073O471k1005j9386m562j923K7761l928j7035j6462r811r800M8540L7155
4829A3942j1222q619j9133k7520K2443J4971J7646P396K9871M176l5669j9561
4817a1279j7091l451R84Q496L07Q722j4603J9155p683P740K3509j5600l1538O001
$$ plain form
4907 3759 7864 -1254 -23532 -32111 -16315 11210 -3275 -10366 -27155 -30660 -13209 -7371 -4859
4894 -4859 1150 -18761 -32615 -31707 -21233 -1257 12055 -8200 -24224 -32645 -23153 -19449 -18086
4881 -18086 -11799 -7736 549 1383 19845 10414 -74 -4175 -17758 -30372 -49263 -27406 -3695
4868 -3695 3305 17657 5102 -18368 -25283 -9432 -1075 6415 31263 42693 45119 42388 27679
4855 27679 11414 21220 30360 -13707 -34752 -45984 -72921 -64027 -19691 10323 13147 12363 -2073
4842 -2073 4398 -16607 -35993 -40555 -42478 -14717 -18645 -35680 -52142 -61953 -71753 -23213 13942
4829 13942 2720 -5899 -25032 -52552 -30109 -15138 2508 9904 39775 43951 8282 -11279
4817 -11279 -28370 -31821 -30837 -22341 -22034 -13312 -27915 -8760 -16443 -8703 14806 -794 -32332 -26331
4803b6331L6937K8029J1244k8101J686j7179j6000j976J901L0458j6726l6733
4791c2791J2741K5961Q329j7602Q935J0829Q522r360n287K019k7539j5965j2694
4778d3902M796j833j757K4941K2192j7801j9160J860R343P010j5580j247R346
4765b1792M272M6151j4163m7259J2655P240J0239N925J67j1003j0672K4266o400
4752c74P19j9544j0451O076J0844L561L0065Q744j3283J4189p275j9796p721l757
4738h003j6565M851M0840M1388J1341k6408j0436Q374j9864m532k2594K739k1632
4725b0501K621L9084K4451l7709l3832J7890L3186L3541J6286K375k6952k2926
4713B7514m506j0044k3065k9217R253j643q378J5874l432J0924J1752K0098J4867
$$ plain form
4803 -26331 10606 38635 49879 21778 23464 6285 -9715 -11691 -9790 20668 3942 -32791
4791 -32791 -20050 5911 14240 -3362 5573 16402 24924 15564 10277 12296 -15243 -31208 -43902
4778 -43902 -39106 -40939 -42696 -17755 4437 -13364 -32524 -30664 -21321 -14311 -29891 -31138 -21792
4765 -21792 -17520 28631 14468 -32791 -20136 -12896 -2657 3268 3435 -7568 -18240 6026 -374
4752 -374 345 -19199 -29650 -23574 -12730 -9169 20896 29640 16357 30546 23271 3475 -4246 -8003
4738 -8003 -24568 -19717 21123 62511 73852 47444 37008 45382 25518 20986 -1608 1131 -20501
4725 -20501 -17880 21204 45655 7946 -25886 -7996 25190 58731 75017 77392 50440 27514
4713 27514 23008 12964 -10101 -39318 -30065 -31708 -40086 -24212 -27644 -16720 -4968 15130 29997
4700B9997k7597k9780J9232q423Q816q314m29P470q928n089K2181M1142r610j6725
4686A3943Q366M947r538p329j2831J2691k287q098l9380m529M0534K0199J4769
4673C1457J7781J0442k5728l8303K889J1211l116l5320p760N7342N561j6122L862
4660A4196J1347l9756j3000n231K6370o573J841K1143M48j5840J4041J2980l1501
4647i535q539j0785K2265L0547J400j0747Q625N537p100o266N044M458j8709J1593
4633A7788L870j762J5288L0931k807k6775j8182r16L933J0072j5000m2861k7935
4620e4356K570K8849Q690k0718m088r060Q996o028Q344N150Q10m425J4633K8656
4606H023J1465Q56Q717J3822o670j5394l5356J2890K1447k0325k3526j0167L2482
$$ plain form
4700 29997 2400 -27380 -8148 -16571 -7755 -16069 -16498 -9028 -17956 -23045 -864 40278 30668 13943
4686 13943 22309 27256 17718 10389 -2442 10249 7962 -136 -39516 -44045 -3511 16688 31457
4673 31457 49238 59680 33952 -4351 -1462 9749 6633 -28687 -36447 20895 26456 10334 14196
4660 14196 25543 -14213 -27213 -32444 -6074 -12647 -10806 10337 10785 -5055 8986 21966 -9535
4647 -9535 -18074 -28859 -6594 23953 25353 14606 23231 28768 21668 15402 20446 24904 6195 17788
4633 17788 21658 19896 35184 66115 63308 36533 18351 17435 21368 31440 16440 -26421 -54356
4620 -54356 -51786 -22937 -14247 -34965 -39053 -48113 -39117 -45145 -36801 -31651 -30841 -35266 -20633 8023
4606 8023 19488 20344 29061 42883 36213 20819 -14537 -1647 19800 -525 -24051 -34218 -1736
4593a736K7145j5663k913j573j416K6951O588k1582k668q083K577J1539J3507
4580C2673j7741n873j8055l9634J055L3542k3004o051K788K2359M313q305K6437
4567D504k6293k1989R602L7014J0900J7330k1301r878J5276P250L068n1262j4052
4554c9831m412N698L0825J0731m569l250K5797J1138q636m0403j0534J2032P02
4541a4712m019Q646j9426r455J2096M586K2840j0504l4365k4188k189J7205M633
4528d8852K587O082N272O45K0710q702j5659j3965q823Q451m367J9670K2072m567
4514a9446j652K2382N274q101J0053J1284K323j6095k9596j032k4203n928L4332
4501b0405P156J5531l107j7076N160K0568J8277r371k4002k1747k6348o082L4609
$$ plain form
4593 -1736 25409 9746 6833 5260 3844 30795 37383 15801 13133 5050 7627 19166 32673
4580 32673 14932 9059 -8996 -48630 -47575 -14033 -37037 -43088 -40300 -17941 -13628 -21933 4504
4567 4504 -21789 -43778 -34176 2838 13738 31068 9767 -111 15165 22415 25483 -25779 -39831
4554 -39831 -44243 -38545 -7720 3011 -1558 -4808 20989 32127 23491 -16912 -27446 -15414 -14712
4541 -14712 -18731 -10085 -29511 -38966 -26870 -22284 556 -9948 -44313 -68501 -70690 -53485 -48852
4528 -48852 -46265 -40183 -34911 -34266 -13556 -22258 -37917 -51882 -60705 -52254 -56621 -36951 -14879 -19446
4514 -19446 -21098 1284 6558 -1543 8510 19794 22117 6022 -23574 -24606 -48809 -54737 -20405
4501 -20405 -13249 2282 -825 -17901 -12741 7827 26104 16733 -7269 -29016 -55364 -61446 -26837
4488b6837K1596n326j878k907o09j3695j3239K7984J2110j9988k6885Q943N934
4475c4797k5898j4493N914M1326n208k5258K458j7882J0525J7384l150J8511J918
4462b8650N637l168j0490k5928Q398K7176J7425J960K891p240k7728k662n676
4449d8055k06M029M602L1369K571j3924L3885J3169p265q478J1728J0136k1672
4436A1889k4047m674k6480Q314N7039j4690R432L280n238k9806N354j1879k138
4423b3644L437K1905J0597n519N422n538k7326j8924N028j488K382O326K065j0030
4409c5307q678K5366J3848J737k485N057k2214N061j1770l592K9456J333J5796
4396A3608J6027l2080m5792n271l561R297k4546j666K3231J7956p787K2722K8370
$$ plain form
4488 -26837 -5241 -10567 -12445 -15352 -15961 -29656 -42895 -14911 -2801 -22789 -49674 -40731 -34797
4475 -34797 -60695 -75188 -69274 -27948 -33156 -58414 -55956 -73838 -63313 -45929 -49079 -30568 -28650
4462 -28650 -23013 -26181 -36671 -62599 -54201 -27025 -9600 -7640 -4749 -11989 -39717 -42379 -48055
4449 -48055 -48261 -44232 -39630 -8261 -5690 -19614 14271 27440 20175 11697 23425 33561 11889
4436 11889 -12158 -16832 -43312 -34998 22041 7351 16783 20063 14825 -14981 -9627 -21506 -23644
4423 -23644 -20207 1698 12295 6776 12198 6660 -20666 -39590 -34562 -36050 -33668 -27342 -25277 -35307
4409 -35307 -43985 -18619 -4771 -3034 -5519 -462 -22676 -17615 -29385 -32977 -3521 -2188 13608
4396 13608 29635 -2445 -48237 -53508 -57069 -47772 -72318 -73984 -50753 -32797 -40584 -17862 10508
4383A0508j5411l6948J532L1622Q264J1575r677O832k2424j0214L679l612j7896
4370d2170L581L0653r335k6123n3K4129n891r17O744J6991J1523p700m176l686
4356f430j331Q594k9030j0617J3606J1570n793K0461K1380k6351l8578q499K1050
4343b9968N673j9686R390L3058m195k1202O02M0327J6582N495K749j4840j869
4330B2116N39P977J123m014j7747L0609j028J463P422N568n949j9742q242Q049
4316B8144K154q630m02K1086J0012j5647q099o526r619m487o987N392oj6803n651
4301a6069J7596o741r664O711m273p895K7901m519k3030m189K3759L2175K3086
4288E4848l0639l0117J6996j2782R426k3660j9898K0442M01j7567P448k091L424
$$ plain form
4383 10508 -4903 -41851 -40319 -8697 -433 11142 1465 8297 -14127 -24341 -20662 -24274 -42170
4370 -42170 -38589 -7936 -17271 -43394 -43447 -19318 -25209 -26126 -19382 -2391 9132 1432 -2744 -6430
4356 -6430 -7761 833 -28197 -38814 -25208 -13638 -19431 1030 22410 -3941 -42519 -51018 -29968
4343 -29968 -24295 -43981 -34591 -1533 -5728 -26930 -26328 13999 30581 36076 38825 23985 22116
4330 22116 22655 30632 31755 27741 9994 40603 39575 41038 48460 54028 48079 28337 20095 28144
4316 28144 30298 21668 21266 42352 52364 36717 28618 22092 12473 7986 999 6391 6385 -10418 -16069
4301 -16069 1527 -5214 -14878 -8167 -12440 -20335 7566 3047 -19983 -24172 -413 31762 54848
4288 54848 24209 -5908 11088 -1694 7732 -15928 -35826 -15384 -14983 -32550 -25102 -27193 -23769
4275b3769J5890j326k4830j559M0823L3332l3534l9840j7340Q935j3937r39L6264
4262b1830J8400P414j5610k0240L98L1310J3925K3081J1141k1730k7199j2287
4250a3227M520o055j941L8539L0316q877k6264J8164j8532j1513k8209k9956K2130
4237c0905L9089o106j3054M339J5069m948K718r938K820l2034k6475j961L4964
4224b6422K7630j7860n841J8996j3135N880M333O744K979K0079K2886l6788m1827
4211c2346k372J4150J6903O205K4106j144l7977j4301J0113K3400k286j5074Q934
4198a689p032O967r64j351J1976L881j4996j3231K9385j9476j2874q807j20q628
4184c6959J0303j182j1701m204J0821J3847K621J4782l770j4113L835R982k5152
$$ plain form
4275 -23769 -7879 -9205 -34035 -35594 5229 38561 5027 -34813 -52153 -43218 -57155 -58094 -21830
4262 -21830 -3430 3984 -11626 -31866 -31468 -158 13767 36848 47989 26259 -940 -13227
4250 -13227 -8707 -14762 -16703 21836 52152 43275 17011 35175 16643 5130 -23079 -53035 -30905
4237 -30905 8184 2078 -10976 -6637 8432 3484 6202 -3736 -916 -32950 -59425 -61386 -26422
4224 -26422 1208 -16652 -22493 -3497 -16632 -10752 -6419 325 3304 23383 46269 9481 -32346
4211 -32346 -34718 -20568 -3665 2540 26646 25502 -12475 -26776 -16663 6737 4451 -10623 -1689
4198 -1689 -8721 -1754 -2718 -4069 7907 11788 -3208 -16439 12946 -6530 -19404 -28211 -28331 -36959
4184 -36959 -26656 -27838 -39539 -43743 -32922 -19075 -16454 -1672 -5442 -19555 -15720 -5738 -30890
4171c0890J1237R761l203K3428j2591j0986j7138P023P816M639J0282L2193p354
4158B4217l5404k2164J0265j3573l5928L1856L3293p564k5704o125J821m675L4230
4145a5455j9214O085m607L661J3065m37l121J1776J4586q854l6442n13M239J6384
4131a8847R466O084l9642J1930J7773l092j6577n697M5863k808J1163J0816q915
4118A7517p460l495k7195p926Q988N644K5563L4099j2901m311j1360j47J6635
4105C3651r797j0399q520j2120J3307K312k4785l4607q189n789J2589K456L825
4092d6066L402P814r00L1036L9322j6532j9371j272Q542j845j1231j2867J5988
4079c980j481L402k2491j348N203J5465L4543M4524k4471o2881j6608l728J952
$$ plain form
4171 -30890 -19653 -9892 -13095 10333 -2258 -13244 -30382 -23359 -15543 -10904 -622 31571 24217
4158 24217 -11187 -33351 -23086 -36659 -72587 -40731 -7438 -15002 -40706 -46831 -45010 -49685 -15455
4145 -15455 -34669 -28584 -33191 -29530 -16465 -16902 -20023 -8247 6339 -2515 -38957 -39470 -35231 -18847
4131 -18847 -9381 -3297 -42939 -31009 -13236 -16328 -32905 -38602 7261 4453 15616 26432 17517
4118 17517 10057 6562 -20633 -28559 -19571 -13927 11636 45735 32834 28523 17163 17016 33651
4105 33651 23854 13455 4935 -7185 6122 8434 -16351 -50958 -59147 -64936 -52347 -49891 -46066
4092 -46066 -42664 -34850 -35750 -4714 34608 18076 -1295 -2567 5975 4130 -7101 -19968 -3980
4079 -3980 -5461 -2059 -24550 -25898 -20695 -5230 29313 73837 49366 -13515 -30123 -33851 -31899
4066c1899J382J0023J6272J051J1625j7462k0292K0702M792p663J2484K932J6116
4053B0063J4414k5864k976K2901K8582p19n340j049r778k5597k0975Q562J4425
4040A6649Q810R339j0251l1442P58J2606j897r593m311k0094Q898L0336p741m29
4026A638o594j9159J7641Q176j9561J3342K3645q390p199l866n488O504o61j2900
4012a2872m999J0095P766J0547J181J4324P596j23k7212k2101k3170k3046J4649
3999d7365J1439J3591K6670p005j1353n801j1561j898J2600j1966j272K1604K0275
3986G958L9456o029j2279J9138Q886l8770l3618j657q8K0110K7504K8791Q096
3973F7498r489k1078j5430j7902q303k212j1771n379J8421k3950q295r072l445
$$ plain form
4066 -31899 -30517 -20494 -4222 -3171 8454 -9008 -29300 -8598 -3806 -11469 1015 3947 20063
4053 20063 34477 8613 5637 28538 57120 56401 51061 50012 40234 14637 -6338 2224 16649
4040 16649 25459 34798 24547 -6895 -6137 6469 4572 -5021 -9332 -29426 -20528 9808 2067 1638
4026 1638 -4956 -24115 -6474 1702 -17859 -4517 19128 10738 3539 -327 -5815 689 28 -12872
4012 -12872 -17871 -7776 -10 10537 11718 26042 33638 33515 6303 -15798 -38968 -62014 -47365
3999 -47365 -35926 -22335 4335 -2670 -14023 -19824 -31385 -33283 -20683 -32649 -33921 -12317 7958
3986 7958 47414 41385 29106 48244 57130 18360 -15258 -16915 -17003 3107 30611 59402 67498
3973 67498 58009 36931 21501 3599 -4704 -6916 -18687 -24066 -5645 -29595 -37890 -46962 -50407
3960e0407P695R187p116O596l96j2955l621J3807j1869N16J1850K8941j4291k968
3946b5031j2742N873k4936K5620N1822mK6869l0501j9274Q623r330O456k558j5314
3932a4427q923J6025k4821N576r608j6444L080L1473L1993o349k7334J7358R386
3919F985r998q835K5426K1674J5366m7072k6004p736K6885j475k5492O59J8636
3906a0981J1401J3671l452j3100K721M560L4415j5496l1241j476O295J3355K4757
3893C5429j9301k6346l8537R660O717M608J8078K4065L7928j9990j419k7911l0072
3880b7091K750N915j4356j0807J8164K854Q966K040k4170K253L42L4151j9349
3867a8338j7049j913P618l095r867M580J062O850p392q437M111K6357J3438O380
$$ plain form
3960 -50407 -42712 -33525 -40641 -34045 -34441 -47396 -51017 -37210 -49079 -48563 -36713 -7772 -22063 -25031
3946 -25031 -37773 -31900 -56836 -31216 20606 20602 47471 16970 -2304 6319 -3011 3445 887 -14427
3932 -14427 -23350 -7325 -32146 -26570 -36178 -52622 -49542 -18069 13924 7575 -19759 -2401 6985
3919 6985 -3013 -11848 13578 35252 50618 3546 -22458 -30194 -3309 -4784 -30276 -29617 -10981
3906 -10981 420 14091 10639 -2461 260 4820 39235 23739 -7502 -8978 -2683 10672 35429
3893 35429 16128 -10218 -48755 -39095 -32378 -27770 -9692 14373 52301 32311 30892 2981 -27091
3880 -27091 -24341 -18426 -32782 -43589 -25425 -22571 -13605 -11565 -35735 -33482 -33140 1011 -18338
3867 -18338 -35387 -37300 -29682 -32777 -42644 -38064 -37002 -30152 -37544 -45981 -41870 -15513 -2075 4305
3853D305M289J486J80k5578L272K557q445m572q455J5954J5808K708k0458j2135
3839b9084M950K8125J3871J5289n337m222m461k3032j9806l684k2132j1200l638
3826f4361J1540r970R244l72L124j0195N204M13j2163L654J6408O160J4314L3741
3812F741L3049k165k0804J771k0902m032j0061M557K194l154M348J1345j1265
3799h378n579J9938J2970k4269r933j0402J4801k567K822K4254K15k3559j6021
3786b5708o885L638J257k1197o236M28K5473K83j9179R001m200j6396L2231K9882
3772B392Q743q522r859o712L269Q563l8824M042J2499J52L56m310L160Q104l827
3757b0774N590K1716J8619m977k5169k8957K2385M469O510J6659K5975j4081j2019
$$ plain form
3853 4305 8594 10080 10260 -15318 -12046 -9489 -17934 -22506 -30961 -15007 801 3509 -16949 -29084
3839 -29084 -24134 3991 17862 33151 27814 23592 19131 -3901 -23707 -27391 -49523 -60723 -64361
3826 -64361 -52821 -62791 -53547 -53919 -50795 -60990 -55786 -55373 -67536 -63882 -47474 -41314 -27000 6741
3812 6741 39790 37625 16821 18592 -2310 -6342 -16403 -11846 -9652 -12806 -8458 2887 -8378
3799 -8378 -13957 5981 18951 -5318 -15251 -25653 -10852 -13419 -10597 13657 13872 -9687 -25708
3786 -25708 -32593 -28955 -27698 -48895 -55131 -54703 -29230 -28947 -48126 -39125 -43325 -59721 -27490 2392
3772 2392 11135 2613 -7246 -13958 -10689 -2126 -40950 -36908 -24409 -24257 -23901 -28211 -25051 -16947 -20774
3757 -20774 -15184 6532 25151 20174 -4995 -33952 -11567 -7098 -588 16071 42046 27965 15946
3744A5946j1751J7968j465J1263j1031m4126J0609o031j5522K703j400K0452J3257
3731H72K7739P543r30r825k042o532l0699J8567j0928L419l006M619J2740l2935
3717b1398k1010K6621K7058j519k0383n868r62m88K1360J5919n789L712j8286
3704a033J8479o8j8833J7061k037k4522l2606P676K7889j4112j979J7861Q538
3691B314j4012j4079K3600r736N289l3646J0178L9238J535o746n681m358J3414
3678G310J7721j1115k9987k5122J276K7437J7377J3854J9972k2832n812K780j357
3665A1502P83l50m942N565O350j2210J2271J0619L539r678j4579j8428J0972L114
3651D528n647J22m659N191r138j614m021j3312k6111l263K5125q63k5287K257
$$ plain form
3744 15946 4195 22163 20698 31961 20930 -23196 -12587 -18618 -34140 -31437 -32837 -12385 872
3731 872 28611 36154 35224 25399 23357 16825 -13874 4693 -6235 -2816 -5822 -1203 11537 -21398
3717 -21398 -42408 -15787 11271 9752 -10631 -16499 -17461 -17949 3411 19330 13541 17253 -1033
3704 -1033 17446 17378 -1455 15606 13569 -10953 -43559 -35883 -7994 -22106 -24085 -6224 2314
3691 2314 -11698 -25777 -2177 -11913 -6624 -40270 -30092 9146 10681 3935 -1746 -6104 7310
3678 7310 25031 13916 -16071 -41193 -39917 -12480 4897 18751 38723 15891 10079 12859 11502
3665 11502 12285 11935 6993 12558 18908 6698 18969 29588 33127 23449 8870 -9558 1414 4528
3651 4528 -1119 -997 -5656 -465 -9603 -11217 -15238 -28550 -54661 -57924 -32799 -33662 -58949 -56692
3637e6692M4516j833l292J3508K8553l0797q961Q362q939K9914J2046J2081j7144
3624B1322j7847k2921j2958M580K7334Q822p109l657r182M314r087J7415L3408
3611C4434j0330l681J9382j5581j8977j5661K626j9889k1349J8991P674j7138
3599c9499K7419K9787p447k607R628m3328k1350k5788J4994J330j650J686J2359
3586d4466J5462J8624J1606k250p33j0778j7995n832L290J3671j677M731j2436
3573b8783r243K7680j3338l0920j437K6939L1259M063j9417j7083K0271J1580
3561A571J841l5799j2146K3893K3482q603Q549Q918R741k6798j5731P771J9715
3548F404O542l0360j4675J0793J2646k7792Q96R282J2889k4312M595k825L2072
$$ plain form
3637 -56692 -12176 -14009 -17301 -3793 24760 -6037 -14998 -6636 -15575 14339 26385 38466 21322
3624 21322 3475 -19446 -32404 -27824 -490 8332 1223 -2434 -11616 -7302 -16389 1026 34434
3611 34434 24104 20423 39805 24224 5247 -10414 -7788 -27677 -49026 -30035 -22361 -39499
3599 -39499 -12080 17707 10260 7653 17281 -26047 -47397 -73185 -58191 -56861 -58511 -56825 -44466
3586 -44466 -29004 -10380 1226 -1024 -1757 -12535 -30530 -36362 -33072 -19401 -21078 -16347 -28783
3573 -28783 -38026 -10346 -23684 -54604 -56041 -29102 2157 6220 -13197 -30280 -10009 1571
3561 1571 3412 -32387 -44533 -20640 2842 -5761 2788 11706 21447 -5351 -21082 -13311 6404
3548 6404 12946 -17414 -32089 -21296 -8650 -36442 -35546 -26264 -13375 -37687 -33092 -35917 -3845
3535c845r452J7078n68j0342O744L441j9341k0432P660J1246R531p326m356m101
3521b4063K6767j361O555O710J0658m946k0858M578L0933J6928l5973j2883K8080
3508C1125l2686r287N069K405r652n590K7888k1363Q405p972l739j1381L0818
3495D040j956k2074j7598L373Q727O093P624K898k0451K1062K8874P23J7672q343
3481C0664o050j0885N867j0104K57n693p012J1812k5775K398l771m948J182K8862
3467F804K1798Q554m808L0588q636m6676l2318k0510K3891K0249n787J1815P633
3454A2597l0939j6702j3524J4149K9845J8377l785k1570P747r245l548l450k621
3441b2669K4826J1912q236K909J7637N534q072p862q131o042K3859p400l9366
$$ plain form
3535 -3845 -13297 3781 3213 -7129 -385 3056 -16285 -36717 -29057 -17811 -8280 -15606 -19962 -24063
3521 -24063 2704 1343 7898 14608 25266 20320 -538 4040 34973 51901 15928 3045 31125
3508 31125 -1561 -10848 -5779 -3374 -13026 -18616 9272 -12091 -3686 -11658 -15397 -26778 4040
3495 4040 2084 -19990 -37588 -34215 -25488 -19395 -11771 -8873 -29324 -8262 20612 21335 39007 30664
3481 30664 24614 13729 19596 9492 9749 4056 -2956 8856 -16919 -14521 -18292 -23240 -22058 6804
3467 6804 28602 37156 32348 62936 54300 7624 -24694 -45204 -21313 -1064 -6851 4964 12597
3454 12597 -18342 -35044 -48568 -34419 -4574 13803 10018 -11552 -3805 -13050 -16598 -20048 -22669
3441 -22669 2157 14069 5833 8742 26379 31913 23841 15979 7848 1806 25665 18265 -21101
3428b1101j5010k903K628J8971j1010J1586K6518j9594j3184R350k575J1962j3326
3415a7688k0234J9915K3190q531l0210L2033L3212j979L057m053j0077J6403N413
3402D0451j007o576k7192k2881J0684q121K4945J2404r782q814P075j3588m6947
3389d9349n954m543K1912L3523K548n413k0785j0174M048J2187K1619O390K592
3376H601J5232M655m553k1731M754J7059k1558j4507J1651N912P546k5024j6878
3363b8841K5752M370j2344J0741j262K39r765J3552N844p152j1600R980O483q490
3349b493j0303N251J4933J3362q983j5522J2872L1076r519k6737l885l1506j8717
3336e0171j1250N323L5646P009j0498O640j0911n957M294K6239K1645j022J0939
$$ plain form
3428 -21101 -36111 -39014 -36386 -17415 -28425 -16839 9679 -9915 -23099 -13749 -16324 -4362 -17688
3415 -17688 -37922 -18007 5183 -3348 -33558 -1525 31687 29708 32765 28712 18635 35038 40451
3402 40451 39444 32868 5676 -17205 -6521 -14642 10303 22707 12925 4111 11186 -2402 -49349
3389 -49349 -55303 -59846 -37934 -4411 -1863 -7276 -28061 -38235 -34187 -22000 -381 6009 8601
3376 8601 23833 28488 23935 2204 6958 24017 2459 -12048 -397 5515 13061 -11963 -28841
3363 -28841 -3089 1281 -11063 -322 -1584 -1345 -11110 2442 8286 1134 -10466 -486 5997 -2493
3349 -2493 -12796 -7545 7388 20750 11767 -3755 9117 40193 30674 3937 52 -31454 -50171
3336 -50171 -61421 -56098 -20452 -13443 -23941 -17301 -28212 -34169 -29875 -3636 18009 16987 27926
3323B7926K1029N607k4183n538m080l2724j3844P230m766N84J9310N844j0195
3310g800l6440K948L1476l768j8962k5070r199K9593M1243J0632j3460q315k7997
3297c5119K807j656l413J4437n71j592J8626K3226k5720j6707J2137p422K001
3284a8966P083r102n330J5083K807J7988K2969k6936k3295J6551K48O179j091
3271D188J0662J4238j5016j0994J3506Q067n173k867M448k0616o969J0999l2890
3258b8417k912O361r250K5146L6441M950k1205k387J1015o748j7645l0817j9759
3245e5227J0307l806K7385J5902J9726O493J7350l3685l3697r463J2713K5129
3233h73J3464o016J723o42O568N350k1733j1016j1948J0206K0079j84j4120J1033
$$ plain form
3323 27926 48955 54562 30379 24841 20761 -11963 -25807 -18577 -23343 -22759 -3449 2395 -7800
3310 -7800 -44240 -41292 -9816 -13584 -32546 -57616 -66815 -37222 4021 14653 1193 -7122 -35119
3297 -35119 -32312 -33968 -37381 -22944 -23515 -25107 -6481 16745 -8975 -25682 -13545 -20967 -18966
3284 -18966 -11883 -20985 -26315 -11232 -8425 9563 32532 5596 -17699 -1148 -900 5279 4188
3271 4188 14850 29088 14072 3078 16584 24651 19478 16611 21059 443 -6526 4473 -28417
3258 -28417 -31329 -24968 -34218 -9072 27369 32319 11114 8727 19742 12994 -4651 -35468 -55227
3245 -55227 -44920 -48726 -21341 -5439 14287 20780 38130 4445 -29252 -38715 -26002 -873
3233 -873 12591 6575 8298 7656 14224 19574 -2159 -13175 -25123 -14917 5162 4978 -9142 1891
3219A891j3214j2402j0328j8575j4065L713L3165M9450J6564K478j1829j0870
3207A5978K891k00J2166J2152N895j5485k7896j0806J003q559J5381J1155j3175
3194E00P910N878r435J7502K7627m9201k6715N548K0969k4029J5706L6681j0676
3181A8265k5906o192k806k5846J0084J9099K1420j3639L159K06K6822Q270j8007
3168A4929k5643j8464O392K4302J1948j255J1638j1567j1369q418N309r704m933
3155a6835J0412Q227M960J0038J3546m754l0994J0863J7620M235R838Q860m150
3142D1866j2792j0685K664j1290j2746k676k4562R535N504P362J9727R76j2350
3129E33l5184q827J6733K6848J3803k3020k7476j5376m332J2203L4849J3821k9917
$$ plain form
3219 1891 -11323 -23725 -34053 -52628 -66693 -62980 -29815 19635 36199 38677 26848 15978
3207 15978 18869 18669 30835 42987 48882 33397 5501 -5305 -4302 -12861 2520 13675 500
3194 500 8410 14288 4853 22355 49982 781 -25934 -20386 583 -23446 -7740 28941 18265
3181 18265 -7641 -13833 -16639 -42485 -32401 -13302 8118 -5521 -2362 -2156 24666 32936 14929
3168 14929 -10714 -29178 -22786 1516 13464 12209 23847 12280 911 -7507 -2198 -11902 -16835
3155 -16835 -6423 1804 6764 16802 30348 25594 -5400 5463 23083 27318 37156 46016 41866
3142 41866 29074 18389 21053 9763 -2983 -5659 -30221 -20686 -15182 -7820 11907 12883 533
3129 533 -34651 -43478 -26745 103 13906 -9114 -36590 -51966 -56298 -44095 -9246 4575 -25342
3116b5342k7139k849M425J276r247J146p300L535P301J4643O372j2754N914J5864
3102b4155J3732Q674j113l011J240p359j1735N745n010m715J4411r728m4470K951
3088f4543M0499L3335p543j3709P527K577l8840J7167K1296p469j1170m387J2661
3075a2599K7403J9123k2077j5644l571J2223M0521j4478k1890K7848l761n966
3063B7132j5530k0658m7335K0577L4249l0977m562K1211m461j9345K8337j65j3585
3050b5112j9236O850J2824K125J4633j263l270J6488M6561k459l5250r011L638
3037G518j4998r241L241O875j4266p619J9684q598j1233N89R081J4881O29J9054
3023A5597r017r023k2453k1992O554q831M92K5738M3701J3116J6473k33p693k334
$$ plain form
3116 -25342 -52481 -55330 -50905 -49629 -58876 -57730 -65030 -61495 -54194 -39551 -33179 -45933 -40019 -24155
3102 -24155 -10423 -1749 -2862 -5873 -4633 -11992 -23727 -17982 -22992 -27707 -13296 -23024 -67494 -64543
3088 -64543 -24044 9291 1748 -11961 -4434 -1857 -40697 -23530 -2234 -9703 -20873 -25260 -12599
3075 -12599 14804 33927 11850 -3794 -7365 4858 45379 30901 9011 36859 33098 27132
3063 27132 11602 -9056 -56391 -35814 -1565 -32542 -37104 -15893 -20354 -39699 -11362 -11527 -25112
3050 -25112 -44348 -37498 -24674 -22549 -7916 -9179 -12449 4039 50600 48141 12891 3880 7518
3037 7518 -7480 -16721 -13480 -6605 -20871 -28490 -8806 -17404 -28637 -28048 -18967 -4086 -3457 15597
3023 15597 6580 -2443 -24896 -46888 -40334 -49165 -48673 -22935 20766 33882 50355 50122 42429 40095
3009D0095k2293k0675K139J2877j1456K767P9m211j5420q005J5618j2561P333
2996a3713J5231L2499Q369j9596k16Q128l0146k6099R670O235l0522j2700J8473
2983c4387N277L272n109J2328P83l485O343j5992k4101Q317m124k4354M50L5007
2969c9775L691J8451J1661j9611m816Q186J8916j5670k566n359R738n762K5015
2956B099K4418j9464j8160J2695K6029j7835j2956j954k412n305j8216j6175J7636
2943b9600J7704J1753Q315J9371j876j4682j0229k2998j343L5012L865k7110k850
2930a4668L3867J8479p854m438k902k0214j0571p249r488j085L6008K4385P84
2917C5054k1683j8538j5145k134K576k4417O303O1458j063J023r241m345J6579
$$ plain form
3009 40095 17802 -2873 -734 12143 687 3454 3533 -678 -16098 -24103 -8485 -21046 -13713
2996 -13713 1518 34017 42386 22790 22574 30702 556 -25543 -15873 -9638 -40160 -52860 -34387
2983 -34387 -29110 -25838 -30947 -18619 -17836 -21321 -14978 -30970 -55071 -46754 -50878 -75232 -74782 -39775
2969 -39775 -36084 -17633 -5972 -25583 -30399 -22213 -3297 -18967 -21533 -26892 -17154 -22916 2099
2956 2099 26517 7053 -11107 1588 27617 9782 -3174 -5128 -7540 -12845 -31061 -47236 -29600
2943 -29600 -11896 -143 8172 27543 25667 10985 756 -22242 -23585 11427 15292 -11818 -14668
2930 -14668 19199 37678 29824 25386 22484 2270 -8301 -15550 -25038 -26123 9885 34270 35054
2917 35054 13371 -5167 -20312 -22446 -19870 -44287 -37984 23474 22411 23434 14193 9848 26427
2904B6427n039k4072M929J0757k4992m2070J413L70j601K4277L1983k9894j8494
2891d6006k063J7298L385L600M567R477K8718j230K496p796R05J3377J8131l5119
2877I740k8996j2861J722J0198K1111k1292j0500L0178J3263P941q584k2816m142
2864a5038K6912O425J6200j3990k2937o086p237r58j0921j1422R945O268P403
2851a5436k5919k5842N040K6451K9759L038k1384j2692J0480J4955J5084P339
2839A0873n6515r590M0661J2686J5175M745p086n385M917j0598J9532o085k7707
2826a4377j3609j2526J7990K888L5155K1836l1174k1319J1557n706J5284j2800
2814f801l929n110P114m493R365J9906j2923M841j290J789J3667j5035j5748k54
$$ plain form
2904 26427 21388 -2684 2245 13002 -11990 -54060 -52647 -52277 -53878 -29601 2382 -27512 -46006
2891 -46006 -48069 -30771 -27386 -23786 -19219 -9742 18976 17746 20242 12446 13351 26728 44859 9740
2877 9740 -19256 -32117 -30395 -20197 914 -20378 -30878 -700 12563 20504 11920 -10896 -15038
2864 -15038 11874 18299 34499 20509 -2428 -8514 -15751 -16709 -27630 -39052 -29107 -22839 -15436
2851 -15436 -41355 -67197 -62157 -35706 -5947 -2909 -24293 -36985 -26505 -11550 3534 10873
2839 10873 -45642 -55232 -14571 -1885 13290 18035 10949 5564 10481 -117 19415 13330 -14377
2826 -14377 -27986 -40512 -22522 -19634 15521 37357 6183 -15136 -3579 -9285 5999 -6801
2814 -6801 -10730 -15840 -8726 -13219 -3854 16052 3129 7970 6680 8469 22136 7101 -8647 -8901
2800h901K263J1341J188K7772J3850j2551j7997Q524k553p473j2932Q860K6587
2787C7978j7917J194o4336j7931M4405J4998j4307r038N28J5107K4093K8443o070
2774C7147r180J1229q065p109O607j7605l7723j8159j01K8811M1356l010L330
2761B7528n575q794j3372k5391L9219J3333k4120k0819J7862M962j2055j6489
2749b3711J2956K9256Q498L78P2j2440J3701K4485n303K6072L579k4007o1519
2736g983M36J9565n423k3825M297k873Q307p322k6153N697k7842k288J0328Q997
2722d6082N789O514j2009P572L1404J6101k340o343J1104K086L671L5957P371
2709F0795J0521l111l7205l2868l2112q34K0063N173R00J9381L353j0913j8458
$$ plain form
2800 -8901 -6638 4703 5891 33663 47513 34962 16965 25489 22936 15463 2531 11391 37978
2787 37978 20061 21255 -43081 -61012 -16607 -1609 -15916 -24954 -24426 -9319 14774 43217 37147
2774 37147 27967 39196 31131 24022 30629 13024 -24699 -42858 -42959 -14148 27208 24198 27528
2761 27528 21953 13159 -213 -25604 13615 26948 2828 -17991 -129 4833 -7222 -23711
2749 -23711 -10755 18501 26999 27377 27449 15009 28710 53195 47892 73964 77543 53536 -7983
2736 -7983 -7547 12018 6595 -17230 -12933 -15806 -7499 -14821 -40974 -35277 -63119 -65407 -55079 -46082
2722 -46082 -40293 -33779 -45788 -38216 -6812 9289 6949 606 11710 13796 17467 53424 60795
2709 60795 71316 68205 31000 -1868 -33980 -34814 -14751 -9578 -8678 10703 14056 3143 -15315
2696a5315J644o096j1344P794K1936L582P820j6400k3676j6604K1635J9049J2947
2683F972J9061J0036l816k5367J0119J5265J9692j4668j3107M004P031j9514k7051
2670a1343j0215p452J1479k49m792K7878J5722q107l522K1308j3659k6766j5323
2657b5041n501j4324J0009q565K5386J693Q035K1116O579r971N75r622J2863K6003
2643C9235l0024j3158M629K0402J2120j9879m698q746m142p003j6953j2276j4760
2630e5253l409K2067L6002J1470k50k4771K3385J0319L933L4398L605k1105k8395
2617A1996k342o876N288N653J5582K9159p155k4638l9707j5786j6752j019K6098
2604b0499K3395J7774J5002J6001j5823k8803J0503r104j6033r158j8632r917
$$ plain form
2696 -15315 -13671 -19767 -31111 -23317 -1381 2201 10021 -6379 -30055 -46659 -25024 -5975 6972
2683 6972 26033 36069 32253 6886 17005 32270 51962 37294 24187 28191 35222 15708 -11343
2670 -11343 -21558 -29010 -17531 -17780 -22572 5306 21028 12921 9399 30707 17048 -9718 -25041
2657 -25041 -30542 -44866 -34857 -43422 -18036 -16343 -8308 12808 19387 9416 9991 369 13232 39235
2643 39235 9211 -3947 682 21084 33204 13325 8627 -119 -4261 -11264 -28217 -40493 -55253
2630 -55253 -58662 -36595 -593 10877 10627 -14144 9241 19560 23493 57891 61496 40391 11996
2617 11996 9654 2778 8066 13719 29301 58460 51305 26667 -13040 -28826 -45578 -46597 -20499
2604 -20499 2896 20670 35672 51673 35850 7047 17550 8446 -7587 -16745 -35377 -45294
2592d5294J2872J6239P32M695L7474j2476k893j409n674j0643j2056l6258l4062
2579h8753J0528K9940J8195K0670J8184r541o115j6543j2980j2232L627J3324
2567c1696J2203K3496J0691j0231o276m275J1231r462L013l305r864K59K3497
2554I281J4577j6196r016K7214N245Q064J7953o459j6964J3339J9494L4343J8637
2541A19512k3818j0079l7436m6473j3744j9991j9273K7124K2765q902j5598j9305
2529d5218O140q773J077M2116K0058j3066L556J0711j2662k2089k0823r27L9806
2516i4K5282m318o889N973p869MK433J9662J5156k1093m881m780q362J5879r923
2501A6180N369m0341j1021L9725L2279o399k9755k155J3889J0578J898k1789R724
$$ plain form
2592 -45294 -32422 -16183 -15451 -10756 26718 14242 11349 9940 4266 -6377 -18433 -54691 -88753
2579 -88753 -78225 -48285 -30090 -9420 8764 -777 -6892 -23435 -36415 -48647 -45020 -31696
2567 -31696 -19493 4003 14694 4463 -1813 -6088 5143 -4319 -1306 -4611 -14475 -14216 9281
2554 9281 23858 7662 -1354 25860 31105 39169 57122 50663 33699 47038 66532 100875 119512
2541 119512 95694 85615 48179 1706 -12038 -32029 -51302 -24178 -1413 -10315 -25913 -45218
2529 -45218 -39078 -47851 -46774 -4658 15400 2334 5890 16601 3939 -18150 -38973 -39900 -94
2516 -94 25188 20870 13981 19954 12085 12089 14522 34184 49340 28247 23366 18586 10224 26103 16180
2501 16180 21549 -18792 -29813 9912 42191 35792 6037 3882 17771 28349 30247 8458 18182
2488A8182J1238l8082j5233j2115j0789K7023L3037m585m7038j9311M848K4223
2476b8602m597P094R989j8039J8789L3708J9942j8603j2921L666l2963l245J8666
2463g116J8689q446J0765P865j2613l1700j6253j3775L181k928j8797K1271J3663
2450c6194L2660J9613k077j9427J7927j4946k4243J2149M739m298J542O566K2674
2437A6685n758j3884j9437m041Q009j0178Q164K1063K5661o577m039j7218p348
2424h898j1499L3624j34j3924o714k7669p4J2142l116J3874J2759j0060j929Q1
2410a1537j3721K1703K8132N57q992N500k0121J1647J2837k5824J3324Q931R416
2397C1852r022O533m870r729j2154J3619j9158j0664n979J0313n9K092K7549r318
$$ plain form
2488 18182 29420 -8662 -23895 -36010 -46799 -19776 13261 8676 -38362 -57673 -52825 -28602
2476 -28602 -33199 -26105 -16116 -34155 -15366 18342 38284 19681 6760 10426 -22537 -25782 -7116
2463 -7116 11573 3127 13892 21757 9144 -22556 -38809 -52584 -49403 -52331 -71128 -49857 -36194
2450 -36194 -3534 16079 14002 -5425 12502 -2444 -26687 -14538 -9799 -14097 -12555 -5989 16685
2437 16685 10927 -2957 -22394 -26435 -18426 -28604 -20440 623 26284 19707 15668 -1550 -8898
2424 -8898 -20397 13227 13093 -831 -7545 -35214 -35288 -23146 -26262 -12388 371 -9689 -11618 -11537
2410 -11537 -25258 -3555 24577 25134 16142 21642 1521 13168 26005 181 13505 22436 31852
2397 31852 22830 29363 24493 14764 2610 16229 -2929 -13593 -19572 -9259 -9318 -7226 20323 11005
2383A1005J701j59j1349k456J2417K4442K6287N77j3344k7874Q299n618j1606
2370A2322j7019k0089J1796q305m355M8988L246l663L733l6963j804K230m027
2357a3910j6486K2011J8161j0144k2140J5781J4014J4498q321l3550l5207J5626
2345c9667K7839J8995J1788m639k5569o760n855j1044J1256J0088J7846J7938
$$ plain form
2383 11005 12706 12547 1198 -1258 11159 35601 61888 62465 49121 21247 29546 23928 12322
2370 12322 -4697 -24786 -12990 -21295 -25650 23338 26584 22921 26654 -10309 -12113 -9883 -13910
2357 -13910 -30396 -8385 9776 -368 -22508 -6727 7287 21785 13464 -20086 -55293 -39667
2345 -39667 -11828 7167 18955 14316 -11253 -18013 -23868 -34912 -23656 -13568 4278 22216
$$ [...]
##END NTUPLES=NMR SPECTRUM
##END=
