##TITLE=Analysis number 323721
Compound Code mo 07020
Project Code adrs
Chemist Name spectrum
##JCAMPDX= 6.0         $$ Bruker NMR JCAMP-DX V2.0
##DATA TYPE= NMR SPECTRUM
##DATA CLASS= NTUPLES
##ORIGIN= Bruker BioSpin GmbH
##OWNER= nmr
$$ XWIN-NMR		Version 3.5
$$ Fri Nov  3 15:41:20 2006 GMT Standard Time (UT+0h)  MAYBRIDGE\nmr@NMR_250MHZ
##.OBSERVE FREQUENCY= 250.131544655141
##.OBSERVE NUCLEUS= ^1H
##.ACQUISITION MODE= SIMULTANEOUS (DQD)
##.ACQUISITION SCHEME= undefined
##.AVERAGES= 16
##.DIGITISER RES= 18
##SPECTROMETER/DATA SYSTEM= dpx250
##.PULSE SEQUENCE= zg30
##.SOLVENT NAME= CDCl3
##.SHIFT REFERENCE= (INTERNAL, CDCl3, 0, 16.522)
##AUDIT TRAIL= $$ (NUMBER, WHEN, WHO, WHERE, WHAT)
$$ ##TITLE= Audit trail, XWIN-NMR		Version 3.5
$$ ##JCAMPDX= 5.01
$$ ##ORIGIN= Bruker BioSpin GmbH
$$ ##OWNER= nmr
$$ C:\u/data/dgb/nmr/ADRS/2200/pdata/1/auditp.txt
$$ ##AUDIT TRAIL=  $$ (NUMBER, WHEN, WHO, WHERE, WHAT)
(   1,<2006-11-03 15:40:43.03 +000>,<MAYBRIDGE\nmr>,<NMR_250MHZ>,
      <created by zg, POWCHK disabled, PULCHK disabled
       configuration hash MD5:
       49 4B E0 1D 92 C2 6B 37 9F E6 65 BC 52 41 86 1D
       data hash MD5: 64K
       16 E5 C5 18 AE E4 6C 52 B9 ED 1C 1E F4 92 C6 65>)
(   2,<2006-11-03 15:41:01.34 +000>,<MAYBRIDGE\nmr>,<NMR_250MHZ>,
      <Start of raw data processing
       ef LB = 0.3 FT_mod = 6 PKNL = 1 SI = 32K 
       data hash MD5: 32K
       66 94 08 FB 6E 62 62 FF DC 9E ED 0E E4 DF FB 2F>)
(   3,<2006-11-03 15:41:05.62 +000>,<MAYBRIDGE\nmr>,<NMR_250MHZ>,
      <apk 
       data hash MD5: 32K
       BF 9C EF C9 FA 37 D9 2F 41 ED 5D AF B6 5E 80 BA>)
(   4,<2006-11-03 15:41:07.22 +000>,<MAYBRIDGE\nmr>,<NMR_250MHZ>,
      <abs ABSG = 5 
       data hash MD5: 32K
       EF FA 70 13 5D BB A2 A7 A8 4F 0C 38 6B 8E 29 51>)
$$ ##END=
$$ 
$$ hash MD5
$$ 8F E8 48 6F 7B 1D D3 BF FB 73 17 C6 23 CB 65 12
##$RELAX= 
##$RELAX= 
##$RELAX= 
##$RELAX= 
##$RELAX= 
##$RELAX= 
##$RELAX= 
$$ Bruker specific parameters
$$ --------------------------
##$DU= <C:\u>
##$EXPNO= 2200
##$NAME= <ADRS>
##$PROCNO= 1
##$TYPE= <nmr>
##$USER= <dgb>
##$AMP= (0..31)
100 100 100 100 100 100 100 100 100 100 100 100 100 100 100 100 100 100 
100 100 100 100 100 100 100 100 100 100 100 100 100 100 
##$AQSEQ= 0
##$AQ_mod= 3
##$AUNM= <au_zg>
##$AUTOPOS= <36 >
##$BF1= 250.13
##$BF2= 250.13
##$BF3= 250.13
##$BF4= 250.13
##$BF5= 500.13
##$BF6= 500.13
##$BF7= 500.13
##$BF8= 500.13
##$BYTORDA= 1
##$CFDGTYP= 0
##$CFRGTYP= 5
##$CHEMSTR= <none>
##$CNST= (0..31)
1 1 145 1 1 1 1 1 1 1 1 1 1 1 1 1 1 1 1 1 1 1 1 1 1 1 1 1 1 1 1 1 
##$CPDPRG= <>
##$CPDPRG1= <>
##$CPDPRG2= <>
##$CPDPRG3= <>
##$CPDPRG4= <mlev>
##$CPDPRG5= <mlev>
##$CPDPRG6= <mlev>
##$CPDPRG7= <mlev>
##$CPDPRG8= <mlev>
##$CPDPRGB= <>
##$CPDPRGT= <>
##$D= (0..31)
0 1 0 0 0 0 0 0 0 0.06 0 0 0 0 0 0 0.0002 0 0 0 0 0 0 0 0 0 0 0 0 0 0 
0 
##$DATE= 1162568440
##$DBL= (0..7)
120 120 120 120 120 120 120 120 
##$DBP= (0..7)
150 150 150 150 150 150 150 150 
##$DBP07= 0
##$DBPNAM0= <>
##$DBPNAM1= <>
##$DBPNAM2= <>
$$ [...]
##$SUBNAM7= <"">
##$SUBNAM8= <"">
##$SUBNAM9= <"">
##$SW= 20.6930455092707
##$SWIBOX= (0..15)
0 0 3 0 0 0 0 0 0 0 0 0 0 0 0 0 
##$SW_h= 5175.983436853
##$TD= 65536
##$TD0= 1
##$TE= 683.16
##$TE2= 300
##$TE3= 300
##$TEG= 300
##$TL= (0..7)
0 120 120 120 120 120 120 120 
##$TP= (0..7)
150 150 150 150 150 150 150 150 
##$TP07= 0
##$TPNAME0= <>
##$TPNAME1= <>
##$TPNAME2= <>
##$TPNAME3= <>
##$TPNAME4= <>
##$TPNAME5= <>
##$TPNAME6= <>
##$TPNAME7= <>
##$TPOAL= (0..7)
0.5 0.5 0.5 0.5 0.5 0.5 0.5 0.5 
##$TPOFFS= (0..7)
0 0 0 0 0 0 0 0 
##$TUNHIN= 0
##$TUNHOUT= 0
##$TUNXOUT= 0
##$USERA1= <user>
##$USERA2= <user>
##$USERA3= <user>
##$USERA4= <user>
##$USERA5= <user>
##$V9= 5
##$VALIST= <valist>
##$VCLIST= <CCCCCCCCCCCCCCC>
##$VD= 0
##$VDLIST= <DDDDDDDDDDDDDDD>
##$VPLIST= <PPPPPPPPPPPPPPP>
##$VTLIST= <TTTTTTTTTTTTTTT>
##$WBST= 1024
##$WBSW= 4
##$XGAIN= (0..3)
0 0 0 0 
##$XL= 0
##$YL= 0
##$YMAX_a= 445301
##$YMIN_a= -299113
##$ZGOPTNS= <>
##$ZL1= 120
##$ZL2= 120
##$ZL3= 120
##$ZL4= 120
##$ABSF1= 16.522
##$ABSF2= -4.171173
##$ABSG= 5
##$ABSL= 3
##$ALPHA= 0
##$AQORDER= 0
##$ASSFAC= 0
##$ASSFACI= 0
##$ASSFACX= 0
##$ASSWID= 0
##$AUNMP= <proc_1d>
##$AZFE= 0.1
##$AZFW= 0.1
##$BCFW= 0
##$BC_mod= 0
##$BYTORDP= 0
##$COROFFS= 0
##$CY= 12.5
##$DATMOD= 1
##$DC= 0
##$DFILT= <>
##$DTYPP= 0
##$F1P= 14.0000005364418
##$F2P= -0.99999901652339
##$FCOR= 0.5
##$FTSIZE= 32768
##$FT_mod= 6
##$GAMMA= 0
##$GB= 0
##$INTBC= 1
##$INTSCL= 1
##$ISEN= 128
##$LB= 0.3
##$LEV0= 0
##$LPBIN= 0
##$MAXI= 10000
##$MC2= 0
##$MEAN= 0
##$ME_mod= 0
##$MI= 0
##$NCOEF= 0
##$NC_proc= -3
##$NLEV= 6
##$NOISF1= 0
##$NOISF2= 0
##$NSP= 0
##$NTH_PI= 0
##$NZP= 0
##$OFFSET= 16.522
##$PC= 1
##$PHC0= -39.90126
##$PHC1= 10.70065
##$PH_mod= 1
##$PKNL= yes
##$PPARMOD= 0
##$PSCAL= 4
##$PSIGN= 0
##$REVERSE= no
##$SF= 250.13
##$SI= 32768
##$SIGF1= 0
##$SIGF2= 0
##$SINO= 400
##$SIOLD= 32768
##$SREGLST= <1H.CDCl3>
##$SSB= 0
##$STSI= 32768
##$STSR= 0
##$SW_p= 5175.98343685301
##$SYMM= 0
##$S_DEV= 0
##$TDeff= 65536
##$TDoff= 0
##$TI= <Analysis number 999999
Compound Code 99
Book Reference 9
Project Code 9>
##$TILT= no
##$TM1= 0
##$TM2= 0
##$TOPLEV= 0
##$USERP1= <user>
##$USERP2= <user>
##$USERP3= <user>
##$USERP4= <user>
##$USERP5= <user>
##$WDW= 1
##$XDIM= 32768
##$YMAX_p= 301439024
##$YMIN_p= -195881
$$ End of Bruker specific parameters
$$ ---------------------------------
##NTUPLES= NMR SPECTRUM
##VAR_NAME=  FREQUENCY,     SPECTRUM/REAL,   SPECTRUM/IMAG
##SYMBOL=    X,             R,               I
##VAR_TYPE=  INDEPENDENT,   DEPENDENT,       DEPENDENT
##VAR_FORM=  AFFN,          ASDF,            ASDF
##VAR_DIM=   32768,         32768,           32768
##UNITS=     HZ,            ARBITRARY UNITS, ARBITRARY UNITS
##FACTOR=    0.157963299565203, 1,           1
##FIRST=     4132.6476996994, 0,             0
##LAST=      -1043.33573715361, 0,           0
##MIN=       -1043.33573715361, -195881,     0
##MAX=       4132.6476996994, 301439024,     0
$$ Real data points
##PAGE= N=1
##DATA TABLE= (X++(R..R)), XYDATA
$$ [...]
18235A15664J2389O0842K1464J0994j2670K776m4756n6649L1622J677M531m943
$$ 115664 128053 188895 210359 221353 208683 211459 166703 110054 141676 143353 147884 142941
18223A42941L4931O855n8223m3106r09L4438N8420l6367k5819r788K2090l954
$$ 142941 177872 184727 126504 83398 82489 116927 175347 138980 113161 103373 125463 121509
18211A21509k0899l9861O2409J8239k9888J1788k9284J4282J1530J5643M0436
$$ 121509 100610 60749 123158 141397 111509 123297 94013 108295 119825 135468 175904
18200A75904m933l4348l215J5047k169j387M6242J3640K7347p748o3776j3061
$$ 175904 170971 136623 133408 148455 146286 144899 191141 204781 232128 224380 160604 147543
18188A47543K8340K1231j264L162Q546L4266K0009L011n2187l3197j6645L2720
$$ 147543 175883 197114 195850 199012 207558 241824 261833 264844 212657 179460 162815 195535
18176A95535L7478M4559K3614J23J3546J6800O4831Q7627L971n3406p127k6867
$$ 195535 233013 277572 301186 301309 314855 331655 396486 484113 488084 434678 427551 400684
18164D00684Q733j4347o0544N6587L1874j192j4374L9499K4138R420N4473M9154
$$ 400684 409417 395070 334526 391113 422987 421795 407421 446920 471058 480478 534951 584105
18152E84105L1184j4055l2657O833L8057R442L0207M1937M6194K3870n076P4040
$$ 584105 615289 601234 568577 575410 613467 622909 653116 695053 741247 765117 760041 834081
18140H34081M3948N981J7606K6394N8498J213Q8623J05346P2090P8758R5912R6760
$$ 834081 878029 884010 901616 928010 986508 987721 1076344 1181690 1253780 1332538 1428450 1525210
18128A525210J14001J26198J24765K00623K17765K84769M05917N10882O23235
$$ 1525210 1639211 1765409 1890174 2090797 2308562 2593331 2999248 3510130 4133365
18119D133365P94595J049074J549601K167643L190360N017698Q362283J3497793
$$ 4133365 4927960 5977034 7526635 9694278 12884638 17902336 26264619 39762412
18111C9762412J7754528J3604206Q97719j2457072j7377134j1534111o726685
$$ 39762412 57516940 71121146 72018865 59561793 42184659 30650548 23923863
18104B3923863m190952l129382k629258k176120j573639j028409n87655k58640
$$ 23923863 19732911 16603529 13974271 11798151 10224512 9196103 8608448 8349808
18096H349808n6814K85408O60129J072458J742579K685747M355254O904628J0265802
$$ 8349808 8292994 8578402 9238531 10310989 12053568 14739315 19094569 25999197 36264999
18087C6264999J2608757J0599094L823621m237077q519080q036423o834201o337233
$$ 36264999 48873756 59472850 63296471 59059394 50540314 42503891 35669690 29332457
18079B9332457n691467m039757k316003p59872O78885J864631K360346J445061
$$ 29332457 23640990 19601233 17285230 16525358 17204243 19068874 21429220 22874281
18071B2874281o57063k776326l687951l149911k247841j603314j119793p26391
$$ 22874281 22217218 19440892 15752941 12603030 10355189 8751875 7632082 6905691
18063F905691m66472l21936j86358q2420q5683j38330n2297p230K5830M5474J03157
$$ 6905691 6439219 6117283 5930925 5848505 5762822 5624492 5572195 5564965 5590795 5636269 5739426
18052E739426K76001M57189P17260J085909J674017K445521L302906L773198L065240
$$ 5739426 6015427 6472616 7189876 8275785 9949802 12395323 15698229 19471427 22536667
18043B2536667J095873j195770k482271k144538j016972M00482J978128L851458
$$ 22536667 23632540 22436770 19954499 17809961 16792989 17193471 19171599 23023057
18035B3023057N906695P641960Q783699J0074305J0967297Q328695O4187r830259
$$ 23023057 28929752 36571712 45355411 55429716 66397013 74725708 74789895 64959636
18027F4959636j5333025j3651004r543942o290655m269154k938225j938304j297686
$$ 64959636 49626611 35975607 26431665 20141010 15871856 12933631 10995327 9697641
18019I697641r65566o17769k92062J3344L58417O80125R70661P40264m4596j014900
$$ 9697641 8732075 8114306 7822244 7835588 8194005 8874130 9844791 10585055 10540459 9525559
18009I525559j556455j338122r84356o93842n08494l28704k42672k09646j00412
$$ 9525559 7969104 6630982 5646626 4952784 4444290 4115586 3872914 3663268 3562856
18000C562856q0285k02944k62651k32478k32540j54208j57616j88107j57852j23978
$$ 3562856 3482571 3279627 3016976 2784498 2551958 2397750 2240134 2052027 1894175 1770197
17990A770197r2401p7035n0207k6350q045K0766m1449J6211j1705o1097j04086
$$ 1770197 1677796 1600761 1550554 1524204 1516159 1536925 1495476 1511687 1499982 1438885 1334799
17979A334799l2121l2651m2194k7665m8800j12423r2517j22488k1208M6377n9021
$$ 1334799 1302678 1270027 1227833 1200168 1151368 1038945 946428 823940 802732 849109 790088
17968G90088j1014J904k7659j1202m95K5285l1036m8371j9619M0238K8273j2363
$$ 790088 779074 780978 753319 742117 741622 766907 735871 687500 667881 708119 736392 724029
17956G24029r7278m2350n580k1852L694o5056r726J155J9960m5562L3835L3697
$$ 724029 626751 584401 578821 556969 560663 495607 485881 487036 506996 461434 495269 528966
17944E28966K179L2636J3041n4315L903n068l9799n6498m9914m315P3888L7231
$$ 528966 531145 563781 576822 522507 526410 521342 481543 425045 375131 370816 444704 481935
17932D81935q686j5494p9362m2303m7873J0761L3304K2790J805M840j4906o1623
$$ 481935 473249 457755 378393 336090 288217 298978 332282 355072 356877 361717 346811 285188
17920B85188j5725N594R148j0493k7613r198P703J2643J4190J1239J1975k023
$$ 285188 269463 275057 284205 273712 246099 236901 244604 257247 271437 282676 294651 292628
17908B92628j9015k0537J3884J3561j2569k4423K5842J6567n1276o2655M985k1734
$$ 292628 273613 253076 266960 280521 267952 243529 269371 285938 234662 172007 176992 155258
17896A55258j5778l9563k1663j3179J24233M7415l5887j3132Q1j9281J0346M1675
$$ 155258 139480 99917 78254 65075 189308 236723 200836 187704 187785 168504 178850 220525
17884B20525o1288l2153R029l2707J9672J9661K2398L9494M59m1269n7740p531
$$ 220525 159237 127084 136113 103406 123078 142739 165137 204631 205090 163821 106081 98550
17872I8550J2019M4403k0762K6328O5028j9654p2429L9269k968j4487j6664L688
$$ 98550 110569 154972 134210 160538 225566 205912 133483 172752 169784 155297 138633 142321
17860A42321m5855l0573m1127K2057M863N1646J4835N153k2676K0625j413J0832
$$ 142321 96466 65893 24766 46823 51686 103332 118167 123320 100644 121269 119856 130688
17848A30688M9733q00p2149j02839Q869L6970k5593m0045l5337q501O0995N1407
$$ 130688 180421 179621 107472 4633 13502 50472 24879 -15166 -50503 -59004 1991 53398
17836E3398m699K4499n912j1221j1033L53M4541K4543k6407o0532o572P5212K8727
$$ 53398 48699 73198 67286 56065 45032 45385 89926 114469 88062 27530 20958 96170 124897
17823A24897L8318k5258k873q563J1428l2174l8714K0040K4578L0323K4j814R183
$$ 124897 163215 137957 135084 126521 137949 105775 67061 87101 111679 142002 142026 140212 149395
17810A49395J733J383K91l0828l6566l4232K1959M7014K006l950l0663p0093J9770
$$ 149395 151128 152511 152802 121974 85408 51176 73135 120149 122155 118205 87542 17449 37219
17797C7219N6504R311l3313Q963M890Q625m4589J7959J3922j0741p376J5498r728
$$ 37219 93723 103034 69721 78684 83574 92199 47610 65569 79491 68750 61374 76872 67144
17784F7144l1443j8765N9170O2169N827lk5935m6618k2369n265L212L985R0278
$$ 67144 35701 16936 76106 138275 144102 144099 118164 71546 49177 43912 47124 51109 141387
17771A41387K183k9158r380l2554k0136o731J9125O0823K6636j9856N175M5318
$$ 141387 143570 114412 105032 72478 52342 45611 64736 125559 152195 132339 137514 182832
17759A82832k7182K3095M4118j6915j736n783k0244k6480m0616J1123k3313R481
$$ 182832 155650 178745 222863 205948 204212 198429 178185 151705 111089 122212 98899 108380
17747A08380P6203p5991k6519J2156L267j0728k6957m0523K6440N3642k6555o486
$$ 108380 184583 108592 82073 94229 97496 86768 59811 19288 45728 99370 72815 66329
17735F6329j9213l9772l066O6509M4964l5596l9242N927K8446J7774m4911m3099
$$ 66329 47116 7344 4278 70787 115751 80155 40913 46840 75286 93060 48149 5050
17723E050L8332O0169j7555P714l3179p6951M0955L6904n5725n8408P5146P4450
$$ 5050 43382 103551 85996 93710 60531 -16420 24535 61439 5714 -52694 22452 96902
17711I6902j8731L241N115N988r183J9737m2722M309K8124M3618k3071k5298K3081
$$ 96902 78171 81412 86527 92515 83332 103069 60347 64656 92780 136398 113327 88029 111110
17698A11110J968k8759l937O730J4416M2282L9490L315k2007K0300l5419j7015
$$ 111110 113078 84319 80382 87112 101528 143810 183300 186615 164608 184908 149489 132474
17686A32474k2330l9484j6557J8347M1272K0102m562j7665m7858k5232J6725K3426
$$ 132474 110144 70660 54103 72450 113722 133824 129262 111597 63739 38507 55232 78658
17674G8658P998M9327j9406k3802k8118j3677J693Q7220O2453K9062k010l7793
$$ 78658 86656 135983 116577 92775 64657 50980 52673 139893 202346 231408 229398 191605
17662A91605K5467l55m8014P629J1277M375L929k7633k6570M207m6285j1821j176
$$ 191605 217072 216717 168703 176332 187609 191984 195913 168280 141710 145917 99632 87811 86635
17649H6635O031Q659K3281l7484K6736Q29J999P1374Q28k2148j7740J2826N6914
$$ 86635 92666 101325 124606 87122 113858 114687 116686 188060 188888 166740 149000 161826 218740
17636B18740M581k7102K8509L0147k7503J3868K2279K0983m0618K8148J5012k1117
$$ 218740 223321 196219 224728 254875 227372 241240 263519 284502 243884 272032 287044 265927
17624B65927j2979L759J8924J093l2435j3586o4832J4153L7786J918R6318K6054
$$ 265927 252948 256707 275631 276724 244289 230703 165871 180024 217810 219728 316046 342100
17612C42100p217M852o2605O41M4522j4698l055j0839p0376j2861k5496l0059
$$ 342100 334883 339735 277130 277771 322293 307595 304540 293701 223325 210464 184968 154909
17600A54909k7346N683N0442j394l5287O3840L1648n8918j4569J0816R6859K6315
$$ 154909 127563 133246 183688 182294 147007 210847 242495 183577 169008 179824 276683 302998
17588C02998k8939M5606M0360k7843N566N9797N1925j8501k5778L2564m4447m4069
$$ 302998 274059 319665 360025 332182 337748 397545 449470 430969 405191 437755 393308 349239
17576C49239L7522P4286K7237L6854N4528r222m4913l5965k044l7725n2919N740
$$ 349239 386761 461047 488284 525138 579666 570444 525531 489566 487522 449797 396878 402618
17564D02618N8700P658o0262L5857M5663M890o7329k4993k8358J7931O6103M6583
$$ 402618 461318 468976 408714 444571 490234 495124 427795 402802 374444 392375 458478 505061
17552E05061N817M1598J6618k5175N005k2732M9703P4420P1246M0679L1568L1834
$$ 505061 510878 552476 569094 543919 548924 526192 575895 650315 721561 762240 793808 825642
17540H25642K0637P0152O4190O4046J4671K9734N7908o561k1084m584M8863J03829
$$ 825642 846279 916431 980621 1044667 1059338 1089072 1146980 1140419 1119335 1114751 1163614 1267443
17528A267443J11301R0847R3684J78103L00235L93526L68677M21207M81012N54226
$$ 1267443 1378744 1469591 1563275 1741378 2041613 2435139 2803816 3225023 3706035 4260261
17518D260261R26448J220664J237377Q56372J35385o15941r18158p11394l63140
$$ 4260261 5186709 6407373 7644750 8501122 8636507 8020566 7102408 6391014 6027874
17509F027874L5191K98706O25466R36003J275140J762022K596503L924113O196316
$$ 6027874 6063065 6361771 6987237 7923240 9198380 10960402 13556905 17481018 23677334
17500B3677334R448220J3018147J4342712J0429251K145185o103776r892064r572735
$$ 23677334 33125554 46143701 60486413 70915664 73060849 66957073 57065009 47492274
17492D7492274q323440p314876n973301m176860k395960q27776N43015J643113
$$ 47492274 39168834 31853958 25880657 21703797 19307837 18480061 19023076 20666189
17484B0666189K091873J243121o57141k583548l550838l345994k508188j800493
$$ 20666189 22758062 24001183 23344042 20760494 17209656 13863662 11355474 9554981
17476I554981j235388q03796n98524m46206k72931k84452k84218j45683r8040
$$ 9554981 8319593 7515797 6917273 6471067 6198136 5913684 5629466 5483783 5385743
17467E385743m6769J7012J45886J57358J80993L32434N48480R51109J451070K143654
$$ 5385743 5338974 5355986 5501872 5659230 5840223 6172657 6721137 7672246 9123316 11266970
17457A1266970K915429L258570K655081J018731q28787j882864j678137o63872
$$ 11266970 14182399 17440969 20096050 21114781 20285994 18403130 16724993 16061121
17449A6061121N71448J989745L471185M919499O065575P069016Q107709Q099246
$$ 16061121 16632569 18622314 22093499 27012998 33078573 40147589 48255298 56354544
17441E6354544M928346j683702q465436j1614596j0262952p401255n021894l408181
$$ 56354544 61282890 59599188 51133752 39519156 29256204 21854949 16833055 13424874
17433A3424874k330977j560428j082411q26054o46200l80162j87883J20147M19625
$$ 13424874 11093897 9533469 8451058 7625004 6978804 6598642 6410759 6530906 6950531
17424F950531N62746N07916M8668n56957j018832r49724p60502n06863l73003
$$ 6950531 7513277 8021193 8069861 7512904 6494072 5544348 4783846 4276983 3903980
17415C903980l09862l35844l57773k69426j56903j72564j70249q7514o3851p5419
$$ 3903980 3594118 3258274 2900501 2631075 2474172 2301608 2131359 2043845 1979994 1904575
17405A904575n1380J3004L359m6714m2413p6532j05563j16208r5234q0318o9895
$$ 1904575 1853195 1866199 1869558 1822844 1780431 1703899 1598336 1482128 1386894 1306576 1236681
17394A236681p9875r8457m8986L0377m0566p8242m5714n0671m7457k1067K6670
$$ 1236681 1156806 1058349 1009363 1039740 999174 920932 875218 824547 777090 756023 782693
17383G82693J654n6147J516K1596o8965k4465q384j8874j3987M6796N1030l5832
$$ 782693 784347 728200 729716 751312 682347 657882 649498 630624 616637 663433 714463 678631
17371F78631m915m464L39m1516k0007R323O889K497O0161Q4935L9742M4931k1563
$$ 678631 673716 669252 669591 628075 608068 617391 624280 626777 686938 771873 811615 856546 834983
17358H34983j6673l2880r7813p3448n1733n0544p4022L514j5712K3617j1919j2422
$$ 834983 818310 785430 687617 614169 562436 511892 437870 441384 425672 449289 437370 424948
17346D24948O886M687P086k2196n5489o1538o5202j9393R4733j497l4291n826
$$ 424948 431834 436521 443607 421411 365922 304384 239182 219789 314522 313025 278734 272908
17334B72908k6435p364j6172j077O7255P5679l0358m5502m361N5462l2937k0864
$$ 272908 246473 239109 222937 221860 289115 364794 334436 288934 284573 340035 307098 286234
17322B86234Q154j5683j8832k184m5270l8344L7761O4034L6576n3800l4814K1863
$$ 286234 294388 278705 259873 257689 212419 174075 211836 275870 312446 258646 223832 245695
17310B45695L8043J0189j6915m7781l0372l0524L839N5135K2739L3328J1997p4505
$$ 245695 283738 293927 277012 229231 198859 168335 172174 227309 250048 283376 295373 220868
17298B20868p9674l8640J4552O9644n482j7787J0250J5632n3884l6836p425Q1517
$$ 220868 141194 102554 117106 186750 181268 163481 173731 189363 135479 98643 91218 172735
17286A72735K6724j6602l0320m5365P263J8564j0726J3675M500q944j1323m9713
$$ 172735 199459 182857 152537 107172 114435 132999 122273 135948 140448 131504 120181 70468
17274G0468j5252k7998M549K7798n964m8186L714J8546M8044N899n050J8272L3482
$$ 70468 55216 27218 31767 59565 53601 5415 9129 27675 75719 81618 76568 94840 128322
17261A28322l7650p2062m1615j2834J509J01989P9761m1944q9881J745k4872l6775
$$ 128322 90672 18610 -23005 -35839 -34330 67659 147420 105476 15595 17340 -7532 -44307
17249d4307K0162K0170J5777l2624o4185m3083L8255K0250J7495K1161L7451k2678
$$ -44307 -24145 -3975 11802 -20822 -85007 -128090 -89835 -69585 -52090 -30929 6522 -16156
17237a6156n0596K0461M8280J3150k3786j5034R647O7230k4961k092O993n310
$$ -16156 -66752 -46291 1989 15139 -8647 -23681 -14034 53196 28235 26143 33136 27826
17225B7826j6085l2890K0419K3293j987M5965M175K296q4173m8822M5568J5537
$$ 27826 11741 -21149 -730 22563 20576 66541 70716 73012 -11161 -59983 -14415 1122
17213A122L7683K662l5836l0107k7457K0473K9058J0778j3061j4165K0396J6400
$$ 1122 38805 41467 5631 -24476 -51933 -31460 -2402 8376 -4685 -18850 1546 17946
17201A7946m0302l6719N897L9834j361R164L5089L1370J7869j3860j2834n000
$$ 17946 -22356 -59075 -53178 -13344 -14705 -5541 29548 60918 78787 64927 52093 47093
17189D7093q357k3749K8283J1229J5713k8400k2483K930P549k5719m9791K3748
$$ 47093 38736 14987 43270 54499 70212 41812 19329 22259 29808 4089 -45702 -21954
17177b1954L2506M9583k5224N953m0014J6811O7594O0868l7544m9384l5589J2679
$$ -21954 10552 60135 34911 40864 850 17661 85255 146123 108579 59195 23606 36285
17165C6285k5666m1304J7780Q398j2462K7083K9911Q12m7414l8659m2409k0712
$$ 36285 10619 -30685 -12905 -4507 -16969 10114 40025 40837 -6577 -45236 -87645 -108357
17153a08357J0735M7769L2868k7878K565O3833J3725n29J5902p0621m8151J4611
$$ -108357 -97622 -49853 -16985 -44863 -42298 21535 35260 34731 50633 -19988 -68139 -53528
17141e3528K4180l0681q664Q51l2076J5248K826J3780K8411O7075L7117o514k9936
$$ -53528 -29348 -60029 -68693 -67842 -99918 -84670 -81844 -68064 -39653 27422 64539 58025 28089
17128B8089j9853p841K0530l7450k570L4125J4453M3088n219k5157L525k4022
$$ 28089 8236 395 20925 -16525 -19095 15030 29483 72571 67352 42195 45720 21698
17116B1698J3785R639k9397m971j1127L3011R5225l0937n9566m2563m409J3800
$$ 21698 35483 45122 15725 10754 -373 32638 127863 96926 37360 -5203 -9612 4188
17104D188K5897P629k7734j618M2265K6594k9156j7524k721k4316j2178Q20N6777
$$ 4188 30085 37714 9980 8362 50627 77221 48065 30541 27820 3504 -8674 -7854 48923
17091D8923J6773k1184Q539j8433j3329K8486m9118l0795m372P222K5521J0525
$$ 48923 65696 44512 53051 34618 21289 49775 657 -30138 -34510 -27288 -1767 8758
17079H758L846L3690J6235k1651r991J2676k8711n6359j1533L9869N9032J5733
$$ 8758 12604 46294 62529 40878 30887 43563 14852 -41507 -53040 -13171 45861 61594
17067F1594p951O632J2317N534m3033q733k5556l269j4952L1068o685j2659N0441
$$ 61594 53643 60275 72592 78126 35093 26360 804 -2465 -17417 13651 6966 -5693 44748
17054D4748k8674m8401n005P968M1754L3428J6131j2818J2536J1172j9342n4628
$$ 44748 16074 -32327 -37332 -29364 12390 45818 61949 49131 61667 72839 53497 -1131
17042a131q183K8041M6126r689l2208k5145L2401l8121l9113K6981L4202j7910
$$ -1131 -9314 18727 64853 55164 22956 -2189 30212 -7909 -47022 -20041 14161 -3749
17030c749J6151j8212p6227L3995R479L1825K2820l2142j7710L2160J8035k0758
$$ -3749 12402 -5810 -82037 -48042 -38563 -6738 16082 -16060 -33770 -1610 16425 -4333
17018d333l6300m2179M546R8466L1011L9697n113m924l9430K3493p375k7546L0081
$$ -4333 -40633 -82812 -78266 20200 51211 90908 85795 80871 41441 64934 57559 30013 60094
17005F0094K5916K9305k337Q6L137M1671K7885M6785K6194l6351J5540m5969m658
$$ 60094 86010 115315 112978 113064 116201 157872 185757 232542 258736 222385 237925 191956 187298
16992A87298J4440j7675N51l3503j9583k5746M2294J4184K6179J5732k4163k9832
$$ 187298 201738 184063 184614 151111 131528 105782 148076 162260 188439 204171 180008 150176
16980A50176L551n0644n0605l367j7342m0673J5448O3461K2859l7533M2730J3478
$$ 150176 153727 103083 52478 49111 31769 -8904 6544 70005 92864 55331 98061 111539
16968A11539R11o490K0394Q968j9141l5006m3321K6933J7485o3986o1863r614
$$ 111539 112450 105960 126354 135322 116181 81175 37854 64787 82272 18286 -43577 -53191
16956e3191l6090M9790Q5699P7966L5586k4053J9260l9159L6071Q9269L002j7972
$$ -53191 -89281 -39491 46208 124174 159760 135707 154967 115808 151879 241148 244150 226178
16944B26178K171l1372j7846K9316j4236m6231k8381n3044l3152M519Q058L6032
$$ 226178 228349 196977 179131 208447 194211 147980 119599 66555 33403 37922 45980 82012
16932H2012Q187m666M7334N9060l3651L2913N6651J229j6217K122o5464q6891
$$ 82012 90199 85533 132867 191927 158276 191189 247840 249069 232852 234974 169510 82619
16920H2619r201K768j5532M7452L0113l2920k5070K2059J1759K1453l7799n8731
$$ 82619 73418 76186 60654 108106 138219 105299 80229 102288 114047 135500 97701 38970
16908C8970J0518k2437n656J4173J344j7019j7794L5530l4340j2602L9535o58
$$ 38970 49488 27051 21395 35568 36912 19893 2099 37629 3289 -9313 30222 29564
16896B9564k2080m2800L6492L0896L983L8909j958j6663J9578k156O128r078m5899
$$ 29564 7484 -35316 1176 32072 36055 74964 73006 56343 75921 73765 79893 70815 24916
16883B4916n0081m0387O167j7080L9216L7715j1414j3046J4569J1256N4994N2318
$$ 24916 -25165 -65552 -59385 -76465 -37249 466 -10948 -23994 -9425 1831 56825 109143
16871A09143l0671j9841N8455J154m9731k7396k1236k6008N185k4768J63M1461
$$ 109143 78472 58631 117086 118240 68509 41113 19877 -6131 -946 -25714 -25551 15910
16859A5910N4014L8042m0238l0125N916L3455n225l9368J2928L8710j748n1977
$$ 15910 69924 107966 67728 37603 43519 76974 71749 32381 45309 84019 82271 30294
16847C0294L0537L8808l7569l0369p374j153J1694k5827j3182j154M3075L2056
$$ 30294 60831 99639 62070 31701 24327 23174 34868 9041 -4141 -5295 37780 69836
16835F9836J9961l3150k9882K7401O2368L150l0717k0429K6056k3595k1885j6985
$$ 69836 89797 56647 26765 54166 116534 119684 88967 68538 94594 70999 49114 32129
16823C2129l021k2596K3047j6660L093O771J4782L9253J0989J6382r246O193n4726
$$ 32129 29108 6512 29559 12899 15992 22763 37545 76798 87787 104169 94923 101116 46390
16810D6390j9775P053P177j6073j9479J5298J9485K5608m4359m5223j7778m453
$$ 46390 26615 33668 40845 24772 5293 20591 40076 65684 21325 -23898 -41676 -46129
16798d6129J9365K6579j8601K2191J9398J2392J5634m9908P3538O1331j6928L6895
$$ -46129 -26764 -185 -18786 3405 22803 35195 50829 921 74459 135790 118862 155757
16786A55757J0567J4890L8660m5131o5232k5018L2607p167L057J9509L3410L546
$$ 155757 166324 181214 219874 174743 109511 84493 117100 109933 112990 132499 165909 169455
16774A69455j6943L9532J7401L944J1148l7829K6851P0490K1029j442n3233j995
$$ 169455 152512 192044 209445 213389 224537 186708 213559 284049 305078 303636 250403 248408
16762B48408J5073N1796K2775K6163K388m098l0498n4386R644J7762j463j041
$$ 248408 263481 315277 338052 364215 366603 362505 332007 277621 287265 305027 303564 302523
16750C02523j6270o0975m0856L9463Q2279L5311J5938R0557J8339o177N2322k9301
$$ 302523 286253 225278 184422 223885 306164 341475 357413 447970 466309 460132 512454 483153
16738D83153n2850r374p170j12489j16046l2723j6865K660k5329m6072j6420p969
$$ 483153 430303 420929 413759 301270 185224 152501 135636 138296 112967 66895 50475 42506
16726D2506O897J6397L190q69o551R428m4188j9290n854N184P3208O1476j5132
$$ 42506 49403 65800 68990 68121 61570 70998 26810 7520 1666 6850 80058 141534 126402
16713A26402p671K8221l825p225j6169k8026k0681J7020K3275K1988L2072N668
$$ 126402 118731 146952 143127 135902 119733 91707 71026 88046 111321 133309 165381 171049
16701A71049k2398l1650j2004k515j6538m9225j6381N0042n0879L934K0518N2520
$$ 171049 148651 117001 104997 102482 85944 36719 20338 70380 19501 23435 43953 96473
16689I6473L2110j4756K0907P235k3661q675n0567P032N8163M6202k5593k7060
$$ 96473 128583 113827 134734 141969 118308 109633 59066 66098 124261 170463 144870 117810
16677A17810j5086L487l1691K1628K9194n3650j52j5568M981J3050K0579l445
$$ 117810 102724 106211 74520 96148 125342 71692 71540 55972 60953 74003 94582 91137
16665I1137n0563L9823K9655j2321j042l7421K4613p0682J09K788p653L2389M1976
$$ 91137 40574 80397 110052 97731 96689 59268 83881 13199 13308 16096 8443 40832 82808
16652H2808j065m13j9076k5506J3914k7428N526K1721P358L9100J0072N529J3779
$$ 82808 81743 81330 62254 36748 50662 23234 28760 50481 57839 96939 107011 112540 126319
16639A26319l603J2596n4457J5720K2634k7487k6339j421j3237l2203M264P505
$$ 126319 122716 135312 80855 96575 119209 91722 65383 63962 50725 18522 22786 30291
16627C0291n689M9064M744j1197P4169l1983r334J5898j2458j5367Q7779l2529
$$ 30291 24602 73666 78410 67213 141382 109399 100065 115963 103505 88138 175917 143388
16615A43388n2512p382k2594j4900j6790J1440J221m1792L9075K5536j830Q681
$$ 143388 90876 83494 60900 46000 29210 40650 41871 79 39154 64690 62860 71541
16603G1541l3373J0924J8531K3026j7047k2903k9589k69j9938N1416N6316J3921
$$ 71541 38168 49092 67623 90649 73602 50699 21110 20841 903 52319 108635 122556
16591A22556l5840L824j3163q326N998k552l0561n1016N538N4774L5913n367n6870
$$ 122556 86716 90540 77377 69051 75049 72497 41936 -9080 -3542 51232 87145 81778 24908
16578B4908K7882O3041J1653k0758k2127k0836l2877m2277N5751N2842r763K807
$$ 24908 52790 115831 127484 106726 84599 63763 30886 -11391 44360 97202 87439 90246
16566I0246M2708j0283K4433n058o1236r070k7214J3806O4428N8413L6843n6244
$$ 90246 132954 122671 147104 142046 80810 71740 44526 58332 122760 181173 218016 161772
16554A61772j3172j8522m2138m678k9846K5440l4565J4148J9103M4001K2422M5774
$$ 161772 148600 130078 87940 83262 53416 78856 44291 58439 77542 121543 143965 189739
16542A89739P1377P216p6939o5325K9576O5213l5150n3229n3074N8021K8834n8065
$$ 189739 261116 268332 191393 126068 155644 220857 185707 132478 79404 137425 166259 108194
16530A08194j5767o02J8925L2137K4896j4442j1029P864l6627j237K8185j3076
$$ 108194 92427 91825 110750 142887 167783 153341 142312 150176 113549 112312 140497 127421
16518A27421l8862N2407l4921m3408L0251K4164J8637l9268M4579K3130M6105
$$ 127421 88559 140966 106045 62637 92888 117052 135689 96421 141000 164130 210235
16507B10235n452j4035P87o20j2268K0936N0049P2006K1086K1653M2930L5969
$$ 210235 204783 190748 191535 190915 178647 199583 249632 321638 342724 364377 407307 443276
16495D43276K6742K5617j3693q4383m1510k0710p5715K9161N2453j6369k0400
$$ 443276 470018 495635 481942 397559 356049 335339 259624 288785 341238 324869 304469
16484C04469j9915M8199n5252k7205Q507l84k2862J1972l946J80K9978O5726L8120
$$ 304469 284554 332753 277501 250296 258803 258419 235557 247529 243583 243763 273741 339467 377587
16471C77587m3295j6102r494p0038L5721N7759n2901J630l1395l7253L0679L1787
$$ 377587 334292 318190 308696 238658 274379 332138 279237 280867 249472 212219 242898 274685
16459B74685p396k429K504l5618J5766L610J9417k4972R865k4017K2426j3378
$$ 274685 267289 264860 267364 231746 247512 251122 270539 245567 255432 231415 253841 240463
16447B40463J0650J0381j1483o1820l4680L5231R155l948J1572Q31O540l4205
$$ 240463 251113 261494 250011 188191 153511 188742 197897 193949 205521 206352 212892 178687
16435A78687m214R323J1657K3616L1340k9250k2111l007L3272J12Q0895O1892
$$ 178687 174473 183796 195453 219069 250409 221159 199048 196041 229313 229425 310320 372212
16423C72212J4659L7076n0003n4401m2194L2108J8686M9520O7006N3428o1216
$$ 372212 386871 423947 373944 319543 277349 309457 328143 377663 444669 498097 436881
16412D36881j8626J6746k3859n726l046j9932N5979M3564M2443K7513m6176l3111
$$ 436881 418255 435001 411142 405416 402370 382438 438417 481981 524424 551937 505761 472650
16400D72650J8387O1430K4892J0734l8866J1208m7608l2008J7915M2821N356m916
$$ 472650 491037 552467 577359 588093 549227 560435 512827 480819 498734 541555 546911 541995
16388E41995k5225L2075K0409k604k6003k2425j9899J2927J5404N2314K472M43
$$ 541995 516770 548845 569254 566650 540647 518222 498323 511250 526654 578968 581440 581883
16376E81883j4544l5354j6756P634m2629j0392M5870M8927k4689j8835L8845K940
$$ 581883 567339 531985 515229 522863 480234 469842 515712 564639 539950 521115 559960 562900
16364E62900M6379L8801K1340m531l581j6728k366L8772P051K1543p019L2162
$$ 562900 609279 648080 669420 664889 661308 644580 642214 680986 688037 709580 702561 734723
16352G34723N9460J0701o4014K2505M8353o3019o1085k8452P6932Q3271k0897
$$ 734723 794183 804884 740870 763375 811728 748709 687624 659172 736104 819375 798478
16341G98478m9728M2915L7847m7267O290N3306k5364M4597N7834L4014L6514M2712
$$ 798478 748750 791665 829512 782245 788535 841841 816477 861074 918908 952922 989436 1032148
16329A032148M055k1053j8670L9816O2433J4170K2975P483K3811K1602J5836L2083
$$ 1032148 1036203 1015150 996480 1036296 1098729 1112899 1135874 1143357 1167168 1188770 1204606 1236689
16317A236689m183j6148K2269N5352N9674L6938L8979N4697J7725k0352J01589
$$ 1236689 1232506 1216358 1238627 1293979 1353653 1390591 1429570 1484267 1501992 1481640 1583229
16306A583229P6774O825k7666N0805M3526J5311O957j3864J548L9207R0223J01955
$$ 1583229 1660003 1666828 1639162 1689967 1733493 1748804 1755761 1741897 1743445 1782652 1872875 1974830
16294A974830P1371N1783J7004O557P3304R1864Q5212R8503O1849N1033N4618
$$ 1974830 2046201 2097984 2114988 2121545 2194849 2286713 2371925 2470428 2532277 2583310 2637928
16283B637928N8415Q4127P9921O8529J08967R1805R6460J49533J50297R6705R6330
$$ 2637928 2696343 2780470 2860391 2928920 3037887 3129692 3226152 3375685 3525982 3622687 3719017
16272C719017J59917J01629J16973J16094J25362J63031K25068J65584J64015
$$ 3719017 3878934 3980563 4097536 4213630 4338992 4502023 4727091 4892675 5056690
16263E056690J76954K23108K12656K12950K55698L03242K95947K67012K73092
$$ 5056690 5233644 5456752 5669408 5882358 6138056 6441298 6737245 7004257 7277349
16254G277349K48782L33208L95728L68836L48069L17704M22378N06250N66608
$$ 7277349 7526131 7859339 8255067 8623903 8971972 9289676 9712054 10218304 10784912
16245A0784912M73927M86375O14657O25670O31829O73015P24737P67952Q36867
$$ 10784912 11258839 11745214 12359871 12985541 13617370 14290385 15015122 15783074 16619941
16236A6619941Q82538R00856R31908R88953R25410R29986R85724J026886J012756
$$ 16619941 17502479 18403335 19335243 20324196 21249606 22179592 23165316 24192202 25204958
16227B5204958R59182R22467Q90084P72926O40448O27373N16998K89725J71273
$$ 25204958 26164140 27086607 27976691 28749617 29390065 30017438 30534436 30824161 30995434
16218C0995434L4663r4954j78620k81067m40319n82955o49170p91185p88712q25210
$$ 30995434 31030097 30935143 30756523 30475456 30035137 29452182 28803012 28011827 27223115 26397905
16208B6397905q92438q92301r12313r45740r29140q58004q50404q47931q34913
$$ 26397905 25505467 24613166 23700853 22755113 21825973 20967969 20117565 19269634 18434721
16199A8434721q18716p50372o79735o89197o68065o12706o04831n50060n48380
$$ 18434721 17616005 16865633 16185898 15496701 14828636 14215930 13611099 13061039 12512659
16190A2512659m88619m67398m35629m57422m57495l64116k71242l13131k93155
$$ 12512659 12024040 11556642 11121013 10663591 10206096 9841980 9570738 9257607 8964452
16181H964452l38997k85531k00313j75576j68203j88282k01706j39873o9105p1109
$$ 8964452 8625455 8339924 8139611 7964035 7795832 7607550 7405844 7265971 7196866 7125757
16171G125757l8430k883m4765q9091p5828l7271j00024j06600m7271Q999L8629
$$ 7125757 7087327 7084444 7039679 6950588 6874760 6837489 6737465 6630865 6583594 6592593 6631222
16160F631222Q2418K69447N03500N83468P48900J016042J489666K130060L055260
$$ 6631222 6713640 6983087 7486587 8070055 8818955 9834997 11324663 13454723 16509983
16151A6509983M560625O676793R109948J0892100J1520693J1057643Q494124K912753
$$ 16509983 21070608 27747401 36857349 47749449 59270142 70327785 78821909 81734662
16143H1734662m023758r483890j1196666j0919349j0162806q432445o231652m284578
$$ 81734662 77710904 68227014 57030348 46110999 35948193 27515748 21284096 16999518
16135A6999518k971905k070555j459382j136896r29881p76201o41385n55914l86591
$$ 16999518 14027613 11957058 10497676 9360780 8430899 7654698 7013313 6457399 6070808
16126F070808k41216k07890j77746n9437n2692j06766j81793k37324k88737k72115
$$ 6070808 5829592 5621702 5443956 5384519 5331827 5225061 5043268 4805944 4517207 4245092
16116D245092k84518k82231k23087j66648j60635j60854r7512j30900j30213p1623
$$ 4245092 3960574 3678343 3455256 3288608 3127973 2967119 2869607 2738707 2608494 2536871
16106B536871j13832j15177n2468n56m4793j27262j38267j19247l5686j2811j0881
$$ 2536871 2423039 2307862 2255394 2254838 2210045 2082783 1944516 1825269 1789583 1776772 1765891
16095A765891j3491m4072o1615j9780J9173k1577m7387n7149k1575J1060L084
$$ 1765891 1752400 1708328 1646713 1626933 1646106 1624529 1577142 1519993 1498418 1509478 1512562
16084A512562m1916o7988n3338q0611j879j5595m2410m0402k0228N4375j6024
$$ 1512562 1470646 1402658 1349320 1268709 1266830 1251235 1208825 1168423 1148195 1202570 1186546
16073A186546l9178o0807j9322J6829k1487j4913l8869m159M0954j7675k3650
$$ 1186546 1147368 1086561 1067239 1084068 1062581 1047668 1008799 1004640 1045594 1027919 1004269
16062A004269l8772j6052J9564j1005n7415p7668k7955l003j9767j1334K5198
$$ 1004269 965497 949445 969009 958004 900589 822921 794966 791963 772196 760862 786060
16051G86060j7315k9096n484R559K188n052k3170m0501k8371N4971N5139k6378
$$ 786060 768745 739649 734165 743724 745912 740860 717690 677189 648818 703789 758928 732550
16039G32550o8050l7254m9694k3557p468j6351k534Q786J8960p813l2184L6507
$$ 732550 664500 627246 577552 553995 546527 530176 527642 536428 555388 547575 515391 551898
16027E51898N2347J8419j9848m5805l1938M6532j3706M148j9073J0000k7028k4667
$$ 551898 604245 622664 602816 557011 525073 571605 557899 562047 542974 552974 525946 501279
16015E01279n8380p893J7265J5491q078r381R968l0746k5713L258R168N9047k6214
$$ 501279 442899 435006 452271 467762 459684 450303 460271 429525 403812 407070 416238 475285 449071
16002D49071p4230j379J9035L4212L4678m6438l474m9370j1884J166n0663l6149
$$ 449071 374841 373462 392497 426709 461387 414949 411475 362105 350221 351387 300724 264575
15990B64575j4090J8289k3880K8409j2176J1704p467L6559j0554q432k335j1653
$$ 264575 250485 268774 244894 273303 261127 272831 265364 301923 291369 282937 280602 268949
15978B68949j5594k9409j4095L8101M4241M97k1395R558k1021k7509j1058o757
$$ 268949 253355 223946 209851 247952 292193 292690 271295 280853 259832 232323 221265 214508
15966B14508l816L959J331k1995K8865L7997j8337p2980q729J8527k2820k1534
$$ 214508 210692 214651 215982 193987 222852 260849 242512 169532 160803 179330 156510 134976
15954A34976K0732N7102M7860J2007J6675K0342K0686J869n9799L3923J3353L2912
$$ 134976 155708 212810 260670 272677 289352 309694 330380 332249 272450 306373 319726 352638
15942C52638R4755N6005J5683m6181j00531o5541j6498n7767J4029k3170j0505
$$ 352638 447393 503398 519081 472900 372369 306828 290330 232563 246592 223422 212917
15931B12917j4218K7516p937R086k7963R91o2779n932K3722P085l1601K5187L2170
$$ 212917 198699 226215 218278 227364 199401 200392 137613 131681 155403 162488 130887 156074 188244
15918A88244m6054K9500j272j9171O0019j2657n1323k1494J3462J5750j9507o226
$$ 188244 142190 171690 170418 151247 211266 198609 147286 125792 139254 155004 135497 129271
15906A29271l4088n5399J1184k1923J2952M4743N8116K6120o6617n395k3979k4558
$$ 129271 95183 39784 50968 29045 41997 86740 144856 170976 104359 98964 74985 50427
15894E0427L8424L5887k3170K8461M3292m7464j0968K5992m0243p8074L4795j080
$$ 50427 88851 124738 101568 130029 173321 125857 114889 140881 100638 22564 57359 56279
15882E6279q339j8734k446K9542Q4810M2636l4043j6389j9479L0128J2274q8200
$$ 56279 47940 29206 26760 56302 141112 183748 149705 133316 113837 143965 156239 68039
15870F8039j4129P174M0984J5900l4650J0647M4723P006k7934L5912P3612Q652
$$ 68039 53910 61084 102068 117968 83318 93965 138688 145694 117760 153672 227284 235936
15858B35936k3929p53l3909l4667j5454L764j2394l1762k6573m808M5918M898
$$ 235936 212007 211254 177345 142678 127224 130988 118594 86832 60259 55451 101369 106267
15846A06267k1186l9063R110M3162N3963l366l4321o9846K1731m6003l2636L9344
$$ 106267 85081 46018 55128 98290 152253 148887 114566 44720 66451 20448 -12188 27156
15834B7156J3248k548K1742N7360M0118j6036m0435M1026J989m9221N597q075
$$ 27156 40404 37856 59598 116958 157076 141040 100605 141631 143620 94399 99996 91921
15822I1921J8188k841l6971P588k7302L3219J1224j1020k0163l9243Q640K3371
$$ 91921 110109 107268 70297 77885 50583 83802 95026 84006 63843 24600 33240 56611
15810E6611J3102q21r300j4893K6741J9114K3453L2994J7453j9630k5411m9125
$$ 56611 69713 68892 59592 44699 71440 90554 114007 147001 164454 144824 119413 70288
15798G0288j1125K0459j3992r349j1556J4894J5081J2441J0051l4005j1764N5438
$$ 70288 59163 79622 65630 56281 44725 59619 74700 87141 97192 63187 51423 106861
15786A06861N7111l7136q8975l2962K3919K2311m147n5896O772N4927K0002K39
$$ 106861 163972 126836 37861 4899 28818 51129 46982 -8914 -2142 52785 72787 73026
15774G3026j7328J621L2045J5305l8323l4170K6205j2181n2742M6436K4489j0445
$$ 73026 55698 57319 89364 104669 66346 32176 58381 46200 -6542 39894 64383 53938
15762E3938k3102o395k0036N3199L3580l3718n3694l9009j4679L3514L8329J2222
$$ 53938 30836 24441 4405 57604 91184 57466 3772 -35237 -49916 -16402 21927 34149
15750C4149j7972K3910o808L9001L8415p097j8930M809J2811Q264l1722j3642
$$ 34149 16177 40087 33279 72280 110695 103598 84668 89477 102288 110552 78830 65188
15738F5188o2405m0639P0034L1788O5914j8034l9575k5515p784k6130J1308M3813
$$ 65188 2783 -37856 32178 63966 129880 111846 72271 46756 38972 12842 24150 67963
15726F7963m6845m5736N3762J9734K7018k8626o7049n313j2762J6610n238K7131
$$ 67963 21118 -24618 29144 48878 75896 47270 -19779 -25092 -37854 -21244 -26482 649
15714F49N3565K9452j02822m8508P1462K444N311k075m3756K8755Q1888J5809
$$ 649 54214 83666 -19156 -67664 3798 6242 11553 9478 -34278 -5523 76365 92174
15702I2174l7734l3541k9215K2779O2534K5298j3310j7117k3673k0817j5859p615
$$ 92174 54440 20899 -8316 14463 76997 102295 88985 71868 48195 27378 11519 3904
15690C904l0180l6243j1775L6699n035k439M456K5328L5393n742j4156k5669K2096
$$ 3904 -26276 -62519 -74294 -37595 -42630 -45069 -40613 -15285 20108 14366 210 -25459 -3363
15677c363j0875L0617J5329J1647K22k2952K0729o995j7289M6433j3461K0643
$$ -3363 -14238 16379 31708 43355 43577 20625 41354 34359 17070 63503 50042 70685
15665G0685k6758K4208J4806j7538l6806J4236j1767J9205J7020l879k6346m829
$$ 70685 43927 68135 82941 65403 28597 42833 31066 50271 67291 63412 37066 32237
15653C2237J7980J4052p484k0232J0935L2547P367l9935N991M5560L0152j1596
$$ 32237 50217 64269 56785 36553 47488 80035 87402 47467 53458 99018 129170 117574
15641A17574j9356j9074J7077J5405n7228j7297k23M534M7829J0319j7405j2663
$$ 117574 98218 79144 96221 111626 54398 37101 36878 41412 89241 99560 82155 69492
15629F9492j8095Oj8022J1405M3496j489m0138k6016K989K4414L353j6408j2977
$$ 69492 51397 51403 33381 44786 88282 86793 46655 20639 23628 48042 51395 34987 22010
15616B2010j1879K6726K7575l8487K3049M7856k5051m7272L1708J8567l8609j2281
$$ 22010 10131 36857 64432 25945 48994 96850 71799 24527 56235 74802 36193 23912
15604B3912j625L9154O7918K257l4284j1634l8010Q232O9811J0068j9411O492
$$ 23912 22287 61441 129359 131616 97332 85698 47688 55920 125731 135799 116388 122880
15592A22880l3238o7663L9389M7206m6134J0210k0182q0746o365O5488L2653k0011
$$ 122880 89642 21979 61368 108574 62440 72650 52468 -28278 -34643 30845 63498 43487
15580D3487J6447L3090J9276l8335o8577k3755J411L4578k0544n2943j8203J08144
$$ 43487 59934 93024 112300 73965 5388 -18367 -16956 17622 -2922 -55865 -74068 34076
15568C4076K0642J4377m915M0794j7798N424j640o2629K003L5446L679j9542l3431
$$ 34076 54718 69095 64180 104974 87176 92600 90960 28331 30334 65780 69459 49917 16486
15555A6486j6199m458K7676m1632Q739K3085J02501J2457J6955O0753J05735J09955
$$ 16486 287 -4171 23505 -18127 -9388 13697 116198 128655 145610 206363 312098 422053
15543D22053k735Q142m5972k5332m0130o8708p9582o4300n6381K2877o323k9990
$$ 422053 419318 427460 381488 356156 316026 247318 167736 103436 47055 69932 63609 33619
15531C3619J2497j9696p40J6714J0041J7742J9332L7190q826j3015n6803L329
$$ 33619 46116 26420 25680 42394 52435 70177 89509 126699 117873 104858 48055 51384
15519E1384j2250n2739J602M8361j3613p4076P838J6679R966L0261k7859q977
$$ 51384 39134 -13605 -12003 36358 22745 -51331 -43493 -26814 -16848 13413 -14446 -23423
15507b3423R541m1277J7789L1837J0151o3480l2493N5337l3802K5940k990l5172
$$ -23423 -13882 -55159 -37370 -5533 4618 -58862 -91355 -36018 -69820 -43880 -46870 -82042
15495h2042M6696K3165j2081J032J9483j0712m0730J0999J3070j1809p986J7529
$$ -82042 -35346 -12181 -24262 -23230 -3747 -14459 -55189 -44190 -31120 -42929 -50915 -33386
15483c3386L8071J0820K8768N3557j1035m6695j2257M1850K80m7218n866o071
$$ -33386 4685 15505 44273 97830 86795 40100 27843 69693 69973 22755 16889 10818
15471A0818j2532L4422j2994J8401k2401j593P902J4463k2837m0997K3361K8041
$$ 10818 -1714 32708 19714 38115 15714 14121 22023 36486 13649 -27348 -3987 24054
15459B4054K457K1842J9350K18o9360o754j5867L3595J8982J0648k0628r242j1238
$$ 24054 26511 48353 67703 67921 -1439 -8193 -24060 9535 28517 39165 18537 9295 -1943
15446a943j7329K859K165j1039Q0378j625l9862L5301l4398o2991n823k0064J2449
$$ -1943 -19272 -16413 -14248 -25287 55091 53466 13604 48905 14507 -48484 -54307 -74371 -61922
15433f1922M7499O6368p377l2264J5426L8819K9440m4416n1728P808j8790J5119
$$ -61922 -14423 51945 44568 12304 27730 66549 95989 51573 -155 7653 -11137 3982
15421C982J1763j5519m8331k2140M7390L2973L3827m9969k255M3310M972l72K668
$$ 3982 15745 226 -48105 -70245 -22855 10118 43945 -6024 -8279 35031 40003 39631 42299
15408D2299J8548q737o5850l7934M6708O5275j670o4937l3377R832J3911K5794
$$ 42299 60847 52110 -13740 -51674 -4966 60309 58639 -6298 -39675 -29843 -15932 9862
15396I862j0490k5670m4135k5031L8626J1552J1414M5824k4283l0464K064m658
$$ 9862 -628 -26298 -70433 -95464 -56838 -45286 -33872 11952 -12331 -42795 -40731 -45389
15384d5389M5482K2987N0787M004j4357q57j4192p7532l6318M2222K6999l910
$$ -45389 93 23080 73867 77871 63514 62657 48465 -29067 -65385 -23163 3836 -74
15372g4l5123j2287k8470n9105L5989N1501N0681k3852o52M0888n173l6686r695
$$ -74 -35197 -47484 -75954 -135059 -99070 -47569 3112 -20740 -21392 19496 14323 -22363 -32058
15359c2058k4256j0899k013L8444L4952j8529P807l32m943M5917j2813J2215j8082
$$ -32058 -56314 -67213 -69226 -30782 4170 -14359 -6552 -6884 -11827 34090 21277 33492 15410
15346A5410m5938j2000R238K229J9415J3669n590j0324M5007j8760R698K288l9347
$$ 15410 -30528 -42528 -33290 -31061 -11646 2023 -3567 -13891 31116 12356 22054 24342 -15005
15333a5005j3938J3166M1641Q612j5l5250J4312N6519k9988n7995R376J8581L590
$$ -15005 -28943 -15777 25864 34476 34461 -789 13523 70042 40054 -17941 -8565 10016 13606
15320A3606J9929k2371j1709J6942r500m782P11J882l990j5516n855L3324L0853
$$ 13606 33535 11164 -545 16397 6897 2115 2826 4708 718 -14798 -20653 12671 43524
15307D3524j3540j11348j3503N670r922J1440N5267L0144m3217l3640P0206J8960
$$ 43524 29984 -81364 -94867 -89197 -99119 -87679 -32412 -2268 -45485 -79125 -8919 10041
15295A0041k831k1939l2810J5657j1367M748R685J9808j2910n1157J5947M1126
$$ 10041 7210 -14729 -47539 -31882 -43249 -38501 -28816 -9008 -21918 -73075 -57128 -16002
15283a6002K8650r297l8319l8226Q032o636L6344K3041K617K7943K975m7533k4236
$$ -16002 12648 3351 -34968 -73194 -65162 -71798 -35454 -12413 -9796 18147 21122 -26411 -50647
15270e0647N7438r805k1591n9195K0742Q0032Q290o959L256j4793O515j7391n6936
$$ -50647 6791 -3014 -24605 -83800 -63058 16974 25264 18305 21561 6768 13283 -4108 -61044
15257f1044n3086K7695K0199J8527j900j7659K1268K4072K5840L2749K8272j0507
$$ -61044 -114130 -86435 -66236 -47709 -49609 -67268 -46000 -21928 3912 36661 64933 54426
15245E4426p4579k2744k7777l0012m425Q566k542J8110P8326J0802n3982K0480
$$ 54426 -20153 -42897 -70674 -100686 -105111 -96545 -99087 -80977 -2651 8151 -45831 -25351
15233b5351J447l9033n191J8074m0677p0666o518P8216Q9977O845k7496l315K1680
$$ -25351 -23904 -62937 -68128 -50054 -90731 -161397 -167915 -89699 278 7123 -20373 -23688 -2008
15220b008O248L203l8851j0473L0213l1288K5120J1907K7132j6163l2159K0856
$$ -2008 4240 7443 -31408 -41881 -11668 -42956 -17836 -5929 21203 5040 -27119 -6263
15208f263O669L1691J5634p6472o1234K4043N5629R517l865l365K4880J1561N418
$$ -6263 406 32097 47731 -28741 -89975 -65932 -10303 -786 -4651 -8016 16864 28425 33843
15195C3843j5554l2556m3608J3495K034K3629M8881m3667l6683K4166p3040m2459
$$ 33843 18289 -14267 -57875 -44380 -42346 -18717 30164 -13503 -50186 -26020 -99060 -141519
15183a41519N2435M8856L1179j8602J9686q544q959m0433M6792N4026N3141J497
$$ -141519 -89084 -40228 -9049 -27651 -7965 -16509 -25468 -65901 -19109 34917 88058 89555
15171H9555J4326P93l3909l1198K606j2180n7519o656N1329m048o0440Q604l069
$$ 89555 103881 104674 70765 39567 42173 29993 -27526 -34182 17147 13099 -47341 -38737 -41806
15158d1806q779M6574K0364n2777r723k1686k0786K3061O2979j9063j7928K7027
$$ -41806 -50585 -4011 16353 -36424 -46147 -67833 -88619 -65558 -2579 -21642 -39570 -12543
15146a2543j0283K9945M0798m4188k2167l3555l563J9548N2J3967n037L3774J1837
$$ -12543 -22826 7119 47917 3729 -18438 -51993 -55556 -36008 -35956 -21989 -27026 6748 18585
15133A8585k6364l7454J6054L7058M9092l3967k5413l9375k6574L2695O8112J3394
$$ 18585 -7779 -45233 -29179 7879 56971 23004 -2409 -41784 -68358 -35663 32449 45843
15121D5843m4146L175k9529P915K6872M6693M2497k6403l9387n7556J9932N9428
$$ 45843 1697 4872 -24657 -16742 10130 56823 99320 72917 33530 -24026 -4094 55334
15109E5334J7519m137k6006q381j7993j1211o199j4010M1805j902k9601j3976
$$ 55334 72853 68716 42710 34329 16336 5125 -1074 -15084 26721 24819 -4782 -18758
15097a8758K9888O0992j3912l7042m2728K263M6323J4875l742j3189J8298j4915
$$ -18758 11130 72122 58210 21168 -21560 -19297 27026 41901 38159 24970 43268 28353
15085B8353j8451m1279m2087l4979k2352O289Q577L966J3951J8942j7993N3081
$$ 28353 9902 -31377 -73464 -108443 -130795 -124506 -115929 -111963 -98012 -79070 -97063 -43982
15073d3982J9418j3083k5254l4360l6651L0418P4649M9394k3424J889P504m5526
$$ -43982 -24564 -37647 -62901 -97261 -133912 -103494 -28845 20549 -2875 -986 6518 -39008
15061c9008J8838r603O72P3780J5538l3321K1534J4787q1371n1921L8841J5399
$$ -39008 -20170 -29773 -29101 44679 60217 26896 48430 63217 -18154 -70075 -31234 -15835
15049a5835J0711L434j2229j8500J4253R253J1412l6556m9522J6980L027j8986
$$ -15835 -5124 -1690 -13919 -32419 -18166 -8913 2499 -34057 -83579 -66599 -63572 -82558
15037h2558L3625N1547j679N307k4135Q988j0714K6862L335K9412J8756k0876
$$ -82558 -48933 2614 935 6242 -17893 -8905 -19619 7243 10578 39990 58746 37870
15025C7870r39k1278m0031O231k8379K2005J7837j9258L0152p209J7826L0919
$$ 37870 36931 15653 -24378 -18147 -46526 -24521 -6684 -25942 4210 -2999 14827 45746
15013D5746q4184j7153j5941M0484P9632J0681j2338l6596l6562k0982l8202k6712
$$ 45746 -38438 -55591 -71532 -31048 48584 59265 46927 10331 -26231 -47213 -85415 -112127
15001a12127P3200Q3024K449L464l624q559o9321k8594N8544J9261J307J0749
$$ -112127 -38927 44097 46546 50010 46386 37827 -31494 -60088 -1544 17717 19024 29773
14989B9773n573J8374m659k6676j1870K9595K2803k5693l9187l7266j1248P0770
$$ 29773 24200 42574 37915 11239 -631 28964 51767 26074 -13113 -50379 -61627 9143
14977I143O758k8323o328L7770K6034j6408K4548K4937l3715o2023l6122N6352
$$ 9143 15901 -12422 -18750 19020 45054 28646 53194 78131 44416 -17607 -53729 2623
14965B623L6807m188k3855l3611k681m2773r588K4496L1714L3310k5911m9228
$$ 2623 39430 35242 11387 -22224 -24905 -67678 -77266 -52770 -21056 12254 -13657 -62885
14953f2885N4947N4146K9569k1362k0769j9746r840k5324j1305j1640K6362k0267
$$ -62885 -7938 46208 75777 54415 33646 13900 4060 -21264 -32569 -44209 -17847 -38114
14941c8114n2698M136J5903r519j866K2104N383O646M3910O3272k7016J6202K3506
$$ -38114 -90812 -86676 -70773 -80292 -82158 -60054 -54671 -48025 -4115 59157 32141 48343 71849
14928G1849j2337k7319P674J5582K2784l2671m5628l3478N721n6892j0337K9255
$$ 71849 59512 32193 39867 55449 78233 45562 -66 -33544 -27823 -84715 -95052 -65797
14916f5797J2480Q906K2347J2822j419k7359j535n1151k366K9057J0587p438k7666
$$ -65797 -53317 -44411 -22064 -9242 -10661 -38020 -39555 -90706 -93072 -64015 -53428 -60866 -88532
14903h8532l0586J0047J4312J6710J6928K9606k035L397k0243K9627M7343J5241
$$ -88532 -119118 -109071 -94759 -78049 -61121 -31515 -33550 -30153 -50396 -20769 26574 41815
14891D1815p2560l1155M6564O7042L3966Q436K219j9457q429L915j6785l8511
$$ 41815 -30745 -61900 -15336 51706 85672 94108 96327 76870 68441 72356 55571 17060
14879A7060n994L38k2736J2293K5627K0284q183m5127k0197j1160K9257N3971
$$ 17060 11066 11404 -11332 961 26588 46872 38689 -6438 -26635 -37795 -8538 45433
14867D5433l9252l3970j7370J6016K6902k1010o514k4284o8392J7570M8307j2795
$$ 45433 6181 -27789 -45159 -29143 -2241 -23251 -29765 -54049 -122441 -104871 -56564 -69359
14855f9359K3584N0506P2563j8817k5669p6639l8883j5340Q3509M3464n0672l3174
$$ -69359 -45775 4731 77294 58477 32808 -43831 -82714 -98054 -14545 28919 -21753 -54927
14843e4927l3878L2616j9419l7668M4996P2721p684l3169j2501K544L6445L0344
$$ -54927 -88805 -56189 -75608 -113276 -68280 4441 -3243 -36412 -48913 -46369 -9924 20420
14831B0420j9646p9354j9950J8823L9560K3750N688O97m2600K1154L6250L457
$$ 20420 774 -78580 -98530 -79707 -40147 -16397 -10709 -10012 -52612 -31458 4792 8249
14819H249K5540n1178m7021j5880K8283M3188K123p587m915k097l7264j9226K9812
$$ 8249 33789 -17389 -64410 -80290 -52007 -8819 -6696 -14283 -19198 -21295 -58559 -77785 -47973
14806d7973k8539N4648L178M7971M0390j3530m1726m6182r378K2360M018m33L662
$$ -47973 -76512 -21864 -18686 29285 69675 56145 14419 -31763 -41141 -18781 -14763 -15196 -11534
14793a1534o351N196l6826k5260r972O609M3407K5159l7439Q22K9313L4869K897
$$ -11534 -17885 -12689 -49515 -74775 -84747 -78138 -34731 -9572 -47011 -46189 -16876 17993 20890
14780B0890L258M0204L2165m7506r7423J8170J440M751M2638P2124j1808j3951
$$ 20890 24148 64352 96517 49011 -48412 -30242 -28802 -24051 18587 90711 78903 64952
14768F4952n1218j5801j4955J505M826o3297k0299L2822R433j9599k2860J968
$$ 64952 13734 -2067 -17022 -15517 -10691 -73988 -94287 -61465 -52032 -71631 -94491 -92523
14756i2523n517O189L8920K4865K1084k3579n3781q555N5640N4517K8399l6262
$$ -92523 -98040 -91851 -52931 -28066 -6982 -30561 -84342 -92897 -37257 17260 45659 9397
14744I397j2238M269k0406P337j4368q747m2057N4183P3855J01l6572j7513m7049
$$ 9397 -2841 1428 -18978 -11641 -26009 -34756 -76813 -22630 51225 51326 14754 -2759 -49808
14731d9808N385L1616k5857o0328k8450P9581N524m2053j6102M919p760L5343
$$ -49808 -44423 -12807 -38664 -98992 -127442 -47861 -42337 -84390 -100492 -95573 -103333 -67990
14719f7990J9874j1630J4580K2525K7094k1630m9109J4521J4047K7219M2157K7480
$$ -67990 -48116 -59746 -45166 -22641 4453 -17177 -66286 -51765 -37718 -10499 31658 59138
14707E9138Q593k1499n6983R464J0550K0385K1365l7218k5735L113j8675K5231
$$ 59138 67731 46232 -10751 -1287 9263 29648 51013 13795 -11940 -8827 -27502 -2271
14695b271k7672L1219K7610K6605j1948k2229P596k2071l9325k8752l9629n0818
$$ -2271 -29943 1276 28886 55491 43543 21314 28910 6839 -32486 -61238 -100867 -151685
14683a51685M9587L0752p413O3032L1332j4258k8705J7068k3527j1685j2269K0493
$$ -151685 -102098 -71346 -78759 -15727 15605 1347 -27358 -10290 -33817 -45502 -57771 -37278
14671c7278O3836j447j2946m2655L1407J9202l0704l4494m2316J2180O8679j2798
$$ -37278 26558 25111 12165 -30490 917 20119 -10585 -45079 -87395 -75215 -6536 -19334
14659a9334j7640L2531k9410K3867m1094O956J9677j3111J8971L3608Q888k1749
$$ -19334 -36974 -4443 -33853 -9986 -51080 -44124 -24447 -37558 -18587 15021 23909 2160
14647B160J5476K7277m9435P989j1169k0278P409J7991l113n2618L8117J262o4772
$$ 2160 17636 44913 -4522 3467 -7702 -27980 -20571 -2580 -5693 -58311 -20194 -18932 -83704
14634h3704j4668n942K3728J5742K402L5046M0129J0978k9964k0335k9647J3121
$$ -83704 -98372 -104314 -80586 -64844 -62442 -27396 12733 23711 -6253 -26588 -56235 -43114
14622d3114L0554K0897k0972l3814M065k6796K4508K7851J2104l4341L8634K0393
$$ -43114 -12560 8337 -12635 -46449 -42384 -69180 -44672 -16821 -4717 -39058 -424 19969
14610A9969n8815L2036K8276K8850M476q556k3082K278K0008M4975m026o6305
$$ 19969 -38846 -6810 21466 50316 54792 46236 23154 25432 45440 90415 86389 20084
14598B0084l0770l684m8240q259N967M8431R92j6506M78o321Q566L9732J6289
$$ 20084 -10686 -14370 -62610 -70869 -64902 -16471 -15479 -31985 -31507 -37828 -29262 10470 26759
14585B6759K6108N5342M70k8644k3613m5852J994K5277n178l3189k3114m7554
$$ 26759 52867 108209 108679 80035 56422 10570 12564 37841 32663 -526 -23640 -71194
14573g1194K1445L4209L8885l360q4371j4936k4123k5973J4035K6254O3158P9631
$$ -71194 -49749 -15540 23345 19985 -64386 -79322 -103445 -129418 -115383 -89129 -25971 53660
14561E3660j4601j9684L2499l976j0071j6545J7912O868j5533p5471m6948J3348
$$ 53660 39059 19375 51874 47898 37827 21282 39194 46062 30529 -44942 -91890 -78542
14549g8542M8439M6841k3447l9686N851R962P032j1217N8764K2188j6250l3229
$$ -78542 -30103 16738 -6709 -46395 -40544 -30582 -23550 -34767 23997 46185 29935 -3294
14537c294j2030L111l0865j2092j6486O1523M2936M1371M09o2464J0196N5535
$$ -3294 -15324 -12213 -43078 -55170 -71656 -10133 32803 74174 74583 12119 22315 77850
14525G7850L5841k2158n7477q9980q996J9037K927J2766K944j2784J85k1693L9116
$$ 77850 113691 91533 34056 -55924 -64920 -45883 -42956 -30190 -27246 -40030 -39845 -61538 -22422
14512b2422N1094k2534k0619p253J0393j5736k3814K4740Q663k148K0309k5361
$$ -22422 28672 6138 -14481 -21734 -11341 -27077 -50891 -26151 -17488 -19636 673 -24688
14500b4688L5215j5875M0201M5472k2290k1930k836K1482l9890J9875L278J4243
$$ -24688 10527 -5348 34853 80325 58035 36105 33269 54751 14861 34736 38014 52257
14488E2257o7409J6979o619j1192j5383L3638J3524m1259J9830j3936p1305m065
$$ 52257 -15152 1827 -4792 -15984 -31367 2271 15795 -25464 -5634 -19570 -90875 -94940
14476i4940p543J1864M2467N8801l9340m0731j632K4924J2969O3433O240k6719
$$ -94940 -102483 -90619 -48152 10649 -28691 -69422 -71054 -46130 -33161 30272 36512 9793
14464I793j049k5553k4663l3576l8719J6909M6865P5390J6957o201q390o4586
$$ 9793 8744 -16809 -41472 -75048 -113767 -96858 -49993 25397 42354 36153 27763 -36823
14452c6823m8643j7959J5699M4566L5542k8323k2836J5830L0591Q3904Q876l4918
$$ -36823 -85466 -103425 -87726 -43160 -7618 -35941 -58777 -42947 -12356 71548 80424 45506
14440D5506O552r147j8163l1010R171l0667j2418k4723k9517L9845M7908J8203
$$ 45506 52058 42911 24748 -6262 2909 -27758 -40176 -64899 -94416 -54571 -6663 11540
14428A1540J5284J9508N705j9977j3600j6266m3762p302J9229M5729J7575J8823
$$ 11540 26824 46332 52037 32060 18460 2194 -41568 -48870 -29641 16088 33663 52486
14416E2486k6787n7265r711l646k124k8695J0265M2626L9520M7182J2081n4901
$$ 52486 25699 -31566 -41277 -44923 -47047 -75742 -65477 -22851 16669 63851 75932 21031
14404B1031k1286J8630K9445L7535K432l8555m4850j1880k5279L4156j5830P679
$$ 21031 -255 18375 47820 85355 87787 49232 4382 -7498 -32777 1379 -14451 -6772
14392f772K4509p1845l078K0210j5983l5865K4640L8424l534k1602p6036o8949
$$ -6772 17737 -54108 -57186 -36976 -52959 -88824 -64184 -25760 -29294 -50896 -126932 -195881
14380a95881M2023Q3609j2537M4976J1049l9963k308L9391K6507K1382j3528K459
$$ -195881 -153858 -70249 -82786 -37810 -26761 -66724 -69032 -29641 -3134 18248 4720 7179
14368G179J0074K5674l9478m4876N5858k1975J5238K9654m6388l4131R554L352
$$ 7179 17253 42927 3449 -41427 14431 -7544 7694 37348 -9040 -43171 -33617 -30265
14356c0265K4820K434m6592k1623M6279K920l6056Q519J6421J109K5246J0755
$$ -30265 -5445 -3011 -49603 -71226 -24947 -22027 -58083 -49564 -33143 -32034 -6788 3967
14344C967J3695J5218m814n6919o4173P118J2601J1625O723k4671K0660J3999
$$ 3967 17662 32880 28066 -28853 -93026 -85908 -73307 -61682 -54959 -79630 -58970 -44971
14332d4971m1365j8197L3828J7064M891k6389r093J8384p213O8288M5013k3466
$$ -44971 -86336 -104533 -70705 -53641 -48750 -75139 -84232 -65848 -73061 -4773 40240 16774
14320A6774l7894k2560K6431J5967L11m8570j5003k7886k1804L7500L483k669
$$ 16774 -21120 -43680 -17249 -1282 -971 -49541 -64544 -92430 -114234 -76734 -73251 -75920
14308g5920J8233N6457J08j6589J0155j6458L0253m9385Q492j9487j2587j8808
$$ -75920 -57687 -1230 -1122 -17711 -7556 -24014 6239 -43146 -34654 -54141 -66728 -85536
14296h5536R174l746o163L7196J8202J2412P519K9014P7220K779o3108m4485r625
$$ -85536 -76362 -80108 -86271 -49075 -30873 -18461 -10942 18072 95292 98071 34963 -9522 -19147
14283a9147J6044J3207R38n6333j3955m4566k0676Q1348P5417l6218m3836j2378
$$ -19147 -3103 10104 11042 -45291 -59246 -103812 -124488 -43140 32277 -3941 -47777 -60155
14271f0155J9352j6253j7583J334J5380M3977L0100J3589j3358n6103l7190j0510
$$ -60155 -40803 -57056 -74639 -73305 -57925 -13948 16152 29741 16383 -39720 -76910 -87420
14259h7420N0518M253j5545L0865M2174j2419j7955m2056l8001j8799O5105L0134
$$ -87420 -36902 -32649 -48194 -17329 24845 12426 -5529 -47585 -85586 -104385 -39280 -9146
14247i146L141n8886m001L6901q436j0124K1939Q172j7098l3752k6933K8648K1395
$$ -9146 -6005 -64891 -68892 -31991 -40427 -50551 -28612 -20440 -37538 -71290 -98223 -69575 -48180
14234d8180j254o15p890l1180j1146K040k887K5545L3433N851L5501J5652k1231
$$ -48180 -49434 -50049 -57939 -89119 -100265 -98225 -101112 -75567 -42134 -36283 -782 14870 -6361
14221f361j7566K5664K3596k8321m09n573l4806J0007m2443j4890J5696j989j7397
$$ -6361 -23927 1737 25333 -2988 -3397 -8970 -43776 -33769 -76212 -91102 -75406 -77395 -94792
14208i4792L1969K751k2809R97l0071M5544K7981M146L1915M7613K0338n6104
$$ -94792 -62823 -60072 -82881 -81884 -111955 -66411 -38430 -34284 -2369 45244 65582 9478
14196I478l5956j3718K0136N8902n2742J4332M7773m1734m5895k1372n5961J5034
$$ 9478 -26478 -40196 -20060 38842 -13900 432 48205 6471 -39424 -60796 -116757 -101723
14184a01723K9216P6141L8850m0800J0996k0627n5500J2220N7745j3369k2898
$$ -101723 -72507 3634 42484 1684 12680 -7947 -63447 -51227 6518 -6851 -29749
14173b9749j6176P1969L4600k4174j3148r528l4414J5349m3344l304L3652J0442
$$ -29749 -45925 26044 60644 36470 23322 13794 -20620 -5271 -48615 -51919 -18267 -7825
14161g825m0925k2297k1864k1026K3717n190k8696M0029P8744L4645o6149j1324
$$ -7825 -48750 -71047 -92911 -113937 -90220 -95410 -124106 -84077 -5333 29312 -36837 -48161
14149d8161m698J146N8510j339p850R182k8885k19L2716P385l5902K392L1939
$$ -48161 -52859 -51713 6797 5458 -2392 6790 -22095 -22314 10402 17787 -18115 -15723 16216
14136A6216q77k922P2973K34p5243R265m4440k0365j0544j13R482K1621O749L2385
$$ 16216 15339 12417 85390 85624 10381 19646 -24794 -45159 -55703 -55816 -46334 -24713 -17964 14421
14122A4421j1713M4813K8828o7184r0618j0843P1182M9759p236q4403k7223N036
$$ 14421 2708 47521 76349 9165 -81453 -92296 -21114 28645 21409 -62994 -90217 -85181
14110h5181M0464O5569N6585k1723k1261J7542l7997m4219K8957j6415k2438J1191
$$ -85181 -44717 20852 77437 55714 34453 51995 13998 -30221 -1264 -17679 -40117 -28926
14098b8926m6389n1848m823K9474O0104K8079q615n008P408r03K6605K2793J0684
$$ -28926 -75315 -127163 -131986 -102512 -42408 -14329 -22944 -27952 -20544 -21447 5158 27951 38635
14085C8635p8632M8774L4560j3912R318k0591p2954J4222L6761j4158j7982l390
$$ 38635 -39997 8777 43337 29425 38743 18152 -54802 -40580 -3819 -17977 -35959 -39349
14073c9349p207j6250J965L1703M3557K8444J0272j1486k0420J0212j1546l8725
$$ -39349 -46556 -62806 -60841 -29138 14419 42863 53135 41649 21229 31441 19895 -18830
14061a8830k5675L8354l1087j1586L1878j9722j4571M3625K1944k4662n655j6743
$$ -18830 -44505 -6151 -37238 -48824 -16946 -36668 -51239 -7614 14330 -10332 -15987 -32730
14049c2730Q310j0783K2545k9053k598j2773k2830K531J4218L5847R589K0917
$$ -32730 -24420 -35203 -12658 -41711 -44309 -57082 -79912 -77381 -63163 -27316 -17727 3190
14037C190k0237n3545j9295k7340r564M241J2951L7739L9216J1812k4748n072
$$ 3190 -17047 -70592 -89887 -117227 -126791 -122550 -109599 -71860 -32644 -20832 -45580 -50652
14025e0652J2059j2329J5547k722J1887L5042J7466j0160k7363O169J4402j8834
$$ -50652 -38593 -50922 -35375 -38097 -26210 8832 26298 16138 -11225 -5056 9346 -9488
14013i488k7440k3046r71N683L719N3266o042k7184k8367m3966M7517M4610L2410
$$ -9488 -36928 -59974 -60945 -55262 -51543 1723 -4319 -31503 -59870 -103836 -56319 -11709 20701
14000B0701l8567q7732P244P968J2060J0189L5177j6772k3330K7669N036k4610
$$ 20701 -17866 -105598 -98354 -90386 -78326 -68137 -32960 -49732 -73062 -45393 -40357 -64967
13988f4967j5034L9792M1851m3506l2399l7306J6967Q918P3773L8487L741J2445
$$ -64967 -80001 -40209 1642 -41864 -74263 -111569 -94602 -85684 -11911 26576 30317 42762
13976D2762j5264m4166k9176L1596L062p6647l6216J0555R004K2936k5987j1816
$$ 42762 27498 -16668 -45844 -14248 -11186 -87833 -124049 -113494 -104490 -81554 -107541 -119357
13964a19357J7795K3156L5140K0882k8297j5916J4439J8772r533N918O626j952
$$ -119357 -101562 -78406 -43266 -22384 -50681 -66597 -52158 -33386 -42919 -37001 -30375 -32327
13952c2327J9558k1724M295J8202J2440j8891j7187k3485J6102K1917J8813m012
$$ -32327 -12769 -34493 -30198 -11996 444 -18447 -35634 -59119 -43017 -21100 -2287 -6299
13940f299J8206Q720k9000j1841M659o9440m83J0583j8522L1654L9026J4801M508
$$ -6299 11907 20627 -8373 -20214 -15555 -84995 -85478 -74895 -93417 -61763 -22737 -7936 -3428
13927c428J1859J0658j8953L9807J6218J1378J8340J1270o4605n0961l5785K2591
$$ -3428 8431 19089 136 39943 56161 67539 85879 97149 32544 -18417 -54202 -31611
13915c1611M1395k4272j8788j752n76j0157K7463M5742l8816j8410K8975L4833
$$ -31611 9784 -14488 -33276 -35028 -35604 -45761 -18298 27444 -11372 -29782 -807 34026
13903C4026J5297k0113l1163o5131l991n902K6471K0220J7223n873k4290J8452
$$ 34026 49323 29210 -1953 -67084 -71075 -76977 -50506 -30286 -13063 -18936 -43226 -24774
13891b4774m0329m4422K7964N0664l4125m8273L0077K3766K4415m930J1508j8922
$$ -24774 -65103 -109525 -81561 -30897 -65022 -113295 -83218 -59452 -35037 -39967 -28459 -47381
13879d7381m2774K0245K7372k0872l1202l7847L2736N2724J9751L011K1122J9472
$$ -47381 -90155 -69910 -42538 -63410 -94612 -132459 -99723 -46999 -27248 -24237 -3115 16357
13867A6357n2044l4115L3970K4410p172Q056M8105m902j353O114n7252N0967K030
$$ 16357 -35687 -69802 -35832 -11422 -18594 -10538 37567 32665 31312 37426 -19826 31141 33171
13854C3171k2575M108j5195j9883J5141j3356m1827k5009K0733J7459K0139l4402
$$ 33171 10596 14704 -491 -20374 -5233 -18589 -60416 -85425 -64692 -47233 -27094 -61496
13842f1496j575M3891L7224j2213n2512k257P0639n9331n4721m481R037q050K1141
$$ -61496 -63071 -19180 18044 5831 -46681 -48938 21701 -37630 -92351 -96832 -87795 -95845 -74704
13829g4704J797K4963M1891r221R637M600J8276Q376J5525J7791m4294o9745m1318
$$ -74704 -72907 -47944 -6053 -15274 -5637 -1037 17239 25615 41140 58931 14637 -55108 -96426
13816i6426k4801N4010R1059k7300J4098K028K2808k5378n9125k1012M597k5318
$$ -96426 -121227 -67217 23842 -3458 10640 12668 35476 10098 -49027 -70039 -65442 -90760
13804i0760J7768K2934L9491O689m8698L083M3211L7497K8555n0533J389K850
$$ -90760 -72992 -50058 -10567 -3878 -52576 -49493 -6282 31215 59770 9237 10626 13476
13792A3476k7262l3330j7799L328K8834k6435J3449J3338J2228M2754p335m8513
$$ 13476 -13786 -47116 -64915 -61587 -32753 -59188 -45739 -32401 -20173 22581 15246 -33267
13780c3267n4889n0405j9627L3024L9006k3963J2693K3834n609j1110J9761J7792
$$ -33267 -88156 -138561 -158188 -125164 -86158 -110121 -97428 -73594 -79203 -90313 -70552 -52760
13768e2760M0438k7024M2840O9705j0488q117J9082k8444n6984J2560M694N3458
$$ -52760 -12322 -39346 3494 73199 62711 54594 73676 45232 -11752 808 5502 58960
13756E8960K9748k2939q4957l8886j7041J1786l0714j2388M2308J5932m1439J7066
$$ 58960 88708 65769 -19188 -58074 -75115 -63329 -94043 -106431 -64123 -48191 -89630 -72564
13744g2564Q046K2471K638n4437N4918O425K3137R341l8079N213J5321j0465r389
$$ -72564 -64518 -42047 -39409 -93846 -38928 -32503 -9366 -25 -38104 -32891 -17570 -28035 -37424
13731c7424J1424o538j6381n6613J4575J7579L5177K1497L9058O867l9824q072
$$ -37424 -26000 -32538 -48919 -105532 -90957 -73378 -38201 -16704 22354 29221 -10603 -18675
13719a8675N935o777M107K9933P7470m0767j9407O770l3549m3883j7472K7371
$$ -18675 -12740 -19517 -15410 14523 91993 51226 31819 38589 5040 -38843 -56315 -28944
13707b8944P710J3427m6665K1682O773j8555L040O4054J3275k7904L1232J3609
$$ -28944 -21234 -7807 -54472 -32790 -26017 -44572 -41532 22522 35797 7893 39125 52734
13695E2734j7162n7867O441l1538l3114L5455J9450Q093j5741j231Q390M2273
$$ 52734 35572 -22295 -15854 -47392 -80506 -45051 -25601 -17508 -33249 -34480 -26090 16183
13683A6183L523L0710M048l9527o5720J040l197N147j5885K2639M891k1654k9205
$$ 16183 19706 50416 54464 14937 -50783 -49743 -52940 -47793 -63678 -41039 -36148 -57802 -87007
13670h7007k541p182K8774L1014j2892J8388l998J686J0923K0793N692m3523k274
$$ -87007 -89548 -96730 -67956 -36942 -49834 -31446 -35444 -33758 -22835 -2042 3650 -39873 -42147
13657d2147K9329j880o089J4119J0922K036N425K5351L8798N6147o3330p1308
$$ -42147 -12818 -14698 -20787 -6668 4254 6290 11715 37066 75864 132011 68681 -2627
13645b627Q174p116r409Q503j0804l4451k3316J0509J707k616k804L0682M8839
$$ -2627 5547 -1569 -10978 -2475 -13279 -47730 -71046 -60537 -58830 -61446 -64250 -33568 15271
13632A5271j9465n0062j6895l2260L3980K9549l7442k9258k5535K1155Q7845k0310
$$ 15271 -4194 -54256 -71151 -103411 -69431 -39882 -77324 -106582 -132117 -110962 -23117 -43427
13620d3427k6664K4229P304J7257n4817l121K7808J9583J0824k213J5514J8707
$$ -43427 -70091 -45862 -38558 -21301 -76118 -79239 -51431 -31848 -21024 -23237 -7723 10984
13608A0984Q732l0406j583j2190J5254l8154K6292K8779j2732j9681l5087J5715
$$ 10984 19716 -10690 -12273 -24463 -9209 -47363 -21071 7708 -5024 -24705 -59792 -44077
13596d4077N2378k0749j9419Q0654q158k6399j2776n62K2095p575l5985L1393
$$ -44077 8301 -12448 -31867 48787 40629 14230 1454 892 22987 15412 -20573 10820
13584A0820L1326k0474K5991J3958K3973l1524P533K1991k6236J6727O160j0245
$$ 10820 42146 21672 47663 61621 85594 54070 61603 83594 57358 74085 80245 70000
13572G0000n8147l3256n270l0697m483L8110K6229j4131m3105k9956K2864K3203
$$ 70000 11853 -21403 -26673 -57370 -61853 -23743 2486 -11645 -54750 -84706 -61842 -38639
13560c8639K3015J7479J7520J6943j8433l017J899l1879k2597R755L2709M2777
$$ -38639 -15624 1855 19375 36318 17885 14868 16767 -15112 -37709 -27954 4755 47532
13548D7532L6812L241j1560m6113l7110N6941M1772j4279J67M145L3454K2380
$$ 47532 84344 87585 76025 29912 -7198 49743 91515 77236 77403 81548 115002 137382
13536A37382L3662Q1808R4424r939L0301m2081r7040p0266l2816J7050k4429l4290
$$ 137382 171044 252852 347276 337337 367638 325557 228517 158251 125435 142485 118056 83766
13524H3766l0154j4085L5863K6911M728l2304j6400j678j905l3336m2683l345
$$ 83766 53612 39527 75390 102301 107029 74725 58325 56647 54742 21406 -21277 -24622
13512b4622k8670N1532K6500K5464R719J0861l4566R812K593o5740m6895j3131
$$ -24622 -53292 -1760 24740 50204 59923 70784 36218 46030 48623 -17117 -64012 -77143
13500g7143Q533J9001M0403j1427R563r987K6609M9470O6652J8301Q6032J89427
$$ -77143 -68610 -49609 -9206 -20633 -11070 -21057 5552 55022 121674 139975 226007 415434
13488D15434J00900j0107j14099j03624r9457l4513r846n7832l5007j5357l1639
$$ 415434 516334 506227 392128 288504 189047 154534 144688 86856 51849 36492 4853
13477D853J1189l043m6088J2099o151j3917k183K5033K0371J5002O1584k0967
$$ 4853 16042 12999 -33089 -20990 -27141 -41058 -43241 -18208 2163 17165 78749 57782
13465E7782k4909j0918r948R017o668j6310K9204J2107m6474j8481j8970P059
$$ 57782 32873 21955 12007 21024 14356 -1954 27250 39357 -7117 -25598 -44568 -37509
13453c7509J3625J8910N7511M209j821L355j2938M6931O9806O7483M9247l7958
$$ -37509 -23884 -4974 52537 56746 54925 58280 45342 92273 162079 229562 278809 240851
13441B40851n8105l1615n8295l3147J9564J9409k9773n8300M355N118r039K9437
$$ 240851 182746 151131 92836 59689 79253 98662 68889 10589 14944 20062 11023 40460
13429D0460L2025p0763k5531k6098l3570j6093n0439k3193Q5119L4559O14O86
$$ 40460 72485 1722 -23809 -49907 -83477 -99570 -150009 -173202 -88083 -53524 -52910 -52224
13417e2224n555k899O6885m38l7668k8152l7102k9403j7319J9782j6909J7940
$$ -52224 -57779 -60678 6207 5769 -31899 -60051 -97153 -126556 -143875 -124093 -141002 -123062
13405a23062O8428K08O500N547Q405Q0237L5525m8548k0031L704j716l1053K5755
$$ -123062 -54634 -54426 -47926 -42379 -33974 46263 81788 33240 13209 16913 15197 -15856 9899
13392I899M9318j0062j8753P660K7434N350j428j6646j7009L17l3000j7200K5558
$$ 9899 59217 49155 30402 38062 65496 70846 69418 52772 35763 36080 3080 -14120 11438
13379A1438M1587l9567J5922M899Q179k912p923l0133M181P847M9746L5278K5987
$$ 11438 53025 13458 29380 34279 42458 39546 31623 1490 5671 13518 63264 98542 124529
13366A24529j2842m3082j7024m9159m1669K0336L6289N270m8557K9865L6421J5614
$$ 124529 111687 68605 51581 2422 -39247 -18911 17378 22648 -25909 3956 40377 55991
13354E5991M195l8867l6043M68R4326M0047k3796o6244m3158n273L5495n602N226
$$ 55991 60186 21319 -14724 -14256 80070 120117 96321 30077 -13081 -18354 17141 11539 16765
13341A6765K9686J5827K7746p127l7505k9637m7522L4980K7155o5534Q015j4179
$$ 16765 46451 62278 90024 82897 45392 15755 -31767 3213 30368 -35166 -27151 -41330
13329d1330r108L1476o929L6953N0388j5579o968K174k9147k0518o145p7040J5798
$$ -41330 -50438 -18962 -25891 11062 61450 45871 38903 41077 11930 -8588 -14733 -91773 -75975
13316g5975j4808L6675M9023N229j592M032j5039O254K9257L3358J9846L0913
$$ -75975 -90783 -54108 -5085 144 -1448 2584 -12455 -6201 23056 56414 76260 107173
13304A07173j5489q5609p2541k0177J4732K399N0603k742q63J4288o814l0733
$$ 107173 91684 6075 -66466 -86643 -71911 -69512 -18909 -21651 -22514 -8226 -15040 -45773
13292d5773J1163K8032N3577q464p2475j9645P784O3556J3384o6800M9475J4574
$$ -45773 -34610 -6578 46999 38535 -33940 -53585 -45801 17755 31139 -35661 13814 28388
13280B8388L0213R058L8606K0483n2397r0261K9796M9224l8691j1488K5649k1354
$$ 28388 58601 67659 106265 126748 74351 -15910 13886 63110 24419 12931 38580 17226
13268A7226J7024j1622p662r561m1904J8487L4944J2032O059m0101o495P506O827
$$ 17226 34250 22628 14966 5405 -36499 -18012 16932 28964 35023 -5078 -11573 -4067 2760
13255B760K2819L399J6119L5023j0859m7989l056L6892K071L25m1082J5683L0775
$$ 2760 25579 28978 45097 80120 69261 21272 18216 55108 57179 57504 16422 32105 62880
13242F2880j3965q185J9750m0208o5709K5175J3774K3689K889j2494n87K2892
$$ 62880 48915 40730 60480 20272 -45437 -20262 -6488 17201 20090 7596 7009 29901
13230B9901O4999j1187n1275J9118J8803n366K6409j5691o6805k5688J9440N1149
$$ 29901 94900 83713 32438 51556 70359 64993 91402 75711 8906 -16782 2658 53807
13218E3807J5080k912o10K1569O525r512R079o882j713k6098o5977K964r567M850
$$ 53807 68887 65975 65365 86934 93459 83947 93026 86144 84431 58333 -7644 -4680 -14247 -9397
13204i397P6595Q7525J6990p811N467J9125p2264j9991M4739J5982n2948m6371
$$ -9397 67198 154723 171713 163902 169369 188494 116230 96239 140978 156960 104012 57641
13192E7641M8833N540l6115l4952j4631r722n4893J4901K4070m672O392J7437
$$ 57641 106474 112014 75899 40947 26316 16594 -38299 -23398 672 -4000 2392 19829
13180A9829L786k86K5792L7552K4906r077p626k9147k3214P3706M5833J6175K3189
$$ 19829 23615 23329 49121 86673 111579 102502 94876 65729 42515 116221 162054 178229 201418
13167B01418Q892k3891j5291l727J787k7258q328m6672L1214Q4609m156O3634
$$ 201418 210310 186419 171128 167401 169188 141930 133602 86930 118144 202753 198597 262231
13155B62231R0538k7861k4200l0602P677o72O593j6408L0338M9984k7078N2840
$$ 262231 352769 324908 300708 270106 277783 277111 283704 267296 297634 347618 320540 373380
13143C73380M5228J2033N1329P4527M9497M8015Q2635J18996J84999K56802L16573
$$ 373380 418608 430641 481970 556497 605994 654009 736644 855640 1040639 1297441 1614014
13132A614014L90750L42903K24137M3330k0115O9675J40048K83085M45153P52739
$$ 1614014 2004764 2347667 2571804 2615134 2595019 2664694 2804742 3087827 3532980 4285719
13122D285719J181326J724364K605772L720398M389861L562994J016398k065774
$$ 4285719 5467045 7191409 9797181 13517579 17907440 21470434 22486832 20421058
13114B0421058m002538l893381l009936k095180j457620j017081o82277n43328
$$ 20421058 16418520 12525139 9515203 7420023 5962403 4945322 4263045 3719717
13106C719717n04591l26064k38400j96977j67177p0103r9153o4523N573m8685
$$ 3719717 3215126 2889062 2650662 2453685 2286508 2216405 2117252 2052729 2058302 2009617
13096B009617K1639M0398M7632L6634O3094J04820J25238L8992J06046J92934
$$ 2009617 2031256 2071654 2119286 2155920 2219014 2323834 2449072 2488064 2594110 2787044
13086B787044L05697M38733N25831N81903P79623J059753J358941J737096K309809
$$ 2787044 3092741 3531474 4057305 4639208 5418831 6478584 7837525 9574621 11884430
13077A1884430L358741N019860P658883J1226559J4330643J3294687N452637n485273
$$ 11884430 15243171 20263031 27921914 39148473 53479116 66773803 72226440 66741167
13069F6741167j3573803j3864626j0208529p048100m810601l298608k252423j631095
$$ 66741167 53167364 39302738 29094209 22046109 17235508 13936900 11684477 10053382
13061A0053382j278171j073318r02311p24970n51571m12366l33300k64360j81933
$$ 10053382 8775211 7701893 6799582 6074612 5523041 5110675 4777375 4513015 4331082
13052D331082j73924j31134o2280p0553l2343K2840O7262j9744M9642J17450J76455
$$ 4331082 4157158 4026024 3963744 3893191 3860848 3883688 3950950 3931206 3980848 4098298 4274753
13041D274753K47699K99337M08379N77350Q02718J051553J326280J645132K169943
$$ 4274753 4522452 4821789 5230168 5807518 6610236 7661789 8988069 10633201 12803144
13032A2803144L160578M775604P304291J0870570J4220665J4011008O896519m210786
$$ 12803144 15963722 20739326 28043617 38914187 53134852 67145860 74042379 69831593
13024F9831593j3261578j4703879j1075515p612521n178165l550069k385952j717042
$$ 69831593 56570015 41866136 30790621 23178100 17999935 14449866 12063914 10346872
13016A0346872j341679j116029j016430p84658n68339m35215l95680l32760k48497
$$ 10346872 9005193 7889164 6872734 6088076 5519737 5084522 4688842 4356082 4107585
13007D107585j45643j36642j72959r9025m5004q6911q5539q4834l0682r513k7739
$$ 4107585 3961942 3825300 3652341 3553316 3508312 3421401 3335862 3251028 3220346 3210833 3183094
12996C183094J7452K049R7767J21709K32417K93121L90255N04914O40142R89214
$$ 3183094 3200546 3202595 3300362 3422071 3654488 3947609 4337864 4842778 5482920 6472134
12986F472134J504712K347818L383506M329737M246846K266060r80614l800374
$$ 6472134 7976846 10324664 13708170 18037907 22284753 24550813 23570199 19769825
12978A9769825m511083l734503k724027j842913j296143q81799n99168m89751
$$ 19769825 15258742 11524239 8800212 6957299 5661156 4779357 4180189 3690438
12970C690438m51895l34635k16888k42720j95105j00240j10855p6809p2766q7174
$$ 3690438 3238543 2903908 2687020 2444300 2249195 2148955 2038100 1961291 1888525 1801351
12960A801351o7699n7427p5909o4349m3330r3635k5457N5221N7372q4502j04124
$$ 1801351 1733652 1676225 1600316 1535967 1492637 1399002 1373545 1428766 1486138 1401636 1297512
12949A297512o7180m6043j01593n6100k0371n52q7823o6993l1234m321J7258K4276
$$ 1297512 1230332 1184289 1082696 1026596 1006225 1005673 917850 850857 819623 815302 832560 856836
12937H56836l0377K4316O3608O0909o068o6852o8243p4570p4124j7963J2863k7208
$$ 856836 826459 850775 914383 975292 969224 902372 834129 759559 685435 667472 680335 653127
12925F53127r2255l6455M9689O1928N7306l840j6289p6429q1718J7707J5382K9555
$$ 653127 560872 524417 574106 636034 693340 689500 673211 596782 515064 532771 548153 577708
12913E77708N3007L432j0211J296m192j8619L2968J572N1988l4938q5295o6595
$$ 577708 630715 634147 623936 625232 621040 602421 635389 636961 688949 654011 568716 502121
12901E02121j4298K0867l2497m2993l7343m595l652j4506n388K3688K6754m1799
$$ 502121 487823 508690 476193 433200 395857 391262 387610 373104 367716 391404 418158 376359
12889C76359o4860n5973l4804J8241J8089k4587J5559o529L2263J4639J0467J027
$$ 376359 311499 255526 220722 238963 257052 232465 248024 241495 273758 288397 298864 299891
12877B99891k9268Q479j821J2688R434K6616M8754k9565o852L4011k3094P019
$$ 299891 270623 279102 277281 289969 299403 326019 374773 345208 338356 372367 349273 356292
12865C56292M6194O4126J9578O7834Q5649l0523n8520K8010l0748m5499n3092
$$ 356292 402486 466612 486190 554024 639673 609150 550630 578640 547892 502393 449301
12854D49301m3130n5691J0130K5557j5649n1576m6778k6915o041k912m750p538
$$ 449301 406171 350480 360610 386167 370518 318942 272164 245249 239208 236296 231546 224008
12842B24008k4299k3797m8820R110J5408m4453O427j5854j5309J1352K4006J1425
$$ 224008 199709 175912 127092 136202 151610 107157 113584 97730 82421 93773 117779 129204
12830A29204O538r75l0423M4864N7681J4901L071M8395L5734N962P010j0793j8502
$$ 129204 135742 134767 104344 149208 206889 221790 224861 273256 308990 314952 321962 311169 292667
12817B92667l265N431K9692N0951k4831k3142K5180K1244K1715K2474J9998k7982
$$ 292667 289402 294833 324525 375476 350645 327503 352683 373927 395642 418116 438114 410132
12805D10132r7317M0785j5520k3532k4897m4363p853R569n3335m7720K3597o692
$$ 410132 312815 353600 338080 314548 289651 245288 237435 247004 193669 145949 169546 162854
12793A62854j4609J8032q402J7350L4240L3250j2721L9789N9584m0667m3922l2392
$$ 162854 148245 166277 157875 175225 209465 242715 229994 269783 329367 288700 244778 212386
12781B12386k4598m4747K1774L7823J2815J8396L3368M5231r945j331P450L8843
$$ 212386 187788 143041 164815 202638 215453 233849 267217 312448 302503 301172 308622 347465
12769C47465k4067M631l5869o739k981K8965L4497K0205J5702k7320k8896K9880
$$ 347465 323398 328029 292160 285421 282440 311405 345902 366107 381809 354489 325593 355473
12757C55473P729k7281L9499N2951N1777J21050K06972K03689J01396l3387j30251
$$ 355473 363202 335921 375420 428371 480148 601198 808170 1011859 1113255 1079868 949617
12746I49617q6145k8454l5580q752m792k297J9371m3264l4872j4928L8604L0390
$$ 949617 863472 835018 799438 790686 785894 783597 802968 759704 724832 709904 748508 778898
12734G78898K8397o374j191J4194O787L0367K3375L3494M2310L9182O9404R7628
$$ 778898 807295 800921 799730 813924 820711 851078 874453 907947 950257 989439 1058843 1156471
12722A156471M5388J12913J60556J07582P9383R7964J41087K39391J94361Q9544
$$ 1156471 1201859 1314772 1475328 1582910 1662293 1760257 1901344 2140735 2335096 2424640
12712B424640O1762Q6283L5160P6579P9332J57000K01219K61661L62997M10129
$$ 2424640 2486402 2572685 2607845 2684424 2763756 2920756 3121975 3383636 3746633 4156762
12702D156762M34537M29155M42569M14648M95065O50492R60564J260934J487121
$$ 4156762 4591299 5020454 5463023 5877671 6372736 7023228 7983792 9244726 10731847
12693A0731847J764877J893673K032624K505440L509632M994647P063741J0398851
$$ 10731847 12496724 14390397 16423021 18928461 22438093 27432740 34496481 44895332
12685D4895332J5625120K4142067L7237226N3609558O3511288N0604968J1813465
$$ 44895332 60520452 84662519 121899745 175509303 239020591 289625559 301439024
12678C01439024l3796069n9966203n6954365m1511439k8154685j9156837j3278898
$$ 301439024 267642955 207676752 150722387 109210948 81056263 61899426 48620528
12671D8620528r253619o548746m679040l346654k503683k085598j866523j765862
$$ 48620528 39366909 32818163 28139123 24792469 22288786 20203188 18336665 16570803
12663A6570803j508397j209564r27462p31980n96994n36380n45039n71933n62184
$$ 16570803 15062406 13852842 12925380 12193400 11596406 11060026 10514987 9943054 9380870
12654I380870n33783n59310n27513m54869m17068l54484l28251k68228j76252
$$ 9380870 8847087 8287777 7760264 7305395 6888327 6533843 6205592 5937364 5761112
12645E761112j94314k01896j07737M5204Q2915J2650o0573k50380l47143m13785
$$ 5761112 5566798 5364902 5257165 5302369 5385284 5397934 5337361 5086981 4739838 4326053
12635D326053l22858k14640k11850j75713j63439j59895o3180q3406j35785r0118
$$ 4326053 4003195 3788555 3576705 3400992 3237553 3077658 3014478 2931072 2795287 2705169
12625B705169p8205o3212o1669p6083p4102j00116q1141k0850j35104p8231p8344
$$ 2705169 2626964 2563752 2502083 2426000 2351898 2251782 2170641 2149791 2014687 1936456 1858112
12614A858112k7677l5769o339m9124n8997k9622o040l8564Q193R269M5482J6149
$$ 1858112 1830435 1794666 1788327 1739203 1680206 1650584 1644544 1605980 1614173 1623442 1668924 1685073
12602A685073j4854j08475p0070k9315r7705j36483o9449p4258k6371j6376n2656
$$ 1685073 1670219 1561744 1491674 1462359 1364654 1228171 1158722 1084464 1058093 1041717 989061
12591I89061k7644j1603o1815j5707M1966m126o3358l3448J9092m698q4435j3692
$$ 989061 961417 949814 887999 872292 914258 910132 846774 813326 832418 827720 743285 729593
12579G29593N1642L2248n9625o0825M6136J4200m8461J7685L062n6322j1886J0120
$$ 729593 781235 813483 753858 693033 739169 753369 704908 722593 725655 669333 657447 667567
12567F67567j9994J0079J5824l2909L1556M3373M0720J8161L1263R7675N2436
$$ 667567 647573 657652 673476 640567 672123 715496 756216 774377 805640 903315 955751
12556I55751K8287J1288o1910j11613p2447l2841k1479r2634L246J6963k7019
$$ 955751 984038 995326 933416 821803 749356 716515 695036 602402 605648 622611 595592
12545E95592l3725l1964m5075j8909K0433n529q4265l1125J5073Q135J098L3271
$$ 595592 561867 529903 484828 465919 486352 480823 396558 365433 380506 388641 389739 423010
12533D23010L1931P458k682j3412K4467J9681n555K2675l0416n6893J503N600
$$ 423010 454941 462399 459717 446305 470772 490453 484898 507573 477157 420264 421767 427367
12521D27367m8056o8464k5040M183j0952K7045J8697L4837K0226K4937J7640M9541
$$ 427367 379311 310847 285807 289990 279038 306083 324780 359617 379843 404780 422420 471961
12509D71961l5070o3046n6850p4373k8665M8973K2207j8034L4653l5065m6517
$$ 471961 436891 373845 316995 242622 213957 262930 285137 267103 301756 266691 220174
12498B20174j9130J2988O1036J6266l1736m4681J0131K719k9853k4884k8537R090
$$ 220174 201044 214032 275068 291334 259598 214917 225048 227767 197914 173030 144493 153583
12486A53583N0774L5299j2058l0883p1433K7636K540J7231O9663j783l4638l8650
$$ 153583 204357 239656 227598 196715 125282 152918 155458 172689 242352 240569 205931 167281
12474A67281q1788m8069L5475J8792J9248o065j5816L2011k4933k5788L2238K7276
$$ 167281 85493 37424 72899 91691 110939 104874 89058 121069 96136 70348 102586 129862
12462A29862M4001k3980P817Q4028k035k2537l2555k1045m3490k4382K4899M7050
$$ 129862 173863 149883 157700 241728 239693 217156 184601 163556 120066 95684 120583 167633
12450A67633J6241j2458k7927k9792J6509M2485p447J215q794k8851J0632K6646
$$ 167633 183874 171416 143489 113697 130206 172691 165244 166459 157665 128814 139446 166092
12438A66092L342n4276m9468M3923J5028n1700o311P502k4722Q509K2409j2902
$$ 166092 169434 115158 65690 109613 124641 72941 66630 74132 49410 57919 80328 67426
12426F7426M618L089m2414m6509M9275M809k1086M438L194L2228Q001m3871N8558
$$ 67426 72044 75133 32719 -13790 35485 40294 19208 23646 26840 59068 67069 23198 81756
12413H1756K3134l9737r445J6776j742k3064K6130K3784J6940J5739l1679n6744
$$ 81756 104890 65153 55708 72484 70742 47678 73808 97592 114532 130271 98592 41848
12401D1848L5952J869p6463J2238N7569M267o5256k01K8991M6803J0023J4098
$$ 41848 77800 79669 3206 15444 73013 77280 12024 11823 40814 87617 97640 111738
12389A11738K189n5435k3821K5848J4243J6091J065K8487M6375k0731r314j1838
$$ 111738 113927 58492 34671 60519 74762 90853 91918 120405 166780 146049 136735 124897
12377A24897M4511l4707l6549p018k1514K4276P80p812j2992j6409J5614j1329
$$ 124897 169408 134701 98152 91134 69620 93896 94676 86864 73872 57463 73077 61748
12365F1748k2552q835j6589j7006j1989k0747M6404P0099M35J0119M050J4529
$$ 61748 39196 30361 13772 -3234 -15223 -35970 10434 80533 80968 91087 95137 109666
12353A09666K2447J3933j210o7441m0054N4961k3670o4087m2374J9817K9910Q6999
$$ 109666 132113 146046 144836 77395 37341 92302 68632 4545 -37829 -18012 11898 98897
12341I8897L4971k0673M149m9126q4586m651j749J9560o158J0934Q7312q043m7842
$$ 98897 133868 113195 117344 68218 -16368 -21019 -22768 -3208 -9366 1568 88880 80837 32995
12328C2995k9968j3443L2243j5298R758N942j6412k2933j5112M2021J0769o317
$$ 32995 3027 -10416 21827 6529 16287 22229 5817 -17116 -32228 9793 20562 14245
12316A4245M940j9473K5370K1810j933M4292j5283n8519m5169L1914m5453J5666
$$ 14245 19185 -288 25082 46892 44959 89251 73968 15449 -29720 2194 -43259 -27593
12304b7593M5774M3818l9698Q455M600j5622l091L3672N065o633J4631l7707l7927
$$ -27593 18181 61999 22301 30756 35356 19734 16643 50315 55380 48747 63378 25671 -12256
12291a2256q129k017M7963K8517o6134l9950K5242N932M131k7419o168P270o8
$$ -12256 -20385 -22402 25561 54078 -12056 -52006 -26764 -20832 -16701 -44120 -50288 -43018 -43086
12278d3086L821M0871M8533L7579N422k3248j3186N0137L2953M5581m726l2146
$$ -43086 -39265 1606 50139 87718 93140 69892 56706 106843 139796 185377 180651 148505
12266A48505n7965l5662j3315n810J030j2053J8792l673r751j6599k8187k9581
$$ 148505 90540 54878 41563 35753 36783 24730 43522 39849 30098 13499 -14688 -44269
12254d4269P288M3191J6796K8l2975L2663L4905k4452l0177l2201N5950P5734
$$ -44269 -36981 6210 23006 23034 -9941 22722 57627 33175 2998 -29203 26747 102481
12242A02481j6286m4885J5746M5646K3032J6221n1125j3364K7123M1769J9987
$$ 102481 86195 41310 57056 102702 125734 141955 90830 77466 104589 146358 166345
12231A66345j8295R974l1462K1126R6795J52227J74131K28741K74206K85219J76709
$$ 166345 148050 158024 126562 147688 244483 396710 570841 799582 1073788 1359007 1535716
12220A535716m8088k79604l06675k11755j55017q6440n1160p3629q1847m6812
$$ 1535716 1487628 1208024 901349 689594 534577 448137 396977 323348 241501 194689
12210A94689m1116m7753n896K2277j8346J4321k1748J7450P091j7839l956P311
$$ 194689 153573 105820 99924 122201 103855 118176 96428 113878 120969 103130 99174 106485
12198A06485j6420K3013J429J5791k6190M389n691k8267m6958l9612j9389L5029
$$ 106485 90065 113078 114507 130298 104108 108497 102806 74539 27581 -12031 -31420 3609
12186C609k1798M6017O5310M2648K3466n6315p8738J5852r35m6102l8740K3191
$$ 3609 -18189 27828 93138 135786 159252 102937 24199 40051 39116 -6986 -45726 -22535
12174b2535O0034N856P39R327j8905m8890j610M4380k6264k2622O8563L4008k314
$$ -22535 37499 43355 44094 53421 34516 -14374 -15984 28396 2132 -20490 48073 82081 79767
12161G9767j1742j1073q816J7316j3106o1959l2358J5395L6813L6752P757M1814
$$ 79767 68025 56952 48136 65452 52346 -9613 -41971 -26576 10237 46989 54746 96560
12149I6560l8721l9879L262L1020J1008m4134l2150n0452M5169L1962L0679j1705
$$ 96560 57839 17960 21222 52242 63250 19116 -13034 -63486 -18317 13645 44324 32619
12137C2619k6995k9946M338L3450J154k3928J0733K7313L547j0533j1968L0410
$$ 32619 5624 -24322 -19984 13466 14620 -9308 1425 28738 32285 21752 9784 40194
12125D0194k7666m7139q0685k6603N3099Q8542M5052P4133m2309p1936m926p144
$$ 40194 12528 -34611 -115296 -141899 -88800 -258 44794 118927 76618 4682 -244 -7388
12113g388j4576N215j5406J1548K1855K8685p637j9027l8366L7157j4614L1203
$$ -7388 -21964 -16749 -32155 -20607 1248 29933 22296 3269 -35097 2060 -12554 18649
12101A8649p320n9059j135P673j4598K212j7804L015N5055N0429k7794l9286N201
$$ 18649 11329 -47730 -48865 -41192 -55790 -53578 -71382 -68367 -13312 37117 9323 -29963 -24762
12088b4762K5195j3782N806q632k1020J2246L6862R172j6215L782J6337j217M0747
$$ -24762 433 -13349 -7543 -16175 -37195 -24949 11913 21085 4870 8652 24989 23772 64519
12075F4519k2056o9021k9862o747M1283M3602k2998l822J639k103j1978k3732
$$ 64519 42463 -26558 -56420 -63167 -21884 21718 -1280 -5102 -3463 -5566 -17544 -41276
12063d1276J8489K7143M9202J1971P670J246j1248l7149n7215k1931J3595L090
$$ -41276 -22787 4356 53558 65529 73199 74445 63197 26048 -31167 -53098 -39503 -36413
12051c6413p25r091O0605L1735K4486k805m9352L65k2626m494o061k3979J3351
$$ -36413 -37138 -46229 14376 46111 70597 67792 18440 18805 -3821 -8315 -14376 -38355 -25004
12038b5004j2625j8031J5389M612j2390J5558o660M256L4627J5482m0219l3825
$$ -25004 -37629 -55660 -40271 -35659 -48049 -32491 -39151 -34895 -268 15214 -25005 -58830
12026e8830K2086j0268Q692J2313J3617r128K0604Q953J3730J8050N199k4898
$$ -58830 -36744 -47012 -38320 -26007 -12390 -21518 -914 8039 21769 39819 45018 20120
12014B0120j500L0820l4409n0853m3003P6140Q9456l8360r932o6603l4521J2915
$$ 20120 18620 49440 15031 -35822 -78825 -2685 86771 48411 38479 -28124 -62645 -49730
12002d9730Q3805O0931L3518n0386P855k0545m8025K6550L8629r264p5352L557
$$ -49730 34075 95006 128524 78138 85993 65448 17423 43973 82602 73338 -2014 1543
11990A543p684M2125k1688j7498K7788m0109j4027L2503J2978m6917n2289j5509
$$ 1543 -6141 35984 14296 -3202 24586 -15523 -29550 2953 15931 -30986 -83275 -98784
11978i8784L4363P7964M5587n8979Q537k8962K6328N1214L3623k5310l0747J941
$$ -98784 -64421 13543 59130 151 8688 -20274 6054 57268 90891 65581 34834 36775
11966C6775J5107l318j7890j4333L0605n9410o6403J4474L3229K8715k3643J782
$$ 36775 51882 48564 30674 16341 46946 -12464 -78867 -64393 -31164 -2449 -26092 -24310
11954b4310j3186K6844L8633j2788M542N042Q773J8985K5557j6522k4105m7936
$$ -24310 -37496 -10652 27981 15193 19735 24777 33550 52535 78092 61570 37465 -10471
11942a0471l2988o3667M955N6564P3974r671m1969P35l7221M5505O8406l5231
$$ -10471 -43459 -107126 -102171 -45607 28367 18696 -23273 -22538 -59759 -14254 54152 18921
11930A8921K746n945K538n4133m8380P3649J2073q9109J4339M5841K8403n044
$$ 18921 21667 15722 18260 -35873 -84253 -10604 1469 -87640 -73301 -27460 943 -4101
11918d101q340L9283J8674K2279j8196k5559P090M3939j311N3937l0126l5454
$$ -4101 -12441 26842 45516 67795 49599 24040 31130 75069 73758 127695 97569 62115
11906F2115L3524n3635o0165j9435J2211L6617N390k6683N3580K8555k7819K161
$$ 62115 95639 42004 -18161 -37596 -25385 11232 16622 -10061 43519 72074 44255 46416
11894D6416j3449j1461r705j4386K0354J7016Q707k809k0602k863n0769n0000
$$ 46416 32967 21506 11801 -2585 17769 34785 43492 40683 20081 17218 -33551 -83551
11882h3551K2234L2057K9822m3151R087L3712L1079J351k0442n1418J1948L8270
$$ -83551 -61317 -29260 562 -42589 -33502 210 31289 32640 12198 -39220 -27272 10998
11870A0998K3684m3217N487K8639K2338j9733m9504k2471K3356K2256J076n5957
$$ 10998 34682 -8535 -3048 25591 47929 28196 -21308 -43779 -20423 1833 2909 -53048
11858e3048j3641J3328L5858M8809j9429m0129L5607J4617n7421j4643K615N5302
$$ -53048 -66689 -53361 -17503 31306 11877 -28252 7355 21972 -35449 -50092 -47477 7825
11846G825M9013j9577L2333K0887k0082M5151o668q397J7555J1815m8161n7063
$$ 7825 56838 37261 69594 90481 70399 115550 108882 100485 118040 129855 81694 24631
11834B4631K7186J9232m3906q871L0385m4149K8605K5853l3987n0824L8270N4738
$$ 24631 51817 71049 27143 18272 48657 4508 33113 58966 24979 -25845 12425 67163
11822F7163j5413k5508J4683m940k1233n54J1355j2451m9394l5197p2842m195
$$ 67163 51750 26242 40925 35985 14752 14198 25553 13102 -36292 -71489 -144331 -148526
11810a48526L2770P2998M335J5703R119P3418O7270L4382l8844n3613k6278k2803
$$ -148526 -115756 -42758 -38423 -22720 -13601 59817 127087 161469 122625 69012 42734 19931
11798A9931j8471J9006K3746j151n8836o3859M5995K881J7412L6301P2186m144
$$ 19931 1460 20466 44212 43061 -15775 -79634 -33639 -30758 -13346 22955 95141 90997
11786I0997p0002q055p585N112J9183j9037m0692N642n043j229J1561L8599O461
$$ 90997 20995 12940 5355 10467 29650 10613 -30079 -24437 -29480 -30709 -19148 19451 25912
11773B5912J4670k1682j6700L5565j1312k5691l574j4878m7200j0080J4642L6322
$$ 25912 40582 18900 2200 37765 26453 762 -2812 -17690 -64890 -74970 -60328 -24006
11761b4006K5043l3873m93K1034L4261M2938K4348k1304m0373j0664k9582j7539
$$ -24006 1037 -32836 -33329 -12295 21966 64904 89252 67948 27575 16911 -12671 -30210
11749c0210k3521O241M4462M8932M0549m5078k1039m1586L1656J3863l3010k7232
$$ -30210 -53731 -47490 -3028 45904 86453 41375 20336 -21250 10406 24269 -8741 -35973
11737c5973n2462K3736M3671j6193k9216j2486K1865M6354k0933k4427R5968r999
$$ -35973 -88435 -64699 -21028 -37221 -66437 -78923 -57058 -10704 -31637 -56064 39904 29905
11725B9905l1422j347L195n0730j2887J5655N133j4396j185L6167M3856J5916
$$ 29905 -1517 -2864 331 -50399 -63286 -47631 -42498 -56894 -58079 -21912 21944 37860
11713C7860M174p975k796K1859j3380l1928K2055M0892m6013n6014j0703M895
$$ 37860 42034 34059 31263 53122 39742 7814 29869 70761 24748 -31266 -41969 -37074
11701c7074l019L0072J8670j226k6994k5847j6378j775J6268L6546M6426j5264
$$ -37074 -40093 -10021 8649 7423 -19571 -45418 -61796 -63571 -47303 -10757 35669 20405
11689B0405l2161M6692k655k6383k523k455j8347l2998k2612L8112L9413l4136
$$ 20405 -11756 34936 32281 5898 3375 920 -17427 -50425 -73037 -34925 4488 -29648
11677b9648J6995L0929L7697l7558o6043r127N0278r199j1096m94J7712N11k3962
$$ -29648 -12653 18276 55973 18415 -47628 -56755 -6477 -15676 -26772 -27266 -9554 -9043 -33005
11664c3005n1859k0736N9299M4576l0598J3049j0595k5479k6477J2758K6594O4540
$$ -33005 -84864 -105600 -46301 -1725 -32323 -19274 -29869 -55348 -81825 -69067 -42473 22067
11652B2067N1064J2557J4841j72l6436r090J2095k6589r325N0395R546k8326j5825
$$ 22067 73131 85688 100529 100357 63921 54831 66926 40337 31012 81407 90953 62627 46802
11639D6802m1914k9151N302K0332j9986m6145K323P1892N9476j7519j74m354L0844
$$ 46802 4888 -24263 -18961 1371 -18615 -64760 -62437 9455 68931 51412 51238 46884 77728
11626G7728k7930m4270j9532Q0987k7645j8578K2134J7335K7801m1628r753n3174
$$ 77728 49798 5528 -14004 66983 39338 20760 42894 60229 88030 46402 36649 -16525
11614a6525O063R730M2591m4416k9332L4315n267k8512l8895R915J9546j1076
$$ -16525 -10462 -732 41859 -2557 -31889 2426 -2841 -31353 -70248 -60333 -40787 -51863
11602e1863M2892P2179M1747j4514l4711l7488l1222m2366n2478r464O0010O6047
$$ -51863 -8971 63208 104955 90441 55730 18242 -12980 -55346 -107824 -117288 -57278 8769
11590H769l742Q76j9249m4571K8713L5066J0542R670J8719j1261q866o475l2895
$$ 8769 5027 5903 -13346 -57917 -29204 5862 16404 26074 44793 33532 24666 18191 -14704
11577a4704l5671J7253O2866N4673J6702k6781l1146R079K249K9030l4306m4879
$$ -14704 -50375 -33122 29744 84417 101119 74338 43192 52271 54520 83550 49244 4365
11565D365K782J1148J3346m5074o4928M4985O9861M5079m8233j3818O228m027
$$ 4365 7147 18295 31641 -13433 -78361 -33376 36485 81564 33331 19513 25741 21714
11553B1714o2464n3606k0442J6775L2795J9761L3372l1936K9198J228j4146K7237
$$ 21714 -40750 -94356 -114798 -98023 -65228 -45467 -12095 -44031 -14833 -13605 -27751 -514
11541e14K2146m2592n8631K2517L7128J7341K3369m1863J2365J6726J1841p254
$$ -514 21632 -20960 -79591 -57074 -19946 -2605 20764 -21099 -8734 7992 19833 12579
11529A2579k9852K2665K1913P493N738K5329o827o037j6160N915m0725k1514K2027
$$ 12579 -17273 5392 27305 34798 40536 65865 59038 53001 36841 42756 2031 -19483 2544
11516B544K4569J314k0391L3355N4444O679r6535j4138r803m1179M42k8490k6805
$$ 2544 27113 28427 8036 41391 95835 102514 5979 -8159 -17962 -59141 -58699 -87189 -113994
11503a13994j0316K0685P1932M1056j6890j6322m7541J4442J4461K4417O79j1852
$$ -113994 -124310 -103625 -31693 9363 -7527 -23849 -71390 -56948 -42487 -18070 -17391 -29243
11491b9243j9848q847R875k5373K2487J6155j7156K5288j094N973M694o0979j2480
$$ -29243 -49091 -57938 -48063 -73436 -50949 -34794 -51950 -26662 -27756 -21783 -17089 -78068 -90548
11478i0548r195L2050J09m5366l2905O3198P3594J6845L177r901p4M1813j5733
$$ -90548 -99743 -67693 -67584 -112950 -145855 -82657 -9063 7782 10959 1058 984 42797 27064
11465B7064l7850J838k0436q487K66k2915j564Q996L326n910J4197M1556J8313
$$ 27064 -10786 -8948 -29384 -37871 -37605 -60520 -62084 -53088 -49762 -55672 -41475 81 18394
11452A8394n0727O092K683n4834l3473O9141K7710M9825L6367m268R220l7648
$$ 18394 -32333 -26241 -23558 -78392 -111865 -42724 -15014 34811 71178 66910 76130 38482
11440C8482j0257J9264l7892o3872l9399L0890P2986m70m4033o54q66K2000L961
$$ 38482 28225 47489 9597 -54275 -93674 -62784 10202 9732 -34301 -34955 -35821 -13821 -9860
11427i860L8487K8981K8360o1345m2898L0846j2678r159K5466k0529l2539p654
$$ -9860 28627 57608 85968 24623 -18275 12571 -107 -9266 16200 -4329 -36868 -44522
11415d4522j2865Q062K5005K5849J9650k2272l1105J1454O83l1850J0923N5940
$$ -44522 -57387 -49325 -24320 1529 21179 -1093 -32198 -20744 -20061 -51911 -40988 14952
11403A4952J7617j1871k7122j8785O3421P2060k1406l9168k2667k5316K9910j7202
$$ 14952 32569 20698 -6424 -25209 38212 110272 88866 49698 27031 1715 31625 14423
11391A4423K5795M8502j051p355k950J5745n1118j3209K0396N045o2548n3374
$$ 14423 40218 88720 87669 80314 77364 93109 41991 28782 49178 54223 -8325 -61699
11379f1699r762j0762L0853L3909O781L1879M0365k5761J3154J8213k0257j6472
$$ -61699 -71461 -82223 -51370 -17461 -10680 21199 61564 35803 48957 67170 46913 30441
11367C0441R653j2867l4643M8861N5029j276r619l7302m0566j308l1931p028L7492
$$ 30441 40094 27227 -7416 41445 96474 95198 85579 48277 7711 6403 -25528 -32556 4936
11354D936Q691m1621k9479K1121N1995J6854l8235J0747L0990l1496l5997m0154
$$ 4936 13627 -27994 -57473 -36352 15643 32497 -5738 5009 35999 4503 -31494 -71648
11342g1648j3958j8843P145l04l898K2206N3160j2696k6304l2934k871K7066L6120
$$ -71648 -85606 -104449 -97304 -97608 -101506 -79300 -26140 -38836 -65140 -98074 -100945 -73879 -37759
11329c7759O3988K8670k3206n1439k9928k774Q272M8586j8567n772N0853n104
$$ -37759 26229 54899 31693 -19746 -49674 -52448 -44176 4410 -14157 -19929 30924 25820
11317B5820l0005p748p807p5869k264K560P755k9866J7846O757L5532J8835M107
$$ 25820 -4185 -11933 -19740 -95609 -97873 -95313 -87558 -117424 -99578 -92821 -57289 -38454 -34347
11304c4347m4893J1781L7450P0966k686k0280O047n6715j9479l0310L4143J3448
$$ -34347 -79240 -67459 -30009 40957 38271 17991 24038 -32677 -52156 -82466 -48323 -34875
11292c4875M355k5917R278J1487L3387N9137j9920k5796L3285J93n8648l1605
$$ -34875 -30520 -56437 -47159 -35672 -2285 56852 36932 11136 44421 44614 -14034 -45639
11280d5639l4151N4741J5653j6363K3100K950j597J8676K5194J7939P623m166
$$ -45639 -79790 -25049 -9396 -25759 -2659 291 -1306 17370 42564 60503 68126 63960
11268F3960p5174r5242K89M1250M471K2651R2725l1103n0714r276k2101j4721
$$ 63960 -11214 -106456 -106167 -64917 -60446 -37795 54930 23827 -26887 -36163 -58264 -72985
11256g2985k149M3312J1479j6996N495L2552k705L200K2880m2062J6317L5251
$$ -72985 -75134 -31822 -20343 -37339 -31844 708 -1997 1203 24083 -17979 -1662 33589
11244C3589L2579k5202k2990K1778M6491o335j6344r526j9711j9145j3955m262
$$ 33589 66168 40966 17976 39754 86245 79910 63566 54040 34329 15184 1229 -3033
11232c033L6088J5570j3814m88J3210j2907J3963j0250M9075J3128K844r422k0410
$$ -3033 33055 48625 34811 34323 47533 34626 48589 38339 87414 100542 103386 93964 73554
11219G3554j7280M501P765K3190k8927m0323L880N6480K4054j0023k3777j7633
$$ 73554 56274 60775 68540 91730 62803 22480 26360 82840 106894 96871 73094 55461
11207E5461L83j8710m2116k6507n940J4800K6157N2292M6514j7163k5783N7172
$$ 55461 55844 37134 -4982 -31489 -37429 -22629 3528 55820 102334 85171 59388 116560
11195A16560N804J7232L3394J1075k8384p4086K7046Q4945N1476P1204j7563q1744
$$ 116560 122364 139596 172990 184065 155681 81595 108641 193586 245062 316266 298703 216959
11183B16959n2735M6690N8461j0046o1597l5768J3801k9432J4791K6490m4991
$$ 216959 164224 210914 269375 259329 197732 161964 175765 146333 161124 187614 142623
11172A42623Q615j4253l0479l9332J2976L3333N578j2738p099O245J9156j4367
$$ 142623 151238 136985 106506 67174 80150 113483 119061 106323 99224 105469 124625 110258
11160A10258K9141J334n854K2157K3111l169J3619J5047n4944m9726N4078M6752
$$ 110258 139399 140733 134879 157036 180147 176978 190597 205644 150700 100974 155052 201804
11148B01804k9019K2023K4278k1224L799J321k2940J4386O5369k2068m5209K5847
$$ 201804 172785 194808 219086 197862 201661 202982 180042 194428 259797 237729 192520 218367
11136B18367Q4628N277l1081M4837M195n4559k8864m6839j2600k7481o6299L936
$$ 218367 302995 308272 277191 322028 326223 271664 242800 195961 183361 155880 89581 93517
11124I3517O404K9118J8103r917n997o7649J0507K8808L8343J443j7540k2506
$$ 93517 99921 129039 147142 137225 131228 63579 74086 102894 141237 142680 125140 102634
11112A02634O5174m899k9427n6508k3572J6156l767J6321K2218k2768j0139M8154
$$ 102634 167808 162909 133482 76974 53402 69558 65791 82112 104330 81562 71423 119577
11100A19577m7948p990k991K2997j0970l8647J2103L7683K5810K2248k7542n003
$$ 119577 71629 63639 60648 83645 72675 34028 46131 83814 109624 131872 104330 99327
11088I9327l0769l6576j6349P4671J3297l5334L1345k9921j4736K5794J4582j3183
$$ 99327 68558 31982 15633 90304 103601 68267 99612 69691 54955 80749 95331 82148
11076H2148M43k1762k0893j2508L3585j4143o3040k2770M7549N9464k8742j5297
$$ 82148 82591 60829 39936 27428 61013 46870 -16170 -38940 8609 68073 39331 24034
11064B4034k593p3619n137L1784k6740P976Q9973k555N4120k4824m6223K9910
$$ 24034 21441 -52178 -57315 -25531 -52271 -44295 45678 43123 97243 72419 26196 56106
11052E6106n7435k3278j6491J0489j9542j3351L5094M3546k6631l0453L5905K8362
$$ 56106 -1329 -24607 -41098 -30609 -50151 -63502 -28408 15138 -11493 -41946 -6041 22321
11040B2321J8543l403Q490k9527j0382n7382k4830J0979K567L3460k5949J481
$$ 22321 40864 37461 45951 16424 6042 -51340 -76170 -65191 -62624 -29164 -55113 -53632
11028e3632l4963L140M8351N772J6852M5844K1198K7270l6099m8664R013Q8465
$$ -53632 -88595 -85455 -37104 -31332 -14480 31364 52562 79832 43733 -4931 4082 92547
11016I2547K3183n6054R717q215l6638J4126K8538l094j6307j5267q247L0779
$$ 92547 115730 59676 69393 61178 24540 38666 67204 64110 47803 32536 24289 55068
11004E5068j7673r0077j2274J5302j2311K7763K8140k6266m1709r59M5349P0933
$$ 55068 37395 -52682 -64956 -49654 -61965 -34202 -6062 -32328 -74037 -74996 -29647 41286
10992D1286j9978l7156l2036J6174N5169m3156j0012N676l0894l8536K100J4193
$$ 41286 21308 -15848 -47884 -31710 23459 -19697 -29709 -24033 -54927 -93463 -91363 -77170
10980g7170P0710J0606l390k4453q619J3345N4962j6393k3746L2476J8532k976
$$ -77170 -6460 4146 756 -23697 -32316 -18971 35991 19598 -4148 28328 46860 43884
10968D3884Q997k6678k912m1017m3897l5055k4787L0282J03301L0398m9833l0309
$$ 43884 52881 26203 23291 -17726 -61623 -96678 -121465 -91183 12118 42516 -7317 -37626
10956c7626j4086L2624L3982J7050K2134M685Q371o768m6662l9843q365N2383
$$ -37626 -51712 -19088 14894 31944 54078 58763 67134 60366 13704 -26139 -34504 17879
10944A7879J8060J72n313o2446k9925K0961J6139J7037j962R581M625m0688j4548
$$ 17879 35939 36111 30798 -31648 -61573 -40612 -24473 -7436 -9398 183 4808 -35880 -50428
10931e0428L420o240M6469L4085k4688k7913j2067k1431J189J1647P0482J4223
$$ -50428 -47008 -53248 -6779 27306 2618 -25295 -37362 -58793 -57604 -45957 24525 38748
10919C8748K9715l4253o4019m1571j9197O1040J5344J771J6164k1799j3546L1109
$$ 38748 68463 34210 -29809 -71380 -90577 -29537 -14193 -12422 3742 -18057 -31603 -494
10907d94O4200l6944j0664K7015J3389l0758K7503O0310j4354p3214k7860J959
$$ -494 63706 26762 16098 43113 56502 25744 53247 113557 99203 25989 -1871 88
10895H8j1875M109q968j5482K3189O3520k5599k4091Q651M828K7037j1396k2167
$$ 88 -11787 -7678 -16646 -32128 -8939 54581 28982 4891 13542 18370 45407 34011 11844
10882A1844k4262L9489o303l1966n2544L9169M7218M4336K8415q057J6213J7982
$$ 11844 -12418 27071 20768 -11198 -63742 -24573 22645 66981 95396 87339 103552 121534
10870A21534l5569J1343M9897K2036L6319J18248J35172O9957K599j2838j05682
$$ 121534 85965 97308 147205 169241 205560 323808 458980 528937 531536 518698 413016
10859D13016j39798m6689l7596o0680m2877j5435l0143l0389R408m3528m0837
$$ 413016 273218 226529 188933 128253 85376 69941 39798 9409 18817 -24711 -65548
10848f5548R164K9202P940M8796q649L1477p680l1797M0143n9635k9272J821K3826
$$ -65548 -56384 -27182 -19242 29554 20905 52382 44702 12905 53048 -6587 -35859 -34038 -10212
10835a0212J1538k6584J8417R565R798J1158m6874k6767K3872j7310J1942j0078
$$ -10212 1326 -25258 -6841 2724 12522 23680 -23194 -49961 -26089 -43399 -31457 -41535
10823d1535j679n182M1138O0915l466l8092o8767o2199j0860N2632K5798M7945
$$ -41535 -43214 -48396 -7258 53657 50191 12099 -56668 -118867 -129727 -77095 -51297 -3352
10811c352p056R159m118l1688L2562M0788L8461j4456j1976j7302k5533K0218
$$ -3352 -10408 -1249 -5367 -37055 -4493 36295 74756 60300 48324 31022 5489 25707
10799B5707K3346n0178p0355J2731k525j4963L7368J9691k540R691O6533k3520
$$ 25707 49053 -1125 -71480 -58749 -61274 -76237 -38869 -19178 -21718 -12027 54506 30986
10787C0986K97l1267k7034m59O4697M8210l3600l4089j7589P109Q637r2166L960
$$ 30986 31283 16 -27018 -27477 37220 85430 51830 17741 152 7261 15898 -76268 -72308
10774g2308P4833R528r530R77j2605J9861k3642j4649k1914L8257K9050K7099
$$ -72308 2525 12053 2523 3500 -9105 10756 -12886 -27535 -49449 -11192 17858 44957
10762D4957j6279m7444q188n0440k1564P1144M9759j3640L884p5859k3682k3390
$$ 44957 28678 -18766 -26954 -77394 -98958 -27814 21945 8305 12189 -63670 -87352 -110742
10750a10742j7836L9707q283M8092N1955R890m5158K2729Q595l8958J0233j9658
$$ -110742 -128578 -88871 -97154 -49062 2893 12783 -32375 -9646 -1051 -40009 -29776 -49434
10738d9434K9976n0105m2000M570l262N0817N0390L6682l5464q908j3628L4083
$$ -49434 -19458 -69563 -111563 -106993 -110255 -59438 -9048 27634 -7830 -16738 -30366 3717
10726C717J4242k541k5328k5876L9275L7254l5826J1684R1803J3358m1544m4622
$$ 3717 17959 15418 -9910 -35786 3489 40743 4917 16601 108404 121762 80218 35596
10714C5596P711q660k6891l4402L5830K8604K0219j325k1309j6642L2627k4389
$$ 35596 43307 34647 7756 -26646 9184 37788 58007 56682 35373 18731 51358 26969
10702B6969l9935J7586J9505M0328n693j391K3723n0250m4869M7035j9793j1711
$$ 26969 -12966 4620 24125 64453 58760 57369 81092 30842 -14027 33008 13215 1504
10690A504j671J1655j6060n4674k3371L2646K5867J4766j6989K1157J8034M0156
$$ 1504 -167 11488 -4572 -59246 -82617 -49971 -24104 -9338 -26327 -5170 12864 53020
10678E3020P2486Q7865O2989K9180P6985J15088P331j27620j44830q1044l148
$$ 53020 125506 213371 276360 305540 382525 497613 504944 377324 232494 151450 148302
10667A48302l1529o6647o2310J4728M6518J6307o2332N7494O2165m8364l2531
$$ 148302 116773 50126 -12184 2544 49062 65369 3037 60531 122696 74332 41801
10656D1801j3862l7796q5494J4061l354N8010L2698l4811l3294J3306M1459j5331
$$ 41801 27939 -9857 -95351 -81290 -84644 -26634 6064 -28747 -62041 -48735 -7276 -22607
10644b2607j6731L7433L9064o360J367K8276R699J0089j152K1291P5387P6877
$$ -22607 -39338 -1905 37159 30799 32166 60442 70141 80230 79078 100369 175756 252633
10632B52633L6227J2229q0126j03155q3282q1271m551L2273o4246M606K6391j7015
$$ 252633 288860 301089 220963 117808 34526 -46745 -51296 -19023 -83269 -78663 -52272 -69287
10620f9287L2885M9303r113o2973Q010K6490L2218j6555P599p241Q237J1008J0402
$$ -69287 -36402 12901 3788 -59185 -51175 -24685 7533 -9022 -1423 -8664 -427 10581 20983
10607B0983J7719k331j8702m0361l2697j4156l0913J4037M4373J4426K8086n4932
$$ 20983 38702 36371 17669 -22692 -55389 -69545 -100458 -86421 -42048 -27622 464 -54468
10595e4468j6231m244L7324O56K3824J606o5945m7147J5842N9008L9589J181M1827
$$ -54468 -70699 -74943 -37619 -36963 -13139 -11533 -77478 -124625 -108783 -49775 -10186 -9005 32822
10582C2822k2557k8267l23m7982l4012J9514J7011M909L371M8789J8269j9872
$$ 32822 10265 -18002 -18325 -66307 -100319 -80805 -63794 -58885 -55514 -6725 11544 -8328
10570h328l5459j0334j8668o2479j4212M7597J4853O4065N3004L5400j1079n4586
$$ -8328 -43787 -54121 -72789 -135268 -149480 -101883 -87030 -22965 30039 65439 54360 -226
10558b26l1765o337K2893M1125o7425l2736N1432L9014m7260k0306l6812K687
$$ -226 -31991 -38328 -15435 25690 -41735 -74471 -23039 15975 -31285 -51591 -88403 -85716
10546h5716n094P6219Q7447j8434Q567J5579k5254k0531M4449O367j5517J0102
$$ -85716 -90810 -14591 72856 54422 62989 78568 53314 32783 77232 83599 68082 78184
10534G8184l237l6696l2266l2375n518P778o73k8832k4095M1012K9368k4164j3978
$$ 78184 74947 38251 5985 -26390 -31908 -24130 -24803 -53635 -77730 -36718 -7350 -31514 -45492
10521d5492J1498o0838j0364J0948J4080R4399M6261r3610N386M9926j6228l958
$$ -45492 -33994 -94832 -105196 -94248 -80168 14231 60492 -33118 -27732 22194 5966 2008
10509B008j5111k4489K0702J1351n616l1168j1826k5611k8721L9427N1816K7519
$$ 2008 -13103 -37592 -16890 -5539 -11155 -42323 -54149 -79760 -108481 -69054 -17238 10281
10497A0281N0194l9346l0010L547K9141J0853J735J2104l3014m1425j1362O523
$$ 10281 60475 21129 -8881 -5334 23807 34660 36395 48499 15485 -25940 -37302 -30779
10485c0779J5676o289J8616m7247l8034Q287J1175P0332o646K2785L94Q753N0949
$$ -30779 -15103 -21392 -2776 -50023 -88057 -79770 -68595 1737 -4909 17876 18270 27023 77972
10472G7972M0845q315K3071p314p8381p8727l8645L6724L6750L0965l0702k4038
$$ 77972 118817 110502 133573 126259 47878 -30849 -69494 -32770 3980 34945 4243 -19795
10460a9795k301p708m2522p800L2233P4660P2716n7799n3695J9098K0003n166
$$ -19795 -22096 -29804 -72326 -80126 -47893 26767 99483 41684 -12011 7087 27090 21924
10448B1924j4688r836j1044j3114j6794L5549M2987m0003m4130p138k6113j7008
$$ 21924 7236 -2600 -13644 -26758 -43552 -8003 34984 -5019 -49149 -56287 -82400 -99408
10436i9408R297Q0345M2384K7224N212j5221m2025N110r714M0142J9328J4346
$$ -99408 -90111 -9766 32618 59842 65054 49833 7808 12918 3204 43346 62674 77020
10424G7020l4291o3075n2534k1926K9394L1163L8796J9305N109J3685m4592J5371
$$ 77020 42729 -20346 -72880 -94806 -65412 -34249 4547 23852 28961 42646 -1946 13425
10412A3425K9240O638l2783k7699P419K7030J0349K2537q201k6508P639j618k3257
$$ 13425 42665 49303 16520 -11179 -3760 23270 33619 56156 47955 21447 29086 27468 4211
10399D211K2995J4367m1049k802r199r559n919k3595J3185N209l8215L6157J3793
$$ 4211 27206 41573 524 -2278 -11477 -21036 -26955 -50550 -37365 -32156 -70371 -34214 -20421
10386b0421O053o3862m411R605J0897K9130p872k6073m0392K0279K4828N105K0826
$$ -20421 -14368 -78230 -82641 -73036 -62139 -33009 -40881 -66954 -107346 -87067 -62239 -57134 -36308
10373c6308K0690J16J9118m0907K9143O2107k8862m7185o70K3598r382R578j2648
$$ -36308 -15618 -15502 3616 -37291 -8148 53959 25097 -22088 -22758 840 -8542 1036 -11612
10360a1612m40J7396K5363l8794n3249q002L4760L6051j3991j9500l3641R289
$$ -11612 -12052 5344 30707 -8087 -61336 -69338 -34578 1473 -12518 -32018 -65659 -56370
10348e6370O2559r17j3175j187k5392r872k0065K4552P0380K3937K8548k3271
$$ -56370 6189 5272 -7903 -9090 -34482 -44354 -64419 -39867 30513 54450 82998 59727
10336E9727o5838p008N3185m8330k8982K9684j8327j5698o071L0867j2802k5399
$$ 59727 -6111 -13119 40066 -8264 -37246 -7562 -25889 -41587 -47658 -16791 -29593 -54992
10324e4992j6716k8752Q562K3539p253l9620J9405k9653l0509O187J5328j2243
$$ -54992 -71708 -100460 -91898 -68359 -75612 -115232 -95827 -125480 -155989 -149802 -134474 -146717
10312a46717k1610l164K0415L0034O0549n432k3015K3918K6413j8188K4444l4400
$$ -146717 -168327 -171491 -151076 -121042 -60493 -65925 -88940 -65022 -38609 -56797 -32353 -66753
10300f6753L3975L701k3768r397q173N050j6680O3859J0867K298l3745M047M6583
$$ -66753 -32778 -29077 -52845 -62242 -70415 -65365 -82045 -18186 -7319 -5021 -38766 -34719 11864
10287A1864K2455k8240K4940l3792m2643j0340k2416j9747Q513M7500j5063j6501
$$ 11864 34319 6079 31019 -2773 -45416 -55756 -78172 -97919 -89406 -41906 -56969 -73470
10275g3470J9723L767q522L0548j4946j0253K1435J8459j9718j573O8557L6518
$$ -73470 -53747 -49980 -58502 -27954 -42900 -53153 -31718 -13259 -32977 -34550 34007 70525
10263G0525R07Q209l9915n9148n5611q640K4676L256k780j3778j9987k6482j5145
$$ 70525 71432 79641 39726 -19422 -75033 -83673 -58997 -55741 -58521 -72299 -92286 -118768 -133913
10250a33913n440P6M0008k308K951M8740L9883l1430l0630L8157M4299k8136l6241
$$ -133913 -139353 -139277 -99269 -101577 -98626 -49886 -10003 -41433 -72063 -33906 10393 -17743 -53984
10237e3984L4505K7552M5615K5074l4113o8043K0068M697k1154J4858P5025K2401
$$ -53984 -19479 8073 53688 78762 44649 -23394 -3326 1371 -19783 -4925 70100 92501
10225I2501n6373l8948J2605n8120q623m301L9621o472L876n0813j3425n3821
$$ 92501 36128 -2820 9785 -48335 -56958 -61259 -21638 -28110 -24234 -75047 -88472 -142293
10213a42293l7852N6032N3485k880M7632r171n3868o238J0855Q875L8630K6622
$$ -142293 -180145 -124113 -70628 -73508 -25876 -35047 -88915 -95153 -84298 -75423 -36793 -10171
10201a0171M5802j0050n4435l0627o5283K5965N5642j4862J7059k0153O83N9795
$$ -10171 35631 25581 -28854 -59481 -124764 -98799 -43157 -58019 -40960 -61113 -60430 -635
10189f35K6846n508N571k3948m1938n818J2556J3918l656k5003k5979k0313K9228
$$ -635 26211 20703 26274 2326 -39612 -45430 -32874 -18956 -22612 -47615 -73594 -93907 -64679
10176f4679L5364J0168r435L1652J3133l305J7224L264j7866j4059J4425L0435
$$ -64679 -29315 -19147 -28582 3070 16203 12898 30122 33386 15520 1461 15886 46321
10164D6321L0443k5445o4849j9083O123l1080K5150o293o705k0681K6860l7229
$$ 46321 76764 51319 -13530 -32613 -26490 -57570 -32420 -38713 -45418 -66099 -39239 -76468
10152g6468k2174M0634K220j103j2521k7329k1390N143P3790L2526p360k2459
$$ -76468 -98642 -58008 -55788 -56891 -69412 -96741 -118131 -112988 -39198 -6672 -14032 -36491
10140c6491J1013J5156L6200K8607J5966o7655k7071M4273O207l2583j388q046
$$ -36491 -25478 -10322 25878 54485 70451 2796 -24275 19998 26205 -6378 -7766 -15812
10128a5812J4397K8622j4542l0217j774P80K0621r972K3192N9388l8253m2666
$$ -15812 -1415 27207 12665 -17552 -19326 -18546 2075 -7897 15295 74683 36430 -6236
10116f236j9341l1933R348M295K6953J1065j5756J3389k5406j452K5545K3480
$$ -6236 -25577 -57510 -48162 -43867 -16914 -5849 -21605 -8216 -33622 -35074 -9529 13951
10104A3951j8193J0827Q750m6848k4161j4009J7440O808K2759K2355K3537J9178
$$ 13951 -4242 6585 15335 -31513 -55674 -69683 -52243 -45435 -22676 -321 23216 42394
10092D2394M7763n1082m9025j7480k1553J7999J1565m2093n566J3800j9548j6424
$$ 42394 90157 39075 -9950 -27430 -48983 -30984 -19419 -61512 -67078 -53278 -72826 -89250
10080h9250L7565O5281J7782P93J2303J6629k9768k9984q3376L8383J00223M491
$$ -89250 -51685 13596 31378 32171 44474 61103 31335 1351 -82025 -43642 56581 61072
10068F1072n2884n4099j3227L3841J5419r43k0396J3881L6647L6845l3861K3659
$$ 61072 8188 -45911 -59138 -25297 -9878 -10821 -31217 -17336 19311 56156 22295 45954
10056D5954j5941m2972l0756L5933r612j0874j4085k550L0656O5710R786n5230
$$ 45954 30013 -12959 -43715 -7782 -17394 -28268 -42353 -44903 -14247 51463 61249 6019
10044F019n5250J9490M5592N696k1316K6679k5514m2394M0347J0315J2929l9828
$$ 6019 -49231 -29741 15851 21547 231 26910 1396 -40998 -651 9664 22593 -17235
10032a7235m6993m6792k3194L2475J9810M3725M7430l1819J0171k315o2353l433
$$ -17235 -64228 -111020 -134214 -101739 -81929 -38204 9226 -22593 -12422 -14737 -77090 -80523
10020h0523n271K6452O4247k4792j08443K494O1900j9925k7952j4397K0781M8728
$$ -80523 -85794 -59342 4905 -19887 -128330 -125836 -63936 -83861 -111813 -126210 -105429 -56701
10008e6701J0909r32r67j3146J633J389n9738n7400K7881M9518J8448k0863j172
$$ -56701 -45792 -46724 -47691 -60837 -59204 -57815 -117553 -174953 -147072 -97554 -79106 -99969 -101141
9995a01141L7088O674k0756K1484P279j3269N2575J7008j3188L4064J7981J5744
$$ -101141 -64053 -57379 -78135 -56651 -49372 -62641 -10066 6942 -6246 27818 45799 61543
9983F1543O789o0043m4054j9004N3211J0077J4260Q575k3703j4048r565R694P985
$$ 61543 68332 8289 -35765 -54769 -1558 8519 22779 31354 7651 -6397 -15962 -6268 1717
9970A717L979l3258j9939M9583K7315m550K429O401k0483n8820L8840J648l4284
$$ 1717 5696 -27562 -47501 2082 29397 24847 27276 33677 13194 -45626 -6786 -5138 -39422
9957c9422k8687j5356K7952L1201J6081L2196j0871l8187k3476K1197R894J0107
$$ -39422 -68109 -83465 -55513 -24312 -8231 23965 13094 -25093 -48569 -27372 -17478 -7371
9945g371J9790J6785j7081k2986k9209k4377n805k490M1117j0704k6823M4086
$$ -7371 12419 29204 12123 -10863 -40072 -64449 -70254 -72744 -31627 -42331 -69154 -25068
9933b5068M2828K501N5329j6698N658J5985k1370k1991l690j4621j3559k7238
$$ -25068 17760 20261 75590 58892 64550 80535 59165 37174 33484 18863 5304 -21934
9921b1934k4364l8836K8241K5952J7522l8512J0478L5765K6112L463j7735k7933
$$ -21934 -46298 -85134 -56893 -30941 -13419 -51931 -41453 -5688 20424 23887 6152 -21781
9909b1781j0721K7949j0251K9324R310K1608j8490l1243j1337k7493J2921k3840
$$ -21781 -32502 -4553 -14804 14520 23830 45438 26948 -4295 -15632 -43125 -30204 -54044
9897e4044J7489J1977L378K5466J2065q782O660J0049N801K327k981j1510k8884
$$ -54044 -36555 -24578 -21200 4266 16331 7549 14209 24258 30059 32386 29405 17895 -10989
9884a0989M2372p949j8252r383P996K2796J5268J0324K8764O78n5841l1443m0523
$$ -10989 31383 23434 5182 -4201 3795 26591 41859 52183 80947 81625 25784 -5659 -46182
9871d6182L0094l7926N332R491N5087L8141k9549n0376m1042K8970O0338q827
$$ -46182 -16088 -54014 -48682 -39191 15896 54037 24488 -25888 -66930 -37960 22378 13551
9859A3551P765k864k7507k5773K1552L518n3368k1972L0152p096J2921L369k8718
$$ 13551 21316 18452 -9055 -34828 -13276 -9758 -63126 -85098 -54946 -62042 -49121 -45752 -74470
9846g4470N583M2479J1841O843k6794J4664M6171m1847k2884k3754L6275J3984
$$ -74470 -68887 -26408 -14567 -7724 -34518 -19854 26317 -15530 -38414 -62168 -25893 -11909
9834a1909L063L7325K5406Q136O711L297l5106j1824j9747k9876j1128M0256L7582
$$ -11909 -8846 28479 53885 62021 68732 72029 36923 25099 5352 -24524 -35652 4604 42186
9821D2186k6840l5693R193J2846P117P329m9774k669k0820j232P396L2402K0264
$$ 42186 15346 -20347 -11154 1692 8809 16138 -33636 -36305 -57125 -58357 -50961 -18559 1705
9808A705k0957j2820r994J4900o7186j4089M4391M1716O2036N5373j3868p2977
$$ 1705 -19252 -32072 -42066 -27166 -94352 -108441 -64050 -22334 39702 95075 81207 8230
9796H230k4130J4723o172q233R285J3249J562o5227j1529k0645J8357J6561M5438
$$ 8230 -15900 -1177 -7349 -15582 -6297 6952 8514 -56713 -68242 -88887 -70530 -53969 -8531
9783h531O11j7630k910m92r1963m4272K8273O4608L5439N965K7599P745k6731
$$ -8531 -7920 -25550 -28460 -28952 -120915 -165187 -136914 -72306 -36867 -30902 -3303 4442 -22289
9770b2289J4359N1845K7754o0776j8070N801j5983k103L7261L2812k9279n2658
$$ -22289 -7930 43915 71669 10893 -7177 -1376 -17359 -19462 17799 50611 21332 -31326
9758c1326J3047L409l9746n6599K2871N4335P288K0062n4685n9741N353J282J9344
$$ -31326 -18279 -14870 -54616 -111215 -88344 -34009 -26721 -6659 -61344 -121085 -115732 -114450 -95106
9745i5106k2924j0638J0052O9452L1353J9732n082J9287o076q192k8544O667j0137
$$ -95106 -118030 -128668 -118616 -49164 -17811 1921 -3161 16126 10050 1858 -26686 -20019 -30156
9732c0156j0119q665p87P532J6475J1410j8043j2161K4736N4178R010m430j8914
$$ -30156 -40275 -48940 -49727 -42195 -25720 -14310 -32353 -44514 -19778 34400 43410 38980 20066
9719B0066o5232m7136J6072K2814N2530L7266l5987m2754o342N532J7255M403
$$ 20066 -45166 -92302 -76230 -53416 -886 36380 393 -42361 -48703 -43171 -25916 -21513
9707b1513p473j4932R00K0660P2419m8395n4763o620O4174L0328J669J6465l0429
$$ -21513 -28986 -43918 -43018 -22358 50061 1666 -53097 -59717 4457 34785 36454 52919 22490
9694B2490l7472l9185J111P3554K5686k5946J5120n073m1917j09418Q808Q2488
$$ 22490 -14982 -54167 -53056 20498 46184 20238 35358 30285 -11632 -121050 -112242 -29754
9682b9754J5037K65j2732M738Q306m025k0043K119K5271j8899q91m1310K393R7056
$$ -29754 -14717 -14452 -27184 -22446 -14140 -18165 -38208 -36089 -10818 -29717 -30608 -71918 -69525 27531
9668B7531J281k5061k1926o266L4591j9419r730l4669j9701p569R476K0255N9955
$$ 27531 28812 3751 -18175 -24441 10150 -9269 -18999 -53668 -73369 -80938 -71462 -51207 8748
9655H748K1850l5670j2267m5386O7468N8140m6146j0845R7683n306q4057j1541
$$ 8748 30598 -5072 -17339 -62725 4743 62883 16737 5892 103575 98269 14212 2671
9643B671p372o185n1111J9052N0824J8162l791O759k18m4869p66N7141J8256K5989
$$ 2671 -4701 -10886 -61997 -42945 7879 26041 22250 29009 28791 -16078 -16844 40297 58553 84542
9629H4542l6802K0524n3395p2952j6589J4329J2379l3395N007O1030J7462J3702
$$ 84542 47740 68264 14869 -58083 -74672 -60343 -47964 -81359 -76352 -15322 2140 15842
9617A5842o542P5929j0488m9258m0847J1028J9630K9883N7393m5195r0707l7661
$$ 15842 9300 85229 74741 25483 -15364 -4336 15294 45177 102570 57375 -33332 -70993
9605g0993L0684K4764P544Q333L5643o5482n871j9556K4741L8670n2290P09K0175
$$ -70993 -40309 -15545 -8001 332 35975 -29507 -35378 -54934 -30193 8477 -43813 -43104 -22929
9592b2929N3552L1269m5601j0460K692k8214L717K1445j4034q1552m3897K4504
$$ -22929 30623 61892 16291 5831 8523 -19691 -15974 5471 -8563 -90115 -134012 -109508
9580a09508M1954O961K2155l0221K0626M494o461M012Q383L855N9681k4812l676
$$ -109508 -67554 -60593 -38438 -68659 -48033 -43539 -50000 -45988 -37605 -33750 25931 1119 -2557
9567b557L2237J0668j6537L6012O7788j93m6862n5192k9914N428J4919l6876j8519
$$ -2557 29680 40348 23811 59823 127611 127418 80556 25364 -4550 878 15797 -21079 -39598
9554c9598k3059j2690L6605j0812l716R576M2750M2087N1801M0603q4875m8066
$$ -39598 -62657 -75347 -38742 -49554 -53270 -43694 -944 41143 92944 133547 48672 606
9542F06J0558k8762J5634l5734l964O7571L1887m363M1674J7081l3826O77k086
$$ 606 11164 -17598 -1964 -37698 -41662 25909 57796 53433 95107 112188 78362 79039 76953
9529G6953j4115K6065j5650m3767j3532J0997l4250M460K4447j0132R686p1595
$$ 76953 62838 88903 73253 29486 15954 26951 -7299 -2839 21608 11476 21162 -50433
9517e0433k7172M3701L2462O6773L4107k9664l2985j4728M1302J4141l720J4198
$$ -50433 -77605 -33904 -1442 65331 99438 69774 36789 22061 63363 77504 73784 87982
9505H7982l3238j22J9744o932O165j5200K572j9851k8360k7618N3447N8541j0239
$$ 87982 54744 54622 74366 67434 73599 58399 60971 41120 12760 -14858 38589 97130 86891
9492H6891P167J1314O891p471Q202L1670k5362m6711O239j2057m712L6083j9895
$$ 86891 94058 105372 112263 104792 112994 144664 119302 72591 78830 66773 62061 98144 78249
9479G8249J517M6315j34K3853m6732o1371q553L4496K3669l459N750j1837j4679
$$ 78249 79766 126081 125947 149800 103068 41697 33144 67640 91309 87850 93600 81763 67084
9466F7084L7275L5203k093l6665J1294l682k0314J6582m866l879J2714o411j7805
$$ 67084 104359 139562 137469 100804 112098 108416 88102 104684 99818 95939 108653 102242 84437
9453H4437J3073M9548j6567j1410k1762j1996L6006k3483j6620j9491J1368j2837
$$ 84437 97510 147058 130491 119081 97319 85323 121329 97846 81226 61735 73103 60266
9441F0266M9960M8127n8370o6693N231N909j2589l0248L6490K5737J4145l2515
$$ 60266 110226 158353 99983 33290 38521 44430 31841 1593 38083 63820 77965 45450
9429D5450m9243M408N6663j0089P64N7360l422k0744o6856l9007j1964N4878M9442
$$ 45450 -3793 615 57278 47189 47953 105313 101891 81147 14291 -24716 -36680 18198 67640
9416F7640J777k6870m1276N859K6108L4310M5109L8505J054j5851l2186n4036
$$ 67640 69417 42547 1271 7130 33238 67548 112657 151162 152216 136365 104179 50143
9404E0143j9495O1421m556m3141L2677j6288m8773K8860J6920Q325J8523M8142
$$ 50143 30648 92069 87513 44372 77049 60761 11988 40848 57768 66093 84616 132758
9392A32758Q330J6737j5854N553Q721N3749k200q871o7454k6658k7916k500K4656
$$ 132758 141088 157825 141971 147524 156245 209994 207794 198923 131469 104811 76895 74395 99051
9379I9051N9005L1879q7567l6361o11L3013K0371j8662m7877L5671L8004q101
$$ 99051 158056 189935 102368 66007 65396 98409 118780 100118 52241 87912 125916 117815
9367A17815k4734j9942J7923k3988j2596M7612J4794K5248k9174n112O1933Q1699
$$ 117815 93081 73139 91062 67074 54478 102090 116884 142132 112958 107846 169779 251478
9355B51478j6374k6611j4596k5228n930K0653K5003k0113J0785J0527j0392K9510
$$ 251478 235104 208493 193897 168669 162739 183392 208395 188282 199067 209594 199202 228712
9343B28712j6284l6824J3967N508j3590M6256K3869L2527j7272l3202j5833M1971
$$ 228712 212428 175604 189571 195079 181489 227745 251614 284141 266869 233667 217834 259805
9331B59805L2303R701o806k2602m5720l7028j3074O349J3727L2428K8198j0368
$$ 259805 292108 301809 295003 272401 226681 189653 176579 182928 196655 229083 257281 246913
9319B46913k3892K6662j8409k7843L1483P7276M300n2281l9424J8609L9161k152
$$ 246913 223021 249683 231274 203431 234914 312190 316490 264209 224785 243394 282555 280403
9307B80403m1890k4139M3280k3296l0324J3877K1390J2520J8784q33L6393N4430
$$ 280403 238513 214374 257654 234358 204034 217911 239301 251821 270605 269772 306165 360595
9295C60595J0499l4507j2780l4483k2864j7504K1017L6572j3119k7936j7283K825
$$ 360595 371094 336587 323807 289324 266460 248956 269973 306545 293426 265490 248207 251032
9283B51032j1576K1616K2327j8370J7997O8297j2663r933J3632m2146n5197o8134
$$ 251032 239456 261072 283399 265029 283026 351323 338660 328727 342359 300213 245016 176882
9271A76882J4448N5143L5713Q635K1707M6117J1466N1561k0926j9446M7201L5459
$$ 176882 191330 246473 282186 290821 312528 358645 370111 421672 400746 381300 428501 463960
9259D63960J432j2320J0877r269K6884j5137R436M7586J8395j2230P504L0588
$$ 463960 465392 453072 463949 454680 481564 466427 475863 523449 541844 529614 537118 567706
9247E67706o319J7897L165p777o5107J4945L2893m5434L0040N514M923L2635q785
$$ 567706 561387 579284 582449 574672 509565 524510 557403 511969 542009 547523 552446 585081 576296
9234E76296l8946O5172N9381k4592j7345k6569j8355M638k1302N8207K8883J1975
$$ 576296 537350 602522 661903 637311 619966 593397 575042 579680 558378 616585 645468 657443
9222F57443Q196J8805L1703K4941K2192m425L1256M9142L1764l3456r3144k0822
$$ 657443 665639 684444 716147 741088 763280 758855 790111 839253 871017 837561 744417 723595
9210G23595L2761K1065J3454N3240L2808j3402r525n7308L0225O4496M2660j8169
$$ 723595 756356 777421 790875 844115 876923 863521 853996 796688 826913 891409 934069 915900
9198I15900L3637j7472J7034J7838O1102j1539o0796n416K7690M2414j573M2620
$$ 915900 949537 932065 949099 966937 1028039 1016500 955704 950288 977978 1020392 1018819 1061439
9186A061439N228R878J9860L7231N6978J3690J1330r1M5676K9772J092k009K0977
$$ 1061439 1066667 1076545 1096405 1133636 1190614 1204304 1215634 1215543 1261219 1290991 1292083 1290074 1311051
9173A311051r220M5777M8372o70l7450p481L5025M098J1534K709M5313O0639K5313
$$ 1311051 1301831 1347608 1395980 1395310 1357860 1350379 1385404 1389502 1401036 1403745 1449058 1509697 1535010
9160A535010K4394J6638R136L3470J9177M7198r409j4495L954m8314m1543q215
$$ 1535010 1559404 1576042 1585178 1618648 1637825 1685023 1675614 1661119 1665073 1616759 1575216 1567001
9148A567001K605J5421N9900L750j3943L076j1244K3585r00N557N5053J5788j2669
$$ 1567001 1569606 1585027 1644927 1648677 1634734 1637810 1626566 1650151 1649251 1654808 1709861 1725649 1712980
9135A712980k198P4112l316L5212l8705K2086J5445m6759l4674n3955J3990M0788
$$ 1712980 1710782 1784894 1781578 1816790 1778085 1800171 1815616 1768857 1734183 1680228 1694218 1735006
9123A735006L8455O812o9868j9697J5479R667j6843n3452o275k2889p942J0239
$$ 1735006 1773461 1780273 1710405 1690708 1706187 1715854 1699011 1645559 1639284 1616395 1608453 1618692
9111A618692k5659k7842K3923j2414j6316K2061N3508j9440o1617l7331n6485
$$ 1618692 1593033 1565191 1589114 1576700 1560384 1582445 1635953 1616513 1554896 1517565 1461080
9100A461080j352j9635o3551k7038J871J7379N7698Q605k7171k8108k7050j6285
$$ 1461080 1459728 1440093 1376542 1349504 1351375 1368754 1426452 1435057 1407886 1379778 1352728 1336443
9088A336443K1283o2615m2643k8531J1739K126P653j133k6331n5591n1257k1581
$$ 1336443 1357726 1295111 1252468 1223937 1235676 1237802 1245455 1244322 1217991 1162400 1111143 1089562
9076A089562L5085N385M4139k1515p3341J7041j1760L2197l3345k4890K0524J0441
$$ 1089562 1124647 1130032 1174171 1152656 1079315 1096356 1084596 1116793 1083448 1058558 1079082 1089523
9064A089523l7335m8728m0560q672J185M859n2582j9051K1033J4002O9820J6318
$$ 1089523 1052188 1003460 962900 954228 955413 960272 907690 888639 909672 923674 993494 1009812
9052A009812m1875l9165l0465p1047k2089L816m6563J556K1621j1339k7102k3765
$$ 1009812 967937 928772 898307 827260 805171 808987 762424 763980 785601 774262 747160 723395
9040G23395P8389L8287l501q4917r6376k8893O5406J9817L9978o683n2369m4634
$$ 723395 801784 840071 836570 751653 655277 626384 691790 711607 751585 744902 692533 647899
9028F47899p2034O044j2435m9132l4282Q697M911J8447M7921K7134L5767k4350
$$ 647899 575865 581909 569474 520342 486060 494757 499668 518115 566036 593170 628937 604587
9016F04587l2830m256l1557n7590J7962L2558j0323k2886k5705l9871n999K9806
$$ 604587 571757 567501 535944 478354 496316 528874 518551 495665 469960 430089 424090 453896
9004D53896R83k0677k132k5318j1201K8748K39Q427K9170m8736L8919r790J59
$$ 453896 454879 434202 432070 406752 395551 424299 424538 432965 462135 413399 452318 442528 442687
8991D42687J2150K7176P3978k84m8713r4813P363P467K051q805J186m6201l7307
$$ 442687 454837 482013 555991 555707 506994 412181 419544 427011 429062 420257 421443 375242 337935
8978C37935k151l0631l307N0090j3667k8671j90K6317M7806m1468k2585K8517
$$ 337935 335784 305153 301846 351936 338269 309598 309408 335725 383531 342063 319478 347995
8966C47995n755k5313K447k0507K5688n126q818K2597L8118m433L068k0441n1146
$$ 347995 342240 316927 319374 298867 324555 319429 310611 333208 371326 366893 369961 349520 298374
8953B98374J7524J8586k3937l2894l5426m088L7856K4243K8298n4925q1860j6609
$$ 298374 315898 334484 310547 277653 242227 238139 275995 300238 328536 273611 191751 175142
8941A75142K0341M8442j54j7669r122Q17M9319k0414J922j7418J8612l388R147
$$ 175142 195483 243925 243771 226102 216980 217797 267116 246702 248624 231206 249818 246430 255577
8928B55577L548l1335L055R931J3474P888l7247m2557L948N2761m1789m7011j1037
$$ 255577 259125 227790 230845 240776 254250 262138 224891 182334 186282 239043 197254 150243 139206
8915A39206P04J6102N1611m5957L175N420k8115r949M5561L4823L3649j3356m1129
$$ 139206 139910 156012 207623 161666 164841 170261 142146 132197 177758 212581 246230 232874 191745
8902A91745k0197O759K4187L8371M292p6645l0093j2565P044J8151J9143l076
$$ 191745 171548 178307 202494 240865 245157 168512 138419 125854 132898 151049 170192 167116
8890A67116l0813m9179j4042L830j120k880L3617K4073j9966Q048J9815l7296
$$ 167116 136303 87124 73082 76912 75792 72912 106529 130602 110636 118684 138499 101203
8878A01203o3336j7882N2368O0559l4898M702j0390k592R266M1731K7604N4242
$$ 101203 37867 19985 72353 132912 98014 102716 92326 89734 99000 140731 168335 222577
8866B22577j8219j6922n1335k5589J2686m1119K8571M1237l8785j7474k7669k4744
$$ 222577 204358 187436 136101 110512 123198 82079 110650 151887 113102 95628 67959 43215
8854D3215K9039M4515J2042r555o579J6876J1366k7470K386m279K4159M5482M4574
$$ 43215 72254 116769 128811 119256 112677 129553 140919 113449 115835 111556 135715 181197 225771
8841B25771R206l9455O298M042m8618J8439M1639p3286k3547N2650r938j8149
$$ 225771 234977 195522 201820 205862 157244 175683 217322 144036 120489 173139 163201 145052
8829A45052L607p371m206N03K4053n3501k2036J8543J0371k0835l3939J8434Q015
$$ 145052 148659 141288 137082 137585 161638 108137 86101 104644 115015 94180 60241 78675 86690
8816H6690J2974P840K9845j685j2203M3494l7557r5462J4670M2257o63L3681K8391
$$ 86690 99664 107504 137349 135664 123461 166955 129398 33936 48606 90863 90200 123881 152272
8803A52272j0578J9204M6183l2884L0752P4418L5320K6617M8058m3976o6680m4662
$$ 152272 141694 160898 207081 174197 204949 279367 314687 341304 389362 345386 278706 234044
8791B34044n5743n2088L0971Q6210N8661m1039j7610q804K8505R79o4418j05753
$$ 234044 178301 126213 157184 243394 302055 261016 243406 234602 263107 264086 199668 93915
8779I3915K5258M1682M5475L0147m7714l1301j2042k3673q423K455j9278j851
$$ 93915 119173 160855 206330 236477 188763 157462 145420 121747 113324 115779 96501 94650
8767I4650l2040n7728P07O6722M1698K8077J2608J9372j8025p5968j4726r870
$$ 94650 62610 4882 5589 72311 114009 142086 154694 174066 156041 80073 65347 55477
8755E5477J6322M7225J15987Q8168L8653j6571l8076p7167l6758j0611M3903m0422
$$ 55477 71799 119024 235011 323179 361832 345261 307185 230018 193260 182649 226552 186130
8743A86130n9179p1442k4264L6577m144M1418j1591J1319P705l3536m9683p532
$$ 186130 126951 55509 31245 67822 63678 105096 93505 104824 112529 78993 29310 21778
8731B1778K7661k477N838j7033R453K6613L3198K3978m1630K4007L2832p403l511
$$ 21778 49439 46962 52800 35767 45220 71833 105031 129009 87379 111386 144218 136815 133304
8718A33304m497n08l7677J5886j1885J5691K0562j4572k4028l6200m561J9838
$$ 133304 128807 128299 90622 106508 94623 110314 130876 116304 92276 56076 51515 71353
8706G1353m3460j817L5983M9646j1003k1525J925L4087M2563J9759K0039L1585
$$ 71353 27893 26076 62059 111705 100702 79177 81102 115189 157752 177511 197550 229135
8694B29135L4188j4352q1168n562l203k8838M853L0251J8351K47K5732m1502o5402
$$ 229135 263323 248971 167803 162241 159038 130200 135053 165304 183655 183902 209634 168132 102730
8681A02730k1296n637L741Q4092N859j1539k289J9872J9554j0191o041o0769j7836
$$ 102730 81434 75797 79538 163630 169489 157950 155661 175533 195087 184896 178855 118086 100250
8668A00250L2616L4537M9543L3361L2462j2558k0213j9201K5857O7069Q2302m8524
$$ 100250 132866 167403 216946 250307 282769 270211 249998 230797 256654 323723 406025 357501
8656C57501n7076l3377K118L4490P028l3152K3787P8130M4614j4308N333O0046
$$ 357501 300425 267048 269166 303656 310684 277532 301319 379449 424063 409755 415088 475134
8644D75134l160M2183O0341K3608L9864P1262K7530P9163N5262J8464M6549K6692
$$ 475134 471974 514157 574498 598106 637970 709232 736762 815925 871187 889651 936200 962892
8632I62892j6529o6920r1103j9745J1117o4168p8548o9158j7305L360n3142J4700
$$ 962892 946363 879443 788340 768595 779712 715544 636996 567838 550533 553893 500751 515451
8620E15451L0758J6744l9053j5779R873K1056o124n9387K9361J9682R034K8384
$$ 515451 546209 562953 523900 508121 517994 539050 532926 473539 502900 522582 531616 560000
8608E60000K6362J4631P7606K8427L2497L4248m216L3515Q8980M3369L1853P4202
$$ 560000 586362 600993 678599 707026 739523 773771 769555 803070 892050 935419 967272 1041474
8596A041474L5950J8414N6012K8360R1156J20666J40223J54309J10584m7004j52255
$$ 1041474 1077424 1095838 1151850 1180210 1271366 1392032 1532255 1686564 1797148 1750144 1597889
8585A597889j80482j00368p5788p7154j22723j45403j15714k2238m2543k9409
$$ 1597889 1417407 1317039 1241251 1164097 1041374 895971 780257 758019 715476 686067
8575F86067p4958q8660K4770M4225j7854j1450k5417j2332N152k2702N2540L3460
$$ 686067 611109 522449 547219 591444 573590 562140 536723 524391 529543 506841 559381 592841
8563E92841N5424Q8768n160J1194O0809J25775J49292K63346M09428P11901J125622
$$ 592841 648265 737033 731873 743067 803876 929651 1078943 1342289 1751717 2463618 3589240
8552C589240J574955J574389N13212p70355j557644j301722q50468n19171k48840
$$ 3589240 5164195 6738584 7251796 6481441 4923797 3622075 2771607 2252436 2003596
8543B003596j81444j29241j61099j43668j62392j53527r1582p3738l1519o7522
$$ 2003596 1822152 1692911 1531812 1388144 1225752 1072225 980643 906905 875386 807864
8533H07864r2321l8288m4767k8580J760m519j8771K714J2997m127q831L5297M7636
$$ 807864 715543 677255 632488 603908 605668 601149 582378 585092 598089 593962 585131 620428 668064
8520F68064N9659J43815J68524K44688M63060P49176J232484J548123J299151
$$ 668064 727723 871538 1040062 1284750 1747810 2496986 3729470 5277593 6576744
8511F576744K37827j049535j635828j193232p19092m37277l49622k95071j74810
$$ 6576744 6814571 5765036 4129208 2935976 2216884 1779607 1429985 1134914 960104
8502I60104n3040j55136q1361m0638p4794q4147J4230N4509m7977r6226l0079
$$ 960104 907064 751928 670567 629929 555135 470988 485218 539727 491750 395524 365445
8491C65445L3129J3668m1560o7186R279M2944j800l9430m2899l7228r153J4626
$$ 365445 398574 412242 370682 303496 312775 355719 353919 314489 271590 234362 225209 239835
8479B39835J6806k546M831n3086m0917L3306J2526j684j3287l4370j9067K1522
$$ 239835 256641 254095 258926 205840 164923 198229 210755 209071 195784 161414 142347 163869
8467A63869L2500J3685l996R259l2033k4530M018q23O554j1738Q648l2605j634
$$ 163869 196369 210054 206058 215317 183284 158754 162772 161949 168503 156765 165413 132808 131174
8454A31174o6694m3624K1257j6987M1836Q0024k8047M5586R691k96O5688o055
$$ 131174 64480 20856 42113 25126 66962 146986 118939 164525 174216 173920 239608 233553
8442B33553k3324J7171l0229j8394q521J5146j2028K284k4207j0671j3958J6405
$$ 233553 210229 227400 197171 178777 170256 185402 173374 175658 151451 140780 126822 143227
8430A43227L4474l6845m4630j2386m7672j0842R586K6838K2567K6546n957K1401
$$ 143227 177701 140856 96226 83840 36168 25326 34912 61750 84317 110863 104906 126307
8418A26307M2154m0807j7374m2989l403L4686m8503o4788J4319J2781j7979n226
$$ 126307 168461 127654 110280 67291 63888 98574 50071 -14717 -398 12383 -5596 -10822
8406a0822O20l3965j8846J9780M8028J1868K82M4273N6123Q194K849J7638J8170
$$ -10822 -10202 -44167 -63013 -43233 4795 16663 16945 61218 117341 125535 128384 146022 164192
8393A64192K7911J3426p3876m4108N295k4488l383p5736j5299m0638m1049J8230
$$ 164192 192103 205529 131653 87545 92840 68352 64969 -10767 -26066 -66704 -107753 -89523
8381h9523N0846L1320K0332J4507k3381p588N766K8178J7133m0663N527J5740
$$ -89523 -38677 -7357 12975 27482 4101 -3487 2279 30457 47590 6927 12454 28194
8369B8194j1842m263o382K3483L9819J5577K7187K4128N052n1484l4906k347N2952
$$ 28194 16352 12089 5707 29190 69009 84586 111773 135901 140953 89469 54563 52216 105168
8356A05168K5602Q842M482k0717j5205j2675j5854m5047k2599K144k225l771K7943
$$ 105168 130770 139612 144094 123377 108172 95497 79643 34596 11997 14141 11916 8145 36088
8343C6088m3128q340K6832m5189l587k7599n2138L6162M9543L7594M9821L8824
$$ 36088 -7040 -15380 11452 -33737 -37324 -64923 -117061 -80899 -31356 6238 56059 94883
8331I4883O858J3430o4383n1081j1353K6359N5473Q2141Q60l8623l6651O0659
$$ 94883 101741 115171 50788 -293 -11646 14713 70186 152327 153187 114564 77913 138572
8319A38572N9296K9751l6360j0319k8149q9500j1660j6392k7154k8161K092J2640
$$ 138572 197868 227619 191259 180940 152791 63291 51631 35239 8085 -20076 -17984 -5344
8307e344J8424M1128j1323J4836R746j5541j7401L7828r017k5789K439J5720L3376
$$ -5344 13080 54208 42885 57721 67467 51926 34525 72353 63336 37547 39986 55706 89082
8294H9082L6290J0798j640K613K7403J2060L230J0041q578k4346K9517M8398M6076
$$ 89082 125372 136170 134530 137143 164546 176606 179836 189877 181299 156953 186470 234868 280944
8281B80944N8667M2978K7729l9787p2861l1862K6629P3245N8579K497J6690N7608
$$ 280944 339611 382589 410318 370531 297670 265808 292437 365682 424261 426758 443448 501056
8269E01056L2518k6805j5252M0632J2040N0380K2940O3857N6748R619N5649J25592
$$ 501056 533574 506769 491517 532149 544189 594569 617509 681366 738114 747733 803382 928974
8257I28974J40586Q5291J29269J12739J50575J94883K18930K41248L33416M38641
$$ 928974 1069560 1154851 1284120 1396859 1547434 1742317 1961247 2202495 2535911 2974552
8247B974552M46302N31780O02738Q23199J075930J567189K291172L322667N044957
$$ 2974552 3420854 3952634 4555372 5378571 6454501 8021690 10312862 13635529 18680486
8238A8680486P731115J1427279J4913306J4575745P241271l990035j3035911j4404897
$$ 18680486 26411601 37838880 52752186 67327931 74569202 70579167 57543256 43138359
8230D3138359j1169397p841663n400182l779300k674067j874464j395988j039638
$$ 43138359 31968962 24127299 18727117 14947817 12273750 10399286 9003298 7963660
8222G963660p32119n46819l89523k87297k62689k85853k17259j33385j04127q0866
$$ 7963660 7231541 6684722 6295199 6007902 5745213 5459360 5242101 5108716 5004589 4923723
8212D923723j7188l8357L9613J34250J67245J96787K44987L72901N54122P33984
$$ 4923723 4906535 4868178 4907791 5042041 5209286 5406073 5651060 6023961 6578083 7312067
8202G312067P87367Q76316J052737J388661J963346K815242M089487O043711R136667
$$ 7312067 8099434 8975750 10028487 11417148 13380494 16195736 20285223 26328934 35465601
8193C5465601J4238087K1872205L0273159L1704084J7558635o030947k6713560
$$ 35465601 49703688 71575893 101849052 133553136 151111771 145080824 118367264
8186A18367264l0523860k3408536j6236856j1114303p718941n473626l983547
$$ 118367264 87843404 64434868 48198012 37083709 29364768 23891142 19907595
8179A9907595k922070k142438j565928j133706r18990p56133p06646o39152o36751
$$ 19907595 16985525 14843087 13277159 12143453 11224463 10468330 9761684 9122532 8485781
8170H485781n28423l32734k74440k52394k28284k03717j72756j29427j87461r4991
$$ 8485781 7957358 7624624 7350184 7097790 6869506 6665789 6493033 6363606 6176145 6081154
8160F081154M5984J95661K38675L21565L78777M45997N74516Q58778J318988J869552
$$ 6081154 6127138 6322799 6561474 6883039 7261816 7707813 8282329 9141107 10460095 12329647
8150A2329647K729245M174202O462706R689145J3356092J4502329R370174r27794
$$ 12329647 15058892 19233094 25695800 35384945 48741037 63243366 72613540 71685746
8142G1685746j0859951j4493804j1965097q460793n855153m106150k928743k095012
$$ 71685746 60825795 46331991 34366894 25906101 20050948 15944798 13016055 10921043
8134A0921043j536803j141879q52325o50092m99485m28699l73006l78535l55984
$$ 10921043 9384240 8242361 7390036 6739944 6240459 5811760 5438754 5060219 4704235
8125D704235l04361k70274k35301j89871j37289j21823r0824j22230j78028j22599
$$ 4704235 4399874 4129600 3894299 3704428 3567139 3445316 3354492 3232262 3054234 2931635
8115B931635j00248r2361j63888j32398j07177j27102q9507p8938n6794l6803
$$ 2931635 2831387 2739026 2575138 2442740 2335563 2208461 2118954 2040016 1983222 1946419
8105A946419r5089l9950k3409q9398j03382k597j6684n7492q9191l1014j9499
$$ 1946419 1851330 1811380 1787971 1698573 1595191 1592594 1575910 1518418 1429227 1398213 1378714
8094A378714m4602J4544k4855p1773r904M319m3533l9222p1085m8724j595P0966
$$ 1378714 1334112 1348656 1323801 1252028 1242124 1246443 1202910 1163688 1092603 1043879 1042284 1113250
8082A113250j4392k0872n0536m8157P889o4866l3090J3334K060m0567N778k2770
$$ 1113250 1098858 1077986 1027450 979293 987182 922316 889226 902560 904620 864053 869831 847061
8070H47061m2807l477l2085J4985J4681K6281j6109m8888m6110m2726J2307J5706
$$ 847061 804254 800777 768692 783677 798358 824639 808530 759642 713532 670806 683113 698819
8058F98819j4125q148j0089N485K5460m1973j6234r828N233k7134j8713M0499
$$ 698819 684694 676546 666457 671942 697402 655429 639195 629367 634600 607466 588753 629252
8046F29252L8693k2011o0872j5508L266l886l0928j0712K0788k1152k1368K7404
$$ 629252 667945 645934 585062 569554 572820 568934 538006 527294 548082 526930 505562 532966
8034E32966N2425l2367k9437j3625j9087L2432J8375M2357k201k3382k5230o715
$$ 532966 585391 553024 523587 509962 490875 523307 541682 584039 581838 558456 533226 526511
8022E26511K5717k7391l18k3141Q720O0419O2986O6686L6598M0059J6804l1026
$$ 526511 552228 524837 524519 501378 510098 570517 633503 700189 736787 776846 793650 762624
8010G62624j06849p0535k4882q72m9661q3128P673K2623j7001k137m592J0806
$$ 762624 655775 585240 560358 559486 509825 426697 434370 456993 439992 437855 433263 444069
7998D44069K1569M1150O4868L2302n4525p1959j3018J7460J2502J5630L960j5014
$$ 444069 465638 506788 571656 603958 549433 477474 464456 481916 494418 510048 514008 498994
7986D98994k1736n6666n0737M105L140L3336j2480K3569N3590J6190J6840k7935
$$ 498994 477258 420592 369855 373960 377100 410436 397956 421525 475115 491305 508145 480210
7974D80210R030L3095Q7370M6979J21337J61368J33314J16735N3914n4205j27918
$$ 480210 489240 522335 609705 656684 778021 939389 1072703 1189438 1243352 1189147 1061229
7963A061229j41733j04434o5946p9746o7746q2787n2504m0011j8224L0864J6820
$$ 1061229 919496 815062 749116 669370 601624 518837 466333 426322 408098 438962 455782
7952D55782J2276P118q890l3882J353l984j3105l083j4903k6757K0626J2011n0883
$$ 455782 468058 475176 466286 432404 433757 429773 416668 413585 398682 371925 392551 404562 353679
7939C53679n3681L4228j1798M0267K4954L525o8327J0419P7296j9252P315P7697
$$ 353679 299998 334226 322428 362695 387649 391174 322847 333266 410562 391310 398625 476322
7927D76322p037q952J4917O1656M4832K8135M3718J3532p9988n2928p9266l7534
$$ 476322 469285 460333 475250 536906 581738 609873 653591 667123 587135 534207 454941 417407
7915D17407p598l1803k1715l2900p227j6848m3072l0568k6535L878l9313K5937
$$ 417407 409809 378006 356291 323391 316164 299316 256244 225676 199141 203019 163706 189643
7903A89643L5468K9906q889n282r07j8685m2691J7409L5964Q683l9369l1579L97
$$ 189643 225111 255017 246128 240846 239939 221254 178563 195972 231936 240619 201250 169671 170068
7890A70068K1415j0092J1466L729M1983K9645j9461j9165L0623J6388J519J713
$$ 170068 191483 181391 192857 196586 238569 268214 248753 229588 260211 276599 278118 279831
7878B79831n2903j9105K6135J4196o5305n7291m4834L3519M9847O186o2216m8269
$$ 279831 226928 207823 233958 248154 182849 125558 80724 114243 164090 170276 108060 59791
7866E9791M734L1245N5818k617M733O920K8713J7868K0397n5432n1515j697n4603
$$ 59791 64525 95770 151588 148971 153704 160624 189337 207205 227602 172170 120655 118958 64355
7853F4355l8030M3124O6225Q9674l0176k4723l5691Q43j1287O254L9885M0960
$$ 64355 26325 69449 135674 225348 195172 170449 134758 135601 124314 130568 170453 211413
7841B11413O9564K8064k6925j9043l6517m1601K3520n1897K7247Q1295Q7664J38253
$$ 211413 280977 309041 282116 263073 226556 184955 208475 156578 183825 265120 352784 491037
7829D91037Q4806m6411j04239p4175p2176j03223p3507J6524L3859K2891n505
$$ 491037 575843 529432 425193 351018 278842 175619 102112 118636 152495 175386 169881
7818A69881K3767R148p705o619k4102m9716k1132N856N1572L0843J809J493j1633
$$ 169881 193648 202796 195091 188472 164370 114654 93522 99378 150950 181793 183602 185095 173462
7805A73462r102R196j2639n9531l1815M6427K1057L774k585m4992j578k965Q734
$$ 173462 164360 173556 160917 101386 69571 115998 137055 140829 138244 93252 91674 88709 97443
7792I7443O8713J4067P3982K7835O8730J28463J58332J40479K5533m9407j05659
$$ 97443 166156 180223 254205 282040 350770 479233 637565 778044 803577 754170 648511
7781F48511r1978j02858j05528n1996m8497q4882R571j8182k3907k6957P998P906
$$ 648511 556533 453675 348147 296151 247654 162772 172343 154161 130254 103297 111295 119201
7769A19201l6928J8462M3944J5458j2605l2821Q350J7268n2354o9706l1152M1318
$$ 119201 82273 100735 144679 160137 147532 114711 123061 140329 87975 18269 -12883 28435
7757B8435j5595J7153J0630Q523K3808J9136j6551J4951N9055K1076p996K0419
$$ 28435 12840 29993 40623 49146 72954 92090 75539 90490 149545 170621 162625 183044
7745A83044L5399M4555O7457L6926L1536M1840O2486k5386n3486j22183m6377
$$ 183044 218443 262998 330455 367381 398917 440757 503243 477857 424371 302188 255811
7734B55811l8707m8304k9575J2939j6558j2954l2781K2953M4740L7792q650m6154
$$ 255811 217104 168800 139225 152164 135606 122652 89871 112824 157564 195356 186706 140552
7722A40552n0600m5716l038P825K7385P195q537q226L5797o3249l2686J2011L3052
$$ 140552 89952 44236 41198 49023 76408 83603 75066 66840 102637 39388 6702 18713 51765
7709E1765O1264k5844L166l3823k4504K6067L6542l790O926J3688l916l2372n348
$$ 51765 113029 87185 90351 56528 32024 58091 94633 90843 97769 111457 107541 75169 69821
7696F9821j5960L2390j7829k1782j9506K7279N639j3540J638P3641M807j9189
$$ 69821 53861 86251 68422 46640 27134 54413 60052 46512 48150 121791 126598 107409
7684A07409l8089r181K446k1744j8086j7932j0286N0980J4163L103K9521l0937
$$ 107409 69320 60139 62585 40841 22755 4823 -5463 45517 59680 62783 92304 61367
7672F1367j9320j9126k5408P990J2171J4716K5040M865L5743j8019l6593J858
$$ 61367 42047 22921 -2487 5503 17674 32390 57430 62295 98038 80019 43426 45284
7660D5284k6629l1246L6436r573j6081r564N224K7439l0977L6413N7403k2457
$$ 45284 18655 -12591 23845 14272 -1809 -11373 -6149 21290 -9687 26726 84129 61672
7648F1672o1724l3901N3486N5657k6266m3044M2340K9223K1220j8057j6182k0438
$$ 61672 -52 -33953 19533 75190 48924 5880 48220 77443 98663 80606 64424 43986
7636D3986k58J5999J8809k6775q642r950K2123K8291k5763k6218l6438M1629Q9408
$$ 43986 43728 59727 78536 51761 43119 33169 55292 83583 57820 31602 -4836 36793 126201
7623A26201J9302j6821l0515n7620K2328Q55m2125k3105J4098K1012q984M1843
$$ 126201 145503 128682 98167 40547 62875 63730 21605 -1500 12598 33610 24626 66469
7611F6469N113j375r024L1862K9097j3919j0053p233m1165l6596J5589k7957J7359
$$ 66469 71582 70207 61183 93045 122142 108223 98170 90937 49772 13176 28765 808 18167
7598A8167L2529M9478J1844l2035j9378K207J962k016K6287L186j7971o8296k9356
$$ 18167 50696 100174 112018 79983 60605 62812 64774 62758 89045 92231 74260 5964 -23392
7585b3392l6443J3285M5329M3203j9524K1250j4092k1380p090R749M0360n2739
$$ -23392 -59835 -46550 -1221 41982 22458 43708 29616 8236 1146 10895 51255 -1484
7573a484M021P3450N718j3810O4385M0175l3181l5290j7428l711l5429l0021L1162
$$ -1484 2537 75987 81705 67895 132280 172455 139274 103984 86556 82845 47416 17395 48557
7560D8557l0174k1545K9398J3939M6450M3344l960m3349l9021l2510L8611M713
$$ 48557 18383 -3162 26236 40175 86625 129969 126009 82660 43639 11129 49740 54453
7548E4453j7720r998N7904J3235m3918j3548l9140K61k5357J9645J2833M733K4427
$$ 54453 36733 26735 84639 97874 53956 40408 1268 1529 -23828 -4183 8650 13383 37810
7535C7810L2519l3457k9000k8290L507O328M0631J0435J1767j3985m2991k7348
$$ 37810 70329 36872 7872 -20418 -16911 -10583 30048 40483 52250 38265 -4726 -32074
7523c2074k4361J9910K828K1047K1708K4926q405m3537J8081L2666k6167Q789
$$ -32074 -56435 -36525 -33697 -12650 9058 33984 25579 -17958 123 32789 6622 15411
7511A5411P279n2354j0228L8905M0660k7192m9230o39M0607N0789J4432l0980
$$ 15411 22690 -29664 -39892 -987 39673 12481 -36749 -37388 3219 54008 68440 37460
7499C7460k9236j3242M0146J67m3208m3296J0903O6423K0263R170m5077k6392
$$ 37460 8224 -5018 35128 35295 -7913 -51209 -40306 26117 46380 55550 10473 -15919
7487a5919j7864p897N4689j872L0851l4839k9507l2939j1749j0707J8647J3742
$$ -15919 -33783 -41680 13009 11137 41988 7149 -22358 -55297 -67046 -77753 -59106 -45364
7475d5364J9037M8381K5700l9256l6162L980L9605j1225j7901N2703K7400k7804
$$ -45364 -26327 22054 47754 8498 -27664 -23684 15921 4696 -13205 39498 66898 39094
7463C9094k5194J9953L2588m3466m6369o699L2109J9875l2622M1686k292L4541
$$ 39094 13900 33853 66441 22975 -23394 -30093 2016 21891 -10731 30955 28663 63204
7451F3204L7733L3820k3580k0337n4975k8837M7814K8614m3800n4686o611N1074
$$ 63204 100937 134757 111177 90840 35865 7028 54842 83456 39656 -15030 -21641 29433
7439B9433M0534k5425K9542J5449l3668n0J5033K9987R678j872J6545l5299n9158
$$ 29433 69967 44542 74084 89533 55865 55815 70848 100835 110513 108641 125186 89887 30729
7426C0729k7512M095N7076K2946l3136k2474L915m4802k4603K2792M7463L7235
$$ 30729 3217 7312 64388 87334 54198 31724 35639 -9163 -33766 -10974 36489 73724
7414G3724M5833Q383j9376l0188l3554N292j6969p184l3896M5692J4587n3755
$$ 73724 119557 127940 108564 78376 44822 50114 33145 25961 -7935 37757 52344 -1411
7402a411l5866L7123M4562P0588k4157m5213k134K5184J323m8934o748J2938J1270
$$ -1411 -37277 -154 44408 114996 90839 45626 43492 68676 69999 21065 14317 27255 38525
7389C8525q182N670M0064l5885j9066J2976m5757k6169l677J7873j4078N600o045
$$ 38525 30343 36013 76077 40192 21126 34102 -11655 -37824 -41501 -23628 -37706 -32106 -38151
7376c8151M0687K3220o377j4051L0489k1431O536K2576N8575J9704l5446n5402
$$ -38151 2536 25756 19379 5328 35817 14386 20922 43498 102073 121777 86331 30929
7364C0929J5790m0108M542K9787l733n0790k1117L012N027M5292J2887J3125J7334
$$ 30929 46719 6611 11153 40940 37207 -13583 -34700 -31688 -26661 18631 31518 44643 61977
7351F1977J5962K0461L5768N884k3895q7927j6325J7024j7767m8854o729M2559
$$ 61977 77939 98400 134168 140052 116157 28230 11905 28929 11162 -37692 -44421 -1862
7339a862M1480j4033m306J0298k8564k9534O581k0387M9118L2700k0032J6266
$$ -1862 39618 25585 21279 31577 3013 -26521 -19940 -40327 8791 41491 21459 37725
7327C7725j7012k1288J0366K1946J4857k1894J0727L0331L6545M1347o883m4892
$$ 37725 20713 -575 9791 31737 46594 24700 35427 65758 102303 143650 136767 91875
7315I1875m3866k5791o7346j2716Q5177N2211J7496l5186k5193q030m993J8053
$$ 91875 48009 22218 -45128 -57844 27333 79544 97040 61854 36661 28631 23638 41691
7303D1691L3497Q323J3728J4205k2803n9736m5125j3344K3886q241P441J710k4212
$$ 41691 75188 83511 97239 111444 88641 28905 -16220 -29564 -5678 -13919 -6478 -4768 -28980
7290b8980O853K3182o3110l2622M7921K5492j1699j3209M646J2311L9945N1129
$$ -28980 -22127 1055 -62055 -94677 -46756 -21264 -32963 -46172 -41526 -29215 10730 61859
7278F1859p432l3870J0951L575M6204M0679m1338L1922m4853l7378j6016q477
$$ 61859 54427 20557 31508 35083 81287 121966 80628 112550 67697 30319 14303 5826
7266E826n2561j8085R935M6623J09146J5546k0117l6974k0385o7818j8460k336
$$ 5826 -46735 -64820 -54885 -8262 100884 116430 96313 59339 38954 -28864 -47324 -49660
7254d9660M0114K3779p141Q680O1368K422l7837k6281l2627J212l4825K02L0850
$$ -49660 -9546 14233 7092 15772 77140 79562 41725 15444 -17183 -15971 -50796 -50594 -19744
7241a9744K7698J4032K9917p065k1196K292l3448m9829k5921K0355k7101K7860
$$ -19744 7954 21986 51903 44838 23642 25934 -7514 -57343 -83264 -62909 -90010 -62150
7229f2150M734r417L7006L9549J5755j2424k955J9211r513m031j1171K9693N518
$$ -62150 -57416 -66833 -29827 9722 25477 13053 10098 29309 19796 15765 4594 34287 39805
7216C9805p3178n5035j3333M7149N3286M4084k387j4614l7713J7007N4269M3199
$$ 39805 -33373 -88408 -101741 -54592 -1306 42778 40391 25777 -11936 5071 59340 102539
7204A02539R148j4918l2096l5235q597j011J7173J2185K6529L8642M544o3407
$$ 102539 111687 96769 64673 29438 20841 19830 37003 49188 75717 114359 118903 55496
7192E5496j6181j1602N374k1368O368j1717n0P4304K8262l6637O364j4577m1080
$$ 55496 39315 27713 33087 11719 18087 6370 6320 80624 108886 72249 78613 64036 22956
7179B2956p764J3037L3522J7277k1220k832o3532j9031O3846M6626N0983k3919
$$ 22956 15192 28229 61751 79028 57808 54976 -8556 -27587 36259 82885 133868 109949
7167A09949l1907k3362r359J0015M0150m7455n9141J0087O2780M0038k2336n5161
$$ 109949 78042 54680 45321 55336 95486 48031 -11110 -1023 61757 101795 79459 24298
7155B4298k8760L7785K9348j1775j7692L7200J3274J6710R603K8436j3928m6122
$$ 24298 -4462 33323 62671 50896 33204 70404 83678 100388 109991 138427 124499 78377
7143G8377n7760J1559K437n2280j0488K473K4296P3197J2687l6864m5491j0442
$$ 78377 20617 32176 34613 -17667 -28155 -25682 -1386 71811 84498 47634 2143 -8299
7131h299Q881L4256K7557m8521l0730l672M0883O804J3577l4235n0726L718K8339
$$ -8299 582 34838 62395 13874 -16856 -20528 20355 27159 40736 6501 -44225 -40507 -12168
7118a2168M1339J465J3455l6684p4252J4563j7608l7857J1750P5448J4749j2893
$$ -12168 29171 30636 44091 7407 -66845 -52282 -69890 -107747 -95997 -20549 -5800 -18693
7106a8693L0703j6402l8233K534o180J5480M070j5365J0890q105l606j3020L0076
$$ -18693 12010 -4392 -42625 -40091 -46271 -30791 -26721 -42086 -31196 -39301 -42907 -55927 -25851
7093b5851O836K8039R956J4377J8822l7434m8652O990K7211k5693N689j3466N1412
$$ -25851 -19015 9024 18980 33357 52179 14745 -33907 -26917 294 -25399 -19710 -33176 18236
7080A8236L9613l7335o2627l8346O3429M7129j7241R408j0526Q093j9102J168
$$ 18236 57849 20514 -42113 -80459 -17030 30099 12858 22266 11740 19833 731 1899
7068A899m7010l3783N9391o532Q231n568j5316n635j2050j6684k3277k2635M3590
$$ 1899 -45111 -78894 -19503 -26035 -17804 -23372 -38688 -44323 -56373 -73057 -96334 -118969 -75379
7055g5379J6199k3284N688O1324K5305j0278O476K7382n643k0014j176q709K3932
$$ -75379 -59180 -82464 -76776 -15452 9853 -425 6051 33433 27790 7776 6600 -2109 21823
7042B1823L3177j4396J3245J5104K0678m6927n1189R420K8028J6213N202J4043
$$ 21823 55000 40604 53849 68953 89631 42704 -8485 935 28963 45176 50378 64421
7030F4421j1029l7281l9622m2011J6578j3567L8583J2267J6185P931l6308j4699
$$ 64421 53392 16111 -23511 -65522 -48944 -62511 -23928 -11661 4524 12455 -23853 -38552
7018c8552j3399M6945L687J420O067J7702K4604r172n8616k0299M3952K2958L360
$$ -38552 -51951 -5006 -1319 101 6168 23870 48474 39302 -19314 -39613 4339 27297 30657
7005C0657j1406N526l654j1395j2828L5655k5337j6663j0938m6479Q956K3059
$$ 30657 19251 24777 21123 9728 -3100 32555 7218 -9445 -20383 -66862 -57906 -34847
6993c4847j6584L0541j0769k4135J6645L77K4079J9037k1507J9929RK7168l2694
$$ -34847 -51431 -20890 -31659 -55794 -39149 -38772 -14693 4344 -17163 2766 2775 29943 -2751
6980b751K1277k7433m1148P756n011Q384J6828J7471O2893m155k0050K8173m7551
$$ -2751 18526 -8907 -50055 -42299 -47310 -38926 -22098 -4627 58266 54111 34061 62234 14683
6967A4683l5595L8324j5487k9853j4227m3724k1692L7079L8163o692n766K3725
$$ 14683 -20912 17412 1925 -27928 -42155 -85879 -107571 -70492 -32329 -39021 -44787 -21062
6955b1062K4979L4105L4785o543o1018n0176M1763O3039L0692n2026k5928j4558
$$ -21062 3917 38022 72807 66264 5246 -44930 -3167 59872 90564 38538 12610 -1948
6943a948K3812N1247j1682l6125N3873M473k276m2687k1783M3203R11l7331n8482
$$ -1948 21864 73111 61429 25304 79177 83650 81374 38687 16904 60107 61018 23687 -34795
$$ [...]
##END NTUPLES=NMR SPECTRUM
##END=
