##TITLE=Analysis number 324656
Compound Code rf 01368
Project Code adrs
Chemist Name fudan
##JCAMPDX= 6.0         $$ Bruker NMR JCAMP-DX V2.0
##DATA TYPE= NMR SPECTRUM
##DATA CLASS= NTUPLES
##ORIGIN= Bruker BioSpin GmbH
##OWNER= nmr
$$ XWIN-NMR		Version 3.5
$$ Wed Nov 29 13:03:48 2006 GMT Standard Time (UT+0h)  MAYBRIDGE\nmr@NMR_250MHZ
##.OBSERVE FREQUENCY= 250.131544655141
##.OBSERVE NUCLEUS= ^1H
##.ACQUISITION MODE= SIMULTANEOUS (DQD)
##.ACQUISITION SCHEME= undefined
##.AVERAGES= 16
##.DIGITISER RES= 18
##SPECTROMETER/DATA SYSTEM= dpx250
##.PULSE SEQUENCE= zg30
##.SOLVENT NAME= CDCl3
##.SHIFT REFERENCE= (INTERNAL, CDCl3, 0, 16.522)
##AUDIT TRAIL= $$ (NUMBER, WHEN, WHO, WHERE, WHAT)
$$ ##TITLE= Audit trail, XWIN-NMR		Version 3.5
$$ ##JCAMPDX= 5.01
$$ ##ORIGIN= Bruker BioSpin GmbH
$$ ##OWNER= nmr
$$ C:\u/data/dgb/nmr/ADRS/1440/pdata/1/auditp.txt
$$ ##AUDIT TRAIL=  $$ (NUMBER, WHEN, WHO, WHERE, WHAT)
(   1,<2006-11-29 13:03:19.18 +000>,<MAYBRIDGE\nmr>,<NMR_250MHZ>,
      <created by zg, POWCHK disabled, PULCHK disabled
       configuration hash MD5:
       49 4B E0 1D 92 C2 6B 37 9F E6 65 BC 52 41 86 1D
       data hash MD5: 64K
       73 97 DB E5 CE 2A B9 29 BD F9 DA 30 5F 17 4E F3>)
(   2,<2006-11-29 13:03:36.64 +000>,<MAYBRIDGE\nmr>,<NMR_250MHZ>,
      <Start of raw data processing
       ef LB = 0.3 FT_mod = 6 PKNL = 1 SI = 32K 
       data hash MD5: 32K
       60 17 D8 0E EA 18 C8 1B 13 47 9F 12 A5 52 EF DC>)
(   3,<2006-11-29 13:03:38.35 +000>,<MAYBRIDGE\nmr>,<NMR_250MHZ>,
      <apk 
       data hash MD5: 32K
       69 B7 8A D0 AA F3 4B BF 88 63 9C 0C AC F7 97 86>)
(   4,<2006-11-29 13:03:39.18 +000>,<MAYBRIDGE\nmr>,<NMR_250MHZ>,
      <abs ABSG = 5 
       data hash MD5: 32K
       AD 7D 3E 10 2F A0 BB 4E 65 4B 91 DB E9 9A 6F E1>)
$$ ##END=
$$ 
$$ hash MD5
$$ AC 52 60 59 96 53 40 1E B3 74 E3 BC 59 87 2D 9D
##$RELAX= 
##$RELAX= 
##$RELAX= 
##$RELAX= 
##$RELAX= 
##$RELAX= 
##$RELAX= 
$$ Bruker specific parameters
$$ --------------------------
##$DU= <C:\u>
##$EXPNO= 1440
##$NAME= <ADRS>
##$PROCNO= 1
##$TYPE= <nmr>
##$USER= <dgb>
##$AMP= (0..31)
100 100 100 100 100 100 100 100 100 100 100 100 100 100 100 100 100 100 
100 100 100 100 100 100 100 100 100 100 100 100 100 100 
##$AQSEQ= 0
##$AQ_mod= 3
##$AUNM= <au_zg>
##$AUTOPOS= <25 >
##$BF1= 250.13
##$BF2= 250.13
##$BF3= 250.13
##$BF4= 250.13
##$BF5= 500.13
##$BF6= 500.13
##$BF7= 500.13
##$BF8= 500.13
##$BYTORDA= 1
##$CFDGTYP= 0
##$CFRGTYP= 5
##$CHEMSTR= <none>
##$CNST= (0..31)
1 1 145 1 1 1 1 1 1 1 1 1 1 1 1 1 1 1 1 1 1 1 1 1 1 1 1 1 1 1 1 1 
##$CPDPRG= <>
##$CPDPRG1= <>
##$CPDPRG2= <>
##$CPDPRG3= <>
##$CPDPRG4= <mlev>
##$CPDPRG5= <mlev>
##$CPDPRG6= <mlev>
##$CPDPRG7= <mlev>
##$CPDPRG8= <mlev>
##$CPDPRGB= <>
##$CPDPRGT= <>
##$D= (0..31)
0 1 0 0 0 0 0 0 0 0.06 0 0 0 0 0 0 0.0002 0 0 0 0 0 0 0 0 0 0 0 0 0 0 
0 
##$DATE= 1164805397
##$DBL= (0..7)
120 120 120 120 120 120 120 120 
##$DBP= (0..7)
150 150 150 150 150 150 150 150 
##$DBP07= 0
##$DBPNAM0= <>
##$DBPNAM1= <>
##$DBPNAM2= <>
$$ [...]
##$SUBNAM7= <"">
##$SUBNAM8= <"">
##$SUBNAM9= <"">
##$SW= 20.6930455092707
##$SWIBOX= (0..15)
0 0 3 0 0 0 0 0 0 0 0 0 0 0 0 0 
##$SW_h= 5175.983436853
##$TD= 65536
##$TD0= 1
##$TE= 294.16
##$TE2= 300
##$TE3= 300
##$TEG= 300
##$TL= (0..7)
0 120 120 120 120 120 120 120 
##$TP= (0..7)
150 150 150 150 150 150 150 150 
##$TP07= 0
##$TPNAME0= <>
##$TPNAME1= <>
##$TPNAME2= <>
##$TPNAME3= <>
##$TPNAME4= <>
##$TPNAME5= <>
##$TPNAME6= <>
##$TPNAME7= <>
##$TPOAL= (0..7)
0.5 0.5 0.5 0.5 0.5 0.5 0.5 0.5 
##$TPOFFS= (0..7)
0 0 0 0 0 0 0 0 
##$TUNHIN= 0
##$TUNHOUT= 0
##$TUNXOUT= 0
##$USERA1= <user>
##$USERA2= <user>
##$USERA3= <user>
##$USERA4= <user>
##$USERA5= <user>
##$V9= 5
##$VALIST= <valist>
##$VCLIST= <CCCCCCCCCCCCCCC>
##$VD= 0
##$VDLIST= <DDDDDDDDDDDDDDD>
##$VPLIST= <PPPPPPPPPPPPPPP>
##$VTLIST= <TTTTTTTTTTTTTTT>
##$WBST= 1024
##$WBSW= 4
##$XGAIN= (0..3)
0 0 0 0 
##$XL= 0
##$YL= 0
##$YMAX_a= 333342
##$YMIN_a= -473421
##$ZGOPTNS= <>
##$ZL1= 120
##$ZL2= 120
##$ZL3= 120
##$ZL4= 120
##$ABSF1= 16.522
##$ABSF2= -4.171173
##$ABSG= 5
##$ABSL= 3
##$ALPHA= 0
##$AQORDER= 0
##$ASSFAC= 0
##$ASSFACI= 0
##$ASSFACX= 0
##$ASSWID= 0
##$AUNMP= <proc_1d>
##$AZFE= 0.1
##$AZFW= 0.1
##$BCFW= 0
##$BC_mod= 0
##$BYTORDP= 0
##$COROFFS= 0
##$CY= 12.5
##$DATMOD= 1
##$DC= 0
##$DFILT= <>
##$DTYPP= 0
##$F1P= 14.0000005364418
##$F2P= -0.99999901652339
##$FCOR= 0.5
##$FTSIZE= 32768
##$FT_mod= 6
##$GAMMA= 0
##$GB= 0
##$INTBC= 1
##$INTSCL= 1
##$ISEN= 128
##$LB= 0.3
##$LEV0= 0
##$LPBIN= 0
##$MAXI= 10000
##$MC2= 0
##$MEAN= 0
##$ME_mod= 0
##$MI= 0
##$NCOEF= 0
##$NC_proc= -5
##$NLEV= 6
##$NOISF1= 0
##$NOISF2= 0
##$NSP= 0
##$NTH_PI= 0
##$NZP= 0
##$OFFSET= 16.522
##$PC= 1
##$PHC0= 219.1093
##$PHC1= 9.72701
##$PH_mod= 1
##$PKNL= yes
##$PPARMOD= 0
##$PSCAL= 4
##$PSIGN= 0
##$REVERSE= no
##$SF= 250.13
##$SI= 32768
##$SIGF1= 0
##$SIGF2= 0
##$SINO= 400
##$SIOLD= 32768
##$SREGLST= <1H.CDCl3>
##$SSB= 0
##$STSI= 32768
##$STSR= 0
##$SW_p= 5175.98343685301
##$SYMM= 0
##$S_DEV= 0
##$TDeff= 65536
##$TDoff= 0
##$TI= <Analysis number 999999
Compound Code 99
Book Reference 9
Project Code 9>
##$TILT= no
##$TM1= 0
##$TM2= 0
##$TOPLEV= 0
##$USERP1= <user>
##$USERP2= <user>
##$USERP3= <user>
##$USERP4= <user>
##$USERP5= <user>
##$WDW= 1
##$XDIM= 32768
##$YMAX_p= 372177331
##$YMIN_p= -429269
$$ End of Bruker specific parameters
$$ ---------------------------------
##NTUPLES= NMR SPECTRUM
##VAR_NAME=  FREQUENCY,     SPECTRUM/REAL,   SPECTRUM/IMAG
##SYMBOL=    X,             R,               I
##VAR_TYPE=  INDEPENDENT,   DEPENDENT,       DEPENDENT
##VAR_FORM=  AFFN,          ASDF,            ASDF
##VAR_DIM=   32768,         32768,           32768
##UNITS=     HZ,            ARBITRARY UNITS, ARBITRARY UNITS
##FACTOR=    0.157963299565203, 1,           1
##FIRST=     4132.6476996994, 0,             0
##LAST=      -1043.33573715361, 0,           0
##MIN=       -1043.33573715361, -429269,     0
##MAX=       4132.6476996994, 372177331,     0
$$ Real data points
##PAGE= N=1
##DATA TABLE= (X++(R..R)), XYDATA
$$ [...]
23846B1855J2682N9445o1021m1844J9135L721N0958K0868O1752J5767m2208j48087
$$ 21855 34537 93982 32961 -8883 10252 13973 64931 85799 147551 163318 121110 -26977
23834b6977r3034j8914p2355L4152J30874R6947O0493q0642j1503o9149l5603
$$ -26977 -120011 -138925 -211280 -177128 -46254 50693 111186 30544 19041 -50108 -85711
23823h5711j4305m66o011J08779L923r5720L6457j3258k3063L756j1467O86N530
$$ -85711 -100016 -100482 -106493 2286 6209 -89511 -53054 -66312 -89375 -85619 -97086 -96400 -90870
23810i0870k1829N936P6690Q1649K2029J0615n7268l7261O703o9639L8936L5528
$$ -90870 -112699 -106763 -30073 51576 73605 84220 26952 -10309 -3606 -73245 -34309 1219
23798A219m144J33587l449o962r1042J8978q956l4441K1290Q3718K3271l7455
$$ 1219 -2925 130662 127213 120251 29209 48187 39231 4790 26080 109798 133069 95614
23786I5614M1269n7833j080J1677q6630k2199N7492k2297l127o3091j14359P8930
$$ 95614 136883 79050 77970 89647 3017 -19182 38310 16013 12886 -50205 -164564 -85634
23774h5634M0254j08684K3017L9903J2888o3340l1296Q4128k7964K8169q252O0546
$$ -85634 -45380 -154064 -131047 -91144 -78256 -141596 -172892 -88764 -116728 -88559 -96811 -36265
23762c6265J156p3010O0261M6385r9896p3901M3618P0698j8115J23517R5446L445
$$ -36265 -35109 -108119 -47858 -1473 -101369 -175270 -131652 -60954 -79069 44448 139894 143339
23750A43339r7044R604L9416J045j18961r0653P201J18256M4742q2971J7277O0828
$$ 143339 46295 55899 95315 96360 -22601 -113254 -106053 12203 56945 -26026 -8749 52079
23738E2079P940Q9433o149M0179r5474q4691L5840J9497k285k774r8262p7741
$$ 52079 60019 149452 143303 183482 88008 3317 39157 58654 56369 53595 -44667 -122408
23726a22408m6247r206K2381k3329P8741k2101N7056q430o644N3204L5556p904
$$ -122408 -168655 -177861 -155480 -178809 -100068 -122169 -65113 -73543 -80187 -26983 8573 669
23714F69l0685O044M2487m7956O8280O4104j21741N514J08285p344m8954n1043
$$ 669 -30016 -23972 18515 -29441 38839 102943 -18798 -13284 95001 87657 38703 -12340
23702a2340J9466L6132O0968l1300j2359L9996j34842q4069J05804J07383m6929
$$ -12340 7126 43258 104226 72926 60567 100563 -34279 -118348 -12544 94839 47910
23691D7910K823O2767J11720O8973J6252k1269j09227j02734n6828J1355K2046
$$ 47910 50733 113500 225220 294193 310445 289176 179949 77215 20387 31742 53788
23680E3788N9414O2101j43521K1683m6049r8971k0135l881O5256L0137M6355P8976
$$ 53788 113202 175303 31782 53465 7416 -91555 -111690 -115571 -50315 -20178 26177 105153
23668A05153L9838j26407q6460p817p347m987K964m3091J4058M4246M3345L4872
$$ 105153 144991 18584 -67876 -75693 -83040 -88027 -85063 -128154 -114096 -69850 -26505 8367
23656H367J3740r6518n7427O4903L5979n5736O0653J03250j9303q8147n0318k7764
$$ 8367 22107 -74411 -131838 -66935 -30956 -86692 -26039 77211 57908 -30239 -80557 -108321
23644a08321N3558k4012n1881R5339Q1651q7097o1259J32815J79485m1895m9655
$$ -108321 -54763 -78775 -130656 -35317 46334 -40763 -102022 30793 210278 168383 118728
23633A18728r9865m3274L0728j8322j27177n5323J39884L3868p951o1318P3968
$$ 118728 18863 -24411 6317 -12005 -139182 -194505 -54621 -20753 -28704 -90022 -16054
23622a6054j9609m0284O9096k3018K6625N4408n4438q0376J2122J19113M517q395
$$ -16054 -35663 -75947 -6851 -29869 -3244 51164 -3274 -83650 -71528 47585 52102 43707
23610D3707J7539j4469L5392j7403k4146j207p5819N7169m4288J01686J01666
$$ 43707 61246 46777 82169 64766 40620 39413 -36406 20763 -23525 78161 179827
23599A79827m4679j35019l4336N2897J9222k5934p1743n7298q6314n2716N3153
$$ 179827 135148 129 -34207 18690 37912 11978 -59765 -117063 -203377 -256093 -202940
23588b02940J0407P7321J3257k7257P6785J60219M2498p6593p6647P5604Q7120
$$ -202940 -192533 -115212 -101955 -129212 -52427 107792 150290 73697 -2950 72654 159774
23577A59774j11898j65410K0223R5702Q9969n7690p2993k5481J9972l1188O8658
$$ 159774 47876 -117534 -97311 -1609 88360 30670 -42323 -67804 -47832 -79020 -10362
23566a0362M544m3860J3868o2388J3016J21862Q589M021k6508j14762q5265o689
$$ -10362 -5818 -49678 -35810 -98198 -85182 36680 45269 49290 22782 -91980 -177245 -183934
23554a83934k2567o7345R0554R2522P1497L586r5936j5626J50467Q6714R2858
$$ -183934 -206501 -273846 -183292 -90770 -19273 -15687 -111623 -127249 23218 109932 202790
23543B02790K8610k55261l3193k3891m1200J6876m5335k9405P2408O6494J1393
$$ 202790 231400 -23861 -57054 -80945 -122145 -105269 -150604 -180009 -107601 -41107 -29714
23532b9714l3033J1223J05480p2753J1482k858j1746o0917O8903P5118p867j24763
$$ -29714 -62747 -51524 53956 -18797 -7315 -10173 -21919 -82836 -13933 61185 53318 -71445
23520g1445O6508N4555p6041j4477k2565m1443j4689P836L6385k0975m3363O1469
$$ -71445 -4937 49618 -26423 -40900 -63465 -104908 -119597 -111761 -75376 -96351 -139714 -78245
23508g8245R0691O3354m2661m7692J55377L0617o7252n7083M889J00761Q4908
$$ -78245 12446 75800 33139 -14553 140824 171441 104189 47106 51995 152756 237664
23497B37664j10694r7824p4460J5021P4010k7017J33256o1085k19127n4091l1739
$$ 237664 126970 29146 -45314 -30293 43717 16700 149956 88871 -130256 -184347 -216086
23486b16086J23528L9366P4495K8970q224l3704k5381m7136L3427J2620Q1204
$$ -216086 -92558 -53192 21303 50273 42049 8345 -17036 -64172 -30745 -18125 63079
23475F3079M0225N4510r349k8231n6862l9759P9668n9815n1280k3804N8073R5529
$$ 63079 103304 157814 148465 120234 63372 23613 103281 43466 -7814 -31618 26455 121984
23463A21984J00849o2814n0671j3351l6036P509L1490O1299k4090m0308r2464
$$ 121984 222833 160019 109348 95997 59961 67470 98960 160259 136169 95861 3397
23452C397J3968Q96p5936n2714J65899n1007j32511k0577O3122N5058m2503o1135
$$ 3397 17365 18261 -57675 -110389 55510 4503 -128008 -148585 -85463 -30405 -72908 -134043
23440a34043J99532k3803n0828n3754J3335N1523J7987q7951k0806P6191P4326
$$ -134043 65489 41686 -9142 -62896 -49561 1962 19949 -68002 -88808 -12617 61709
23429F1709J874j46037j37337L5004p5727J30308J83556J4894p8173m6382J9316
$$ 61709 63583 -82454 -219791 -184787 -260514 -130206 53350 68244 -9929 -56311 -36995
23418c6995n239n1772o9624o1665k5206M2460J08696O1707L6166L6742o7082j01156
$$ -36995 -42234 -94006 -163630 -225295 -250501 -208041 -99345 -37638 -1472 35270 -31812 -132968
23406a32968m2258o1167K6779J61245J20590m3387r8744m4897O495m9321m6579
$$ -132968 -175226 -236393 -209614 -48369 72221 28834 -69910 -114807 -108312 -157633 -204212
23395b04212J1315O0589k063L2120R9572L4641k0033o6681r0517J9646J50522
$$ -204212 -192897 -132308 -134371 -102251 -2679 31962 11929 -54752 -145269 -125623 24899
23384B4899k795k6978n8880J26907N9522P927j6433Q574r8757j10316J3976M3105
$$ 24899 22104 -4874 -63754 63153 122675 130602 114169 122743 23986 -86330 -72354 -29249
23372b9249K2697P1056M8796o6085j79844m1675J12272R8475P170k6057k731M4252
$$ -29249 -6552 64504 113300 47215 -132629 -174304 -62032 36443 43613 17556 14825 59077
23360E9077j12828l4525R6628N2580n5393L8767N2394L8291m4257l6929j570k9088
$$ 59077 -53751 -88276 8352 60932 5539 44306 96700 134991 90734 53805 52235 23147
23348B3147L8583R3242m7335l802j2619q9659m7139Q5646o1341j0030p243o0361
$$ 23147 61730 154972 107637 103835 91216 1557 -45582 40064 -21277 -31307 -38550 -98911
23336i8911j3053M2955K2789k1865q6998k8495q903P7472J00668M847n5796L618
$$ -98911 -111964 -69009 -46220 -68085 -155083 -183578 -192481 -115009 -14341 -9494 -65290 -61672
23324f1672M4729j10653l4943P7561j014k9327N406k0120J3431J0281m6876j771
$$ -61672 -16943 -127596 -162539 -84978 -85992 -115319 -109913 -130033 -116602 -106321 -153197 -154968
23312a54968N2491q1329m2004P5642J96385Q1547p717R3975o3168r4570L0828
$$ -154968 -102477 -183806 -225810 -150168 46217 127764 120047 214022 150854 56284 87112
23301H7112O4067J7163o876q3959j5520L5867J0289r532j16668l9550K8584M3515
$$ 87112 151179 168342 161466 77507 61987 97854 108143 98611 -18057 -57607 -29023 14492
23289A4492O0997R2574K079j11474p8445l7275K3421m1813k1933K0394L1305P2967
$$ 14492 75489 168063 170142 58668 -19777 -57052 -33631 -75444 -97377 -76983 -45678 27289
23277B7289j8850J25416l841j40064n5800L3347o5497k7063R5615J01886q0285
$$ 27289 8439 133855 130014 -10050 -65850 -32503 -98000 -125063 -29448 72438 -7847
23266g847j836j0876j830Q686o136l1183K3677J52580l4898j23476p5701O029
$$ -7847 -9683 -20559 -22389 -13703 -19839 -51022 -27345 125235 90337 -33139 -108840 -102811
23254a02811J2555l1509j2153l9349J41583J8638l1512M7593J21462k2080k6409
$$ -102811 -90256 -121765 -133918 -173267 -31684 -13046 -44558 3035 124497 102417 76008
23243G6008Q9076K1193q9471m9179l9798O2991J37118k2009k31297j19087N0581
$$ 76008 165084 186277 96806 47627 7829 70820 207938 185929 -45368 -164455 -113874
23232a13874L6396k6922m8255J26353M2166l7286M6706R681J20370k5950j6432
$$ -113874 -77478 -104400 -152655 -26302 15864 -21422 25284 34965 155335 129385 112953
23221A12953l8866p0186n9623J7329M5654J3113j32768j08695N5278N863k541
$$ 112953 74087 3901 -55722 -38393 7261 20374 -112394 -221089 -165811 -159948 -162489
23210a62489m1645O2404Q7554K7019l1542N09L5936L4528p8315o0256N9907P6701
$$ -162489 -204134 -141730 -54176 -27157 -58699 -58190 -22254 12274 -66041 -126297 -66390 10311
23198A0311M8027p1165j22491k2898J6096J03399P4791n7885m2499k2217j6322
$$ 10311 58338 -12827 -135318 -158216 -142120 -38721 36070 -21815 -64314 -86531 -102853
23187a02853j2591n8115k3693j24506M591J39008M071K4227O3746J00323n512
$$ -102853 -115444 -173559 -197252 -321758 -317167 -178159 -174088 -149861 -86115 14208 8696
23176H696j38169n9655K0612O1585N3344P8647j6794l4062n7439O8675L4122j07440
$$ 8696 -129473 -189128 -168516 -106931 -53587 25060 8266 -25796 -83235 -14560 19562 -87878
23164h7878M2269J35286J5440p2740l2200M7957k6441J4030j2108m182r8978n9198
$$ -87878 -45609 89677 105117 32377 177 48134 21693 35723 23615 19433 -79545 -138743
23152a38743J46278N3954m6295j29785j25317J00251J15783K696N3512o2960r4038
$$ -138743 7535 61489 15194 -114591 -239908 -139657 -23874 -21178 32334 -30626 -124664
23141a24664k1354j1505m2341J61361R4219p6331o6671l9418k3784n7207K4640
$$ -124664 -146018 -157523 -199864 -38503 55716 -20615 -87286 -126704 -150488 -207695 -183055
23130a83055K9729r373K7116J7124L6114j2378p397L6967o6802m3021n8624m6045
$$ -183055 -153326 -162699 -135583 -118459 -82345 -94723 -102120 -65153 -131955 -174976 -233600 -279645
23118b79645j3355P743K8644k2005R0868L564q892K3441J02930m3121J8270K9297
$$ -279645 -293000 -285257 -256613 -278618 -187750 -184186 -193078 -169637 -66707 -109828 -91558 -62261
23106f2261j21082O2301K8958L0314m0054o7306Q2528N8757j12541j2155Q2844
$$ -62261 -183343 -121042 -92084 -61770 -101824 -169130 -86602 -27845 -140386 -152541 -69697
23095f9697P2746K3426L6250L9417l9067q1308L1768L0763r455k4768m4477J6800
$$ -69697 3049 26475 62725 102142 63075 -18233 13535 44298 34843 10075 -34402 -17602
23083a7602l2174K0319O6071K10764k1376j15860n9677r9807J4459O228K103K0440
$$ -17602 -49776 -29457 36614 247378 226002 110142 50465 -49342 -34883 -28655 -26552 -6112
23071f112r2763m6863N0139Q4721k8068o8254l4697N3708N4812O6255k538O9796
$$ -6112 -98875 -145738 -95599 -10878 -38946 -107200 -141897 -88189 -33377 32878 30340 100136
23059A00136P372m3029j8884K543l6382j13392J02966Q4671m3947K4082L1902
$$ 100136 107508 64479 45595 48138 11756 -101636 1330 86001 42054 66136 98038
23048I8038P0770J9988k2917k00871m9229O1084Q9668K3149M1342K1991p155J6723
$$ 98038 168808 188796 165879 -34992 -84221 -23137 66531 89680 131022 153013 145858 162581
23036A62581k4026j03775l9525J9535M51k8579j11915l3453J83713R8768K6142
$$ 162581 138555 34780 -4745 14790 15241 -13338 -125253 -158706 25007 123775 149917
23025A49917l1029j06662k7871r0214j26687J35418K00631J44914m7726j13377
$$ 149917 118888 12226 -15645 -105859 -232546 -97128 103503 248417 200691 87314
23015H7314k8388M1036L6261m4458l4722j0845M9181p1543j68860l9233R4797
$$ 87314 58926 99962 136223 91765 57043 46198 95379 23836 -145024 -184257 -89460
23004h9460J8164J7920j7136R4397k97k4588k00619J2372J51526J08258j27758
$$ -89460 -71296 -53376 -70512 23885 23588 -1000 -201619 -189247 -37721 70537 -57221
22993e7221L1050J12598j613o7265q4285M6098p0301j2844J55176j6729p6151
$$ -57221 -26171 86427 84814 17549 -66736 -20638 -90939 -103783 51393 34664 -41487
22982d1487m4487M8320K9674O447n0163M2283J00762Q1134r1705j00063r3668
$$ -41487 -85974 -37654 -7980 -1533 -51696 -9413 91349 172483 80778 -19285 -112953
22971a12953L3199j397o4870K0930J27063K4124k8953P5056J4760j6386P6151
$$ -112953 -79754 -81151 -146021 -125091 1972 26096 -2857 72199 86959 70573 146724
22960A46724l8233J2698j6312K5839k4621q6781K3199N2004O2877k8397j49374
$$ 146724 108491 121189 104877 130716 106095 19314 42513 94517 157394 128997 -20377
22949b0377M2757l8969p2551K1206r156J3125L7409O1367J6996R7790k1140q0217
$$ -20377 22380 -16589 -89140 -67934 -77090 -63965 -26556 34811 51807 149597 128457 48240
22937D8240o3893M7737l3431j2635q2139n22o474o85K4721K8978J9390L9367J03426
$$ 48240 -15653 32084 -1347 -13982 -96121 -96643 -103117 -103802 -79081 -50103 -30713 8654 112080
22924A12080M4533n3758o2617R532m5468K6476K3842k0776M041P7146j57390q1697
$$ 112080 156613 102855 40238 49770 4302 30778 54620 33844 37885 115031 -42359 -124056
22912a24056Q5338k559R667M4418Q1012o5480m5481J7657j3804k6015j2133J03943
$$ -124056 -38718 -41277 -31610 12808 93820 28340 -17141 516 -13288 -39303 -51436 52507
22900E2507N6826q0780q5016j6051M4484K9322l6167Q1257M1703R746n7453k0470
$$ 52507 109333 28553 -56463 -72514 -28030 1292 -34875 46382 88085 97831 40378 19908
22888A9908n3505k9009n653M8648N1002r5868r0106Q607m1288P9697O0159o0102
$$ 19908 -33597 -62606 -68259 -19611 31391 -64477 -154583 -145976 -187264 -107567 -47408 -107510
22876a07510k0989m4906l8629O4780o4266N4675J09932M9196k6507m0969o027
$$ -107510 -128499 -173405 -212034 -147254 -211520 -156845 -46913 2283 -24224 -65193 -71220
22865g1220M8690M0480M6242J17377n5765k5727n792p5812P117l3264J17272L3843
$$ -71220 -22530 17950 64192 181569 125804 100077 94285 18473 25590 -7674 109598 143441
22853A43441k0004J21391M6159o1425l1407o2371j07714j51358M911p72J9890
$$ 143441 123437 244828 290987 229562 198155 135784 28070 -123288 -118377 -119149 -99259
22842i9259n4418P1219Q3973J30594M5957o5383r0835j36732Q8361Q0898n3311
$$ -99259 -153677 -82458 1515 132109 178066 112683 21848 -114884 -26523 54375 1064
22831A064l9277R1505N7112m4921p6136n1748K9998J40579N3162N3900O127J2255
$$ 1064 -38213 53292 110404 65483 -10653 -62401 -32403 108176 161338 215238 221365 233620
22819B33620k987Q025n2397k9003o208n5346j30111l3492J8952j15859L9422J6758
$$ 233620 230633 238658 186261 157258 151050 95704 -34407 -67899 -48947 -164806 -125384 -108626
22807a08626M8323L8276K3896n4452q060Q1832L4489n9701O2821K1279j03907
$$ -108626 -60303 -22027 1869 -52583 -60643 21189 55678 -4023 58798 80077 -23830
22796b3830m9434P9889m3377j6323K5125J1831m9971j48516j08935O4032J06488
$$ -23830 -73264 6625 -36752 -53075 -27950 -16119 -66090 -214606 -323541 -259509 -153021
22785a53021J36380N9930Q6321k2678n8415k2290J0775k9710K8664j51799j42265
$$ -153021 -16641 43289 129610 106932 48517 26227 37002 7292 35956 -115843 -258108
22774b58108J38975J4928O9468O4596J1173k2479p5964J00547M3204o0036R950
$$ -258108 -119133 -104205 -34737 29859 41032 18553 -57411 43136 86340 26304 36254
22763C6254K6395q62o7157Q8194J6228q0494n7739q7995n1298M857L7538j3107
$$ 36254 62649 61787 -5370 82824 99052 18558 -39181 -127176 -178474 -173617 -136079 -149186
22751a49186q4228N8535k6614O6057M8k5336K0293k2850j15869o3215R0759Q6780
$$ -149186 -233414 -174879 -201493 -135436 -135388 -160724 -140431 -163281 -279150 -342365 -251606 -164826
22739a64826k7348L3129J40321R4147M6160n3494o1408M8242k6097m3716N3485
$$ -164826 -192174 -159045 -18724 75423 121583 68089 6681 54923 28826 -14890 38595
22728C8595j02544j05354l2583K00185J20728j06575r1817J1528M8461m0680r5055
$$ 38595 -63949 -169303 -201886 -1701 119027 12452 -79365 -67837 -19376 -60056 -155111
22717a55111j09J8853M5658r2059L4596j1173L4597k630M2392N5661M606o8934
$$ -155111 -155220 -136367 -90709 -182768 -148172 -159345 -124748 -127378 -84986 -29325 -24719 -93653
22705i3653l1114O6999l6972j7072N4103j1880N9961R3398R1230q4642r7985o4159
$$ -93653 -124767 -57768 -94740 -111812 -57709 -69589 -9628 83770 175000 90358 -7627 -71786
22693g1786p147k3065j5758O5411O3525Q0495J52030n1501j18517M2651M576p477
$$ -71786 -78933 -101998 -117756 -52345 11180 91675 243705 192204 73687 116338 120914 113437
22681A13437j00504l3339o6787j15273l4515N2614N8404R603Q7519k608K5511
$$ 113437 12933 -20406 -87193 -202466 -236981 -184367 -125963 -116360 -28841 -31449 -5938
22670e938l1625j53796j13926Q5929R4399l1125n7146J36155Q1342j07561M0668
$$ -5938 -37563 -191359 -305285 -219356 -124957 -156082 -213228 -77073 4269 -103292 -62624
22659f2624K4488L5344N8709N8458n3376p4359n0306p5816J2756J11295q854J8730
$$ -62624 -38136 -2792 55917 114375 60999 -13360 -63666 -139482 -126726 -15431 -24285 -5555
22647e555l486J17794O2442L4456K6302k4676r4475j35495l9884K7038J26641
$$ -5555 -9041 108753 171195 205651 231953 207277 112802 -22693 -62577 -35539 91102
22636I1102k133p6506l7924R446L1279P5005l6251O5798q5252r5348m6555k5981
$$ 91102 88969 12463 -25461 -16015 15264 90269 54018 119816 34564 -60784 -107339 -133320
22624a33320N985P7646l4315J00386Q7339r655J1451M042q6977k4865j977j00001
$$ -133320 -127335 -49689 -84004 16382 103721 94066 105517 109559 22582 -2283 -4260 -104261
22612a04261p3563J06026Q0260m5291m355j64725n0740j0972L1491j5914J79552
$$ -104261 -177824 -71798 8462 -36829 -41184 -205909 -256649 -267621 -236130 -252044 -72492
22601g2492K7563r2296M6798M2769o8055j14480R2431J12298L9440M1027m103
$$ -72492 -44929 -137225 -90427 -47658 -115713 -230193 -137762 -25464 13976 55003 50900
22590E0900J271m6053l4526o990k5807J483m4656R012M6928R1155P4706L8328
$$ 50900 52171 6118 -28408 -35398 -61205 -59722 -104378 -95366 -48438 42717 117423 155751
22578A55751J1013Q228m8767O2551j02555j41959L4283J652L5604k506J786O6925
$$ 155751 166764 174992 126225 188776 86221 -55738 -21455 -19803 15801 13295 15081 82006
22566H2006N6611q3161p3233K8430q019n5123P4840o128l8231M9389k8534r814
$$ 82006 138617 55456 -17777 10653 2634 -52489 22351 16223 -22008 27381 -1153 -10967
22554a0967P858L0226j5343L4347M4607K0099j03185q0728j5101j6010p9394m8916
$$ -10967 -3109 27117 11774 46121 90728 110827 7642 -73086 -88187 -104197 -183591 -232507
22542b32507M9769P8425J81505P542n2570o3118j71026q2469P6833J72930J03457
$$ -232507 -182738 -104313 77192 84734 32164 -30954 -201980 -284449 -207616 -34686 68771
22531F8771K1314l2463j4320n5211j4387J9637K7921L5535L518J0778n2696O1561
$$ 68771 90085 57622 43302 -11909 -26296 -6659 21262 56797 60315 71093 18397 79958
22519G9958l0437r7601m106L9841M8337j3915p3914p8482R6883l1945P8310J20392
$$ 79958 49521 -48080 -52186 -12345 35992 22077 -51837 -130319 -33436 -65381 12929 133321
22507A33321O6349l8555o7796j4854K0822j3745j5495M9934k877j72938k2222
$$ 133321 199670 161115 93319 78465 99287 85542 70047 119981 117104 -55834 -78056
22496g8056M5689P623l9713m296k7839N5k1896O8217r924Q3779J5231r1579n8500
$$ -78056 -32367 -24744 -64457 -68753 -96592 -96537 -118433 -50216 -60140 23639 38870 -52709 -111209
22483a11209R5981N8090J052m6887k1921M8910n8444j0631L1348n6849k1203L5317
$$ -111209 -15228 42862 43914 -2973 -24894 24016 -34428 -45059 -13711 -70560 -91763 -56446
22471e6446M1461p750o4906n6162K4890j03966q5811L5451R830L7883J28675J19391
$$ -56446 -14985 -22735 -87641 -143803 -118913 -222879 -308690 -273239 -263409 -225526 -96851 22540
22459B2540K4023J8848o259K3388k3876p0047N9801l7944m4739o1745O1951O4982
$$ 22540 46563 65411 59152 82540 58664 -11383 48418 10474 -34265 -96010 -34059 30923
22447C0923N2211O5589Q8345n637r7354K7808J2775p0233j90216Q195O1538k1450
$$ 30923 83134 148723 237068 231431 134077 161885 174660 104427 -85789 -77594 -16056 -37506
22435c7506k598l5387N3298l8248j11301J05277J17630P5769K3791q5811j74697
$$ -37506 -40104 -75491 -22193 -60441 -171742 -66465 51165 126934 150725 64914 -109783
22424a09783Q3279n1524L7435Q1212J09039j8845j12671K3133p1631j7600N9284
$$ -109783 -26504 -78028 -40593 40619 149658 130813 18142 41275 -30356 -47956 11328
22413A1328O7196p5251o8341k1655k9951J5572o7728M6527N9484j8524M6071L3969
$$ 11328 78524 3273 -65068 -86723 -116674 -101102 -168830 -122303 -62819 -81343 -35272 -1303
22401a303K6317k299K0374R15k6696M3405P2040r1875j25356m7557J3118l3227
$$ -1303 25014 22715 43089 44004 17308 60713 132753 40878 -84478 -132035 -118917 -152144
22389a52144L6886R7080R865l6069j7893l6145M4610n8225L9774J6517p1525K7784
$$ -152144 -115258 -18178 -8313 -44382 -62275 -98420 -53810 -112035 -72261 -55744 -127269 -99485
22377i9485o2547K9698q1616n4785J02779Q6013j4626K5624q200K0369m3958K9171
$$ -99485 -162032 -132334 -213950 -268735 -165956 -79943 -94569 -68945 -77145 -56776 -100734 -71563
22365g1563l1141r368R2917n5572r5814j890k3095k3812L793J38847J45855Q0231
$$ -71563 -102704 -112072 -19155 -74727 -170541 -172431 -195526 -219338 -215545 -76698 69157 149388
22353A49388j29092l8590J884Q602r308L2818M4244M6296p0854K941J697q1385
$$ 149388 20296 -18294 -16410 -7808 -17116 15702 59946 106242 35388 38329 40026 -41359
22341d1359n1531J4246O4043K1718o2606K2154Q1844l697n544m5868r1577J5958
$$ -41359 -92890 -78644 -14601 7117 -55489 -33335 48509 44812 39268 -6600 -98177 -82219
22329h2219O0989o533o857m0565l2293M0683M9550O7766J23889k9223j1623m9544
$$ -82219 -21230 -27763 -34620 -75185 -107478 -66795 -17245 50521 174410 145187 133564 84020
22317H4020m979O4485O4012j67734n8934m3275o0551M4449P8206k0169O8320Q9247
$$ 84020 79041 143526 207538 39804 -19130 -62405 -122956 -78507 -301 -20470 47850 137097
22305A37097P2013L5194L5446j4223j45789q5694j02557N5449J00381o88L6477
$$ 137097 209110 244304 279750 265527 119738 34044 -68513 -13064 87317 86629 123106
22294A23106L4522m5689M3603k1194L5892l4191r3080L6220q572q418j0298l6894
$$ 123106 157628 111939 155542 134348 170240 136049 42969 79189 70617 62199 51901 15007
22282A5007n7354J26155L0976M6349q2466l062l718r580o4911J9047L1212l4062
$$ 15007 -42347 83808 114784 161133 78667 75605 71887 62307 -2604 16443 47655 13593
22270A3593j1749l4522K2432P8693P7536l5075j23006o6756R2301K2646M553q1334
$$ 13593 1844 -32678 -10246 68447 145983 110908 -12098 -78854 13447 36093 40646 -40688
22258d0688l2022l4759P8791P9118J2525J3406j00490p3112q8290k8104K4568
$$ -40688 -72710 -107469 -28678 50440 62965 76371 -24119 -97231 -185521 -213625 -189057
22247a89057j9353J01451m5418M3502M7695O0514q0266K1429J05453N0157k9678
$$ -189057 -208410 -106959 -152377 -108875 -61180 -666 -80932 -59503 45950 96107 66429
22236F6429o2815Q8220q6643l0428P2324o0807p7832P3657p1394j6294l8880R6029
$$ 66429 3614 91834 5191 -25237 47087 -13720 -91552 -17895 -89289 -105583 -144463 -48434
22224d8434N259K860P7636q819p1271m3299j5466M6945M835M2049J00729K4405
$$ -48434 -43175 -40315 37321 28502 -42769 -86068 -101534 -54589 -49754 -7705 93024 117429
22212A17429m8703k0412P7802n1673m7829r6632j08465O676J06738J11041P490
$$ 117429 68726 48314 126116 74443 26614 -70018 -178483 -171807 -65069 45972 53462
22201E3462q3693n6877r537O0225J12268J0418l7764l7648N7416k9741j19613
$$ 53462 -30231 -87108 -96645 -36420 75848 86266 48502 10854 68270 38529 -81084
22190h1084J3984J05833J39522m5956j44256k8611k5879n2585N4341K4985n6435
$$ -81084 -67100 38733 178255 132299 -11957 -40568 -66447 -119032 -64691 -39706 -96141
22179i6141m45P3981J14904q0518j85654n5660J22912K2824Q1033L9011m7694
$$ -96141 -96586 -22605 92299 11781 -173873 -229533 -106621 -83797 -2764 36247 -11447
22168a1447o384J8685j316K5390j05391K003L4869j5422J42105Q9166n5103n4291
$$ -11447 -17831 854 -462 24928 -80463 -78460 -43591 -59013 83092 172258 117155 62864
22156F2864M2810j17530l0790L5323P4578M2603m9921q9457K7766j3078l6853
$$ 62864 105674 -11856 -42646 -7323 67255 109858 59937 -29520 -1754 -14832 -51685
22145e1685k2445O4097P2909L7325K1856r7237q1066L6859N7795J16513l1892
$$ -51685 -74130 -10033 62876 100201 122057 24820 -56246 -19387 38408 154921 123029
22134A23029q7536j41850j08890Q4604k6674k277N3361M6391J20113j22000m3225
$$ 123029 35493 -106357 -215247 -130643 -157317 -159594 -106233 -59842 60271 -61729 -104954
22123a04954M7978k7536Q6366p487j21782M0163l3970N897R1176N2319o5704N4377
$$ -104954 -56976 -84512 1854 -5633 -127415 -87252 -121222 -115325 -24149 28170 -37534 16843
22111A6843p934j0831P1587J4486J6563m4663n8692O6742j1144L6851L5832k8121
$$ 16843 8909 -1922 69665 84151 100714 56051 -2641 64101 52957 89808 125640 97519
22099I7519j32364o4687j0560k8574R0763J16632J15300P2668l1425k2209o5458
$$ 97519 -34845 -99532 -110092 -138666 -47903 68729 184029 256697 225272 203063 137605
22088A37605j20658p4986L8895J8928q9181o2297K6470Q1895M7270O4599j4131
$$ 137605 16947 -58039 -19144 -216 -89397 -151694 -125224 -43329 3941 68540 54409
22077E4409o740P2146j4786j10849n3103O04K1116N9234k2371j963J11096L1164
$$ 54409 47669 119815 105029 -5820 -58923 -58319 -37203 22031 -340 -2303 108793 139957
22065A39957l0102r5274m9895p920N1511j10187M161K6072N315r2235m8162O3700
$$ 139957 109855 14581 -35314 -43234 8277 -101910 -97749 -71677 -66362 -158597 -206759 -143059
22053a43059J93687L9794j8699Q8067o0928j70975l981P8400J22728o2143l1139
$$ -143059 50628 90422 71723 159790 98862 -72113 -76094 2306 125034 62891 31752
22042C1752N7518J4065j1714M0675j915k1291p2517k3383R4683L4994p0350p5869
$$ 31752 89270 103335 91621 132296 130381 109090 36573 13190 107873 142867 72517 -3352
22030c352J0912R9622j10434l2153K5732K0914P9679k1833r6952j00955L6093
$$ -3352 7560 107182 -3252 -35405 -9673 11241 90920 69087 -27865 -128820 -92727
22019i2727P254p7789N0745L5385k1162J5049N5765j2940K5228M1548q1106N702
$$ -92727 -85473 -163262 -112517 -77132 -98294 -83245 -27480 -40420 -15192 26356 -54750 -49048
22007d9048n7560L844Q894j9525L4742k4416N6840J0933o9659L0490L5059J32381
$$ -49048 -106608 -102764 -93870 -113395 -78653 -103069 -46229 -35296 -104955 -74465 -39406 92975
21995I2975K3701p0059n6314m9462J4375N9992K8363M7628R2231p3890j14285
$$ 92975 116676 46617 -9697 -59159 -44784 15208 43571 91199 183430 109540 -4745
21984d745j44757j08148J2537J2740J60593P9928K4274q6875j49775n2128n9102
$$ -4745 -149502 -257650 -245113 -232373 -71780 8148 32422 -54453 -204228 -256356 -315458
21973c15458J27938J12218j4623n037L5335R0639R0881M1244J394m8036j11690
$$ -315458 -187520 -75302 -89925 -94962 -59627 31012 121893 163137 164531 116495 4805
21962D805j5313K2365j12154J9553M6871P432L9804O5959O6775o9998p2855l0558
$$ 4805 -10508 11857 -100297 -80744 -33873 -26441 13363 79322 146097 76099 3244 -27314
21950b7314p676L6609O8519n3045j07558l002j6093k1875P6916J48823L8245r4882
$$ -27314 -34990 1619 70138 17093 -90465 -93467 -109560 -131435 -54519 94304 132549 37667
21938C7667o5698N2308j0064n1435j46252P4126J36456L4657j08241j19957M3943
$$ 37667 -28031 24277 14213 -37222 -183474 -109348 27108 61765 -46476 -166433 -122490
21927a22490J29353n7091m4297P4630k8632J9647P1241n7257k1638j1264r6420
$$ -122490 6863 -50228 -94525 -19895 -48527 -28880 42361 -14896 -36534 -47798 -144218
21916a44218P504P3569K4091L7655Q0369O291o3772J26341m1972j49242j97830
$$ -144218 -136714 -63145 -39054 -1399 78970 85261 21489 147830 105858 -43384 -241214
21905b41214m7709M2498j8590o6846J76146J00414j1560M1340O0933r9436n4215
$$ -241214 -288923 -246425 -265015 -331861 -155715 -55301 -66861 -25521 35412 -64024 -118239
21894a18239K8005K4757l5691M8089L5050j4788q7617p1245Q8361J20297j19792
$$ -118239 -90234 -65477 -101168 -53079 -18029 -32817 -120434 -191679 -103318 16979 -102813
21883a02813j06351J8175L1373M1452N9109M5165Q7516j14769M147L0337M0308
$$ -102813 -209164 -190989 -159616 -118164 -59055 -13890 73626 -41143 -36996 -6659 33649
21872C3649l7945M9868K6227j44425r6798O0647M2300n0455M3715O6736p211M9467
$$ 33649 -4296 45572 71799 -72626 -169424 -108777 -66477 -116932 -73217 -6481 -13692 35775
21860C5775R55l7353J6671o8866p6884m7705J03368L6485j8830L5574L1254N8559
$$ 35775 36730 -623 16048 -52818 -129702 -177407 -74039 -37554 -56384 -20810 10444 69003
21848F9003J0187j40141p9361O2061J06031n7584M1748N7621k502l6562j03635
$$ 69003 79190 -60951 -140312 -78251 27780 -29804 11944 69565 67063 30501 -73134
21837g3134l1283P9976M0737M3088M6563q972m9401l1589j6101K1942n4941o9724
$$ -73134 -104417 -24441 16296 59384 105947 96975 47574 15985 -116 21826 -33115 -102839
21825a02839J00014K6864j56472k9500J05692m1427j963J18416n6677l7688M0558
$$ -102839 -2825 24039 -132433 -161933 -56241 -97668 -99631 18785 -37892 -75580 -35022
21814c5022k6272q8008K0669L2979N5018J2237K3085l9339m7019N9628N7246n2940
$$ -35022 -61294 -149302 -128633 -95654 -40636 -28399 -5314 -44653 -91672 -32044 25202 -27738
21802b7738k4617J5537J624j608N1121n1729j11039k4402q2697J00187R2039J02379
$$ -27738 -52355 -36818 -35194 -36802 14319 -37410 -148449 -172851 -255548 -155361 -63322 39057
21790C9057r690j25728J9369J26268L2860K3663K655M4187M0663j18840r5199
$$ 39057 29367 -96361 -76992 49276 82136 105799 108454 152641 193304 74464 -20735
21779b0735j44307k1635J12763o9053M9897L6750p3819o8775J06099J04880n296
$$ -20735 -165042 -186677 -73914 -142967 -93070 -56320 -130139 -198914 -92815 12065 6769
21768F769p8219K028J34486L7162o9608o0988M7382J14001m9898m0671k0630j02661
$$ 6769 -71450 -69422 65064 102226 32618 -28370 19012 133013 83115 42444 21814 -80847
21756h0847j33851Q1642K4422N350J07321Q6593L507r5414r050P4755K4878J9715
$$ -80847 -214698 -133056 -108634 -103284 4037 90630 94137 -1277 -10327 64428 89306 109021
21744A09021K9208O728n3853m5654p8712r883l7817L1375Q5569O6145Q023O2018
$$ 109021 138229 144957 91104 45450 -33262 -43145 -80962 -49587 35982 102127 110150 172168
21732A72168R467n2039j49522N186M164j2231j8338M1754L0823J9347m2385L881
$$ 172168 181635 129596 -19926 -14740 -10576 -22807 -41145 609 31432 50779 8394 12275
21720A2275K0640m713M840m5097q9750Q2865n4883N4051K0671L960q0960N5007
$$ 12275 32915 28202 33042 -12055 -101805 -18940 -73823 -19772 899 4859 -76101 -21094
21708b1094M8133k9268J20475L0714o3139M2148m270l0473R677j44833n1788O5036
$$ -21094 27039 -2229 118246 148960 85821 127969 123699 93226 102903 -41930 -93718 -28682
21696b8682O8908J5662j8019L361K1474M8690q8626j3002J8676J04145j32018
$$ -28682 40226 55888 37869 41230 62704 111394 22768 9766 28442 132587 569
21685E69n3618P2617M3518l9690Q845K5096L8935l252l0822L5355K0449n2470
$$ 569 -53049 19568 63086 23396 32241 57337 96272 93020 62198 97553 118002 65532
21673F5532K1556j29531m1316L2012N385m63Q8195O3133j09063q3832O4906Q6217
$$ 65532 87088 -42443 -83759 -51747 -46362 -46825 41370 104503 -4560 -88392 -23486 62731
21661F2731j17930R8495m341j25418n986N4240J9556p0507P5379O0231Q003q7119
$$ 62731 -55199 43296 38955 -86463 -92449 -38209 -18653 -89160 -13781 46450 54453 -32666
21649c2666j1654J15481O0127N527n3205r8271n9863O3867k2905o3601m7675j6437
$$ -32666 -44320 71161 131288 136815 83610 -14661 -74524 -10657 -33562 -97163 -144838 -161275
21637a61275N82L7703J69045P6936j8571K7875k4732l6547l7860O103J8701l4549
$$ -161275 -160693 -122990 46055 122991 104420 132295 107563 71016 33156 39259 57960 23411
21625B3411o3116m3385o8377P8847O3127J38547o596n2229o268m8779r4721m0563
$$ 23411 -39705 -83090 -151467 -72620 -9493 129054 122458 70229 63961 15182 -79539 -120102
21613a20102p526K0391n4719M1564o0726j12143n0681J63674J14445Q3447N3258
$$ -120102 -127628 -107237 -161956 -120392 -181118 -293261 -343942 -180268 -65823 17624 70882
21602G0882k7739J9151L2145n1945R4200j0383q4903r2898r937M1694P3863l0841
$$ 70882 43143 62294 94439 42494 136694 126311 41408 -51490 -61427 -19733 54130 23289
21590B3289j13661M3758M1137P5797m317j50091r7406M8705J55953J23445q7184
$$ 23289 -90372 -46614 -5477 70320 66003 -84088 -181494 -132789 23164 146609 59425
21579E9425o6416Q3516k1233R958o8515r6151L2173J36720N2568k269j0431J0659
$$ 59425 -6991 76525 55292 65250 -3265 -99416 -67243 69477 122045 119776 109345 120004
21567A20004p5741K1526j01958n6629n4194R7094J01470j513o5966o7812j5837
$$ 120004 44263 65789 -36169 -92798 -146992 -49898 51572 50059 -15907 -83719 -99556
21556i9556M3745k6687m414N1461L0627K9153M8156m810k3750K3298n3135o7495
$$ -99556 -55811 -82498 -86912 -35451 -4824 24329 72485 67675 43925 67223 14088 -53407
21544e3407o7833n3244K7368L8773R590m6064k8765Q7924J11808K4924J8000M0763
$$ -53407 -121240 -174484 -147116 -108343 -98753 -144817 -173582 -85658 26150 51074 69074 109837
21532A09837o0159p2172O7093k8224j32754J9689P2249J4034q0900l9800l8823
$$ 109837 49678 -22494 44599 16375 -116379 -96690 -24441 -10407 -91307 -131107 -169930
21521a69930L1592p656m5230L1280P4575N4034L694m3197n9483K5768P7196O220
$$ -169930 -138338 -145994 -191224 -159944 -85369 -31335 -27641 -70838 -130321 -104553 -27357 -21137
21509b1137n9933M1012K3179j13018o621P1944l7189n0609N387k3107J04791r091
$$ -21137 -81070 -40058 -16879 -129897 -136518 -64574 -101763 -152372 -146985 -170092 -65301 -74392
21497g4392K2519j158o518q7534L2635J68488j7040M4876L0641k4375p2018j34086
$$ -74392 -51873 -53031 -59549 -147083 -114448 54040 37000 81876 112517 88142 16124 -117962
21485a17962P5653K21645K573o3611p1816N358J12947k1639n7092q2503P4156
$$ -117962 -42309 179336 181909 118298 46482 51840 164787 143148 86056 3553 77709
21474G7709Q2865k194Q39P5608j18875p9888l5190m6200M660j1937J8330n9786
$$ 77709 160574 158380 159219 234827 115952 36064 874 -45326 -40666 -52603 -34273 -94059
21462i4059q8560M2374m8452J4900J75229J39010O1788r7664J2389L4304n7462
$$ -94059 -182619 -140245 -188697 -173797 1432 140442 202230 104566 116955 151259 93797
21451I3797l1622J5407m8984j163N1208O4983j17448P182J968n378N4817j50961
$$ 93797 62175 77582 28598 27435 78643 143626 26178 33360 35328 29950 84767 -66194
21439f6194j22068J3798J24049O9081q7779n1256M0913O9725O5999O3658J2580
$$ -66194 -188262 -174464 -50415 18666 -69113 -120369 -79456 -9731 56268 119926 132506
21428A32506O6691p3102j07350q7980m5767k0371P0576O7115j19440q5806N0023
$$ 132506 199197 126095 18745 -69235 -115002 -135373 -64797 2318 -117122 -202928 -152905
21417a52905N3619J21982k859n3034r3124n6353J03446N6042K1990M8716L3696
$$ -152905 -99286 22696 19837 -33197 -126321 -182674 -79228 -23186 -1196 47520 81216
21406H1216j23165o7646M6474j3994j7538J7047k7404Q9237J7429o528r0293r2448
$$ 81216 -41949 -109595 -63121 -77115 -94653 -77606 -105010 -15773 1656 -4872 -95165 -187613
21394a87613k8077J35568J3182R6097j51343k3842Q2255J560N22J07347L1007
$$ -187613 -215690 -80122 -66940 29157 -122186 -146028 -63773 -62213 -61691 45656 76663
21383G6663m8745M2369k5778q3013N5194Q5418j5482q1940K8711q667o3566M0772
$$ 76663 27918 70287 44509 -38504 16690 102108 86626 4686 33397 24730 -38836 1936
21371A936r6844J292M6660J16520l899O4756N3209j621j07445q1838p1374j553
$$ 1936 -94908 -93616 -46956 69564 65665 130421 183630 182009 74564 -7274 -78648 -80201
21359h0201J74594N0588j10759L047N6199o338j29072o7265q2714n2435k128k4451
$$ -80201 94393 144981 34222 37269 93468 87130 -41942 -109207 -191921 -244356 -246484 -270935
21347b70935N3135J47485p8723k1848k7296P2376J10133J75894m278r9465n553
$$ -270935 -217800 -70315 -149038 -170886 -198182 -125806 -15673 160221 155943 56478 50925
21336E0925J0564j08537l3102k3047r693l2472r2582J5639Q5519R3766p8626m0160
$$ 50925 61489 -47048 -80150 -103197 -112890 -145362 -237944 -222305 -136786 -43020 -121646 -161806
21324a61806l9104K9641M5504j7912p1571p0054J30282Q1326P06j35052m7219
$$ -161806 -200910 -171269 -125765 -143677 -215248 -285302 -155020 -73694 -72988 -208040 -255259
21313b55259J28219M2694L53l2181N8237M389n257J5722J4221j0336M9028Q2291
$$ -255259 -127040 -84346 -83993 -116174 -57937 -53548 -58805 -43083 -28862 -39198 9830 92121
21301I2121L2707K8723p4042k0205o2414K9021Q4893Q873j23215q451L113n6545
$$ 92121 124828 153551 79509 59304 -3110 25911 110804 119677 -3538 -11989 -8876 -65421
21289f5421J4321J3926K0787K8793l3203p9975p3500l602Q8489J05624o851J1902
$$ -65421 -51100 -37174 -16387 12406 -20797 -100772 -174272 -177874 -89385 16239 9388 21290
21277B1290m665l8604j01506o206M4641N4320j11586n1492L0419j0101M6143J10173
$$ 21290 16625 -21979 -123485 -129691 -85050 -30730 -142316 -193808 -163389 -173490 -127347 -17174
21265a7174N0806j66115L6781K6223K4453O2844m2823j500O0989N4087J1993j7697
$$ -17174 33632 -132483 -95702 -69479 -45026 17818 -25005 -26505 34484 88571 100564 82867
21253H2867k2496q8042m1310K6249M4547m5397n3765l8898R097R142N1597Q270
$$ 82867 60371 -27671 -68981 -42732 1815 -43582 -97347 -136245 -127148 -118006 -66409 -58139
21241e8139j2720P0513K9283l2242k448P220l9615M7969L0451l3461L436j8791
$$ -58139 -70859 -346 28937 -3305 -5753 1467 -38148 9821 40272 6811 10247 -8544
21229h544j0671l617M6533n780j28057q8154Q6135R0488k101M2008o9487r583
$$ -8544 -19215 -22832 23701 17921 -110136 -198290 -112155 -21667 -23768 18240 -51247 -60830
21217f0830j12095j9027Q095L627Q1151L2294M0216m7632j09496J5526m7266K2782
$$ -60830 -172925 -191952 -183857 -180230 -99079 -66785 -26569 -74201 -183697 -168171 -215437 -192655
21205a92655J7379l2054J06221L583M2419J37586J25691K3454q3740o5846n1429
$$ -192655 -175276 -207330 -101109 -97526 -55107 82479 208170 231624 147884 82038 30609
21194C0609j04378K9889l0614l7756Q3662J44698K9977p4253O612l495o8506m6352
$$ 30609 -73769 -43880 -74494 -112250 -28588 116110 146087 71834 78446 74951 6445 -39907
21182c9907l850l9806k1215L2168K3865N529k8336N0283Q0912P885j2904k8419
$$ -39907 -43757 -83563 -104778 -72610 -48745 -43216 -71552 -21269 59643 67528 54624 26205
21170B6205J4520l8185M7574p646j59202J1670N1547r944M3410K735J7637P0059
$$ 26205 40725 2540 50114 42468 -116734 -105064 -53517 -63461 -20051 -17316 321 70380
21158G0380o3485O719k2527O9701L8235q7191j04975k2195Q4429J2683l8767L6116
$$ 70380 6895 13614 -8913 60788 99023 11832 -93143 -115338 -30909 -18226 -56993 -20877
21146b0877O0785k5981p407o6995J1991M6580k7275r113N5960J9024r4657o3283
$$ -20877 39908 13927 6520 -60475 -48484 -1904 -29179 -38292 17668 36692 -57965 -121248
21134a21248R2718p1816J1241R0404M405j10406o3309K6424Q4986J1936R5198
$$ -121248 -28530 -100346 -89105 1299 5704 -104702 -168011 -141587 -56601 -44665 50533
21123E0533J3812M936K6006P8101q9864j63512R4586M4470R6575l6310k05115
$$ 50533 64345 69281 95287 173388 83524 -79988 14598 59068 155643 119333 -85782
21112h5782o9425K5388k5962R6516O2201J4191J9512M8429K7998N7498R801j4254
$$ -85782 -155207 -129819 -155781 -59265 2936 17127 36639 85068 113066 170564 180365 166111
21100A66111m304M694m3402j20776q4089j8786R399O5740m168j5270J8530N3194
$$ 166111 161807 166501 123099 2323 -81766 -100552 -91153 -25413 -29581 -44851 -26321 26873
21088B6873J1049L0460O336o9987j3481O6148O0659K4214r8003o9862l3380J3998
$$ 26873 37922 68382 74718 4731 -8750 57398 118057 142271 44268 -25594 -58974 -44976
21076d4976N0200P9045j5877r9148Q645L7137J4048n158k0449j44812m1391P1954
$$ -44976 5224 84269 68392 -30756 -22111 15026 29074 23916 3467 -141345 -182736 -110782
21064a10782n7906n0470m24O2315k7174O3224J01861j686M6052j4242n761P2599
$$ -110782 -168688 -219158 -219582 -157267 -184441 -121217 -19356 -21042 25010 10768 5007 77606
21052G7606m163Q269j4781j80722m0230m3362m2549Q943K8477M1304M4433J2154
$$ 77606 73443 81712 66931 -113791 -154021 -197383 -239932 -230989 -202512 -161208 -116775 -104621
21040a04621R0978J12455k7845p6402m8278j06595l020M0328j1393L7759J09618
$$ -104621 -13643 98812 70967 -5435 -53713 -160308 -163328 -123000 -134393 -96634 12984
21029A2984k0551j28990N9383K000k5961M5722j3936N9662J15451p0973q1652
$$ 12984 -7567 -136557 -77174 -75174 -101135 -55413 -69349 -9687 105764 34791 -46861
21018d6861L7513l8360J6408L51j01716j16049n935K9722O7849J16103p7265O6526
$$ -46861 -9348 -47708 -31300 -30949 -132665 -248714 -254649 -224927 -157078 -40975 -118240 -51714
21006e1714P5489O1585L6381O2409L9405j89071r7521k7610K1997J5765p5316
$$ -51714 23775 85360 121741 184150 223555 34484 -63037 -90647 -68650 -52885 -128201
20995a28201o9252L1572k2291Q8761k5804l8804K9887L5667O6897L1111J7626
$$ -128201 -197453 -165881 -188172 -99411 -125215 -164019 -134132 -98465 -31568 -457 17169
20984A7169j47j7194n7298p8607N8099l2849K3307k6218Q9060k7710K2042l7293
$$ 17169 17022 -172 -57470 -136077 -77978 -110827 -87520 -113738 -24678 -52388 -30346 -67639
20972f7639j4747M7702o15p8954J9825Q2774m8024j1436M0963k0752q380p4959
$$ -67639 -82386 -34684 -35299 -114253 -94428 -11654 -59678 -71114 -30151 -50903 -59283 -134242
20960a34242o669M9060k6792N4988R8014M8264n3012L3172l453n417K2868p4992
$$ -134242 -140911 -91851 -118643 -63655 34359 82623 29611 62783 59330 53913 76781 1789
20948A789m8926l0716O789l3564K3464M3428r6400P4481J61444J6370k01863N3332
$$ 1789 -47137 -77853 -71064 -104628 -81164 -37736 -134136 -59655 101789 118159 -83704 -30372
20936c0372Q0560l2147l2380k9303Q459M8034N1570L5589j11094k9112J14491
$$ -30372 50188 18041 -14339 -43642 -35183 12851 64421 100010 -11084 -40196 74295
20925G4295M9974J5292j05141q5937Q042q4845K3799J32326O4649o6110k248O5266
$$ 74295 124269 139561 34420 -51517 -43475 -128320 -104521 27805 92454 26344 24096 89362
20913H9362j02993k1237k6389J0792O9251J22454j08982o4594j8256J23586K1180
$$ 89362 -13631 -34868 -61257 -50465 18786 141240 32258 -32336 -50592 72994 94174
20902I4174O984M0988K6994q4753l5750m4744O2807J13089q6428q8872N206n8106
$$ 94174 101158 142146 169140 84387 48637 3893 66700 179789 93361 4489 9695 -48411
20890d8411k1932N9028l5823K9140N5141M7589N4873j69902o7456L5659J2709
$$ -48411 -70343 -11315 -47138 -17998 37143 84732 139605 -30297 -97753 -62094 -49385
20879d9385k0720o2748K7795M9470r2770l9663O3169K1331n1648L4026l973k4338
$$ -49385 -70105 -132853 -105058 -55588 -148358 -188021 -124852 -103521 -155169 -121143 -125116 -149454
20867a49454M3509L5171n0111M0625J0347L4062J28188O1435m1998j37789l9931
$$ -149454 -105945 -70774 -120885 -80260 -69913 -35851 92337 153772 111774 -26015 -65946
20856f5946j5906p1991o460P4655M0069j6663Q5550K2563j7577J1118p9545j10835
$$ -65946 -81852 -153843 -160303 -85648 -45579 -62242 23308 45871 28294 39412 -40133 -150968
20844a50968L645P6655P2108J07992j9839p8889l9093o4085K4610M3421K2395
$$ -150968 -147323 -70668 1440 109432 89593 10704 -28389 -92474 -67864 -24443 -2048
20833b048q0122k591O6370L0881m0381j7092L0131M4034L0444M2285J8125Q734
$$ -2048 -82170 -84761 -18391 12490 -27891 -44983 -14852 29182 59626 101911 120036 128770
20821A28770J9981Q6811N3535o0798L8614L068n4309j34661n7443J19624J6872
$$ 128770 148751 235562 289097 228299 266913 269981 215672 81011 23568 143192 160064
20810A60064j6238o754M6091O824O1559j34960p2947j10855j11091J26582P9428
$$ 160064 143826 137072 183163 189987 251546 116586 43639 -67216 -178307 -51725 27703
20799B7703j94572j10901N7775J40239n471O315N3748J15888L3178L1822p0139
$$ 27703 -166869 -277770 -219995 -79756 -85227 -78912 -25164 90724 123902 155724 85585
20788H5585p1756m2096L0043j14164m3466N3216M1403j4265L4705m8560j306N7365
$$ 85585 13829 -28267 1776 -112388 -155854 -102638 -61235 -75500 -40795 -89355 -90661 -33296
20776c3296q6912L237J9899j0906P3352O4998j01340o489J11199J272o4378K2315
$$ -33296 -120208 -116971 -97072 -107978 -34626 30372 -70968 -77457 33742 35014 -29364 -7049
20764g049q9946K9391o9559L1728L1948L0673j467j236N4867O1432k9250k1351
$$ -7049 -96995 -67604 -137163 -105435 -73487 -42814 -44281 -45517 9350 70782 41532 20181
20752B0181r572n5386k5971m1144n6719m5655N8962P2024p1513J7297Q4338J11004
$$ 20181 10609 -44777 -70748 -111892 -168611 -214266 -155304 -83280 -154793 -137496 -53158 57846
20740E7846K8524q7456J1689j8035j3110R8081q8047k9599j1315J6718k5132n831
$$ 57846 86370 -1086 10603 -7432 -20542 77539 -10508 -40107 -51422 -34704 -59836 -65667
20728f5667J1115L6187N2807l5344N3640O0497q8654j01538O2292J03423J6620
$$ -65667 -54552 -18365 34442 -902 52738 113235 24581 -76957 -14665 88758 105378
20717A05378P248j19060m3612p6594K5184Q6223O3445Q0954k8404K42O7075J7632
$$ 105378 112626 -6434 -50046 -126640 -101456 -15233 48212 129166 100762 101004 168079 185711
20705A85711m0777l2191R1715M710p8503l9876p9291q4782Q2806J58207k1704
$$ 185711 144934 112743 204458 209168 130665 90789 11498 -73284 9522 167729 146025
20694A46025q402p4554k4192r561n1045O1985L8104l7736M53q7938j1138k0433
$$ 146025 137623 63069 38877 29316 -21729 40256 78360 40624 41077 -46861 -57999 -78432
20682g8432P033k0177j424M3036N6764j2235j38073m8471K2777K2528L5635R3126
$$ -78432 -71399 -91576 -93000 -49964 6800 -5435 -143508 -191979 -169202 -146674 -111039 -17913
20670a7913k6966J9374k2865J2947N186J10634l8580l4862P388p7245K1677M0114
$$ -17913 -44879 -25505 -48370 -35423 -30237 80397 41817 6955 14343 -62902 -41225 -1111
20658a111m9209n382J56452J4916o1858j19434j32907J1496N0859O9997J20275
$$ -1111 -50320 -55702 100750 115666 53808 -65626 -198533 -187037 -136178 -66181 54094
20647E4094k018m7653N5996R1557L8748n8254j26612m7755O3065M1893j13331
$$ 54094 52076 4423 60419 151976 190724 132470 5858 -41897 21168 63061 -50270
20636e0270p1140R5621Q9509r2j4464n0304p7070P7437J55945R4854j18582j79470
$$ -50270 -121410 -25789 63720 63628 49164 -1140 -78210 -773 155172 250026 131444 -48026
20624d8026k08798r2408J6915O8090J47803J38991o33j21652k7183J34463l7227
$$ -48026 -256824 -349232 -332317 -264227 -116424 22567 21934 -99718 -126901 7562 -29665
20613b9665q7470J25012M8333j30818p9469m5915K0122L1009L9963J71506J98899
$$ -29665 -117135 7877 56210 -74608 -154077 -199992 -179870 -148861 -108898 62608 261507
20602B61507k4535j41019m1536q4064r3728L8031L1396K6992j6979l999J58878
$$ 261507 236972 95953 54417 -29647 -123375 -85344 -53948 -26956 -43935 -47934 110944
20591A10944k8242Q369m4692n478J973j23274j39841N6280O1732J5323R543l8808
$$ 110944 82702 91071 46379 40901 42874 -80400 -220241 -163961 -102229 -86906 -77363 -116171
20579a16171j16997j9381L4044J26004L5084O567j4470L942j0318N4416l0772
$$ -116171 -233168 -252549 -218505 -92501 -57417 -50850 -65320 -61378 -71696 -17280 -48052
20568d8052J09281p429n8812j4857m1800M1435Q6409j837J11280J17269K9608
$$ -48052 61229 53800 -5012 -19869 -61669 -20234 66175 64338 175618 292887 322495
20557C22495j96281p8609l0375O230L1545o6949m0776Q0318K3515n339m1990r779
$$ 322495 126214 47605 17230 23460 55005 -11944 -52720 27598 51113 45774 3784 -5995
20545e995n9707p0637J7866j6907l1922k3944K3052L7002N4603P2342O9739K8299
$$ -5995 -65702 -136339 -118473 -135380 -167302 -191246 -168194 -131192 -76589 -4247 65492 93791
20533I3791k2207m1972K4564L6454N3956M5609L922r3571k02275K093P5414m324
$$ 93791 71584 29612 54176 90630 144586 190195 194117 100546 -101729 -99636 -24222 -28546
20521b8546K1587J81713J3934r9606k8439J11324r0778j16348K719N7760p0872
$$ -28546 -6959 174754 188688 89082 60643 171967 81189 -35159 -32440 25320 -45552
20510d5552q7966P9071P3548O300k9888M151k3436K1343p8659r2556q5596Q6572
$$ -45552 -133518 -54447 19101 25401 -4487 -336 -23772 -2429 -81088 -173644 -259240 -172668
20498a72668K4545K7470J00247r049R0024J2872o4168O0395j45618j07087J39030
$$ -172668 -148123 -120653 -20406 -29455 60569 73441 9273 69668 -75950 -183037 -44007
20487d4007l467L8223M2177l6830n523r014q0704P1816m1390N8558K9953J4941
$$ -44007 -47474 -9251 32926 -3904 -9427 -18441 -99145 -27329 -68719 -10161 19792 34733
20475C4733j13433R3708P9458k7755j7586L769O2215m5301N0850j5087R832p1972
$$ 34733 -78700 15008 94466 66711 49125 52894 115109 69808 120658 105571 115403 43431
20463D3431j20992J1824o6954p672J01244m555J4702N1044J2898n1920j0694n961
$$ 43431 -77561 -65737 -132691 -140363 -39119 -43674 -28972 22072 34970 -16950 -27644 -33605
20451c3605q992r086m0712k7275o127J092J7883P6839J28789K8731L6229J9751
$$ -33605 -42597 -51683 -92395 -119670 -125797 -124705 -106822 -29983 98806 127537 163766 183517
20439A83517l3137j73513o0118p8590L0634J16395R4467j1990m7986j3789J6743
$$ 183517 150380 -23133 -83251 -161841 -131207 -14812 79655 67665 19679 5890 22633
20428B2633j4838m8268J5056o8706q3324l962Q1007L7020O1646L196K1807P79
$$ 22633 7795 -40473 -25417 -94123 -177447 -181409 -100402 -63382 -1736 1460 23267 24046
20416B4046m3527J46826J50161n2708j15213L5287Q9169m7410J5001j5298j18491
$$ 24046 -19481 127345 277506 224798 109585 144872 234041 186631 201632 186334 67843
20405F7843j26348J5486p1503m4544L092J0485k8661N8164L0890J27061R9215
$$ 67843 -58505 -43019 -114522 -159066 -155974 -145489 -174150 -115986 -85096 41965 141180
20394A41180j04900k2516K9770j5895n5137j3550k8703J2642k5500L1587j3117
$$ 141180 36280 13764 43534 27639 -27498 -41048 -69751 -57109 -82609 -51022 -64139
20383f4139N6066J34416p3049j00297L9582n1033K7708L068J7015m7303o268Q2901
$$ -64139 -8073 126343 53294 -47003 -7421 -58454 -30746 -27678 -10663 -57966 -64234 18667
20371A8667P8573j618n2002K9190k3483j08280N2730Q9417O2590J1837p5232n9128
$$ 18667 97240 95622 43620 72810 49327 -58953 -6223 83194 145784 157621 82389 23261
20359B3261p3719l0956J8488n5829O89O6098N2401J10148N5054q2869j6785J07474
$$ 23261 -50458 -81414 -62926 -118755 -118066 -51968 433 110581 165635 82766 65981 173455
20347A73455l9822m3112L3435J6805p0942K0639n2519j24671j1669J96801K4541
$$ 173455 133633 90521 123956 140761 69819 90458 37939 -86732 -98401 98400 122941
20336A22941M010L7968j35985j32271r4j8718l5600N6864O1940M0422Q020P1232
$$ 122941 126951 164919 28934 -103337 -103431 -122149 -157749 -100885 -38945 1477 9497 80729
20324H0729M5553n2952q6320m4210N1881N6979l7155M399j1139O9594N4571m5656
$$ 80729 126282 73330 -12990 -57200 -5319 51660 14505 18904 7765 77359 131930 86274
20312H6274J3824N7811n1310l8630l330Q1140j8680n6794k1700m4773m7221n934
$$ 86274 100098 157909 106599 67969 64639 145779 127099 70305 48605 3832 -43389 -49323
20300d9323Q7395M6080M813J69831Q7653j11542j66840j21953p6861O8551J23349
$$ -49323 38072 84152 88965 258796 346449 234907 68067 -53886 -130747 -62196 61153
20289F1153J14655n2565p0038P2429L784M3837l8622j24710m7719p5971J12944
$$ 61153 175808 123243 53205 125634 129418 173255 134633 9923 -37796 -113767 -823
20278h23K30751K0293j34138k4756J8764l0707O0118n4109m3698K8801M8733K170
$$ -823 229928 250221 116083 91327 110091 79384 139502 85393 41695 70496 119229 121399
20266A21399m6029L388m5902r6449l8520J27680N4076J154l9815P71n2980K6583
$$ 121399 75370 78758 32856 -63593 -102113 25567 79643 80797 40982 41753 -11227 15356
20254A5356J61638k0967n4662M2858m3584m8310L95o3614m9999k3585J2430L6136
$$ 15356 176994 156027 101365 144223 100639 52329 52724 -10890 -60889 -84474 -72044 -35908
20242c5908l8072j8461L7861Q3585j5395N4253m7859P0013k551k8257j07161k5277
$$ -35908 -73980 -92441 -54580 29005 13610 67863 20004 90017 87466 59209 -47952 -73229
20230g3229K21012R8510j9705j0730o464k980r8230m3644m5163J3257o4816n4290
$$ -73229 147783 246293 226588 215858 209394 206414 108184 64540 19377 32634 -32182 -86472
20218h6472L9295N2946J00660K4146J36350L8042j00588j11780p3403k2502k4340
$$ -86472 -47177 5769 106429 130575 266925 304967 204379 92599 19196 -3306 -27646
20207b7646p1633l35N0865J12363L0430L5053n4718j0531Q2301O5276j54284j51437
$$ -27646 -99279 -99614 -48749 63614 94044 129097 74379 63848 146149 211425 57141 -94296
20195i4296j7778P8817J17360J24698M9657j07559j23663M022P9884Q1460q0717
$$ -94296 -112074 -33257 84103 208801 258458 150899 27236 31258 111142 192602 111885
20184A11885j38050q663K5897n5047l685K7779j40572J22953P5780P256J041R2408
$$ 111885 -26165 -34828 -8931 -63978 -67663 -39884 -180456 -57503 18277 25533 26574 118982
20172A18982J10799m4113j02457k01507n9170O1507P8440m1492L5551m2327m8302
$$ 118982 229781 185668 83211 -118296 -177466 -115959 -37519 -79011 -43460 -85787 -134089
20161a34089L2516P7674O0322k0250n9473p1577N3456R5329J2006J6516L0770
$$ -134089 -101573 -23899 36423 16173 -43300 -114877 -61421 33908 45914 62430 93200
20150I3200M9489k5451o3154N7471N5864n8344j10283j02451K0714J8360P3724
$$ 93200 142689 117238 54084 111555 167419 109075 -1208 -103659 -82945 -64585 9139
20139I139Q7393J3788n2123K4349Q71j9736l165M8618L4879j7702J4236K6480
$$ 9139 96532 110320 58197 82546 83417 63681 60516 109134 144013 126311 140547 167027
20127A67027m2206n9216m6936J2692N7267Q9813m5291L0048L4892r9056p3368
$$ 167027 124821 65605 18669 31361 88628 178441 133150 163198 198090 99034 25666
20116B5666m0158j9788L2289Q363P0544M7020p3758o2361O9742O8846q6444R164
$$ 25666 -14492 -34280 -1991 6372 76916 123936 50178 -12183 57559 126405 39961 49125
20104D9125n6666K9728l2041j18701k6692O8359Q8678m042j1964p3959n9151N4104
$$ 49125 -7541 22187 -9854 -128555 -155247 -86888 1790 -2252 -14216 -88175 -147326 -93222
20092i3222k3586M2427R744l0775l7488N1972P7763L4430m5368j70661n0914J0072
$$ -93222 -116808 -74381 -64637 -95412 -132900 -80928 -3165 31265 -14103 -184764 -235678 -225606
20080b25606J61625K12528j16422j25297n0452K6834J15710P187R6903p3040q868
$$ -225606 -63981 148547 32125 -93172 -143624 -116790 -1080 6107 103010 29970 21102
20069B1102l8399L3472M9997J5994j6023R2533r8971j05054M8119J6259l1744
$$ 21102 -17297 16175 66172 82166 66143 158676 59705 -45349 2770 19029 -12715
20058a2715j2069m2413N9661j6161o9275O9962N1747R1730o9036k2526J3008p893
$$ -12715 -24784 -67197 -7536 -23697 -92972 -23010 28737 120467 51431 28905 41913 34020
20046C4020P9112P241o4038p3218j0517q6705m3420J49681J0826j6563j15913
$$ 34020 113132 120373 56335 -16883 -27400 -114105 -157525 -7844 2982 -13581 -129494
20035a29494m612J92631R6498k9169r8707p6935k0426k313M1579k2580n3159N1426
$$ -129494 -134106 58525 155023 125854 27147 -49788 -70214 -72527 -30948 -53528 -106687 -55261
20023e5261O6551L6250J27780m6858o0380j82o617k7818m2832O4276q437P4402
$$ -55261 11290 47540 175320 128462 68082 67900 61283 33465 -9367 54909 46472 120874
20011A20874q2385j43024j40969j1246R6535M6285J01310Q9461M7747J7499r0752
$$ 120874 38489 -104535 -245504 -256750 -160215 -113930 -12620 76841 124588 142087 51335
20000E1335R841q205K1892M0518q6349L9860o8934j40262q51J5905M094N1315
$$ 51335 61176 52971 74863 115381 29032 68892 -42 -140304 -141155 -125250 -121156 -69841
19988f9841N8812j24329j3142J3578l622j10719N2606M388M4588M7801N040K6325
$$ -69841 -11029 -135358 -148500 -134922 -138544 -249263 -196657 -192269 -147681 -99880 -94840 -68515
19976f8515N6477j9934O7524l8312q4233K4094P53M7367J10830J01273j03186
$$ -68515 -12038 -31972 35552 -2760 -86993 -62899 -62146 -14779 96051 197324 94138
19965I4138p0079J7559O293l0377r3461o0217k1100l0233L4962R0299J8204J7913
$$ 94138 24059 41618 47911 17534 -75927 -136144 -157244 -187477 -152515 -62216 -44012 -26099
19953b6099R1473k7417j14255j07254N5480M8491j42210J9536L6811J36082J60243
$$ -26099 65374 37957 -76298 -183552 -128072 -79581 -221791 -202255 -165444 -29362 130881
19942A30881K2791m9688J3991L4042m2245O7799L7338l5807q9849n1702m2174
$$ 130881 153672 103984 117975 152017 109772 177571 214909 179102 89253 37551 -4623
19931d623O2016k0123K7845q780j19514J0785O0432J8867k1640J8640P0463J8595
$$ -4623 57393 37270 65115 56335 -63179 -52394 8038 26905 5265 23905 94368 112963
19919A12963q8077n5743L5189K8864L0281K7428J54677L8061j00221J0091J6231
$$ 112963 24886 -30857 4332 33196 63477 90905 245582 283643 183422 193513 209744
19908B09744k6871k8537j0917o5441n7398n736J30789K1597n7399j39392m7985
$$ 209744 182873 154336 143419 77978 20580 14844 145633 167230 109831 -29561 -77546
19897g7546j622J48739r1793p1758J43583J07084L6375q6270l3477R8895j2428
$$ -77546 -79168 69571 -22222 -93980 49603 156687 193062 106792 73315 172210 159782
19886A59782j47158j19464j0423J12911m8062m6465J0082o126O1887L373R8706
$$ 159782 12624 -106840 -117263 -4352 -52414 -98879 -88797 -94923 -33036 -29663 69043
19875F9043J9665l709o2336K6782l0112j45555j3260j856j1188l6777R7325J65237
$$ 69043 88708 84999 22663 49445 19333 -126222 -139482 -141338 -152526 -189303 -91978 73259
19863G3259o256l4198k4607k6985K5272K4375O0782q7614J5966N9157K8067O4813
$$ 73259 67003 32805 8198 -18787 6485 30860 91642 4028 19994 79151 107218 172031
19851A72031M6264l4530l1994q5044q0573K7148L2086N4907R4683O7737p5079
$$ 172031 218295 183765 151771 66727 -13846 13302 45388 100295 194978 262715 187636
19840A87636n3678k5560j02092k305k1613P151l3994N3865O1125k9160l3345j42411
$$ 187636 133958 108398 6306 4001 -17612 -10461 -44455 9410 70535 41375 8030 -134381
19828a34381P796M6750K2094M2083k7599J7686M4369N8914K5142k6877L0251n5668
$$ -134381 -126585 -79835 -57741 -15658 -43257 -25571 18798 77712 102854 75977 106228 50560
19816E0560r7800N3578N3900M6879q4824n0366j09550M9601J268J4428J09289
$$ 50560 -47240 6338 60238 107117 22293 -28073 -137623 -88022 -86754 -72326 36963
19805C6963M8094r0992j0012N0973j836j00549p0883P5753J01703m7715P130N8085
$$ 36963 85057 -5935 -15947 35026 33190 -67359 -138242 -62489 39214 -8501 -1371 56714
19793E6714j7700l1257n0271R2927M3888L1148k3598j27640N8310J11821K1671
$$ 56714 39014 7757 -42514 50413 94301 125449 101851 -25789 32521 144342 166013
19782A66013L0500N5449p7808j18984j3665j3261J03342n3434r8603L4553K6434
$$ 166013 196513 251962 174154 55170 41505 28244 131586 78152 -20451 14102 40536
19771D0536J0455n9633N4723K6782k3534j19567P9366L4670p2244m8822J7137
$$ 40536 50991 -8642 46081 72863 49329 -70238 9128 43798 -28446 -77268 -60131
19760f0131O2232J24112j5136r0042r5862q4672O0550O5602N9150N8185n0274
$$ -60131 2101 126213 111077 21035 -74827 -159499 -98949 -33347 25803 83988 33714
19749C3714K4249J18103P1810m6695k01945M665o7445M9313M3646M8629j2836
$$ 33714 57963 176066 247876 201181 -764 3901 -63544 -14231 29415 78044 65208
19738F5208j2785M6364p7929k5181O5880l3542j6795l9264m0289L9258J32910
$$ 65208 52423 98787 20858 -4323 61557 28015 11220 -28044 -68333 -29075 103835
19727A03835N1306M3614n0916r3346N6690Q9157j07736j20759r714N797j0120
$$ 103835 155141 198755 147839 54493 111183 200340 92604 -28155 -37869 -32072 -42192
19716d2192M4790O0730l2175R4341M0096o584q176j37598m2504K8590L3683J43330
$$ -42192 2598 63328 31153 125494 165590 159006 150830 13232 -29272 -682 33001 176331
19704A76331N64o3423j7837j6477J3340P7547Q732q8588J372o8649n2257r197
$$ 176331 176895 113472 95635 79158 92498 170045 178777 90189 91561 22912 -29345 -38542
19692c8542J8497O628n8805l0536K5608M4232k9659r1347O677R0422P4140r8014
$$ -38542 -20045 -13417 -72222 -102758 -77150 -32918 -62577 -153924 -147247 -56825 17315 -80699
19680h0699L3824J49441k5051j43291J1784N6157o2366J8017p8057p0173M2416
$$ -80699 -46875 102566 77515 -65776 -53992 2165 -60201 -42184 -120241 -190414 -147998
19669a47998R4127k6045n651M699M2281M0873N2295J11179P8209J4275p13r4863
$$ -147998 -53871 -79916 -85567 -80868 -38587 2286 54581 165760 243969 258244 257531 162668
19657A62668k36826j06159k8462K0110J41147N8942n5376m7515p4513N4535L4138
$$ 162668 -74158 -180317 -208779 -188669 -47522 11420 -43956 -91471 -165984 -111449 -77311
19646g7311p2502L0474P7666J09015P69k8670j7370O0354mm6283p2579L5595O5365
$$ -77311 -149813 -119339 -41673 67342 68111 39441 22071 82425 82421 36138 -36441 -846 64519
19633F4519J4316J1524q3436O3703m491Q858N5543L7715N2315M3403p6793l7334
$$ 64519 78835 90359 6923 70626 66135 74993 130536 168251 220566 263969 187176 149842
19621A49842O5678j15955j49882n4305n3444P3301M2564J5528k0581N5084P9835
$$ 149842 215520 99565 -50317 -104622 -158066 -84765 -42201 -26673 -47254 7830 87665
19610H7665k522N9137j27180o836M8107m5270l5926p2405Q2512R9758j6576j4569
$$ 87665 85143 144280 17100 10264 58371 13101 -22825 -95230 -12718 87040 70464 55895
19598E5895L0777l2258j03410l1491L7360k023o9252K9266M0058M7969Q434Q196
$$ 55895 86672 54414 -48996 -80487 -43127 -45150 -114402 -85136 -45078 2891 11325 19521
19586A9521j1146Q8139N5106m9091o1435j3158J3625l2799Q371k540R169l3190
$$ 19521 8375 96514 151620 102529 41094 27936 41561 8762 17133 14593 23762 -9428
19574i428J4355J6480M1418O4297M7193j53968n670R7358J45679J6191p7107q111
$$ -9428 4927 21407 62825 127122 174315 20347 14677 112035 257714 273905 196798 188687
19562A88687R0247M8907j33136q8347j8195r9898K1699M934q8397q2631L585n0209
$$ 188687 278934 327841 194705 106358 88163 -11735 9964 14898 -73499 -156130 -152545 -202754
19550b02754l2312O7652N5057l1711O5267N4767j4623k1740j8717n8640Q8689
$$ -202754 -235066 -167414 -112357 -144068 -78801 -24034 -38657 -60397 -79114 -137754 -49065
19539d9065J39415j7521r9922j07077m7877O1801L2036O8116J67587O0597J1001
$$ -49065 90350 72829 -27093 -134170 -182047 -120246 -88210 -20094 147493 208090 219091
19528B19091J4980l3823k993l3573m1602l4969j1819K7199m552O6040K2957k2488
$$ 219091 234071 200248 197255 163682 122080 87111 75292 102491 97939 163979 186936 164448
19516A64448P3721n6151j11401K0201M5607Q0109m0605M0123J1676m0070l5697
$$ 164448 238169 182018 70617 90818 136425 216534 175929 216052 227728 187658 151961
19505A51961L7955m1190r8696j25346M9594P9306L2197q301k6058J5058q2503
$$ 151961 189916 148726 50030 -75316 -25722 53584 85781 77480 51422 66480 -16023
19494a6023m930K2455l4818m3555O5323M6696o3144k6225M7533J94482N6906r0729
$$ -16023 -20953 1502 -33316 -76871 -11548 35148 -27996 -54221 -6688 187794 244700 153971
19482A53971j64413n1491N0030M6362n0986J0155J3372O058J18802R884p3411
$$ 153971 -10442 -61933 -11903 34459 -16527 -6372 7000 13058 131860 141744 68333
19471F8333j07107R566M2505m5009q6951M8109K3438j15102K740M4837K3678J7937
$$ 68333 -38774 -29208 13297 -31712 -118663 -70554 -47116 -162218 -159478 -114641 -90963 -73026
19459g3026J8314O2036m818k3275p134o5349k5670N975J25808m8991j353N6121
$$ -73026 -54712 7324 2506 -20769 -27903 -93252 -118922 -112947 12861 -36130 -37483 18638
19447A8638N5905j62N3748K7337m8193m9835O7978n2393j6107M8083j08431j7135
$$ 18638 74543 74381 128129 155466 107273 57438 125416 73023 56916 104999 -3432 -20567
19435b0567K4171J5959Q6910O9299K0417q1344n5112j6542l7507p2610m1216M2913
$$ -20567 3604 19563 106473 175772 196189 114845 59733 43191 5684 -66926 -108142 -65229
19423f5229K1138P9379J21417o1801K5242M1339L7099o6388l9344L156q2626P53
$$ -65229 -44091 35288 156705 94904 120146 161485 198584 132196 92852 96008 13382 14135
19411A4135l9220L8660M9410K0763P0879l1519r7826o698O3479l239P0726K1593
$$ 14135 -25085 13575 62985 83748 154627 123108 25282 18584 82063 78824 149550 171143
19399A71143j05634j09506k4228J34786O3746j05075L5896R1728J6130o0110p0885
$$ 171143 65509 -43997 -68225 66561 130307 25232 61128 152856 168986 108876 37991
19388C7991m9130R672M6150K4689N974N0183J28040J07291K0566j08348l7654
$$ 37991 -11139 -1467 44683 69372 75346 125529 253569 360860 381426 273078 235424
19377B35424n8700j84574r258Q7561K1220N3899Q7284n2219n0258K8N982r7217
$$ 235424 176724 -7850 -17108 70453 91673 145572 232856 180637 130379 130407 136389 39172
19365C9172k139L9185J9960M082N2875k6213l8358o8919O2650k7391q541k8107
$$ 39172 37033 76218 96178 100260 153135 126922 88564 19645 82295 54904 46363 18256
19353A8256K0422J0440J05453K2980j1480q4205p4972r4855M5359k1531q9726
$$ 18256 38678 49118 154571 177551 166071 81866 6894 -87961 -42602 -64133 -153859
19342a53859Q2167J08884l3350M2180Q1889L958l7205J6246P7745L4333m3577
$$ -153859 -71692 37192 3842 46022 127911 131869 94664 110910 188655 222988 179411
19331A79411p8909n3887q3477N6043N8028J6014L8410O2160j4924k9287q8474
$$ 179411 100502 46615 -36862 19181 77209 93223 131633 193793 178869 149582 61108
19320F1108o8436p6928Q2591Q4173M647K8778j111Q3993K2638q9162P422O0068
$$ 61108 -7328 -84256 -1665 82508 87155 115933 114822 198815 221453 132291 139713 199781
19308A99781M8568o4974j13285J859l8423J6342J66664O7188L4684m1300q3883
$$ 199781 248349 183375 70090 71949 33526 49868 216532 283720 318404 277104 193221
19297A93221P9241l881k4662j19374k2025L1700O2895p3336j09813p8369R5549
$$ 193221 272462 268581 243919 124545 102520 134220 197115 123779 13966 -64403 31146
19286C1146N0342J7748K4047L3526J01446j8662j34425K0265M3335M7978l439
$$ 31146 81488 99236 123283 156809 258255 239593 105168 125433 168768 216746 213307
19275B13307o0199o4733m0672L6840M2803J9459L1074j1919J50004o897j24882
$$ 213307 153108 88375 47703 84543 127346 146805 177879 165960 315964 309067 184185
19264A84185j30537l3348n3032J71405N6115j22936N4621J7567k0252k1196M4057
$$ 184185 53648 20300 -32732 138673 194788 71852 126473 144040 123788 102592 146649
19253A46649P6138n5870p3073K6488K189L7140K7189q1251n1278o1808J64857
$$ 146649 222787 166917 93844 120332 122521 159661 186850 105599 54321 -7487 157370
19242A57370L8992m1207M5464l6792m1307o5124o5194l3010R4609l6994q9346
$$ 157370 196362 155155 200619 163827 122520 57396 -7798 -40808 53801 16807 -72539
19231g2539K6856J40957J70846j33473r6405l7166J03493J48680J5898j12218
$$ -72539 -45683 95274 266120 132647 36242 -924 102569 251249 267147 154929
19221A54929p2559L4784J10680L9104K7124m5967r0114l7846k1982j02029k7480
$$ 154929 82370 117154 227834 266938 294062 248095 157981 120135 98153 -3876 -31356
19210c1356m4292k835N3832J03623O2394L4984p9217m8560Q6849J12574p2038
$$ -31356 -75648 -78483 -24651 78972 141366 176350 97133 48573 135422 247996 175958
19199A75958j0766m1063P582j6736m3522N8640J03408N787Q9428p2218j04619
$$ 175958 165192 124129 131711 114975 71453 130093 233501 239288 328716 256498 151879
19188A51879m9758m5664p4636j21223J4218J7188J10365L3618l3570N6157L4977
$$ 151879 102121 56457 -18179 -139402 -125184 -107996 2369 35987 2417 58574 93551
19177I3551j8426R4664O6394N305j47221J06969J57467P399j17556j32724J01737
$$ 93551 75125 169789 236183 241488 94267 201236 358703 366102 248546 115822 217559
19166B17559J06625q3526O2714n898k5970o2051l4521p9908P915K2127m4435l0930
$$ 217559 324184 240658 303372 297474 271504 209453 174932 95024 102939 125066 80631 49701
19154D9701m5402J6457K343K778J57060r85j8452m0151O5346Q0985m6128j25157
$$ 49701 4299 20756 23099 25877 182937 181952 163500 123349 188695 269680 223552 98395
19142I8395j03232N7006J06053J12384q1861q106O2084p2585n4605Q4999k7764
$$ 98395 -4837 52169 158222 270606 188745 180639 242723 170138 115533 200532 172768
19131A72768K83L8775k2416m2308j06848q091M4110l886J69513N1723r2922j07399
$$ 172768 173051 211826 189410 147102 40254 32163 76273 72387 241900 293623 200701 93302
19119I3302o6065q393J27371L1181M6461j59718o5974J6970o355P6059Q9355R4969
$$ 93302 27237 18844 146215 177396 223857 64139 -1835 15135 8780 84839 174194 269163
19107B69163J27075k16166j6068K9481r0994k5869J1677R5810L588j8820n3242
$$ 269163 396238 180072 164004 193485 102491 76622 88299 184109 187697 168877 115635
19096A15635P5738l1530j09653l0061L7480m8834P0704M9165J07202o3435m7630
$$ 115635 191373 159843 50190 20129 57609 8775 79479 128644 235846 172411 124781
19085A24781P4241J1142j41914k4613N1131J38144N7458j08408O6879O7132p5632
$$ 124781 199022 210164 68250 43637 94768 232912 290370 181962 248841 315973 240341
19074B40341J7128K2007o2949j5563P0517m3627l8197m718o7608q0389N9463K6542
$$ 240341 257469 279476 216527 200964 271481 227854 189657 184939 117331 36942 96405 122947
19062A22947n2110q9821M5128M3800O2592M5609p960K5352J09014L2958q222J527
$$ 122947 70837 -18984 26144 69944 132536 178145 170185 195537 304551 337509 329287 330814
19050C30814j3126n7539l2416N1646k1478j84934q2047P1317N9645M0103K1093
$$ 330814 317688 260149 227733 279379 257901 72967 -9080 62237 121882 161985 183078
19039A83078N6694j8533j36699O3513n1518m3616J7284J1760p101L6703P0907
$$ 183078 239772 221239 84540 148053 96535 52919 70203 81963 74862 111565 182472
19028A82472J38678J9726j19991M0106J3943L2090o3703j8399Q7278j21622j47148
$$ 182472 321150 340876 220885 260991 274934 307024 243321 224922 312200 190578 43430
19017D3430O2631J23380M9289N5273l9150l4087j6164K5400j32837n4854K09245
$$ 43430 106061 229441 278730 334003 294853 260766 244602 270002 137165 82311 291556
19006B91556N0067j17052K6212r545j92408N8058M1791r2787m8427J66753R9146
$$ 291556 341623 224571 250783 241238 48830 106888 148679 55892 7465 174218 273364
18995B73364K8108l9371o2268m4673l0710N9144o0214M4458Q0506O5720m7907
$$ 273364 301472 262101 199833 155160 124450 183594 123380 167838 248344 314064 266157
18984B66157j09547J1413Q1220o4335j0600K585k5757L080k7006q0862l7396K2829
$$ 266157 156610 168023 249243 184908 174308 176893 151136 154216 127210 46348 8952 31781
18972C1781P1980R3562K0612m138Q0289k7731K9687M8166M225L5150L8638P1659
$$ 31781 103761 197323 217935 213797 294086 266355 296042 344208 348433 383583 422221 493880
18960D93880j57041j25394n6025J00711J34901l6241m2422o7318j34050N631N7954
$$ 493880 336839 211445 155420 256131 391032 354791 312369 245051 111001 116632 174586
18949A74586K0836M2848L839m0994M489J2763L5967J1317j6126N1693M33L3661
$$ 174586 195422 238270 242109 201115 205604 218367 254334 265651 249525 301218 301651 335312
18937C35312k0972q9852n6033J1162k834K2938Q8J0874J31890P8231q1238j02606
$$ 335312 314340 224488 168455 179617 176783 199721 199809 210683 342573 420804 339566 236960
18925B36960j1490r9493L9702O6310j924j00182j0665Q8101L2988P5582P1397
$$ 236960 225470 125977 165679 231989 230065 129883 119218 207319 240307 315889 387286
18914C87286j2262P0573J70895J52826K52860J13151J93241K11396K16854J76051
$$ 387286 375024 445597 616492 769318 1022178 1135329 1328570 1539966 1756820 1932871
18904A932871J33529R7831R2219o6434r4596o7087k6680m7446n7833R1775O4554
$$ 1932871 2066400 2164231 2256450 2190016 2095420 2028333 2001653 1954207 1896374 1988149 2052703
18893B052703J20980J02715L1236O6532n4172q220n8698j93509k38256j59325
$$ 2052703 2173683 2276398 2307634 2374166 2319994 2311774 2253076 2059567 1821311 1661986
18883A661986k91667j79242j9057j17932j19134j54562n3465q3316o252L6187
$$ 1661986 1370319 1191077 1172020 1054088 934954 780392 726927 643611 637359 673546
18873F73546o5440k0145j0554l6950J6637k1452r0926j25074r2337j36344L7926
$$ 673546 608106 587961 577407 540457 557094 535642 444716 319642 227305 90961 128887
18862A28887Q1022q033n1933P0185N1638K4230M3432K0682j21782l9613Q8294
$$ 128887 209909 201876 149943 220128 271766 295996 339428 360110 238328 198715 287009
18851B87009j9902m1022j3705l7562K3224L0402P7707O0038j6036j15024m0820
$$ 287009 267107 226085 212380 174818 198042 228444 306151 366189 350153 235129 194309
18840A94309j0788j41567K7655J83057K20726O7746p3402K3774j3528N8296q8767
$$ 194309 183521 41954 69609 252666 473392 541138 467736 491510 477982 536278 447511
18829D47511r9954k9728N9329L0509p3560p1343p780N9499M5407O4618N9537P2197
$$ 447511 347557 317829 377158 407667 334107 262764 254984 314483 359890 424508 484045 556242
18817E56242q5817l9765J997m4639p4429J17276j2214j4572l9857m3691j4123
$$ 556242 470425 430660 432657 388018 313589 430865 418651 404079 364222 320531 306408
18806C06408j11639J0816J19628J5871o7645r8606p2292J6616Q7395l1564N44
$$ 306408 194769 205585 325213 341084 273439 174833 102541 119157 206552 174988 175532
18795A75532R0039P6524N675l6112p1852P525J63203K6842k594o0045o616m4352
$$ 175532 265571 342095 347770 311658 239806 247331 410534 437376 434782 374737 368121 323769
18783C23769l0735K826J4900L9040L7164k094n1201o9879N3436J76022L7176j09205
$$ 323769 293034 295860 310760 349800 386964 384870 333669 263790 317226 493248 530424 421219
18771D21219N1841J49532K68504N82427M89627k51289m90164l48718k87619q2561
$$ 421219 473060 622592 891096 1473523 1963150 1711861 1221697 872979 585360 502799
18761E02799R2555J71187J72835J20309Q5967L8850J07592J10332J73436K02739
$$ 502799 595354 766541 939376 1059685 1145652 1184502 1292094 1402426 1575862 1778601
18751A778601J56013o0882j74043R9512P8783o4404j11618j02698j69210j43203
$$ 1778601 1934614 1873732 1699689 1799201 1877984 1813580 1701962 1599264 1430054 1286851
18741A286851q5759o8523r7715j03901k04815j33601j21946J06314P9132j04975
$$ 1286851 1201092 1132569 1034854 930953 726138 592537 470591 576905 656037 551062
18731E51062k24519j1416Q0786P2963N9480p5183p9722J0282j6064P6158l2303
$$ 551062 326543 315127 395913 468876 528356 453173 373451 383733 367669 443827 411524
18720D11524J12387R0202q6075j15980r4167N1989O149k257m0591K28311J19727
$$ 411524 523911 614113 528038 412058 317891 369880 376029 373772 333181 561492 681219
18709F81219M9900J6646J59739R4914J6331J284J20715K86465K44569J28804p549
$$ 681219 731119 747765 907504 1002418 1018749 1020033 1140748 1427213 1671782 1800586 1793037
18698A793037n812J1675O9853L9193K1214p722j86855k83159n3830l7851j63013
$$ 1793037 1787225 1798900 1868753 1907946 1929160 1921438 1734583 1451424 1397594 1359743 1196730
18687A196730k15330n8403r4094p0045n3494O1769q7585j49936n6218M0419o0015
$$ 1196730 981400 922997 828903 758858 705364 767133 679548 529612 473394 513813 453798
18676D53798n2810j43655J0644N7555N8864O9143K2331q0601L2424P3876L7063
$$ 453798 400988 257333 267977 325532 384396 453539 475870 395269 427693 501569 538632
18665E38632m5154L9769m480M7813J05494P3971o4095j57987q4915j5723L7693
$$ 538632 493478 533247 528767 576580 682074 756045 691950 533963 449048 433325 471018
18654D71018L8970r5125r2254P4556K6297N9581J3983K7708J370M6744Q4250m6636
$$ 471018 509988 414863 322609 397165 423462 483043 497026 524734 526104 572848 657098 610462
18642F10462M985k8600l4889R9587J11573k8218n1023k92J55870L5665L8781J6119
$$ 610462 615447 586847 551958 651545 763118 734900 683877 683585 839455 875120 913901 930020
18630I30020M75P0086P4312J2697q7048j9878K5452k6051l4329j50512m9461o7758
$$ 930020 930495 1000581 1074893 1087590 1000542 980664 1006116 980065 945736 795224 745763 678005
18618F78005o6009n0749J0365P9503J22698M2038o0968P9422P4269L3974Q550
$$ 678005 611996 561247 571612 651115 773813 815851 754883 834305 908574 942548 951098
18607I51098p5463j14651l6605M2661L7071L7693R5816m6054j13946J1649L548
$$ 951098 875635 760984 724379 767040 804111 841804 937620 891566 777620 789269 792817
18596G92817n3184N2133n0116n3154L7530k6157o4008k8664N2926M0833o0152
$$ 792817 739633 791766 741650 688496 726026 699869 635861 607197 660123 700956 640804
18585F40804p7401j5913R5040R093j1450q9479j1081K5096L8593L9707O425q2749
$$ 640804 563403 547490 642530 651623 640173 550694 539613 564709 603302 643009 649434 566685
18573E66685N1238L1801K4878m2962L9923l5571M832L5673j3918l4411J0049P2315
$$ 566685 617923 649724 674602 631640 671563 635992 640824 676497 662579 628168 638217 710532
18561G10532n0098n0614K39J16726m3143j02751Q8125N297P0545J23719J8667
$$ 710532 660434 609820 610059 726785 683642 580891 669016 674313 744858 868577 887244
18550H87244j40571o8074J4939Q71P2904k5331N0477J8937j5881m2886J5725k0564
$$ 887244 746673 678599 693538 694409 767313 741982 792459 811396 795515 752629 768354 747790
18538G47790j29314J00359O8696j0570r4370L2748J46981k568K4533l8126n0955
$$ 747790 618476 718835 787531 776961 682591 715339 862320 859752 884285 846159 795204
18527G95204L2649q6247O289n7707q7085l2526Q0694j0102N3174k9844l3892J84561
$$ 795204 827853 741606 747895 690188 603103 570577 651271 641169 694343 664499 630607 815168
18515H15168K45139P8002J00885j5960J9779k0662q8086M5146n2438j2609n4989
$$ 815168 1060307 1138309 1239194 1223234 1243013 1222351 1134265 1179411 1126973 1114364 1059375
18504A059375p534M8519M79J16148Q2610L6638M5566L0738m4328l2220K9456o8788
$$ 1059375 1051841 1100360 1100839 1216987 1299597 1336235 1381801 1412539 1368211 1335991 1365447 1296659
18492A296659j4290J00937J21912L072m3634J8689J1619j5181L937P3083J58839
$$ 1296659 1282369 1383306 1505218 1508290 1464656 1483345 1494964 1479783 1483720 1556803 1715642
18481A715642K0786n1137j34967j50444M2070J57020P264o7182j17177R5708R8953
$$ 1715642 1736428 1685291 1550324 1399880 1441950 1598970 1606234 1539052 1421875 1517583 1616536
18470A616536m8176l5204K377L9290Q1641m8233m9147J10609K0721k4313M3233
$$ 1616536 1568360 1533156 1535533 1574823 1656464 1608231 1559084 1669693 1690414 1666101 1709334
18459A709334M8729L1559p1466M6079P1700J52155P668p3889k1094M8688Q5648
$$ 1709334 1758063 1789622 1718156 1764235 1835935 1988090 1995758 1921869 1900775 1949463 2035111
18448B035111P3523R117O2829J20616J36808R8603N6136O8209R2362R6026J67302
$$ 2035111 2108634 2117751 2180580 2301196 2438004 2536607 2592743 2660952 2753314 2849340 3016642
18437C016642J03811K872Q9921K14307M8865M9217Q7494P7122Q3700J41788J97872
$$ 3016642 3120453 3123325 3213246 3427553 3476418 3525635 3613129 3690251 3773951 3915739 4113611
18426D113611K27340K03012K04609L35871L30894L83884L92939M69025N39188
$$ 4113611 4340951 4543963 4748572 5084443 5415337 5799221 6192160 6661185 7200373
18417G200373N89782O64275N94797N68533N90274O60437P42176P52856Q34113
$$ 7200373 7790155 8454430 9049227 9617760 10208034 10868471 11610647 12363503 13197616
18408A3197616J030220J184787J300058J580272J982438K485224L032289L899620
$$ 13197616 14227836 15412623 16712681 18292953 20275391 22760615 25792904 29692524
18400B9692524N545805Q084086J1854939J6623355K1340566K6572036L2633660
$$ 29692524 35238329 43322415 55177354 71800709 93141275 119713311 152346971
18393A52346971L7884318L9357946L7203301L4105247K8236285J8826861Q453974
$$ 152346971 190231289 229589235 266792536 300897783 329134068 347960929 356414903
18386C56414903j820720j0792693j4537327j3975602j3170760r359822L76794
$$ 356414903 354594183 343801490 329264163 315288561 302117801 292757979 293134773
18379B93134773J0598407J5457372J6581508J7158752J3795276N451243m812451
$$ 293134773 303733180 319190552 335772060 352930812 366726088 372177331 367364880
18372C67364880j6166550k6789747l3282614l6908486l9911949l9776000l5038351
$$ 367364880 351198330 324408583 291125969 254217483 214305534 174529534 139491183
18365A39491183k8784232k3667258j8816769j4006516j0170747p394853n549278
$$ 139491183 110706951 87039693 68222924 54216408 44045661 36650808 31101530
18358C1101530m346515l295775k802594k325587j813321j509130j227264r05955
$$ 31101530 26755015 23459240 20656646 18331059 16517738 15008608 13781344 12875389
18350A2875389q83155r98287r17993p41893p71403p54352o42182o47832o61036
$$ 12875389 11992234 10993947 10075954 9334061 8562658 7808306 7166124 6518292 5857256
18341E857256n75291n44198m85520m12788m05902m06946k04364k61349k21907
$$ 5857256 5281965 4737767 4252247 3839459 3433557 3026611 2822247 2560898 2338991
18332B338991k04931k44596p1852j29589j01228o1975m6051j2938M8579o305l629
$$ 2338991 2134060 1889464 1817612 1688023 1586795 1524820 1478769 1465831 1514410 1508105 1504476
18321A504476n1416r7540O0839O7721l6796q5804l9311o0406o5538n3786j2474
$$ 1504476 1453060 1355520 1416359 1484080 1447284 1361480 1322169 1261763 1196225 1142439 1129965
18310A129965J3440J00627M0447m1558l6290M0666J47736n5932L4319J39764k3140
$$ 1129965 1143405 1244032 1284479 1242921 1206631 1247297 1395033 1339101 1373420 1513184 1490044
18299A490044p6912Q842J36324K25265K3048j33799j54446p2030P0179p7745j166
$$ 1490044 1413132 1421974 1558298 1783563 1806611 1672812 1518366 1446336 1516515 1438770 1437604
18288A437604J5661J18527J68865O631o1090J19737j0481J00654L7360p5528o3520
$$ 1437604 1453265 1571792 1740657 1747288 1686198 1805935 1795454 1896108 1933468 1857940 1794420
18277A794420K0557M0027J10097R0183J60049K3991J2855J22101J02217J5780
$$ 1794420 1814977 1855004 1965101 2055284 2215333 2239324 2252179 2374280 2476497 2492277
18267B492277K03103J42803J44951K56093L13071K87139M36003O10608N13068
$$ 2492277 2695380 2838183 2983134 3239227 3552298 3839437 4275440 4886048 5399116
18258E399116K11162L03127K88613L70222M26805N68664M91531L71216L64909
$$ 5399116 5610278 5913405 6202018 6572240 6999045 7567709 8059240 8430456 8795365
18249H795365L71436O00109Q82742J134305J260525J611025K033061K939971M439052
$$ 8795365 9166801 9766910 10649652 11783957 13044482 14655507 16688568 19628539 24067591
18240B4067591O493367J0108187J6089654K1618706K1254329J7705057J6064361
$$ 24067591 30560958 40669145 56758799 78377505 99631834 117336891 133401252
18233A33401252K0983027L6885790M3060457K4153771N597716j2147307p946024
$$ 133401252 154384279 191270069 234330526 258484297 264082013 251934706 243988682
18226B43988682J4479886J1279372r113217k8403044m3408093l2375166j7307205
$$ 243988682 258468568 269747940 260634723 232231679 188823586 156448420 139141215
18219A39141215j5072612j8010776k2255370k1882178j5740879r906520o300177
$$ 139141215 124068603 106057827 83802457 61920279 46179400 36272880 29972703
18212B9972703m170352l077636k449482j868248j264144q10712n10547k28961
$$ 29972703 25802351 22724715 20275233 18406985 17142841 16332129 15821582 15592621
18204A5592621m42132l83093j18205j0184J89402J73368J46119K62596L35473
$$ 15592621 15150489 14767396 14649191 14639007 14828409 15001777 15147896 15410492 15745965
18195A5745965O44655J010276J384492J789633K438950L783380N457322P862760
$$ 15745965 16390620 17400896 18785388 20575021 23013971 26797351 32254673 40117433
18187D0117433J2398416J9531890K5964754K5017134K0513841J8981869K5624999
$$ 40117433 52515849 72047739 98012493 123029627 143543468 162525337 188150336
18180A88150336M4440103M9775882K6963318N276758j5167079q427037J7270258
$$ 188150336 232590439 282366321 309329639 314606397 299439318 291012281 308282539
18173C08282539J1786470j2138924l5024008n1106251l7023558k0265169j8199051
$$ 308282539 320069009 307930085 272906077 221799826 184776268 164511099 146312048
18166A46312048k1904566k6779185k5884766j8729347j1933121p720493n276574
$$ 146312048 124407482 97628297 71743531 53014184 41081063 33360570 28083996
18159B8083996l779724l029194k418715j875340j555734j281818j132437j198510
$$ 28083996 24304272 21275078 18856363 16981023 15425289 14143471 13011034 11812524
18151A1812524j188183j184779r54989q85058o20617n43838m94794l84149m80720
$$ 11812524 10624341 9439562 8484573 7599515 6978898 6435060 5940266 5556117 5075397
18142E075397m53065l39389k41450k69265l1575j16559k37864k70822j53321j02701
$$ 5075397 4622332 4282943 4041493 3772228 3740653 3624094 3386230 3115408 2962087 2859386
18132B859386k8820N3575R0336j1026q6080J20361K76038K60064L41870L65530
$$ 2859386 2830566 2884141 2974477 2963451 2877371 2997732 3273770 3533834 3875704 4241234
18122D241234L19550N06227P34599R73056J562052K425567L126320M278476P073181
$$ 4241234 4560784 5067011 5801610 6774666 8336718 10762285 13888605 18167081 25240262
18113B5240262J2473893K3205264M7576388R4833131R9608469m3758732j12002149
$$ 25240262 37714155 60919419 108495807 203328938 302937407 259178675 147176526
18106A47176526o5643385l0453230j5362997r007084n973911m146326l012631
$$ 147176526 81533141 51079911 35716914 26709830 20735919 16589593 13576962
18099A3576962k191477j864155j673598j447161j116514p69814n15779n33691
$$ 13576962 11385485 9521330 7847732 6400571 5284057 4514243 3998464 3464773
18091C464773m07687k05992j75216l64915m05795k48976k06485j28860j00843
$$ 3464773 3057086 2851094 2675878 2310963 1905168 1656192 1449707 1320847 1220004
18082A220004r3038j65407j74902L6328j59860q7944J45655l5566o6899Q469Q7837
$$ 1220004 1126966 961559 786657 822985 663125 575181 720836 685270 618371 626840 714677
18071G14677j61984k8344k885j520p860j42950j22487k5748N0237L7900j9811
$$ 714677 552693 524349 521464 519944 512084 369134 246647 220899 271136 309036 289225
18060B89225p2135j23856j18352m8836l5627O5467n890J5353n5540P7943r737
$$ 289225 217090 93234 -25118 -73954 -109581 -44114 -50004 -34651 -90191 -12248 -21985
18049b1985M6499J10420N9132l4109R385Q6624k1635L217P3626Q1194j19519o0165
$$ -21985 24514 134934 194066 159957 169342 255966 234331 237548 311174 392368 272849 212684
18037B12684Q083j23558j8442J11780M268j8150l5759m1764l013m4707j6536J03781
$$ 212684 220767 97209 78767 190547 194815 176665 140906 99142 96129 51422 34886 138667
18025A38667R7182m2261J2845l588o2005j8343n0701j04504J2935L4645K0747
$$ 138667 235849 193588 206433 202845 140840 122497 71796 -32708 -19773 14872 35619
18014C5619M0947p601K6580L9169N8263M8478j09593j134P5922j53710k027L8883
$$ 35619 76566 68965 95545 134714 192977 241455 131862 130728 206650 52940 50913 89796
18002H9796O674L171j20119j27989m5448N5906k8110Q625l9989j3974N7891O9811
$$ 89796 96470 99641 -20478 -148467 -193915 -138009 -166119 -157494 -197483 -211457 -153566 -83755
17990h3755j6339J19068j79125j16645M8099K1815O3841O9257N6347N0158M9867
$$ -83755 -100094 18974 -160151 -276796 -228697 -206882 -143041 -73784 -17437 32721 82588
17979H2588J3817o0746o7079n119k7749J8286N6041J3968P15N1433K3672p3380
$$ 82588 96405 35659 -31420 -36539 -64288 -46002 10039 24007 24722 76155 99827 26447
17967B6447j4139K7863N4349q0386r742L4571q5898l3039m8606l982O7827M8450
$$ 26447 12308 40171 94520 14134 4392 38963 -46935 -79974 -128580 -132562 -64735 -16285
17955a6285L9619P970n9172o8535j7845N3259r938m5072k8898K3542K8639j3609
$$ -16285 23334 31304 -27868 -96403 -114248 -60989 -70927 -115999 -144897 -121355 -92716 -106325
17943a06325l3248Q941M3993K40191n364j72896r0097P8129P2516k1778o6216
$$ -106325 -139573 -130632 -86639 153552 148188 -24708 -114805 -36676 35840 14062 -52154
17932e2154m9756l668l8797n969L7866o3308l0709L1404J0751n0899J9337q2681
$$ -52154 -101910 -105578 -144375 -150344 -112478 -175786 -206495 -175091 -164340 -215239 -195902 -278583
17920b78583Q6551J41842K4861K5498J55146J4639k0185j06217J9495M2577M3804
$$ -278583 -192032 -50190 -25329 169 155315 169954 149769 43552 63047 105624 149428
17909A49428M9110J0736m0520J8411J54015N0433k8871q7249o9479o0060J0755
$$ 149428 198538 209274 168754 187165 341180 391613 362742 275493 206014 145954 156709
17898A56709L0494k753p741L6594J213l6571p6224j35883j2257j3386L3616J61273
$$ 156709 187203 184450 176709 213303 214516 177945 101721 -34162 -46419 -59805 -26189 135084
17886A35084J47341J01617p9631m1288j9450K1992m4477J5010O8997J17398P5790
$$ 135084 282425 384042 304411 263123 243673 265665 221188 236198 305195 422593 498383
17875D98383J40477K27927J67121J45022J91466K16755K25371K32125O6590p4726
$$ 498383 638860 866787 1033908 1178930 1370396 1587151 1812522 2044647 2111237 2036511
17865B036511j17814o9048k2738m330J1568q3460N9475L4412R3405R6949K32357
$$ 2036511 1918697 1849649 1826911 1822581 1834149 1750689 1810164 1844576 1937981 2034930 2267287
17854B267287J21509n4316j43276j06634j54918k63283j60595j14587k62757l36540
$$ 2267287 2388796 2334480 2191204 2084570 1929652 1666369 1505774 1391187 1128430 791890
17844G91890j57158j6226l2310l3591o8834l3096P939j10267k5492p5102q3064
$$ 791890 634732 618506 586196 552605 483771 450675 458614 348347 322855 247753 164689
17833A64689M1887N8483k3718j1175r0276P6811n7816j04527R6231K5729j6515
$$ 164689 206576 265059 241341 230166 139890 216701 158885 54358 150589 176318 159803
17822A59803p101k974J0081j01982L4615J8736R345r382Q3242P9578j38696j31868
$$ 159803 152702 149728 159809 57827 92442 111178 120523 111141 194383 273961 135265 3397
17810C397N2499R017l9362r2730J2974m1797m2734O890O233Q1659O3630J18924
$$ 3397 55896 64913 25551 -67179 -54205 -96002 -138736 -131846 -125613 -43954 19676 138600
17798A38600o8424L011K14322P4751j45175j15029q393l6586p9901J7466N3907
$$ 138600 70176 73187 287509 362260 217085 102056 93663 57077 -22824 -5358 48549
17787D8549J6464l013J1112m8233J80490Q0965O0803l6477j43952m8803m9090
$$ 48549 65013 62000 73112 24879 205369 286334 347137 310660 166708 117905 68815
17776F8815J58437N8192q6528q5738j7817J16839J07938J12573M3977Q824k850
$$ 68815 227252 285444 198916 113178 95361 212200 320138 432711 476688 485512 482662
17765D82662r0110j4886m1205j13421Q5859J8823R8099k5509n5688l7718P4173
$$ 482662 392552 377666 336461 223040 308899 327722 425821 400312 344624 306906 381079
17754C81079N3522Q550p4310l6780L8150N3699L2056O0803K9138n2517l2939J05366
$$ 381079 434601 443151 368841 332061 370211 423910 455966 516769 545907 493390 460451 565817
17742E65817L4276k9859Q02r8891P0915N3481k963n446r5238j3862M5928J17411
$$ 565817 600093 570234 571036 472145 543060 596541 593578 588132 492894 479032 524960 642371
17730F42371J33512J826m57l0113j330K6601N0436j0758J4086k8901k0766O1215
$$ 642371 775883 777709 777252 747139 745809 772410 822846 812088 826174 797273 776507 837722
17718H37722J89035J13642J04183R9789K3655J36414K48896J25327J15978R9548
$$ 837722 1026757 1140399 1244582 1344371 1368026 1504440 1753336 1878663 1994641 2094189
17708B094189n7470r8598p0354N1883m6071O3746j1513q1112m5507J38610J23437
$$ 2094189 2036719 1938121 1867767 1919650 1873579 1937325 1925812 1844700 1799193 1937803 2061240
17697B061240L8498Q8101J61662Q6736J46008J24200K86261K76693J75502O9448
$$ 2061240 2099738 2187839 2349501 2436237 2582245 2706445 2992706 3269399 3444901 3514349
17687C514349N1950J30760K49348J70043M6295K25455K69081K86552L26493M05252
$$ 3514349 3566299 3697059 3946407 4116450 4162745 4388200 4657281 4943833 5270326 5675578
17677E675578M74254N67487L74349L72068M55336N98767Q33065P95881Q88998
$$ 5675578 6149832 6717319 7091668 7463736 7919072 8517839 9350904 10146785 11035783
17668A1035783J217480J550551J903716K879605M595975O935431J0661699J5396505
$$ 11035783 12253263 13803814 15707530 18587135 23183110 30118541 40780240 56176745
17660E6176745J8697984J7013191J4768170K0422763L0915177K9112518Q365564
$$ 56176745 74874729 91887920 106656090 127078853 157994030 187106548 195472112
17653A95472112o626519Q26989J2047842L836915j6018885j9525391o433096K838533
$$ 195472112 188845593 189672582 201720424 205557339 189538454 170013063 163579967 166418500
17645A66418500n70755m123337N234159J9072841J6556491k724115j1410893r87542
$$ 166418500 165847745 161724408 166958567 186031408 202587899 199863784 188452891 187465349
17637A87465349O398818p365268k7015980k9146970j9619836j4664710j6472531
$$ 187465349 193864167 186498899 159482919 130335949 110716113 96051403 79578872
17630G9578872j7550285j4115228r629926o490036m522618k979003k049054j877853
$$ 79578872 62028587 47913359 38283433 31793397 27270779 24291776 22242722 20364869
17622B0364869j457207q91620n45599n31884m35606j00032L18808M87998Q78611
$$ 20364869 18907662 18016042 17470443 16938559 16502953 16402921 16721729 17209727 18088338
17613A8088338J636757L250965N356266Q234003J2207986J5107894J3682611J1890661
$$ 18088338 19725095 22976060 28332326 36566329 48774315 63882209 77564820 89455481
17605H9455481J6994274K5889710K3948353O257546n615967J299375J0336168
$$ 89455481 106449755 132339465 156287818 162545364 156929397 158228772 168564940
17598A68564940K617003j4048797j6149446m996085K283526r96829l712809M789407
$$ 168564940 171181943 157133146 140983700 135987615 138271141 137274312 133561503 138350910
17590A38350910J6059529J3098608l371852r811206l23893N460259o911471k3379997
$$ 138350910 154410439 167509047 164137195 154325989 154002096 159462355 152550884 129170887
17582A29170887k4287840j6156313j2286112j4216455j5032239j2157848q323853
$$ 129170887 104883047 88726734 76440622 62224167 47191928 35034080 26710227
17575B6710227n413923l796503k736427k087454j561467j297700j025844q28636
$$ 26710227 21296304 17499801 14763374 12675920 11114453 9816753 8790909 7962273
17567G962273q53362r54765o06785l59896m11945o18229m75162l26917j62394
$$ 7962273 7108911 6154146 5547361 5187465 4775520 4157291 3682129 3355212 3192818
17558C192818k15948j66419r6603l10117k80321k30039j12604k3622m6160j03856
$$ 3192818 2976870 2810451 2713848 2403731 2123410 1893371 1780767 1757145 1710985 1607129
17548A607129k45763k15013j70418n4340j58467j71223l4165k6878p5120n7371
$$ 1607129 1361366 1146353 975935 921595 763128 591905 557740 530862 455742 398371
17538C98371m4080n0432r5686l4221M0758J1517k3521N6251k7579k5058K9240
$$ 398371 354291 303859 208173 173952 214710 226227 202706 258957 231378 206320 235560
17527B35560j5879r6875Q0465j4893K0527J06177j322j5397q7079p744k6638j53541
$$ 235560 219681 122806 203271 188378 208905 315082 313760 298363 211284 203540 176902 23361
17515B3361L8360K2829J2540k327M3728L0863q5485q7799m3495L3289J22127J22707
$$ 23361 61721 84550 97090 94763 138491 169354 83869 -3930 -47425 -14136 107991 230698
17503B30698l4284l6440r170L0990O1505q2848j54516j61088m4111K06529J09060
$$ 230698 196414 159974 150804 181794 243299 160451 5935 -155153 -199264 7265 116325
17492A16325N1984m8651l7728p4772q5307n42N7470Q532j11830k5632K8965j7258
$$ 116325 168309 119658 81930 7158 -78149 -78691 -21221 -12689 -124519 -150151 -121186 -138444
17480a38444J35662Q5106n4546j4423j09290j70927l0582j88J0392J01478J06987
$$ -138444 -2782 82324 27778 13355 -95935 -266862 -297444 -297632 -287240 -185762 -78775
17469g8775l6601n3315J8796r3177k7333J58902J89375k025j94974l2926L9680
$$ -78775 -115376 -168691 -149895 -243072 -270405 -111503 77872 75847 -119127 -152053 -112373
17458a12373J00335r446Q807N2890r2385j82800l9170J86831L7339O0266J02290
$$ -112373 -12038 -21484 -12677 40213 -52172 -234972 -274142 -87311 -49972 10294 112584
17447A12584J17827J27274J32505L48983N41447j9451n47737m24146j82194l5595
$$ 112584 230411 357685 490190 839173 1380620 1361169 813432 389286 207092 171497
17437A71497j18482q7632p3095N4363O7145j8425j46522j25157j28018J9219J57171
$$ 171497 53015 -34617 -107712 -53349 13796 -4629 -151151 -276308 -404326 -385107 -227936
17426b27936J10175Q1643N3976m4037m3805o5458j16576k8411J1862K8765J08307
$$ -227936 -117761 -36118 17858 -26179 -69984 -135442 -252018 -280429 -268567 -239802 -131495
17415a31495J7103M9357j29296j59823n0545K1924P9666L9348O6543Q5454o8578
$$ -131495 -114392 -65035 -194331 -354154 -404699 -382775 -303109 -263761 -197218 -111764 -180342
17404a80342k9643R6983q53o4922j6057k704M9939j07416k2654O4650M776M4497
$$ -180342 -209985 -113002 -113855 -178777 -194834 -197538 -147599 -255015 -277669 -213019 -208243 -163746
17392a63746l4737M9283l4293k4473J40144L987j80463p7916O7449J31651N1590
$$ -163746 -198483 -149200 -183493 -207966 -67822 -63835 -244298 -322214 -254765 -123114 -71524
17381g1524j94395j19976O956L5872O9881M8542r2855P9229M0611n8650Q2810
$$ -71524 -265919 -385895 -378939 -343067 -273186 -224644 -317499 -238270 -197659 -256309 -173499
17370a73499O2737j05526N2856K6611J2117l290r0504o4095m5311K6083L5096
$$ -173499 -110762 -216288 -163432 -136821 -124704 -127994 -218498 -282593 -327904 -301821 -266725
17359b66725r743k5236j4830L4887n4334m0644o87m9691O7726R3510o2888K0459
$$ -266725 -276468 -301704 -316534 -281647 -335981 -376625 -377312 -427003 -359277 -265767 -328655 -308196
17347c08196M1401j2203q519k4470j0078P2516J1587P4290j6845M5353M4769p6782
$$ -308196 -266795 -278998 -287517 -311987 -322065 -249549 -237962 -163672 -180517 -135164 -90395 -167177
17335a67177j06721P5429L6079j1363k3408m5469k2596J0448M6384J3192r4387
$$ -167177 -273898 -198469 -162390 -173753 -197161 -242630 -265226 -254778 -208394 -195202 -289589
17324b89589P0412L3097J2957J6240o6260q0284M1744P5285J9337m1744r5318
$$ -289589 -219177 -186080 -173123 -156883 -223143 -303427 -261683 -186398 -167061 -208805 -304123
17313c04123P239J29274J48117M1467j3124p6460m812J5909o1817J2417M1992
$$ -304123 -296884 -167610 -19493 21974 8850 -67610 -72422 -56513 -118330 -105913 -63921
17302f3921q4472m4634L3833R9805j7004j00175l7558l0100l6454j39954M9742
$$ -63921 -148393 -193027 -159194 -59389 -76393 -176568 -214126 -244226 -280680 -420634 -370892
17291c70892J62993k9512p8580j8964J23015J06214j0128J13148k6080o5832o6188
$$ -370892 -207899 -237411 -315991 -334955 -211940 -105726 -115854 -2706 -28786 -94618 -160806
17280a60806O9409J14669j01190l2554J61619k0131j90761p6206K5054M3543o0325
$$ -160806 -91397 23272 -77918 -110472 51147 31016 -159745 -235951 -210897 -167354 -227679
17269b27679j9715j05860M6385M1530N8034L6366m8665l0345K6482j4181O9725
$$ -227679 -247394 -353254 -306869 -265339 -207305 -170939 -219604 -249949 -223467 -237648 -167923
17258a67923M9428l5646j29026m050M7250N6044P9769j25886j16835q2394Q9812
$$ -167923 -118495 -154141 -283167 -287217 -239967 -183923 -104154 -230040 -346875 -429269 -339457
17247c39457J23228k0744r927m8820J0419O3216Q1510K8389n7396k0782J11004
$$ -339457 -216229 -236973 -246900 -295720 -285301 -222085 -140575 -112186 -169582 -190364 -79360
17236g9360O7654q0570p5277l124m1138j09183N94M2374J3099N8074j4048m6020
$$ -79360 -11706 -92276 -167553 -170677 -211815 -320998 -320404 -278030 -264931 -206857 -220905 -266925
17224b66925Q3962K1199N4033K571O7117q592j38621o1217j1639n0939J5221J11373
$$ -266925 -182963 -161764 -107731 -105160 -38043 -46635 -185256 -246473 -258112 -309051 -293830 -182457
17212a82457J0962o6969k2226K7267J22248P7505k3755p4365j12223r4662j7093
$$ -182457 -171495 -238464 -260690 -233423 -111175 -33670 -57425 -131790 -244013 -338675 -355768
17201c55768R6332P949r0915m2107O8998o1967K4222J51406j21569r3139J17812
$$ -355768 -259436 -251487 -342402 -384509 -315511 -377478 -353256 -201850 -323419 -416558 -298746
17190b98746K6726q0843J7402O3419K3449L4583Q3537O1037L7970r1478m6673
$$ -298746 -272020 -352863 -335461 -272042 -248593 -214010 -130473 -69436 -31466 -122944 -169617
17179a69617j1904K0615Q2456n1459l8188j33705m2882L5948K7726M2035N7213
$$ -169617 -181521 -160906 -78450 -129909 -168097 -301802 -344684 -308736 -281010 -238975 -181762
17168a81762k4383k8315J04228N0100k542n189j5514O983q9836j05011J4696P7873
$$ -181762 -206145 -234460 -130232 -80132 -82674 -87863 -103377 -96394 -186230 -291241 -276545 -198672
17156a98672m7597L7661R0010P6407P7214o7619L1316K0790q5607N6469j13969
$$ -198672 -246269 -208608 -118598 -42191 35023 -32596 -1280 19510 -66097 -9628 -123597
17145a23597j61682J08367R0776J13950K6372L1728n851K749k1784j88769N9780
$$ -123597 -285279 -176912 -86136 27814 54186 85914 80063 82812 61028 -127741 -67961
17134f7961J45291Q7363K04q810J03418k3991R3662P9090O9759J89616K18569
$$ -67961 77330 164693 164897 156087 259505 235514 329176 408266 478025 667641 886210
17123H86210l9722j15868J84354J00531j01302l9404m0237j17848q0099l1725
$$ 886210 846488 730620 914974 1015505 914203 874799 834562 716714 636615 604890
17113F04890J02103J73520J62086k698m3094M3054O4602l6766j87765k24346j01495
$$ 604890 706993 880513 1042599 1039901 996807 1039861 1104463 1067697 879932 655586 554091
17102E54091q5209j73890j34034l7469j44255r5879L1998N0877P6548K3513N6543
$$ 554091 468882 294992 160958 123489 -20766 -116645 -84647 -33770 42778 66291 122834
17091A22834P420j44980m2503J3722n0535q3040r069J07808J3985K3613K8103
$$ 122834 130254 -14726 -57229 -43507 -94042 -177082 -186151 -78343 -64358 -40745 -12642
17080a2642Q4408J85418K9846J21453J01753P7465P7828N3397l7877P368Q2553
$$ -12642 71766 257184 287030 408483 510236 587701 665529 718926 681049 688417 770970
17069G70970J16088n1357r6677n2270k8796K6505j3310o6229k9658N8740J10274
$$ 770970 887058 835701 739024 686754 657958 684463 671153 604924 575266 634006 744280
17058G44280n2099k3817j3722j06430q098n7575j15204o2204j08147l6952m1253
$$ 744280 692181 668364 654642 548212 540114 482539 367335 305131 196984 160032 118779
17047A18779j57244l4357J10310Q027m854J5753Q5344L2457Q1662n8450m7628
$$ 118779 -38465 -72822 37488 45515 40661 56414 141758 174215 255877 197427 149799
17036A49799R781r3282j39336n3166j4783K6512l3650m0811j06515L4286R7275
$$ 149799 159580 66298 -73038 -126204 -140987 -114475 -148125 -188936 -295451 -261165 -163890
17025a63890J25873J06879J5638J6527k4580j33221J6879P0139k2696o3203j00095
$$ -163890 -38017 68862 84500 101027 76447 -56774 -39895 30244 7548 -55655 -155750
17014a55750k0231O6077J6670J6976P961P5991L4278j3675L5520p6231q0313j8708
$$ -155750 -175981 -109904 -93234 -76258 -68297 7694 41972 28297 63817 -12414 -92727 -111435
17002a11435R0036J5030O3980q4274l5545j386J12283P2160k5745p7006R046J3628
$$ -111435 -21399 -6369 57611 -26663 -62208 -63594 48689 120849 95104 18098 27144 40772
16990D0772m2257K2742j5771N6159k9531l6044o9198r6558l5837j8021O8557O2712
$$ 40772 -1485 21257 5486 61645 32114 -3930 -73128 -169686 -205523 -223544 -154987 -92275
16978i2275J06313p607J9801L4576r5501n4680R5630l4772k7266n4695n5387j1106
$$ -92275 14038 6431 26232 60808 -34693 -89373 6257 -28515 -55781 -110476 -165863 -176969
16966a76969N6284O2997j30923k5964Q0300k6485o2448J860Q7725R6786Q1089
$$ -176969 -120685 -57688 -188611 -214575 -134275 -160760 -223208 -221348 -133623 -36837 44252
16955D4252j07990r8634K5077J7289k851N952Q9974n5549j25558k3109j09298
$$ 44252 -63738 -162372 -137295 -120006 -122857 -116905 -26931 -82480 -208038 -231147 -340445
16944c40445m4775J34226J18982J27325l7111r0645M1664m206q3559k968Q4027
$$ -340445 -385220 -250994 -132012 -4687 -41798 -132443 -90779 -94985 -178544 -181512 -97485
16933i7485J00573n2224j35246n012k8591K6653M4897m56P7424O3652l301o5394
$$ -97485 3088 -49136 -184382 -189394 -217985 -191332 -146435 -146891 -69467 -5815 -9116 -74510
16921g4510m0867r7907M1228O1467O1601N6624K364r6948j98492K8752Q0723P3057
$$ -74510 -115377 -213284 -172056 -110589 -48988 7636 10000 -86948 -285440 -256688 -175965 -102908
16909a02908O1946N0818Q031m1271q2591j0753J1011j14087R423O7543R6910j1002
$$ -102908 -40962 9856 17887 -23384 -105975 -116728 -105717 -219804 -210381 -142838 -45928 -56930
16897e6930k2175p3382q0945L5953R6495N4955k2991l4869m9461p7846Q3871q236
$$ -56930 -79105 -152487 -233432 -197479 -100984 -46029 -69020 -103889 -153350 -231196 -147325 -155561
16885a55561m3369n143R8702L3455q4078K4218J0906M392K9258L408o2646j9738
$$ -155561 -198930 -204073 -105371 -71916 -155994 -131776 -120870 -116478 -87220 -83812 -146458 -166196
16873a66196N0446Q545K0507q887K086l1865o2855J2474L2006N8514r0644J5935
$$ -166196 -115750 -107205 -86698 -95585 -93499 -125364 -188219 -175745 -143739 -85225 -175869 -159934
16861a59934J98764K5923m1067n017N3972m973R3199r862P6473q8863j38120O0454
$$ -159934 38830 64753 23686 18669 72641 67668 160867 151005 227478 138615 495 60949
16849F0949J46720J2955j17770n9421k1137j0629j11275n4198P3956O5067N7543
$$ 60949 207669 220624 102854 43433 22296 11667 -99608 -153806 -79850 -14783 42760
16838D2760M40j53715K1861R1394M8469M9667n2906o2194r86o1063K8041J09627
$$ 42760 43200 -110515 -88654 2740 51209 100876 47970 -14224 -15210 -76273 -48232 61395
16826F1395R6491m6918r8961p2706L0123Q1300N9162m7216R988P7289N8916q0403
$$ 61395 157886 110968 12007 -60699 -30576 50724 109886 62670 72658 149947 208863 128460
16814A28460j3838k1250M1345O8012p1363J3227m0906l2084k0360O2550l6161
$$ 128460 114622 93372 134717 202729 131366 144593 103687 71603 51243 113793 77632
16803G7632K026M2068R975j21078n4962l5027J1057Q6445j6504J3899K8609m1357
$$ 77632 79658 121726 131701 10623 -44339 -79366 -68309 18136 1632 15531 44140 2783
16791B783o9286O6176m3979p6923P2338N1762M429K1113j01432q2895o355O7196
$$ 2783 -66503 -327 -44306 -121229 -48891 2871 7300 28413 -73019 -155914 -162269 -95073
16779i5073N0783O6505j6403J00236K0144k3420k0587K9607P8879J04203k18392
$$ -95073 -44290 22215 5812 106048 126192 102772 82185 111792 190671 294874 76482
16768G6482j38507J09724q3714m6319j8700m3419M6759M5287L4815j16449k814
$$ 76482 -62025 47699 -36015 -82334 -101034 -144453 -97694 -52407 -17592 -134041 -136855
16757a36855j0915J21195L2659M5597R5247p0025q9911j06125N2531O9116l3909
$$ -136855 -147770 -26575 6084 51681 146928 76903 -13008 -119133 -66602 2514 -31395
16746c1395j4941M0147J5839P9833k7907n8050P6032n1165j02818J5774O1713
$$ -31395 -46336 -6189 9650 89483 61576 3526 79558 28393 -74425 -58651 3062
16735C062J14242L1417n9931j01358o2000p2504r1841O6394N1069K1076m2864
$$ 3062 117304 148721 88790 -12568 -74568 -147072 -238913 -172519 -121450 -100374 -143238
16724a43238K3119J03272k460j2699l9246J6502M144k4718J19726N8943M9319
$$ -143238 -120119 -16847 -19307 -32006 -71252 -54750 -50606 -75324 44402 103345 152664
16713A52664Q471r131j2980O377q4880k8110R437p365j43099k0494M6125k6335
$$ 152664 161135 152004 139024 145401 60521 32411 41848 34483 -108616 -129110 -82985 -109320
16701a09320K9816j7533N3942K940P3630N2060N3280k1062m5500Q4789L3504l1756
$$ -109320 -79504 -97037 -43095 -40155 33475 85535 138815 117753 72253 157042 190546 158790
16689A58790q5951o8951P402O578r4021p3880n3811q2167P7640J25962P9121N5154
$$ 158790 72839 3888 11290 17868 -76153 -150033 -203844 -286011 -208371 -82409 -3288 51866
16677E1866J83934K0373j14243j95629j39307L8331J26867K362M2401L5307j5265
$$ 51866 235800 256173 141930 -53699 -193006 -154675 -27808 -25446 16955 52262 36997
16666C6997J4462p0344J7235M5270k3244K1278j53175j25239M5416P4762P7197
$$ 36997 51459 -18885 -1650 43620 20376 41654 -111521 -236760 -191344 -116582 -39385
16655c9385N8915J08910M9483k6727j28363j0980J08830J1718j19724j5689L2780
$$ -39385 19530 128440 177923 151196 22833 11853 120683 132401 12677 -3012 29768
16644B9768j9397n439N9912O3213P1641L870o7463j46306k4110J10648Q8204K4020
$$ 29768 10371 4932 64844 128057 199698 203568 136105 -10201 -34311 76337 164541 188561
16632A88561J0297j76845p5261R8897P4826j4029m5962K7018M6506n4610m1434
$$ 188561 198858 22013 -53248 45649 120475 106446 60484 87502 134008 79398 37964
16621C7964N018k1521J0507o9364j4969K1307M9187Q2824l554o608J16625J6951
$$ 37964 42982 21461 31968 -37396 -52365 -31058 18129 100953 97399 90791 207416 224367
16609B24367l2854l1681K2663K3043n9755R1571j00562o4588p781J7726R9175
$$ 224367 191513 159832 182495 205538 145783 237354 136792 72204 64423 82149 181324
16598A81324L1942q5458m0477l2337O039j4513N5489J8442r997J8292O891n5890
$$ 181324 213266 127808 87331 54994 61033 46520 102009 120451 110454 128746 135637 79747
16586G9747n8135m291M2727m2417L3846n974L732P68j5342O6615l3659O3106o3054
$$ 79747 21612 17321 60048 17631 51477 45503 49235 50003 34661 101276 67617 130723 67669
16573F7669j311L1644P0823M0153N8551j80040R975Q0275L0948m9474o4527k5941
$$ 67669 66358 98002 168825 208978 267529 87489 97464 177739 208687 159213 94686 68745
16561F8745M9893K6210N1498j39797j27069J12743k4584l6012P3903Q6244m135
$$ 68745 118638 144848 196346 56549 -70520 42223 17639 -18373 55530 141774 137639
16550A37639j9646M5405n1989K1323J0584K5934p1717O590m241J30922o974l485
$$ 137639 117993 163398 111409 132732 143316 169250 97533 104123 99882 230804 223830 220345
16538B20345k5109p2921k7841J02J2891R77Q9326N7126M6977r340j7919m2186
$$ 220345 195236 122315 94474 94576 107467 108444 197770 254896 301873 292533 274614 232428
16526B32428p8438R8O1901l2082k2108J17264o3754o2994J48038O9258l1230K6267
$$ 232428 153990 154088 215989 183907 161799 279063 215309 152315 300353 369611 338381 364648
16514C64648r8335n0831k3221l3753n1272n9017K705N5858j3170K1447N1032K0803
$$ 364648 266313 215482 192261 158508 107236 48219 50924 106782 93612 115059 166091 186894
16502A86894k4501J15508Q800o7005n5523o5341p8668l2921J31535J12579l6016
$$ 186894 162393 277901 286701 219696 164173 98832 20164 -12757 118778 231357 195341
16491A95341l6932q1393O1360R8416k0045j5438k6363r152M4358l9854l6521K7535
$$ 195341 158409 77016 138376 236792 216747 201309 174946 165794 210152 170298 133777 161312
16479A61312J58518K4425k29736n8761R2951N3848j1732P89j6561N5546l0132
$$ 161312 319830 344255 114519 55758 148709 202557 190825 191614 175053 230599 200467
16468B00467N8817m2978n2260O5642K8260n1465p4967Q0909N0804K4714L9873
$$ 200467 259284 216306 164046 229688 257948 206483 131516 212425 263229 287943 327816
16457C27816J9312K0239K4264k1879j01745k7378L2086P9869J3466j8228j12107
$$ 327816 347128 367367 391631 369752 268007 240629 272715 352584 366050 347822 235715
16446B35715O8805M4221j04723l1792K2362M238j990L0707L9666M8566j7654q4030
$$ 235715 304520 348741 244018 212226 234588 238826 236836 267543 307209 355775 338121 254091
16434B54091p4076l629O813O8358J38728J7296j04798N3015N9297k8009J0314
$$ 254091 180015 176386 183199 251557 390285 407581 302783 355798 415095 387086 397400
16423C97400N063J8485j69260j29550R9005P9646o6947q3948J8385M2180l2709
$$ 397400 402463 420948 251688 122138 221143 300789 233842 149894 168279 210459 177750
16412A77750J313Q0769J28820K0188l9153j54359j6304K8441p148J5465j17202
$$ 177750 179063 259832 388652 408840 369687 215328 199024 227465 220317 235782 118580
16401A18580K0560J92849L2672j15295O4805R2802j6301j2388k0752k8353k0049
$$ 118580 139140 331989 364661 249366 314171 406973 390672 378284 357532 329179 309130
16390C09130p805j3101j5835R83Q6959j290j9557J5915j71538o8797Q5659J61838
$$ 309130 301325 288224 272389 273372 360331 359041 339484 355399 183861 115064 200723 362561
16378C62561N6352J21197k1828o3658q2789J4008P6057J5539K5910N062P5901
$$ 362561 418913 540110 518282 454624 371835 385843 461900 477439 503349 508411 584312
16367E84312k9574m3522l8432N651q9773N4347J1420p7894k2695N6385l0624J07657
$$ 584312 554738 511216 472784 478435 388662 443009 454429 376535 353840 410225 379601 487258
16355D87258J16690L9237l1365n5823J1811p1494m8665l0534J392J6996k3075
$$ 487258 603948 643185 611820 555997 567808 496314 447649 417115 418507 435503 412428
16344D12428M1912Q5170l770L891M9810L7709j05945l9671N219M6887n0178J50111
$$ 412428 454340 539510 535740 539631 589441 627150 521205 481534 486753 533640 483462 633573
16332F33573Q1195L2346k4657o4021k8565m8799n9747m5146J2489P5064O1146
$$ 633573 714768 747114 722457 658436 629871 581072 521325 476179 488668 563732 624878
16321F24878M4265M3677r2320p3159m5358N581P0338j4647r074O4493K2072j6242
$$ 624878 669143 712820 620500 547341 501983 507564 577902 563255 554181 618674 640746 624504
16309F24504o754O371P3888k0295M4866j7324o1960k5421m2384l5734J67186J12228
$$ 624504 617750 624121 698009 677714 722580 705256 643296 617875 575491 539757 706943 819171
16297H19171O5672o6568n7987J2873M8707l4658j55899l4281N7684J42663M1192
$$ 819171 884843 818275 760288 773161 821868 787210 631311 597030 654714 797377 838569
16286H38569n0638j8633l9179Q4512o6192j10994l938R3456N9975q5552K4167
$$ 838569 787931 769298 730119 814631 748439 637445 633507 726963 786938 701386 725553
16275G25553Q2320L4042J9298L6814l8596j43201q9207l9782O0864J62413J54200
$$ 725553 807873 841915 861213 898027 859431 716230 627023 587241 648105 810518 964718
16264I64718p4686j16295k909L3263N2084R282R4474j23489n3686n7788m0130
$$ 964718 890032 773737 770828 804091 856175 865457 959931 836442 782756 724968 684838
16253F84838p9781l3895R8603J11501J37905N822J75407K4003j65316r9045N2358
$$ 684838 605057 571162 669765 781266 919171 924993 1100400 1124403 959087 860042 912400
16242I12400N9778L7551n7476l1455J10537J8023k3786J7580O8748K7443O4342
$$ 912400 972178 1009729 952253 920798 1031335 1049358 1025572 1043152 1111900 1139343 1203685
16231A203685P9033O9263N9894L0864j03268r7278n286P9399K3920m648P1451
$$ 1203685 1282718 1351981 1411875 1442739 1339471 1242193 1236907 1316306 1340226 1335578 1407029
16220A407029O7666J09820J92061J04855n1832J20943k4949j4524j48287k21253
$$ 1407029 1474695 1584515 1776576 1881431 1829599 1950542 1925593 1911069 1762782 1541529
16210A541529k22845Q969J33059k6147Q8981K4640j2000k1356j5569J02544J65225
$$ 1541529 1318684 1327653 1460712 1434565 1523546 1548186 1536186 1514830 1499261 1601805 1767030
16199A767030R7919R3143j02398j63270l9134l8488l1135P5566L9844o9895j54124
$$ 1767030 1864949 1958092 1855694 1692424 1653290 1614802 1583667 1659233 1699077 1629182 1475058
16188A475058J8636M2913O0245k3040o9399P1242j8308n8563l8845p470l5807
$$ 1475058 1493694 1536607 1596852 1573812 1504413 1575655 1557347 1498784 1459939 1452469 1416662
16177A416662P716P1396K7317J17344P0609O8058k5833k3574p989k7316p4862
$$ 1416662 1424378 1495774 1523091 1640435 1711044 1779102 1753269 1729695 1721706 1694390 1619528
16166A619528j33531J9101J17173L4464L6818j7135j23322q0085J56468J15154
$$ 1619528 1485997 1505098 1622271 1656735 1693553 1676418 1553096 1473011 1629479 1744633
16156A744633j2434P038k1237J33532R3685o479N7929J6124N967J22442Q167p7375
$$ 1744633 1732199 1739237 1718000 1851532 1945217 1938738 1996667 2012791 2018758 2141200 2149367 2071992
16144B071992j16635J1882J31338J25092j37555j52868j1070J06708J86116L0474
$$ 2071992 1955357 1967239 2098577 2223669 2086114 1933246 1922176 2028884 2215000 2245474
16134B245474p7923l072J2357p6086Q001O9139J19778K43O1941L541N6652R8199
$$ 2245474 2167551 2164479 2176836 2100750 2108751 2177890 2297668 2297911 2359852 2363393 2420045 2518244
16122B518244R1351m8966l2305M7005J5539P1316r406q6979P6239K2904L3887
$$ 2518244 2609595 2560629 2528324 2575329 2590868 2662184 2652778 2565799 2642038 2664942 2698829
16111B698829J42252M9324L0232J5089R7049m5309J0013l106L8990M4571K8522
$$ 2698829 2841081 2890405 2920637 2935726 3032775 2987466 2997479 2994373 3033363 3077934 3106456
16100C106456k4562o8808Q5170J08711M755K3274j8250J00134L481p9313J41968
$$ 3106456 3081894 3013086 3098256 3206967 3211722 3234996 3216746 3316880 3320361 3241048 3383016
16089C383016Q4839J09503M0583l9480r2810J6169J98837J61811O9687J52020
$$ 3383016 3467855 3577358 3617941 3578461 3485651 3501820 3700657 3862468 3932155 4084175
16079D084175J8290p4283N8784N4630K6753P2238Q6406J62393K1936N8618p4320
$$ 4084175 4102465 4028182 4086966 4141596 4168349 4240587 4326993 4489386 4511322 4569940 4495620
16068D495620O1932R2522J02833Q7386k7549J3567M8514J20064Q8799N3139J26977
$$ 4495620 4557552 4650074 4752907 4840293 4812744 4826311 4874825 4994889 5083688 5136827 5263804
16057E263804J32456K3211J01467J94110J01180m4369j3809R7844J69616J40929
$$ 5263804 5396260 5419471 5520938 5715048 5816228 5771859 5758050 5855894 6025510 6166439
16047F166439K14429K29284K15703J8625L1233R6030N4874L8236J13585Q4572
$$ 6166439 6380868 6610152 6825855 6844480 6875713 6971743 7026617 7064853 7178438 7263010
16037G263010J02358J96178J44394K00138J16024N3857J74350K53752O6966K8310
$$ 7263010 7365368 7561546 7705940 7906078 8022102 8075959 8250309 8504061 8571027 8599337
16027H599337K20860K10581J58535J21820K34163L17931K04344K54041L11512
$$ 8599337 8820197 9030778 9189313 9311133 9545296 9863227 10067571 10321612 10633124
16018A0633124K06688J54049P8401J19242K07307J95118L43980M33898K66519
$$ 10633124 10839812 10993861 11072262 11191504 11398811 11593929 11937909 12371807 12638326
16009A2638326K42024K68201J97732L33600M55029L48380L89547L30015L03972
$$ 12638326 12880350 13148551 13346283 13679883 14134912 14483292 14872839 15202854 15506826
16000A5506826L71763M35987M94851M74229L03731M30019O13268M87167M08538
$$ 15506826 15878589 16314576 16809427 17283656 17587387 18017406 18630674 19117841 19526379
15991A9526379N09767N78775N60188N12657N27783O85608O74241P32355P73475
$$ 19526379 20036146 20614921 21175109 21687766 22215549 22901157 23575398 24307753 25081228
15982B5081228O20942P68523R08602Q79676Q02865P63192R04051R75024J054411
$$ 25081228 25702170 26470693 27379295 28258971 29061836 29825028 30729079 31704103 32758514
15973C2758514J244975J134991J107766J167746J224998J200066J280095J274269
$$ 32758514 34003489 35138480 36246246 37413992 38638990 39839056 41119151 42393420
15965D2393420J350340J485092J563288J595758J753155J671052J698614J773403
$$ 42393420 43743760 45228852 46792140 48387898 50141053 51812105 53510719 55284122
15957E5284122J747453J818448J891808J767560J818221K002866K044984K005840
$$ 55284122 57031575 58850023 60741831 62509391 64327612 66330478 68375462 70381302
15949G0381302J935076J935710J936612J943148J894322J889394J687924J714173
$$ 70381302 72316378 74252088 76188700 78131848 80026170 81915564 83603488 85317661
15941H5317661J708463J820769J630483J527884J378939J213131J185839J210747
$$ 85317661 87026124 88846893 90477376 92005260 93384199 94597330 95783169 96993916
15933I6993916J036354Q70454O77700O62832N79957L93815L86572O4898r3994
$$ 96993916 98030270 98900724 99578424 100241256 100821213 101215028 101601600 101666498 101572504
15924A01572504k26874k34623l71576n37159p34274q66633r87290j015685j209533
$$ 101572504 101345630 101111007 100739431 100202272 99467998 98601365 97614075 96598390 95388857
15915I5388857j427783j391913j419741j589346j667655j751608j608738j845692
$$ 95388857 93961074 92569161 91149420 89560074 87892419 86140811 84532073 82686381
15907H2686381j915086j786395j808135j882715k008753k027547j946250k048582
$$ 82686381 80771295 78984900 77176765 75294050 73285297 71257750 69311500 67262918
15899F7262918k021031j924628j849246j879321j923738j769713j727547j774978
$$ 67262918 65241887 63317259 61468013 59588692 57664954 55895241 54167694 52392716
15891E2392716j648168j525430j660591j715415j538556j405246j330265j340472
$$ 52392716 50744548 49219118 47558527 45843112 44304556 42899310 41569045 40228573
15883D0228573j306728j288286j285514j195359j086188r89805r78422r83322
$$ 40228573 38921845 37633559 36348045 35152686 34066498 33076693 32098271 31114949
15875C1114949r24594r87044j056136q63488q57245q03332p04570o43107o40828
$$ 31114949 30190355 29203311 28147175 27283687 26426442 25623110 24918540 24275433 23634605
15866B3634605q15413o94931m95067o38434p63996o65902m96955l20527n02452
$$ 23634605 22819192 22124261 21629194 20990760 20226764 19560862 19063907 18743380 18240928
15857A8240928m26685m17862m12983m82879m70105m63277m48097l94069m70055
$$ 18240928 17814243 17396381 16983398 16500519 16030414 15567137 15119040 14724971 14254916
15848A4254916m33266k71643k95457k60292k64605k58804l89406l20802k13974
$$ 14254916 13821650 13550007 13254550 12994258 12729653 12470849 12081443 11760641 11546667
15839A1546667l06007j65038j85616k46052k24511j75541j29380k28325l07446
$$ 11546667 11240660 11075622 10890006 10643954 10419443 10243902 10114522 9886197 9578751
15830I578751k09588j76161k85238j98699j48984j26803j41312j68242k40173
$$ 9578751 9369163 9193002 8907764 8709065 8560081 8433278 8291966 8123724 7883551
15821G883551j70211j3269k9166j05483j55479j81876j78469j52800r3313m1944
$$ 7883551 7713340 7700071 7670905 7565422 7409943 7228067 7049598 6896798 6803485 6761541
15811F761541j18293j24655j90200j65079q1595m7121j12450j52216j33458k0169
$$ 6761541 6643248 6518593 6328393 6163314 6081719 6034598 5922148 5769932 5636474 5616305
15801E616305o4461p7014l6006j06370k1552r5829o4759q6983k53532j91949M832
$$ 5616305 5551844 5474830 5438824 5332454 5310902 5215073 5150314 5063331 4809799 4617850 4622682
15790D622682j5244m1116N3813J2543j49371r2578j66704j27470k7878q163l931
$$ 4622682 4607438 4566322 4620135 4632678 4483307 4390729 4224025 4096555 4068677 4060514 4056583
15779D056583r3439j17035k3073n1288q3798Q927M029j0052n6601j40985k9603
$$ 4056583 3963144 3846109 3823036 3771748 3687950 3696877 3700906 3690854 3634253 3493268 3463665
15768C463665M9425l0118R2419m8339q3060n0714l6847j71321n0688O749K842
$$ 3463665 3513090 3482972 3575391 3527052 3443992 3393278 3356431 3185110 3134422 3141171 3144013
15757C144013n6044m7060n4389N3634P1065j47347N611l8125j19130n5526n1331
$$ 3144013 3087969 3040909 2986520 3040154 3111219 2963872 2969483 2931358 2812228 2756702 2705371
15746B705371j1519p6005k25327Q5830J28677m196q1738n0119L001q9701n6109
$$ 2705371 2693852 2617847 2392520 2478350 2607027 2602831 2521093 2470974 2473975 2384274 2328165
15735B328165r100j10378o1993j0436q2001R226l7294k2636N4648J7794j9813
$$ 2328165 2319065 2208687 2146694 2136258 2054257 2063483 2026189 2003553 2058201 2075995 2056182
15724B056182r9539K5623l5356j1961P2352j0384j35826q1124L0013j9909l8942
$$ 2056182 1956643 1982266 1946910 1934949 2007301 1996917 1861091 1779967 1809980 1790071 1751129
15713A751129m7574n2049m2929N7533J735k3686L5876O6306k267m1827k4519r5071
$$ 1751129 1703555 1651506 1608577 1666110 1667845 1644159 1680035 1746341 1744074 1702247 1677728 1582657
15701A582657P3440J3873p1252j8385L2933J39104q5649q1714k714K3962j00009
$$ 1582657 1656097 1669970 1598718 1580333 1613266 1752370 1666721 1585007 1582293 1606255 1506246
15690A506246j28779o8244M2283k2481K5948q3736M9381J30025N8286j31674L6950
$$ 1506246 1377467 1309223 1351506 1329025 1354973 1271237 1320618 1450643 1508929 1377255 1414205
15679A414205k978k13697J0788q6495o3658Q0474J17198J03103L8187J33213M0728
$$ 1414205 1411227 1197530 1208318 1121823 1058165 1138639 1255837 1358940 1397127 1530340 1571068
15668A571068j35760p8904o6381o8447Q2271k7122n6922m3585l9772o4131O9205
$$ 1571068 1435308 1356404 1290023 1221576 1303847 1276725 1219803 1176218 1136446 1072315 1141520
15657A141520J10346n4808L6229j865N5432n8673N7065J50750K330l7763M8355
$$ 1141520 1251866 1197058 1233287 1231422 1286854 1228181 1285246 1435996 1438326 1400563 1448918
15646A448918k5622l8644o7831j04135j0357o5931r8798k4238O0914O9628J01673
$$ 1448918 1423296 1384652 1316821 1212686 1202329 1136398 1037600 1013362 1074276 1143904 1245577
15635A245577O3261N9147J19710J66822O9312j0370J9460r5495k35081j56314
$$ 1245577 1308838 1367985 1487695 1654517 1723829 1713459 1732919 1637424 1402343 1246029
15625A246029K12j4184o5968j38988K2601k1212O68n1326J33786R2520L8822Q7358
$$ 1246029 1246241 1232057 1166089 1027101 1049702 1028490 1029158 977832 1111618 1204138 1242960 1330318
15613A330318k7853p0576j10337j23597p9702j58117p8106j2199o3515M7589J3034
$$ 1330318 1302465 1231889 1121552 997955 918253 760136 682030 669831 606316 653905 666939
15602F66939J08236J29993K3986o6236p6506K634n1599l2734l4359j45122o3547
$$ 666939 775175 905168 929154 862918 786412 789046 737447 704713 670354 525232 461685
15591D61685K2418l1626L5113m06q2068k072Q5411P7810N7131Q8670j3731j14513
$$ 461685 484103 452477 487590 487184 405116 403044 488455 566265 623396 712066 698335 583822
15579E83822M7650N7361K2912r4647n2978r1727n9775J28798J9885N8400K16l3586
$$ 583822 631472 688833 711745 617098 564120 472393 412618 541416 561301 619701 619917 586331
15567E86331l0974l2676j27088m0065O3697J26191N9841l5276J6796q7914k3205
$$ 586331 555357 522681 395593 355528 419225 545416 605257 569981 586777 498863 475658
15556D75658J4992P9007R4156j1423j01805l8458R654K7841m1560j19954k0631
$$ 475658 490650 569657 663813 652390 550585 512127 521781 549622 508062 388108 367477
15545C67477L9552m07R005j36250J8163Q1468R1002Q0885J6449j24375l8727n5387
$$ 367477 407029 406622 415627 279377 297540 379008 470010 550895 567344 442969 404242 348855
15533C48855L6895N9797N803k0729j3359j8057j02432r842J14584J59284o451
$$ 348855 385750 445547 451350 430621 417262 399205 296773 286931 401515 560799 554348
15522E54348j4754o798p7318j5911J16767N3548J3918q9436r8981k654J01707
$$ 554348 539594 532796 455478 439567 556334 609882 623800 534364 435383 432729 534436
15511E34436Q0960p5643j01889K0188k0255O0396r2405j72614O16J97429J1771
$$ 534436 615396 539753 437864 458052 437797 498193 405788 233174 233790 431219 442990
15500D42990j01685J5760L4237N8421P293n6603l2434j47518r20O7757r900r1269
$$ 442990 341305 357065 391302 449723 457016 400413 367979 220461 219541 287298 277398 186129
15488A86129k9866l273j1009R9451J59668l6878M8240P994j42952p9130j5566
$$ 186129 156263 152990 141981 241432 401100 364222 412462 420456 277504 198374 182808
15477A82808l729O5661J17976l8495K8320J53442L2879k3855j10189j45361j7214
$$ 182808 179079 244740 362716 324221 352541 505983 538862 515007 404818 259457 242243
15466B42243R2511M9955J1656j2700K5510q0037o9127j7024j2189o9127j4595
$$ 242243 334754 384709 396365 383665 409175 329138 260011 242987 230798 161671 147076
15455A47076K2487L10J2264Q5212O4347m810j529j22009r5138R7759L2601n9311
$$ 147076 169563 169873 182137 267349 331696 326886 325357 203348 108210 205969 238570 179259
15443A79259l7561O6271n5994p8664j4833J32098O0152l1292j4724M5052K1890
$$ 179259 141698 207969 151975 73311 58478 190576 250728 219436 204712 249764 271654
15432B71654m2372q4928L7187L3913Q1973J52053q1336m8188l9853N2589M8359
$$ 271654 229282 144354 181541 215454 297427 449480 368144 319956 280103 332692 381051
15421C81051j00218l0788P1674L3720l7194q8564k579Q1226o6712n1809L4015
$$ 381051 280833 250045 321719 355439 318245 229681 227102 308328 241616 189807 223822
15410B23822K837n1441j27027k4212m6941Q8652J18263l5878j48391N4390N5020
$$ 223822 226659 175218 48191 23979 -22962 65690 183953 148075 -316 54074 109094
15399A09094k1786M1344Q2728j5716N8605K9177L6598p5906m1486L2950l3027
$$ 109094 87308 128652 211380 195664 254269 283446 320044 244138 202652 235602 202575
15388B02575J0098M15o181o1744m5851P7016K4173N4011J35972L1527l7540j06522
$$ 202575 212673 213088 206907 145163 99312 176328 200501 254512 390484 422011 384471 277949
15376B77949q9228m4467P4814M3269j02871j15806Q3195J10015R6882P7302m7142
$$ 277949 188721 144254 219068 262337 159466 43660 126855 236870 333752 411054 363912
15365C63912j65764p4080J06878P7994o2137o2444Q837j5973l3747k2388N9607
$$ 363912 198148 124068 230946 308940 246803 184359 193196 177223 143476 121088 180695
15354A80695j4463N6870K6460n1285q4742r1180N3806L5056k194M2346M0716n1249
$$ 180695 166232 223102 249562 198277 113535 22355 76161 111217 109023 151369 192085 140836
15342A40836j79685M5277J33508Q5286N9461q7649J5170p7075r9829k7246N5567
$$ 140836 -38849 6428 139936 225222 284683 197034 212204 135129 35300 8054 63621
15331F3621J3039N0663p736N9897K3301J7408R23P975l4498K1438R7795m394j14657
$$ 63621 76660 127323 119587 179484 202785 220193 221116 229091 194593 216031 313826 309432 194775
15318A94775j32289j55071L2553J03689q994N9537N7814Q696N6378j20893q6884
$$ 194775 62486 -92585 -60032 43657 34663 94200 152014 160710 217088 96195 9311
15307I311M8389p1731M4927L6308q164J11349J49426o5006j08524r0078l0363
$$ 9311 57700 -14031 30896 67204 59040 170389 319815 254809 146285 56207 25844
15296B5844k1081m9471N5787K1136q1888p3126l8140J94640J38101j6229r2042
$$ 25844 4763 -44708 11079 32215 -49673 -122799 -160939 33701 171802 155573 63531
15285F3531j7459M0791P4347N8616N454j20771k0726K1915J02896J15462R6579
$$ 63531 46072 86863 161210 219826 225280 104509 83783 105698 208594 324056 420635
15274D20635m7864j10049j92419l5873J0267J50701L9547j29217p574k2269M7061
$$ 420635 372771 262722 70303 34430 44697 195398 234945 105728 98154 75885 122946
15263A22946L9865J11505j23850k4735M2666j2263J2483L6273M4020O4536o5679
$$ 122946 162811 274316 150466 125731 168397 156134 168617 204890 248910 313446 247767
15252B47767j09500l7318p0300j8804j31616N0278J15576j3650M1906P1378q7326
$$ 247767 138267 100949 30649 11845 -119771 -69493 46083 32433 74339 145717 58391
15241E8391j17572J96486M6545j6682q2455m2488L0277J9747M489M9258Q0049
$$ 58391 -59181 137305 183850 167168 84713 42225 72502 92249 96738 145996 226045
15230B26045J2313r1009j7166k6803j65482o0743J8930j4675K3495M7570l6772
$$ 226045 238358 147349 130183 103380 -62102 -122845 -103915 -118590 -95095 -47525 -84297
15219h4297L9558J95966O7046r99p9982k4577J2157o9628k9761N8654R6614j573
$$ -84297 -44739 151227 218273 217274 137292 112715 124872 55244 25483 84137 180751 179178
15207A79178k7943J05426j8985p9020n8729M084N4528q1801M3447k5956j1771
$$ 179178 151235 256661 237676 158656 99927 104011 158539 76738 120185 94229 82458
15196H2458N2993m1957j37889r8420L5928O7076R5283J25109O7142R0270l5961
$$ 82458 135451 93494 -44395 -142815 -106887 -39811 55472 180581 247723 337993 302032
15185C02032n9817j70533m6787P9295n6164p6372m6583J07026J3640P3855l0258
$$ 302032 242215 71682 24895 104190 48026 -28346 -74929 32097 45737 119592 89334
15174H9334m5970p9911m4910q0831Q6474J86102o3880n861R792j7500N928j4212
$$ 89334 43364 -36547 -81457 -162288 -75814 110288 46408 40547 50339 32839 38767 24555
15162B4555k2727P3927N0918L085n508l5465o6276Q5482O0289J27106r74j10961
$$ 24555 1828 75755 126673 129758 124250 88785 22509 107991 168280 295386 294412 183451
15150A83451m0977j13553n8232K5567R6155J0548r1061r1034L7823L5183J09445
$$ 183451 142474 28921 -29311 -3744 92411 102959 11898 -79136 -41313 -6130 103315
15139A03315J8535P3350j3464j01957l410m2287L381K6865q7689j4873P4872j2343
$$ 103315 121850 195200 181736 79779 76369 34082 37463 64328 -23361 -38234 36638 24295
15127B4295k6242m5565n7757J00452j2429m0419j1501m3477j5724k9725M4601
$$ 24295 -1947 -47512 -105269 -4817 -17246 -57665 -69166 -112643 -128367 -158092 -113491
15116a13491l7449Q0262O3061o5629o8980l7582q717Q99J7027J05661Q8217o310
$$ -113491 -150940 -70678 -7617 -73246 -142226 -179808 -188525 -187626 -170599 -64938 23279 16969
15104A6969m0984o7323M1531P9332l8546j8073J3804J978J12914O872M7550o1063
$$ 16969 -24015 -91338 -49807 29525 -9021 -27094 -13290 -11312 101602 108474 156024 94961
15092I4961p0469o5385j6481K1977j5723J01458P9765O2521m4086p8674N7556
$$ 94961 24492 -40893 -57374 -35397 -51120 50338 130103 192624 148538 69864 127420
15081A27420m3651j12292m5254J087j01120J0965O6147Q0826n3341N9722K1872
$$ 127420 83769 -28523 -73777 -72690 -173810 -162845 -96698 -15872 -69213 -9491 12381
15070A2381n4637K0693J44776N5168l7971J149N1447j73257m0047Q3688Q1134
$$ 12381 -42256 -21563 123213 178381 140410 141559 193006 19749 -20298 63390 144524
15059A44524Q7278k7323j06178m1039p6355k9506P7040l7403n0747Q8383J5384
$$ 144524 231802 204479 98301 57262 -19093 -48599 28441 -8962 -59709 28674 44058
15048D4058l7047p1955j1661L2947J01360N1589o1013J591k6958o2634j1519N9382
$$ 44058 7011 -64944 -76605 -43658 57702 109291 48278 49869 22911 -39723 -51242 8140
15036H140M5043N9725L6954n063n7000j21755k6871r0612P5208o7476j0968Q6495
$$ 8140 53183 112908 149862 144799 87799 -33956 -60827 -151439 -76231 -143707 -154675 -68180
15024f8180j5596m9036L7735N9983L0643o0258K2968P6379k1434j44063n4232
$$ -68180 -83776 -132812 -95077 -35094 -4451 -64709 -41741 34638 13204 -130859 -185091
15013a85091J55160j5451k8143K2517O1383j9256M8923j1813l826J07856j8166
$$ -185091 -29931 -45382 -73525 -51008 10375 -8881 40042 28229 24403 132259 114093
15002A14093m261R442n6941q6398l1132J4558n1721N5350k9363r852R6570R7318
$$ 114093 109832 119274 62333 -24065 -55197 -40639 -92360 -37010 -66373 -76225 20345 117663
14990A17663j541N4509k2978q5142r3464r0225k00P9660J43554J7156k4717n720
$$ 117663 116122 170631 147653 62511 -30953 -121178 -121378 -41718 101836 118992 94275 88555
14978H8555l1489J18669R672j16238R1462Q7023l8130j25186Q458M6399j16354
$$ 88555 57066 175735 185407 69169 160631 247654 209524 84338 92796 139195 22841
14967B2841p8361L1786k4968p5342j7061N5932P4656k0246M2605O522p8391k935
$$ 22841 -55520 -23734 -48702 -124044 -141105 -85173 -10517 -30763 11842 18364 -60027 -62962
14955f2962M2244q962J3604l34N1645K3634P5082N6316M1994k8193q4429k2038
$$ -62962 -20718 -29680 -16076 -16410 35235 58869 133951 190267 232261 204068 119639 97601
14943I7601M6032j9599j09722L4058J09714m0313k9368R967K6976R1878n2799
$$ 97601 143633 124034 14312 48370 158084 117771 88403 98370 125346 217224 164425
14932A64425m7885j04699m0488N5919J46088j20304J6314K5197j41794m6517n9748
$$ 164425 116540 11841 -28647 27272 173360 53056 69370 94567 -47227 -93744 -153492
14921a53492p2072L0194P659J39876N9078o4226r8205L6707R0710N9161k6311
$$ -153492 -225564 -195370 -187711 -47835 11243 -52983 -151188 -114481 -23771 35390 9079
14910I079M8735L4367j1057j6380q863M01Q4928n6947J3525K0318K5457M5989
$$ 9079 57814 92181 81124 64744 55881 56282 141210 84263 97788 118106 143563 189552
14898A89552l8817N7436q2864j17236m9163l1158n8751J23285M7350n4561p8558
$$ 189552 150735 208171 125307 8071 -41092 -72250 -131001 -7716 39634 -14927 -93485
14887i3485j8747K8400k8114K4813m2208m7205P2429O3909J04712N1697K4692
$$ -93485 -112232 -83832 -111946 -87133 -129341 -176546 -104117 -40208 64504 116201 140893
14876A40893M303N0958j4869O775o6907q3028j11333j400l4310o7750L1755k3187
$$ 140893 145196 196154 181285 188060 121153 38125 -73208 -74608 -108918 -176668 -144913 -168100
14864a68100K0613M3026N1115K476o5913n754p2716K9634J0768R4524P0453j23397
$$ -168100 -147487 -104461 -53346 -50870 -116783 -122537 -195253 -165619 -154851 -60327 10126 -113271
14852a13271m4911O1861k1105J4962J4363K7934J740j1728o6018o8913m2657N5153
$$ -113271 -158182 -96321 -117426 -102464 -88101 -60167 -58427 -70155 -136173 -205086 -247743 -192590
14840a92590O2865L9014J6089J4461j3470J750J4546o2254Q0245Q2096k4706k3274
$$ -192590 -129725 -90711 -74622 -60161 -73631 -71881 -57335 -119589 -39344 42752 18046 -5228
14828e228k4638O0495J35681j2371n8138q8840j05077r061m0126N3567R9188o1958
$$ -5228 -29866 30629 166310 153939 95801 6961 -98116 -107177 -147303 -93736 5452 -56506
14816e6506p4307L9062P3980m6104o5432m4994m6151P0787O3110J498N1238p8592
$$ -56506 -130813 -91751 -17771 -63875 -129307 -174301 -220452 -149665 -86555 -85057 -33819 -112411
14804a12411m3919R3683o4207N3330j3342O9109P8884m2420J9131K7144Q550m9383
$$ -112411 -156330 -62647 -126854 -73524 -86866 -17757 61127 18707 37838 64982 73532 24149
14792B4149p7307l8354n8333p3032k3042K3971J02279l2791K8821P295n3719Q8432
$$ 24149 -53158 -91512 -149845 -222877 -245919 -221948 -119669 -152460 -123639 -116344 -170063 -81631
14780h1631R1024L431j01677O0519K0529l6788l1311K1642P2446L5372l3167o1442
$$ -81631 9393 12824 -88853 -28334 -7805 -44593 -75904 -54262 18184 53556 20389 -41053
14768d1053M7015J2933n5077m28K5629O8561o3067n0417j09817p4166J65291Q0443
$$ -41053 5962 18895 -36182 -36610 -10981 57580 -5487 -55904 -165721 -239887 -74596 5847
14756E847k8819j1043l3924P6264m3650p2282L7846l794L2371q2183j51272P217
$$ 5847 -22972 -34015 -67939 8325 -35325 -107607 -69761 -73555 -41184 -123367 -274639 -267422
14744b67422J60791J44232J9839r2116k6612L0730k7762P0303K9058j0269j18476
$$ -267422 -106631 37601 57440 -34676 -61288 -30558 -58320 11983 41041 30772 -87704
14733h7704L3311O0902J27356l663j35636n8459m873J2347J9559j0184R238J1159
$$ -87704 -54393 6509 133865 130202 -5434 -63893 -68766 -56419 -36860 -47044 -37806 -26647
14721b6647O2625K1273l6483m928j54055r5161m0759J07533J9394J7907J30381
$$ -26647 35978 57251 20768 15840 -138215 -233376 -274135 -166602 -147208 -129301 1080
14710A080m7101J1609j6570J07230o595m2394m1023n6227n1270n0633M1475R8347
$$ 1080 -46021 -34412 -50982 56248 49653 7259 -33764 -89991 -141261 -191894 -150419 -52072
14698e2072N8726r6839P6948M1402K2286l4026k4248q5414K3487P922l7072K0563
$$ -52072 6654 -90185 -13237 28165 50451 16425 -7823 -93237 -69750 -61828 -98900 -78337
14686g8337j9833o2220K0520J42882k1928k292K2425q5569l0451J5477M9919J11841
$$ -78337 -98170 -160390 -139870 3012 -18916 -21208 1217 -84352 -114803 -99326 -49407 62434
14674F2434J16676j7617r1686j27463l8153O591Q0827n063k1971q3541j42174
$$ 62434 179110 161493 69807 -57656 -95809 -89218 -8391 -13454 -35425 -118966 -261140
14663b61140L0517P3309p9465K7986P9064m946j05584M591P7329l531J36039J49392
$$ -261140 -230623 -157314 -236779 -208793 -129729 -134675 -240259 -235668 -158339 -161870 -25831 123561
14651A23561o8512o5534R8292n5474p2833l8653O7055N8821L2586m788o3737r7832
$$ 123561 55049 -10485 87807 32333 -40500 -79153 -12098 46723 79309 74521 10784 -87048
14639h7048l1699J3398j0668J0433l8674L941J4066R2502K1816k8526J86O5478
$$ -87048 -118747 -105349 -116017 -105584 -144258 -140317 -126251 -33749 -11933 -40459 -40273 25205
14627B5205m0724Q347L4693P4900K8974j16994m5161Q6490J13302q5058l2415
$$ 25205 -15519 -7172 27521 102421 131395 14401 -30760 55730 169032 83974 51559
14616E1559j22329o4314j3435J1851J1267N0647k3498K5774J2102j0920M8672
$$ 51559 -70770 -135084 -148519 -136668 -125401 -74754 -98252 -72478 -60376 -71296 -22624
14605b2624J52o0427L984K5122k8621P9459K4508R519j3837o4440l0019j06321
$$ -22624 -22472 -82899 -78915 -53793 -82414 -2955 21553 31072 17235 -47205 -77224 -183545
14593a83545o7444k211J54713Q1995n3057O9692K9988o9863o4555N7473M8144
$$ -183545 -250989 -253200 -98487 -16492 -69549 143 30131 -39732 -104287 -46814 1330
14582A330K6562n3386n573l1025j0082Q5000K8256j04188n6243n3472M7919P6114
$$ 1330 27892 -25494 -31067 -62092 -72174 12826 41082 -63106 -119349 -172821 -124902 -48788
14570d8788L261r0J01767R0332k1951j40443j63208k382j47489J9428l153R0012
$$ -48788 -45527 -45617 56150 146482 124531 -15912 -179120 -181502 -328991 -309563 -312716 -222704
14558b22704L1606N076J16824J5856n9542o2751n5622J15865J33968L4235O9464
$$ -222704 -191098 -186022 -69198 -53342 -112884 -175635 -231257 -115392 18576 52811 122275
14547A22275O1031p6755j09001l2539K7336k7713m1234j9441P0465J2332m3402
$$ 122275 183306 106551 -2450 -34989 -7653 -35366 -76600 -96041 -25576 -13244 -56646
14536e6646q3335N9500J34693J5642l3522l9402p5690o8237q090K2646k6511M0896
$$ -56646 -139981 -80481 54212 69854 36332 -3070 -78760 -146997 -155087 -132441 -158952 -118056
14524a18056K7644m9118J10333Q9617q0566J4530K5407l2009j6234j9027L1141
$$ -118056 -90412 -139530 -29197 60420 -20146 -5616 19791 -12218 -28452 -47479 -16338
14513a6338J7897r222O252o9317j53235o237N6743O9802L7616k3345L6505J47697
$$ -16338 1559 -7663 -1411 -70728 -223963 -230200 -173457 -103655 -66039 -89384 -52879 94818
14501I4818J06739q2171j89278m0278m2155k024J23023J16527k0740k5953j08464
$$ 94818 201557 119386 -69892 -110170 -152325 -154349 -31326 85201 64461 38508 -69956
14490f9956n7544L3186Q7666j897m4150O7441j2206m7035p3517j8579K0725K6071
$$ -69956 -127500 -94314 -6648 -8545 -52695 14746 2540 -44495 -118012 -136591 -115866 -89795
14478h9795N0041j25009o6303Q1946J98016R6037n2028m2656P902j6701J059l2916
$$ -89795 -39754 -164763 -231066 -149120 48896 144933 92905 50249 58151 41450 42509 9593
14466I593K496n9986L103L7850L4269R5776M8010p8013j7299j24851n8459J9658
$$ 9593 12089 -47897 -44794 -6944 27325 123101 171111 93098 75799 -49052 -107511 -87853
14454h7853P1568r1853K2647K4888o1557n814r6999R4335J03243Q6488J7584r200
$$ -87853 -16285 -108138 -85491 -60603 -122160 -127974 -224973 -130638 -27395 59093 76677 67477
14442F7477k9619o9853o6634M7433l1671k0796K0734o127r389J5256J14299j9900
$$ 67477 37858 -31995 -98629 -51196 -82867 -103663 -82929 -89056 -98445 -83189 31110 11210
14430A1210n8725l0208p38Q133L8110M8447l6647n0056m3904J5088R5194K465
$$ 11210 -47515 -77723 -78461 -70328 -32218 16229 -20418 -70474 -114378 -99290 -4096 -1631
14418a631n6144O5013M0942P6388o6196o7350k5913M2809p4805l1758O8923J85730
$$ -1631 -57775 7238 48180 124568 58372 -8978 -34891 7918 -66887 -98645 -29722 156008
14406A56008n5408j52079O9009M8476N6200P2865j0706j21099m5496n1907j0093
$$ 156008 100600 -51479 17530 66006 122206 195071 184365 63266 17770 -34137 -44230
14395d4230O8081q914k418p7016m9149M5455K8280J0594j15919k0993Q6007n360
$$ -44230 23851 14937 12519 -64497 -113646 -68191 -39911 -29317 -145236 -166229 -80222 -85582
14383h5582R1017J2351p500k3743P6894k7541N2117J9073n4865j7900J1750k3438
$$ -85582 5435 17786 10286 -13457 63437 35896 88013 107086 52221 34321 46071 22633
14371B2633K4179r9574N1574P2928o206k5320m328r889n7925M6642N3922O6180
$$ 22633 46812 -52762 -1188 71740 65534 40214 35886 25997 -31928 14714 68636 134816
14359A34816k6632j39667j04770j20977O6550K18785J4097q3892r5033j1979L5616
$$ 134816 108184 -31483 -136253 -257230 -190680 28105 42202 -41690 -136723 -148702 -113086
14348a13086O2732l6960j08422Q6095L8261K846P3922j867M0169p5882p1724N6309
$$ -113086 -50354 -87314 -195736 -109641 -71380 -68534 5388 3521 43690 -32192 -103916 -47607
14336d7607J05961n7567o8830J2809p177j3609K0273q41q1281l6544L1250L2721
$$ -47607 58354 787 -68043 -55234 -62411 -76020 -55747 -56588 -137869 -174413 -143163 -110442
14324a10442n6479q1716K9810J454L1308O2012j2969P5268M6622k8856L5248j23193
$$ -110442 -166921 -248637 -218827 -217373 -186065 -124053 -137022 -61754 -15132 -43988 -8740 -131933
14312a31933m1898J0833J63482L3364p9237n5272n3088N3910P3168o1456k4861
$$ -131933 -173831 -162998 484 33848 -45389 -100661 -153749 -99839 -26671 -88127 -112988
14301a12988J25695K4662o5563m2163M5992Q5851l909k2851R0871N5468o7325
$$ -112988 12707 37369 -28194 -70357 -24365 61486 57577 34726 125597 181065 113740
14290A13740l4792L385r2567j24246L6308M9837R5530K3069O2916J16659j29479
$$ 113740 78948 82333 -10234 -134480 -98172 -48335 47195 70264 133180 249839 120360
14279A20360j64636M6059M2934K954j0985m9727q406k7922q304K8477l8687J07033
$$ 120360 -44276 1783 44717 47671 36686 -13041 -21447 -49369 -57673 -29196 -67883 39150
14267C9150L9324N9266r235j53286k8171J08915k3675j04284N4541K4564n389
$$ 39150 78474 137740 128505 -24781 -52952 55963 32288 -71996 -17455 7109 1720
14256A720n9952L8781K8515j02028j06052n9516r9045J50619R8138O4902j5775
$$ 1720 -58232 -19451 9064 -92964 -199016 -258532 -357577 -206958 -108820 -43918 -59693
14245e9693q1502k4181M5861J09384O2705L9593m7129m2794l8822j3386O9553
$$ -59693 -141195 -165376 -119515 -10131 52574 92167 45038 2244 -36578 -49964 19589
14234A9589j6617m4562l8498M8639P6769J2183J2785j41630l1944J05988M4663
$$ 19589 2972 -41590 -80088 -31449 45320 57503 70288 -71342 -103286 2702 47365
14223D7365q2582l7300N8097N4836j9118N1085M3095J321p0942o3462l7612J14852
$$ 47365 -35217 -72517 -14420 40416 21298 72383 115478 116799 45857 -17605 -55217 59635
14211E9635j7222l2386R7082l8623r3442p474K1724p9850j13936L8202J21609
$$ 59635 42413 10027 107109 68486 -24956 -32430 -10706 -90556 -204492 -166290 -44681
14200d4681L6418L5273k4661K0810j169p5067j13505k9043N0776J32415m1332
$$ -44681 -8263 27010 2349 23159 21990 -53077 -166582 -195625 -144849 -12434 -53766
14189e3766j6000N3753n1284L2821J41017N761n7322j6375k426N1224j4929n6678
$$ -53766 -69766 -16013 -67297 -34476 106541 112302 54980 38605 36179 87403 72474 15796
14177A5796l5146j10639p7286l3200J9542M0744K9090m5469Q122J5068M6299j9948
$$ 15796 -19350 -129989 -207275 -240475 -220933 -180189 -151099 -196568 -188446 -173378 -127079 -147027
14165a47027O0201Q4181k2577j95n9385m3679O6731N9110j8321n7743l1159R8776
$$ -147027 -86826 -2645 -25222 -25417 -84802 -128481 -61750 -2640 -20961 -78704 -109863 -11087
14153a1087N0634j02615r2857q594N9465k5556O1022k5500q1853L1723J03132
$$ -11087 39547 -63068 -155925 -164519 -105054 -130610 -69588 -95088 -176941 -145218 -42086
14142d2086j7730o7458m8617r6305Q4320P8156J09858j0044J14099K7206p1055
$$ -42086 -59816 -127274 -175891 -272196 -187876 -109720 138 -9906 104193 131399 60344
14131F0344o8951j03274N3796r094J5426Q5690O5367m5265j32501J14373j1146
$$ 60344 -8607 -111881 -58085 -67179 -51753 33937 99304 54039 -78462 35911 24765
14120B4765j59478p6130J32836M1329q9568k0390K4207M1697K5418O6673l6848
$$ 24765 -134713 -210843 -78007 -36678 -126246 -146636 -122429 -80732 -55314 11359 -25489
14109b5489j06076k9756O8145O0346n2390k5520n8803P1814O3250q783q0717N6371
$$ -25489 -131565 -161321 -93176 -32830 -85220 -110740 -169543 -97729 -34479 -43262 -123979 -67608
14097f7608P6870J06260l6523j07181J1441R6216N3970k3884q9096o7729Q4568
$$ -67608 9262 115522 78999 -28182 -16741 79475 133445 109561 20465 -47264 37304
14086C7304r0959m4133M8668M8673O7130K7724k491M3930o9775j41578m8812l3771
$$ 37304 -53655 -97788 -49120 -447 66683 94407 91916 135846 66071 -75507 -124319 -158090
14074a58090P8996J06705l8203r4130p0862K7198Q0649O5329m1584M3980j7983
$$ -158090 -79094 27611 -10592 -104722 -175584 -148386 -67737 -2408 -43992 -12 -17995
14063a7995m0309j64858l8768l464J39242J85831J5577k8133L6198n2850J0756
$$ -17995 -58304 -223162 -261930 -265394 -126152 59679 75256 47123 83321 30471 41227
14052D1227L5199m920j5135J0247J864q5436k9923O4708k1771l5292j8483R7204
$$ 41227 76426 71506 56371 66618 68482 -16954 -46877 17831 -3940 -39232 -57715 39489
14040C9489K2059n2938m518J04927O9649K6192o5237k7292l8520j4618p6365j03938
$$ 39489 61548 8610 4092 109019 178668 204860 139623 112331 73811 59193 -17172 -121110
14028a21110M2889K0000J6712O9548J73l5258k4773q95R3652k9912m6259n326
$$ -121110 -78221 -58221 -41509 28039 28212 -7046 -31819 -32714 60938 31026 -15233 -20559
14016b0559p6177N0969N7594J17226L4728k7833K3575k4700r7221o3998K6016
$$ -20559 -96736 -45767 11827 129053 163781 135948 159523 134823 37602 -26396 -380
14005c80J4841l2802P067K5240L685K778n6038J920J82188Q6272l6946j46188
$$ -380 14461 -18341 -11274 13966 17651 20429 -35609 -33689 148499 234771 197825 51637
13993E1637Q534Q0546K5782q3081n1668L0171j11874p0933O3670N4361p0965k6837
$$ 51637 60171 140717 166499 83418 31750 61921 -49953 -120886 -57216 -2855 -73820 -100657
13981a00657J00072K189Q63p2184Q4616R255J02245M2066j39264l9659k6696m6453
$$ -100657 -585 1604 2467 -69717 14899 24154 126399 168465 29201 -10458 -37154 -83607
13969h3607l6210r6782m0504M1429K9087N3662K9183P3756J5145n035K873m8246
$$ -83607 -119817 -216599 -257103 -215674 -186587 -132925 -103742 -29986 -14841 -19876 -17003 -65249
13957f5249L0852P3040K1489l58m6403L2908O378r0379q2883n0655J8944J7512
$$ -65249 -34397 38643 60132 59774 13371 46279 52657 -37722 -120605 -171260 -152316 -134804
13945a34804q1780J6485J03713j4254j7528K9167J58551P4951l7827n5706m6438
$$ -134804 -216584 -200099 -96386 -110640 -128168 -99001 59550 134501 96674 40968 -5470
13934e470J7378Q034m1481M9592k1327K002k8755o3636p195M8809J41938Q0844
$$ -5470 11908 19942 -21539 28053 6726 8728 -20027 -83663 -90858 -42049 99889 180733
13922A80733j4220j23847j42016o9889M7598N7440M2306r450J5998J40026l868
$$ 180733 166513 42666 -99350 -169239 -121641 -64201 -21895 -31345 -15347 124679 120811
13911A20811n7126r9246j03045q1925O8396J439J4917J68988N5267J9457N489
$$ 120811 63685 -35561 -138606 -220531 -152135 -150696 -135779 33209 88476 107933 113422
13900A13422j40887j56237Q6130J42032O7356L2423M8927r4241k5894J7321k4407
$$ 113422 -27465 -183702 -97572 44460 111816 144239 193166 98925 73031 90352 65945
13889F5945J4913P2748L112N2922q4480j01778J4095J28680m0082j08470j00163
$$ 65945 80858 153606 156718 209640 125160 23382 37477 166157 126075 17605 -82558
13878h2558n3308M0619k6032J436J25223J6731o99J39027J9454r3421n4768K5073
$$ -82558 -135866 -95247 -121279 -119843 5380 22111 21412 160439 179893 86472 31704 56777
13866E6777J868J19682k4350j59741o7320P2821n2361o8577M1052R7587R2093
$$ 56777 58645 178327 153977 -5764 -73084 -263 -52624 -121201 -80149 17438 109531
13855A09531m4038k4846k9316m0832j07689K3595M978J13500R4970m8769O305
$$ 109531 65493 40647 11331 -29501 -137190 -113595 -108617 4883 99853 51084 57389
13844E7389q37N7163j3211n0108k6792p5136r5419O1477K3626N0648p01M3372
$$ 57389 56552 113715 100504 50396 23604 -51532 -146951 -85474 -61848 -11200 -11901 31471
13832C1471P9503n8687r2358Q5104J39284P9116o6905n7798n3792j2335M6248
$$ 31471 110974 52287 -40071 45033 184317 263433 196528 138730 84938 72603 118851
13821A18851K5620r084n7869q5936j41008l0887j123Q8856L7539J5975p5078J9999
$$ 118851 144471 135387 77518 -8418 -149426 -180313 -181436 -92580 -55041 -39066 -114144 -94145
13809i4145K4596k5880p9598Q9983J16226O5113P3478L6744l8260q5413l115J43583
$$ -94145 -69549 -95429 -175027 -85044 31182 96295 169773 206517 168257 82844 79729 223312
13797B23312O4840l8826k3403q0334j23789p816Q642L9471K0052l9167o418M8181
$$ 223312 288152 249326 225923 145589 21800 13984 22626 62097 82149 42982 36564 84745
13785H4745P1680j1995R2454P916q5972n2744j2656o9478N7098L2232k057k2707
$$ 84745 156425 144430 236884 244800 158828 106084 93428 23950 81048 113280 111223 88516
13773H8516m2872n4278r6228n2079J14771J06995M9274R5184q0541m8116k669
$$ 88516 45644 -8634 -104862 -156941 -42170 64825 114099 209283 128742 80626 77957
13762G7957k2738M0734J2429q4862P5559L4343j73980J6798L6589j7620n1399
$$ 77957 55219 95953 108382 23520 99079 133422 -40558 -23760 12829 -4791 -56190
13751e6190n4358M4867J4890k9422O2938L4887R0925m457p5367m0445k3204k9242
$$ -56190 -110548 -65681 -50791 -80213 -17275 17612 108537 104080 28713 -11732 -34936 -64178
13739f4178Q3943J2375j8632N812l9121j2541J04432J98214k0418r6180p0241
$$ -64178 19765 32140 13508 19320 -19801 -32342 72090 270304 249886 153706 83465
13728H3465j11019j02140K5774J1979j8254M2476J22399L7022O3385K6616p1579
$$ 83465 -27554 -129694 -103920 -91941 -110195 -67719 54680 91702 155087 181703 110124
13717A10124j14635K5998l9260j27554M29J07152j5920J10823k1883r5787P1285
$$ 110124 -4511 21487 -17773 -145327 -144898 -37746 -53666 57157 35274 -60513 10772
13706A0772O5367M9363M3910l2467K9978J3829p3886k3453l9526m3178n1848q681
$$ 10772 76139 125502 169412 136945 166923 180752 106866 83413 43887 709 -51139 -59820
13694e9820L4117q0132n134Q5783J3807L9169N9397R3279m7893j65316P2666P2432
$$ -59820 -25703 -105835 -110969 -25186 -11379 27790 87187 180466 132573 -32743 39923 112355
13682A12355o0663k10409M4953J05908O330p0652J8360P1591Q3225K3777k961
$$ 112355 51692 -158717 -113764 -7856 -1526 -72178 -53818 17773 100998 124775 121814
13671A21814p3203R352l5031q3712q5214o193K8595L4129J6794l2612j7825N3642
$$ 121814 48611 57963 22932 -60780 -145994 -152187 -123592 -89463 -72669 -105281 -123106 -69464
13659f9464k7593j7388J30026P3544K0066j07287q834M4792K5082K3010j828K5877
$$ -69464 -97057 -114445 15581 89125 109191 1904 -6930 37862 62944 85954 84126 110003
13647A10003O1902o4691j10124j0874k2873p4174j1555R6499M2197K4586K3531
$$ 110003 171905 107214 -2910 -13784 -36657 -110831 -122386 -25887 16310 40896 64427
13636F4427o3423j5944o9982J89J39761N6610k338j0116p5010p2993O9883M150
$$ 64427 1004 -14940 -84922 -84733 55028 111638 109300 99184 24174 -48819 21064 25214
13624B5214m3441L6533k8190N5017O7961J5883O5030n2945q544N849j97364J682
$$ 25214 -18227 18306 -9884 45133 113094 128977 194007 141062 132518 138367 -58997 -57315
13612e7315N1931j4027M0170J36531j2873j79458M7219Q8599K0720j278m5240
$$ -57315 -5384 -19411 20759 157290 144417 -35041 12178 100777 121497 120219 74979
13601G4979j5765o9889m5266O5206l4028L3528L8193q7241K1319p3544L8486o4758
$$ 74979 59214 -10675 -55941 9265 -24763 8765 46958 -40283 -18964 -92508 -54022 -118780
13589a18780N412j3786J13924J12696o203p7220J2708M47o5371j49821j9694M7599
$$ -118780 -113368 -127154 -13230 99466 93263 16043 28751 29198 -36173 -185994 -205688 -158089
13577a58089K2588J10778P6230P4446L7309q7679j070l2701k584N7868o2536l9243
$$ -158089 -135501 -24723 51507 125953 163262 75583 74513 41812 39228 97096 34560 -4683
13565d683L2239l3774o7023n189J19615o9893J1071O388k5530J12739J14449J2501
$$ -4683 27556 -6218 -73241 -78430 41185 -28708 -17637 -11249 -36779 75960 190409 202910
13553B02910j868j3883l9462K5151k241j01980o4479k8414M7068P7027o296M4987
$$ 202910 201042 187159 147697 172848 170607 68627 4148 -24266 22802 99829 93533 138520
13541A38520K9193n9193N4934L6620j6090l1534q058N397l3781J2779J6123m4876
$$ 138520 167713 108520 163454 200074 183984 152450 144392 149789 116008 128787 144910 100034
13529A00034j29898p6730O3888O5847J2183K7458N6067K5988o4788j56143l7627
$$ 100034 -29864 -106594 -42706 23141 35324 62782 118849 144837 80049 -76094 -113721
13518a13721J06429N7586J2127K8129O3943q4542r2337J1999J44514J2522n0221
$$ -113721 -7292 50294 62421 90550 154493 69951 -22386 -10387 134127 146649 96428
13507I6428j27862L3101M5552o4772p6632O2911J3568j0608p7787j3593O381N3723
$$ 96428 -31434 1667 47219 -17553 -94185 -31274 -17706 -28314 -106101 -119694 -113313 -59590
13495e9590R0747J07171J27897n3015j20714m1702q9793k2214Q8106O8888N368
$$ -59590 31157 138328 266225 213210 92496 50794 -38999 -61213 26893 95781 101149
13484A01149j2852l1592n2544l8733l5982l1762o1576p7991K6400J40795l5902
$$ 101149 88297 56705 4161 -34572 -70554 -102316 -163892 -241883 -215483 -74688 -110590
13473a10590N1677J28002m9826r3581K5226J14305k0104Q4947N0240o7834q1594
$$ -110590 -58913 69089 19263 -74318 -49092 65213 45109 130056 180296 112462 30868
13462C0868J9205P0071n9651o4804R2089J25589j02581L2450K8351N6532J3429
$$ 30868 50073 120144 60493 -4311 87778 213367 110786 143236 171587 228119 241548
13451B41548j18690J6495p6298n2952k080j7843M6716P7287K6802k9835M6036
$$ 241548 122858 139353 63055 10103 8023 -9820 36896 114183 140985 111150 157186
13440A57186n4003p599L0297Q564p7855k5188L0665l7526j5162j56899j04378
$$ 157186 103183 95584 125881 134445 56590 31402 62067 24541 9379 -147520 -251898
13429b51898J27241R7190L2997K0721j3521J9550Q1375M942J9033p8793l0609
$$ -251898 -124657 -27467 5530 26251 12730 32280 113655 118597 137630 58837 28228
13418B8228J66K7837J7563P7537n2981m1807j551K4879M0965Q034j2938L196K6928
$$ 28228 28394 56231 73794 151331 98350 56543 54992 79871 120836 128870 115932 119128 146056
13405A46056j463r6110K8064Q2775K2328j64670m7154N5427J0322l0823K9544
$$ 146056 144593 48483 76547 159322 181650 16980 -30174 25253 35575 4752 34296
13394C4296K1754O7556l785O9200K3382k2739p9488L4682O2605J0527K6676j150
$$ 34296 56050 123606 119821 189021 212403 189664 110176 144858 207463 217990 244666 243516
13382B43516K2585j55798o5636j8255R7581O1445J9336j01770j37857J0859P5981
$$ 243516 266101 110303 44667 26412 123993 185438 204774 103004 -34853 -23994 51987
13371E1987J03183M8831M3862n1384k09706j9702O1840J8046l3663n2319l2659
$$ 51987 155170 204001 247863 196479 -13227 -32929 28911 46957 13294 -39025 -71684
13360g1684O1941M3584K6204j37435m2432Q8621r0208Q4252J51279R7026n3041
$$ -71684 -9743 33841 60045 -77390 -119822 -31201 -121409 -37157 114122 211148 158107
13349A58107K2649M3593q6205j17147Q4649J64651O9992r6986o1003Q951o647
$$ 158107 180756 224349 138144 20997 105646 270297 340289 243303 182300 191251 184604
13338A84604q6579m5328Q0823q5085M7630m7301k2202K9170N752l2089J18269
$$ 184604 98025 52697 133520 48435 96065 48764 26562 55732 61484 29395 147664
13327A47664m7336j73133p9371r5181Q9097J16479L7244J0661o4952k4204j4241
$$ 147664 100328 -72805 -152176 -247357 -158260 -41781 -4537 6124 -58828 -83032 -97273
13316i7273J6258N5494P8341P3984K0088P0373J0328l2956k8060m566J6231n9513
$$ -97273 -81015 -25521 52820 126804 146892 217265 227593 194637 166577 162011 178242 118729
13304A18729k0650J9216j2224l3898N3537J07073J038L20l9567M9158P685m8808
$$ 118729 98079 117295 105071 71173 124710 231783 232821 233141 193574 242732 250417 201609
13292B01609N206q627q2287l0700j4741o7580j05920q4998R9396J72708J41358
$$ 201609 206815 198188 115901 85201 70460 2880 -103040 -188038 -88642 84066 225424
13281B25424o9818j01339k840P4806N9445O5601j58216q8443n903N4399m6915
$$ 225424 155606 54267 51427 126233 185678 251279 93063 4620 -1283 53116 6201
13270F201N7130J3754Q3161K3654j39227q304m7054j35411L4923Q6824Q6807j6463
$$ 6201 63331 77085 160246 183900 44673 36369 -10685 -146096 -111173 -24349 62458 45995
13258D5995o8994k0224K9123J08137R5606L5776q7005m0280j8656j9643P7112
$$ 45995 -22999 -43223 -14100 94037 189643 225419 138414 98134 79478 59835 136947
13247A36947M005l535p5605j55893Q6024L1093n0199J5060R975j7934k254n7816
$$ 136947 140952 137417 61812 -94081 -8057 23036 -27163 -12103 -2128 -20062 -22316 -80132
13235h0132P4799M4885l1494M5788M2982j6789k2768L2438M2091L6432n6702O2994
$$ -80132 -5333 39552 8058 53846 96828 80039 57271 89709 131800 168232 111530 174524
13223A74524K6957n7612J6975L000j18578j35066k2257J08247L1781l364k3150
$$ 174524 201481 143869 160844 163844 45266 -89800 -112057 -3810 27971 24607 1457
13212A457j9182L2748J2074l8774j7808N63O8918N4801N8080P901j7955j186Q6784
$$ 1457 -17725 15023 27097 -11677 -29485 -28922 39996 94797 152877 160778 142823 141637 228421
13199B28421k3447j03877r0825l9646O2089J15213J02222N2988k9265r3642j0299
$$ 228421 204974 101097 10272 -29374 32715 147928 250150 303138 273873 180231 169932
13188A69932R927l2027J1780j612Q3207R3052j85115k1053J0978N7392P3241m2416
$$ 169932 179859 147832 159612 158000 241207 334259 149144 128091 139069 196461 269702 227286
13176B27286N9824J12651K3219m2513j32655q0143J6344J38097J9937l5109l7146
$$ 227286 287110 399761 422980 380467 247812 167669 184013 322110 342047 306938 269792
13165B69792o4545j2372j5391O564K382M3935Q0138J756Q509r1995r6072L0979
$$ 269792 205247 192875 177484 184048 186430 230365 310503 312259 320768 228773 132701 163680
13153A63680j8794N6182J14063k42k9645l7541j7754K673L6115k175j39426p6633
$$ 163680 144886 201068 315131 314889 285244 247703 229949 232622 268737 266562 127136 50503
$$ [...]
##END NTUPLES=NMR SPECTRUM
##END=
