##TITLE=Analysis number 324063
Compound Code sb 00582
Project Code adrs
Chemist Name synthon
##JCAMPDX= 6.0         $$ Bruker NMR JCAMP-DX V2.0
##DATA TYPE= NMR SPECTRUM
##DATA CLASS= NTUPLES
##ORIGIN= Bruker BioSpin GmbH
##OWNER= nmr
$$ XWIN-NMR		Version 3.5
$$ Tue Nov 14 12:33:07 2006 GMT Standard Time (UT+0h)  MAYBRIDGE\nmr@NMR_250MHZ
##.OBSERVE FREQUENCY= 250.131544655141
##.OBSERVE NUCLEUS= ^1H
##.ACQUISITION MODE= SIMULTANEOUS (DQD)
##.ACQUISITION SCHEME= undefined
##.AVERAGES= 16
##.DIGITISER RES= 18
##SPECTROMETER/DATA SYSTEM= dpx250
##.PULSE SEQUENCE= zg30
##.SOLVENT NAME= CDCl3
##.SHIFT REFERENCE= (INTERNAL, CDCl3, 0, 16.522)
##AUDIT TRAIL= $$ (NUMBER, WHEN, WHO, WHERE, WHAT)
$$ ##TITLE= Audit trail, XWIN-NMR		Version 3.5
$$ ##JCAMPDX= 5.01
$$ ##ORIGIN= Bruker BioSpin GmbH
$$ ##OWNER= nmr
$$ C:\u/data/dgb/nmr/ADRS/310/pdata/1/auditp.txt
$$ ##AUDIT TRAIL=  $$ (NUMBER, WHEN, WHO, WHERE, WHAT)
(   1,<2006-11-14 12:32:36.14 +000>,<MAYBRIDGE\nmr>,<NMR_250MHZ>,
      <created by zg, POWCHK disabled, PULCHK disabled
       configuration hash MD5:
       49 4B E0 1D 92 C2 6B 37 9F E6 65 BC 52 41 86 1D
       data hash MD5: 64K
       3A E3 7D B8 6A 9F 27 77 73 AD 56 F2 35 92 70 FA>)
(   2,<2006-11-14 12:32:56.22 +000>,<MAYBRIDGE\nmr>,<NMR_250MHZ>,
      <Start of raw data processing
       ef LB = 0.3 FT_mod = 6 PKNL = 1 SI = 32K 
       data hash MD5: 32K
       E7 B3 D3 D9 A0 AF 76 F9 E9 DD D8 B4 B9 05 5D 4C>)
(   3,<2006-11-14 12:32:59.01 +000>,<MAYBRIDGE\nmr>,<NMR_250MHZ>,
      <apk 
       data hash MD5: 32K
       56 68 C0 C0 9C 97 6D 2F C3 40 4E 9F 9A A2 F4 9A>)
(   4,<2006-11-14 12:32:59.87 +000>,<MAYBRIDGE\nmr>,<NMR_250MHZ>,
      <abs ABSG = 5 
       data hash MD5: 32K
       6A E9 2B 71 F7 50 56 DB 4C 1C DD 2D E1 3D 4A 73>)
$$ ##END=
$$ 
$$ hash MD5
$$ 6C 1A 69 C3 42 60 49 96 DE 5A D0 C6 D6 7C 4B BB
##$RELAX= 
##$RELAX= 
##$RELAX= 
##$RELAX= 
##$RELAX= 
##$RELAX= 
##$RELAX= 
$$ Bruker specific parameters
$$ --------------------------
##$DU= <C:\u>
##$EXPNO= 310
##$NAME= <ADRS>
##$PROCNO= 1
##$TYPE= <nmr>
##$USER= <dgb>
##$AMP= (0..31)
100 100 100 100 100 100 100 100 100 100 100 100 100 100 100 100 100 100 
100 100 100 100 100 100 100 100 100 100 100 100 100 100 
##$AQSEQ= 0
##$AQ_mod= 3
##$AUNM= <au_zg>
##$AUTOPOS= <34 >
##$BF1= 250.13
##$BF2= 250.13
##$BF3= 250.13
##$BF4= 250.13
##$BF5= 500.13
##$BF6= 500.13
##$BF7= 500.13
##$BF8= 500.13
##$BYTORDA= 1
##$CFDGTYP= 0
##$CFRGTYP= 5
##$CHEMSTR= <none>
##$CNST= (0..31)
1 1 145 1 1 1 1 1 1 1 1 1 1 1 1 1 1 1 1 1 1 1 1 1 1 1 1 1 1 1 1 1 
##$CPDPRG= <>
##$CPDPRG1= <>
##$CPDPRG2= <>
##$CPDPRG3= <>
##$CPDPRG4= <mlev>
##$CPDPRG5= <mlev>
##$CPDPRG6= <mlev>
##$CPDPRG7= <mlev>
##$CPDPRG8= <mlev>
##$CPDPRGB= <>
##$CPDPRGT= <>
##$D= (0..31)
0 1 0 0 0 0 0 0 0 0.06 0 0 0 0 0 0 0.0002 0 0 0 0 0 0 0 0 0 0 0 0 0 0 
0 
##$DATE= 1163507552
##$DBL= (0..7)
120 120 120 120 120 120 120 120 
##$DBP= (0..7)
150 150 150 150 150 150 150 150 
##$DBP07= 0
##$DBPNAM0= <>
##$DBPNAM1= <>
##$DBPNAM2= <>
$$ [...]
##$SUBNAM7= <"">
##$SUBNAM8= <"">
##$SUBNAM9= <"">
##$SW= 20.6930455092707
##$SWIBOX= (0..15)
0 0 3 0 0 0 0 0 0 0 0 0 0 0 0 0 
##$SW_h= 5175.983436853
##$TD= 65536
##$TD0= 1
##$TE= 683.16
##$TE2= 300
##$TE3= 300
##$TEG= 300
##$TL= (0..7)
0 120 120 120 120 120 120 120 
##$TP= (0..7)
150 150 150 150 150 150 150 150 
##$TP07= 0
##$TPNAME0= <>
##$TPNAME1= <>
##$TPNAME2= <>
##$TPNAME3= <>
##$TPNAME4= <>
##$TPNAME5= <>
##$TPNAME6= <>
##$TPNAME7= <>
##$TPOAL= (0..7)
0.5 0.5 0.5 0.5 0.5 0.5 0.5 0.5 
##$TPOFFS= (0..7)
0 0 0 0 0 0 0 0 
##$TUNHIN= 0
##$TUNHOUT= 0
##$TUNXOUT= 0
##$USERA1= <user>
##$USERA2= <user>
##$USERA3= <user>
##$USERA4= <user>
##$USERA5= <user>
##$V9= 5
##$VALIST= <valist>
##$VCLIST= <CCCCCCCCCCCCCCC>
##$VD= 0
##$VDLIST= <DDDDDDDDDDDDDDD>
##$VPLIST= <PPPPPPPPPPPPPPP>
##$VTLIST= <TTTTTTTTTTTTTTT>
##$WBST= 1024
##$WBSW= 4
##$XGAIN= (0..3)
0 0 0 0 
##$XL= 0
##$YL= 0
##$YMAX_a= 616769
##$YMIN_a= -641827
##$ZGOPTNS= <>
##$ZL1= 120
##$ZL2= 120
##$ZL3= 120
##$ZL4= 120
##$ABSF1= 16.522
##$ABSF2= -4.171173
##$ABSG= 5
##$ABSL= 3
##$ALPHA= 0
##$AQORDER= 0
##$ASSFAC= 0
##$ASSFACI= 0
##$ASSFACX= 0
##$ASSWID= 0
##$AUNMP= <proc_1d>
##$AZFE= 0.1
##$AZFW= 0.1
##$BCFW= 0
##$BC_mod= 0
##$BYTORDP= 0
##$COROFFS= 0
##$CY= 12.5
##$DATMOD= 1
##$DC= 0
##$DFILT= <>
##$DTYPP= 0
##$F1P= 14.0000005364418
##$F2P= -0.99999901652339
##$FCOR= 0.5
##$FTSIZE= 32768
##$FT_mod= 6
##$GAMMA= 0
##$GB= 0
##$INTBC= 1
##$INTSCL= 1
##$ISEN= 128
##$LB= 0.3
##$LEV0= 0
##$LPBIN= 0
##$MAXI= 10000
##$MC2= 0
##$MEAN= 0
##$ME_mod= 0
##$MI= 0
##$NCOEF= 0
##$NC_proc= -3
##$NLEV= 6
##$NOISF1= 0
##$NOISF2= 0
##$NSP= 0
##$NTH_PI= 0
##$NZP= 0
##$OFFSET= 16.522
##$PC= 1
##$PHC0= 167.2538
##$PHC1= -8.193989
##$PH_mod= 1
##$PKNL= yes
##$PPARMOD= 0
##$PSCAL= 4
##$PSIGN= 0
##$REVERSE= no
##$SF= 250.13
##$SI= 32768
##$SIGF1= 0
##$SIGF2= 0
##$SINO= 400
##$SIOLD= 32768
##$SREGLST= <1H.CDCl3>
##$SSB= 0
##$STSI= 32768
##$STSR= 0
##$SW_p= 5175.98343685301
##$SYMM= 0
##$S_DEV= 0
##$TDeff= 65536
##$TDoff= 0
##$TI= <Analysis number 999999
Compound Code 99
Book Reference 9
Project Code 9>
##$TILT= no
##$TM1= 0
##$TM2= 0
##$TOPLEV= 0
##$USERP1= <user>
##$USERP2= <user>
##$USERP3= <user>
##$USERP4= <user>
##$USERP5= <user>
##$WDW= 1
##$XDIM= 32768
##$YMAX_p= 305966772
##$YMIN_p= -46234
$$ End of Bruker specific parameters
$$ ---------------------------------
##NTUPLES= NMR SPECTRUM
##VAR_NAME=  FREQUENCY,     SPECTRUM/REAL,   SPECTRUM/IMAG
##SYMBOL=    X,             R,               I
##VAR_TYPE=  INDEPENDENT,   DEPENDENT,       DEPENDENT
##VAR_FORM=  AFFN,          ASDF,            ASDF
##VAR_DIM=   32768,         32768,           32768
##UNITS=     HZ,            ARBITRARY UNITS, ARBITRARY UNITS
##FACTOR=    0.157963299565203, 1,           1
##FIRST=     4132.6476996994, 0,             0
##LAST=      -1043.33573715361, 0,           0
##MIN=       -1043.33573715361, -46234,      0
##MAX=       4132.6476996994, 305966772,     0
$$ Real data points
##PAGE= N=1
##DATA TABLE= (X++(R..R)), XYDATA
$$ [...]
18637a3195J1419r02o51R36j905l219J795O426l103n769J824N226J728l854l464
$$ -13195 -1776 -2678 -3329 -2393 -4298 -7517 -5722 704 -2399 -8168 -6344 -1118 610 -3244 -6708
18622f708J9k669j499N00O307r02k890K051L448o42n538J444R323j249K589K328
$$ -6708 -6689 -9358 -10857 -10357 -4050 -4952 -7842 -5791 -2343 -2985 -8523 -7079 2244 995 3584 5912
18606E912K76k750n971m363q85L334o821R227J0361k43p195j031L641n458j105
$$ 5912 6188 3438 -2533 -6896 -7781 -4447 -11268 -2041 8320 8077 882 -149 3492 -1966 -3071
18591c071o093N10j335k478n21M406J030j51K442J231L843o91L63K80Q942r198
$$ -3071 -9164 -8654 -9989 -12467 -12988 -8582 -7552 -7703 -5261 -4030 -187 -878 -515 -235 8707 -491
18575d91q45Q474L626m100l974p728j500K013K890K889n277j019k278L048J190
$$ -491 -1336 7138 10764 6664 2690 -5038 -6538 -4525 -1635 1254 -4023 -5042 -7320 -4272 -3082
18560c082j321k353q02O806K077o522o938q39n694J787L620J724M383J955P9j485
$$ -3082 -4403 -6756 -7558 -752 1325 -5197 -12135 -12974 -18668 -16881 -13261 -11537 -7154 -5199 -5120 -6605
18544f605q038N381N790K030j2532k182l977j29J126J1799Q475r290l989O889
$$ -6605 -14643 -9262 -3472 -1442 -13974 -16156 -20133 -20262 -19136 -7337 1138 -8152 -12141 -5252
18530e252K001j901r648q536J25M601L753M986P219J641k591o764m659M617q194
$$ -5252 -3251 -5152 -14800 -23336 -23211 -18610 -14857 -9871 -2652 -1011 -3602 -10366 -15025 -10408 -18602
18515a8602j59Q611M121O468q64p602j590Q245k693n635o870J301k969M177J020
$$ -18602 -18761 -10150 -6029 439 -425 -8027 -9617 -1372 -4065 -9700 -16570 -15269 -18238 -14061 -13041
18500a3041N673M421J922q76p236n912L396J0784M531k722m714l030q035o7M591
$$ -13041 -7368 -2947 -1025 -1901 -9137 -15049 -11653 -869 3662 940 -3774 -6804 -14839 -14906 -10315
18485a0315K522o477m166m851J6517K022J117L457k378n404O320M876J94l272
$$ -10315 -7793 -14270 -18436 -23287 -6770 -4748 -3631 -174 -2552 -7956 -1636 3240 3434 162
18471A62r655K023P785l020n617L16q050r488J0158P166L52k319o210n68R90P566
$$ 162 -9493 -7470 315 -2705 -8322 -8006 -16056 -25544 -15386 -8220 -7868 -10187 -16397 -16965 -15975 -8409
18455h409O550M89J154J387q785l953K816M175m883k112O204N81o026L959Q171
$$ -8409 -1859 -1370 -216 1171 -7614 -11567 -8751 -4576 -9459 -11571 -5367 -4786 -10812 -6853 1318
18440A318j109m370J688K512J023j169M797l77j0189r84R2l543N395J313O575
$$ 1318 209 -4161 -2473 39 1062 -107 4690 4313 -5876 -6860 -6768 -10311 -4916 -3603 2972
18425B972o998m556O649n149l088L046N718j944K757l652j891L839k268o789k17
$$ 2972 -4026 -8582 -1933 -7082 -10170 -7124 -1406 -3350 -593 -4245 -6136 -2297 -4565 -11354 -11571
18410a1571Q712Q329p34l490M165K867k635q340J626Q372k250n507j41K159n344
$$ -11571 -2859 5470 4736 1246 5411 8278 5643 -2697 -1071 7301 5051 -456 -597 1562 -3782
18395c782K107m44o263Q623N97n556k307l257J286m522l315O489N850p28K462
$$ -3782 -1675 -2119 -8382 241 838 -4718 -7025 -10282 -8996 -13518 -16833 -10344 -4494 -5222 -2760
18380b760K040L920p455j559l560j0245P829O935M962N349k911j499N443J84j54
$$ -2760 -720 3200 -4255 -5814 -9374 -19619 -11790 -4855 107 5456 2545 1046 6489 6673 6519
18365F519m106r813j194J0561L03m019n061k597N410K076k501L872M846Q250L786
$$ 6519 2413 -7400 -8594 1967 2270 -1749 -6810 -9407 -3997 -1921 -4422 -550 4296 12546 16332
18350A6332K734K092m499j2519k070k166n355k20L552M145p632p438n477p19M2
$$ 16332 19066 21158 16659 4140 2070 -96 -5451 -5671 -2119 2026 -5606 -13044 -18521 -19240 -19198
18335a9198P173L08J992L491N490P641L276m124l721j09p436q76k202N350J831
$$ -19198 -12025 -11717 -9725 -6234 -744 6897 10173 6049 2328 2219 -5217 -6093 -8295 -2945 -1114
18320a114L492K032L766J531k986p039n743J701Q687p997j612j175j895q10n908
$$ -1114 2378 4410 8176 9707 6721 -318 -6061 -4360 4327 -3670 -5282 -6457 -8352 -9162 -15070
18305a5070n714L192N198N705M941j658n12l721m000j317k413J331M572k527k274
$$ -15070 -20784 -17592 -12394 -6689 -1748 -3406 -3918 -7639 -11639 -12956 -15369 -14038 -9466 -11993 -14267
18290a4267K917r12k13O977M249J483N003l288n58p589j1228N6r141p426R810
$$ -14267 -11350 -12262 -12475 -5498 -1249 234 5237 1949 1391 -6198 -17426 -17370 -26511 -33937 -24127
18275b4127J6730m85m170M577P88M057J171L380M725n174j1916l52P081Q02o352
$$ -24127 -7397 -7882 -12052 -7475 -6687 -2630 -1459 1921 6646 1472 -10444 -10796 -3715 -2913 -9265
18260i265r566m465M993L646M438M682o731j964O055J2568M686p516m658K937
$$ -9265 -18831 -23296 -18303 -14657 -10219 -5537 -12268 -14232 -8177 4391 9077 1561 -3097 -160
18246a60p703m273P620j03k890L758k712j300r54M943J849k09N191j0878p345
$$ -160 -7863 -12136 -4516 -4619 -7509 -3751 -6463 -7763 -8717 -3774 -1925 -2134 3057 -7821 -15166
18231a5166l706j0J1386O404O155q451r046K078K721q31n550p960l30J902L85
$$ -15166 -18872 -18882 -7496 -1092 5063 -3388 -12434 -10356 -7635 -8466 -14016 -21976 -22306 -20404 -20019
18216b0019L721O902K43J0752O941j048n961l248j0231o1o766j186N987N929J1598
$$ -20019 -16298 -9396 -9153 1599 8540 7492 1531 -1717 -11948 -12009 -18775 -19961 -13974 -8045 3553
18201C553K569r457j0705l082J55N283K925j161M415K473k943m635k043r345J289
$$ 3553 6122 -3335 -14040 -17122 -16967 -11684 -8759 -9920 -5505 -3032 -5975 -10610 -12653 -21998 -20709
18186b0709K408k804N113O72K583M481N902n725q488M089O464m238R4O096j0113
$$ -20709 -18301 -21105 -15992 -15320 -12737 -8256 -2354 -8079 -16567 -12478 -6014 -10252 -10158 -4062 -14175
18171a4175j6035Q089J6681k192p589O598N428j447l320j1028J416J514P327R94
$$ -14175 -30210 -22121 -5440 -7632 -15221 -8623 -3195 -4642 -7962 -18990 -17574 -16060 -8733 -7739
18157g739o222k494J939J009K285o02n83m020M313P86k471J381o853m81J900J0043
$$ -7739 -13961 -16455 -14516 -13507 -11222 -11824 -12407 -16427 -12114 -11328 -13799 -12418 -19271 -19752 -17852 -7809
18141g809M032Q52k527j2092p09J1797J6597l023j1N818R774k327L671J5256K7209
$$ -7809 -3777 -2925 -5452 -17544 -18253 -6456 10141 7118 7107 12925 22699 20372 24043 39299 66508
18126F6508J9977J8426K1476K6634K7084M7117O4598Q6237J33235K22062L57608
$$ 66508 86485 104911 126387 153021 180105 227222 291820 378057 511292 733354 1090962
18115A090962O17017J106788J715974J987477J578170Q55722M55422j59027j318534
$$ 1090962 1707979 2814767 4530741 6518218 8096388 8952110 9407532 9248505 7929971
18106G929971k069747j735029j153095p67130n12906l52712k56181j94343j50679
$$ 7929971 5860224 4125195 2972100 2204970 1692064 1339352 1083171 888828 738149
18097G38149j02240p6570o3995m6674l7146k6079k2161k1801j7901j9463j9331
$$ 738149 635909 559339 495344 448670 411524 385445 363284 341483 323582 304119 284788
18086B84788j1500j2635j4940j6809j6211j5481o106j2148o837m671r181k511
$$ 284788 273288 260653 245713 228904 212693 197212 191106 178958 172121 167450 158269 155758
18074A55758o642q529r258j3973N623n000r393P359m78j2350r280m684o845n535
$$ 155758 149116 140587 131329 117356 122979 117979 108586 115945 115467 103117 93837 89153 82308 76773
18060G6773q460j981J291K864j541l210l270n745O649k27M487m414o948k634J3004
$$ 76773 68313 66332 67623 70487 68946 65736 62466 56721 63370 63143 67630 63216 56268 53634 66638
18045F6638M578m688q277n857M671Q05n945n154o72J935k502r44M9p060k878j968
$$ 66638 71216 66528 58251 52394 57065 57870 51925 46771 46099 48034 45532 44588 44637 37577 34699 32731
18029C2731k431l971L555O714O950o319n226N127L848n887M159M49n373n378L768
$$ 32731 30300 26329 29884 36598 43548 37229 32003 37130 40978 35091 39250 39699 34326 28948 32716
18014C2716k526m026J282o50J096J009k016K57M225j1127j016K656o788l257n69
$$ 32716 30190 26164 27446 26796 27892 28901 26885 27142 31367 20240 19224 21880 15092 11835 11266
17999A1266Q745j304m683l59j072J299k716J594M726J752Q356k401p527K360m826
$$ 11266 20011 18707 14024 13665 12593 13892 11176 12770 17496 19248 27604 25203 17676 20036 15210
17984A5210k954P5J0272R680K492k662j889J60l799L678p669n46K185m189O97
$$ 15210 12256 12331 22603 32283 34775 32113 30224 30384 26585 30263 22594 22048 24233 20044 20741
17969B0741N717o571o684o350K399R275M319l370j527q383j94k58R074p34q245
$$ 20741 26458 19887 13203 6853 9252 18527 22846 19476 17949 9566 9372 9114 18188 17454 9209
17954I209j837J790j932k621k805J725j530M432K089J536j513l664J433M800L387
$$ 9209 7372 9162 7230 4609 1804 3529 1999 6431 8520 10056 8543 4879 6312 11112 14499
17939A4499o735N530N693m79o336m392N76j598l571K786l468P836K469k874J15
$$ 14499 7764 13294 18987 18508 12172 7780 8356 6758 3187 5973 2505 10341 12810 9936 10051
17924A0051J2478L95k395n573r781l999L778N301O675j424o137r14K747Q508J55
$$ 10051 22529 22924 20529 14956 5175 1176 4954 10255 16930 15506 9369 8455 11202 19710 19865
17909A9865q293P111K741j0730q420j023M617R06J994o657p474M135N10K084K125
$$ 19865 11572 18683 21424 10694 2274 1251 5868 6774 8768 2111 -5363 -1228 -718 1366 3491
17894C491n465P693J322j675m436l263N013k493J368O326p374n183L366Q550M706
$$ 3491 -1974 5719 7041 5366 930 -2333 2680 187 1555 7881 507 -4676 -1310 7240 11946
17879A1946n357m741O368m785r603l76N854o324M662J0339Q714l436O921n485
$$ 11946 6589 1848 8216 3431 -6172 -6548 -694 -7018 -2356 7983 16697 13261 20182 14697
17865A4697n354q79j077m701P023K908p639l071N296l10k161k071m777N194O503
$$ 14697 9343 8464 7387 2686 9709 12617 4978 1907 7203 6893 4732 2661 -2116 3078 9581
17850I581K17Q91m629L047J2621m22r313m577l389k77n675K550k931N188J364
$$ 9581 9798 10689 6060 9107 21728 21306 11993 7416 4027 3750 -1925 625 -2306 2882 4246
17835D246j0741n110Q410O002O233L684K102k8j2984p094j771O908J0083J377
$$ 4246 -6495 -11605 -3195 2807 9040 12724 14826 14798 1814 -5280 -7051 -143 9940 11317
17821A1317J644l752n683j442L653k880j290p078o612n36Q066K673j076K690N053
$$ 11317 12961 9209 3526 2084 5737 2857 1567 -5511 -12123 -12659 -4593 -1920 -2996 -306 4747
17806D747Q649K249j0359n54L837n808q506O90P289j444N24O229o63n381m795
$$ 4747 13396 15645 5286 4732 8569 2761 -5745 -5055 2234 790 1314 7543 6880 1499 -3296
17791c296l08K757N542N226J530O001L78p121q238Q2R64j660j608j356Q967L162
$$ -3296 -3604 -847 4695 9921 11451 17452 17830 10709 2471 2553 3517 1857 249 -1107 7860 11022
17775A1022k863l060q97o015m928K278M57M247K670K764j158l050K412o141K870
$$ 11022 8159 5099 4202 -1813 -6741 -4463 -4006 241 2911 5675 4517 1467 3879 -2262 608
17760F08O325Q365p289o231P242R28L65O275o919j0712n553K06M378J3151N33
$$ 608 6933 15298 8009 1778 9020 9948 10313 16588 9669 -1043 -6596 -6390 -2012 11139 11672
17745A1672r419p391m16P95m464K728N950J922n649k277Q480K467Q404k140q385
$$ 11672 2253 -5138 -5554 -4759 -9223 -6495 -545 1377 -4272 -6549 1931 4398 12802 10662 2277
17730B277J10Q326O895J098j883L765k114j0889n056K517m11N097k498n182j135
$$ 2277 2387 10713 17608 18706 16823 20588 18474 7585 2529 5046 4635 9732 7234 2052 917
17715I17l945l461j773L924j659J125K639N339L000q182N47P456l298J043M102
$$ 917 -3028 -6489 -8262 -4338 -5997 -4872 -2233 3106 6106 -2076 -1529 5927 2629 3672 7774
17700G774k63L143n68p629L365L152J399O640j652r425k765l939q579k435M977
$$ 7774 7511 10654 10086 2457 5822 8974 10373 17013 15361 5936 3171 -768 -9347 -11782 -6805
17685f805j754n85M47l901j201K685J392J0927P227k661k650O248l456l934m087
$$ -6805 -8559 -9144 -8697 -12598 -13799 -11114 -9722 1205 8432 5771 3121 9369 5913 1979 -2108
17670b108j035j049Q95L745K719O156O17l419l161J124o862o03j76O078N589L560
$$ -2108 -3143 -4192 -3297 448 3167 9323 9940 6521 3360 4484 -2378 -2981 -3157 2921 8510 12070
17654A2070j008p597j1089n296J2702P384K559l860j0337j606Q515k43p636k620
$$ 12070 11062 3465 -7624 -12920 -218 7166 9725 5865 -4472 -6078 2437 2194 -5442 -8062
17640h062R91J997o076O60N664j054p315n467o35R552M998M963P323m291L79L648
$$ -8062 -7071 -5074 -11150 -10490 -4826 -5880 -13195 -18662 -19297 -9745 -4747 216 7539 3248 3627 7275
17624G275k756O20m323j223M170k464K5k972l880l4j3085L227P099k407N80O513
$$ 7275 4519 5139 816 -407 3763 1299 1324 -1648 -5528 -5562 -18647 -15420 -8321 -10728 -10148 -3635
17608c635N133M162p386j3842P922Q134P504l34m745l653q29P35N526N281q709
$$ -3635 1498 5660 -1726 -15568 -7646 488 7992 7658 2913 -740 -1569 -834 4692 9973 1264
17593A264p393j400j225J0916N388j85l277j7289M827R525K504q249L54M726O93
$$ 1264 -6129 -7529 -8754 2162 7550 7365 4088 -13201 -8374 1151 3655 -4594 -4240 486 1179
17578A179j161O765j335O243L683r683L015m553l168K06N947M997R12p2p657q57
$$ 1179 18 6783 5448 11691 15374 5691 8706 4153 985 1191 7138 12135 13047 12975 5318 4461
17562D461p153j936k510K804N164K633k09n009J910M10j685k079J099ok782O781
$$ 4461 -2692 -4628 -7138 -4334 830 3463 3254 -1755 155 565 -1120 -3199 -2100 -2106 -4888 1893
17546A893J708J000n218j16N908J41m331M47N119P915p252n964L057k455m867
$$ 1893 3601 4601 -617 -733 5175 5316 985 1432 6551 14466 7214 1250 4307 1852 -3015
17531c015m15L852K884l016O716J244k162o255n435L502Q899k552k099N948j835
$$ -3015 -3430 422 3306 290 7006 8250 6088 -167 -5602 -2100 6799 4247 2148 8096 6261
17516F261K095j762j476L523k594o971m200K529P189j245n82N34j255N622j205
$$ 6261 8356 6594 5118 8641 6047 -924 -5124 -2595 4594 3349 2767 3301 2046 7668 6463
17501F463o504m653n883O474K00m006l032N947q19L393N325M795J026q314j691
$$ 6463 -41 -4694 -10577 -4103 -3903 -7909 -10941 -4994 -5813 -2420 2905 7700 8726 412 -1279
17486a279L758q149n923j024Q074P653j040n381K344R664k224n784k597K014n541
$$ -1279 2479 -5670 -11593 -12617 -4543 3110 2070 -3311 -967 8697 6473 689 -1908 106 -5435
17471e435k853L014Q814l171k63O033M328l256p07n408J015l165p72M700O588
$$ -5435 -8288 -5274 3540 369 106 6139 10467 7211 6504 1096 2111 -1054 -1826 2874 9462
17456I462N454o673o599O047K768n313O09M879k613k912M383P928J5161Q333K333
$$ 9462 14916 8243 1644 7691 10459 5146 5755 10634 8021 5109 9492 17420 32581 40914 43247
17441D3247Q666N84k713p569j1636j2884q190J380K552J107q831l954j606j53
$$ 43247 51913 52497 49784 42215 30579 17695 9505 10885 13437 14544 5713 1759 153 0
17427@L127n678m15K616n777k656N381O483k594J0390Q239o226p708k348O826
$$ 0 3127 -2551 -2966 -350 -6127 -8783 -3402 3081 487 10877 19116 12890 5182 2834 9660
17412I660L860J0869j487k937p161o700n432J858K569j539K001p859P244k589
$$ 9660 13520 24389 22902 19965 12804 6104 672 2530 5099 3560 5561 -2298 4946 2357
17398B357l211M222m633K613K273m850O40j853n258R312K334j088N761l784r051
$$ 2357 -854 3368 -1265 1348 3621 -1229 -589 -2442 -7700 1612 3946 2858 8619 4835 -4216
17383d216K21L877L955L548m94j893N640M722m920j17o639m119K674J1663K492
$$ -4216 -3995 -118 3837 7385 6891 4998 10638 15360 10440 10323 3684 -435 2239 13902 16394
17368A6394o164p9R587j039r246r043n918K057q33o049L85M501Q766l801j3351
$$ 16394 10230 10151 19738 18699 9453 410 -5508 -3451 -4284 -10333 -9948 -5447 3319 -482 -13833
17353a3833J787Q930o627o762J537Q13K593K218l105p842K024J843m68L149N634
$$ -13833 -12046 -3116 -9743 -16505 -14968 -14155 -11562 -9344 -12449 -20291 -18267 -16424 -16892 -13743 -8109
17338h109R663l858o0k601j3709l158K525J1146o171r135j910J2699N083J478
$$ -8109 1554 -2304 -2364 -4965 -18674 -21832 -19307 -8161 -14332 -23467 -25377 -12678 -7595 -6117
17324f117p200l07Q085L482L84P707O680K048r445j0322l438l9Q297q650j1166
$$ -6117 -13317 -13624 -5539 -2057 -1673 6034 12714 14762 5317 -5005 -8443 -8482 -185 -8835 -20001
17309b0001J151N071L852P641o62j051L071j0074q255J464O756L161O593L847
$$ -20001 -18850 -13779 -9927 -2286 -2948 -3999 -928 -11002 -19257 -17793 -11037 -7876 -1283 2564
17295B564o039K05M207J870J887n846l724j189m843p35Q230Q610L831m880k090
$$ 2564 -3475 -3270 937 2807 4694 -1152 -4876 -6065 -10908 -11643 -3413 5197 9028 4148 2058
17280B058p388N045K631j05j307K691P370k846j0436J703O91n854o60J539R391
$$ 2058 -5330 -285 2346 2241 934 3625 10995 8149 -2287 -584 107 -5747 -6407 -4868 4523
17265D523M932R79n59m691K197m285q934o326N448Q968K430k150p247k794L220
$$ 4523 9455 10434 9875 5184 7381 3096 -5838 -12164 -6716 2252 4682 2532 -4715 -7509 -4289
17250d289M088N87m314J883L516o616r579P255Q835N594k372o610k774k860M19
$$ -4289 -201 386 -3928 -2045 1471 -5145 -14724 -7469 1366 6960 4588 -2022 -4796 -7656 -7237
17235g237K598j671Q639O31k12m219n547l152M026Q706M498L27J986j2191r10
$$ -7237 -4639 -6310 2329 2960 2748 -1471 -7018 -10170 -6144 2562 7060 7387 9373 -2818 -3728
17220c728M462M444q1j569n2j788N406P562n323q219p023m816P933J2508K529
$$ -3728 734 5178 5097 3528 3476 1688 7094 14656 9333 1114 -5909 -10725 -2792 9716 12245
17205A2245p272q1O598q15j3197l151O902n66L182K723l88k659r866P146j719
$$ 12245 4973 4892 11490 10675 -2522 -5673 1229 663 3845 6568 6180 3521 -6345 801 -918
17190i18K580j597J627o371m279Q68K510J1838M516q20o062p411j143L03O161
$$ -918 1662 65 1692 -4679 -8958 -8090 -5580 6258 10774 9954 3892 -3519 -4662 -4359 1802
17175A802R12r435j1953R541N267J459K911j1959j418J1359P489N764k725J872
$$ 1802 2714 -6721 -18674 -9133 -3866 -2407 504 -11455 -12873 -1514 5975 11739 9014 10886
17161A0886K84r252j0204j062L928j753M373O408l107j251J453K380J892j313
$$ 10886 11170 1918 -8286 -9348 -5420 -7173 -2800 3608 501 -750 703 3083 4975 3662
17147C662q412l014K507j432p341L093J1924K791q25k306j10M460Q99j1084l125
$$ 3662 -4750 -7764 -5257 -6689 -14030 -10937 987 3778 2953 647 537 4997 5896 -5188 -8313
17132h313j322n664R504M3n617l273J561N514J154O916J017j335l917l023k264
$$ -8313 -9635 -15299 -5795 -5752 -11369 -14642 -13081 -7567 -6413 503 1520 185 -3732 -6755 -9019
17117i019Q652q24l395N861j91n128N923J92k634o539o197j898R33N651J0856
$$ -9019 -367 -1191 -4586 1275 1084 -4044 1879 2071 -563 -7102 -13299 -15197 -14264 -8613 2243
17102B243R22N36k6P287o510l327j217K061N053j36m389m398R42M237r04j656
$$ 2243 3165 3701 3675 10962 4452 1125 -92 1969 7022 6886 2497 -1901 -959 3278 2374 718
17086G18q75m813j1n355l316N169L370j076k41K560N852Q21O499J271p428j1670
$$ 718 -157 -4970 -4981 -10336 -13652 -8483 -5113 -6189 -6430 -3870 1982 2803 9302 10573 3145 -8525
17070h525p25P677K430j292m106n533n001p862L057O977L199Q783N551K44q489
$$ -8525 -9250 -1573 857 -435 -4541 -10074 -15075 -22937 -19880 -12903 -9704 -921 4630 4874 -3615
17055c615n390Q91P911j412q150n589R43N19J3344J6120L923j2544l410N534j3243
$$ -3615 -9005 -8114 -203 -1615 -9765 -15354 -14411 -13892 -548 15572 19495 6951 3541 9075 -4168
17040d168o713M227Q599l164p03l978m028N021m383o939J159R604O46n051k283
$$ -4168 -10881 -6654 1945 -1219 -1922 -5900 -9928 -4907 -9290 -16229 -15070 -5466 -4820 -9871 -12154
17025a2154L127O7J529J636l656O63N35J74R27K314M157P044k870j1938k082Q857
$$ -12154 -9027 -8960 -7431 -5795 -9451 -8788 -8253 -8079 -7152 -4838 -681 6363 3493 -8445 -10527 -1670
17009a670R771K47o269o710k810P161l057L89j840m68K227O6n59Q25L860m444
$$ -1670 8101 8348 2079 -4631 -7441 -280 -3337 -2948 -4788 -5256 -3029 -2963 -3522 -2697 1163 -3281
16993c281L634L838K358J271l364m079l160j709N057r04j801O600K644J3631q29
$$ -3281 353 4191 6549 7820 4456 377 -2783 -4492 565 -339 -2140 4460 7104 20735 19906
16978A9906j0587P059l466p003R49j760j648l271O787J71J543l83l581R02j615
$$ 19906 9319 16378 12912 5909 6858 5098 3450 179 6966 7137 8680 8297 4716 5618 4003
16963D003K10q52o488l894n2K270r168k946o546O33Q229J0214J900L585M673K362
$$ 4003 4213 3361 -3127 -7021 -7073 -4803 -13971 -16917 -23463 -22830 -14601 -4387 -2487 1098 5771 8133
16947H133p70L297l923m873k818J38l140m354r78p577N747M724K773l350O587
$$ 8133 7363 10660 6737 1864 -954 -816 -3956 -8310 -9288 -16865 -11118 -6394 -3621 -6971 -384
16932c84r394l838J0628J1136l773l603l779n125k493O814r62q16n320j655O940
$$ -384 -9778 -13616 -2988 8148 4375 772 -3007 -8132 -10625 -3811 -4773 -5589 -10909 -12564 -5624
16917e624N427P36P99O757p345n169j817N250L37K164N441j401L22K629r374o014
$$ -5624 -197 539 1338 8095 750 -4419 -6236 -986 -649 1515 6956 5555 5877 8506 -868 -6882
16901f882Q02L398m0m204k016J418J888j708j27M255N548n62l226m847l07J075
$$ -6882 -6080 -2682 -2722 -6926 -8942 -7524 -5636 -7344 -7471 -3216 2332 1770 -1456 -6303 -6610 -5535
16885e535O161K055j158J0008L345o444r192J128R07p18j250L782J523J789j347
$$ -5535 626 2681 1523 11531 14876 8432 -760 368 1275 557 -693 3089 4612 6401 5054
16870E054l878J740J499o582l59n50k265n252o677N646N489K553n475l885K690
$$ 5054 1176 2916 4415 -2167 -2526 -3076 -5341 -10593 -17270 -11624 -6135 -3582 -9057 -12942 -10252
16855a0252O371l71N944P980n435q790P70k441Q455N019K309N208k379o700j146
$$ -10252 -3881 -4252 1692 9672 4237 -4553 -3783 -6224 2231 7250 9559 14767 12388 5688 4542
16840D542n488M301j902j994k291j494M958O71K323l893l182J098L535l899l848
$$ 4542 -946 3355 1453 -541 -2832 -4326 632 1303 3626 -267 -3449 -2351 1184 -2715 -6563
16825f563L943m046l929M620k707j2406K666J6576P281J516l224j031N841K092
$$ -6563 -2620 -6666 -10595 -5975 -8682 -21088 -18422 -1846 5435 6951 3727 2696 8537 10629
16811A0629j396k889n614r693j479M324J1207L408m543j533Q595k203R801J1188
$$ 10629 9233 6344 730 -8963 -10442 -6118 5089 8497 3954 2421 11016 8813 18614 29802
16797B9802n979q681o991j3790m108J372M481L311q191q57N151M437J281k59l961
$$ 29802 23823 15142 8151 -5639 -9747 -8375 -3894 -583 -8774 -9631 -4480 -43 1238 979 -2982
16782b982L16L505j660l405m020o762k673M406L419r27l189R51N351j89M003o91
$$ -2982 -2666 839 -821 -4226 -8246 -15008 -17681 -13275 -9856 -10783 -13972 -13021 -7670 -7859 -3856 -4547
16766d547r393k405M798O356k267l032J2487l21o316K699P546M961n10r18r429
$$ -4547 -13940 -16345 -11547 -5191 -7458 -10490 1997 1676 -4640 -1941 5605 10566 10056 9138 -291
16751b91j721K46O99m263O512L563N591m233m441j746m945L668j320J82O381l879
$$ -291 -2012 -1766 -1067 -5330 1182 4745 10336 6103 1662 -84 -5029 -1361 -2681 -2499 3882 3
16735Cm401M943O47n865N437j9M412J2719L39l091k129m704p193m924m394K863
$$ 3 -4398 545 1192 -4673 764 745 5157 17876 18215 15124 12995 8291 1098 -3826 -8220 -5357
16719e357R80K928N207J173L3K346n188m556O316j720o276M137J0917m431o348
$$ -5357 -4377 -1449 3758 4931 4964 7310 2122 -2434 3882 2162 -4114 23 10940 6509 161
16704A61o00j021L747J205n215j813K336o75o119m119P957R835j712p185l342
$$ 161 -439 -1460 2287 3492 -1723 -3536 -1200 -1875 -7994 -12113 -4156 5679 3967 -3218 -6560
16689f560J375M896m76m162J2322k962q893j379N09M289N150Q630o00n969j585
$$ -6560 -5185 -289 -765 -4927 7395 4433 -4460 -5839 -5330 -1041 4109 12739 12139 6170 4585
16674D585n358j764m18q89l385k276M806P2M5m220O05K388M455K622O353Q185
$$ 4585 -773 -2537 -2955 -3844 -7229 -9505 -4699 -4627 -4582 -8802 -8197 -5809 -1354 1268 7621 15806
16658A5806n518n195n741K36O422L151P557J925j2420q862l571L025K493O03N829
$$ 15806 10288 5093 -648 -412 6010 9161 16718 18643 6223 -2639 -6210 -3185 -692 -89 5740
16643E740M395m718j1004n598P261J2961J2315p006j2387n83N722j411QP373l388
$$ 5740 10135 5417 -5587 -11185 -3924 9037 21352 14346 1959 1376 7098 5687 5695 13068 9680
16628I680n180M593p58j1477n406l944k493Q320N453N176J260m75K569L880j2718
$$ 9680 4500 9093 8335 -3142 -8548 -12492 -14985 -6665 -1212 3964 5224 4749 7318 11198 -1520
16613a520m152L665K912l663n788R528m92j779n554o455k310J427r46J3809N561
$$ -1520 -5672 -2007 905 -2758 -8546 982 490 -1289 -6843 -13298 -15608 -14181 -15127 -1318 4243
16598D243k819R34p446j6155l716Q681j264k857P574J053k968n439Q19J0384J4735
$$ 4243 1424 2358 -5088 -21243 -24959 -16278 -17542 -20399 -12825 -11772 -14740 -20179 -19360 -8976 5759
16583E759k594o707n615r925j654N474Q835J2107P213o671j1158q12O241K352
$$ 5759 3165 -3542 -9157 -19082 -20736 -15262 -6427 5680 12893 6222 -4936 -5748 493 2845
16569B845k325M483o77l324j561P108m945m808m191J406K516l743m028L934o3
$$ 2845 520 5003 4326 1002 -559 6549 1604 -3204 -7395 -5989 -3473 -7216 -11244 -7310 -7373
16554g373k739r356J209j79n709M692P91J470N29N135K772l097p411K956O927
$$ -7373 -10112 -19468 -18259 -18438 -24147 -19455 -18664 -17194 -16665 -11530 -8758 -11855 -19266 -16310 -9383
16539i383M56J246m937j879J003N343N066N684L659n424j909k794J253N181k72
$$ -9383 -8927 -7681 -12618 -14497 -13494 -8151 -3085 2599 6258 834 -1075 -3869 -2616 2565 2293
16524B293k684k726k029l437R788J0475L75o605k981o493k413J1071n452m760
$$ 2293 -391 -3117 -5146 -8583 1205 11680 12055 5450 2469 -4024 -6437 4634 -818 -5578
16510e578M312Q896j15p465o3J448j952q37k165J0895M166l713k157L19q264q620
$$ -5578 -1266 7630 7515 50 -13 1435 -517 -1354 -3519 7376 11542 7829 5672 5991 -2273 -10893
16494a0893q56O743K789J650l114l149k100o438n182O877P483M484O184k299o370
$$ -10893 -11749 -5006 -2217 -567 -3681 -6830 -8930 -15368 -20550 -13673 -6190 -1706 4478 2179 -4191
16479d191j431m17n584j257j30N54l58l527O149J0480j887L923P34O06l184n072
$$ -4191 -5622 -6039 -11623 -12880 -13010 -12456 -12814 -16341 -10192 288 -1599 2324 3058 3664 480 -4592
16463d592J488P875J40p845J26L134K848l077N11P566M581m912o844k420o641
$$ -4592 -3104 4771 4911 -2934 -2808 326 3174 97 608 8174 12755 7843 999 -1421 -8062
16448h062m07K862K030o204o891n352J3147J059J523L665N757j671O44J190Q491
$$ -8062 -8469 -5607 -3577 -9781 -16672 -22024 -8877 -7818 -6295 -2630 3127 1456 2100 3290 11781
16433A1781K46J44n855J639O7m218Q58j896k553L750J870m4n93k615n981J14P775
$$ 11781 12027 12171 6316 7955 8022 3804 4662 2766 213 3963 5833 5789 5196 2581 -3400 -3286 4489
16416D489l121J258M38K41j924K684k66J705n128m540N870N13M202J342m322l527
$$ 4489 1368 2626 3064 3305 1381 4065 3799 5504 376 -4164 1706 2219 6421 7763 3441 -86
16400h6k90m02j661m093R85J0306Q374M190L811j970m527q313j552r07j596l284
$$ -86 -376 -778 -2439 -6532 -5547 4759 13133 17323 21134 19164 14637 6324 4772 3865 2269 -1015
16384a015J707l063k955K636K793j546o092m9J516r27o364M489M517K248n009
$$ -1015 692 -2371 -5326 -2690 103 -1443 -7535 -7584 -6068 -6995 -13359 -8870 -4353 -2105 -7114
16369g114J249n8J186J0904j836O00j591J809J502j1338N065J096r897n992L509
$$ -7114 -5865 -5923 -4737 6167 4331 4931 3340 5149 6651 -4687 378 1474 -8423 -14415 -10906
16354a0906J1053J0029o13n180p097L753M033K450K929J23p314m304l596J289
$$ -10906 147 10176 9563 4383 -2714 1039 5072 7522 10451 10574 3260 -1044 -4640 -3351
16340c351N728K995j263R412q97N36q320p359N26M667k957j472l756j492K863
$$ -3351 2377 5372 4109 13521 12624 13160 4840 -2519 -1993 2674 -283 -1755 -5511 -7003 -4140
16325d140N199N227m983n448L263k597m870L58L765m374k34Q093J362J323l247
$$ -4140 1059 6286 1303 -4145 -882 -3479 -8349 -7991 -4226 -8600 -8834 -741 621 1944 -1303
16310a303j491K275R136j650j1042k382L995l504j626N029R41o57l799M276J768
$$ -1303 -2794 -519 8617 6967 -4075 -6457 -2462 -5966 -7592 -2563 -1622 -2279 -6078 -1802 -34
16295c4L69k245j141Q069m18l713m934L551N040j137J2936k056o686k511q086
$$ -34 335 -1910 -3051 5018 4600 887 -4047 -496 4544 3407 16343 14287 7601 5090 -2996
16280b996l144j075j110j097M968k282o271l803J497L802K131O077M616Q536O779
$$ -2996 -6140 -7215 -8325 -9422 -4454 -6736 -13007 -16810 -15313 -11511 -9380 -3303 1313 9849 16628
16265A6628o246m605K710j014K710O52j380K074q48J874k447p051k85o86l288
$$ 16628 10382 5777 8487 7473 10183 10835 9455 11529 10681 12555 10108 3057 2772 2086 -1202
16250a202o56R17m9K824k245L12L365K728q709M32j351M358j264n637M31j082
$$ -1202 -1858 -941 -990 1834 -411 -99 3266 5994 -2715 -2283 -3634 724 -540 -6177 -5746 -6828
16234f828p065K561M007m601K538M15J1388O61k960l34M189p169K925K743l449
$$ -6828 -13893 -11332 -7325 -11926 -9388 -8973 2415 3076 116 -218 3971 -3198 -273 2470 -979
16219i79J684p595n726j431O574O515n06K497M709P75L398j1625R11MJ172j528
$$ -979 705 -6890 -12616 -14047 -7473 -958 -1464 1033 5742 6517 9915 -1710 -799 -795 377 -1151
16203a151q625J721P939M994J625p480m822j794J633L606L605L960o439l996M332
$$ -1151 -9776 -8055 -116 4878 6503 -977 -5799 -7593 -5960 -2354 1251 5211 -1228 -5224 -892
16188h92P171P72o976J668N269m541l734J462J084P361k679n272J237J178p336
$$ -892 6279 7051 75 1743 7012 2471 -1263 199 1283 8644 5965 693 1930 3108 -4228
16173d228o25J472J0556L977l06j617L002p7n500k028O829n10j054q580M812Q555
$$ -4228 -4853 -3381 7175 11152 10846 9229 12231 12154 6654 4626 11455 10945 9891 1311 6123 14678
16157A4678j569j0714k752N892o476n751L357N413n426j4803J950N257J546J0596
$$ 14678 13109 2395 -357 5535 -941 -6692 -3335 2078 -3348 -18151 -16201 -10944 -9398 1198
16143A198M292q060K483M80P23P493p508M933M236p766j331M81l027j523J357
$$ 1198 5490 -2570 -87 393 1116 8609 1101 6034 10270 2504 1173 1654 -1373 -2896 -1539
16128a539J701N750M40l836n499M147K652L858M821l313j0698K802Q651j553O193
$$ -1539 162 5912 6352 2516 -2983 1164 3816 7674 12495 9182 -1516 1286 9937 8384 14577
16113A4577k960j1353q033O30K254M2k199M00l714M214L158m491J061p649L376
$$ 14577 11617 264 -7769 -7139 -4885 -4843 -7042 -6642 -10356 -6142 -2984 -7475 -6414 -14063 -10687
16098a0687o761j107O764K735K10M113K804l11l271N349k066p640j826L091l256
$$ -10687 -17448 -18555 -11791 -9056 -8846 -4733 -1929 -2240 -5511 -162 -2228 -9868 -11694 -8603 -11859
16083a1859l287L292J19j722l277J647Q419l573j257R200M659Q660k910r48j086
$$ -11859 -15146 -11854 -11735 -13457 -16734 -15087 -6668 -10241 -11498 -2298 2361 11021 8111 7163 6077
16068F077q63m873p918L924Q571n635k500K371K719j0454r496K249M404M373p32
$$ 6077 5214 341 -7577 -3653 4918 -717 -3217 -846 1873 -8581 -18077 -15828 -11424 -7051 -7783
16053g783n96K159p340m020K370M070r12Q493J1513j17m782M58n392K532j583
$$ -7783 -8379 -6220 -13560 -17580 -15210 -11140 -12052 -3559 7954 7837 3055 3513 -1879 653 -930
16038i30n943l886q791J367P791M716L318o59l311n13M541K726Q046o374n847
$$ -930 -6873 -10759 -19550 -18183 -10392 -5676 -2358 -3017 -6328 -6841 -2300 426 8472 2098 -3749
16023c749n234P88K956l06l795Q973J151n448J374P099j079k393O541M640o599
$$ -3749 -8983 -8195 -5239 -5545 -9340 -367 784 -4664 -3290 3809 2730 337 6878 11518 4919
16008D919j2710n093J0831L077M117K24N603k083o730j139K165j614p036K577
$$ 4919 -7791 -12884 -2053 1024 5141 5365 10968 8885 2155 1016 3181 1567 -5469 -2892
15994b892M234k075o26q1m51o851o193L631J546J6230R186k004j373k708O53k903
$$ -2892 1342 -733 -1359 -1440 -1891 -8742 -14935 -11304 -9758 6472 15658 13654 12281 9573 10226 7323
15978G323q632J522K886O634m371p421j016p69K673L458m039L97M09o237l884
$$ 7323 -1309 213 3099 9733 5362 -2059 -3075 -3844 -1171 2287 -1752 -1355 -946 -7183 -11067
15963a1067J2471k939M38O927K347J976J9j788K86M74l635N052N49j0988k755
$$ -11067 1404 -1535 -1097 5830 8177 10153 10172 8384 8670 9144 5509 10561 11110 122 -2633
15948b633N424k286m320J378p28m219O136Q908M649p937j3173L119Q423l179m857
$$ -2633 2791 505 -3815 -2437 -3165 -7384 -1248 7660 12309 4372 -8801 -5682 2741 -438 -5295
15933e295j887K044J119M138n542L904k017o812m289J738O555P160L246l639o064
$$ -5295 -7182 -5138 -4019 119 -5423 -1519 -3536 -10348 -14637 -12899 -6344 816 4062 423 -5641
15918e641m239N692R450j486r209l184J627k150n413m802Q86R494N191K507j732
$$ -5641 -9880 -4188 5262 3776 -5433 -8617 -6990 -9140 -14553 -19355 -18469 -8975 -3784 -1277 -3009
15903c009o407j932N103j913K324J342q710p220K664K110O843N080N203P21L866
$$ -3009 -9416 -11348 -6245 -8158 -5834 -4492 -13202 -20422 -17758 -15648 -8805 -3725 1478 2199 6065
15888F065Q088R97p732K94m146j0440K345M47l066j711J322j878l040J921L104
$$ 6065 14153 15150 7418 7712 3566 -6874 -4529 -4082 -7148 -8859 -7537 -9415 -12455 -10534 -7430
15873g430n470l545O504K966L53j1863m940J972J0674P093J971J26N758M84r879
$$ -7430 -12900 -16445 -9941 -6975 -6622 -18485 -23425 -21453 -10779 -3686 -1715 -1589 4169 4653 -5226
15858e226l443N040L564N707m56q42k91q46J867L278J156o786K47P69l082l813
$$ -5226 -8669 -3629 -65 5642 5186 4344 4053 3207 5074 8352 9508 2722 2969 3738 656 -3157
15842c157m401o135l844J0181O439J446k80j637q21L82Q99M137J184o332J008
$$ -3157 -7558 -13693 -17537 -7356 -917 529 249 -1388 -2209 -1827 -928 3209 4393 -1939 -931
15827i31J418K231p441o769J172j133J490M97M227Q796n134o264q664N351P096
$$ -931 487 2718 -4723 -11492 -10320 -11453 -9963 -9466 -5239 3557 -1577 -7841 -16505 -11154 -4058
15812d058K547n796r458l25M353J3031Q902n88n301n150r535r008j57J1694L989
$$ -4058 -1511 -7307 -16765 -17090 -12737 294 9196 8608 3307 -1843 -11378 -20386 -20543 -8849 -4860
15797d860K721L67k952K112k33q0o245m409q9J379N71k19R080J469l693j095L868
$$ -4860 -2139 -1772 -4724 -2612 -2845 -2925 -9170 -13579 -13668 -12289 -11718 -11937 -2857 -1388 -5081 -6176 -2308
15780b308j124p553R55Q115O420j860o335q311O138M760P4k263M237L388n090
$$ -2308 -3432 -10985 -10030 -1915 4505 2645 -3690 -12001 -5863 -1103 -1029 -3292 945 4333 -757
15765g57l092M20J108o71J035K777M802l407k899p792M162j051p987K126O111
$$ -757 -3849 -3429 -2321 -2992 -1957 820 5622 2215 -684 -8476 -4314 -5365 -13352 -11226 -5115
15750e115J280K477n546k176r96m59n525k384K724L814L79k06L383m32K654L418
$$ -5115 -3835 -1358 -6904 -9080 -10076 -10535 -16060 -18444 -15720 -11906 -11527 -11733 -8350 -8782 -6128 -2710
15734b710l9L335K415K388l559m20j0248p79J771K827M685n230N297Q97m331j512
$$ -2710 -2749 586 3001 5389 1830 1410 -8838 -9617 -7846 -5019 -334 -5564 -267 630 -3701 -5213
15718e213J625o596J947R331P237O986o272l218J653n120q148n774n536j438N40
$$ -5213 -3588 -10184 -8237 1094 8331 15317 9045 5827 7480 2360 -5788 -11562 -17098 -18536 -17996
15703a7996q31K594L754O791J833J823M504J1910o84k694L87m89l204J544m017
$$ -17996 -18827 -16233 -12479 -5688 -3855 -2032 2472 14382 13698 11004 11391 10902 7698 9242 5225
15688E225p610J587r61Q413k785K884J902L629l944m329m578K6o300r172r54Q945
$$ 5225 -2385 -798 -1759 6654 3869 6753 8655 12284 8340 4011 -567 -541 -6841 -16013 -16967 -8022
15672h022P281M28l666m629j425N306k00L204o730j575m672k91k273j886N875
$$ -8022 -741 -313 -3979 -8608 -10033 -4727 -4927 -1723 -8453 -10028 -14700 -14991 -17264 -19150 -13275
15657a3275O460M515P84j0103J095m095q374L145K093L986J69J062N80k46O191
$$ -13275 -6815 -2300 -1516 -11619 -10524 -14619 -22993 -19848 -17755 -13769 -13600 -12538 -11958 -12204 -6013
15642f013p28k021l5l111k818L80J912N330Q593j897M324q45o958j0023L221K245
$$ -6013 -6741 -8762 -8797 -11908 -14726 -14346 -12434 -7104 1489 -408 3916 3071 -3887 -13910 -10689 -8444
15626h444K557N848j554k486M631l701M069J844o303q53j0437R73R162J0475L007
$$ -8444 -5887 -39 -1593 -4079 552 -3149 920 2764 -3539 -4392 -14829 -13856 -4694 5781 8788
15611H788k321j959K563K457r596n14o89n624n0J945K192r994k240m743N522O929
$$ 8788 6467 4508 7071 9528 -68 -582 -1271 -6895 -6945 -5000 -2808 -12802 -15042 -19785 -14263 -7334
15595g334L224k045M64k708m516J489J3058J720j599j102J343J712J308K429N313
$$ -7334 -4110 -6155 -5691 -8399 -12915 -11426 1632 3352 1753 651 1994 3706 5014 7443 12756
15580A2756n171r839J674J82N268j0316o163L386J0210K207o135N277l649J850
$$ 12756 7585 -2254 -580 -398 4870 -5446 -11609 -8223 1987 4194 -1941 3336 -313 1537
15566A537Q860K699j0987k481l961P253P464k023N853l628p611o137j162n061
$$ 1537 10397 13096 2109 -372 -4333 2920 10384 8361 14214 10586 2975 -3162 -4324 -9385
15552i385P000N639j252n117O075Q146O37p718j1263n527l996n114R969O593J3216
$$ -9385 -2385 3254 2002 -3115 2960 11106 11743 4025 -7238 -12765 -16761 -21875 -11906 -5313 7903
15537G903k871o926k474l332J361K891K658j913k288J966p847r279N515J99l71
$$ 7903 5032 -1894 -4368 -7700 -6339 -3448 -790 -2703 -4991 -3025 -10872 -20151 -14636 -14437 -14808
15522a4808J2995M906N49r43O733l666l331K553M59o543N85K783l116L393K431
$$ -14808 -1813 3093 3642 2699 9432 5766 2435 4988 5447 -1096 -511 2272 -844 2549 4980
15507D980M808N193q483p947m091l797L013J555O945O482n589m279J004r524L08
$$ 4980 9788 14981 6498 -1449 -5540 -9337 -6324 -4769 2176 8658 3069 -1210 -206 -9730 -9422
15492i422R703K613n976q520l588N872N552Q79K659q21j023j631k556L650k751
$$ -9422 281 2894 -3082 -11602 -15190 -9318 -3766 -2887 -228 -1049 -2072 -3703 -6259 -2609 -5360
15477e360l987K25j893N965Q308K008J597o11P52n036j1674Q95M120q160j356
$$ -5360 -9347 -9122 -11015 -5050 3258 5266 6863 6252 7004 1968 -9706 -8811 -4691 -12851 -14207
15462a4207R554Q721J0218j153l145n064p355J448k275M982K941J534l206J814
$$ -14207 -4653 4068 14286 13133 9988 4924 -2431 -983 -3258 1724 4665 6199 2993 4807
15448D807K786n024j0813L28M741N976K257M429j682o692q810N56K041R08J652
$$ 4807 7593 2569 -8244 -7916 -3175 2801 5058 9487 7805 1113 -7697 -7141 -5100 -4192 -2540
15433b540o229Q296N874q51l185K680K338J700N355M771q85L77r331K130P239
$$ -2540 -8769 -473 5401 4550 1365 4045 6383 8083 13438 18209 17324 17701 8370 10500 17739
15418A7739o970m592R28q056o354m116K527R930L2p850k120o20M358P216J191
$$ 17739 10769 6177 7105 -951 -7305 -11421 -8894 1036 1068 -6782 -8902 -9522 -5164 2052 3243
15403C243o484P91P21n390K527j16J663J647N19m454o007K989Q526Q23N694O136
$$ 3243 -3241 -2450 -1729 -7119 -4592 -4708 -3045 -1398 -879 -5333 -11340 -8351 175 998 6692 12828
15387A2828L781J43j0578o561k098l60Q760J869o119q302J584Q130n039l669k988
$$ 12828 16609 16752 6174 -387 -2485 -2845 5915 7784 1665 -6637 -5053 3077 -1962 -5631 -8619
15372h619J919M411m11L77m584j0124o66O155J390k365k380m585j332Q072J2279
$$ -8619 -6700 -2289 -2700 -2323 -6907 -17031 -17697 -11542 -10152 -12517 -14897 -19482 -20814 -12742 -463
15357d63K13m148o241Rk000k77k741Q582J0159j91j0697L111q13n036k822R344
$$ -463 -250 -4398 -10639 -10630 -12630 -12907 -15648 -7066 3093 2902 -7795 -4684 -5497 -10533 -13355 -4011
15341d011M638q878m55L510L518O795R95Oq909k839K423l51l278r07K42p911L438
$$ -4011 627 -8251 -8706 -5196 -1678 5117 6112 6118 -2791 -5630 -3207 -3558 -6836 -7743 -7501 -15412 -11974
15324a1974N634J348p94K879J0273N277k736J577j744o100r210j0317j917M948
$$ -11974 -6340 -4992 -5786 -2907 7366 12643 9907 11484 9740 3640 -5570 -15887 -17804 -12856
15310a2856R076n062J600p268l342M529J87J114J5701J4359r684m076J962Q04
$$ -12856 -3780 -8842 -7242 -14510 -17852 -13323 -13136 -12022 3679 18038 8354 4278 6240 7044
15296G044n56k47k309m237q88J08m671p24L605l87M716J559J117j523M500k983
$$ 7044 6488 6241 3932 -305 -1193 -1085 -5756 -6480 -2875 -3262 1454 3013 4130 2607 7107 4124
15280D124k40n707j550l534k248k20N198J771j1172J732Q242M654J415k812M414
$$ 4124 3884 -1823 -3373 -6907 -9155 -9375 -4177 -2406 -13578 -11846 -3604 1050 2465 -347 4067
15265D067k912L177r9J044j926o250R29Q84r716k847j403q26n332M255P20J981
$$ 4067 1155 4332 4233 5277 3351 -2899 -1970 -1086 -10802 -13649 -15052 -15878 -21210 -16955 -16235 -14254
15249a4254M663P256P02J930m065n584P965J002n190K21M606o469k679O61q87
$$ -14254 -9591 -2335 -1633 297 -3768 -9352 -1387 -385 -5575 -5354 -748 -7217 -9896 -9235 -10122
15234a0122J1892J2403O34o938j1193r62M862l166M795Q659r15n698n597l509
$$ -10122 1770 14173 14807 7869 -3324 -4286 576 -2590 2205 10864 9949 4251 -1346 -4855
15220d855K867L665p604O871R931l463m951l7p492O54Q468J765o692j203j180
$$ -4855 -1988 1677 -5927 944 10875 7412 2461 2424 -5068 -4414 4054 5819 -873 -2076 -3256
15205c256o2p826K12J1503m930j0939k230J1254K748m797n82K414N19k113o906
$$ -3256 -3318 -11144 -10932 571 -4359 -15298 -17528 -6274 -3526 -8323 -8905 -6491 -5972 -8085 -14991
15190a4991O364J2097k376p398k587N855J0326J078o132p033L824n483l307O382
$$ -14991 -8627 3470 1094 -6304 -8891 -3036 7290 8368 2236 -4797 -973 -6456 -9763 -3381
15176c381m850Q08L966M834N284J958m665p248L194J1750O193O00o225n010p41
$$ -3381 -8231 -7423 -3457 1377 6661 8619 3954 -3294 -100 11650 17843 18443 12218 7208 6467
15161F467r2K72l809m379j126M475K102L543N120L48L362Q372M044j5188p788
$$ 6467 6375 6647 2838 -1541 -2667 1808 3910 7453 12573 12921 16283 24655 28699 13511 5723
15146E723R340L691k448l5N076j208M411J89k361K269O812n926q987j231l598
$$ 5723 15063 18754 16306 16271 21347 20139 24550 24739 22378 24647 31459 25533 16546 15315 11717
15131A1717Q118q120J017J189N28j445O60m293J060K494j826n439r086N89J0234
$$ 11717 19835 11715 12732 13921 14449 13004 13664 9371 10431 12925 11099 5660 -3426 -2837 7397
15116G397l621r896LQ293R393r50r169J540j1829l737k352L56K674P153J138o893
$$ 7397 3776 -6120 -6117 2176 11569 10619 1450 2990 -8839 -12576 -14928 -14572 -11898 -4745 -3607 -10500
15100a0500J1683O573j0376m657j446j256K978M240k210k307J504j63M291O104
$$ -10500 1183 7756 -2620 -7277 -8723 -9979 -7001 -2761 -4971 -7278 -5774 -5937 -1646 4458
15086D458m800o43K802J414o346j2080J1081Q374j179o17k461l044J751L554P22
$$ 4458 -342 -985 1817 3231 -3115 -15195 -4114 4260 3081 2464 3 -3041 -1290 2264 2986
15071B986O257M338j165n335l774L657M456J366n224k011n778N08N178J910j0849
$$ 2986 9243 13581 12416 7081 3307 6964 11420 12786 7562 5551 -227 281 5459 7369 -3480
15056c480o451N165j330M189l313k988P52R926n57l035J512K054J436l764j763
$$ -3480 -9931 -4766 -6096 -1907 -5220 -8208 -7456 2470 1913 -1122 390 2444 3880 116 -1647
15041a647o014J038P978Q726O251J513j0537q801N16J1145l211J074R02l405m708
$$ -1647 -7661 -6623 1355 10081 16332 17845 7308 -1493 -977 10168 6957 8031 8933 5528 820
15026H20J809m14m659m881R078L102K706k891q80p176J671o241O81P042K3K45
$$ 820 2629 2215 -2444 -7325 1753 4855 7561 4670 3790 -3386 -1715 -7956 -7275 -233 -210 35
15010C5M189r70j669O268L551J544j3039R48j534k745k249P286P64k212k031K603
$$ 35 4224 3254 1585 7853 11404 12948 -91 857 -677 -3422 -5671 1615 2379 167 -1864 739
14994G39K246p769K246L203l776q110L420J2534L629o986j905n564p420n266r3
$$ 739 2985 -4784 -2538 665 -3111 -11221 -7801 4733 8362 1376 -529 -6093 -13513 -18779 -18872
14979a8872M318M27l078K172P706M282l841p178j93J827J310L049M021k583Q86
$$ -18872 -14554 -14127 -17205 -15033 -7327 -3045 -6886 -14064 -14257 -12430 -11120 -8071 -4050 -6633 -5747
14964e747K296k845m822L022l783k30R796J038r398o045J138K661N976P927Q361
$$ -5747 -3451 -6296 -11118 -8096 -11879 -12109 -2313 -1275 -10673 -16718 -15580 -12919 -6943 984 9345
14949I345J279m296J235N903n976n262k045q25k690n951n887J1567L304n0m808
$$ 9345 10624 6328 7563 13466 7490 2228 183 -642 -3332 -9283 -15170 -3603 -299 -349 -5157
14934e157n88L690L996m396P289p81n303P33K685P322r124j3496k274R095N356
$$ -5157 -5745 -2055 1941 -2455 4834 4053 -1250 -517 2168 9490 366 -13130 -15404 -6309 -953
14919i53q037o1R620L717l5j056j485n954n67N997k846m159k310K368J474K663
$$ -953 -8990 -9051 569 4286 4251 3195 1710 -4244 -4811 1186 -1660 -5819 -8129 -5761 -4287 -1624
14903a624n399m283l21L687l840K419Q151N682l157L883L036m864L333q674q712
$$ -1624 -7023 -11306 -11627 -7940 -11780 -9361 -1210 4472 1315 5198 8234 3370 6703 -1971 -10683
14888a0683N740L192q686K047J3626J849j0158j0736k074j71J779N612L821q813
$$ -10683 -4943 -1751 -10437 -8390 5236 7085 -3073 -13809 -15883 -16054 -14275 -8663 -4842 -13655
14874a3655j09L098K893K500o071m6N592j036o87m043N642N591k374N923Q223
$$ -13655 -13764 -10666 -7773 -5273 -11344 -11390 -5798 -6834 -7521 -11564 -5922 -331 -2705 3218 11441
14859A1441j13q92q641R166N851q759l315O87L764j354Q08j488p408k263k434
$$ 11441 11328 10436 1795 10961 16812 8053 4738 5425 9189 7835 8643 7155 -253 -2516 -4950
14844d950M469j379O76k352r58K399j914j492J0263N345j601m061Q86L036l823
$$ -4950 -481 -1860 -1184 -3536 -4494 -2095 -4009 -5501 4762 10107 8506 4445 5331 8367 4544
14829D544l245O12k562p100k087L662O158p600k67L325K147N301l312p333o691
$$ 4544 1299 1911 -651 -7751 -9838 -6176 -18 -7618 -7885 -4560 -2413 2888 -424 -7757 -14448
14814a4448n396K280J1702N541l917P97r85Q658j277q271l68Q055L506p631J703
$$ -14448 -19844 -17564 -5862 -321 -4238 -3441 -4426 4232 2955 -5316 -5684 2371 5877 -1754 -51
14799e1k999k064K502J2179J099K70L04n098j0403M318M439m340J72j248k325
$$ -51 -3050 -5114 -2612 9567 10666 10936 11240 6142 -4261 57 4496 156 328 -920 -3245
14784c245j769L144l72k047o607N270J351n287m54M255L669p912K795q767j1319
$$ -3245 -5014 -1870 -2242 -4289 -10896 -5626 -4275 -9562 -10016 -5761 -2092 -10004 -7209 -15976 -27295
14769b7295Q69J0021J1895K159r76m756m217m393L77Q032J2315L147q323P75J216
$$ -27295 -26426 -16405 -4510 -2351 -3327 -8083 -12300 -16693 -16316 -8284 4031 7178 -1145 -370 846
14754H46J15O562J508m065l62l173J066k957k8k754M63j873l515p01p96K754N885
$$ 846 961 7523 9031 4966 4604 1431 2497 -460 -488 -3242 -2779 -4652 -8167 -8868 -9664 -6910 -1025
14737a025J111q956j3892K97R362M061K479J297L001m478p690l996N616M505N521
$$ -1025 86 -8870 -22762 -22465 -13103 -9042 -6563 -5266 -2265 -6743 -14433 -18429 -12813 -8308 -2787
14722b787P559k167o784q676k418P453N197J525q86J904p897J83K590j973j2989
$$ -2787 4772 2605 -4179 -12855 -15273 -7820 -2623 -1098 -1984 -80 -7977 -7794 -5204 -7177 -20166
14707b0166P64O424N921n97K279N087J2034J225j0629p625o20m614m452J402K410
$$ -20166 -19402 -12978 -7057 -7654 -5375 -288 11746 12971 2342 -5283 -5903 -10517 -14969 -13567 -11157
14692a1157L473m06N05l187k808K180J828k067n046K5R30M500N199J0832K953
$$ -11157 -7684 -8090 -7585 -10772 -13580 -11400 -9572 -11639 -16685 -16660 -15730 -11230 -6031 4801 7754
14677G754q777l242N732R960q29o159m079j998P390Q089o606j2563q076j318R68
$$ 7754 -1023 -4265 1467 11427 10598 4439 360 -1638 5752 13841 7235 -5328 -13404 -14722 -13754
14662a3754J595J531R771o2O42k192r864r90R662K113p758R872K522o170o121
$$ -13754 -12159 -10628 -857 -919 -277 -2469 -12333 -13323 -3661 -1548 -9306 566 3088 -3082 -9203
14647i203j588M703R047r57M844o845m24K310L656k514N628O689l228o565q932
$$ -9203 -10791 -6088 2959 2002 6846 1 -423 1887 5543 3029 8657 15346 12118 5553 -3379
14632c379k397j067Q695J075o301m767n727o331L964R753n10j0441k255R609P753
$$ -3379 -5776 -6843 1852 2927 -3374 -8141 -13868 -20199 -16235 -6482 -6992 -17433 -19688 -10079 -2326
14617b326l722j159N023K652k572n477p751Q9L543K039L091J516K468p42K272
$$ -2326 -6048 -7207 -2184 468 -2104 -7581 -15332 -15243 -11700 -9661 -6570 -5054 -2586 -3328 -1056
14602a056R453M781K865p635n406n389p404P374J4610O01j5526j917M039J384
$$ -1056 8397 13178 16043 8408 3002 -2387 -9791 -2417 12193 12794 -2732 -4649 -610 774
14588G74J552k825q710K134J1126Q49m552j724J696l080m85M494o745j896J894
$$ 774 2326 -499 -9209 -7075 4051 4900 348 -1376 320 -2760 -3245 1249 -5496 -7392 -5498
14573e498J567j016L812J388J591N656k374l397J042j1093R96J1912j61j825l970
$$ -5498 -3931 -4947 -1135 253 1844 7500 5126 1729 2771 -8322 -7326 4586 4425 2600 -1370
14558a370P660J3312n909m097M407P70o405k930l310j397K988p21L749J457O839
$$ -1370 6290 19602 13693 9596 14003 14773 8368 5438 2128 731 3719 2998 6747 8204 15043
14543A5043J342j1359p805L246M72j126m511k550N078K168M894m817m109n758
$$ 15043 16385 5026 -2779 467 939 -187 -4698 -7248 -2170 -2 4892 75 -4034 -9792
14529i792l519J625M487k815R655M188j0125O097M203m836K197j831r024N306
$$ -9792 -13311 -11686 -7199 -10014 -359 3829 -6296 -199 4004 -832 1365 -466 -9490 -4184
14515d184N138N071L387J645l420k718r851l487r204P69P582M569l392j408K034
$$ -4184 954 6025 9412 11057 7637 4919 -4932 -8419 -17623 -16854 -9272 -4703 -8095 -9503 -7469
14500g469j837j068N259m205P965R211J096N751J947q876j0220n317j195J020
$$ -7469 -9306 -10374 -5115 -9320 -1355 7856 8952 14703 16650 7774 -2446 -7763 -8958 -7938
14486g938k85K664K014L855m70j113n924Q66k374j960J79N775J571j408k336l344
$$ -7938 -8223 -5559 -3545 310 -160 -1273 -7197 -6331 -8705 -10665 -10486 -4711 -3140 -4548 -6884 -10228
14470a0228j500p466N100M569P070K038R268Q390r027n028n53j175k606k918R16
$$ -10228 -11728 -19194 -14094 -9525 -2455 -417 8851 17241 8214 3186 2633 1458 -1148 -4066 -3150
14455c150O125K865l164q058n093L96m187M704N488o970j160L93N553n840l899
$$ -3150 2975 5840 2676 -5382 -10475 -10079 -14266 -9562 -4074 -11044 -12204 -11811 -6258 -12098 -15997
14440a5997J0925O221n81m981J456O774k190K050K07o148n089j315J25K666K841
$$ -15997 -5072 1149 568 -4413 -2957 3817 1627 3677 3884 -2264 -7353 -8668 -8543 -5877 -3036
14425c036L750m17J515n619j2717l81L148P094n198j208M522J527j434J420m497
$$ -3036 714 297 1812 -3807 -16524 -16905 -13757 -6663 -11861 -13069 -8547 -7020 -8454 -7034 -11531
14410a1531l714l447m358k321L786Q556R070j325k109l53M777K266j363m483n398
$$ -11531 -15245 -18692 -23050 -25371 -21585 -13029 -3959 -5284 -7393 -7746 -2969 -703 -2066 -6549 -11947
14395a1947q909k797K526R169n465N291K451J776K578n095o282n432Q53j261L725
$$ -11947 -20856 -23653 -21127 -11958 -17423 -12132 -9681 -7905 -5327 -10422 -16704 -22136 -21283 -22544 -18819
14380a8819N997j832j073M330J0129L79o090j052k880K718L68N928l420n518p19
$$ -18819 -12822 -14654 -15727 -11397 -1268 -889 -6979 -8031 -10911 -8193 -7825 -1897 -5317 -10835 -11554
14365a1554j473m015N22R735L316l274q827l131K709J823Q609Q21L354k056n830
$$ -11554 -13027 -17042 -16520 -6785 -3469 -6743 -15570 -18701 -15992 -14169 -5560 -4739 -1385 -3441 -9271
14350i271l566l476P84K289j336N626J280n301M613o03J876l64l565M829m604
$$ -9271 -12837 -16313 -15529 -13240 -14576 -8950 -7670 -12971 -8358 -8961 -7085 -7449 -11014 -6185 -10789
14335a0789l654P079j102m11j271r290K55J860Q01L549M850P581J4586l07j3479
$$ -10789 -14443 -7364 -8466 -8877 -10148 -19438 -19183 -17323 -16522 -12973 -8123 -542 14044 13737 258
14320B58j566m627Q88M970k292Q19P438L298q723l943m072k66p531K689Q549J109
$$ 258 -1308 -5935 -5047 -77 -2369 -1550 5888 9186 463 -3480 -7552 -7818 -15349 -12660 -4111 -3002
14304c002k564n989j0492l820L707k279N114L250p860l618P674J5675J3748N459
$$ -3002 -5566 -11555 -22047 -25867 -22160 -24439 -19325 -16075 -23935 -27553 -19879 -4204 9544 15003
14290A5003l738k645L805P813r221n765j698k632N89m800k25N242Q398J541m701
$$ 15003 11265 8620 12425 20238 11017 5252 3554 922 1511 -3289 -3514 1728 10126 11667 6966
14275F966p937r332m923j406Q11m093n933M636n611k343J609L81l920N556J089
$$ 6966 -971 -10303 -15226 -16632 -15821 -19914 -25847 -21211 -26822 -29165 -27556 -27175 -31095 -25539 -24450
14260b4450j507R088R719J3192Q924r324j1161k188o603n287Q548J3536R272N485
$$ -24450 -25957 -16869 -7150 6042 14966 5642 -5519 -7707 -14310 -19597 -11049 2487 11759 17244
14246A7244K4518J1104K27L925l551m914j6813j9198j3502p004J105j75Q24J0926
$$ 17244 41762 52866 53093 57018 53467 48553 31740 12542 -960 -7964 -6859 -7034 -6210 4716
14232D716l947O106K1q211p211r196l831k704o047l756N398J2381k174L746l832
$$ 4716 769 6875 6896 -1315 -8526 -17722 -21553 -24257 -30304 -34060 -28662 -16281 -18455 -14709 -18541
14217a8541O587l66o354j691N09K811k410j77R392J543M653Q22q731Q359P403
$$ -18541 -11954 -12320 -18674 -20365 -19856 -17045 -19455 -19632 -10240 -8697 -4044 -3222 -11953 -3594 3809
14202C809k818l793m517O696K543J917o508r257j075L505K258L488m064o345N054
$$ 3809 991 -2802 -7319 -623 1920 3837 -2671 -11928 -13003 -9498 -7240 -3752 -7816 -14161 -9107
14187i107J218L423M682L947J641j3103l191K870m974n282L222K544n81l644L025
$$ -9107 -7889 -4466 216 4163 5804 -7299 -10490 -7620 -12594 -17876 -14654 -12110 -12691 -16335 -13310
14172a3310J2592P509Q618O60j1063j5296l445k139l461l664N796O279K592O017
$$ -13310 -718 6791 15409 16069 5006 -10290 -13735 -15874 -19335 -22999 -17203 -10924 -8332 -2315
14158b315J1837l653l278m076M023n145K07j911j297L651M146N3l220j2421o953
$$ -2315 9522 5869 2591 -1485 2538 -2607 -2400 -4311 -5608 -1957 2189 2242 -978 -13399 -20352
14143b0352K571J912L801J735j137m47O497M412K067p091p080m460L741M651m774
$$ -20352 -17781 -15869 -12068 -10333 -11470 -11917 -5420 -1008 1059 -6032 -13112 -17572 -13831 -9180 -13954
14128a3954j572K908R014J5889q84j0213p889l090N217K093N031Q024m04r718
$$ -13954 -15526 -12618 -3604 12285 11401 1188 -6701 -9791 -4574 -2481 2550 10574 10170 452
14114D52o071P417O844k663m733l311k922j1118r452N041M929N754N826L092L447
$$ 452 -5619 1798 8642 5979 1246 -2065 -4987 -16105 -25557 -20516 -15587 -9833 -4007 -915 2532
14099B532M484O292r329o565m624j756j072L987M750J586j0123q603M886l988
$$ 2532 7016 13308 3979 -2586 -7210 -8966 -10038 -6051 -1301 285 -9838 -18441 -13555 -17543
14085a7543Q480M311n459Q246K529q485n210K067L912R638j388j98o762M83Q982
$$ -17543 -9063 -4752 -10211 -1965 564 -7921 -13131 -11064 -7152 2486 1098 900 -5862 -5379 3603
14070C603p06m890O0m898M180J1992Q997m110j2988j2326o249m562n29O069R626
$$ 3603 2897 -1993 -1933 -6831 -2651 9341 18338 14228 1240 -11086 -17335 -21897 -22426 -16357 -6731
14055f731M260M637J3191K961K376j923k188p061p633N23L355R4n86n909l710
$$ -6731 -2471 2166 15357 18318 20694 18771 16583 9522 1889 2412 5767 5861 5275 -634 -4344
14040d344J0652Q26l841l365N927j171j0186q821j070M701Q498l842l474l991
$$ -4344 6308 7134 3293 -72 5855 4684 -5502 -14323 -15393 -10692 -2194 -6036 -9510 -13501
14026a3501O890N245l534m63N531J280m05K44M26M729m630J140N01o686k359N443
$$ -13501 -6611 -1366 -4900 -5363 168 1448 1043 1287 1713 6442 1812 2952 3453 -3233 -5592 -149
14010a49j830r38K825N88m704l776o704L258N748J931n658n134P744J949k820
$$ -149 -1979 -2917 -92 496 -4208 -7984 -14688 -11430 -5682 -3751 -9409 -14543 -6799 -4850 -7670
13995g670J297J4844k303r966n8j304J032J110j654M244O492k408L98O619K155
$$ -7670 -6373 8471 6168 -3798 -3856 -5160 -4128 -3018 -4672 -428 6064 3656 4054 10673 12828
13980A2828q38J110m295o813J135M058l985q07J418r005l390P046O133m141K107
$$ 12828 11990 13100 8805 1992 3127 7185 3200 2393 3811 -5194 -8584 -1538 4595 454 2561
13965B561j50m509l698N232J396k324j953J18m419o86R595l745k970j735Q521
$$ 2561 2411 -2098 -5796 -564 832 -1492 -3445 -3327 -7746 -8432 1163 -2582 -5552 -7287 1234
13950A234L85l762m80M020J531k297K727M26n25l136k606n023L898n99P0L224
$$ 1234 1619 -2143 -2623 1397 2928 631 3358 3784 3259 123 -2483 -7506 -3608 -4207 -4137 -913
13934i13K307m280m76L42l942L161P786K41j630k088m651j032l11N62P954p620
$$ -913 1394 -2886 -3362 -3020 -6962 -3801 3985 4226 2596 508 -4143 -5175 -5486 -4924 3030 -4590
13918d590n415K394k027K694l092m099k094L106J2449L622j1891p694J0394j632
$$ -4590 -10005 -7611 -9638 -6944 -10036 -14135 -16229 -13123 -674 2948 -8943 -16637 -6243 -7875
13904g875K911k981l021p326J090l262l510l033O471N19P28O481O288K614J537
$$ -7875 -4964 -7945 -10966 -18292 -17202 -20464 -23974 -27007 -20536 -20017 -19289 -12808 -6520 -3906 -2369
13889b369o200J139Q44m803j946o2J664P496m8p585j040J533K667Q71P551k838
$$ -2369 -8569 -7430 -6586 -11389 -13335 -13397 -11733 -4237 -4285 -11870 -12910 -11377 -8710 -7839 -288 -3126
13873c126m208j0L635l657n254J3030J9723n00q006j895l311K003L275j908R53
$$ -3126 -7334 -7344 -3709 -7366 -12620 410 20133 19633 11627 9732 6421 8424 11699 9791 10744
13858A0744n896k055m016J446M049m003o441P33P798P704K39n815l640n475K852
$$ 10744 4848 2793 -1223 223 4272 269 -6172 -5439 2359 10063 10302 4487 847 -4628 -1776
13843a776k202l928j416j1124R326J3709m523L78n05j597n525K722J1817k748
$$ -1776 -3978 -7906 -9322 -20446 -11120 2589 -1934 -1556 -2061 -3658 -9183 -6461 5356 2608
13829B608o430p130N643O70J382l730N334L037n57l855m935o033M391O021q50
$$ 2608 -3822 -10952 -5309 -4639 -3257 -6987 -1653 1384 827 -3028 -7963 -13996 -9605 -3584 -4434
13814d434J779O757j093k9j133m297K582k378n687N815R587j99j0703m357l256
$$ -4434 -2655 4102 3009 2980 1847 -2450 132 -2246 -7933 -2118 7469 7270 -3433 -7790 -11046
13799a1046k359J575N437J6K222O346N68J550l229k628q438m285N473P768M326
$$ -11046 -13405 -11830 -6393 -6377 -4155 2191 2759 4309 1080 -1548 -9986 -14271 -8798 -1030 3296
13784C296K93L371O18j285o177o186o38M054Q970l689M630O132o148j2572J935
$$ 3296 3589 6960 7578 6293 116 -6070 -6708 -2654 6316 2627 7257 13389 7241 -5331 -3396
13769c396M719j533l659J987r157m335L238L515J1219K791Q193l736j1825o50
$$ -3396 1323 -210 -3869 -1882 -11039 -15374 -12136 -8621 2598 5389 13582 9846 -1979 -2629
13755b629P231K626k808j2308q309P153Q634L296q8j0566J67j072o588M378M931
$$ -2629 4602 7228 4420 -7888 -16197 -9044 -410 2886 2798 -7768 -7601 -8673 -15261 -10883 -5952
13740e952K778M083R09J225P207N201m086q462n417Q3O938K066l899n54q862j484
$$ -5952 -3174 909 1818 3043 10250 15451 11365 2903 -2514 -2431 4507 6573 2674 2120 -6742 -8226
13724h226K512K348K283j976o157Q24Q247o25m092j019J33j881k315j163L690
$$ -8226 -5714 -3366 -1083 -3059 -9216 -8392 -145 -770 -4862 -5881 -5748 -7629 -9944 -11107 -7417
13709g417o167m277j513O449O796N887M839N767j978j939l348j0298K227N630
$$ -7417 -13584 -17861 -19374 -12925 -6129 -242 4597 10364 8386 6447 3099 -7199 -4972 658
13695F58O440M711m302p561k56O169N33K848m101q154k561K451J114j633k558
$$ 658 7098 11809 7507 -54 -310 5859 6392 9240 5139 -3015 -5576 -3125 -2011 -3644 -6202
13680f202N083R031k231m304q430o073K236P682o36R32J72q431q595Q973P758
$$ -6202 -1119 7912 5681 1377 -7053 -13126 -10890 -3208 -3844 -2912 -2740 -11171 -19766 -10793 -3035
13665c035l697n502N639L2L037N427L867r504p282k395M353j567J659K287O712
$$ -3035 -6732 -12234 -6595 -6563 -3526 1901 5768 -3736 -11018 -13413 -9060 -10627 -8968 -6681 31
13650C1L332p749l448M292K74L15p430n612O618j508l988q08k69K0343k342j1976
$$ 31 3363 -4386 -7834 -3542 -3268 -2953 -10383 -15995 -9377 -10885 -14873 -15681 -15950 4393 2051 -9925
13634i925n570L650L932M450l70N638O537m461m269j772o210l499M766j2454M421
$$ -9925 -15495 -11845 -7913 -3463 -3833 1805 8342 3881 -388 -2160 -8370 -11869 -7103 -19557 -15136
13619a5136O090l320j231M414M911L214L207p462l846M565L560l093o93m84M792
$$ -15136 -9046 -12366 -13597 -9183 -4272 -1058 2149 -5313 -9159 -4594 -1034 -4127 -4820 -5304 -512
13604e12j768k48J008K066o661m373n164n494L914J350O452M154L711k557p633
$$ -512 -2280 -2528 -1520 546 -6115 -10488 -15652 -21146 -17232 -15882 -9430 -5276 -1565 -4122 -11755
13589a1755l529M91L207L206l171k284O082J466l071l337O059M990p989M809N290
$$ -11755 -15284 -14793 -11586 -8380 -11551 -13835 -7753 -6287 -9358 -12695 -6636 -1646 -9635 -4826 464
13574D64P966N442o238o286k081k444Q54L704j483o651M056J2072K911N758l722
$$ 464 8430 13872 7634 1348 -733 -3177 -2323 1381 -102 -6753 -2697 9375 12286 18044 14322
13559A4322M285M516j6415j3897n2K018J335N212l82l57k76k259J586J425m097
$$ 14322 18607 23123 6708 -7189 -7241 -5223 -3888 1324 942 585 309 -1950 -364 1061 -3036
13544c036j0992o050M598J1931J5616J091N6l042M234P205k065r786o272l382
$$ -3036 -14028 -20078 -15480 -3549 12067 13158 13214 10172 14406 21611 19546 9760 3488 106
13530A06j094k024J57m288K019J1964L657m88j1199o040L58M730k779j17M144
$$ 106 -988 -3012 -2855 -7143 -5124 6840 10497 10009 -1190 -7230 -6872 -2142 -4921 -5038 -894
13515h94L813J225L272P95p239j2298m324O573O624N963J386p291K012n22o039
$$ -894 2919 4144 7416 8211 972 -11326 -15650 -9077 -2453 3510 4896 -2395 -383 -905 -6944
13500f944K247P182J997Q75O993j70J133o577j0318j1638L17J744N438j26P549
$$ -6944 -4697 2485 4482 5357 12350 12180 13313 6736 -3582 -15220 -14903 -13159 -7721 -7847 -298
13485b98k612N086K787p153M907j013O88M37m445p669K759Q682Q52j473l117N47
$$ -298 -2910 2176 4963 -2190 2717 1704 2392 2829 -1616 -9285 -6526 2156 3008 1535 -1582 -1035
13469a035l569k967K896O24M424O93o57m653j389O506O896l157J1166M567N94
$$ -1035 -4604 -7571 -4675 -4051 373 1066 409 -4244 -5633 873 7769 4612 15778 20345 20939
13454B0939p993m334M552r85j3373j623M425l156N097p642m102J56L456K720L027
$$ 20939 12946 8612 13164 12179 -1194 -2817 1608 -1548 3549 -4093 -8195 -8039 -4583 -1863 1164
13439A164K293m816K874J0221Q68m586n75O397l697o184n007l351O294J642o118
$$ 1164 3457 -1359 1515 11736 12604 8018 7443 13840 10143 3959 -1048 -4399 1895 3537 -2581
13424b581j766M224O901J119l969q20K28k878p44L966K361p964J614j860l45J5
$$ -2581 -4347 -123 6778 7897 3928 3108 3336 458 -286 3680 6041 -1923 -309 -2169 -2514 -2499
13408b499n253N297M529o661R11R471O315p310p840o568j467L547j58O182K802
$$ -2499 -7752 -2455 2074 -4587 -3676 5795 12110 4800 -3040 -9608 -11075 -7528 -7686 -1504 1298
13393A298n393k168J33N305L816R75L102K697l389j2541p498r18P514k428m282
$$ 1298 -4095 -6263 -6130 -825 2991 3966 7068 9765 6376 -6165 -13663 -14581 -7067 -9495 -13777
13378a3777L180R153K871m724j996Q319J107j054M149N287M436k211N209N746
$$ -13777 -10597 -1444 1427 -3297 -5293 3026 4133 3079 7228 12515 16951 14740 19949 25695
13364B5695N96n231r964m35l856p55j527Q6L636N591P56M557J338r19Q63j0768
$$ 25695 26291 21060 11096 10661 6805 6050 4523 4609 8245 13836 14592 19149 20487 19568 20431 9663
13348I663k735J886j166K990L044L563o651n084m825k83k161m148N916J593l212
$$ 9663 6928 8814 7648 10638 13682 17245 10594 5510 685 402 -1759 -5907 9 1602 -1610
13333a610n119L065M418l466o398J2776K355R72j897p360L656L044P55N079o558
$$ -1610 -6729 -3664 754 -2712 -9110 3666 6021 6993 5096 -2264 1392 4436 5191 10270 3712
13318C712l695L947j677o282q83L760O361j556L757K528R36k016p589q170L172
$$ 3712 17 3964 2287 -3995 -4878 -1118 5243 3687 7444 9972 10908 8892 1303 -6867 -3695
13303c695J5115L468j2305p073l796J994J3661N701j628l836J016J295R25J375
$$ -3695 11420 14888 2583 -4490 -8286 -6292 7369 13070 11442 7606 8622 9917 10842 12217
13289A2217n231J739J176R24P15J412o981r900m71N4l86N146P879l394j149K944
$$ 12217 6986 8725 9901 10825 11540 12952 5971 -3929 -4400 -4346 -4732 414 8293 4899 3750 6694
13273F694J3839J218j1073j1386m568j752L864M746m833m279N604O508k832j0353
$$ 6694 20533 21751 10678 -708 -5276 -7028 -3164 1582 -3251 -7530 -1926 4582 1750 -8603
13259h603j097K944J423Q723L210k708l644k047K095K476j0733m508q13j0078
$$ -8603 -9700 -6756 -5333 3390 6600 3892 248 -1799 296 2772 -7961 -12469 -13282 -23360
13245b3360j570N774M123J0224Q80l656K608Q460J134l296p602K222N688O53N822
$$ -23360 -24930 -19156 -15033 -4809 -3929 -7585 -4977 3483 4617 1321 -6281 -4059 1629 2282 8104
13230H104k036o417J194P10m889j565K067O419M542j0613l43O23O290M975O518
$$ 8104 6068 -349 845 1555 -3334 -4899 -2832 3587 8129 -2484 -2827 -2204 4086 9061 15579
13215A5579j751j294p663k907l358J134R454k799J73J239o819q396L290M86P134
$$ 15579 13828 12534 4871 1964 -1394 -260 9194 6395 6568 7807 988 -7408 -4118 -3632 3502
13200C502j035q077L255p11L242N810m330j843j360k536p434O554O686K190l701
$$ 3502 2467 -5610 -2355 -3066 176 5986 1656 -187 -1547 -4083 -11517 -4963 1723 3913 212
13185B12l864j285M367j083n809Q298J0477J737m622j911o809p889J408N872J810
$$ 212 -3652 -4937 -570 -1653 -7462 836 11313 13050 8428 6517 -292 -8181 -6773 -901 909
13170I09J496n77o527K713N146l475m897j829J346K660n856o642j777M348J7930
$$ 909 2405 1828 -4699 -1986 3160 -315 -5212 -7041 -5695 -3035 -8891 -15533 -17310 -12962 4968
13155D968J974p041M83Q080K647k918K792j116m837j72L383k674n233j718m31
$$ 4968 6942 -99 384 8464 11111 8193 10985 9869 5032 4860 8243 5569 336 -1382 -1813
13140a813o251q975K170Q160K584L009J643n78N870N927n664l483K647k100p97
$$ -1813 -8064 -17039 -14869 -6709 -4125 -1116 527 -51 5819 11746 6082 2599 5246 3146 2349
13125B349m182k664j9M470P05m820j343l763L111P88K05j962L069j040m087Q04
$$ 2349 -1833 -4497 -4516 -46 659 -4161 -5504 -9267 -6156 -5368 -5163 -7125 -4056 -5096 -9183 -8379
13109h379J614M458L835J3527j137r901k987k354M394O834k808n987K774J474
$$ -8379 -6765 -2307 1528 15055 13918 4017 1030 -1324 3070 9904 7096 1109 3883 5357
13095E357O295M122l558J893m5l945n351m732n85Q30N639J2381J076l202j1626
$$ 5357 11652 15774 12216 14109 14064 10119 4768 36 -549 281 5920 18301 19377 16175 4549
13080D549o694k522K110L749P650o29l107J678j678o350L175p95p643m96J445
$$ 4549 -2145 -4667 -2557 1192 8842 8213 5106 6784 5106 -1244 1931 1136 -6507 -7003 -5558
13065e558J0808J94q375p02M676l857m644l94J137M548m572k343R073P679j206
$$ -5558 5250 5444 -2931 -3633 1043 -2814 -7458 -7852 -6715 -2167 -6739 -9082 -9 7670 6464
13050F464o206j1737j636k330P473P510M144m463n397M590L994l366l398N130
$$ 6464 258 -11479 -13115 -15445 -7972 -462 3682 -781 -6178 -1588 2406 -960 -4358 772
13036G72J8774L951q329j045j925q424K077k009k76j487P6J190j295R649O162
$$ 772 19546 23497 15168 14123 12198 3774 5851 3842 3566 2079 2155 3345 2050 11699 17861
13021A7861M033p433k380k587K466J549l499j35J099p453n122J277N170n235m864
$$ 17861 21894 14461 12081 9494 11960 13509 10010 9875 10974 3521 -1601 -324 4846 -389 -5253
13006e253p244R9J49J367p38m56J0966L647m304k577L995m423Q292J532O68k759
$$ -5253 -12497 -12398 -12249 -10882 -11620 -12076 -1110 2537 -1767 -4344 -349 -4772 3520 5052 5720 2961
12990B961J438K164q750K316M544O994K851j1272p216Q200m637J740J918L259
$$ 2961 4399 6563 -2187 129 4673 11667 14518 3246 -3970 4230 -407 1333 3251 6510
12976F510J717R16m679m655j698n928l706k459J752K370R815Q017N917j283o813
$$ 6510 8227 9143 4464 -191 -1889 -7817 -11523 -13982 -12230 -9860 -45 7972 13889 12606 5793
12961E793J905o055m476j349r90L964J436m94J80m134n400J1J855R66J437L028
$$ 5793 7698 1643 -2833 -4182 -5172 -1208 228 -266 -86 -4220 -9620 -9609 -7754 -6788 -5351 -2323
12945b323L10l395J354P669l721r75p104L798M562l243K929j89k867j194m19p841
$$ -2323 -2013 -5408 -4054 3615 -106 -1081 -8185 -4387 175 -3068 -139 -328 -3195 -4389 -4808 -12649
12929a2649J758L329J2754J244O87K344P014l29n284k837J741K63p468r563J755
$$ -12649 -10891 -7562 5192 6436 7123 9467 16481 16152 10868 8031 9772 10035 2567 -6996 -5241
12914e241J3825K473j4358q649o34Q361N146P190O415L847n480q045m066M2k548
$$ -5241 8584 11057 -3301 -11950 -12584 -4223 923 8113 14528 18375 12895 4850 784 826 -1722
12899a722k160N012P707j458q48M923m715k853P995k865n301n883P237J93j518
$$ -1722 -3882 1130 8837 7379 6531 11454 6739 3886 11881 9016 3715 -2168 5069 5262 3744
12884C744k574P064p099q022p291N201J130J0996L278M07N734K899l478o49L841
$$ 3744 1170 8234 1135 -6887 -14178 -8977 -7847 3149 6427 6834 12568 15467 11989 11340 15181
12869A5181N58j569k76o778l404K479K47L278O232l96p89j610j3352m862N046
$$ 15181 15739 14170 13894 7116 3712 6191 6438 9716 15948 15552 14763 13153 -199 -5061 -15
12854a5Q709K10p792L522M04m8m227j962j684q49j819m58N228O114m97K9k505
$$ -15 8694 8904 1112 4634 5038 4990 763 -1199 -2883 -3732 -5551 -6009 -781 5333 4836 4865 2360
12837B360l763Q74L15L035p883n422O856J500J250J075k114J4473m879q069m895
$$ 2360 -1403 -529 -214 2821 -5062 -10484 -3628 -2128 -878 197 -1917 12556 7677 -392 -5287
12822e287l948j094K28M321R891N550J290o649j0572l768J980n262M632L97K377
$$ -5287 -9235 -10329 -10101 -5780 4111 9661 10951 4302 -6270 -10038 -8058 -13320 -8688 -8291 -5914
12807e914N778k16j2953k299O685K343l244l337k439p47N124N655L049l27Q275
$$ -5914 -136 -352 -13305 -15604 -8919 -6576 -9820 -13157 -15596 -16343 -11219 -5564 -2515 -2842 5433
12792E433L231l548O330L078o185o817o92q080k049N463k922M222Q903M339n805
$$ 5433 8664 5116 11446 14524 8339 1522 830 -7250 -9299 -3836 -6758 -2536 6367 10706 4901
12777D901o002K109P567k275k267L960o233J190P161P177j827j0504n218O957
$$ 4901 -1101 1008 8575 6300 4033 7993 1760 2950 10111 17288 15461 4957 -261 6696
12763F696J2359r14l077p863k364J0485N091l02q130j790m740p99o420K803J734
$$ 6696 19055 18141 15064 7201 4837 15322 20413 20111 11981 10191 5451 4652 -1768 1035 2769
12748B769K362J2456j559q887m412P727k618k592L386L586l585q438L072J0147
$$ 2769 5131 17587 16028 7141 2729 10456 7838 5246 8632 12218 8633 195 3267 13414
12734A3414P493j141l496j703K021k996n221n001m753N268l664O921N756r06l61
$$ 13414 20907 19766 16270 14567 16588 13592 8371 3370 -1383 3885 221 7142 12898 11992 11631
12719A1631q08r466M472m08L218N045o260j641P797n179J552j93o776m882k48
$$ 11631 10823 1357 5829 5421 8639 13684 7424 5783 13580 8401 9953 9760 2984 -1898 -2146
12704b146M341O033n624j4704l411P535J0773J1643m297K3O667m08J343l161l613
$$ -2146 2195 8228 2604 -12100 -15511 -7976 2797 14440 10143 10166 16833 16425 17768 14607 10994
12689A0994p229J426J198K720k488J086Q210l528J09P069J174j722m157o742p974
$$ 10994 3765 5191 6389 9109 6621 7707 15917 12389 12498 19567 20741 19019 14862 8120 146
12674A46J447p89N940J906K523N766m150m087p262k906M799J805j395Q076M396
$$ 146 1593 804 6744 8650 11173 16939 12789 8702 1440 -1466 3333 5138 3743 11819 16215
12659A6215O15P170L877r815m646N767Q45p09j224J757Q53p684j454N404o410
$$ 16215 16830 24000 27877 18062 13416 19183 20028 19319 18095 19852 20705 13021 11567 16971 10561
12644A0561q468M535M073n504k873L650j505J346K268K244J219K739N018N311
$$ 10561 2093 6628 10701 5197 2324 5974 4469 5815 8083 10327 11546 14285 19303 24614
12630B4614o683j052j44l296K722j581k199o640P554M017r92q014J049J940j601
$$ 24614 17931 16879 16735 13439 16161 14580 12381 5741 13295 17312 16320 8306 9355 11295 9694
12615I694r4p653m308Q627J2187P25j1260l723q901L761J2060M831L502L546q00
$$ 9694 9600 1947 -2361 6266 18453 19178 7918 4195 -4706 -945 11115 15946 19448 22994 22194
12600B2194j164P267J639o368n429m094M303j1P49l753n388M927l656j464J868
$$ 22194 21030 28297 29936 23568 18139 14045 18348 18337 19086 15333 9945 14872 11216 9752 11620
12585A1620m906L219M088K582k188j754k164k834J614K233j1207J685l911n948
$$ 11620 6714 9933 14021 16603 14415 12661 10497 7663 9277 11510 303 1988 -1923 -7871
12571g871P073J461K110l239l539k399J2122M267J3k490l657m175P914J1674N608
$$ -7871 -798 663 2773 -466 -4005 -6404 5718 9985 9998 7508 3851 -324 7590 19264 24872
12556B4872p156N84O849n376j8096j4986j050Q840K949O465M465L038m190j695
$$ 24872 17716 18300 25149 19773 1677 -13309 -14359 -5519 -2570 3895 8360 11398 7208 5513
12542E513J1880J901J769k250O439L438r982m632J344l994j680j091n397p689
$$ 5513 17393 19294 21063 18813 25252 28690 18708 14076 15420 11426 9746 8655 3258 -4431
12528d431M654M965K887K467j1977N50P106J909K497o158M546J382l937k746l331
$$ -4431 223 5188 8075 10542 -1435 -885 6221 8130 10627 4469 9015 10397 6460 3714 383
12513C83j018M11J312O441k28n2k169l967N8P341K374o294M227M316K730m461
$$ 383 -635 -224 1088 7529 7301 7249 5080 1113 1171 8512 10886 4592 8819 13135 15865 11404
12497A1404L006l675k715l115J804P620j500P602K993l088J904j234m192l01k679
$$ 11404 14410 10735 8020 4905 6709 14329 12829 20431 23424 20336 22240 21006 16814 16513 13834
12482A3834k769MQ73P50J474K523N329l369o119J0350Q283m053j536k165l272
$$ 13834 11065 11069 11942 12692 14166 16689 22018 18649 12530 22880 31163 27110 25574 23409 20137
12467B0137l757l278P212J0846J499o555j104J454o710o343M721O310k694J369
$$ 20137 16380 13102 20314 31160 32659 26104 25000 26454 19744 13401 18122 24432 21738 23107
12453B3107m387R238L244k341r770j2039l19J0712j068l08L920j839J703P317
$$ 23107 18720 27958 31202 28861 19091 7052 6733 17445 16377 16069 19989 18150 19853 27170
12439B7170o485M880R695k440o393O009k99m28K93O587n861p25Q371J60j299J992
$$ 27170 20685 25565 35260 32820 26427 32436 32137 31709 32002 38589 32728 32003 40374 40534 39235 41227
12423D1227L114M062O459l407l496P570L572m569Q69J833n811l977P474J1062
$$ 41227 44341 48403 54862 51455 47959 55529 59101 54532 55401 57234 51423 47446 54920 65982
12409F5982J6684J0031J5105J5649K958P053Q888Q524O779K0452N0550P6351R2416
$$ 65982 82666 92697 107802 123451 126409 133462 142350 150874 157653 178105 228655 305006 397422
12396C97422R5413Q2608N9658L7207n98n1002q1528p3866m1134k3126q402M67
$$ 397422 492835 575443 635101 672308 671710 620708 539180 465314 424180 401054 392652 393119
12384C93119N766L460J63o84j3081l4432l9933k4910Q36J7035K2979K0406J0164
$$ 393119 398885 402345 402508 401824 388743 354311 314378 289468 290304 307339 330318 350724 360888
12371C60888Q167k437j2082j4361j1229j674R11J2284R184Q62J4446J4689K0421
$$ 360888 369055 366618 354536 340175 328946 327272 328183 340467 349651 350513 364959 379648 400069
12358D00069L0415O9216J20298J78693K51469K84208K40384J53858N9872m4917
$$ 400069 430484 499700 619998 798691 1050160 1334368 1574752 1728610 1788482 1743565
12348A743565j55020k46809k54492k09568j41840r2345n3075k8044j4811r105
$$ 1743565 1588545 1341736 1087244 877676 735836 643491 590416 562372 547561 538456
12338E38456q895m521j2260o227k174q106l619p622j409j0294k3466l7804k8637
$$ 538456 529561 525040 512780 506553 504379 496273 492654 485032 483623 473329 449863 412059 383422
12325C83422l1686k2072q987Q5P822J4691J3921L112j4286j1572M568O821K5676
$$ 383422 351736 329664 320677 320762 328584 343275 357196 360308 346022 334450 339018 345839 371515
12312C71515N2489P2107Q2048N8739L4596J0321l1077p7434r1930q8923o2510
$$ 371515 424004 496111 578159 636898 671494 681815 650738 573304 481374 392451 329941
12301C29941n2411m2861l2856k4856q602m457o470j8957j6195j3559j1377q510
$$ 329941 277530 234669 201813 176957 168355 163898 157428 138471 122276 108717 97340 88830
12289H8830k249r686j5379K732R098R62K101J657K005K49k533q897r085k788n946
$$ 88830 86581 76895 61516 64248 73346 74308 76409 78066 80071 80320 77787 68890 59805 57017 51071
12274E1071l502l958P385O563k416M250p340r154K536J2463O317o114j0097L080
$$ 51071 47569 43611 50996 57559 55143 59393 52053 42899 45435 57898 64215 58101 48004 51084
12260E1084L785q512q937J411M370k276o168j063l153J971P023J095m470Q819
$$ 51084 54869 46357 37420 38831 43201 40925 34757 33694 30541 32512 39535 40630 36160 44979
12246D4979o76m377N359M942j2261p535K767Q421P889n654O84P873k451m464J767
$$ 44979 44303 39926 45285 50227 37966 30431 33198 41619 49508 43854 44538 52411 49960 45496 47263
12231D7263N417o808j0984O652Q853k690L533p259q687Q500J1325P444j2494o379
$$ 47263 52680 45872 34888 41540 50393 47703 51236 43977 35290 43790 55115 62559 50065 43686
12217D3686p497P131J0189L408o437j0037k930J1758J0289J4203R1q725P566j925
$$ 43686 36189 43320 53509 56917 50480 40443 37513 49271 59560 73763 73854 65129 72695 70770
12203G0770q346N871N088J0469J1260J2649J9147K1651Q50j1222k558l879n740
$$ 70770 62424 68295 73383 83852 95112 107761 126908 148559 149409 138187 135629 131750 126010
12190A26010j0427j3776j0499l401K811j667o2n516j506J0622N706J0932N409
$$ 126010 115583 101807 91308 87907 90718 89051 88989 83473 81967 92589 98295 109227 114636
12177A14636n958l495M857L934L057k593J453o711m136j712n55R238J2823l401
$$ 114636 108678 105183 110040 113974 117031 114438 115891 109180 105044 103332 102777 112015 124838 121437
12163A21437M772R909N485K078O854J1413J6027J9560L2471M6757M2935J3940
$$ 121437 126209 136118 141603 143681 150535 161948 177975 197535 230006 276763 319698 333638
12151C33638n659k847p923l799k7444m0739l6501j6006n734j7776j3189L607l354
$$ 333638 327979 325132 317209 313410 285966 245227 208726 192720 186986 169210 156021 159628 156274
12138A56274r081J072R751o4M32L640q907j0405l442k107K65L937o708M134M766
$$ 156274 147193 148265 158016 157952 158384 162024 153117 142712 139270 137163 137428 141365 134657 138791 143557
12123A43557Q498M914m35l963J884O594J134N730p81M629J0283J8789J9170J7804
$$ 143557 152055 156969 156534 152571 154455 161049 162183 167913 167132 171761 182044 200833 220003 237807
12109B37807P587R810R841n499j1243k1893l3395k4747r044q710K549L493Q531
$$ 237807 245394 255204 265045 259546 248303 226410 193015 168268 159224 150514 153063 156556 165087
12096A65087K653j3612o246J70L446n777J476J0071l108o147J739j766J4797J7832
$$ 165087 167740 154128 147882 148052 151498 145721 147197 157268 154160 148013 149752 147986 162783 180615
12082A80615K2068J6706J4655J6845Q57K461J3817J3131J8605M550n47Q621P720
$$ 180615 202683 219389 234044 250889 251746 254207 268024 281155 299760 304310 303763 312384 320104
12069C20104L609M235K0517K9386J0167l52j272q5l788q919n955Q012M864J8542
$$ 320104 323713 327948 348465 377851 388018 387666 386394 386309 382521 373602 367647 375659 380523 399065
12055C99065J6980J6770J0413M588J641p268j5255j8231j5942j4670j133K703
$$ 399065 416045 432815 443228 447816 449457 442189 426934 408703 392761 378091 376958 379661
12043C79661J4730L2404L0336L0758L8745L7726M2911M5043L3656L1229L3716
$$ 379661 394391 426795 457131 487889 526634 564360 607271 652314 685970 717199 750915
12032G50915L1656K9064K7807J8106O703r345j3383N669J2702J9113M7801N4543
$$ 750915 782571 811635 839442 857548 864251 854906 841523 847192 859894 879007 926808 981351
12020I81351P1625J26754J94224K35273K74156K77185K39054J77199P2868m0446
$$ 981351 1052976 1179730 1373954 1609227 1883383 2160568 2399622 2576821 2649689 2609243
12010B609243j43110j86970j89063j34852p8578m6346k3304j4759j2621j8725
$$ 2609243 2466133 2279163 2090100 1955248 1876670 1830324 1807020 1792261 1779640 1760915
12000A760915p309M8160J26075J96670K29544K03512J67031R2571m566r2003j57438
$$ 1760915 1753606 1801766 1927841 2124511 2354055 2557567 2724598 2817169 2812603 2720600 2563162
11989B563162j75941j53014j24094j05062q6212m9741j8363K1427N9069R8188
$$ 2563162 2387221 2234207 2110113 2005051 1918839 1869098 1850735 1872162 1931231 2029419
11979B029419J41720J88945K67091L76846N00294O16920O60536O45567N69198
$$ 2029419 2171139 2360084 2627175 3004021 3504315 4121235 4781771 5427338 5996536
11970E996536M58962L78198L33870M01985N44060O81090P14769N83158M44391
$$ 5996536 6455498 6833696 7167566 7569551 8113611 8794701 9509470 10092628 10537019
11961A0537019L89933L13342K37189K54612L66865M75508N03542M38199M18002
$$ 10537019 10926952 11240294 11477483 11732095 12098960 12574468 13078010 13516209 13934211
11952A3934211N92679R37994J429942K155492L282967N119769Q057605J2208580
$$ 13934211 14526890 15464884 16894826 19050318 22333285 27453054 35510659 47719239
11944D7719239J6746582J9277512J7279321J1286694N037265p41198q524880j5333878
$$ 47719239 64465821 83743333 101022654 112309348 117346613 116605415 108080535 92746657
11936I2746657j5866501j1470917p141806m291562k768244j923432q86700O80530
$$ 92746657 76880156 65409239 58267433 53975871 51207627 49284195 48397495 49078025
11928D9078025K434613L732771M118371L779621L189711K219262N11137j162845
$$ 49078025 51512638 55245409 59363780 63143401 66333112 68552374 69063511 67900666
11920F7900666j513311k81855J655908L253141M095159M254385L744498K610295
$$ 67900666 66387355 66105500 67761408 71014549 75109708 79364093 83108591 85718886
11912H5718886P25460j457642k645654k088858l90664J554542L379461N540770
$$ 85718886 86444346 84986704 82341050 80252192 79861528 81416070 84795531 90336301
11904I0336301Q907426J4716113K4258571L6179119M3726037L9851603K6683721
$$ 90336301 99243727 113959840 138218411 174397530 218123567 257975170 284658891
11897B84658891J3083968r88611k1289323l9626894m2981028l4190129k4265090
$$ 284658891 297742859 296754248 275464925 235838031 192857003 158666874 134401784
11890A34401784j6660208j1310287p701263m814151j848351P12977J734003J107587
$$ 134401784 117741576 106431289 98730026 93915875 92067524 92780501 94514504 95622091
11882I5622091k31865j864947l985522n735908n641584l827844j559211K69764
$$ 95622091 95390226 93525279 89539757 83803849 78162265 74334421 72775210 73044974
11874G3044974J168368R31092j17479j358481k449154l633470m685217m756322
$$ 73044974 74213342 75144434 75026955 73668474 71219320 67585850 62900633 58144311
11866E8144311l544112j712228k0506J208113K129351L329920N858734J0173922
$$ 58144311 54600199 52887971 52867465 54075578 56204929 59534849 65393583 75567505
11858G5567505J4758098J6458581J3611508Q371632K789508n007878j4417181
$$ 75567505 90325603 106784184 120395692 128767324 131556832 126548954 112131773
11851A12131773k0275873j9758408j5819579j1349349p782743n364190l794952
$$ 112131773 91855900 72097492 56277913 44928564 37145821 31781631 27986679
11844B7986679k699532j860052j262205r41072q49173q16642p06853n80701m84649
$$ 27986679 25287147 23427095 22164890 21223818 20374645 19558003 18851150 18270449 17785800
11835A7785800m27834l49416l14205m12747o37775q64021r52105q84389p36530
$$ 17785800 17357966 17008550 16694345 16281598 15643823 14779802 13827697 12943308 12206778
11826A2206778o04482n71738o49645p52065q31444q59935q00134o73283n32306
$$ 12206778 11602296 11030558 10380913 9628848 8797404 7937469 7137335 6464052 5931746
11817E931746m14525l36534k53093j89800j54710j21604q4117n9124k7999N339
$$ 5931746 5517221 5180687 4927594 4737794 4583084 4461480 4377363 4318239 4290240 4295579
11807D295579M8905R2303J33569J35352J25663O9811j7996j23796k09118k62090
$$ 4295579 4344484 4436787 4570356 4705708 4831371 4901182 4883186 4759390 4550272 4288182
11797D288182k76076k30393j50338p8292m3257l4758k0068q523M673N6600J44979
$$ 4288182 4012106 3781713 3631375 3553083 3509826 3475068 3455000 3446477 3451150 3507750 3652729
11786C652729J99200K16803J91735J03595l0444j89772l03994l65943l76517l41903
$$ 3652729 3851929 4068732 4260467 4364062 4333618 4143846 3839852 3473909 3097392 2755489
11776B755489k80682k04312j34662j10710p6457n1884k4361k573J1776J2511K1572
$$ 2755489 2474807 2270495 2135833 2025123 1948666 1896782 1872421 1869848 1881624 1894135 1915707
11765A915707N373j6125m3069p0934p4812p8746q0674q2089o5952o5129n3637
$$ 1915707 1921080 1904955 1861886 1790952 1716140 1637394 1556720 1474631 1408679 1343550 1289913
11754A289913m4139l8240k8213k6106j4495l898m332q06J569j1526j8972k9728
$$ 1289913 1245774 1207534 1179321 1153215 1138720 1134822 1130490 1129684 1131253 1119727 1100755 1071027
11742A071027m3969n7872n6765m1527m1132m7689k4895j6082j2611j2186m811
$$ 1071027 1027058 969186 912421 870894 829762 782073 757178 741096 728485 716299 711488
11731G11488q977r338j0482r516o649q274j2393r664j3755r715j1172k1618k0901
$$ 711488 702511 693173 682691 673175 666526 658252 645859 636195 622440 612725 601553 579935 559034
11718E59034k2050k5949j6646j6920j9525N402J6963J0415J639L638K622k328
$$ 559034 536984 511035 494389 477469 457944 463346 480309 490724 492363 496001 498623 496295
11706D96295j2564j1157n071L994q035j0114j0753j3911j3283l197L47j765J634
$$ 496295 483731 472574 467503 471497 463462 453348 442595 428684 415401 412204 412551 410786 412420
11693D12420O766j0811q841j3867j2058m473j0782j5692o120P350M252L072J33
$$ 412420 419186 408375 399534 385667 373609 369136 358354 342662 336542 343892 348144 351216 351349
11680C51349o969j3577k689j52o33n13O408N300N206k586k241N103J462M934M966
$$ 351349 344380 330803 328114 327962 327329 326816 333224 338524 343730 341144 338903 344006 345468 350402 355368
11665C55368O032j3278j3267j0856o262q740p943l152K732Q152m514N759J3076
$$ 355368 361400 348122 334855 323999 317737 308997 301054 297902 300634 308786 304272 310031 323107
11652C23107M917Q783K877o998K221R70j679j3417j2262j7441j0358o07L030l140
$$ 323107 328024 336807 339684 332686 334907 335877 334198 320781 308519 291078 280720 280113 283143 280003
11638B80003L542J713j2120k242L856J574M221k572k022m217k224P49o414m872
$$ 280003 283545 285258 273138 270896 274752 276326 280547 277975 275953 271736 269512 270261 263847 258975
11624B58975j537r124o490j0004n415r529p021l44n46l230K466M460K519J585
$$ 258975 257438 248314 241824 231820 226405 216876 209855 209511 208965 205735 208201 212661 215180 216765
11610B16765n189L743M797J3315P657J0445L44n63r790q439j5570o994O230r266
$$ 216765 211576 215319 220116 233431 241088 251533 251877 251314 241524 233085 217515 210521 216751 207485
11596B07485r765m25L373K380K065K851j1524j3169N737k586M45L230Q912N959
$$ 207485 197720 197295 200668 203048 205113 207964 196440 183271 189008 186422 186867 190097 199009 204968
11582B04968J863q969o271p578j0214p053j211O966n66J113k935N802P383k226
$$ 204968 206831 197862 191591 184013 173799 166746 165535 172501 171935 173048 170113 175915 183298 181072
11568A81072r230l176l211J8q5O061o267j6451Q255Q828J566j988o005n037J057
$$ 181072 171842 168666 165455 165473 165388 171449 165182 148731 156986 165814 167380 165392 159387 154350 155407
11553A55407Q765O360l862r963k324J542J92L363l326k88O187J738N152J6040
$$ 155407 164172 170532 166670 156707 154383 155925 156117 159480 156154 155866 162053 163791 168943 184983
11539A84983L985l455m182k742n111q633r31J093PJ57Q82M016o251m128M589o075
$$ 184983 188968 185513 181331 178589 173478 164845 163914 165007 165014 165171 166053 170069 163818 159690 164279 158204
11523A58204K580P909K696j337J443L265k059l496n733L81M335P29j859j931N645
$$ 158204 160784 168693 171389 170052 171495 174760 172701 169205 163472 163853 168188 168917 167058 165127 170772
11508A70772K844r178K367N622j327M9p798p609P403O555K83O437J361O646J2508
$$ 170772 173616 164438 166805 172427 171100 171149 163351 155742 163145 169700 169983 176420 177781 184427 196935
11493A96935R759K531K419Q801J3715J0158J8495L4080M3681O1347P1872R0543
$$ 196935 206694 209225 211644 220445 234160 244318 262813 296893 340574 401921 473793 564336
11481E64336Q4339N5183J7089N339k9058n7271p7469p0221m2448k0190j841k472
$$ 564336 648675 703858 720947 726286 697228 639957 562488 492267 449819 429629 427788 425316
11469D25316M370P513m531j0308k3069k1490n227J4540J3224K7636L0772L3086
$$ 425316 429686 437199 432668 422360 399291 377801 372574 387114 400338 427974 458746 491832
11457D91832L1143K2471Q380p686k287J2153Q752l51q443p508q236K502J1551
$$ 491832 522975 545446 553826 546140 543853 556006 564758 564407 555964 548456 540220 542722 554273
11444E54273K3151N3369R6384J38271K00544K39703K41518J97057J06204J2924
$$ 554273 577424 630793 727177 865448 1065992 1305695 1547213 1744270 1850474 1863398
11434A863398j01802k13346k66825k48090j87101j27093q9252n3741l3145l3465
$$ 1863398 1761596 1548250 1281425 1033335 846234 719141 629889 576148 543003 509538
11424E09538k6250j6684j3768j7164n271J939J1086J9049O199j860j3664j1372
$$ 509538 483288 466604 452836 435672 430401 432340 443426 462475 468674 466814 453150 441778
11412D41778j8484k0945j5046M661J6944K1004J7943K8831J4314m760k063o579
$$ 441778 423294 402349 387303 391964 408908 429912 447855 476686 491000 486240 484177 477598
11400D77598l294K0571M3694Q0338Q4956O3638M3731J9901j9577q4533j09853
$$ 477598 474304 494875 538569 618907 703863 767501 811232 831133 811556 727023 617170
11389F17170j14074r2327p0080m0032k0956k2449j0523o710m025j7132j2954j1275
$$ 617170 503096 410769 340689 300657 279701 257252 246729 240019 235994 218862 205908 194633
11377A94633j6855n041k246o859k720L79j6604p324m596M24R630R353m97j1297
$$ 194633 177778 172737 170491 163632 160912 161291 144687 137363 132767 133191 142821 152174 151677 140380
11363A40380l220n111n699j374n542m549Q036M191M437j378q92k094L871K008
$$ 140380 137160 132049 126350 124976 119434 114885 122921 127112 131549 130171 129279 127185 131056 133064
11349A33064p197m734j921j225n546q598K570O5k70m460p863K851K989L708l233
$$ 133064 125867 121133 119212 117987 112441 103843 106413 106478 106208 101748 93885 96736 99725 103433 100200
11334A00200O44K581j118j974j093r7N97p405m896M128N039J6959N970j1004Q485
$$ 100200 100844 103425 102307 100333 99240 99143 99740 92335 87439 91567 96606 113565 119535 108531 117016
11319A17016j807o842j846M388j670q554j0685r9O892K800K416O058N218K286
$$ 117016 115209 108367 106521 110909 109239 100685 90000 89901 96793 99593 102009 108067 113285 115571
11305A15571j2896m597p141m740m742O047J1448M354j780L61l545n294o058J685
$$ 115571 102675 98078 90937 86197 81455 87502 98950 103304 101524 101885 98340 93046 86988 88673
11291H8673J564P559L505j658K064k287k032k65L79L384n827j361N364J239J56
$$ 88673 90237 97796 101301 99643 101707 99420 97388 97123 97502 100886 95059 93698 99062 100301 100457
11276A00457J133q425q735O760R811N466O12o889m48J0522k32p186j327k101L320
$$ 100457 101590 93165 84430 91190 101001 106467 107079 100190 99742 110264 110032 102846 101519 99418 102738
11261A02738n525r085j651N354P840j596m842J286m020o425m338j045N982l286
$$ 102738 97213 88128 86477 91831 99671 98075 93233 94519 90499 84074 79736 78691 84673 81387
11247H1387m672J067L588N081N072O706K566K546m076m621n613q561k920M944
$$ 81387 76715 77782 81370 86451 91523 98229 100795 103341 99265 94644 89031 80470 77550 82494
11233H2494R497n013j367j0774P183O033k643m328j024L335J3061K728r996p508
$$ 82494 91991 86978 85611 74837 82020 88053 85410 81082 80058 83393 96454 99182 89186 81678
11219H1678M609K210r659m794Q954M486l317K452O034l737m740M508K497L668
$$ 81678 86287 88497 78838 74044 82998 87484 84167 86619 92653 88916 84176 88684 91181 94849
11205I4849j0340n360N972J807M028r056l150M788p385l364P356N669J197m169
$$ 94849 84509 79149 85121 86928 90956 81900 78750 83538 76153 72789 80145 85814 87011 82842
11191H2842j0480J871j77J0577Q848p581k429J10n661p978L321J2381k50o136
$$ 82842 72362 74233 74056 84633 93481 85900 83471 83581 77920 69942 73263 85644 85394 79258
11177G9258n246j483m210M003N004l637O602k216n095n291L357N065M453L368
$$ 79258 74012 72529 68319 72322 77326 73689 80291 78075 72980 67689 71046 76111 80564 83932
11163H3932n951m792k365K985p780K851J3055r01o127K449k39M174q527j1130
$$ 83932 77981 73189 70824 73809 66029 68880 81935 81034 74907 77356 77117 81291 72764 61634
11149F1634K83K644J123L83O884N585p769L471j19m968r2J0029J3K382o584r864
$$ 61634 61917 64561 65684 66067 72951 78536 70767 74238 74119 69151 69059 79088 79101 81483 74899 65035
11133F5035k931j546M22N643Q390j740l216j641J42l035o506k225P426m88P154
$$ 65035 62104 60558 60980 66623 75013 73273 70057 68416 68558 65523 59017 56792 64218 63730 70884
11118G0884M193K171K427k188j1204j0965M745K314N735P314j017k198o824M734
$$ 70884 75077 77248 79675 77487 66283 55318 60063 62377 68112 75426 74409 72211 65387 70121
11104G0121P840N29j722K973j217j25K014J156K953k958J625m134N996L510p339
$$ 70121 77961 78490 76768 79741 78524 78399 80413 81569 84522 81564 83189 79055 85051 88561 81222
11089H1222o027L643p551j1252l010P7K353L307M770L319k731J108K60R6m22n117
$$ 81222 75195 78838 71287 60035 57025 57102 59455 62762 67532 70851 68120 69228 69488 69584 69162 64045
11073F4045o286j955J4635N229l072j265m412J551m42J210n948N373O255O182
$$ 64045 57759 55804 70439 75668 72596 71331 66919 68470 68028 69238 63290 68663 74918 81100
11059H1100K22m361o173J985m537L874m232J657M826J57j368q29J258m051K761
$$ 81100 81322 76961 70788 72773 68236 72110 67878 69535 74361 74518 73150 72321 73579 69528 72289
11044G2289J334j633p663r325J2251J6741O031k575l707r573o04O972n294m739
$$ 72289 73623 71990 64327 55002 67253 83994 90025 87450 83743 74170 73566 80538 75244 70505
11030G0505k203O179R445m010J057Q088j3934q432k122K535m472l951M759R165
$$ 70505 68302 74481 83926 79916 80973 89061 75127 66695 64573 67108 62636 58685 63444 72609
11016G2609M932j653o507m744n788P01O967k942j80P025K181p16l269k370l231
$$ 72609 77541 75888 69381 64637 58849 59550 66517 63575 63395 70420 72601 71885 68616 66246 63015
11001F3015n987J742J8742M14k457L46N881m896j917m797j050j683m556l576M009
$$ 63015 57028 58770 77512 77926 75469 75815 81696 76800 74883 70086 69036 67353 62797 59221 63230
10986F3230m055r112J0231N119Q168J2031J803l504K204o11k415m105r813k484
$$ 63230 59175 50063 60294 65413 73581 85612 87415 83911 86115 85504 83089 78984 69171 66687
10972F6687M579J0307J26K081K427j1139n26P007n605J002n05k678r877O47O582
$$ 66687 71266 81573 81699 83780 86207 75068 74542 81549 75944 76946 76441 73763 63886 64533 71115
10957G1115J667k225N748R390l703j3638M471N95j843j1215n308R343J0885o462
$$ 71115 72782 70557 76305 85695 81992 68354 72825 73420 71577 60362 55054 64397 75282 68820
10943F8820o102J583j167k313N866O819M49j867n485N83K088K304o32p702J804
$$ 68820 62718 64301 63134 60821 66687 73506 73955 72088 66603 67186 69274 71578 70946 63244 65048
10928F5048R664j514m973q475n304K798J5332K510l534K998P392n134M305J874
$$ 65048 74712 73198 68225 59750 54446 57244 72576 75086 71552 74550 81942 76808 81113 82987
10914H2987p668M758N265j0226j3265J162O489j75m716O836M866l168j688O70
$$ 82987 75319 80077 85342 75116 61851 63013 69502 69327 64611 71447 76313 73145 71457 72127
10900G2127J058N357J342l572j0077m545M187P228K076O689n943o365P53l905
$$ 72127 73185 78542 79884 76312 66235 61690 65877 73105 75181 81870 75927 69562 70315 66410
10886F6410J51M119J119q317k590L071o77n71j729J092N85l565P713j095j4k326
$$ 66410 66561 70680 71799 63482 60892 63963 63286 62715 60986 62078 62663 59098 66811 65716 65702 63376
10870F3376p67N327o3M95N074q07N16p541R11k47P822K337L063k511q01O141j431
$$ 63376 62609 67936 67873 68368 73442 72635 73151 65610 66521 66274 74096 76433 79496 76985 76184 82325 80894
10853H0894j0136r558Q19M950K083n494O70M745N26j0138M970Q281l71n255J845
$$ 80894 70758 61200 62019 66969 69052 63558 64228 68973 69499 59361 64331 72612 72241 66986 68831
10838F8831k976O125K369o356m407j366l329l944J3007J2149N574q272r393j0158
$$ 68831 65855 71980 74349 67993 63586 62220 58891 54947 67954 80103 85677 77405 68012 57854
10824E7854K944M393N234o471L872O133m15k812j0402r715l938N653N181N117
$$ 57854 60798 65191 70425 63954 67826 73959 73544 70732 60330 50615 46677 52330 57511 62628
10810F2628M135r80n204J001o480j488Q143Q612L605M337N776l471j5038j785
$$ 62628 66763 65783 60579 61580 55100 53612 61755 70367 73972 78309 84085 80614 65576 63791
10796F3791Q01N405L436L584J677k734r34L00L803l501J004m616K401m07K27L635
$$ 63791 64592 69997 73433 77017 78694 75960 75026 75326 79129 75628 76632 72016 74417 74010 74237 77872
10780G7872k172m828p604j524J0148Q987k846o426K757R62k609j272Q93n614q862
$$ 77872 75700 70872 63268 61744 71892 80879 78033 71607 74364 75326 72717 71445 72338 66724 57862
10765E7862k921L197L80J466N672Q072Q95m285o062n787M835Q035p353m565L188
$$ 57862 54941 58138 58518 59984 65656 73728 74623 70338 64276 58489 63324 71359 64006 59441 62629
10750F2629L329o502N561M279p699l988o74Q200O680M791r358l814L115P502l354
$$ 62629 65958 59456 65017 69296 61597 57609 56935 65135 71815 76606 67248 63434 66549 74051 70697
10735G0697J251L477L746K097k685L571M022R06L906n211j0414o807J922O141
$$ 70697 71948 75425 79171 81268 78583 82154 86176 87082 90988 85777 75363 68556 70478 76619
10721G6619N08r94Q30J182L167K979J468O66N805m555p993o254J2364L421j579
$$ 76619 77127 76133 76963 78145 81312 84291 85759 86425 92230 87675 79682 73428 85792 89213 87634
10706H7634j1379p639m227l815k180P067j922o81j81J296R014l136L844P998N140
$$ 87634 76255 68616 64389 60574 58394 65461 63539 62858 62677 63973 72987 69851 73695 81693 86833
10691H6833K251j617r282j2505n712M084O839N550j3250j3843L747J0398J831
$$ 86833 89084 87467 78185 65680 59968 64052 70891 76441 63191 49348 53095 63493 65324
10678F5324M717K172m683j212J545j3O620K754j276K155l610j5383J104J3557
$$ 65324 70041 72213 67530 66318 67863 67850 74470 77224 75948 78103 74493 59110 60214 73771
10664G3771N801k377r30O8M581M837P417n896j2029j375o82Q6M761Q891n761j257
$$ 73771 79572 77195 76265 76333 80914 85751 93168 87272 75243 73868 73186 73272 78033 86924 81163 79906
10648G9906l220M591j838p346r094m715J0044R814n43p274j753k392N92J758K247
$$ 79906 76686 81277 79439 72093 62999 58284 68328 78142 77599 70325 68572 66180 66772 68530 70777
10633G0777R00K340k074N358J877N302o45l193J563q996q957K279J427l520M863
$$ 70777 71677 74017 71943 77301 79178 84480 83835 80642 82205 73209 64252 66531 67958 64438 69301
10618F9301N55J521P645K59J874l070O80J32m941j150L566k230j339N860M860
$$ 69301 69856 71377 79022 79281 81155 78085 78765 78897 73956 72806 76372 74142 72803 78663 83523
10603H3523l140l296l868M282K913r81l640j521n981p77M339k842R7M048L917
$$ 83523 80383 77087 73219 77501 80414 79433 75793 74272 68291 67514 71853 69011 69108 73156 77073
10588G7073p427M211N428J1162q342q587m890l004R933K792K553K127k555o999
$$ 77073 69646 73857 79285 90447 82105 73518 68628 65624 75557 78349 80902 83029 80474 73475
10574G3475o319J0711Q087L806l248k354n927n39M743K063m374j657J947O76o488
$$ 73475 67156 77867 85954 89760 86512 84158 78231 77692 82435 84498 80124 78467 80414 81090 74602
10559G4602l636N250K678n766j040L052K738N317J974N39r318j158l01k587p574
$$ 74602 70966 76216 78894 73128 72088 75140 77878 83195 85169 85708 76390 75232 74931 72344 64770
10544F4770O765L233q227P352P123n083K822k033m707o167l071O702Q629M535
$$ 64770 71535 74768 66541 73893 81016 75933 78755 76722 72015 65848 62777 69479 78108 82643
10530H2643K727n898l568m333n48L21M93J01m04J2O619L031l98r154j697O68m527
$$ 82643 85370 79472 75904 71571 71023 71344 71837 71938 71534 71546 78165 81196 80798 71644 69947 70615 66088
10513F6088j271J0903J0524Q3J365O46L239J152M394K012n665q342n55l22m56
$$ 66088 64817 75720 86244 86327 87692 88338 91577 92729 97123 99135 93470 85128 84573 84251 83795
10498H3795r43L015M515n071L66K076M694k420o402j173J1231N843j830m927j5212
$$ 83795 82852 85867 90382 85311 85677 87753 92447 90027 83625 82452 93683 99526 97696 92769 77557
10483G7557j049L508j147K333n275O818M36o76k832l227K928O676k677j1404k925
$$ 77557 76508 80016 78869 81202 75927 82745 83181 82505 79673 76446 79374 86050 83373 71969 69044
10468F9044N908K628L916O465k801k880k322l691J0186J993o387P195J996l058
$$ 69044 74952 77580 81496 87961 85160 82280 79958 76267 86453 88446 82059 89254 91250 88192
10454H8192q240o577m677J267N320N587j610K923k057J6p38l880k439N30j052
$$ 88192 79952 73375 68698 69965 75285 80872 79262 82185 80128 80144 79406 75526 73087 73617 72565
10439G2565O315n773N872K664o400J48O770Q447K285J69q788K652M335p886N063
$$ 72565 78880 73107 78979 81643 75243 75391 82161 90608 92893 93062 84274 86926 91261 83375 88438
10424H8438J314K781P623l265n507J434q304l485K947L09M50k289K105Q085P98
$$ 88438 89752 92533 100156 96891 91384 92818 84514 81029 83976 84285 84735 82446 84551 92636 93434
10409I3434K137N066n773j24j886k847M698k411L51m475K39o819k87N35j847M362
$$ 93434 95571 100637 94864 94740 92854 90007 94705 92294 92645 88170 88409 81590 81303 81838 79991 84353
10393H4353Q28K77j471j7R966R212l30N623o034n698k280j754l817o78m233O140
$$ 84353 85181 85458 83987 83970 93936 103148 102818 108441 102407 96709 94429 92675 88858 88180 83947 90087
10377I0087Q574r266k871O937L904J690j665j0652m538m39l001m75o591n43Q079
$$ 90087 98661 89395 86524 93461 97365 99055 97390 86738 82200 81761 78760 78285 71694 71151 79230
10362G9230J681M517O872K229j276L069Q13Q967j148J208M944J185j818l866o922
$$ 79230 80911 85428 92300 94529 93253 96322 97135 106102 104954 106162 111106 112291 110473 106607 99685
10347I9685m085K261n478j0085k866P524N090M160Q365k604J053M109o430j875
$$ 99685 95600 97861 92383 82298 79432 86956 92046 96206 104571 101967 103020 107129 100699 98824
10333I8824m299m390Q86P353K871q590m967L159J818q131K078Q186O771n074m846
$$ 98824 94525 90135 91021 98374 101245 92655 87688 90847 92665 84534 86612 94798 101569 96495 91649
10318I1649l689R589O334m25n237n328k340k382K421N243J481l826j194j787j124
$$ 91649 87960 97549 103883 103458 98221 92893 90553 88171 90592 95835 97316 93490 92296 90509 89385
10303H9385r971k009N472J046N280K665l54o255k026J449k934j909p164M570J2455
$$ 89385 79414 77405 82877 83923 89203 91868 91514 85259 83233 84682 81748 79839 72675 77245 89700
10288H9700J711j121M995J0084L576p528n580N022L199n380N904J155j840m912
$$ 89700 91411 90290 95285 105369 108945 101417 95837 100859 104058 98678 104582 105737 103897 98985
10274I8985k938Q497k324m322k338L340P469Q334Q468P39J645J597q689j1632
$$ 98985 96047 104544 102220 97898 95560 98900 106369 114703 123171 123910 125555 127152 118463 106831
10260A06831l163K954O202J502O194q489r978K873K914O98l511K353p185p574
$$ 106831 103668 106622 112824 114326 120520 112031 102053 104926 107840 108538 105027 107380 100195 92621
10246I2621J813M315j542j809O972O475p226L0J000N316P702O89r26N540K667
$$ 92621 94434 98749 97207 95398 102370 108845 101619 101649 102649 107965 115667 116356 115430 120970 123637
10231A23637M061p687j1243rn104r548P009K662j532M477L736P584M530n514K620
$$ 123637 127698 120011 108768 108759 103655 94107 101116 103778 102246 106723 110459 118043 122573 117059 119679
10216A19679j413o124l681m424M520j611l908J465J0720P827K946l421q7j0704
$$ 119679 118266 112142 108461 104037 108557 106946 103038 104503 115223 123050 125996 122575 122488 111784
10202A11784j3235p15M528k489m574J329O762M991O145J894q32m783P83P994k858
$$ 111784 98549 97834 102362 99873 95299 96628 103390 108381 114526 116420 115588 110805 111588 119582 116724
10187A16724l550n394o431J1084J2963o599k428M297q38L246L543O816P793n221
$$ 116724 113174 107780 101349 112433 125396 118797 116369 120666 119828 123074 126617 133433 141226 136005
10173A36005m998L751K112J286M468K866m54n302n190m962Q267M121l842j0306
$$ 136005 131007 134758 136870 138156 142624 145490 145036 139734 134544 129582 137849 141970 138128 127822
10159A27822K356J677j589O240j846m291q471o684J985J2209J946k258l328n186
$$ 127822 130178 131855 130266 136506 134660 130369 121898 115214 117199 129408 131354 129096 125768 120582
10145A20582k316K529P86J407r20P436L191k302o945J806J1921Q508K129q030
$$ 120582 118266 120795 121581 122988 122068 129504 132695 130393 123448 125254 137175 145683 147812 139782
10131A39782j562M275K257j578j809M413Q032O96K528J887j757l142o749j0643
$$ 139782 138220 142495 144752 143174 141365 145778 153810 154506 157034 158921 157164 154022 147273 136630
10117A36630P486N771L2M121N007k531r398j4737J405N351p165M265L082K669
$$ 136630 144116 149887 149919 154040 159047 156516 147118 132381 133786 139137 131972 136237 139319 141988
10103A41988N05L010j437j042M135q48L48K969q890m861k452J2604n082o815L651
$$ 141988 142493 145503 144066 143024 147159 146311 146659 149628 140738 135877 133425 146029 140947 134132 137783
10088A37783P656J3657k366m517m604P242M056L47K101L838M908n859l88N364
$$ 137783 145439 159096 156730 152213 147609 154851 158907 159254 161355 165193 170101 164242 163854 169218
10074A69218M81j2172k329J0449P230J913j328M355J2275J1792J3569K2449L7555
$$ 169218 169699 157527 155198 165647 172877 174790 173462 177817 190092 201884 215453 237902 275457
10061B75457M2153L8579K5715J4708N369O82j7156k8092k8595m1939l1228k4056
$$ 275457 317610 356189 381904 396612 401981 402663 385507 357415 328820 286881 255653 231597
10049B31597k2536j1387o13m758r570q107Q29N753N653J038K340Q580P886N846
$$ 231597 209061 197674 197061 192303 182733 174626 175455 181208 186861 187899 190239 198819 206705 212551
10035B12551l997p181k629L767K982M464K909O603R493O186J9296J9089K7064
$$ 212551 208554 201373 198744 202511 205493 209957 212866 219469 228962 235148 254444 273533 300597
10022C00597N3575O3400R0171J07052J05325J11663R5835Q6226N5517Q888m0689
$$ 300597 354172 417572 507743 614795 720120 831783 927618 1013844 1069361 1078249 1037560
10011A037560o8655p7628j05956j28059j12363q8346p4296m1078k6944k0732j0741
$$ 1037560 968905 891277 785321 657262 544899 456553 382257 341179 314235 293503 282762
10000B82762m815o400j756L486Q15m432l662k918j85p342j0812J675Q010L38J370
$$ 282762 277947 271547 269791 273277 274092 269660 265998 263080 262895 255553 244741 246416 254426 254764 256134
9985B56134J6182O150J5338K7458M3380M3239O0246R5775J23833J46316J57260
$$ 256134 272316 278466 293804 321262 364642 407881 468127 563902 687735 834051 991311
9974I91311J68280J74131J46165J08802N8375q042q1319j23492j51723j78064
$$ 991311 1159591 1333722 1479887 1588689 1647064 1639022 1557703 1434211 1282488 1104424
9964A104424j96653j81093j31552q6398n9506m9883l1247k4386j1944m295p042
$$ 1104424 907771 726678 595126 508728 449222 399339 368092 343706 331762 327467 320425
9953C20425j5186j3817j4431j2037p984J026M15O673R434O745J279P880P741L739
$$ 320425 305239 291422 276991 264954 256970 257996 258411 265084 274518 281263 282542 290422 298163 301902
9939C01902J0780K2946K3083L3533L9035N9384P8857J09671J30499J42972J36891
$$ 301902 312682 335628 358711 392244 431279 490663 569520 679191 809690 952662 1089553
9928A089553J10871Q7739L6054m2361j04004j22250j50520j54625j29059j07522
$$ 1089553 1200424 1288163 1324217 1281856 1177852 1055602 905082 750457 621398 513876
9918E13876p3706m1846l3050k0394j1634p042q694r924j6333j2025n213l075O83
$$ 513876 440170 398324 365274 344880 333246 326204 317510 307586 291253 279228 274015 270940 271623
9905B71623m488n813j295l855k780P483J937L432M365l255k607K678P804J0218
$$ 271623 267135 261322 260027 256172 253392 260875 262812 266244 270609 267354 264747 267425 275229 285447
9891B85447J6009J6491K4300L5849N7575N3771L9474K0099R018q305k5053l9387
$$ 285447 301456 317947 342247 378096 435671 489442 528916 549015 558033 549728 524675 485288
9879D85288l9602m3721l5487l0012k3236j8030j2118p035j1795j4124p45K161
$$ 485288 445686 401965 366478 336466 313230 295200 283082 276047 264252 250128 249383 251544
9867B51544l512O996O208l967k876k960o23k574O685L684j49N942M624J2695O482
$$ 251544 248032 255028 261236 257269 254393 251433 250810 248236 254921 258605 258456 264398 269022 281717 288199
9852B88199P150J6742J9796J6883J3281k643j842j528j2484k3007j5797n045j2127
$$ 288199 295349 312091 331887 348770 362051 359408 357566 356038 343554 320547 304750 299705 287578
9839B87578K761l961r86N403J0960N273J0241J5929J3499Q362j027N543N171L515
$$ 287578 290339 286378 285392 290795 301755 307028 317269 333198 346697 355059 354032 359575 364746 368261
9825C68261M522o52n190m16J155k722j6124q867J0040J561j429n590j329J0564
$$ 368261 372783 372131 366941 366525 367680 364958 348834 339967 350007 351568 350139 344549 343220 353784
9811C53784J8777K5172K6159M2141N0340M5602J6949K52L716n823k1193m1950
$$ 353784 372561 397733 423892 466033 516373 561975 578924 579176 582892 577069 555876 513926
9799E13926m7202m3333k2507j4185n679R09J0803J3287O664m165Q054J4975O757
$$ 513926 466724 423391 400884 386699 381020 381929 392732 406019 412683 408518 416572 431547 438304
9786D38304M40J843Q743l42L822l371j555r09p316j0488l409q828K273M051K969
$$ 438304 438744 440587 449330 448988 452810 449439 447884 446975 439659 429171 425762 416934 419207 423258 426227
9771D26227P138K530k984J3342J0579O503R197J9203K8693K7242J4255k020j2556
$$ 426227 433365 435895 432911 446253 456832 463335 472532 491735 520428 547670 561925 559905 547349
9758E47349q937j7491k8499p579n656j2755J860J3880J2362N155n935j656q9j805
$$ 547349 538412 520921 492422 484843 479187 466432 468292 482172 494534 499689 493754 492098 492009 490204
9744D90204j4322p858M618l046K088J2029J1872J6764K8411L0344L0354J6345
$$ 490204 475882 468024 472642 469596 471684 483713 495585 512349 540760 571104 601458 617803
9732F17803J4292M680l13J1421R684k986j078J0430R056Q664N085P911J8959J6403
$$ 617803 632095 636775 636462 647883 657567 654581 653503 663933 672989 681653 686738 694649 713608 730011
9718G30011J9951J5187P772J104o405q710r066l192O218N682j0478l285J57q15
$$ 730011 749962 765149 772921 774025 767620 758910 749844 746652 752870 758552 748074 744789 744946 744131
9704G44131l611k672M170J2089Q624J1270O36J7025K7427K1678K8802K5980L5344
$$ 744131 740520 737848 742018 754107 762731 774001 774637 791662 819089 840767 869569 895549 930893
9691I30893L6098K6025K6630K8903J7499J6429K0578l963n769K4158K7118K2881
$$ 930893 966991 993016 1019646 1048549 1066048 1082477 1103055 1099092 1093323 1117481 1144599 1167480
9679A167480L5150N7697P2681Q3571Q4719Q0495P1480Q0294J09212J56028J96678
$$ 1167480 1202630 1260327 1333008 1416579 1501298 1581793 1653273 1733567 1842779 1998807 2195485
9668B195485K16510K21978K27034K08598J31929O8292P9903J46781K00289K41893
$$ 2195485 2411995 2633973 2861007 3069605 3201534 3269826 3349729 3496510 3696799 3938692
9658C938692K37488K04774J55327M9463j02999k07032k24116j86983j64343j49660
$$ 3938692 4176180 4380954 4536281 4585744 4482745 4275713 4051597 3864614 3700271 3550611
9648C550611j13056q1795l9990j3295L1658Q8502J57658K65525M37170O79436
$$ 3550611 3437555 3355760 3315770 3302475 3334133 3422635 3580293 3845818 4282988 4962424
9638D962424R47925J118677J112884J025703Q65950N84486J92072j31541l17986
$$ 4962424 5910349 7029026 8141910 9167613 10033563 10618049 10810121 10678580 10360594
9629A0360594m21465m93586n21447n34009n47862m89594l84807l17106k83429
$$ 10360594 9939129 9445543 8924096 8390087 7842225 7352631 6967824 6650718 6367289
9620F367289k36493j89771j54575j09371r125J31570K77855M13972N31120O49027
$$ 6367289 6130796 5941025 5786450 5677079 5667954 5799524 6077379 6491351 7022471 7671498
9610G671498P30558P77313Q21167Q74813J002262J207434J581341K186301L089140
$$ 7671498 8402056 9179369 10000536 10875349 11877611 13085045 14666386 16852687 19941827
9601A9941827M393725O232253Q825610J2299591J6108443J8432076J7271243J2560909
$$ 19941827 24335552 30567805 39393415 51693006 67801449 86233525 103504768 116065677
9593A16065677O343276j83895p841163j5004683j8013164j6128586j2328368q531740
$$ 116065677 122408953 122225058 114383895 99379212 81366048 65237462 52909094 44377354
9585D4377354n318815k637393j94076K175986M422745O306812P673371Q735340
$$ 44377354 39058539 36421146 36227070 38403056 42825801 49132613 56805984 65541324
9577F5541324R632076R630977Q275557O493897N164359L535089J009102j320196
$$ 65541324 75173400 84804377 93079934 99573831 104738190 108273279 109282381 107962185
9569A07962185k556011l167341l780656m241594m359328m344751m536014m525921
$$ 107962185 105406174 102238833 98458177 94216583 89857255 85512504 80976490 76450569
9561G6450569l840629k525229l31713L633905J0001084J8997367L0284320M1461989
$$ 76450569 72609940 70084711 69752998 73386903 83387987 102385354 132669674 174131663
9553A74131663M7179834M2642159K9139303J2873813m465127k4900738m2606916
$$ 174131663 221311497 263953656 293092959 305966772 301501645 276600907 233993991
9546B33993991m8087887m1535164l0610656k0326575j2215910o172148j921303
$$ 233993991 185906104 144370940 113760284 93433709 81217799 75045651 73124348
9539G3124348P41426K318406L426054M163006M340478M266020M498692M822611
$$ 73124348 73865774 76184180 79610234 83773240 88113718 92379738 96878430 101701041
9531A01701041M640914L841516K490810N86010j224243k497715m118487o557797
$$ 101701041 106341955 110183471 112674281 113260291 112036048 109538333 105419846 98862049
9523I8862049q644249r487746r710069r848016r131752p177775m535406j980026
$$ 98862049 90217800 80730054 71019985 61171969 52040217 44862442 40327036 38347010
9515C8347010N35349L342288O831884J1054869J4994693J6560129J4280655R294936
$$ 38347010 38882359 42224647 49056531 60111400 75106093 91666222 105946877 115241813
9507A15241813L779304k873828j0850767j6660554j7390176j4935942j1748798
$$ 115241813 119021117 116147289 105296522 88635968 71245792 56309850 44561052
9500D4561052q884912o558488m760844l465588k577275j958943j528971j226555
$$ 44561052 35676140 29117652 24356808 20891220 18313945 16355002 14826031 13599476
9492A3599476j028615r07849q39848p79004o88982o08252n13045l99717k70778
$$ 13599476 12570861 11663012 10823164 10044160 9355178 8746926 8233881 7834164 7563386
9483G563386j63723r3925l7174N565L4089O3855J08570K11859L43338M52679N24500
$$ 7563386 7399663 7305738 7268564 7274129 7308218 7372073 7480643 7692502 8035840 8488519 9013019
9472I013019N60152N67109N10899L08772l0457l71029o22186q18478j008399j126438
$$ 9013019 9573171 10140280 10651179 10959951 10929494 10558465 9936279 9117801 8109402 6982964
9462F982964j031418p91673n62621l93097k79952k05500j46901j00400p2928k5377
$$ 6982964 5951546 5159873 4597252 4204155 3924203 3718703 3571802 3471402 3398474 3373097
9452C373097J2783N1012Q8426J15904J47905J65264J68998J22308L2156n1387
$$ 3373097 3385880 3436892 3525318 3641222 3789127 3954391 4123389 4245697 4277853 4226466
9442D226466j24394j78310k10434k18356j72290j14804q1197j23506j82463k16368
$$ 4226466 4102072 3923762 3713328 3494972 3322682 3207878 3126681 3003175 2820712 2604344
9432B604344k17508k17021k12706j73208j23714r6922q3163o8415n4688n5107
$$ 2604344 2386836 2169815 1957109 1783901 1660187 1563265 1480102 1411687 1356999 1301892
9422A301892m3248m0071m9899m1397l8622m2255l6050l6745m4453m1231m4876
$$ 1301892 1258644 1218573 1168674 1127277 1088655 1046400 1010350 973605 929152 887921 843045
9411H43045n5751l9741k7858k2568k1370j2342m539j1397j1528q876j0290j6678
$$ 843045 787294 747553 719695 697127 675757 663415 658876 647479 635951 627075 616785 600107
9399F00107j4605j3291k6270l8341k7164k2368k2023l2483l2401k8256k7260k4919
$$ 600107 585502 572211 545941 507600 480436 458068 436045 403562 371161 342905 315645 290726
9387B90726J574R66Q27K006l040l609q73Q339J722k151n854r463j6393n742j4112
$$ 290726 292300 293266 294093 296099 293059 289450 288577 296916 298638 296487 290633 281170 264777 259035 244923
9372B44923k9327l7214j7270j8217j3932j098J1249J7049R959J6558N313M905
$$ 244923 215596 178382 161112 142895 128963 127865 139114 156163 166122 182680 187993 192898
9360A92898j3041j8712n254n976j3233j3647j0393n674j3879j3951K631R852R398
$$ 192898 179857 161145 155891 149915 136682 123035 112642 106968 93089 79138 81769 91621 101019
9347A01019J2540L509M983r758j1029j3029o258q145o884P671J0431M728K692
$$ 101019 113559 117068 122051 112293 101264 88235 81977 73832 66948 74619 85050 89778 92470
9334I2470r003j6668K604K482r760j258k533L567Q936Q511P285M454R03Q958R204
$$ 92470 83467 66799 69403 71885 62125 60867 58334 61901 70837 79348 86633 91087 91990 100948 110152
9319A10152L762o626j4385j1618j7664j1275J226N92J066O990l329k649Q524R875
$$ 110152 113914 107288 92903 81285 63621 52346 53572 54164 55230 62220 58891 56242 64766 74641
9305G4641N570l320P828J0060P522M328o395p832j6897l244r071j1065p614K776
$$ 74641 80211 76891 84719 94779 102301 106629 100234 92402 75505 72261 63190 52125 44511 47287
9291D7287R18L002K05l045k346O153K369P715O335j90k80J469n918j3304k972
$$ 47287 48205 51207 51412 48367 46021 52174 54543 62258 68593 68403 68123 69592 63674 50370 47398
9276D7398R844n072n346J193m008j984p68r891j803l751j0100r483N656J0107
$$ 47398 57242 52170 46824 48017 44009 42025 41257 31366 29563 25812 15712 6229 11885 21992
9262B1992O483N074N311N348L070K152M445K508j1894j7809l728j514j5462m979
$$ 21992 28475 33549 38860 44208 47278 49430 53875 56383 44489 26680 22952 21438 5976 997
9248I97N571O234P54o644q186n832N83k074m14P971j357N151P80r514k182k997
$$ 997 6568 12802 13556 6912 -1274 -7106 -6523 -8597 -9011 -1040 -2397 2754 3534 -5980 -8162 -11159
9232a1159L086n07L848O940L747r130l233j978N704J6383J2668O134O343J2313
$$ -11159 -8073 -8580 -4732 2208 5955 -3175 -6408 -8386 -2682 13701 26369 32503 38846 51159
9218E1159J7524L1111M4626L4123L4270L7528L0622K4630J6516q976k2662k3128
$$ 51159 68683 99794 144420 178543 212813 250341 280963 305593 322109 313133 290471 267343
9206B67343l1391m3066m5199l9997l2149r436l566p837n272l34n613l167J005
$$ 267343 235952 192886 147687 107690 75541 66105 62539 54702 49430 49096 43483 40316 41321
9193D1321N796n014j2341P90M807J193J894n612L51O561J5858K2360O250L227
$$ 41321 47117 42103 29762 30552 35359 36552 38446 32834 33185 39746 55604 77964 84214 87441
9179H7441J4545J5899K3922K9517M5143P7007J16267J42588J61655J61123J38325
$$ 87441 101986 117885 141807 171324 216467 293474 409741 552329 713984 875107 1013432
9168A013432J08208N0312k1215p7602j19716j36814j47759j36687j28335r4934
$$ 1013432 1121640 1171952 1150737 1073135 953419 816605 668846 532159 403824 308890
9158C08890o9732m9621k6015j7162j4689k1817j4455j0009l604L419N296M145
$$ 308890 239158 189537 163522 146360 131671 109854 95399 85390 81786 85205 90501 94646
9146I4646j1824p386l710k217N70O528M304J3182J3830J4865J9163K3035L0098
$$ 94646 82822 75436 71726 69509 70079 76607 80911 94093 107923 122788 141951 164986 195084
9133A95084L2876N8071Q8135J28448J67087J98719K08885J82579J38203Q6720
$$ 195084 227960 286031 374166 502614 669701 868420 1077305 1259884 1398087 1484807
9123A484807J2267o8880j28677j61414j74947j72302j64102j35448j07478q1787
$$ 1484807 1497074 1428194 1299517 1138103 963156 790854 626752 491304 383826 302039
9113C02039n7272l8665l4461k8907k1168j7170j1763j6902j4220o946p959L21
$$ 302039 244767 206102 171641 142734 121566 104396 92633 75731 61511 54565 46606 46927
9101D6927k527R4J3347J2623j985J2082R571K919O394R095J3024J6693K3317L8670
$$ 46927 44400 44494 57841 70464 68479 80561 90132 93051 99445 108540 121564 138257 161574 200244
9087B00244O3752R5188J07377R7975J04308R0050O0958K4204j8183n1584o8043
$$ 200244 263996 359184 466561 564536 668844 758894 819852 844056 825873 774289 706246
9076G06246q5268q7791r7886r4684p6271o1027n5663l7870j9670j0289j7046j6312
$$ 706246 620978 533187 435301 340617 264346 203319 147656 109786 90116 79827 62781 46469
9064D6469o783q060o489l026n301j976L766K700N496R30m867p48k59k132m004
$$ 46469 39686 31626 25137 22111 16810 14834 18600 21300 26796 27726 22859 22111 21852 19720 15716
9049A5716K594n008n42Q177P101J2089J8729K4961K5228K2538K4462K3178J9460
$$ 15716 18310 13302 12760 20937 28038 40127 58856 83817 109045 131583 156045 179223 198683
9036A98683k820p826j1854j6287l0406l0235k3365j9840j8361j7095n077N471
$$ 198683 195863 188037 176183 159896 129490 99255 75890 56050 37689 20594 15517 20988
9024B0988r656j0154K363n492m536j0535J555J041n000O382L062K635K161K405
$$ 20988 11332 1178 3541 -1951 -6487 -17022 -15467 -14426 -19426 -13044 -9982 -7347 -5186 -2781
9010b781j245K847j411o972o322m867J448O581L47l437r647r116L874J1183K158
$$ -2781 -4026 -1179 -2590 -9562 -15884 -20751 -19303 -12722 -12375 -15812 -25459 -34575 -30701 -19518 -17360
8995a7360L736O144O135q542k049k708m068L605k994k126k641j920m527L768O274
$$ -17360 -13624 -7480 -1345 -9887 -11936 -14644 -18712 -15107 -18101 -20227 -22868 -24788 -29315 -25547 -19273
8980a9273K377M69l523m600j210J724L918J938m057j274Q010Q926L285j4843o237
$$ -19273 -16896 -16427 -19950 -24550 -25760 -24036 -20118 -18180 -22237 -23511 -15501 -6575 -3290 -18133 -24370
8965b4370n12m849k272J145p60M507J388Q898M187n978p814M603J7109M110r811
$$ -24370 -24882 -29731 -32003 -30858 -31618 -27111 -25723 -16825 -12638 -18616 -26430 -21827 -4718 -608 -10419
8950a0419L18n538m071k84N247O907l017r891k441L54L066q984j572M542k719
$$ -10419 -10101 -15639 -19710 -19994 -14747 -7840 -10857 -20748 -23189 -22835 -19769 -28753 -30325 -25783 -28502
8935b8502j4293l439J4943J1068L311J559k568l499O286N707j101j020N067L651
$$ -28502 -42795 -46234 -31291 -20223 -16912 -15353 -17921 -21420 -15134 -9427 -10528 -11548 -6481 -2830
8921b830N586L169p741n301l556j4797k057J2066q20k38N35j163J042J630m047
$$ -2830 2756 5925 -1816 -7117 -10673 -25470 -27527 -15461 -16281 -16519 -15984 -17147 -16105 -14475 -18522
8906a8522j074M408N940l571J241n614n602N719n482l746j965L555K786L141n849
$$ -18522 -19596 -15188 -9248 -12819 -11578 -17192 -22794 -17075 -22557 -26303 -28268 -24713 -21927 -18786 -24635
8891b4635n834K302O360m725l733N403P28n090L539M030M033P719O128J126L959
$$ -24635 -30469 -28167 -21807 -26532 -30265 -24862 -24134 -29224 -25685 -21655 -17622 -9903 -3775 -2649 1310
8876A310r762m090r858K001J674P707k545m630J328r397n774Q735J1124l459q264
$$ 1310 -8452 -12542 -22400 -20399 -18725 -11018 -13563 -18193 -16865 -26262 -32036 -23301 -12177 -15636 -23900
8861b3900j0272r71L18K77k827Q70J0639N779L663N296J037k437L442k121m738
$$ -23900 -34172 -35143 -34825 -34548 -37375 -36505 -25866 -20087 -16424 -11128 -10091 -12528 -9086 -11207 -15945
8846a5945j15l10j309m356M928J598j309J753L650M252k031l923J353N672m768
$$ -15945 -16060 -16370 -17679 -22035 -17107 -15509 -16818 -15065 -11415 -7163 -9194 -13117 -11764 -6092 -10860
8831a0860j2951o909k886K883k104o887l684R176O131O470N795O954J440j18L470
$$ -10860 -23811 -30720 -33606 -30723 -32827 -39714 -43398 -34222 -28091 -21621 -15826 -8872 -7432 -7550 -4080
8816d080m206J909M655L376r987j2295L459Q61K247K459q908m922J1022K822K17
$$ -4080 -8286 -6377 -1722 1654 -8333 -20628 -17169 -16308 -14061 -11602 -20510 -25432 -14410 -11588 -11371
8801a1371J196l62k339K386p283n811Q463o429l68L794J742K008L668j0565M852
$$ -11371 -10175 -10537 -12876 -10490 -17773 -23584 -15121 -21550 -21918 -18124 -16382 -14374 -10706 -21271 -16419
8786a6419O954M446m073n734p261n938M235L90j013n63N092j97J330R295N19L84
$$ -16419 -9465 -5019 -9092 -14826 -22087 -28025 -23790 -23400 -24413 -24976 -19884 -20081 -18751 -9456 -8937 -8553
8770h553J199P342n689n081m259L172M158j032K317O200K71l380p251j2460k448
$$ -8553 -7354 -12 -5701 -10782 -15041 -11869 -7711 -8743 -6426 -226 45 -3335 -10586 -23046 -25494
8755b5494j229o772j0061J2780J3693J204k397K659k520K433K38k681p454N527
$$ -25494 -26723 -33495 -43556 -30776 -17083 -15879 -18276 -15617 -18137 -15704 -15466 -18147 -25601 -20074
8741b0074P014m589j181k054K175N747J306k395k075j494J0676o980l902k643
$$ -20074 -13060 -17649 -18830 -20884 -18709 -12962 -11656 -14051 -16126 -17620 -6944 -13924 -17826 -20469
8727b0469M40l66m851r23j013O066P139O884j219l668k67o388Q58M98M500j1531
$$ -20469 -20029 -20395 -25246 -26169 -27182 -21116 -13977 -7093 -8312 -11980 -12247 -18635 -17777 -17279 -12779 -24310
8711b4310j4836l316R007J1277O685J4940K999r644k870n469M178M468l995L396
$$ -24310 -39146 -42462 -33455 -22178 -15493 -553 2446 -7198 -10068 -15537 -11359 -6891 -10886 -7490
8697g490k862J575J86o935J012l244j1377k575o661J2171J5659K367j123j787
$$ -7490 -10352 -8777 -8591 -15526 -14514 -17758 -29135 -31710 -38371 -26200 -10541 -8174 -9297 -11084
8683a1084M116K05j1932q581l445M535M405L326P098L013r331J1100M877l743
$$ -11084 -6968 -6763 -18695 -27276 -30721 -26186 -21781 -18455 -11357 -8344 -17675 -6575 -1698 -5441
8669e441p365k118N902J1728N11j3281k327o34M182r296N810R177N176K5j116
$$ -5441 -12806 -14924 -9022 2706 3217 -10064 -12391 -13025 -8843 -18139 -12329 -3152 2024 2049 933
8654I33n360P109K915j9779m839Q579N848O425P673j632k4j446j1565n185n41
$$ 933 -4427 2682 5597 -14182 -19021 -10442 -4594 1831 9504 7872 7848 6402 -5163 -10348 -10889
8639a0889k15O70K04j282L714m5m157m476J090P126M386n608j254j441Q64M118
$$ -10889 -11104 -10434 -10230 -11512 -7798 -7843 -12000 -16476 -15386 -8260 -3874 -9482 -10736 -12177 -11313 -7195
8623g195Q910J019o087M287M490q381nk832l744k7K503J7856J0697m696p689K655
$$ -7195 1715 2734 -3353 934 5424 -2957 -2962 -5794 -9538 -9565 -7062 10794 21491 16795 9106 11761
8607A1761J272L25k981k980n96k343K28K059p610J510K354J461O464k792o710
$$ 11761 13033 13358 10377 7397 6801 4458 4686 6745 -865 645 2999 4460 10924 8132 1422
8592A422o64o265K691q712j655J0309k615M684J476r99k741o101j518o671P093
$$ 1422 758 -5507 -2816 -11528 -13183 -2874 -5489 -805 671 -328 -3069 -9170 -10688 -17359 -10266
8577a0266k390M343j417n318K815K760n351l38Q824J3710O42q382l736L610M186
$$ -10266 -12656 -8313 -9730 -15048 -12233 -9473 -14824 -15162 -6338 7372 8014 -368 -4104 -494 3692
8562C692O780K304m030l773K300n61N37K749J234n365J921k820J520J62N962P606
$$ 3692 10472 12776 8746 4973 7273 6712 7249 9998 11232 5867 7788 4968 6488 6650 12612 20218
8546B0218m544r447m538J704K544O203R516J459r096k586j749K807N602J371o449
$$ 20218 15674 6227 1689 3393 5937 12140 21656 23115 14019 11433 9684 12491 18093 19464 13015
8531A3015Q272K694j595p529n84R720n99p135r006l761M139K925Q981M364n772
$$ 13015 21287 23981 22386 14857 14273 23993 23394 16259 7253 3492 7631 10556 19537 23901 18129
8516A8129k093l908l73N861M968L588o14N372L12m014p461m372l16K746M88j1479
$$ 18129 16036 12128 11755 17616 22584 26172 25558 30930 31242 27228 19767 15395 15079 17825 18313 6834
8500F834m445l179m847L534L263j293j2378o654M71O137Q144M069J786m718J402
$$ 6834 2389 -790 -5637 -2103 1160 -133 -12511 -19165 -18694 -12557 -4413 -344 1442 -3276 -1874
8485a874N942o371K481K268J85J427n088n525m392K871m26L957n208m685P429
$$ -1874 4068 -2303 178 2446 2631 4058 -1030 -6555 -10947 -8076 -8502 -4545 -9753 -14438 -7009
8470g009L134k15P57J720K735J475R946k06j6951j2738m782M010N768N469o873
$$ -7009 -3875 -4090 -3333 -1613 1122 2597 12543 12337 -4614 -17352 -22134 -18124 -12356 -6887 -13760
8455a3760l049L383O756J0632m042j0287m139O976k30l218J0527N346n514m562
$$ -13760 -16809 -13426 -6670 3962 -80 -10367 -14506 -7530 -7760 -10978 -451 4895 -619 -5181
8441e181p175k677k641j160M712O056M740k103R80J574j0077k301R725J378j527
$$ -5181 -12356 -15033 -17674 -18834 -14122 -8066 -3326 -5429 -4449 -2875 -12952 -15253 -5528 -4150 -5677
8426e677r07p643p06k42M471N475j725L769p733j0553m17m122l862O144N536L612
$$ -5677 -6584 -14227 -14933 -15175 -10704 -5229 -6954 -3185 -10918 -21471 -21888 -26010 -29872 -23728 -18192 -14580
8410a4580M266O783L007J752K024j0586j4276L663P666N062N557j7p449j371J0096
$$ -14580 -10314 -3531 -524 1228 3252 -7334 -21610 -17947 -10281 -5219 338 321 -7128 -8499 1597
8395A597k094q191m897n617k343M937j585J5J272M05l650q740J922N006L781Q829
$$ 1597 -497 -8688 -13585 -19202 -21545 -16608 -18193 -18178 -16906 -16501 -20151 -28891 -26969 -21963 -18182 -9353
8379i353R493J40k567n943n812p255K352J463L770J586M186O731M400j759j479
$$ -9353 140 280 -2287 -8230 -14042 -21297 -18945 -17482 -13712 -12126 -7940 -1209 3191 1432 -47
8364d7M830q384n892Q26K391n27m579j939J207L081L460L418J096n051p283k572
$$ -47 4783 -3601 -9493 -8667 -6276 -6803 -11382 -13321 -12114 -9033 -5573 -2155 -1059 -6110 -13393 -15965
8348a5965n005J414J617R162Q540J41o312p737m719q57l21M675M025L748k103
$$ -15965 -20970 -19556 -17939 -8777 -237 -96 -6408 -14145 -18864 -19721 -20042 -15367 -11342 -7594 -9697
8333i697m038N264K129l509K448J037N983N99O06N189p305o371N236j492o768
$$ -9697 -13735 -8471 -6342 -9851 -7403 -6366 -383 216 822 6011 -1294 -7665 -2429 -3921 -10689
8318a0689m696l889o750J009O84m451N780L974J990M350P570p718j1584J48J687
$$ -10689 -15385 -19274 -26024 -25015 -24331 -28782 -23002 -19028 -17038 -12688 -5118 -12836 -24420 -24272 -22585
8303b2585M897N306L694q729l68M818J992q886L75K604p428J752K659K433M039
$$ -22585 -17688 -12382 -8688 -17417 -17785 -12967 -10975 -19861 -19486 -16882 -24310 -22558 -19899 -17466 -13427
8288a3427P90k293K830J772O705N21j83r3L580l186p648l89L616K132j0356L469
$$ -13427 -12637 -14930 -12100 -10328 -3623 -3102 -3285 -3378 202 -2984 -10632 -11021 -7405 -5273 -15629 -12160
8272a2160r83k873j091m178N810k164J0854P414L579l16l362n35p206K949P205
$$ -12160 -13143 -16016 -17107 -21285 -15475 -17639 -6785 629 4208 3892 530 -5 -7211 -4262 2943
8257B943j743p459m770n489j152N969k223J121O987L597k144J031K010N946j153
$$ 2943 1200 -6259 -11029 -16518 -17670 -11701 -13924 -12803 -5816 -2219 -4363 -3332 -1322 4624 3471
8242C471p67m335j3239N359J605O850O245r523n187N442J433q16m939P45M708
$$ 3471 2704 -1631 -14870 -9511 -7906 -1056 5189 -4334 -9521 -4079 -2646 -3462 -8401 -7656 -2948
8227b948M43j64l85m77R21J093j826J164O96L013N603o177p224K436N913J461
$$ -2948 -2505 -2669 -3054 -3531 -2610 -1517 -3343 -2179 -1483 1530 7133 956 -6268 -3832 2081 3542
8211C542L179L460q75k247n856j522J222n15J68k220l882M48J268j782m220o331
$$ 3542 6721 10181 9306 7059 1203 -319 903 388 556 -1664 -5546 -5098 -3830 -5612 -9832 -16163
8195a6163O325O843o796l121l662L970R890J53p693pN108M800O163l615N88P092
$$ -16163 -9838 -2995 -9791 -12912 -16574 -12604 -2714 -2561 -10254 -10261 -5153 -353 5810 2195 2783 9875
8179I875j421n845n06q602j479N53l909R423L061j317N359j772k716n583K795
$$ 9875 8454 2609 2103 -6499 -7978 -7425 -11334 -1911 1150 -167 5192 3420 704 -4879 -2084
8164b084K364J2j1538n369K420l440J705J494Q364L321M021n717r219Q468M617
$$ -2084 280 292 -11246 -16615 -14195 -17635 -15930 -14436 -6072 -2751 1270 -4447 -13666 -5198 -581
8149e81p170K330P852r62O12m611p787q4O450R926j052M08J707o378M315Q076
$$ -581 -7751 -5421 2431 1469 2081 -2530 -10317 -10401 -3951 5975 4923 5331 7038 660 4975 13051
8133A3051j6824L536J033j573j41q879n765j981p29Q959L944O878K185j24M017
$$ 13051 -3773 -237 796 -777 -918 -9797 -15562 -17543 -18272 -9313 -5369 1509 3694 3570 7587
8118G587l264k496L800j956k39M923r124p156N76J0798O456M303J678p034p874
$$ 7587 4323 1827 5627 3671 3432 8355 -769 -7925 -7349 3449 9905 14208 15886 8852 978
8103I78P005J878j3612m562n612m419N920J1556k374n561n115Q053L90L809k546
$$ 978 7983 9861 -3751 -8313 -13925 -18344 -12424 -868 -3242 -8803 -13918 -5865 -5475 -1666 -4212
8088d212o674Q582Q91n588m324K106K180N331J0454J2726k421j0339n953k135
$$ -4212 -10886 -2304 -1413 -7001 -11325 -9219 -7039 -1708 8746 21472 19051 8712 2759 624
8074F24m016l129L191K672M883K709n592j4627P333r98n675K00J901J532N050
$$ 624 -3392 -6521 -3330 -658 4225 6934 1342 -13285 -5952 -6950 -12625 -12425 -10524 -8992 -3942
8059c942M133q136o423n456O042L719M721j904k392O04j04K680m61j0897l782
$$ -3942 191 -7945 -14368 -19824 -13782 -10063 -5342 -7246 -9638 -9034 -9138 -6458 -6919 -17816 -21598
8044b1598J0295N927j996J52N301J016M589J039l186L946j0659l421l41K766J502
$$ -21598 -11303 -5376 -7372 -7220 -1919 -903 3686 4725 1539 5485 -5174 -8595 -8936 -6170 -4668
8029d668M397m955M119L424o85J510n239l35l716r972K45P490j844L07K124o96
$$ -4668 -271 -5226 -1107 2317 1632 3142 -2097 -2432 -6148 -16120 -15875 -8385 -10229 -9922 -7798 -8494
8013h494P60m282k801N29N035P179P006k401p791K978J761k351k63K621J629k467
$$ -8494 -7734 -12016 -14817 -14288 -9253 -2074 4932 2531 -5260 -2282 -521 -2872 -3135 -514 1115 -1352
7997a352K212q729J918J171m321l319N413K765p070O11J452M474L746O607L993
$$ -1352 860 -7869 -5951 -4780 -9101 -12420 -7007 -4242 -11312 -10701 -9249 -4775 -1029 5578 9571
7982I571p747o601J943N50p30r50k216J413o81k974q2j631J74P881M758M94J281
$$ 9571 1824 -4777 -2834 -2284 -3014 -3964 -6180 -4767 -5448 -8422 -8504 -10135 -9961 -2080 2678 3172 4453
7965D453J735Q17P22L554j392l548N59n626o661N812P449p72l443J360J233j854
$$ 4453 6188 7005 7727 11281 9889 6341 6900 1274 -5387 425 7874 7102 3659 5019 6252 4398
7949D398p14R50P663j045o700q216J627P715m532l629P419q917r328R101N318
$$ 4398 3684 4634 12297 11252 4552 -3664 -2037 5678 1146 -2483 4936 -3981 -13309 -4208 1110
7934A110O649k113m877q09O291j469L627K918m189j976p751p067N327N326n054
$$ 1110 7759 5646 769 -40 6251 4782 8409 11327 7138 5162 -2589 -9656 -4329 997 -4057
7919d057o088K995P188K731k128J345j1035p506P2R035Q833J2128m118m491r362
$$ -4057 -10145 -7150 38 2769 641 1986 -9049 -16555 -16483 -7448 1385 13513 9395 4904 -4458
7904d458m552k273n116J0791O413L277k940j455k698j084o33K186J159L636j649
$$ -4458 -9010 -11283 -16399 -5608 805 4082 1142 -313 -3011 -4095 -4728 -2542 -1383 2253 604
7889F04j293l336L183K670K252J425j3011k20O627M295J682m252j366O975O784
$$ 604 -689 -4025 -842 1828 4080 5505 -7506 -7726 -1099 3196 4878 626 -740 6235 13019
7874A3019m657k643j420K452Q82r878m562j838N591Q42J3m58P997k278l275K513
$$ 13019 8362 5719 4299 6751 7633 -2245 -6807 -8645 -3054 -2212 -2199 -2657 5340 3062 -213 2300
7858B300P367m246n097q172n770l244K929J173M23P681J7127J849n286p888j4036
$$ 2300 9667 5421 324 -7848 -13618 -16862 -13933 -12760 -12337 -4656 12471 14320 9034 1146 -12890
7843a2890J717P189m989j867j063J572k395m82j692J45M393O051R152qm027N9
$$ -12890 -11173 -3984 -8973 -10840 -11903 -10331 -12726 -13208 -14900 -14755 -10362 -4311 4841 4833 806 865
7827H65L964j33k928p84m12p952l675l354J819J3530N237M600l064l066M912P10
$$ 865 4829 4696 1768 984 572 -7380 -11055 -14409 -12590 940 6177 10777 7713 4647 9559 10269
7811A0269q106j274o396n930k125N859K658m863J919N05J2322K705o441l647m245
$$ 10269 2163 889 -5507 -11437 -13562 -7703 -5045 -9908 -7989 -7484 4838 7543 1102 -2545 -6790
7796f790N698m581j0081J922O333P017l141k505M017R064j683K687L133m214p001
$$ -6790 -1092 -5673 -15754 -13832 -7499 -482 -3623 -6128 -2111 6953 5270 7957 11090 6876 -125
7781a25r42L457M628P164j453k182K802n628n456o600J004j050K95K437k97M397
$$ -125 -1067 2390 7018 14182 12729 10547 13349 7721 2265 -4335 -3331 -4381 -4086 -1649 -1946 2451
7765B451R216L880O60K606m720q710j0288l558M063k126k886K698l97K159J557
$$ 2451 11667 15547 16207 18813 14093 5383 -4905 -8463 -4400 -6526 -9412 -6714 -7111 -4952 -3395
7750c395O485l11p527R62K589J328J59K132q301l708q89p072j087R366J5806L394
$$ -3395 3090 2779 -4748 -3786 -1197 131 290 2422 -5879 -9587 -10476 -17548 -18635 -9269 6537 9931
7734I931j4664l597M466n368j026K878j367k397o596N701J1788P88k449K548r89
$$ 9931 -4733 -8330 -3864 -9232 -10258 -7380 -8747 -11144 -17740 -12039 -251 537 -1912 636 -353
7719c53l685o01J546m017j724l631l089L936J477L700n676k74O232M633n042p768
$$ -353 -4038 -4639 -3093 -7110 -8834 -12465 -15554 -11618 -10141 -6441 -12117 -12391 -6159 -1526 -6568 -14336
7703a4336p411R371K556j187k075M886m80l861J515J756Q25J176M858j888j996
$$ -14336 -21747 -12376 -9820 -11007 -13082 -8196 -8676 -12537 -11022 -9266 -8441 -7265 -2407 -4295 -6291
7688f291L515j666r73Q67k544K364O224j896l410n07k610r378m584M907M226Q90
$$ -6291 -2776 -4442 -5415 -4548 -7092 -4728 1496 -400 -3810 -4317 -6927 -16305 -20889 -15982 -11756 -10866
7672a0866n82O67j123j2290l098O955O664M487L506J266J310M16n361J776L753
$$ -10866 -11448 -10781 -11904 -24194 -27292 -20337 -13673 -9186 -5680 -4414 -3104 -2688 -8049 -6273 -2520
7657b520l302K421J1333K225r881o309o420O008M355o694j764j067q35O081o190
$$ -2520 -5822 -3401 7932 10157 276 -6033 -12453 -6445 -2090 -8784 -10548 -11615 -12450 -6369 -12559
7642a2559p792M329P276N52l008N604O115L4k389l441l426K304m320L481k165
$$ -12559 -20351 -16022 -8746 -8194 -11202 -5598 517 551 -1838 -5279 -8705 -6401 -10721 -7240 -9405
7627i405J863O291j263l297j081N249M09J215K426K070l909l971l410N367j291
$$ -9405 -7542 -1251 -2514 -5811 -6892 -1643 -1234 -19 2407 4477 568 -3403 -6813 -1446 -2737
7612b737k335R1q29n092k286K531m334M020J2336K962J836j762m104l232m096
$$ -2737 -5072 -4981 -5810 -10902 -13188 -10657 -14991 -10971 1365 4327 6163 4401 297 -2935 -7031
7597g031j265j1310L712K495J822j715l518j905P961J912L970J8562K047r651
$$ -7031 -8296 -19606 -15894 -13399 -11577 -13292 -16810 -18715 -10754 -8842 -4872 13690 15737 6086
7583F086p957k097O65j529o753j751L89L112L855N932q359L385J4171O708p168
$$ 6086 -1871 -3968 -3303 -4832 -11585 -13336 -12947 -9835 -5980 -48 -8407 -5022 9149 15857 8689
7568H689j6650m69O001J874k19m70O156Q13k074k885r26o929L954N918K116m44
$$ 8689 -7961 -8430 -2429 -555 -774 -1244 4912 5725 3651 766 -160 -7089 -3135 2783 4899 4455
7552D455n587m325m657L86R663L488K925k034o456J41J616K512k91l208r443j156
$$ 4455 -1132 -5457 -10114 -9728 -65 3423 6348 4314 -2142 -2001 -385 2127 1836 -1372 -10815 -11971
7536a1971K08n311j141K399N295O015O630O461k090o049L90N625J889J895L196
$$ -11971 -11763 -17074 -18215 -15816 -10521 -4506 2124 8585 6495 446 836 6461 8350 10245 13441
7521A3441n126p267L262P733j473r735n857K023j38k684j670P325J420J438M437
$$ 13441 8315 1048 4310 12043 10570 835 -5022 -2999 -3137 -5821 -7491 -166 1254 2692 7129
7506G129j467K691K736m745q201k809m860P58M316L931m883j772m756j979J0688
$$ 7129 5662 8353 11089 6344 -1857 -4666 -9526 -8768 -4452 -521 -5404 -7176 -11932 -13911 -3223
7491c223k304l942m042N606K579n179O563L443j0909J322O962k935o701m800N713
$$ -3223 -5527 -9469 -13511 -7905 -5326 -10505 -3942 -499 -11408 -10086 -3124 -6059 -12760 -17560 -11847
7476a1847P682N144P256J304O015R55j927k899o644l669J905p77j541J217K804
$$ -11847 -4165 979 8235 9539 15554 16509 14582 11683 5039 1370 3275 2498 957 2174 4978
7461D978M140k591o39J592k705k346j542J351k157m990j459l256K681J763K444
$$ 4978 9118 6527 5888 7480 4775 2429 887 2238 81 -4909 -6368 -9624 -6943 -5180 -2736
7446b736l542n082J604o00K318k511p25K496K594j08N957Q99p445N557q245j901
$$ -2736 -6278 -11360 -9756 -10356 -8038 -10549 -11274 -8778 -6184 -6292 -335 564 -6881 -1324 -9569 -11470
7430a1470J1906j178l333k403l17K757k302k313O65p31l733K211J469K632n049
$$ -11470 436 -742 -4075 -6478 -6795 -4038 -6340 -8653 -7988 -8719 -12452 -10241 -8772 -6140 -11189
7415a1189j2843M380J2533J1908R881r95o345j76o614o376k040k682P522O173
$$ -11189 -24032 -19652 -7119 4789 14670 13675 7330 7154 540 -5836 -7876 -10558 -3036 3137
7401C137j388L31M988J62j0696J789L945k872J113n055K444Q702J1O919K937k442
$$ 3137 1749 2080 7068 7230 -3466 -1677 2268 -604 509 -4546 -2102 6600 6611 13530 16467 14025
7385A4025n248J587j658n524n217j675n000N754P520o686p056L66K423M03l828
$$ 14025 8777 10364 8706 3182 -2035 -3710 -8710 -2956 4564 -2122 -9178 -8812 -6389 -5986 -9814
7370i814M874J0047j1538l921J723L762M265K040P353j35r433r013l309K231L666
$$ -9814 -4940 5107 -6431 -10352 -8629 -4867 -602 1438 8791 8656 -777 -9790 -13099 -10868 -7202
7355g202r14k60O92N851J0386m557P17K576m795r526p546K193Q712m016j034J0042
$$ -7202 -8116 -8376 -7684 -1833 8553 3996 4713 7289 2494 -7032 -14578 -12385 -3673 -7689 -8723 1319
7339A319N470p274k248N365P421k972j9401p468N446j95p351L288O438M73L968
$$ 1319 6789 -485 -2733 2632 10053 7081 -12320 -19788 -14342 -14537 -21888 -18600 -12162 -11689 -7721
7324g721L667p87K884Q121n06j416Q208K58r573o726n822n35N204j614R170J0580
$$ -7721 -4054 -4841 -1957 6164 5658 4242 12450 12708 3135 -3591 -9413 -9948 -4744 -6358 2812 13392
7308A3392M384j4222q005O51J039k910k092p71K372O632O301L741m519j1226Q81
$$ 13392 17776 3554 -4451 -3800 -2761 -5671 -7763 -8534 -6162 470 6771 10512 5993 -5233 -4352
7293d352l005l029N31O178j075o08q56K94N687P512j627j681k453J191k200K614
$$ -4352 -7357 -10386 -9855 -3677 -4752 -5360 -6216 -5922 -235 7277 5650 3969 1516 2707 507 3121
7277C121m595j695L819k992M859L53k874N1p875q493M881K526n892p514K024Q712
$$ 3121 -1474 -3169 650 -2342 2517 2870 -4 47 -7828 -16321 -11440 -8914 -14806 -22320 -20296 -11584
7261a1584P33q659P60J594K205L766K471l066L735P553K335L864J0452K03J806
$$ -11584 -10851 -19510 -18750 -17156 -14951 -11185 -8714 -11780 -8045 -492 1843 5707 16159 16362 18168
7246A8168K130n6n095m953n393p155M25k350n280L623P55n912m323j536O901O526
$$ 18168 20298 20242 15147 10194 4801 -2354 -1929 -4279 -9559 -5936 -5181 -11093 -15416 -16952 -10051 -3525
7230c525Q075P726P301R96q047q370J297o763r634k312J0198M134l940j017P000
$$ -3525 4550 12276 19577 20573 12526 4156 5453 -1310 -10944 -13256 -3058 1076 -2864 -3881 3119
7215C119L829k917l310j4656j644J1114J1079M192Q850J3107J1777J7395n763
$$ 3119 6948 4031 721 -13935 -15579 -4465 6614 10806 19656 32763 44540 61935 56172
7202E6172n266j7610k0623j7336j6663j2415n620P791J0913P817k273M353q307
$$ 56172 50906 33296 12673 -4663 -21326 -33741 -39361 -31570 -20657 -12840 -15113 -10760 -19067
7189a9067j0562K519J5127P645L61K751O411Q056J851j314m166p662P87j895j0059
$$ -19067 -29629 -27110 -11983 -4338 -3977 -1226 5185 13241 15092 13778 9612 1950 2737 842 -9217
7174i217m238k512Q64K993M504m323j0874l830K806N064J5866N773J666N353k34
$$ -9217 -13455 -15967 -15103 -12110 -7606 -11929 -22803 -26633 -23827 -18763 -2897 2876 4542 9895 9661
7159I661k711j0913j074O475q334k666n055M92P477O839m952j984j249Q002n546
$$ 9661 6950 -3963 -5037 1438 -6896 -9562 -14617 -14125 -6648 191 -4761 -6745 -7994 8 -5538
7144e538J148N666K670m7L220j289j297q246o081L691j261j563m892P400O690
$$ -5538 -4390 1276 3946 3899 7119 5830 4533 -3713 -9794 -6103 -7364 -8927 -13819 -6419 271
7129B71l629k125L094k3J0465K446n744r079j0582J278J180N1J893r27R755M786
$$ 271 -3358 -5483 -2389 -2412 8053 10499 4755 -4324 -14906 -13628 -12448 -12397 -10504 -11431 -1676 3110
7113C110p508n977j42M717J1785m166J438P684k832n938L771J353m784n906j066
$$ 3110 -4398 -10375 -10517 -5800 5985 1819 3257 10941 8109 2171 5942 7295 2511 -3395 -4461
7098d461K388M99j122N856k373M040N908l768o907m069k492K040r85k583J451
$$ -4461 -2073 -1574 -2696 3160 787 4827 10735 6967 60 -4009 -6501 -4461 -5446 -8029 -6578
7083f578k900O123Q458j671P162K716l629j197L420J719m01N53p419p841m472
$$ -6578 -9478 -3355 5103 3432 10594 13310 9681 8484 11904 13623 13222 13775 6356 -1485 -5957
7068e957n109M601k676m47j007Q198L964P97J263p115j2224N167J1676M772L29
$$ -5957 -11066 -6465 -9141 -9588 -10595 -2397 1567 2364 3627 -3488 -15712 -10545 1131 5903 6232
7053F232M931N142o5N833o91j4862q775l779j271n270J822M032k913l358Q443
$$ 6232 11163 16305 16240 22073 21382 6520 -2255 -6034 -7305 -12575 -10753 -6721 -9634 -12992 -4549
7038d549J2068O488r198q581k098K43M161Q793j887m528k213M42K553M317k929
$$ -4549 7519 14007 4809 -3772 -5870 -5627 -1466 7327 5440 912 -1301 -859 1694 6011 3082
7023C082J541n413M67j62o988o839J435L07l85n244J430q96O59N98j972P84j679
$$ 3082 4623 -790 -323 -485 -7473 -14312 -12877 -12570 -12955 -18199 -16769 -17665 -17006 -16408 -18380 -17596 -19275
7006a9275J0588J2810j083r7k140r124R074O725j701K047j832J770n378j0126
$$ -19275 -8687 4123 3040 2943 803 -8321 753 7478 5777 7824 5992 7762 2384 -7742
6992g742m050Q827N728J99J890N104J748m457m668M369p683k091O930J423l925
$$ -7742 -11792 -2965 2763 2962 4852 9956 11704 7247 2579 6948 -735 -2826 4104 5527 1602
6977A602p01J526J4863l669j1429N18N21r331L994J2302J1048q86k955r074n019
$$ 1602 901 2427 17290 13621 2192 2710 3231 -6100 -2106 10196 21244 20358 17403 8329 3310
6962C310K558P105J124n92j003r52n709l052M807Q804q55j1311j2014K86O723
$$ 3310 5868 12973 14097 13505 12502 11550 5841 2789 7596 16400 15545 4234 -7780 -7494 -771
6947g71K246l80l862m405Q958L229m340k213M148r99K471J419o367p79J1698K077
$$ -771 1475 1095 -2767 -7172 1786 5015 675 -1538 2610 1611 4082 5501 -866 -1645 10053 12130
6931A2130m988M63Q68k77l32m185R989p9J155K026l791n238o182l257J101L171
$$ 12130 7142 7605 8473 8196 7864 3679 13668 13589 14744 16770 12979 7741 1559 -1698 -597 2574
6915B574o13j033N256P7P240m855K731m087o661L994l053L430K799M854j883l802
$$ 2574 1961 928 6184 6261 13501 8646 11377 7290 629 4623 1570 5000 7799 12653 10770 6968
6899F968L45J412n139j32J004M783o580M11M535R819q665p769M96j443K519O519
$$ 6968 7313 8725 3586 3454 4458 9241 2661 3072 7607 17426 8761 992 1488 45 2564 9083
6883I083j2037j620M905J348l520n407j190P655l795l518R10M421K780l582p29
$$ 9083 -2954 -4574 331 1679 -1841 -7248 -8438 -783 -4578 -8096 -7186 -2765 15 -3567 -4296
6868d296n967j923q13l227O538J4993j46j410j0366p444l249R71J104J893Q094
$$ -4296 -10263 -12186 -12999 -16226 -9688 5305 5159 3749 -6617 -14061 -17310 -16339 -15235 -13342 -5248
6853e248O960J478j402m154N70K902J015l293L41N479j883j576j08k155m91O007
$$ -5248 1712 3190 1788 -2366 -1796 1106 2121 -1172 -831 4648 2765 1189 1081 -1074 -1565 4442
6837D442k71o084p90O356m579j3994m679Q872Q558O97n228p235O498j561k778
$$ 4442 4171 -1913 -2703 3653 -926 -14920 -19599 -10727 -2169 -1472 -6700 -13935 -7437 -8998 -11776
6822a1776O081K212K208P169J143o812l221J383k943j478p592n270q59P795O522
$$ -11776 -5695 -3483 -1275 5894 7037 225 -2996 -1613 -4556 -6034 -13626 -18896 -19755 -11960 -5438
6807e438L831M455O955m33N633r000r88P195L185m22l449r076j1385k134n211
$$ -5438 -1607 2848 9803 9370 15003 6003 5015 12210 15395 14973 11524 2448 -8937 -11071 -16282
6792a6282Q620J5458k047l854O132l540o059J264K263P26j117k819L367N752J804
$$ -16282 -7662 7796 5749 1895 8027 4487 -1572 -308 1955 2681 1564 -1255 2112 7864 9668
6777I668l265k548j7O931k601m788q788j781Q586J099l928k689J605j981O298
$$ 9668 6403 3855 3838 10769 8168 3380 -5408 -7189 1397 2496 -1432 -4121 -2516 -4497 1801
6762A801l256m448M251J0732K189j676l268K753K303K741o607k741m88O946r07
$$ 1801 -1455 -5903 -1652 9080 11269 9593 6325 9078 11381 14122 7515 4774 4286 11232 10325
6747A0325J478j4534m130K935J120J0475M330K375L854o782r204q95K424J413
$$ 10325 11803 -2731 -6861 -3926 -2806 7669 11999 14374 18228 11446 2242 1347 3771 5184
6733E184n309k475p80J200K888k518K04J264N799P145J0454o107j6173n078j031
$$ 5184 -125 -2600 -3380 -2180 708 -1810 -1606 -342 5457 12602 23056 16949 776 -4302 -5333
6718e333J078j898o656j562M332N018Jl915Q567J667j13k032p908P05j619M759
$$ -5333 -4255 -6153 -12809 -14371 -10039 -5021 -5020 -8935 -368 1299 1186 -846 -8754 -8049 -9668 -4909
6702d909Q169l705J8k340J157M378L966l382N7O239J189K408j989m297k676J0345
$$ -4909 3260 -445 -427 -2767 -1610 2768 6734 3352 3409 9648 10837 13245 11256 6959 4283 14628
6686A4628N925r339p162o422l773J0690Q958k016j262p618o78o492l938j1783
$$ 14628 20553 11214 4052 -2370 -6143 4547 13505 11489 10227 2609 1931 -4561 -8499 -20282
6672b0282K700L318P11j903K578K194J315M376M685L820j073L672K451J627l158
$$ -20282 -17582 -14264 -13553 -15456 -12878 -10684 -9369 -4993 -308 3512 2439 6111 8562 10189 7031
6657G031n983k155q600L101Q626m84p458R502K403r642M309J0262n935r059Q231
$$ 7031 1048 -1107 -9707 -6606 2020 1536 -5922 3580 5983 -3659 650 10912 4977 -4082 4149
6642D149p4j133j952k591n112j684M857J2626J86L124J938q326p351j1885M814
$$ 4149 4075 2942 990 -1601 -6713 -8397 -3540 9086 9272 12396 14334 6008 -1343 -13228 -8414
6627h414J2761P937k599j3915j6765J004O63M364N813P03L499N536M778K250q808
$$ -8414 4347 12284 9685 -4230 -20995 -19991 -19328 -14964 -9151 -8448 -4949 587 5365 7615 -1193
6612a193p00L724L608k343k258n488n209K860M296J557L23j319o70j032j734n381
$$ -1193 -1893 1831 5439 3096 838 -4650 -9859 -6999 -2703 -1146 -823 -2142 -2812 -3844 -5578 -10959
6596a0959j991K882J581r36n579o709R817K331j196j341n32N253Q258q320J160
$$ -10959 -12950 -10068 -8487 -9423 -15002 -21711 -11894 -9563 -10759 -12100 -12632 -7379 879 -7441 -6281
6581f281L19J930M686j94k754o722m627O683k146l983K628O719J2422L296k747
$$ -6281 -5962 -4032 654 460 -2294 -9016 -13643 -6960 -9106 -13089 -10461 -3742 8680 11976 9229
6566I229p325l746q730KQ59p575m617K493O857O371J399O513k366l713M052N294
$$ 9229 1904 -1842 -10572 -10570 -9711 -17286 -21903 -19410 -12553 -6182 -4783 1730 -636 -4349 -297 4997
6550D997m88o03K791N50o200m988j1870Q145P128n997M565N805n32k649q89K565
$$ 4997 4509 3906 6697 7247 1047 -3941 -15811 -7666 -538 -6535 -1970 3835 3303 654 -235 2330
6534B330O550k105m437N45L240N130r43q902N479L071l278l343R501o166p201
$$ 2330 8880 6775 2338 2883 6123 11253 10310 1408 6887 9958 6680 3337 12838 6672 -529
6519e29O723L098r38k33q14l689m434l156L424j841n857l840J590J848j351M760
$$ -529 6194 9292 8354 8121 7307 3618 -816 -3972 -548 -2389 -8246 -12086 -10496 -8648 -9999 -5239
6503e239o187J422m22K796j500k230O62L544M196l74q016l925M360J658N314l441
$$ -5239 -11426 -10004 -10426 -7630 -9130 -11360 -10698 -7154 -2958 -3332 -11348 -15273 -10913 -9255 -3941 -7382
6487g382J956J0691K105k084K260m26k346o28j149n43l938j437k478M659J003
$$ -7382 -5426 5265 7370 5286 7546 7120 4774 4146 2997 2454 -1484 -2921 -5399 -740 263
6472B63o926M475O740K130N143L259N478l571k118j0583o365K18p67M22J391L461
$$ 263 -6663 -2188 4552 6682 11825 15084 20562 16991 14873 4290 -2075 -1857 -2624 -2202 -811 2650
6456B650J530L461j0209o535R236P616K872j3732r865L408R47K611l959n280L575
$$ 2650 4180 7641 -2568 -9103 133 7749 10621 -3111 -12976 -9568 -8621 -6010 -9969 -15249 -11674
6441a1674L265P015p23m673Q023J0588N963L537n198p994n545k736K842o85l244
$$ -11674 -8409 -1394 -2117 -6790 1233 11821 17784 21321 16123 8129 2584 -152 2690 2005 -1239
6426a239k826p521L492M782J918P636N786j925K872M635J078l65O8j3079r977
$$ -1239 -4065 -11586 -8094 -3312 -1394 6242 12028 10103 12975 17610 18688 18323 18391 5312 -4665
6411d665k54N983O393n644p025p17k04j025p922Q86M411L383Q151L01j2613J242
$$ -4665 -4919 1064 7457 1813 -5212 -5929 -6133 -7158 -15080 -14194 -9783 -6400 1751 2052 -10561 -9319
6395i319N9N020j540l975M983Q609J484m740j73P558L551j413k779Q273K50K587
$$ -9319 -9260 -4240 -5780 -9755 -4772 3837 5321 581 408 7966 11517 10104 7325 15598 15848 18435
6379A8435l944j1056j1120J3973m76n24K774L32j1693m478K975N882M238N980
$$ 18435 14491 3435 -7685 6288 5812 5288 8062 8394 -3299 -7777 -4802 1080 5318 11298
6365A1298n16j229L095n932m935K116l45r829L79J729j204R20Q213o32j669m077
$$ 11298 10782 9553 12648 6716 1781 3897 3552 -6277 -5898 -4169 -5373 -4453 3760 3128 1459 -2618
6349b618O42N610M467K686m725l992j723j528l479K680L051p763q346r689K91
$$ -2618 -1976 3634 8101 10787 6062 2070 347 -1181 -4660 -1980 1071 -6692 -15038 -24727 -24436
6334b4436J0679J2693J0261M361k150k996q20j218j209M85J892K681j893m080
$$ -24436 -13757 -1064 9197 13558 11408 8412 7592 6374 5165 5650 7542 10223 8330 4250
6320D250o174j2755O044K232M122J2304l122r049M026K77O00j626j418l328n25
$$ 4250 -1924 -14679 -8635 -6403 -2281 10023 6901 -2148 1878 2155 2755 1129 -289 -3617 -4142
6305d142J098J101o0j360K918j259J187k365k853P966J444L1N49j816m761o433
$$ -4142 -3044 -1943 -2003 -3363 -445 -1704 -517 -2882 -5735 2231 3675 3706 4255 2439 -2322 -8755
6289h755j852O663K943o26L293N527q304k626L230k059l640L827M406L746K001
$$ -8755 -10607 -3944 -1001 -1627 1666 7193 -1111 -3737 -507 -2566 -6206 -2379 2027 5773 7774
6274G774L653r751J0816J690n526m920o708k349n249l525m486J453O339P619J445
$$ 7774 11427 1676 12492 14182 8656 3736 -2972 -5321 -10570 -14095 -18581 -17128 -10789 -3170 -1725
6259a725N11J64N674J879m403q776l1n109j2044K746Q331M029m219L759L157J872
$$ -1725 -1214 -1050 4624 6503 2100 -6676 -6707 -11816 -23860 -21114 -12783 -8754 -12973 -9214 -6057 -4185
6243d185o459j110N964Q354J76n459M422J0620k09n110M622J495j421q408j0253
$$ -4185 -10644 -11754 -5790 2564 2740 -2719 1703 12323 12114 7004 11626 13121 11700 3292 -6961
6228f961n045L217M528R44m520n102P058J835p788q784N087Q032O803J417j15
$$ -6961 -12006 -8789 -4261 -3317 -7837 -12939 -5881 -4046 -11834 -20618 -15531 -7499 -696 721 606
6213F06p003m96L855Q260k712k938K479Q85k282M349K865n362q148j0243m4K804
$$ 606 -6397 -6893 -3038 5222 2510 -428 2051 2936 654 5003 7868 2506 -5642 -15885 -15929 -13125
6197a3125K452O959P95k627J584O8n012L10o306K561Q152p409o55N459p572l588
$$ -13125 -10673 -3714 -2919 -5546 -3962 -3894 -8906 -8596 -14902 -12341 -4189 -11598 -12253 -6794 -14366 -17954
6181a7954n340N236J0186J5899k967o988m548R419K254o947p407Q49R502N55M15
$$ -17954 -23294 -18058 -7872 8027 5060 -1928 -6476 2943 5197 -1750 -9157 -8308 1194 1749 2164
6166B164O85K996p07k802n510l8Q574P577m140k878N822j055j3901L953K224L992
$$ 2164 2849 5845 5138 2336 -3174 -3212 5362 12939 8799 5921 11743 10688 -3213 740 2964 6956
6150F956k129n273k732R471N810R256m419n194k869M21M825n205n182L133l29
$$ 6956 4827 -446 -3178 6293 12103 21359 16940 11746 8877 9298 14123 8918 3736 6869 6540
6135F540l904P412o286m606j372J000M483n099o386J504Q982R744k348J27l794
$$ 6540 2636 10048 3762 -844 -2216 -1216 3267 -1832 -8218 -6714 2268 12012 9664 9791 5997
6120E997l270J0633J551L869p93q176p101l129K730K174j673K526L574q565j537
$$ 5997 2727 13360 14911 18780 17987 9811 2710 -419 2311 4485 2812 5338 8912 347 -1190
6105a190Q742L539o564r113J194J0819N989L7j405m324k663k105K363M966L662
$$ -1190 7552 11091 4527 -4586 -3392 7427 13416 13453 12048 7724 5061 2956 5319 10285 13947
6090A3947K967n403r811l825r591m166N856k111k878j401L352L879Q345R906M267
$$ 13947 16914 11511 1700 -2125 -11716 -15882 -10026 -12137 -15015 -16416 -13064 -9185 -840 9066 13333
6075A3333j430l433j1973n266K375J1878L434j0092k877m183o56k659n552J984
$$ 13333 11903 8470 -3503 -8769 -6394 5484 8918 -1174 -4051 -8234 -8890 -11549 -17101 -15117
6061a5117N839Q743J690q004Q38N788j017K677M461j866p932j989P517Q649l617
$$ -15117 -9278 -535 1155 -6849 -6011 -223 -1240 1437 5898 4032 -3900 -5889 1628 10277 6660
6046F660n580k651L52k113N616J409l977l573J42O226Q277j353p611j1351j005
$$ 6660 1080 -1571 -1219 -3332 2284 3693 -284 -3857 -3715 2511 10788 9435 1824 -9527 -10532
6031a0532R76j309k552j436J3612M004l368q23j122Q185K297j836K569K630l845
$$ -10532 -9556 -10865 -13417 -14853 -1241 2763 -605 -1428 -2550 5635 7932 6096 8665 11295 7450
6016G450m560o094J521m054O348K992j414j406j473N276O271L122L623n444k047
$$ 7450 2890 -3204 -1683 -5737 611 3603 2189 783 -690 4586 10857 13979 17602 12158 10111
6001A0111j0845q572O31k505k83J2017J026N477L18L202M015j302m500r580j0572
$$ 10111 -734 -9306 -8675 -11180 -11463 554 1580 7057 7375 10577 14592 13290 8790 -790 -11362
5986a1362j1181Q615J1002J3K289n058k192K772m033M785N378Q244P052k646M894
$$ -11362 -22543 -13928 -2926 -2913 -624 -5682 -7874 -5102 -9135 -4350 1028 9272 16324 13678 18572
5971A8572R85l987j4869r57j351o580O34m229O364M850J695M694M446p048n590
$$ 18572 19557 15570 701 -256 -1607 -8187 -7553 -11782 -5418 -568 1127 5821 10267 3219 -2371
5956b371J520j411K20K873J739k094l429J035J3839J21l728o351N46Jp594k532
$$ -2371 -851 -2262 -2042 831 2570 476 -2953 -1918 11921 12042 8314 1963 2509 2510 -5084 -7616
5940g616O887O73j837K126o5O92j679m818K825K787j776r4m385k918j670k55R561
$$ -7616 -729 -56 -1893 233 168 860 -819 -5637 -2812 -25 -1801 -1895 -6280 -9198 -10868 -11123 -1562
5923a562P48J953r83Q70J132k735o097J465L6K789K461l291L821l80n624N677
$$ -1562 -814 1139 156 1026 2158 -577 -6674 -5209 -5173 -2384 77 -3214 607 227 -5397 280
5907B80K0r73k668j195L876L914N60o526k977K293M942M825K974K321Q032j0398
$$ 280 300 -673 -3341 -4536 -660 3254 3814 -2712 -5689 -3396 1546 6371 9345 11666 19698 9300
5891I300j4048l827P8O484N597M200k610j3145j696Q355J0837J971j0146N809
$$ 9300 -4748 -8575 -8497 -2013 3584 7784 5174 -7971 -9667 -1312 9525 11496 1350 7159
5877G159K090J665J71o415o390k727J1248j910q25k056O323N55p463j5841N025
$$ 7159 9249 10914 11085 4670 -1720 -4447 6801 4891 4066 2010 8333 8888 1425 -14416 -9391
5862i391N425J401O119L782J784j877q458n301Q135P223M35J987n084j826j829
$$ -9391 -3966 -2565 3554 7336 9120 7243 -1215 -6516 1619 8842 9277 11264 6180 4354 2525
5847B525j560J633J030O156K537K530k316q60q268l349J231L896M389j625p240
$$ 2525 965 2598 3628 9784 12321 14851 12535 11675 3407 58 1289 5185 9574 7949 709
5832G09k928P94R165J702j0621P649L569o708m245k129q09m760m550n78K614P717
$$ 709 -2219 -1425 7740 9442 -1179 6470 10039 3331 -914 -3043 -3852 -8612 -13162 -13740 -11126 -3409
5816c409l62K429O605j47Qp23N6P492l095p617q089n189O310K817m215K101P898
$$ -3409 -3771 -1342 5263 5116 5124 4401 4457 11949 8854 1237 -6852 -12041 -5731 -2914 -7129 -5028 2870
5799B870J772l045j2045o964J3091K515l983j909N11L609J769P33O459n07j281
$$ 2870 4642 1597 -10448 -17412 -4321 -1806 -5789 -7698 -7187 -3578 -1809 -1076 5383 4876 3595
5784C595l457K538j104n611n40o671M121J268n442P633L242j917K657N16k401
$$ 3595 138 2676 1572 -4039 -4579 -11250 -7129 -5861 -11303 -3670 -428 -2345 312 828 -1573
5769a573m373n595J806K771N964n17K083J2727j076K940o295l034k403L441l922
$$ -1573 -5946 -11541 -9735 -6964 -1000 -1517 566 13293 12217 15157 8862 5828 3425 6866 2944
5754B944m377j108L306P497j889r842k242M476k368Q743K403J538J886m983l53
$$ 2944 -1433 -2541 765 8262 6373 -3469 -5711 -1235 -3603 5140 7543 9081 10967 5984 5631
5739E631j811j339j724o249l528L081J0543o19N300K316L159L52k57j668m813
$$ 5631 3820 2481 757 -5492 -9020 -5939 4604 3985 9285 11601 14760 15112 14855 13187 8374
5724H374m506R49N15J509K023l122M548q337p352P723M193J349q429o334K855
$$ 8374 3868 4817 5332 6841 8864 5742 10290 1953 -5399 2324 6517 7866 -563 -6897 -4042
5709d042K422L869k179n475R20j892O108L429K110l205k996j1097n917n452P00
$$ -4042 -1620 2249 70 -5405 -4485 -6377 -269 3160 5270 2065 -931 -12028 -17945 -23397 -22697
5694b2697Q185L414j616p751J073J0129O325O454j182j767Q498J6k086l738k783
$$ -22697 -14512 -11098 -12714 -20465 -19392 -9263 -2938 3516 2334 567 9065 9081 6995 3257 474
5679D74O5M544N8O712J953O10Q187n949j4516J574m860m314P87K349L78M747j405
$$ 474 539 5083 5141 11853 13806 14416 22603 16654 2138 3712 -1148 -5462 -4675 -2326 -1948 2799 1394
5662A394k487n241j146M121L915K770n69p650m299q57N462L096J65P735O572l268
$$ 1394 -1093 -6334 -7480 -3359 556 3326 2757 -4893 -9192 -10049 -4587 -1491 -1326 6409 12981 9713
5646I713j781M6j437m466l924r80N939M019K779n485j876J607N792m170j668L774
$$ 9713 7932 7978 6541 2075 -1849 -2829 3110 7129 9908 4423 2547 4154 9946 5776 4108 7882
5630G882k95k201M600J99o154J850r21l739Q45M026L944j658j2307j882k053j829
$$ 7882 7587 5386 9986 10185 4031 5881 4960 1221 2066 6092 10036 8378 -3929 -5811 -7864 -9693
5614i693l71l052K591l28L175l149K136K692k030J914m440M80M125k6l351n518
$$ -9693 -10064 -13116 -10525 -10853 -7678 -10827 -8691 -5999 -8029 -6115 -10555 -10075 -5950 -5976 -9327 -14845
5598a4845k636M404O405J190k911J118p40M54M642n682Q27J611L595J3626P823
$$ -14845 -17481 -13077 -6672 -5482 -8393 -7275 -8015 -7561 -2919 -8601 -7774 -6163 -2568 11058 18881
5583A8881O068j519k184j1598j2314k606O442O930j0812p479J0P431P576M49n20
$$ 18881 24949 23430 21246 9648 -2666 -5272 1170 8100 -2712 -10191 -10181 -2750 4826 5275 4755
5568D755k803j490j173o78L496j68M62q40L086j14q47k741J28K224N614m874k033
$$ 4755 1952 462 -711 -1389 2107 1939 2401 1561 4647 4533 3686 945 1073 3297 8911 4037 2004
5551B004j081k95J385k767O141n171K114P835p489q437k429M069R727o225L004
$$ 2004 923 628 2013 -754 5387 216 2330 10165 2676 -5761 -8190 -4121 5606 -619 2385
5536B385q06M108r200q431P95P375P410p633q39O063N010k795J793N506J611l321
$$ 2385 1579 5687 -3513 -11944 -11149 -3774 3636 -3997 -4836 1227 6237 3442 5235 10741 12352 9031
5520I031j40o78n875M198K334o375L97M580N591J092l892q081l145r732n96N133
$$ 9031 8891 8213 2338 6536 8870 2495 2892 7472 13063 14155 10263 2182 -963 -10695 -11291 -6158
5504f158P223P519m083J477K081M552M14n666p724J965L579R66j633j6045k753
$$ -6158 1065 8584 4501 5978 8059 12611 13025 7359 -365 1600 5179 6145 4512 -11533 -14286
5489a4286P371k275k181J779l9M714j132P203L422J012p132k724N976K231j990
$$ -14286 -6915 -9190 -11371 -9592 -9631 -4917 -6049 1154 4576 5588 -1544 -4268 1708 3939 1949
5474A949K001p10M146L752k09M348Q97p380p896P993l741q567L148M00N933k413
$$ 1949 3950 3240 7386 11138 10929 15277 16174 8794 898 8891 5150 -3417 -269 131 6064 3651
5458C651n694o48J191j663J997O078N22p334m341k689O384L515N9K318M012l069
$$ 3651 -2043 -2691 -1500 -3163 -1166 4912 5434 -1900 -6241 -8930 -2546 969 1028 3346 7358 4289
5442D289o628m402L235L196j742n66j210o487M642J3718L441j875k771K011k137
$$ 4289 -2339 -6741 -3506 -310 -2052 -2618 -3828 -10315 -5673 8045 11486 9611 6840 8851 6714
$$ [...]
##END NTUPLES=NMR SPECTRUM
##END=
