##TITLE=Analysis number 323007
Compound Code aw 00215
Project Code adrs
Chemist Name butt park
##JCAMPDX= 6.0         $$ Bruker NMR JCAMP-DX V2.0
##DATA TYPE= NMR SPECTRUM
##DATA CLASS= NTUPLES
##ORIGIN= Bruker BioSpin GmbH
##OWNER= nmr
$$ XWIN-NMR		Version 3.5
$$ Mon Oct 16 20:00:49 2006 GMT Daylight Time (UT+1h)  MAYBRIDGE\nmr@NMR_250MHZ
##.OBSERVE FREQUENCY= 250.131544655141
##.OBSERVE NUCLEUS= ^1H
##.ACQUISITION MODE= SIMULTANEOUS (DQD)
##.ACQUISITION SCHEME= undefined
##.AVERAGES= 16
##.DIGITISER RES= 18
##SPECTROMETER/DATA SYSTEM= dpx250
##.PULSE SEQUENCE= zg30
##.SOLVENT NAME= CDCl3
##.SHIFT REFERENCE= (INTERNAL, CDCl3, 0, 16.522)
##AUDIT TRAIL= $$ (NUMBER, WHEN, WHO, WHERE, WHAT)
$$ ##TITLE= Audit trail, XWIN-NMR		Version 3.5
$$ ##JCAMPDX= 5.01
$$ ##ORIGIN= Bruker BioSpin GmbH
$$ ##OWNER= nmr
$$ C:\u/data/dgb/nmr/ADRS/600/pdata/1/auditp.txt
$$ ##AUDIT TRAIL=  $$ (NUMBER, WHEN, WHO, WHERE, WHAT)
(   1,<2006-10-16 20:00:26.19 +100>,<MAYBRIDGE\nmr>,<NMR_250MHZ>,
      <created by zg, POWCHK disabled, PULCHK disabled
       configuration hash MD5:
       49 4B E0 1D 92 C2 6B 37 9F E6 65 BC 52 41 86 1D
       data hash MD5: 64K
       56 F4 EB F3 CA 6B 09 A2 40 21 D2 CC F5 9D 18 49>)
(   2,<2006-10-16 20:00:40.05 +100>,<MAYBRIDGE\nmr>,<NMR_250MHZ>,
      <Start of raw data processing
       ef LB = 0.3 FT_mod = 6 PKNL = 1 SI = 32K 
       data hash MD5: 32K
       AC 2B 28 B1 D6 A1 7C 51 8D F2 E4 A5 73 77 CD 36>)
(   3,<2006-10-16 20:00:41.61 +100>,<MAYBRIDGE\nmr>,<NMR_250MHZ>,
      <apk 
       data hash MD5: 32K
       61 4A DA 14 B0 EC 6E 79 1F 78 11 01 61 4E F1 AA>)
(   4,<2006-10-16 20:00:42.42 +100>,<MAYBRIDGE\nmr>,<NMR_250MHZ>,
      <abs ABSG = 5 
       data hash MD5: 32K
       A6 1D E0 F6 DE 9E 0D 19 A4 54 87 D2 3D F6 CC 1A>)
$$ ##END=
$$ 
$$ hash MD5
$$ AB E9 C4 56 A7 5C 6D 8D 7F A8 86 48 BD 2E 60 4E
##$RELAX= 
##$RELAX= 
##$RELAX= 
##$RELAX= 
##$RELAX= 
##$RELAX= 
##$RELAX= 
$$ Bruker specific parameters
$$ --------------------------
##$DU= <C:\u>
##$EXPNO= 600
##$NAME= <ADRS>
##$PROCNO= 1
##$TYPE= <nmr>
##$USER= <dgb>
##$AMP= (0..31)
100 100 100 100 100 100 100 100 100 100 100 100 100 100 100 100 100 100 
100 100 100 100 100 100 100 100 100 100 100 100 100 100 
##$AQSEQ= 0
##$AQ_mod= 3
##$AUNM= <au_zg>
##$AUTOPOS= <44 >
##$BF1= 250.13
##$BF2= 250.13
##$BF3= 250.13
##$BF4= 250.13
##$BF5= 500.13
##$BF6= 500.13
##$BF7= 500.13
##$BF8= 500.13
##$BYTORDA= 1
##$CFDGTYP= 0
##$CFRGTYP= 5
##$CHEMSTR= <none>
##$CNST= (0..31)
1 1 145 1 1 1 1 1 1 1 1 1 1 1 1 1 1 1 1 1 1 1 1 1 1 1 1 1 1 1 1 1 
##$CPDPRG= <>
##$CPDPRG1= <>
##$CPDPRG2= <>
##$CPDPRG3= <>
##$CPDPRG4= <mlev>
##$CPDPRG5= <mlev>
##$CPDPRG6= <mlev>
##$CPDPRG7= <mlev>
##$CPDPRG8= <mlev>
##$CPDPRGB= <>
##$CPDPRGT= <>
##$D= (0..31)
0 1 0 0 0 0 0 0 0 0.06 0 0 0 0 0 0 0.0002 0 0 0 0 0 0 0 0 0 0 0 0 0 0 
0 
##$DATE= 1161025225
##$DBL= (0..7)
120 120 120 120 120 120 120 120 
##$DBP= (0..7)
150 150 150 150 150 150 150 150 
##$DBP07= 0
##$DBPNAM0= <>
##$DBPNAM1= <>
##$DBPNAM2= <>
$$ [...]
##$SUBNAM7= <"">
##$SUBNAM8= <"">
##$SUBNAM9= <"">
##$SW= 20.6930455092707
##$SWIBOX= (0..15)
0 0 3 0 0 0 0 0 0 0 0 0 0 0 0 0 
##$SW_h= 5175.983436853
##$TD= 65536
##$TD0= 1
##$TE= 683.16
##$TE2= 300
##$TE3= 300
##$TEG= 300
##$TL= (0..7)
0 120 120 120 120 120 120 120 
##$TP= (0..7)
150 150 150 150 150 150 150 150 
##$TP07= 0
##$TPNAME0= <>
##$TPNAME1= <>
##$TPNAME2= <>
##$TPNAME3= <>
##$TPNAME4= <>
##$TPNAME5= <>
##$TPNAME6= <>
##$TPNAME7= <>
##$TPOAL= (0..7)
0.5 0.5 0.5 0.5 0.5 0.5 0.5 0.5 
##$TPOFFS= (0..7)
0 0 0 0 0 0 0 0 
##$TUNHIN= 0
##$TUNHOUT= 0
##$TUNXOUT= 0
##$USERA1= <user>
##$USERA2= <user>
##$USERA3= <user>
##$USERA4= <user>
##$USERA5= <user>
##$V9= 5
##$VALIST= <valist>
##$VCLIST= <CCCCCCCCCCCCCCC>
##$VD= 0
##$VDLIST= <DDDDDDDDDDDDDDD>
##$VPLIST= <PPPPPPPPPPPPPPP>
##$VTLIST= <TTTTTTTTTTTTTTT>
##$WBST= 1024
##$WBSW= 4
##$XGAIN= (0..3)
0 0 0 0 
##$XL= 0
##$YL= 0
##$YMAX_a= 452894
##$YMIN_a= -337214
##$ZGOPTNS= <>
##$ZL1= 120
##$ZL2= 120
##$ZL3= 120
##$ZL4= 120
##$ABSF1= 16.522
##$ABSF2= -4.171173
##$ABSG= 5
##$ABSL= 3
##$ALPHA= 0
##$AQORDER= 0
##$ASSFAC= 0
##$ASSFACI= 0
##$ASSFACX= 0
##$ASSWID= 0
##$AUNMP= <proc_1d>
##$AZFE= 0.1
##$AZFW= 0.1
##$BCFW= 0
##$BC_mod= 0
##$BYTORDP= 0
##$COROFFS= 0
##$CY= 12.5
##$DATMOD= 1
##$DC= 0
##$DFILT= <>
##$DTYPP= 0
##$F1P= 14.0000005364418
##$F2P= -0.99999901652339
##$FCOR= 0.5
##$FTSIZE= 32768
##$FT_mod= 6
##$GAMMA= 0
##$GB= 0
##$INTBC= 1
##$INTSCL= 1
##$ISEN= 128
##$LB= 0.3
##$LEV0= 0
##$LPBIN= 0
##$MAXI= 10000
##$MC2= 0
##$MEAN= 0
##$ME_mod= 0
##$MI= 0
##$NCOEF= 0
##$NC_proc= -4
##$NLEV= 6
##$NOISF1= 0
##$NOISF2= 0
##$NSP= 0
##$NTH_PI= 0
##$NZP= 0
##$OFFSET= 16.522
##$PC= 1
##$PHC0= -47.0569
##$PHC1= 10.78137
##$PH_mod= 1
##$PKNL= yes
##$PPARMOD= 0
##$PSCAL= 4
##$PSIGN= 0
##$REVERSE= no
##$SF= 250.13
##$SI= 32768
##$SIGF1= 0
##$SIGF2= 0
##$SINO= 400
##$SIOLD= 32768
##$SREGLST= <1H.CDCl3>
##$SSB= 0
##$STSI= 32768
##$STSR= 0
##$SW_p= 5175.98343685301
##$SYMM= 0
##$S_DEV= 0
##$TDeff= 65536
##$TDoff= 0
##$TI= <Analysis number 999999
Compound Code 99
Book Reference 9
Project Code 9>
##$TILT= no
##$TM1= 0
##$TM2= 0
##$TOPLEV= 0
##$USERP1= <user>
##$USERP2= <user>
##$USERP3= <user>
##$USERP4= <user>
##$USERP5= <user>
##$WDW= 1
##$XDIM= 32768
##$YMAX_p= 457481201
##$YMIN_p= -338601
$$ End of Bruker specific parameters
$$ ---------------------------------
##NTUPLES= NMR SPECTRUM
##VAR_NAME=  FREQUENCY,     SPECTRUM/REAL,   SPECTRUM/IMAG
##SYMBOL=    X,             R,               I
##VAR_TYPE=  INDEPENDENT,   DEPENDENT,       DEPENDENT
##VAR_FORM=  AFFN,          ASDF,            ASDF
##VAR_DIM=   32768,         32768,           32768
##UNITS=     HZ,            ARBITRARY UNITS, ARBITRARY UNITS
##FACTOR=    0.157963299565203, 1,           1
##FIRST=     4132.6476996994, 0,             0
##LAST=      -1043.33573715361, 0,           0
##MIN=       -1043.33573715361, -338601,     0
##MAX=       4132.6476996994, 457481201,     0
$$ Real data points
##PAGE= N=1
##DATA TABLE= (X++(R..R)), XYDATA
$$ [...]
13633a08716P9809L4617j300p2348o9601O1955O9991n9415K6515N4108L5328Q765
13621E9708j15783j3327J8348J30756L4202K978j20094p7348O3800K3879r752
13610b633n6354k8698O9323L2948J9262k969k4289l7617O571m583N8484K9716
13598E9161q90k110o6989P9228K1456j5368l4032j6696j10799m4487R2238Q0434
13586D1146j5030o1244N9287l4903J5364j4480j26085j4631M9602p9093o9935
13575b50002L113Q2859N5941m9332l0629L5651j5552J04730L5309p348j8163j3013
13563f6436J919L4180J01732L1735o5487l7008L3274M7171L353M6421N3044O9659
13551B53557j3372L085k4925l7387l1147n9721r3755q309q0992j6192N7426J225
$$ y = [-108716, -28907, 5710, 4410, -67938, -137539, -75584, -5593, -65008, -38493, 15615, 50943, 59708, -56075, -69402, -51054, 79702, 113904, 116882, -3212, -80560, -16760, 7119, -2633, -58987, -87685, -18362, 14586, 33848, 30879, 6590, -31027, -24456, -29039, 29445, 59161, 58271, 56161, -10828, 68400, 89856, 74488, 40456, 23760, -87039, -131526, -39288, 41146, 26116, -35128, 24159, -10744, 4620, -9860, -135945, -150576, -100974, -180067, -250002, -246889, -164030, -108089, -157421, -188050, -152399, -167951, -63221, -27912, -35260, -53423, -66436, -64517, -30337, 71395, 103130, 37643, 635, 33909, 81080, 84433, 130854, 183898, 253557, 240185, 243270, 218345, 180958, 149811, 90090, -3665, -11974, -92966, -109158, -51732, -50507]
13539e0507N2252J735k8679M6298m9931m525k3162J18013L8814l2100m0664O456
13527C4000J5214K7657q031n8952k7797M286n9748L0262J3800M3732K2926O171
13515D3520K8179l79L2529J2194J18592J54335J25758J55227K10052J92808q936
13504A063879k04281k75139j28585n1536r4218j08377q082m6442r5194j37949
13494h5924j5035n08J7002N7331J1802J2906n8867j7120M4576J7491l9941M5241
13482a1046M2001o2719N264k0808k9826Q2467J03595J21601l0716o0968r0171
13471D8674l7259J11070O6287K7141R7845P5883K86J18069J44547K50688J55844
13460A059075J55351n7240k63479l14231k03771j21453q0834m8506j3486J304
$$ y = [-50507, 1745, 3480, -25199, 21099, -28832, -33357, -56519, 61494, 100308, 68208, 27544, 34000, 49214, 76871, 68840, 9888, -17909, -13623, -73371, -43109, -29309, 14423, 37349, 43520, 71699, 71320, 103849, 116043, 234635, 388970, 514728, 669955, 880007, 1072815, 1063879, 859598, 584459, 455874, 404338, 310120, 201743, 193661, 147219, 52025, -85924, -100959, -101467, -84465, -27134, -15332, -2426, -61293, -78413, -33837, -16346, -56287, -11046, 30955, -31764, -26500, -47308, -77134, 5333, 108928, 230529, 199813, 138845, 48674, 11415, 122485, 188772, 215913, 313758, 389641, 389927, 507996, 652543, 903231, 1059075, 1214426, 1157186, 893707, 579476, 375705, 254252, 173418, 124912, 111426, 112730]
13450A12730l5043K7150K7563J01588N5467p5682q0978o5822n1756M6902R6348
13439A58467O305j58778p9968R3902P7812j2729j5010o6913K4391p6012j9078
13428f7611m776l6558K6073j085M6676K2936N6440M2953Q1817j4815r348L3364
13416A76066R6546J7563q771L9883n1418n7670q0652K778n06k1389K0543J9788
13404A52761k2796P0224K0061k1565K5532j18858n4109O7674n8190L4044j4169
13393H0609q5077r7841M477P3438j4177J7835j1734K8596Q5919k162l5399l0413
13381A4071K8849K371n2018p4399L5940L3058l2674N6456L4936n7405m3294l3857
13369h7966O2589L8946p4887k3957J877L0203k2298k2718L5022Q5238o2504j21679
$$ y = [112730, 77687, 104837, 132400, 233988, 289455, 213773, 132795, 66973, 15217, 62119, 158467, 164772, 5994, -73974, 19928, 97740, 85011, 70001, 3088, 27479, -48533, -67611, -72387, -108945, -82872, -83957, -37281, -14345, 42095, 85048, 166865, 152050, 142702, 176066, 272612, 290175, 281404, 321287, 269869, 212199, 131547, 134325, 133819, 112430, 132973, 152761, 129965, 200189, 220250, 198685, 224217, 105359, 51250, 118924, 60734, 94778, 80609, -4468, -102309, -97832, -24394, -38571, -20736, -32470, -3874, 82045, 79883, 44484, 14071, 42920, 45291, -6727, -81126, -45186, -12128, -44802, 11654, 46590, -10815, -54109, -87966, -25377, 13569, -61318, -85275, -83398, -53195, -75493, -98211, -63189, 22049, -40455, -162134]
13357a62134J8414P1158Q346O5952K7867j0934j00450k5585M1314N9460jM6897
13345D0304Q9169N1753j2683o4744l3100o914p3590j9810j0294j0883j7150n8442
13333a26384J3972k2538L181M5644M2437l0984M9838Q2641L0717M2531k1150j14953
13321e048N4606J173o092K0255J1531m7424l3856J2782p858p8307m6524K8348
13309i6414J7614j6061J1324M5950O6231K7959k3401L0440N2005j9367o3373N1990
13297H4897M4672K013J71m7535j9069l9530n4999o1803k1000j9385K8781q5217
13285a88004l0062M2505O8229L0885m463M773N8527L9880L9809N2146K7277j3885
13273A27617j11052m9046L4617J03538M549O524j2817j00909j0084O3096N0570
$$ y = [-162134, -143720, -72562, -64216, 1736, 29603, 18669, -81781, -107366, -66052, -6592, -6593, 40304, 129473, 181226, 168543, 103799, 70699, 63785, -9805, -29615, -39909, -50792, -67942, -126384, -112412, -134950, -131769, -86125, -43688, -74672, -24834, 57807, 88524, 131055, 109905, -5048, 49558, 50731, 44639, 64894, 76425, 29001, -4855, 7927, 69, -78238, -124762, -96414, -78800, -94861, -83537, -37587, 28644, 56603, 33202, 63642, 115647, 96280, 32907, 84897, 129569, 131582, 131753, 84218, 65149, 25619, -29380, -91183, -112183, -131568, -102787, -188004, -218066, -175561, -107332, -76447, -80910, -76137, -17610, 22270, 62079, 114225, 141502, 127617, 16565, -32481, 2136, 105674, 110223, 116747, 103930, 3021, -7063, 56033, 106603]
13262A06603j346n4751J1813R1023K192p6772R053N3715Q4168J4010N9896j8014
13250B81590m6936r2848q269n5676J9365l5571q812K907l853O6506o217m8093
13238F4093m2766r336r1741k3881O5378R9925M6165k175m8128r4401o1490k2290
13226a20647M130J32191M5120m3483j0200K3215K1083k1261m5192J1680J19046
13215A15682M3876l5621l5385K5811L2914k5184m0958L1542L8051M3534l2699
13204A61563n9340j7849j2431K5987L46O386L1989n1425o0170o18N4558L5568
13192A14564Q765J4718m1186k7615j34865j4359O6664K7059l7674O015K2672j4095
13180i337O4931p4149K9953J3421J6861J7611M899j0183K694J10331J12855r385
$$ y = [106603, 105257, 50506, 62319, 153342, 155534, 78762, 87815, 141530, 225698, 239708, 299604, 281590, 234654, 141806, 133537, 77861, 97226, 61655, 52843, 55750, 51897, 118403, 112186, 64093, 21327, 11991, -79750, -103631, -38253, 61672, 107837, 105662, 57534, -36867, -98357, -120647, -116517, 15674, 60794, 17311, 7111, 30326, 51409, 30148, -15044, -3364, 115682, 159558, 123937, 88552, 114363, 147277, 122093, 81135, 112677, 150728, 194262, 161563, 102223, 84374, 71943, 97930, 98276, 104662, 136651, 85226, 25056, 24438, 78996, 114564, 123329, 138047, 96861, 69246, -65619, -79978, -13314, 13745, -23929, -17914, 4758, -9337, 55594, -18555, 11398, 24819, 41680, 59291, 64190, 54007, 56701, 167032, 279887, 270502]
13168B70502j01773q222J6832K9783n4770o6887m4317R217J31264Q3665j8935
13157B46359n0914n06k0036l4870P5611L9346R100j9311o8686M0063L7983P5118
13145C29257k5821r0707k7248j1772o2318k4848n8638K6063Q4477L6157O8966
13134B43568M9264O2341N0742L0272M1478q801m8809J0354M1729J16305N1771
13123F40214q8472l2179M1609j2417J7794P4248l4167o727O7645O8838r706J63278
13111H89958K08534O4934k4364M1411J55384K48166K20451K89920K79255L58356
13101B732005N04150O31423P96375J069750J303248J795200K864585M422346P089325
13092B3208407J0825331J4012740J3133633O957063k857595j2737131j4623294
$$ y = [270502, 168729, 160507, 177339, 207122, 152352, 85465, 41148, 50365, 181629, 265294, 246359, 195445, 194939, 174903, 140033, 215644, 254990, 264090, 244779, 176093, 216156, 254139, 329257, 303436, 212729, 185481, 173709, 111391, 86543, 27905, 53968, 138445, 174602, 243568, 292832, 355173, 405915, 436187, 477665, 468864, 420055, 430409, 472138, 588443, 640214, 551742, 519563, 561172, 548755, 566549, 640797, 606630, 599903, 667548, 736386, 726680, 889958, 1098492, 1163426, 1139062, 1180473, 1335857, 1584023, 1804474, 2094394, 2373649, 2732005, 3236155, 3867578, 4663953, 5733703, 7036951, 8832151, 11696736, 16119082, 23208407, 34033738, 48046478, 61180111, 68137174, 65279579, 52542448, 37919154]
13085C7919154j0381701o602826m250845k862635k008459j469450j181300r80642
13077H181296q83698o47648m25152l43890j85976j03364j26422l7746K6621k5809
13067E428212o7217O4553m6367J5753K33677L44194L67329M30861O12302P57447
13057H140744R85652J263921J651358K283725K983794L808457N169193P494757
13049C3781601J1827864J9384943L0877964M3554609M6014991K8581151j393207
13042B12629916l8029518n2046907l6938755k2106724j3858824r267991o495465
13035C3885732m704063l646251l132221k800464k294633j577746j070827q08274
13027A3851253n73842k57222o6313k77087m74717n72751o98339n40713k91981
$$ y = [37919154, 27537453, 20934627, 16683782, 13821147, 11812688, 10343238, 9161938, 8181296, 7297598, 6649950, 6224798, 5880908, 5694932, 5591568, 5465146, 5427400, 5454021, 5428212, 5360995, 5425548, 5379181, 5394934, 5628611, 5972805, 6340134, 6770995, 7383297, 8140744, 9126396, 10390317, 12041675, 14325400, 17309194, 21117651, 26286844, 33781601, 45609465, 64994408, 95872372, 139426981, 185441972, 214023123, 212629916, 174600398, 122553491, 85614736, 63508012, 49649188, 40381197, 33885732, 29181669, 25535418, 22403197, 19602733, 17308100, 15730354, 14659527, 13851253, 13277411, 13020189, 12953876, 12676789, 12202072, 11629321, 10930982, 10390269, 10098288]
13018A0098288r2439K1024K02945L95206N12540O61288Q86394J161988J523020
13009A5370254K077887K723786L585079M824424P069011J1132617J8136785K9071655
13001I3991498M2087383M7511655L3007712M145903l2963998n3867795m1034700
12994I2877658k4673433j5231217j0174952p017418n013657l972719l345634k964767
12986B0483861k367556j850751j326524r94803o91501m79223k94510l52581n61274
12977A1565138q02767q59574o65062m18467k62730j84286j84589j7842k3029L2808
12967H179600Q5345J97512L46545N95812Q20202J088627J556242K244453L522497
12958A8636835N714578R130582J3078182J4800609J0970961K196396r126751j6052759
$$ y = [10098288, 10005849, 10026873, 10229818, 10625024, 11137564, 11798852, 12685246, 13847234, 15370254, 17448141, 20171927, 23757006, 28581430, 35650441, 46783058, 64919843, 93991498, 136078881, 183590536, 216598248, 220744151, 187780153, 133912358, 92877658, 68204225, 52973008, 42798056, 35780638, 30766981, 26794262, 23448628, 20483861, 18116305, 16265554, 14939030, 13944227, 13252726, 12773503, 12478993, 12126412, 11565138, 10762371, 9902797, 9237735, 8819268, 8556538, 8372252, 8187663, 8169821, 8146792, 8179600, 8264945, 8462457, 8809002, 9404814, 10225016, 11313643, 12869885, 15114338, 18636835, 24351413, 33481995, 46560177, 61360786, 72331747, 74528143, 65401392, 49348633]
12950D9348633j3739922r017787n712910l784195k636788j845255j520188j281641
12942I809947j081103q87810o52262m67631m44649l77943l00665j60784j72703
12933E264397k26223l28913l21113k36330k68251k22333j10280j3201j49005j69169
12923C219579j22479j70066j32877l7828j07511n0133l4591l7831r5350j10156
12913B320757r3091k4826J02548L6423r9334j02200N787q360N676J44270J54161
12902B441811O2334m4278j90247j16066j01194j15032r2100j08295r2972n1988
12892A591973K7025k1053k8507k8467K809j24813m6794N2512R0231M6679r207
12881A552388p5206o1607p0223m8348j90J9227L739k485k7530k7394l6021n8437
$$ y = [49348633, 35608711, 26590924, 20878014, 17093819, 14457031, 12611776, 11091588, 9809947, 8728844, 7841034, 7188772, 6721141, 6276492, 5898549, 5597884, 5437100, 5264397, 5038174, 4709261, 4388148, 4151818, 3883567, 3661234, 3550954, 3537753, 3388748, 3219579, 3097100, 2927034, 2794157, 2756329, 2648818, 2598685, 2564094, 2526263, 2430913, 2320757, 2227666, 2202840, 2305388, 2341811, 2242477, 2140277, 2146064, 2137704, 2143380, 2287650, 2441811, 2504145, 2459867, 2269620, 2153554, 2052360, 1937328, 1845228, 1736933, 1643961, 1591973, 1618998, 1597945, 1569438, 1540971, 1543780, 1418967, 1372173, 1424685, 1514916, 1561595, 1552388, 1477182, 1415575, 1345352, 1297004, 1296814, 1316041, 1319780, 1317295, 1289765, 1262371, 1226350, 1167913]
12869A167913Q453r4645o6541O5468O2054o0518p5146K9541Q2026J45789J53620
12858A418014J12684L9285j6336r7911j19401k11631j35725j37723R566N5940
12848I16762j8212K06k6456O1725J2907n4668J6662k7583K7747L5151l5825m2476
12836H65940o3812l6455n2777R8362j1140p3400o3104q3672j2619m9313m453J4082
12824E27639j1877m7394K3374J27224K500q5286o0001n7124R21P4895o4591O4172
12812D94452J90303M6978n841k0057j43664m9330k935j0195k3021m1549L1186
12801D66327N9655P9947O7896N1421n6235p0008p4660q5815M9822L6078j5916
12790E08512L0896r9157q3157K2372L3768P7071o067l1107m5741n8815q4317N6410
$$ y = [1167913, 1176366, 1081721, 1015180, 1080648, 1142702, 1082184, 1007038, 1036579, 1118605, 1264394, 1418014, 1530698, 1569983, 1553647, 1455736, 1336335, 1124704, 988979, 851256, 860822, 916762, 898550, 898756, 872300, 934025, 946932, 892264, 908926, 881343, 909090, 944241, 908416, 865940, 802128, 765673, 712896, 811258, 800118, 726718, 663614, 579942, 567323, 518010, 513557, 527639, 515762, 468368, 491742, 618966, 621466, 536180, 476179, 419055, 419976, 494871, 430280, 494452, 684755, 731733, 725892, 705835, 562171, 512841, 509906, 499711, 476690, 435141, 466327, 525982, 605929, 673825, 725246, 669011, 599003, 524343, 438528, 488350, 524428, 508512, 539408, 440251, 357094, 379466, 413234, 490305, 484238, 453131, 407390, 348575, 264258, 320668]
12778C20668J2329M8698o7208q3851o1702m2809j7686p7386O0965Q7773o5384
12767A14407l0394Q5793M8016k5358L5636K7409Q730J3477n851l8300n3740R8910
12755B78735M3568p1352J8451q5920k8633L1666K3572L8616q6842P743P097k2875
12743A53826m665N650o3285k1808l5720R5171P4096O7024p2852n6545m200O8423
12731B05115q7256n4288m4212M5594L9834N2144J0719j01452j5920l619k8533
12720A8126O3180N9321j4859q0010p7103N0460M8480L9580R461K5105n8957j461
12708H1323R4241j7709o426q7882m3627J4846l5560K4335k8350P8057J3233k8808
12696E7673l6169k5999K4169N6427M3567k0686N1828N2695k8206o3807l2476N6638
$$ y = [320668, 332997, 381695, 314487, 230636, 168934, 126125, 108439, 31053, 92018, 179791, 114407, 84013, 169806, 217822, 192464, 228100, 255509, 264239, 277716, 271865, 233565, 179825, 278735, 322303, 250951, 269402, 183482, 154849, 186515, 210087, 248703, 161861, 169604, 176701, 153826, 149161, 154811, 91526, 69718, 33998, 129169, 203265, 270289, 197437, 140892, 136692, 205115, 117859, 63571, 19359, 64953, 104787, 156931, 167650, 66198, 50278, 46659, 18126, 81306, 140627, 125768, 45758, -31345, 19115, 67595, 107175, 116636, 141741, 82784, 81323, 175564, 157855, 151429, 63547, 19920, 34766, -794, 23541, -4809, 73248, 86481, 57673, 21504, -4495, 19674, 76101, 119668, 98982, 150810, 203505, 175299, 111492, 79016, 135654]
12684A35654K5276l2293q4416p3340p6855j0941J31427L596o3403K4331P2024
12673E1060m003O627m1626N7242J7360Q8676p143j18304L4501q3856J4400K7056
12661D1990J3506O0933o2601M5583N5399n9390o3864N9273P3421J0926k52M3664
12649B18588m6736m5671p3679p0606N7310M513j6039J08523j3294o7439l209L4697
12637H6958N318k5441o1283m0925k9495P3264o2050R6512P6730j2544N2966p0047
12625H9963j01461N7705M5534R9618L0636O9326Q1960n7982o5408j43986j2700
12614I3205N9351m824n884q784n1255n752o7555M2P4215N916K5234K3674l3136
12601A04447k1503K5556J3619L2993l3047j22729J7391Q0080l7775K8276O296
$$ y = [135654, 160930, 128637, 44221, -29119, -105974, -116915, 14512, 18108, -45295, -20964, 51060, 47057, 53684, 12058, 69300, 86660, 175336, 168193, 49889, 84390, 534, 14934, 41990, 55496, 116429, 53828, 99411, 154810, 95420, 31556, 90829, 164250, 175176, 174924, 218588, 171852, 126181, 52502, -18104, 39206, 43719, 27680, 136203, 122909, 55470, 52261, 86958, 92276, 66835, 5552, -35373, -64868, 8396, -53654, 42858, 119588, 107044, 160010, 89963, -11498, 46207, 91741, 191359, 221995, 291321, 373281, 315299, 249891, 105905, 93205, 152556, 147732, 141848, 133064, 81809, 76057, 8502, 8544, 82759, 88675, 113909, 137583, 104447, 82944, 108500, 122119, 155112, 122065, -664, 16727, 96807, 59032, 87308, 93604]
12590I3604P6865M6804K4043k0420o3254J5735J07675j857J8548J32549J51198
12579E81490J02519J45702K30031K45584K31921N5621p0169j15104k38821k95271
12569H73503j95163q1832j31375q5117j1038j8662j26614j6870J3039Q3957n8507
12558B45321m8384l6671L86L1078j229k0122j24471k9626j3040J20709P8360Q716
12546B11027M5394N0452N0655K7918j1850N4017J2462K9541K31881L09940K10365
12535A221802J52888K51071K52508J77001K13153R1168k9946j27199l20950l81828
12525A499668l38430k26979j67598j48969j16426M1213K7049m1331o1094r8282
12515C68821k1552L3391o9340o3692q4544O2495l214p7132j2815j3021R278K068
$$ y = [93604, 170469, 217273, 241316, 220896, 157642, 173377, 281052, 279195, 297743, 430292, 581490, 684009, 829711, 1059742, 1305326, 1537247, 1592868, 1522699, 1407595, 1168774, 873503, 678340, 596508, 465133, 380016, 368978, 350316, 223702, 206832, 219871, 303828, 245321, 196937, 160266, 160652, 191730, 190501, 170379, 45908, 16282, 3242, 123951, 202311, 211027, 256421, 306873, 357528, 385446, 373596, 427613, 440075, 469616, 701497, 1011437, 1221802, 1374690, 1625761, 1878269, 2055270, 2268423, 2359591, 2329645, 2202446, 1881496, 1499668, 1161238, 934259, 766661, 617692, 501266, 542479, 569528, 528197, 467103, 368821, 347269, 380660, 311320, 247628, 163084, 225579, 222365, 145233, 132418, 119397, 128675, 130743]
12503A30743J4157P3953R0631P2543N738r338L760n653L6170P3300J10870J90325
12491G87199K40791K72546L42843K16420J63771k4575r6201q8378k25789k87011
12481A301616k44990j96736j58604q4887m8161n4562j33909l8260O8864J6796
12471D27167r660J1897j2775l7181L2577q9552o4140J1032J353K4729m9832o6473
12459A79142k4246m8030j1283m6792L1774K6235Q5882J3709k3279l4416J1573
12448A60269J43800J07652N3594L7322J02716R0235k6955j1178j17652j23281
12438D16522j33076j99250n6506Q2238l9931j880L8983L5120N9486o189p8154
12427A17363J4423N073l3230l9317j5820J5625j371o881J9172M3154m8369j46195
$$ y = [130743, 144900, 218853, 309484, 382027, 387765, 378427, 382187, 376534, 412704, 486004, 596874, 787199, 1027990, 1300536, 1643379, 1859799, 2023570, 1998995, 1902794, 1814416, 1588627, 1301616, 1056626, 859890, 701286, 616399, 568238, 513676, 379767, 341507, 410371, 427167, 417507, 429404, 416629, 379448, 412025, 322473, 258333, 269365, 270718, 295447, 245615, 179142, 154896, 106866, 95583, 48791, 80565, 106800, 192682, 206391, 183112, 148696, 160269, 304069, 411721, 465315, 502637, 605353, 695588, 668633, 657455, 539803, 416522, 283446, 84196, 27690, 109928, 69997, 68117, 107100, 142220, 201706, 195517, 117363, 131786, 136859, 103629, 64312, 48492, 64117, 62746, 55865, 75037, 118191, 69822, -76373]
12415g6373N5622K5896k1409l968o109k4823N0228J535L77P877k0424J12428M3803
12402A44660o7284l3860l7941l4478N950j342M1983k6153K2707j0006M5719J04527
12390A54482o6050r0778J3485P4748K8696j2143M2231L509m8386l650Q4132K774
12378A83050j6310l4291K5168q9104J805J9059j8350k5535P804N1057o07l2898
12366G0848J1409K2555K7744O232l8092j04463m2489l2169L7396L8614Q297k5085
12354a9203o8467k8102O2380J21888k5520K667K0946J2049K166P970n2101k211
12342C4462L9816L4412L5244q2524k0620Q234j4242q2641Q8756J0543l4090n0958
12330c3608J4550P6850l9167k6517K1756Q1302N8316j18r7078k3299K0016j6824
$$ y = [-76373, -20751, 5145, -16264, -20232, -26341, -51164, -936, 599, 976, 8853, -11571, 100857, 144660, 77376, 43516, 5575, -28903, -22953, -24295, 17688, -8465, 14242, 4236, 49955, 154482, 88432, -2346, 11139, 85887, 114583, 102440, 144671, 148180, 99794, 96144, 180276, 183050, 166740, 132449, 157617, 68513, 70318, 89377, 71027, 45492, 53296, 104353, 103746, 70848, 82257, 104812, 132556, 138788, 100696, -3767, -46256, -78425, -41029, -2415, 5882, -19203, -87670, -115772, -53392, 68496, 42976, 45643, 66589, 78638, 80804, 88774, 36673, 34462, 74278, 108690, 143934, 61410, 40790, 49024, 34782, -47859, 40897, 51440, 17350, -33608, -19058, 57792, 18625, -7892, 13864, 95166, 153482, 153364, 56286, 32987, 53003, 36179]
12318C6179j2635R92J7657j07876j0624Q2674k9338L1059k6729R3955P3169o0685
12306H7798r0468L7904j3639j27022m4972J3501J01119R4688P451K2760p9110
12295A0010m5705L8648L7184O3209k128n7440j8495m7689j40771J07791J35234
12284G9848J50602j0808n4316K565n7702m5142J16740J73157L4087o6543J24234
12273D46722L09092M33849O84326O44074L15475j42073o94004p24764m35215j25839
12263G11643j27749o4877r4853o3202j67895o0713J03822k7048J2652m8667j9246
12252A53867P4721J5186j11631p5951m9335m1851l3168K4174P126J32891M2689
12241A38718o1220o5894k9267j7660q7214o3441M9305J32340J697R9377L080m2898
$$ y = [36179, 23544, 24536, 42193, -65683, -76307, 6367, -22971, 8088, -18641, 75314, 148483, 87798, -2670, 35234, 21595, -105427, -150399, -136898, -35779, 58909, 66360, 89120, 10010, -35695, 2953, 40137, 103346, 101218, 43778, 25283, -22406, -163177, -55386, 79848, 230450, 219642, 165326, 167891, 110189, 65047, 181787, 354944, 389031, 322488, 446722, 755814, 1189663, 1873989, 2518063, 2833538, 2691465, 1997461, 1272697, 837482, 711643, 583894, 519017, 424164, 360962, 193067, 132354, 236176, 209128, 221780, 173113, 153867, 228588, 243774, 132143, 56192, 6857, -34994, -68162, -43988, -36862, 96029, 138718, 77498, 11604, -17663, -35323, -122537, -185978, -136673, -4333, -2636, 96741, 99821, 56923]
12229E6923K1472j8569p8243M5695M946m8023O974N1031K9138k5987O1385l6019
12217G0723p0466J5532L4405k8915L9097n3374M7562N1364M6186p8520q8979q0420
12205i5805j0403K3737J08763J2545m7873l3521l0784L8317J7673L7032Q296l1485
12193c508P0256n30J1360K0551K8305k3401r112l2106N0143l8602m4093k0609
12181H654p472K0633n6403l9813O5184M7234L6938o1039k2859P1610l2529m0859
12169a0721o623n2107J57777J24611n7898q2788o1520l9191k5538Q1845K2548
12158E0395J9039l1066j1429R401K0179M693k6121O9214j756m744L4187K4144
12146A56136K9927L7930K7415N2415Q644P2681K4468m1013r7809p8324Q205m904
$$ y = [56923, 78395, 59826, -18417, 27278, 32224, -15799, -8825, 42206, 71344, 45357, 106742, 70723, 257, 15789, 50194, 21279, 60376, 7002, 54564, 105928, 152114, 73594, -15385, -95805, -106208, -82471, 26292, 38837, -9036, -42557, -73341, -35024, -17351, 19681, 27977, -3508, 66748, 66218, 77578, 98129, 126434, 103033, 93921, 61815, 111958, 73356, 29263, 8654, 1182, 21815, -34588, -74401, -9217, 38017, 74955, 13916, -8943, 62667, 30138, -10721, -17344, -69451, 88326, 212937, 155039, 72251, 10731, -28460, -53998, 27847, 50395, 69434, 38368, 26939, 36340, 56519, 61212, 35091, 104305, 102549, 97805, 131992, 156136, 186063, 223993, 251408, 303823, 312467, 385148, 409616, 368603, 270794, 192470, 200675, 195771]
12134A95771j7992m8481K6006l7659l0245n1554l6091K6285M7020o7906j0569
12123e415J4414J6126k6046P5875K1998j27043M565Q4052J9955J3825q519l5704
12111D8083m2678O2472k653n826J7896j5805k0967k9907J8683n348N581l4874
12099e343p472l6757n4358j1432N7697j8044l7327l9771K1577M2044m5478R9119
12087c5545J18828r995k4761J8440m4181J2908N2789o710o8944K5177l4434L1912
12075C5484k3071N1090J9279q8953j0016L5877q597o3997o1384J5939l0207J2853
12063a15703k3187N8670J22485Q925l3934o3075m964l3070K4800R1656P1965k100
12051A02468m3511j00838l3634K5712M1892L8169K1756K6544N412m573p6449r240
$$ y = [195771, 177779, 129298, 155304, 117645, 87400, 35846, -245, 26040, 73060, 5154, -5415, 8999, 25125, -921, 74954, 96952, -30091, -25526, 58526, 78481, 92306, 83787, 48083, 5405, 67877, 65224, 59398, 77294, 61489, 40522, 10615, 29298, 23950, 29531, -5343, -12815, -49572, -103930, -115362, -57665, -75709, -113036, -152807, -131230, -89186, -134664, -35545, 83283, 73288, 48527, 66967, 22786, 35694, 88483, 81773, 12829, 38006, 3572, 35484, 12413, 63503, 82782, -6171, -16187, 19690, 11093, -52904, -114288, -98349, -128556, -115703, -138890, -80220, 42265, 51190, 17256, -45819, -50783, -83853, -59053, 32603, 104568, 102468, 58957, -41881, -75515, -49803, -7911, 30258, 52014, 78558, 83970, 79397, 2948, -6292]
12039f292J3481m4658J0654l354L771L1536J514P4879R3997n5374r3381l1008
12027d235K4881m1387J4749L719J1144K7181q2041j4921k2327L2141Q1451n955
12015B4400l5162l724J04094L7656p1353k6041K4031j2986r290J3617j23524O4783
12003a3499M2376j01039J127M1408k886m8496m185P2092Q689j630q039m8504J7192
11990d5394Q3248Q482j7612m2605m7739l7972J6459K9334P74P3996O9881l485
11978H7367K7172J894o7065L641j385K324r1396n1792N0735P0009l4454n3598
11966e6548j0649n4097K1251l2073L7797J3302n076j3118J7880Q7650L3507n8269
11954a8443N2177k0308j4237P6777n6750l1133m1225j8004K1134M2906k3097p9421
$$ y = [-6292, 7189, -37469, -26815, -30169, -26398, 5138, 6652, 81531, 175528, 120154, 26773, -4235, 20646, -20741, -5992, -2273, 8871, 36052, -45989, -60910, -83237, -51096, 30355, 24400, -10762, -14486, 89608, 127264, 55911, 29870, 53901, 40915, 31625, 45242, -78282, -13499, 28877, -72162, -71035, -29627, -32513, -81009, -85194, -13102, -4413, -6043, -14082, -62586, -45394, 37854, 46336, 28724, -13881, -61620, -99592, -83133, -53799, -53025, 20971, 90852, 87367, 114539, 116433, 49368, 53009, 51624, 53948, -37448, -89240, -38505, 31504, -2950, -56548, -67197, -121294, -100043, -132116, -94319, -81017, -86093, -99211, -81331, 6319, 39826, -18443, 33734, 13426, -811, 75966, 19216, -11917, -53142, -71146, -50012, -7106, -30203, -109624]
11942a09624N0679M1058K6914K0103k8584P2458M872l6811k3098P0517P5072J7203
11930A80759o4502j7260q476k884m8665M423l415j0933K0176J8519p903k7337
11918C2502k8782l1782L556J3618L958L5769o6355J2017k52J3108J5624K8186
11906C1167O1357M8099k8214m9300k7956L4757l5244j0564m3896p962J42l5043
11894f2657m1894J071P3389O2154n974K8124n706k5288j3631r303o5349q261N2381
11881b0944M7962K2141l8265m4846p981Q3387R607j4697R1145N4174j04319k9874
11869D7490p577m3981M0974K1908n9617J92M9029l4992J3782M5629l0549K7057
11857F9345J8620p384m5247n0170l1468P807l8471J6189l5021M8886K0344L249
$$ y = [-109624, -58945, -17887, 9027, 29130, 546, 73004, 77876, 41065, 17967, 88484, 163556, 180759, 116257, 98997, 90521, 87637, 38972, 43395, 39980, 29047, 49223, 67742, 59839, 32502, 3720, -28062, -24506, -10888, -6930, 28839, -37516, -25499, -25751, -12643, 2981, 31167, 92524, 140623, 112409, 63109, 35153, 69910, 34666, 24102, -19794, -27756, -27614, -62657, -104551, -103480, -30091, 32063, 26089, 54213, 48507, 23219, 9588, 285, -65064, -73325, -20944, 27018, 49159, 10894, -33952, -41933, 41454, 51061, 36364, 127509, 181683, 77364, 47490, 39913, -4068, 36906, 58814, -803, -611, 48418, 13426, 27208, 72837, 42288, 69345, 87965, 80581, 35334, -14836, -46304, -38497, -76968, -60779, -95800, -46914, -26570, -23321]
11845b3321Q165P5718Q6983o3594k4727o1872L1599J759m5913N071M4007K4230
11833E8105J2573n2455l468m9215j24427K6193R7390R059r330r561m2774m110
11821i2020J1669J7761L2395L6672J03784P7678m0552j570J6212o4154j00877
11810c002o7737M2488L9909L64J0803J8820J99q8668p0648l3829K3440K467P182
11797a18212Q2471j7221O2875J4864j01206k3733p733l5775R6314J06985o0769
11786a140o2281m3675l4305m8252N1574M3997N7280L8972M2129R78l798m6597
11774e118p0165m3457N1830O8518j9592j8589j0383M0632Q1182l749j31748L1836
11762b8803m564l3211J6338M1567n0292m739q053J52P0831N8299K439k1855p805
$$ y = [-23321, -15156, 60562, 147545, 83951, 59224, -2648, 28951, 30710, -15203, -10132, 33875, 58105, 70678, 18223, 14755, -34460, -158887, -132694, -35304, -26245, -35575, -45136, -87910, -92020, -80351, -62590, -30195, 6477, 110261, 187939, 147387, 145817, 162029, 97875, -3002, -70739, -28251, 11658, 12022, 22825, 41645, 41844, -46824, -117472, -151301, -127861, -125394, -118212, -35741, -52962, 9913, 24777, -76429, -100162, -107895, -143670, -47356, 59629, -1140, -63421, -107096, -141401, -189653, -138079, -94082, -36802, 2170, 44299, 45277, 41479, -5118, -75283, -118740, -66910, 1608, -17984, -36573, -46956, -6324, 74858, 71109, -60639, -28803, -33367, -66578, -50240, -8673, -58965, -63704, -71757, -71605, -774, 57525, 59964, 38109, 30304]
11749C0304m2281o3091n5775k3810k851L8154p9608P6748L3757j6277M1493N8730
11737d507J8069p6705r3410J5429O4948M7957L398K0068J8837j347Q6610o4076
11725C5271l857L1712J3134o3939o3732N9586R2614k7088j6295K2768M9046L983
11713A33203k6768j32589k6782Q4701p685p1716o6553M3102O5673J7717j05578
11702i3275q0439O8956P9508n9506L1612O1755k5419l8115O0745M1748L2463L912
11690H3945o6883m1708j4969J5219K495m5894j03289j1332J00618J0431q6539
11679a57906M9896N5536J49282o329k4050N0051J1054r424p0833j3495O0368r57
11667I3193p8584r236m5252j4708J2570l3519R082O4442j9956p2026p0043K1441
$$ y = [30304, -11977, -75068, -130843, -154653, -157504, -119350, -198958, -122210, -88453, -104730, -63237, -4507, 13562, -63143, -156553, -141124, -76176, -28219, -24821, -4753, 14084, 12737, 99347, 35271, 31414, 63126, 76260, 12321, -51411, 8175, 100789, 73701, 57406, 80174, 129220, 133203, 106435, -26154, -52936, 31765, 24080, -47636, -114189, -71087, -5414, 12303, -93275, -173714, -104758, -25250, -84756, -53144, 8611, -16808, -54923, 5822, 47570, 80033, 83945, 17062, -24646, -39615, -24396, -21901, -67795, -171084, -182416, -81798, -71367, -157906, -108010, -52474, 96808, 90479, 66429, 116480, 127534, 118110, 47277, 33782, 94150, 93193, 14609, 5373, -39879, -54587, -42017, -75536, -66454, -2012, -21968, -93994, -164037, -142596]
11655a42596Q949k4849R4024M5332l949J8193M4351k337N3258R5760m5913k4342
11643A15881o1680k0625K0467M2690n8649o1758J7844r642p2799l4815R947P8195
11631c4944p084j39982j4968k229k686N4671N7021L8516m1479j4859N6046J1737
11619d0240r5212l9149K7185Q947N1020J08908Q6477q6339j14057r3991Q9021
11608i7430N1724K9124P564o6461k1693m4795k2034M0304Q3356Q6733n8764l7260
11596d9632P8166M1981l6037k4533p9360O5431O4388J4321j13830M1475N7837
11585F0207J7872m3364r5835l552j4647m0718L1783Q897J1215m6745l8292L1778
11573a21401R5813N8324J0575j37762l2765M2862J0317R025m0645P6945q997K9710
$$ y = [-142596, -133647, -158496, -64472, -19140, -23089, -4896, 39455, 37118, 90376, 186136, 140223, 115881, 54201, 33576, 54043, 96733, 38084, -23674, -5830, -15472, -88271, -123086, -113139, -34944, -42028, -182010, -196978, -199207, -201893, -147222, -90201, -51685, -93164, -108023, -51977, -40240, -135452, -174601, -147416, -138469, -87449, 21459, 107936, 21597, -92460, -186451, -97430, -45706, -16582, -9018, -75479, -97172, -141967, -164001, -123697, -40341, 46392, -12372, -49632, 28534, 70515, 34478, 9945, -69415, -3984, 60404, 74725, -39105, 2370, 60207, 78079, 34715, -61120, -64672, -79319, -120037, -88254, -79357, -68142, -114887, -153179, -121401, -25588, 32736, 43311, -94451, -127216, -84354, -74037, -65012, -105657, -28712, -37709, -7999]
11561g999j5393m4403k877L3914O9812n911r109N736k7685K1211o033k8823o7323
11548h4883j9851N4352o1914k2532R6744Q649m9289l4668k167M3493J9552m9143
11536a01657J7326n445N7173J9587l6042l0589R546k864P7726j2570n3321O5648
11524D518j4870M5517p390j8180j2373K7010M9857Q153o7128n6929k4066k316
11512f8197m9869j9800q6588m4211J42957P7092P1649k4344q4330M6711j641k1962
11500f2533k9057M1869J07544J9479r6917J6409K4940J0987j3452j31k9146m9995
11488f0003j4258p2593l6298l8666L9078O2248Q7146L4022K2431L4771r9650m2501
11476h4273O2039L3594n9778j21358n8873R8183L0612k8558l859L2836O2660K0806
$$ y = [-7999, -23392, -67795, -70672, -36758, 33054, 27143, 18034, 23770, -3915, 17296, 11263, -17560, -84883, -104734, -50382, -112296, -134828, -38084, -29435, -78724, -113392, -115559, -72066, -52514, -101657, -84331, -89776, -32603, -13016, -49058, -79647, -70101, -72965, 4761, -7809, -61130, 4518, -10352, 35165, 27775, 9595, -2778, 24232, 74089, 82242, 15114, -41815, -65881, -68197, -118066, -137866, -224454, -268665, -125708, -48616, 23033, -1311, -85641, -38930, -40571, -62533, -91590, -49721, 57823, 77302, -19615, -3206, 21734, 32721, 19269, 19138, -10008, -60003, -74261, -146854, -183152, -221818, -182740, -120492, -33346, 676, 23107, 57878, -41772, -84273, -22234, 11360, -48418, -169776, -228649, -130466, -99854, -128412, -132271, -99435, -36775, -15969]
11464a5969J0681M6589L9029R1638M2726p1777r0630q0662l0320l4893N4909K8820
11452i859j1050l2181P1506n6452j5069N0923M5267L576K0277m5523m7067o5267
11440i0919l0655K2103J06934L736l7136K0759r7029l5882J2308L2941M6224p5122
11428a21738N3633m7143J7847J07407J1975K8914j1704l0184j3481l2616P501
11417b9589L7927J9497m9472m6241P1177k7610o393o8042k5054J7703M1500J7590
11405d7007p5754n7592R8746n17r4107M8252J09387P8516K5798N516R325k4069
11393G6494o2408j5895j8813j29928p5224J00484R7405N0231k6924j12169j23520
11382b40267M9876P8617M8814K7164k7042K7285K4253J3633q8526j9083M7514
$$ y = [-15969, -5288, 41301, 80330, 171968, 214694, 142917, 52287, -28375, -58695, -93588, -38679, -9859, -20909, -53090, 18416, -38036, -53105, -2182, 43085, 46661, 66938, 21415, -25652, -90919, -121574, -99471, 7463, 11199, -25937, -5178, -102207, -138089, -125781, -92840, -46616, -121738, -68105, -115248, -97401, 10006, 21981, 50895, 39191, 9007, -4474, -37090, -29589, 8338, 27835, -21637, -67878, 3299, -24311, -30704, -98746, -123800, -106097, -64597, -47007, -122761, -180353, -81607, -82124, -176231, -127979, -18592, 59924, 85722, 91238, 100563, 76494, 14086, -1809, -20622, -150550, -225774, -125290, -27885, 22346, -4578, -116747, -240267, -190391, -111774, -62960, -35796, -62838, -35553, -11300, 2333, -86193, -105276, -57762]
11371e7762L1810Q037P536j0410m0446L1556J7744k8613N7408j0030k8591j0910
11359c2671P4199J3902j07045K2491N0481q0185P4818L2909q8911k3963K7333
11348c6642k8995l6137n3794J355O8971O5580o7828j31999l7049l1816K3959R0795
11336a73600O7838R9598R6010l3270m4201o8303k8199k0974J8085j7126l5804
11325a39946J6341K6261J2816j4361q672J7277j07527O5810P0638L0218k994L1638
11313b501m6151l6065P2985J5996O6326K3157M394N5153l2757l5209m1152n3371
11301i195p9990K0721J14530k4452j35046l8224J12180K4156J3614j7179j1902
11290c0787p2763k1677R0155R8813R528P1378p6334k9523o1751n6302M5834k4203
$$ y = [-57762, -25952, -17915, -10379, -20789, -61235, -29679, -11935, -40548, 16860, 6830, -21761, -32671, 41528, 55430, -51615, -29124, 21357, -58828, 15990, 48899, -40012, -63975, -36642, -65637, -101774, -155568, -154213, -85242, -19662, -87490, -219489, -256538, -288354, -264395, -173600, -105762, -6164, 89846, 56576, 12375, -55928, -84127, -105101, -87016, -104142, -139946, -123605, -97344, -84528, -98889, -107561, -90284, -197811, -132001, -61363, -31145, -34139, -2501, -48652, -84717, -11732, 4264, 70590, 93747, 98141, 153294, 120537, 85328, 44176, -9195, -89185, -68464, 46066, 21614, -113432, -151656, -39476, -15320, -1706, -18885, -30787, -103550, -125227, -35072, 63741, 73269, 144647, 68313, 38790, -22961, -79263, -33429, -57632]
11278e7632N5036M5677N9967J482K8506k0147J0137r1508L716M8969P3080o6503
11266I0780L564P1185j39026o0819K9081N1880J06481l496r2558p5399L4286J04998
11254A20957Q6882O2854k1884k594q8878Q835Q7712l1782o3755J1973j684p3300
11242I5336P5350Q0712n2007q0941p0773j2230P3186J6477j4521l8701l2061q911
11230C0916O570J4176R560N357O7036n2845J3242L0367K400M9944p1176N575R8703
11217B09825J34216N4826m6773N0959Q2756N3415M3989L8780L8595O6934J01727
11206H29249Q6110M5599j8537k6245q6477j24931r3183n2926K9569K336M1543
11195F32107j30879r1632k2694n8806j1330n2190k6089M78l1502M5343N5778O5998
$$ y = [-57632, -2596, 43081, 103048, 104530, 133036, 112889, 123026, 31518, 35234, 84203, 157283, 90780, 94344, 165529, 26503, -34316, -5235, 46645, 153126, 149630, 57072, -18327, 15959, 120957, 207839, 270693, 248809, 246215, 157337, 166172, 253884, 222102, 158347, 170320, 168636, 95336, 170686, 251398, 199391, 118450, 47677, 35447, 108633, 125110, 110589, 71888, 39827, 30916, 37486, 51662, 61222, 66579, 133615, 80770, 94012, 124379, 126779, 176723, 105547, 111122, 209825, 344041, 398867, 352094, 403053, 485809, 539224, 583213, 621993, 660588, 727522, 829249, 915359, 960958, 942421, 916176, 829699, 704768, 611585, 558659, 588228, 590564, 632107, 501228, 409596, 386902, 328096, 316766, 264576, 238487, 238965, 207463, 252806, 308584, 374582]
11183C74582J013n0414n9048m1975j5770M7997L2732Q0662J3445k8828r1461k6799
11171B36136R9332J04528j6826n5295Q4336M5226K5812J25769J06630P5371L9528
11160H70547l5170O0146O0808J5174r3923j01286q9762j05318j32042n2326j4697
11149C82151k5187j04927j8909N1489l8800j1602N0167q82r1944p1304K7585K032
11137A49869N936N2911K7853o2227p1668j6119M5780M7722N6495M0905j01584
11126A75873j8429q8338m280J00599N8796L8974j25063q0865L3478J53109J63159
11115D07013j674Q473k1484k0604j3933m7893k8779L736q1922K1766j5130l9945
11103A69624N0410l4847k3611o4972l4147K3943J3036J2442K384k888O4430L0284
$$ y = [374582, 375595, 325181, 266133, 224158, 208388, 256385, 289117, 369779, 383224, 354396, 262935, 236136, 335468, 439996, 423170, 367875, 452211, 497437, 523249, 649018, 755648, 831019, 870547, 835377, 895523, 956331, 971505, 877582, 776296, 686534, 581216, 449174, 396848, 382151, 356964, 252037, 233128, 284617, 245817, 234215, 284382, 283500, 191556, 120252, 147837, 149869, 155805, 208716, 236569, 174342, 102674, 86555, 132335, 180057, 236552, 277457, 175873, 157444, 69106, 64826, 165425, 224221, 263195, 138132, 57267, 90745, 243854, 407013, 405339, 413812, 392328, 371724, 357791, 309898, 281119, 284855, 202933, 224699, 209569, 169624, 220034, 185187, 161576, 96604, 62457, 86400, 99436, 111878, 114262, 111374, 175804, 206088]
11091B06088l4898p9601m8739j908p4138m155N4139L4222l8601j6441K2179K4064
11079D2211l0305r6301l4475O712l626L6850R295j8458M3118J19168L6720j93706
11067h2797p1284N3273N9591J3034J9679M8678J7259R131j7699L2646L8023k7599
11055I1935k5021n590K3879M214j14197o8908K4315K3377Q024o2277o8766N7679
11043a11336L0142M4385J6313p2399n8127L3718K5893N6605J5966j8977k6709
11032f4526M074N2105K1609n1386j2984k4906M1581K8805M4495l5695m3170P5046
11020C5048L5953p9492p3348M6062L1293k1809l8348N839R7410P3345k6012j613
11008H4328o3905m0909N2868R22m5380o7537j9671O0224r893n0293L6044l2465
$$ y = [206088, 171190, 91589, 42850, 40942, -33196, -37351, 16788, 51010, 12409, -4032, 18147, 42211, 11906, -84395, -118870, -112158, -115784, -78934, -69639, -88097, -44979, 74189, 110909, -82797, -154081, -100808, -41217, -28183, -8504, 40174, 57433, 66564, 48865, 81511, 119534, 91935, 66914, 61324, 85203, 89417, -24780, -93688, -69373, -45996, -37972, -100249, -169015, -111336, -81194, -36809, -20496, -92895, -151022, -117304, -91411, -34806, -18840, -37817, -64526, -60452, -8347, 13262, -38124, -51108, -76014, -34433, -5628, 38867, 3172, -39998, 35048, 71001, -8491, -81839, -35777, -4484, -26293, -64641, -58802, 38608, 111953, 85941, 84328, 20423, -20486, 32382, 33304, -12076, -79613, -99284, -39060, -48953, -99246, -63202, -95667]
10996i5667q5827N380K8786J11595K7936m2383k7021k9233m4571M754m1444j12453
10984c00148J8126J07327M8094N7801O8564Q6565Q399k7705p372p354k0872R8998
10972A30423n2426n0511p3834j24037j2248L5003J02742R9349K9608q956P227
10961H2340k3208r7075m5470p1565M3781J11142Q636l3491m9182L170l1032j708
10949a03662m6345P493O7644l1575J02564Q2713o3919m0647J6032J4983n2803
10938d7522k51L1168K9268m1943M9142L2594k398R036l7648l1556n4326p1696
10926a36132k6210Q6785O7053l7706n7912j8659l7752Q6990J46133K4500q9134
10915G956J7932n43O5404p0761n6065R850N0259P0487r8237j47382j02747j2227
$$ y = [-95667, -181494, -176114, -147328, -35733, -7797, -50180, -77201, -106434, -151005, -146251, -187695, -300148, -282022, -174695, -126601, -68800, -236, 86329, 94728, 67023, 59651, 52297, 31425, 130423, 77997, 27486, -46348, -170385, -182633, -147630, -44888, 54461, 84069, 75113, 82340, 59132, -37943, -83413, -154978, -111197, -55, 8581, -24910, -74092, -70922, -101954, -103662, -150007, -142514, -74870, -106445, -3881, 78832, 14913, -25734, -9702, 5281, -47522, -47773, -16605, 12663, -29280, 19862, 52456, 50058, 59094, 21446, -10110, -64436, -136132, -162342, -75557, -8504, -46210, -104122, -122781, -160533, -73543, 72590, 97090, 7956, 25888, 25345, 90749, 19988, -36077, -26227, 24032, 94519, -3718, -151100, -253847, -266074]
10903b66074J09309O5012r9947K0492O5878Q5663N4845p7691j7075K9382k1394
10892e1600p5051J9751k3536R5737P7583K3160L2912q511o3216j02059O824k5373
10880i3379k4168Q5539m724L7156N8038K2804j35472n9391K7483L6103k9683L8791
10868d0903n378n0894n5111J2214j2450J0413O8040j9154k260P58P8477k8452
10856d4700o6064K5066O7992N8100j0290k7495p9946j11886Q3313P1849K3145
10845a0916k8129N1573j2129n1005m0704q797J4946M0256n6618j1655m3752k2921
10833a79851N0077N5160O331l3201M4585M9652P318o292K0614K6888m0810p6575
10821g6104o8740M4138J57010J1584q8794j0356j411L767k8271J3695L4282J3703
$$ y = [-266074, -156765, -91753, -191700, -171208, -105330, -19667, 35178, -42513, -59588, -30206, -51600, -126651, -106900, -130436, -34699, 42884, 66044, 98956, 90445, 27229, -74830, -68006, -93379, -117547, -32008, -36732, 424, 58462, 81266, -54206, -113597, -86114, -50011, -79694, -40903, -46281, -97175, -152286, -140072, -152522, -142109, -74069, -93223, -95483, -94725, -16248, -44700, -110764, -85698, -17706, 40394, 30104, 2609, -77337, -189223, -105910, -34061, -10916, -39045, 12528, 399, -50606, -91310, -100107, -85161, -44905, -101523, -113178, -156930, -179851, -129774, -74614, -68283, -101484, -56899, -7247, 71, -6221, 14393, 41281, 471, -76104, -144844, -100706, 56304, 67888, -20906, -31262, -32673, -28906, -57177, -43482, -9200, 4503]
10809D503N3018M860j09616j05089K0095n041M0193M8991m5202M2421p631k1940
10797h0438P0885N3517O325j2205n8712j6562N4614m7238j4474n7229L5470O2523
10785c524O5621j50087K8918R2258j2681m1942j13737m6390j4999K5353M0866
10774a30344J3690l9798L8201l5117p6582L2902O3755l1528M2039P520O5386L912
10762d5964L4398O3221K8386k9702n7370N4877M014q7417n6312k0290r819k437
10750a24415O9856R4255Q2722K6216l2799j8435l8293k3703O355l245o6574n102
10738c3162p2019l8765j4061M8574J3316k5588O351O0197q941l9822K6202L6171
10726d1547n0784P9307P6521K1943m6669J299k5101m9900L8746K010J2931K2540
$$ y = [4503, 57521, 62381, -47235, -152324, -132229, -137270, -97077, -48086, -93288, -50867, -58498, -80438, -9553, 43964, 50289, 38084, -20628, -37190, 17424, -29814, -44288, -101517, -66047, -3524, 62097, -87990, -59072, 33186, 20505, -21437, -135174, -181564, -196563, -171210, -130344, -116654, -156452, -118251, -153368, -229950, -197048, -133293, -164821, -122782, -115262, -49876, -45964, -11566, 51655, 80041, 50339, -7031, 47846, 51860, -35557, -91869, -112159, -121978, -124415, -54559, 39696, 122418, 148634, 115835, 97400, 59107, 35404, 41759, 38514, -28060, -33162, -105181, -143946, -158007, -109433, -96117, -121705, -115354, -55157, -64098, -103920, -77718, -41547, -92331, -13024, 63497, 85440, 38771, 40070, 14969, -34931, 3815, 5825, 18756, 41296]
10714D1296j4815l5761o339J9673n5512m6829M9988n7627l3320O7688R692p1512
10702a33378J9626O2620L152O9751R2642M0531N30j5531r4719k6899o677l4753
10690b3105J7064k4192J3852P1171L7800O258k4307M8530r71K6992O5483K4012
10678B38587R202N3622m308j3720p2720n8766p6987k6926j6055p6417K0954J7182
10666f352j1746j610P7538n3409J2833p251n8907l0541l3694j7242j5358k6763
10654a72502N5103P227m2764n9331m132M4535J17149J13213P4622n242o8893k4845
10642C4140n4664q704n0614K3091P9455o3689p0705k0794k1394N8013l7157l8448
10630a71470L9767m6736P151N1694N6434J05991K122k4362j1576q932L9961L7211
$$ y = [41296, 26481, -9280, -15619, 4054, -51458, -98287, -48299, -105926, -139246, -71558, -61866, -133378, -113752, -51132, -47980, 21771, 114413, 154944, 155474, 139943, 45224, 18325, 11648, -23105, -6041, -30233, -16381, 54790, 92590, 98848, 74541, 123071, 122100, 149092, 214575, 238587, 247789, 301411, 297103, 283383, 210663, 151897, 74910, 47984, 31929, -44488, -23534, -6352, -18098, -19708, 57830, 4421, 17254, 10003, -48904, -79445, -113139, -130381, -145739, -172502, -117399, -110172, -152936, -212267, -216399, -171864, -54715, 58498, 133120, 127878, 58985, 34140, -20524, -29228, -79842, -56751, 22704, -40985, -111690, -132484, -153878, -95865, -133022, -171470, -131703, -178439, -171288, -119594, -63160, 42831, 44953, 20591, 9015, 83, 40044, 77255]
10618G7255n6121j28715o5930n9335N4616J39577k2776m4488O2188L6426r4014
10607a01317K5112N2345M7130j5257l9063k7249J8494J2482N8106P4080j24962
10596b0099n0185n0146L8677L1660J4575J7896o3644O166N602J04931R1172j00039
10584B6566j13096m3402K6500J5151R8916K184j09120p432J4957K9619J8253k5817
10572f6721o6825M476n5214j612K4095R6423M8302P0165O8310q904r8043n8860
10560d4408j2658l3562P726M8359l2842L692J1131l6488O3631N8977k2506j2079
10548a027l9125o9621o4846J09582Q8042o4034K1955M0477n1453r4386k0569K2034
10536a22971J24702K7270p2114m9486O9742J5273k1502O7556J8159r9542M5468
$$ y = [77255, 21134, -107581, -173511, -232846, -178230, -38653, -61429, -105917, -43729, -7303, -101317, -76205, -23860, 23270, 8013, -31050, -58299, -39805, -27323, 30783, 104863, -20099, -70284, -120430, -81753, -50093, -35518, -17622, -81266, -75100, -69498, 35433, 126605, 26566, -86530, -129932, -103432, -88281, 10635, 12819, -96301, -103733, -88776, -59157, -40904, -66721, -133546, -129070, -184284, -185896, -161801, -65378, -17076, 53089, 121399, 112495, 14452, -44408, -57066, -90628, -82902, -34543, -67385, -63693, -52562, -89050, -25419, 33558, 11052, -1027, -40152, -109773, -174619, -65037, 23005, -41029, -19074, 21403, -30050, -124436, -145005, -122971, 1731, 29001, -43113, -92599, -22857, -7584, -29086, 38470, 56629, -42913, 2555]
10525B555k2896k1674J4515J8858L5462J3550K3991l4253K561Q206o990J33533
10513A67418O8795J41198J97161L00052K20899L1482j93346j80805M1055J80594
10503I74503J33265J77937r7082l93190k64913j17713j21566q1161j3732m7884
10493A48464q969o145p7932j9287m5424m4392K6874J9782M0474J2203K4208N573
10481G5429N1281L410m1337L187k7133M8781K4434m1166M0655L3775r2712j66735
10469h8131O1976N0469o6560p6833n6905M0212K9159j565P2741l8302o3759j4078
10457a51576N0374J1591k416J5608j9238L0940L9228r044j0134p523K6297M7235
10445B1342Q917k4401q2953r9459k2757J24238K9464Q1636L5519p6742j01985
$$ y = [2555, -20341, -42015, -27500, -8642, 26820, 40370, 64361, 30108, 32669, 40875, 33885, 167418, 236213, 377411, 574572, 874624, 1095523, 1127005, 933659, 752854, 793909, 974503, 1107768, 1285705, 1188623, 795433, 530520, 412807, 291241, 210080, 196348, 148464, 139495, 133350, 55418, 36131, -9293, -53685, -26811, -7029, 33445, 45648, 69856, 75429, 126710, 130120, 88783, 91970, 64837, 113618, 138052, 96886, 137541, 171316, 78604, -88131, -26155, 24314, -42246, -119079, -175984, -135772, -106613, -108178, -35437, -73739, -137498, -151576, -101202, -89611, -92027, -76419, -95657, -64717, -25489, -34533, -44667, -52190, -25893, 21342, 30259, 5858, -77095, -176554, -199311, -75073, -45609, 36027, 71546, -5196, -107181]
10434a07181k7908O0575P2053J3242J4869k067j37880o7247M6799J4091K2428
10423i8226J2514K9779K0519k2823K9565M9420m5105p4286J1547P9389J38069
10412A30362l9396j07123J9015k4089j5621m576k5441M9051k5144l2721k5932
10401a01615j3713O2253j6801j40210j1159J06869O6028P163K8716n2259Q6p565
10389g2207j1654l9877p9936j0050K9969l4176N7394M8847L7053j2839l414N8089
10377c2801K81L7460L2124M2007l6787k2481o915k9874l6437L3849j0739k0782
10365e1095j8299M8511j5393q3397m6295l0407O937K5116m8315j5025L636Q1511
10353a42515L1724M718Q751J21032Q5212m1751j01941m9153N520L7247L4989J4482
$$ y = [-107181, -135089, -74514, -2461, 10781, 25650, 23583, -114297, -181544, -134745, -120654, -98226, -85712, -55933, -35414, -58237, -28672, 20748, -24357, -98643, -87096, -7707, 130362, 90966, -16157, 2858, -21231, -36852, -41428, -66869, -17818, -42962, -75683, -101615, -115328, -53075, -69876, -210086, -221245, -114376, -48348, -41185, -12469, -64728, -64642, -72207, -83861, -123738, -203674, -213724, -183755, -217931, -160537, -111690, -74637, -87476, -90890, -32801, -32520, 4940, 37064, 79071, 42284, 19803, 12888, -16986, -53423, -19574, -30313, -51095, -69394, -20883, -36276, -119673, -165968, -196375, -189438, -164322, -212637, -227662, -224026, -142515, -110791, -106073, -97322, 23710, 108922, 67171, -34770, -83923, -78403, -41156, -6167, 8315]
10341H315N1723o8859r1803N5835k5642j23620K5929j3037R374J8527J787O5098
10329h6373M1130j03141q2032J34281N5275L378K0292O4309l0742n1183j0302
10318d5108O83l0159n721K4215J3116p5206N9296k5639o5323J8978M5628k2873
10306a08113l8792L9235J3219M9040m1589m9743J5641m334l0503j9423M8413L5115
10294i1834P845O678K0815j2310N801o0485O047L9461K9860R956k7935q591M4300
10281c0392J791p422L6290j7525l2138p6047Q4439J04056M1850J435o5796j31769
10269i1228k9517L298Q574m5882J5617R9422M9928N4220n7510k8802J0045O1070
10257D9235L7666p6472n5745J9262o6448m8325k1012K4461o2347Q8564J82037
$$ y = [8315, 60038, -8821, -100624, -44789, -70431, -194051, -168122, -181159, -171785, -153258, -151471, -86373, -45243, -148384, -230416, -96135, -40860, -37482, -17190, 47119, 16377, -34806, -45108, -44425, -74584, -80305, -56090, -42974, -118180, -58884, -84523, -149846, -130868, -85240, -108113, -146905, -107670, -94451, -45411, -87000, -136743, -121102, -125436, -155939, -175362, -126949, -91834, -83989, -77311, -56496, -68806, -63005, -123490, -117443, -77982, -48122, -38166, -66101, -74692, -30392, -28601, -36023, 267, -17258, -49396, -125443, -41004, 63052, 104902, 106337, 40541, -91228, -120745, -117447, -108873, -154755, -139138, -39716, 10212, 64432, 6922, -21880, -11835, 49235, 86901, 10429, -45316, -26054, -92502, -140827, -161839, -137378, -199725, -111161, 70876]
10246G0876M0349R370j6572J9334o3437l9660J0439l4649p9941L4770l5348p1535
10234a56004R753M6467L0738M3190j9732k0443q527J1050j6421n3737j7421K8680
10222a22407J11055J392L3484K9992K0115N8404n0403j44603n4187O7239O1253
10211A1334L143J5231j2086j1937k4792Q9713K4201k8778n3138K6226J568m1049
10199c64r8215M200R892K8855J0850n6037k180J1695K9086m4113p0513J4824M0009
10186a22011o5044m2327P4179J11464N7230k3891l8936j00921p9412Q0989K6455
10175a22225l6857L0995Q0264R164k9434m4073r6699j7641j0743J1119N5645O7522
10163a02963R2170J4884M8475K0905K2667q4462j03664m125o2132n3997O5315
$$ y = [70876, 111225, 120595, 104023, 123357, 59920, 20260, 30699, -3950, -83891, -49121, -84469, -156004, -146251, -99784, -69046, -25856, -45588, -66031, -74558, -63508, -79929, -133666, -151087, -122407, -11352, -9960, 23524, 53516, 73631, 132035, 81632, -62971, -117158, -49919, 11334, 14477, 29708, 17622, 5685, -19107, 70606, 94807, 66029, 12891, 39117, 40685, -364, -98579, -94379, -84487, -55632, -44782, -100819, -102999, -91304, -62218, -106331, -176844, -162020, -122011, -187055, -229382, -155203, -43739, 13491, -10400, -49336, -150257, -229669, -148680, -122225, -159082, -128087, -47823, -38659, -68093, -112166, -208865, -226506, -237249, -226130, -170485, -102963, -10793, 4091, 52566, 73471, 96138, 11676, -91988, -96113, -158245, -212242, -146927]
10152a46927J387M2609L8379m4191K9228J68893j7626p1557j5059j9575O692R6622
10140F8875m7559o1426k0736J4554J2106j5931m8785P9407k1636j29032j5795
10129a85958J04710R7032r401k5080M7909n2459j40295k9724Q1093j6048M1261
10118h6960K2671P4049N1849K1072l8490j8309r8243j9885j8075n4256L7102R1513
10106c5962o607j5027J3579l2746q1414o7727L8851J72031K595K1844j626l2932
10094b5141M3376K1949j4999j03961p8172N0776Q6643L9525K7191l0663K1529
10083C8053o9395k2754J2788j0364J7150k5948K6663L6362j4945k4766l9994K5057
10071e2093o3148p1648K4958J11560M9631j6284J3832J9373N6591l0681m8286
$$ y = [-146927, -145540, -102931, -64552, -108743, -79515, 89378, 71752, 195, -14864, -34439, -27747, 68875, 21316, -40110, -60846, -46292, -34186, -50117, -98902, -19495, -41131, -170163, -185958, -81248, 15784, 6383, -18697, 29212, -23247, -163542, -193266, -112173, -128221, -86960, -64289, 9760, 61609, 82681, 44191, 25882, -72361, -92246, -110321, -164577, -127475, -35962, -42569, -57596, -44017, -76763, -158177, -225904, -187053, -15022, -12427, 9417, 7791, -25141, 18235, 40184, 25185, -78776, -156948, -106172, -19529, 19996, 47187, 16524, 38053, -31342, -54096, -41308, -51672, -34522, -60470, -33807, 2555, -12390, -37156, -77150, -52093, -115241, -186889, -161931, -50371, -740, -17024, -3192, 16181, 72772, 42091, -6195]
10060f195j708K6260M3015K2410Q5934m6359r6508n6196m4718p1844J9953J5633
10048a10323M4875k9713Q0370P0683l7316q4356q4433L8403M1578n6392K4218
10037a02406l364K6186J27893r8N9189M2222P1o883o7131r0204o2549j8773L7423
10024e8424l4058L0888K0294l5968j5695M1413m4463q1918k4250N6438N7306M5371
10012d3066P6603J3172k8697p321m5003l6123o8235M6707M1078m3309P8784K5205
10000I795N3664J357J7867l1502o1372l2450q6280r835M6836j0811K0661J08476
9988B6406m8072J3757J9244R921l30j9336J3298J03933q882p3949n7832j3971
9976c5813K3213l4459k7166o178J3163j3565l1676K5244N6385P8471J5669l5629
$$ y = [-6195, -7903, 18357, 61372, 83782, 169716, 123357, 26849, -29347, -74065, -145909, -125956, -110323, -65448, -95161, -14791, 55892, 18576, -65780, -150213, -111810, -70232, -126624, -102406, -105770, -79584, 48309, 48211, 107400, 149622, 149693, 142810, 75679, -14525, -77074, -95847, -58424, -92482, -61594, -41300, -77268, -92963, -51550, -96013, -177931, -202181, -145743, -88437, -43066, 33537, 46709, 18012, 10691, -34312, -70435, -138670, -91963, -50885, -94194, -15410, 9795, 63459, 64816, 82683, 51181, -10191, -42641, -128921, -138756, -91920, -102731, -82070, 26406, -21666, -7909, 11335, 21256, 20926, 1590, 14888, 118821, 109939, 35990, -21842, -35813, -12600, -47059, -74225, -80403, -67240, -80805, -112481, -87237, -30852, 47619, 63288, 27659]
9964B7659m5303k7176R8661Q650j8099l4802k0157k8496j0000P8338J9441k676
9952D6040N2198l1717j1972r9107r5918n8640L0645Q4564R0363L5105j8558M886
9940B7889J6238o9973j08105p407M5170M9627K2133Q7682M497j50420j5229P0423
9928b7475M7201O4206l6957p0016P0196J6689o69K6798m31m8538p2424n6179J0480
9915g7119J06849M1590m3898j18915o4548m1512O711J28775Q7728M38p4520n4429
9903a02850N5653K9300P2095J8214L8980k8421n8565L8165j8587k0751k6687j6097
9891a9551j24084P637N4878P3625j3587P4571p365m5107j18532M9171R2045p023
9879A6678j5172j7871l3959M298k7550O3307l4731L7849L8002P432N9149o878
$$ y = [27659, -17644, -44820, 53841, 62491, 44392, 9590, -10567, -39063, -49063, 29275, 48716, 46040, 98238, 66521, 54549, -44558, -140476, -199116, -168471, -83907, 6456, 41561, 23003, 27889, 44127, -25846, -133951, -141358, -96188, -46561, -24428, 63254, 67751, -82669, -97898, -27475, 19726, 83932, 46975, -23041, 47155, 63844, 63175, 89973, 89542, 41004, -31420, -87599, -77119, 29730, 71320, 27422, -91493, -156041, -197553, -190842, -62067, 25661, 26099, -48421, -102850, -47197, -17897, 54198, 72412, 111392, 82971, 24406, 62571, 43984, 23233, -3454, -19551, -143635, -135998, -81120, -7495, -21082, 53489, 46124, 1017, -117515, -68344, 23701, 16678, 1506, -16365, -50324, -46026, -73576, -10269, -45000, -7151, 30851, 38283, 97432, 90554]
9867I0554k5068L1942L1361L614k3141m4727m4194k9290l0884m2780l7106K9605
9855i0114O5509K7543K489O5253L0402K8136J9010j2128k985j8101K9182m4911
9843I9285j28501j16019k410M2339m096k4113L4861N3420J4478M8535j5119k4713
9831b2053P7626q841K3027J32125R6378m1527j02415j0346j2268P794r5076n2065
9819g641j09936J0533L0946L3390n317K7848N9545n0893p3790Q373Q2555K885
9807H498P9628J46542L1421j13260j31131j6905l3n0983k9939O465R922J8081
9795d1694k5130j5581j0757j408O8368L9408m9897r503M8331p119k377r5676M135
9782i8900M6295M1667N6964m5525l6709m6854P2878P9224p2125o0536M6168j1601
$$ y = [90554, 65486, 97428, 128789, 132403, 109262, 64535, 20341, -8949, -39833, -82613, -119719, -90114, -24605, 2938, 5427, 70680, 101082, 129218, 148228, 136100, 133115, 115014, 144196, 99285, -29216, -145235, -147645, -105306, -109402, -133515, -98654, -45234, -30756, 17779, 2660, -22053, 55573, 46732, 69759, 201884, 298262, 256735, 154320, 143974, 131706, 139500, 44424, -7641, -117577, -107044, -76098, -42708, -48025, -20177, 39368, -11525, -85315, -76942, 5613, 8498, 88126, 234668, 266089, 152829, 21698, 4793, 4760, -46223, -76162, -69697, -59775, -41694, -66824, -82405, -93162, -94570, -26202, 13206, -36691, -46194, 2137, -4982, -7359, -103035, -98900, -52605, -10938, 46026, 501, -36208, -83062, -10184, 69040, -3085, -63621, -17453, -29054]
9770b9054Q384O2930M7299M5271p700m7894o8982o2745O7838O4978j403m6238
9758C2684k7796m998k4329K6385k0720m4919p3095K6932J4700J328K2495J00123
9746B8790L7378n5611K8807J8268M1435r2918n7922R1337K7622q7380j9592M2900
9734C114J9898n3157J697k9945l0633N4908J9448K604l0064M1239K8671p9954
9722e2174Q2466M5411k2703n2527m6874j1696R0138K6057r6984m9084J22672Q0009
9710A14711l1503q3103k5044M075m4378j4474P1387L599l9299j2387k980N6935
9698b461P5290K5134j01157k4436P5555P6040N6135m091j0552r2658k7952j3713
9686C1134O1782Q2060l6123k8762n6991o4078q1387O0894O3441L5529N9539L4961
$$ y = [-29054, -20670, 42260, 89559, 134830, 127130, 79236, 10254, -52491, 15347, 80325, 78922, 32684, 4888, -110, -24439, 1946, -18774, -63693, -136788, -109856, -95156, -93828, -71333, 28790, 66168, 10557, 39364, 57632, 99067, 6149, -51773, 39564, 67186, -20194, -39786, 3114, 23012, -30145, -28448, -58393, -89026, -34118, -14670, -12066, -42130, -891, 27780, -52174, 30292, 75703, 53000, 473, -46401, -58097, 32041, 58098, -38886, -87970, 34702, 114711, 83208, 105, -24939, -20864, -65242, -79716, -8329, -4730, -44029, -56416, -59396, -2461, 72829, 97963, -3194, -27630, 47925, 123965, 180100, 176009, 165457, 72799, 44847, 31134, 92916, 174976, 138853, 110091, 53100, -10978, -92365, -31471, 31970, 67499, 127038, 161999]
9674A61999m7660j7537L8327K2218J1547m9159p3245j0961m0203m0004M063P4453
9662C3838O2540j755K025K8496k2257o7597L7230J9893R331o7734l2134P714K4082
9649C3672L8715k1764N6561R1167l5403p6179m9828m7301L5748M3823m0495n2704
9637b3988J2614O1964P1739K3855j16415P6001M4819N509j918L2118Q5659p0238
9625B01719r9436j7247m008P6911j6889l6660n1782k7425L6214N3734L00j0643
9613A04788J4198R382l9876N2362J3780K5023o5659j18663n0135K5292m5120K7967
9601d6661K2116O9789Q3404m6110K7062K8214j6481p5868k9340O1148R1912q0225
9589H8960n0674O6946O1158q5789L8382K2625M4745j06010q4131Q7722p3892N0810
$$ y = [161999, 114339, 96802, 135129, 157347, 168894, 119735, 46490, 35529, -4674, -44678, -40615, 33838, 96378, 94623, 96648, 125144, 102887, 35290, 72520, 92413, 101744, 34010, 1876, 9590, 33672, 72387, 50623, 107184, 198351, 162948, 86769, 36941, -10360, 25388, 69211, 28716, -23988, -11374, 50590, 122329, 146184, 29769, 105770, 150589, 156098, 154180, 186298, 271957, 201719, 102283, 85036, 81028, 157939, 141050, 104390, 52608, 25183, 61397, 115131, 115431, 104788, 118986, 128368, 88492, 140854, 154634, 179657, 113998, -4665, -54800, -29508, -74628, -46661, -24545, 45244, 128648, 82538, 109600, 137814, 121333, 45465, 16125, 77273, 169185, 88960, 38286, 105232, 166390, 80601, 118983, 141608, 186353, 80343, -3788, 83934, 10042, 60852]
9577F0852M6305q3348N3126m682O1627M1984j6292L0388L0170N1518j3068q0862
9565A77718q5991O5930J08950P6210R447r6957k4450J93r2318J5400N4215m6992
9553A61355n3633J9860R2039j7423n6564m0033k359Q6427J3735l7143O403M2369
9541B15033P639k9292l6872j01474o58J60668k9165j4455l5165m3860p6808L8367
9529E3958Q6932K9095k9556j7754L0227M8875J7604j4130o8605j8938P2049M1006
9517B30763p359j4812o5708P2991l2826l1096N909p612J5525l5554n604L4427
9505A59044j3648j0744m5535r1214m6863O0588j1780O2826N6629L5386K8462K5998
9493B09149o2282L4421N359N1546O323r786R5325m5289p3136J0539J8026j6349
$$ y = [60852, 107157, 23809, 76935, 72253, 133880, 175864, 159572, 189960, 220130, 271648, 258580, 177718, 91727, 157657, 266607, 342817, 352264, 255307, 230857, 231050, 138732, 154132, 208347, 161355, 107722, 127582, 219621, 202198, 145634, 105601, 103242, 189669, 203404, 166261, 172664, 215033, 222672, 193380, 156508, 55034, 54376, 215044, 185879, 171424, 136259, 92399, 15591, 53958, 140890, 169985, 140429, 122675, 152902, 201777, 219381, 205251, 136646, 117708, 189757, 230763, 223404, 208592, 142884, 215875, 183049, 151953, 157862, 150250, 165775, 130221, 124617, 159044, 145396, 134652, 89117, -2097, -48960, 11628, -152, 62674, 119303, 154689, 183151, 209149, 146867, 181288, 186647, 238193, 244516, 234730, 330055, 284766, 211630, 222169, 240195, 223846]
9481B23846j7655J9414M2330J682j8369j0166L6442m7040n6523l0851j7421q8497
9469C7192n649J8323O2953J00769O6713O5895n7889p5585J3345k877k6058q353
9457A88779o0865M9186J41041N1718j9135l0949M523K3495o6736m7940j5758m9405
9445A67954O006R7384n9726o6503l1783o47R4577J3906J1966l9527o6727J6881
9433A43761O0196j5861K6600O9401r513L0556o0098J360N6766q431n8835L5582
9421B71484J8263r407l5254L1222J09869M7975K5217n837k4052k2569r8986l9325
9409B68600Q4095M8437P911M8599K4195K1422K6128j6686l970J1337l2434k2273
9397D65361n2051k7539M936M6715O6906l0668m7845J7443J58263K2760n1718q0657
$$ y = [223846, 206191, 225605, 267935, 269617, 251248, 241082, 277524, 230484, 173961, 143110, 125689, 37192, 31543, 49866, 112819, 213588, 280301, 346196, 288307, 212722, 226067, 223190, 197132, 188779, 127914, 177100, 318141, 369859, 350724, 319775, 324298, 347793, 281057, 233117, 217359, 167954, 173960, 271344, 211618, 145115, 113332, 112685, 207262, 221168, 233134, 193607, 126880, 143761, 203957, 188096, 214696, 284097, 274584, 305140, 245042, 246402, 303168, 294737, 235902, 271484, 289747, 280340, 245086, 276308, 386177, 434152, 459369, 453532, 429480, 406911, 307925, 268600, 352695, 401132, 409043, 457642, 481837, 503259, 529387, 512701, 508731, 520068, 487634, 465361, 413310, 385771, 390707, 437422, 504328, 473660, 425815, 443258, 601521, 624281, 572563, 491906]
9385D91906q901o1965k8949M9547J947n8086p1512j1090P1777O1662J1799k44
9373D47891N6482N6196l3197J6490L3425l0103l9096q084m969o373L102l2082
9361D59682K813j1691m6776r6071K4724J14204O6561K2579p3537P2130O1607J5708
9349F11933k5765L3274Q7807P342q5001j6922N9634n420k6403J5979j869p0008
9337E84581n2920J801J39520M3362n631P0431R693q0664n2874M6837L4505l9258
9325F99383o4486R701O9618K6028m0508J0383M4409M153n9868J5023M3702j2832
9313G44706j05850o6351N9928J09625P5969p9630o4135P6387l5323k1697k5207
9302F68422N7924Q5609N3502J06722P6931L0995q2953q8306l5854p3072k1517
$$ y = [491906, 483005, 421040, 392091, 441638, 443585, 385499, 313987, 302897, 374674, 436336, 448135, 447891, 504373, 560569, 527372, 543862, 577287, 547184, 508088, 500004, 495035, 488662, 491764, 459682, 462495, 450804, 404028, 307957, 332681, 446885, 513446, 536025, 462488, 534618, 596225, 611933, 586168, 619442, 707249, 714591, 629590, 612668, 672302, 666882, 640479, 656458, 654589, 584581, 531661, 533462, 672982, 716344, 710713, 781144, 790837, 710173, 657299, 704136, 738641, 699383, 634897, 644598, 714216, 740244, 699736, 710119, 754528, 758681, 698813, 713836, 757538, 744706, 638856, 572505, 632433, 742058, 818027, 738397, 674262, 750649, 715326, 693629, 668422, 726346, 811955, 865457, 972179, 1049110, 1080105, 997152, 908846, 872992, 799920, 778403]
9291G78403K1800P2381Q8956N4036o0948m8350k6785J5780N0017P424R028k2944
9279I38798p263J8275l9546l6579Q906L6457R9391Q2839r0001k8094P9582j9348
9267A043417k1265Q2021M3488R633J5700k0013j04656j4410R627L6875L6241K9418
9255A146076Q739k1727j4773l4117N5238L6875n6910J2687M1608O9351n1008L5749
9243A227788M6150K8142k0983j0175O4074L859q94L0870P994l2766L1076o715
9231A368420o8630m2507L7997J4556o4442o0702j4242J06626J02622j5815n3815
9220A310068N743L2085J6161k0818N2753m430j28956M171M9457m6191k6594J7024
9208A260473Q6778J03679K0804K4655K7315N9235L9061p9678j1446k3158N3708
$$ y = [778403, 800203, 872584, 961540, 1015576, 954628, 906278, 879493, 895273, 945290, 952714, 961742, 938798, 931535, 949810, 910264, 873685, 882591, 919048, 1018439, 1101278, 1011277, 983183, 1062765, 1043417, 1022152, 1104173, 1147661, 1157294, 1172994, 1152981, 1048325, 1033915, 1043542, 1080417, 1116658, 1146076, 1154815, 1133088, 1118315, 1084198, 1139436, 1176311, 1119401, 1132088, 1173696, 1243047, 1192039, 1227788, 1273938, 1302080, 1281097, 1270922, 1334996, 1338855, 1337961, 1368831, 1376825, 1344059, 1375135, 1368420, 1299790, 1257283, 1295280, 1309836, 1245394, 1184692, 1170450, 1277076, 1379698, 1363883, 1310068, 1315811, 1347896, 1364057, 1343239, 1395992, 1391562, 1262606, 1266777, 1316234, 1270043, 1243449, 1260473, 1347251, 1450930, 1471734, 1496389, 1523704, 1582939, 1622000, 1542322, 1530876, 1507718, 1561426]
9197A561426M172n7070M1106N6715p089o8107n6245K9023k4355l5717J6090L9010
9185A498959j1367P261J7820l0414n7555n4039K2810Q3205l4933m878J41580R4618
9173A673067l9008j31067K287J4599k369m499L7021L0174k850K3573M4325J1923
9161A657176N8701m2343j06761L87N3267Q9632J34692r1286o6154m0931L9403
9150A685783P758j34433k3105Q4093l3016M6333J8970J193q5264j8230N7702n9326
9138A548458n1607M0922L2060m1379q6399N9149N882j67189J2864P868l6429J6531
9126A340731k2184k0610p9189J9716J3441M5770O261M9159K7624j5280J4508n1118
9114A328829l3772q451O4059k4304k5150j9069N8781j2173q5319k4746J8819m4224
$$ y = [1561426, 1565598, 1508528, 1549634, 1606349, 1599260, 1531153, 1474908, 1503931, 1479576, 1443859, 1459949, 1498959, 1487592, 1494853, 1512673, 1482259, 1424704, 1370665, 1393475, 1476680, 1441747, 1436869, 1578449, 1673067, 1634059, 1502992, 1505279, 1519878, 1517509, 1513010, 1550031, 1580205, 1577355, 1600928, 1645253, 1657176, 1715877, 1673534, 1566773, 1567160, 1620427, 1710059, 1844751, 1753465, 1687311, 1646380, 1685783, 1693541, 1559108, 1536003, 1620096, 1587080, 1633413, 1652383, 1653576, 1568312, 1550082, 1607784, 1548458, 1496851, 1537773, 1569833, 1528454, 1442055, 1501204, 1507086, 1339897, 1352761, 1360629, 1324200, 1340731, 1318547, 1297937, 1218748, 1238464, 1251905, 1297675, 1303936, 1353095, 1380719, 1365439, 1379947, 1328829, 1295057, 1286606, 1350665, 1326361, 1301211, 1282142, 1340923, 1328750, 1243431, 1218685, 1237504, 1193280]
9102A193280k3042N6439l4226j1774k4272L6286L3086l9598p9262n1424Q955L0255
9090A094703K2306o042L1499Q0363Q59j2103n6145n3444J3488o1196r399p315
9078A037574o1185q9797K4860K9793j8223l154j2679M6774Q3374n520p6034l2822
9066I22961j9187M6943m4858L2464R3647N5551n8048j0978m2207k6403K401j5465
9054I36821N878L3984j2588K3480P1984m9761p6453r8298n108O8104R6564J3376
9042A007983n7581j24106l3544M4331n5854q7940K365M7482N6320L9110m5983
9031G92583k6254J5840j1195Q417p0521P8023Q788L6888j6668m9623k3519j03308
9019F39451j6699Q6175r8213q0793j9923O3051K4224k9215q4929N1247J27313
$$ y = [1193280, 1170238, 1226677, 1192451, 1180677, 1156405, 1192691, 1225777, 1186179, 1106917, 1055493, 1064448, 1094703, 1117009, 1110967, 1142466, 1222829, 1223688, 1211585, 1155440, 1101996, 1115484, 1054288, 1044889, 1037574, 976389, 886592, 911452, 941245, 923022, 919868, 907189, 953963, 1037337, 1031817, 955783, 922961, 903774, 950717, 905859, 938323, 1031970, 1087521, 1029473, 1018495, 976288, 949885, 952286, 936821, 942699, 976683, 964095, 987575, 1059559, 1009798, 933345, 835047, 829939, 898043, 994607, 1007983, 950402, 826296, 792752, 837083, 781229, 693289, 695654, 743136, 799456, 838566, 792583, 766329, 782169, 770974, 779391, 708870, 786893, 795681, 832569, 815901, 766278, 742759, 639451, 622752, 708927, 610714, 529921, 509998, 573049, 597273, 568058, 483129, 534376, 661689]
9008F61689K6594q8467k1455k135j54628M5522J47202m0059j9410q7674m9326
8997D17853R5480J0491O525j1266l9457m9611J1247P3825j3985n6350M7664O6310
8985E58726n1277j6700M8848J9053j241m9963J5878j2983r963K019l4246m1100
8973D27051N1387M720j0299j01948N2329Q6338j1675l2386K2322Q999m0914J9641
8961D75565R314j10839j09387p29P1855R1830J03904m0411l4619M1683L9332q9267
8949D48231j3049P5413J8063m5707l8006l027J2692J1726j23279m9054J3178n3001
8937B54180r698L099j0711K2856M9247j2035J3731J7243K4906m1246o2305L088
8925B52355J3745J11961K8650j7407K0563m434J09454J7088p2373j45206K4651
$$ y = [661689, 688283, 599816, 578361, 576226, 421598, 467120, 614322, 574263, 554853, 467179, 417853, 513333, 523824, 530349, 519083, 479626, 430015, 441262, 515087, 501102, 444752, 492416, 558726, 507449, 490749, 539597, 558650, 557409, 507446, 523324, 510341, 500378, 502397, 468151, 427051, 478438, 483158, 472859, 370911, 423240, 509578, 497903, 465517, 487839, 496838, 455924, 475565, 484879, 374040, 264653, 263924, 335779, 427609, 531513, 491102, 456483, 498166, 537498, 448231, 435182, 510595, 528658, 482951, 444945, 441918, 454610, 466336, 343057, 294003, 307181, 254180, 244482, 247581, 236870, 259726, 308973, 296938, 310669, 327912, 352818, 311572, 249267, 252355, 266100, 378061, 406711, 389304, 409867, 405433, 514887, 531975, 459602, 314396, 339047]
8914C39047K8271m7118l1891n6477L3775L8554j7828J1563l4410m4500m3106P9978
8902B55858R0705N614j9116l4473R2382Q091r257L193k7961J1245M9543L7075
8890D62899k4987p8241q9085j42079j2558j0216p124O7346J37065j1471k8329
8879B63220q9565l9652L1587J7880K3178j8634M1422k4665n8598K6774m87O9266
8867B41726Q3575n7525K9938j1684n5587p2149m6916J294K1364M935M472l6416
8855A07027k0993M0839M2055l5312m0996J0006J3860L6367J20155K2792J271l6363
8843B60708m7216P734N0442K6015k4414l5714k4173m2188P645L0185l2501m8512
8831A28011j6663L9634l9895Q4386N2762Q2216o430p7067r3327m0582o019k5634
$$ y = [339047, 367318, 320200, 288309, 231832, 265607, 304161, 286333, 297896, 263486, 218986, 175880, 255858, 346563, 352177, 333061, 298588, 390970, 399061, 389804, 392997, 365036, 376281, 425824, 462899, 437912, 359671, 270586, 128507, 115949, 105733, 98609, 165955, 303020, 291549, 263220, 173655, 134003, 165590, 183470, 206648, 188014, 229436, 204771, 146173, 172947, 172460, 241726, 325301, 267776, 297714, 286030, 230443, 158294, 111378, 112672, 134036, 138971, 143443, 107027, 86034, 126873, 168928, 133616, 92620, 102626, 116486, 152853, 273008, 295800, 297071, 260708, 213492, 221226, 271668, 297683, 273269, 237555, 213382, 171194, 178839, 209024, 176523, 128011, 111348, 150982, 111087, 195473, 248235, 330451, 324021, 246954, 153627, 113045, 107026, 81392]
8819H1392K8847P6244r2509q365O848K9843L1717Q2411J1929r1453n2590O866
8807A11180N0158n684J6966P6289P008p5439p2323N2263J07206N0526n4698j6491
8795B46961n2025k9215O4726N2857q25O769k7454q6171q3918m0639Q4203P6081
8783B11350N782L8903L6899p0063P4705M4346l2928r9846l9920n0886n3033O0126
8771A25435R267k6964O2537p811L084O8094K1251n2122J2641n4917r7941p640
8759E4914L9611J1303O7421Q486j3159j8204m3002r062L1303P3022p2937j07497
8747B2199K4063M527K5363P868k5781l3014J14774L7227q4326J2588M067M0131
8735A49686K9882L2322q1722q369N2138k0585m4537N1305R0448N569k3650p280
$$ y = [81392, 110239, 186483, 93974, 85609, 92457, 122300, 154017, 236428, 248357, 156904, 104314, 111180, 161338, 155654, 172620, 248909, 255917, 180478, 108155, 160418, 267624, 318150, 263452, 246961, 194936, 165721, 230447, 283304, 282479, 289248, 261794, 175623, 91705, 51066, 135269, 211350, 217132, 256035, 292934, 222871, 297576, 341922, 308994, 209148, 169228, 118342, 65309, 125435, 134702, 107738, 170275, 162464, 165548, 233642, 254893, 202771, 215412, 160495, 62554, 54914, 94525, 105828, 173249, 181735, 168576, 150372, 107370, 98308, 129611, 202633, 129696, 22199, 46262, 50789, 76152, 84020, 58239, 25225, 139999, 177226, 92900, 105488, 109555, 149686, 179568, 211890, 130168, 121799, 173937, 153352, 108815, 160120, 250568, 256137, 232487, 225207]
8723B25207q454p6971k2547J0394K8680M9756P2167l1573m7063l3276j08822J1837
8711F9335j495l0381O048L4330M0094M6436N8221l8194J1490q5401m795K9580
8699A35268o7095l8308L0458R2976M2761L5853J5328o6848m2676J461l9681k3388
8687G6109j8396l1933J5506J868J1858Q0545q719j3368L7102J20604J6142J3641
8675C00959p6874j12505M0896M8634Q9928m3593m8665K8426J6570j5360Q047P9915
8663C16378J14263k9808k7894q5030K5425K7759l1744n3366l1169P7488Q1481
8652C83783J04163Q4919n7582O1427Q4565R9216J48957K05612P3885l3387N4347
8641A209905r033J9990R891n1954l1192n0188K6985M7748R5126Q6359L00076P12622
$$ y = [225207, 216753, 139782, 117235, 127629, 156309, 206065, 278232, 246659, 199596, 166320, 57498, 69335, 67840, 37459, 43507, 77837, 117931, 164367, 222588, 184394, 195884, 110483, 105688, 135268, 68173, 29865, 60323, 153299, 196060, 231913, 247241, 180393, 137717, 139178, 99497, 76109, 57713, 25780, 41286, 43154, 55012, 135557, 126838, 113470, 150572, 271176, 287318, 300959, 224085, 111580, 152476, 201110, 291038, 247445, 198780, 227206, 243776, 228416, 236463, 316378, 430641, 400833, 372939, 287909, 313334, 341093, 309349, 255983, 224814, 302302, 383783, 487946, 572865, 515283, 576710, 661275, 760491, 909448, 1115060, 1188945, 1155558, 1209905, 1200872, 1220862, 1230753, 1178799, 1147607, 1097419, 1124404, 1172152, 1267278, 1353637, 1653713, 2366335]
8629B366335P46542M26994J8010o40741r05853m96968k45365j90424j01518p547
8619I69465o0490l6186L778j1260o6024M295R125n1754M9743J29044R937L3300
8607I82973M1094L5878P8211J00107J04615K91791K68956J45209K19845K52956
8597B521635J21371L943K961O7471K0286L515M7470J62173K71242L17728M89294
8586D029089Q48000J226123R57575L16463p99134j826963j345523q28732n05361
8577B071537l33221k14424k48043j42563j5995p2853j11149K237j8776L2175L5983
8566I84908P5208k7545o6523n125n7285o1016J07946M4758J8322O8292Q9247J14977
8554A286164P9196P0945N5784M3301P6976J20854L1698J17298J94479L90372N60804
$$ y = [2366335, 3112877, 3539871, 3557881, 2917140, 2011287, 1514319, 1268954, 1078530, 977012, 969465, 908975, 872789, 876567, 865307, 799283, 803578, 812703, 760949, 810692, 939736, 949673, 982973, 1024067, 1059945, 1138156, 1238263, 1342878, 1634669, 1903625, 2048834, 2268679, 2521635, 2643006, 2646949, 2649910, 2717381, 2737667, 2741182, 2788652, 2950825, 3222067, 3539795, 4029089, 4877089, 6103212, 7060787, 7377250, 6578116, 4751153, 3405630, 2576898, 2071537, 1738316, 1523892, 1275849, 1133286, 1117291, 1044438, 933289, 935526, 916750, 948925, 984908, 1060116, 1032571, 966048, 960923, 903638, 842622, 950568, 995326, 1013648, 1081940, 1171187, 1286164, 1365360, 1436305, 1492089, 1535390, 1612366, 1733220, 1764918, 1882216, 2076695, 2467067, 3027871]
8543C027871O10049M60465K81921K06615k9762l84855q53497r14976o80977l45070
8533A377784j61846k23835j66051p9377L4991l43j6981j7085r7834k6213j0398
8522F12812J7634r8665q0977k4417J9899M3755l0912K0780k964l1344p005K612
8510D41208q183l5314M9838P9801m2415l9246M8616L0498O9374J39681K35996
8499I69854K72283J69587K711j33917j76954k14169k75029j41593j12744l924
8489C56105m2108q08M3995N5574k7815l5333Q4117m0744j08685o2076M099Q060
8477B34381M405j5348J7176R683j02109m1065K2881M5092p8773N7859K2511j9566
8465A57127O6690L1060P072n0599q6606k4911L2803l325m042n9533q1363M0110
$$ y = [3027871, 3637920, 4098385, 4380306, 4586921, 4557159, 4172304, 3318807, 2403831, 1722854, 1377784, 1215938, 992103, 826052, 746675, 781666, 781323, 764342, 747257, 649423, 623210, 612812, 630446, 531781, 450804, 426387, 446286, 490041, 459129, 479909, 476945, 445601, 438596, 441208, 433025, 397711, 447549, 527350, 484935, 445689, 494305, 524803, 594177, 733858, 969854, 1242137, 1411724, 1414435, 1280518, 1103564, 889395, 614366, 472773, 360029, 356105, 313997, 313189, 357184, 412758, 384943, 349610, 433727, 392983, 284298, 222222, 226321, 234381, 238786, 223438, 240614, 250297, 148188, 107123, 130004, 175096, 96323, 154182, 176693, 157127, 223817, 254877, 261949, 211350, 124744, 99833, 132636, 129311, 125269, 65736, -15627, 24483]
8453B4483k0313K7293k356K1460k0598N9441P7896P3999J14373o262R526k0020
8441C38922j23367p7385p1291K6761j8244n2910j4327o7664J6000N1718q033K150
8429B330L1035K7908p4961p3067j6547Q0692J16247N1392J5087m4145r8900k3202
8417f131Q5551N833K7505k4302j42333L3854L0433m1950N6446l8618k7629l0620
8405g1961N7368P1804M4339K6073M0888P4033L9253J3122P0577j9983m373p5082
8393B66058k11318n7533L0069j2678m3925O7649P9206m2986l0375j6378j2557
8382A5232k6523M0493N9425p5467N9342j7825N3649m7541o5252L0913N517j6815
8370A5148K3050q3676n090J8661n1018p2107N0915L0998j8363J9140L9846o9160
$$ y = [24483, 4170, 31463, 29107, 50567, 29969, 89410, 167306, 241305, 355678, 349416, 358942, 338922, 215555, 138170, 66879, 93640, 75396, 22486, 8159, -59505, -43505, 8213, 180, 2330, 33365, 61273, -13688, -86755, -103302, -22610, 93637, 145029, 160116, 115971, 17071, -6131, 79420, 85253, 112758, 88456, -53877, -20023, 10410, -31540, 24906, -13712, -41341, -71961, -14593, 57211, 101550, 127623, 168511, 242544, 281797, 294919, 365496, 345513, 341140, 266058, 54740, -2793, 27276, 14598, -29327, 38322, 117528, 74542, 44167, 27789, 15232, -11291, 29202, 88627, 13160, 72502, 54677, 108326, 60785, -4467, 26446, 31963, 15148, 38198, -45478, -50568, -31907, -82925, -155032, -104117, -73119, -91482, -72342, -32496, -101656]
8358a01656M2705J8912m3803L9951N2342j2286K3093M9000j028M4714j8876o8638
8346B4430L5669k4538j0565r186q913J1937l5610p0969N0507R0032k7008q6566
8334f0780j7909P9679l8624m8572j2513j02612J9618L3406p984L5940K1117p0126
8322a69360L1676K4321K5053J97J5977N3995J04943l7069j4963J2647o6883j7120
8310c6586L5591n3177m8764l7564j6952l6359M1417Q8502M2850j0437M8844L7168
8298E4533L2718m0386l8947o7446O008K1703J316M2095J9980O540m6700j8728
8286b7314Q6724n2544q3445n0768Q284K1978J8236J6591l5817k7405m7061j2368
8274a84909M1150M6852R8107J50682J86148L2802r0013j35412p3156J796M792
$$ y = [-101656, -58951, -40039, -83842, -43891, 8451, -3835, 19258, 68258, 67230, 111944, 93068, 24430, 60099, 35561, 24996, 15810, 6897, 18834, -16776, -87745, -37238, 52794, 25786, -60780, -78689, 990, -37634, -86206, -98719, -201331, -181713, -148307, -156291, -120351, -99234, -169360, -137684, -113363, -88310, -88113, -72136, -18141, 86802, 49733, 34770, 47417, -19466, -36586, -995, -54172, -102936, -140500, -157452, -193811, -152394, -63892, -21042, -31479, 17365, 54533, 87251, 46865, 7918, -59528, -53520, -31817, -30501, 11594, 31574, 38114, -8586, -27314, 59410, 6866, -76579, -127347, -119063, -97085, -78849, -62258, -98075, -125480, -172541, -184909, -143759, -96907, 1200, 151882, 338030, 370832, 280819, 145407, 72251, 74047, 78839]
8263G8839q9059M5357L0799L2853j4952l9549N615o0378j8306N7997L8409n9470
8251H155m5389j07524L4683M7013k0745m6028J5839K5261k8238Q190Q5287R3773
8239G0277P2609K0777M1912K8693l495K1423l1572L6545P9422M9912Q5192P4506
8227E46201J33857R6352P2315O8531K3151J6531k7122O8118R6228J15377O3327
8216A272866J41168J64929J02158J21060J70316J58069J70736K21616L04835L44688
8206C172441M46153O62242Q64833R04086J042565J154331J173693J358027J856363
8197A2634734K826458M255875O398179R963941J6235534K6492086M0182297M9745146
8189A68734250M1452083J5608041k1359840n0811160m6432099k9846767j8553876
$$ y = [78839, -10220, 35137, 65936, 98789, 83837, 44288, 49903, -10475, -28781, 29216, 67625, 8155, -37234, -144758, -110075, -63062, -83807, -129835, -113996, -88735, -116973, -108783, -23496, 70277, 142886, 163663, 205575, 234268, 230773, 252196, 220624, 257169, 336591, 386503, 471695, 546201, 680058, 776410, 848725, 917256, 940407, 956938, 929816, 997934, 1094162, 1209539, 1272866, 1414034, 1578963, 1681121, 1802181, 1972497, 2130566, 2301302, 2522918, 2827753, 3172441, 3618594, 4280836, 5145669, 6049755, 7092320, 8246651, 9420344, 10778371, 12634734, 15461192, 19717067, 26115246, 36079187, 52314721, 78806807, 118989104, 168734250, 210186333, 225794374, 204434534, 153623374, 107191275, 77344508, 58790632]
8182E8790632j2434237q744795o203543m536772l444304k704608j966757j399759
8174A7355857j060005r19975q31180q24759p32393n40524l62197k83913j31020
8165A1669891q2209O2945J92443L18202O09619Q92523J272877J675804J872297
8156A8484392J993041J902643K115330L163421M826417P284497J1117441J7600458
8148F8487640K8900597M8297508P6855315J01758083R0784282M2397776l2822337
8141D24658864j04417923r9602163o3529793l8863513k5759280j8026473j2901473
8134F1558246r380650p019419n305000m099075l100772k341546j987509j897220
8126B6427055j891289j795019j639785j297995r59304p68812n14633j69575L7834
$$ y = [58790632, 46356395, 37611600, 31408057, 26871285, 23426981, 20722373, 18755616, 17355857, 16295852, 15375877, 14544697, 13719938, 12987545, 12447021, 12084824, 11800911, 11669891, 11587682, 11650627, 11843070, 12161272, 12770891, 13663414, 14936291, 16612095, 18484392, 20477433, 22380076, 24495406, 27658827, 32485244, 39769741, 50887182, 68487640, 97388237, 145685745, 222541060, 324299143, 415083425, 457481201, 424658864, 320240941, 220638778, 157108985, 118245472, 92486192, 74459719, 61558246, 52177596, 45158177, 39853177, 35754102, 32653330, 30311784, 28324275, 26427055, 24535766, 22740747, 21100962, 19802967, 18843663, 18074851, 17560218, 17390643, 17428477]
8117A7428477K18563K81194J71264m402Q642K34472L76454M19234P90364J349729
8107B1273991K071088L221514N042829Q081115J3029192K1423632L3603687M5422753
8099A53169801M4138674K4242477q125796m3005776m9737955l4613918k1209818
8092F4857689j3772961r645632o754554m953996l854260k964198k247939j663708
8084A9000441j285319j035070j064340j024263j042774r20228p23020o02387m02087
8075A0900953k48325P3854M09611N29457M99564m8178p13668j076213j077809
8066I249246q17431o28133m95216m15689k77574k42828k51633j93479k07826k20224
8056E499213j44856j16666j18323j38464k02181k31982j80572j09730m1875J7140
$$ y = [17428477, 17647040, 17928234, 18099498, 18095096, 18103738, 18338210, 18714664, 19133898, 19924262, 21273991, 23345079, 26566593, 31609422, 39690537, 52719729, 74143361, 107747048, 153169801, 197308475, 221550952, 213425156, 170419380, 120681425, 86067507, 64857689, 51084728, 41439096, 34684542, 29730546, 25876286, 22912088, 20664149, 19000441, 17715122, 16680052, 15615712, 14591449, 13548675, 12628447, 11905427, 11303040, 10900953, 10652628, 10726482, 11136093, 11665550, 12165114, 12116936, 11403268, 10327055, 9249246, 8431815, 7803682, 7308466, 6892777, 6615203, 6372375, 6120742, 5927263, 5719437, 5499213, 5354357, 5237691, 5119368, 4980904, 4778723, 4546741, 4366169, 4256439, 4214564, 4231704]
8046D231704o2546p5568n1563q0437j19322k05238j40874n0997r7113m9609p0256
8035C228181q2415j018R0416L1373n6522L5681K43197L19796L12490J86652Q5694
8024D393525j75538l07666m07387l43001k26722k49021q4841R6745P3499j25960
8014B643633q4485j74237j66387j42929Q1426J42493L1527N9314K8423k5320j33130
8003B260328j52849n2465k7627j07560p9918m110j7345J9113Q6121o422J00741
7992B018007K04531R6209n0955j90493j61017j83596j51512r1288K8586Q4145
7982A602617l4319J4985L876L1066j8684r3635j8744m8084j0261j35083p93n1000
7970A241941J3060j7964l9931K3329R8808J18198P7686M0474R3959J58185J47578
$$ y = [4231704, 4169158, 4093590, 4042027, 3961590, 3842268, 3637030, 3496156, 3445159, 3348046, 3298437, 3228181, 3145766, 3144748, 3235164, 3266537, 3210015, 3245696, 3488893, 3808689, 4121179, 4307831, 4393525, 4217987, 3910321, 3502934, 3159933, 2933211, 2684190, 2599349, 2696094, 2769593, 2643633, 2559148, 2384911, 2218524, 2075595, 2157021, 2299514, 2331041, 2390355, 2418778, 2393458, 2260328, 2107479, 2055014, 2027387, 1919827, 1839909, 1835799, 1818454, 1837567, 1923688, 1917266, 2018007, 2222538, 2318747, 2267792, 2077299, 1916282, 1732686, 1581174, 1489886, 1518472, 1602617, 1568298, 1583283, 1587159, 1618225, 1599541, 1505906, 1487162, 1439078, 1428817, 1293734, 1292941, 1241941, 1255001, 1237037, 1197106, 1220435, 1319243, 1437441, 1515127, 1555601, 1649560, 1807745, 1955323]
7959A955323O25j48291m5433r0920j13115O7908j8046n673O4404O4755N0200K68950
7947B050687L78091J69021k8295k11771l84247l05860m1974r7832n2624K1123
7937A496319P243L7370M3150K5944n7032r3281p8260j3902p9858j67635j51395
7926I68663r4363l5726M2608R0426L3323Q903L2625Q0699J5498N133M1334O9330
7914A258453l6440o2234j47053q1422n5454J0280Q5430M0214j8054l9159J9320
7903I73881K30941J40052J0539O4378p9039j49491p4958r1419j84175j2118o0365
7892G68226k1717Q1892O0701J0982P0550N2928M6660r9281j00252j35037j52176
7881E83476l0026p045M5386N1123j3209j5665k1566l7764k8341p365j7274q1221
$$ y = [1955323, 1955948, 1807657, 1762224, 1671304, 1558189, 1626097, 1608051, 1602378, 1666782, 1731537, 1781737, 2050687, 2428778, 2597799, 2569504, 2357733, 1973486, 1667626, 1625652, 1527820, 1475196, 1496319, 1503562, 1540932, 1584082, 1610026, 1552994, 1459713, 1381453, 1367551, 1287693, 1120058, 968663, 874300, 838574, 881182, 971608, 1004931, 1013834, 1046459, 1127158, 1142656, 1147789, 1189123, 1258453, 1222013, 1159779, 1012726, 931304, 875850, 886130, 971560, 1011774, 993720, 954561, 973881, 1204822, 1344874, 1355413, 1419791, 1340752, 1191261, 1116303, 1024884, 840709, 828591, 768226, 746509, 828401, 889102, 900084, 970634, 1023562, 1070222, 970941, 870689, 735652, 583476, 553450, 546405, 591791, 642914, 629705, 614040, 592474, 554710, 526369, 519004, 501730, 420509]
7869D20509m7977L7593P7791o455J4427k2686J7776j7631l5265J6148L0151m4817
7857D39564m2268k6201m3074k1049O2224M9156J2026k4964j02253m801J1668K5321
7845C35349P1650O661m6447k5661m9715k2402n5122k5137L4395K4309M4591M8461
7833C40932j1385M2415q22n2728m1492n4126m0241L0569K9377K5735Q9805M9780
7821D07819q0010o7548L4327J5942M0840m0620o1698O170l1437K3325M3472K0997
7809C11579M992k6566k033K7595J6265j6637q8639P369l5346K8123L1089n0745
7797B07046Q1363q4085N8611O5569l5837Q524K7371j2713L0135J89710K75589
7786H11283J86633J40570J08684R5949n7116l10898k73321m9781m4562j01430
$$ y = [420509, 372532, 410125, 487916, 481461, 495888, 473202, 490978, 473347, 438082, 454230, 484381, 439564, 397296, 371095, 328021, 306972, 369196, 418352, 430378, 405414, 303161, 298360, 310028, 335349, 406999, 413660, 367213, 341552, 291837, 269435, 214313, 189176, 223571, 247880, 292471, 340932, 329547, 371962, 371140, 318412, 276920, 222794, 182553, 213122, 242499, 268234, 358039, 407819, 327809, 260261, 294588, 310530, 351370, 310750, 249052, 255222, 223785, 247110, 290582, 311579, 316571, 290005, 287972, 315567, 331832, 315195, 226556, 233925, 198579, 226702, 257791, 207046, 288409, 204324, 262935, 328504, 292667, 301191, 328562, 315849, 345984, 535694, 811283, 997916, 1138486, 1247170, 1343119, 1286003, 975105, 701784, 652003, 607441, 506011]
7776E06011j07696o2920j3127M7229K2949O0537l813q5680o186o3657j6975K7555
7764C04227l4725n1995n7166n7973P4933K1981L938L7738N7638K39N7754M0821
7752C97410o4113L3095p7959K5422Q5966J3186J0004P4008J39310J15379K43738
7741I95446N02371N56933L92087J80249k17011n51256m58044k49206k35828k42217
7731F73524j19908j2975l317m0953j13724m9943p5219j5082K2147N3375O1174
7720C79099K7157j4688m6202m8783q697L6580L1821l4572K346q3890k0427K0307
7708B40051j3622N1816j04332n9905N5474J26127P8921j7881j07894Q418J64006
7697D21179J33073J19566J95442J37956J32248L1461j61567j67900k24572r3504
$$ y = [506011, 398315, 335395, 322268, 369497, 392446, 452983, 449170, 363490, 357304, 293647, 276672, 304227, 269502, 217507, 160341, 102368, 177301, 199282, 203220, 240958, 298596, 298835, 356589, 397410, 333297, 366392, 288433, 313855, 399821, 413007, 423011, 497019, 636329, 751708, 995446, 1497817, 2054750, 2446837, 2627086, 2410075, 1858819, 1400775, 1151569, 915741, 673524, 553616, 540641, 537324, 496371, 382647, 332704, 257485, 242403, 264550, 317925, 379099, 406256, 391568, 345366, 296583, 287886, 324466, 356287, 321715, 324061, 240171, 219744, 240051, 226429, 278245, 173913, 114008, 169482, 295609, 374530, 356649, 248755, 257173, 421179, 554252, 673818, 869260, 1007216, 1139464, 1170925, 1009358, 841458, 616886, 523382]
7687E23382j41776p2665N6931n2200r772M5176p0868j0813n6761J8958K2568k8512
7675B23648q2155M082M9828M2554l0889o5513k4643N6482k7372J6701J13886j1615
7663B64994o951j5390m1873L8115l053q8604M9978m0691n9957M0822M1296l7660
7651A41026p126l1745M496N4268p8130k4158k0903q554J8919K5983M965K2443
7639A01484K9201M5974l4101l3429l0231L7044M1948J6849m0873q4282K9989M0014
7627A19587J6844m2538n586P5027m94r769M1855J00309J2881n8604r3649j1705
7615A44158M4409o1426l6995m664k6880l0763K844q4233L7846J64249M4697o3398
7603A29844m3694M6718J511l9339m4820R5708L8596J2831m4673n5031n7127j5623
$$ y = [523382, 381606, 308941, 365872, 313672, 303900, 349076, 278208, 267395, 210634, 229592, 252160, 223648, 141493, 145575, 195403, 237957, 207068, 141555, 116912, 173394, 146022, 162723, 276609, 264994, 258043, 242653, 200780, 238895, 235842, 147238, 197216, 156525, 96568, 137390, 178686, 141026, 133900, 102155, 106651, 160919, 82789, 58631, 37728, 29174, 48093, 74076, 79041, 101484, 130685, 176659, 142558, 109129, 78898, 115942, 157890, 174739, 133866, 49584, 79573, 119587, 136431, 93893, 88307, 163334, 162840, 153071, 194926, 295235, 308116, 249512, 155863, 144158, 188567, 127141, 90146, 85482, 58602, 27839, 30683, -53550, -15704, 148545, 193242, 129844, 86150, 132868, 134379, 95040, 50220, 145928, 184524, 197355, 152682, 97651, 40524, 24901]
7591B4901N5330L7767L539L5152K8029r7311l9219M9919K4283L4289o692o7366
7579H2621K3860M5547K2107J8020q138l6848K2689q8498N7992O9336j3823J2377
7567B07242J7762m9981N5567k7347j6559n617n8446p3809k3318J6119k9562O1556
7555G3607Q3490J6201j5716L1189j5994K5417p802n7426J4921K8999j7457m7085
7543A12344M0476Q6288P2441n8302k6311N295o3706K127q4662p959Q179m6036
7531D0174J6891p732M9051q9934P470M8448p0439Q866P6477R000l1762R6380J5576
7518A68466l4509j09818p4230J3265N3626Q3751L8589m5718m9858m5031j24408
7507a25875L5926O8073M7349P637K1422j4344l3283l9874L1030O7413l674R456
$$ y = [24901, 80231, 117998, 121537, 156689, 184718, 87407, 48188, 98107, 122390, 156679, 149987, 82621, 106481, 152028, 174135, 192155, 184017, 147169, 169858, 81360, 139352, 208688, 194865, 207242, 225004, 175023, 230590, 203243, 186684, 181067, 122621, 48812, 25494, 41613, 12051, 73607, 157097, 173298, 157582, 188771, 172777, 198194, 190392, 132966, 147887, 176886, 159429, 112344, 152820, 239108, 311549, 253247, 226936, 232231, 168525, 170652, 85990, 78031, 86210, 40174, 57065, 49333, 98384, 8450, 15920, 64368, -6071, 2795, 79272, 88272, 56510, 152890, 168466, 133957, 24139, -50091, -36826, 16800, 100551, 139140, 93422, 43564, -1467, -125875, -89949, -21876, 25473, 33110, 54532, 40188, 6905, -32969, -1939, 65474, 61800, 71256]
7495G1256O9135o7598q442j2644p619J28580L5795o6918L3810K4579r0524j08598
7483H12l9376M2514J9035Q3813M6700l8208K4982Q6040l4845l1938r7636l7154
7471B4739j6491l3132P840K3672J05611K6727j05717M7695Q6943o3848p8458j9522
7459F059N6979L7330L77l3376J0428j28811o0559J8692J6310R9694J34169N1426
7447B08718l3692N3347l0855n1226l2395L9583p906l1407r4927j3350O5535n0134
7435B1291k4732K5040R31O4437P5840O5053l3052j34170l1612K1648k9833M586
7423B5427P3193q123J0733N974Q7478L0446l0374n267j28419j20299L139J37230
7411H1138o725J5591L5232j1689K5573p7453o2056k8149J3179L6694k5148q118
$$ y = [71256, 140391, 72793, 64351, 51707, 44088, 172668, 208463, 141545, 175355, 199934, 109410, 812, -38564, 3950, 22985, 106798, 153498, 115290, 140272, 226312, 191467, 159529, 61893, 24739, 8248, -24884, -17044, 6628, 112239, 138966, 33249, 80944, 167887, 104039, 25581, 6059, 63038, 100368, 100745, 67369, 77797, -51014, -111573, -92881, -76571, 23123, 157292, 208718, 175026, 228373, 197518, 146292, 113897, 153480, 145574, 114167, 19240, 5890, 71425, 21291, -3441, 21599, 22530, 86967, 162807, 227860, 194808, 60638, 29026, 50674, 20841, 25427, 98620, 90497, 101230, 107204, 194682, 225128, 194754, 189487, 61068, -59231, -56092, 81138, 74413, 90004, 125236, 113547, 139120, 61667, -389, -28538, -15359, 21335, -3813, -11931]
7399a1931K0662J20051R6737N601m317o8731m1881N9770j3328n4155o9845n1857
7387a3224N1531N0385K4447n2219N7533M7516L5692j7241j47564K8374N7492J9275
7375A41997Q688k4080J4364k9465p5472p1224J05554J1745P0899N3495l6159O6775
7363B37117K7198l9687j0807j32491K0049J9127N0880K4057j00290o3504j31525
7352i9876M6637J8982K1394J4790k7492k1021O1911R8353J1901l6535K2310J8379
7340A29733j08555m2317K5777L0394K0574O1614J12130j059o3667n3326o8564
7329D2734n813j4111N4468O6178m6327q3423l4508N0896P1102K0262L972M6677
7317A72107J7899k6587l6228J188K9595J6554j5449j9364r6014J5585o576P942
$$ y = [-11931, 8731, 128782, 225519, 231120, 226803, 158072, 116191, 175961, 162633, 108478, 38633, -13224, 38307, 88692, 113139, 60920, 118453, 165969, 201661, 184420, 36856, 65230, 122722, 141997, 150685, 126605, 140969, 111504, 36032, -35192, 70362, 82107, 153006, 206501, 170342, 237117, 264315, 224628, 213821, 81330, 101379, 120506, 171386, 195443, 95153, 31649, -99876, -53239, -34257, -12863, 1927, -25565, -46586, 15325, 113678, 125579, 89044, 111354, 129733, 21178, -21139, 4638, 35032, 55606, 117220, 229350, 228291, 164624, 111298, 42734, 36921, 22810, 77278, 143456, 97129, 13706, -20802, 30094, 101196, 121458, 125430, 172107, 190006, 163419, 127191, 128379, 157974, 174528, 159079, 139715, 43701, 59286, 52710, 60652]
7305F0652M8071J7562J5794k2940j2132N2759P0406k7563q5989j39030m57J9638
7293c229K4065O3604M1905k4104m3590l077P2199P3355p0188j7945k9108m4543
7281C9344l464q958Q8721N2167p2341r7757k6109N0954l989N864O9985P7797j1394
7268A60820m2164j65413m9470K5902K6568K8576N6340k1582m516N186l7797K8015
7256A0465L2570k38K9684m1005l6386m8753O070m0152M6645O2809j8379J27592
7244A30922P8293j29197n7490L6205o36k2582J3019l9237l0530Q4105O8188n9717
7232G1343K7607N7970L7869j19213k8700N9616J9305q7648l5148k4212l4749o5830
7220a21790J8565M9799Q5900k6497K4268L2680J5221q4598k5553N9708m7024O204
$$ y = [60652, 108723, 126285, 142079, 119139, 107007, 159766, 230172, 202609, 116620, -22410, -22867, -3229, 20836, 84440, 126345, 102241, 58651, 55574, 127773, 201128, 130940, 112995, 83887, 39344, 35880, 26922, 115643, 167810, 95469, -2288, -28397, 22557, 18568, 24432, 94417, 172214, 160820, 118656, -46757, -96227, -70325, -43757, -15181, 41159, 19577, 15061, 20247, -17550, 10465, 43035, 42797, 72481, 31476, -4910, -53663, -47593, -87745, -41100, 21709, 3330, 130922, 209215, 80018, 22528, 58733, 58097, 35515, 48534, 9297, -21233, 62872, 131060, 71343, 98950, 156920, 194789, 75576, 46876, 106492, 125797, 38149, 3001, -21211, -55960, -121790, -103225, -53426, 32474, 5977, 30245, 62925, 78146, -6452, -32005, 27703, -19321, -13117]
7208a3117M4951N7903Q9217L4528q1334l3774J7366n1544p7652o2382O8083Q6588
7196G8833L5455K7814J11845Q564p6578j21086r7387q6091n485R9330Q0662J5491
7184G1367j4071J5050J1488j2424J0697K7372j1364P367J1712l2291J5529j1192
7172H9240o2339o5740j1222J12M6122O5626L7066o961Q870L9438j1967j10919
7160A7326k5303J9816L2412p6770j4914N3023Q3568m285j2394K1921k2366J8660
7148I0694K0658Q835K495L2798j6805K8799n6873j0711r3395p2457Q1240Q7822
7136A03100M2756j00580k6437N3499o0817l1501J60064P4288L8353m1020k7842
7125A83863l2502k2134j03815o5052J1779K6557O2938O4186J9731k6889k5585
$$ y = [-13117, 31834, 89737, 178954, 213482, 132148, 98374, 115740, 64196, -13456, -75838, -7755, 78833, 114288, 142102, 253947, 262511, 185933, 64847, -32540, -118631, -124116, -24786, 55876, 71367, 57296, 72346, 83834, 71410, 82107, 109479, 98115, 105482, 117194, 84903, 100432, 89240, 26901, -38839, -50061, -49949, -3827, 61799, 98865, 91904, 100774, 140212, 128245, 17326, -7977, 11839, 44251, -32519, -47433, 5590, 89158, 84873, 72479, 94400, 72034, 90694, 111352, 120187, 122682, 155480, 138675, 167474, 110601, 99890, 6495, -65962, 15278, 103100, 145856, 45276, 18839, 72338, 11521, -19980, 140084, 214372, 252725, 211705, 183863, 151361, 129227, 25412, -39640, -27861, -1304, 61634, 125820, 145551, 118662, 93077]
7114I3077j09403k1118m9004J1217R736l1908Q3991M1958j8595L6949L2904L9434
7102A19238K2636n8627R3509J2575l3505k0030k4794O03N319J6310n7628j8945
7090E6661k2601J35778K0331j7636J110j11110k5559L1822K5591L6520k6357j09863
7078e313p0071K0150J7308P1455Q5518m0596k6791P944J0894N1594n4055o854
7066F1183k0664M5352l3449p817j7434m9164K0237P612M4141R306R961J201p1463
7053i98J1300M4444K9592n2034l2606l8763k2597L9871L0163P3717j5834n4043
7041A2212l8027r023L7510K4818j0896k4789K2570n0233L5087R200o6297l7146
7029i5014J7872r180r5173M243P2135J14274O406l3881M7444r5435r1857o19Q7218
$$ y = [93077, -16326, -37444, -86448, -75231, -65495, -97403, -13412, 28546, 9951, 46900, 79804, 119238, 141874, 83247, 176756, 189331, 155826, 135796, 111002, 111605, 116924, 133234, 75606, 56661, 34060, 169838, 190169, 172533, 173643, 62533, 36974, 68796, 94387, 130907, 104550, -5313, -75384, -55234, -37926, 33529, 119047, 78451, 51660, 59604, 70498, 122092, 68037, 61183, 40519, 85871, 52422, 44605, 27171, -21993, -1756, 5856, 49997, 59303, 69264, 70465, -998, 10302, 54746, 84338, 32304, -302, -39065, -61662, -21791, 8372, 82089, 66255, 12212, -25815, -34838, 2672, 27490, 16594, -8195, 14375, -35858, -771, 8429, -57868, -95014, -77142, -86322, -181495, -177252, -105117, 9157, 15563, -18318, 29126, -66309, -158166, -158785, -71567]
7016g1567J00218q9758m0025O0269J37979m0905p7442M9165N2273J7938k8155
7005F9990j2048M8833M5612q937j02755n003P3512N7846J3464n9231j01794o5391
6993d5902J5877R651L0406k0184J395K0715m7577n4382J07670J1540r5097K2424
6981d3464P206L224M379L1344n5922o8506N1299J5735K8559r0483J4023J27009
6969B4403n3566n2506L1932P9730n3349j989k3592P5580O1215K5794L4153k4689
6957A23116p5551o3500L2847k6656m8492l2843L716N3950J10785k3740j4288J0483
6945D9827j4332m7733J5815N7110J01441j0661m5002q016P284n4791j14076l6387
6933i9521L2027M1304j9767l9660l9387j8402Q5596M3145m3169k6424j4983R1639
$$ y = [-71567, 28651, -61107, -101132, -40863, 97116, 56211, -21231, 27934, 80207, 98145, 69990, 57942, 106775, 152387, 143450, 40695, 35692, 109204, 167050, 180514, 121283, 19489, -45902, -30025, -20374, 10032, -10152, -8757, 11958, -35619, -90001, 17669, 29209, -65888, -43464, -36258, -33034, -28655, 2689, -53233, -121739, -70440, -54705, -26146, -116629, -102606, 24403, -29163, -81669, -49737, 29993, -23356, -25345, -48937, 26643, 87858, 113652, 147805, 123116, 47565, -15935, 16912, -9744, -58236, -91079, -87363, -33413, 77372, 53632, 39344, 49827, 35495, -12238, 3577, 60687, 162128, 151467, 106465, 98449, 105733, 50942, -63134, -99521, -67494, -26190, -45957, -85617, -125004, -143406, -57810, -14665, -57834, -84258, -99241, -7602]
6921g602j5680m596J8123L4791j04029m3789N5351N310O5359O8355j4489p174
6909D9930K4995J6311j9621o1708j01287p221J1393K0223N8131N7620L8837J4235
6897A01838q1150n5462L1024j2235n0428N8268N4796L4775N8611k5440o892l5840
6885G1865o463L8746J0237k016r7k6923j1542J8532J5113j0229o0943o6283j1841
6872d1844J9821m6922P7014P8239J5325j3392j4832K6365o1687q4321M6356Q3065
6860H3187N6349k6783m0458l4076p7576K5448L2492n9648N0737K3900j1672n9410
6848c7510L1255j0002o0442Q9537K7904k38j1056k0864j7445n1102M2813m325
6836b1475J58N5188j19278j7693M4842K6132j8961J9930L3322q1767J1375J0568
$$ y = [-7602, -23282, -27878, -9755, 25036, -78993, -122782, -67431, -62121, 3238, 71593, 57104, 49930, 74925, 91236, 71615, 9907, -91380, -98601, -87208, -66985, -8854, 48766, 87603, 101838, 20688, -34774, -3750, -15985, -66413, -8145, 46651, 81426, 140037, 114597, 107705, 71865, 65402, 104148, 114385, 112369, 112272, 85349, 73807, 92339, 107452, 97223, 36280, -30003, -41844, -22023, -68945, 8069, 86308, 101633, 88241, 73409, 99774, 38087, -46234, 122, 83187, 139536, 112753, 72295, 38219, -39357, -13909, 18583, -41065, 9672, 33572, 21900, -37510, -6255, -16257, -76699, 12838, 40742, 40504, 29448, 8584, -8861, -59963, -17150, -21475, -21317, 33871, -85407, -103100, -58258, -32126, -51087, -31157, 2165, -79602, -68227, -57659]
6824e7659k1374k0152O6298m035L5243l02L5191K0488L6943J080K1531K7110j7326
6811A23036r9536m9020M0464p465L9751P7387L9535j7117n1629L1309k3056K116
6799A05775l1481q0938Q1010J90634J0178j34539k9434M1875l9002N222R5755
6788B15055p6366m7763n0171n8062l9672L0338q7034M8997O8393O7630k8090j4717
6776B8538O3829j2703n3616J02824M4462n1119L1087p7093K3383N3429l3437k1691
6764I7893k8126j1795K2973o6348q593J4455m8009M9180L8689R8161J0844j30499
6752C8825p0883m5333k427Q6517m442J4905J9431m5586L746J13978m090o097r7990
6739E54J9598L5885J3287L889l4758J8289J8315k3601k3371q8684o0736O3852
$$ y = [-57659, -79033, -99185, -32887, -36922, -1679, -1981, 33210, 53698, 90641, 91721, 113252, 140362, 123036, 23500, -25520, 14944, 7479, 47230, 124617, 164152, 147035, 95406, 126715, 103659, 105775, 74294, -6644, 74366, 265000, 275178, 140639, 111205, 153080, 114078, 119300, 215055, 138689, 90926, 40755, -17307, -56979, -26641, -113675, -64678, 3715, 71345, 43255, 28538, 92367, 79664, 26048, 128872, 173334, 122215, 153302, 76209, 99592, 153021, 119584, 97893, 69767, 57972, 80945, 14597, 6004, 20459, -27550, 21630, 60319, 158480, 169324, 38825, -32058, -77391, -79818, 6699, 2257, 17162, 36593, -8993, -5247, 108731, 104641, 98544, 554, 20152, 56037, 69324, 73213, 38455, 56744, 75059, 51458, 28087, -60597, -121333, -57481]
6727e7481J08187N2420j30486j48063k9672J2925R9381J11924l5200O7679j3804
6716C7810o7945j6759n1365m3614j8781P1733M7753L9777K4959P505k3045k0142
6704a2114j8188J1149J4773N5611L2572Q0012M3229o7766p8216J8441O7415p499
6692A39419n7505R017l6006K5846L7112J3533n4410l3681L3446J2855m7936n7214
6680a5524o401n1679N517P7221J4421k3220O2401n9488L1312J7185J0384M5041
6668A07170J09560p3641j26737M4579J491j1007p3164p2737O972J59113R987j7880
6656F3706N0129j7810j00910j24411J2097M6659O3863L309J1138k1546M796O7875
6644E8895N5983n276N0562L0766n9123q9696k4385m708J02044J0307o1076N2203
$$ y = [-57481, 50706, 103126, -27360, -175423, -205095, -192170, -92789, 19135, -16065, 51614, 37810, -30135, -46894, -98259, -141873, -160654, -88921, -41168, -1391, 23568, 31073, 8028, -12114, -30302, -19153, -4380, 51231, 83803, 163815, 207044, 139278, 61062, 79503, 146918, 139419, 81914, 90931, 54925, 80771, 117883, 131416, 77006, 43325, 76771, 89626, 41690, -15524, -21925, -73604, -68087, 9134, 23555, 335, 62736, 3248, 34560, 51745, 62129, 107170, 216730, 143089, 16352, 60931, 62422, 51415, -21749, -94486, -87514, 71599, 81586, 63706, 113835, 96025, -4885, -129296, -117199, -70540, -6677, -3368, 7770, -13776, -8980, 58895, 114878, 109602, 160164, 190930, 131807, 42111, 17726, 13018, 115062, 125369, 64293, 116496]
6632A16496R804l0999p438k0367L7400l3634n6627k7638k5301K2603J4745m5694
6620d6650K6278J4756Q255K5901Q128m7213j03194J3154L9420K663M3703L2503
6608A7704k3089r1196n8939R6885Q4724O0896m0899k0048q1891n7068N7949L8655
6596a6317K7001n0951J9744R8563M9700j2379K5456N9792o5071j8478N9402q1642
6584I4820q3935n8434r918O504N8379m913N940R4290j1425k0902m4517j02456
6572g6567K9925P7581n4712J9560L9201K4118n0507o2204J9472L0490l3482q5082
6560a22207N1620J53336O3119p8601M1135N3318o1346k262J6303K6327N4507q915
6548A86334n0636J2446M2602O0485p6436j6216m8813m5073j5366l9440m97K9758
$$ y = [116496, 126300, 95301, 87863, 67496, 104896, 71262, 14635, -13003, -38304, -15701, -956, -46650, -20372, -5616, 2639, 28540, 36668, -10545, -113739, -100585, -61165, -58502, -14799, 17704, -5385, -96581, -155520, -58635, 26089, 86985, 46086, 26038, -55853, -112921, -54972, -16317, 10684, -40267, -20523, 78040, 127740, 115361, 140817, 200609, 135538, 117060, 176462, 94820, 10885, -47549, -57467, -50963, 7416, 2503, 8443, 102733, 91308, 70406, 25889, -76567, -46642, 30939, -23773, -4213, 34988, 59106, 8599, -53605, -34133, -3643, -37125, -122207, -70587, 82749, 145868, 67267, 108402, 161720, 100374, 98112, 114415, 140742, 195249, 186334, 135698, 148144, 190746, 251231, 174795, 158579, 109766, 64693, 49327, 9887, 9390, 39148]
6536C9148o5680k5751Q6559n4717K3167R2697P1555j21205n349Q77q2972M9981
6524H310O2266P280l8472n3446n8064L7239K4279L1409N2128k2477q0462J3445
6512a6565N4824l7414j09467l6458J10436M0463l1814m4063R6119L2331j15539
6501e7147n7303O8068M5473M425j4003P4664m6086m8610o0838k451J01630L1983
6489C9805J1334p418m238O268K4490L8648K4389m1723j6825N569j3227p1223k8409
6476c2560Q375O5889N9753K7590j02892r5256M2488P0618l6225p6929o5637p7911
6464b12697m975k3657J22614J31557L590q186n1209K0713j16631j07294N3635
6453a92540P0589Q3082K0131q7586j1827O1826K9209p1467N0075R6165L4449j8179
$$ y = [39148, -26532, -52283, 34276, -20441, 2726, 95423, 166978, 45773, 40424, 41301, -41671, 8310, 70576, 77856, 39384, -14062, -72126, -34887, -10608, 20801, 72929, 50452, -30010, -16565, 38259, 845, -108622, -145080, -34644, 5819, -25995, -70058, 26061, 58392, -57147, -114450, -46382, -909, 3516, -10487, 64177, 18091, -30519, -91357, -93808, 7822, 39805, 51139, 43721, 39483, 45751, 70241, 108889, 133278, 91555, 74730, 80299, 67072, -4151, -32560, -24185, 41704, 101457, 129047, 26155, -69101, -26613, 44005, 7780, -69149, -134786, -212697, -217672, -241329, -118715, 12842, 16432, 8246, -42963, -22250, -138881, -246175, -192540, -121951, -38869, -18738, -106324, -118151, -56325, -27116, -98583, -48508, 47657, 82106, 63927]
6441F3927j05993k5363J41705P1633j44538p1282J7287o8169j05321R4354J42724
6430A0964o3037J1097Q4804L5022m8818J2514N041q7880j1573L8607L2354J5528
6418C4623J4331m5688j5806K878o4732l5938M6811L3453M9358J5853J7404k94
6406E2253k2598J0240R9173R0804o0786j62513r7675K1860Q8408K0561J4254J2471
6394F6452m7730j55481J7916N1780r915k7999K2364K017n2451J12166J02538J8783
6382A00440J2372j0878M6309k0136j4131m7337o7760L1588N5961m6534j8119n2924
6370c1149l3015j01680r0418L6683J13094P6779N6092M4664m1484m8812j01L0400
6358A1053M0993k373m4757P4497M9740p2226p745j5554j9426q204n0209o3734
$$ y = [63927, -42066, -67429, 74276, 145909, 1371, -69911, -52624, -120793, -226114, -131760, 10964, -52073, -40976, 43828, 78850, 30032, 42546, 47587, -40293, -51866, -13259, 19095, 34623, 48954, 3266, -12540, -9662, -74394, -110332, -63521, -30068, 19290, 35143, 52547, 52253, 29655, 39895, 139068, 229872, 169086, 6573, -91102, -69242, 19166, 39727, 53981, 66452, 18722, -136759, -118843, -67063, -76978, -104977, -82613, -80596, -133047, -20881, 81657, 100440, 112812, 101934, 148243, 128107, 113976, 66639, -1121, 30467, 86428, 39894, 21775, -31149, -64164, -165844, -256262, -219579, -106485, -29706, 26386, 71050, 29566, -19246, -19347, 11053, 52046, 49673, 4916, 79413, 129153, 56927, 49182, 33628, 14202, 5998, -44211, -107945]
6346a07945l096L804K9361M5478K3993j01470L0376J9138m693M753q141Q0004
6334A1562M2583L922P559m1322p8214K4643j2792N329K216K2970J2204K383K5355
6321B8398K2774l8427l9647M556K9317n2899M81Q0794J7868q6223k565P4912J9803
6308E9142n1682K4765o8035l5636P6699L0436L2764p1184k49P3432j0472k9326
6296C0654o6083l7125p9608L8299J72811J15002K2506L4172m9486r1337K799p2689
6284A9915m9986p2104R3282O1969k9044J4567k7247o2271l5221m7465K1183L7381
6272g5041O2098J9366p095M5872k5233m7970o0328p0398L9679P4949k0j982Q0835
6259C4732O821l6317n1789P9677L524j401L8334K0692q6732m7119J1214K9674
$$ y = [-107945, -111041, -107237, -77876, -32398, -8405, -109875, -79499, -60361, -65054, -60301, -68442, 11562, 54145, 58067, 65626, 24304, -53910, -29267, -42059, -36730, -34514, -11544, 660, 3043, 28398, 51172, 12745, -26902, -22346, 6971, -45928, -45447, 35347, 53215, -33008, -35573, 39339, 59142, 7460, 32225, -35810, -71446, 5253, 35689, 68453, -2731, -2980, 70452, 59980, 30654, -35429, -72554, -152162, -113863, 58948, 173950, 196456, 230628, 181142, 89805, 92604, 19915, -30071, -102175, -8893, 53076, 24032, 38599, 11352, -50919, -86140, -133605, -112422, -75041, -12943, 6423, -672, 45200, 19967, -28003, -88331, -158729, -119050, -44101, -44121, -46103, 34732, 41553, 5236, -46553, 33124, 36648, 35247, 73581, 94273, 7541, -39578, -28364, 1310]
6247A310N629m0371M4478R777p0063J3756j1584l8387L5398P2240L4215l8817
6235A7581J2290K4525n5970o4553j0721k612L6865k3744L4598m8632k7321O2005
6223d5689J01873J2815p2885m490j585K1123J8348j1177L1004l9059j3126q311
6211a1159m8747L7791O4042K5888J6254n0810o4105j568J698L5390J3629q405
6199I898j3273J954l9903o1382m1719r3209J9020Q0116J37165L4170m682L0735
6187E8890j2162r3156k2101J8177l2502K6385J2976p772L7911r2571J4851O7019
6175b4055O4099M1190m8015p0836m3372K5635L597M1217K1896o797K9978q0024
6163d5487Q325R081K2994k8050Q0644J10699n0583p8987j40995k4569J13203k3346
$$ y = [1310, 6939, -33432, 11046, 20823, -49240, -35484, -47068, -85455, -50057, 22183, 56398, 17581, 29871, 54396, -1574, -66127, -76848, -79460, -42595, -66339, -31741, -80373, -107694, -45689, 56184, 68999, -3886, -8376, -9961, 11162, 29510, 18333, 49337, 10278, -2848, -11159, -59906, -22115, 41927, 67815, 84069, 33259, -30846, -32414, -30716, 4674, 18303, 9898, -3375, -1421, -41324, -102706, -144425, -237634, -218614, -138498, -1333, 32837, 28155, 58890, 46728, -46428, -68529, -50352, -82854, -56469, -43493, -51265, -13354, -105925, -91074, -24055, 40044, 81234, 33219, -37617, -80989, -55354, -51757, -10540, 11356, 4559, 34537, -45487, -37162, -28081, -5087, -33137, 47507, 158206, 107623, 28636, -112359, -136928, -23725, -47071]
6151d7071o3558K1524L8369J12093O4283Q519k1046m3227n6706j01444K4547M8545
6139a5172k4953m3303q289P3910J9625n8900k7198K9691J04723N1061K7433p409
6127A21219m1314J9513r28m5384r5418O6758J7774m2749n7766r3873p7227m2158
6115b71553K4276Q6112j6429j04691J02979M0953N4884M2618j4406M0333m3370
6104e8294K656P0934k1162q8741k7879L2326L460j5990k7626J6347n40R554l1210
6091a36165J04141P3547J6759K575n9971l7283m154l0814K4929N1010j3481l5643
6079d4550k0259Q184L0040O463j711J4172j5010L5647M9295k4143j637M8746l5461
6066D9776j4482j4255j02502q3165R665P01Q5488P7504R3118L2108p1936n0775
$$ y = [-47071, -110629, -89105, -50736, 61357, 125640, 134159, 113113, 69886, 13180, -88264, -63717, -15172, -40125, -83428, -91717, -17807, 1818, -57082, -84280, -54589, 50134, 101195, 128628, 121219, 79905, 99418, 98490, 53106, -42312, 24446, 42220, -529, -58295, -152168, -229395, -271553, -247277, -161165, -177594, -282285, -179306, -138353, -83469, -40851, -55257, -14924, -58294, -55638, 15296, -5866, -94607, -122486, -90160, -86700, -102690, -130316, -113969, -114509, -104955, -136165, -32024, 41523, 58282, 60857, 886, -36397, -40551, -71365, -46436, 4574, -8907, -44550, -64809, -56625, -26585, -20122, -21833, -7661, -22671, 12976, 62271, 38128, 36491, 85237, 49776, 35294, 21039, -81463, -164628, -154963, -154262, -68774, 8730, 101848, 133956, 62020, 11245]
6054A1245Q7380l9022q8822l7837p818O7701j0678m3434p2016O6381N9982p834
6042a4772o2827K8227K9620P7149j7896K0537k7295p4234l0799O820J3583k7836
6030g9723J27683L3340r189K0151j8273q9680P103m122k4142l645N7267J6824
6018C3594m8104k4322l6706J8283M0981K1854j6888j3654l9818j8042j0085M6357
6006d6550J01241P033J0632J6216P68m2379o4415J4771K4823k5189n5193R7497
5994C9255N6986J6076o429K3208r6670r9872p8775m330J9999L6800J10980n952
5982A1276n9971l7650K1230j3582N7099l419K937r494k1061j0509K4447M5350
5970F653n9257Q1671M6777q9075J4438K7853L7077n7255q2126m6915k4404J180
$$ y = [11245, 98625, 59603, -29219, -67056, -74874, -7173, -17851, -61285, -133301, -66920, -6938, -14772, -77599, -49372, -19752, 57397, 39501, 60038, 32743, -41491, -72290, -65470, -51887, -79723, 47960, 81300, 72111, 92262, 73989, -15691, -8588, -12710, -36852, -40497, 16770, 33594, -14510, -38832, -75538, -57255, -16274, 5580, -11308, -24962, -64780, -82822, -92907, -46550, 54691, 61724, 72356, 88572, 89340, 46961, -17454, -2683, 22140, -3049, -58242, 39255, 96241, 112317, 105888, 129096, 32426, -67446, -146221, -150551, -130552, -93752, 17228, 11276, -48695, -86345, -65115, -78697, -21598, -25017, -22080, -31574, -52635, -63144, -38697, 6653, -52604, 29067, 75844, -13231, 1207, 29060, 66137, 8882, -73244, -120159, -144563, -143383]
5958a43383p16O635L7012P8898m4376l0345O1501L6382J8209J9951p8155q2645
5946a21032m3696O6728M7361j8328N9111J2142J1699k2118K3621M4785n3174o5403
5934e8304M4649K6376J6140M7928m7449k1007J7843m233k5242O3825j6930j0388
5922C3208P359K2886R5944M5872n7641k0842l3617j57919j02144J11162o2471
5911a18203r7497N6969J25118L8452j6022j2033m1916Q9414o852L1283l0854j1797
5899F062K115l5790l0288L4307Q3129L7456K3653L4041k6202N170j9684M262o0664
5886E7567m1995n2252K8143P3349m8858N8417K7081k4586j4415K0314R783n6111
5874C6437n8301q1741l9659o5499l6148J11312R9776P1576K3361J7205l7461L8729
$$ y = [-143383, -144099, -137464, -100452, -21554, -65930, -96275, -34774, 1608, 19817, 39768, -38387, -121032, -164728, -98000, -50639, -68967, -9856, 2286, 13985, -8133, 15488, 60273, 7099, -58304, -13655, 12721, 28861, 76789, 29340, 8333, 26176, 21943, -3299, 60526, 43596, 33208, 40567, 63453, 159397, 205269, 147628, 126786, 93169, -64750, -166894, -55732, -118203, -215700, -158731, -33613, 4839, -11183, -23216, -65132, 24282, 17430, 48713, 17859, 6062, 8177, -27613, -57901, -23594, 59535, 96991, 120644, 154685, 128483, 133653, 113969, 118231, 57567, 15572, -36680, -8537, 64812, 15954, 74371, 101452, 76866, 62451, 82765, 92548, 36437, -21864, -103605, -143264, -208763, -244911, -133599, -33823, 37753, 61114, 78319, 40858, 79587]
5862G9587j9650L9928L5079k3448n866n9937L9214o231m4240P8753R541o7278
5850E5452j14534j20802K8568M724K8399L7546L2129J09311k9372j00316J1498
5839e7397L1085j9013P490L8082L1509k7828l6040j0836J2499L2163o1956l0720
5827i0962j5065j3601p2819P6953Q1682k9176m4598k8028M0478m599j04908n753
5815b10396Q0843N2497K3343O3320m1913O960K1324j3159N7534K6046l9261p8029
5803e0891n8050l831O3268L804o5612j07140O3564J05795J844r07m8922L0420
5791f6658P223l9454k8484L5255L7079o2831l2882M2259J12606N8843J2443m7766
5779B7633q2356n4969j0937R7510K7889l9130j3392l4509o056J5618N6378M7371
$$ y = [79587, 59937, 99865, 134944, 111496, 105630, 45693, 84907, 78676, 34436, 113189, 122730, 55452, -59082, -179884, -151316, -146592, -118193, -80647, -48518, 60793, 31421, -68895, -57397, -26312, -45325, -37835, 247, 31756, 3928, -32112, -42948, -30449, 1714, -60242, -90962, -106027, -119628, -192447, -115494, -33812, -62988, -107586, -135614, -95136, -99735, -204643, -210396, -129553, -77056, -53713, 9607, -32306, -25346, -4022, -17181, 40353, 66399, 27138, -50891, -108941, -112772, -49504, -45700, -111312, -218452, -154888, -49093, -47249, -48156, -97078, -66658, -59435, -98889, -127373, -92118, -55039, -117870, -150752, -108493, 4113, 62956, 75399, 27633, -54723, -109692, -120629, -23119, 4770, -34360, -47752, -82261, -88317, -72699, -16321, 31050]
5767C1050J7467j7655L4443J7684m2981l9061k3908l8295O860j4765K108j8147
5755h5200K7458L5011k6384j1527L5287R148L1929k0654j17417J5250J5052L2778
5743e9269M2196q628m7182Q0718N1013j04063n2542K5976M4718M7709o4896r0923
5731a35173k1409r411K1932K5598k0285N1820N526J3955K1567j5272j6306l4111
5719a11569J18437Q3529n0188l5741o0432M5782N7956r6375j7624J8516K5513
5708b2196O4258k3557M2766M319n9711r8266J2931J1140L8597J934L1340K3973
5696B7528p499m5J5470j0890o1277m7952L2457M0578l1713j0769j8981J5786L0133
5683b7174J9220j10758J0886J7016K3514L8328Q798m778q162J0131M4469l9926
$$ y = [31050, 48517, 30862, 65305, 82989, 40008, 947, -22961, -61256, -54396, -69161, -67053, -85200, -57742, -22731, -49115, -60642, -25355, -16207, 15722, -4932, -122349, -107099, -92047, -59269, -17073, -25701, -72883, 7835, 58848, -45215, -97757, -71781, -27063, 20646, -44250, -135173, -156582, -165993, -144061, -118463, -138748, -86928, -81402, -67447, -45880, -61152, -77458, -111569, 6868, 90397, 40209, 4468, -55964, -10182, 47774, -48601, -66225, -47709, -22196, 42062, 18505, 61271, 65590, 5879, -92387, -79456, -68316, -29719, -27785, 3555, 27528, 20029, 19984, 35454, 24564, -36713, -84665, -52208, -11630, -43343, -54112, -73093, -57307, -27174, -7954, -118712, -107826, -90810, -67296, -28968, -20170, -24948, -33110, -22979, 21490, -18436]
5671a8436J980J3345M4399L0041P528p6074p3451j6236J4179M5443J6798j9575
5659c0059K7717j6422p0063P2749N6408j1814l6954J5904L2529n4760K7361l0364
5647a7768j6358L263P9948L0346m9993j0223J4765K839L5916j31741l5048j5966
5635a10020J4072L61L836j7044R0639M8019J7225N1171j309O0256k5121j1684
5623A20401n9844j7391r987j9757J4760l4832P7331j2382o7724L648p1025n3863
5611a30665m750N5240J988n9874m7877J34898N0310R816L4053m0526J2388K7355
5599D2356n7836n9904N4808j8556k3302l3678m0174q799O8950M5965L7994k5017
5587a7193j05443N0286J2440j0049K4670Q4006J04450J8045n6893l9143n0487
$$ y = [-18436, -16456, -3111, 41288, 71329, 78857, 2783, -70668, -86904, -72725, -27282, -10484, -30059, -2342, -18764, -88827, -16078, 40330, 28516, -8438, 7466, 39995, -14765, 12596, -17768, -34126, -30863, 49085, 79431, 29438, 19215, 33980, 36819, 72735, -59006, -94054, -110020, -95948, -95587, -91751, -108795, -18156, 29863, 47088, 98259, 96950, 157206, 132085, 120401, 60557, 43166, 33179, 13422, 28182, -6650, 70681, 58299, -9425, -5777, -76802, -130665, -135415, -80175, -78187, -138061, -185938, -51040, -730, 9086, 43139, 2613, 15001, 42356, -15480, -75384, -20576, -39132, -62434, -96112, -136286, -145085, -76135, -30170, 7824, -17193, -122636, -72350, -59910, -69959, -45289, 38717, 143167, 161212, 104319, 65176, 14689]
5576A4689n6581l6184l9352l2279l6894n1866R1788K0930M8345L8063M3067J5240
5564A8966j8479l0956P184m1000l5025L7732l3643M6099J4712l7159p4900K9120
5552a17349M1078n4458p3213N3258J35708P0047m4396k3234N1371J5702k2461
5541C2053P934N1203N630j9893l5819L0672l7245o8263O6875R9320m3016J3212
5529A02663p3054r7764j0181j840P184N4081o5898r4802j3998K0139L186j5527
5517a85811j8082J8354o41N3032M4686l6890N0184M6713N688J1246k632J461J6503
5504C811p440o3813M4950J3325K0091l7418k7587m4124M4753j1797N9087N228
5492i34N2412j503l6958M7114n963k6574M558N6233j1556m2098l4076q4349P6857
$$ y = [14689, -41892, -78076, -117428, -149707, -186601, -238467, -146679, -125749, -77404, -39341, 3726, 18966, 487, -30469, -23285, -64285, -99310, -61578, -95221, -49122, -34410, -71569, -146469, -117349, -76271, -130729, -203942, -150684, -14976, 55071, 10675, -12559, 38812, 54514, 32053, 39987, 91190, 96820, 76927, 41108, 71780, 34535, -33728, 33147, 132467, 89451, 102663, 29609, -68155, -78336, -80176, -72992, -18911, -84809, -179611, -193609, -173470, -170284, -185811, -203893, -185539, -186180, -133148, -88462, -125352, -75168, -28455, -22767, -11521, -14153, -12692, 3811, -3629, -67442, -22492, -9167, 10924, -26494, -54081, -98205, -53452, -65249, -6162, -934, 51478, 49975, 13017, 60131, 54168, 27594, 32152, 88385, 76829, 34731, 655, -83694, -6837]
5479f837k834m770n3385Q6798R9455j14327m7048P6891M6968o1860N796L4527
5467E9374j1321j38112n4373j4359Q9040K4688o979O134l6185p3918L809K7772
5455a24430q547L3241L0468k7736L6988J8363m2013q200l7687p5570L8883m282
5443a70522N8911J26872J5288j7780l5882n4240L2211O1317R2107M0084Q853p8714
5431G8505q4120j5982P2180o5621J1911P3612n7878l5811Q042O5887n3111o5213
5419f7599K0002J1337J8302K4101L3550p1806N0452n5873r6544q0738k6574Q147
5407b33243J21988m283l1830N4378J01553j5134L4819k9715j1466J9050R768O21
5395A6506k2091P966L1060o906m6925K280m0474n2795n111N1484J1151L4705j6253
$$ y = [-6837, -9671, -14441, -67826, 18972, 118427, 4100, -42948, 33943, 80911, 19051, 24847, 59374, 48053, -90059, -144432, -158791, -69751, -45063, -52042, -45908, -82093, -156011, -152202, -124430, -132977, -99736, -69268, -97004, -60016, -41653, -83666, -91866, -129553, -205123, -166240, -170522, -111611, 15261, 30549, 12769, -23113, -77353, -45142, 16175, 108282, 148366, 157219, 78505, -5615, -21597, 50583, -15038, -3127, 70485, 12607, -23204, -15162, 50725, -2386, -67599, -47597, -36260, -17958, 6143, 39693, -32113, 18339, -37534, -134078, -214816, -241390, -233243, -111255, -115538, -147368, -92990, 8563, -6571, 28248, -1467, -12933, 6117, 15885, 16506, -5585, 2381, 33441, 26535, -20390, -18110, -58584, -111379, -116490, -65006, -53855, -19150, -35403]
5382c5403J5717P3663n1323p2753j8356M6472O1662j8765Q214M9172P099n9413
5370E986m9041m6532K1459Q1585P7509l6962r6517j09501n1891j9635M7296J07211
5358f9033O4339K9689k0133o300l464J5355q9832j6631L0403J39461m6793m5434
5346a8373P05M3876L7152n313j37999m2725n5882M2961M7768k5103j4340Q4120
5334d3153P2723l7031K4229n6912m8117l611M3005p277k3802k8445R3605J5376
5322E90n7488m4223L5290O4563M8252J3012l4887n8496P2284M3969m7395j03747
5310f8276l4012Q7246O2314r030O5178o1428k8743m7419L6636p977n6241Q807
5298e2945k5775j3683M0749n9548k6980m1069R921K1427L0621K3667O8119M9988
$$ y = [-35403, -19686, 53977, 2654, -70099, -88455, -41983, 19679, 914, 9128, 58300, 65399, 5986, -43055, -89587, -68128, 13457, 90966, 54004, -42513, -152014, -203905, -223540, -176244, -69033, -4694, 24995, 4862, -1438, -4902, 10453, -79379, -96010, -65607, 73854, 27061, -18373, -17668, 26208, 63360, 58047, -79952, -122677, -178559, -135598, -87830, -112933, -127273, -43153, 29570, -7461, 16768, -40144, -88261, -91872, -48867, -56144, -79946, -108391, -14786, 590, -56898, -101121, -65831, -1268, 46984, 59996, 25109, -33387, 38897, 82866, 35471, -68276, -102288, -15042, 47272, 38242, 103420, 41992, 13249, -34170, 2466, -5511, -61752, -52945, -78720, -92403, -51654, -111202, -138182, -179251, -169330, -147903, -117282, -93615, -25496, 24492]
5286B4492J2644n7941o906p8416O524R7003p4442o3496J3279M2955P685m3081
5274a19700M4206M9925o8790j909P65R431k4208N3849M5088J05371L4151O804
5262A34983m342o1109q8302j23445O3825J71150L5116n9895j18400j08956M043
5251a55332O3355Q045m8470L4017J12874m9498J6779K3604J9100o4772j8692J9120
5239c9870M4856k1752l8185k4513L6583n298n7222J8415N4607k4166K7406j6869
5227d6008K2343M412r0789O253Q554J10917M9919j0001q2262p4325j0129N2400
5215e8716J18825K8304K8641m1389o2347m9146j1690J319O3546k6502q515M589
5203a3081J4054m5105p7919n705P9896R3590K1240j0618n7000k8244j0164o4361
$$ y = [24492, 37136, -20805, -27711, -106127, -99603, -2600, -77042, -140538, -127259, -84304, -76619, -119700, -75494, -25569, -94359, -96268, -95503, -86072, -110280, -56431, -11343, 94028, 128179, 134983, 130641, 69532, -18770, -142215, -78390, 92760, 127876, 67981, -50419, -159375, -155332, -91977, -83932, -132402, -98385, 14489, -35009, -18230, 5374, 24474, -40298, -58990, -39870, 4986, -16766, -54951, -79464, -42881, -48179, -105401, -86986, -32379, -56545, -29139, -46008, -23665, -19253, -110042, -103789, -95235, 15682, 65601, 55600, -26662, -100987, -111116, -58716, 60109, 88413, 117054, 75665, 13318, -35828, -47518, -46199, 17347, -9155, -17670, -13081, 973, -44132, -122051, -127756, -47860, 45730, 66970, 56352, -648, -28892, -39056, -103417]
5191a03417k6434k5445O1672J9988l165O6726J8875k9708k5647J9417N856L3367
5179A2085K5356j5666m203o067n5093k4327M4147L594j2569K3234J858P989j2592
5166a2254J00504N3438m1047q1374n3028Q759L8356l0347K7760m6640K3848m9651
5154f1676l5637L2820M5135n8296o3755m2193K1508k5293J3893J2448Q7028j06162
5142a80180j2922J10374L30j8467o1218k4513O0717P2932N8964j970K967K4179
5130C1193O4437K7096l9427j37930J218m3218Q449J71767N9141o6915j5074K5566
5118H6303J4571k4992o8538r2725l0521L5624M4773J15075L0642m5084O7042N4740
5106A86910o8365n7591j9850j8834J8789R4217N3929k010p4479o6080k9676l2271
$$ y = [-103417, -129851, -155296, -93624, -73636, -76801, -10075, 8800, -20908, -46555, -27138, -21282, 12085, 37441, 21775, 17572, 11505, -43588, -67915, -23768, -20174, -32743, -9509, -7651, 338, -12254, 88250, 141688, 100641, 19267, -33761, -25002, 13354, -16993, 10767, -35873, -12025, -61676, -97313, -64493, -19358, -77654, -141409, -183602, -162094, -187387, -173494, -161046, -74018, -180180, -193102, -82728, -82398, -100865, -162083, -186596, -125879, -52947, 6017, 4047, 7014, 31193, 95630, 122726, 83299, -54631, -53413, -96631, -88182, 83585, 142726, 75811, 60737, 86303, 100874, 75882, 7344, -85381, -115902, -80278, -35505, 79570, 110212, 65128, 132170, 186910, 118545, 60954, 41104, 22270, 41059, 135276, 189205, 187195, 112716, 46636, 16960, -15311]
5094a5311K9585K2093o1302l6227k6546N4747J630l4386n4463o3989N5696O5219
5082f3254O997j6172n719K0367l2482J2124N5610n6225n0873j4037Q227N4198
5070h1239K5411j7140r437J2100O2328J39744M4420o7318j06554q0076k9421M1620
5058f5562K5066N4426k6526J2460k452K9313L1664L4886L7053J2250l0196l6131
5046G6251L2652k6593p3966o9796Q134Q8144J5682J739L4471k7913r4210J3958
5034b1447M4835N0808L0971q3626p0911N6688K7627l6563J4712j4846m645n5105
5022f1502l8916k1755k926j4185K6609l6030M1043O0695N9183K8275j2907l2544
5010d960p0267n7579J5949P1405j47L5826L366l1123J3542N4855q5834q1963K9482
$$ y = [-15311, 14274, 36367, -24935, -61162, -87708, -32961, -31331, -65717, -120180, -184169, -128473, -63254, -56257, -72429, -78148, -57781, -90263, -78139, -22529, -78754, -129627, -143664, -135437, -81239, -55828, -72968, -82405, -70305, -7977, 131767, 176187, 108869, 2315, -77761, -107182, -65562, -40496, 13930, -12596, -136, -2588, 26725, 58389, 93275, 130328, 142578, 112382, 76251, 108903, 82310, 8344, -61452, -53318, 34826, 50508, 52247, 86718, 58805, -35405, -21447, 23388, 74196, 105167, 21541, -49370, 7318, 34945, -1618, 13094, -1752, -6397, -61502, -100418, -122173, -125099, -139284, -112675, -148705, -107662, -46967, 12216, 40491, 27584, -4960, -75227, -132806, -116857, -45452, -45599, -9773, -6407, -37530, -23988, 30867, -54967, -136930, -107448]
4997a07448J7901M6989J4547n072n2089J5528j3050l1286m5551J00805O8091r49
4985H416N348n977l8823j7797O3869M6625j6099k4233Q978k7349P9869J25251
4973B08078l2761o3420j65037j14824j701R9534Q9218m7849m6833N8580M0520
4962B3505P8558K3066O142k4422n5685j5349j5293p3845k50M8506k3080R0122
4950F1975K3160j08899o4568J1976J07605K5601o3740k1170m1650R99l2851j359
4938a02921J2509O7927K2854k0772j6093R5191k66m9588q1388N6818R37n7783
4926g2575j18356k0568N6003J26593M1886l4809K5413q4677l1008L3263J9038
4915e9797j2569O7545P4461O1789l3394p4756r7227m108k7399K661Q1993L9439
$$ y = [-107448, -89547, -42558, -28011, -33083, -85172, -69644, -82694, -113980, -159531, -58726, 9365, 8416, 13764, 7787, -31036, -48833, 15036, 61661, 45562, 21329, 30307, 2958, 82827, 208078, 175317, 111897, -53140, -167964, -169665, -70131, 19087, -28762, -75595, -17015, 23505, 102063, 125129, 131271, 106849, 51164, 35815, 20522, -53323, -53573, -5067, -28147, 61975, 85135, -23764, -88332, -76356, 31249, 56850, -6890, -28060, -69710, -68711, -101562, -102921, -90412, -22485, 369, -20403, -36496, 58695, 58429, 8841, -72547, -15729, -14792, -72575, -190931, -211499, -155496, -28903, 12983, -21826, 3587, -81090, -112098, -78835, -59797, -72366, -4821, 69640, 131429, 98035, 23279, -73948, -78056, -105455, -102794, -20801, 18638]
4903A8638M537L8485M2188o0528m1324K1923L23n3305M9669j8125M9408r245l303
4890C9341k7544q8711j05299Q699J07090P9838R2137N6138m0077p8930l9976P11
4878C417j14611j10507k290P1387O2595O8873R904m0856L7846L5668q673l9809
4866b7056o8750K3685n028O510J3381R0074M5975j5082k1296j1287q093J4221
4854C7254L6269k7702m7208j11286J4066L9802o5315K9774O8388m8035n983L6471
4842d3505m5588n1428K739J00271P9605j5157j3135m4491o0503Q128Q343n5517
4830a30238j249J5302l8172J13402j3869m2352N2357O9890J232p4186m2350j0438
4818a00671k5960L3377k8833l8090l877J05739P871j4554P352k458R6963j417
$$ y = [18638, 23175, 61660, 103848, 43320, 1996, 23919, 24242, -29063, 20606, 2481, 51889, 42644, 39341, 11797, -76914, -182213, -173514, -66424, 13414, 105551, 161689, 121612, 42682, 2706, 3417, -111194, -221701, -223991, -152604, -90009, -21136, -11232, -52088, -14242, 21426, 12753, -27056, -95806, -72121, -77149, -70639, -57258, 32816, 78791, 63709, 42413, 31126, 23033, 37254, 73523, 45821, -1387, -112673, -98607, -58805, -124120, -94346, -25958, -73993, -79976, -43505, -89093, -140521, -137782, -37511, 42094, 26937, 13802, -30689, -91192, -83064, -74721, -130238, -131487, -116185, -154357, -40955, -54824, -97176, -44819, 25071, 26303, -47883, -90233, -100671, -126631, -93254, -122087, -160177, -164054, -58315, -50444, -64998, -57646, -60104, 36859, 35442]
4806C5442m6129M8382m0495n1605O1317M9469k1571o9988p261K7141N5415J7302
4794E7419m387j9734J9226o6570q0245K7358j7353P103k5643P2195M1017q9208
4782g8822p789P6839N3714l6420o5240m9162M0101L9370L1881L5824j9147M7930
4770F9079J5890N9434n2335p9413K7236k2895J5057l6327q2339j7129M1709J7000
4758d5033P80n2615m6684J26311P4334p0367j18841j19660L7082K1232N2416J21125
4746a9920M0847r189K2030j01757k6833J04663J6973n5801N585k718N0440K6571
4734E0891N9581J6303j6358n2184j03500q2795M3640N067q1168j6655O3796O5124
4722d8258n3063n4607l5305N9031P8581O0129J322J9249K0617O7813j4104m8570
$$ y = [35442, -10687, 37695, -2800, -54405, 6912, 56381, 34810, -35178, -42439, -15298, 40117, 57419, 53032, 33298, 52524, -14046, -94291, -66933, -84286, -77183, -102826, -30631, 10386, -78822, -86611, -9772, 43942, 7522, -57718, -106880, -66779, -27409, 4472, 40296, 21149, 69079, 84969, 144403, 92068, 12655, 39891, 16996, 32053, -4274, -86613, -103742, -62033, -45033, -44253, -96868, -143552, -17241, 57093, -13274, -132115, -251775, -214693, -193461, -141045, -19920, 20927, 11738, 33768, -67989, -94822, 9841, 26814, -28987, -23402, -26120, 24320, 50891, 110472, 126775, 110417, 58233, -45267, -128062, -84422, -79355, -160523, -177178, -113382, -48258, -101321, -155928, -191233, -132202, -53621, 6508, 7830, 27079, 47696, 115509, 101405, 52835]
4710E2835N340K3652r141n8809k9440j3799K9533m4893o1426Q2237N0209k9637
4698c339R3707l593K1530j3682j04215k3505N2032R5069M013q0552j52008l6191
4686a50734J8813P4542J18151k1288q4130k5685j9064k4113N5282Q1518q670m3093
4674b8471M1952N4683k1243l0843n0414q442j6671o91j1546m4589O430m5222k2053
4661a77120J5264L7660Q332Q736K0397M9664N413R825j1956L4829J2564K9632
4649D3240O157q021N6263N3228J2487O042j2108j19303q3316j9721L7587j5218
4637d2683m6814L3844M8241M73L5341J79899L210n9467m6966m052k2708J2318
4625I0636p4359J6911P5239J8173j34184m1652Q6223K0831m9193j3390j5874K5361
$$ y = [52835, 58175, 81827, 72686, 13877, -15563, -29362, 171, -44722, -106148, -23911, 26298, -3339, 90368, 86775, 108305, 94623, -9592, -33097, 18935, 114004, 118017, 37465, -114543, -150734, -131921, -57379, 60772, 39484, -44646, -70331, -89395, -113508, -58226, 23292, 14622, -28471, 13481, 68164, 46921, 16078, -34336, -42778, -59449, -60140, -71686, -116275, -109845, -155067, -177120, -161856, -124196, -115864, -107128, -86731, -37067, -31654, -21829, -33785, 1044, 13608, 43240, 49397, 41376, 97639, 150867, 163354, 169396, 157288, 37985, -45331, -65052, -27465, -42683, -89497, -55653, -7412, -6939, 28402, 208301, 211511, 152044, 105078, 101026, 78318, 90636, 16277, 33188, 108427, 126600, -7584, -49236, 36987, 57818, 8625, -4765, -20639, 4722]
4613D722l0326L4603M5257j18305o2340m5869P5569J7677K8881J2276l754m0636
4601h2245L8326P098k5087k1075O6444L9945n2014J5950K1434L1171J8299J543
4589E9789K3702l5716p2881Q6236J8280q2504J421K3687q641k9122P931R7907
4577I0089M3921j19926m2501M9852p3791o9347l564L7077O8534M5718j3077k9942
4565a6957N6373M0805M5838m1446n5866J80J3681J802m3763k6053k1766l6564
4553h3736j4875o823j5619M4944R69o0723p8288P942J14352R2413J7601K0863
4541C9020Q752N125j0002q6477m3677Q5824P7898J7680m6203k5423r1825m9323
4529a18631n2890J13473O6946j17172J6924L3817L0583L0222N3455l5400o7320
$$ y = [4722, -25604, 8999, 54256, -64049, -126389, -172258, -96689, -79012, -50131, -37855, -41609, -82245, -43919, -36821, -61908, -82983, -16539, 23406, -28608, -12658, 8776, 39947, 58246, 59789, 83491, 47775, -25106, 61130, 79410, -3094, -1673, 22014, 13373, -15749, -7818, 90089, 134010, 14084, -28417, 21435, -52356, -121703, -125267, -88190, -19656, 26062, 12985, -16957, 39416, 80221, 126059, 84613, 28747, 28927, 42608, 44410, 647, -25406, -47172, -83736, -98611, -105434, -121053, -76109, -75140, -135863, -214151, -206209, -91857, 556, 18157, 39020, 47772, 52897, 42895, -43582, -87259, -1435, 76463, 94143, 47940, 22517, -69308, -118631, -171521, -58048, 8898, -108274, -91350, -57533, -26950, 3272, 56727, 21327, -45993]
4518d5993m3039o6161j4796J7854R3123Q9138N8882n8448J5561K1000p6698J1323
4506A746j9735m9546l2234q517P256L322M910m2800K0994P5279P5379L2289N125
4493G3468j0095r7828l0999l99j2651J11226P960n5479L5661k7518j1623N2359
4481C4082l7144L9113J7q6466k0868J9687N0073j2520p9351R567O1112N9889k4300
4468A2891p6360n3160n4681J1724l4765R496J9168l5967j8837J4376R9017J8819
4456h8279m9537M244Q2101P688Q878M571O2920m9M4792P0159m5680o1948n5977
4443a6117k8752J2338l574l5182m2624L4698N8867Q260P394j8094l1931L6685
4431a8032p3945n7524m1308J4295R4464P5951m5244p1243l6047j0837J11622J79820
$$ y = [-45993, -89032, -155193, -169989, -152135, -59012, 30126, 89008, 30560, 46121, 67121, -9577, 1746, -17989, -67535, -99769, -108286, -101030, -97708, -92798, -135598, -114604, -39325, 36054, 68343, 73468, 63373, -34455, -65454, -65853, -78504, 32722, 40682, -14797, 20864, -6654, -18277, 34082, -3062, 36051, 36068, -50398, -71266, -51579, -1506, -14026, -93377, -83810, -22698, 37191, 12891, -63469, -116629, -171310, -159586, -194351, -184855, -165687, -201654, -220491, -206115, -107098, -88279, -137816, -133572, -51471, -43783, -34905, -30334, 32586, 32537, 77329, 147488, 101808, 39860, -16117, -44869, -32531, -36105, -71287, -113911, -79213, -20346, -12086, -4692, -22786, -54717, -18032, -91977, -149501, -190809, -176514, -82050, -6099, -51343, -122586, -158633, -169470, -57848, 121972]
4419A21972k4155p0530k7271n7298k8466k0711r3782k1593p1870R2271J38607
4408f2826P4000L6379m766n1867j8062K1784j6817n1454M7798J34821M9587p3846
4396H4731n1224J5146K6199j5461j13603n4334N1204O1487j576J7050l9156L5240
4384A5703j2206n6158K1956N2501j1008n6289M8762R3763O6689L6107p3053l308
4372A23459M7607n6136q2429n1971M3091P0129Q6k4583m1976k1037L3883q9978
4360d9855K8352P4361m4483M8855l9669o596p4556j9526L0934L9860M2147m8539
4348a8715M2367k7923Q2579p658q7882r048N5728P5947n201L0283l5212j06123
4336a0858m6197M528N8043J9377P670L5159M679m1440n6364J1985n1289k6130
$$ y = [121972, 97817, 27287, 16, -57282, -85748, -106459, -200241, -221834, -293704, -201433, -62826, 11174, 47553, 42787, -9080, -27142, -5358, -22175, -73629, -25831, 108990, 158577, 84731, 33507, 48653, 74852, 59391, -54212, -108546, -57342, 4145, 2569, 19619, -19537, 15703, 3497, -52661, -30705, 21796, 10788, -45501, 3261, 97024, 163713, 199820, 126767, 123459, 171066, 114930, 32501, -19470, 23621, 93750, 93836, 69253, 27277, 6240, 40123, -49855, -21503, 52858, 8375, 57230, 17561, 10965, -63591, -83117, -52183, -12323, 29824, -18715, 23652, -4271, 78308, 70650, -17232, -26280, 29448, 105395, 100194, 130477, 95265, -10858, -57055, -52527, 5516, 24893, 32563, 67722, 72401, 30961, -25403, -13418, -64707, -90837]
4324i0837r827J00872j929R149o4657k0371R0757K3840o2894J0413k1218J7317
4312a9385K9891M2720j1702l3759l8220p3753k3030O2657K5307P2932R0216p0893
4300E2981q9494M9899Q4658J7651n0748q8652m2391o4931R5400O1505o0097j7381
4288e1600q4843k7004j8575N0441P4882M8046O4109M9999O2466k5945p0080j1954
4276E9942n124p5658l3422j2250p992m5430q05Q889K8995j8315O0156N5000n5400
4263d1414k8603k9759O5063M9421n2393L0582O8976m992J5231M3735K7220l3345
4251A09722j8899j8238K2928O783j2837r6663l3023j2568O8788R378k067l2065
4239h761n286L4638O8619J7893J8378o4558j07736k6722N5695n2924J6850J01042
$$ y = [-90837, -100664, 208, -1721, 7428, -57229, -77600, 13157, 36997, -25897, -15484, -36702, -19385, 10506, 53226, 41524, 7765, -30455, -104208, -127238, -64581, -39274, 33658, 123874, 52981, -36513, 13386, 98044, 115695, 64947, -23705, -66096, -131027, -35627, 25878, -34219, -51600, -136443, -163447, -182022, -131581, -56699, -8653, 55456, 105455, 167921, 141976, 71896, 59942, 54818, -20840, -54262, -66512, -74504, -119934, -120739, -111850, -82855, -101170, -41014, 13986, -41414, -70017, -99776, -34713, 14708, -37685, -7103, 61873, 56881, 72112, 115847, 143067, 109722, 90823, 72585, 95513, 102296, 89459, -7204, -40227, -52795, 15993, 25371, 23304, -8761, -14047, 20591, 89210, 107103, 125481, 60923, -46813, -73535, -17840, -70764, -53914, 47128]
4227D7128J3529m5345q7506n3966n3354j4354P1250L1797O3544N3014M9026q90
4215G3873q206m4701j03799M5346K3091l4062R693Q3514M0935N494m5714J9882
4203F5346r896j25107O843l96l4461k3816l3796M1390M4773J4400m3352l6498
4191a34570m5121O9953R8549L9032k406o273O823m2623o6905L8122N5036N5817
4179F5434p5850K0466N2447j6210J5634k5865l2212m9303p409N0537J6590N7721
4167G1980L50o2881p0837J104j2463p803J37459O036n8995O1726J00218l7378
4155A28516j79257l4308k5651p982M1163K6735l1509k239N9130R4547m1711o5135
4143c7701m912K0818m0903M8388J1496K8732m5107k3040L4779m8265J0807P8377
$$ y = [47128, 60657, 15312, -72194, -126160, -179514, -193868, -122618, -90821, -27277, 25737, 74763, 73873, 65667, 20966, -82833, -37487, -14396, -48458, -38765, 44749, 85684, 91178, 45464, 65346, 55450, -69657, -62814, -63210, -97671, -121487, -155283, -113893, -69120, -54720, -98072, -134570, -179691, -109738, -11189, 27843, 25437, 19164, 25987, -16636, -83541, -45419, 9617, 65434, -10416, 10050, 62497, 46287, 61921, 36056, 3844, -45459, -52868, -2331, 14259, 71980, 72330, 9449, -61388, -60284, -72747, -80550, 56909, 62945, 3950, 65676, 165894, 128516, -50741, -85049, -110700, -118682, -77519, -50784, -82293, -84532, -25402, 69145, 27434, -37701, -42613, -21795, -62698, -14310, -2814, 25918, -19189, -42229, -7450, -55715, -44908, 33469]
4131C3469k4785j3603l0222P6818o1744r0700L5001L5185k3843q7590l2759J4476
4119a70297M4942M5504N2811J10230k6474K2100J6284o4254m0424K6706r396m654
4107C078O0752l3657o5501J8105J1845o1207K785m0538j09184m1263J02005R2554
4095f0226M7958q81p6691k7784N5826J7424P276J7197k4244k1546k7967l4434
4083a28092P6908O3418k9932n5405l8557N1466n5308m3519P3618J05745P4258
4072I4600N7370K4406p3684p8776j23004O3952n872R363R3216n5432l5620p1724
4060a01205k2790P7534J0186L0347O7377K7745k1277m6261j9654N3564k9168q1740
4048e5342k994M1634p7474K7145K0215r0922K601J22005O469j9794m4622j7738
$$ y = [33469, 8684, -4919, -35141, 41677, -20067, -110767, -75766, -40581, -64424, -152014, -184773, -170297, -125355, -79851, -27040, 83190, 56716, 78816, 95100, 30846, -9578, 17128, 7732, 3078, 63830, 30173, -35328, -17223, -5378, -66585, -63800, -104338, -213522, -254785, -152780, -60226, -12268, -13149, -89840, -117624, -61798, -44374, -37098, -19901, -44145, -65691, -93658, -128092, -51184, 12234, -17698, -73103, -111660, -60194, -115502, -159021, -85403, 20342, 94600, 151970, 176376, 102692, 23916, -99088, -35136, -41008, -31645, 61571, 6139, -29481, -101205, -123995, -46461, -36275, -5928, 61449, 89194, 67917, 21656, 2002, 55566, 26398, -55342, -58336, -16702, -94176, -67031, -46816, -137738, -135137, -13132, -6663, -26457, -71079, -88817]
4036h8817J2193Q0223L9053l3654k9377n3333o8288J03030J15570j7618p994J1758
4024F2746j0094l8942k1132J7513n8104O9753j2261k240M7296K1101l1545j2882
4012C1209K6627L240K4156M8329L2632n0488r2316m1531j9204L1344l1680l3184
4000g0866q25L362k7190M1340O6303k8198J8878Q7693l8802m8773L9413o213L6766
3987G2888P0947J3602m1974l7610o5730O945K0176o1027q3060N005m4314k8023
3975a72175R0637N1793k4206l8914M2906K6589m9850l2882M1477n109m2430O5853
3963d6311J5242j5698M4348R799l8315q675K0754J672k3276L2736m4390K1631
3951c0483O1186O3284Q6446n8587p126j8592j17000r1110K668l1016K1611M7401
$$ y = [-88817, -76624, 3599, 42652, 8998, -20379, -73712, -142000, -38970, 76600, 58982, 50988, 62746, 52652, 13710, -7422, 10091, -48013, 21740, 9479, 7239, 54535, 75636, 44091, 31209, 57836, 61076, 85232, 133561, 166193, 115705, 23389, -18142, -37346, -6002, -37682, -70866, -71691, -68329, -95519, -54179, 12124, -16074, 2804, 90497, 51695, 2922, 42335, 36122, 72888, 143835, 157437, 115463, 77853, 12123, 19068, 39244, -21783, -104843, -99838, -144152, -172175, -81538, -29745, -53951, -92865, -49959, -23370, -73220, -106102, -64625, -69734, -112164, -46311, -31069, -46767, -2419, 7380, -30935, -39610, -18856, -17184, -40460, -7724, -52114, -30483, 30703, 93987, 180433, 121846, 114720, 96128, -20872, -111982, -109314, -140330, -118719, -71318]
3939g1318P9844R5623k6883q1283J4344N2083N1881J6011l419k02219n5854J1815
3927a19375k4938M4692p3726K9135O5415L2108J9827J357m5310L6211P7906l2074
3915A1228N1888P0926l5904o0943Q834J3873l8118m0436o4419q457Q1514j795
3903a1809m3318o9650O5518M2828k3861J0854k6924l3906R2970O7119J5652p1355
3891A4118j8954l6420j14711j926P6119N5357r372m1492J32852J4065P322l1328
3879D5630N8895K2345j0666r7202m2885N8322k3898n0297M3384j6731l4637L7007
3867a0733n9402m6652O5812M6787O3355k742n0879m0096k7553l501k2054N0815
3855c6843K3340J8813k8375k5089j313j4309k2026M58R2355J06051N0573m2806
$$ y = [-71318, 8526, 104149, 77266, -4017, 10327, 62410, 114291, 130302, 126883, -75336, -131190, -119375, -144313, -99621, -173347, -144212, -78797, -46689, -26862, -25505, -70815, -34604, 43302, 11228, 63116, 134042, 98138, 37195, 46029, 59902, 21784, -18652, -83071, -91528, -10014, -11809, -55127, -124777, -59259, -16431, -40292, -29438, -56362, -90268, 2702, 69821, 85473, 14118, -4836, -41256, -155967, -157893, -81774, -26417, -35789, -77281, 55571, 69636, 76958, 45630, 104525, 126870, 116204, 19002, -23883, 34439, 10541, -39756, 3628, -13103, -47740, -10733, -70135, -116787, -50975, -4188, 59167, 56425, 5546, -34550, -62103, -65604, -87658, -36843, -13503, 5310, -23065, -48154, -49467, -63776, -85802, -85344, 7011, 113062, 163635, 120829]
3843A20829p1124M6651q214n1742L6431M2721m0437o8493o0123J3911n809j4971
3831f0370M0160L47q0492J7164Q8739R009N4356n3898j02754k5201j0121Q1515
3819d1546P0160m1113o714J12816N681l2277p9856q8964k6946N2153R3901j5782
3807A513Q0795j4896q1831m5876R1124O2581m4293j6568l7253J1433M7617j958
3795E2388j4542J3272n932p8856l8730L7515J08143o4843j02892K3984Q4881j8846
3783d458J0186M373J1572N3059j50N4059M358m4742L9115n7818r3850l874j2922
3770d1092r80K8668M6693O0541K6151p6834J3134q8516l9212L4289M6191K3440
3758C2473n0334j41880M7438O8672m6346m76M2890J3543p8735k2772m2352J7803
$$ y = [120829, 49705, 96356, 88142, 36400, 72831, 115552, 75115, 6622, -53501, -39590, -45399, -60370, -20210, -19863, -100355, -83191, 5548, 14557, 68913, 15015, -87739, -112940, -123061, -41546, 28614, -12499, -19213, 93603, 99284, 67007, -12849, -101813, -128759, -76606, 17295, 1513, 82308, 67412, -14419, -60295, 30829, 93410, 49117, 32549, -4704, 6729, 54346, 52388, 37846, 51118, 45186, -33670, -72400, -34885, 73258, 8415, -94477, -70493, 14388, -4458, 5728, 10101, 21673, 74732, 74582, 128641, 132999, 88257, 127372, 69554, -24296, -28170, -41092, -42072, -13404, 33289, 93830, 119981, 43147, 56281, -32235, -71447, -37158, 9033, 32473, -17861, -159741, -112303, -43631, -89977, -90453, -47563, -34020, -112755, -135527, -177879, -160076]
3746a60076R1846Q8876R0126m1257p0839M5727M4448M5090j11176r4851n3584
3735a25670J6053J4386Q7885M552k630L198R94k4060J02240O7267l5918m1290
3723F7007k5446l0767Q716m633L3792L1647P854K2097J4739j9242o8992m6036
3711i264l711p837l7673o253J8585J1089N058M6267m5161l3724l0195K9151m235
3698f7903J0360L809L6306M127P8735l920P812L7149j15681o8614J3171O1611
3686c038k8898M095k1584K146m7178n9042n2251K5546P0784M1943R02k001N3375
3673a5201K3099N901k7968m2547M7014m4799m337K9375K2006L230M8393K8844
3661G3010k7425K2298Q2441j0936p2524m7477m4373O9542l6304j4122K1288p752
$$ y = [-160076, -68230, 20646, 110772, 69515, -1324, 44403, 88851, 133941, 22765, -72086, -125670, -109617, -95231, -7346, -2794, -5424, -2226, -1232, -25292, 76948, 144215, 108297, 67007, 41561, 10794, 19510, 14877, 48669, 80316, 88170, 110267, 125006, 105764, 36772, -9264, -12975, -20812, -58485, -64738, -46153, -35064, -30006, 16261, -28900, -62624, -92819, -63668, -67903, -57543, -53734, -17428, -13301, 65434, 61514, 69326, 106475, -9206, -77820, -64649, -3038, -31936, -27841, -49425, -47279, -94457, -153499, -205750, -180204, -109420, -67477, -66575, -68576, -15201, 7898, 13799, -14169, -56716, -9702, -54501, -58838, -29463, -7457, -4227, 44166, 73010, 45585, 67883, 150324, 139388, 66864, 19387, -24986, 44556, 8252, -5870, 15418, 7666]
3649G666n9771r755J21245O7680n9109k0487j7979j712P3941q0708K0326n0580
3637i243Q0974J819q3373o8067K7293l5800O9133K6575O16K8612k7577p0310o315
3624f5663q425n9752J5476R646J5795N8317P7524k352L9814k8239m4149r377l3017
3611c4402j105j5060j1398K8083O0475k9972P150k3228M220K9383l293J4556m068
3598B1341O7446K9209l7120p1537n4769l555J3958J9782k2790R514Q948m139r8793
3585a22505K4396L9279Q3397L4157o6119m53N6544k5569o3651o4922l3885Q7744
3573e1587N6429j7890J1250J24k4048m0673j9341J4808N1189r1845j7474l220
3561a32278N3084J22436N4737j14547l801k2215O9977K9359j6637K0803j4618
$$ y = [7666, -52105, -61860, 59385, 127065, 67956, 47469, 29490, 27778, 101719, 21011, 41337, -9243, 71731, 73550, -9823, -77890, -50597, -86397, -17264, 9311, 9927, 38539, 10962, -59348, -65663, -74088, -133840, -118364, -108718, -92923, -34606, 42918, 40566, 80380, 52141, 7992, -1385, -34402, -35507, -50567, -61965, -33882, 26593, -3379, 3771, -19457, -15237, 14146, 10853, 25409, 21341, 88787, 117996, 80876, 9339, -45430, -48985, -35027, -15245, -38035, -28521, -19573, -23712, -122505, -98109, -58830, 24567, 58724, -7395, -7848, 48696, 23127, -40524, -105446, -139331, -51587, 4842, -13048, -1798, -1674, -25722, -66395, -85736, -70928, -19739, -111584, -129058, -132278, -79194, 43242, 97979, -16568, -20369, -42584, 27393, 56752, 40115, 60918, 46300]
3550D6300k3517q6215j45772N4087J20681N1039q201k780m8491n0216n103P0545
3538b7643L0311p8769N1463N2228K8360M5187n9404j09283k1476M0761p7424j0997
3526a36686M3209L7747K0178K2563M780R0249J8866p7547o5202l2100O9713J63486
3514A59256L6883n0117n5362j23114m610J02109M4410m3437k3844n2802P3464
3503F2836Q729n3713l7475j0491L2366j6804n4262M55K9855N2000j6645P1922
3491F8773O8481k666p4401L5967N1865N606J7062j4975o0493j47733m5710Q4134
3479a4090N3643j17432p5621Q1289J06138o907j3532P102n568J760k5802o3960
3467g2980N5422N1855P988l6870j8815j9397K0432o2872M0512Q2125P618o9345
$$ y = [46300, 22783, -63432, -209204, -155117, -34436, 16603, 8402, 5622, -42869, -93085, -98188, -27643, 2668, -76101, -24638, 27590, 55950, 101137, 41733, -67550, -89026, -48265, -125689, -136686, -93477, -55730, -35552, -12989, -8209, 82040, 100906, 23359, -41843, -73943, -4230, 159256, 196139, 146022, 90660, -32454, -37064, 65045, 109455, 66018, 42174, -10628, 62836, 71565, 17852, -19623, -30114, 2252, -14552, -68814, -68359, -38504, 13496, -3149, 68773, 137254, 134588, 60187, 96154, 148019, 153625, 170687, 155712, 95219, -52514, -98224, -14090, 39553, -77879, -153500, -72211, 33927, 27020, 13488, 20590, 15022, 16782, -9020, -72980, -17558, 34297, 42285, 5415, -13400, -32797, -12365, -75237, -34725, 47400, 55018, -14327]
3455a4327o2835O4468J00867K3170l3614m7399J0520P45l4839n3753K0983O5064
3443C9050K171p6865j8874K0806M2183r6202n9885P1187N4588l6594k787k1581
3431h2803k3413M9954O4959o2154k6385O6328j7490o4952r955l5527k0753J26335
3419c5856M5816L6642j9884p3834L7498m5520M2775M9669o0339j4858N7163k1827
3407b555N0613N4109j64k2615M3173M0124j13386k3445m0589n071O5647K0255
3395F6096o2789J954l0458q9220N248Q0342Q862N441O2046j4239R097m4612r827
3382a2059K4980K0213p1422k9245K7577j8636J2511j9716N5903J5181j9640Q6405
3370G2052J107j09620j6179K8363p3499j7655J20267J25793l2866o5525K8830
$$ y = [-14327, -77162, -12694, 88173, 111343, 77729, 30330, 40850, 41595, 6756, -46997, -26014, 39050, 41221, -35644, -54518, -33712, 8471, -87731, -147616, -76429, -21841, -58435, -61222, -82803, -106216, -56262, 8697, -53457, -79842, -13514, -31004, -95956, -105911, -141438, -162191, -35856, 9960, 46602, 26718, -47116, -9618, -55138, -12363, 37306, -23033, -37891, 19272, -2555, 48058, 102167, 102003, 79388, 122561, 162685, 49299, 25854, -14735, -19806, 45841, 66096, 3307, 5261, -25197, -114417, -109169, -28827, -19965, -14524, 47522, 33283, 42380, -2232, -12059, 12921, 33134, -38288, -67533, -39956, -58592, -46081, -65797, -9894, 5287, -14353, 72052, 73159, -36461, -52640, -24277, -97776, -115431, 4836, 130629, 97763, 32238, 61068]
3359F1068L93m053j2491j28052p4173P5996M3823j97M5321J4860k3347q1475m237
3346h6564J2395Q4960O8305o9996q7494L0552j3757K4182K4930J6508l7166m2278
3334g5423Q317J9639J3165N1473J4994n9234j02940n0939K55q492J8014Q6271
3322h4900q897J6648P8854J6153K1725j9219j08846l6010N250L3563N2755k7516
3310f0440J0227R6003O267k3494J7117J25040O298j50934j00005q572J3048M2431
3298b7014J9220k6749p6055O5739N1936l3746L1104k0050n1428N0062J09788l7782
3286E5025p0273m6684l5911l4142L3718L5737k3799J8409M1387m7509K9325l3350
3274g8067M6537k3370k8392K6839o9205m4007p584M3683O588M4019P6231L4116
$$ y = [61068, 61461, 57408, 44917, -83135, -157308, -81312, -37489, -37686, 7635, 22495, -852, -82327, -86564, -74169, 10791, 79096, 9100, -78394, -47842, -61599, -37417, -12487, 4021, -33145, -75423, -67106, -47467, -34302, 17171, 32165, -27069, -130009, -180948, -180693, -189185, -171171, -84900, -93797, -77149, 1705, 17858, 39583, 20364, -88482, -124492, -119242, -85679, -32924, -60440, -50213, 45790, 52057, 28563, 45680, 170720, 177018, 26084, -73921, -82493, -69445, -27014, -7794, -34543, -110598, -44859, 7077, -26669, 4435, -15615, -67043, -16981, 92807, 55025, -15248, -61932, -97843, -131985, -98267, -62530, -86329, -67920, -26533, -74042, -44717, -78067, -31530, -54900, -83292, -56453, -125658, -169665, -177249, -133566, -126978, -82959, -6728, 27388]
3262B7388K9212n0541l7052Q1901J6073N9656j7036n165n2475j2312k797r999
3250B6853m4394l2559K6317j7850n0446O176P5781J61278M7220j39747q3448J5417
3238i402K4310J7450j6590K9139k9911m6162n6042N6832K3715j4840J0760k0921
3226c1662j6239P9766m488l9068Q262K7759l2211m2939K0994l0090m4959J21764
3214A6889K7098J3874J05706o6246j17007m0222n8892J9130J4478L1436J9705
3203c4051R0390r339j2410n192K0054J6967N537o0586r3083L5935j2219j9798
3191g7795M0208J17678M5921n0998l9172n9165n7825j915k7681N1806O1057O3640
3179F5759l3265l2781o2049o439n295o0487n1985M5806R8669J28269k4180j21706
$$ y = [27388, 56600, 6059, -30993, 50908, 66981, 126637, 109601, 104436, 51961, 39649, 36852, 26853, -17541, -50100, -23783, -41633, -92079, -85903, -10122, 151156, 198376, 58629, -24819, -9402, 14908, 32358, 15768, 44907, 14996, -31166, -87208, -30376, -6661, -21501, -10741, -31662, -47901, 31865, 27377, -11691, -3429, 24330, -7881, -50820, -29826, -59916, -104875, 16889, 43987, 57861, 163567, 97321, -19686, -59908, -118800, -99670, -85192, -53756, -34051, 56339, 47000, 34590, 29398, 49452, 66419, 71956, 11370, -81713, -45778, -57997, -77795, -37587, 80091, 126012, 75014, 35842, -23323, -81148, -83063, -110744, -58938, 2119, 65759, 32494, -287, -62336, -68775, -74070, -134557, -186542, -140736, -42067, 86202, 62022, -59684]
3167e9684N7553Q9754P8680j6932j29254P855R3085j3761k6781m7961m4660M0353
3155B8247N2642o7979q903L7150l4250n9083K8596K6281N90O140N7301M7604l5094
3142G9242L820K4165O7551M8878m7548p9166m1003j4619k0654M0013p494n2540
3130F45J9183O4214j3409j4101K7812j4646l0687n2415L6788J7912m976p268j9227
3117I825J3021j5554N3266M9588o1842p690M2205K2879M9935Q6966o3624o9384
3105A09591n3249j3082j3274M5750k1711k9096n5112J9734l8274l7093j0228N9363
3093c6681J6151K8889j6859n865O7124k4610k5021k5016K9988k0879n2739J61243
3081I5725J04037m8113o3457l198J8684N4896o7778j11037l6943J0006P973j781
$$ y = [-59684, -2131, 87623, 166303, 149371, 20117, 27972, 121057, 107296, 80515, 32554, -12106, 28247, 80889, 12910, 4007, 41157, 6907, -52176, -23580, 2701, 3291, 9431, 66732, 114336, 79242, 83062, 107227, 174778, 223656, 176108, 96942, 55939, 41320, 20666, 60679, 53185, 645, 19828, 84042, 70633, 56532, 84344, 69698, 39011, -13404, 23384, 41296, 36320, 29052, 9825, 22846, 7292, 60558, 110146, 48304, 40614, 82819, 105698, 155633, 242599, 178975, 109591, 56342, 43260, 29986, 75736, 54025, 24929, -30183, -10449, -48723, -85816, -96044, -36681, -20530, 8359, -8500, -14365, 52759, 28149, 3128, -21888, 8100, -12779, -65518, 95725, 199762, 151649, 88192, 84994, 103678, 158574, 90796, -20241, -57184, -47178, -39205, -40986]
3069d0986k9135J0963K0939j8246J3198o018K8613k9607K7620J8543L8976N546
3057D0406n3918l5117Q86q636K2498O8737k2288j14313P6845O6542r0178K026
3045d6510j1381n8614o93l3037p017R973J32947P3837K4936l9485j24188k844
3033h2076j2148k6593N9933J1573j6187N5555L4085m938l4527j7449J2815O4000
3021D4043R2229O7067K1760q3707j49698j15140P0790o227k7027k332M8223l2669
3009g2688K7659L6558k8886j6054J0808M3092m19l702j3991m3799K8564J02853
2997F9995Q8954l2631n2049j9342m7738K4287P7209l787l1810l5462M347o9622
2985b7649N0736K7930n1295M699q98M3567J0533n8126O62j7689M8014Q957J8081
$$ y = [-40986, -70121, -59158, -38219, -56465, -43267, -49285, -20672, -50279, -22659, -4116, 34860, 40406, -13512, -48629, -47743, -56379, -33881, 34856, 12568, -101745, -24900, 41642, -48536, -46510, -57891, -116505, -117198, -150235, -157252, -147279, -14332, 59505, 84441, 44956, -79232, -82076, -94224, -120817, -60884, -49311, -65498, -9943, 24142, 19204, -15323, -32772, -19957, 44043, 136272, 203339, 225099, 141392, -8306, -123446, -52656, -58883, -85910, -88242, -40019, -72688, -45029, -8471, -37357, -53411, -42603, 489, 70, -3632, -17623, -61422, -32858, 69995, 158949, 126318, 74269, 54927, 7189, 31476, 108685, 104898, 73088, 37626, 41973, -27649, 23087, 51017, -278, 4421, 3523, 47090, 57623, -503, 159, -17530, 30484, 39441, 57522]
2972E7522J3368m2417Q140K0186K7520J0924n4345L774j2610j81564k0065P1199
2960i8368L4582q6804j7018P2133J2039m784J5616J28N4901K9273J96M4824L8321
2947I5039K8008J6836n0557n9596n9246m5581n6335L2284Q9019J03962q363l6043
2935D9427j8453M9878l2954p7222K756N7914K1324j3428n3731j1101k9652k3783
2923g9025j08092N9358R7613k299K9047l2584L1787K1647K4961J9692O2325k9197
2911I5233o0788k8908j8284N6361J6232l1761o0231j4252p1718M248p792P463
2899a14197O0812q14k5659J06259R3103j9168m2332q0834K1346N5876P8213J2244
2887A44849O3896o0047r9709l8297m2299j6132J0578j0620P4394l2082j1043O335
$$ y = [57522, 70890, 28473, 36613, 56799, 84319, 95243, 40898, 44672, 32062, -149502, -169567, -98368, -63786, -150590, -167608, -95475, -83436, -88220, -72604, -72476, -17575, 11698, 11894, 56718, 95039, 123047, 139883, 89326, 29730, -29516, -75097, -131432, -99148, -10129, 93833, 85470, 49427, 30974, 80852, 47898, -29324, -26568, 31346, 52670, 39242, -14489, -25590, -55242, -79025, -187117, -127759, -30146, -32445, -3398, -35982, -4195, 17452, 42413, 62105, 124430, 95233, 34445, 5537, -12747, 43614, 59846, 28085, -32146, -46398, -118116, -113868, -121660, -114197, -53385, -54199, -79858, 26401, 119504, 100336, 58004, -22830, -1484, 54392, 132605, 144849, 208745, 148698, 48989, 10692, -31607, -47739, -37161, -47781, 26613, -5469, -16512, -10177]
2875a0177M6103M0699L5897K8202p8384k6385q4895l726m8519m7074J0595N4819
2863h2845N9110K8281k8766K27P8619M5621j5860m4515j01492o2150R1750P3347
2851D1327m116r0784j7510J8932L0025L6851Q7823M3081p1230M394M861L0593
2839A14247K541j2663q5062p9204K8488K8242m0930k1272K4832J8725J5977J1989
2827E910P8909j00602k3048M8308L1146l851M1547O4491k4684o8183K3859R0953
2815A64755n6409r8186m4365k2341l8479o6500J9478P2755N9165O0483n3963L813
2803B06N0059L8215P7404q8340j54479K6884K8332K5350J22263j3615o9580j9256
2791B3443k6631K0953l0863K3867k4385p8073J4022j3244n5189j9017L630O4929
$$ y = [-10177, 35926, 76625, 112522, 140724, 62340, 35955, -48940, -52666, -101185, -148259, -137664, -82845, -23735, 4546, -24220, -23993, 54626, 100247, 84387, 39872, -61620, -123770, -32020, 41327, 37211, -53573, -71083, -52151, -22126, 14725, 102548, 145629, 74399, 78793, 83654, 114247, 116788, 104125, 19063, -60141, -31653, -3411, -44341, -65613, -40781, -22056, -6079, 5910, 84819, -15783, -38831, 9477, 40623, 36772, 78319, 142810, 118126, 49943, 73802, 164755, 108346, 10160, -34205, -56546, -95025, -161525, -142047, -69292, -10127, 50356, -3607, 206, 50265, 88480, 165884, 77544, -76935, -50051, -21719, 3631, 125894, 112279, 42699, 23443, -3188, 17765, -13098, 10769, -13616, -91689, -77667, -90911, -146100, -165117, -161487, -96558]
2779i6558K3380M4127K7976m9140K0179J61992J4861l4504q743n5961R37k495
2767D6051N7061J5838l0400j18715N7100r56p4821k667L144j3070R657j4447N2701
2754a3524J09607k5308P945L743l0881k7874n6194n5530N2389N3736O2871L965
2742H4945l2326m3712J942M2587j6612m0334k8655o846J2921R6156k3701o6589
2730b0224K5698k0281j5814N6441l3151J19569J07635K6796m5417m8173l3229
2719A19850l3554n1044l8428J2647J6488O4909m6409r2184L5602P853p2171K9099
2707d7342l4839l754N8036J2237J854m4319l9527J4015L5283o042K8842K3672
2695a884k1205R770O154Q0972J2540M1624R058p2239r6195L8249j1957j7223m9451
$$ y = [-96558, -73178, -29051, -1075, -50215, -30036, 131956, 146817, 112313, 103570, 47609, 48546, 46051, 103112, 118950, 88550, -30165, 26935, 25979, -48842, -51509, -48365, -61435, -51778, -66225, -13524, 96083, 70775, 78720, 82463, 51582, 23708, -32486, -88016, -35627, 18109, 80980, 84945, 52619, 8907, 10849, 53436, 36824, -3510, -32165, -39011, -26090, 70066, 46365, -20224, 5474, -14807, -30621, 25820, -7331, 112238, 219873, 246669, 201252, 153079, 119850, 86296, 35252, -3176, 9471, 25959, 90868, 44459, -47725, -12123, -4270, -76441, -47342, -82181, -85935, -27899, -15662, -13808, -58127, -97654, -83639, -48356, -54398, -25556, -1884, -23089, -13319, -7165, 73807, 86347, 127971, 137029, 64790, -31405, 6844, -5113, -22336, -71787]
2682g1787N3670M8192l2574M5120O4385N437l2853j4553m0909j07042K0943O3028
2670A057n4866o1082k345N9294m0329L1484n798K4574J00775J9892o8821k7685
2658b3850J3554k9499k2230n0527J02985J33112m0631p0758O712Q8974J3249j8870
2646A02221n6186J1825O6558p7010j17373l6269n4957L4761J07264K3152j0694
2635f708p3770p4862J4960J26430N9293P186o1896l1368q7506J0678Q3579M5137
2623A1153L5524m1540n6126N302m0456L1676J6097l9296J3590K5997P0027l8565
2611f617m2071j4249j24419N9928N2317M3766P5840J8086K0633j4554n4562l3679
2599a9581J5259Q4839M4886q072p3422p5928K0092J1069K4225L4608Q8190K1269
$$ y = [-71787, -18117, 30075, -2499, 42621, 107006, 112443, 79590, 65037, 24128, -82914, -61971, 1057, -53809, -114891, -117236, -57942, -98271, -66787, -72585, -48011, 52764, 72656, 3835, -23850, -10296, -39795, -62025, -112552, -9567, 123545, 82914, 12156, 18868, 107842, 121091, 102221, 46035, 57860, 124418, 47408, -69965, -106234, -161191, -126430, -19166, 3986, -6708, -80478, -155340, -140380, -13950, 45343, 52529, -9367, -40735, -128241, -117563, -33984, 11153, 46677, 5137, -50989, -45687, -86143, -54467, -38370, -77666, -64076, -38079, 31948, -6617, -48688, -62937, -187356, -127428, -75111, -31345, 44495, 62581, 83214, 68660, 14098, -19581, -4322, 80517, 125403, 117331, 43909, -32019, -11927, -858, 23367, 57975, 146165, 167434]
2587A67434m0756J7895j9881q1541m039N9270k2888L5289K9832K051k8673k8245
2575H5748p183k4818K530o9277r1336Q564L5982M6178O1329O0258Q2107k1511
2563A68571q352j2708o6469j5301P7332M7133j13074j66163p0881K8273k0366
2552a52005M4936l1120k1517J18486J0944j43983k5097O0081N9318m8411o6406
2541a94774J1669J38370k5937m4200K5311K7243K3450R9917O7527o7573l937k5822
2529C1244j22797k1488O025m1681m1292N3515J08421K987r3338n808Q0607R3565
2517D9960q635J5310P1182K2555l8894j69565q4228O6603P7068J5235n6743j09775
2505a49927m0051N2933M9011M9806r403K1865m592J7754M6760o0886p5464N224
$$ y = [167434, 126678, 144573, 124692, 43151, 39112, 98382, 75494, 110783, 140615, 142666, 113993, 85748, 78565, 53747, 56277, -13000, -104336, -95772, -59790, -13612, 47717, 107975, 190082, 168571, 160219, 147511, 81042, 65741, 143073, 190206, 77132, -89031, -159912, -131639, -152005, -107069, -138189, -159706, -41220, -30276, -174259, -199356, -139275, -79957, -128368, -194774, -183105, -44735, -70672, -114872, -89561, -62318, -38868, 61049, 128576, 61003, 57066, 31244, -91553, -113041, -107016, -148697, -189989, -136474, -28053, -25066, -118404, -124212, -43605, 49960, 41325, 56635, 127817, 150372, 111478, -58087, -142315, -75712, 1356, 16591, -40152, -149927, -189978, -137045, -88034, -38228, -47631, -25766, -30358, -12604, 34156, -26730, -102194, -96970]
2493i6970N4254o52K1060L3265J9459j969p845m5180j4205L4670o8671o5324N9749
2480g8359P6902k0891j5266M9131K3869N8132M605l6822o8347n0163k1814J00435
2468B1412j6231m6484M1577L3735J8540k5514j173o884j14700P794P8135j8814
$$ y = [-96970, -42716, -43368, -22308, 10957, 30416, 28447, 20602, -24578, -38783, -4113, -72784, -138108, -78359, -1457, -22348, -37614, 11517, 35386, 93518, 98123, 61301, -7046, -57209, -79023, 21412, 5181, -41303, 274, 34009, 52549, 27035, 25862, 18978, -95722, -87928, -9793, -28607]
$$ [...]
##END NTUPLES=NMR SPECTRUM
##END=
