##TITLE=Analysis number 322659
Compound Code cc 01302
Project Code adrs
Chemist Name prosynth
##JCAMPDX= 6.0         $$ Bruker NMR JCAMP-DX V2.0
##DATA TYPE= NMR SPECTRUM
##DATA CLASS= NTUPLES
##ORIGIN= Bruker BioSpin GmbH
##OWNER= nmr
$$ XWIN-NMR		Version 3.5
$$ Fri Oct 13 09:17:07 2006 GMT Daylight Time (UT+1h)  MAYBRIDGE\nmr@NMR_250MHZ
##.OBSERVE FREQUENCY= 250.131544655141
##.OBSERVE NUCLEUS= ^1H
##.ACQUISITION MODE= SIMULTANEOUS (DQD)
##.ACQUISITION SCHEME= undefined
##.AVERAGES= 16
##.DIGITISER RES= 18
##SPECTROMETER/DATA SYSTEM= dpx250
##.PULSE SEQUENCE= zg30
##.SOLVENT NAME= CDCl3
##.SHIFT REFERENCE= (INTERNAL, CDCl3, 0, 16.522)
##AUDIT TRAIL= $$ (NUMBER, WHEN, WHO, WHERE, WHAT)
$$ ##TITLE= Audit trail, XWIN-NMR		Version 3.5
$$ ##JCAMPDX= 5.01
$$ ##ORIGIN= Bruker BioSpin GmbH
$$ ##OWNER= nmr
$$ C:\u/data/dgb/nmr/ADRS/130/pdata/1/auditp.txt
$$ ##AUDIT TRAIL=  $$ (NUMBER, WHEN, WHO, WHERE, WHAT)
(   1,<2006-10-13 09:16:45.45 +100>,<MAYBRIDGE\nmr>,<NMR_250MHZ>,
      <created by zg, POWCHK disabled, PULCHK disabled
       configuration hash MD5:
       49 4B E0 1D 92 C2 6B 37 9F E6 65 BC 52 41 86 1D
       data hash MD5: 64K
       ED 5F A8 85 07 02 3E D9 52 3B E9 EA 1A 42 F2 59>)
(   2,<2006-10-13 09:16:57.43 +100>,<MAYBRIDGE\nmr>,<NMR_250MHZ>,
      <Start of raw data processing
       ef LB = 0.3 FT_mod = 6 PKNL = 1 SI = 32K 
       data hash MD5: 32K
       00 F1 A7 C8 27 08 1F D0 EF 75 0A 79 65 61 20 D7>)
(   3,<2006-10-13 09:16:58.95 +100>,<MAYBRIDGE\nmr>,<NMR_250MHZ>,
      <apk 
       data hash MD5: 32K
       61 05 26 A9 3D ED B0 5A 46 CC 3D B7 4B C8 3D 73>)
(   4,<2006-10-13 09:16:59.71 +100>,<MAYBRIDGE\nmr>,<NMR_250MHZ>,
      <abs ABSG = 5 
       data hash MD5: 32K
       EB A6 47 E7 16 AA C7 80 BB 1F CB 6E FE 71 6B E5>)
$$ ##END=
$$ 
$$ hash MD5
$$ 02 AA 9E 49 45 AD C3 AD 34 34 85 67 62 97 DB DA
##$RELAX= 
##$RELAX= 
##$RELAX= 
##$RELAX= 
##$RELAX= 
##$RELAX= 
##$RELAX= 
$$ Bruker specific parameters
$$ --------------------------
##$DU= <C:\u>
##$EXPNO= 130
##$NAME= <ADRS>
##$PROCNO= 1
##$TYPE= <nmr>
##$USER= <dgb>
##$AMP= (0..31)
100 100 100 100 100 100 100 100 100 100 100 100 100 100 100 100 100 100 
100 100 100 100 100 100 100 100 100 100 100 100 100 100 
##$AQSEQ= 0
##$AQ_mod= 3
##$AUNM= <au_zg>
##$AUTOPOS= <9 >
##$BF1= 250.13
##$BF2= 250.13
##$BF3= 250.13
##$BF4= 250.13
##$BF5= 500.13
##$BF6= 500.13
##$BF7= 500.13
##$BF8= 500.13
##$BYTORDA= 1
##$CFDGTYP= 0
##$CFRGTYP= 5
##$CHEMSTR= <none>
##$CNST= (0..31)
1 1 145 1 1 1 1 1 1 1 1 1 1 1 1 1 1 1 1 1 1 1 1 1 1 1 1 1 1 1 1 1 
##$CPDPRG= <>
##$CPDPRG1= <>
##$CPDPRG2= <>
##$CPDPRG3= <>
##$CPDPRG4= <mlev>
##$CPDPRG5= <mlev>
##$CPDPRG6= <mlev>
##$CPDPRG7= <mlev>
##$CPDPRG8= <mlev>
##$CPDPRGB= <>
##$CPDPRGT= <>
##$D= (0..31)
0 1 0 0 0 0 0 0 0 0.06 0 0 0 0 0 0 0.0002 0 0 0 0 0 0 0 0 0 0 0 0 0 0 
0 
##$DATE= 1160727404
##$DBL= (0..7)
120 120 120 120 120 120 120 120 
##$DBP= (0..7)
150 150 150 150 150 150 150 150 
##$DBP07= 0
##$DBPNAM0= <>
##$DBPNAM1= <>
##$DBPNAM2= <>
$$ [...]
##$SUBNAM7= <"">
##$SUBNAM8= <"">
##$SUBNAM9= <"">
##$SW= 20.6930455092707
##$SWIBOX= (0..15)
0 0 3 0 0 0 0 0 0 0 0 0 0 0 0 0 
##$SW_h= 5175.983436853
##$TD= 65536
##$TD0= 1
##$TE= 683.16
##$TE2= 300
##$TE3= 300
##$TEG= 300
##$TL= (0..7)
0 120 120 120 120 120 120 120 
##$TP= (0..7)
150 150 150 150 150 150 150 150 
##$TP07= 0
##$TPNAME0= <>
##$TPNAME1= <>
##$TPNAME2= <>
##$TPNAME3= <>
##$TPNAME4= <>
##$TPNAME5= <>
##$TPNAME6= <>
##$TPNAME7= <>
##$TPOAL= (0..7)
0.5 0.5 0.5 0.5 0.5 0.5 0.5 0.5 
##$TPOFFS= (0..7)
0 0 0 0 0 0 0 0 
##$TUNHIN= 0
##$TUNHOUT= 0
##$TUNXOUT= 0
##$USERA1= <user>
##$USERA2= <user>
##$USERA3= <user>
##$USERA4= <user>
##$USERA5= <user>
##$V9= 5
##$VALIST= <valist>
##$VCLIST= <CCCCCCCCCCCCCCC>
##$VD= 0
##$VDLIST= <DDDDDDDDDDDDDDD>
##$VPLIST= <PPPPPPPPPPPPPPP>
##$VTLIST= <TTTTTTTTTTTTTTT>
##$WBST= 1024
##$WBSW= 4
##$XGAIN= (0..3)
0 0 0 0 
##$XL= 0
##$YL= 0
##$YMAX_a= 425077
##$YMIN_a= -285343
##$ZGOPTNS= <>
##$ZL1= 120
##$ZL2= 120
##$ZL3= 120
##$ZL4= 120
##$ABSF1= 16.522
##$ABSF2= -4.171173
##$ABSG= 5
##$ABSL= 3
##$ALPHA= 0
##$AQORDER= 0
##$ASSFAC= 0
##$ASSFACI= 0
##$ASSFACX= 0
##$ASSWID= 0
##$AUNMP= <proc_1d>
##$AZFE= 0.1
##$AZFW= 0.1
##$BCFW= 0
##$BC_mod= 0
##$BYTORDP= 0
##$COROFFS= 0
##$CY= 12.5
##$DATMOD= 1
##$DC= 0
##$DFILT= <>
##$DTYPP= 0
##$F1P= 14.0000005364418
##$F2P= -0.99999901652339
##$FCOR= 0.5
##$FTSIZE= 32768
##$FT_mod= 6
##$GAMMA= 0
##$GB= 0
##$INTBC= 1
##$INTSCL= 1
##$ISEN= 128
##$LB= 0.3
##$LEV0= 0
##$LPBIN= 0
##$MAXI= 10000
##$MC2= 0
##$MEAN= 0
##$ME_mod= 0
##$MI= 0
##$NCOEF= 0
##$NC_proc= -5
##$NLEV= 6
##$NOISF1= 0
##$NOISF2= 0
##$NSP= 0
##$NTH_PI= 0
##$NZP= 0
##$OFFSET= 16.522
##$PC= 1
##$PHC0= -40.04253
##$PHC1= 0.3076359
##$PH_mod= 1
##$PKNL= yes
##$PPARMOD= 0
##$PSCAL= 4
##$PSIGN= 0
##$REVERSE= no
##$SF= 250.13
##$SI= 32768
##$SIGF1= 0
##$SIGF2= 0
##$SINO= 400
##$SIOLD= 32768
##$SREGLST= <1H.CDCl3>
##$SSB= 0
##$STSI= 32768
##$STSR= 0
##$SW_p= 5175.98343685301
##$SYMM= 0
##$S_DEV= 0
##$TDeff= 65536
##$TDoff= 0
##$TI= <Analysis number 999999
Compound Code 99
Book Reference 9
Project Code 9>
##$TILT= no
##$TM1= 0
##$TM2= 0
##$TOPLEV= 0
##$USERP1= <user>
##$USERP2= <user>
##$USERP3= <user>
##$USERP4= <user>
##$USERP5= <user>
##$WDW= 1
##$XDIM= 32768
##$YMAX_p= 359438825
##$YMIN_p= -1835684
$$ End of Bruker specific parameters
$$ ---------------------------------
##NTUPLES= NMR SPECTRUM
##VAR_NAME=  FREQUENCY,     SPECTRUM/REAL,   SPECTRUM/IMAG
##SYMBOL=    X,             R,               I
##VAR_TYPE=  INDEPENDENT,   DEPENDENT,       DEPENDENT
##VAR_FORM=  AFFN,          ASDF,            ASDF
##VAR_DIM=   32768,         32768,           32768
##UNITS=     HZ,            ARBITRARY UNITS, ARBITRARY UNITS
##FACTOR=    0.157963299565203, 1,           1
##FIRST=     4132.6476996994, 0,             0
##LAST=      -1043.33573715361, 0,           0
##MIN=       -1043.33573715361, -1835684,    0
##MAX=       4132.6476996994, 359438825,     0
$$ Real data points
##PAGE= N=1
##DATA TABLE= (X++(R..R)), XYDATA
$$ [...]
$$ plain form
18268 -670412 -526261 -275506 321880 634260 1010940 989622 770822 549670 429895 574122
18258 574122 453457 655653 657077 483642 576686 136812 388588 627583 461930 777376
18248 777376 1267628 1250522 1149216 1128599 596692 689706 1085419 1352617 1569798 1430339
18238 1430339 811113 714608 1166665 1255900 1648852 1563930 1303198 1417164 1385823 1864854
18228 1864854 2642320 2598309 2109834 2132738 2055881 2053685 1812971 1642657 1653053 1012854
18218 1012854 550456 280939 559644 1368175 1583031 1552112 1760649 1621631 1659108 1670303
18208 1670303 1780012 1814151 1753644 1226367 1023268 1208254 1510748 1829803 2303174 2790868
18198 2790868 2109172 1451988 1716407 1999290 1717606 1168774 948464 745899 922995
$$ packed form
18268f70412J44151K50755N97386L12380L76680k1318k18800k21152j19775J44227
18258E74122j20665K02196J424j73435R3044m39874K51776K38995j65653L15446
18248G77376M90252j7106j01306k0617n31907R3014L95713K67198K17181j39459
18238A430339o19226r6505M52057Q9235L92952q4922k60732J13966l1341M79031
18228A864854P77466m4011m88475K2904p6857k196k40714j70314J0396o40199
18218A012854m62398k69517K78705Q08531K14856l0919K08537j39018L7477J1195
18208A670303J09709L4139o0507n27277k03099J84986L02494L19055M73371M87694
18198B790868o81696o57184K64419K82883k81684n48832k20310k02565J77096
$$ plain form
18189 922995 1400153 984695 516351 505307 449246 869713 1123514 915536 994683 1156899
18179 1156899 932357 1127869 940118 951056 1118666 1228343 1343323 1559073 1423345 1379542
18169 1379542 1871230 1909479 1690973 1911151 1560784 1403711 1672373 1964467 2273990 2569852
18159 2569852 2785192 2917696 2853692 2670216 2696424 2928700 3367416 3720524 3752584 4473251
18149 4473251 5075698 5070963 4858969 4978120 5222912 5479671 5534027 5396418 5328858 5837789
18139 5837789 6346842 6595856 6734815 7025508 7887625 8836029 9557155 10640267 11670254
18130 11670254 12747184 13948498 15404069 17613742 20018412 23181640 26633936 31171477
18122 31171477 36538761 42853454 51026719 63395373 82446518 111166668 147739458
$$ packed form
18189I22995M77158m15458m68344j1044n6061M20467K53801k07978P9147J62216
18179A156899k24542J95512j87751J0938J67610J09677J14980K15750j35728m3803
18169A379542M91688L8249k18506K20178l50367j57073K68662K92094L09523K95862
18159B569852K15340J32504o4004j83476K6208K32276M38716L53108L2060P20667
18149D473251O02447m735k11994J19151K44792K56759N4356j37609o7560N08931
18139E837789N09053K49014J38959K90693Q62117R48404P21126J083112J029987
18130A1670254J076930J201314J455571K209673K404670L163228L452296M537541
18122C1171477N367284O314693Q173265J2368654J9051145K8720150L6572790
$$ plain form
18115 147739458 182683474 216132351 249634667 274137755 282241394 281611326 284800908
18108 284800908 297814750 324368893 359438825 332733099 212855505 121488392 78021180
18101 78021180 56160541 43489144 34823765 28752949 25105739 22730575 20376796 18094957
18093 18094957 16214433 14664469 13373710 12635189 12089766 11764493 11716093 11255897 10706798
18084 10706798 10217604 9640375 9198829 8507356 7896967 7833320 7287706 6651199 6893606
18075 6893606 6956544 6356485 5795195 5172513 4804957 4689882 4649423 4616113 4724519 4869276
18065 4869276 5041218 4881142 4481105 4499332 4274977 4340202 4870431 4901851 4264201 3895615
18055 3895615 3835939 3633370 3468508 3488066 2987948 2774777 2626860 2395888 2012720 1904284
$$ packed form
18115A47739458L4944016L3448877L3502316K4503088Q103639o30068L189582
18108B84800908J3013842K6554143L5069932k6705726j19877594r1367113m3467212
18101G8021180k1860639j2671397q665379o070816l647210k375164k353779k281839
18093A8094957j880524j549964j290759p38521n45423l25273m8400m60196n49099
18084A0706798m89194n77229m41546o91473o10389o3647n45614o36507K42407
18075F893606O2938o00059n61290o22682l67556j15075m0459l3310J08406J44757
18065D869276J71942j60076m00037J8227k24355O5225N30229L1420o37650l68586
18055C895615n9676k02569j64862J9558n00118k13171j47917k30972l83168j08436
$$ plain form
18045 1904284 2012084 1879969 1970236 2267988 2970268 2997475 2691379 2042527 1876069 1450750
18035 1450750 1364322 1837143 1871787 1334727 1304872 1660545 1861401 1926671 2206099 2552591
18025 2552591 2277231 1401375 1008169 1134488 1170706 838761 161304 254326 484002 859297
18015 859297 1018640 1172077 1167528 1294216 1278987 1003194 1306905 1321671 1160880 1200854
18005 1200854 2084410 2698815 2932340 2914898 2484295 2697264 2942356 2945233 2532531 2737124
17995 2737124 2544886 2644442 2718495 2942167 2852682 2707877 2625499 2913469 2720993 2353916
17985 2353916 1905783 1420775 1549113 1270617 1005603 900241 1187056 980031 639660
17976 639660 870859 1054663 1032680 1292855 1349700 995188 720034 403501 471809 444318
$$ packed form
18045A904284J07800j32115R0267K97752P02280K7207l06096o48852j66458m25319
18035A450750q6428M72821L4644n37060k9855L55673K00856O5270K79428L46492
18025B552591k75360q75856l93206J26319L6218l31945o77457R3022K29676L75295
18015H59297J59343J53437m549J26688j5229k75793L03711J4766j60791L9974
18005A200854Q83556O14405K33525j7442m30603K12969K45092K877m12702K04593
17995B737124j92238R9556P4053K23672q9485j44805q2378K87970j92476l67077
17985B353916m48133m85008J28338k78496k65014j05362K86815k07025l40371
17976F39660K31199J83804k1983K60175N6845l54512k75154l16533O8308k7491
$$ plain form
17966 444318 632638 705085 289121 1003623 1616866 1647004 1466163 1601183 931954 683316
17956 683316 921983 618858 460495 954071 1463490 1285375 860231 878733 1315499 1320976
17946 1320976 1296650 1452263 1437358 1325312 1229811 1285816 1113594 750316 870347 1212942
17936 1212942 1555061 1203491 971966 1149270 833881 566876 321775 207949 663656
17927 663656 621707 371751 193131 178697 248533 383502 372789 300768 772850 773105 417018
17916 417018 700241 501796 264187 603253 628592 559752 -79950 -225867 -160039 167465
17906 167465 402306 556314 407517 25499 37798 140872 373132 844155 727625 982546
17896 982546 920336 492662 91923 230215 493416 896437 872582 776584 901403 844594
$$ packed form
17966D44318J88320P2447m15964P14502O13243L0138j80841J35020o69229k48638
17956F83316K38667l03125j58363M93576N09419j78115m25144J8502M36766N477
17946A320976k4326J55613j4905j12046r5501N6005j72222l63278J20031L42595
17936A212942L42119l51570k31525J77304l15389k67005k45101j13826M55707
17927F63656m1949k49956j78620j4434O9836J34969j0713p2021M72082K55l56087
17916D17018K83223j98445k37609L39066K5339o8840o39702j45917O5828L27504
17906A67465K34841J54008j48797l82018J2299J03074K32260M71023j16530K54921
17896I82546o2210m27674m00739J38292K63201M03021k3855r5998J24819n6809
$$ plain form
17886 844594 1008515 272547 81016 633629 769288 1048244 1460428 888399 466645 366871
17876 366871 140596 -14164 49573 342546 666209 530073 273036 25541 85987 310523
17866 310523 409533 491963 -133083 -222485 -184895 -377885 -278950 242768 504551 849973
17856 849973 486341 336117 971114 930648 764949 623825 55996 -32718 191406 515950
17846 515950 393290 46890 -81825 -251748 -329668 -505523 10554 359222 293161 26910
17836 26910 -405551 -613397 -316090 51611 638668 561486 468244 301445 39042 -11333
17826 -11333 184187 222001 675222 414095 184375 71411 350064 652554 161925 299628
17816 299628 -81368 -438731 45054 20215 -184504 -102493 17566 196612 197891 178319
$$ packed form
17886H44594J63921p35968j91531N52613J35659K78956M12184n72029m21754r9774
17876C66871k26275j54760O3737K92973L23663j36136k57037k47495O0446K24536
17866C10523R9010Q2430o25046q9402L7590j92990R8935N21718K61783L45422
17856H49973l63632j50224O34997m0466j65699j41124n67829q8714K24124L24544
17846E15950j22660l46400j28715j69923p7920j75855N16077L48668o6061k66251
17836B6910m32461k07846K97307L67701N87057p7182r3242j66799k62403n0375
17826a1333J95520L7814M53221k61127k29720j12964K78653L02490m90629J37703
17816B99628l80996l57363M83785k4839k04719Q2011J20059J79046J279j9572
$$ plain form
17806 178319 399207 190931 -89808 -198444 -85856 97267 649391 815319 616217 46403
17796 46403 -27086 416976 583667 248821 -135954 -253572 -12891 827 -346852 -135200
17786 -135200 693369 408390 -62249 -123023 122264 443564 742059 414461 -177024 -240440
17776 -240440 -411488 -477394 -168063 93103 469770 818627 798488 751791 778452 1032245
17766 1032245 1010713 852019 741806 786693 204396 253708 638309 472080 313049 374033
17756 374033 41014 -375431 -512614 -197745 180930 -169523 -547372 -505220 98723 182117
17746 182117 103983 -239396 -85457 540546 1028530 697010 72372 93652 308016 593444
17736 593444 304244 316115 145035 520344 730280 433442 237141 -46834 183783 211116
$$ packed form
17806A78319K20888k08276k80739j08636J12588J83123N52124J65928j99102n69814
17796D6403p3489M44062J66691l34846l84775j17618K40681J3718l47679K11652
17786a35200Q28569k84979m70639o0774K45287L21300K98495l27598n91485o3416
17776b40440j71048o5906L09331K61166L76667L48857k0139m6697K6661K53793
17766A032245k1532j58694j10213M4887n82297M9312L84601j66229j59031O0984
17756C74033l33019m16445j37183L14869L78675l50453l77849M2152O03943Q3394
17746A82117p8134l43379J53939O26003M87984l31520o24638K1280K14364K85428
17736E93444k89200J1871j71080L75309K09936k96838j96301k83975K30617K7333
$$ plain form
17726 211116 250770 397050 476204 539882 491879 298203 67303 -79189 167227 210277
17716 210277 326432 186444 -21430 1177031 1709436 1180488 1176209 931779 736051 763061
17706 763061 1501132 1417939 780539 697353 475706 522233 758432 931119 937477 666892
17696 666892 748971 783505 1148285 992675 737447 744499 1477012 1742856 1739351 1529803 1277564
17685 1277564 1162598 1121152 1013046 876576 1176508 2105693 2699460 2619333 2260826 2225529
17675 2225529 1912180 1783520 2196753 2840427 3775743 3545537 3096138 3578753 3954304
17666 3954304 4668868 5124751 4897838 4813797 5315251 5571024 5592168 5770452 6331852 6847251
17656 6847251 6898604 7471550 8342586 8808962 8809728 9280810 10668896 12215484 13771269 15171736
$$ packed form
17726B11116L9654J46280P9154O3678m8003j93676k30900j46492K46416M3050
17716B10277J16155j39988k07874J198461N32405n28948m279k44430j95728K7010
17706G63061P38071q3193o37400q3186k21647M6527K36199J72687O358k70585
17696F66892Q2079L4534L64780j55610k55228P052P32513K65844l505k09548k52239
17685A277564j14966m1446j08106j36470K99932R29185N93767q0127l58507l5297
17675B225529l13349j28660M13233O43674R35316k30206m49399M82615L75551
17666C954304P14564M55883k26913q4041N01454K55773K1144J78284N61400N15399
17656F847251N1353N72946Q71036M66376P66M71082J388086J546588J555785J400467
$$ plain form
17646 15171736 17102123 20322218 23849651 27981269 33146353 40405468 51516555 66355621
17638 66355621 83785198 103325710 122122955 137387299 148610366 155957675 159721758
17631 159721758 163426202 171292941 182188441 182344596 165388486 135973943 91792720
17624 91792720 60072630 43824268 34878447 29296671 25405020 22922072 21967283 21618595
17616 21618595 21809082 23001288 24541636 26001266 28103711 30723467 31998627 33375505
17608 33375505 34551710 35799641 37540988 40255614 43356049 43838804 39680840 36398811
17600 36398811 35149057 34261427 33425779 32778960 33042457 34502351 36465404 36598241 32047861
17591 32047861 26564071 23471093 22966084 23740077 25868263 28331677 31217518 34817333
$$ packed form
17646A5171736J930387L220095L527433M131618N165084P259115J1111087J4839066
17638F6355621J7429577J9540512J8797245J5264344J1223067P347309L764083
17631A59721758L704444P866739J0895500J56155j6956110k9414543m4181223
17624I1792720l1720090j6248362q945821n581776l891651k482948r54789l48688
17616B1618595J90487J192206J540348J459630K102445K619756J275160J376878
17608C3375505J176205J247931J741347K714626L100435M82755m157964l282029
17600C6398811j249754q87630q35648o46819K63497J459894J963053J32837m550380
17591C2047861n483790l092978n05009P73993K128186K463414K885841L599815
$$ plain form
17583 34817333 40762286 50015216 63168484 78523254 94617431 111093284 125050433
17576 125050433 135646738 142378461 145775908 147878238 153430932 163702065 170086101 152441795
17568 152441795 123513425 88147621 56211265 38272327 28849245 23442742 19858543
17561 19858543 17008178 15216072 14115507 12652306 11297240 10533439 9788569 9246193
17553 9246193 8682133 8259013 7966595 8088808 7597594 7057375 6268209 5928771 6011143 6301387
17543 6301387 6292959 5740323 5739954 6047897 5701574 5117045 4919213 4802192 4512721 3993869
17533 3993869 3810093 3979861 4201409 4744990 5103011 4852234 4679435 4684884 4536826 4649436
17523 4649436 4901413 4489093 4164660 3717713 3154425 2678959 2147111 1973765 1104618
$$ packed form
17583C4817333N944953R252930J3153268J5354770J6094177J6475853J3957149
17576A25050433J0596305O731723L397447K102330N552694J0271133O384036j7644306
17568A52441795k8928370l5365804l1936356j7938938r423082n406503l584199
17561A9858543k850365j792106j100565j463201j355066p63801p44870n42376
17553I246193n64060m23120k92418J22213m91214n40219p89166l39438Q2372K90244
17543F301387q428n52636l69L07943l46323n84529j97832j17021k89471n18852
17533C993869j83776J69768K21548N43581L58021k50777j72799N449j48058J12610
17523D649436K51977m12320l24433m46947n63288m75466n31848j73346q69147
$$ plain form
17514 1104618 1166370 1251407 1923663 2545574 2148859 2137669 2800302 2859198 2820830 2866823
17504 2866823 2721028 2638415 2493901 2513079 2419118 1906109 1578855 1331505 1134856 1458598
17494 1458598 1167377 1065363 1101477 1766099 2152362 1912799 1568372 958984 883048 867257
17484 867257 1069833 1406974 915491 784363 921340 748098 582997 450814 703309 990688
17474 990688 1192015 1079136 1133371 960706 1113498 1283195 1527378 1195351 958441 982224
17464 982224 1338452 1514313 1514334 1051687 1665814 1218044 897682 1014860 1149773 1415244
17454 1415244 1235332 1583738 2160565 2503831 2472595 2498760 2171446 2008084 2124690 2404050
17444 2404050 2959546 3026455 2789111 3143207 2842180 2631837 2299657 1485597 1410154 1456810
$$ packed form
17514A104618O1752Q5037O72256O21911l96715j1190O62633N8896l8368M5993
17504B866823j45795q2613j44514J9178r3961n13009l27254k47350j96649L23742
17494A458598k91221j02014L6114O64622L86263k39563l44427o09388p5936j5791
17484H67257K02576L37141m91483j31128J36977j73242j65101j32183K52495K87379
17474I90688K01327j12879N4235j72665J52792J69697K44183l32027k36910K3783
17464I82224L56228J75861K1m62647O14127m47770l20362J17178J34913K65471
17454A415244j79912L48406N76827L43266l1236K6165l27314j63362J16606K79360
17444B404050N55496O6909k37344L54096l01027k10343l32180q14060p5443M6656
$$ plain form
17434 1456810 1498321 1427652 1554927 1365918 1314648 903379 633427 843676 1087169 924517
17424 924517 806576 374964 302887 233483 -35947 -232227 -473012 -86568 153108 698541
17414 698541 815609 751719 606020 735734 422132 335389 571710 635773 716360 368005
17404 368005 617952 964547 836420 685956 49935 -153314 -107323 -199933 169765 511881
17394 511881 645295 665415 658373 877529 546374 775836 983687 1068663 361594 -77296
17384 -77296 128846 236602 305200 -22105 137090 451782 318757 411698 578600 440280
17374 440280 -36370 113179 290840 195334 158642 234266 364908 323213 158961 103457
17364 103457 338537 233167 130391 244674 393988 610627 549178 91642 53366 281948
$$ packed form
17434A456810M1511p0669J27275j89009n1270m11269k69952K10249K43493j62652
17424I24517j17941m31612p2077o9404k69430j96280k40785L86444K39676N45433
17414F98541J17068o3890j45699J29714l13602q6743K36321O4063Q0587l48355
17404C68005K49947L46595j28127j50464o36021k03249M5991r2610L69698L42116
17394E11881J33414K0120p042K19156l31155K29462K07851Q4976p07069m38890
17384g7296K06142J07756O8598l27305J59195L14692j33025R2941J66902j38320
17374D40280m76650J49549J77661r5506l6692P5624J30642m1695j64252n5504
17364A03457K35080j05370j02776J14283J49314K16639o1449m57536l8276K28582
$$ plain form
17354 281948 479483 859339 1088178 970802 402649 193346 138349 479692 730706 691397
17344 691397 183427 -215253 -301662 229550 486480 447387 278279 189651 -129032 -209698
17334 -209698 224848 135719 403059 732273 425734 -96844 283063 856569 986203 717191
17324 717191 539901 815456 706471 558667 843406 1100494 775133 991953 981599 514846
17314 514846 542581 586338 590907 859733 939495 658309 342317 243532 875643 1059963 482883
17303 482883 -48083 202259 68337 -91556 -206287 -68196 -306011 -251396 28693 329360
17293 329360 822478 663746 228667 91505 137314 336026 550380 675715 491690 298714
17283 298714 116477 -59151 -562638 -510155 -408221 -119496 298248 302129 -114989 -425444
$$ packed form
17354B81948J97535L79856K28839j17376n68153k09303n4997L41343K51014l9309
17344F91397n07970l98680q6409N31212K56930l9093j69108q8628l18683q0666
17334b09698M34546q9129K67340L29214l06539n22578L79907N73506J29634k69012
17324G17191j77290K75555j08985j47804K84739K57088l25361K16820j0354m66753
17314E14846K7735M3757M569K68826P9762k81186l15992r8785O32111J84320n77080
17303D82883n30966K50342j33922j59893j14731J38091k37815N4615K80089L00667
17293C29360M93118j58732m35079j37162M5809J98712K14354J25335j84025j92976
17283B98714j82237j75628n03487N2483J01934K88725M17744L881m17118l10455
$$ plain form
17273 -425444 -9530 793631 561708 -45841 -581172 -424684 97036 477427 721577 907861
17263 907861 724991 294862 -87055 2691 26963 69074 140461 28320 50265 -513833
17253 -513833 -612319 -252174 -114682 -132757 11645 594438 536795 323502 27991 -198825
17243 -198825 105097 -121485 -306454 -261968 317004 762665 798929 606195 700484 827251
17233 827251 837836 1007517 711055 -201206 -406258 -92726 324588 692268 74890 -159250
17223 -159250 179550 49006 255313 379786 -337654 -749060 -143384 520803 534894 218729
17213 218729 133894 233418 418280 323538 370086 628100 646000 528860 136736 -170377
17203 -170377 86850 -30644 139389 375378 52689 -126641 -148312 285 133328 -2707
$$ packed form
17273d25444M15914Q03161k31923o07549n35331J56488N21720L80391K44150J86284
17263I07861j82870m30129l81917Q9746K4272M2111P1387j12141K1945n64098
17253e13833r8486L60145J37492j8075J44402N82793n7643k13293k95511k26816
17243a98825L03922k26582j84969M4486N78972M45661L6264j92734R4289J26767
17233H27251J0585J69681k96462r12261k05052L13532M17314L67680o17378k34140
17223a59250L38800j30544K06307J24473p17440m11406O05676O64187J4091l16165
17213B18729q4835R9524J84862r4742M6548K58014J7900j17140l92124l07113
17203a70377K57227j17494J70033K35989l22689j79330k1671J48597J33043j36035
$$ plain form
17193 -2707 -36065 -135746 38395 322346 636026 695551 420142 230696 364550 276799 366396
17182 366396 599211 524276 847516 861705 90554 -137806 -133346 -99121 -5172 -130385 -224158
17171 -224158 -125567 -111528 357591 580537 618121 472224 47223 -495723 -824311 -486658
17161 -486658 114201 19722 -368289 53139 174839 -38621 -498261 -183248 411575 289468
17151 289468 -111485 -10936 310661 -110976 -690334 -670707 -705813 -194571 430812 163176
17141 163176 102000 186943 -50635 -429440 -697314 -796557 -1176994 -911159 -939944 -704756
17131 -704756 -610792 -394658 179046 545072 334444 -55148 161521 116949 95776 284357
17121 284357 -155014 -436720 -239400 213127 449925 114347 828598 1007021 1291905 1412180
$$ packed form
17193b707l3358r9681J74141K83951L13680N9525k75409j89446J33854q7751Q9597
17182C66396K32815p4935L23240J4189p71151k28360M460L4225R3949j25213r3773
17171b24158R8591J4039M69119K22946L7584j45897m25001n42946l28588L37653
17161d86658O00859r4479l88011M21428J21700k13460m59640L15013N94823j22107
17151B89468m00953J00549L21597m21637n79358J9627l5106N11242O25383k67636
17141A63176o1176Q4943k37578l78805k67874r9243l80437K65835k8785K35188
17131g04756R3964K16134N73704L66026k10628l89592K16669m4572k1173J88581
17121B84357m39371k81706J97320M52527K36798l35578P14251J78423K84884J20275
$$ plain form
17111 1412180 1449941 926481 405613 202898 214889 144263 191273 -68043 -104166 114308
17101 114308 264270 372324 207448 -365339 -241215 -45249 200893 -229155 -453531 -358772
17091 -358772 -342175 -654197 -721887 -103219 223871 225304 550583 369998 -11250 -22062
17081 -22062 380254 136126 -106790 -227656 92507 106026 241448 418563 40588 -101439
17071 -101439 -68713 -84971 214819 500937 618406 422879 358023 109171 -135062 -194007
17061 -194007 200040 354666 1057280 1372548 1331783 1355055 993464 918502 973322 1474689
17051 1474689 1724266 1675068 1274405 890208 1145984 915760 619427 342416 382862 464638
17041 464638 -129182 -170330 -320955 -723029 -923792 -414747 61079 512858 503441 -468022
$$ packed form
17111A412180L7761n23460n20868k02715J1991p0626M7010k59316l6123K18474
17101A14308J49962J08054j64876n72787J24124J95966K46142m30048k24376R4759
17091c58772J6597l12022o7690O18668L27090J433L25279j80585l81248j0812
17081b2062M02316k44128k42916j20866L20163J3519J35422J77115l77975j42027
17071a01439L2726j6258K99790K86118J17469j95527o4856k48852k44233n8945
17061a94007L94047J54626P02614L15268m0765K3272l61591p4962N4820N01367
17051A474689K49577m9198m00663l84197K55776k30224k96333k77011M0446Q1776
17041D64638n93820m1148j50625m02074k00763N09045M75826M51779r417r71463
$$ plain form
17031 -468022 -460974 -110899 100103 290018 166600 423318 510359 595999 698983 319072
17021 319072 -79844 -548801 -273374 -14358 -72469 418879 815479 635047 413294 220570
17011 220570 162913 71660 -46074 424165 344139 175133 262747 266222 882952 813788 574203
17000 574203 503991 -237981 -291942 -464055 -731954 -614925 -581572 -646087 -610787 -390190
16990 -390190 20528 22729 -69652 139816 442590 239769 -170493 -378077 -213911 -497056
16980 -497056 -478292 -207185 -218359 -211516 -260072 -276612 -429483 -67478 -177825 -212118 -226070
16969 -226070 -458834 -69834 306817 212890 -900 -117692 -551630 -647522 -579241 -721703
16959 -721703 -400753 -450145 -635727 -109771 312260 449247 131147 -120741 -314570 -266101
$$ packed form
17031d68022P048L50075K11002J89915j23418K56718Q7041Q5640J02984l79911
17021C19072l98916m68957K75427K59016n8111M91348L96600j80432k21753j92724
17011B20570n7657r1253j17734M70239q0026j69006Q7614L475O16730o9164k39585
17000E74203p0212p41972n3961j72113k67899J17029L3353o4515L5300K20597
16990c90190M10718K201r2381K09468L02774k02821m10262k07584J64166k83145
16980d97056J8764K71107j1174O843m8556j6540j52871L62005j10347l4293j3952
16969b26070k32764L89000L76651r3927k13790j16792m33938r5892O8281j42462
16959g21703L20950m9392j85582N25956M22031J36987l18100k51888j93829M8469
$$ plain form
16949 -266101 -443745 -504895 -153697 107656 -3087 -30979 424526 387846 190089 -381915
16939 -381915 -179061 102545 -31353 -203768 93559 439167 656157 285176 -48272 -329832
16929 -329832 -344121 -148187 -54063 31127 118920 22349 221400 423077 465750 101044 -215948
16918 -215948 -751866 -820038 -596118 -318348 -290879 -114612 -482567 -653132 -608957 -522336
16908 -522336 -271554 5298 258217 25864 -142491 -434864 -557773 212225 544770 401675
16898 401675 68684 -8664 -148221 321242 657186 622450 424307 843626 1009341 534845
16888 534845 37995 49612 20696 85823 -68857 -46060 202939 529701 889116 735977
16878 735977 449263 134470 158863 -18450 -492793 -935542 -1044422 -930484 -200235 297987
$$ packed form
16949b66101j77644o1150L51198K61353j10743k7892M55505l6680j97757n72004
16939c81915K02854K81606j33898j72415K97327L45608K16990l70981l33448k81560
16929c29832j4289J95934R4124Q5190Q7793r6571J99051K01677M2673l64706l16992
16918b15948n35918o8172K23920K77770K7469J76267l67955j70565M4175Q6621
16908e22336K50782K76852K52919k32353j68355k92373j22909P69998L32545j43095
16898D01675l32991p7348j39557M69463L35944l4736j98143M19319J65715m74496
16888E34845m96850J1617k8916O5127j54680K2797K48999L26762L59415j53139
16878G35977k86714l14793K4393j77313m74343m42749j08880J13938P30249M98222
$$ plain form
16868 297987 492378 293275 -99769 -189233 -120510 61973 -144838 212767 356525 142999
16858 142999 -50931 464986 610410 282985 615726 889999 1010357 511001 240513 308928
16848 308928 241240 -270470 -551676 -289836 -767386 -1306050 -1528459 -1113986 -236618 137882
16838 137882 514599 271798 -211756 -102253 -346087 -605185 -982635 -431602 -149966 -57645
16828 -57645 -425523 -437186 48767 -638592 -1219217 -1020708 -590934 -155318 241763 288390
16818 288390 324797 331809 -36089 -308138 -512847 -555561 -938434 -1178147 -1126324 -982750
16808 -982750 -1040555 -800895 -599142 -434954 -296214 -158363 -86525 -66873 -56544 -102070
16798 -102070 -112953 -228451 -179917 -131869 -647541 -1039534 -810941 -177576 190281 57650
$$ packed form
16868B97987J94391j99103l93044q9464O8723J82483k06811L57605J43758k13526
16858A42999j93930N15917J45424l27425L32741K74273J20358m99356k70488O8415
16848C08928o7688n11710k81206K61840m77550n38664k22409M14473Q77368L74500
16838A37882L76717k42801m83554J09503k43834k59098l77450N51033K81636R2321
16828e7645l67878j1663M85953o87359n80625J98509M29774M35616L97081M6627
16818B88390L6407P012l67898k72049k04709m2714l82873k39713N1823J43574
16808i82750n7805K39660K01753J64188J38740J37851P1838J9652J0329m5526
16798a02070j0883j15498M8534M8048n15672l91993K28593O33365L67857j32631
$$ plain form
16788 57650 -122618 502758 270193 -216617 -171608 -564701 -426339 -419145 -58205 -46790
16778 -46790 269175 554199 600850 473886 356815 -304813 -731904 -295856 -508221 -455263
16768 -455263 -202513 178799 122120 70023 -282719 -561075 -715070 -552764 -322381 -88038
16758 -88038 351628 183053 -152573 -278427 -267885 -366300 -117590 -27633 -243061 -581314
16748 -581314 -932640 -871808 -535197 -298300 -633440 -534080 423771 383803 461579 488410
16738 488410 274036 -18055 -458501 -879758 -679446 -390954 102738 -18784 -366111 -540553
16728 -540553 -668798 -220968 419237 417759 132805 -83332 245130 657181 909002 714053
16718 714053 903218 978160 361228 -250744 -325827 -385246 -710004 -1152900 -1071409 -885940
$$ packed form
16788E7650j80268O25376k32565m86810M5009l93093J38362P194L60940J1415
16778d6790L15965K85024M6651j26964j17071o61628m27091M36048k12365N2958
16768d55263K52750L81312n6679n2097l52742k78356j53995J62306K30383K34343
16758h8038M39666j68575l35626j25854J0542r8415K48710Q9957k15428l38253
16748e81314l51326O0832L36611K36897l35140R9360R57851l9968P7776K6831
16738D88410k14374k92091m40446m21257K00312K88492M93692j21522l47327j74442
16728e40553j28245M47830O40205j478k84954k16137L28462M12051K51821j94949
16718G14053J89165P4942o16932o11972p5083n9419l24758m42896Q1491J85469
$$ plain form
16708 -885940 -488694 23374 92962 69867 279441 793488 1093557 988642 852013 784222
16698 784222 312967 -9610 -80900 710545 1207402 1378541 1044854 840103 868085 798513
16688 798513 542638 -383476 -354174 -40685 -510260 -337456 89834 -141251 -98910 326108
16678 326108 324608 -304161 -738831 -736129 -514962 -13684 78160 -19068 -442934 -743377 -408023
16667 -408023 -387073 -510086 -475852 -303490 407749 660131 497707 348588 182822 -228232
16657 -228232 -206462 58784 -59954 -136981 -212187 -362975 -408 354934 481731 435215
16647 435215 -104908 -152904 -359740 -308813 -31722 -28322 -371349 -750812 -902927 -482969
16637 -482969 -45299 84374 52455 -182239 98448 85212 122480 102088 -423446 -376081
$$ packed form
16708h85940L97246N12068O9588k3095K09574N14047L00069j04915j36629o7791
16698G84222m71255l22577p1290P91445M96857J71139l33687k04751K7982o9572
16688G98513k55875r26114K9302L13489m69575J72804M27290k31085M2341M25018
16678C26108j500o28769m34670K702K21167N01278R1844r7228m23866l00443L35354
16667d08023K0950j23013L4234J72362P11239K52382j62424j49119j65766m11054
16657b28232K1770K65246j18738p7027p5206j50788L62567L55342J26797m6516
16647D35215n40123m7996k06836N0927K77091L400l43027l79463j52115M19958
16637d82969M37670J29673l1919k34694K80687j3236L7268k0392n25534M7365
$$ plain form
16627 -376081 -96702 418605 154738 -111228 28109 -69410 -36622 -191171 -682230 -592943
16617 -592943 -36941 139535 930713 849171 214206 -281139 -298789 339989 223369 318484
16607 318484 731794 372884 -121138 -288314 76176 315512 393908 302463 426829 701734
16597 701734 410020 294906 49443 88247 187913 846632 826952 561672 144127 -231828
16587 -231828 -624371 -1287718 -939183 -155334 191658 -268410 -312468 239034 371694 420732
16577 420732 398398 169731 163704 -56073 280989 744608 860773 553505 399668 108100
16567 108100 -149654 -397888 -571214 -899070 -929315 -251995 -337493 -265091 445449 962025
16557 962025 1035649 591079 28825 59611 -154505 -338051 115326 148930 51981 61371 -94469
$$ packed form
16627c76081K79379N15307k63867k65966J39337r7519L2788j54549m91059Q9287
16617e92943N56002J76476P91178q1542o34965m95345j7650O38778j16620R5115
16607C18484M13310l58910m94022j67176L64490K39336P8396r1445J24366K74905
16597G01734k91714j15114k45463L8804R9666O58719j9680k65280m17545l75955
16587b31828l92543o63347L48535P83849L46992m60068m4058N51502J32660M9038
16577D20732k2334k28667o027k19777L37062M63619J16165l07268j53837k91568
16567A08100k57754k48234j73326l27856l0245O77320q5498P2402P10540N16576
16557I62025P3624m44570n62254L0786k14116j83546M53377L3604r6949R390j55840
$$ plain form
16546 -94469 22588 -177798 -203550 -290984 -34091 -211079 -378768 -762334 -481729 -183791
16536 -183791 -108402 367123 245781 -109242 -367698 -280763 49304 439854 459018 597237
16526 597237 541740 54640 217562 536587 423238 526409 508918 39348 -90498 422458
16516 422458 42705 -84033 97728 429884 365900 -103183 -436909 -9632 170131 302825
16506 302825 961098 451129 -238905 -360253 58723 -208538 -350753 -266775 -17177 -122651
16496 -122651 -97610 180338 152992 220506 6456 -256932 -352498 -214205 359794 475591
16486 475591 260854 32521 -50669 78476 -31293 27170 -10321 236692 484861 365509
16476 365509 405187 294425 -30366 421555 758608 875276 942821 607033 264117 233221
$$ packed form
16546i4469J17057k00386k5752q7434K56893j76988j67689l83566K80605K97938
16536a83791P5389M75525j21342l55023k58456Q6935L30067L90550J9164J38219
16526E97237n5497m87100J62922L19025j13349J03171j7491m69570j29846N12956
16516D22458l79753j26738J81761L32156o3984m69083l33726M27277J79763J32694
16506C02825O58273n09969o90034j21348M18976k67261j42215Q3978K49598j05474
16496a22651K5041K77948k7346O7514k14050k63388r5566J38293N73999J15797
16486D75591k14737k28333q3190J29145j09769N8463l7491K47013K48169j19352
16476C65509L9678j10762l24791M51921L37053J16668O7545l35788l42916l0896
$$ plain form
16466 233221 258678 283308 212741 -85225 -212746 -96844 208015 -8886 -93569 434560
16456 434560 497793 174964 232984 271562 561778 405050 223665 6588 -269173 -632966
16446 -632966 -272784 -128055 -20078 -383188 -163525 -167145 -182121 169474 96954 29338
16436 29338 -49888 33892 -498429 -800029 -20468 99756 93417 77527 -311994 -52345 148503
16425 148503 -147291 -437714 -681354 -914988 -962731 -693493 -217623 -537441 -721140 -310621
16415 -310621 -442567 -702862 -707901 -685741 -503594 -550498 -559062 -808204 -507828 -306094 -6882
16404 -6882 -8207 48195 -319185 -415414 -455364 -255878 -404010 -947042 -938753 -930806 -510047
16393 -510047 158654 596248 489673 295990 624354 483213 86389 48279 -104759 -113934
$$ packed form
16466B33221K5457K4630p0567k97966j27521J15902L04859k16901q4683N28129
16456D34560O3233l22829N8020L8578K90216j56728j81385k17077k75761l63793
16446f32966L60182J44729J07977l63110K19663l620j4976L51595p2520o7616
16436B9338p9226Q3780n32321l01600P79561J20224o339j5890l89521K59649K00848
16425A48503k95794k90423k43640k33634m7743K69238M75870l19818j83699M10519
16415c10621j31946k60295n039K2160J82147m6904q564k49142L00376K01734K99212
16404f882j325N6402l67380r6229l9950J99486j48132n43032Q289P947M20759
16393e10047O68701M37594j06575j93683L28364j41141l96824l8110j53038r175
$$ plain form
16383 -113934 22001 21583 -534926 -728654 -354982 -413294 -500554 -596068 -520617 -686726 -1051073
16372 -1051073 -689382 -406651 -179318 204814 410956 227556 413113 368558 261881 12747
16362 12747 -65694 54425 261118 67861 -174685 -408075 -129277 123461 202537 -218472
16352 -218472 -288630 -345464 146702 208755 -200531 -41826 228795 169001 -142723 -223764
16342 -223764 -404811 -817419 -894022 -339377 5603 -314416 -376169 -224932 -706557 -996918
16332 -996918 -962761 -586964 -511396 -436909 -476871 -232871 -400250 -622209 -432309 384208
16322 384208 259799 -5510 -370346 -668869 -748415 -214955 -132698 -450372 -229320 -315018
16312 -315018 -410066 -234382 -175594 -441749 -20031 192185 -398151 -484275 -569460 -887725
$$ packed form
16383a13934J35935m18n56509j93728L73672n8312q7260r5514P5451j66109l64347
16372a051073L61691K82731K27333L84132K06142j83400J85557m4555j06677k49134
16362A2747p8441J20119K06693j93257k42546k33390K78798K52738P9076m21009
16352b18472p0158n6834M92166O2053m09286J58705K70621n9794l11724q1041
16342b23764j81047m12608p6603N54645L44980l20019o1753J51237m81625k90361
16332i96918L4157L75797P5568P4487l9962K44000j67379k21959J89900Q16517
16322C84208j24409k65309l64836k98523p9546N33460Q2257l17674K21052q5698
16312c15018r5048J75684N8788k66155M21718K12216n90336q6124q5185l18265
$$ plain form
16302 -887725 -848208 -918310 -821062 -691052 -422720 -59463 -241212 -233402 -197055 -379727 -317914
16291 -317914 -231840 -695706 -1175307 -819921 -43571 409345 -19280 -374077 164777 457196
16281 457196 360873 209981 -147171 -321427 -213746 -107546 -100227 -395009 -169013 159853
16271 159853 219556 41245 -171334 -373534 -296607 123740 663990 586136 437566 33686
16261 33686 330226 681624 197418 -545190 -716276 -471549 -475021 -135653 33649 -376344
16251 -376344 -580668 -508078 -125556 -662773 -529514 194164 211769 -8979 -391542 3205
16241 3205 124686 -322653 -360590 373576 668971 612180 -152547 -750439 -915023 -710749
16231 -710749 -651453 -567493 -189798 340141 47871 -70110 42993 305727 114739 -417246
$$ packed form
16302h87725L9517p0102R7248J30010K68332L63257j81749P810L6347j82672O1813
16291c17914Q6074m63866m79601L55386P76350M52916m28625l54797N38854K92419
16281D57196r6323j50892l57152j74256J07681J06200P319k94782K25996L28866
16271A59853N9703j78311k12579k02200P6927M20347N40250p7854j48570m03880
16261C3686K96540L51398m84206p42608j71086K44727l472L39368J69302m09993
16251c76344k04324P2590L82522n37217J33259P23678J7605k20748l82563L94747
16241C205J21481m47339l7937P34166K95395n6791p64727n97892j64584K04274
16231g10749N9296Q3960L77695N29939k92270j17981J13103K62734j90988n31985
$$ plain form
16221 -417246 -273813 138781 259762 -9488 246196 529739 862700 770580 204027 33659
16211 33659 397506 -172645 -686100 -1115811 -643299 -9321 -28656 -438505 -488071 -166779
16201 -166779 -225752 -188958 98954 94400 -231710 -7489 -45760 -174985 -567062 -981048
16191 -981048 -1237869 -403515 494627 551419 562087 375838 312881 556760 479247 565968
16181 565968 738061 212330 -234422 -671834 -792783 -781228 -814588 -736955 -669352 -404322
16171 -404322 26911 446612 424418 536159 767005 253566 -385287 -212355 -313255 -302826
16161 -302826 82765 49024 -449301 -883380 -700595 -354310 -112461 -333168 -749237 -753672
16151 -753672 -362699 -30438 -312598 -643679 -777011 -810026 -406660 45345 75199 208546
$$ packed form
16221d17246J43433M12594J20981k69250K55684K83543L32961r2120n66553j70368
16211C3659L63847n70151n13455m29711M72512O33978j9335m09849m9566L21292
16201a66779n8973L6794K87912m554l26110K24221l8271j29225l92077m13986
16191i81048k56821Q34354Q98142N6792J0668j86249o2957K43879p7513Q6721
16181E65968J72093n25731m46752m37412j20949J1555l3360P7633O7603K65030
16171d04322M31233M19701k2194J11741K30846n13439o38853J72932j00900J0429
16161c02826L85591l3741m98325m34079J82785L46285K41849k20707m16069m435
16151g53672L90973L32261k82160l31081j33332l3015M03366M52005K9854J33347
$$ plain form
16141 208546 764852 578902 265047 505346 470295 503293 636883 624071 193692 -20196
16131 -20196 159767 -124316 114853 320729 164376 -169156 -177336 -130319 170995 200924
16121 200924 274419 504186 314746 234245 163402 -31830 146124 -12457 -491998 -416132
16111 -416132 87715 269929 404955 197216 217782 34521 -678252 -529861 -74279 142488
16101 142488 217357 -125548 259790 688146 618032 342048 200428 -239880 459932 826750
16091 826750 472852 41924 22168 -199207 15659 492682 711479 283717 115044 -20843
16081 -20843 331231 425020 -225628 -649006 -542065 -301934 -550782 -431720 -38089 -316571
16071 -316571 -700675 -931566 -628813 -119990 146853 316866 412789 556990 831114 868231
$$ packed form
16141B08546N56306j85950l13855K40299l5051L2998J33590j2812m30379k13888
16131b0196J79963k84083K39169K05876j56353l33532q180M7017L01314K9929
16121B00924P3495K29767j89440q0501p0843j95232J77954j58581m79541P5866
16111d16132N03847J82214J35026k07739K0566j83261p12773J48391M55582K16767
16101A42488P4869l42905L85338M28356p0114k75984j41620m40308O99812L66818
16091H26750l53898m30928j9756k21375K14866M77023K18797m27762j68673j35887
16081b0843L52074R3789o50648m23378J06941K40131k48848J19062L93631k78482
16071c16571l84104k30891L02753N08823K66843J70013R5923J44201K74124L7117
$$ plain form
16061 868231 591174 340742 327626 18444 -562196 -657932 -568142 -67795 -102043 -501346
16051 -501346 -372265 41277 259782 43726 -297556 -201563 -24489 133098 -103706 185880
16041 185880 296835 -29943 -114701 -22030 1606 -263175 -228585 -188005 -56695 -370104
16031 -370104 -435323 -555080 -413776 -188337 174708 449788 229149 -279046 -206269 -277255
16021 -277255 5466 -73433 -13804 326410 722164 909177 527562 67965 -139896 -586085
16011 -586085 -995755 -1281511 -958966 -20839 562868 226254 -79951 -590406 -426977 -333597
16001 -333597 -592537 -414471 -509541 -503938 -655021 -613367 -464381 -384794 -637069 -558265 -499481
15990 -499481 -314720 49189 411811 246764 -117200 -398931 -477729 -297795 -58550 160370
$$ packed form
16061H68231k77057k50432j3116l09182n80640r5736Q9790N00347l4248l99303
16051e01346J29081M13542K18505k16056l41282R5993J77074J57587k36804K89586
16041A85880J10955l26778q4758R2671K3636k64781L4590M0580J31310l13409
16031c70104o5219j19757J41304K25439L63045K75080k20639n08195P2777p0986
16021b77255K82721p8899N9629L40214L95754J87013l81615m59597k07861m46189
16011e86085m09670k85756L22545R38127N83707l36614l06205n10455J63429R3380
16001c33597k58940J78066r5070N603j51083M1654J48986P9587k52275P8804N8784
15990d99481J84761L63909L62622j65047l63964k81731p8798J79934K39245K18920
$$ plain form
15980 160370 164926 187193 125710 -87825 -175479 -647753 -751799 -717676 -591218 -460379 278123
15969 278123 417556 341490 610686 681738 676533 956905 373481 -99018 -262292 -88958
15959 -88958 17436 317673 62020 -357679 -372902 -642575 -999984 -898143 -1087801 -948465
15949 -948465 -497713 -216312 -361834 -809931 -965469 -1102942 -861756 -1056754 -1258138 -809735
15939 -809735 -300614 -74341 66084 174816 -186440 -335734 -355407 -361695 -402215 -1108867
15929 -1108867 -831634 -464429 -762487 -380773 327504 379362 639725 317525 -180550 -106624
15919 -106624 149484 -239221 -188822 -290479 192289 453327 230739 249920 227542 334811
15909 334811 323036 733731 516292 -513460 -754463 -300587 260440 40047 -382180 -669114
$$ packed form
15980A60370M556K2267o1483k13535q7654m72274j04046L4123J26458J30839P38502
15969B78123J39433p6066K69196P1052n205K80372n83424m72499j63274J73334
15959h8958J06394L00237k55653m19699j5223k69673l57409J01841j89658J39336
15949i48465M50752K81401j45522m48097j55538j37473K41186j94998k01384M48403
15939h09735N09121K26273J40425J08732l61256j49294j9673o288m0520p06652
15929a108867K77233L67205k98058L81714P08277N1858K60363l22200m98075P3926
15919a06624K56108l88705N0399j01657M82768K61038k22588J9181k2378J07269
15909C34811j1775M10695k17439j029752k41003M53876N61027k20393m22227k86934
$$ plain form
15899 -669114 -533984 -2850 252145 234918 -18711 -424142 -116549 53159 461896 -163487
15889 -163487 -307441 -123960 -444664 -347509 134544 136388 304853 229362 411724 281745
15879 281745 80348 -29361 86017 138959 507473 5861 -407098 -504403 -460493 -172049
15869 -172049 225945 180466 -102823 -559002 -235261 276468 571039 599063 497802 -127789
15859 -127789 -698682 -397023 -309326 -68010 -121054 -357002 -23421 305441 154917 -260612
15849 -260612 -549941 -1012314 -1086859 -854242 -682849 -634272 -986930 -817638 -917628 -942399
15839 -942399 -805687 -798902 -627339 -51674 -45518 -318872 63791 -42142 -107561 -183617 137581
15828 137581 -27490 47890 -13302 261186 277446 -198559 -474006 -760047 -1213739 -1495164
$$ packed form
15899f69114J35130N31134K54995j7227k53629m05431L07593J69708M08737o25383
15889a63487j43954J83481l20704R7155M82053J844J68465p5491J82362j29979
15879B81745k01397j09709J15378N2942L68514n01612m12959r7305M3910K88444
15869a72049L97994m5479k83289m56179L23741N11729K94571K8024j01261o25591
15859a27789n70893L01659Q7697K41316n3044k35948L33581L28862j50524m15529
15849b60612k89329m62373p4545K32617J71393M8577l52658J69292r9990k4771
15839i42399J36712O785J71563N75665O156k73354L82663j05933o5419p6056L21198
15828A37581j65071P5380o1192K74488J6260m76005k75447k86041m53692k81425
$$ plain form
15818 -1495164 -1037738 -115465 179123 -153178 -471651 -101006 254028 156562 -42249 -184277
15808 -184277 -167378 -204134 -435079 -432495 -390674 -489983 -432121 -144842 -181597 -363869 -447780
15797 -447780 -368385 -287464 17324 282898 169262 -98128 -463862 -596102 -837734 -607631
15787 -607631 -278401 16976 -103578 -213006 -278094 -179989 99110 327456 299068 258143
15777 258143 94440 -346703 -760638 -684736 -742424 -864082 -574890 -274765 38944 -154353
15767 -154353 -711 -129475 147793 816854 797243 299891 -25462 264646 -41092 83354
15757 83354 304357 362125 281216 497351 556127 482624 390326 -51238 77787 216132 -173409
15746 -173409 1735 475528 772517 699591 198422 333913 36807 -341534 -235323 -550671
$$ packed form
15818a495164M57426R22273K94588l32301l18473L70645L55034r7466j98811j42028
15808a84277J6899l6756k30945K584M1821r9309N7862K87279l6755j82272q3911
15797d47780P9395Q0921L04788K65574j13636k67390l65734j32240k41632K30103
15787f07631L29230K95377j20554j09428o5088R8105K79099K28346k8388m0925
15777B58143j63703m41143m13935P5902n7688j21658K89192L00125L13709j93297
15767a54353J53642j28764K77268O69061j9611m97352l25353K90108l05738J24446
15757H3354K21003N7768q0909K16135N8776p3503r2298m41564J29025J38345l89541
15746a73409J75144M73793K96989p2926n01169J35491k97106l78341J06211l15348
$$ plain form
15736 -550671 -460380 -216182 -80826 -260680 -245404 -17137 -153175 -308090 -497159 -225791
15726 -225791 -107399 -17231 -148755 -115017 -411472 -274779 276719 95351 134424 466497
15716 466497 493318 215929 -63488 36368 234976 360770 207857 578074 617643 -20001
15706 -20001 -210018 1125 -70317 -113591 -95951 -111152 -387253 -844344 -712332 -489238
15696 -489238 -241635 -280462 -172559 -297406 -587816 -709959 -1061547 -771415 -131952 -189259
15686 -189259 -613807 -815872 -419588 -535451 -527070 -269339 336977 366308 -124160 -465085
15676 -465085 -525489 -785237 -675796 -579047 -684015 -780842 -952386 -659232 -223814 45812
15666 45812 241478 47200 -74521 89478 99658 164464 174252 214039 464285 476650 435449
$$ packed form
15736e50671R0291K44198J35356j79854J5276K28267j36038j54915j89069K71368
15726b25791J18392R0168j31524L3738k96455J36693N51498j81368L9073L32073
15716D66497K6821k77389k79417R9856J98608J25794j52913L70217L9569o37644
15706b0001j90017K11143p1442m3274J7640j5201k76101m57091J32012K23094
15696d89238K47603l8827J07903j24847k90410j22143l51588K90132O39463n7307
15686a89259m24548k02065L96284j15863Q381K57731O06316K9331m90468l40925
15676d65085o0404k59748J09441R6749j04968r6827j71544K93154M35418K69626
15666D5812J95666j94278j21721J63999J0180O4806R788L9787K50246J2365m1201
$$ plain form
15655 435449 48738 24503 -30601 -372242 -620927 -460441 185831 305993 27650 315502
15645 315502 709571 707478 361805 166909 120477 -207051 91699 47803 71075 27918 135542
15634 135542 152711 -99197 372469 219788 -135562 -17100 -178213 119309 317288 383401
15624 383401 565202 828716 1081843 947784 260587 183422 303171 545133 273153 -36494
15614 -36494 -79127 39631 -147553 -67522 133910 256198 419215 205500 60812 134209
15604 134209 -176844 -87213 13168 -3880 -4875 -224562 -362614 -230659 136141 131150 82358
15593 82358 296489 -99426 58334 18048 -341299 -192642 -260282 -300401 -227793 53682
15583 53682 -103939 52170 137669 46214 274407 118249 -423415 -736070 -290254 326921
$$ packed form
15655D35449l86711k4235n5104l41641k48685J60486O46272J20162k78343K87852
15645C15502L94069k093l45673j94896m6432l27528K98750m3896K3272m3157J07624
15634A35542J7169k51908M71666j52681l55350J18462j61113K97522J97979O6113
15624C83401J81801K63514K53127j34059o87197p7165J19749K41962k71980l09647
15614c6494m2633J18758j87184Q0031K01432J22288J63017k13715j44688P3397
15604A34209l11053Q9631J00381j7048r95k19687j38052J31955L66800m991m8792
15593H2358K14131l95915J57760m0286l59347J48657o7640m0119P2608K81475
15583E3682j57621J56109Q5499r1455K28193j56158n41664l12655M45816O17175
$$ plain form
15573 326921 634829 693277 562733 227576 22088 257094 608362 374714 18345 254463
15563 254463 42049 -251329 -653557 -1035617 -556837 -185961 -466775 -225652 547605 596778
15553 596778 -157340 -213093 63907 63144 -51017 -450371 121533 196804 -317198 -99905
15543 -99905 75531 -175891 -290126 -145696 221907 660556 781476 19327 -651293 -268206
15533 -268206 177237 160638 -268176 -836189 -733575 -563160 -299354 -212935 -338132 -335052
15523 -335052 -580156 -566850 -513659 -421646 -264305 308235 -19111 -703223 -852557 -703983
15513 -703983 -285901 -27952 233109 616189 537554 340142 32966 -29270 -272408 60265
15503 60265 347698 541317 845838 731773 245546 -266603 -421528 -290283 -384195 -352805
$$ packed form
15573C26921L07908N8448j30544l35157k05488K35006L51268k33648l56369K36118
15563B54463k12414k93378m02228l82060M78780L70876k80814K41123P73257M9173
15553E96778p54118n5753K77000p63j14161l99354N71904P5271n14002K17293
15543i9905J75436k51422j14235J44430L67603M38649J20920p62149o70620L83087
15533b68206M45443j6599m28814n68013J02614J70415K63806Q6419j25197L080
15523c35052k45104J3306N3191R2013J57341N72540l27346o84112j49334J48574
15513g03983M18082K57949K61061L83080p8635j97412l07176o2236k43138L32673
15503F0265K87433J93619L04521j14065m86227n12149j54925J31245r3912L1390
$$ plain form
15493 -352805 122340 -110034 -222086 -276994 -36265 357433 269651 -526644 -1048135 -1008920
15483 -1008920 -402001 161282 174935 -198498 -622417 -687503 -72095 -66038 52783 -363369
15473 -363369 -600926 -587363 -719099 267550 783492 799002 627527 371723 299592 106369
15463 106369 144543 662083 578800 267130 481663 477926 244364 -97614 269527 237650
15453 237650 222910 -329643 -798398 -330755 44633 80463 392755 34652 -208858 -204128
15443 -204128 -73087 -193230 -316484 339820 116111 -649658 -892286 -586035 -216837 -114458
15433 -114458 -148749 -463550 -251289 149136 253154 453842 191584 -501395 -482343 -6905
15423 -6905 566888 468543 256034 -107590 -984369 -1137986 -483270 -294130 -153348 31470
$$ packed form
15493c52805M75145k32374j12052n4908K40729L93698q7782p96295n21491L9215
15483a008920O06919N63283J3653l73433m23919o5086O15408O057J18821m16152
15473c63369k37557J3563j31736R86649N15942J5510j71475k55804p2131j93223
15463A06369L8174N17540q3283l11670K14533l737k33562l41978L67141l1877
15453B37650j4740n52553m68755M67643L75388L5830L12292l58103k43510M730
15443b04128J31041j20143j23254O56304k23709p65769k42628L06251L69198J02379
15433a14458l4291l14801K12261M00425J04018K00688k62258o92979J9052M75438
15423f905N73793r8345k12509l63624q76779j53617O54716J89140J40782J84818
$$ plain form
15413 31470 -31961 -307421 -375120 -516689 -838398 -691682 -434302 -211361 -142959 -181094
15403 -181094 134376 320227 203718 -460554 -1170615 -1131811 -420543 -8375 89016 -189322
15393 -189322 -504797 -447555 -431929 -685809 -594586 -305259 64116 414399 -93910 -475633
15383 -475633 -207833 15866 226205 485493 599187 109677 193198 179532 -481255 -1038430
15373 -1038430 -909265 -484523 -560963 -821393 -484020 87691 52623 -232561 -224166 -18656
15363 -18656 20193 -192307 650069 924138 312975 294045 525738 526645 462897 318836 -93564
15352 -93564 61174 9171 -29392 241527 783500 551783 245463 -80823 -184085 445066
15342 445066 968901 489201 69163 216376 284994 256751 456611 322370 308691 506707
$$ packed form
15413C1470o3431k75460o7699j41569l21709J46716K57380K22941O8402l8135
15403a81094L15470J85851j16509o64272p10061L8804P11268M12168R7391k78338
15393a89322l15475N7242J5626k53880R1223K89327L69375L50283n08309l81723
15383d75633K67800K23699K10339K59288J13694m89510Q3521j3666o60787n57175
15373a038430J29165M24742p6440k60430L37373N71711l5068k85184Q395K05510
15363a8656L8849k12500Q42376K74069o11163j8930K31693R07o3748j44061m12400
15352i3564J54738n2003l8563K70919N41973k31717l06320l26286j03262O29151
15342D45066N23835m79700m20038J47213O8618k8243J99860j34241j3679J98016
$$ plain form
15332 506707 620516 -125326 -894358 -726571 -623731 -541815 -340305 10165 37318 2213
15322 2213 -299388 -653201 -688002 -406599 -84437 -190362 -207006 -488625 -211315 302893
15312 302893 256699 508087 131885 58334 234864 -205244 -275640 567647 683176 777223
15302 777223 875139 563566 88532 104480 500153 379917 436814 -125619 81972 339744
15292 339744 -231880 -627365 -318917 -199229 -686874 -613191 61133 340253 601293 191158
15282 191158 -123885 151567 340574 315599 544965 689625 132660 -13441 163353 -582315
15272 -582315 -706176 -280240 -476215 -788850 -683690 -277578 221221 85150 -155804 -491687
15262 -491687 -695563 -497760 -589923 -638741 -319844 -90297 -340518 -550170 -483443 -160040
$$ packed form
15332E06707J13809p45842p69032J67787J02840Q1916K01510L50470K7153l5105
15322B213l01601l53813l4801K81403L22162j05925j6644k81619K77310N14208
15312C02893m6194K51388l76202p3551J76530m40108p0396Q43287J15529R4047
15302G77223R7916l11573m75034J5948L95673j20236N6897n62433K07591K57772
15292C39744n71624l95485L08448J19688m87645P3683O74324K79120K61040m10135
15282A91158l15043K75452J89007k4975K29366J44660n56965j46101J76794p45668
15272e82315j23861M25936j95975l12635J05160M06112M98799j36071k40954l35883
15262d91687k03876J97803r2163m8818L18897K29547k50221k09652O6727L23403
$$ plain form
15252 -160040 2347 -414403 -43237 169659 241032 42392 -204550 -144921 -650984 -876597
15242 -876597 -537006 -23872 391783 310337 360188 423774 600834 404813 189292 415878
15232 415878 547787 528604 422351 501076 274849 157013 209116 -80409 -30328 160248
15222 160248 -405735 -380084 -445174 -314529 -285495 -387786 -169356 212279 28815 -27356
15212 -27356 7022 341278 919515 650740 293689 219582 260213 308279 723915 656752 575076
15201 575076 662643 455775 -280701 -343769 -330941 -374125 -64096 -94514 -200551 55005
15191 55005 452385 758483 666363 625397 599977 868573 1032583 1052062 604025 634244 1272579
15180 1272579 1268240 1077191 1393845 872185 402381 237034 2876 -497580 -344710 -161885
$$ packed form
15252a60040J62387m16750L71166K12896P1373j98640k46942N9629n06063k25613
15242h76597L39591N13134M15655q1446M9851O3586J77060j96021k15521K26586
15232D15878J31909j9183j06253P8725k26227j17836N2103k89525N0081J90576
15222A60248n65983K5651o5090J30645K9034j02291K18430L81635j83464n6171
15212b7356L4378L34256N78237k68775l57051p4107M0631M8066M15636o7163q1676
15201E75076Q7567k06868p36476o3068J2828m3184L10029l0418j06037K55556
15191E5005L97380L06098r2120m0966k5420K68596J64010J9479m48037L0219O38335
15180A272579m339j91049L16654n21660m69804j65347k34158n00456J52870J82825
$$ plain form
15170 -161885 -108373 -305204 -196917 -204796 -143933 -220984 -131304 -45967 -86381 -323050 -184700
15159 -184700 -45652 159713 -64020 -122552 -208494 108251 -175192 72437 290281 561299
15149 561299 -170579 -187849 113161 -547445 -516338 -180403 151149 511741 199529 -110920
15139 -110920 -1654 -458023 -603074 24748 26602 -16774 -271424 -424528 -229412 148051
15129 148051 -309502 -535976 -521435 -536082 -417553 409537 208004 129345 28356 -55785
15119 -55785 -329455 -611927 -1045993 -1169872 -1037810 -1237489 -1267284 -567231 -516749 -573067
15109 -573067 -241489 144224 505885 445899 364169 6961 -223355 315031 573368 285961
15099 285961 166169 -26538 -46856 -346462 -370033 -252892 219977 604177 345818 412753
$$ packed form
15170a61885N3512j96831J08287p879O0863p7051Q9680Q5337m0414k36669J38350
15159a84700J39048K05365k23733n8532q5942L16745k83443K47629K17844K71018
15149E61299p31878j7270L01010o60606L1107L35935L31552L60592l12212l10449
15139a10920J09266m56369j45051O27822J854m3376k54650j53104J95116L77463
15129A48051m57553k26474J4541j4647J18529Q27090k01533p8659j00989q4141
15119e5785k73670k82472m34066j23879J32062j99679k9795P00053N0482n6318
15109e73067L31578L85713L61661n9986q1730l57208k30316N38386K58337k87407
15099B85961j19792j92707k0318k99606k3571J17141M72869L84200k58359O6935
$$ plain form
15089 412753 557388 488979 27085 -538084 -219228 -19879 -323223 -314948 -318142 -395391 -605266
15078 -605266 -448047 -394222 -522501 101526 24593 121548 94966 54563 -191048 -108966 -268223
15067 -268223 -62464 277426 335940 -36261 -48171 250507 477545 177763 -379478 -393484
15057 -393484 -288255 -456348 -414449 -306741 15256 412089 744457 547853 150933 -201942
15047 -201942 -1046515 -1465370 -885199 -61284 394717 366510 179514 174304 -285002 -352831
15037 -352831 -383615 -382959 -203017 65443 177469 -89983 -642756 -747872 -1256111 -1128819
15027 -1128819 -661611 -122626 300331 412389 -235974 -184806 136401 -258057 78626 424224
15017 424224 420527 138533 43992 127347 -397636 -530493 69264 138620 -318756 -414130 -315654
$$ packed form
15089D12753J44635o8409m61894n65169L18856J99349l03344Q275l194p7249k09875
15078f05266J57219N3825j28279O24027p6933R6955k6582m0403k45611Q2082j59257
15067b68223K05759L39890N8514l72201j1910K98678K27038k99782n57241j4006
15057c93484J05229j68093M1899J07708L21997L96833L32368j96604l96920l52875
15047b01942q44573m18855N80171Q23915M56001k8207j86996n210m59306o7829
15037c52831l0784O56J79942K68460J12026k67452n52773j05116n08239J27292
15027a128819M67208N38985M22957J12058o48363N1168L21207l94458L36683L45598
15017D24224l697k81994r4541Q3355n24983j32857N99757O9356m57376r5374R8476
$$ plain form
15006 -315654 460768 783437 531168 -136996 -178908 -83823 397787 966779 857944 242697
14996 242697 -189402 -269220 -855244 -895202 -826357 -588306 -621532 -529983 -226702 -301270 -338638
14985 -338638 -575307 -334666 -644771 -490875 62180 -299055 -554886 -1418088 -1336943 -814584
14975 -814584 -454615 -186480 91500 -123850 -577278 -562825 -465916 -86629 328337 177741
14965 177741 150835 6821 175382 284070 208959 -49890 209757 87002 185790 279906
14955 279906 -139148 -591206 -596738 -188001 -69104 -583970 -1326051 -1284806 -971490 -614994
14945 -614994 -404464 -788741 -909700 -326685 -77210 471380 239857 242534 124258 158686
14935 158686 44307 -235021 -492230 -718099 -832975 -292897 108017 250612 -162830 -355843
$$ packed form
15006c15654P76422L22669k52269o68164m1912R5085M81610N68992j08835o15247
14996B42697m32099p9818n86024l9958O8845K38051l3226R1549L03281p4568l7368
14985c38638k36669K40641l10105J53896N53055l61235k55831q63202Q1145N22359
14975h14584L59969K68135K77980k15350m53428J4453R6909L79287M14966j50596
14965A77741k6906j44014J68561J08688p5111k58849K59647j22755R8788R4116
14955B79906m19054m52058n532M08737J18897n14866p42081M1245L13316L56496
14945f14994K10530l84277j20959N83015K49475N48590k31523K677j18276L4428
14935A58686j14379k79328k57209k25869j14876N40078M00914J42595m13442j93013
$$ plain form
14925 -355843 -1061503 -837418 -535843 -1032264 -981344 -482466 278317 536667 377363 701840
14915 701840 342254 39084 -256500 -809654 -684235 -528130 -50918 630508 606699 155409
14905 155409 193917 -97791 -392763 96950 -14773 47573 545474 116163 169997 314739
14895 314739 137597 -203639 -391468 -80315 -355337 -294707 -82958 -97449 33199 119892
14885 119892 -922 -403581 -568145 -167218 172664 -17855 92518 -152075 -218639 -502649
14875 -502649 -322107 -118267 -159125 124343 236018 7813 -302841 -74398 91722 -17553
14865 -17553 39632 -53392 -166490 -194570 257164 210599 94497 377777 597561 594111 -39731
14854 -39731 -705142 -500133 13264 311235 86029 -407636 -473371 -411003 -496669 -564444
$$ packed form
14925c55843p05660K24085L01575m96421N0920M98878P60783K58350j59304L24477
14915G01840l59586l03170k95584n53154J25419J56105M77212O81426k3809m51290
14905A55409L8508k91708k94972M89713j11723O2346M97901m29311N3834J44742
14895C14739j77142l41236j87829L11153k75022O0630K11749j4491J30648Q6693
14885A19892j20814m02659j64564M00927L39882j90519J10373k44593o6564k84010
14875e02649J80542K03840m0858K83468J11675k28205l10654K28443J66120j09275
14865a7553N7185r3024j13098k8080M51734m6565j16102K83280K19784l450o33842
14854c9731o65411K05009N13397K97971k25206m93665o5735O2368q5666o7775
$$ plain form
14844 -564444 -278509 -155265 53773 660314 187063 -232910 -282935 -508118 -205361 192245
14834 192245 -82057 256791 -66548 39314 105387 -191207 -701585 -283752 -147442 -537756
14824 -537756 -602196 -214748 -15916 -434297 -769077 -408298 65164 158009 -23698 -88069
14814 -88069 101947 -106205 -192238 -352556 -338515 -535176 -792153 -930063 -962601 -700233
14804 -700233 -227073 -234479 -449660 -388641 40436 536297 421248 376238 571803 315092
14794 315092 440349 200200 -5034 209697 370654 193911 -75906 -142132 209693 -170777
14784 -170777 -55349 312348 385369 114361 90092 427650 577506 567322 214016 -17840
14774 -17840 -323082 -343667 -198482 52608 -401688 -228693 162892 -266631 -483032 -543723
$$ packed form
14844e64444K85935J23244K09038O06541m73251m19973n0025k25183L02757L97606
14834A92245k74302L38848l23339J05862O6073k96594n10378M17833J36310l90314
14824e37756o4440L87448J98832m18381l34780L60779M73462R2845j81707o4371
14814h8069J90016k08152q6033j60318J4041j96661k56977j37910l2538K62368
14804g00233M73160p406k15181O1019M29077M95861j15049m5010J95565k56711
14794C15092J25257k40149k05234K14731J60957j76743k69817o6226L51825l80470
14784a70777J15428L67697P3021k71008k4269L37558J49856j0184l53306k31856
14774a7840l05242k0585J45185K51090m54296J72995L91585m29523k16401o0691
$$ plain form
14764 -543723 -279772 144675 100765 18299 458316 322075 -144984 -393447 -131205 -116965
14754 -116965 -370634 61093 -151892 153968 380225 361708 56221 -133031 -58117 400979
14744 400979 399846 511528 429419 207835 -64157 -231282 208839 157012 -73189 -347369
14734 -347369 114444 747495 786066 292851 -77035 129793 320256 438325 366145 372462
14724 372462 163148 157505 87703 51742 318348 295954 73991 35602 273230 646196 704722
14713 704722 664964 192058 -251683 -217495 110223 60121 423645 924499 850159 931962
14703 931962 1028095 728817 449540 452193 725416 771822 506323 321103 -377739 -417361
14693 -417361 133004 678965 732668 382620 -131487 -332304 -76694 324437 274972 409295
$$ packed form
14764e43723K63951M24447m3910q2466M40017j36241m67059k48463K62242J4240
14754a16965k53669M31727k12985L05860K26257j8517l05487j89252P4914M59096
14744D00979j133J11682q2109k21584k71992j67125M40121n1827k30201k74180
14734c47369M61813O33051L8571m93215l69886K06828J90463J18069p2180O317
14724C72462k09314n643o9802l5961K66606k2394k21963l8389K37628L72966N8526
14713G04722l9758m72906m43741L4188L27718n0102L63524N00854p4340Q1803
14703I31962R6133k99278k79277K653K73223M6406k65499j85220o98842l9622
14693d17361N50365N45961N3703l50048n14107k00817K55610M01131m9465J34323
$$ plain form
14683 409295 96454 14624 253088 228855 544619 590586 408923 485622 240870 160089
14673 160089 -109667 -397028 -472506 -395265 -570673 -603472 -268425 287961 169486 -8353
14663 -8353 -429518 -256737 433837 654697 196808 -120669 -492504 -250440 -80288 -210543
14653 -210543 281478 443534 531796 615370 375360 360257 -109600 -85228 -16078 -150237
14643 -150237 -32248 -6468 -113600 -156625 83045 228168 109980 -18062 13111 12430 48535
14632 48535 250139 535243 274155 38755 62287 166593 293291 374004 226596 -136146
14622 -136146 -115211 -67508 -255417 -513752 -139685 243974 112956 79596 -315741 -89390
14612 -89390 459512 288401 71694 88789 94323 539484 892389 1064400 946598 395909
$$ packed form
14683D09295l12841q1830K38464k4233L15764M5967j81663P6699k44752q0781
14673A60089k69756k87361p5478P7241j75408l2799L35047N56386j18475j77839
14663h353m21165J72781O90574K20860m57889l17477l71835K42064J70152j30255
14653b10543M92021J62056Q8262Q3574k40010j5103m69857K4372O9150j34159
14643a50237J17989K5780j07132m3025K39670J45123j18188j28042L1173o81L6105
14632D8535K01604K85104k61088k35400K3532J04306J26698Q0713j47408l62742
14622a36146K0935M7703j87909k58335L74067L83659j31018l3360l95337K26351
14612h9390N48902j71111k16707J7095N534M45161L52905J72011j17802n50689
$$ plain form
14602 395909 254920 400787 -18295 -462668 -547415 -266901 -95065 39240 -190882 -130387
14592 -130387 244986 221585 16745 68660 -279319 -411844 -528198 -599479 -277101 12318
14582 12318 324487 525025 -79694 -327721 -270833 134690 524468 155735 -9902 181850
14572 181850 -13111 266355 559680 94638 105099 400647 128055 -437734 -206256 180394
14562 180394 -219666 121601 -1242 -528956 -285644 -387895 -783047 -690183 -399613 341637
14552 341637 181519 -126691 -39986 126015 59810 -496889 -637955 -548841 -370735 13238
14542 13238 43048 -251559 -568726 -528903 -81743 35545 210 106837 255897 588822
14532 588822 421570 107162 38427 835380 1006571 1103860 1192181 498164 345088 -188999
$$ packed form
14602C95909j40989J45867m19082m44373q4747K80514J71836J34305k30122O0495
14592a30387L75373k3401k04840N1915l47979j32525j16354p1281L22378K89419
14582A2318L12169K00538o04719k48027N6888M05523L89778l68733j65637J91752
14572A81850j94961K79466K93325m65042J0461K95548k72592n65789K31478L86650
14562A80394m00060L41267j22843n27714K43312j02251l95152R2864K90570P41250
14552C41637j60118l08210Q6705J66001o6205n56699j41066Q9114J78106L83973
14542A3238K9810k94607l17167L9823M47160J17288l5335J06627J49060L32925
14532E88822j67252l14408o8735P96953J71191R7289Q8321o94017j53076n34087
$$ plain form
14522 -188999 -286197 -243588 746 568174 434671 498024 947432 716512 113517 -368228
14512 -368228 -117819 405238 592781 617781 735371 255386 -233217 -116080 236119 875223
14502 875223 1088344 1279478 923572 896487 1108427 294713 16189 9360 -289728 -277405
14492 -277405 -42214 -46729 -187604 358224 533237 -36902 -320593 207386 268329 -82387
14482 -82387 -288642 -428787 -18420 -55361 -51078 562828 1086729 1073937 1013616 1129414 1384462
14471 1384462 1003646 798098 722440 125189 -155043 -393784 -90846 -347443 -498648 -486955
14461 -486955 -174955 136365 -54815 245246 6217 -310647 214649 433228 35021 -290914
14451 -290914 -324115 47854 221918 -29274 -305127 -329611 258026 434692 -2286 -45834
$$ packed form
14522a88999r7198M2609K44334N67428j33503O3353M49408k30920o02995m81745
14512c68228K50409N23057J87543K5000J17590m79985m88603J17137L52199O39104
14502H75223K13121J91134l55906k7085K11940q13714k78524o829k99088J2323
14492b77405K35191m515j40875N45828J75013n70139k83691N27979O0943l50716
14482h2387k06255j40145M10367l6941M283O13906N23901j2792o0321J15798K55048
14471A384462l80816k05548p5658n97251k80232k38741L02938k56597j51205J1693
14461d86955L12000L11320j91180L00061k39029l16864N25296K18579l98207l25935
14451b90914l3201L71969J74064k51192k75853k4484N87637J76666m36978m3548
$$ plain form
14441 -45834 450348 949273 207729 -160246 -29261 40285 -671303 -1143156 -1016903 -965434
14431 -965434 -1018431 -1064162 -1018818 -741915 -592153 -685825 -788986 -293002 -83430 -121451
14421 -121451 -686441 -994796 -663419 -281201 238366 314077 844477 1136597 1098737 1162658
14411 1162658 941959 1010617 738743 567653 808269 834368 851535 908021 594698 250639
14401 250639 372477 301854 -111274 386080 401045 193898 -44287 -349910 -559178 -480371
14391 -480371 -167433 9888 -334856 -330353 -390936 -452420 -278910 206601 506157 833450
14381 833450 798302 376369 495283 646375 202554 -17026 331343 874504 631178 253274
14371 253274 3333 546333 442837 316292 115910 220861 119452 -196289 -154942 70227
$$ packed form
14441d5834M96182M98925p41544l67975J30985O9546p11588m71853J26253N1469
14431i65434n2997m5731M5344K76903J49762r3672j03161M95984K09572l8021
14421a21451n64990l08355L31377L82218N19567P5711N30400K92120l7860O3921
14411A162658k20699O8658k71874j71090K40616K6099J7167N6486l13323l44059
14401B50639J21838p0623m13128M97354J4965k07147k38185l05623k09268P8807
14391d80371L12938J77321l44744M503o0583o1484J73510M85511K99556L27293
14381H33450l5148m21933J18914J51092m43821k19580L48369N43161k43326l77904
14371B53274k49941N43000j03496j26545k00382J04951j01409l15741M1347K25169
$$ plain form
14361 70227 -218891 114863 1064503 580334 -120578 -260188 44499 501579 263769 -92211
14351 -92211 339140 386912 17801 -384721 -214274 -25258 8572 266945 226979 6020
14341 6020 -70361 49086 263330 467432 106325 -93235 324054 343299 265007 38690
14331 38690 -427051 -281226 -108586 -411973 -424700 -49642 200243 77760 160660 196858
14321 196858 34903 125673 -351329 -136733 290392 201654 219117 796348 604014 64776
14311 64776 -201524 -292800 -319208 -201315 -340715 9908 55211 333700 500266 444167
14301 444167 825911 576041 13667 -47791 425441 -4804 -304797 86295 231243 373708
14291 373708 256467 -52675 159749 827925 687963 345353 141484 36827 -203666 -260282
$$ packed form
14361G0227k89118L33754R49640m84169p00912j39610L04687M57080k37810l55980
14351i2211M31351M7772l69111m02522J70447J89016L3830K58373l9966k20959
14341F020p6381J19447K14244K04102l61107j99560M17289J9245p8292k26317
14331C8690m65741J45825J72640l03387j2727L75058K49885j22483Q2900L6198
14321A96858j61955R0770m77002K14596M27125q8738J7463N77231j92334n39238
14311F4776k66300r1276k6408J17893j39400L50623M5303K78489J66566n6099
14301D44167L81744k49870n62374o1458M73232m30245k99993L91092J44948J42465
14291C73708j17241l09142K12424O68176j39962l42610k03869j04657k40493n6616
$$ plain form
14281 -260282 -430898 -339919 -319545 -470631 -488220 -34123 502508 323374 -299072 -256537
14271 -256537 -303648 -244895 -289102 -366251 -8876 -23313 -76605 -250356 -270122 -178204 -177086
14260 -177086 -225887 -276986 -114648 -142558 -359940 -209022 242980 -89802 -489611 -554390
14250 -554390 -250462 24885 -635279 -519647 383624 302009 -194507 -39447 42335 -21766
14240 -21766 -2698 280389 509708 430188 -146810 -142815 19762 134201 357105 425390 524012
14229 524012 417462 268915 368508 323247 280139 -175245 -308781 -191050 -182901 -96720 -87245
14218 -87245 -67094 119214 285636 256147 -651988 -971855 -738586 -89755 241825 165121
14208 165121 -108538 -71624 201185 599857 88635 -457229 -154629 327111 592198 432916
$$ packed form
14281b60282j70616R0979K0374j51086j7589M54097N36631j79134o22446M2535
14271b56537m7111N8753m4207p7149L57375j4437n3292j73751j9766R1918J118
14260a77086m8801n1099J62338k7910k17382J50918M52002l32782l99809o4779
14250e54390L03928K75347o60164J15632R03271q1615m96516J55060Q1782o4101
14240b1766J9068K83087K29319p9520n76998L995J62577J14439K22904O8285R8622
14229E24012j06550j48547R9593m5261m3108m55384j33536J17731Q149Q6181R475
14218h7245K0151J86308J66422k9489r08135l19867K33269O48831L31580p6704
14208A65121k73659L6914K72809L98672n11222n45864L02600M81740K65087j59282
$$ plain form
14198 432916 409743 93029 -393809 -432290 -265067 -728965 -1195261 -970927 -745541 -855232
14188 -855232 -714035 -472508 -636017 -573203 -195227 -427574 -222387 -119152 46370 -38827
14178 -38827 -188410 -83897 115355 410659 105551 -89238 12967 28987 64803 -187157
14168 -187157 -427219 -470111 -307523 -188686 -252227 -115460 294157 250711 15853 156932
14158 156932 -245335 -256654 -48707 -343583 -610308 -186923 -33082 328338 -85648 -306601
14148 -306601 -187875 14265 205149 95563 -95119 -246099 -71828 73412 22903 -80932
14138 -80932 -28037 96642 456654 847849 285742 -99264 -337073 -77268 308883 550788
14128 550788 788895 220896 471485 557807 481156 288171 168190 682623 614189 624626
$$ packed form
14198D32916k3173l16714m86838l8481J67223m63898m66296K24334K25386j09691
14188h55232J41197K41527j63509O2814L77976k32347K05187J03235J65522q5197
14178c8827j49583J04513J99252K95304l05108j94789J02205J6020L5816k51960
14168a87157k40062m2892J62588J18837o3541J36767M09617m3446k34858J41079
14158A56932m02267j1319K07947k94876k66725M23385J53841L61420m13986k20953
14148c06601J18726K02140J90884j09586j90682j50980J74271J45240n0509j03835
14138h0932N2895J24679L60012L91195n62107l85006k37809K59805L86151K41905
14128E50788K38107n67999K50589Q6322p6651j92985j19981N14433o8434J0437
$$ plain form
14118 624626 25152 -178903 -56407 559364 239411 -174921 -183404 -243405 8007 315291
14108 315291 489662 553837 457749 -38469 167601 204768 -245422 637155 1190117 1017462
14098 1017462 350961 729205 858831 575008 111011 102668 -122181 -298520 -223936 236920
14088 236920 182183 72243 -139406 129423 83605 -191074 -197616 165241 562366 677427
14078 677427 775289 380193 97051 36313 267830 431150 385345 498046 567709 429177
14068 429177 535706 745663 952175 959374 624575 334378 515259 801358 1117175 1582123
14058 1582123 970693 509586 310077 180648 73704 80310 8676 -339328 -306837 -47475
14048 -47475 -99520 -25521 240729 265079 529453 397585 388752 160817 -264630 -259196 22601
$$ packed form
14118F24626n99474k04055J22496O15771l19953m14332q483o0001K51412L07284
14108C15291J74371O4175r6088m96218K06070L7167m50190Q82577N52962j72655
14098A017462o66501L78244J29626k83823m63997q343k24849j76339P4584M60856
14088B36920n4737j09940k11649K68829m5818k74679o542L62857L97125J15061
14078F77427R7862l95096k83142o0738K31517J63320m5805J12701O9663j38532
14068D29177J06529K09957K06512P199l34799k90197J80881K86099L15817M64948
14058A582123o11430m61107j99509j29429j06944O606p1634l48004L2491K59362
14048d7475n2045P3999K66250K4350K64374j31868q833k27935m25447N434K81797
$$ plain form
14037 22601 704651 894773 1010348 842848 387959 224607 139359 48375 293654 494475
14027 494475 839925 497808 297790 764819 639800 541789 279806 433984 798493 88347
14017 88347 -135513 -102741 -130808 2872 -2313 -130887 267786 984388 1100404 787289
14007 787289 1120242 1466376 1352548 1183558 1008232 715815 677498 1080488 1012964 924154
13997 924154 627168 628935 852391 836420 867457 1094116 1246038 1083995 861641 986323
13987 986323 1289640 1607229 1916453 2191482 1573356 1500770 1765067 2028755 2253864 2152052
13977 2152052 2307461 1645695 1443904 1895370 2363313 1960027 1022670 429902 239656
13968 239656 487528 761863 729870 1049378 1303547 1401836 1481289 1108761 1053774 1330282
$$ packed form
14037B2601O82050J90122J15575j67500m54889j63352q5248r0984K45279K00821
14027D94475L45450l42117k00018M67029j25019r8011k61983J54178L64509p10146
14017H8347k23860L2772k8067J33680n185j28574L98673P16602J16016l13115
14007G87289L32953L46134j13828j68990j75326k92417l8317M02990o7524q8810
13997I24154k96986J767K23456j5971L1037K26659J51922j62043k22354J24682
13987I86323L03317L17589L09224K75029o18126p2586K64297K63688K25109j01812
13977B152052J55409o61766k01791M51466M67943m03286r37357n92768j90246
13968B39656K47872K74335l1993L19508K54169R8289P9453l72528n4987K76508
$$ plain form
13958 1330282 1680360 1127314 1176129 1574185 2064196 2500762 2620244 2240892 2186691 2378335
13948 2378335 2395414 2351568 2452983 2041429 1146091 700579 1087581 1338172 1070462 760892
13938 760892 377494 184837 355281 265553 546100 1045709 756681 392987 -95328 157403
13928 157403 708915 988907 1138275 1197261 1075917 1308165 1679559 1893058 1799089 1639080
13918 1639080 1599380 1602182 1691312 1337616 1120195 1035224 1108356 1133678 1186763 830921 677469
13907 677469 825473 820505 483951 785131 1230326 1291157 1388049 1278050 1044432 1045231 984397
13896 984397 1129713 1218298 1529462 1240315 1351801 1449599 1349788 1517384 2155775 2043356
13886 2043356 1428088 1064239 653309 437874 257862 147058 -7000 490107 866433
$$ packed form
13958A330282L50078n53046M8815L98056M90011M36566J19482l79352n4201J91644
13948B378335J7079m3846J01415m11554q95338m45512L87002K50591k67710l09570
13938G60892l83398j92657J70444q9728K80547M99609k89028l63694m88315K52731
13928A57403N51512K79992J49368N8986j21344K32248L71394K13499r3969j60009
13918A639080l9700K802Q9130l53696k17421q4971P3132K5322N3085l55842j53452
13907F77469J48004m968l36554L01180M45195O0831R6892j09999k33618P99o0834
13896I84397J45316Q8585L11164k89147J11486R7798r9811J67596O38391j12419
13886B043356o15268l63849m10930k15435j80012j10804j54058M97107L76326
$$ plain form
13877 866433 462121 527751 889208 1218854 1416688 1443436 1460123 1243844 884384 1096971
13867 1096971 1476102 1149391 710535 711151 904433 1067151 1476015 2086419 2102274 2203722
13857 2203722 1716390 1430266 1634109 1234036 967449 359866 541085 600582 247996 276658
13847 276658 422220 786847 1168967 1097331 802452 517673 113422 -85436 -285335 -126699
13837 -126699 257840 264195 719576 1343633 1060442 514360 376425 562049 506156 603104
13827 603104 397025 -11570 22072 184951 634569 766066 422905 683924 800729 718168
13817 718168 488022 563828 749963 207294 235578 470762 884111 665267 369239 376081
13807 376081 146159 710573 1161256 1064162 992838 861692 834390 596046 371763 737528
$$ packed form
13877H66433m04312O5630L61457L29646J97834K6748J6687k16279l59460K12587
13867A096971L79131l26711m38856O16J93282J62718M08864O10404J5855J01448
13857B203722m87332k86124K03843m00073k66587o07583J81219N9497l52586K8662
13847B76658J45562L64627L82120p1636k94879k84779m04251j98858j99899J58636
13837a26699L84539O355M55381O24057k83191n46082j37935J85624n5893R6948
13827F03104k06079m08595L3642J62879M49618J31497l43161K61019J16805q2561
13817G18168k30146P5806J86135n42669K8284K35184M13349k18844k96028O842
13807C76081k29922N64414M50683r7094p1324j31146k7302k38344k24283L65765
$$ plain form
13797 737528 764220 294814 180937 -9245 -89455 26277 328811 463413 147751 289315
13787 289315 359514 335612 619824 858727 959790 443586 -21644 -506644 86378 561555
13777 561555 517902 795451 977628 928068 911134 612978 924355 1148475 1124371 1004174
13767 1004174 1265056 1219995 888003 599567 537320 184326 230802 -106386 -383148 383824
13757 383824 1042089 908241 828798 360287 597611 572034 514001 633441 190396 -390667
13747 -390667 -267715 315058 764229 752196 893360 772973 551672 942842 1412837 1187530
13737 1187530 940724 844352 761186 582623 1166163 1347938 1227257 1226929 1178183 825637
13727 825637 607314 607257 400399 202734 497447 622227 661459 955448 1186214 894623
$$ packed form
13797G37528K6692m69406j13877j90182q0210J15732L02534J34602l15662J41564
13787B89315P0199k3902K84212K38903J01063n16204m65230m85000N93022M75177
13777E61555m3653K77549J82177m9560j6934k98156L11377K24120k4104j20197
13767A004174K60882m5061l31992k88436o2247l52994M6476l37188k76762P66972
13757C83824O58265j33848p9443m68511K37324k5577n8033J19440m43045n81063
13747c90667J22952N82773M49171j2033J41164j20387k21301L91170M69995k25307
13737A187530k46806r6372q3166j78563N83540J81775j20681l28m8746l52546
13727H25637k18323n7k06858j97665K94713J24780L9232K93989K30766k91591
$$ plain form
13717 894623 1117350 1450182 1488099 1026820 954047 1510946 1808307 1501809 1103986 761405
13707 761405 653126 509152 586037 28331 461385 354053 364168 709275 920897 1125847
13697 1125847 1039400 1138964 1249075 1649829 1705800 1546610 1539598 739691 365262 749835
13687 749835 1045801 1388110 1196630 707319 929364 1336822 1407501 1468382 1471965 1852053
13677 1852053 2327494 2572815 2200285 1273094 1616381 1763704 1038390 1157084 1505980
13668 1505980 1065639 760992 725720 1071963 1100954 1058337 1109016 1652382 1572286 1283871
13658 1283871 1058641 1130207 1349690 1639211 1758036 1322164 1103399 1084397 1689257 2137290
13648 2137290 2310585 2225661 2012963 2002681 1761560 1766959 1940649 1905297 2088350 2545830
$$ packed form
13717H94623K22727L32832L7917m61279p2773N56899K97361l06498l97823l42581
13707G61405j08279j43974P6885n57706M33054j07332J0115L45107K11622K04950
13697A125847q6447R9564J10111M00754N5971j59190p012p99907l74429L84573
13687G49835K95966L42309j91480m89311K22045M07458P0679O0881L583L80088
13677A852053M75441K45321l72530r27191L43287J47323p25314J18694L48896
13668A505980m40341l04647l5272L46243K8991m2617N0679N43366q0096k88415
13658A283871k25230P1566K19483K89521J18825m35872k18765j9002O04860M48033
13648B137290J73295q4924k12698j0282k41121N399J73690l5352J83053M57480
$$ plain form
13638 2545830 2134611 2059284 1966971 1874945 2183384 1982807 2166962 2318296 2225696 1912208
13628 1912208 1780229 1796291 2036708 2143276 2185631 1978687 1673431 1658919 1586731 1881663
13618 1881663 2182955 2376888 2262923 2093685 2195743 1766826 1701038 2078598 2137627 1987135
13608 1987135 2375387 2175601 2126178 2591178 2497641 2672488 2915555 3098082 3129704 2797109
13598 2797109 3280507 3478861 3584880 3197812 3313063 3664762 3439370 3227920 3083985
13589 3083985 3279912 3580171 3456239 3652897 3749806 4437002 4489411 4661976 5060219 5039039
13579 5039039 5026976 5037473 4800989 4788858 5579326 6015337 5710760 6280597 6857357 6863816
13569 6863816 7209184 7648966 7557722 7561607 7814523 8268541 8694067 9443403 9851039 10097062
$$ packed form
13638B545830m11219p5327r2313r2026L08439k00577J84155J51334r2600l13488
13628A912208j31979J6062K40417J06568M2355k06944l05256j4512p2188K94932
13618A881663L01292J93933j13965j69238J02058m28917o5788L77560N9029j50492
13608A987135L88252j99786m9423M65000r3537J74847K43067J82527L1622l32595
13598B797109M83398J98354J06019l87068J15251L51699k25392k11450j43935
13589C083985J95927L00259j23932J96658R6909O87196N2409J72565L98243k1180
13579E039039j2063J0497k36484j2131P90468M36011l04577N69837N76760O459
13569F863816L45368M39782r1244L885K52916M54018M25526P49336M07636K46023
$$ plain form
13559 10097062 10372126 11165044 12248288 13391282 14873894 16394020 18340310 19994925
13551 19994925 21957916 25539986 30241096 35804926 42148149 48954624 55560803 61675427
13543 61675427 67052782 72023752 78282884 86493755 96030562 105000306 107816259 102960680
13535 102960680 96776931 93327797 93759764 97295285 103217505 110052773 112592200 110247413
13527 110247413 112031872 118714024 127907286 139516555 150143346 156683209 160389646 165343058
13519 165343058 174346031 188573782 203548129 204726156 182236235 157191231 143548888
13512 143548888 137624478 135522410 135393586 138203391 144750458 154162720 161319247 159856446
13504 159856446 154351295 153577513 159006241 167485094 174586977 180917465 190018420 205480706
$$ packed form
13559A0097062K75064P92918J083244J142994J482612J520126J946290J654615
13551A9994925J962991L582070M701110N563830O343223O806475O606179O114624
13543F1675427N377355M970970O259132Q210871R536807Q969744K815953m855579
13535A02960680o183749l449134M31967L535521N922220O835268K539427k344787
13527A10247413J784459O682152R193262J1609269J0626791O539863L706437M953412
13519A65343058R002973J4227751J4974347J178027k2489921k5045004j3642343
13512A43548888n924410k102068j28824K809805O547067R412262P156527j462801
13504A59856446n505151p73782N428728Q478853P101883O330488R100955J5462286
$$ plain form
13496 205480706 228396891 254968042 270390153 264240689 255535386 258157497 267962792
13489 267962792 280474219 294904298 310415079 324404885 327628423 309032410 277412401
13482 277412401 253849884 239602473 221155444 183933389 138946460 105077733 83638296
13475 83638296 70473882 61732651 55967117 51080297 47393000 44956007 42430590 40483905
13467 40483905 39593883 39553718 39880225 40199678 40654950 41742277 43273315 45740611 48908886
13458 48908886 52468510 56654773 62121797 69426899 78522678 91111943 108066215 128595413
13450 128595413 151789587 175895569 201414189 227258424 250887809 271099283 290338710
13443 290338710 310277874 330442400 345288990 343777085 320235498 295107866 284276491
$$ packed form
13496B05480706K2916185K6571151J5422111o149464q705303K622111R805295
13489B67962792J2511427J4430079J5510781J3989806L223538j8596013l1620009
13482B77412401k3562517j4247411j8447029l7222055m4986929l3868727k1439437
13475H3638296j3164414q741231n765534m886820l687297k436993k525417j946685
13467D0483905q90022m0165L26507L19453M55272J087327J531038K467296L168275
13458D8908886L559624M186263N467024P305102R095779J2589265J6954272K0529198
13450A28595413K3194174K4105982K5518620K5844235K3629385K0211474J9239427
13443B90338710J9939164K0164526J4846590j511905k3541587k5127632j0831375
$$ plain form
13436 284276491 282588077 271295601 243112844 215672406 198284353 186719934 180630014
13429 180630014 180618426 186356349 196110260 199987826 181672994 154460563 139107975 135071479
13421 135071479 135645848 136713837 138488601 142008590 149297967 161192195 176378706 185636151
13413 185636151 181671399 173807245 170879130 169252945 166276059 164275876 165642644 171032122
13405 171032122 179118381 181055006 161121559 128738687 106951802 96845276 92873312
13398 92873312 92387748 93156702 93824280 95516324 98426313 103680842 109269349 112712890
13390 112712890 107794115 94482172 82404919 74378919 70156728 68657080 68317354 67086030
13382 67086030 58617576 45387987 34866739 28446857 24484729 21733148 19656168 18056143
$$ packed form
13436B84276491j688414j1292476k8182757k7440438j7388053j1564419o089920
13429A80630014j1588N737923R753911L877566j8314832k7212431j5352588m036496
13421A35071479N74369J067989J774764L519989P289377J1894228J5186511R257445
13413A85636151l964752p864154k928115j626185k976886k000183J366768N389478
13405A71032122Q086259J936625j9933447l2382872k1786885j0106526l971964
13398I2873312m85564P68954O67578J692044K909989N254529N588507L443541
13390A12712890m918775j3311943j2077253q026000m222191j499648l39726j231324
13382F7086030q468454j3229589j0521248o419882l962128k751581k076980j600025
$$ plain form
13374 18056143 16902153 16055360 14939636 14058171 13369928 13044530 12509692 12188388 12068088
13365 12068088 11641369 10875433 10265786 9632003 9413415 9163547 8830786 8712082 8416340
13356 8416340 7831444 7263703 6693518 6146286 5869319 6021386 6142190 6086307 6054217 6201347
13346 6201347 6050901 5853834 5378753 5209218 5162916 5165454 5100871 5020250 4786402 4778883 4247357
13335 4247357 4034344 4552480 4363558 4228667 3999409 3909390 4139758 3966310 3702545 3432959
13325 3432959 3577629 3709736 3408047 3320096 2968593 2451911 2249568 2792980 3302104 3281420
13315 3281420 2968014 2983796 2767618 2687812 2947671 2844406 2576332 2636923 2473972 2368101
13305 2368101 2459748 2408010 2743651 2922704 2884416 2741600 2782702 2702496 2702814 2689428 2634726
$$ packed form
13374A8056143j153990q46793j115724q81465o88243l25398n34838l21304j20300
13365A2068088m26719p65936o09647o33783k18588k49868l32761j18704k95742
13356H416340n84896n67741n70185n47232k76967J52067J20804n5883l2090J47130
13346F201347j50446j97067m75081j69535m6302K538o4583q0621k33848p519n31526
13335D247357k13013N18136j88922j34891k29258r0019K30368j73448k63765k69586
13325C432959J44670J32107l01689q7951l51503n16682k02343N43412N09124k0684
13315C281420l13406J5782k16178p9806K59859j03265k68074O0591j62951j05871
13305B368101R1647n1738L35641J79053l8288j42816M1102q0206L18j3386n4702
$$ plain form
13294 2634726 2370505 2157361 1745536 1588718 1580953 1938034 1634695 1345942 1134956 1463893
13284 1463893 1656571 1652185 1352666 1140188 1003562 1236749 1251862 1143285 754572 800139
13274 800139 867123 932075 1034354 1086052 1011586 1009338 1236999 1364373 1496661 1893720 1595067
13263 1595067 1021736 817317 907707 1176745 941617 928911 1024936 600234 65432 -314226
13253 -314226 -170921 -14949 -191739 196429 391400 222173 102929 442391 421561 507840
13243 507840 454627 842716 804313 854126 893605 874465 628604 341457 562162 392687
13233 392687 -429915 -658781 617577 1204542 899134 868522 442671 82728 -115782 -6151
13223 -6151 224442 8588 -2365 -248579 -558745 -554995 10723 390718 406976 232772 -111175
$$ packed form
13294B634726k64221k13144m11825j56818p765L57081l03339k88753k10986L28937
13284A463893J92678m386k99519k12478j36626K33187J5113j08577l88713M5567
13274H00139O6984O4952J02279N1698p4466k248K27661J27374J32288L97059k98653
13263A595067n73331k04419R0390K69038k35128j2706R6025m24702n34802l79658
13253c14226J43305J55972j76790L88168J94971j69227j19244L39462k0830Q6279
13243E07840n3213L88089l8403M9813L9479j9140k45861k87147K20705j69475
13233C92687q22602k28866J276358N86965l05408l0612m25851l59943j98510J09631
13223f151K30593k15854j0953k46214l10166L750N65718L79995J6258j74204l43947
$$ plain form
13212 -111175 -247110 -10866 294603 167322 348737 1037033 932315 817095 1080569 1418101
13202 1418101 918790 949146 408435 -37436 -455741 -377644 11044 790793 1109280 611239
13192 611239 287381 448502 565849 424335 645698 1242385 1057110 575594 222152 -190993
13182 -190993 -464139 -260350 -174229 -289051 -88454 166419 -82672 -123362 119396 -128146
13172 -128146 128734 -28041 -323554 -253881 -393936 -836483 -941687 -245411 138161 238587
13162 238587 143973 -215711 -602815 -714952 -582035 -549422 -411293 -147716 16197 519909
13152 519909 456384 228083 86519 8742 -195405 -248916 -78817 -450264 -1179302 -714958
13142 -714958 -357933 -720946 -306611 -28739 -36435 219806 215294 68112 -147482 -89882
$$ packed form
13212a11175j35935K36244L05469j27281J81415O88296j04718j15220K63474L37532
13202A418101m99311L0356n40711m45871m18305P8097L88688P79749L18487m98041
13192F11239l23858J61121J17347j41514K21363N96687j85275m81516l53442m13145
13182a90993k73146K03789Q6121j14822K00597K54873k49091m0690K42758k47542
13172a28146K56880j56775k95513O9673j40055m42547j05204O96276L83572J00426
13162B38587r4614l59684l87104j12137J32917L2613J38129K63577J63913N03712
13152E19909o3525k28301j41564p7777k04147n3511J70099l71447p29038M64344
13142g14958L57025l63013M14335K77872p696K56241m512j47182k15594N7600
$$ plain form
13132 -89882 -239667 -646081 -156531 223275 92390 -212115 -461870 -218974 -597939 -953265
13122 -953265 -657678 -353770 -345846 191879 -186062 -641447 -206800 187795 197966 154693
13112 154693 -12839 -67603 -16146 112793 281985 -22103 296627 357178 -75093 128929
13102 128929 408809 559744 323112 -278580 -407417 -784170 -674261 -497704 -767035 -681336
13092 -681336 -240529 -337094 -57470 470776 879229 921586 432713 218745 140315 -251755
13082 -251755 42500 490017 915853 977630 683637 587853 305902 -156348 -196017 -150639
13072 -150639 228075 159934 -368928 -752125 -286698 -13384 636198 706423 466730 595169
13062 595169 719650 1202307 1534533 1399413 1067111 1182662 1329020 973262 764557 1233765
$$ packed form
13132h9882j49785m06414M89550L79806j30885l04505k49755K42896l78965l55326
13122i53265K95587L03908P924N37725l77941m55385M34647L94595J0171m3273
13112A54693j67532n4764N1457J28939J69192l04088L18730O0551m32271K04022
13102A28929K79880J50935k36632o01692j28837l76753J09909J76557k69331Q5699
13092f81336M40807r6565K79624N28246M08453M2357m88873k13968p8430l92070
13082b51755K94255M47517M25836O1777k93993r5784k81951m62250l9669M5378
13072a50639L78714o8141n28862l83197M65427K73314O49582P0225k39693J28439
13062E95169J24481M82657L32226j35120l32302J15551J46358l55758k08705M69208
$$ plain form
13052 1233765 1348166 908745 439227 83562 259639 669801 323720 298988 431108 499241
13042 499241 264870 197809 199590 612031 584160 450314 943131 1034890 738355 614222
13032 614222 1011441 1504795 1226286 830834 1138837 1279001 1739065 1630159 1078366 521209
13022 521209 162841 -158831 -420341 -619131 -7012 153215 -83841 -301935 -71413 273570
13012 273570 167050 710280 774734 728834 737920 638453 820858 1409542 1639153 979034
13002 979034 176635 292275 672578 886362 1001199 425834 -315517 -227095 106625 150395
12992 150395 106282 94413 401334 667990 339045 567138 370406 293961 269521 155259
12982 155259 88239 -33556 -67268 283213 502586 820804 1185193 1517375 1726723 1119698
$$ packed form
13052A233765J14401m39421m69518l55665J76077M10162l46081k4732J32120O8133
13042D99241k34371o7061J781M12441k7871j33846M92817R1759k96535j24133
13032F14222L97219M93354k78509l95452L08003J40164M60064j08906n51793n57157
13022E21209l58368l21672k61510j98790O12119J60227k37056k18094K30522L44983
13012B73570j06520N43230O4454m5900R086r9467J82405N88684K29611o60119
13002I79034q02399J15640L80303K13784J14837n75365p41351Q8422L33720M3770
12992A50395m4113j1869L06921K66656l28945K28093j96732p6445k4440j14262
12982A55259o7020j21795l3712L50481K19373L18218L64389L32182K09348o07025
$$ plain form
12972 1119698 697102 915695 1430748 1300965 1411796 786196 357854 344147 713254 897693
12962 897693 1191644 1161954 1140547 895733 782779 1002947 1187378 1028665 845949 527227
12952 527227 608899 754389 969473 1150886 1388597 1362315 1336329 1266870 1354687 1407819 1563495
12941 1563495 1674398 1543168 1510185 1350983 908007 602543 367999 963530 868437 838678
12931 838678 617492 125787 621599 440367 31403 -301873 -183813 -71978 -102905 -113474
12921 -113474 -96239 51605 348330 312647 132502 309160 416262 280059 -69283 -23517
12911 -23517 69146 -17550 231277 908721 617733 70955 240506 598303 263026 536057
12901 536057 505828 45530 -72435 84229 446874 111957 -416461 -148605 -9692 -22259
$$ packed form
12972A119698m22596K18593N15053j29783J10831o25600m28342j3707L69107J84439
12962H97693K93951k9690k1407k44814j12954K20168J84431j58713j82716l18722
12952E27227Q1672J45490K15084J81413K37711k6282k5986o9459Q7817N3132J55676
12941A563495J10903j31230l2983j59202m42976l05464k34544N95531r5093k9759
12931H38678k21186m91705M95812j81232m08964l33276J18060J11835l0927j0569
12921a13474J7235J47844K96725l5683j80145J76658J07102j36203l49342M5766
12911b3517R2663q6696K48827O77444k90988n46778J69551L57797l35277K73031
12901E36057l0229m60298j17965J56664L62645l34917n28418K67856J38913j2567
$$ plain form
12891 -22259 547682 293794 63489 -532887 -1035011 -479455 -234228 -699694 -970446 -744850
12881 -744850 -154993 266439 225064 73988 64778 -74418 -75147 217990 20273 -86277 -200416
12870 -200416 -524051 -625617 -420675 -348510 -47571 459462 557086 179137 -405377 -542711
12860 -542711 -121993 602846 316450 104329 -79508 149005 143952 -67775 139158 483835
12850 483835 242354 59718 -259091 -539961 -496106 -329096 -269516 -138651 -429151 -493974
12840 -493974 -770242 -419118 -87646 -21823 238949 200811 -55 80685 332391 -126562
12830 -126562 -299739 -262583 197836 523937 423558 42187 -457430 -369994 40390 -16572
12820 -16572 131251 135335 131803 -177265 -498905 -288526 -117659 -360202 -783683 -748592 -100917
$$ packed form
12891b2259N69941k53888k30305n96376n02124N55556K45227m65466k70752K25596
12881g44850N89857M21432m1375j51076r210j39196p29K93137j97717j06550j14139
12870b00416l23635j01566K04942P2165L00939N07033R7624l77949n84514j37334
12860e42711M20718P24839k86396k12121j83837K28513n053k11727K06933L44677
12850D83835k41481j82636l18809k80870M3855J67010N9580J30865k90500o4823
12840d93974k76268L51124L31472O5823K60772l8138k00866Q0740K51706m58953
12830a26562j73177L7156M60419L26101j00379l81371m99617Q7436M10384n6962
12820a6572J47823M084l532l09068l21640K10379J70867k42543m23481L5091O47675
$$ plain form
12809 -100917 172261 -113711 -83981 48901 -194350 -441539 -503809 -321653 259623 71462
12799 71462 -93552 413112 573159 250036 38736 74975 81811 125431 -102334 -37144 64572
12788 64572 371526 474905 369295 84521 -54859 -17938 97573 59075 190223 106357
12778 106357 352753 601864 380884 -252127 -812127 -707598 -146150 -12023 -256927 -354803
12768 -354803 106954 -58037 79228 -25596 -113809 367164 -40397 -394837 -109133 -65621
12758 -65621 -425580 -564364 -980254 -1030879 -483747 -373617 -548426 -704060 -425409 -510678
12748 -510678 -933660 -994175 -629374 -450479 223988 398061 275950 10835 -44083 -37595
12738 -37595 -39290 -119186 75167 247108 138642 93184 249706 -26650 -575548 -438762
$$ packed form
12809a00917K73178k85972K9730J32882k43251k47189o2270J82156N81276j88161
12799G1462j65014N06664J60047l23123k11300L6239O836M3620k27765O5190J01716
12788F4572L06954J03379j05610k84774j39380L6921J15511l8498J31148q3866
12778A06357K46396K49111k20980o33011n60000J04529N61448J34127k44904r7876
12768c54803M61757j64991J37265j04824q8213M80973m07561l54440K85704M3512
12758f5621l59959j38784m15890n0625N47132J10130j74809j55634K78651q5269
12748e10678m22982o0515L64801J78895O74467J74073j22111k65115n4918O488
12738c7595j695p9896J94353J71941j08466m5458J56522k76356n48898J36786
$$ plain form
12728 -438762 -243173 -876161 -1555790 -1277058 -766385 -801872 -301577 -397842 -655236 -614871
12718 -614871 -587762 -82315 -177917 -320916 -180414 -23193 358106 243399 52417 -356237
12708 -356237 -687881 -525031 289238 419038 554871 595867 563560 68885 -22481 7571
12698 7571 8200 -385092 23539 369997 447701 607666 467512 -215658 -356685 -183457 -256108
12687 -256108 -206340 -222313 -89686 256160 166223 -8660 -259798 -291347 -564236 -670569
12677 -670569 -541832 -947311 -1019600 -752857 -257948 322030 18236 124203 204535 -59061
12667 -59061 14384 -69328 -107760 -251596 -375878 -216366 107826 540614 228607 -273668
12657 -273668 174442 -39533 -32306 55810 -55306 -198526 -44521 38991 -88861 -395950
$$ packed form
12728d38762J95589o32988o79629K78732N10673l5487N00295r6265k57394M0365
12718f14871K7109N05447r5602j42999J40502J57221L81299j14707j90982m08654
12708c56237l31644J62850Q14269J29800J35833M0996l2307m94675r1366L0052
12698G571O29l93292M08631L46458P7704J59965j40154o83170j41027J73228p2651
12687b56108M9768j5973J32627L45846q9937j74883k51138l1549k72889j06333
12677f70569J28737m05479p2289K66743M94909N79978l03794J05967Q0332k63596
12667e9061P3445q3712l8432j43836j24282J59512L24192M32788l12007n02275
12657b73668M48110k13975P227Q8116j11116j43220J54005Q3512j27852l07089
$$ plain form
12647 -395950 -324851 288237 -1130 108541 199105 301669 73715 406629 302731 108313
12637 108313 -56803 -34687 63321 -215631 -624579 -584829 -432005 -284393 -718773 -825843
12627 -825843 -559125 -998819 -757346 41161 297188 242835 202642 -542151 -845537 -399438
12617 -399438 -355415 -567229 -928188 -815387 -700305 -539940 -1866 -336748 -774196 -436879
12607 -436879 -374881 -572935 -246267 285460 123260 94360 365866 580400 50218 -766089
12597 -766089 -840173 -731595 -835495 -392063 -146971 40638 23409 10566 44605 465532
12587 465532 444069 126757 371086 932127 747672 575838 33662 -233133 -29951 -44808
12577 -44808 274298 273287 -26717 -174800 -221047 -44604 -140647 -176755 254976 377343 -472433
$$ packed form
12647c95950P1099O13088k89367J09671R0564J02564k27954L32914j03898j94418
12637A08313j65116K2116R8008k78952m08948L9750J52824J47612m34380j07070
12627h25843K66718m39694K41473P98507K56027n4353m0193p44793l03386M46099
12617c99438M4023k11814l60959J12801J15082J60365N38074l34882m37448L37317
12607d36879O1998j98054L26668N31727j62200k8900K71506K14534n30182q16307
12597g66089p4084J08578j03900M43432K45092J87609j7229j2843L4039M20927
12587D65532k1463l17312K44329N61041j84455j71834n42176k66795K03182j4857
12577d4808L19106j011l00004j48083m6247J76443r6043l6108M31731J22367q49776
$$ plain form
12566 -472433 -747988 -804530 -892912 -1064259 -609951 -347810 -43829 -20018 -550050 -1052766
12556 -1052766 -717101 -11010 33423 -61690 -356478 -379098 -446827 -439948 -187447 -384440
12546 -384440 -549769 -821707 -870064 -911749 -816162 -482074 -396071 90805 -134574 -407
12536 -407 150535 31108 448113 848758 515556 322121 -17807 29548 393781 151392
12526 151392 -309732 -623441 -584415 -404361 -323864 35466 -45513 -275619 -155995 -30120
12516 -30120 -207545 -187027 -141440 -388850 -78966 -269187 -46328 341229 319541 -26400
12506 -26400 -578230 -684735 -193106 -5217 70092 93838 138725 -72499 115922 459024
12496 459024 559908 322125 467901 109125 -280037 -452136 188448 544717 106402 81474
$$ packed form
12566d72433k75555n6542q8382j71347M54308K62141L03981K3811n30032n02716
12556a052766L35665P06091M4433r5113k94788k2620o7729O879K52501j96993
12546c84440j65329k71938m8357m1685R5587L34088Q6003M86876k25379J34167
12536d07J50942j19427M17005M00645l33202j93435l39928M7355L64233k42389
12526A51392m61124l13709L9026J80054Q0497L59330q0979k30106J19624J25875
12516c0120j77425K0518M5587k47410L09884j90221K22859L87557k1688l45941
12506b6400n51830j06505M91629J87889P5309K3746M4887k11224J88421L43102
12496D59024J00884k37783J45776l58776l89162j72099O40584L56269m38315k4928
$$ plain form
12486 81474 -509565 -943929 -564960 -681164 -343060 -567551 -119952 94891 414046 396219
12476 396219 575303 402514 474255 956072 854223 589546 518420 50335 -175206 -240356
12466 -240356 -42151 -224340 -43822 486569 -63039 -396471 -3790 485089 421678 200522
12456 200522 -276774 -571860 -344853 -49062 -281535 -681769 -393191 -374185 -321973 58720
12446 58720 417716 417107 50229 273070 264655 -112858 510772 693841 789356 1119533 617847
12435 617847 391719 146706 28281 222851 -28328 -236345 -510997 -813848 -1040808 -838066
12425 -838066 -421390 -504941 -282755 -360301 -343472 -269064 -203845 -69850 275487 403323
12415 403323 370662 245170 391564 461511 -14387 -22820 -87278 -560099 -945098 -1631464
$$ packed form
12486H1474n91039m34364L78969j16204L38104k24491M47599K14843L19155j7827
12476C96219J79084j72789P1741M81817j01849k64677p1126m68085k25541o5150
12466b40356J98205j82189J80518N30391n49608l33432L92681M88879o3411k21156
12456B00522m77296k95086K27007K95791k32473m00234K88578J9006N2212L80693
12446E8720L58996o09l66878K22841q415l77513O23630J83069R5515L30177n01686
12435F17847k26128k45013j18425J94570k51179k08017k74652l02851k26960K02742
12425h38066M16676q3551K22186p7546J6829P4408O5219J33995L45337J27836
12415D03323l2661j25492J46394O9947m75898q433o4458m72821l84999o86366
$$ plain form
12405 -1631464 -1509000 -824039 -438043 -448603 -401861 -326619 -617556 -701957 55550 11473
12395 11473 75921 90365 -12531 79042 252098 197005 277518 -38799 83001 212913 -239806
12384 -239806 -693403 -386979 -188707 -580978 -438530 -726113 -632658 -661305 -380305 -501868
12374 -501868 -418009 -524934 -740714 -441003 -618355 -397996 -385631 -629663 -995484 -874617
12364 -874617 -222904 -58431 365623 -2994 -380477 -730436 -654427 -779609 -1216443 -914618
12354 -914618 -396750 -504221 -311254 281307 600371 434003 -87802 -67470 254657 -401465
12344 -401465 -641279 -577422 -292567 -484413 -596012 -192015 -189548 251921 -47220 -252795
12334 -252795 115489 144866 329988 172405 146065 99969 200759 587929 388366 -273974
$$ packed form
12405a631464J22464O84961L85996j0560M6742P5242k90937q4401P57507m4077
12395A1473O4448J4444j02896R1573J73056n5093Q0513l16317J21800J29912m52719
12384b39806m53597L06424J98272l92271J42448k87583R3455k8647K81000j21563
12374e01868Q3859j06925k15780K99711j77352K20359J2365k44032l65821J20867
12364h74617O51713J64473M24054l68617l77483l49959P6009j25182m36834L01825
12354i14618N17868j07471J92967N92561L19064j66368n21805K0332L22127o56122
12344d01465k39814O3857K84855j91846j11599M03997K467M41469k99141k05575
12334b52795L68284K9377J85122j57583k6340m6096J00790L87170j99563o62340
$$ plain form
12324 -273974 -213529 -153944 -73932 615234 715816 1067651 981753 296917 -190686 -301832
12314 -301832 -309122 230789 304610 411024 293427 286698 573807 729752 631162 956550 1022642
12303 1022642 763762 883491 595241 549290 403078 410144 570274 210916 96752 66048
12293 66048 21769 242395 261264 252991 -60128 -6784 311080 218360 97542 585107 599039
12282 599039 366088 403938 83477 -203672 -69282 -111696 -231844 -520917 -554960 -615154
12272 -615154 -463890 -48593 -178655 -641688 -427362 -482984 -1121844 -1099319 -520321 -509616
12262 -509616 -358296 -78989 -295664 -316994 -345180 -347500 -150346 200864 389670 480816
12252 480816 -111097 -222846 -392963 -541919 -138954 25280 -334028 -159546 48468 -270215
$$ packed form
12324b73974O0445N9585Q0012O89166J00582L51835q5898o84836m87603j11146
12314c01832p290N39911P3821J06414j17597o729K87109J55945r8590L25388O6092
12303A022642k58880J19729k88250m5951j46212P066J60130l59358j14164l0704
12293F6048m4279K20626J8869q273l13119N3344L17864r2720j20818M87565J3932
12282E99039k32951L7850l20461k87149J34390m2414j20148k89073l4043o0194
12272f15154J51264M15297j30062m63033K14326n5622o38860K2525N78998J0705
12262e09616J51320K79307k16675k1330k8186k320J97154L51210J88806R1146
12252D80816n91913j11749j70117j48956M02965J64234l59308J74482K08014l18683
$$ plain form
12242 -270215 -490960 -258517 58363 88508 676 57416 34038 -220319 -2990 630037
12232 630037 1045604 1186920 573509 -291644 -241721 -331330 -331870 -321114 -631311 -1023216 -873427
12221 -873427 -195212 740078 855573 493239 -137975 -1017300 -810298 -226841 55201 -188292
12211 -188292 -281238 -161667 213606 406991 23725 109661 14852 -287074 21676 111667
12201 111667 -388892 -544211 -271336 -392419 -563173 -527382 -331980 -2176 -410266 -849862
12191 -849862 -101294 134910 -223610 -460729 -551674 -197090 278814 44769 -264418 -471342
12181 -471342 -582011 -432893 -444868 -354726 -386244 -297347 91876 -18086 -101337 -123160 -396386
12170 -396386 -1023146 -1078053 -601901 -105739 -591541 -592265 -297105 -131806 84189 -138483
$$ packed form
12242b70215k20745K32443L16880L0145q7832N6740k3378k54357K17329O33027
12232F30037M15567J41316o13411q65153M9923q9609n40J0756l10197l91905J49789
12221h73427O78215R35290J15495l62334o31214q79325K07002N83457K82042k43493
12211a88292r2946J19571L75273J93385l83266Q5936r4809l01926L08750Q9991
12201A11667n00559j55319K72875j21083j70754L5791J95402L29804m08090m39596
12191h49862P48568K36204l58520k37119r0945L54584M75904k34045l09187k06924
12181d71342j10669J49118j1975R0142l1518Q8897L89223j09962q3251k1823k73226
12170c96386o26760n4907M76152M96162m85802p24K95160J65299K15995k22672
$$ plain form
12160 -138483 -528936 -138895 429235 169388 -77584 -413382 -657810 -743455 -538810 -593630
12150 -593630 -677216 -686828 -437697 -281491 -263414 140955 431677 68001 -239706 110511
12140 110511 420835 265603 625703 597915 574272 519688 240264 -497803 -1395744 -1135346
12130 -1135346 -777961 -533778 17028 76360 166682 71430 370179 329367 202175 131416
12120 131416 -87875 161228 -8912 -559534 -1169791 -738400 -356704 -11264 233105 368043
12110 368043 11263 54249 248215 325851 263207 -928 146596 -108677 -377427 24096
12100 24096 6120 -322777 -391226 -831147 -699057 -216110 22381 488737 798899 -46176
12090 -46176 206750 456540 161806 -276660 -122516 140667 749438 1175552 936369 731293
$$ packed form
12160a38483l90453L90041N68130k59847k46972l35798k44428q5645K04645n4820
12150e93630q3586r612K49131J56206J8077M04369K90722l63676l07707L50217
12140A10511L10324j55232L60100k7788k3643n4584k79424p38067q97941K60398
12130a135346L57385K44183N50806N9332R0322r5252K98749m0812j27192p0759
12120A31416k19291K49103j70140n50622o10257M31391L81696L45440K44369J34938
12110C68043l56780M2986J93966P7636o2644k64135J47524k55273k68750M01523
12100B4096j7976l28897o8449m39921J32090M82947K38491M66356L10162q45075
12090d6176K52926K49790k94734m38466J54144K63183O08771M26114k39183k05076
$$ plain form
12080 731293 528758 -370232 -399311 -636931 -914294 -635465 -914194 -1092558 -587090 -358496
12070 -358496 -618481 -960582 -711216 -911747 -815072 -312192 250890 288245 -513212 -798131
12060 -798131 -453236 -219227 -246661 -781579 -816093 -409593 -448794 -504936 -783320 -980957
12050 -980957 -1083788 -828095 -252142 415994 -41642 -385595 -41763 196052 111214 536895
12040 536895 492778 -13574 -87564 -92815 105439 236830 192104 429129 1116 -348223
12030 -348223 -258960 -47068 -219033 -215432 -360204 -437142 -100116 -209462 265880 317212
12020 317212 -140336 -634169 -573373 -549205 -371393 -409496 -149766 409143 644684 478805
12010 478805 -342710 -127800 396094 303948 494966 446582 284077 210595 -227861 -136961
$$ packed form
12080G31293k02535q98990k9079k37620k77363K78829k78729j78364N05468K28594
12070c58496k59985l42101K49366k00531R6675N02880N63082L7355q01457k84919
12060g98131L44895K34009k7434n34918l4514M06500l9201n6142k78384j97637
12050i80957j02831K55693N75953O68136m57636l43953L43832K37815q4838M25681
12040E36895m4117n06352p3990n251J98254J31391m4726K37025m28013l49339
12030c48223Q9263K11892j71965L601j44772p6938L37026j09346M75342N1332
12020C17212m57548m93833O0796K4168J77812l8103K59730N58909K35541j65879
12010D78805q21515K14910N23894r2146J91018m8384j62505p3482m38456R0900
$$ plain form
12000 -136961 286640 195469 154442 59443 -144427 121253 297345 296115 463495 652613
11990 652613 497161 227737 -235752 -106577 5287 -141251 -61943 -124072 141642 35780
11980 35780 137091 133519 -167402 274226 351470 63238 98870 2388 -43474 -317930 -379365
11969 -379365 -545173 -768519 -574261 -143070 -608103 -779026 43355 -156051 -293286 20148
11959 20148 -129571 83179 520375 430486 431846 431995 384384 549481 819320 498892 74113
11948 74113 -21418 242082 28732 -317440 -332180 -309765 94010 435979 437256 29950 -368031
11937 -368031 163054 212726 -143836 -103896 -510168 -584433 -459504 -694640 -693924 -429310 -234586
11926 -234586 -156608 330087 467614 428785 744907 599750 -264456 -649800 30713 267341
$$ packed form
12000a36961M23601r1171m1027r4999k03870K65680J76092j230J67380J89118
11990F52613j55452k69424m63489J29175J11864j46538P9308o2129K65714j05862
11980C5780J01311l572l00921M41628P7244k88232L5632r6482m5862k74456o1435
11969c79365j65808k23346J94258M31191m65033j70923Q22381j99406j37235L13434
11959B0148j49719K12750M37196q9889J360J49m7611J65097K69839l20428m24779
11948G4113r5531K63500k13350l46172j4740K2415M03775L41969J277m07306l97981
11937c68031N31085M9672l56562L9940m06272p4265J24929k35136P16K64614J94724
11926b34586P7978M86695J37527l8829L16122j45157q64206l85344O80513K36628
$$ plain form
11916 267341 226539 312483 -69967 -278391 -202557 238620 704093 811266 200943 184589
11906 184589 110378 269043 365526 272900 145551 99925 137472 112548 85973 101717 -160476
11895 -160476 -686421 -681737 -322391 -422611 -813886 -883194 -400259 -196771 -207695 -322052
11885 -322052 87947 518060 519013 498674 767960 574912 300094 -493166 -714825 -430992
11875 -430992 -678064 -965432 -943997 -1219400 -858307 -537727 -356113 -78704 -295209 -338383
11865 -338383 -21528 199410 -271011 -101176 181536 258962 293250 350584 -408909 -840020
11855 -840020 -981358 -322546 -55959 64314 78182 -129344 191840 814422 591449 739635
11845 739635 626774 501584 193139 -12338 242274 300897 37039 -149746 -188836 -123503
$$ packed form
11916B67341m0802Q5944l82450k08424P5834M41177M65473J07173o10323j6354
11906A84589p4211J58665R6483r2626j27349m5626L7547k4924k6575J5744k62193
11895a60476n25945M684L59346j00220l91275o9308M82935K03488j0924j14357
11885c22052M09999M30113R53k0339K69286j93048k74818p93260k21659K83833
11875d30992k47072k87368K1435k75403L61093L20580J81614K77409k16505m3174
11865c38383L16855K20938m70421J69835K82712P7426L4288N7334p59493m31111
11855h40020j41338O58812K66587J20273J3868k07526L21184O22582k22973J48186
11845G39635j12861j25190l08445k05477K54612N8623k63858j86785l9090O5333
$$ plain form
11835 -123503 -173865 -47615 -354883 -609109 -480720 -376870 -104219 -421798 24262 244501
11825 244501 326018 8197 -697263 -1099257 -601694 -401132 335975 528404 200212 340337
11815 340337 -194198 -313726 -12986 -239593 -415258 -597828 -398598 -493947 -822797 -505158
11805 -505158 -799324 -712085 -593885 -879790 -1040376 -858472 -492692 51186 340224 32919
11795 32919 -323825 -305388 -568120 -316601 97487 97346 28973 18251 -83108 77712 73212
11784 73212 -100922 35326 77691 -105234 -164575 -492118 -860480 -703966 -262670 -389619
11774 -389619 -498621 8667 63435 -16744 -172258 -161551 -115908 -94014 45029 161022
11764 161022 167145 -11994 -2700 -43823 -8403 231790 173325 339980 42337 -282741 -30637
$$ packed form
11835a23503n0362J26250l07268k54226J28389J03850K72651l17579M46060K20239
11825B44501Q1517l17821p05460m01994M97563K00562P37107J92429l28192J40125
11815C40337n34535j19528L00740k26607j75665j82570J99230r5349l28850L17639
11805e05158k94166Q7239J18200k85905j60586J81904L65780N43878K89038l07305
11795C2919l56744J8437k62732K51519M14088j41o8373j0722j01359J60820m500
11784G3212j74134J36248M2365j82925n9341l27543l68362J56514M41296j26949
11774c89619j09002N07288N4768q0179j55514J0707M5643K1894J39043J15993
11764A61022O123j79139R294m1123L5420K40193n8465J66655k97643l25078K52104
$$ plain form
11753 -30637 403706 686123 427449 182647 62760 126355 -311329 -533344 -303770 -138950
11743 -138950 -401264 -884955 -879450 -688233 -518129 -270073 -616269 -756754 -524202 -174411
11733 -174411 -338906 -449872 -571719 -280536 -339241 -281941 -386011 -781505 -626440 -834566
11723 -834566 -700456 -719585 -759623 -316895 138444 336568 189665 2551 206124 510589
11713 510589 249584 -471515 -606915 -363525 -327772 -369823 -358568 -139770 21878 -71684
11703 -71684 60510 -373301 -569901 -448471 -143815 -196939 -494101 -217626 -131125 -300006
11693 -300006 -380879 -499705 -27188 -180973 -131732 83319 183227 -241032 -691437 -550579
11683 -550579 -200448 -33257 1489 -410166 -307097 -209938 50509 -7067 -273289 30078
$$ packed form
11753c0637M34343K82417k58674k44802j19887O3595m37684k22015K29574J64820
11743a38950k62314m83691N505J91217J70104K48056l46196j40485K32552L49791
11733a74411j64495j10966j21847K91183n8705N7300j04070l95494J55065k08126
11723h34566J34110j9129m0038M42728M55339J98124j46903j87114K03573L04465
11713E10589k61005p21099j35400K43390L5753m2051J1255K18798J61648r3562
11703g1684J32194m33811j96600J21430L04656n3124k97162K76475Q6501j68881
11693c00006q0873j18826M72517j53785M9241K15051R9908m24259m50405J40858
11683e50579L50131J67191L4746m11655J03069R7159K60447n7576k66222L03367
$$ plain form
11673 30078 384564 150332 250214 306204 206783 -554633 -1029213 -804623 -684398 -503072
11663 -503072 -65270 88515 210669 -254956 -229945 -3686 -29147 -210476 -83999 -90459
11653 -90459 -292516 -570464 -470319 -43332 -101622 -466232 -296234 -440532 -619355 -296205
11643 -296205 -364630 130166 255861 206494 395779 239132 135519 45855 -197579 -326599
11633 -326599 259751 391023 99708 -353500 -528898 -192032 -137607 -492673 -1099880 -1258965
11623 -1258965 -1167805 -991777 -748067 -641529 -750544 -1040118 -924333 -904785 -662771 -389247
11613 -389247 -188064 182823 93677 215234 323764 -81571 -476846 -839246 -969859 -675214
11603 -675214 -2886 228829 232463 -43449 176696 277596 -129802 28130 633452 781389
$$ packed form
11673C0078L54486k34232R9882N5990r9421p61416m74580K24590J20225J81326
11663e03072M37802J53785J22154m65625K5011K26259k5461j81329J26477o460
11653i0459k02057k77948J00145M26987n8290l64610J69998j44298j78823L23150
11643b96205o8425M94796J25695m9367J89285j56647j03613q9664k43434j29020
11633c26599N86350J31272k91315m53208j75398L36866N4425l55066o07207j59085
11623a258965R1160J76028K43710J06538j09015k89574J15785J9548K42014K73524
11613c89247K01183L70887q9146J21557J08530m05335l95275l62400j30613K94645
11603f75214O72328K31715L634k75912K20145J00900m07398J57932O05322J47937
$$ plain form
11593 781389 368789 17820 -51038 -78062 -402319 -610537 -435787 -293726 -408809 -249013
11583 -249013 21527 -50605 17836 136461 177969 -87213 -336193 -515540 -260749 -3339
11573 -3339 -127929 -159785 -65791 31803 -16608 -267480 83439 676151 1094921 858957 62005
11562 62005 -394840 -481504 -247484 -23736 538797 285128 -122468 14932 454954 414546
11552 414546 667673 801922 463252 272757 192931 137263 -17174 -135243 -711538 -865448
11542 -865448 -931819 -598654 37012 46156 -506682 -581193 222259 691471 321567 183701
11532 183701 70152 -81741 52896 -6075 139833 311691 342460 70792 178038 779995
11522 779995 1003517 744591 413284 132970 -24436 -25953 54637 -201947 -97069 -300753
$$ packed form
11593G81389m12600l50969o8858k7024l24257k08218J74750J42061j15083J59796
11583b49013K70540p2132O8441J18625M1508k65182k48980j79347K54791K57410
11573c339j24590l1856R3994R7594m8411k50872L50919N92712M18770k35964p96952
11562F2005m56845q6664K34020K23748N62533k53669m07596J37400M40022m0408
11552D14546K53127J34249l38670j90495p9826n5668j54437j18069n76295j53910
11542h65448o6371L33165O35666R144n52838p4511Q03452M69212l69904j37866
11532A83701j13549j51893J34637n8971J45908J71858L0769k71668J07246O01957
11522G79995K23522k58926l31307k80314j57406j517Q0590k56584J04878k03684
$$ plain form
11512 -300753 -316693 -439657 -650495 -419206 -81280 -129898 495082 558731 -124217 -388909
11502 -388909 -348923 -288584 9427 206941 96285 320043 46010 -431627 -491008 101895
11492 101895 398313 568410 -74972 -113077 -243064 -500400 126118 274114 259296 291818
11482 291818 325816 735283 447932 -159983 87393 403319 860370 530169 -232845 -459618
11472 -459618 360446 644045 318482 626635 812035 402826 -336370 -440212 -497020 -686478
11462 -686478 -257693 -225137 -456345 -452067 -508417 -542281 -562986 -938331 -1286865 -1124454 -1189777
11451 -1189777 -1142262 -775678 -677411 -679893 -823461 -263445 -57528 -245208 -406062 -276708
11441 -276708 67053 222187 22079 181745 166590 398747 324631 410851 55722 -358213
$$ packed form
11512c00753j5940j22964k10838K31289L37926m8618O24980O3649o82948k64692
11502c88909L9986O0339K98011J97514j10656K23758k74033m77637n9381N92903
11492A01895K96418J70097o43382l8105j29987k57336O26518J47996j4818L2522
11482B91818L3998M09467k87351o07915K47376L15926M57051l30201p63014k26773
11472d59618Q20064K83599l25563L08153J85400m09209p39196j03842n6808j89458
11462f86478M28785L2556k31208M278n6350l3864k0705l75345l48534J62411o5323
11451a189777M7515L66584R8267k482j43568N60016K05917j87680j60854J29354
11441b76708L43761J55134k00108J59666j5155K32157p4116Q6220l55129m13935
$$ plain form
11431 -358213 -272932 -11589 -210169 -203804 197600 36265 -589553 -463398 -171340 -147502
11421 -147502 -156086 195332 563559 459391 564408 835495 568294 548638 692625 269599
11411 269599 10820 94177 286163 30952 -340562 -302394 -313975 -375149 -287061 -492132
11401 -492132 -499803 -132882 -222164 -115049 -419935 -498317 -359494 -329052 43600 296570
11391 296570 587760 988103 651019 274324 405793 441780 254948 216649 -49783 -580065
11381 -580065 -1026414 -733995 -76138 -177897 272220 596553 698231 331604 -214151 -725176
11371 -725176 -535404 -671842 -1226163 -801203 -19957 360480 365057 369909 128655 568009
11361 568009 488076 420322 525075 -52727 -429211 -376534 -516743 -299806 71427 -26437
$$ packed form
11431c58213Q5281K61343j98580O365M01404j61335o25818J26155K92058K3838
11421a47502q584L51418L68227j04168J05017K71087k67201j9656J43987m23026
11411B69599k58779Q3357J91986k55211l71514L8168j1581o1174Q8088k05071
11401d92132p671L66921q9282J07115l04886p8382J38823L0442L72652K52970
11391B96570K91190M00343l37084l76695J31469L5987j86832l8299k66432n30282
11381e80065m46349K92419O57857j01759M50117L24333J01678l66627n45755n11025
11371g25176J89772j36438n54321M24960P81246L80437M577M852k41254M39354
11361E68009p9933o7754J04753n77802l76484N2677j40209K16937L71233r7864
$$ plain form
11351 -26437 -561845 -800139 -348445 31127 257846 594515 455976 508308 503488 241483
11341 241483 551417 619645 662825 310659 38981 71683 71043 195352 242488 -33133 -231482
11330 -231482 -504856 -439636 -233186 -241473 -477999 -352765 -209192 -86468 -151382 29130
11320 29130 -90234 229338 263536 -366904 -536355 -391612 -183168 -176831 -100599 54568
11310 54568 54934 424630 337737 161746 194137 267351 4843 70425 -63618 164970 163477
11299 163477 -54189 83192 388775 612758 543770 205208 573052 811816 801817 374602
11289 374602 414726 655497 495510 106352 -48597 -280826 -138637 -366929 -399715 -332691
11279 -332691 -457190 -71853 78480 -386643 -289215 2523 -47946 -149593 -187442 -63778
$$ packed form
11351b6437n35408k38294M51694L79572K26719L36669j38539N2332m820k62005
11341B41483L09934O8228M3180l52166k71678L2702o40J24309M7136k75621j98349
11330b31482k73374O5220K06450q287k36526J25234J43573J22724o4914J80512
11320B9130j19364L19572L4198o30440j69451J44743K08444O337P6232J55167
11310E4568L66L69696q6893j75991L2391P3214k62508O5582j34043K28588j493
11299A63477k17666J37381L05583K23983o8988l38562L67844K38764r999m27215
11289C74602M0124K40771j59987l89158j54949k32229J42189k28292l2786O7024
11279c32691j24499L85337J50333m65123R7428K91738n0469j01647l7849J23664
$$ plain form
11269 -63778 72523 40262 -80211 68325 -94889 -278819 -457828 -642928 -413807 -111925
11259 -111925 -144716 -278724 -299662 -323843 -532144 -721673 -612934 -1170848 -1835684 -1072703
11249 -1072703 -768628 -623491 -210114 -424940 -766379 -799974 -1365410 -1113270 -619285 -470969
11239 -470969 -712722 -634550 -420418 -398347 -279722 45162 -67658 -173962 -336516 -9554
11229 -9554 632783 512978 514596 784374 941898 1013819 227160 -193304 306794 256290 228331
11218 228331 145580 -128208 -348953 -157882 -165067 -27669 -190314 -80074 549246 465455
11208 465455 995370 1001926 571678 564600 410078 140165 16997 111625 375225 298198 -173947
11197 -173947 -568781 -241876 343114 368796 15906 -387580 -829907 -789577 -801652 -762141
$$ packed form
11269f3778J36301l2261j20473J48536j63214j83930j79009j85100K29121L01882
11259a11925l2791j34008k0938k4181k08301j89529J08739n57914o64836P62981
11249a072703L04075J45137M13377k14826l41439l3595n65436K52140M93985J48316
11239d70969k41753P8172K14132K2071J18625L24884j12820j06304j62554L26962
11229i554O42337j19805J618K69778J57524P1921p86659m20464N00098n0504k7959
11218B28331q2751k73788k20745J91071p185J37398j62645J10240O29320q3791
11208D65455N29915O556m30248p078j54522k69913j23168R4628K63600p7027m72145
11197a73947l94834L26905N84990K5682l52890m03486m42327M0330j2075L9511
$$ plain form
11187 -762141 -855385 -461088 -20410 97849 459589 550248 705396 378915 74970 237950
11177 237950 -113889 -329788 -444507 -624847 -812206 -759637 -282066 -118328 -105307 -426864
11167 -426864 -371633 -611054 -806226 -635983 -639149 -680449 -900396 -962492 -1005243 -448998 -4890
11156 -4890 -14950 -28109 -82615 -127860 314509 504511 23991 -676548 -1179256 -1029697 -790676
11145 -790676 -785420 -921955 -723838 -680407 -667226 -399128 296736 247578 -325094 -204270
11135 -204270 -252581 -470167 -329308 162659 117541 319160 166503 398033 232111 -429837
11125 -429837 -457387 -393386 -28943 -88409 -66731 -178703 -551205 -1264261 -1017345 -488114
11115 -488114 -36489 -85294 273296 -4004 -198604 85986 413309 470638 408154 2249
$$ packed form
11187g62141r3244L94297M40678J18259L61740R0659J55148l26481l03945J62980
11177B37950l51839k15899j14719j80340j87359N2569M77571J63738J3021l21557
11167d26864N5231k39421j95172J70243l166m1300k19947o2096m2751N56245M44108
11156d890j0060j3159n4506m5245M42369J90002m80520p00539n02708J49559K39021
11145g90676N256j36535J98117M3431J3181K68098O95864m9158n72672J20824
11135b04270m8311k17586J40859M91967m5118K01619j52657K31530j65922o61948
11125d29837k7550O4001L64443n9466K1678j11972l72502p13056K46916N29231
11115d88114M51625m8805L58590k77300j94600K84590L27323N7329o2484m05905
$$ plain form
11105 2249 -302173 -211846 -245987 -504750 -65019 -187769 -81326 -129840 -486677 -233841
11095 -233841 -393446 -609808 -883701 -1001634 -1006067 -782508 -520694 -60109 187610 148077
11085 148077 -139267 -92699 170583 201546 236186 64830 -304180 3276 -336420 -780090
11075 -780090 -649497 -102684 533816 694023 793651 874490 818354 436469 -286129 -557655
11065 -557655 -670351 -913059 -705215 -624087 -632620 -382542 -350077 -410084 -7768 -64786 9697
11054 9697 218345 231748 212077 5357 -314692 -393667 -677492 -696751 -139788 84233 6691
11043 6691 -175586 135025 548816 496398 186525 481709 -174216 -454588 -417553 -274966
11033 -274966 68933 454957 478643 -153672 -207702 -556013 -461809 -37348 -46584 -26113 274721
$$ packed form
11105B249l04422R0327l4141k58763M39731j22750J06443m8514l56837K52836
11095b33841j59605k16362k73893j17933m433K23559K61814M60585K47719l9533
11085A48077k87344M6568K63282L0963L4640j71356l69010L07456l39696m43670
11075g80090J30593N46813O36500J60207R9628Q0839n6136l81885p22598k71526
11065e57655j12696k42708K07844Q1128q533K50078L2465o0007M02316n7018P4483
11054I697K08648J3403j9671k06720l20049p8975k83825j9259N56963K24021p7542
11043F691j82277L10611M13791n2418l09873K95184o55925k80372L7035J42587
11033b74966L43899L86024K3686o32315n4030l48311R4204M24461r236K0471L00834
$$ plain form
11022 274721 95805 -185907 -424525 -251049 -480560 -730356 -562478 -226833 191996 -59075
11012 -59075 7061 474635 426365 127381 150298 150271 230958 194352 193741 3968 -195255 273893
11000 273893 233123 -397347 -216551 -46823 -217739 174321 60402 -159289 -435929 -749181
10990 -749181 -589646 -265062 26873 229377 162820 565671 897337 267200 32784 -24952
10980 -24952 -226623 -289623 -419265 -575797 -528409 -491609 -578443 -811130 -588662 171771
10970 171771 249659 -233439 -151183 116638 -275320 -586674 -126939 488999 193693 -25549
10960 -25549 83577 286696 306674 264338 -109011 -346471 16984 165477 489848 545958
10950 545958 471731 172495 -126660 44264 529542 1203785 1346530 946978 571593 325373
$$ packed form
11022B74721j78916k81712k38618J73476k29511k49796J67878L35645M18829k51071
11012e9075O6136M67574m8270k98984K2917k7Q0687l6606o11j89773j99223M69148
11000B73893m0770o30470J80796J69728j70916L92060j13919k19691k76640l13252
10990g49181J59535L24584K91935K02504o6557M02851L31666o30137k34416n7736
10980b4952k01671o3000j29642j56532M7388L6800q6834k32687K22468P60433
10970A71771P7888m83098Q2256K67821l91958l11354M59735O15938k95306k19242
10960b5549J09126K03119J9978m2336l73349k37460L63455J48493L24371N6110
10950E45958p4227k99236k99155J70924M85278O74243J42745l99552l75385k46220
$$ plain form
10940 325373 560856 499421 167771 -67643 -405650 -1065551 -1443507 -749305 -543519 -732308
10930 -732308 -245737 351535 291511 66650 70978 223637 -116764 -220214 93366 243130
10920 243130 183689 -18795 24356 -15687 -344913 -481974 -468778 -386817 -786130 -720495 -755969
10909 -755969 -820014 -966589 -895699 -792580 -594214 -42084 84952 202982 507904 479282
10899 479282 133931 91861 19124 -57565 220451 844262 845148 410389 330791 170301 154164
10888 154164 -37779 152829 457946 892098 713478 689313 799535 328513 -375175 -353009
10878 -353009 -400377 -726724 -891850 -132363 198898 76324 334479 100378 224543 315601
10868 315601 655755 731716 172330 -327419 -607216 -560975 -651738 -787228 -780312 -362192
$$ packed form
10940C25373K35483o1435l31650k35414l38007o59901l77956O94202K05786j88789
10930g32308M86571N97272o0024k24861M328J52659l40401j03450L13580J49764
10920B43130n9441k02484M3151m0043l29226j37061J3196Q1961l99313O5635l5474
10909g55969o4045j46575P0890J03119J98366N52130J27036J18030L04922k8622
10899D79282l45351m2070p2737p6689K78016O23811Q86m34759p9598j60490j6137
10888A54164j91943J90608L05117M34152j78620k4165J10222m71022p03688K2166
10878c53009m7368l26347j65126P59487L31261j22574K58155k34101J24165R1058
10868C15601L40154P5961n59386m99749k79797M6241r0763j35490O916M18120
$$ plain form
10858 -362192 -322646 -540248 -353666 406507 850951 473857 -14840 -287172 333382 608213
10848 608213 651629 576451 -232514 124252 429479 20532 -582342 -467781 -410113 -167500
10838 -167500 -266089 -664966 -1124169 -624794 30696 355679 489452 387729 83407 -475189
10828 -475189 -290085 51391 31459 -191222 -31593 37286 -191892 -21005 269737 320856
10818 320856 109074 100763 -84945 357050 1010315 1006704 771753 646494 111165 -210366
10808 -210366 -824253 -589357 -549264 -388183 -72937 496665 684243 264273 -291553 8708
10798 8708 -91086 -54916 57994 263645 -148475 118815 668786 477916 -200433 -353077
10788 -353077 -285020 95366 93986 33684 -165779 -333662 -143735 66845 -81699 95965
$$ packed form
10858c62192L9546k17602J86582P60173M44444l77094m88697k72332O20554K74831
10848F08213M3416p5178q08965L56766L05227m08947o02874J14561N7668K42613
10838a67500r8589l98877m59203M99375O55490L24983J33773j01723l04322n58596
10828d75189J85104L41476j9932k22681J59629O8879k29178J70887K90742N1119
10818C20856k11782q311j85708M41995O53265l611k34951j25259n35329l21531
10808b10366o13887K34896M0093J61081L15246N69602J87578m19970n55826L00261
10798H708r9794L6170J12910K05651m12120K67290N49971j90870o78349j52644
10788c53077O8057L80386j380o0302j99463j67883J89927K10580j48544J77664
$$ plain form
10778 95965 100855 -40671 -285365 -895499 -663611 -262443 -108330 -71738 -470259 -844870
10768 -844870 -1093999 -786498 -921406 -888579 -788186 -974730 -428204 -151522 234297 472833
10758 472833 271941 379078 350675 272065 121337 9451 16850 72019 -124703 -295702
10748 -295702 -314995 -131286 317314 325090 557442 1342028 1423573 842269 352862 -153080
10738 -153080 -506583 -442449 -11635 495164 788650 1104844 1068674 784441 439705 161020
10728 161020 66829 378348 505009 606212 457579 615554 332415 155153 333100 264156
10718 264156 274076 508270 1037566 846120 493930 331241 -43448 -124248 -91703 1417
10708 1417 -14232 -43855 -134754 -397703 -570301 132380 409883 251932 550769 373961
$$ packed form
10778I5965M890j41526k44694o10134K31888M01168J54113L6592l98521l74611
10768h44870k49129L07501j34908L2827J00393j86544N46526K76682L85819K38536
10758D72833k00892J07137k8403p8610j50728j11886P399N5169j96722j70999
10748b95702j9293J83709M48600P776K32352P84586Q1545n81304m89407n05942
10738a53080l53503O4134M30814N06799K93486L16194l6170k84233l44736k78685
10728A61020r4191L11519J26661J01203j48633J57975k83139j77262J77947o8944
10718B64156R920K34194N29296j91446l52190j62689l74689q0800L2545R3120
10708A417j5649k9623r0899k62949j72598P02681K77503j57951K98837j76808
$$ plain form
10698 373961 112766 370410 260670 11454 -102263 -473539 -525968 -292849 -125095 -356835
10688 -356835 -636164 -338848 -53283 -259037 -378674 -120491 169683 64917 107418 -51646
10678 -51646 171276 203553 314640 102219 -138283 -313750 277994 294815 296780 570540
10668 570540 546696 550149 58765 -441618 -329785 -347572 -352809 -248740 -251426 -47274 674407
10657 674407 1093350 1173633 840888 722722 645144 538423 -72808 -217497 -254379 -161374
10647 -161374 -54992 -17281 170095 583835 -7668 -155327 51528 -111261 99226 705305
10637 705305 510673 84552 101673 347779 295804 612169 330782 197919 106172 154006
10627 154006 36727 -138053 293175 628845 528590 803954 1136575 869628 474170 257381
$$ packed form
10698C73961k61195K57644j09740k49216j13717l71276n2429K33119J67754k31740
10688c56835k79329K97316K85565k05754j19637K58183K90174j04766M2501j59064
10678e1646K22922L2277J11087k12421k40502j75467N91744J6821J965K73760
10668E70540k3844L453m91384n00383J11833j7787n237J04069k686K04152P21681
10657F74407M18943Q0283l32745j18166p7578j06721o11231j44689l6882R3005
10647a61374J06382L7711J87376M13740n91503j47659K06855j62789K10487O06079
10637G05305j94632m26121J7121K46106n1975L16365k81387j32863r1747M7834
10627A54006j17279j74780M31228L35670j00255K75364L32621k66947l95458k16789
$$ plain form
10617 257381 -35643 -487028 -437160 -15475 -191661 -529383 -371661 38579 -139467 -358487
10607 -358487 -700527 -457264 -141847 -46459 358520 140453 431467 1145908 769392 388587
10597 388587 554579 123453 -334506 -155461 -190846 -275793 41534 146151 411723 71096
10587 71096 -216416 -427267 -433974 -177343 -145179 -238035 -151720 -82320 -210725 -387426 -692578
10576 -692578 17886 610462 274278 -444876 -808010 -258439 -662376 -712290 -263133 33419
10566 33419 14819 -289947 -396492 -95737 113389 48565 -73393 -259917 110623 153496
10556 153496 -41134 488124 225156 -280841 -482945 -272105 -10664 481015 493100 109670
10546 109670 -355000 -472223 -442389 -353465 10237 -118439 -191245 -223698 -278189 -201941 -230848
$$ packed form
10617B57381k93024m51385M9868M21685j76186l37722J57722M10240j78046k19020
10607c58487l42040K43263L15417R5388M04979k18067K91014P14441l76516l80805
10597C88587J65992m31126m57959J79045l5385q4947L17327J04617K65572l40627
10587G1096k87512k10851o707K56631L2164r2856Q6315O9400j28405j76701l05152
10576f92578P10464N92576l36184p19154l63134N49571m03937m9914M49157K96552
10566C3419j8600l04766j06545L00755K09126o4824j21958j86524L70540M2873
10556A53496j94630N29258k62968n05997k02104K10840K61441M91679J2085l83430
10546A09670m64670j17223K9834Q8924L63702j28676p2806l2453n4491P6248k8907
$$ plain form
10535 -230848 -245983 99268 -318547 -263077 -359844 -320681 32086 235956 158239 -91421
10525 -91421 25209 -357182 -461136 -537991 -469130 -863210 -754512 -217485 582057 951465
10515 951465 720022 454501 749511 828657 656227 378445 -55062 269186 348198 169314
10505 169314 181086 297558 545074 390318 368244 245741 427712 418203 704330 983511
10495 983511 904473 871921 746763 578235 537672 552284 209453 133039 505035 901763
10485 901763 537887 52499 -167055 -238132 -29798 204094 429844 76485 201545 460583
10475 460583 376644 69746 278647 457309 164297 117968 373752 294792 133428 32759
10465 32759 505409 482614 -88163 -373480 -504576 -472355 -484632 -124587 -447927 -350680
$$ packed form
10535b30848j5135L45251m17815N5470r6767L9163L52767K03870p7717k49660
10525i1421J16630l82391j03954p6855O8861l94080J08698N37027P99542L69408
10515I51465k31443k65521K95010P9146j72430k77782m33507L24248P9012j78884
10505A69314J1772J16472K47516j54756k2074j22503J81971r509K86127K79181
10495I83511p9038l2552j25158j68528m0563J4612l42831p6414L71996L96728
10485I01763l63876m85388k19554p1077K08334K33892K25750l53359J25060K59038
10475D60583q3939l06898K08901J78662k93012m6329K55784p8960j61364j00669
10465C2759M72650k2795n70777k85317j31096L2221j2277L60045l23340R7247
$$ plain form
10455 -350680 -138239 71605 409424 444145 -37157 -120427 -60928 -327354 -971788 -975742
10445 -975742 -863701 -520915 -105307 163660 -91186 446549 919556 689273 88350 -319729
10435 -319729 -945514 -616643 222924 101933 123614 353911 321459 342519 835922 541851
10425 541851 184973 -167190 -402893 -272128 -239818 -555423 -649868 -377227 -66129 -176266
10415 -176266 96207 154904 116498 537522 448478 338088 194803 47148 76408 278243
10405 278243 196067 185035 35712 -322017 -485986 -523611 -456747 -378397 -189431 -425555
10395 -425555 -510421 -130463 163143 129598 33190 -22821 117407 270186 320120 275678 -139417
10384 -139417 -296085 -296174 -189607 -364226 -287726 262333 284779 94830 -81948 -200334 -94737
$$ packed form
10455c50680K12441K09844L37819L4721m81302q3270N9499k66426o44434l954
10445i75742J12041L42786M15608K68967k54846N37735M73007k30283o00923m08079
10435c19729o25785L28871Q39567j20991K1681K30297l2452K1060M93403k94071
10425E41851l56878l52163k35703J30765L2310l15605r4445K72641L11098j10137
10415a76266K72473N8697l8406M21024q9044j10390j43285j47655K9260K01835
10405B78243q2176j1032j49323l57729j63969l7625O6864P8350J88966k36124
10395d25555q4866L79958K93606l3545r6408n6011J40228J52779M9934m4442m15095
10384a39417j56668q9J06567j74619P6500N50059K2446j89949j76778j18386J05597
$$ plain form
10373 -94737 -103096 27066 -79086 -413551 -106625 9871 -93817 207909 431685 304918
10363 304918 -121277 -375109 -369827 136337 356995 210768 347618 81519 -275599 329743
10353 329743 1100095 1502779 1793699 1815601 2129812 2924620 3555176 3881381 3689396 4347467
10343 4347467 4919967 5199388 4988056 4543792 4285491 4228800 3805471 3319880 2307693
10334 2307693 1453563 1553450 1196173 1143793 1341430 1556954 1173559 659186 606864 646725
10324 646725 201267 309627 266610 412801 1011210 783650 476060 626526 974662 930055
10314 930055 327376 113505 245486 190952 -253912 -360435 -313077 10947 244576 316161
10304 316161 111139 157220 179890 -140971 -172543 -60262 -12051 273349 420908 292396
$$ packed form
10373i4737q359J30162j06152l34465L06926J16496j03688L01726K23776j26767
10363C04918m26195k53832N282N06164K20658j46227J36850k66099l57118O05342
10353C29743P70352M02684K90920K1902L14211P94808O30556L26205j91985O58071
10343D347467N72500K79421k11332m44264k58301n6691m23329m85591j012187
10334B307693q54130R9887l57277n2380J97637K15524l83395n14373n2322L9861
10324F46725m45458J08360m3017J46191N98409k27560l07590J50466L48136m4607
10314I30055o02679k13871J31981n4534m44864j06523M7358L24024K33629P1585
10304C16161k05022M6081K2670l20861l1572J12281M8211K85400J47559j28512
$$ plain form
10294 292396 114728 -242221 -670846 -874562 -971971 -1122320 -506454 -25777 378052 96349
10284 96349 226756 836590 829014 595879 394964 297214 600706 631064 467500 -86983
10274 -86983 -89274 85638 -204252 -771008 -386338 176983 149685 467664 762482 747068
10264 747068 279395 -115978 -210002 -269924 -32195 173365 646577 1220293 705236 -9093
10254 -9093 -151154 -114540 409524 542711 346966 540381 703671 492796 447359 648043
10244 648043 586579 37691 64283 186953 39850 -108946 -188379 223435 550261 285066
10234 285066 85363 81953 226230 -372744 -938345 -580375 -381686 -172249 -105600 -656203
10224 -656203 -875272 -429287 -595381 -392781 28068 212343 462180 327321 110503 -139819
$$ packed form
10294B92396j77668l56949m28625k03716r7409j50349O15866M80677M03829k81703
10284I6349J30407O09834p576k33135k00915r7750L03492L0358j63564n54483
10274h6983k291J74912k89890n66756L84670N63321k7298L17979K94818j5414
10264G47068m67673l95373r4024n9922K37729K05560M73212N73716n15057p14329
10254i093j42061L6614N24064J33187j95745J93415J63290k10875m5437K00684
10244F48043o1464n48888K6592J22670j47103j48796p9433M11814L26826k65195
10234B85066j99703l410J44277n98974n65601L57970J98689K09437O6649n50603
10224f56203k19069M45985j66094K02600M20849J84275K49837j34859k16818k50322
$$ plain form
10214 -139819 -68042 428031 201435 232781 -109921 -374125 -185160 -62346 -82159 77208
10204 77208 -2317 -357247 -697784 -661965 -686867 -378149 -236609 -365258 -440790 -699523
10194 -699523 -767688 -710083 -304021 55796 184896 88926 -405610 -334105 -165268 372527
10184 372527 600401 584051 949972 833712 888196 567525 592631 818527 469372 458509
10174 458509 704890 761605 62403 32503 597329 566171 434323 504404 286397 140731
10164 140731 389698 379412 -39206 130132 343563 470045 264584 187374 394734 435230
10154 435230 25595 61963 167938 -27997 -228481 -40612 435074 660732 282655 84036
10144 84036 232294 118258 358824 497949 59520 -110232 250304 8526 -74166 -124748
$$ packed form
10214a39819P1777M96073k26596L1346l42702k64204J88965J22814j9813J59367
10204G7208p9525l54930l40537L5819k4902L08718J41540j28649p5532k58733
10194f99523o8165N7605M06062L59817J29100r5970m94536P1505J68837N37795
10184C72527K27874j6350L65921j16260N4484l20671K5106K25896l49155j0863
10174D58509K46381N6715o99202k9900N64826l1158j31848P0081k18007j45666
10164A40731K48967j0286m18618J69338K13431J26482k05461p7210K07360M0496
10154D35230m09635L6368J05975j95935k00484J87869M75686K25658l78077j98619
10144H4036J48258j14036K40566J39125m38429j69752L60536k41778q2692n0582
$$ plain form
10134 -124748 114491 331299 345961 477539 465102 831588 787857 262385 -163523 254883
10124 254883 334136 133073 169734 146650 153730 77509 32564 402944 750028 392673 41477
10113 41477 7045 -322835 -540310 53732 -60955 -147409 530762 275340 3355 770698
10103 770698 769399 291318 85575 -217536 -505491 -230237 123965 305882 315537 76917
10093 76917 -132049 -266910 -1133862 -948840 -728775 -695475 -807006 -247275 181724 179339
10083 179339 -52368 79433 337920 361231 280780 -74140 -109042 33788 -4418 3814 49951
10072 49951 206899 401198 152561 -91240 361182 753858 236784 298982 308471 834714
10062 834714 1333208 1876312 2174377 2208098 2473768 2924433 3309172 3343570 3133494 2952558
$$ packed form
10134a24748K39239K16808J4662J31578j2437L66486m3731n25472m25908M18406
10124B54883P9253k01063L6661k3084P080p6221m4945L70380L47084l57355l51196
10113D1477l4432l29880k17475N94042j14687q6454O78171k55422k71985P67343
10103G70698j299m78081k05743l03111k87955K75254L54202J81917R655k38620
10093G6917k08966j34861q66952J85022K20065L3300j11531N59731M28999k385
10083A79339k31707J31801K58487K3311q0451l54920l4902J42830l8206Q232M6137
10072D9951J56948J94299k48637k43801M52422L92676n17074O2198R489N26243
10062H34714M98494N43104K98065L3721K65670M50665L84739L4398k10076j80936
$$ plain form
10052 2952558 3466381 3856905 3947462 3210019 1408239 590513 -13045 -74409 233132 329654
10042 329654 252267 60753 -11195 -57123 41997 -22063 -116496 371216 371118 -205660 -400332
10031 -400332 -213106 -347664 -600290 -342121 -348133 -471708 -407918 -331573 -346216 -313554 -63316
10020 -63316 433146 737838 547298 414598 284272 385371 704493 281563 -112509 -233136
10010 -233136 -254314 -177020 2251 128944 201698 309572 153436 488882 861556 751738
10000 751738 983670 715401 381333 214370 242106 226748 -151745 -18335 -196088 -331824
9990 -331824 82546 -20447 -328329 -240154 -2589 -206340 -286783 120773 294692 -107356
9980 -107356 -190104 -177539 -131514 86350 438616 519660 138950 -61777 -136021 -278545 -467770
$$ packed form
10052B952558N13823L90524R0557p37443j801780q17726o03558o1364L07541R6522
10042C29654p7387j91514p1948m5928R9120o4060r4433M87712r8n76778j94672
10031d00332J87226j34558k52626K58169o012j23575O3790P6345j4643L2662K50238
10020f3316M96462L04692j90540j32700j30326J01099L19122m22930l94072j20627
10010b33136k1178P7294J79271J26693P2754J07874j56136L35446L72674j09818
10000G51738K31932k68269l34068j66963K7736j5358l78493J33410j77753j35736
9990c31824M14370j02993l07882Q8175K37565k03751q0443M07556J73919m02048
9980a07356q2748J2565M6025K17864L52266Q1044l80710k00727p4244j42524j89225
$$ plain form
9969 -467770 -100563 124511 268003 342942 414536 405897 84054 -176242 -252416 -272209 -184654
9958 -184654 -90324 368893 358571 -80153 -16865 -151601 -364342 -28022 543408 1137684
9948 1137684 852151 661373 539475 487395 404308 321876 173382 118871 446009 340174
9938 340174 213448 124834 215574 81290 6591 182149 -75951 -141389 157903 57908 -64075
9927 -64075 233703 34014 4193 132160 128135 42723 110706 450611 761150 408795 387923
9916 387923 958368 876822 742915 374526 292212 238081 181437 180396 -7159 -50287 184517
9905 184517 -200396 -311528 184248 461648 50593 -234485 201800 -122484 -97248 397764
9895 397764 385609 266151 210646 96275 -584931 -466733 -213477 -512570 -561163 104093
$$ packed form
9969d67770L67207K25074J43492P4939P1594q639l21843k60296p6174j9793Q7555
9958a84654R4330M59217j0322m38724O3288j34736k12741L36320N71430N94276
9948A137684k85533j90778j21898n2080q3087q2432j48494n4511L27138j05835
9938C40174j26726q8614R0740j34284p4699J75558k58100o5438K99292r9995j21983
9927f4075K97778j99689k9821J27967m025q5412O7983L39905L10539l52355k0872
9916C87923N70445q1546j33907l68389q2314n4131n6644j041j87555m3128K34804
9905A84517l84913j11132M95776K77400m11055k85078M36285l24284K5236M95012
9895C97764j2155j19458n5505j14371o81206J18198K53256k99093m8593O65256
$$ plain form
9885 104093 934891 1070947 1418480 1593473 941874 641274 515430 459834 881536 946006
9875 946006 692410 526285 563152 520605 355524 717319 675323 438928 90872 -29811
9865 -29811 -164663 -286479 -104664 354179 362444 164138 267604 228967 402322 283204
9855 283204 216944 620250 524777 366052 529664 527090 395340 356823 258067 -108766 -3854
9844 -3854 181714 -81 -231541 -68410 435952 342424 441172 1126980 1447554 915627
9834 915627 618297 -9553 -347216 -247249 159529 241790 165851 260276 237691 -225185 -80181
9823 -80181 281785 129707 395529 639469 150564 171433 448125 113126 -11137 54495
9813 54495 310606 651042 877980 100213 -520744 -543784 222523 830987 741605 128638
$$ packed form
9885A04093Q30798J36056L47533J74993o51599l00600j25844n5596M21702O4470
9875I46006k53596j66125L6867m2547j65081L61795m1996k36395l48056j20683
9865b9811j34852j21816J81815M58843Q265j98306J03466l8637J73355j19118
9855B83204o6260M03306r5473j58725J63612k574j31750l8517r8756l66833J04912
9844c854J85568j81795k31460J63131N04362r3528R8748O85808L20574n31927
9834I15627k97330o27850l37663R9967M06778Q2261p5939R4425k2585m62876J45004
9823h0181L61966j52078K65822K43940m88905K0869K76692l34999j24263O5632
9813E4495K56111L40436K26938p77767o20957k3040P66307O08464q9382o12967
$$ plain form
9803 128638 -197343 -22841 23702 -276333 -526313 -331449 204702 370518 248246 252253
9793 252253 408638 406106 256436 697582 953250 512495 344989 413841 435173 653817
9783 653817 524938 580492 358551 441331 283645 222838 265789 469107 573159 716514
9773 716514 453768 480378 490729 562342 357430 208249 525247 812928 578446 754035
9763 754035 622675 638022 1046725 978361 1040615 637049 432773 523098 337089 324922 323308
9752 323308 699225 721610 780973 429590 -185547 -208320 -144775 -154928 -132758 -178745 -297454
9741 -297454 -403216 -298600 371437 819877 665320 139021 -98796 118830 766096 914963
9731 914963 1144886 729472 857686 976914 1023933 901502 646412 654305 420509 189683
$$ packed form
9803A28638l25981J74502M6543l00035k49980J94864N36151J65816j22272M007
9793B52253J56385k532j49670M41146K55668m40755j67506O8852K1332K18644
9783F53817j28879N5554k21941Q2780j57686o0807M2951K03318J04052J43355
9773G16514k62746K6610J0351P1613k04912j49181L16998K87681k34482J75589
9763G54035j31360J5347M08703o8364O2254m03566k04276R0325j86009j2167j614
9752C23308L75917K2385N9363l51383o15137k2773O3545j0153K2170m5987j18709
9741b97454j05762J04616O70037M48440j54557n26299k37817K17626O47266J48867
9731I14963K29923m15414J28214J19228M7019j22431k55090P893k33796k30826
$$ plain form
9721 189683 -113299 -64574 -11582 -220906 -521560 -174782 294737 380377 672953 855425
9711 855425 581129 708700 807120 1100146 1021805 908782 676252 596256 802489 253544
9701 253544 366669 709697 640981 925076 665235 98017 414078 576522 551162 495763
9691 495763 37638 178706 316032 560797 1073099 568994 126566 293722 444120 213334
9681 213334 -251415 -49978 73430 293241 334644 -46049 -643143 -606560 -242689 -176958
9671 -176958 68581 469641 907825 920416 83048 -322173 -423242 -475800 -202565 -58074
9661 -58074 -134920 397206 921785 848783 523021 97100 19698 2844 350311 458299 513823
9650 513823 706233 1216284 1349483 938688 727307 1029382 1206724 885908 506896 -100330
$$ packed form
9721A89683l02982M8725N2992k09324l00654L46778M69519Q5640K92576J82472
9711H55425k74296J27571R8420K93026p8341j13023k32530p9996K06233n48945
9701B53544J13125L43028o8716K84095k59841n67218L16061J62444k5360n5399
9691D95763m58125J41068J37326K44765N12302n04105m42428J67156J50398k30786
9681B13334m64749K01437J23408K19811M1403l80693n97094L6583L63871O5731
9671a76958K45539M01060M38184J2591q37368m05221j01069n2558K73235J44491
9661e8074p6846N32126N24579p3002l25762m25921p7402j6854L47467J07988N5524
9650E13823J92410N10051J33199m10795k11381L02075J77342l20816l79012o07226
$$ plain form
9640 -100330 314433 828128 1096974 698484 413450 361748 576071 1057305 1395538 1453897
9630 1453897 1892079 1645089 1246413 888738 632632 533906 878915 338714 -222667 198820
9620 198820 576535 872274 663287 -241195 110557 709403 1090987 1043983 1210325 968285
9610 968285 1121799 827632 199556 -241322 -180703 -90010 -27088 283423 633696 573566
9600 573566 546475 172405 124446 491477 746449 596872 872818 1152398 874676 697145
9590 697145 908574 1169171 1368079 1192066 1060627 1182585 1035958 798287 1007855 1257938
9580 1257938 1913027 1626104 1464122 1308863 1175654 1195926 1307821 524843 315896 347624
9570 347624 730450 833782 1160037 1124326 797302 794298 799649 708634 679255 978902 1755006
$$ packed form
9640a00330M14763N13695K68846l98490k85034n1702K14323M81234L38233N8359
9630A453897M38182k46990l98676l57675k56106r8726L45009n40201n61381M21487
9620A98820L77715K95739k08987r04482L51752N98846L81584m7004J66342k42040
9610I68285J53514k94167o28076m40878O0619R0693O2922L10511L50273o0130
9600E73566k7091l74070m7959L67031K54972j49577K75946K79580k77722j77531
9590F97145K11429K60597J98908j76013j31439J21958j46627k37671K09568K50083
9580A257938O55089k86923j61982j55259j33209K0272J11895p82978k08947L1728
9570C47624L82826J03332L26255l5711l27024l004N351r1015k9379K99647P76104
$$ plain form
9559 1755006 2084549 1784978 1457979 1235107 760148 453449 736522 739440 1183254 1374125
9549 1374125 1416192 1590228 865379 471462 644854 951586 995804 1165365 1203665 1432225
9539 1432225 1791549 2197329 1918865 1461808 1370029 1074436 1099648 1492245 1614517 1542469
9529 1542469 1100077 761144 881679 918357 795096 608553 449394 299571 519871 795054
9519 795054 1072231 981168 890642 1216812 1547029 1491619 1588355 1418041 988648 801685
9509 801685 394042 239155 526062 846068 1409798 1750602 1898810 2215552 2536580 2467612
9499 2467612 2074445 1853041 1192293 895323 1072064 1144219 1115242 1285565 1283373 1547111
9489 1547111 2448286 2439057 2276779 2264060 2189869 2041492 2012756 1577179 1654060 1721936 1530794
$$ packed form
9559A755006L29543k99571l26999k22872m74959l06699K83073K918M43814J90871
9549A374125M2067J74036p24849l93917J73392L06732M4218J69561L8300K28560
9539A432225L59324M05780k78464m57057r1779k95593K5212L92597J22272p2048
9529A542469m42392l38933J20535L6678j23261j86543j59159j49823K20300K75183
9519G95054K77177r1063r0526L26170L30217n5410R6736j70314m29393j86963
9509H01685m07643j54887K86907L20006N63730L40804J48208L16742L21028o8968
9499B467612l93167k21404o60748k96970J76741P2155k8977J70323k192K63738
9489A547111R01175r229j62278j2719p4191j48377k8736m35577P6881O7876j91142
$$ plain form
9478 1530794 1908229 2527793 2643136 2173954 1944050 1864125 859863 671079 1144311 2116815
9468 2116815 2395504 2190038 1778437 1899038 1921799 1695010 1833344 2292846 2814801 3002827
9458 3002827 2685543 2573213 2751116 2609911 2619882 2488130 2160440 1958010 2052855 2332737
9448 2332737 2448510 2115134 2093807 2156658 2631679 2736303 2272729 2013186 1966501 2054842
9438 2054842 1878803 1806104 2214254 2441218 2627761 2632471 2761923 2566668 1997204 1885447
9428 1885447 2141030 2708925 3192172 3153053 2630048 2631366 2870465 3100763 2694230 2202532
9418 2202532 2269859 2283385 2784536 2848162 3048791 2721695 2252913 2552903 2682162 2655514
9408 2655514 2506031 2262552 2379684 2513955 2838656 2765439 2724999 2685868 2493650 2246837
$$ packed form
9478A530794L77435O19564J15343m69182k29904p9925j004262j88784M73232R72504
9468B116815K78689k05466m11601J20601K2761k26789J38334M59502N21955J88026
9458C002827l17284j12330J77903j41205R971j31752l27690k02430R4845K79882
9448B332737J15773l33376k1327O2851M75021J04624m63574k59543m6685Q8341
9438B054842j76039p2699M08150K26964J86543M710J29452j95255n69464j11757
9428A885447K55583N67895M83247l9119n23005J318K39099K30298m06533m91698
9418B202532O7327J3526N01151O3626K00629l27096m68782K99990J29259k6648
9408B655514j49483k43479J17132J34271L24701p3217m0440l9131j92218k46813
$$ plain form
9398 2246837 2440876 2368586 2224560 2088716 2499845 2760094 2986839 2988403 3434905 3246137
9388 3246137 2481562 2681319 2785394 2862689 3274491 3073208 3036501 3634131 4040888 3855838
9378 3855838 3996467 4109555 3868167 3544204 3751438 4077623 3914450 3548960 3610809 3316885
9368 3316885 3174170 2862771 3252333 4003126 4316464 4024548 3879342 4038704 4578643 4574482
9358 4574482 4228131 4290743 4528360 4517645 4628754 4860741 4305307 3873092 3886255 4156163
9348 4156163 4107472 4020397 4342118 4708349 4663288 4442150 4658519 4952787 5475505 5666320
9338 5666320 5741609 5283194 5371394 5327582 5134286 5040224 5231334 5299110 5294558 5276421 5615488
9327 5615488 5896861 5194823 5190758 5730760 5949095 5912628 5671833 5711983 6502411 7394592
$$ packed form
9398B246837J94039p2290j44026j35844M11129K60249K26745J564M46502j88768
9388C246137p64575J99757J04075P7295M11802k01283l6707N97630M06757j85050
9378C855838J40629J13088k41388l23963K07234L26185j63173l65490O1849k93924
9368C316885j42715l11399L89562P50793L13338k91916j45206J59362N39939m161
9358D574482l46351O2612K37617j0715J11109K31987n55434m32215J3163K69908
9348D156163m8691q7075L21721L66231m5061k21138K16369K94268N22718J90815
9338E666320P5289m58415Q8200m3812j93296r4062J91110O7776m552j8137L39067
9327E615488K81373p02038m065N40002K18335l6467k40795M0150P90428Q92181
$$ plain form
9317 7394592 7382175 6489910 6377947 6759696 6711300 7004310 7491881 7611848 7700566 7739245
9307 7739245 7580016 7557817 7044703 7036954 7419688 7666441 7894588 8292380 8290283 8565380
9297 8565380 8428496 8169828 8537342 8960495 9072738 9141346 9780002 10426725 10131436 9947752
9287 9947752 10141981 10043483 10063723 9933741 10011467 10372555 10290836 9920861 9837154 10159066
9277 10159066 10249088 10191415 10373903 10624855 11024966 11706437 12020275 11915037 11614634 11568693
9267 11568693 11856490 12179400 12381174 12627085 12472223 12740560 12853584 12908219 13017075 13105526
9257 13105526 13143911 13321888 13540942 14135560 14653033 14927209 15115588 15350337 15377000 15438993
9247 15438993 15457905 16034144 16583498 16263734 16498636 16960997 16931226 17043624 17332637 17638373
$$ packed form
9317G394592j2417q92265j11963L81749m8396K93010M87571J19967Q8718L8679
9307G739245j59229k2199n13114p749L82734K46753K28147L97792k097K75097
9297H565380j36884k58668L67514M23153J12243O8608O38656O46723k95289j83684
9287I947752J94229r8498K0240j29982P7726L61088q1719l69975q3707L21912
9277A0159066R0022n7673J82488K50952M00111O81471L13838j05238l00403m5941
9267A1568693K87797L22910K01774K45911j54862K68337J13024N4635J08856Q8451
9257A3105526L8385J77977K19054N94618N17473K74176J88379K34749K6663O1993
9247A5438993J8912N76239N49354l19764K34902M62361k9771J12398K89013L05736
$$ plain form
9237 17638373 17800411 18026720 18232251 18206962 18220753 18343428 18654932 18589207 18471584 19066437
9227 19066437 19520697 19783973 20523806 20603861 20245595 20369496 20730289 21125055 21107982 20993941
9217 20993941 21391058 21844638 22232315 22388643 22603646 22607911 22407109 22381752 22766990 23031263
9207 23031263 23366878 23685854 23787890 24028219 24682735 24683714 24226330 24613356 25106061 25198085
9197 25198085 25420334 25190785 25176288 25126508 25427826 25628571 25957447 25916764 25617664 25580525
9187 25580525 25174666 25050997 24975170 24931600 25196041 25093096 24812394 24795127 24518990 24801816
9177 24801816 24666694 24547048 24846489 24814166 24729573 24356670 24147937 24454575 24544215 24352982
9167 24352982 24467459 24519506 24013244 23733693 23514582 22939647 22609144 22652214 22251064 22466909
$$ packed form
9237A7638373J62038K26309K05531k5289J3791J22675L11504o5725j17623N94853
9227A9066437M54260K63276P39833Q0055l58266J23901L60793L94766j7073j14041
9217B0993941L97117M53580L87677J56328K15003M265k00802k5357L85238K64273
9207B3031263L35615L18976J02036K40329O54516R79m57384L87026M92705R2024
9197B5198085K22249k29549j4497m9780L01318K00745L28876m0683k99100l7139
9187B5580525m05859j23669p5827m3570K64441j02945k80702j7267k76137K82826
9177B4801816j35122j19646K99441l2323q4593l72903k08733L06638Q9640j91233
9167B4352982J14477N2047n06262k79551k19111n74935l30503M3070m01150K15845
$$ plain form
9157 22466909 22378654 22404463 21972753 21860392 21754700 21569015 21674884 21632955 21018406 20374213
9147 20374213 19772417 19517501 18795411 18428234 18693322 19118091 19045851 18854519 18837972 18506218
9137 18506218 18590793 18417809 17909633 17619516 16960464 16545836 16436069 16048530 15940107 15825291
9127 15825291 15230370 15121187 15227803 14633063 14585803 14484510 14551233 14356052 14441015 14243148
9117 14243148 14380666 14385589 13843861 13428158 12792925 12189558 12269874 12635488 12332940 12452041
9107 12452041 12195524 11597482 11109169 10865980 10782226 10348702 10566140 10613338 10177406 9545003
9097 9545003 9791875 10133663 10558722 10382706 10109365 9941653 9527797 9577800 10145134 10057079
9087 10057079 9575560 9164465 8853108 8800862 8654466 8349616 8238717 8333075 7967543 8119388
$$ packed form
9157B2466909q8255K5809m31710j12361j05692j85685J05869m1929o14549o44193
9147B0374213o01796k54916p22090l67177K65088M24769p2240j91332j6547l31754
9137A8506218Q4575j72984n08176k90117o59052m14628j09767l87539j08423j14816
9127A5825291n94921j09183J06616n94740m7260j01293O6723j95181Q4963j97867
9117A4243148J37518M923n41728m15703o35233o03367Q0316L65614l02548J19101
9107A2452041k56517n98042m88313k43189q3754m33524K17438M7198m35932o32403
9097I545003K46872L41788M25059j76016k73341j67712m13856N0003N67334q8055
9087A0057079m81519m11095l11357n2246j46396l04850j10899R4358l65532J51845
$$ plain form
9077 8119388 7797920 7220565 7205437 7080261 7275510 7551043 7397968 7192042 7114002 6534585
9067 6534585 6690388 6725793 6564758 6399422 6059960 5965551 5924104 6215015 6545506 6209601
9057 6209601 5911075 5453478 5587992 5882805 6037959 6172052 5894618 5319989 5543668 6076247
9047 6076247 6167228 5785768 5547841 5451850 5703367 5645540 5356177 5908020 6215109 5897805
9037 5897805 5329479 5279016 5629380 5259765 5340055 5273776 4912528 4905530 4718039 4216383
9027 4216383 4101725 3917274 3501518 3686293 3898506 4191575 4325324 3919984 4075294 3905572
9017 3905572 3948867 3640066 3170507 3318070 3669406 4194325 4444664 4104598 4152377 4343771
9007 4343771 4302266 3986169 3651650 3345448 3033773 3062289 3122915 3093892 2966242 3252240
$$ packed form
9077H119388l21468n77355j5128j25176J95249K75533j53075k05926p8040n79417
9067F534585J55803L5405j61035j65336l39462r4409m1447K90911L30491l35905
9057F209601k98526m57597J34514K94813J55154J34093k77434n74629K23679N32579
9047F076247R0981l81460k37927r5991K51517n7827k89363N51843L07089l17304
9037E897805n68326n0463L50364l69615Q0290o6279l61248o998j87491n01656
9027D216383j14658j84451m15756J84775K12213K93069J33749m05340J55310j69722
9017C905572M3295l08801m69559J47563L51336N24919K50339l40066M7779J91394
9007D343771m1505l16097l34519l06202l11675K8516O0626k9023j27650K85998
$$ plain form
8997 3252240 3365320 3011749 2581440 2247657 2304930 2407498 2825132 3252054 2998744 3090539
8987 3090539 3381586 3314605 2583005 1977688 2200542 2619238 2704640 3118549 3070382 3112836
8977 3112836 3548517 2974134 2490707 2456986 2999882 3160902 3133072 3326586 3480850 3008846
8967 3008846 2556057 2445557 2306363 1892706 2121687 2320294 2284927 2432043 2802792 2790614
8957 2790614 2450833 1972631 1890349 1786247 1775735 1435958 2007412 2338399 1884402 1268508
8947 1268508 1192548 1609376 1698528 2310928 2394237 1949070 1980466 2487468 2549824 1850984
8937 1850984 1579206 1668765 1635085 1736284 1515637 1307154 1523392 1354038 1210311 1053525
8927 1053525 1260306 1291667 1549872 1671159 1768688 1477518 1280505 970017 993237 1433304
$$ packed form
8997C252240J13080l53571m30309l33783N7273J02568M17634M26922k53310R1795
8987C090539K91047o6981p31600o05317K22854M18696Q5402M13909m8167M2454
8977C112836M35681n74383m83427l3721N42896J61020k7830J93514J54264m72004
8967C008846m52789j10500j39194m13657K28981J98607l5367J47116L70749j2178
8957B790614l39781m78202q2282j04102j0512l39777N71454L30987m53997o15894
8947A268508p5960M16828Q9152O12400Q3309m45167L1396N07002O2356o98840
8937A850984k71778Q9559l3680J01199k20647k08483K16238j69354j43727j56786
8927A053525K06781L1361K58205J21287R7529k91170j97013l10488K3220M40067
$$ plain form
8917 1433304 1731349 1793207 2004822 1860776 1972991 1802021 1830348 1652781 789754 564216
8907 564216 861425 1309675 1852904 1855960 1829149 1930932 1559575 1239105 1197560 1629074
8897 1629074 1788589 1527456 1085067 821716 1164124 1833971 1417104 1388302 1539079 1466612
8887 1466612 1492943 1875478 1586605 1164046 949785 1066237 1139005 1247588 1664526 1691867
8877 1691867 1482094 1526367 1653783 1948903 1869544 1654003 1575030 1755349 1808165 2355114
8867 2355114 1947812 1446397 1485744 1496194 1506315 1703756 1624952 1317673 1397466 1541973
8857 1541973 1270408 937376 1362548 1293926 1069287 643168 649050 1157534 1345578 979357
8847 979357 589101 165449 355312 406711 554769 793013 1138548 1111348 1370184 1418115
$$ packed form
8917A433304K98045O1858K11615j44046J12215j70970K8327j77567q63027k25538
8907E64216K97209M48250N43229L056k6811J01783l71357l20470m1545M31514
8897A629074J59515k61133m42389k63351L42408O69847m16867k8802J50777p2467
8887A466612K6331L82535k88873m22559k14261J16452P2768J08583M16938K7341
8877A691867k09773M4273J27416K95120p9359k15541p8973J80319N2816N46949
8867B355114m07302n01415L9347J0450J0121J97441p8804l07279P9793J44507
8857A541973k71565l33032M25172o8622k24639m26119N882N08484J88044l66221
8847I79357l90256m23652J89863N1399J48058K38244L45535k7200K58836M7931
$$ plain form
8837 1418115 1318266 989425 966991 732475 803070 637031 722766 1080326 1132597 1125022 982016
8826 982016 747277 728150 720397 972112 1054401 990162 263367 193998 -70559 -190391 315447
8815 315447 544014 691356 913409 646200 500043 938751 874405 516256 560732 828918
8805 828918 963827 824519 430492 695794 854995 441456 667045 908613 1082517 792112
8795 792112 980334 1089323 722501 633383 950056 1230906 984758 1098873 1481032 1542057
8785 1542057 1518943 1391503 859652 552749 851108 760347 761476 868048 977486 864502
8775 864502 651711 844727 844266 804333 715792 876296 1071763 1345991 1090773 596596 611166
8764 611166 801924 557819 899892 1536596 1159796 1117417 1300595 1437734 1377457 1343688
$$ packed form
8837A418115r9849l28841k2434k34516P0595j66039Q5735L57560N2271p575j43006
8826I82016k34739j9127p753K51715Q2289o4239p26795o9369k64557j19832N05838
8815C15447K28567J47342K22053k67209j46157M38708o4346l58149M4476K68186
8805H28918J34909j39308l94027K65302J59201m13539K25589K41568J73904k90405
8795G92112J88222J08989l66822q9118L16673K80850k46148J14115L82159O1025
8785A542057k3114j27440n31851l06903K98359r0761J129J06572J09438j12984
8775H64502k12791J93016m61l9933q8541J60504J95467K74228k55218m94177J4570
8764F11166J90758k44105L42073O36704l76800m2379J83178J37139o0277l3769
$$ plain form
8754 1343688 1749790 1834152 1633714 1143229 990684 1087904 1106907 1198751 1223141 1206521 1130939
8743 1130939 887738 762879 219912 57879 261856 462482 387637 658091 814826 884510
8733 884510 1067213 1307158 1009484 598313 399435 479343 1009296 1035856 784063 1017090
8723 1017090 1105871 1339882 1306897 899165 863048 648740 748466 1232876 1752739 1384347
8713 1384347 535584 153052 119117 109944 -300021 128005 -18805 -277618 -46914 269811
8703 269811 510457 797586 1588487 1800435 1381118 1286133 1540641 1091186 950387 526923
8693 526923 332254 401430 699745 992216 863471 645941 1044490 1770697 2001577 1532279
8683 1532279 823198 885565 532681 874695 1253717 901500 791853 1074626 705857 888673
$$ packed form
8754A343688M06102Q4362k00438m90485j52545R7220J9003R1844K4390j6620p5582
8743A130939k43201j24859n42967j62033K03977K00626p4845K70454J56735O9684
8733H84510J82703K39945k97674m11171j98878P9908N29953K6560k51793K33027
8723A017090Q8781K34011l2985m07732l6117k14308R9726M84410N19863l68392
8713A384347q48763l82532l3935r173m09965M28026j46810k58813K30704L16725
8703B69811K40646K87129P90901K11948m19317r4985K54508m49455j40799m23464
8693E26923j94669O9176K98315K92471j28745k17530L98549P26207K30880m69298
8683A532279p09081O2367l52884L42014L79022l52217j09647K82773l68769J82816
$$ plain form
8673 888673 1039890 1360725 1255253 976837 1070599 845855 846203 572007 698676 312951
8663 312951 -271947 104186 724862 794938 432987 584553 267796 -12186 333422 854913
8653 854913 731422 398283 737051 1256016 1379701 1863101 2194156 1945431 1695633 1528040
8643 1528040 1383596 1399408 1334369 1437961 1677868 1678430 1354262 1318336 1735400 1463396 1385034
8632 1385034 1975210 2253449 1994582 2041030 2062977 2370111 2171564 2254825 2736599 2573739
8622 2573739 2515391 2677728 2860155 2928913 3250238 3219022 2629945 2268719 2746077 2879258
8612 2879258 3257332 3031656 2665158 2545097 2830499 2680700 2559606 2838692 3063614 2458332
8602 2458332 2178596 2174612 2240326 2212546 2092527 2337779 2336485 2508017 2826706 2462866 1867788
$$ packed form
8673H88673J51217L20835j05472k78416R3762k24744L48k74196J26669l85725
8663C12951n84898L76133O20676P0076l61951J51566l16757k79982L45608N21491
8653H54913j23491l33139L38768N18965J23685M83400L31055k48725k49798j67593
8643A528040j44444J5812o5039J03592K39907N62l24168l5926M17064k72004p8362
8632A385034N90176K78239k58867M6448K1947L07134j98547Q3261M81774j62860
8622B573739n8348J62337J82427O8758L21325l1216n89077l61226M77358J33181
8612B879258L78074k25676l66498j20061K85402j49799j21094K79086K24922o05282
8602B458332k79736l984O5714k7780j20019K45252j294J71532L18689l63840n95078
$$ plain form
8591 1867788 1937731 1879019 1422954 1252060 1210841 1414407 1686051 1887736 1390768 1184387
8581 1184387 1363266 1053976 777458 659849 562357 933271 1138764 1125240 892293 875356
8571 875356 850194 497979 500081 268986 646195 895289 723972 -36668 -324341 -15207
8561 -15207 556092 638131 275513 457344 697431 559530 787893 990212 379696 431376
8551 431376 325043 -65982 269896 503126 794055 1146620 957520 690254 795066 699574
8541 699574 256339 337219 533917 366595 284558 227125 325306 471547 406182 158407 -76081
8530 -76081 -220387 -22530 292510 376675 55377 187814 677768 566441 347845 591489
$$ packed form
8591A867788O9943n8712m56065j70894m1219K03566K71644K01685m96968k06381
8581A184387J78879l09290k76518j17609r7492L70914K05493j3524k32947j6937
8571H75356k5162l52215K102k31095L77209K49094j71317p60640k87673L09134
8561a5207N71299Q2039l62618J81831K40087j37901K28363K02319o10516N1680
8551D31376j06333l91025L35878K33230K90929L52565j89100k67266J04812r5492
8541F99574m43235Q0880J96698j67322q2037n7433R8181J46241o5365k47775k34488
8530g6081j44306J97857L15040Q4165l21298J32437M89954j11327k18596K43644
$$ [...]
##END NTUPLES=NMR SPECTRUM
##END=
