##TITLE=Analysis number 322723
Compound Code cc 02702
Project Code adrs
Chemist Name fudan
##JCAMPDX= 6.0         $$ Bruker NMR JCAMP-DX V2.0
##DATA TYPE= NMR SPECTRUM
##DATA CLASS= NTUPLES
##ORIGIN= Bruker BioSpin GmbH
##OWNER= nmr
$$ XWIN-NMR		Version 3.5
$$ Sat Oct 14 11:23:54 2006 GMT Daylight Time (UT+1h)  MAYBRIDGE\nmr@NMR_250MHZ
##.OBSERVE FREQUENCY= 250.131544655141
##.OBSERVE NUCLEUS= ^1H
##.ACQUISITION MODE= SIMULTANEOUS (DQD)
##.ACQUISITION SCHEME= undefined
##.AVERAGES= 16
##.DIGITISER RES= 18
##SPECTROMETER/DATA SYSTEM= dpx250
##.PULSE SEQUENCE= zg30
##.SOLVENT NAME= CDCl3
##.SHIFT REFERENCE= (INTERNAL, CDCl3, 0, 16.522)
##AUDIT TRAIL= $$ (NUMBER, WHEN, WHO, WHERE, WHAT)
$$ ##TITLE= Audit trail, XWIN-NMR		Version 3.5
$$ ##JCAMPDX= 5.01
$$ ##ORIGIN= Bruker BioSpin GmbH
$$ ##OWNER= nmr
$$ C:\u/data/dgb/nmr/ADRS/290/pdata/1/auditp.txt
$$ ##AUDIT TRAIL=  $$ (NUMBER, WHEN, WHO, WHERE, WHAT)
(   1,<2006-10-14 11:23:29.29 +100>,<MAYBRIDGE\nmr>,<NMR_250MHZ>,
      <created by zg, POWCHK disabled, PULCHK disabled
       configuration hash MD5:
       49 4B E0 1D 92 C2 6B 37 9F E6 65 BC 52 41 86 1D
       data hash MD5: 64K
       C0 80 68 C4 4B 47 15 F2 9F C8 68 01 01 63 1E C7>)
(   2,<2006-10-14 11:23:46.01 +100>,<MAYBRIDGE\nmr>,<NMR_250MHZ>,
      <Start of raw data processing
       ef LB = 0.3 FT_mod = 6 PKNL = 1 SI = 32K 
       data hash MD5: 32K
       A7 DD 4E BF BA 4D FA 9C 77 6D 0B A3 D5 E0 3A E0>)
(   3,<2006-10-14 11:23:47.79 +100>,<MAYBRIDGE\nmr>,<NMR_250MHZ>,
      <apk 
       data hash MD5: 32K
       5F 87 23 D3 D8 97 1B D5 69 C6 1F 66 69 9C DC CD>)
(   4,<2006-10-14 11:23:48.62 +100>,<MAYBRIDGE\nmr>,<NMR_250MHZ>,
      <abs ABSG = 5 
       data hash MD5: 32K
       65 ED F9 94 D8 0E EF 8A F7 52 5B 7F 35 27 A8 2C>)
$$ ##END=
$$ 
$$ hash MD5
$$ F8 17 1B 10 EA BC FC 2D DA 53 60 93 0E 7E B8 AF
##$RELAX= 
##$RELAX= 
##$RELAX= 
##$RELAX= 
##$RELAX= 
##$RELAX= 
##$RELAX= 
$$ Bruker specific parameters
$$ --------------------------
##$DU= <C:\u>
##$EXPNO= 290
##$NAME= <ADRS>
##$PROCNO= 1
##$TYPE= <nmr>
##$USER= <dgb>
##$AMP= (0..31)
100 100 100 100 100 100 100 100 100 100 100 100 100 100 100 100 100 100 
100 100 100 100 100 100 100 100 100 100 100 100 100 100 
##$AQSEQ= 0
##$AQ_mod= 3
##$AUNM= <au_zg>
##$AUTOPOS= <6 >
##$BF1= 250.13
##$BF2= 250.13
##$BF3= 250.13
##$BF4= 250.13
##$BF5= 500.13
##$BF6= 500.13
##$BF7= 500.13
##$BF8= 500.13
##$BYTORDA= 1
##$CFDGTYP= 0
##$CFRGTYP= 5
##$CHEMSTR= <none>
##$CNST= (0..31)
1 1 145 1 1 1 1 1 1 1 1 1 1 1 1 1 1 1 1 1 1 1 1 1 1 1 1 1 1 1 1 1 
##$CPDPRG= <>
##$CPDPRG1= <>
##$CPDPRG2= <>
##$CPDPRG3= <>
##$CPDPRG4= <mlev>
##$CPDPRG5= <mlev>
##$CPDPRG6= <mlev>
##$CPDPRG7= <mlev>
##$CPDPRG8= <mlev>
##$CPDPRGB= <>
##$CPDPRGT= <>
##$D= (0..31)
0 1 0 0 0 0 0 0 0 0.06 0 0 0 0 0 0 0.0002 0 0 0 0 0 0 0 0 0 0 0 0 0 0 
0 
##$DATE= 1160821408
##$DBL= (0..7)
120 120 120 120 120 120 120 120 
##$DBP= (0..7)
150 150 150 150 150 150 150 150 
##$DBP07= 0
##$DBPNAM0= <>
##$DBPNAM1= <>
##$DBPNAM2= <>
##$DBPNAM3= <>
$$ [...]
##$SUBNAM7= <"">
##$SUBNAM8= <"">
##$SUBNAM9= <"">
##$SW= 20.6930455092707
##$SWIBOX= (0..15)
0 0 3 0 0 0 0 0 0 0 0 0 0 0 0 0 
##$SW_h= 5175.983436853
##$TD= 65536
##$TD0= 1
##$TE= 683.16
##$TE2= 300
##$TE3= 300
##$TEG= 300
##$TL= (0..7)
0 120 120 120 120 120 120 120 
##$TP= (0..7)
150 150 150 150 150 150 150 150 
##$TP07= 0
##$TPNAME0= <>
##$TPNAME1= <>
##$TPNAME2= <>
##$TPNAME3= <>
##$TPNAME4= <>
##$TPNAME5= <>
##$TPNAME6= <>
##$TPNAME7= <>
##$TPOAL= (0..7)
0.5 0.5 0.5 0.5 0.5 0.5 0.5 0.5 
##$TPOFFS= (0..7)
0 0 0 0 0 0 0 0 
##$TUNHIN= 0
##$TUNHOUT= 0
##$TUNXOUT= 0
##$USERA1= <user>
##$USERA2= <user>
##$USERA3= <user>
##$USERA4= <user>
##$USERA5= <user>
##$V9= 5
##$VALIST= <valist>
##$VCLIST= <CCCCCCCCCCCCCCC>
##$VD= 0
##$VDLIST= <DDDDDDDDDDDDDDD>
##$VPLIST= <PPPPPPPPPPPPPPP>
##$VTLIST= <TTTTTTTTTTTTTTT>
##$WBST= 1024
##$WBSW= 4
##$XGAIN= (0..3)
0 0 0 0 
##$XL= 0
##$YL= 0
##$YMAX_a= 591333
##$YMIN_a= -430830
##$ZGOPTNS= <>
##$ZL1= 120
##$ZL2= 120
##$ZL3= 120
##$ZL4= 120
##$ABSF1= 16.522
##$ABSF2= -4.171173
##$ABSG= 5
##$ABSL= 3
##$ALPHA= 0
##$AQORDER= 0
##$ASSFAC= 0
##$ASSFACI= 0
##$ASSFACX= 0
##$ASSWID= 0
##$AUNMP= <proc_1d>
##$AZFE= 0.1
##$AZFW= 0.1
##$BCFW= 0
##$BC_mod= 0
##$BYTORDP= 0
##$COROFFS= 0
##$CY= 12.5
##$DATMOD= 1
##$DC= 0
##$DFILT= <>
##$DTYPP= 0
##$F1P= 14.0000005364418
##$F2P= -0.99999901652339
##$FCOR= 0.5
##$FTSIZE= 32768
##$FT_mod= 6
##$GAMMA= 0
##$GB= 0
##$INTBC= 1
##$INTSCL= 1
##$ISEN= 128
##$LB= 0.3
##$LEV0= 0
##$LPBIN= 0
##$MAXI= 10000
##$MC2= 0
##$MEAN= 0
##$ME_mod= 0
##$MI= 0
##$NCOEF= 0
##$NC_proc= -2
##$NLEV= 6
##$NOISF1= 0
##$NOISF2= 0
##$NSP= 0
##$NTH_PI= 0
##$NZP= 0
##$OFFSET= 16.522
##$PC= 1
##$PHC0= -48.94845
##$PHC1= 6.956417
##$PH_mod= 1
##$PKNL= yes
##$PPARMOD= 0
##$PSCAL= 4
##$PSIGN= 0
##$REVERSE= no
##$SF= 250.13
##$SI= 32768
##$SIGF1= 0
##$SIGF2= 0
##$SINO= 400
##$SIOLD= 32768
##$SREGLST= <1H.CDCl3>
##$SSB= 0
##$STSI= 32768
##$STSR= 0
##$SW_p= 5175.98343685301
##$SYMM= 0
##$S_DEV= 0
##$TDeff= 65536
##$TDoff= 0
##$TI= <Analysis number 999999
Compound Code 99
Book Reference 9
Project Code 9>
##$TILT= no
##$TM1= 0
##$TM2= 0
##$TOPLEV= 0
##$USERP1= <user>
##$USERP2= <user>
##$USERP3= <user>
##$USERP4= <user>
##$USERP5= <user>
##$WDW= 1
##$XDIM= 32768
##$YMAX_p= 401107767
##$YMIN_p= -431658
$$ End of Bruker specific parameters
$$ ---------------------------------
##NTUPLES= NMR SPECTRUM
##VAR_NAME=  FREQUENCY,     SPECTRUM/REAL,   SPECTRUM/IMAG
##SYMBOL=    X,             R,               I
##VAR_TYPE=  INDEPENDENT,   DEPENDENT,       DEPENDENT
##VAR_FORM=  AFFN,          ASDF,            ASDF
##VAR_DIM=   32768,         32768,           32768
##UNITS=     HZ,            ARBITRARY UNITS, ARBITRARY UNITS
##FACTOR=    0.157963299565203, 1,           1
##FIRST=     4132.6476996994, 0,             0
##LAST=      -1043.33573715361, 0,           0
##MIN=       -1043.33573715361, -431658,     0
##MAX=       4132.6476996994, 401107767,     0
$$ Real data points
##PAGE= N=1
##DATA TABLE= (X++(R..R)), XYDATA
$$ [...]
$$ plain form
19017 8015 9819 7355 2411 2230 4109 5242 2111 -1284 487 1728 4970 4129 5676 7907 14212
19002 14212 12285 983 -4643 -10009 -5190 -979 -5286 -4537 144 3016 -635 -1556 -1429 -688 4562
18987 4562 5837 6910 8718 4691 -405 403 -7271 -4816 -1788 -9294 -4376 469 8290 11875 7038
18972 7038 10459 11355 2935 -1141 3377 3328 7845 4187 2162 7756 6821 5296 6679 4327 3439 993
18956 993 -3184 -7734 -5752 -4464 -2000 11115 12115 8953 8215 4335 -275 -3307 -4094 -1427 3618
18941 3618 5723 12720 16207 8427 9907 10920 11295 11683 16274 18938 16692 10584 8633 10503 13803
18926 13803 15426 15247 14333 7789 3956 10826 14153 9162 8663 18522 32032 37097 37859 36888 35630
18911 35630 40911 60732 75821 89729 95855 95274 82517 67300 54962 52796 53760 46023 46290 66898
$$ packed form
19017H015J804k464m944j81J879J133l131l395J771J241L242q41J547K231O305
19002A4212j927j1302n626n366M819M211m307P49M681K872l651r21J27P41N250
18987D562J275J073J808m027n096Q08p674K455L028p506M918M845P821L585m837
18972G038L421Q96q420m076M518m9M517l658k025N594r35j525J383k352q88k446
18956I93m177m550J982J288K464J3115J000l162p38l880m610l032p87K667N045
18941C618K105O997L487p780J480J013L75L88M591K664k246o108j951J870L300
18926A3803J623j79r14o544l833O870L327m991m99R859J3510N065P62r71j258
18911C5630N281J9821J5089J3908O126n81j2757j5217j2338k166R64p737K67K0608
$$ plain form
18897 66898 86223 104203 113993 113826 92409 75225 64832 54887 39903 24771 19524 22800 29144
18884 29144 34490 35871 33064 35002 39102 49853 60104 64066 69677 83740 100547 114003 127350
18871 127350 134031 127129 102195 80121 74299 76667 81012 80051 88588 103461 123575 136386 145503
18858 145503 142008 118744 93895 77617 72449 65311 61163 62162 67806 76700 74585 83148 95213
18845 95213 115090 144372 185505 246682 348484 483409 610660 676865 663688 569037 443547
18834 443547 354071 303308 283147 293043 328771 406866 531191 657128 740956 739641 639552
18823 639552 473019 332643 245952 187879 156073 129142 108306 102990 96793 85027 79559 73941
18811 73941 65033 56569 53418 53828 54350 58801 55949 50448 38799 33389 36327 41250 45445 36087 29031
$$ packed form
18897F6898J9325J7980R790j67k1417j7184j0393r945j4984j5132n247L276O344
18884B9144N346J381k807J938M100J0751J0251L962N611J4063J6807J3456J3347
18871A27350O681o902k4934k2074n822K368M345r61Q537J4873K0114J2811R117
18858A45503l495k3264k4849j6278n168p138m148R99N644Q894k115Q563J2065
18845I5213J9877K9282M1133O1177J01802J34925J27251O6205j3177r4651j25490
18834D43547q9476n0763k0161R896L5728P8095J24325J25937Q3828j315j00089
18823F39552j66533j40376q6691n8073l1806k6931k0836n316o197j1766n468n618
18811G3941q908q464l151M10N22M451k852n501j1649n410K938M923M195r358p056
$$ plain form
18796 29031 20946 14699 14766 15751 18156 20046 20304 27246 29590 26197 23820 18501 22486 25734 19500
18781 19500 19529 23342 17548 15679 15190 15878 17806 24098 22400 19055 24328 36142 48363 52488 53944
18766 53944 48963 40991 35278 26102 19133 19812 10284 8830 15505 14135 5961 7017 6002 4650 7514
18751 7514 10127 12800 14902 10913 4207 3295 8288 11588 11499 8617 14686 18622 16303 12170 11430 10947
18735 10947 17554 14378 14230 17377 22404 17001 14740 21378 23061 21268 17705 15583 14204 14300 17656
18720 17656 19391 19786 23773 20102 17515 18243 28705 24226 19198 25794 35746 32575 27115 29254 33751
18705 33751 30930 29319 31519 37166 37814 45756 52360 56487 63427 82045 108633 145463 181568 205322
18691 205322 223628 216208 188898 157204 135245 126313 130576 139145 151120 183486 213470 222712
$$ packed form
18796B9031q085o247O7R85K405J890K58O942K344l393k377n319L985L248o234
18781A9500K9L813n794j869m89O88J928O292j698l345N273J1814J2221M125J456
18766E3944m981p972n713r176o969O79r528j454O675j370q174J056j015j352K864
18751G514K613K673K102l989o706r12M993L300q9k882O069L936k319m133p40m83
18735A0947O607l176j48L147N027n403k261O638J683j793l563k122j379R6L356
18720A7656J735L95L987l671k587P28J0462m479n028O596R952l171n460K139M497
18705C3751k821j611K200N647O48P942O604M127O940J8618K6588L6830L6105K3754
18691B05322J8306p420k7310l1694k1959q932M263Q569J1975L2366K9984R242
$$ plain form
18679 222712 227652 210820 177990 138568 106852 90313 85349 82692 90216 99936 119794 139139
18667 139139 168649 199834 227223 246768 249518 228546 203093 185299 177260 175691 185745 203168
18655 203168 233612 280647 324294 344309 339553 317766 293211 268145 245422 225733 212660 195388
18643 195388 179347 170875 169447 172772 172561 179611 190572 194711 189454 176451 159413 141971 126940
18630 126940 108777 90706 83764 74176 60849 52806 46433 45383 44831 45845 46230 42502 39562 41755
18616 41755 42636 37674 34443 32167 36849 38035 44402 43853 44971 49901 51577 46474 39823 35289 33594
18601 33594 34945 40154 45337 45755 47914 46613 49266 51598 52338 53783 57250 69570 79271 84729 97746
18586 97746 120501 145625 183904 226273 279026 346357 407395 464761 512669 534679 538180 531372
$$ packed form
18679B22712M940j6832l2830l9422l1716j6539m964k657P524R720J9858J9345
18667A39139K9510L1185K7389J9545K750k0972k5453j7794q039j569J0054J7423
18655B03168L0444M7035M3647K0015m756k1787k4555k5066k2723j9689j3073j7272
18643A95388j6041q472j428L325k11P050J0961M139n257j3003j7038j7442j5031
18630A26940j8163j8071o942r588j3327q043o373j050n52J014L85l728k940K193
18616D1755Q81m962l231k276M682J186O367n49J118M930J676n103o651m534j695
18601C3594J351N209N183M18K159j301K653K332P40J445L467J2320R701N458J3017
18586I7746K2755K5124L8279M2369N2753O7331O1038N7366M7908K2010L501o808
$$ plain form
18574 531372 505885 463768 425778 415408 421736 432144 457875 486560 505703 510323 496770 476752
18562 476752 441133 384298 320851 268056 227148 188552 155918 133454 125990 110049 101892 93381
18550 93381 88860 79678 73163 73034 66868 67700 70828 66925 64861 67503 65951 62315 63362 59759 50795
18535 50795 47947 45154 40728 33957 34986 42150 45958 41618 38940 32812 36518 41156 40158 37348 39080
18520 39080 47998 52805 53661 50544 50957 52032 55599 52218 55405 53187 51755 53179 51826 45860 44228
18505 44228 46760 46749 48924 51509 50859 46935 44026 45483 41616 43606 45010 38300 38103 34977 31270
18490 31270 34372 45666 43692 37062 36984 35917 36784 42230 47521 54261 57112 54765 48153 49248 43735
18475 43735 43257 45416 50957 55671 51938 44710 43674 43701 50595 67200 81249 97372 106460 110474
$$ packed form
18574E31372k5487m2117l7990j0370O328J0408K5731K8685J9143M620j3553k0018
18562D76752l5619n6835o3447n2795m0908l8596l2634k2464p464j5941q157q511
18550I3381m521r182o515j29o166Q32L128l903k064K642j552l636J047l603q964
18535E0795k848k793m426o771J029P164L808m340k678o128L706M638r98k810J732
18520C9080Q918M807Q56l117M13J075L567l381L187k218j432J424j353n966j632
18505D4228K532j1K175K585o50l924k909J457l867J990J404o710j97l126l707
18490C1270L102J1294j974o630p8j067Q67N446N291O740K851k347o612J095n513
18475D3735m78K159N541M714l733p228j036K7O894J6605J4049J6123R088M014
$$ plain form
18461 110474 98819 95512 89739 78751 80473 90936 95843 104858 112336 111922 109668 109044 98756 88906
18447 88906 79135 74482 69551 64543 49603 45622 56071 49342 41751 38748 37877 34971 37624 36499
18433 36499 44510 50703 43711 40032 48401 49020 45018 54009 77215 88746 78374 77303 83073 79129
18419 79129 77938 78502 73392 64658 56211 62705 67958 77127 87511 87259 77239 75069 87188 82924
18405 82924 76324 74496 68840 54864 48373 50322 55564 57992 60082 64206 64513 58924 57506 55559
18391 55559 54823 60128 64777 71998 70870 69163 70305 73264 76293 83324 87590 80423 76262 74258 75230
18376 75230 80074 84759 79557 69190 67592 70616 69517 71154 73931 73621 75938 75283 78064 79024 83300
18361 83300 92446 96920 95343 86536 80085 83617 84650 83037 81870 80439 81208 82641 87127 91741 96321
$$ packed form
18461A10474j1655l307n773j0988J722J0463M907R015P478m14k254o24j0288r850
18447H8906r771m653m931n008j4940l981J0449o729p591l003q71k906K653j125
18433C6499Q011O193o992l679Q369O19m002Q991K3206J1531j0372j071N770l944
18419G9129j191N64n110q734q447O494N253R169J0384k52j0020k170J2119m264
18405H2924o600j828n656j3976o491J949N242K428K090M124L07n589j418j947
18391E5559p36N305M649P221j128j707J142K959L029P031M266p167m161k004R72
18376G5230M844M685n202j0367j598L024j099J637K777l10K317o55K781R60M276
18361H3300R146M474j577q807o451L532J033j613j167j431P69J433M486M614M580
$$ plain form
18346 96321 87660 84196 83354 72145 74003 80983 73924 67394 73227 77457 76864 79333 76703 76525 79737
18331 79737 80707 78924 77632 85597 99509 112150 125869 137154 134752 128277 117825 104976 99155
18318 99155 97600 105764 104354 117451 134180 149743 162551 161394 150527 139853 124444 107744
18306 107744 99000 105430 106188 105640 112933 122516 133765 153072 182364 201115 223537 244443 244282
18293 244282 238652 224701 199902 177619 170388 163855 171319 189188 212803 239999 253160 246317
18281 246317 232741 211073 186814 167137 159613 159044 155738 149290 159131 169775 186479 202056 224410
18268 224410 241090 251262 269749 285445 293180 291436 287767 292432 291238 288432 293787 311892 343702
18255 343702 371836 393421 409393 425490 437930 439806 432256 417440 402834 378866 352609 325070
$$ packed form
18346I6321q661l464q42j1209J858O980p059o530N833M230n93K469k630j78L212
18331G9737R70j783j292P965J3912J2641J3719J1285k402o475j0452j2849n821
18318I9155j555Q164j410J3097J6729J5563J2808j157j0867j0674j5409j6700
18306A07744q744O430P58n48P293R583J1249J9307K9292J8751K2422K0906j61
18293B44282n630j3951k4799k2283p231o533P464J7869K3615K7196J3161o843
18281B46317j3576k1668k4259j9677p524n69l306o448R841J0644J6704J5577K2354
18268B24410J6680J0172J8487J5696P735j744l669M665j194k806N355J8105L1810
18255C43702K8134K1585J5972J6097J2440J876p550j4816j4606k3968k6257k7539
$$ plain form
18243 325070 311303 311616 318745 332073 343481 360006 371945 366739 357875 343755 321284 298794
18231 298794 274691 257921 244321 236547 234496 231401 223734 213085 214725 209797 204830 205726 203498
18218 203498 207299 205587 205872 207102 207820 214684 216878 219479 224618 221933 222765 232388 234828 241571 247919
18203 247919 263722 272267 273069 273749 281408 285599 291732 302137 310917 312029 315882 333291 349509 356416
18189 356416 361975 367771 375096 393659 413940 424490 442598 463788 478102 499156 516108 525438
18177 525438 538800 559263 582821 605033 627646 653520 691564 728950 763436 813114 868125
18166 868125 923524 987545 1072444 1164168 1247431 1315036 1377697 1437370 1509207 1602980 1717655
18155 1717655 1843923 1979418 2134510 2310026 2536552 2798020 3102683 3452560 3877219
$$ packed form
18243C25070j3767L13P129J3328J1408J6525J1939n206q864j4120k2471k2490
18231B98794k4103j6770j3600p774k051l095p667j0649J640m928m967Q96k228
18218B03498L801j712K85J230P18O864K194K601N139k685Q32R623K440O743O348
18203B47919J5803Q545Q02O80P659M191O133J0405Q780J112L853J7409J6218O907
18189C56416N559N796P325J8563K0281J0550J8108K1190J4314K1054J6952R330
18177E25438J3362K0463K3558K2212K2613K5874L8044L7386L4486M9678N5011
18166H68125N5399O4021Q4899R1724Q3263O7605O2661N9673P1837R3773J14675
18155A717655J26268J35495J55092J75516K26526K61468L04663L49877M24659
$$ plain form
18146 3877219 4391195 5018294 5804157 6833953 8255973 10358418 13561068 18264457 24439043
18137 24439043 31063450 36258977 38214528 36127489 31041495 25429789 21394232 19603774
18129 19603774 19952113 22392161 26892112 32804091 38454996 41705530 40977472 36227796
18121 36227796 29379816 23073329 18696031 16156086 14932401 14666451 15264989 16920126
18113 16920126 20071361 25312567 32802086 40989080 47306551 49656845 46231723 38961271
18105 38961271 31412015 25751850 22677444 22004255 23559246 27323134 32821695 38548872
18097 38548872 42293639 42188037 37710697 30388180 22946487 17216372 13366695 10838145
18089 10838145 9133898 7952303 7100414 6448455 5910235 5427757 4988240 4598971 4256102
$$ packed form
18146C877219N13976O27099P85863J029796J422020K102445L202650M703389O174586
18137B4439043O624407N195527J955551k087039n085994n611706m035557j790458
18129A9603774L48339K440048M499951N911979N650905L250534p28058m749676
18121C6227796o847980o306487m377298k539945j223685k65950N98538J655137
18113A6920126L151235N241206P489519Q186994O317471K350294l425122p270452
18105C8961271p549256n660165l074406o73189J554991L763888N498561N727177
18097C8548872L744767j05602m477340p322517p441693n730115l849677k528550
18089A0838145j704247j181595q51889o51959n38220m82478m39517l89269l42869
$$ plain form
18080 4256102 3957821 3697053 3477599 3308209 3167214 3039144 2906206 2782300 2659480
18071 2659480 2536609 2418562 2300252 2175891 2056725 1943683 1846695 1768352 1691774 1623182
18061 1623182 1561504 1505168 1457036 1410552 1360143 1311522 1264595 1223674 1182736 1142630 1110637
18050 1110637 1079296 1049741 1017869 994636 972503 942288 912725 885353 865139 850849 830318
18039 830318 812700 787205 761417 741848 722655 706202 692162 681243 659737 644735 630906
18028 630906 622366 613306 606943 591720 574276 562868 555315 546338 533666 524747 519415 504654 489792
18015 489792 478997 472181 463624 452802 453670 450408 441762 438346 437896 425773 403257 388630 383527
18002 383527 379395 368259 364579 352541 352745 353101 347361 336404 321589 311861 305828 300105 293058 283634
$$ packed form
18080D256102k98281k60768k19454j69390j40995j28070j32938j23906j22820
18071B659480j22871j18047j18310j24361j19166j13042r6988p8343p6578o8592
18061A623182o1678n6336m8132m6484n0409m8621m6927m0921m0938m0106l1993
18050A110637l1341k9555l1872k3233k2133l0215k9563k7372k0214j4290k0531
18039H30318j7618k5495k5788j9569j9193j6453j4040j0919k1506j5002j3829
18028F30906q540r060o363j5223j7444j1408p553q977j2672q919n332j4761j4862
18015D89792j0795o816q557j0822Q68l262q646l416m50j2123k2516j4627n103
18002C83527m132j1136l680j2038K04L56n740j0957j4815r728o033n723p047r424
$$ plain form
17988 283634 271433 263779 267494 269777 264735 276925 282894 277840 269757 258971 251158 243834 232925
17975 232925 225553 215545 213905 222076 224075 222751 223460 223407 219215 206633 196298 186210 176594 178273
17961 178273 173202 175330 173811 173251 165154 157399 156559 161343 152912 144743 139076 128682 109724 96587
17947 96587 94192 102011 109160 117670 125731 128880 131605 124953 112339 103101 94393 89863 89694 97898
17933 97898 113030 124160 121322 121466 118623 122045 130767 132165 116922 103987 90838 76533 66866
17920 66866 60441 72454 86309 100024 113602 117072 111199 97610 79840 65522 51329 45246
17908 45246 54137 71980 81419 81295 84289 88242 89294 96705 96012 88829 91677 94336 88823 89171 90118
17893 90118 88681 84858 76525 71971 73003 81752 84015 87098 90274 88983 87778 88462 90423 86473 93236
$$ packed form
17988B83634j2201p654L715K283n042J2190N969n054q083j0786p813p324j0909
17975B32925p372j0008j640Q171J999j324P09n3m192j2582j0335j0088r616J679
17961A78273n071K128j519n60q097p755q40M784q431q169n667j0394j8958j3137
17947I6587k395P819P149Q510Q061L149K725o652j2614r238q708m530j69Q204
17933I7898J5132J1130k838J44k843L422Q722J398j5243j2935j3149j4305r667
17920F6866o425J2013J3855J3715J3578L470n873j3589j7770j4318j4193o083
17908D5246Q891J7843R439j24K994L953J052P411o93p183K848K659n513L48R47
17893I0118j437l823q333m554J032Q749K263L083L176j291j205O84J961l950O763
$$ plain form
17878 93236 97574 103666 109690 114195 114058 118077 123069 124978 134787 147239 145626 141123 137506 135462
17864 135462 133069 133391 135353 146630 156769 164691 171577 178077 185386 182103 171446 161960 151734
17851 151734 146161 136189 127216 132264 137040 140080 155407 160126 154092 147145 141271 133550 130648 124822
17837 124822 113828 104029 94507 93547 98559 97546 100432 100402 99198 96796 97332 100363 104417 97817 98474
17822 98474 104453 103414 103537 99727 98654 109643 114352 116391 121279 124846 126037 124879 120720 120876 126729
17807 126729 130830 131538 132853 130123 133484 137812 141872 142721 147050 154054 156711 148421 145545 151280 150177
17792 150177 148712 148748 152185 152303 149914 151682 151600 151135 155297 156038 148984 149590 156204 155459 154544 158761 157817
17775 157817 161355 156505 151583 154611 160468 165890 169817 173264 170329 172327 176814 183497 187623 199849
$$ packed form
17878I3236M338O092O024M505j37M019M992J909R809J2452j613m503l617k044
17864A35462k393L22J962J1277J0139P922O886O500P309l283j0657r486j0226
17851A51734n573r972q973N048M776L040J5327M719o034o947n874p721k902n826
17837A24822j0994r799r522r60N012j013K886l0j204k402N36L031M054o600O57
17822I8474N979j039J23l810j073J0989M709K039M888L567J191j158m159J56N853
17807A26729M101P08J315k730L361M328M060Q49M329P004K657q290k876N735j103
17792A50177j465L6L437J18k389J768q2m65M162P41p054O06O614p45r15M217r44
17775A57817L538m850m922L028N857N422L927L447k935J998M487O683M126J2226
$$ plain form
17761 199849 207443 199365 203322 206149 209411 217876 229437 237533 243397 248263 251455 255931 259149 266009
17747 266009 278180 286970 292878 299835 315706 320592 323905 335325 348202 359741 374642 381826 389302
17734 389302 407687 421811 425875 439488 456081 474787 503681 526995 541920 563245 579613 602921
17722 602921 628864 659023 683379 705018 740725 779760 827260 873080 920490 976547 1048071
17711 1048071 1119763 1204002 1307549 1417036 1535900 1664263 1791589 1916659 2028885 2136932
17701 2136932 2260494 2393259 2544882 2744811 3016060 3348200 3758174 4270846 4913331
17692 4913331 5723099 6760607 8152407 10049002 12525473 15526336 19069723 22952649
17684 22952649 26531991 29574122 31886271 32705632 32475228 31887227 30682699 29559896
$$ packed form
17761A99849P594q078L957K827L262Q465J1561Q096N864M866L192M476L218O860
17747B66009J2171Q790N908O957J5871M886L313J1420J2877J1539J4901P184P476
17734C89302J8385J4124M064J3613J6593J8706K8894K3314J4925K1325J6368K3308
17722F02921K5943L0159K4356K1639L5707L9035M7500M5820M7410N6057P1524
17711A048071P1692Q4239J03547J09487J18864J28363J27326J25070J12226J08047
17701B136932J23562J32765J51623J99929K71249L32140M09974N12672O42485
17692D913331Q09768J037508J391800J896595K476471L000863L543387L882926
17684B2952649L579342L042131K312149Q19361k30404n88001j204528j122803
$$ plain form
17676 29559896 29573552 30772858 33216724 36786797 40911988 45307110 49247873 51803211
17668 51803211 53117403 53147029 51144160 47569166 43773990 39874485 35805539 32765696
17660 32765696 31232772 30851794 31462377 32531324 33525106 34145913 33493632 31593268 29138168
17651 29138168 25803424 21829592 18259436 15226597 12599054 10551468 9067742 7974186
17643 7974186 7129162 6443853 5870883 5388035 4982707 4644044 4356964 4127854 3935189
17634 3935189 3766311 3613387 3454426 3286499 3121934 2952752 2776575 2616406 2462707
17625 2462707 2325148 2216407 2116984 2024977 1940579 1853013 1777800 1715015 1648985 1583543 1523457
17614 1523457 1469060 1424582 1380157 1340118 1304168 1269528 1243817 1228449 1207083 1176664 1148530
$$ packed form
17676B9559896J3656J199306K443866L570073M125191M395122L940763K555338
17668E1803211J314192K9626k002869l574994l795176l899505m068946l039843
17660C2765696j532924l80978O10583J068947R93782O20807o52281j900364k455100
17651B9138168l334744l973832l570156l032839k627543k047586j483726j093556
17643G974186q45024o85309n72970m82848m05328l38663k87080k29110j92665
17634C935189j68878j52924j58961j67927j64565j69182j76177j60169j53699
17625B462707j37559j08741r9423r2007q4398q7566p5213o2785o6030o5442o0086
17614A523457n4397m4478m4425m0039l5950l4640k5711j5368k1366l0419k8134
$$ plain form
17603 1148530 1126750 1107372 1079876 1065410 1059641 1049455 1042811 1054204 1084050 1112846 1146216 1163146
17591 1163146 1155892 1119718 1062372 1023287 994790 984185 998545 1044434 1112405 1184451 1222777
17580 1222777 1213655 1154192 1070935 1003872 968210 960456 972056 987513 983818 969042 953451 949325
17568 949325 974093 1008039 1022995 1028390 1030322 1032227 1045151 1077793 1139074 1213986 1315455 1436445
17556 1436445 1527812 1562781 1505531 1380876 1245925 1136711 1071564 1059827 1091627 1154212 1229562
17545 1229562 1280165 1308872 1313263 1309924 1296423 1273580 1245072 1199256 1158676 1122952 1084468 1053771
17533 1053771 1018901 986879 954405 919313 879978 839834 789794 742814 702532 662283 633952
17522 633952 617951 619338 622360 614899 600282 581320 547418 508697 463901 428541 407574 386118
$$ packed form
17603A148530k1780j9378k7496j4466n769j0186o644J1393K9846K8796L3370J6930
17591A163146p254l6174n7346l9085k8497j0605J4360M5889O7971P2046L8326
17580A222777r122n9463q3257o7063l5662p754J1600J5457l695j4776j5591m126
17568I49325K4768L3946J4956N395J932J905J2924L2642O1281P4912J01469J20990
17556A436445R1367L4969n7250j24655j34951j09214o5147j1737L1800O2585P5350
17545A229562N0603K8707M391l339j3501k2843k8508m5816m0580l5724l8484l0697
17533A053771l4870l2022l2474l5092l9335m0144n0040m6980m0282m0249k8331
17522F33952j6001J387L022p461j4617j8962l3902l8721m4796l5360k0967k1456
$$ plain form
17510 386118 373413 369114 368839 365145 360539 346056 320710 294294 280055 261025 249770 244375 240967
17497 240967 225668 213210 204289 202325 206247 202371 210882 231356 241812 248667 249404 234399 205732
17484 205732 183570 168854 157873 156139 169970 191679 214565 222567 227793 227969 216367 214374 209856
17471 209856 201625 203548 206264 207656 221331 248990 297161 367594 444165 517611 580737 639323
17459 639323 675709 687311 676510 634821 563321 496855 455184 427852 420677 421747 419136 425015
17447 425015 447404 472274 484824 485408 468084 438690 405510 367606 340308 327696 327868 358137
17435 358137 398897 442936 470637 466359 428195 365368 299515 250819 224719 219807 224592 231022
17423 231022 242309 250699 247345 234003 215163 188609 162716 144325 136322 129928 121466 113684 102150
$$ packed form
17510C86118j2705m299k75l694m606j4483k5346k6416j4239j9030j1255n395l408
17497B40967j5299j2458q921j964L922l876Q511K0474J0456O855P37j5005k8667
17484B05732k2162j4716j0981j734J3831K1709K2886Q002N226J76j1602j993m518
17471B09856q231J923K716J392J3675K7659M8171P0433P6571P3446O3126N8586
17459F39323L6386J1602j0801m1689p1500o6466m1671k7332p175J070k611N879
17447D25015K2389K4870J2550N84j7324k9394l3180l7904k7298j2612J72L0269
17435C58137M0760M4039K7701m278l8164o2827o5853m8696k6100m912M785O430
17423B31022J1287Q390l354j3342j8840k6554k5893j8391q003o394q462p782j1534
$$ plain form
17410 102150 101595 107018 107977 112673 113416 109175 109065 114852 130213 149141 158910 158487 147923 128251
17396 128251 113392 103311 95380 91896 83357 76492 79763 81700 81965 84239 85788 102647 109604 114059
17382 114059 107053 94166 86504 87406 95740 108187 120439 135261 158651 181639 184760 162870 138646
17369 138646 117252 104969 96295 93113 85381 74030 68976 67853 71543 74674 75441 82477 85998 80189
17355 80189 73322 74508 78471 81128 79674 72327 77776 78736 72539 66725 63081 67373 67457 63631 62219
17340 62219 55265 53506 54186 53216 48095 43566 41789 45948 47118 46940 49683 50189 61124 72020 76509
17325 76509 70326 68433 64399 63196 57612 45923 38947 40527 40610 43276 46054 43284 37248 36008 36251
17310 36251 38519 44334 46012 48091 47545 44417 46731 51230 55636 61037 63673 63630 76435 89534 87028
$$ packed form
17410A02150n55N423R59M696P43m241j10N787J5361J8928R769m23j0564j9672
17396A28251j4859j0081p931l484q539o865L271J937K65K274J549J6859O957M455
17382A14059p006j2887p662R02Q334J2447J2252J4822K3390K2988L121k1890k4224
17369A38646k1394j2283q674l182p732j1351n054j123L690L131P67P036L521n809
17355H0189o867J186L963K657j454p347N449R60o197n814l644M292Q4l826j412
17340F2219o954j759O80r70n121m529j777M159J170j78K743N06J0935J0896M489
17325G6509o183j893m034j203n584j1689o976J580Q3K666K778k770o036j240K43
17310C6251K268N815J678K079n46l128K314M499M406N401K636m3J2805J3099k506
$$ plain form
17295 87028 80998 77592 75715 62489 53356 53025 55312 50404 52941 53863 48429 50192 58057 58526 61299
17280 61299 63747 66579 62948 58901 59777 61601 56399 54765 56151 58686 67221 69965 70291 74531 70724
17265 70724 64015 55959 56651 54297 48912 41568 40192 38028 34374 36999 39673 40539 40181 40362 47880
17250 47880 50075 56170 65061 71993 83516 108609 135328 154755 158996 150252 127954 107981 91539
17237 91539 74101 66964 64781 61214 58754 54746 56217 56339 50472 49329 54857 63562 65682 67073
17223 67073 67537 69563 83009 87757 95982 107307 123010 140713 146223 135503 132006 129152 124591
17210 124591 136649 158516 200817 247023 277176 284974 257477 209875 169892 153370 137546 117165
17198 117165 101984 81688 71375 79276 81623 81935 90924 96096 101972 106997 103109 98183 99927 111277
$$ packed form
17295H7028o030l406j877j3226r133l31K287m908K537R22n434J763P865M69K773
17280F1299K448K832l631m047Q76J824n202j634J386K535Q535K744L26M240l807
17265G0724o709q056O92k354n385p344j376k164l654K625K674Q66l58J81P518
17250D7880K195O095Q891O932J1523K5093K6719J9427M241q744k2298j9973j6442
17237I1539j7438p137k183l567k460m008J471J22n867j143N528Q705K120J391
17223F7073M64K026J3446M748Q225J1325J5703J7703N510j0720l497k854m561
17210A24591J2058K1867M2301M6206L0153P798k7497m7602l9983j6522j5824k0381
17198A17165j5181k0296j0313P901K347L12Q989N172N876N025l888m926J744J1350
$$ plain form
17184 111277 127044 134304 132826 127296 108433 89931 80776 76620 71574 75431 81999 88755 98587
17171 98587 97537 95647 88535 76196 59818 50882 45285 43679 56578 58437 48545 41618 46581 46868
17157 46868 41893 36345 38692 46636 46558 45558 53265 62955 68719 70186 83358 103526 132166 168558
17143 168558 201820 215656 207894 169542 136001 117039 100897 94833 81843 67540 60322 58487
17131 58487 58495 54782 47660 49487 51845 52575 61438 69812 70887 64985 64812 74161 91250 113655 137031
17116 137031 170823 199997 211588 203978 174166 134825 109997 96304 88211 85345 85280 82228 79931
17103 79931 86882 97609 110541 131487 159812 181435 190862 209640 226263 231273 231606 239375 234410
17090 234410 234818 236749 239160 246095 255425 278108 302011 331116 362024 384003 393050 397470 391982
$$ packed form
17184A11277J5767P260j478n530j8863j8502r155m156n046L857O568O756R832
17171I8587j050j890p112j2339j6378q936n597j606J2899J859r892o927M963K87
17157D6868m975n548K347P944p8j000P707R690N764J467J3172K0168K8640L6392
17143A68558L3262J3836p762l8352l3541j8962j6142o064j2990j4303p218j835
17131E8487Ql713p122J827K358P30Q863Q374J075n902j73R349J7089K2405K3376
17116A37031L3792K9174J1591p610k9812l9341k4828j3693q093k866o5l052k297
17103G9931O951J0727J2932K0946K8325K1623R427J8778J6623N010L33P769m965
17090B34410M08J931K411O935R330K2683K3903K9105L0908K1979R047M420n488
$$ plain form
17077 391982 377980 359149 335149 303835 281149 261119 246752 239995 235185 247256 260438 268114
17065 268114 274477 266722 249356 225705 193838 167264 140952 118821 99510 92481 78044 66644
17053 66644 63046 61041 57449 54485 48990 42430 47484 42957 41410 49569 57697 48291 45618 41139
17039 41139 45262 48074 45422 41247 43664 43861 41338 39477 39573 40610 39071 37841 39223 37896 42283
17024 42283 41368 39676 35945 33529 37113 36779 42140 46295 51027 53147 51597 54889 65647 78716
17010 78716 96064 116681 144157 183276 221887 243403 242093 217831 179068 142693 124153 110986
16998 110986 98396 86150 83941 96363 117600 142079 169742 205858 232426 246289 236834 204117
16986 204117 167571 138976 131438 130839 135889 152603 193493 230443 251749 250528 223612 185903
$$ packed form
17077C91982j4002j8831k4000l1314k2686k0030j4367o757m810J2071J3182P676
17065B68114O363p755j7366k3651l1867k6574k6312k2131j9311p029j4437j1400
17053F6644l598k005l592k964n495o560N054m527j547Q159Q128r406k673m479
17039D1139M123K812k652m175K417J97k523j861R6J037j539j230J382j327M387
17024D2283r15j692l731k416L584l34N361M155M732K120j550L292J0758J3069
17010G8716J7348K0617K7476L9119L8611K1516j310k4262l8763l6375j8540j3167
16998A10986j2590j2246k209J2422K1237K4479K7663L6116K6568J3863r455l2717
16986B04117l6546k8595p538n99N050J6714M0890L6950K1306j221k6916l7709
$$ plain form
16974 185903 149560 121855 101763 95204 93963 98902 106521 117653 132926 157612 192904 221070
16962 221070 237295 230462 189432 149578 116965 91223 76844 63719 62894 61841 48585 35463
16950 35463 31675 36299 35100 37223 42036 37559 37074 44351 42504 43334 47780 45944 42340 33479 28361
16935 28361 27434 27235 25515 24835 24650 24851 30004 31306 32126 31987 30709 26779 17193 16452 15708 10641 12463
16918 12463 15795 22109 18701 17973 16245 16517 14103 13986 12360 11845 14449 20815 27614 27848 22864 17742
16902 17742 15134 13936 22119 28501 27224 16659 16151 21396 22804 25287 26835 28534 27412 26241
16888 26241 26560 21290 12539 14664 19607 23873 25781 26011 28870 32214 28170 25425 25395 28453 28261 26775
16872 26775 22497 17927 18189 30794 33169 33799 26886 20145 17504 25601 29312 25729 18461 18489 23260
$$ packed form
16974A85903l6343k7705k0092o559j241M939P619J1132J5273K4686L5292K8166
16962B21070J6225o833m1030l9854l2613k5742j4379j3125q25j053j3256j3122
16950C5463l788M624j199K123M813m477m85P277j847Q30M446j836l604q861n118
16935B8361r27j99j720o80j85K01N153J302Q20j39j278l930r586p41p44n067J822
16918A2463L332O314l408p28j728K72k414j17j626n15K604O366O799K34m984n122
16902A7742k608j198Q183O382j277j0565n08N245J408K483J548J699j122j171
16888B6241L19n270q751K125M943M266J908K30K859L344m044k745l0L058j92j486
16872B6775m278m570K62J2605K375O30o913o741k641Q097L711l583p268K8M771
$$ plain form
16857 23260 19753 17164 14666 16704 27024 25651 17951 16510 5176 1663 3675 11475 14069 17170
16843 17170 26305 36185 36982 32559 31827 36161 30302 25573 22698 14552 9486 5340 12142 12209 8339
16828 8339 5616 9977 18501 22358 15581 9825 11468 13579 10958 10295 14627 14342 10966 13384 13571
16813 13571 15600 13484 10364 13192 10491 -1512 -2047 -504 -294 14 5055 12895 18573 15536 8567
16798 8567 5782 4455 -63 1021 8762 15852 20142 18215 19628 14661 11963 16050 16015 19635 24399
16783 24399 20642 17947 18775 25287 18520 11012 9488 8580 6784 12806 20010 18922 22207 26214 30144
16768 30144 22080 21860 27002 24599 23967 32242 31925 26921 24964 20369 17982 20548 23206 18642 14669
16753 14669 15579 18014 20294 17740 10307 13216 18959 23155 25748 28013 29213 27196 31093 32012 28333
$$ packed form
16857B3260l507k589k498K038J0320j373p700j441j1334l513K012P800K594L101
16843A7170R135R880P97m423p32M334n859m729k875q146n066m146O802O7l870
16828H339k723M361Q524L857o777n756J643K111k621o63M332k85l376K418J87
16813A3571K029k116l120K828k701j2003n35J543K10L08N041P840N678l037o969
16798H567k785j327m518J084P741P090M290j927J413m967k698M087l5L620M764
16783B4399l757k695Q28O512o767p508j524r08j796O022P204j088L285M007L930
16768C0144q064k20N142k403o32Q275l17n004j957m595k387K566K658m564l973
16753A4669R10K435K280k554p433K909N743M196K593K265J200k017L897R19l679
$$ plain form
16738 28333 25750 25980 27947 27470 18149 11684 11555 18280 21061 20531 18684 21096 28440 32040 31934 27693
16722 27693 27606 28820 34747 36285 35417 32748 30225 36162 42807 43536 47575 53203 57993 64008 63688 59706
16706 59706 59605 63629 69030 72795 78070 73953 71376 67278 64069 66200 70374 72488 75788 75447 71605
16691 71605 73691 68148 60554 67553 72529 76547 73879 73667 70668 70346 71494 70919 74226 76616 76352
16676 76352 74937 74195 69788 60757 66396 67024 63512 59337 63909 74075 76981 71924 68796 67012 67604
16661 67604 78684 87168 78278 74863 72426 70677 66565 62909 59224 58232 61283 59658 64399 65684
16647 65684 67658 63767 70072 77315 84729 98182 114420 122143 123585 120537 102981 84953 74635
16634 74635 79127 79757 77782 73934 72559 87047 99100 112290 123538 133573 133289 124706 114141
$$ packed form
16738B8333k583K30J967m77r321o465j29O725K781n30j847K412P344L600j06m241
16722B7693q7J214N927J538q68k669k523N937O645P29M039N628M790O015l20l982
16706E9706j01M024N401L765N275m117k577m098l209K131M174K114L300l41l842
16691G1605K086n543p594O999M976M018k668k12k999l22J148n75L307K390k64
16676G6352j415p42m407r031N639O28l512m175M572J0166K906n057l128j784N92
16661F7604J1080Q484q890l415k437j749m112l656l685r92L051j625M741J285
16647F5684J974l891O305P243P414J3453J6238P723J442l048j7556j8028j0318
16634G4635M492O30j975l848j375J4488J2053J3190J1248J0035k84q583j0565
$$ plain form
16621 114141 100739 91074 85086 82701 86472 100836 116485 128880 140210 144172 136107 117715 100640
16608 100640 86740 78929 79622 80492 81239 87424 88906 97115 102465 110298 124761 129707 131621 121146
16594 121146 106829 90627 82705 83011 75996 71097 68506 68675 80410 90336 90316 90697 95588 100039 100734
16579 100734 102940 104120 107944 116164 108262 110497 109823 112758 110180 113116 114747 116927 128160 131092
16565 131092 127185 118348 113783 120627 123015 126014 127002 126876 130030 136096 130965 132137 129194 135475 140089
16550 140089 135891 134980 141676 147431 147849 145739 144088 143434 141344 147598 159908 156624 145977 151556
16536 151556 162098 166577 174918 183335 182380 182777 181666 182233 179910 186920 189482 184299 184042 191297 198080
16521 198080 206588 213118 220078 234780 244677 250489 258002 268300 270863 277142 289578 296268 296817 299116
$$ packed form
16621A14141j3402r665n988k385L771J4364J5649J2395J1330L962q065j8392j7075
16608A00640j3900p811O93Q70P47O185J482Q209N350P833J4463M946J914j0475
16594A21146j4317j6202p922L06p015m899k591J69J1735R926k0L81M891M451O95
16579A00734K206J180L824Q220p902K235o74K935k578K936J631K180J1233K932
16565A31092l907q837m565O844K388K999R88j26L154O066n131J172k943O281M614
16550A40089m198r11O696N755M18k110j651o54k090O254J2310l284j0647N579
16536A51556J0542M479Q341Q417r55L97j111N67k323P010K562n183k57P255O783
16521A98080Q508O530O960J4702R897N812P513J0298K563O279J2436O690N49K299
$$ plain form
16507 299116 305387 321448 330886 342039 358074 375204 390706 409350 424757 439603 452657 468248
16495 468248 490076 509007 525214 549656 570126 589399 619038 653877 682616 710283 750122
16484 750122 806373 870708 946566 1038014 1144427 1271695 1397856 1491869 1554144 1585303 1620507
16473 1620507 1694631 1788060 1893480 2001838 2145589 2334669 2566693 2852423 3200980 3636540
16463 3636540 4160324 4764959 5484933 6406986 7697817 9615503 12529935 16925725 23242065
16454 23242065 30877514 37428874 40581883 39084797 32659560 25007492 19340826 15816776
16446 15816776 13804008 12853146 12753424 13469257 15135866 18084048 22770216 29337126 36493943
16437 36493943 41601145 42936004 39435535 32243274 25664237 21596550 19817243 20035858
$$ packed form
16507B99116O271J6061R438J1153J6035J7130J5502J8644J5407J4846J3054J5591
16495D68248K1828J8931J6207K4442K0470J9273K9639L4839K8739K7667L9839
16484G50122N6251O4335P5858R1448J06413J27268J26161R4013O2275L1159L5204
16473A620507P4124R3429J05420J08358J43751J89080K32024K85730L48557M35560
16463C636540N23784O04635P19974R22053J290831J917686K914432M395790O316340
16454B3242065P635449O551360L153009j497086o425237p652068n666666l524050
16446A5816776k012768r50862r9722P15833J666609K948182M686168O566910P156817
16437C6493943N107202J334859l500469p192261o579037m067687j779307K18615
$$ plain form
16429 20035858 22306330 26815755 33195726 39383870 42810871 42091421 36431389 28519968
16421 28519968 22160219 18025165 15522071 14129857 13598959 13840282 14939356 17187777
16413 17187777 21016786 26698831 33402720 38660002 40425158 37580070 30327587 22523223
16405 22523223 16790170 13025839 10543887 8862994 7701617 6872549 6264696 5801917
16397 5801917 5432635 5115684 4818462 4521458 4226211 3950889 3693429 3442133 3219535
16388 3219535 3039252 2898498 2796179 2709463 2639013 2578753 2516334 2434627 2331779 2206001
16378 2206001 2075367 1957977 1858312 1785687 1717174 1650394 1591675 1539454 1483669 1438529 1389179
16367 1389179 1337868 1294164 1246104 1205031 1170096 1132546 1106182 1083856 1063095 1037422 1006249
$$ packed form
16429B0035858K270472M509425O379971O188144L427001p19450n660032p911421
16421B8519968o359749m135054k503094j392214n30898K41323J099074K248421
16413A7187777L829009N682045O703889N257282J765156k845088p252483p804364
16405B2523223n733053l764331k481952j680893j161377q29068o07853m62779
16397E801917l69282l16951k97222k97004k95247k75322k57460k51296k22598
16388C219535j80283j40754j02319q6716p0450o0260o2419q1707j02848j25778
16378B206001j30634j17390r9665p2625o8513o6780n8719n2221n5785m5140m9350
16367A389179n1311m3704m8060m1073l4935l7550k6364k2326k0761k5673l1173
$$ plain form
16356 1006249 982514 965177 957239 951415 948188 941781 930663 917675 899093 884268 877443 887954
16344 887954 900992 899312 876888 830457 775011 731922 709163 705418 707853 712548 722459 714639 698533
16331 698533 679228 672720 688738 715032 747903 765931 759253 729849 694046 671133 669157 669287
16319 669287 666563 646817 610884 553307 506649 483035 470458 468031 474656 479615 483473 493145 483076
16306 483076 468227 468433 481001 494152 494803 484687 450888 404357 369597 344876 322664 308931
16294 308931 292279 273131 260934 250177 242122 234896 236085 225747 217284 211437 206312 210070 207457
16281 207457 206770 202628 196730 190028 176832 176673 171269 167860 166373 160412 153414 142392 138921 125848
16267 125848 107099 90249 79385 73612 70797 75437 92181 99944 98477 89988 93129 95071 88738
$$ packed form
16356A006249k3735j7337p938n824l227o407j1118j2988j8582j4825o825J0511
16344H87954J3038j680k2424m6431n5446m3089k2759l745K435M695R911p820j6106
16331F98533j9305o508J6018K6294L2871J8028o678k9404l5803k2913j976J30
16319F69287k724j9746l5933n7577m6658k3614j2577k427O625M959L858R672j0069
16306D83076j4849K06J2568J3151O51j0116l3799m6531l4760k4721k2212j3733
16294C08931j6652j9148j2197j0757q055p226J189j0338q463n847n125L758k613
16281B07457o87m142n898o702j3196j59n404l409j487n961o998j1022l471j3073
16267A25848j8749j6850j0864n773k815M640J6744P763j467q489L141J942o333
$$ plain form
16254 88738 80884 73167 57975 39939 38186 42832 46985 53472 58287 64182 69015 63218 54002 42008
16240 42008 31380 22825 9608 -1712 2903 17774 30820 34430 36356 35605 37248 36723 35953 36478
16226 36478 29713 25823 14356 1910 -8775 -12912 2237 14523 24885 30392 31794 34010 33702
16213 33702 31840 29171 31082 40504 39997 35464 27768 27869 40270 44455 47789 55460 61597 67762 80245
16198 80245 82148 71044 60164 50939 42805 45245 43262 37746 41282 38423 35625 34245 31418 22941
16184 22941 22364 20373 27396 32073 32315 28418 23371 21806 26707 27990 28070 32737 35114 37126 30703
16169 30703 27299 21595 24646 23696 24908 32258 32981 29342 27044 20548 17516 15898 20166 25656 20563
16154 20563 19394 13834 9286 11872 15086 16130 22585 29992 30992 28840 24367 17578 16765 10540 10693
$$ packed form
16254H8738p854p717j5192j8036j753M646M153O487M815N895M833n797r216j1994
16240D2008j0628q555j3217j1320M615J4871J3046L610J926p51J643n25p70N25
16226C6478o765l890j1467j2446j0685m137J5149J2286J0362N507J402K216l08
16213C3702j862k669J911R422n07m533p696J01J2401M185L334P671O137O165J2483
16198H0245J903j1104j0880r225q134K440j983n516L536k859k798j380k827q477
16184B2941n77j991P023M677K42l897n047j565M901J283Q0M667K377K012o423
16169C0703l404n704L051r50J212P350P23l639k298o496l032j618M268N490n093
16154B0563j169n560m548K586L214J044O455P407J000k152m473o789q13o225J53
$$ plain form
16139 10693 15225 19916 21633 15409 14278 13615 14205 13620 21742 24513 20993 14884 4957 2205 1645
16124 1645 899 3039 5473 3560 8356 14538 20822 16107 8775 7821 8714 19168 22649 15360 11828
16109 11828 9329 6048 3856 5001 14388 16173 10975 11558 7889 2050 -4013 -3704 12350 19008 17196
16094 17196 17435 16733 10999 3590 11151 17851 13400 5498 6583 13168 12512 6019 5522 7984 9522
16079 9522 6649 6579 12620 14705 19190 18870 13445 15601 16734 14454 13013 16894 15504 5704 2588
16064 2588 4178 6895 4577 -5017 -6674 -88 2711 631 -1621 -1626 3514 7467 8632 5318 383
16049 383 1939 8657 14301 16646 15689 17816 18094 13378 5259 4768 3122 -1723 5676 12174 12086 15473
16033 15473 11847 10901 8942 1025 784 2531 -430 -739 560 1565 438 6527 8224 7771 5094
$$ packed form
16139A0693M532M691J717o224j131o63N90n85Q122K771l520o109r927k752n60
16124A645p46K140K434j913M796O182O284m715p332r54Q93J0454L481p289l532
16109A1828k499l281k192J145R387J785n198N83l669n839o063L09J6054O658j812
16094A7196K39p02n734p409P561O700m451p902J085O585o56o493m97K462J538
16079I522k873p0O041K085M485l20n425K156J133k280j441L881j390r800l116
16064B588J590K717k318r594j657O586K799k080k252nN140L953J165l314m935
16049C83J556O718N644K345r57K127K78m716q119m91j646m845P399O498q8L387
16033A5473l626r46j959p917k41J747k961l09J299J005j127O089J697m53k677
$$ plain form
16018 5094 4813 5697 3897 -290 -3823 3551 11099 6943 5223 -4540 -4095 4741 8654 3775 -8494
16003 -8494 -9217 -9210 -4636 -5702 -1887 4842 1339 3952 5695 8645 8971 5491 6871 10345 1484 -1403
15987 -1403 202 -59 -4342 -1764 -3348 -6628 1301 4325 5067 2206 2799 7329 5708 3425 7473
15972 7473 10299 6300 4020 571 -5018 -6663 -9326 -9356 -10254 -8894 -5786 2363 -205 -3858 -6695
15957 -6695 -8065 -9343 -7911 -2760 3006 6302 8386 5121 -343 -1603 -6515 -4955 2528 2656 5695
15942 5695 14296 13345 11508 5995 852 1599 6345 1916 463 2910 3322 4423 -1074 -8712 -6317
15927 -6317 1337 4695 11196 14745 12416 8596 6858 13692 12510 8663 5500 7897 16045 12742 14332
15912 14332 14979 18040 17772 24496 24473 16024 14030 17949 23048 24876 31685 44204 53955 68269 76759
$$ packed form
16018E094k81Q84j800m187l533P374P548m156j720r763M45Q836L913m879j2269
16003h494p23PM574j066L815O729l503K613J743K950L26l480J380L474q861k887
15987a403J605k61m283K578j584l280P929L024P42k861N93M530j621k283M048
15972G473K826l999k280l449n589j645k663l0q98J360L108Q149k568l653k837
15957f695j370j278J432N151N766L296K084l265n464j260m912J560P483J28L039
15942E695Q601r51j837n513n143P47M746m429j453K447M12J101n497p638K395
15927f317P654L358O501L549k329l820j738O834j182l847l163K397Q148l303J590
15912A4332O47L061k68O724k3q449j994L919N099J828O809J2519R751J4314Q490
$$ plain form
15897 76759 91246 120765 158201 190097 215471 209975 174709 135878 112034 92931 77987 73065
15885 73065 78624 88315 90157 98650 114006 137248 176775 205843 218093 213189 182481 142308 110424
15872 110424 98514 99581 110892 138285 171018 205052 230491 232540 205873 165803 141250 113508
15860 113508 91462 85583 87848 88627 88644 102561 122711 146901 176364 198815 205708 197881 174274
15847 174274 136287 112405 90599 72209 60370 53396 48905 48120 39322 32654 29527 32475 30271
15834 30271 29891 25195 20026 22369 23061 21495 20631 23034 25998 26141 20323 19985 20430 23375 18276 16689
15818 16689 18914 19492 21350 19461 19998 18814 18109 15266 12386 13214 8808 1720 1162 3049 3425 3965
15802 3965 5564 5042 6851 10763 7815 3748 5681 7413 3449 -508 905 4789 2377 1605 934
$$ packed form
15897G6759J4487K9519L7436L1896K5374n496l5266l8831k3844j9103j4944m922
15885G3065N559R691J842Q493J5356K3242L9527K9068J2250m904l0708m0173l1884
15872A10424j1910J067J1311K7393L2733L4034K5439K049k6667m0070k4553k7742
15860A13508k2046n879K265P79J7J3917K0150K4190K9463K2451O893p827k3607
15847A74274l7987k3882k1806j8390j1839o974m491p85q798o668l127K948k204
15834C0271l80m696n169K343O92j566q64K403K964J43n818l38M45K945n099j587
15818A6689K225N78J858j889N37j184p05k843k880Q28m406p088n58J887L76N40
15802C965J599n22J809L912k948m067J933J732l964l957J413L884k412p72o71
$$ plain form
15787 934 4939 6501 9527 7318 -1907 -706 2114 1 -1263 3093 -840 2254 6135 17184 11068
15772 11068 5954 1968 3551 10535 12823 12958 8985 8176 9075 13632 5393 2795 8909 6928 3709
15757 3709 2275 8333 13141 8336 5029 1509 -340 2021 -1481 3092 9994 4281 -2697 -5623 -3952
15742 -3952 -7165 -8117 1731 -2868 -2675 -7318 -11464 -3276 -4580 -2776 3761 3671 -4088 -6877 -3318 2603
15726 2603 2161 -5581 -12301 -5961 909 5899 9114 8770 6802 7392 5285 666 -1175 264 -4433
15711 -4433 -4975 -5692 -3067 -6917 -7150 -3783 -655 10905 11668 5042 695 6666 7670 -941 -11083
15696 -11083 -7520 1516 592 -3465 2676 2393 353 -24 2738 2419 -2803 525 -2832 -12519 -10487
15681 -10487 -11388 -4128 28 -4786 -7011 -4131 -2917 -5797 -8805 -7536 329 12241 5664 3956
$$ packed form
15787I34M005J562L026k209r225J201K820k113j264M356l933L094L881J1049o116
15772A1068n114l986J583O984K288J35l973q09Q99M557q239k598O114j981l219
15757C709j434O058M808m805l307l520j849K361l502M573O902n713o978k926J671
15742c952l213r52R848m599J93m643m146Q188j304J804O537r0p759k789L559N921
15726B603m42p742o720O340O870M990L215l44j968N90k107m619j841J439m697
15711d433n42p17K625l850k33L367L128J1560P63o626m347N971J004q611j0142
15696a1083L563R036r24m057O141k83k040l77K762l19n222L328l357r687K032
15681a0487r01P260M156m814k225K880J214k880l008J269P865J1912o577j708
$$ plain form
15667 3956 7145 6286 9454 8949 3851 -1701 -532 3012 5600 947 -2623 -814 -3080 -1315 6865
15652 6865 6868 2452 2322 3753 3582 4409 -2446 -728 -424 4673 9832 7412 2908 -2324 -2709 2111 -2343
15635 -2343 -6515 -392 1304 5075 8090 7865 7841 8962 9912 5291 7368 5877 11744 13181 9952 6347
15619 6347 2644 8235 15118 14654 10531 4523 -2057 237 1716 2779 3212 -880 1008 -1028 -5857
15604 -5857 -1734 6933 1872 -2334 -2863 2329 4257 8425 17470 16242 6258 -5010 -5461 -3086 -1388
15589 -1388 -4079 -7023 -4457 -1927 -5318 -8813 -7133 -2924 -26 -244 -7012 -938 -658 -5567 -9422
15574 -9422 -11183 -6559 -4826 -3240 663 -3991 -712 5540 3259 4821 3229 2704 513 1892 2256
15559 2256 3086 -77 1468 2711 1850 1565 2141 2249 -2544 -9073 -5286 -5860 432 1465 -1048 -6235
$$ packed form
15667C956L189q59L168n05n098n552J169L544K588m653l570J809k266J765Q180
15652F865Lm416j30J431j71Q27o855J718L04N097N159k420m504n232l85M820m454
15635b343m172O123J696L771L015k25k4J121R50m621K077j491N867J437l229l605
15619F347l703N591O883m64m123o008o580K294J479J063M33m092J888k036m829
15604e857M123Q667n061m206n29N192J928M168R045j228r984j1268m51K375J698
15589a388k691k944K566K530l391l495J680M209K898k18o768O074K80m909l855
15574i422j761M624J733J586L903m654L279O252k281J562j592n25k191J379L64
15559B256Q30l163J545J243q61k85N76J08m793o529L787n74O292J033k513n187
$$ plain form
15543 -6235 -6244 -50 6384 6308 5182 2839 -2034 -6501 -6554 -6264 -10399 -829 7829 7099 2425 -241 -2038
15526 -2038 -796 429 3008 471 -4425 -11511 -3552 -3204 -7330 -6090 -10015 -7039 -7389 -4572 -2046
15511 -2046 -772 -3128 -2941 -2014 -5990 -5476 -7513 -9810 -9256 -11769 -14929 -14166 -8347 -5478 -6508 -6917
15495 -6917 -5559 502 -235 1120 3265 3632 4780 2414 8016 2682 3112 704 -800 -2282 -1992 2082
15479 2082 8557 9782 9968 12153 9673 1776 -7095 -8425 -12527 -9092 -6066 -2117 -1682 -6081 -15284
15464 -15284 -16840 -12272 -7675 -6938 -3294 -494 3512 -3729 -10898 -7163 -3338 -3437 -1012 -4591 -1787
15449 -1787 -5553 -5709 -6857 -6525 587 -2072 -79 1527 -3159 -6205 -5472 -2411 1429 2271 339 -3294
15433 -3294 -6875 -8478 -3812 -3820 -5906 -8080 -13978 -15670 -13934 -9811 -7099 -9259 -4082 -5348 -5366 -7243
$$ packed form
15543f235rO194O434p6j126k343m873m467n3K90m135R570Q658p30m674k666j797
15526b038J242J225K579k537m896p086P959L48m126J240l925K976l50K817K526
15511b046J274k356J87R27l976N14k037k297N54k513l160P63N819K869j030m09
15495f917J358O061p37J355K145L67J148k366N602n334M30k408j504j482K90M074
15479B082O475J225J86K185k480p897q871j330m102L435L026L949M35m399r203
15464a5284j556M568M597P37L644K800M006p241p169L735L825r9K425l579K804
15449a787l766j56j148L32P112k659J993J606m686l046P33L061L840Q42j932l633
15433c294l581j603M666qk086k174n898j692J736M123K712k160N177j266j8j877
$$ plain form
15417 -7243 -10997 -13281 -11012 -4828 -4963 -3926 -8526 -9804 -10586 -12167 -16805 -5994 -9284 -12948 -13826
15402 -13826 -12366 -14188 -12236 -7879 -9087 -2238 4459 3734 2255 -7355 -9874 -6122 -230 6086 85
15387 85 -448 -4087 -3913 -4829 -3736 -4627 -3799 -3984 -7497 -19269 -22640 -28308 -26835 -14744 -9421 -3725
15371 -3725 1112 -824 -5537 -7071 -10238 -7582 -6849 -9768 -17281 -21668 -15834 -12908 -10778 -8886 -4895
15356 -4895 1986 1424 -1594 2939 -3427 -7532 -5566 -5452 -9864 -11614 -10776 -8885 -7666 -9980 -5945
15341 -5945 -4709 -8227 -7625 -3165 456 -2037 -7324 -11591 -12739 -13238 -9280 -10231 -10568 -8207 -3388 -10217
15325 -10217 -12993 -16917 -13082 -9628 -18598 -16025 -4510 5220 8854 2784 -1113 -32 -1582 -83
15311 -83 -514 -1471 -4368 -8405 -10226 -14494 -16433 -9805 -11027 -8103 -10853 -16260 -16619 -15292 -11419 -11594
$$ packed form
15417g243l754k284K269O184j35J037m600j278p82j581m638J0811l290l664q78
15402a3826J460j822J952M357j208O849O697p25j479r610k519L752N892O316o001
15387H5n33l639J74r16J093q91Q28j85l513j1772l371n668J473J2091N323N696
15371c725M837j936m713j534l167K656P33k919p513m387N834K926K130J892L991
15356d895O881n62l018M533o366m105J966J14m412j750Q38J891J219k314M035
15341e945J236l518O02M460L621k493n287m267j148m99L958r51l37K361M819o829
15325a0217k776l924L835L454q970K573J1515R730L634o070l897J081j550J499
15311h3m31r57k897m037j821m268j939O628j222K924k750n407l59J327L873j75
$$ plain form
15295 -11594 -10039 -7329 -5742 -10308 -17565 -11959 -9840 -5818 -7982 -15621 -15764 -13701 -8617 -10355 -16510
15280 -16510 -15961 -4840 1405 -2644 -1009 -1684 -818 -1460 -8905 -6218 -2425 -3131 -5210 -8911 -5808
15265 -5808 -2399 1148 1743 838 1101 976 -4705 -6169 -13393 -9036 -930 361 2491 -1367 -5833 -5790
15249 -5790 -3658 1364 10013 7005 2094 -1925 -1041 2551 -993 -349 -1039 -4113 -578 -2310 -9715
15234 -9715 -15572 -13084 -10345 -11051 -10381 -8434 -3236 5402 8762 6058 3312 1651 -1927 -5473 -11104
15219 -11104 -14461 -12849 -14617 -12199 -14827 -20759 -17039 -12007 -3191 -4111 -6327 -7128 -10486 -14905 -16021
15204 -16021 -12277 -16130 -18721 -9306 -3879 -13024 -10652 -6668 -7488 -9968 -4640 2349 558 1373 -4184
15189 -4184 -14088 -12180 -7386 412 -1660 -9014 -10435 -12492 -12290 -7287 -5306 -5230 -4783 -6246 -9731 -1891
$$ packed form
15295a1594J555K710J587m566p257N606K119M022k164p639j43K063N084j738o155
15280a6510N49J1121O245m049J635o75Q66o42p445K687L793p06k079l701L103
15265e808L409L547N95r05K63j25n681j464p224M357Q106J291K130l858m466M3
15249e790K132N022Q649l008m911m019Q84L592l544O44o90l074L535j732p405
15234i715n857K488K739p06O70J947N198Q638L360k704k746j661l578l546n631
15219a1104l357J612j768K418k628n932L720N032Q816r20k216q01l358m419j116
15204a6021L744l853k591R415N427r145K372L984q20k480N328O989j791Q15n557
15189d184r904J908M794P798k072p354j421k057K02N003J981P6M47j463l485P840
$$ plain form
15173 -1891 -2887 -8256 -8524 -6084 -8553 -8750 -4668 -2979 -1568 2599 -3016 -11224 -10198 -2377 -1003
15158 -1003 -3167 -986 -3247 1047 -643 -8647 -8720 -12675 -12256 -7466 -2510 -3272 -7208 -7886 -9678 -11685
15142 -11685 1489 445 -7113 -13834 -15018 -8845 -6538 -1745 -2327 -1785 -5731 -14129 -13716 -13177 -23803
15127 -23803 -20638 -11564 -5212 -5047 -7309 -6721 -11803 -11335 -10932 -11974 -13707 -14553 -9580 -2154 -915 -928
15111 -928 -10493 -12570 -3667 2274 6154 4673 5379 10114 5155 3753 5703 4172 5227 -2317 -6051
15096 -6051 513 916 -3650 -6426 -10654 -14587 -10647 -912 -660 4463 -258 -5011 -5817 -7180 -2663
15081 -2663 -9228 -20212 -20878 -9933 -2420 3632 2293 -653 2424 -1967 -1445 2180 2444 4137 2066
15066 2066 -456 -6846 -15856 -12575 -9369 -1965 4116 5275 -4195 -11161 -10345 -11100 -9581 -15924 -19583
$$ packed form
15173a891r96n369k68K440k469j97M082J689J411M167n615q208J026P821J374
15158a003k164K181k261M294j690q004p3l955M19M790M956p62l936o78j792k007
15142a1685J3174j044p558o721j184O173K307M793n82N42l946q398M13N39j0626
15127b3803L165R074O352J65k262N88n082M68M03j042j733q46M973P426J239j3
15111i28r565k077Q903N941L880j481P06M735m959j402J950j531J055p544l734
15096f051O564M03m566k776m228l933L940R735K52N123m721m753q06j363M517
15081b663o565j0984o66J0945P513O052j339k946L077m391N22L625K64J693k071
15066B066k522o390r010L281L206P404O081J159r470o966Q16p55J519o343l659
$$ plain form
15051 -19583 -19978 -11462 -6589 -12650 -15601 -9963 -10335 -6119 -12452 -16824 -12403 -9335 -7581 -9417 -14437
15036 -14437 -12738 -4787 -1172 -9724 -7600 -6777 -9719 -9547 -15193 -14867 -4389 4686 -2260 -5577 -519
15021 -519 -4334 -6881 -6639 -9463 -10502 -10336 -7782 -9338 -9090 -10315 -9565 -12242 -10296 -12302 -12761 -12088
15005 -12088 -7535 -8757 -9092 -7871 -5587 -4469 920 -504 -8726 -7813 -3556 2679 268 -7017 -11242
14990 -11242 -13647 -12319 -12191 -10794 -10426 -8550 -6362 1526 8584 8733 7272 5930 9122 3906 7558
14975 7558 10758 5964 1361 -2201 -1681 -1438 -3890 -10486 -12537 -12079 -14027 -10913 -6541 -6670 -5973 -1685
14959 -1685 4127 5251 5193 5047 -3070 -12813 -16586 -16578 -12522 -9035 -10008 -10553 -11389 -9385 -2641 5975 1846
14942 1846 1683 3348 -5889 -4841 5444 7590 6014 546 -2838 1883 2817 5504 -845 -4763 -7516
$$ packed form
15051a9583l95Q516M873o061k951N638l72M216o333m372M421L068J754j836n020
15036a4437J699P951L615q552K124Q23k942J72n646L26J0478R075o946l317N058
15021e19l815k547K42k824j039J66K554j556K48j225P50k677J946k006m59O73
15005a2088M553j222l35J221K284J118N389j424q222R13M257O235k411p285m225
14990a1242k405J328J28J397L68J876K188P888P058J49j461j342L192n216L652
14975G558L200m794m603l562N20K43k452o596k051M58j948L114M372j29O97M288
14959a685N812J124n8j46q117r743l773QM056L487r73n45q36K004O744Q616m129
14942A846j63J665r237J048J0285K146j576n468l384M721R34K687o349l918k753
$$ plain form
14927 -7516 -7360 -2494 636 -2483 -6926 -4545 -5704 -6168 -6473 -6621 -40 7624 12230 10557 7513 587
14911 587 -2800 -6629 -7271 -1802 -3051 1026 -294 -8267 -5554 -4877 -12480 -11242 -8491 -8109 -8532 -6583
14895 -6583 -2197 -975 376 -1012 -3667 508 -745 -6428 3120 10509 8590 1925 4365 5799 2022
14880 2022 -1590 -1833 -2791 -5559 -6987 -6503 -6223 -10160 -8731 -7589 -10486 -13365 -9372 -14632 -12358 -8728
14864 -8728 -12035 -15488 -20201 -19525 -13146 -10742 -8172 -6934 -11344 -17457 -9346 -7561 -10594 -9843 -10017
14849 -10017 -11661 -18738 -22789 -18867 -8479 -4726 -7897 -7261 -9709 -10669 -9505 -15441 -14586 -14607 -12805
14834 -12805 -12209 -9976 -9938 -3772 -1540 -1941 -3399 -1186 6672 7970 4702 6409 7154 5188 2298 -1979
14818 -1979 -8786 -14196 -14373 -12988 -9182 -11452 -21777 -21733 -11505 -8281 -5716 -5731 -7312 -9543 -5836
$$ packed form
14927g516J56M866L130l119m443K381j159m64l05j48O581P664M606j673l044o926
14911E87l387l829o42N469j249M077j320p973K713O77p603J238K751L82m23J949
14895f583M386J222J351j388k655M175j253n683R548P389j919o665K440J434l777
14880B022l612k43r58k768j428M84K80l937J429J142k897k879L993n260K274L630
14864h728l307l453m713O76O379K404K570J238m410o113Q111J785l033P51j74
14849a0017j644p077m051L922J0388L753l171O36k448r60J164n936Q55k1J802
14834a2805N96K233L8O166K232m01j458K213P858J298l268J707P45j966k890m277
14818a979o807n410j77J385L806k270j0325M4J0228L224K565j5j581k231L707
$$ plain form
14803 -5836 2071 2194 -236 1160 978 -472 2079 -1432 -6304 -7220 -11458 -14300 -10131 -9397 -7677 -14104
14787 -14104 -19941 -20894 -13118 -15176 -8581 -1869 3066 3420 3236 766 -2036 587 4195 360 1561
14772 1561 955 391 1184 -773 -4445 2195 4790 4311 6289 9817 8806 9357 6366 1260 2275 8177
14756 8177 10545 7060 5552 7012 1962 -8422 -6705 -3912 -11197 -8772 -8594 -10105 -9699 62 -856
14741 -856 -8225 -4805 -2140 -11703 -15500 -15903 -17555 -20660 -19097 -16171 -10448 -2559 -8930 -10440 -12881
14726 -12881 -13440 -14194 -9647 -5272 -2894 -1163 -2922 -6891 -7072 3008 1407 -1974 1549 -5482 -9721
14711 -9721 -4708 -1144 -3121 -4698 -8828 -4363 -6131 -3249 -8032 -10244 -11488 -15602 -22905 -20007 -15955
14696 -15955 -12968 -9588 -5460 394 -491 -6601 -7007 -4293 995 -535 -11790 -17755 -12019 -6232 -7999
$$ packed form
14803e836P907J23k430J396j82j450K551l511m872r16m238k842M169P34J720o427
14787a4104n837r53P776k058O595O712M935L54j84k470k802K623L608l835J201
14772A561o06n64P93j957l672O640K595m79J978L528j011N51k991n106J015N902
14756H177K368l485j508J460n050j0384J717K793p285K425J78j511M06R761r18
14741h56p369L420K665r563l797m03j652l105J563K926N723P889o371j510k441
14726a2881n59p54M547M375K378J731j759l969j81J0080j601l381L523p031m239
14711i721N013L564j977j577m130M465j768K882m783k212j244m114p303K898M052
14696a5955K987L380M128N854q85o110m06K714N288j530j1255n965N736N787j767
$$ plain form
14681 -7999 -14173 -15138 -9716 -5363 -6662 -6946 -5089 -7229 -4148 -1530 -4572 1126 2291 -4521 -5703
14666 -5703 -6058 -10859 -2490 -1378 1903 942 2136 3979 -2446 -9304 -9998 -9673 -18420 -20670 -20544 -18786
14650 -18786 -15188 -8690 -4025 -4522 -847 -1914 -460 -6762 -8830 -7263 -1491 2672 1498 -2717 -4925
14635 -4925 -6892 -12411 -14665 -14251 -10252 -5769 -4377 -3918 -2766 919 -7173 -6569 -1865 -1053 -3196 -4830
14619 -4830 -9873 -3590 -4465 -3688 177 2310 -920 -6882 -6450 -3421 -4851 -5629 -1410 -269 -2153 1382
14603 1382 6109 4649 1937 -1177 -9102 -4627 -6259 -4431 -6534 -7745 -8968 -11572 -7958 -6983 -6021
14588 -6021 -8195 -11926 -14546 -14424 -13864 -11256 -10645 -11109 -9344 -13110 -15152 -17276 -15538 -8224 -7711 -11829
14572 -11829 -8909 -11562 -11785 -9176 -9929 -10377 -5379 -318 -1149 4621 9136 4164 -4566 -8158 -447
$$ packed form
14681g999o174r65N422M353j299k84J857k140L081K618l042N698J165o812j182
14666e703l55m801Q369J112L281r61J194J843o425o858o94L25q747k250J26J758
14650a8786L598O498M665m97L675j067J454o302k068J567N772M163j174m215k208
14635d925j967n519k254M14L999M483J392M59J152L685q092O04M704Q12k143j634
14619d830n043O283q75P77L865K133l230n962M32L029j430p78M219J141j884L535
14603A382M727j460k712l114p925M475j632J828k103j211j223k604L614R75R62
14588f021k174l731k620J22N60K608O11m64J765l766k042k124J738P314N13m118
14572a1829K920k653k23K609p53m48M998N061q31N770M515m972q730l592P711
$$ plain form
14557 -447 -358 -4388 -11043 -14434 -13255 -4408 499 -1068 -311 3825 1702 333 -1396 -8262 -10471 -5133
14541 -5133 -36 -676 -3163 2022 -1842 -6860 -1525 4184 3706 -2051 -11341 -14911 -13248 -14562 -6716
14526 -6716 -7255 -15737 -22482 -18692 -18018 -18464 -13180 -5910 -4823 -5504 -11534 -9900 -4312 -3532 -2632 2288
14510 2288 -6219 -15868 -17622 -17462 -9497 -5998 -11035 -10684 -9715 -8514 -5242 -209 -2138 1082 -2427
14495 -2427 -7040 -8225 -11008 -7255 -4358 1683 -3289 -4028 -10775 -17583 -14850 -14785 -12481 -10407 -13907
14480 -13907 -16470 -18976 -16696 -13488 -8926 -5165 -10782 -15776 -12019 -11228 -19185 -11851 -1133 -1388 -6737
14465 -6737 -9402 -2708 1074 -2592 -2617 -729 -9005 -16976 -12141 -6276 -6177 -1448 1832 887 -1621 1265
14449 1265 6084 -1149 -10685 -13812 -9863 -7408 -4969 -9098 -12193 -5604 8167 5803 7696 4418
$$ packed form
14557d47Q9m030o655l391J179Q847M907j567P57M136k123j369j729o866k209N338
14541e133N097o40k487N185l864n018N335N709m78n757r290l570J663j314P846
14526f716n39q482o745L790O74m46N284P270J087o81o030J634N588P80R00M920
14510B288q507r649j754J60P965L499n037L51R69J201L272N033j929L220l509
14495b427m613j185k783L753K897O041m972p39o747o808K733O5K304K074l500
14480a3907k563k506K280L208M562L761n617m994L757P91p957P334J0718k55n349
14465f737k665O694L782l666k5J888q276p971M835N865R9M729L280r45k508K886
14449A265M819p233r536l127L949K455K439m129l095O589J3771k364J893l278
$$ plain form
14435 4418 820 2403 4049 8815 6670 2219 -1929 1765 4753 2147 -6104 -13821 -15817 -16583 -10902
14420 -10902 -9148 -8736 -5795 -3030 -3334 -10676 -2281 -101 -5208 -86 1140 -3118 -2576 -366 -4489
14405 -4489 -16044 -14093 -12130 -12230 -10966 -11090 -14227 -12557 -4992 -9254 -12863 -9702 -8951 -6695 -7850
14390 -7850 -4286 -1059 -3245 -4378 2085 3349 -2436 -6641 -9960 -7923 -9029 -7263 -6874 -11407 -13231
14375 -13231 -9932 -6613 -8595 -11122 -17100 -13007 -7418 -1859 -2147 113 -3290 -2711 -743 -3629 -9806
14360 -9806 -6196 -5781 1308 1536 1345 3454 -1316 -7971 -8308 -5029 -9746 -9718 -3949 -2361 -2806 2756
14344 2756 3927 -1068 -4367 -8199 -6540 -2282 -836 1388 1670 -8233 -13473 -14091 -10183 -8583 -7362
14329 -7362 -12415 -14499 -13055 -9290 -9387 -10512 -11628 -13819 -15649 -17053 -19491 -12903 -15959 -15039 -9473
$$ packed form
14435D418l598J583J646M766k145m451m148L694K988k606q251p717j996p66N681
14420a0902J754M12K941K765l04p342Q395K180n107N122J226m258N42K210m123
14405d489j1555J951J963j00J264j24l137J670P565m262l609L161P51K256j155
14390g850L564L227k186j133O463J264n785m205l319K037j106J766L89m533j824
14375a3231L299L319j982k527n978M093N589N559k88K260l403N79J968k886o177
14360i806L610M15P089K28j91K109m770o655l37L279m717K8N769J588m45N562
14344B756J171m995l299l832J659M258J446K224K82r903n240o18L908J600J221
14329g362n053k084J444L765r7j125j116k191j830j404k438O588l056R20N566
$$ plain form
14314 -9473 -4298 -6165 -4661 -6444 -8322 -9560 -9302 -7751 -14691 -13022 -11643 -20000 -22180 -21875 -21131
14299 -21131 -18046 -12868 -12012 -7332 -3875 -3091 4921 6270 1421 4262 7404 1026 -551 -1431 -5374
14284 -5374 -8246 -10063 -9638 -6167 -605 -3835 -316 -1872 -3844 -5090 -8381 -11320 -13876 -5864 -2013
14269 -2013 4059 5531 2056 2801 -3555 -12147 -13137 -11140 -7008 -4132 -4746 -5560 -2802 -6784 -10773 -10836
14253 -10836 -7929 -12393 -10669 -2098 -2917 -6261 -5693 -11133 -11903 -5134 -2019 -2745 -8166 -5505 -5141 -7576
14237 -7576 -8594 -12773 -11473 -8683 -3662 -7091 -2146 -902 -7142 -11120 -15132 -21587 -21304 -20283 -12204
14222 -12204 -6466 -4559 -7876 -8014 -9575 -10979 -13748 -4441 8916 11699 2949 -2355 -10252 -10043 -7418
14207 -7418 -7496 -10167 -13213 -11324 -10590 -7813 -7965 -17009 -18028 -13001 -10290 -2838 3997 -5660 -15724
$$ packed form
14314i473N175j867J504j783j878j238K58J551o940J669J379q357k180L05P44
14299b1131L085N178Q56M680L457P84Q012J349m849K841L142o378j577q80l943
14284e374k872j817M25L471N562l230L519j556j972j246l291k939k556Q012L851
14269b013O072J472l475P45o356q592r90J997M132K876o14q14K758l982l989o3
14253a0836K907m464J724Q571q19l344N68n440p70O769L115p26n421K661L64k435
14237g576j018m179J300K790N021l429M945J244o240l978m012o455K83J021Q079
14222a2204N738J907l317j38j561j404k769R307J3357K783q750n304p897K09K625
14207g418p8k671l046J889P34K777j52r044j019N027K711P452O835r657j0064
$$ plain form
14192 -15724 -16287 -15008 -16785 -13498 -13651 -9844 -2235 8527 11348 6434 1333 210 -6901 -7673 -1846
14177 -1846 -2171 -7037 -11823 -8642 -9582 -9504 -3200 2454 -1377 -6270 -3768 -4333 -1002 -2027 -1974 -4166
14161 -4166 -8402 -8775 -9047 -8553 -11159 -7828 -5351 -9117 -10374 -5516 -2336 -3334 -5198 -10711 -9597 -6004
14145 -6004 -10832 -6507 -7862 -11332 -8878 -9681 -10721 -11033 -4497 -4040 -5989 -8457 -7948 -2801 1498 -1032
14129 -1032 -853 -5182 -2503 -459 -6533 -17229 -23078 -19255 -19358 -9925 788 -3657 -4235 -4580 -5890
14114 -5890 -800 -1952 -7139 -12765 -13036 -10311 -6859 -2839 -5810 -5933 -12411 -16083 -8905 -4460 -9979
14099 -9979 -13851 -10952 -8327 -6987 -2263 1067 -619 -4779 -154 3743 1069 1459 5617 9347 9417
14084 9417 3635 1566 -1179 2612 7611 4673 1542 615 7178 12248 9825 8540 3871 3083 5784
$$ packed form
14192a5724n63J279j777L287j53L807P609J0762K821m914n101j123p111p72N827
14177a846l25m866m786L181r40P8O304N654l831m893K502n65L331j025N3k192
14161d166m236l73k72M94k606L331K477l766j257M858L180r98j864n513J114L593
14145f004m828M325j355l470K454q03j040l12O536M57j949k468N09N147M299k530
14129a032J79m329K679K044o074j0696n849L823j03R433J0713m445n78l45j310
14114e890N090j152n187n626k71K725L452M020k971j23o478l672P178M445n519
14099i979l872K899K625J340M724L330j686m160M625L897k674L90M158L730P0
14084I417n782k069k745L791M999k938l131r27O563N070k423j285m669p88K701
$$ plain form
14069 5784 5495 5492 -2537 -9030 -3900 -4976 -9833 -7053 -3674 -2455 -5308 -3915 3945 234 -4804 -10174
14053 -10174 -8890 -9786 -13911 -12409 -10109 -4905 -166 1143 5435 3197 387 -2830 -9477 -10815 -8039
14038 -8039 -1124 -1820 -6365 -5607 -843 -1798 -10853 -19482 -20202 -20038 -18206 -11338 -6510 133 5658 1903
14022 1903 -329 -386 -968 -4873 -371 539 -5760 -9515 -12480 -15308 -14815 -9996 -14823 -8751 -3450 -3712
14006 -3712 -5963 -8351 -4942 -3641 -8168 -8225 -2023 -813 -3476 -6682 -13807 -15699 -10237 -8368 -7761
13991 -7761 -888 4861 -469 -5985 -2131 1075 1872 1549 281 4681 5900 1997 -1368 -1066 -2221
13976 -2221 -5510 -2985 -1339 -3060 -12232 -12337 -4128 2784 7982 6914 428 -7540 -8753 -2482 4773
13961 4773 3092 -824 -9278 -12044 -8776 537 -1078 -7092 -9012 -12503 -14459 -12772 -6698 -13158 -9767
$$ packed form
14069E784k89lq029o493N130j076m857K780L379J219k853J393P860l711n038n370
14053a0174J284q96m125J502K300N204M739J309M292k238k810l217o647j338K776
14038h039O915o96m545P58M764r55r055q629p20J64J832O868M828O643N525l755
14022A903k232n7n82l905M502R10o299l755k965k828M93M819m827O072N301k62
14006c712k251k388L409J301m527n7O202J210k663l206p125j892N462J869O07
13991g761O873N749n330n516L854L206P97l23j268M400J219l903l365L02j155
13976b221l289K525J646j721r172j05Q209O912N198j068o486p968j213O271P255
13961D773j681l916q454k766L268R313j615o014j920l491j956J687O074o460L391
$$ plain form
13946 -9767 356 1090 -6012 -3945 1503 9512 11535 2653 2057 -1626 -3376 -6787 -7053 -11915 -12220
13931 -12220 -9382 -4854 -2815 -5788 -9713 -11374 -9593 -4301 -943 1805 -3466 -6667 -6520 -4303 -5562
13916 -5562 2261 6623 1374 -9356 -8601 -7038 -5853 -2728 1874 -136 -1347 -4442 -4975 -6725 -17231
13901 -17231 -11210 -8919 -14470 -13943 -9760 -5728 -5560 -2930 -9438 -9945 -6201 -3643 -3253 -12057 -9452
13886 -9452 -4874 -11804 -9365 -3940 -4003 -776 6900 12114 10134 4977 635 3927 997 -5072 -9284
13871 -9284 -12436 -8792 -2626 -2492 -7328 -14646 -14158 -10985 -9704 -5423 -4449 -2347 -56 25 -1 325 -2064
13854 -2064 2936 2633 -799 2311 6082 -795 -9311 -12664 -17568 -9715 -1880 -734 762 -9368 -7321
13839 -7321 695 -1633 -8387 -5656 -5498 -9555 -5350 -176 -755 -6149 -6959 -5623 -6129 -8744 -1937 2455
$$ packed form
13946i767J0123P34p102K067N448Q009K023q882n96l683j750l411k66m862l05
13931a2220K838M528K039k973l925j661J781N292L358K748n271l201J47K217j259
13916e562P823M362n249j0730P55J563J185L125M602k010j211l095n33j750j0506
13901a7231O021K291n551N27M183M032J68K630o508n07L744K558L90q804K605
13886i452M578o930K439N425o3L227P676N214j980n157m342L292k930o069m212
13871i284l152L644O166J34m836p318M88L173J281M281R74K102K291Q1k6L26k389
13854b064N000l03l432L110L771o877q516l353m904P853P835J146J496j0130K047
13839g321Q016k328o754K731J58m057M205N174n79n394q10J336n06k615O807M392
$$ plain form
13823 2455 1772 -5380 -3063 -4458 -4545 -8644 -9031 -7046 -8856 -15130 -12777 -2135 2602 -374 -7391
13808 -7391 -9116 -618 6102 3829 -2457 -4840 -7436 -9565 -10358 -9085 -7188 -1208 -3322 -732 4947
13793 4947 6932 -297 -3239 154 6791 4987 -2649 -4817 2523 5801 3933 -2249 -5034 -7825 -6964
13778 -6964 -4325 -1184 -6254 -4529 3202 7349 3279 -2515 1969 6523 7655 -2923 -5223 -5586 -7797
13763 -7797 -9770 -4937 1856 1959 2470 5223 1895 -12256 -13053 -1646 5646 7588 1797 -2208 8845
13748 8845 21626 22778 22619 15814 8337 1475 2237 2116 5719 14523 14431 8047 3722 -2959 -6422 -6914
13732 -6914 -12583 -8996 -2579 250 831 -616 -2447 -2834 -2529 -4895 -3106 5553 3325 1628 -2590
13717 -2590 -4779 1903 4622 10684 9131 9420 6377 2933 -1626 -7985 -5126 -2987 -4244 -6831 -4075
$$ packed form
13823B455o83p152K317j395q7m099l87J985j810o274K353J0642M737k976p017
13808g391j725Q498O720k273o286k383k596k129p93J273J897N980k114K590N679
13793D947J985p229k942L393O637j804p636k168P340L278j868o182k785k791Q61
13778f964K639L141n070J725P731M147m070n794M484M554J132j0578k300l63k211
13763g797j973M833O793J03N11K753l328j4151p97J1407P292J942n791m005J1053
13748H845J2781J152j59o805p477o862P62j21L603Q804r2o384m325o681l463m92
13732f914n669L587O417K829N81j447j831l87L05k366J789Q659k228j697m218
13717b590k189O682K719O062j553K89l043l444m559o359K859K139j257k587K756
$$ plain form
13702 -4075 -9159 -7754 -3545 -2789 -493 -6056 -6531 -3452 -6793 -6217 -2878 -10157 -12986 -14889 -13772
13687 -13772 -8193 -8238 -9300 -1659 3714 995 -6991 -12812 -17059 -12730 -4543 -692 -5587 -3841 -2065
13672 -2065 -3229 -6599 -5960 -4115 -4959 -2723 -8154 -8276 -4172 -1353 -4438 -6649 -2966 121 -2653
13657 -2653 241 3133 14091 9749 6584 5362 2630 -3246 -206 -1774 -6867 -3957 -1844 3826
13643 3826 7456 3049 1865 -1210 -2346 159 -2589 -4185 -3923 -1174 4442 3642 -3958 471 6913
13628 6913 1065 5238 4706 4141 5512 3169 1229 3195 1568 -5809 -2841 2402 3077 3654 2592 3342
13612 3342 5446 6521 12498 12882 11714 9157 5142 -2411 -14045 -12156 -6341 -4486 -5855 -5765 -9494
13597 -9494 -7335 -3743 -1985 -5578 -10435 2226 6901 5949 361 -710 9 6627 12669 8452 5091
$$ packed form
13702d075n084J405M209P56K296n563m75L079l341N76L339p279k829j903J117
13687a3772N579m5j062P641N373k719p986n821m247M329Q187L851m895J746J776
13672b065j164l370O39J845q44K236n431j22M104K819l085k211L683L087k774
13657b653K894K892J0958m342l165j222k732n876L040j568n093K910K113N670
13643C826L630m407j184l075j136K505k748j596K62K749N616q00p600M429O442
13628F913n848M173n32n65J371k343j940J966j627p377K968N243O75N77j062P50
13612C342K104J075N977L84j168k557m015p553j1634J889N815J855j369R0l729
13597i494K159L592J758l593m857J2661M675r52n588j071P19O618O042m217l361
$$ plain form
13582 5091 6141 9840 4736 847 -1902 105 1377 1777 4830 5760 6356 5253 5126 2762 -1247 -3625
13566 -3625 -1961 5144 2215 1441 4181 8978 10981 11755 18279 14258 11517 13704 11999 10272 13351
13551 13351 12923 14045 15991 16160 17595 24650 27466 18832 11076 5108 4208 8634 8641 7879 5342 3538
13535 3538 1363 11808 14196 6497 -535 -3967 -1781 -6844 -6559 5887 10159 4624 3528 4546
13521 4546 2447 8264 4340 -2272 296 2953 830 -536 6097 17465 15284 8500 6411 7344 9106
13506 9106 15335 18870 24446 31609 35048 36799 39654 27692 21741 16989 14386 13121 5354 18
13492 18 -3611 -7611 -9857 -3184 4669 5938 5096 2532 6177 5707 4273 13066 15348 9999 8268 10860
13476 10860 13315 9364 9317 11104 14115 12604 10104 12549 11588 18330 15109 13189 6289 1945 5912
$$ packed form
13582E091J050L699n104l889k749K007J272M00L053R30N96j103j27k364m009k378
13566c625J664P105k929p74K740M797K003P74O524m021k741K187j705j727L079
13551A3351m28J122J946J69J435P055K816q634p756n968r00M426Pp62k537j804
13535C538k175J0445K388p699p032l432K186n063K85J2446M272n535j096J018
13521D546k099N817l924o612K568K657k123j366O633J1368k181o784k089R33J762
13506I106O229L535N576P163L439J751K855j1962n951m752k603j265p767n336
13492A8l629m000k246O673P853J269q42k564L645m70j434Q793K282n349j731K592
13476A0860K455l951m7J787L011j511k500K445r61O742l221j920o900m344L967
$$ plain form
13461 5912 15726 27218 29068 35226 37491 30160 25157 22454 22505 24526 22565 12334 14740 24580 23910
13446 23910 21259 19830 20319 16998 14185 3220 -5848 -1384 6422 13068 16224 7179 -742 -2690
13432 -2690 -1831 827 1753 -3149 -2075 -2409 3913 8118 16336 28623 27994 24727 13643 7811 9373
13417 9373 17262 15906 11786 7829 9515 11559 10506 7102 3475 8193 15368 10595 5612 8236 14527
13402 14527 17968 18906 16709 15187 17930 27038 31417 25613 17298 16334 15657 14323 12996 13691 18195
13387 18195 19025 19742 13359 12791 15219 17108 20046 22248 21382 12538 13942 21500 27904 33293 29975
13372 29975 26826 26201 23738 24107 35326 35588 33151 28221 28619 27587 28984 28191 21529 18186 19614
13357 19614 19552 24845 24738 27554 33803 42713 46107 49119 54716 56285 53690 43103 33965 37302 41619
$$ packed form
13461E912R814J1492J850O158K265p331n003k703N1K021j961j0231K406R840o70
13446B3910k651j429M89l321k813j0965r068M464P806O646L156r045p921j948
13432b690Q59K658R26m902J074l34O322M205Q218J2287o29l267j1084n832J562
13417I373P889j356m120l957J686K044j053l404l627M718P175m773m983K624O291
13402A4527L441R38k197j522K743R108M379n804q315r64o77j334j327O95M504
13387A8195Q30P17o383n68K428J889K938K202q66q844J404P558O404N389l318
13372B9975l149o25k463L69J1219K62k437m930L98j032J397p93o662l343J428
13357A9614o2N293j07K816O249Q910L394L012N597J569k595j0587r138L337M317
$$ plain form
13342 41619 40304 33733 32753 32576 25640 21694 20877 21195 21758 22894 17321 12974 12462 24133 31764 37252
13326 37252 36058 35295 35148 31495 35283 35285 35567 38791 37886 37199 39653 40066 37765 30378 28586 40015
13310 40015 37926 35424 31464 30910 32215 36889 33454 27072 20275 16171 12287 17484 25345 24761 18320
13295 18320 15825 23767 23083 20448 28544 37852 35841 33081 28532 27521 26627 23429 26358 28776 26700
13280 26700 28715 29446 31399 32782 41532 42497 39276 36901 35934 34104 30351 26975 29013 34310 32999
13265 32999 32955 33352 24605 23207 22928 19499 19737 22525 25830 33032 34888 34231 38638 41538 43880 49448
13249 49448 53645 58722 65983 69629 73803 71550 63303 61277 47019 42985 39980 46611 54128 59751
13235 59751 57049 50120 42499 40114 41494 43147 41246 44070 52453 56643 53371 56691 58894 59771 63514
$$ packed form
13342D1619j315o571r80j77o936l946q17L18N63J136n573m347n12J1671P631N488
13326C7252j194p63j47l653L788KK82L224r05o87K454M13k301p387j792J1429
13310D0015k089k502l960n54J305M674l435o382o797m104l884N197P861n84o441
13295A8320k495P942o84k635Q096R308k011k760m549j011q94l198K929K418k076
13280B6700K015P31J953J383Q750R65l221k375r67j830l753l376K038N297j311
13265C2999m4L97q747j398k79l429K38K788L305P202J856o57M407K900K342N568
13249D9448M197N077P261L646M174k253q247k026j4258m034l005O631P517N623
13235E9751k702o929p621k385J380J653j901K824Q383M190l272L320K203Q77L743
$$ plain form
13220 63514 62116 58983 54113 49777 53030 60975 65962 76453 84127 89273 102407 117250 127828
13207 127828 139725 143563 130744 119218 118180 119810 122759 129789 143540 153892 170839 186269
13195 186269 197509 214333 233155 264311 315010 379297 480038 629538 865290 1199521 1594412
13184 1594412 1969299 2265569 2379286 2286717 2063016 1729877 1318195 957510 723472 585292
13174 585292 502848 443131 402897 373218 344325 319486 295653 272947 262739 256453 245669 233505
13162 233505 220141 205660 192449 184179 177755 169892 159070 152623 145484 148236 151188 157407 164233
13149 164233 164421 162611 161499 162117 165514 176482 191956 219527 274161 356631 469760 587373
13137 587373 664647 666838 589492 463811 355951 275703 230282 209154 196268 181299 161654
$$ packed form
13220F3514j398l133m870m336L253P945M987J0491P674N146J3134J4843J0578
13207A27828J1897L838j2819j1526j038J630K949P030J3751J0352J6947J5430
13195A86269J1240J6824J8822L1156N0699O4287J00741J49500K35752L34231L94891
13184A594412L74887K96270J13717r2569k23701l33139m11682l60685k34038j38180
13174E85292q2444n9717m0234k9679k8893k4839k3833k2706j0208o286j0784j2164
13162B33505j3364j4481j3211q270o424p863j0822o447p139K752K952O219O826
13149A64233J88j810j112O18L397J0968J5474K7571N4634Q2470J13129J17613
13137E87373P7274K191p7346j25681j07860q0248m5421k1128j2886j4969j9645
$$ plain form
13126 161654 154410 144662 126557 118454 116371 108248 107892 104388 95259 97958 95895 94242 99589 104840
13112 104840 101220 94771 94086 93311 93185 92734 96679 101729 112043 131957 155332 184087 228187 301679
13098 301679 372668 423131 435699 386255 308727 246667 203426 178483 155362 134968 126691 118645
13086 118645 116887 110741 103918 104527 107158 104070 101100 95293 84629 80389 79458 89076 94535 100650
13072 100650 105054 105981 107243 113682 120326 126765 129206 122972 116611 106532 96730 89230 81819 76577
13058 76577 77358 83607 86816 83768 82049 80892 87939 90097 91734 93335 95831 96749 100756 103288 99342
13043 99342 91767 96310 106458 120035 129014 137522 151735 159406 165693 174093 171292 165486 163424 164362
13029 164362 167173 181837 199933 221224 245614 260766 266023 273656 275351 271019 274393 295977 334812
$$ packed form
13126A61654p244r748j8105q103k083q123l56l504r129K699k063j653N347N251
13112A04840l620o449o85p75j26m51L945N050J0314J9914K3375K8755M4100P3492
13098C01679P0989N0463J2568m9444p7528o2060m3241k4943k3121k0394q277q046
13086A18645j758o146o823O09K631l088k970n807j0664m240r31R618N459O115
13072A00650M404R27J262O439O644O439K441o234o361j0079r802p500p411n242
13058G6577P81O249L209l048j719j157P047K158J637J601K496R18M007K532l946
13043I9342p575M543J0148J3577Q979Q508J4213P671O287Q400k801n806k062R38
13029A64362K811J4664J8096K1291K4390J5152N257P633J695m332L374K1584L8835
$$ plain form
13016 334812 389867 479749 626771 840188 1065380 1218254 1247407 1109516 859106 647348
13006 647348 515768 442419 401918 373642 358363 357792 364997 381729 404545 426233 444226 466939
12994 466939 492984 510839 545441 573125 574754 553836 540750 516100 472904 437571 414063 405190
12982 405190 408032 415705 430311 452776 505753 571699 642925 723843 791426 819863 818627 800839
12970 800839 761762 709179 675819 663173 673847 726179 824325 957297 1106782 1262788 1405809
12959 1405809 1524038 1604331 1626143 1598326 1511142 1369027 1202639 1015864 831609 702519
12949 702519 629353 593602 586903 605264 653999 717628 803630 887036 955329 983617 962228 904694
12937 904694 825546 746589 693728 670425 666407 693272 770797 892092 1052962 1223274 1392655
$$ packed form
13016C34812N5055Q9882J47022K13417K25192J52874K9153j37891k50410k11758
13006F47348j31580p3349m0501k8276j5279n71P205J6732K2816K1688J7993K2713
12994D66939K6045J7855L4602K7684J629k0918j3086k4650m3196l5333k3508q873
12982D05190K842P673J4606K2465N2977O5946P1226Q0918O7583K8437j236j7788
12970H00839l9077n2583l3360j2646J0674N2332R8146J32972J49485J56006J43021
12959A405809J18229Q0293K1812k7817q7184j42115j66388j86775j84255j29090
12949G02519p3166l5751o699J8361M8735O3629Q6002Q3406O8293K8288k1389n7534
12937I04694p9148p8957n2861k3303m018K6865P7525J21295J60870J70312J69381
$$ plain form
12926 1392655 1520732 1590408 1593518 1515531 1377079 1242830 1150841 1108047 1105442 1119061 1141587
12915 1141587 1171097 1213813 1292099 1451926 1708087 2102310 2662364 3309641 3910886 4351651
12905 4351651 4426019 4129460 3652045 3019343 2390934 1920423 1594161 1356465 1172073 1033763
12895 1033763 940651 878386 833835 798390 768042 753728 750186 756415 778670 813123 863210 936456
12883 936456 1057444 1218424 1404237 1584548 1707557 1733891 1696848 1608793 1494862 1402561
12873 1402561 1336106 1287216 1295637 1361966 1498272 1721702 2050603 2447108 2838231 3100093
12863 3100093 3111367 2909712 2576572 2168132 1823734 1586782 1419540 1292163 1202111 1159869
12853 1159869 1163175 1210814 1303527 1464968 1731428 2145296 2666958 3180481 3600292 3841758
$$ packed form
12926A392655J28077O9676L110p7987j38452j34249r1989m2794k605J3619K2526
12915A141587K9510M2716P8286J59827K56161L94223N60054O47277O01245M40765
12905D351651P4368k96559m77415o32702o28409m70511l26262k37696j84392j38310
12895A033763r3112o2265m4551l5445l0348j4314l542O229K2255L4453N0087P3246
12883I36456J20988J60980J85813J80311J23009K6334l7043q8055j13931r2301
12873A402561o6455m8890Q421O6329J36306K23430L28901L96505L91123K61862
12863C100093J1274k01655l33140m08440l44398k36952j67242j27377r0052m2242
12853A159869L306M7639R2713J61441K66460M13868N21662N13523M19811K41466
$$ plain form
12843 3841758 3809695 3589954 3255421 2744935 2168761 1723205 1436930 1259061 1143645 1059717
12833 1059717 1000233 959433 931220 906478 891926 878236 857391 838994 831230 836407 845385 859615
12821 859615 870480 873980 880053 887910 905580 917631 929538 938517 946673 951949 955434 960589 978914
12808 978914 1006212 1032101 1063681 1086727 1113419 1147503 1183919 1220461 1260988 1313567 1374780
12797 1374780 1423106 1463875 1503460 1546511 1580494 1612513 1655003 1702806 1771650 1850721 1940996
12786 1940996 2037179 2139970 2246260 2360686 2475182 2590513 2708428 2832991 2961936 3093608
12776 3093608 3234569 3389570 3545401 3709848 3880543 4049115 4224961 4441691 4695440
12767 4695440 5001543 5352637 5725401 6133209 6606500 7164584 7811713 8565072 9445795
$$ packed form
12843C841758l2063k19741l34533n10486n76174m45556k86275j77869j15416q3928
12833A059717n9484m0800k8213k4742j4552j3690k0845j8397p764N177Q978J4230
12821H59615J0865L500O073P857J7670J2051J1907Q979Q156N276L485N155J8325
12808I78914K7298K5889L1580K3046K6692L4084L6416L6542M0527N2579O1213
12797A374780M8326M0769L9585M3051L3983L2019M2490M7803O8844P9071R0275
12786A940996R6183J02791J06290J14426J14496J15331J17915J24563J28945J31672
12776C093608J40961J55001J55831J64447J70695J68572J75846K16730K53749
12767D695440L06103L51094L72764M07808M73291N58084O47129P53359Q80723
$$ plain form
12758 9445795 10478011 11689535 13132438 14880102 16969021 19455333 22436179 26018857
12750 26018857 30406747 36059446 43621379 53977629 68840047 91253631 125906928
12743 125906928 177608789 243621997 310416750 366374723 400531555 401107767 373917605
12736 373917605 329694682 265757712 194206693 138346681 102720873 80225306 65343735
12729 65343735 54978333 47302736 41408090 36748790 32851198 29481073 26508664 23873618
12721 23873618 21643195 19824331 18335400 17085748 16003150 15033663 14152545 13349340
12713 13349340 12617142 11951234 11352013 10813920 10323781 9886643 9504141 9176907 8927469
12704 8927469 8746021 8560072 8288590 7906104 7427651 6944689 6544635 6208466 5916317
$$ packed form
12758I445795J032216J211524J442903J747664K088919K486312K980846L582678
12750B6018857M387890N652699P561933J0356250J4862418K2413584L4653297
12743A25906928N1701861O6013208O6794753N5957973L4156832N76212k7190162
12736C73917605m4222923o3936970p1551019n5860012l5625808k2495567j4881571
12729F5343735j0365402p675597n894646m659300l897592l370125k972409k635046
12721B3873618k230423j818864j488931j249652j082598r69487q81118q03205
12713A3349340p32198o65908n99221n38093m90139m37138l82502l27234k49438
12704H927469j81448j85949k71482l82486m78453m82962m00054l36169k92149
$$ plain form
12695 5916317 5662910 5432778 5222332 5032380 4864494 4710999 4569802 4427062 4283205
12686 4283205 4144151 3998913 3866589 3747259 3638526 3540087 3453050 3369735 3307632 3229502
12676 3229502 3146269 3067364 2992782 2926934 2865055 2794432 2725012 2654860 2582889 2512126 2434714
12665 2434714 2354654 2286376 2227353 2187505 2155655 2109913 2071385 2043594 2013297 1975826 1942845
12654 1942845 1902942 1861595 1811323 1760349 1713344 1665982 1623221 1585560 1544961 1512131 1480548
12643 1480548 1447003 1413844 1382507 1361470 1336523 1307352 1287412 1262287 1241129 1225470 1215605
12632 1215605 1201066 1185549 1177969 1172027 1154290 1143059 1127385 1113347 1099950 1081708 1065324 1044498
12620 1044498 1028280 1013095 995358 979210 966042 976551 997317 1012812 1022320 1029563 1019905 982357
$$ packed form
12695E916317k53407k30132k10446j89952j67886j53495j41197j42740j43857
12686D283205j39054j45238j32324j19330j08733r8439q7037q3315o2103p8130
12676C229502q3233p8905p4582o5848o1879p0623o9420p0152p1971p0763p7412
12665B434714q0060o8278n9023l9848l1850m5742l8528k7791l0297l7471l2981
12654A942845l9903m1347n0272n0974m7005m7362m2761l7661m0599l2830l1583
12643A480548l3545l3159l1337k1037k4947k9171j9940k5125k1158j5659r865
12632A215605j4539j5517p580n942j7737j1231j5674j4038j3397j8242j6384k0826
12620A044498j6218j5185j7737j6148j3168J0509K0766J5495R508P243r658l7548
$$ plain form
12608 982357 932193 875355 813905 752021 706242 673307 653003 630286 611898 598319 582789
12597 582789 575108 558336 544034 533773 521785 520754 516118 517667 512573 507909 499071 489236 468889
12584 468889 457438 452037 447012 435889 419397 407586 407613 411589 405907 400798 391769 382432 373660 365587
12570 365587 360503 347144 329790 306938 293096 279231 266846 255415 249448 240424 235957 223439
12558 223439 199656 152825 77466 -37030 -174941 -301652 -394934 -431658 -404502 -340658 -256820
12547 -256820 -145573 -38416 33017 67018 85804 102553 117094 123785 138841 150971 154873
12536 154873 154361 155971 160294 167599 170591 174288 180367 191752 201437 205539 216715 220405 217938 217115
12522 217115 220468 226854 240727 248131 247660 252265 245539 233623 214699 191335 177075 170406 160854
$$ packed form
12608I82357n0164n6838o1450o1884m5779l2935k0304k2717j8388j3579j5530
12597E82789p681j6772j4302j0261j1988j031m636J549n094m664q838r835k0347
12584D68889j1451n401n025j1123j6492j1811K7L976n682n109r029r337q772q073
12570C65587n084j3359j7354k2852j3842j3865j2385j1431n967r024m467j2518
12558B23439k3783m6831p5359j14496j37911j26711r3282l6724K7156O3844Q3838
12547b56820J11247J07157P1433L4001J8786J6749J4541O691J5056J2130L902
12536A54873n12J610M323P305K992L697O079J1385R685M102J1176L690k467q23
12522B17115L353O386J3873P404m71M605o726j1916j8924k3364j4260o669r552
$$ plain form
12509 160854 154917 150370 155832 160145 164454 167027 162402 165045 174979 171792 169776 163664 160346 165260
12495 165260 180467 191240 210864 249912 304178 388141 499067 621330 724446 778048 771456
12484 771456 704886 598691 486517 389843 318057 268001 234117 215238 200657 189590 183305
12473 183305 172747 158670 142376 131746 124951 115403 104384 104219 112343 103453 100271 109010 117975
12460 117975 126203 131984 128325 119839 112385 113168 113329 107960 99805 102389 104298 107378 106454 102745 93082
12445 93082 79054 71881 69179 71582 73856 73211 71290 74835 87986 98676 108257 115296 125860 135362
12431 135362 138458 138853 137201 136308 130128 121620 120312 128276 136165 142419 150755 157330 178749 204744
12417 204744 241110 264049 273188 265696 239424 204690 170791 147562 129934 119568 111723 106722
$$ packed form
12509A60854n937m547N462M313M309K573m625K643R934l187k016o112l318M914
12495A65260J5207J0773J9624L9048N4266Q3963J10926J22263J03116N3602o592
12484G71456o6570j06195j12174r6674p1786n0056l3884j8879j4581j1067o285
12473A83305j0558j4077j6294j0630o795r548j1019j65Q124q890l182Q739Q965
12460A17975Q228N781l659q486p454P83J61n369q155K584J909L080r24l709r663
12445I3082j4028p173k702K403K274o45j921L545J3151J0690R581P039J0564R502
12431A35362L096L95j652q93o180q508j308P964P889O254Q336O575K1419K5995
12417B04744L6366K2939R139p492k6272l4734l3899k3229j7628j0366p845n001
$$ plain form
12405 106722 104627 100430 101167 102744 103355 97329 93301 92573 89369 83621 84262 88005 92779 96263 91780
12390 91780 92770 90203 84730 79162 67958 66760 68096 70578 74206 74230 80615 86743 82843 83060 89549
12375 89549 95203 97980 101831 98213 96528 101515 104427 105694 107899 102327 98352 93239 88783 90244
12361 90244 92513 93581 90741 95970 99150 100138 100384 101858 110804 117794 119321 118426 116469 113722 117090
12346 117090 123718 131313 139438 148125 147325 146238 147251 145374 141457 133905 131542 129784 122520 121551 133272
12331 133272 143837 144217 148860 161627 182415 221136 278683 340904 397977 432976 442872 413463
12319 413463 376186 354634 360537 380870 406017 420502 415603 409456 405642 415216 439147 459470
12307 459470 487519 522096 550366 588955 621044 651622 666534 673193 685510 701850 731605 780439
$$ packed form
12405A06722k095m197P37J577O11o026m028p28l204n748O41L743M774L484m483
12390I1780R90k567n473n568j1204j198J336K482L628K4O385O128l900K17O489
12375H9549N654K777L851l618j685M987K912J267K205n572l975n113m456J461
12361I0244K269J068k840N229L180R88K46J474Q946O990J527q95j957k747L368
12346A17090O628P595Q125Q687q00j087J013j877l917p552k363j758p264r69J1721
12331A33272J0565L80M643J2767K0788L8721N7547O2221N7073L4999R896k9409
12319D13463l7277k1552N903K0333K5147J4485m899o147l814R574K3931K0323
12307D59470K8049L4577K8270L8589L2089L0578J4912O659J2317J6340K9755M8834
$$ plain form
12295 780439 855177 997607 1234077 1577926 1989988 2371354 2668160 2804514 2771432 2640200
12285 2640200 2445803 2151465 1843435 1565877 1303871 1078029 925691 834629 783818 740339
12275 740339 709135 680452 654023 642076 641824 650094 658516 676836 697352 715762 739396 761350
12263 761350 764537 738760 695531 641954 591974 542100 496145 462112 447548 442557 449930 446951
12251 446951 442462 423907 392948 382163 405650 446150 471482 476126 450368 384101 311127 247932
12239 247932 215550 196829 177077 168963 163643 161349 165082 169208 170353 172269 177410 191051 207226
12226 207226 230186 246003 264957 281019 290115 297495 289619 257830 217722 188528 166758 154520
12214 154520 145468 133949 119877 108502 103996 95892 83748 79300 80551 82290 84513 83923 83659 76206
$$ packed form
12295G80439P4738J42430K36470L43849M12062L81366K96806J36354l3082j31232
12285B640200j94397k94338l08030k77558k62006k25842j52338r1062n0811m3479
12275G40339l1204k8683k6429j1947k52Q270Q422J8320K0516J8410K3634K1954
12263G61350L187k5777m3229n3577m9980m9874m5955l4033j4564m991P373k979
12251D46951m489j8555l0959j0785K3487M0500K5332M644k5758o6267p2974o3195
12239B47932l2382j8721j9752q114n320k294L733M126J145J916N141J3641J6175
12226B07226K2960J5817J8954J6062R096P380p876l1789m0108k9194k1770j2238
12214A54520r052j1519j4072j1375m506q104j2144m448J251J739K223n90k64p453
$$ plain form
12200 76206 73384 83159 85774 97041 100847 94255 87287 85924 83437 84518 79320 74591 83098 91236
12186 91236 93648 99714 125187 152477 174859 195839 197517 175465 144123 120897 112214 108934 108211
12173 108211 95885 83128 75755 76368 73745 64046 67852 71549 66593 64644 67256 70886 65678 60837
12159 60837 57091 54210 53605 49728 45367 43908 43686 40625 40290 38900 35207 35821 42052 50625 49751 49930
12143 49930 46817 46249 52745 53467 47366 43008 50478 53105 49377 45032 43985 46833 47190 53227 55265
12128 55265 63326 60519 53693 46073 43387 44197 50537 47459 43186 45825 48104 49915 45403 40867 46062
12113 46062 47470 57771 57407 50385 53989 54662 56037 62976 69565 70959 73723 77237 80165 88163 114676
12098 114676 147333 171761 188309 186857 164757 131728 111082 92803 76218 70216 70842 65185
$$ packed form
12200G6206k822R775K615J1267L806o592o968j363k487J081n198m729Q507Q138
12186I1236K412O066K5473K7290K2382K0980J678k2052l1342k3226q683l280p23
12173A08211j2326j2757p373O13k623r699L806L697m956j949K612L630n208m841
12159F0837l746k881o05l877m361j459k22l061l35j390l693O14O231Q573q74J79
12143D9930l113n68O496P22o101m358P470K627l728m345j047K848L57O037K038
12128E5265Q061k807o826p620k686Q10O340l078m273K639K279J811m512m536N195
12113D6062J408J0301l64p022L604O73J375O939O589J394K764L514K928P998K6513
12098A14676L2657K4428J6548j452k2100l3029k0646j8279j6585o002O26n657
$$ plain form
12086 65185 62896 59599 59803 62651 66352 69136 63528 55278 50859 48756 50169 53045 57321 57992 52597
12071 52597 53513 59222 67896 73619 85571 97944 102689 109790 125171 141051 159963 197540 245321
12058 245321 291876 315624 312210 281406 241534 197958 158169 124158 97102 90082 89463 87318
12046 87318 76392 68583 67125 63726 64501 67207 69049 64031 64320 65625 59456 55482 54230 57739 58755
12031 58755 60673 60333 64542 75959 79485 75101 78002 89901 107755 126646 147227 163116 172546
12018 172546 171770 153533 125378 101961 83187 69169 63677 63001 59682 55586 51011 51668 55072 50870
12004 50870 43273 38507 40018 42995 34548 26882 26323 32315 33402 29212 31379 34749 31218 27299 32109
11989 32109 34655 34480 37724 33625 26500 32608 33558 33076 34657 32943 27364 24151 21588 20584 21777
$$ packed form
12086F5185k289l297K04K848L701K784n608q250m419k103J413K876M276O71n395
12071E2597R16N709Q674N723J1952J2373M745P101J5381J5880J8912L7577M7781
12058B45321M6555K3748l414l0804l9872m3576l9789l4011k7056p020o19k145
12046H7318j0926p809j458l399P75K706J842n018K89J305o169l974j252L509J016
12031E8755J918l40M209J1417L526m384K901J1899J7854J8891K0581J5889R430
12018A72546p76j8237k8155k3417j8774j4018n492o76l319m096m575O57L404m202
12004E0870p597m766J511K977q447p666n59N992J087m190K167L370l531l919M810
11989C2109K546j75L244m099p125O108R50m82J581j714n579l213k563j004J193
$$ plain form
11974 21777 26475 28865 34851 33114 27435 26121 23525 17831 13399 15358 28800 37074 36335 29274
11960 29274 29722 28613 30832 30729 20031 14390 14667 20168 27510 27492 22058 15030 16888 21568 30290
11945 30290 31477 27413 20043 22825 22188 24545 30666 28123 24225 21589 21400 25482 26275 24376 24986
11930 24986 20296 16221 16728 9833 15729 20613 13145 10584 16236 15470 11291 6284 6690 12042 19165
11915 19165 17943 14446 17844 23783 23245 26631 30497 26730 23550 21785 18688 17907 20928 18134 9224
11900 9224 10125 13887 16867 26178 22360 16079 13889 12607 13908 19005 22759 24531 22756 23099 23147 21025
11884 21025 21360 12997 6850 7460 13981 22223 24777 20505 18479 22992 20705 19815 18258 12860 10597
11869 10597 16652 15365 6615 4090 3106 2769 11245 20119 25154 19688 9935 -111 3137 12956 20279
$$ packed form
11974B1777M698K390N986j737n679j314k596n694m432J959J3442Q274p39p061
11960B9274M48j109K219j03j0698n641K77N501P342j8n434p028J858M680Q722
11945C0290J187m064p370K782o37K357O121k543l898k636j89M082P93j899O10
11930B4986m690m075N07o895N896M884p468k561N652p66m179n007M06N352P123
11915A9165j222l497L398N939n38L386L866l767l180j765l097p81L021k794q910
11900I224R01L762K980R311l818o281k190j282J301N097L754J772j775L43M8k122
11884B1025L35q363o147O10O521Q242K554m272k026M513k287q90j557n398k263
11869A0597O055j287q750k525r84l37Q476Q874N035n466r753j0046L248R819P323
$$ plain form
11854 20279 24619 26176 20383 16663 8215 13639 21599 21175 23870 21463 16261 18878 19982 23681 23662
11839 23662 20214 23322 18716 9691 9699 9653 9930 11645 10300 7284 10421 15127 13931 10806 11935 12049
11823 12049 10145 13489 12981 16447 13896 12439 12689 14839 10840 8630 11522 11949 11340 19535 27089
11808 27089 22470 20363 12744 16206 16534 16013 13748 9184 11115 6517 9608 15317 20404 16364 20461
11793 20461 16982 15118 16394 21179 17904 17949 19464 18541 18797 14291 9605 12520 19352 18220 12801
11778 12801 9472 7977 9009 5091 7574 6826 5745 7729 12936 12362 12452 11282 7441 2679 4077
11763 4077 8234 7624 8281 11541 14249 14562 13271 16533 14873 16606 9891 7553 15287 10628 11587 15469
11747 15469 18268 18239 16293 14780 12340 11830 12401 11815 17567 17837 13891 12783 13821 17811 9795 8036
$$ packed form
11854B0279M340J557n793l720q448N424P960m24K695k407n202K617J104L699j9
11839B3662l448L108m606r025Qm6K77J715j345l016L137M706j196l125J129J14
11823A2049j904L344n08L466k551j457K50K150l999k210K892M27o09Q195P554
11808B7089m619k107p619L462L28n21k265m564J931m598L091N709N087m040M097
11793B0461l479j864J276M785l275M5J515r23K56m506m686K915O832j132n419
11778A2801l329j495J032l918K483p48j081J984N207n74R0j170l841m762J398
11763D077M157o10O57L260K708L13j291L262j660J733o715k338P734m659R59L882
11747A5469K799k9j946j513k440n10N71n86N752K70l946j108J038L990q016j759
$$ plain form
11731 8036 14057 14927 10608 9925 13152 10380 5499 5978 6521 14449 17958 12972 8644 6630 4205 3361
11715 3361 3879 3461 11234 19777 21898 15206 1286 2348 8381 12798 18312 16394 13947 10075 7838
11700 7838 5706 1131 2908 10757 14704 17696 18692 12994 8980 11836 8873 7935 8988 14783 19037
11685 19037 23050 11612 -1099 -3906 412 -3158 -7413 -1648 5726 9118 7262 5127 5483 7219
11671 7219 7422 8683 10759 13013 14071 9692 9506 10572 12891 18696 21272 18492 14804 15422 11343
11656 11343 12103 9791 11420 17978 21913 22627 21035 17692 17270 20177 11574 8917 5981 4783 7852
11641 7852 9121 7409 7110 845 -24 7695 6427 12191 19216 19810 12062 2891 2194 2658 2229 1565
11625 1565 -1099 -983 3911 12852 9639 7999 11553 14764 17330 17231 9034 7962 8671 11686 11420 13169
$$ packed form
11731H036O021Q70m319o83L227k772m881M79N43P928L509m986m328k014k425q44
11715C361N18m18P773Q543K121o692j3920J062O033M417N514j918k447l872k237
11700G838k132m575J777P849L947K992R96n698m014K856k963r38J053N795M254
11685A9037M013j1438j2711k807M318l570m255N765P374L392j856k135L56J736
11671G219K03J261K076K254J058m379j86J066K319N805K576k780l688O18m079
11656A1343P60k312J629O558L935P14j592l343m22K907q603k657k936j198L069
11641G852J269j712k99o265q69P719j268N764P025N94p748r171o97M64m29o64
11625A565k664J16M894Q941l213j640L554L211K566r9q197j072P09L015k66J749
$$ plain form
11609 13169 13471 13225 12026 6368 5280 3103 8658 12089 10471 9376 13951 12294 -251 -3359 -3171
11594 -3171 -1947 -2923 3333 7259 9070 15159 12674 7745 14815 12453 8278 12781 9925 4223 -145
11579 -145 -901 6255 9376 5594 1720 2462 8470 15036 16893 15474 18532 20833 19213 14614 14135 6804
11563 6804 4716 8903 13318 7338 12370 7161 -2325 -8483 -3101 -33 -1466 9 2950 3367 4564
11548 4564 10242 12847 14901 20060 19484 22060 20118 15270 15048 16148 13837 19672 19949 17110 21262
11533 21262 22446 22281 19497 17108 14110 6233 4848 1760 -5980 -4673 3780 3341 3010 4090 4953
11518 4953 10011 12000 11952 15809 16964 19432 16096 17456 17744 14597 15573 13557 15826 17599 11367 11731
11502 11731 12622 11762 14897 11200 7786 8097 1499 3381 1724 -370 -1619 -1970 -5404 -4488 -12183 -10482
$$ packed form
11609A3169L02k46j199n658j088k177N555L431j618j095M575j657j2545l108J88
11594c171J224r76O256L926J811O089k485m929P070k362m175M503k856n702m368
11579a45p56P156L121l782l874P42O008O566J857j419L058K301j620m599m79p331
11563F804k088M187M415n980N032n209r486o158N382L068j433J475K941M17J197
11548D564N678K605K054N159n76K576j942m848k22J100k311N835K77k839M152
11533B1262J184j65k784k389k998p877j385l088p740J307Q453m39l31J080Q63
11518D953N058J989m8L857J155K468l336J360K88l147R76k016K269J773o232L64
11502A1731Q91q60L135l697l414L11o598J882j657k094j249l51l434R16p695J701
$$ plain form
11486 -10482 2719 15410 25443 26952 18165 16842 18902 15339 11882 18118 18607 12519 11257 11772
11472 11772 7024 11030 12026 13466 15287 13627 11963 -837 -901 -152 5521 8325 358 4698 9514
11457 9514 7588 10050 11251 10333 622 2180 13406 8919 4377 6599 3796 3094 5424 9534 8402
11442 8402 10577 15617 17979 14877 13946 11145 9074 8273 7998 10448 9916 11683 7522 3033 3291 3903
11426 3903 7261 8156 11147 12101 14612 14658 18627 9868 6205 11589 16120 10793 8193 5450 -833 2678
11410 2678 5899 2444 6667 4825 2179 2648 7643 12166 19265 18712 12688 10102 9051 5970 8916
11395 8916 13088 16372 14088 11161 5406 -746 -2753 -4361 1339 1856 -1653 -2340 -1682 6082 8990
11380 8990 5462 7708 11380 14048 19705 9813 7134 6842 6377 7371 8089 11547 12598 13738 17050 17743
$$ packed form
11486a0482J3201J2691J0033J509q787j323K060l563l457O236M89o088j262N15
11472A1772m748M006R96J440J821j660j664j2800o4P49N673K804p967M340M816
11457I514j926K462J201r18r711J558J1226m487m542K222k803p02K330M110j132
11442H402K175N040K362l102r31k801k071q01k75K450n32J767m161m489K58O12
11426C903L358Q95K991R54K511M6L969q759l663N384M531n327k600k743o283L511
11410B678L221l455M223j842k646M69M995M523P099n53o024k586j051l081K946
11395H916M172L284k284k927n755o152k007j608N700N17l509o87O58P764K908
11380H990l528K246L672K668N657r892k679k92m65R94P18L458J051J140L312O93
$$ plain form
11364 17743 14204 15544 10817 9432 4010 3595 9615 16838 15099 13993 16287 20773 25060 21254 19244
11349 19244 19839 8810 5964 6804 12435 9157 14780 17073 16965 18843 16599 10663 8316 6267 5912
11334 5912 3321 1522 2560 -6077 -1341 4650 11796 10638 12978 21134 20197 12922 11380 21623 21487
11319 21487 14047 7906 1835 18 1841 5426 5185 1221 4052 5781 1730 413 -2045 2212 8641
11304 8641 11018 10468 11254 12468 9566 8834 8323 16895 17789 11642 15912 16715 11781 9906 8728 6549
11288 6549 8719 1148 -4415 -3101 4001 8642 2926 83 -5223 -3460 5437 2479 -1503 -3942 -3415
11273 -3415 -1360 6550 13072 7079 -2392 -2335 899 6181 9269 13763 13133 14323 16348 15701 12184 8345
11257 8345 8389 8400 3277 6533 13381 17559 21721 24400 18054 12301 17844 16017 17890 16880 9450 2385
$$ packed form
11364A7743l539J340m727j385n422m15O020P223j739j106K294M486M287l806k010
11349A9244N95j1029k846Q40N631l278N623K293j08J878k244n936k347k049l55
11334E912k591j799J038q637M736N991P146j158K340Q156r37p275j542J0243j36
11319B1487p440o141o071j817J823L585k41l964K831J729m051j317k458M257O429
11304H641K377n50P86J214k902p32n11Q572Q94o147M270Q03m934j875j178k179
11288F549K170p571n563J314P102M641n716k843n306J763Q897k958l982k439N27
11273c415K055P910O522n993r471N7L234N282L088M494o30J190K025o47l517l839
11257H345M4J1n123L256O848M178M162K679o346n753N543j827J873j010p430p065
$$ plain form
11241 2385 6933 14875 10432 13063 20696 14839 8700 8704 7279 2486 3397 8902 14977 18298 12179 7888
11225 7888 9594 4547 2125 5209 10992 7731 -2549 -3491 8383 17551 14776 8846 2892 1021
11211 1021 5456 4011 2692 9273 6136 1880 4883 6992 14046 12361 10607 14376 9979 10684 13101
11196 13101 7868 12683 10787 9711 14544 19511 18715 10240 6850 8543 6003 5803 9628 8533 9607
11181 9607 10973 13815 13369 10618 15272 17623 17118 9744 12407 11130 6765 3358 9224 10213 10828 5837
11165 5837 4865 14811 9636 3767 7763 10963 9579 8956 11809 14072 7836 3941 5543 9929 9536
11150 9536 4234 3105 -4 6095 7493 13917 14604 11973 13536 10564 9163 9658 8057 6513 6187
11135 6187 13086 14954 16208 21925 18199 6228 2798 5333 3840 6233 10997 7896 7204 506 3165
$$ packed form
11241B385M548P942m443K631P633n857o139Mj425m793R11N505O075L321o119m291
11225G888J706n047k422L084N783l261j0280r42J1874R168k775n930n954j871
11211A021M435j445j319O581l137m256L003K109P054j685j754L769m397P05K417
11196A3101n233M815j896j076M833M967p96q475l390J693k540k00L825j095J074
11181I607J366K842m46k751M654K351n05p374K663j277m365l407N866R89O15m991
11165E837r72R946n175n869L996L200j384o23K853K263o236l895J602M386l93
11150I536n302j129l109O099J398O424O87k631J563k972j401M95j601j544l26
11135F187O899J868J254N717l726j1971l430K535j493K393M764l101o92o698K659
$$ plain form
11120 3165 6567 10942 14271 13153 6933 4853 4831 8847 9059 5813 8255 5117 -2267 -6213 -2310
11105 -2310 9500 20267 21690 20392 18677 17250 16378 12572 15135 19143 13619 7901 11544 14764
11091 14764 12946 15628 21172 21435 19360 12933 9704 8014 8763 3242 6462 7214 3132 2540 2862 4144
11075 4144 7532 6826 6351 10157 17883 19384 14205 12396 17829 23645 19733 15426 11543 12448 12353 13720
11059 13720 20225 27327 16696 13845 17117 12750 12640 16377 16339 10246 449 -5964 -6086 1876 -712
11044 -712 -3226 -1122 714 7642 9711 10757 5114 4919 5954 5532 8737 7343 7736 13453 12604 8157
11028 8157 6892 5693 3703 5581 10492 18193 21555 15073 11789 4488 -1789 -1973 8700 14716 19890
11013 19890 24223 22845 24173 19393 16061 15222 17366 14176 12902 14093 11502 11191 9637 8755 10199
$$ packed form
11120C165L402M375L329j118o220k080k2M016K12l246K442l138p384l946L903
11105b310J1810J0767J423j298j715j427q72l806K563M008n524n718L643L220
11091A4764j818K682N544K63k075o427l229j690P49n521L220P52m082n92L22J282
11075D144L388p06m75L806P726J501n179j809N433N816l912m307l883R05r5J367
11059A3720O505P102j0631k851L272m367j10L737l8o093r797o413j22P962k588
11044g12k514K104J836O928K069J046n643j95J035m22L205j394L93N717q49m447
11028H157j265j199j990J878M911P701L362o482l284p301o277j84J0673O016N174
11013A9890M333j378J328m780l332q39K144l190j274J191k591l11j554q82J444
$$ plain form
10998 10199 4890 6243 6412 8995 14227 9121 15378 21268 19285 13823 15464 8609 9483 9257 11496
10983 11496 9612 3552 2888 4611 1425 3002 -2719 2407 947 -741 10024 13798 9421 14531
10969 14531 16760 16192 12032 16769 17328 12406 12999 15235 19624 13750 8011 12279 16246 7864 9038
10954 9038 8653 11152 11667 11430 10868 12531 14645 25033 24115 18491 9556 4307 3430 4953 9350 9591
10938 9591 2902 3781 5556 8183 10881 7291 6546 7988 8794 5482 5649 4199 10093 10508 11327 5733
10922 5733 5575 12570 14288 16764 18252 19110 19957 24593 20148 20301 21077 21430 16865 17246 14993 6691
10906 6691 -980 -28 12486 16009 6940 -1312 -2256 2240 9613 8012 6612 7759 10843 15430 9883
10891 9883 -3036 1359 -427 -2053 18 1385 2291 7435 10326 10479 2463 3589 5799 11849 13935
$$ packed form
10998A0199n309J353J69K583N232n106O257N890j983n462J641o855Q74k26K239
10983A1496j884o060o64J723l186J577n721N126j460j688J0765L774m377N110
10969A4531K229n68m160M737N59m922N93K236M389n874n739M268L967q382J174
10954I038l85K499N15k37n62J663K114J0388r18n624q935n249q77J523M397K41
10938I591o689Q79J775K627K698l590p45J442Q06l312J67j450N894M15Q19n594
10922E733j58O995J718K476J488Q58Q47M636m445J53P76L53m565L81k253q302
10906F691p671R52J2514L523r069q252r44M496P373j601j400J147L084M587n547
10891I883j2919M395j786j626K071J367R06N144K891J53q016J126K210O050K086
$$ plain form
10876 13935 10298 3367 -1519 4801 5404 -395 -1390 -492 -1983 -1302 2504 9514 11062 11227 10732 -1062
10860 -1062 -6074 -2155 -4526 1578 3115 8643 17251 18175 11012 8780 4389 5022 4813 5457 -345 -339
10844 -339 965 5109 3127 1800 3459 2517 3350 4610 9041 7119 6637 8402 8463 19 5835 4490
10828 4490 4262 3446 3886 1916 -2482 -1815 5702 12164 8247 7636 3728 1797 2161 2096 7393 12259 14449
10811 14449 17236 14222 12337 9711 8103 7705 4941 7264 11748 13623 9707 8230 6215 1013 -1393
10796 -1393 374 -3046 49 686 1318 8200 12022 6673 -2616 -8089 -811 6662 4434 604 2022
10781 2022 10215 14929 17240 17730 15649 15285 14547 14947 6242 7366 8453 6861 5743 363 2084 6876
10765 6876 7241 186 -2892 2771 4440 -2523 -14107 -3343 5250 11195 11714 12058 8035 2621 -278
$$ packed form
10876A3935l637o931m886O320O03n799r95Q98j491O81L806P010J548J65m95j1794
10860a062n012L919k371O104J537N528Q608R24p163k232m391O33k09O44n802O
10844c39J304M144j982j327J659r42Q33J260M431j922m82J765O1q444N816j345
10828D490k28q16M40j970m398O67P517O462l917o11l908j931L64o5N297M866K190
10811A4449K787l014j885k626j608l98k764K323M484J875l916j477k015n202k406
10796a393J767l420L095O37O32O882L822n349r289n473P278P473k228l830J418
10781B022Q193M714K311M90k081l64p38M00q705J124J087j592j118n380J721M792
10765F876L65p055l078N663J669o963j1584J0764Q593N945N19L44m023n414k899
$$ plain form
10750 -278 2459 -443 461 5875 9243 6962 2980 -2200 -955 -2282 -3458 -3728 -8188 -8155 -7546 -6210
10734 -6210 -6794 -13372 -11230 -5303 -3442 -5709 -9315 -4774 -1832 -7522 787 -967 -684 7139 10508
10719 10508 10357 14695 15243 5146 -381 1171 550 -4849 -4006 -2652 -2711 -3638 -949 -10123 -5907 466
10703 466 5296 1798 2109 -478 3843 11308 5801 -1005 4338 7069 6523 12983 16864 11158 10628 5437
10687 5437 469 2501 9291 9590 8777 9870 3984 2775 3029 5797 3380 1984 7659 7656 5945 11890
10671 11890 8740 4292 1244 -1858 -4577 -1177 2341 5323 4709 12115 20134 16248 11117 7834 6104
10656 6104 4509 5748 4774 -1789 2282 6105 2828 4422 14281 17004 17164 17760 12986 9723 9224 9934
10640 9934 16646 19110 17338 11622 11694 5455 -2984 -4421 2449 5303 1731 -333 4655 14463 17064
$$ packed form
10750b78K737k902R04N414L368k281l982n180J245j327j176k70m460L3O09J336
10734f210n84o578K142N927J861k267l606M541K942n690Q309j754K83P823L369
10719A0508j51M338N48j0097n527J552o21n399Q43J354n9r27K689r174M216O373
10703D66M830l498L11k587M321P465n507o806N343K731n46O460L881n706n30n191
10687E437m968K032O790K99q13J093n886j209K54K768k417j396N675lj711N945
10671A1890l150m448l048l102k719L400L518K982o14P406Q019l886n131l283j730
10656F104j595J239r74o563M071L823l277J594R859K723J60N96m774l263m99P10
10640I934O712K464j772n716P2o239q439j437O870K854l572k064M988R808K601
$$ plain form
10625 17064 14577 15666 16377 18246 26654 24560 17195 15383 18957 15270 17116 21380 23935 15972 5211
10610 5211 11073 16272 13224 8722 11214 7920 5237 8535 9528 7944 15317 6952 9672 16141 14493
10595 14493 13243 12742 11793 10801 11617 11961 16735 16169 13144 15366 17706 19819 16472 6306 5757 9446
10579 9446 14855 12691 9334 7588 10234 21880 21231 18443 18942 19179 16946 21556 16539 14903 16678
10564 16678 16869 18722 15744 15668 16808 19308 19794 17429 13279 7305 14787 17341 10501 11856 9254
10549 9254 8881 772 -2077 -1116 1262 5217 2330 2023 1274 4378 -2782 -6142 -1721 -3528 2868 11214
10533 11214 7020 2000 3635 7339 8406 11922 11484 14396 15667 19444 20305 15823 14981 8486 6493
10518 6493 7514 5023 11636 14076 12571 8351 4767 10877 13807 12911 7809 10259 14541 14394 20485
$$ packed form
10625A7064k487J089P11J869Q408k094p365j812L574l687J846M264K555p963j0761
10610E211N862N199l048m502K492l294k683L298R93j584P373q365K720O469j648
10595A4493j250n01r49r92Q16L44M774n66l025K222K340K113l347j0166n49L689
10579I446N409k164l357j746K646J1646o49k788M99K37k233M610n017j636J775
10564A6678J91J853k978p6J140K500M86k365m150n974P482K554o840J355k602
10549I254l73q109k849R61K378L955k887l07p49L104p160l360M421j807O396Q346
10533A1214m194n020J635L704J067L516m38K912J271L777Q61m482q42o495j993
10518F493J021k491O613K440j505m220l584O110K930q96n102K450M282j47O091
$$ plain form
10503 20485 19209 15750 16739 12550 2788 9026 10877 15510 14329 14067 17512 17936 15067 15227 14342 13209
10487 13209 16765 16670 16434 11241 13803 11141 9155 8472 11135 7118 7382 5794 3833 10871 14339 12192
10471 12192 13752 15192 9446 7097 1513 5832 10745 7318 638 1585 7595 10161 10074 13810 19099
10456 19099 17373 16905 13156 11707 9666 6515 6715 2638 4829 1842 -2900 -267 1106 -1603 -4321
10441 -4321 -4359 1264 964 -240 6464 824 -309 1281 -2055 -8368 -7488 -3255 377 -1269 -4144 -6080
10425 -6080 -7866 -6177 516 7544 2287 -94 725 876 -2551 -5117 -9844 -12176 -12554 -8027 -2415
10410 -2415 2637 7230 10775 11254 7702 3683 -2602 -2419 -4521 -1868 4324 8782 7566 -1803 594
10395 594 10834 10748 4523 879 571 4297 4530 -3936 -6882 -4685 -3119 -2387 -818 -1138 1651 10517
$$ packed form
10503B0485j276l459R89m189r762O238J851M633j181k62L445M24k869J60q85j133
10487A3209L556r5k36n193K562k662j986o83K663m017K64j588j961P038L468k147
10471A2192J560J440n746k349n584M319M913l427o680R47O010K566q7L736N289
10456A9099j726m68l749j449k041l151K00m077K191k987m742K633J373k709k718
10441d321l8N623l00j204O704n640j133J590l336o313Q80M233L632j646k875j936
10425f080j786J689O693P028n257k381Q19J51l427k566m727k332l78M527N612
10410b415N052M593L545M79l552m019o285J83k102K653O192M458j216r369K397
10395E94J0240q6o225l644l08L726K33q466k946K197J566P32J569l20K789Q866
$$ plain form
10379 10517 8620 684 -442 -2873 -4294 -1263 -2315 -1537 382 6248 11742 10344 5410 -1743 468
10364 468 2344 3057 -2366 -9586 -6677 -2871 -8151 -11446 -10545 -7439 -3132 3121 4211 7477 4354
10349 4354 3917 5321 7822 937 -720 7165 14317 9805 7548 10960 13736 12030 9273 6388 5201
10334 5201 9089 4244 -2375 -5427 -4797 134 1820 -648 -169 2257 6240 6290 5264 5374 1998 3722
10318 3722 4951 5511 1447 -2593 -2876 -5077 4739 4723 -1846 -2510 -41 -3465 -1825 3256 112 2591
10302 2591 7788 6835 8076 9739 14108 15587 12283 16289 22548 23257 25743 29079 32035 28945 30286
10287 30286 27292 22602 16830 11689 10894 9562 7138 6540 6620 9876 13025 9575 2153 5288 756
10272 756 -6732 -4488 -3183 -81 -1296 -9476 -13730 -10126 -1228 2191 3041 -1818 -3953 -2652 2158
$$ packed form
10379A0517j897p936j126k431j421L031j052P78J919N866N494j398m934p153K211
10364D68J876P13n423p220K909L806n280l295R01L106M307O253J090L266l123
10349D354m37J404K501o885j657P885P152m512k257L412K776j706k757k885j187
10334E201L888m845o619l052O30M931J686k468M79K426L983N0j026J10l376J724
10318C722J229N60m064m040k83k201R816j6o569o64K469l424J640N081l144K479
10302B591N197r53J241J663M369J479l304M006O259P09K486L336K956l090J341
10287C0286k994m690n772n141p95j332k424n98Q0L256L149l450p422L135m532
10272G56p488K244J305L102j215q180m254L604Q898L419Q50m859k135J301M810
$$ plain form
10257 2158 7512 11087 12025 7577 10660 14233 13888 7986 1172 8590 11302 5321 2786 2063 3743
10242 3743 2599 -476 -284 1910 1378 -149 -6344 84 4977 1150 3382 10148 9194 8995 11646 11769
10226 11769 7609 698 1465 4439 3733 9238 9059 11456 12197 11750 12053 12317 11514 7558 8664 11478
10210 11478 10863 14367 15208 7260 4566 10576 11822 5717 10206 11596 13766 15713 10983 6718 10159
10195 10159 8786 2363 3305 4765 8861 11396 16176 13538 9494 13415 16396 19750 18028 12469 13259
10180 13259 18889 24953 32004 44699 60997 74387 90120 104722 116216 125519 127139 118520 108314
10167 108314 102541 90719 83659 70941 51187 36144 28210 21057 14769 13372 9685 12241 14921
10154 14921 12513 11964 15526 16089 13286 4928 5526 9142 15341 13142 9637 10778 2759 1866 2616 10056
$$ packed form
10257B158N354L575R38m448L083L573l45n902o814P418K712n981k535p23J680
10242C743j144l075J92K194n32j527o195O428M893l827K232O766r54j99K651J23
10226A1769m160o911P67K974p06N505j79K397P41m47L03K64q03l956J106K814
10210A1478o15L504Q41p948k694O010J246o105M489J390K170J947m730m265L441
10195A0159j373o423R42J460M096K535M780k638m044L921K981L354j722n559P90
10180A3259N630O064P051J2695J6298J3390J5733J4602J1494R303J620q619j0206
10167A08314n773j1822p060j2718j9754j5043p934p153o288j397l687K556K680
10154A4921k408n49L562N63k803q358N98L616O199k199l505J141q019q93P50P440
$$ plain form
10138 10056 15591 17307 4631 -3753 -4510 -2123 3112 4656 4695 271 -211 4272 6916 13058 13073 8199
10122 8199 3863 -2392 -4568 -2057 -2985 532 8242 8547 -162 -7450 -5391 -12668 -14902 -6256 -183
10107 -183 6671 4851 10022 6592 1262 1012 955 2939 2355 -2842 -6443 -1224 4664 8381 8544 7083
10091 7083 1740 6359 12370 21112 21919 17365 11574 3663 -2254 -4419 -10943 -16003 -13015 -4610 6744
10076 6744 13134 13545 -612 -2894 137 6146 6151 4472 1354 9577 3510 -6041 -1855 -1144 8919
10061 8919 14785 7875 1172 254 3097 4502 3193 -3965 -1197 -727 3563 6433 8075 2915 4007
10046 4007 7344 4265 852 5880 6993 7180 6610 4801 7001 11745 14122 12298 11260 6657 1240
10031 1240 2583 -2379 1304 7141 3740 -448 -2364 -4641 -417 2435 9063 6469 -1134 -7605 -4024
$$ packed form
10138A0056N535J716j2676q384p57K387N235J544L9m424m82M483K644O142J5m874
10122H199m336o255k176K511r28L517P710L05q709p288K059p277k234Q646O073
10107a83O854j820N171l430n330k50n7J984n84n197l601N219N888L717J63j461
10091G083n343M619O011Q742Q07m554n791p911n917k165o524n060K988Q405J1354
10076F744O390M11j4157k282L031O009Nj679l118Q223o067r551M186P11J0063
10061H919N866o910o703r18K843J405j309p158K768M70M290K870J642n160J092
10046D007L337l079l413N028J113J87n70j809K200M744K377j824j038m603n417
10031A240J343m962L683N837l401m188j916k277M224K852O628k594p603o471L581
$$ plain form
10016 -4024 2520 -3261 -3062 -6206 -4704 -2468 -6838 1456 6687 3633 -2667 -5390 -11269 -16140 -13494
10001 -13494 -7894 -4117 -3398 -1478 -995 -8971 -7925 -3292 1156 10030 19469 20364 10285 2938 1296
9986 1296 -210 -3574 -5289 -1946 -2846 -8403 -9880 -716 5287 -1454 -7733 -6138 -11124 -5927 -5188
9971 -5188 -5365 -2296 -3714 851 -1291 -3555 -5853 -5226 1813 -2312 -1796 4037 7516 805 1511 5958
9955 5958 4993 415 4451 12643 12669 10694 6346 2081 6286 2344 3035 -2838 -1194 4297 5233 7719
9939 7719 5771 2795 3734 3577 3986 4279 9951 19572 19610 19802 17242 13033 11348 8718 -499 -3616 294
9922 294 4041 1164 4015 6297 4456 2120 6178 4656 3864 2662 5974 11968 9313 4234 -3580
9907 -3580 -10256 -6356 -4527 -3007 -3045 -5037 1327 3066 1830 5397 6279 8156 10043 10200 8889 11996
$$ packed form
10016d024O544n781J99l144J502K236m370Q294N231l054o300k723n879m871K646
10001a3494N600L777P19J920M83p976J046M633M448Q874R439Q95j0079p347j642
9986A296j506l364j715L343r00n557j477R164O003o741o279J595m986N197P39
9971e188j77L069j418M565k142k264k298O27P039m125N16N833L479o711P06M447
9955E958r65m578M036Q192K6j975m348m265M205l942O91n873J644N491R36K486
9939G719j948k976R39j57M09K93N672R621L8J92k560m209j685k630r217l117L910
9922B94L747k877K851K282j841k336M058j522p92j202L312N994k655n079p814
9907c580o676L900J829J520l8j992O364J739j236L567Q82J877J887J57j311L107
$$ plain form
9891 11996 16085 8001 1035 6164 1747 -1791 -3559 -1030 5947 12051 17085 10731 10703 10014 7607
9876 7607 10634 8470 4640 5573 5102 2819 6207 1537 -6164 -7530 -5031 1982 -822 -4598 -5193 -2296
9860 -2296 3925 6891 4395 239 -953 -5726 -3781 -3982 -24 11479 14144 9545 7932 9312 11406
9845 11406 10161 5470 3982 2849 1598 -4120 -4172 -892 -307 10195 13903 14925 12180 3119 6809
9830 6809 2524 -5339 -7139 327 6055 7635 4562 4956 13657 15730 20171 23834 16746 3729 2842
9815 2842 9457 14536 20139 19524 12161 10578 11145 17164 21478 22296 17473 12360 12381 13673 14779 9184
9799 9184 7343 6542 6463 9990 18059 13922 12216 17729 20559 15227 9572 9566 12661 7727 9847 20869
9783 20869 23905 27585 35805 35684 34235 33612 34540 34597 28549 20375 16197 17096 23047 23250 14677 7301
$$ packed form
9891A1996M089q084o966N129m417l538j768K529O977O104N034o354k8o89k407
9876G607L027k164l830R33m71k283L388m670p701j366K499P013k804l776n95K897
9860b296O221K966k496m156j192m773J945k01L958J1503K665m599j613J380K094
9845A1406j245m691j488j133j251n718n2L280N85J0502L708J022k745r061L690
9830F809m285p863j800P466N728J580l073L94Q701K073M441L663p088j3017q87
9815B842O615N079N603o15p363j583N67O019M314Q18m823n113K1J292J106n595
9799I184j841q01p9L527Q069m137j706N513K830n332n655oL095m934K120J1022
9783B0869L036L680Q220j21j449o23R28N7o048q174m178Q99N951K03q573p376
$$ plain form
9767 7301 10543 19851 25728 25595 25221 20817 16627 22744 26260 34485 41735 38045 40610 44716 53701
9752 53701 59992 60765 58562 57897 58735 51080 39411 42087 45464 44742 48787 65695 80807 88359 106539
9737 106539 133670 165481 202138 259042 307958 330740 327567 299805 265215 238813 226484 230976
9725 230976 239686 244562 238305 231021 223886 245242 273391 311903 362647 403968 430819 446770 450806
9712 450806 453845 443795 428158 410425 385871 367900 350057 334677 340805 353724 363425 381216
9700 381216 406415 440857 488053 574688 711706 870738 999347 1045520 985131 830255 655025
9689 655025 527866 445798 408626 395643 386971 371745 357182 345755 354860 370138 388738 408285
9677 408285 433294 462896 481760 491722 487225 471900 452900 417443 373797 328242 293297 266363
$$ packed form
9767G301L242R308N877j33l74m404m190O117L516Q225P250l690K565M106Q985
9752E3701O291P73k203o65Q38p655j1669K676L377p22M045J6908J5112P552J8180
9737A06539K7131L1811L6657N6904M8916K2782l173k7762l4590k6402j2329M492
9725B30976Q710M876o257p284p135K1356K8149L8512N0744M1321K6851J5951M036
9712D50806L039j0050j5637j7733k4554j7971j7843j5380O128J2919R701J7791
9700C81216K5199L4442M7196Q6635J37018J59032J28609M6173o0389j54876j75230
9689F55025j27159q2068l7172j2983q672j5226j4563j1427R105J5278J8600J9547
9677D08285K5009K9602J8864R962m497j5325j9000l5457m3646m5555l4945k6934
$$ plain form
9665 266363 256133 265530 278038 280863 276721 271905 264802 276771 307875 344694 361410 348489 322025
9652 322025 276855 239912 207222 182116 165470 156978 145583 132990 120133 109038 109934 112747
9640 112747 108977 109228 118048 120116 120161 115936 102618 97021 89402 85865 81093 76527 72753 68432 62820
9625 62820 69333 81088 80878 86559 84607 83629 81896 78199 72217 73314 80138 80503 87769 92057 96627
9610 96627 99972 100056 107189 116858 119104 117026 114289 114534 110271 104899 102944 101208 98575 95964 93456
9595 93456 92204 83438 78148 71736 67224 66451 64024 64138 62629 65041 67164 68041 66745 69326 77691
9580 77691 82341 81417 79064 75925 74005 74401 69568 56514 56297 60074 57631 55042 65774 75912 84882
9565 84882 102072 117130 117719 119470 120907 114359 107899 106771 105612 104761 109529 115587 121198 132952
$$ packed form
9665B66363j0230R397J2508K825m142m816p103J1969L1104L6819J6716j2921k6464
9652C22025m5170l6943l2690k5106j6646q492j1395j2593j2857j1095Q96K813
9640A12747l770K51Q820K068M5m225j3318n597p619l537m772m566l774m321n612
9625F2820O513J1755k10N681j952r78j733l697n982J097O824L65P266M288M570
9610I6627L345Q4P133R669K246k078k737K45m263n372j955j736k633k611k508
9595I3456j252q766n290o412m512p73k427J14j509K412K123Q77j296K581Q365
9580G7691M650r24k353l139j920L96m833j3054k17L777k443k589J0732J0138Q970
9565H4882J7190J5058N89J751J437o548o460j128j159q51M768O058N611J1754
$$ plain form
9551 132952 133852 121927 111008 106049 106520 103640 92953 81740 82099 86969 83686 78074 82391 100122
9537 100122 114329 109613 98757 92722 85410 74123 63542 62105 65072 61407 59714 68726 75977
9524 75977 72734 75475 83681 88951 101120 104899 102077 95655 93719 97223 107103 121858 143637 155766
9510 155766 171766 178310 169213 161489 155451 145964 128299 114683 110637 111805 111387 109677 113331 119270
9496 119270 116300 115120 111621 113686 116503 111824 108935 110238 107459 109644 111312 107972 103591 106062
9482 106062 105355 103413 105241 108495 116212 122275 125849 129291 134505 144514 157918 161847 170578 172259
9468 172259 168577 167833 167059 161207 168671 180834 191246 195854 196634 192565 190260 191074 187221 186306 185816
9453 185816 193419 196524 194223 201692 216818 227348 235997 242724 247676 252399 262095 268156 274199 280572
$$ packed form
9551A32952R00j1925j0919m959M71k880j0687j1213L59M870l283n612M317J7731
9537A00122J4207m716j0856o035p312j1287j0581j437K967l665j693R012P251
9524G5977l243K741Q206N270J2169L779k822o422j936L504R880J4755K1779J2129
9510A55766J6000O544r097p724o038r487j7665j3616m046J168m18j710L654N939
9496A19270k970j180l499K065K817m679k889J303k779K185J668l340m381K471
9482A06062p07j942J828L254P717O063L574L442N214J0009J3404L929Q731J681
9468A72259l682p44p74n852P464J2163J0412M608P80m069k305Q14l853r15m90
9453A85816P603L105k301P469J5126J0530Q649O727M952M723R696O061O043O373
$$ plain form
9439 280572 288374 298587 308435 320458 331448 329801 334590 352132 362327 367538 375407 390737 404882
9426 404882 414211 416355 419028 422392 430957 449019 469355 477443 482257 478107 476976 476078 479513 478970
9412 478970 477336 484859 488497 483636 487318 491438 490923 488261 478446 473152 467680 465014 462194 456587 456273
9397 456273 449684 444145 429312 408487 395321 382580 374368 367444 356225 332995 316753 304421
9385 304421 309127 306376 301660 296418 285468 276601 272646 268604 266232 263563 260955 263467 262866 257218
9371 257218 260806 261714 259521 251258 247749 252110 250774 256814 255974 263013 263731 255300 243700 229294 210306
9356 210306 195760 195184 186554 180630 170282 162188 161685 162662 159422 159496 157215 153201 150843 145687 136154
9341 136154 144088 159019 159520 156229 158527 157253 157985 156535 156735 148262 137287 135417 140070 143135 143202
$$ packed form
9439B80572P802J0213R848J2023J0990j647M789J7542J0195N211P869J5330J4145
9426D04882R329K144K673L364Q565J8062K0336Q088M814m150j131q98L435n43
9412D78970j634P523L638m861L682M120n15k662r815n294n472k666k820n607l14
9397D56273o589n539j4833k0825j3166j2741q212o924j1219k3230j6242j2332
9385C04421M706k751m716n242j0950q867l955m042k372k669k608K512o01n648
9371B57218L588R08k193q263l509M361j336O040q40P039P18q431j1600j4406j8988
9356B10306j4546n76q630n924j0348q094n03R77l240P4k281m014k358n156r533
9341A36154P934J4931N01l291K298j274P32j450K00q473j0975j870M653L065O7
$$ plain form
9326 143202 142615 142363 143604 145442 146909 145396 143590 150078 149066 140192 131841 123300 126646 134655 134846
9311 134846 136973 139732 141539 141467 135955 120173 109365 99085 92553 89216 91094 94005 89488 89230
9297 89230 82569 83536 79656 78680 78472 76228 69629 74593 76387 71352 63755 58925 59540 70430 67403
9282 67403 62389 70702 78114 81933 89067 94771 91792 93380 102128 104986 99589 89984 86846 83377 77977
9267 77977 78875 75369 70646 67935 65848 61610 56653 56732 50539 41542 41162 47391 39996 29041 26863
9252 26863 25002 32831 47710 50995 50121 52259 49800 38731 32964 33394 35593 34199 32129 35575 41640
9237 41640 38769 29733 23123 29365 27766 21068 19765 20253 22788 24169 30771 33768 35958 30822 25018
9222 25018 25121 26331 14935 12352 11175 8718 3972 5324 3851 4222 7429 12582 13427 17647 22094
$$ packed form
9326A43202n87k52J241J838J467j513j806O488j012q874q351q541L346Q009J91
9311A34846K127K759J807p2n512j5782j0808j0280o532l337J878K911m517k58
9297H9230o661R67l880r76k08k244o599M964J794n035p597m830O15J0890l027
9282F7403n014Q313P412L819P134N704k979J588Q748K858n397r605l138l469n400
9267G7977Q98l506m723k711k087m238m957P9o193q997l80O229p395j0955k178
9252B6863j861P829J4879L285q74K138k459j1069n767M30K199j394k070L446O065
9237D1640k871r036o610O242j599o698j303M88K535J381O602K997K190n136n804
9222B5018J03J210j1396k583j177k457m746J352j473L71L207N153Q45M220M447
$$ plain form
9207 22094 23457 20524 18015 18757 14385 9965 19353 21182 24886 24316 26493 19709 14388 18706 23396
9192 23396 24729 27674 32313 29938 32325 42818 58621 80571 115849 173142 232612 261627 271367
9179 271367 224995 147369 90926 66147 56007 48696 40141 29983 29664 30309 25536 23638 24744
9166 24744 20981 19198 23785 14336 14018 13512 16780 17623 13930 14147 12520 17929 21797 15695 10544 15765
9150 15765 18452 19028 15852 12847 14727 16399 15501 16333 14060 13112 15840 17182 9997 7585 6631 5744
9134 5744 15958 13978 13776 20164 15018 9113 10534 11213 5095 -1538 -6195 -8539 -790 6852 12589
9119 12589 13777 11078 4557 1302 -2493 -3824 -1381 4007 4238 5470 8912 7578 11595 9350 -2760
9104 -2760 2601 11744 13163 8813 5214 12451 14390 17668 19866 16403 10120 8659 6348 -37 -3181
$$ packed form
9207B2094J363k933k509P42m372m420R388J829L704n70K177o784n321M318M690
9192B3396J333K945M639k375K387J0493J5803K1950L5278N7293N9470K9015R740
9179B71367m6372p7626n6443k4779j0140p311q555j0158l19O45m773j898J106
9166B4744l763j783M587r449l18n06L268Q43l693K17j627N409L868o102n151N221
9150A5765K687N76l176l005J880J672q98Q32k273r48K728J342p185k412r54q87
9134E744J0214j980k02O388n146n905J421O79o118o633m657k344P749P642N737
9119A2589J188k699o521l255l795j331K443N388K31J232L442j334M017k245j2110
9104b760N361R143J419m350l599P237J939L278K198l463o283j461k311o385l144
$$ plain form
9089 -3181 -8764 -1216 9213 12778 10593 9297 8751 9103 5981 -5522 -7159 -1118 -13 -661 -5999
9074 -5999 -8585 -1988 5619 9179 14369 12130 12324 11340 10090 6649 -1769 -3884 1305 667 -4475 -4920
9058 -4920 -7375 -7120 -11356 -4966 -2154 1258 373 899 13188 11625 5171 -485 -6716 -10382 3285
9043 3285 16653 17893 8744 3395 4727 9301 10280 2946 7671 8867 4609 5970 4349 3846 -1008
9028 -1008 4743 18529 22952 15999 1157 3134 6536 3625 1481 303 1410 2984 8141 10459
9014 10459 8792 6173 7891 7406 1679 2077 4915 1853 -3693 -6621 -8637 -3241 -3723 -10194 -1723
8999 -1723 7999 12152 9294 2764 -277 -286 -3153 -1237 -3685 -7667 -11927 -9663 -8243 -4736 197 -1312
8983 -1312 3003 5320 9102 7248 3533 4891 12618 10965 1827 -3285 -9261 -13655 -5707 1754 6879
$$ packed form
9089c181n583P548J0429L565k185j296n46L52l122j1503j637O041J105o48n338
9074e999k586O597P607L560N190k239J94r84j250l441q418k115N189o38n142m45
9058d920k455K55m236O390K812L412q85N26J2289j563o454n656o231l666J3667
9043C285J3368J240r149n349J332M574R79p334M725J196m258J361j621n03m854
9028a008N751J3786M423o953j4842J977L402k911k144j178J107J574N157K318
9014A0459j667k619J718m85n727L98K838l062n546k928k016N396m82o471Q471
8999a723R722M153k858o530l041rk867J916k448l982m260K264J420L507M933j509
8983a312M315K317L782j854l715J358P727j653r138n112n976m394P948P461N125
$$ plain form
8968 6879 6253 5457 8183 8440 11399 6700 3302 10483 12889 8834 1568 1556 3986 7563 11727 11277
8952 11277 9951 4963 -3517 -6507 931 12133 12488 10355 10018 9861 6743 -2965 -7184 -4302 1071
8937 1071 3206 3277 8501 6785 -137 -5825 -4883 -56 5872 10551 12830 7731 -106 924 1788 -1571
8921 -1571 346 -4534 -1195 7309 7721 890 -6523 -1598 6458 10757 11562 4233 7405 14168 12870
8906 12870 11515 7079 -2654 -4278 -5910 -3949 -1584 -1064 -3436 -3592 -5194 229 5613 6975 4333
8891 4333 9230 17008 18210 14404 11715 11870 9084 6877 7979 17607 17796 14468 15881 16836 26656 31866
8875 31866 33392 40578 51450 68983 91739 107788 122025 125006 108201 81789 60555 48617
8863 48617 38105 28024 21644 17049 24405 29564 31011 26734 23652 29556 32676 27769 26355 23208
$$ packed form
8968F879o26p96K726K57K959m699l398P181K406m055p266j2K430L577M164m50
8952A1277j326m988q480k990P438J1202L55k133l37j57l118r708m219K882N373
8937A071K135P1N224j716o922n688R42M827N928M679K279n099p837J030Q64l359
8921a571J917m880L339Q504M12o831p413M925Q056M299Q05p329L172O763j298
8906A2870j355m436r733j624j632J961K365N20k372j56j602N423N384J362k642
8891D333M897P778J202l806k689J55k786k207J102R628J89l328J413R55R820N210
8875C1866J526P186J0872J7533K2756J6049J4237K981j6805k6412k1234j1938
8863D8617j0512j0081o380m595P356N159J447m277l082N904L120m907j414l147
$$ plain form
8849 23208 17031 14475 16727 21381 25270 29743 23799 23775 27246 25070 33865 44203 47176 37976 28395
8834 28395 27041 23590 17870 20856 24093 31343 30738 29981 27785 32392 35729 27870 21161 19421 18501
8819 18501 24041 31921 37194 45218 50442 61416 63580 78864 96470 112977 147651 205654 292408
8806 292408 398678 497198 554370 529192 429724 314235 223304 163579 123726 100574 79279
8795 79279 65737 66014 62183 47118 45239 47230 40325 30154 20297 17489 16219 21042 20011 15867
8781 15867 14085 15731 12908 7915 10529 12257 18231 19996 14427 10892 12336 11057 13932 11384 7403
8766 7403 6702 5271 5225 7660 6574 6979 12855 11218 10360 4534 1290 8504 21269 25429 25777 29716
8750 29716 26021 25034 30373 37160 45419 56452 64808 70558 76353 82894 72716 55203 38680 36727
$$ packed form
8849B3208o177k556K252M654L889M473n944k4L471k176Q795J0338K973r200r581
8834B8395j354l451n720K986L237P250o05p57k196M607L337p859o709j740r20
8819A8501N540P880N273Q024N224J0974K164J5284J7606J6507L4674N8003Q6754
8806B92408J06270R8520N7172k5178r9468j15489r0931n9725l9853k3152k1295
8795G9279j3542K77l831j5065j879J991o905j0171r857k808j270M823j031m144
8781A5867j782J646k823m993K614J728N974J765n569l535J444j279K875k548l981
8766G403p01j431m6K435j086M05N876j637q58n826l244P214J2765M160L48L939
8750B9716l695r87N339O787Q259J1033Q356N750N795O541j0178j7513j6523j953
$$ plain form
8736 36727 32702 21586 17816 14516 14911 10444 8497 9884 9873 9317 5263 3148 6900 7807 1207 -1426
8720 -1426 -1945 863 3339 5489 9324 5334 3633 3269 1255 2525 9798 8015 3120 4585 1679
8705 1679 3709 7499 9327 4844 -3823 -4621 -10260 -7467 1310 -1895 -2605 -4629 -2279 1768 1729 3025
8689 3025 7797 5888 4408 -1436 -1544 -6744 -8794 -8314 -8936 -6648 -5174 -5299 -4532 -8107 -9793 -8240
8673 -8240 -5328 3201 882 -2085 -5737 -2260 -3419 -1020 -6169 1353 3465 -160 -2118 837 253
8658 253 2144 6370 777 -5701 1082 8340 8865 2767 5638 8143 12233 16528 7423 4586 4109 1128
8642 1128 4036 9337 11030 15194 11080 5686 1696 -3746 -11498 -8523 -2770 2837 -429 3034 637
8627 637 -1737 2358 5016 7465 8729 7086 8535 7951 5555 1312 2736 -2398 -1187 -7273 -8242 -3463
$$ packed form
8736C6727m025j1116l770l300L95m467j947J387j1n56m054k115L752R07o600k633
8720a426n19K808K476K150L835l990j701l64k014J270P273j783m895J465k906
8705A679K030L790J828m483q667p98n639K793Q777l205p10k024K350M047l9J296
8689C025M772j909j480n844j08n200k050M80o22K288J474j25P67l575j686J553
8673h240K912Q529k319k967l652L477j159K399n149P522K112l625j958K955n84
8658B53J891M226n593o478O783P258N25o098K871K505M090M295r105k837m77k981
8642A128K908N301J693M164m114n394l990n442p752K975N753N607l266L463k397
8627F37k374M095K658K449J264j643J449n84k396m243J424n134J211o086r69M779
$$ plain form
8611 -3463 -1330 1378 1281 2652 8343 17431 16888 17888 15417 12109 15116 18127 20513 26495 25927 28964
8595 28964 33338 33506 31073 24561 20927 16730 13672 18291 13470 8358 14280 15222 19280 23571 32237
8580 32237 44849 61776 68726 73588 65925 45512 30327 26653 22149 13839 11590 12592 11222 11316
8566 11316 7647 589 2223 2987 9800 4389 430 -1502 3031 1603 3228 8722 9663 3806 3807 12334
8550 12334 19257 16389 16972 20030 15675 11724 16041 10439 5590 4192 -502 -1242 764 1420 2634
8535 2634 447 -5321 -11258 -5368 -2038 -200 -1875 -4234 -1513 -4108 -6267 -5879 1736 -245 -887
8520 -887 248 3190 4487 3724 7313 1980 -272 8457 4245 4930 4934 6660 15263 23913 31248 40835
8504 40835 44516 42684 27067 15944 4414 636 2362 3294 1611 4423 120 -1459 -1377 -6065 -8389
$$ packed form
8611c463K133K708r7J371N691R088n43J000k471l308L007L011K386N982n68L037
8595B8964M374J68k433o512l634m197l058M619m821n112N922R42M058M291Q666
8580C2237J2612J6927O950M862p663k0413j5185l674m504q310k249J002j370R4
8566A1316l669p058J634P64O813n411l959j932M533j428J625N494R41n857JQ527
8550A2334O923k868N83L058m355l951M317n602m849j398m694p40K006O56J214
8535B634k187n768n937N890L330J838j675k359K721k595k159L88P615j981o42
8520h87J135K942J297p63L589n333k252Q729m212O85MJ726Q603Q650P335R587
8504D0835L681j832j5617j1123j1530l778J726R32j683K812m303j579Q2m688k324
$$ plain form
8489 -8389 -9817 -9216 -9361 -13400 -7980 -2520 3019 12011 1679 -3872 -4621 5000 6927 2333 5164
8474 5164 6080 1305 3119 9826 3826 911 1476 3710 3978 -5339 -6636 1299 7431 9680 12823 12525
8458 12525 7435 5409 9675 11377 9108 3654 1163 -766 -3295 -2235 1357 4512 9118 9459 7623
8443 7623 1846 -4827 -568 3601 3597 6414 3936 1854 3709 4572 -2372 -3191 8923 6860 4030 -505
8427 -505 -3892 -508 -2372 -4194 -7119 -2700 -4480 -2328 2958 4078 2706 6759 6662 -3645 -7424
8412 -7424 -4523 1217 -1447 -8823 -2279 592 -2339 -902 2385 5129 3125 1138 9365 12392 7873
8397 7873 9801 3727 -859 3657 11555 13819 8898 4743 2905 -2563 -2300 -5205 -7913 -9845 -12499
8382 -12499 -11126 -5582 -8307 -10881 -14438 -8947 -1055 510 -560 -1122 -3058 -3422 -2901 -6692 -11206
$$ packed form
8489h389j428O01j45m039N420N460N539Q992j0332n551p49R621J927m594K831
8474E164R16m775J814O707o000k915N65K234K68r317j297P935O132K249L143k98
8458A2525n090k026M266J702k269n454k491j929k529J060L592L155M606L41j836
8443G623n777o673M259M169mK817k478k082J855Q63o944q19J2114k063k830m535
8427e05l387L384j864j822k925M419j780K152N286J120j372M053r7j0307l779
8412g424K901N740k664p376O544K871k931J437L287K744k004j987Q227L027m519
8397G873J928o074m586M516P898K264m921m155j838n468K63k905k708j932k654
8382a2499J373N544k725k574l557N491P892J565j070n62j936l64N21l791m514
$$ plain form
8367 -11206 -10966 -14664 -6001 1156 -1189 -7290 -7588 -3589 -315 -6832 -2731 1390 632 3790 6690
8352 6690 638 -2800 -3127 879 5268 10745 14594 14304 8262 3082 3673 1833 -4347 -4650 -1508 -4996
8336 -4996 -8217 -12151 -13556 -5663 8338 4687 1844 1782 -2255 -3537 -6321 -8069 -5318 -3490 -5831
8321 -5831 -8740 -9465 -11646 -12427 -15283 -11450 -10475 -10037 -10188 -3260 -1672 756 1080 -8767 -11936 -10103
8305 -10103 -7660 -9384 -9925 -7748 -3304 -5752 -13793 -11976 -2665 201 -5163 -12907 -13058 -7647 -6825
8290 -6825 -5024 -6733 -3725 1375 -3760 -8933 -6376 -9517 -8323 -4770 -1706 -5370 -1061 -6610 -10551
8275 -10551 -1322 -971 -3990 -1940 -12021 -9630 -4414 -3494 -5761 -9188 -10729 -7632 -5934 -3940 647
8260 647 4608 1395 -2760 2103 3999 5762 4097 1933 -3119 -2212 4855 12047 12695 9085 6982 5980
$$ packed form
8367a1206K40l698Q663P157k345o101k98L999L274o517M101M121p58L158K900
8352F690o052l438l27M006M389N477L849k90o042n180N91j840o180l03L142l488
8336d996l221l934j405P893J4001l651k843o2m037j282k784j748K751J828k341
8321e831k909p25k181p81k856L833R75M38j51O928J588K428L24r847l169J833
8305a0103K443j724n41K177M444k448q041J817R311K866n364p744j51N411Q22
8290f825J801j709L008N100n135n173K557l141J194L553L064l664M309n549l941
8275a0551R229L51l019K050j0081K391N216R20k267l427j541L097J698J994M587
8260F47L961l213m155M863J896J763j665k164n052R07P067P192O48l610k103j002
$$ plain form
8244 5980 2112 857 3816 656 -5658 -13231 -13676 -8721 -13042 -8624 -2050 -2895 -5527 -5540 -4272 -3717
8228 -3717 -4731 -3856 -4342 -3742 1786 1207 1061 556 -5363 -11596 -5637 -3231 -4680 -3719 -5333 -9077 -9344
8211 -9344 -4282 -3934 -4451 -4071 -7453 -8484 -13069 -7038 -812 1186 -739 535 -3286 -5031 2768 6390
8195 6390 2099 763 -2027 -6277 -12735 -18633 -19335 -12973 -12361 -8896 -8967 -11767 -7445 -2261 -1322 -6764
8179 -6764 -5703 -2767 -361 -4300 -3067 -3847 -966 -2565 -888 9034 4659 -1000 -2195 -6316 -976
8164 -976 1248 -3395 -10850 -12333 -11763 -12172 -7620 -4199 -6304 -9779 -14999 -17476 -8671 -2178 -4274 -4142
8148 -4142 -6054 -11662 -10841 -12558 -14938 -9887 -10632 -16142 -14988 -12530 -8139 -10228 -21139 -17043 -9881
8133 -9881 -3412 2509 6556 4430 5608 6687 45 -3682 -8798 -8615 -11220 -2579 1963 2897 -2574
$$ packed form
8244E980l868j255K959l160o314p573m45M955m321M418O574q45k632j3J268N55
8228c717j014Q75m86O00N528n79j46n05n919o233N959K406j449R61j614l744k67
8211i344N062L48n17L80l382j031m585O031O226J998j925J274l821j745P799L622
8195F390m291j336k790m250o458n898p02O362O12L465p1k800M322N184R39n442
8179f764J061K936K406l939J233p80K881j599J677R922m375n659j195m121N340
8164i76K224m643p455j483N70m09M552L421k105l475n220k477Q805O493k096J32
8148d142j912n608Q21j717k380N051p45n510J154K458M391k089j0911M096P162
8133i881O469N921M047k126J178J079o642l727n116J83k605Q641M542R34n471
$$ plain form
8118 -2574 -7150 -2401 7275 5949 2547 224 -3332 -8360 -12925 -16443 -16254 -11891 -12925 -17693 -17095
8103 -17095 -20054 -19335 -12130 -10590 -8093 -6006 70 -4982 -10122 -5831 -6742 -12278 -16534 -14747 -5398
8088 -5398 -719 -2739 2343 1899 335 -5131 -5036 3031 1509 -1692 -6751 -4757 -4345 -5175 -1518 2331
8072 2331 -806 -3357 3310 3218 3778 5326 1766 -1006 -5927 -12348 -15895 -16390 -11062 -10564 -9097 -6359
8056 -6359 -1639 -132 -6 -4890 -6268 -4482 -3176 -808 -1843 -7276 -8336 -947 -3108 -4977 -3121
8041 -3121 -3856 -13293 -7151 -3573 -9596 -9577 -5299 -1898 -58 -7620 -10950 -7574 -5549 -12007 -9683 -6783
8025 -6783 -8677 -3769 138 -154 5555 7300 11555 9417 2647 -2951 -3310 2819 4808 4587 6774 828
8009 828 3381 2847 -3991 -5259 -5161 -5827 -6641 -9687 -9704 -13721 -13921 -5647 -3100 -8873 -6590 -3827 -1568
$$ packed form
8118b574m576M749R676j326l402k323l556n028m565l518J89M363j034m768N98
8103a7095k959P19P205J540K497K087O076n052n140M291r11n536m256J787R349
8088e398M679k020N082m44j564n466R5Q067j522l201n059J994M12q30L657L849
8072B331l137k551O667r2N60J548l560k772m921o421l547m95N328M98J467K738
8056f359M720J507J26m884j378J786J306K368j035n433j060P389k161j869J856
8041c121p35r437O142L578o023J9M278L401J840p562l330L376K025o458K324K900
8025f783j894M908L907k92N709J745M255k138o770n598l59O129J989k21K187n946
8009H28K553n34o838j268R8o66q14l046j7m017k00Q274K547n773K283K763K259
$$ plain form
7992 -1568 -515 -2712 -7813 -17014 -21924 -19860 -12674 -7644 -3452 -997 -5226 -10788 -12034 -9715 -4127
7977 -4127 -115 -2560 -2832 -2446 -2478 -1387 1504 7267 2204 -4395 -1053 -2532 -4211 -2561 2571 1594
7961 1594 869 -3156 -3356 -1879 84 -622 1377 6501 4911 5535 11305 9832 3797 35 -9713 -6631
7945 -6631 -1896 4078 -2454 -4426 -2853 6294 7426 11728 10853 8253 3567 -1391 -4347 -4463 -394
7930 -394 942 2233 -2115 -1449 -5530 -4995 2545 10596 7104 -1530 -9073 -10652 -6230 -11085 -9276 1404
7914 1404 8977 10752 8119 7310 9296 8817 7198 3572 3599 -1477 -7344 -5414 744 4967 1223 1402
7898 1402 1643 -2719 -4481 -10184 -13208 -12592 -9847 -5236 -3797 -4274 206 9637 10369 1011 -1267 1970
7882 1970 4424 3129 1186 -4389 -3477 785 3667 190 -3747 -7223 -5973 -6700 2989 4227 -1368
$$ packed form
7992a568J053k197n101r201m910K064P186N030M192K455m229n562j246K319N588
7977d127M012k445k72L86l2J091K891N763n063o599L342j479j679J650N132r77
7961A594p25m025k00J477J963p06J999N124j590O24N770j473o035l762r748L082
7945f631M735N974o532j972J573R147J132M302q75k600m686m958k956j16M069
7930c94J336J291m348O66m081N35P540Q051l492q634p543j579M422m855J809J0680
7914A404P573J775k633q09J986m79j619l626K7n076n867J930O158M223l744J79
7898A402K41m362j762n703l024O16K745M611J439m77M480R431P32r358k278L237
7882A970K454j295j943n575R12M262K882l477l937l476J250p27R689J238n595
$$ plain form
7867 -1368 -6539 -11743 -9948 -5785 -2567 5755 4328 -4276 -6273 -2404 1382 909 1231 -966 -2575
7852 -2575 -3317 -8119 -4242 -9390 -7896 -5768 -6273 -5613 -7631 -6203 -5621 -4034 3648 3063 -3217 -313
7836 -313 4479 3664 -2416 -12053 -14920 -13204 -10879 -12199 -13017 -1219 7676 12830 11303 10056 -127
7821 -127 -842 -490 1046 -557 -6085 -6270 -4609 -6946 -5339 -3654 -3634 1929 -6310 -3250 1939 5923
7805 5923 867 -6281 -10914 -12613 -7344 -5780 -4057 3171 -4030 -12332 -11275 -8050 -11444 -16537 -15825
7790 -15825 -8109 -7261 -11387 -15183 -17910 -9865 -7984 -12688 -5479 1227 -5440 -9173 -12158 -13540 -10981
7775 -10981 -8134 -3960 936 588 -4205 -3421 -825 -3192 -5733 -4748 -7272 -4633 -4986 -3476 -178 -1644
7759 -1644 -3798 -7692 -10039 -14725 -16747 -11842 -10891 -8916 -10517 -10270 -7971 -9491 -9461 -4288 -1247 2925
$$ packed form
7867a368n171n204J795M163L218Q322j427q604j997L869L786m73L22k197j609
7852b575p42m802L877n148J494K128n05O60k018J428N82J587P682n85o280K904
7836c13M792q15o080r637k867J716K325j320q18J1798Q895N154j527j247j0183
7821a27p15L52J536j603n528j85J661k337J607J685K0N563q239L060N189L984
7805E923n056p148m633j699N269J564J723P228p201q302J057L225l394n093P12
7790a5825P716Q48m126l796k727Q045J881m704P209O706o667l733k985j382K559
7775a0981K847M174M896l48m793P84K596k367k541R85k524K639l53J510L298j466
7759a644k154l894k347m686k022M905R51J975j601K47K299j520L0N173L041M172
$$ plain form
7743 2925 1779 2098 3715 6506 2904 3969 521 1494 8149 7282 779 1124 2752 5760 5029 707
7727 707 -2897 -3475 4780 5444 -4413 -8196 -13476 -14388 -15895 -15841 -9690 -14720 -16118 -16411 -19549 -14937 -11092
7710 -11092 -13652 -14722 -12549 -7310 -2692 -7526 -12182 -8535 -3935 -2753 -2000 -2887 -615 -8406 -14797
7695 -14797 -9365 -8949 -1049 2200 -1436 -262 1473 -8254 -12901 -8701 -6260 -3957 -1729 -148 2982
7680 2982 5856 104 -4400 -9105 -6060 6312 6445 -222 -3942 -1638 -2319 -3704 274 3281 3207 2600
7664 2600 1508 2589 818 461 -6482 -9965 -7297 27 1529 2033 -3343 -5511 -1559 1460 -353
7649 -353 815 6880 2586 675 -1833 -7564 -13604 -12208 -9597 -10501 1281 8300 6522 1306 -3008
7634 -3008 4260 4351 3368 3959 6275 7640 2574 3636 -2040 -2800 -3826 -3297 6217 4554 5370 5054 -2255
$$ packed form
7743B925j146L19J617K791l602J065l448R73O655q67o503L45J628L008p31m322
7727G07l604n78Q255O64r857l783n280r12j507N4O151n030j398k93l138M612L845
7710a1092k560j070K173N239M618m834m656L647M600J182P53q87K272p791o391
7695a4797N432M16P900L249l636J174J735r727m647M200K441K303K228J581L130
7680B982K874n752m504m705L045J2372J33o667l720K304o81j385L978L007p4o07
7664B600j092J081j771l57o943l483K668P324J502N04n376k168L952L019j813
7649c53J168O065m294j911k508n731o040J396K611r04J1782P019j778n216m314
7634c008P268R1r83N91K316J365n066J062n676p60j026N29R514j663Q16l16p309
$$ plain form
7617 -2255 -7963 -6918 678 4016 3645 1422 -2154 734 2932 -3000 -7897 -2266 -1816 -2472 -3477 -5646
7601 -5646 -3146 -1839 -3238 -1726 999 2304 4609 2892 -265 -331 -5247 -4405 -860 4656 7808 4612
7585 4612 3085 7204 2346 -2455 -1374 -3216 1482 254 -1266 -3391 -10444 -13512 -12702 -10734 -10763 -8694
7569 -8694 -6753 -9179 -12035 -8726 -1504 3161 -5638 -10399 -13361 -4751 -1587 2101 3482 -7090 -9844
7554 -9844 -13122 -13145 -7982 -3351 -2442 -3647 -2681 1706 173 -5894 -14165 -14284 -16375 -17838 -13361 -8279
7538 -8279 -8894 -7729 -754 9065 14038 9625 5067 4815 4101 379 -1000 -12055 -12515 -13155 -8942 -3919
7522 -3919 -8401 -12749 -10734 -7117 -9635 -5888 -6556 -10328 -10054 -3739 -5845 -6988 -8461 -9674 -2203
7507 -2203 1241 -7615 -4064 -2436 -1437 -2010 -5253 -10451 -12969 -2757 -6552 -7894 -2326 -2178 -3932
$$ packed form
7617b255n708J045P596L338l71k223l576K888K198n932m897N631M50o56j005k169
7601e646K500J307j399J512K725J305K305j717l157o6m916Q42L545N516L152l196
7585D612j527M119m858m801J081j842M698j228j520k125p053l068Q10J968k9K069
7569h694J941k426k856L309P222M665q799m761k962Q610L164L688J381j0572k754
7554i844l278k3N163M631R09j205R66M387j533o067q271j19k091j463M477N082
7538h279o15J165O975R819M973m413m558k52p14l722j379j1055m60o40M213N023
7522c919m482m348K015L617k518L747o68l772K74O315k106j143j473j213P471
7507b203L444q856L551J628R99n73l243n198k518J0212l795j342N568J48j754
$$ plain form
7492 -3932 -9479 -5819 -581 673 3305 1001 -3440 -4613 -4089 -2171 -2802 -4894 -8038 -3992 1113
7477 1113 752 -6934 -5472 -7430 -2984 2196 1307 11134 7239 -2386 -8905 -12744 -10290 -9815 -7986 -2966
7461 -2966 4335 -1541 -7720 2807 5253 4758 71 -4941 -1362 517 -6424 -10044 255 8441 6815
7446 6815 2180 277 1346 -914 -681 -3396 -9261 -8932 -7848 -5057 -2507 1404 43 -2266 -3505
7431 -3505 -3869 -3149 -3686 -6460 -7186 -2386 -1433 4054 4902 912 3477 7401 6415 1032 -390 607 402
7414 402 -2786 -4413 -5606 -4124 -5728 -10737 -12254 -11295 -3919 -1952 -5043 -8986 -6855 -1221 2521
7399 2521 2714 5832 6742 -4071 -10003 -5253 2892 3838 3497 7796 8540 1838 -4763 -7405 -11223 -10609
7383 -10609 -5545 654 211 2986 14211 14006 6767 99 -6125 -9376 -9958 -4376 719 78 8739
$$ packed form
7492c932n547L660N238J254K632k304m441j173N24J918o31k092l144M046N105
7477A113l61p686J462j958M446N180q89R827l895r625o519l839K454M75J829N020
7461b966P301n876o179J0527K446m95m687n012L579J879o941l620J0299Q186j626
7446F815m635j903J069k260K33k715n865L29J084K791K550L911j361k309j239
7431c505l64P20n37k774p26M800R53N487Q48l990K565L924r86n383j422R97k05
7414D02l188j627j193J482j604n009j517R59P376J967l091l943K131N634L742
7399B521J93L118R10j0813n932M750Q145R46l41M299P44o702o601k642l818O14
7383a0609N064O199m43K775J1225k05p239o668o224l251n82N582N095o41Q661
$$ plain form
7368 8739 10284 12288 9404 376 200 151 -2559 -669 -2903 -8632 -9213 -7137 1164 9829 13923 8520
7352 8520 751 -142 4593 -819 2339 3106 -2053 -7825 -8597 -1161 9668 8755 8320 10703 -121 -13445
7336 -13445 -16081 -9990 -4869 1225 5375 -1303 -4885 -4977 -6273 -8384 -7152 174 -2697 -10880 -10922 -12830
7320 -12830 -15532 -9696 -8629 -7845 -8602 -4832 -9162 -10086 -8092 -9059 -7573 -8565 -7274 -6781 -1455 3524
7304 3524 3912 -1831 -9247 -15384 -10213 3001 5592 1233 3129 -756 -2088 3285 -861 -9296 -11773
7289 -11773 -6975 -829 1851 2525 3221 4984 4259 7163 7547 2349 -5840 -6485 -2866 -2834 -5144 3103
7273 3103 -2140 -7953 4064 2672 -5793 -9215 -13497 -9546 -11360 -9677 -5605 -3768 -10379 -17670 -13209
7258 -13209 -2580 -1690 -10213 -12519 -7265 -789 3898 5291 2518 -216 -2541 -9820 -7743 1961 9668
$$ packed form
7368H739J545K004k884r028j76m9k710J890k234n729n81K076Q301Q665M094n403
7352H520p769q93M735n412L158P67n159n772p72P436J0829r13m35K383j0824j3324
7336a3445k636O091N121O094M150o678l582r2j296k111J232P326k871q183m2j908
7320a2830k702N836J067P84p57L770m330r24J994r67J486r92J291M93N326M979
7304C524L88n743p416o137N171J3214K591m359J896l885j332N373m146q435k477
7289a1773M798O146K680O74O96J763p25K904L84n198q189o45L619L2k310Q247
7273C103n243n813J2017j392q465l422m282L951j814J683M072J837o611p291M461
7258a3209J0629Q90q523k306N254O476M687J393k773k734k325p279K077R704P707
$$ plain form
7243 9668 15375 8937 6044 1940 -1106 -3358 -2798 1042 4423 -1175 -7617 -7564 60 318 -519 -3603
7227 -3603 -441 1303 111 -6017 -3977 -1895 -875 -5225 -8481 -13165 -6488 41 1190 2792 -469
7212 -469 500 5144 8994 10970 6698 2708 -1488 -1855 -5170 -2462 878 4974 9728 8032 8462 9049
7196 9049 6208 -1838 -3518 4783 6827 2139 7233 11867 9302 4940 4045 -4617 -11739 -13021 -10010
7181 -10010 -11201 -9525 -9993 -6810 249 -904 -2414 -5643 -1696 -94 -3213 1099 1489 -1880 -3478
7166 -3478 -5832 -9004 -6520 -8519 -8244 -8566 -10427 -18375 -16878 -7930 -3130 -3401 -4009 -3575 -6687 -5282
7150 -5282 -10029 -5871 1665 -59 -3547 -8752 -11887 -14024 -6973 -4491 -8164 -13011 -9621 -9841 -9884 -11934
7134 -11934 -11439 -6636 -2284 -5382 -7448 -7511 -7536 -3026 4941 5506 696 -2162 -1640 -10038 -15519 -6245
$$ packed form
7243I668N707o438k893m104l046k252N60L840L381n598o442N3P624K58q37l084
7227c603L162J744j192o128K040K082J020m350l256m684O677O529J149J602l261
7212d69R69M644L850J976m272l990m196l67l315K708L340M096M754j696M30N87
7196I049k841q046j680Q301K044m688N094M634k565m362q95q662p122j282L011
7181a0010j191J676m68L183P059j153j510l229L947J602l119M312L90l369j598
7166c478k354l172K484j999K75l22j861p948J497Q948M800k71o08M34l112J405
7150e282m747M158P536j724l488n205l135k137P051K482l673m847L390k20m3k050
7134a1934M95M803M352l098k066o3k5M510P967N65m810k858N22q398n481R274
$$ plain form
7118 -6245 1023 -4385 -7866 -2874 -6228 -8860 -9834 -12087 -8103 -4022 -8648 -6050 -800 1583 5362
7103 5362 696 417 2793 -514 -5200 -6126 -2619 1669 -3110 -2805 -756 -2242 -210 -479 -983 -9066
7087 -9066 -7221 -4745 -7532 -11028 -6725 -12461 -8377 -5750 -4546 1128 4146 3817 1289 -2710 -3802
7072 -3802 4048 1718 1590 -469 -2893 -10809 -12912 -15809 -19509 -17793 -18767 -12084 -11794 -9372 -9833 -5878
7056 -5878 -667 -5382 -4538 -6511 -11321 -13086 -8496 -1760 -5971 -7975 -3972 142 -9124 -9559 -4321
7041 -4321 -3027 -9109 -5148 -23 -566 -6690 -4956 -1810 -5767 -9306 -6104 -7834 -7618 -12423 -8327
7026 -8327 -1869 -3439 -8883 -14961 -11131 -4872 -2263 589 2384 2270 2511 -2297 -1948 -776 6914 9034
7010 9034 3864 -3253 -1976 -3806 -4234 -1060 3073 -4534 -3767 -175 -3645 -6056 -9784 -9865 -7434 -7500
$$ packed form
7118f245P268n408l481M992l354k632r74k253L984M081m626K598N250K383L779
7103E362m666k79K376l307m686r26L507M288m779L05K049j486K032k69n04q083
7087i066J845K476k787l496M303n736M084K627J204N674L018l29k528l999j092
7072c802P850k330j28k059k424p916k103k897l700J716r74O683K90K422m61L955
7056e878N211m715Q44j973m810j765M590O736m211k004M003M114r266m35N238
7041d321J294o082L961N125n43o124J734L146l957l539L202j730K16m805M096
7026h327O458j570n444o078L830O259K609K852J795j14K41m808L49J172P690K120
7010I034n170p117J277j830m28L174M133p607P67L592l470k411l728q1K431o6
$$ plain form
6994 -7500 -8683 -14195 -13034 -4854 -3821 2557 -2648 -9963 -10343 -8878 -5141 -2710 -1727 217 1017 -775
6978 -775 -987 2071 691 4687 -1175 -9007 -11525 -5924 -1830 1610 1938 3175 -3304 -5691 -2537 -1529
6962 -1529 -2887 -2063 229 -3152 -11538 -16295 -13858 -10126 -9996 -6665 -3561 -1330 5645 9992 4068
6947 4068 -2484 -1381 -1145 -7471 -6363 -5538 -4100 -4331 -2899 -4884 -7866 -14642 -11624 -9612 -6377 -7595
6931 -7595 -4112 771 3969 10521 6225 9344 6841 7177 7021 -1674 -11940 -16978 -17259 -12827 -6512
6916 -6512 -10065 -12664 -5646 -4134 -4081 -4903 -7075 -7573 -5177 -7829 -6345 6514 8303 -626 -5470 -10031
6900 -10031 -7176 -2896 -1676 -2222 -9950 -10816 -6569 312 -2467 -2365 3222 2130 -90 314 3061 5546
6884 5546 8635 3075 -2123 -12232 -20056 -6179 -836 -1552 -4368 -4898 1035 -3081 -9001 -12213 -11858
$$ packed form
6994g500j183n512J161Q180J033O378n205p315l80J465L737K431R83J944Q00j792
6978g75k12L058j380L996n862p832k518N601M094L440L28J237o479k387L154J008
6962a529j358Q24K292l381q386m757K437L732J30L331L104K231O975M347n924
6947D068o552J103K36o326J108Q25J438k31J432j985k982o776L018K012L235j218
6931g595L483M883L198O552m296L119k503L36j56q695j0266n038k81M432O315
6916f512l553k599P018J512N3q22k172m98K396k652J484J2859J789q929m844m561
6900a0031K855M280J220n46p728q66M247O881k779J02N587j092k220M04K747K485
6884E546L089n560n198j0109p824J3877N343p16k816n30N933m116n920l212L55
$$ plain form
6869 -11858 -2673 624 -4228 -6079 -1628 -2440 -5549 -4277 -913 -2866 -11254 -14370 -18441 -15267 -14511
6854 -14511 -10281 421 5873 8935 2851 -958 7933 7906 4741 5160 7487 2178 -505 2891 4752
6839 4752 5457 5112 9919 4653 -727 -5522 2490 3782 445 -4856 -15726 -18846 -14034 -6676 -1104
6824 -1104 -4919 -4013 -8393 -9266 -5731 -2902 -2459 -4979 -9202 -10871 -12474 -8389 362 186 -3304 -9171
6808 -9171 -13481 -16327 -12613 -7621 -10287 -9421 -2038 2213 4363 2431 2026 6657 2773 -2107 -1513 -8517
6792 -8517 -7646 -5044 -640 -3940 -16671 -15788 -7238 -9698 -11592 -12096 -9605 -9448 -7290 -5835 -2372 1
6776 1 -3006 -6912 -4635 -3608 -6560 -5963 -2818 1670 3175 7024 11967 9574 3550 -9008 -9204 -628
6760 -628 6492 5375 1035 -5642 -2807 200 3624 4507 3460 7782 7109 130 -8518 -8608 -5540 -286
$$ packed form
6869a1858R185L297m852j851M451q12l109J272L364j953q388l116m071L174P56
6854a4511M230J0702N452L062o084l809Q891k7l165M19K327n309k683L396J861
6839D752P05l45M807n266n380m795Q012J292l337n301j0870l120M812P358N572
6824a104l815R06m380q73L535K829M43k520m223j669j603M085Q751j76l490n867
6808i171m310k846L714M992k666Q66P383M251K150j932m05M631l884m880N94p004
6792h517Q71K602M404l300j2731Q83Q550k460j894n04K491J57K158J455L463K373
6776Al007l906K277J027k952N97L145M488J505L849M943k393o024j2558j96Q576
6760f28P120j117m340o677K835L007L424Q83j047M322o73o979q648r0L068N254
$$ plain form
6744 -286 2303 6313 1143 -3599 -5492 -1293 4339 6276 9288 5527 3749 -508 -578 1118 -923 -1550
6728 -1550 -5221 -9021 -5054 487 -306 -569 -1083 5867 7845 2929 1584 3657 7099 6782 5406 2522
6712 2522 -1915 -6779 -11175 -14140 -14221 -9084 -6060 -1150 -1733 -8263 -13479 -15757 -11006 -10487 -12804 -14314
6696 -14314 -8808 -6512 -2473 2459 686 -3358 -5669 -4712 -5133 -2302 -5653 -5829 514 -176 413 -1962
6680 -1962 -4732 2063 2793 1424 550 2005 -3303 -7446 -9633 -13947 -17572 -11587 -6230 -7170 -10571 -7599
6664 -7599 -8762 -8455 -7335 -5590 -7564 -1416 4865 9280 7092 5433 1921 -2327 -2336 -9727 -8477 -5557
6648 -5557 -3093 -3958 -11398 -9743 -6731 -12 3249 2140 1267 5261 2056 84 3429 -71 -3410
6633 -3410 -2852 3860 2010 -3771 -6103 -8907 -5148 2406 9539 7208 -180 -4189 462 406 -4432 -8789
$$ packed form
6744b86K589M010n170m742j893M199N632J937L012l761j778m257p0J696k041o27
6728a550l671l800L967N541p93k63n14O950J978m916j345K073L442l17j376k884
6712B522m437m864m396k965q1N137L024M910n83o530n216k278M751N19k317j510
6696a4314N506K296M039M932j773m044k311R57m21K831l351j76O343o90N89k375
6680a962k770O795P30j369q74J455n308m143k187m314l625N985N357r40l401K972
6664g599j163L07J120J745j974O148O281M415k188j659l512m248rp391J250K920
6648e557K464q65p440J655L012O719L261j109q73L994l205j972L345l500l339
6633c410N58O712j850n781k332k804L759P554P133k331p388m009M651n6m838m357
$$ plain form
6617 -8789 -9519 -3669 10216 13530 2628 855 5342 1669 -11685 -17750 -14885 -8669 -4864 -2550
6603 -2550 -7048 -8941 -146 -203 -7472 -10245 -3979 959 -1823 -4314 -5827 -4916 -3549 -2714 -977 -3470
6587 -3470 -8193 -3995 -5784 -9692 -12478 -8608 -6123 -7263 -14275 -15387 -11205 -8959 -12297 -12212 -8993
6572 -8993 -9838 -11116 -11231 3114 4003 -3345 -9500 -11221 -7617 -211 4449 2749 -4270 -7153 -4871
6557 -4871 -116 -847 -9088 -8078 -2931 -3243 -7872 -8543 -3027 3630 5978 -181 -3241 1551 -158 -8446
6541 -8446 -4169 -3104 -2488 3625 9149 1318 -1120 179 1193 2831 3302 1000 -1001 -1480 -4711 -6916
6525 -6916 -3925 2177 4040 5580 6269 5612 5042 -1085 4359 7945 10698 8456 10252 9857 7023 8831
6509 8831 874 510 -1612 3969 -2578 -10831 -12442 -12442 -13435 -5243 -11925 -15431 -8614 -5897 -12773 -12551
$$ packed form
6617h789p30N850J3885L314j0902j773M487l673j3354o065K865O216L805K314
6603b550m498j893Q795n7p269k773O266M938k782k491j513R11J367Q35J737k493
6587c470m723M198j789l908k786L870K485j140p012j112M182K246l338Q5L219
6572h993q45j278j15J4345Q89p348o155j721L604P406M660j700p019k883K282
6557d871M755p31q241J010N147l12m629o71N516O657K348o159l060M792j709q288
6541h446M277J065O16O113N524p831k438J299J014J638M71k302k001m79l231k205
6525f916K991O102J863J540O89o57n70o127N444L586K753k242J796l95k834J808
6509H831p957l64k122N581o547q253j611%r93Q192o682l506O817K717o876K22
$$ plain form
6493 -12551 -10896 -6851 1815 1911 -2057 2587 7158 4376 2782 -351 -296 -2463 -8727 -931 -3478 -6116
6477 -6116 -3639 1983 5422 2449 -1895 -12151 -17251 -13893 -6026 750 174 -7270 -12443 -9448 -4041
6462 -4041 -8172 -4457 9221 7999 4619 3184 -3480 -4780 -8090 -5278 -3423 -12449 -14053 -7013 -6464
6447 -6464 -5581 -3112 457 735 4182 2175 200 2874 464 -3072 -2249 -3264 -2503 -569 -2277 -572
6431 -572 -1083 -1448 -9064 -14823 -11993 -9337 -10169 -11661 -9429 -10780 -1506 -153 928 -470 -7438 -10970
6415 -10970 -6069 4402 2404 2824 -1561 -2974 -9325 -15273 -11219 -6274 -2071 -1644 -1153 -5659 -6831
6400 -6831 -4041 -6436 -6211 -2625 -901 5799 3360 -948 -9505 -6362 -4021 -11448 -13001 -14485 -9711
6385 -9711 -10018 -8011 -4206 451 1630 3580 4659 1323 4012 10306 8688 -1982 -6158 -9730 -5211
$$ packed form
6493a2551J655M045Q666R6l968M644M571k782j594l133N5k167o264P796k547k638
6477f116K477N622L439k973m344j0256n100L358P867O776n76p444n173K995N407
6462d041m131L715J3678j222l380j435o664j300l310K812J855r026j604P040N49
6447f464Q83K469L569K78L447k007j975K674k410l536Q23j015P61J934j708J705
6431e72n11l65p616n759K830K656q32j492K232j351R274J353J081j398o968l532
6415a0970M901J0471j998M20m385j413o351n948M054M945M203M27M91m506j172
6400f831K790k395K25L586J724O700k439m308q557L143K341p427j553j484M774
6385i711l07K007L805M657J179J950J079l336K689O294j618j0670m176l572M519
$$ plain form
6370 -5211 -3509 5420 8208 977 5196 4405 5405 5578 -668 -6692 -5697 -6991 -11451 -9695 -8485 -9667
6354 -9667 -4439 -3820 -3563 -3307 493 -1876 -4442 -8256 53 8845 4892 4132 5437 5235 2236 163
6338 163 6436 6755 2294 4191 7114 9134 3273 -319 -3422 -8110 -4701 -4319 -3329 -6342 -5931 -2709
6322 -2709 6566 6495 -2111 1004 -1565 -9884 -9724 -10125 -5412 -3554 -1812 -6751 -10585 -9089 -5721 -8514
6306 -8514 -11289 -10710 -7161 -898 -5196 -16792 -12882 -9805 -5663 -4521 221 3167 -4209 -9469 -3137
6291 -3137 1034 623 4567 11788 9739 6666 5637 1104 5014 1693 3903 9526 14645 9616 2911
6276 2911 -3053 -5686 -7026 -7646 -7195 -10038 -5688 -9187 -6368 635 -1184 -8367 -11561 -11107 -4157 -8809
6260 -8809 -12828 -4075 -601 -2015 -779 -1565 -1852 -5303 216 5331 1571 2141 4404 8508 4503 -2932
$$ packed form
6370e211J702Q929K788p231M219p91J000J73o246o024R95j294m460J756J210j182
6354i667N228O19K57K56L800k369k566l814Q309Q792l953p60J305k02k999k073
6338A63O273L19m461J897K923K020n861l592l103m688L409L82R90l013M11L222
6322b709R275p1q606L115k569q319J60m01M713J858J742m939l834J496L368k793
6306h514k775N79L549O263m298j1596L910L077M142J142M742K946p376n260O332
6291c137M171m11L944P221k049l073j029m533L910l321K210N623N119n029o705
6276B911n964k633j340o20M51k843M350l499K819P003j819p183l194M54O950m652
6260h809m019Q753L474j414J236p86k87l451N519N115l760N70K263M104m005p435
$$ plain form
6244 -2932 2946 2108 -6105 -4800 -6322 -6141 -1764 -2541 -4513 -5045 -8365 -14066 -13000 -6307 -4952 -7578
6228 -7578 -10286 -9731 -11842 -4463 2594 -865 -6804 -15829 -15401 -10882 -8325 -4845 -5776 -463 -2498 -5528
6212 -5528 -7719 -5460 -2411 -5773 -7766 -3993 -6041 -3601 -1944 -4478 -163 7277 14192 14947 6704
6197 6704 -1501 -655 -5680 -12588 -15717 -7237 -2838 -1367 -3755 -8551 -16693 -12776 -3618 -2709 -4933
6182 -4933 -2387 -2984 -8968 -11973 -12126 -6987 -4789 -5439 -7547 -5354 -7676 -5647 1732 2881 -1049 -5498
6166 -5498 2564 8095 4965 1968 2265 6452 5693 -2646 -6274 -3424 -3660 -7776 -6990 -4362 -5381 -2212
6150 -2212 74 4108 10374 4378 2653 1277 -996 -2995 -177 1184 -1795 -7032 -1575 6975 12421
6135 12421 2809 -134 -2841 -8194 -12524 -12074 -12234 -10180 -8150 -6077 -9677 -14227 -3857 -3943 -7642
$$ packed form
6244b932N878q38q213J305j522J81M377p77j972n32l320n701J066O693J355k626
6228g578k708N55k111P379P057l459n939r025M28M519K557L480r31N313k035l030
6212e528k191K259L049l362j993L773k048K440J657k534M315P440O915P55q243
6197F704q205Q46n025o908l129Q480M399J471k388m796q142L917R158R09k224
6182d933K546n97n984l005j53N139K198o50k108K193k322K029P379J149l930m449
6166e498Q062N531l130k997K97M187p59q339l628K850k36m116P86K628j019L169
6150b212K286M034O266n996j725j376k273j999K818J361k979n237N457Q550N446
6135A2421r612k943k707n353m330M50j60K054K030K073l600m550J0370q6l699
$$ plain form
6120 -7642 -7674 -13366 -13915 -13459 -13848 -14254 -14539 -8702 -9209 -8249 -6651 -11159 -11592 -13578 -12486 -7001 -3414
6103 -3414 -8525 -11636 -13042 -13737 -15517 -11053 -6360 -2881 -3444 -9873 -11301 -7411 942 -5549 -8952
6088 -8952 -8892 -6632 -1175 2915 341 2770 -1550 -8224 -11790 -12653 -8673 -2034 1296 960 -287 -789
6072 -789 -5248 -7720 -6518 -3809 -3275 -3516 -5490 -9382 -7577 -10793 -16369 -11624 -1678 9465 12961
6057 12961 10842 10270 5211 1118 -3863 -2688 -737 -502 1241 194 2392 6238 -6084 -12989 -5737
6042 -5737 -4256 1249 3455 -1098 -3524 -6352 -9286 -10137 -8330 -5924 28 5436 2262 3393 -1262
6027 -1262 -4207 -532 -1153 22 7114 4772 -237 -4993 -1329 2508 -846 1088 -735 3766 15256
6012 15256 14389 8246 7794 4554 5792 2336 -3437 -6485 -10558 -4074 12072 15556 5655 2679 1953
$$ packed form
6120g642l2n692n49M56l89m06k85N837n07R60J598m508m33j986J092N485L587
6103c414n111l111j406o95j780M464M693L479n63o429j428L890Q353o491l403
6088h952O0K260N457M090k574K429m320o674l566q63L980O639L330l36j247n02
6072g89m459k472J202K709N34k41j974l892J805l216n576M745R946J1143L496
6057A2961k119n72n059m093m981J175J951K35J743j047K198L846j2322o905P252
6042e737J481N505K206m553k426k828k934q51J807K406N952N408l174J131m655
6027a262k945L675o21J175P092k342n009m756L664L837l354J934j823M501J1490
6012A5256q67o143m52l240J238l456n773l048m073O484J6146L484r901k976p26
$$ plain form
5997 1953 -268 460 5873 10905 14808 4714 -1170 -3612 3484 4549 3427 849 -1693 -141 -1307
5982 -1307 6817 9630 10457 7147 3749 -4663 -8697 -1301 970 2958 -2319 -7223 -7405 -3397 66
5967 66 2556 -765 -3094 -8198 -9692 -9852 -2279 -3446 -422 -2834 -9688 -10839 -10718 -9321 -4738 7646
5951 7646 3673 4836 8545 -2646 -8613 -11261 -15202 -9605 -12083 -17147 -18286 -14602 -11406 -14591 -15255
5936 -15255 -13603 -14584 -9377 -8151 -10442 -4910 -7720 -5465 -8623 -5273 -5470 -7137 -7476 -3993 4374
5921 4374 4212 7244 7268 6221 2524 -6885 -8354 -1593 910 921 307 4547 -77 1066 2596 5843
5905 5843 7741 9259 12249 14597 8532 1121 -4175 -5940 -4681 -7128 5803 8696 1512 2484 5335
5890 5335 -487 -9989 -8232 -3477 -3518 -8677 -9524 -7118 -1851 -2521 -4598 -993 -8728 -12439 -13872 -14450
$$ packed form
5997A953k221P28N413N032L903j0094n884k442P096J065j122k578k542J552j166
5982a307Q124K813Q27l310l398q412m034P396K271J988n277m904j82M008L463
5967F6K490l321k329n104j494j60P573j167L024k412o854j151J21J397M583J2384
5951G646l973J163L709j1191n967k648l941N597k478n064j139L684L196l185o64
5936a5255J652r81N207J226k291N532k810K255l158L350j97j667l39L483Q367
5921D374j62L032K4j047l697r409j469O761K503J1o14M240m624J143J530L247
5905E843J898J518K990K348o065p411n296j765J259k447J2931K893p184R72K851
5890E335n822r502J757M755m1n159q47K406N267o70k077L605p735l711j433n78
$$ [...]
##END NTUPLES=NMR SPECTRUM
##END=
