##TITLE=Analysis number 322770
Compound Code cc 07102
Project Code adrs
Chemist Name endeavour
##JCAMPDX= 6.0         $$ Bruker NMR JCAMP-DX V2.0
##DATA TYPE= NMR SPECTRUM
##DATA CLASS= NTUPLES
##ORIGIN= Bruker BioSpin GmbH
##OWNER= nmr
$$ XWIN-NMR		Version 3.5
$$ Mon Oct 16 08:48:05 2006 GMT Daylight Time (UT+1h)  MAYBRIDGE\nmr@NMR_250MHZ
##.OBSERVE FREQUENCY= 250.131544655141
##.OBSERVE NUCLEUS= ^1H
##.ACQUISITION MODE= SIMULTANEOUS (DQD)
##.ACQUISITION SCHEME= undefined
##.AVERAGES= 16
##.DIGITISER RES= 18
##SPECTROMETER/DATA SYSTEM= dpx250
##.PULSE SEQUENCE= zg30
##.SOLVENT NAME= CDCl3
##.SHIFT REFERENCE= (INTERNAL, CDCl3, 0, 16.4457)
##AUDIT TRAIL= $$ (NUMBER, WHEN, WHO, WHERE, WHAT)
$$ ##TITLE= Audit trail, XWIN-NMR		Version 3.5
$$ ##JCAMPDX= 5.01
$$ ##ORIGIN= Bruker BioSpin GmbH
$$ ##OWNER= nmr
$$ C:\u/data/dgb/nmr/ADRS/380/pdata/1/auditp.txt
$$ ##AUDIT TRAIL=  $$ (NUMBER, WHEN, WHO, WHERE, WHAT)
(   1,<2006-10-16 08:47:42.46 +100>,<MAYBRIDGE\nmr>,<NMR_250MHZ>,
      <created by zg, POWCHK disabled, PULCHK disabled
       configuration hash MD5:
       49 4B E0 1D 92 C2 6B 37 9F E6 65 BC 52 41 86 1D
       data hash MD5: 64K
       97 D6 B6 A3 76 0D 12 D3 52 1B 33 86 D6 B5 95 8F>)
(   2,<2006-10-16 08:47:57.03 +100>,<MAYBRIDGE\nmr>,<NMR_250MHZ>,
      <Start of raw data processing
       ef LB = 0.3 FT_mod = 6 PKNL = 1 SI = 32K 
       data hash MD5: 32K
       5F 1F 98 2C BB 0A FB 92 5E E6 42 F3 5F 99 87 9D>)
(   3,<2006-10-16 08:47:58.69 +100>,<MAYBRIDGE\nmr>,<NMR_250MHZ>,
      <apk 
       data hash MD5: 32K
       27 90 D6 02 D1 B6 66 9B E0 6B DC 36 07 89 26 98>)
(   4,<2006-10-16 08:47:59.41 +100>,<MAYBRIDGE\nmr>,<NMR_250MHZ>,
      <abs ABSG = 5 
       data hash MD5: 32K
       BA B9 3B A7 D3 BC 8D 00 E6 6E 81 E6 31 27 3F 5D>)
$$ ##END=
$$ 
$$ hash MD5
$$ 95 43 B3 BD 10 D1 AD 2F 17 84 CF 6C 4A 4F 18 1F
##$RELAX= 
##$RELAX= 
##$RELAX= 
##$RELAX= 
##$RELAX= 
##$RELAX= 
##$RELAX= 
$$ Bruker specific parameters
$$ --------------------------
##$DU= <C:\u>
##$EXPNO= 380
##$NAME= <ADRS>
##$PROCNO= 1
##$TYPE= <nmr>
##$USER= <dgb>
##$AMP= (0..31)
100 100 100 100 100 100 100 100 100 100 100 100 100 100 100 100 100 100 
100 100 100 100 100 100 100 100 100 100 100 100 100 100 
##$AQSEQ= 0
##$AQ_mod= 3
##$AUNM= <au_zg>
##$AUTOPOS= <24 >
##$BF1= 250.13
##$BF2= 250.13
##$BF3= 250.13
##$BF4= 250.13
##$BF5= 500.13
##$BF6= 500.13
##$BF7= 500.13
##$BF8= 500.13
##$BYTORDA= 1
##$CFDGTYP= 0
##$CFRGTYP= 5
##$CHEMSTR= <none>
##$CNST= (0..31)
1 1 145 1 1 1 1 1 1 1 1 1 1 1 1 1 1 1 1 1 1 1 1 1 1 1 1 1 1 1 1 1 
##$CPDPRG= <>
##$CPDPRG1= <>
##$CPDPRG2= <>
##$CPDPRG3= <>
##$CPDPRG4= <mlev>
##$CPDPRG5= <mlev>
##$CPDPRG6= <mlev>
##$CPDPRG7= <mlev>
##$CPDPRG8= <mlev>
##$CPDPRGB= <>
##$CPDPRGT= <>
##$D= (0..31)
0 1 0 0 0 0 0 0 0 0.06 0 0 0 0 0 0 0.0002 0 0 0 0 0 0 0 0 0 0 0 0 0 0 
0 
##$DATE= 1160984861
##$DBL= (0..7)
120 120 120 120 120 120 120 120 
##$DBP= (0..7)
150 150 150 150 150 150 150 150 
##$DBP07= 0
##$DBPNAM0= <>
##$DBPNAM1= <>
##$DBPNAM2= <>
$$ [...]
##$SUBNAM7= <"">
##$SUBNAM8= <"">
##$SUBNAM9= <"">
##$SW= 20.6930455092707
##$SWIBOX= (0..15)
0 0 3 0 0 0 0 0 0 0 0 0 0 0 0 0 
##$SW_h= 5175.983436853
##$TD= 65536
##$TD0= 1
##$TE= 683.16
##$TE2= 300
##$TE3= 300
##$TEG= 300
##$TL= (0..7)
0 120 120 120 120 120 120 120 
##$TP= (0..7)
150 150 150 150 150 150 150 150 
##$TP07= 0
##$TPNAME0= <>
##$TPNAME1= <>
##$TPNAME2= <>
##$TPNAME3= <>
##$TPNAME4= <>
##$TPNAME5= <>
##$TPNAME6= <>
##$TPNAME7= <>
##$TPOAL= (0..7)
0.5 0.5 0.5 0.5 0.5 0.5 0.5 0.5 
##$TPOFFS= (0..7)
0 0 0 0 0 0 0 0 
##$TUNHIN= 0
##$TUNHOUT= 0
##$TUNXOUT= 0
##$USERA1= <user>
##$USERA2= <user>
##$USERA3= <user>
##$USERA4= <user>
##$USERA5= <user>
##$V9= 5
##$VALIST= <valist>
##$VCLIST= <CCCCCCCCCCCCCCC>
##$VD= 0
##$VDLIST= <DDDDDDDDDDDDDDD>
##$VPLIST= <PPPPPPPPPPPPPPP>
##$VTLIST= <TTTTTTTTTTTTTTT>
##$WBST= 1024
##$WBSW= 4
##$XGAIN= (0..3)
0 0 0 0 
##$XL= 0
##$YL= 0
##$YMAX_a= 552046
##$YMIN_a= -375535
##$ZGOPTNS= <>
##$ZL1= 120
##$ZL2= 120
##$ZL3= 120
##$ZL4= 120
##$ABSF1= 16.44575
##$ABSF2= -4.247423
##$ABSG= 5
##$ABSL= 3
##$ALPHA= 0
##$AQORDER= 0
##$ASSFAC= 0
##$ASSFACI= 0
##$ASSFACX= 0
##$ASSWID= 0
##$AUNMP= <proc_1d>
##$AZFE= 0.1
##$AZFW= 0.1
##$BCFW= 0
##$BC_mod= 0
##$BYTORDP= 0
##$COROFFS= 0
##$CY= 12.5
##$DATMOD= 1
##$DC= 0
##$DFILT= <>
##$DTYPP= 0
##$F1P= 14.0000005364418
##$F2P= -0.99999901652339
##$FCOR= 0.5
##$FTSIZE= 32768
##$FT_mod= 6
##$GAMMA= 0
##$GB= 0
##$INTBC= 1
##$INTSCL= 1
##$ISEN= 128
##$LB= 0.3
##$LEV0= 0
##$LPBIN= 0
##$MAXI= 10000
##$MC2= 0
##$MEAN= 0
##$ME_mod= 0
##$MI= 0
##$NCOEF= 0
##$NC_proc= -5
##$NLEV= 6
##$NOISF1= 0
##$NOISF2= 0
##$NSP= 0
##$NTH_PI= 0
##$NZP= 0
##$OFFSET= 16.44575
##$PC= 1
##$PHC0= -43.82874
##$PHC1= 9.240047
##$PH_mod= 1
##$PKNL= yes
##$PPARMOD= 0
##$PSCAL= 4
##$PSIGN= 0
##$REVERSE= no
##$SF= 250.13001907075
##$SI= 32768
##$SIGF1= 0
##$SIGF2= 0
##$SINO= 400
##$SIOLD= 32768
##$SREGLST= <1H.CDCl3>
##$SSB= 0
##$STSI= 32768
##$STSR= 0
##$SW_p= 5175.98343685301
##$SYMM= 0
##$S_DEV= 0
##$TDeff= 65536
##$TDoff= 0
##$TI= <Analysis number 999999
Compound Code 99
Book Reference 9
Project Code 9>
##$TILT= no
##$TM1= 0
##$TM2= 0
##$TOPLEV= 0
##$USERP1= <user>
##$USERP2= <user>
##$USERP3= <user>
##$USERP4= <user>
##$USERP5= <user>
##$WDW= 1
##$XDIM= 32768
##$YMAX_p= 526800463
##$YMIN_p= -1002585
$$ End of Bruker specific parameters
$$ ---------------------------------
##NTUPLES= NMR SPECTRUM
##VAR_NAME=  FREQUENCY,     SPECTRUM/REAL,   SPECTRUM/IMAG
##SYMBOL=    X,             R,               I
##VAR_TYPE=  INDEPENDENT,   DEPENDENT,       DEPENDENT
##VAR_FORM=  AFFN,          ASDF,            ASDF
##VAR_DIM=   32768,         32768,           32768
##UNITS=     HZ,            ARBITRARY UNITS, ARBITRARY UNITS
##FACTOR=    0.157963299565203, 1,           1
##FIRST=     4113.57558174877, 0,            0
##LAST=      -1062.40785510424, 0,           0
##MIN=       -1062.40785510424, -1002585,    0
##MAX=       4113.57558174877, 526800463,    0
$$ Real data points
##PAGE= N=1
##DATA TABLE= (X++(R..R)), XYDATA
$$ [...]
29179 26946 364490 313682 -56032 -82472 -81528 -66639 -112552 -308100 -337995 -277395 -160401
29168 -160401 -105477 -133441 -209875 -415184 -410534 -275290 -279808 -301948 -65361 83719 207964
29157 207964 -5919 -146302 -197013 -129103 28552 217126 205567 274816 420388 396533
29147 396533 159924 -86174 -22389 773 -168439 -254510 -223383 -102951 93904 280077
29137 280077 109088 38588 -119024 -251512 -90849 -84866 52547 99357 -59680 -391476
29127 -391476 -300286 132466 137794 90482 219079 332580 364429 321002 148130 40106 30765
29116 30765 -57630 -120027 -92802 -74623 -115280 -188485 -50398 25414 -146485 -101427 -87673
29105 -87673 -206008 -249143 -254195 -322997 -170006 194712 243915 16305 -187741 -185713 -101287
29094 -101287 -183821 7701 -143817 -110776 2607 -210234 -77545 139445 395191 219476
29084 219476 41778 -121128 -70602 160199 51461 -57579 -52254 -25497 -135325 -140530 -67143
29073 -67143 -220598 -302191 -243487 -96001 -21269 -284810 -196309 -63150 131103 253357
29063 253357 -71588 -176558 -84169 -331281 -292398 -337200 -432551 -303426 -9605 145581
29053 145581 158376 110460 66535 1261 85292 326335 296484 -185760 -192234 -129604 8098
29042 8098 -247901 -468409 -332995 -540029 -457575 -258871 -92210 67164 -42274 -134882
29032 -134882 -187764 -331280 -383750 -387415 -226906 -378217 -226604 112102 173037 85448 259673
29021 259673 339209 110700 41264 -24524 57721 84683 21013 33749 54826 51831 -107555
29010 -107555 -57875 -62303 16943 192960 253088 256732 166159 -41237 110398 302774 175338
28999 175338 -83057 -110969 -98 89764 95633 193719 46179 13585 57102 202746 106221
28988 106221 -66794 140385 301791 466341 628355 511479 428193 216786 357227 511285
28978 511285 627105 663677 512286 363816 390071 498953 385248 487102 461898 346684
28968 346684 389269 303745 157928 233719 309678 198872 248929 357765 475033 369215
28958 369215 145363 55624 73034 128725 -15194 -115209 -425355 -517219 -181449 -55305
28948 -55305 17052 -84248 4126 214585 281080 207383 247633 56015 18194 95666 209271
28937 209271 189724 364446 611027 429993 76063 112922 -140335 -192174 -192427 -406696 -414883
28926 -414883 -317218 -256671 -312991 -133535 -27664 149802 113083 -334857 -408767 -71332
28916 -71332 119480 -58790 -30092 145200 236159 54290 -101001 -200079 -434392 -177879
28906 -177879 -42718 -47515 -37127 -17180 123087 211708 28624 -121696 -104579 -152001 34719
28895 34719 52955 165513 64222 133590 255528 346684 189225 60003 192648 145972
28885 145972 -58242 42526 264255 29435 -227117 -49197 169045 425600 271639 -136372
28875 -136372 -219444 3542 137283 20604 -166454 -111875 -317723 -465892 -238614 28359
28865 28359 2010 -94708 -145356 -306594 -508842 -515332 -128995 13566 -59900 -119157 18990
28854 18990 -2087 -181320 -77679 61390 -50402 25755 184850 160817 187195 90569 100314
28843 100314 257071 273224 291570 277973 210731 -61894 -225908 -251534 -110737 14563
28833 14563 188322 -62574 -90729 100142 184949 -61616 -293093 -24954 12789 25268
28823 25268 -95464 -164669 -191436 -233525 -231801 -322487 -395435 -259222 -176168 -96079 -87718 7609
28811 7609 82336 71440 26783 161322 163090 104881 47008 -122861 -144317 20839 15864 45443
28799 45443 135515 170262 222242 -70396 -256988 -193433 19184 -35343 -144730 -183770 -256216
28788 -256216 -272858 -134402 80166 325755 452719 413722 349038 351782 505750 556860 695457
28777 695457 330712 228834 252641 309186 328119 319133 320492 190046 103372 115522 62112
28766 62112 -36369 -8055 56994 9935 -155352 -183466 -113227 -23387 145612 -13691 234264
28755 234264 247169 77962 -287760 -264667 -274824 -53382 -233678 -267352 -47403 -39525 3914
28744 3914 -83651 -292391 -368369 -536853 -490147 -96923 101996 272093 332114 228248 125319
28733 125319 185901 160864 314361 399991 254380 -28158 335945 671643 600326 257520
28723 257520 62677 -257036 -339770 -290435 -193045 -340655 -590795 -413858 -6034 195795
28713 195795 113520 189139 87805 -76326 -5608 124975 -14740 -46014 -184607 -179368 -57854
28702 -57854 143661 388378 553054 450886 467695 487019 397272 183665 -132321 -174002
28692 -174002 -64786 -114414 -169735 -96184 -222431 -199839 -17292 -61198 -288192 -56675
28682 -56675 51661 58040 112780 177802 162793 97498 373464 350684 430443 220189 116433
28671 116433 105535 17805 -240630 -472576 -684069 -554765 -400380 -122416 205785 220035
28661 220035 140 -44795 -117536 -322058 -297890 162214 319829 261769 493342 463309
28651 463309 365597 160803 51448 5884 97241 294261 489763 478265 412259 552075
28641 552075 747326 496025 339485 141163 28621 151281 143851 54853 163039 322047
28631 322047 221793 -780 33701 -74522 -73947 124463 144500 204566 47437 -126003 -5607
28620 -5607 260720 371302 250789 346838 300565 405221 655736 463734 171283 28351
28610 28351 -121835 -199829 -69225 -168062 -203454 -100433 -88675 -109166 -21265 250444 43729
28599 43729 52998 40044 3728 -41089 21145 -48235 -245290 -169783 -210888 -125785 -50296 108364
28587 108364 321337 142787 33630 35336 128001 30547 1339 13272 -80398 -102443 -265235
28576 -265235 -270755 -35698 235779 88717 14834 -218770 -165782 -34540 58190 -43805
28566 -43805 -186271 -358904 -327455 -232708 -173746 -139298 -339396 -285922 68402 186478 37831
28555 37831 90762 -194131 -384455 -398147 -310107 -397688 -300486 -163287 -105168 -7041 -78284
28544 -78284 -128245 -47070 33910 -166438 -228215 -248352 8241 67336 122327 75793 -31047
28533 -31047 210 30966 3481 51337 29255 -207289 -60655 73427 -80723 903 155605
28522 155605 40016 -52684 -21376 -6957 -190917 -249323 -220325 -49895 -15091 -469628 -494307
28511 -494307 -227235 -180401 -193927 -91602 152394 74405 253478 447905 457383 442972 366689
28500 366689 190090 -15811 293 -49778 -69412 -180095 -122063 -255613 -151847 -96243
28490 -96243 -17020 405 -296035 -282541 -290187 -216272 -169122 -377838 -482549 -152833 -20466
28479 -20466 19352 64624 86933 74176 -47860 -133804 7303 113577 220273 295871 109254
28468 109254 51298 80886 184049 -29173 -37048 -18688 -369045 -478537 -378555 -262706 -169715
28457 -169715 -173569 -384062 -578305 -280933 6677 61509 177145 261625 334620 511283
28447 511283 388051 209713 272866 98753 121585 190662 4268 -207422 -225678 -80945
28437 -80945 26562 16847 -155589 -225727 165570 497219 244796 204911 151304 164333 32693
28426 32693 -50209 -64306 -48160 -83836 -213557 -144455 -1287 -93451 -311669 -508774 -370936
28415 -370936 -123175 -151164 -295704 -186141 -116935 -53138 -179572 -312315 -425576 -418145
28405 -418145 -462454 -146143 22321 -109231 -156663 -179008 -79377 -36986 95262 66307 121394
28394 121394 141651 80560 147820 160770 184947 108241 42847 -15326 -188196 -147891 -48900
28383 -48900 4916 101050 101363 122523 219407 183647 -79539 -243607 -175972 -58395 -118362
28372 -118362 -148096 -81612 -75793 170475 134181 235436 291591 360769 399539 446800 351848
28361 351848 272255 308226 214426 75188 79275 106204 39642 -154250 -147823 -164258 23178
28350 23178 93 -18240 42756 -29363 -76493 128732 151552 -157359 -196191 -50159 16371
28339 16371 57022 142678 192132 138395 117743 302512 430874 355372 69231 30202 53883
28328 53883 22358 -122058 -89891 135118 250138 127967 206218 209782 -23805 -278737 -221059
28317 -221059 -35398 244989 144316 32661 15000 155938 246002 296260 274245 483003
28307 483003 654204 375637 271369 -78330 -172762 13731 135740 317993 365503 258223
28297 258223 39317 6026 25037 86792 257905 216797 126660 -439 -128833 -79465 -131555
28286 -131555 -262380 -95740 164043 290315 191136 -53633 -208264 -298405 -361700 -316892
28276 -316892 -207847 -95613 -174210 -221721 -93088 -6821 -24718 -76320 -126284 -230006 -90141
28265 -90141 -240739 -114822 -4158 198416 301687 253778 268417 120715 -45756 99027
28255 99027 152761 -48608 -83467 -86289 -259798 -465180 -801503 -811592 -379514 37040 7386
28244 7386 -7326 83715 166057 -90259 -43351 62132 -49992 -27090 109697 105170 114004
28233 114004 -66080 -141031 153360 125189 -295809 -349124 -232835 -102728 -363641 -409425
28223 -409425 -350283 -323443 -412969 -408644 -232285 77682 225091 37195 194698 298002
28213 298002 217525 47795 57105 66919 -189995 -271459 156227 225614 312704 219809 116158
28202 116158 -82538 -269748 -256443 -259886 -147587 -111492 -4645 71358 129030 247629 65373
28191 65373 75278 343858 397249 280449 -88753 -315375 -489278 -192789 26429 239247
28181 239247 255757 205874 385059 335131 238520 258595 205082 143198 283468 281808 401339
28170 401339 391422 484052 127910 -22644 51409 164581 128191 33373 -28140 -182082 -460468
28159 -460468 -421245 -165783 36248 77517 177727 187993 -52733 -230818 -167048 -179460
28149 -179460 -335757 -370537 -295676 -239376 -243830 -246744 -225456 -146087 -178379 -549155 -501906
28138 -501906 -380859 -147873 128804 96690 82232 249960 338769 104301 -87372 17436
28128 17436 247930 335297 123050 183330 239363 -32971 -161751 -88105 38117 -73862
28118 -73862 15739 126605 158476 156002 197219 191299 8763 68635 215684 117858 84066
28107 84066 99228 170791 22633 95547 -5086 29237 301188 178544 157379 230041 -72430
28096 -72430 -156245 -289858 -409215 -261148 15373 59286 -80372 -104181 -125804 4690
28086 4690 -58215 -246400 -160893 -88590 -65616 -227970 -226231 25442 -121865 -332021 -421395
28075 -421395 -365721 -337695 -202551 -94984 181706 387344 321342 164755 149470 -8400
28065 -8400 -1045 -170548 -400769 -448101 -272709 -60393 -41336 -94899 143629 409117 440332
28054 440332 354071 362311 215104 47483 -38452 85036 15414 -23068 51571 356960 437156
28043 437156 296891 86731 84237 7492 -53171 -44131 161224 54189 -155992 -121616 -124992
28032 -124992 -152357 67979 199194 75061 -5377 -104011 16070 92369 149164 252989
28022 252989 196020 59968 152674 187888 308918 423016 306897 180258 56641 -77706
28012 -77706 -176932 -211369 20269 43759 256944 280771 -16948 128233 9513 -66599 -26770
28001 -26770 -160323 -205307 -110526 20093 170192 144736 109925 20719 -17473 54539 15900
27990 15900 144167 -57222 -53393 -113768 10998 271549 -20441 -263251 -146904 -11545
27980 -11545 -280683 -285080 -181093 -158963 -274806 -360390 -267062 -101729 -65485 80027 115744
27969 115744 -59140 -28945 13436 66186 137656 192015 365483 323623 175610 146802 180315
27958 180315 112453 135798 127891 -23113 -152322 -86051 122796 22737 -114649 -121353 117257
27947 117257 227247 132243 10980 -52857 -141327 -185552 -1873 -2670 -223351 -228341 -75923
27936 -75923 -69810 86621 114206 -94598 -127875 -196159 -162223 -29474 -210593 -259854 -29381
27925 -29381 -14811 9571 -62372 -8146 132415 86780 7155 -68151 -120808 140888 422920
27914 422920 230638 107153 -48856 -285261 -281945 -265333 -320638 -13615 236819 186427
27904 186427 89677 180654 288162 441216 437573 276752 203266 173075 80896 195777 329516
27893 329516 259970 45867 -93419 -184643 -293112 -171020 53288 18334 13359 161221
27883 161221 99813 96173 80885 171466 139777 129145 -141620 -120337 40759 40505 35919 -51199
27871 -51199 -231387 -269427 -142772 170265 214301 -13350 136247 185971 -35265 -104870
27861 -104870 8811 74666 -35148 -264585 -137871 -81614 -166265 44269 234071 351651
27851 351651 312017 141546 -39262 -68720 47580 108077 167155 206714 308620 239301 -37530
27840 -37530 613 45432 9056 -23749 10916 -31397 -123023 -202823 -92137 -22487 29172
27829 29172 -10004 -28301 -8204 127604 145818 51418 -93943 -128146 93923 148033 232691
27818 232691 306799 133691 72729 212295 233743 30520 -255417 -482366 -289517 99098
27808 99098 164539 31595 16372 12550 82702 -37223 -265637 -383360 -207781 61996 33522
27797 33522 102565 207636 -15854 -386662 -391582 -73992 50993 154057 348583 498822
27787 498822 509875 258932 168495 237469 302458 210705 160757 300528 388211 205428 -37972
27776 -37972 219433 304737 75684 -84986 -149050 -84384 299431 422658 337946 24866
27766 24866 209836 296526 269525 40270 -138181 -104128 -184395 -90165 116299 261619 327358
27755 327358 497777 457272 350020 336441 204956 208120 307837 114267 89894 163872 87594
27744 87594 -48573 -114623 -200944 -74660 -105453 -67242 164962 133511 199915 234519 43077
27733 43077 -61550 -286274 -60198 17723 151686 106169 -18479 95734 195754 186060
27723 186060 268526 295065 -15068 13023 122955 100059 50783 73448 76557 173205 63037
27712 63037 -326142 -440287 -341571 -181660 -110278 -31262 -170937 -348806 -417980 -160507
27702 -160507 -52835 -86220 -162773 -317099 -269873 -95546 -21296 71407 -67251 -40239 10205
27691 10205 -10432 -117717 51403 266084 19330 -248364 -271021 -324987 -291890 -309671 -328969
27680 -328969 -286364 -232017 17262 -135048 -120916 -91270 -59973 -172469 -100590 1930 4107
27669 4107 -163023 -153531 -168894 -271396 -486291 -524547 -445536 -418274 -340924 -201981 237478
27658 237478 284981 68464 250191 110413 -158433 -13101 195213 100756 -94064 -118751
27648 -118751 36582 86081 -174282 -232312 -9728 184458 254324 203078 82459 218003
27638 218003 152979 178373 242611 124108 -197594 -183630 -92661 -70422 -222178 -94569 -219782
27627 -219782 -257412 -264104 -245172 -68692 87874 -230565 -314129 -122922 -112755 -148476 -250148
27616 -250148 -263156 58268 118608 64459 25305 48729 146020 52028 77108 78411 -36217
27605 -36217 -254998 -302388 -214661 -14809 -40857 -75358 23047 -45901 -18423 42327 -123290
27594 -123290 -219171 -124374 19385 -2716 193334 85152 50652 -99527 -236912 -159425
27584 -159425 -205959 -157691 833 151490 320446 256113 115937 244235 -37921 -240480
27574 -240480 -182990 -112056 -62323 -49567 42446 -5368 66467 54677 141164 156916 -49668
27563 -49668 -336837 -408449 -218343 -16026 -22076 290111 283814 167076 199060 201026 26252
27552 26252 -2149 -130711 115979 467511 219377 131398 310092 306912 98061 -50624
27542 -50624 12457 29147 31540 152800 80344 -196974 -248406 -260713 -199690 -215215 95830
27531 95830 194326 408256 351743 97026 145401 239607 223928 140981 -205 -115197 -395836
27520 -395836 -578487 -363487 -201561 -229670 -228534 -232942 -184649 80564 368722 303911 342443
27509 342443 440203 464231 404735 225644 -34523 19415 37068 -95309 -24547 225951 344722
27498 344722 284561 405116 500485 464467 258009 195104 188662 133816 -252 110441 239430
27487 239430 275389 387257 310268 163365 148404 38662 146795 141625 -31038 -44773 -15026
27476 -15026 -3080 107232 115815 649158 655353 558426 590182 474302 420640 381785 360845
27465 360845 430458 413338 467267 396351 33818 -334458 -546176 -494376 -526013 -167008 -76196
27454 -76196 -52702 -214387 -104421 -27629 173479 9184 -199229 -131781 -161825 -84609 -106189
27443 -106189 -82837 -98993 -85423 146044 218980 265198 123052 -27029 45500 170577 258305
27432 258305 211185 -103404 -492591 -308793 -200135 -96049 -44613 -201687 -317354 -170676
27422 -170676 -4423 205916 199982 89689 -76738 -185513 -264426 -290482 -191085 -200500 -281896
27411 -281896 -93826 18628 90557 125110 -48978 -90441 -24360 -25872 7514 -216338 -300537
27400 -300537 -51843 153102 448816 373746 155368 203532 292929 254762 220517 174183 -65416
27389 -65416 -105657 -23722 -151098 -335027 -214077 -186682 -89836 -3177 101229 24902 120781
27378 120781 89820 -230675 -169701 -132898 -250034 -79987 58143 -146103 -283002 -138113
27368 -138113 -18227 99624 160426 131285 114823 -127359 -191107 119801 56015 -73462
27358 -73462 -91445 -55983 53031 63350 147753 286119 94596 -157381 -147931 -293224 -331434
27347 -331434 -267321 -212208 -198943 -209458 -68914 113759 10089 235062 223569 392323
27337 392323 441873 423808 158123 83319 -28288 -166850 -224239 -138688 -57002 174240 254278
27326 254278 62027 -115344 46009 87301 101589 198765 -9387 -44792 -109145 -286583
27316 -286583 -302070 -201126 178604 138783 -314589 -331182 -299135 -356578 -490877 -328727
27306 -328727 -296175 -153643 57126 5183 -18887 -64424 -50598 191644 412530 563141
27296 563141 353740 193022 92574 186762 107206 102961 -52347 -232947 -144407 -44599 354052
27285 354052 494281 438198 489205 336868 403387 376986 221170 -119853 -220133 -52164
27275 -52164 59465 -126780 -25978 150427 127540 -14956 59740 -14952 -163203 -66928
27265 -66928 122322 148829 -65451 -11264 -24809 -42988 -177033 -112292 -115284 -113601 -61777
27254 -61777 117561 154399 87640 -6999 48706 144931 187920 222804 184863 344404 444582
27243 444582 225272 42431 -125397 -4132 -39417 103260 301591 419174 362974 196385
27233 196385 177223 267232 278435 257233 106435 -114665 -211018 -54601 19806 35286 101036
27222 101036 381821 260001 -88416 -71386 -10716 -163092 -132504 57575 -97935 -135926
27212 -135926 -45216 20300 194259 280989 543275 597723 363039 50329 -23955 -88656 67265
27201 67265 378581 188061 -147819 -210371 -184818 -39335 37753 115671 182573 53158 -32600
27190 -32600 -109119 -202976 -135426 92821 286045 215857 22679 -78747 -117034 -137802 -148408
27179 -148408 -310334 -237733 -173209 -197544 13847 28324 29908 -56668 -253269 -95823 -35838
27168 -35838 -222315 -423056 -444791 -183528 -246288 -128550 -81842 -375294 -394854 -216987
27158 -216987 -129574 39594 211887 50109 -191536 -77865 1210 -2192 -20010 -587 12769
27147 12769 -34731 -244115 -350575 -324767 -287158 -317663 -282791 22639 75306 -6345 18947
27136 18947 -130129 -133922 -140979 38465 162767 170187 148671 262505 359143 237447 429484
27125 429484 631709 480050 187628 212181 -34672 -103973 -96734 -23994 63707 265840 297533
27114 297533 174313 44371 18389 112651 172593 230871 304298 128784 -61183 -129204 -179640
27103 -179640 -116614 -99616 -39723 43963 140628 144852 199559 256641 216984 5708 -202793
27092 -202793 -215303 -246654 -103195 168962 110698 6764 60567 -81987 -229988 -395191
27082 -395191 -360583 -441846 -217080 -198288 24246 105903 9737 -86130 179421 106460 -177349
27071 -177349 -10808 80753 47239 232023 295154 404755 315260 129428 80859 -182647
27061 -182647 -393763 -282731 -48604 -25153 -118558 9580 38390 97217 -71380 -35484
27051 -35484 114234 32053 -164321 -257918 -403465 -480253 -201530 -50355 179706 171293 120196
27040 120196 -65988 -101682 -58493 7556 159431 17565 -117913 -374051 -272723 -147734
27030 -147734 12009 201907 118243 -89783 -78376 309530 255599 9579 -33263 -265617
27020 -265617 -172277 14035 121064 192594 310154 104812 -186827 -175291 -90641 87550
27010 87550 307208 341522 180376 81272 38557 30510 88197 272555 119903 43454 -94216
26999 -94216 -19661 -83254 -292843 -166791 -70274 -71958 -187258 33903 55121 -2500 74174
26988 74174 25663 -49028 -253850 -210534 -282091 -630937 -642687 -293122 -297719 -149296 -50787
26977 -50787 -112262 -95305 -160655 -130434 -185491 -322923 -402682 -342234 -138658 127886 237167
26966 237167 144212 114632 -33520 142967 234958 15261 -198986 -316056 -521461 -305684
26956 -305684 -185626 -331964 -347185 -201415 -238619 -150991 -11865 247127 319793 341798
26946 341798 375528 222672 81269 -161632 -100550 160312 407018 486009 326037 92527
26936 92527 -70616 -22146 124290 95914 305382 381993 257898 242338 219360 228608 87062
26925 87062 -77389 -287032 -136220 -75243 62988 228146 40731 -183921 -144503 150706
26915 150706 104063 84032 300769 284958 258777 23641 63459 109244 212964 174458 251331
26904 251331 170866 152896 146262 72839 150486 233819 -99628 -251256 -225954 -523148 -339914
26893 -339914 -277149 -18154 38231 71806 177891 89951 -151081 -267989 -136586 42642
26883 42642 -65124 -78221 -60832 -44410 -33005 44086 -92711 74034 167837 117293 -44036
26872 -44036 -154304 -176337 -210789 -250891 -115538 159014 205226 202938 191325 197685 106929
26861 106929 191120 179440 178513 173894 135176 65977 -276909 -162722 -17645 -196445 51522
26850 51522 108841 -55885 -121863 11352 65763 119382 -75229 -215996 -310919 -313209 -200561
26839 -200561 -264564 -267503 -243123 -126714 -75161 -61070 88332 67195 -29622 -63895 -28309
26828 -28309 11249 -118302 216547 376849 552735 612046 175272 -89574 -86176 -130417 19648
26817 19648 114895 2841 107782 426258 385624 244094 203381 -23812 213991 404377
26807 404377 45547 -166251 -255910 -187397 -66982 -117649 109587 281209 316577 341659
26797 341659 287381 170324 83294 22802 199350 172962 18354 -116292 -95940 162280
26787 162280 342266 284017 130712 64158 26687 30761 -118976 -67875 100758 202779 3951
26776 3951 16438 19916 193244 326212 329503 173001 107271 21323 94620 23818 -9140 64
26764 64 108439 120601 153218 111235 106061 380156 339567 282186 432095 581155 484998 333140
26752 333140 413467 492246 462619 176675 -125353 -162650 -138012 -390328 -553147 -215172
26742 -215172 32769 -163664 -304649 -356942 -109307 142148 139131 31212 29714 123458 -51535
26731 -51535 44993 43450 -128517 -166926 -160520 2642 492815 612078 417138 181376 293574
26720 293574 350107 543796 452816 170966 258174 381638 286986 164953 109385 128624 173007
26709 173007 -43871 -68892 -97796 -70537 -99701 -101713 -211650 -104965 -153722 -403952 -564139
26698 -564139 -422078 -219370 -265143 49418 159541 86537 -43293 3471 84833 179588
26688 179588 190018 141934 82139 -87365 -6965 -45542 -99034 822 313516 180199 -60566
26677 -60566 -164219 -266017 -326897 -300375 -271239 -53167 -57693 -156896 -27973 -152858 -385252
26666 -385252 -378947 -286918 -241141 -293301 -214594 -315918 -352691 -188118 47069 152797 -4055
26655 -4055 -293187 -292279 -221517 -223218 -357013 -297001 -146360 44537 165987 34299 -8327
26644 -8327 -253200 -444541 -620702 -235334 132827 -7224 -78760 29219 -115527 -197747
26634 -197747 -112554 -126820 -166164 -94966 73639 191551 232200 344518 110191 92593 250506
26623 250506 222881 461244 472686 445636 304847 337265 224542 32022 -56268 142680
26613 142680 346192 105316 -320144 -481169 -237591 -386476 -632193 -435931 -360997 -288402
26603 -288402 -323795 -363822 -2612 221582 267073 180375 63528 -3016 -46875 -4531 47565
26592 47565 39481 116041 102650 -31614 133198 201345 28668 -66441 -100364 -88170 -76451
26581 -76451 -132063 -19853 -12268 -11663 50523 45695 159919 -4490 -199082 -350192 -114990
26570 -114990 194704 281523 312635 173702 -102114 -157049 -250302 -111100 -89151 -36619 37243
26559 37243 105654 172481 156463 16071 2606 -155526 -210127 -199598 -260684 -412534 -214330
26548 -214330 152859 197538 -151025 -202408 -163856 -96149 -210879 -308836 -232387 -71321 186360
26537 186360 83747 -179375 -271280 -139305 74318 155643 -38297 -118419 -111221 11480
26527 11480 83798 -274485 -576284 -682571 -388948 -54047 -129350 55202 91101 152382
26517 152382 46796 -25569 -23371 -107832 59271 -67878 -161259 -134992 -236832 -294039 -115676
26506 -115676 58417 94416 -27863 -339620 -378529 -220125 -47903 -77695 13633 68978
26496 68978 -63171 -197565 -281211 -138925 -107904 -242245 -39710 107423 109773 61962 19775
26485 19775 48528 -163120 -264595 -163724 -242890 -345059 -242382 -108715 -113965 -317271
26475 -317271 -346523 -186171 10376 89579 -216034 -144101 146877 125939 47828 -137235
26465 -137235 -168933 -170923 -219869 -386929 -384958 -444300 -408665 -177128 41843 80745 31626
26454 31626 -52306 92790 199239 448132 384633 524923 746865 729190 508868 361538
26444 361538 262397 149696 7907 -43251 -160641 -277196 -18998 210707 23136 -254820
26434 -254820 -138522 -206601 -150884 -43450 -54575 48053 36810 160107 330207 210514
26424 210514 107955 199996 82773 112574 76360 -77138 -87372 -109957 -131838 30994 4978
26413 4978 45584 291532 325075 271866 19221 -72586 99030 13131 -168356 21820 87328
26402 87328 53918 -30261 -78479 -122562 -297554 -463883 -471101 -343913 -133780 -228673 -153961
26391 -153961 -18675 -208725 -147072 -218865 -158029 -54958 17363 122738 69065 155811 38542
26380 38542 -202870 -132232 -150095 -111756 -145672 -9784 244068 350824 358654 162120 49636
26369 49636 130159 -22771 -73090 -54558 116113 185456 194909 44178 -45782 -408623 -345949
26358 -345949 -301798 -341103 -65949 -47247 -50413 52823 423807 278090 166127 131441 2549
26347 2549 98004 57389 161316 89953 71646 17099 -21119 -14134 219634 359399 426625
26336 426625 277575 -18351 -113077 116820 107175 87610 -40801 -214993 -322766 -459676
26326 -459676 -551067 -548657 -473821 -268585 -151631 145465 298545 -93043 -359256 -81781
26316 -81781 75231 93300 49074 11916 -29163 -1856 92686 68433 145522 215517 323393
26305 323393 494619 410638 409907 318384 374875 398619 409433 420796 401681 142320 230004
26294 230004 366257 376717 367368 261000 229472 48149 -67507 88805 -237385 -224529
26284 -224529 -38795 167439 246882 162416 134907 193253 283084 269347 57156 10102 66520
26273 66520 -34448 -230091 -230942 -250658 -288020 5973 187658 -12403 -4079 -22783 -48649
26262 -48649 -13824 43664 6430 -73593 -94005 -70115 -146033 -148855 -162190 -59923 62912
26251 62912 -128691 -97286 -115257 -12624 206566 290524 173255 147929 80225 81787 87726
26240 87726 27870 -42285 -211754 -52636 269153 296910 183787 160633 323297 514844
26230 514844 558364 373523 -38846 -226793 -402080 -412877 -362681 -160732 10839 -294093
26220 -294093 -337374 -431227 -216961 89740 127027 -22761 21554 32180 28920 -57603 -53485
26209 -53485 2583 365994 402799 199154 -57760 -95272 -164096 -33702 199605 261583 185269
26198 185269 125381 301497 179520 25307 187094 345429 389189 318445 329717 444343
26188 444343 387630 121670 -252648 -354021 40585 208880 227247 150573 110694 -59578
26178 -59578 -283888 -85984 -2708 -45823 77496 37073 -1075 139757 308010 400223 320232
26167 320232 134904 -158177 -135329 -24806 28346 -55840 112793 214613 356790 200258
26157 200258 119091 148290 189274 252034 247544 163459 11271 -169982 -122811 -297785 -85553
26146 -85553 142950 141903 146846 -252893 -299691 -108048 55 -37848 -68608 100094 129283
26135 129283 279278 399403 140036 -185742 4767 1435 -71002 54490 -77484 -79503
26125 -79503 -137243 -354228 -464796 -398145 -418515 -334318 -396428 -265108 -285083 -252283 -95104
26114 -95104 117302 89286 -75213 -129497 -77450 -68204 244804 448950 210775 -118313 -164362
26103 -164362 -4816 -146944 -419781 -446916 -107586 -225708 -367757 -292406 -192220 -44282
26093 -44282 246152 470238 270616 200713 175393 89049 -60315 185768 372739 514092
26083 514092 301494 47994 -277243 -321935 -315397 -265713 -426740 -548126 -290329 3760
26073 3760 -4547 1942 -151879 -239016 -451576 -513868 -581496 -473501 -94202 98491 177240
26062 177240 186092 277248 376224 269750 233167 96109 210653 459539 594851 666982 748159
26051 748159 594178 412224 245739 235155 96060 -122264 22725 264628 247579 188922
26041 188922 223552 89374 107317 125227 212013 231336 12122 -122748 -189715 -92633 132420
26030 132420 237211 257600 171821 -58078 -92518 -55069 -46065 -193101 -370431 -423538 -401720
26019 -401720 -171644 -192316 -316084 -267509 -8833 -3302 -79241 -208776 -89688 90837
26009 90837 296885 295742 87350 52884 129029 111188 201491 86583 -28308 34976 150121
25998 150121 214647 86753 -158300 -252138 -322925 -155192 11638 84545 195784 176184
25988 176184 192425 238843 82452 125605 389373 319931 263642 160280 251642 76141 -170095
25977 -170095 -165661 -90916 15915 -1934 75304 224788 192939 165134 -20121 4262 11429
25966 11429 37799 224006 336476 216918 240326 268710 183465 121532 39775 100564 252134
25955 252134 272807 -32915 -176669 62715 45775 -125160 -37074 54681 -159323 -263645
25945 -263645 -90061 64303 68711 75333 -68152 6549 205263 472606 388868 340158 255227
25934 255227 -13824 -295755 -267475 -111485 9929 59163 98899 332165 296703 66039
25924 66039 -159292 -268292 -191603 -124007 -63388 -77322 -154332 19979 334933 300804 64702
25913 64702 -45296 -57897 17415 40884 -25810 118143 201755 333702 342331 354239 298776
25902 298776 253036 70072 -71033 -59090 -102954 -156249 -266195 -256372 -220695 -42674 -18953
25891 -18953 62060 595 -157019 -179577 -80683 -27231 -24278 -327379 -254117 75941 10030
25880 10030 -48885 -60651 16243 285000 482225 620428 379288 186976 9791 -30353
25870 -30353 -146075 -157615 -33493 171354 345883 137185 29629 59987 36580 12191
25860 12191 -7935 -32093 10962 -73499 28794 82097 -171424 -191931 -303470 -307331 -318576
25849 -318576 -261902 -314158 -202334 -122530 -109099 -8008 137887 -126832 -322570 -252782
25839 -252782 -130937 8839 154154 218772 105950 5039 40161 99319 179792 -22404
25829 -22404 -171972 -259486 -206095 -5161 -313631 -439767 -147871 182109 88669 -27895
25819 -27895 -298255 -322891 -110248 -67670 -286480 -216419 -96281 -80622 -12465 187570 340108
25808 340108 378601 280056 187563 169106 -80012 -84014 70890 97460 141875 99326 87192
25797 87192 130126 79035 99072 122982 99888 110771 -85568 -70913 81383 95095 90266
25786 90266 183792 198203 -1309 -199671 -56699 208346 201427 30759 -53155 93306 496014
25775 496014 598077 570389 580905 555368 511210 248748 127151 138573 166595 -27993 73058
25764 73058 192187 252983 218034 144418 147262 103853 57524 -353164 -700812 -520025 -302792
25753 -302792 -234413 -210729 -12513 120198 74703 -47654 -98365 -278453 -314536 -313210 -197350
25742 -197350 -220761 -266481 -217990 -79223 29706 99233 -10808 259614 459881 363699
25732 363699 274076 17840 -223530 -16625 -47837 23061 -201960 -280049 -365338 -236645
25722 -236645 -216520 -395611 -397726 -133846 80046 270526 41179 -312491 -192011 -77345
25712 -77345 -65625 -119740 -225870 -143409 -171269 1856 9033 -45273 221691 423596 213363
25701 213363 266934 57311 -75956 -17554 203912 178681 -13425 42991 -97109 -189306
25691 -189306 -161109 -115109 -199329 -130217 315653 382506 172988 96293 395146 483755 333537
25680 333537 129781 60672 233071 261793 -208992 -205896 -184548 -258948 -298680 -409611 -493737
25669 -493737 -415321 -292926 -207900 -321358 -208616 -35940 138818 80171 -179999 -273222
25659 -273222 -249772 -299536 -265105 -293803 -384402 -332012 -317693 -319011 -291912 -295134 -174050 33367
25647 33367 31864 -96146 -64856 -68510 -126599 -224489 -142126 20944 -110466 -247835 -204988
25636 -204988 -15349 238919 191164 -47508 -189108 -155116 -53933 39218 60359 -22167
25626 -22167 -95772 16636 225258 217323 189341 172140 113818 20874 -198999 -201185 62996
25615 62996 -39313 -190573 -189422 -119332 -16676 54083 144022 56845 239272 189299 74005
25604 74005 -101385 -161349 -282636 -355090 -715406 -792335 -601830 -343464 -105716 -39653
25594 -39653 138106 305862 443356 448326 387117 191630 177715 230551 183398 310036 207879
25583 207879 116602 -60591 -203368 -275036 -226292 -155162 -69736 -156634 -263772 -442564 -505033
25572 -505033 -381204 -131507 -190402 -198733 -348946 -506932 -317739 -116365 -245415 -46379
25562 -46379 227327 219065 151884 107025 191335 -74328 -28870 93510 220767 58264 -237505
25551 -237505 91937 106924 -26057 -111037 -72080 -200475 -90161 -100741 -206228 -81412
25541 -81412 180842 166898 258134 295251 261389 74440 108007 106314 -19177 -169118 -119866
25530 -119866 35856 231035 191451 90473 -62905 122496 194620 46577 -56132 -106495
25520 -106495 -186137 -329428 -48351 131776 181278 90355 -121363 -185168 -177359 22617 -86616
25509 -86616 -279575 -412045 -231946 15917 220631 502521 432832 279873 107617 186478
25499 186478 189687 97850 62473 39227 35328 -83896 72102 171242 71752 261169 208340
25488 208340 107459 49174 30366 38029 7833 -58000 -96521 36169 269526 161014 -63387
25477 -63387 -168481 -101868 -236904 -360089 -314990 -100819 -33522 -366305 -340784 -210959
25467 -210959 -202298 -8815 97340 210542 80321 -141762 -80950 -112963 -279321 -286895 -326836
25456 -326836 -332815 -240706 -228523 -527366 -487418 -116160 18308 -207007 -270026 -297283 -416682
25445 -416682 -436707 -425514 -500846 -168260 -129802 -13765 -43656 17920 167269 200877 107912
25434 107912 147841 247583 -12825 -71375 -154205 -209878 -389493 -262174 -355849 -464989 -485729
25423 -485729 -222434 217097 373084 102901 -22386 248495 114210 -304041 -361273 -269693
25413 -269693 -152324 -177268 -126022 -203726 -225332 -87134 11919 184411 150060 46617 -274584
25402 -274584 -399677 -164010 68980 -91372 -155878 -233831 -292459 -242801 -308835 -144815
25392 -144815 126543 422446 554393 311514 67757 -39511 -81979 -69783 -82328 -101815
25382 -101815 -151672 -111027 12839 32044 129205 212858 309644 36116 95169 -136187 -64900
25371 -64900 139776 226055 3748 -31515 186736 256706 246922 341630 596609 468290 181660
25360 181660 -33360 -122089 83686 135244 203168 357339 404334 496716 215756 -29069
25350 -29069 143127 131585 32828 88862 167394 277269 131686 63970 -61565 3217 -331092
25339 -331092 -362752 -171167 -49183 90057 245859 149939 -49783 -247501 -345794 -228877
25329 -228877 -260693 -208557 -319321 -581087 -549274 -274407 -72040 25651 32367 169546 330793
25318 330793 191398 40922 -116889 -85369 -95258 160846 357576 347960 251695 -55742 -126069
25307 -126069 205796 47982 -305187 -312229 -147935 -11568 158669 -142617 -327327 -70704
25297 -70704 -3756 -147762 -162523 -68475 75675 157667 -519 -119964 -226537 -327634
25287 -327634 12435 74454 14404 -244871 -233387 -40963 -158514 -80568 254376 308312
25277 308312 54921 -127555 -154784 -45987 -56278 66367 281555 118419 -20317 -153820
25267 -153820 -58740 -34976 269302 214090 86460 25424 197834 97953 -173658 -238834 -279348
25256 -279348 -386461 -431205 -292004 37573 41022 68115 14971 9432 71559 30861 -22101
25245 -22101 -206527 -214271 -184059 -43987 -53384 -175526 -124314 -37675 32768 -120401 -298115
25234 -298115 -480599 -496425 -153376 -96587 32683 209291 153274 71257 38337 -23229 52888
25223 52888 -66393 -138655 -34228 -83133 -148037 -181563 -105431 -211862 24313 119952 313668
25212 313668 382937 214186 132831 -52633 230087 373392 313872 240398 220893 354159
25202 354159 345279 168875 341862 175162 58629 6138 196263 214318 42644 -228317
25192 -228317 -387025 -353598 -116658 -118990 -142446 -97502 -38527 -59314 -202955 30568 196368
25181 196368 -78717 -78522 234417 301487 411564 310829 255254 84602 -54163 -76768 -352571
25170 -352571 -278461 -273239 -158181 -170160 -235622 -123224 160557 171380 179538 69053 35676
25159 35676 50203 87794 127357 227596 273364 249004 -94167 -303348 -71488 -135487 -164478
25148 -164478 -146176 -234912 77063 139286 172089 263645 266485 96693 -70148 -121943 -183662
25137 -183662 -430278 -676217 -424219 -260949 -277551 -251696 -411842 -288417 -177306 -250376
25127 -250376 -415514 -536670 -421323 -476373 -105716 52870 97704 213309 45599 -4665
25117 -4665 116394 136391 143545 23293 19268 -64806 -107081 144009 342727 297359 74289
25106 74289 -60302 -80740 45578 60678 20100 -101599 167193 381767 289870 332028 245373
25095 245373 226510 335914 86733 -93027 -225598 -117573 -208850 -291334 -259754 -109770
25085 -109770 -151472 -50239 251816 6300 3334 -154298 -269805 -98516 -69885 -53511
25075 -53511 68613 27454 -75088 -142264 -190145 -105297 8841 -146187 -252591 -229114 -260740
25064 -260740 -445231 -394066 -256299 -212055 -3617 204252 230220 173697 97539 -93001
25054 -93001 -244860 -74203 -12009 13817 149719 -130634 -254035 -84821 -54128 -95018
25044 -95018 -114937 -204982 -78074 -24452 14711 173273 242340 200719 57000 75947 58723
25033 58723 -132750 -205616 -146503 -184748 -58385 20935 30613 106226 120714 -241242 -307637
25022 -307637 -260300 -105315 16768 -127435 -73577 31309 -34220 -115597 -15869 17704 75890
25011 75890 -21595 -178878 -268599 32578 25077 5366 -73187 -146441 -224338 -161612 -238802
25000 -238802 -386047 -191920 -10901 -41568 -274778 -331579 -557924 -596125 -304014 -65118
24990 -65118 5659 -120572 -74003 -160049 -332258 -312853 -222227 -179309 -237094 -392711 -363833
24979 -363833 -272939 -166242 -274239 -208535 -211623 -291989 -316647 -230165 -279000 -303699 -327466
24968 -327466 -110980 -93485 -198222 -86058 78754 335683 546388 514338 640761 421879
24958 421879 36304 34503 162742 187618 67216 63197 57364 40029 88695 214127 148668
24947 148668 -42567 -253919 -287663 -102821 201381 248397 220621 109625 63181 105936
24937 105936 134190 44761 97591 200171 -88735 -199656 -107305 -62365 -75142 -102232 26121
24926 26121 -119444 -312709 -161839 29788 300425 449131 63607 -62736 313289 438280
24916 438280 490514 109531 -17081 144821 587168 857601 616075 188855 124290 94305
24906 94305 145939 58624 -29503 2298 14980 -178492 -52244 238558 319109 312716 278765
24895 278765 351433 245007 144794 51865 2095 -76483 -261969 -398221 -194564 156199
24885 156199 218710 50611 -10197 -27830 -88334 53550 17001 -25384 -185535 -277805 -420585
24874 -420585 -592477 -539151 -406014 -377928 -310050 -185566 58658 -16565 -178859 -150080
24864 -150080 56489 117116 101961 -136726 -254015 -355390 -119180 184687 214477 324215
24854 324215 432309 285382 183965 182039 210841 204243 223525 243579 176698 148718 126392
24843 126392 96662 178958 25992 -113395 -159873 129947 338415 280715 32973 -95973
24833 -95973 -118845 -72917 -85655 -139787 -352081 -483664 -435900 -237289 -118032 -296627 -370262
24822 -370262 -116657 51729 -33763 -24933 -59218 -250396 -188054 130344 -3282 -175461
24812 -175461 -76299 761 117452 205396 159873 43071 -19190 -157109 -230750 -212654 -187217
24801 -187217 99057 185358 147049 1161 112339 2334 -143251 -141179 -1002 -44892
24791 -44892 -147228 63119 381333 313250 -96337 -263884 -290217 -104306 -107242 -80800 -29673
24780 -29673 2590 -43981 146058 359245 145202 55684 162669 -5293 -267136 -557297
24770 -557297 -534264 -596140 -473865 -350140 -80443 17567 -21611 97302 263406 259634 233673
24759 233673 74240 106241 115108 114876 212001 224866 33928 215827 276413 396814 351028
24748 351028 270239 152620 18650 -106011 -114273 11498 135588 -18440 -36309 -107685
24738 -107685 -377613 -249833 -54558 -35667 -107916 -138911 -117716 79210 274053 186406
24728 186406 -123568 -329131 -469621 -485626 -473503 -496497 -520395 -330314 -247111 -243038 -199701
24717 -199701 -7179 -102428 -148150 92569 199602 201650 93290 108148 127529 -19405 -205630
24706 -205630 -389405 -53899 70545 319795 297543 235774 181832 135192 228753 297497 89217
24695 89217 -11321 -207694 -222708 -199642 -157966 -95344 -161127 -254928 -322330 -189512 -266637
24684 -266637 -345586 -140852 -26495 -109534 -220690 -149320 -436968 -307105 -436696 -502669
24674 -502669 -432255 -237818 -166679 -69989 -9276 -141335 -122781 -179037 -153797 43443 189218
24663 189218 12382 181154 11998 -163475 -72571 106518 252475 20347 -96256 127282
24653 127282 114877 77259 103240 -21099 191782 253842 243154 153112 221682 356461 131637
24642 131637 -42242 123012 47567 -159098 -276454 -418003 -401619 -339526 -311886 269
24632 269 203064 61971 -199400 -295549 -229590 -109586 147614 290609 240362 -65720 -121782
24621 -121782 -54294 51883 175126 230762 -102367 -24579 187946 37778 -72379 -11840
24611 -11840 25938 -3686 -34121 49851 52483 94279 -88162 -282903 -360778 -249427 -315367
24600 -315367 -318656 -174259 -75664 28209 -38152 -171935 11545 14554 27571 91398 43709
24589 43709 16338 -108282 -73707 -113733 -5921 26155 -14655 41080 123401 65462 113260
24578 113260 -63743 121080 302664 216902 113754 383075 508615 404918 249519 -49626
24568 -49626 -212073 -409089 -277343 -191505 -183567 -162363 -290973 -280736 -221841 -109793 -214882
24557 -214882 -27770 -22036 -59737 -52769 -26690 -19894 -97050 -230651 -224148 -375914 -339133 -348378
24545 -348378 -384694 -198360 -106863 -191507 -84849 75439 179189 354282 216823 47458
24535 47458 -13706 -112037 -162443 -102944 4527 -101784 -213373 -241700 -449433 -334915 -192512
24524 -192512 -174500 -56386 -173108 -87032 139304 92877 37579 -236397 -322997 -456903
24514 -456903 -448984 -11282 67120 83083 -75048 136398 227100 63968 -29041 -29703 -113158
24503 -113158 66453 -31814 -205968 -41231 -13677 12275 -18287 -64340 -55124 66199 73029
24492 73029 -160961 -278840 -302987 -169053 -241412 -202555 -170628 -163761 -133722 -112626 -33896
24481 -33896 113020 -125666 -141710 -155601 -117403 -30391 153642 129546 -3838 -186476 -315559
24470 -315559 -43424 145461 -16373 -114119 -175593 -197999 -20481 353880 227544 98490
24460 98490 136105 284895 185125 89151 46792 -239276 -246261 -228978 -444567 -332837 -114118
24449 -114118 5402 -88043 -111200 63744 128237 130128 202311 191186 149800 231972 327633
24438 327633 229697 108272 10458 -29754 12112 114557 112653 264253 269028 -39123 -322069
24427 -322069 -130882 294476 416932 235818 26023 -133943 -563626 -560230 -425123 -233360
24417 -233360 -184163 -69338 107457 185052 288384 190927 302137 404312 147139 19175
24407 19175 -185540 -390208 -174256 150829 192846 260127 351415 366055 226925 -39200
24397 -39200 -214243 -221247 -401418 -212856 134622 183452 -88282 -224695 -319250 -320455 -250803
24386 -250803 -290421 -261826 -73500 -72459 4117 -14678 -37999 -151598 -31440 143248 298426
24375 298426 455463 312227 6579 -252187 -262890 -225920 -333527 -215084 9881 -50552
24365 -50552 -17984 37117 -148435 -238705 53501 85571 108952 12465 -334148 -418036 -366020
24354 -366020 -203215 118203 252543 67343 -187855 -429177 -438807 -276507 -353009 -528962
24344 -528962 -559422 -448358 -225644 -142188 -124050 183999 459579 430826 386462 257585
24334 257585 104873 -411203 -639351 -495399 -317180 -295746 -233477 -144825 -211709 -142788
24324 -142788 -229316 -211239 -153315 -258385 -267948 -239030 -407382 -359570 -154377 -104778 161934
24313 161934 239514 173913 -61091 -99991 -92774 -142250 -274116 -125307 -91868 2629 132159
24302 132159 52732 -77540 -182924 23032 175756 123715 -186528 -303135 -191406 -158405
24292 -158405 -169458 -69234 -236811 -271781 -383324 -371194 -341844 -189991 -43769 37681
24282 37681 158935 83631 -11730 -14994 35709 -97035 -225301 -229465 46262 190874 354995
24271 354995 290057 196600 74350 10655 50801 239187 316205 360905 246250 404280 563423
24260 563423 515088 386527 303091 55350 -20074 -72588 29617 333843 317257 -54358
24250 -54358 -195607 1676 13767 57055 220011 237570 304317 464254 387203 376743 312736
24239 312736 165007 84972 71226 354043 354917 121725 29383 -3108 116764 47792 -80737
24228 -80737 34601 221409 274615 396227 268484 245375 356385 395677 299829 80817
24218 80817 -94595 -50248 -74026 -3851 253319 294367 47094 -177722 -251550 -188051 -12636
24207 -12636 109644 248506 331250 288025 193759 133680 280165 234430 107918 56910 -128900
24196 -128900 -165295 -262391 30719 193160 161362 115239 141038 409320 425010 256541 -98318
24185 -98318 -96780 -100076 112077 236894 241881 41905 -13433 -53995 -77229 -175668 -100484 -23995
24173 -23995 223624 296138 45280 -178271 -76987 -54745 -237499 -223548 -42144 -26622
24163 -26622 -86988 -20944 309302 348910 271545 187313 74661 -56117 -60 143751 370126
24152 370126 490861 457478 147376 243218 518542 402890 80521 87603 185832 121716 201815
24141 201815 167926 315638 572066 462526 102027 -95542 -26359 104176 257841 163168
24131 163168 -197780 -304992 -311471 -285003 -170315 -102940 -6862 -27249 75766 171037 364559
24120 364559 285286 356994 366470 231691 197434 72565 161535 158533 -99234 -125218 -25670
24109 -25670 64193 92655 28175 -30998 303659 182701 -109333 -287493 -323524 -259101 29199
24098 29199 50303 -182085 -153425 -6910 15469 -169623 -227358 -139073 31805 18064 3660
24087 3660 -48847 -78595 -140899 -18338 -106625 -254228 -126804 -88905 -17486 -160437 -11968
24076 -11968 233566 252624 141476 114018 44277 -56451 -214948 -215633 -208724 -489566 -640422
24065 -640422 -341662 -300594 -469799 -512876 -272796 -131405 121237 486132 635367 597025
24055 597025 386628 173979 227179 314131 286892 98239 42159 -38061 -142284 -37526
24045 -37526 -141041 -299559 -386450 -245783 -225607 -330802 -146561 8888 157760 59148
24035 59148 37701 180395 277582 303457 337113 406499 429964 361826 282089 119727 104258
24024 104258 278377 525970 445003 171333 49938 63010 42556 -81927 -194358 -70978
24014 -70978 -89611 -161435 -11025 -51212 12263 13172 26810 96940 43050 -106024 -85425 -16702
24002 -16702 21365 208089 145654 31315 75160 69974 -143622 -222416 -354847 -328092 -197432
23991 -197432 -190088 -175861 153337 190704 34051 107834 118666 90058 4725 -79344 3922
23980 3922 -88292 -208245 -303297 -244093 -203569 -256086 -217783 -158014 -90049 -85591 -93011 -278159
23968 -278159 -53685 152709 238994 182955 161720 9415 46122 120539 156030 133480 83931
23957 83931 83193 142408 118731 401335 610376 513622 324753 171983 83370 74711 -244355
23946 -244355 -403380 -276380 -26104 -134342 -95659 -34358 -59280 159484 111107 336451
23936 336451 436968 353918 487305 412350 56679 28921 165703 199384 76205 -39778
23926 -39778 -9492 -210451 -345944 -325299 -167046 -231951 -418146 -373397 -260080 -210053 -195922
23915 -195922 -103496 105953 135732 54947 -118267 -149089 -194823 -94356 59427 134772 -17440
23904 -17440 -91405 114213 34482 -145674 -221168 -147305 29479 56870 106444 180325 260748
23893 260748 294159 460948 321718 94056 279896 273765 91434 -237249 -187035 -114707
23883 -114707 -39275 76547 155657 228664 229178 77180 -15274 237237 414195 400317 292843
23872 292843 179584 241973 419826 314320 259281 181373 47205 -322829 -546858 -486081
23862 -486081 -209964 -172252 -97646 -74102 -69766 112983 208251 -19413 -36565 74158 26143
23851 26143 4402 183451 47718 -87790 -66212 106137 175351 98803 70576 139455 277555
23840 277555 211469 -8504 -167993 -252482 -216440 -323341 -125913 -162916 -36100 278720
23830 278720 428689 488544 381950 175807 202477 331469 295674 160770 30950 76401
23820 76401 -227683 -428817 -518831 -108336 60735 -68672 -18764 -98650 -311234 -311813 -258699
23809 -258699 -364727 -524373 -481278 -158241 -67191 226189 377211 247389 99469 -99192
23799 -99192 -182500 -174303 -200025 -105399 9608 -202165 -477879 -447136 -352222 -227646 -111593
23788 -111593 72121 -58386 -154700 -51616 32758 57040 32274 -118318 -78072 24492
23778 24492 -111108 -169584 -59654 -83799 -169940 -43930 -50063 -301515 -347695 -314188 -14927
23767 -14927 -140767 -66270 78375 -22337 -94941 -92581 -186758 -128453 -15518 80667 65724
23756 65724 -161403 -113065 -129437 -197632 -635 129268 -174459 -270193 -325036 -158155 278747
23745 278747 432539 233492 248744 79508 -203747 -214544 -150593 47745 142087 -14599
23735 -14599 182747 367217 167709 22896 -84657 -65819 942 33510 13390 -63275 -43866
23724 -43866 -17630 -32900 -234033 -257318 -21497 43088 97788 -11610 -170402 -181052 -171611
23713 -171611 -169644 -113824 -168952 -218865 -118446 112703 9930 -231087 -367809 -317291 -190266
23702 -190266 95006 287937 179850 56342 352843 376765 87687 -70240 -51506 -173704
23692 -173704 -201719 -24966 -148024 -280007 -146589 -151146 -302603 -332381 -284796 -253283 -221173
23681 -221173 -65790 78687 302300 282628 36795 -201688 -358888 -327176 -276407 -294733
23671 -294733 -221606 -222189 -37130 -910 -6598 -18446 -178183 -358257 -366399 -324811 -307323 -360718
23659 -360718 -170926 167320 228324 92003 -26978 -196424 -99512 -15526 34539 -27174
23649 -27174 -205998 -67353 -202822 -355388 -204664 -66614 9854 60322 61037 -39102 44540
23638 44540 -56000 -44891 20985 -117323 -138112 -40151 -29733 80800 202870 162083 50124
23627 50124 224481 434841 256305 -71097 -212629 -303302 -578435 -749755 -715281 -420568
23617 -420568 -223453 -18638 70377 6228 -111529 -126829 -124493 -89663 -181248 -278063 -88873
23606 -88873 -87940 -152008 -362065 -236980 -74538 -65267 -123492 -115006 -32685 177666 156388 92942
23594 92942 137460 147800 132446 167634 126293 62391 -104277 20839 92316 734 155826
23583 155826 205889 -14320 -147172 -123443 -90561 -168014 -343936 -187184 -131272 -40523 -32753
23572 -32753 126969 108868 31334 -75158 -213319 -160563 -181549 -235875 -210697 -134230 -223989
23561 -223989 -50976 -21600 696 -93669 12756 163139 -16464 -217428 -411132 -332331
23551 -332331 -346857 -369874 -329403 -225267 -202363 -110845 46549 216333 198951 162776 68442
23540 68442 -113110 120653 -224043 -331914 -134763 109713 -36320 -35019 51997 102103
23530 102103 23768 184483 309669 493989 315697 202092 250697 485724 344940 97294
23520 97294 -91102 -83324 -83720 176260 72694 -38915 -14845 -130115 -308452 -224042 -174726
23509 -174726 -46619 3011 -195129 -171079 -262329 -167213 -120742 -41613 -196944 -383442 -208820
23498 -208820 175190 367479 413058 401565 442759 386820 238492 -5371 -277069 -155911
23488 -155911 -100018 -69129 -122591 -225490 -155651 -32217 -13121 30210 -91470 100119 336334
23477 336334 -25882 -151644 -118847 -242353 -361342 -123540 122457 99645 73175 -88006
23467 -88006 -61527 33811 -76172 -132029 -187148 -174708 -63325 -56182 33073 153744 273259
23456 273259 240501 222379 323378 167303 300735 157394 85178 48403 94073 -143095
23446 -143095 -189323 -165472 -211440 -105410 -17548 -32466 -138474 -209585 -118072 -103082 -142396
23435 -142396 -276970 -52988 113840 -26310 -386824 -351327 -278161 -27355 187317 78665
23425 78665 -35549 118004 37188 52417 119601 -3 -11978 -21619 -83434 -104095 11683
23414 11683 -89034 171856 296130 182265 -58283 41494 214388 166019 89074 -8826
23404 -8826 -323162 -335219 -165245 -336372 -92494 175220 -883 -243326 -153264 -126620
23394 -126620 -276246 -163662 -155154 -30218 -51400 -310656 -540687 -552957 -368596 -395216
23384 -395216 -419210 -363871 -123635 -32674 -13722 -492 -276271 -303461 -330574 -392762 -562564
23373 -562564 -583005 -322897 -56137 -59972 13932 56313 80282 -402202 -357469 -210271 -371720
23362 -371720 -257984 -22839 6146 100893 59657 -176505 -238752 -61621 -16148 8869 -13427
23351 -13427 -35774 -139164 -266896 -335030 -214950 -179723 -61083 16460 52090 131683 103381
23340 103381 176601 399754 599991 677496 290060 93636 -120338 -70664 -10772 110520
23330 110520 307975 310845 84105 -67466 -181379 -160704 -79788 124963 168599 172770 334392
23319 334392 479623 365474 434364 451168 420184 113566 -239039 -200988 50252 384152
23309 384152 354721 250562 176670 -55388 104073 174765 -109927 -256528 -243197 -21562
23299 -21562 182576 86004 61357 118002 326956 243778 -34539 12580 -9306 73653 366010
23288 366010 293143 153073 87439 196560 467658 402798 408361 422242 141931 242218 190121
23277 190121 104353 -57741 -264549 -271323 -186310 -102718 -157607 -327048 -289957 -261173 -345429
23266 -345429 -411251 -233787 -314824 -294859 -100290 -91410 -37402 -39118 250006 376194 252216
23255 252216 56816 100753 44 -50482 69096 14362 -164480 -284182 -312409 -302084
23245 -302084 -211846 -336943 -658202 -757202 -322066 -196121 -46813 187377 440513 515485
23235 515485 240202 71174 67893 -49552 -41873 -82497 182657 132864 -200875 -188413 101546
23224 101546 2123 -101039 60646 86940 -64099 129322 132976 -144549 -217158 -96790
23214 -96790 110693 -69411 -110629 -312185 -436752 -394635 -273185 -120933 -31095 -202876
23204 -202876 -421387 -408709 -155549 -182264 -643518 -730118 -457872 -288748 -10024 27978
23194 27978 -77547 -237508 -285693 -227439 -338506 -355242 -161108 -63087 -82603 -74329 -211909
23183 -211909 -197704 73038 173495 127151 25700 47195 153878 214591 123132 -16639
23173 -16639 -120649 -231120 -12036 81183 311520 327715 224657 301642 354070 325899 214210
23162 214210 -74568 -147443 -246811 -277437 -168988 -216683 -390257 -438510 -258871 -60087
23152 -60087 -152221 -306414 -448466 -122587 -70418 56270 190870 279184 383864 316234
23142 316234 292561 521573 408107 220794 289578 254301 229125 347700 581587 745671
23132 745671 704905 618322 488335 319607 -5621 -5619 -170768 -280179 -388062 -324514 -364373
23121 -364373 -194302 -21752 54085 143222 80665 67563 20482 -116918 121429 207841 258381
23110 258381 334493 105256 -76249 84283 196071 -80289 -36884 162033 324716 462351
23100 462351 423677 211967 -42163 -181704 -101362 -86436 -182726 -169940 -235059 -180761 40895
23089 40895 160148 111842 -128365 -299862 -269826 -195561 -174637 -168897 -111010 96110 16862
23078 16862 40180 -26280 44382 270687 285634 233997 102158 121861 188290 355451 364874
23067 364874 291630 67759 -210910 -297504 -254099 -21300 -20330 133924 -2772 -276713 -558740
23056 -558740 -119721 45752 -38952 -115977 -195070 20493 142552 224214 211489 -27030
23046 -27030 -284217 -261216 -137733 214464 301029 218852 340184 93658 14388 173712
23036 173712 394683 386572 545815 472791 182173 126392 7253 -50765 -116392 -65481 102768
23025 102768 -186080 -165144 -25036 39059 92707 -129752 -207891 -97233 22433 92881
23015 92881 -107429 -108882 47891 28307 71979 87014 239350 130971 210290 251134 170724
23004 170724 52577 185157 221189 21136 -33168 102721 231144 112220 -112982 31299
22994 31299 200188 203547 132190 86879 -12108 23351 -78329 -82550 228962 349896 85640
22983 85640 75975 230402 13152 -219337 -100635 44307 -180562 -66628 -39688 -61112
22973 -61112 98720 268711 170972 82321 -230071 -70972 114401 196177 355102 264325
22963 264325 156137 137529 159158 56663 -6279 52250 189758 250369 146488 129090 95003
22952 95003 119946 -73319 -117673 12402 -100476 -283329 -268079 -279084 -223196 -46023 120473
22941 120473 20271 -157968 -29185 -106316 -191155 -183217 -180670 -201754 -483518 -538287 -248758
22930 -248758 -44406 88151 66642 31869 8685 -68069 -40903 -209869 -312234 -323537 -302193
22919 -302193 -139165 -209620 -102802 -64670 67773 -43808 -186403 -388827 -319264 -159873
22909 -159873 -287494 -203414 -144465 -276506 -336102 -230009 -126542 -36868 -86944 -151327 -82097
22898 -82097 27071 -15659 16890 109831 358364 573353 296495 -96515 -80348 245288
22888 245288 307315 270648 60082 22278 78950 170297 54628 -157180 12476 41853 3512
22877 3512 182231 216283 176465 191240 262093 55022 -15978 76580 -39155 153338 309467
22866 309467 282782 146209 216062 18651 13536 203662 48289 55284 208877 267107 424280
22855 424280 297202 158690 155582 -24594 -21819 -5347 -144635 -300441 -192948 -268979 -407116
22844 -407116 -296549 -240706 -292983 -366513 -172239 -176028 -357058 -371928 -216850 -220718 2789
22833 2789 15930 87645 213123 188664 -18769 -12926 33494 -78229 -237288 11392 102594
22822 102594 134745 235538 137559 -25196 30890 58910 262204 256608 53441 -7406 -85544
22811 -85544 118511 291894 -4550 -94489 -127315 -106604 59684 112691 76076 119093 251367
22800 251367 145279 180201 156108 353021 710731 811518 605123 435371 287956 300682
22790 300682 181590 263438 225184 221209 -80753 -87745 -78894 -133599 -100648 -116750 -192864 -318321
22778 -318321 -414431 -141655 -340857 -549006 -568830 -425406 -263257 -49556 101035 113067
22768 113067 -162360 -323307 -239752 -522568 -596435 -256668 9605 -6294 -33975 -127367
22758 -127367 -194038 -308669 -411572 -163768 -254308 -390953 -390196 -390177 -338405 -392206 -159413
22747 -159413 -10422 -17825 14588 130109 200196 127177 4357 -21032 119563 196993 118352
22736 118352 -6788 -75220 76468 184772 123481 119566 48920 9547 42526 -62053 55938
22725 55938 183352 138347 -12488 -127109 79173 189350 211969 261790 84472 -17982
22715 -17982 233763 253723 -41986 74906 359356 244296 -90578 -339676 -309696 -164661
22705 -164661 -182487 -225074 -122831 -354036 -466018 -244537 -282779 -428428 -484566 -384860
22695 -384860 -344125 8402 6423 28658 -12072 -35041 151536 309358 365167 68821 -192830
22684 -192830 -192760 -126974 -86279 -161146 -193558 -186758 -151220 -347213 -412401 -162552 171918 232437
22672 232437 348923 388116 306923 34485 36697 -100742 -70351 83424 91385 176070 93577
22661 93577 -40760 -164083 -235946 -4311 98103 33798 127752 281872 138593 90951
22651 90951 105330 115795 152075 148029 82281 108576 67101 313365 361965 538599 385173
22640 385173 -190582 -365979 -282478 -292611 -175790 -298755 -301761 -163195 -330839 -399770
22630 -399770 -252748 -204779 -58576 -219477 -193143 -176057 -112272 -148063 36880 120947 280369
22619 280369 220986 -30639 -144389 -13655 -125175 -119326 -6427 -4178 -38867 -73394 202504
22608 202504 205814 69088 -111504 -175094 -206155 4084 281059 376017 227997 -99794
22598 -99794 -111181 -23038 -133493 -301216 -331130 -256934 -197191 -90167 -102790 43853 2765
22587 2765 -313095 -244757 -27877 -162145 -281501 -275914 -237446 -200275 -182847 -200836 -265110
22576 -265110 -301460 -311574 -332999 -271720 -71758 -51071 -28525 87707 108180 -99239 -285737
22565 -285737 -113143 165119 130997 121104 -19327 -97411 105293 80789 139407 38735 -40893
22554 -40893 162525 247630 49810 -185364 -102021 68698 29370 54625 -158473 -316727
22544 -316727 -449585 -577652 -678167 -566131 -250899 -164427 -144753 -299613 -201323 -136616
22534 -136616 -283979 -329256 -241603 -375219 -260282 -214817 -254530 -109645 -42236 66592
22524 66592 159622 34275 73130 -125039 -275712 -155883 101758 133416 -68089 -12082
22514 -12082 49545 355763 219649 126206 79973 257733 339369 341486 184224 40879 -11728
22503 -11728 -8553 -155236 -94039 -98574 -34813 -13412 158349 23374 -307447 -470951 -209563
22492 -209563 -53078 -133013 -12266 -153491 -116230 -183413 -65493 -1605 278591 387491
22482 387491 293381 372546 143474 135264 70685 -148436 -198501 -51376 -13186 132947 -17470
22471 -17470 -167026 -343754 -625607 -312309 233512 249395 270645 100775 66903 106126
22461 106126 132629 47399 28419 -31151 -241162 -208428 33744 102227 71768 34389 39612
22450 39612 123080 135485 -184851 -333699 -295583 -106466 -46759 102058 116747 -35934 -218336
22439 -218336 -260186 -91984 125351 200863 228438 276302 342935 354321 228593 -192521 -280292
22428 -280292 -500130 -285344 -250584 -91054 65172 139577 -148441 -353193 -452833 -608403
22418 -608403 -687824 -682664 -587657 -458431 -551698 -558332 -310493 -180425 -99163 -105105 -213182
22407 -213182 -189178 -43625 -91069 -139080 190927 341319 -23078 -91485 -251210 -188554
22397 -188554 -566227 -946827 -757652 -393590 -349346 -348791 -293908 -373420 -311399 -395187 -386105
22386 -386105 -186394 -104270 65068 -84310 -201785 -62708 -59800 -226302 -206482 44243
22376 44243 41773 -253257 -129113 -17785 78309 -124302 -246932 -30918 12331 -71764 27788
22365 27788 -18392 137395 61221 -73314 -381388 -545285 -430773 -222805 -46825 -87057
22355 -87057 -383658 -339807 -296452 -332860 -383474 -636375 -695085 -507323 -308662 -58512 -201613
22344 -201613 -126768 -112918 -189997 -118576 -44956 -34799 -17094 224085 226478 59161 277869
22333 277869 465872 455750 468517 411816 400290 272618 -96378 -71416 -18740 -113410 -263757
22322 -263757 -283245 -299124 -114949 199932 116145 -96759 -515159 -585477 -421991 -280920
22312 -280920 -282062 -247166 -326917 -124498 42507 -117804 -132213 -180950 -125734 161248 198303
22301 198303 -84049 -41286 92646 293397 159969 15361 -323616 -364691 -475226 -506323
22291 -506323 -167439 -17268 196906 519428 483992 569985 332282 -79119 -58848 -157670
22281 -157670 -180775 -128129 -130586 -180422 -157427 -218135 -127672 -77520 -16050 57549 -203440
22270 -203440 -297861 -314680 -270613 -115626 -24532 -1037 -10567 3380 38868 6792 110176
22259 110176 328196 287381 92412 -4804 131874 -103189 41832 24796 -117572 -318229
22249 -318229 18659 381466 93510 -20510 -29779 -98055 -122922 111226 336309 66126
22239 66126 -44863 -290961 -208026 7781 26572 64916 159785 130656 83135 -114664 29104
22228 29104 60727 14769 59535 168798 -28176 53209 -23900 40174 96445 87397 111722
22217 111722 175274 144833 -91027 -152457 -26297 45874 -14840 135597 110111 -46589 -368541
22206 -368541 -580238 -448833 -379778 -445140 -343307 -8921 233936 201163 74672 -152358
22196 -152358 -219674 -276858 -276699 -274138 -229258 -73312 -118275 99539 -32125 -144876 -115368
22185 -115368 20651 -273810 -236905 -42216 -101586 -120671 -73570 -271383 -254566 -61241
22175 -61241 99618 -8341 -276252 -391632 -412393 -218084 -288769 -529307 -491106 -337747
22165 -337747 -430284 -359477 -189781 -66481 -39028 -60894 -110395 22408 177372 20132
22155 20132 35155 89745 188412 26822 23541 83853 95945 47984 -23247 50142 79514 -108831
22143 -108831 -115123 -102513 -54248 17 -36122 -35110 -6281 107964 25930 27526 238181 80409
22131 80409 -139065 -264560 -102566 -143517 -53564 -281849 -321155 -230406 -258942 -78180 43685
22120 43685 49436 36007 -70581 -51630 -249464 -272171 -125623 -44038 100017 185596 11329
22109 11329 19040 221708 216774 -75947 -286929 -250331 -151826 44850 241294 348369 110097
22098 110097 -162320 -466932 -427555 -249604 -170541 -136852 -300199 -388175 -505236 -518481
22088 -518481 -281592 -281829 -246694 -258368 -401322 -218156 -147021 -307968 -348015 -325557 -367084
22077 -367084 -144665 78959 -216515 -233188 -149970 -112653 -220686 -197795 -215192 -318007
22067 -318007 -445104 -119369 157627 126252 11486 19036 190420 94061 -103907 -54707
22057 -54707 169859 283761 -30681 -316453 -295106 -174950 -144953 -307614 -317903 -485482
22047 -485482 -564000 -407860 -314060 -142242 -4411 84030 -50354 -192915 21919 60782
22037 60782 -13748 65259 -77001 -31251 133680 355144 472318 327645 114040 49270
22027 49270 -247281 -485279 -423482 -257002 -153570 -91764 131839 355551 496095 400444
22017 400444 421856 293614 302467 201757 -149651 -181599 -62454 -19556 -9777 63676 -159461
22006 -159461 -303804 -161897 -269890 -311960 -358453 -188820 -165860 -258451 -214523 -211360 -113760
21995 -113760 -18699 -7837 -170761 -227181 -128071 -203953 -22285 -64279 39161 70140 -53752
21984 -53752 -178870 -186089 -156105 -239136 -20455 -216661 -235918 -235381 -42756 76295 -161937
21973 -161937 -407891 -439780 -223709 39265 55402 36745 289827 95185 -326639 -242388
21963 -242388 -273429 -221835 44516 169234 83151 -13248 97008 72409 65360 96689 155176
21952 155176 82088 192685 201302 -116200 -351701 -423916 -368904 -98431 46903 -48085 1042
21941 1042 268937 396450 420933 283923 135613 127773 7899 58944 72386 15432 -13023
21930 -13023 31719 30553 207177 389362 422875 537327 336324 185959 -5120 -219412
21920 -219412 -215117 -248755 -262487 -92609 40424 218481 235686 186130 324509 136477 -88977
21909 -88977 -72574 25309 -141915 -281660 -316671 -355033 -385118 -420043 -295033 -236044 -49724
21898 -49724 -27995 -56577 -75717 -204209 -192075 63627 14506 -201641 -139049 -117821 16489
21887 16489 142943 71638 -83531 -87810 87981 313117 279757 -67272 -49491 43060 -161112
21876 -161112 -210462 65989 213079 347893 389929 95710 63974 155887 -42487 -137162
21866 -137162 -128029 -224028 -174960 -45583 46447 -10901 16615 -62200 -210654 -177302 -101502
21855 -101502 -64898 -219372 -200950 -226402 -99907 -160370 -370471 -448912 -502537 -479071 -236070
21844 -236070 -243157 -268200 -32012 -248237 -441677 -93889 -32572 51408 -146865 -105409 -99573
21833 -99573 52204 -56665 -42960 -9272 79077 92518 -55680 28437 65407 139829 199594
21822 199594 243873 232519 225939 381304 478493 18878 -262220 -375743 -502415 -291515
21812 -291515 -117407 -78273 -320194 -316565 -315571 -405325 -401524 -462969 -451986 -213123 -171659 -151491
21800 -151491 -79774 -17661 -109181 -38722 -147943 -253634 -265106 -224742 -133906 -151612 14762
21789 14762 165613 39273 -188398 -144141 -29077 191966 253231 63653 -214394 -249364
21779 -249364 -176766 2044 150852 -12445 -251702 -325534 -237226 27045 -2773 -57718
21769 -57718 -27780 -91704 101266 210375 155328 180407 198627 295460 410902 222934 -29183
21758 -29183 -64252 214351 161573 -71130 -207302 -352511 -343137 -58982 159718 -15259
21748 -15259 -14122 -90125 -73345 -165152 -378420 -319883 -362024 -216713 19412 148103 43625
21737 43625 106861 -62853 -94086 -27744 -274098 -424355 -441281 -274369 -128129 -174570 -186099
21726 -186099 -165147 -135732 3463 101600 180649 -39768 -85152 -145950 -204324 4814 334081
21715 334081 238552 157689 129758 130551 103263 15179 -14141 -57776 -60608 -12888 133348 88538
21703 88538 15094 63850 -17733 38298 72036 352804 260085 -163144 -173501 -211053 -269177
21692 -269177 -110547 -96793 53393 80476 100133 -11614 -114058 -299737 -524705 -408576
21682 -408576 -361417 -88619 128656 142837 -31946 -197792 -399074 -265645 138176 171143
21672 171143 186423 161111 271513 114516 214683 180421 123288 59556 36556 134992 142807
21661 142807 83236 61301 333428 492624 568346 293910 34821 -67238 -19928 7537
21651 7537 -6749 225787 191749 52185 -11594 -5872 103351 74980 17471 -107637 -97859
21640 -97859 -29993 81107 108370 415265 612781 296684 -57293 -253847 -318705 -326843 -299183
21629 -299183 6899 351978 630734 540497 369146 283091 345092 373531 126093 206629
21619 206629 297657 122969 -49563 -15050 32767 3739 144514 168901 66532 -155638
21609 -155638 -299551 -202988 92709 347962 182365 290762 272514 180671 115117 138180
21599 138180 -36928 -224862 -369373 -286343 -438391 -336573 -171848 -112265 -128948 -334454
21589 -334454 -258499 -364104 -369228 -57696 63445 103934 32750 -257301 -314575 -269915 -175797
21578 -175797 -155058 -47377 234394 264264 147772 26839 28397 25280 59696 122632 241432
21567 241432 133440 -53599 -116082 -82183 -205541 -317396 -255812 -36496 121159 313900
21557 313900 539996 425847 477732 647808 642148 455087 393616 431899 334625 10426 -17531
21546 -17531 58395 184292 165657 83776 193872 275429 184338 162139 452718 256001 -124581
21535 -124581 -222599 -24468 38228 -13184 -81098 -52883 -46665 -25440 20871 139561 -8009
21524 -8009 -150790 136882 278455 180885 213684 357095 398301 466584 276402 43411 201309
21513 201309 213408 107000 88780 50068 62004 45505 37249 -125021 -223012 -154208 -131922
21502 -131922 114084 75094 180941 86660 11741 69153 5428 169144 138692 -139035 -247819
21491 -247819 -190996 -225443 -94504 -118291 -234332 -249230 2476 228457 88383 -85909
21481 -85909 -70511 64657 54639 -44861 -43738 -97767 -178675 -139248 -100285 91403 -60091
21470 -60091 -308215 -355652 -452373 -212619 -167446 -62872 -26934 -61679 105915 68420 7733
21459 7733 40748 -68848 25100 -105766 -273849 -353450 -419281 -345502 -151877 186922 155698
21448 155698 -4738 -25856 -140886 -183247 -116197 -110365 38240 187050 354924 185652
21438 185652 -4198 -267358 -81940 14265 30356 147939 42875 114655 368730 264157
21428 264157 240028 135928 139626 248953 103049 -247032 -192540 814 181219 104512
21418 104512 49565 146869 349712 285417 270938 120397 244027 337403 -70167 -269209
21408 -269209 -78225 194647 232640 257375 238211 229085 254340 249146 18466 -155363 -51016
21397 -51016 183899 87098 84945 -88972 -271193 -217855 -269530 -380525 -317114 -265557 -44360
21386 -44360 228554 393046 263893 -7072 -163147 -149609 -495172 -710273 -501619 -321591
21376 -321591 -239764 -16271 223588 292090 369567 380914 107302 -13847 -121445 -145333
21366 -145333 -104923 -135541 -223836 -109107 -243386 -227195 -256878 -295917 -122379 14094 45257
21355 45257 -3935 7520 -45141 78299 356621 542706 556068 486631 214606 34725 59495
21344 59495 212618 195532 164712 205741 408677 391876 210971 123360 -5814 -95739 -87505
21333 -87505 -131627 -191838 -173000 -77795 -29651 82585 286053 322229 403374 385714 131044
21322 131044 37313 -66113 -221776 -119311 -245647 -435889 -293766 136494 231187 207069
21312 207069 -41069 -73615 -82315 56278 20035 -74583 -185823 -200746 -152914 -202278 -192373
21301 -192373 -471718 -602779 -312273 -144171 -176631 -87287 250614 311623 331838 312728
21291 312728 321468 327775 80456 167559 149899 182204 24715 13345 89037 1481 72075
21280 72075 108497 69564 99757 267286 283943 38586 6939 -44829 -56544 -123287 -213905
21269 -213905 -71476 295422 211354 -200624 -200589 10806 67526 -59896 71659 -65499 24091
21258 24091 152000 229607 414780 433420 312713 166551 149257 34406 280352 408932
21248 408932 338566 108471 5662 73690 76558 -39144 -196895 -99445 -139684 -91993 -68955
21237 -68955 -1070 -78893 -249109 -237963 -262604 -141258 247873 270270 151246 171555 93414
21226 93414 -215242 -421818 -306427 -252183 -272573 -271544 -220263 -102254 107876 79851 71817
21215 71817 66098 -77896 -277177 -119141 192397 140767 5630 -45086 -141202 -205183 -227037
21204 -227037 -303563 -185697 98666 90803 235598 219874 70796 88657 53225 -120900 -16410
21193 -16410 38366 -115321 -119843 -152795 -315949 -336959 -332856 -93082 272405 408232 467618
21182 467618 320410 150118 63085 -39846 -76847 -120336 -116345 -189478 -39096 -5374 188448
21171 188448 316158 216986 5193 18425 187415 319672 424298 483218 354565 207688
21161 207688 161406 282072 270702 197967 -34153 -129534 108240 -19768 -59916 53136
21151 53136 50489 118596 170618 188139 31403 53900 333150 378121 -63528 -319286 -232373
21140 -232373 -133459 -268682 -157533 35139 48415 40336 -402614 -618117 -380290 -190992
21130 -190992 -269953 -87673 155704 350826 131084 -13123 -254076 -353957 -384179 -155818
21120 -155818 -263560 -476045 -717183 -370980 -165371 -188809 -26958 -224846 -298977 -401876
21110 -401876 -381518 -109665 204953 147663 1790 55036 373950 442794 472176 699826
21100 699826 483788 265121 199271 179297 81453 177882 39217 -136785 -34981 60843
21090 60843 -92805 -359551 -331918 -497690 -472056 -311129 -209360 -258345 -108297 10937
21080 10937 153863 -2059 -205385 -118607 -198109 -222128 72101 291475 82210 -211100
21070 -211100 -180310 -5565 12272 -51766 74123 337142 413006 -9505 -68955 -108226 -35066
21059 -35066 82718 17155 -48325 -60782 124162 158868 -173471 -411325 -64075 69383
21049 69383 174049 92957 2859 -2338 166397 268812 334957 469930 565573 353256 127288
21038 127288 576044 771164 645209 180252 10356 84112 170356 89665 304672 312542
21028 312542 394326 270285 170985 -187014 -186908 16162 -6370 -22386 98558 131066 -35265
21017 -35265 -46867 -99728 -136792 -118994 -313441 -189665 -309811 -534287 -484377 -372732 -248762
21006 -248762 -277783 -148400 -122866 -173325 -199234 -27060 -57245 -133069 -120435 84156 56511
20995 56511 -29519 -27284 77655 8155 44600 125772 252063 362339 243560 96893 263572
20984 263572 392686 276926 37617 66574 155526 353381 559873 287433 608 -134473
20974 -134473 -240067 -230426 -107893 21221 -154594 -325508 -56476 159687 285371 99444
20964 99444 -67496 -124285 -222296 51129 43787 -229343 -388162 -378898 -250676 -83317 -41744
20953 -41744 -17994 -71340 74330 23283 -83029 -214459 -123204 -148520 -200008 91786 -57936
20942 -57936 -198980 61857 182150 34316 4345 -54746 -220762 -203980 -7581 -68192
20932 -68192 -238154 -129869 35526 25513 -210983 -221710 -132901 19314 16938 -38819 95342
20921 95342 204935 145299 -57650 -171399 108694 185762 188312 262860 576875 457456 347614
20910 347614 166203 21309 -39476 77262 316156 329500 272399 144604 -71444 -445508
20900 -445508 -457872 -250986 -184289 -260237 -111710 -191921 -350147 -554746 -399388 -253070
20890 -253070 -441803 -219132 14114 -79667 -91470 -262315 -428195 -129659 92186 251012
20880 251012 261584 70210 63120 229155 303016 383330 180884 17326 16873 43619 -8318
20869 -8318 -81337 -65678 -53135 -82002 -297702 -204608 34490 253952 133048 -251 -72841
20858 -72841 -305720 -395876 -221516 -200994 -35254 56126 33521 -94055 -87606 -331708 -314312
20847 -314312 -203142 -160144 20317 150965 59881 -75810 -358486 -304632 -13517 13918
20837 13918 94593 107254 89800 11501 -132857 -272859 -147649 -168979 -51197 12094 17902
20826 17902 104552 -4428 -100232 86195 11919 155804 403166 320103 -25020 -177313
20816 -177313 -199365 -192408 -127845 -84160 -101103 -25292 166039 170749 221164 273739 326582 339740
20804 339740 170667 61116 -97607 -385088 -318402 99787 196668 -77816 -136365 -10182
20794 -10182 261835 120243 -100380 120077 203238 -80429 -332568 -344458 -276503 -418513
20784 -418513 -378956 -156727 23097 138280 -33552 -127838 -7824 -71254 -65480 -154726 -381240
20773 -381240 -390087 -277487 -408605 -171657 35076 -207181 -306334 -272064 92852 96535 19096
20762 19096 23125 153270 269386 269379 123544 -59601 -285930 -109048 139961 197659 282164
20751 282164 194841 100212 11316 68527 75796 219199 207444 144437 -78932 -76981 -45534
20740 -45534 43701 350775 101253 -223242 -228131 -179151 -28560 22269 111575 28845 22602
20729 22602 128834 417445 431662 203919 359144 357805 187182 -279497 -375306 -292055 -129649
20718 -129649 -13117 -16972 -52586 -139424 -254268 -377512 -173766 134486 99783 193607 -101640
20707 -101640 -61336 -59648 -179628 -95874 -52075 -38727 43491 71416 879 -179173 -105779
20696 -105779 10674 216871 361308 338687 408501 426259 181982 35505 -65317 -111836
20686 -111836 -178629 -129697 -235547 -370862 -183493 76830 141437 141190 202896 226893 169040
20675 169040 -19481 -257408 -121578 58202 -108477 -202476 -141528 -73085 -217112 -254520
20665 -254520 -223167 -240921 -59436 -88390 -135252 63084 -33264 17097 101929 103033 -26698
20654 -26698 -439081 -222959 14889 -1786 -219028 2345 122289 174409 117808 -46717
20644 -46717 -214349 -281849 -388654 -158331 -18417 157399 162304 -102705 -296152 -178657
20634 -178657 -218052 -215530 -179875 27924 171720 180388 -80032 -228442 -197789 -221753 -67886
20623 -67886 126447 119249 85898 -98809 19820 232793 278825 346923 268860 148419 -21128
20612 -21128 -140200 24507 163410 394898 311159 263214 317380 316553 205740 180752 125637
20601 125637 -504 38052 128003 293000 415340 314992 120773 -39641 -26000 -128286
20591 -128286 -204945 9682 272999 263742 135233 -116520 -97672 -75010 94823 84774 -19264
20580 -19264 119985 316145 364053 255712 255613 76745 -31150 -62684 30883 359929 611454
20569 611454 612524 416683 535187 665337 846802 913014 1388205 1848727 2002578 2173690
20559 2173690 2387712 2328225 2191289 2246000 2189111 1704025 1438646 1520428 2066510 2379969
20549 2379969 2408150 2250314 2547343 2855650 2493862 2220593 1899342 1572139 1388274 1126672
20539 1126672 810817 683486 838351 890866 934208 904867 718777 714057 643995 793088
20529 793088 747801 599489 368259 369287 265030 123059 96294 44747 -26466 66720 123809
20518 123809 161004 282312 232083 118613 401859 386915 301446 463166 283167 16311
20508 16311 150413 203639 132512 176378 348465 331607 277889 405842 405464 170120 472462
20497 472462 584836 147201 -61521 -28510 129947 42742 -64875 -108390 -158 106512
20487 106512 135074 101307 267888 259514 240735 163903 22432 75214 113696 161479 165094
20476 165094 -35786 -194186 -59019 79968 -19931 -192129 -107588 85288 143355 265138
20466 265138 44201 87536 166847 217181 145591 24377 -300227 -564975 -284852 -46890
20456 -46890 -44137 112498 169891 112165 52998 42138 162359 168695 115655 279427 240216
20445 240216 -63383 -225293 -122399 414 -88009 -104 -27338 170899 25276 193151
20435 193151 237669 104997 -51607 -103004 -50579 240665 493048 362734 264040 251053
20425 251053 204405 165158 199046 48324 -8726 125330 227391 211444 233520 214640 14934
20414 14934 -86636 -194167 13630 39287 20921 127158 132582 -39372 -254578 -195213 153920
20403 153920 348287 310046 290493 233910 81533 -39031 -165920 -68043 52169 38225
20393 38225 -97874 973 92544 82566 42636 9666 -38806 -79451 -34413 -61965 -9334 -21439
20381 -21439 69886 -25494 113402 288583 293452 311798 255080 -113694 -242148 -111957 -6040
20370 -6040 88765 276004 283743 429840 475512 391082 195291 44416 -151124 -315783 74000
20359 74000 304815 295885 301580 269355 180139 162002 1433 -176623 -185987 -60350 136903
20348 136903 172911 50353 111613 234515 124637 38414 24493 146160 132736 -64217
20338 -64217 -146715 -111800 31061 196974 274016 265589 186665 91387 -32669 -96985 -122149
20327 -122149 -202376 -173687 228331 416040 406655 370479 315415 349064 448451 395547 456326
20316 456326 532081 458156 536511 684006 393626 132085 40161 74568 153303 246921 360435
20305 360435 611076 711599 513297 384608 215810 -121239 -142697 -48067 18192 43063
20295 43063 216894 360408 470695 554490 360868 331634 682373 847740 837234 718926
20285 718926 716020 686500 660718 560541 505983 670987 847840 713613 713042 775727 770719
20274 770719 600166 491494 522838 355803 86184 -173844 -312457 -289726 -81414 140511
20264 140511 175288 19904 -155823 -224401 89198 -170728 -287402 -213506 131031 339938
20254 339938 256164 127898 -23693 289524 409752 224594 267576 219967 166248 112489
20244 112489 267145 307635 152550 -474 121381 174886 165079 133460 158938 115359 -86841
20233 -86841 130478 470548 379090 268674 210885 75129 59805 81273 159529 399057 291916
20222 291916 173255 -54202 -126371 -112080 59846 131993 164282 111321 140542 299669 402583
20211 402583 150445 -86916 -285575 -292620 -171755 -67364 82679 -250343 -418644 -282743
20201 -282743 -163648 -60611 86757 161174 268362 477016 243295 -71586 -183360 -91844
20191 -91844 -198522 -195843 -126208 -299798 -195290 -160398 -127204 -147987 -170599 -259989 -275868
20180 -275868 -94470 -158434 -250175 -48275 88282 -270020 -394265 -199552 178631 186130
20170 186130 157180 301653 289730 245504 102773 -109534 222161 456997 408886 568086
20160 568086 619280 610996 652968 540763 530047 577669 756323 977137 913243 827201 707608
20149 707608 676324 792667 808627 740587 879283 1086434 1046900 837797 672046 625991
20139 625991 629038 747467 750618 770683 590467 701069 793007 756146 679923 552276 621397
20128 621397 694211 855340 964108 950429 842863 963343 961067 998103 1132662 1348209
20118 1348209 1569911 1570807 1277900 841551 890200 1007958 1153334 1398014 1361271 1116559
20108 1116559 1072696 1078759 934557 1045676 1101674 846155 732729 981622 1165717 1310564
20098 1310564 1280918 1248848 1234338 1479343 1755140 1742335 1761670 1789493 1877993 1992041 2018294
20087 2018294 1973155 2005043 2206757 2303621 2511756 2771754 2901007 3139743 3296647 3563010
20077 3563010 4247296 5054084 5703334 6385646 7388418 8330973 9215917 10061378 10945639
20068 10945639 11455484 12009980 12465105 12819555 13554513 14363032 15225006 16172243 17018034
20059 17018034 18084127 19454986 20418669 21551494 22536865 23399547 23812244 24207283 25063558
20050 25063558 26509160 28384996 30978012 34714713 40655129 49782767 63855495 86191522
20042 86191522 120478048 168420227 225668986 284706863 339741483 389060920 427247502
20035 427247502 442752521 432555703 403671989 369109562 338302554 317952954 312971990
20028 312971990 329337608 363783251 404485681 443513557 475804500 490307407 477508868
20021 477508868 440814633 389964661 335229764 279753690 225469531 177328682 143003024
20014 143003024 120450959 104802932 93102619 83831462 76234845 70033133 64663218
20007 64663218 60137902 56359003 53129807 49979538 46923137 44004085 41554612 39349122
19999 39349122 37236247 35265207 33140226 30991980 29030798 27277442 25704129 24146999
19991 24146999 22745929 21466445 20288230 19394321 18647836 17688165 16832414 16157201 15507422
19982 15507422 14844588 14258658 13634499 12942275 12352540 11788103 10879617 10118845 9564754
19973 9564754 8880838 8551340 8385303 8020699 7606917 7351952 6982740 6545233 6297551
19964 6297551 6063916 5755385 5357559 5128690 4850029 4513883 4188186 4024138 4138531
19955 4138531 3809854 3331479 3280004 3216095 3082297 2818311 3015960 3076905 3158991 3219128
19945 3219128 2959106 2598712 2322302 2380416 2421929 2418204 2603568 2723617 2620151 2418704
19935 2418704 2176964 2161179 2105690 2065025 2387331 2595916 2578354 2466330 2766861 3179003
19925 3179003 3566022 4079554 4537858 4826001 4688648 4616729 4645815 4571163 4654996 4521970
19915 4521970 4490924 4560585 4658690 4750168 4700761 4713222 4957998 5136116 4692346 3891345
19905 3891345 3517401 3566717 3325792 2848462 2319139 1895568 1725695 1909412 1776365 1485340
19895 1485340 1670157 1892149 1860952 1789731 1758628 1575095 1335573 1018924 1111525 1086885
19885 1086885 1037697 970589 943653 914970 1002203 1090213 1205651 1135260 1031942 963137 1071269
19874 1071269 1043117 1172668 1042959 1088869 1002685 739082 698089 676563 744804 769725 829462
19863 829462 808212 729244 750494 883107 758563 772372 720419 519692 621720 935269
19853 935269 942315 806410 766389 822664 822737 862435 848267 751363 648261 673592 873713 821439
19841 821439 668937 717087 760416 767726 680108 687891 973708 919357 825176 623671 584578
19830 584578 433899 595793 489568 406879 344029 281431 267557 277346 143201 255944 414869
19819 414869 499505 498834 558704 505504 629866 667240 620321 494041 396839 262519 290747
19808 290747 306628 283892 306556 495431 541209 448183 618736 675787 559931 523946 428942
19797 428942 454558 365451 265408 48565 -218814 -75193 228044 208986 163727 498915
19787 498915 660659 474984 358185 481929 470319 425033 337657 164280 -85047 142655
19777 142655 427233 460752 366375 317315 278940 272543 -29825 -146976 -296470 -212992 -171868
19766 -171868 -57317 -64962 -151736 90166 111793 93824 278612 275582 274449 311521 354427
19755 354427 320036 276274 410763 522066 493452 599975 612360 342371 38657 202354
19745 202354 616944 655401 513769 294789 111316 105884 388321 371043 477661 751822
19735 751822 356231 104039 256718 141268 27574 158424 140926 218874 209592 12006
19725 12006 72234 154859 367383 515202 493007 380931 358722 228844 226552 93726 141138
19714 141138 424705 643759 685665 418343 312187 354137 542944 687179 720691 791162
19704 791162 813043 813164 700382 813528 805972 475367 112229 186659 522140 543049 452245
19693 452245 377631 297984 226592 143901 121642 201897 249195 287498 226350 188762 195751 259654
19681 259654 -18640 -12498 307276 494863 537902 612118 460253 432123 334897 352718 216954
19670 216954 392246 343423 105529 438656 542804 566832 509467 600973 659393 949694
19660 949694 871341 711595 648751 559737 476947 707864 738463 929684 937501 521174 502165
19649 502165 430020 675269 569076 690530 773644 694494 809773 655665 608414 733991
19639 733991 691210 597887 391216 112490 105861 104151 74714 171854 279824 365006 378025
19628 378025 510459 513463 609514 764850 464986 197803 82705 160269 211867 249272 229951
19617 229951 247956 190772 424782 507672 438723 545490 385839 348700 666420 828439
19607 828439 635471 311996 -46451 -265881 -22342 534815 693706 634786 597328 694408
19597 694408 820505 785452 524839 417840 384369 345201 581168 832456 805368 772687
19587 772687 957566 1132049 1148849 1076846 1185805 1434207 1530484 1905262 2577561 3118203
19577 3118203 3761699 3975721 4432639 4695914 4477924 4343864 4033851 3658346 3296649
19568 3296649 3175072 3697622 4521458 4696842 4731847 4790828 4682947 4316009 3720029 3322696
19558 3322696 3168756 2858281 2474221 2444875 2326201 2215905 2159304 1735506 1621194 1714418
19548 1714418 1877297 1792499 1772228 1411366 1493207 1709490 1802213 1756000 1952522 2400152
19538 2400152 2718423 2895958 3134744 3381658 3772831 4060309 4080730 3730934 3527921 3409472
19528 3409472 3401875 3470186 3798099 4506137 5308797 6467287 7640072 8278693 8700811 8887840
19518 8887840 8665378 8013332 7274393 6391463 6066392 6299364 6622538 7309059 7821311
19509 7821311 8141227 8302420 8558214 8534248 7856880 7089056 6363337 5945042 5453735 5221678
19499 5221678 5361490 5459455 5903759 6390507 6486695 6470619 6699354 6735169 6552597 6095814
19489 6095814 5800617 5550486 5118613 4880584 4995115 5397287 5854022 6308999 6829467
19480 6829467 7008986 7165580 7488316 7812549 8175385 8638158 9285869 9804107 10690189
19471 10690189 11696190 12860140 14639772 17354338 21235372 27305101 37093484 52911975
19463 52911975 77651878 111983210 152121453 189793687 218357550 235151232 237163170
19456 237163170 221616491 195382853 169150235 141165911 122748743 123106395 140078683
19449 140078683 168824791 200395298 226042483 241664889 244601825 232134411 204211055
19442 204211055 172823535 138895125 105654296 82766653 68420338 58910551 51997997
19435 51997997 46405094 42192993 38672474 35482325 32889778 31068044 29915725 29106322
19427 29106322 28877664 28600185 28331156 27906463 27434871 27036244 26502103 26030493 25551770
19418 25551770 25040745 25026405 25278522 25911351 27094917 29085744 32173166 37188081 44953804
19409 44953804 57062705 76671264 107127715 148573066 194049675 233915694 262485526
19402 262485526 276674495 273371194 250831341 220119586 188908466 157887144 142533031
19395 142533031 148536801 172113699 206392435 241089337 267563743 281656332 280520936
19388 280520936 260647504 225740201 189251519 148839908 112615807 88749947 73565900
19381 73565900 63228722 55783931 49901203 45220431 41137170 37439939 34410417 32251382
19373 32251382 30437219 28888983 27546308 26280264 25478332 24780164 23618432 22314529
19365 22314529 21450045 20281389 18937476 17622310 16429474 15845127 15001986 14324551 14132000
19356 14132000 13985808 13625846 13048359 12467004 11689594 10865205 9915428 9054323 8440016
19347 8440016 7998464 7450759 7221378 6950726 6372098 5809823 5242309 4798710 4743182 4692318
19337 4692318 4535833 4376959 4138225 4025905 3944501 3590158 3620996 3464765 3573668 3535614
19327 3535614 3275527 2897756 2693276 2655702 2665606 2614995 2372114 2319419 2478103 2520130
19317 2520130 2510077 2511576 2389468 2156894 1772196 1689603 1989844 2004411 1679200 1459940
19307 1459940 1323882 1310740 1379266 1550205 1655465 1562012 1431900 1437791 1565532 1514432
19297 1514432 1400451 1241255 1367125 1465248 1422521 1507026 1548627 1342299 1100495 1137026
19287 1137026 1342608 1725433 1635253 1427384 1158254 909466 1065501 1339350 1313242 1044023
19277 1044023 900359 1008220 1092872 1042421 776464 722159 888276 817991 956795 1010892
19267 1010892 890736 1031629 1363216 1325843 1319745 1170772 929596 779535 706215 632596
19257 632596 645547 515242 545441 478436 404524 492733 142683 250126 467695 337445
19247 337445 378514 520022 576061 615160 309493 281105 382057 432233 689265 852410
19237 852410 623835 642768 797570 649632 394581 463590 436328 347409 560076 818536
19227 818536 905156 774285 781569 887731 712206 821306 856914 766322 692957 589720 678722
19216 678722 589810 515784 605417 770721 730768 703474 570903 467696 456848 383592 319163
19205 319163 91609 241223 498237 633897 830286 764196 694285 419321 385345 506634
19195 506634 569394 551367 427552 244514 323222 377136 492360 755782 718835 796250 1132657
19184 1132657 1422810 1673246 1877376 2140898 2254573 2709047 3057098 2830799 2815456 2751160
19174 2751160 2282451 1964441 1793899 1710427 1565838 1432120 1137555 850197 671153 915074
19164 915074 970242 672114 322441 374289 396236 353277 320568 211500 33463 24646 207736
19153 207736 55525 323284 623450 662448 616643 699973 785001 883155 968562 939479 919139
19142 919139 809941 732405 707364 738233 697024 730416 920961 1232691 1537738 1636846 1561283
19131 1561283 1614387 1648855 1891997 1968974 1841208 2050326 2080917 1933389 1881168 2186381
19121 2186381 2072321 2071071 1927931 1975285 1734545 1449422 1279727 993105 892373 934269
19111 934269 882855 847845 675171 632885 662573 541630 574505 893939 1069448 844477
19101 844477 621066 429883 434047 398619 624091 875108 617306 448693 373427 580045
19091 580045 469232 495564 622600 661472 448051 401650 520975 337565 137395 217123
19081 217123 -89226 -113313 -31356 1763 -14386 -32658 89974 105400 125181 224821 419068
19070 419068 531812 542349 494851 372904 156309 -62973 -135037 -221377 -246307 -84343
19060 -84343 -103634 -219597 -76695 -77546 -299268 -161111 -115494 -248050 -161546 20687 210919
19049 210919 160833 -94585 -145337 -66734 148422 408029 432319 493988 423533 105423 82611
19038 82611 175193 402184 418837 306193 260526 280372 176160 148313 414719 602696 892861
19027 892861 1024284 1063847 959293 743706 596609 550356 634490 702779 698633 615684 537086
19016 537086 530056 550068 638585 635203 641082 747012 850327 938640 935459 802240 798402 670378
19004 670378 701451 516328 419812 539356 769635 1008268 909588 641692 695387 819012
18994 819012 822527 798916 626841 606687 663407 798570 858823 899455 706840 526211 577431
18983 577431 577239 526027 816349 1046175 959644 992221 1065193 1051042 603157 511948 773566
18972 773566 645562 549219 613740 757254 797776 718110 936298 1111719 1121476 1050525 1059362
18961 1059362 1158479 1319221 1387630 1179185 1196767 1116510 1244787 1307763 1287765 1430288
18951 1430288 1405688 1504212 1592368 1676782 1647298 1549222 1586711 1667096 1895305 1939734 1981987
18940 1981987 2153284 2235057 2706492 3423746 4099174 4623963 5333157 5844479 6048600 5999325
18930 5999325 5699604 5413842 5137205 5028777 4983382 5214081 5615693 6440746 7349439 8504647
18920 8504647 9763704 10928049 11907745 12972279 13944176 14255300 14188157 14289380 14266679
18911 14266679 14330209 14542936 15181448 16121286 17697757 19682820 22625867 26974396 32568505
18902 32568505 40423994 51952889 69878005 98656737 143047598 205393016 280799436
18895 280799436 358701276 425831544 470866207 486910324 469633762 429225589 368937447
18888 368937447 305485828 252001131 214990577 204812571 221715688 264128743 326264168
18881 326264168 396613865 461507838 507680191 526800463 512245065 470531871 407941200
18874 407941200 332649290 263572908 203344117 160200072 132261042 113188700 99172622
18867 99172622 88126132 79304333 71708997 65503542 60279020 55803419 52112806 49309366
18859 49309366 47358389 45762199 44144150 42620637 40981059 39020207 36964138 34862248
18851 34862248 32552099 30415410 28563329 26796132 25010090 23568809 22168443 20900420
18843 20900420 19878392 19225399 18753714 18060530 17677226 17332675 16728320 15959371 15226808
18834 15226808 14379081 13473946 12713594 12039149 11480608 11103266 11010681 10578559 10106572
18825 10106572 9642226 8938434 8219343 7818213 7161484 6642100 6117505 5944050 6080384
18816 6080384 6198951 6462906 6822802 6946077 6736630 6402328 5801546 5341755 5093114
18807 5093114 4783311 4499149 4378213 4234901 4041408 3920328 3723473 3664867 3750467 3717640
18797 3717640 3484914 3192586 3084060 3160500 3322864 2882180 2677156 2714759 2632764 2416253
18787 2416253 2379197 2497832 2323743 2155052 2132106 2313293 2577729 2692938 2774903 2543645
18777 2543645 2355077 2120227 1943247 2057610 2168091 2273110 2636519 2896756 3118473
18768 3118473 3163000 3016911 2778969 2552023 2358974 2092322 1649051 1507899 1747248 1592723
18758 1592723 1593952 1788067 1757276 1715790 1598443 1609734 1640113 1633149 1583815 2004242 2265286
18747 2265286 2186479 2021239 1833875 1800324 1840643 1920906 1727710 1769608 1755324 1842374 1814560
18736 1814560 1839863 1893707 1893149 1753325 1532743 1746935 2185197 2368643 2359123 2436648 2473206
18725 2473206 2752725 3084935 3346642 4051618 4895806 5612728 6302815 6902259 7504961
18716 7504961 7984320 8094892 8207958 8281334 8171197 7940495 7494963 7013636 6461625 5835215
18706 5835215 5177098 4370697 3900979 3669067 3302831 3221264 3079880 2924119 3016925 3182785
18696 3182785 3263627 3288198 3447701 3320094 3051441 3222668 3632320 3749295 4006077 4381724
18686 4381724 4714248 5055373 5391045 5823774 6399871 6796400 7034482 7439324 8054632
18677 8054632 8820427 9737884 10768219 11565665 12226336 13351442 14972302 16809345 19071394
18668 19071394 21920512 26033691 32435195 41615874 55698879 77483784 108812401 147642833
18660 147642833 186412901 221117024 257774989 300395735 336755622 351988625 357336639
18653 357336639 361816987 360955403 349004528 329226233 292140268 250102071 217674239
18646 217674239 188046735 150131670 116172023 93908067 79741308 69526709 61776849
18639 61776849 55657061 50674633 46465534 43004761 40354617 37765343 35420047 33571382
18631 33571382 32269164 31075514 29594867 28385442 27301340 26496043 25675538 24850317
18623 24850317 24074388 23702076 23423562 23488666 23596850 23805974 24184762 24646165 25237835
18614 25237835 26231832 27933974 29988675 33069740 38072873 45880560 58577369 78633247
18606 78633247 106937968 140508020 172499846 201835796 234826749 271686758 298678316
18599 298678316 307996817 312385173 315913796 312691087 300686931 280045419 244347490
18592 244347490 209657217 183480137 155936186 121815238 94608974 77643014 66458913
18585 66458913 58188508 51708598 46913575 42852447 39207850 36208170 33602383 31319572
18577 31319572 29444307 27887139 26244538 24722911 23266790 21771383 20553456 19659398
18569 19659398 18660054 17462379 16741784 16092192 15232942 14226049 13715241 13431546 12909491
18560 12909491 12537248 12467835 12423319 12089840 11780538 11368537 10620931 9868630 9327881 8751439
18550 8751439 7934471 7563133 7289159 6902068 6273772 5672218 5221107 5119775 4850693
18541 4850693 4781442 4782828 4466565 4042340 3968805 3861658 3586020 3442336 3284173 3200129
18531 3200129 3063263 2671061 2500415 2397208 2482433 2462086 2282414 2225123 2374573 2365238
18521 2365238 2286145 2133197 2118369 2121771 2114146 2195238 2349444 2261632 2127900 2185004 2085256
18510 2085256 2083368 1951350 1670323 1558006 1499314 1464289 1613856 1763530 1492099 1345584
18500 1345584 1392660 1267367 1127952 1291879 1252407 1114629 1025055 1172423 1520698 1329317
18490 1329317 1313345 1422019 1436369 1418138 1251163 1260896 1272481 1227261 1212827 1271450 1530678
18479 1530678 1604266 1540496 1286592 1280510 1275337 940628 774033 663848 427925 538525
18469 538525 1136130 1368236 1194432 991592 828955 755889 789715 631256 686454 607377
18459 607377 579087 886168 1029372 1028454 803226 781931 698907 693724 745147 637411 770826
18448 770826 772792 461103 420351 597047 614749 685807 867526 967913 969128 963366 784249
18437 784249 803846 941354 1010726 753018 763042 768715 669962 397798 382566 412977 498449
18426 498449 730396 582457 413675 473880 325300 514957 607183 754733 771058 757345
18416 757345 572316 514568 734656 945315 976301 779472 677407 778496 654927 390634
18406 390634 235963 186970 435980 538904 420173 251693 157131 232939 481409 600887
18396 600887 578782 650643 745915 759869 270891 145187 2946 176871 325822 339867
18386 339867 332078 480122 698958 442338 286402 144388 292516 273138 87961 40088
18376 40088 76296 158304 104387 139541 496238 693899 726981 715106 226279 255394 648644
18365 648644 703584 767631 933206 953153 1201192 1079591 718104 497419 193181 218755
18355 218755 305140 354920 266771 387244 404452 355843 199934 198686 675593 689241 768291
18344 768291 658976 572477 906934 1050999 660585 580800 208558 39796 123960 199255
18334 199255 318862 369427 364292 245270 60668 247975 441803 621773 614908 593123 413755
18323 413755 414092 301157 193294 1772 32775 181355 168707 180327 263119 434698 425664
18312 425664 437179 339246 260333 215474 78732 196771 436944 559359 597572 402912
18302 402912 128646 -19445 33589 -3480 60244 -190981 -212492 -175844 -181808 -83840 337165
18291 337165 751915 758206 346793 366484 533582 373452 248389 398769 373367 364331 331833
18280 331833 225040 240861 387262 299354 275803 378237 368586 171156 98534 -78317 -154168
18269 -154168 62244 114312 67747 -25100 45298 275322 601145 420808 -7902 -9425 156594
18258 156594 261326 338691 256248 261630 151516 366715 524619 618529 657171 564964 736964
18247 736964 1025055 1602314 2042849 2383660 2652314 2934686 2866985 2538386 2264141 1956013
18237 1956013 1702990 1454190 1448389 1553357 2098783 2531990 2807891 3046946 3008662 2981702
18227 2981702 2848149 2853539 2605342 2283846 2098489 1657611 1271160 1150021 812592 595275
18217 595275 498411 522540 559992 692542 616665 465952 595346 857645 929370 790560
18207 790560 899633 908169 497678 272156 270521 323429 236170 632524 730781 586146 623360
18196 623360 681759 497347 266577 402693 529008 368433 455775 393793 533698 636809
18186 636809 833706 665500 400095 202975 85611 227209 396365 469168 460979 394656
18176 394656 364948 485236 539271 600972 731633 727969 506423 646393 516102 209479
18166 209479 293674 728214 677637 666690 689964 787325 941515 853415 576683 463713 378001
18155 378001 620711 878560 983545 825605 752927 943525 940508 905748 811571 968939
18145 968939 1062642 950068 1055375 1217516 1372280 1564727 1434375 1348811 1200536 1369281
18135 1369281 2197636 2468009 2686204 2946858 3309206 3620979 4434647 5304927 6145738
18126 6145738 7109365 7982739 8895165 9699722 10590223 11654346 13482248 16053907 19762888
18117 19762888 25784659 35845556 54028602 85335329 131417624 183998338 221179541
18110 221179541 230078426 223229745 215397701 194627504 141127637 93900464 67727066
18103 67727066 53050062 43975102 37485349 32430939 28375128 25125140 22586494 20347353
18095 20347353 18357210 16971318 15509336 14174533 13180983 12506609 12037983 11525143 10736566
18086 10736566 9961530 9293566 8680322 8121076 7694465 7375176 7232753 6861375 6508965
18077 6508965 6405616 6133880 5895300 5918157 5943769 6030737 6134194 6009391 5838765 5776470
18067 5776470 5476448 5321942 5053453 4859840 4728530 4531471 4176500 3843544 3499882
18058 3499882 3069024 2703891 2439062 2199973 2152850 2203139 1944101 1833611 1731072 1614520
18048 1614520 1563796 1397529 1405134 1500998 1421667 1506221 1393810 1458678 1577739 1505309 1251729
18037 1251729 1095187 871048 743280 879298 1064609 986539 1187095 993917 853270 950470
18027 950470 846346 652268 790183 865457 802503 610750 573077 443014 410751 469460
18017 469460 285399 471311 803754 968899 868515 757354 689938 598865 689566 680761
18007 680761 610689 401065 281498 226732 306060 147148 427447 905994 1134299 1142316
17997 1142316 1028206 1173266 1210091 1136201 1297285 1191118 1230301 1256370 1187573 1187639 1221576
17986 1221576 1115568 895712 1038128 1146848 992748 692623 624631 676260 721855 462272
17976 462272 456479 444787 330195 266420 242038 277314 224021 105558 -89132 -163450 59916
17965 59916 127533 243200 571491 797480 521497 370168 420841 458253 403295 548646
17955 548646 732605 636651 646279 765333 899256 785973 733620 829852 809038 548878 370909
17944 370909 334443 281969 422602 695399 917590 781408 779242 791342 949053 904554 655907
17933 655907 509968 400644 379695 406840 295664 323626 346376 448961 400163 690730
17923 690730 641183 655225 564510 439472 436307 323746 208224 -25932 -17169 71196 59414
17912 59414 -130492 -165427 -209792 133586 126070 16212 185786 171494 188096 402146 739331
17901 739331 555890 261811 197096 366224 394859 248976 303384 488546 565846 394289
17891 394289 466147 267448 175253 270353 508988 485711 274636 74423 -22106 74611 337952
17880 337952 341072 301302 341431 423133 235610 -110134 -286516 -150805 143367 202624 319528
17869 319528 464427 422178 342081 377140 396024 480181 521533 728761 799550 618725 418021
17858 418021 213008 304387 430935 285182 29236 -67893 36110 -53374 -291483 -499365
17848 -499365 -390019 -114692 -85674 -70345 -7834 -15682 72220 16861 88827 218827 234032
17837 234032 207466 238299 301013 369257 514462 648604 678915 767375 692053 567370 317533
17826 317533 195762 189755 277374 307975 429311 331172 161589 159252 163100 257199 264546 387341
17814 387341 483776 510527 415586 337645 277036 632179 779305 1049914 1127586 699778 586256
17803 586256 655536 721429 606046 441611 510748 606697 635381 761829 655334 776470
17793 776470 895482 710369 590572 560433 476418 206093 297539 178549 235542 461252
17783 461252 563246 523239 368827 196311 54520 -169030 -116548 3851 61027 157993
17773 157993 212677 281113 381984 471919 373052 256306 155345 -13092 4419 330522
17763 330522 484326 529855 681136 622338 370939 438223 239751 127109 153571 222239
17753 222239 414756 308284 172587 96084 77668 126329 102893 94559 -83235 -86684 97438
17742 97438 215443 91991 -14744 188845 356300 308139 131476 124392 373561 417631
17732 417631 234164 -72738 -343043 -367464 -445817 -489059 -227750 -232771 -315269 3411 24444
17721 24444 5857 167335 199876 -101473 -128845 -192713 -248217 -128926 60727 166044 258792
17710 258792 53932 -267896 -185518 50639 35128 -111466 -187648 -65754 220286 288944
17700 288944 106605 59505 210576 156151 176029 182450 40983 140196 228964 326138 332114
17689 332114 -164217 -49429 93734 107109 90996 142101 512815 692575 649387 741140
17679 741140 844147 866514 567502 508820 515742 533814 569110 618306 603871 553917 659201
17668 659201 333358 146114 306694 516379 647563 817000 1038461 876907 912555 927408
17658 927408 787582 734881 599432 580210 526062 447358 373223 368133 460690 642033 646572
17647 646572 372228 -16533 -201 173255 385101 510742 625587 518841 502506 650441
17637 650441 666853 667312 804543 1004954 1004050 958893 1006586 858218 820440 930965 878908
17626 878908 800129 856466 741625 877104 957730 1075660 1033422 1015145 877770 877259 997014
17615 997014 1026415 986818 1157621 1154723 1125774 1061422 1001037 1063059 1318324 1389245 1583799
17604 1583799 1846194 1837185 1827443 1791396 1979743 2068868 2335446 2830724 3461482 3684991
17594 3684991 3895239 4385144 4692998 4766767 5049351 5442334 5578483 5679650 5979540 6558201
17584 6558201 7230140 7820195 8602776 9668419 10893936 11949256 12869660 13873062 15341409
17575 15341409 16663039 17950146 19515714 21379892 24244380 28320142 34018096 42814811
17567 42814811 56844438 79490250 115774319 167189198 225716044 275255969 305619217
17560 305619217 326027172 351272805 375802992 383804707 380624572 370430819 356171927
17553 356171927 345121031 332867529 311510764 301350104 318881151 347599355 366234385
17546 366234385 374112101 385847473 403212052 408461730 399271707 382763330 358889587
17539 358889587 333111081 304138528 257352769 198820064 153552507 125150665 106618976
17532 106618976 93125533 82819846 75020542 68401339 63060131 58844881 55024239 51738054
17524 51738054 48642012 45817619 43428234 41097994 39013893 36989540 34806336 32566859
17516 32566859 30804004 29012429 27004896 25253631 24267246 23263739 22293488 21187886
17508 21187886 20334655 19662562 18834289 17984537 17267293 16496592 15491835 14418674 13572665
17499 13572665 12988654 12544339 12148106 11691137 10876660 10689944 10326542 10083112 9965753
17490 9965753 9643091 8963853 8370680 8056254 7624742 7382845 7498406 7597616 7336160 7282650
17480 7282650 7197170 6834176 6389168 6086948 5835350 5641939 5380846 5376018 4961792 4280851
17470 4280851 3926558 3781585 3657788 3590828 3393744 3262501 3201933 2918056 2841962 2844400
17460 2844400 2927177 3068400 2884140 2465228 2234924 2268594 2287293 2283675 2311113 2386147 2471078
17449 2471078 2809341 2726426 2605131 2685509 2705868 2604394 2796099 2884175 2724686 2587259
17439 2587259 2312452 2188953 2049755 1736328 1665303 1581778 1634909 1608989 1424220 1594579
17429 1594579 1701031 1608294 1424917 1261867 1236783 1189026 1117567 941508 1091215 1051608
17419 1051608 856134 895674 1161632 1142170 1030544 1012832 1026053 1128113 1239625 1234067
17409 1234067 1258455 1101759 1011882 1119488 1215531 976640 771579 844325 795388 705974
17399 705974 684047 789997 658440 684459 679926 597972 613170 550199 526981 760906 702424
17388 702424 582528 738840 689324 704115 771609 992776 1100397 923949 1042218 1191457
17378 1191457 1230099 1176805 838920 923810 838018 655131 514763 656538 723960 692094
17368 692094 692833 599311 569470 811711 737426 730350 846629 726294 711899 515804 425976
17357 425976 670022 655330 385501 374145 466149 465416 511806 530352 315180 336041 281765
17346 281765 496383 568773 486728 279267 338543 274872 404651 629848 512775 539549
17336 539549 863015 890088 828931 817270 654074 342362 375340 470403 452296 602624 518882
17325 518882 415715 257848 345903 554062 587579 592559 666048 556752 226886 154093 115498
17314 115498 157032 521427 570615 630914 508342 133109 225251 319853 596585 572357 414852
17303 414852 505635 423726 306908 422561 534970 294684 60708 -134691 27440 155447
17293 155447 -12548 10437 39330 207 -34740 -10701 -116205 -8523 38969 23760 40097
17282 40097 99028 170887 266320 164134 178235 292904 327136 386503 318374 469801 525370
17271 525370 787217 862311 287795 112214 236834 274920 179325 423101 418477 406442 402360
17260 402360 336179 489560 505863 404174 543091 604537 618074 520013 367225 354705 362427
17249 362427 308827 297992 104538 107597 181404 93057 86884 217137 325436 471064 430423
17238 430423 385784 420812 261794 -79040 -217234 -152652 -65361 34640 125402 297303
17228 297303 456790 404290 130623 899 -58108 4066 199397 443947 269549 23012
17218 23012 -40930 3306 151191 245242 128036 76118 -137297 -170511 14654 229919 304398
17207 304398 495245 532656 393519 286429 108431 -120742 -196238 -178721 -289439 -272029
17197 -272029 -166656 -94174 -17721 270975 495023 392537 279457 40867 64168 104004
17187 104004 -12833 -196637 -404344 -112886 168042 235473 231843 330159 235541 87181
17177 87181 112248 -84376 -331115 -506241 -449555 -368251 -270642 6786 52371 -5945 41426
17166 41426 176665 135956 52205 176559 -362 -86095 -40466 48717 54176 -102414 -39920
17155 -39920 144214 175550 69860 -29827 -172331 -251871 -313560 -367043 -310149 -414858 -339009
17144 -339009 -236690 -219118 -157704 190864 224272 -136983 -316974 -209996 -85352 -143499
17134 -143499 88967 20540 -203272 -154496 30259 112846 31661 -28656 -107532 124346 349502
17123 349502 288896 273310 166801 246451 215233 116237 51191 68126 142869 72229 -94796
17112 -94796 -2217 4499 -94617 -149303 -60164 -173050 -111743 -96721 -10730 -35124 -40284 84264
17100 84264 15042 -61085 -21495 345285 368966 195054 247545 351289 169164 244851 -33918
17089 -33918 -78096 132568 303871 342114 460735 439242 405828 447184 305923 221352 155945
17078 155945 43 -44521 -73471 65691 493545 279889 -49046 67230 346394 248527
17068 248527 -46687 -27561 -190954 -79105 -165568 -220139 122903 180175 242800 13460
17058 13460 -135178 -138776 -231995 -153489 -197750 -137907 14481 186971 342230 177750 28696
17047 28696 113626 182529 209906 259333 233808 252375 347775 358037 370518 407385 215424
17036 215424 90610 120196 -46705 -12139 -35087 -37382 36686 14750 -30440 -338584 -388540
17025 -388540 -247706 64530 114048 51895 346706 372724 126699 27958 50301 -306993
17015 -306993 -483449 -403087 -266541 -230588 19666 440407 469430 27194 -132193 -100690
17005 -100690 -106404 -169109 -266664 3116 396157 458230 393335 172521 83969 171212 321548
16994 321548 624341 910408 1277601 1685445 1819517 2253784 2416334 2336243 2129251 2085852
16984 2085852 1916033 1850350 1778631 1745673 1717554 1513247 1538333 1874640 2235440 2293704
16974 2293704 2176574 2075745 1872024 1869327 2047870 2043804 1855965 1642808 1416399 1146733
16964 1146733 947307 654930 336813 26124 127997 206271 317994 525507 715096 560289
16954 560289 528565 291510 226759 89849 40888 167571 266232 356996 358372 256796 142665
16943 142665 167643 249421 207690 182217 216781 -20792 -259151 -284794 -143380 40471 288190
16932 288190 364703 270526 123936 -58943 -14824 138567 199541 2169 45640 -26639 85703
16921 85703 93895 138550 -75364 -82471 -86792 -117253 -120431 -9307 60807 -50974 -223887 -223001
16909 -223001 -35137 168029 257274 262867 284628 312501 289099 166487 -74739 1073 -60083
16898 -60083 167963 383006 548219 719065 460663 361015 472832 532277 572720 660352
16888 660352 311676 9142 -104376 -153907 -519993 -433971 -136309 -30185 148063 376028
16878 376028 489614 367702 320479 86944 19325 36548 77813 34139 167677 221581 202789
16867 202789 192159 136003 200266 230582 124771 135788 247542 330839 478764 354639 67180
16856 67180 -205558 -399363 -394748 -150002 -8517 107554 -26283 -197804 -456622 -372997
16846 -372997 -223106 -337855 -319299 -219597 -71044 52577 -262741 -323865 -105612 55624
16836 55624 225057 216322 34818 -169615 14127 9098 106580 172601 -44657 -207799 -376322
16825 -376322 -350695 -225528 -8224 -9788 1629 -16966 -17208 71303 -65764 46121 202345
16814 202345 85888 20790 75753 -64327 26571 -45254 63654 -111288 -335640 -290615
16804 -290615 19716 388500 582214 618344 420617 394390 120883 79595 146995 147518 -26816
16793 -26816 90793 53134 -73868 16017 229705 283292 174028 376383 426836 358629 220501
16782 220501 316859 425363 301616 289729 105764 65411 264874 179212 220314 329309
16772 329309 240001 119427 -73256 5847 65214 88816 14419 -3270 -44885 9932 182874
16761 182874 229100 250550 146964 9054 -37617 -178356 -280957 -342763 -326548 -247835 -423615
16750 -423615 -577312 -586631 -466713 -496907 -315341 -254438 -185952 -187239 -241521 -209314 -70134
16739 -70134 23449 -55555 -83167 -78374 43021 -21401 179692 382341 158347 65098 -93404
16728 -93404 -8759 159037 209661 288358 282441 336659 203970 154089 77494 108998 78007
16717 78007 298885 228462 82628 52125 270635 324621 247034 160149 50172 46147 -74025
16706 -74025 20786 171821 442545 381091 618 -134671 147893 161351 -307791 -706112
16696 -706112 -427579 -154781 19652 55215 -133321 -319709 -216970 122788 15902 -352617
16686 -352617 -525635 -349051 -217135 -8679 -457911 -409049 -274943 -114598 22760 63555
16676 63555 74905 148700 205352 36437 -21182 -99783 -144641 25509 134119 60325 197604
16665 197604 297896 322964 469016 472597 136002 -70223 -204324 65452 123569 32555
16655 32555 138305 237589 220742 502056 344912 179911 339384 457094 387122 164416
16645 164416 147891 271367 184651 109467 -11440 -98941 -230268 -103422 -154887 -292903
16635 -292903 -414320 -211114 -108757 150743 314959 136145 161396 203175 276918 212089
16625 212089 193303 12590 -121516 153229 -6235 -96620 -218201 -264316 -349651 -355175 -221382
16614 -221382 91998 9816 -299033 -457509 -554268 -454114 -196224 -230473 -18210 178427
16604 178427 60258 -114073 -14470 97343 382856 216243 79626 193764 15596 -78282
16594 -78282 -48452 294150 369043 244479 122381 235952 111746 -98587 106720 93587
16584 93587 -292010 -193290 -307231 -450635 -368444 -298614 -263583 -218955 -116069 -41698 -213683
16573 -213683 -189045 -116531 105207 235356 96870 61391 152023 -105254 -80068 99008
16563 99008 311718 277692 -33593 -27041 31454 -339794 -368377 -150663 -233217 -400677 -340504
16552 -340504 -391263 -278385 -140876 -55046 46605 -28158 -122596 125700 331048 371432
16542 371432 415192 397679 239167 243423 -7712 -98154 93903 145776 117954 148429 53371
16531 53371 76504 332168 188620 274085 84940 80218 357639 331995 308476 184890 298243
16520 298243 515127 440208 387996 221079 -130112 -179813 -192161 -39125 -60694 -132962 -69354
16509 -69354 21675 50084 -195149 -243120 -244939 -300789 -111611 -31764 -163754 -50772 147939
16498 147939 219109 448606 425146 378755 329596 243962 230346 38471 5607 -44496 -69619
16487 -69619 16734 105872 32789 -65287 -180993 -387712 -376287 -321295 8994 94658 75530
16476 75530 -22969 -72745 -295881 -335046 62114 78406 17153 51712 -147800 -244237 53279
16465 53279 -54541 59608 113906 97497 110372 -145833 -332343 -266419 -340547 -295151 51760
16454 51760 180803 106488 254516 438659 341680 383454 363427 212524 188820 81062 179121
16443 179121 12078 91647 273276 294952 159864 58303 91868 -92186 34088 -8622
16433 -8622 -81372 87174 121972 -132249 -212411 -18764 31667 -222942 -384165 -127588 -240045
16422 -240045 -169111 -136343 -105322 -111701 -197075 -139939 -177690 -221774 -123138 -224872 -259085
16411 -259085 -315127 -543406 -150258 145773 -5629 -206072 -365145 -500571 -566152 -527316
16401 -527316 -402572 -127840 -32712 -112528 -95232 -57177 40328 -66391 -413063 -360259 -354995
16390 -354995 -16014 283852 501615 549784 285815 3493 51037 422165 508431 334631
16380 334631 196380 154450 42631 -21891 -555 102253 40265 -10408 15620 195811 505307
16369 505307 502496 93502 -312357 -408457 -328087 -375133 -85529 281011 222314 7137 -83284
16358 -83284 -137896 -163776 -93729 87271 192662 49561 -19885 -149200 -214430 -282045 -117324
16347 -117324 119761 181288 -14077 50010 205543 53174 -76812 160799 112385 -346638
16337 -346638 -541504 -379975 -363702 -67624 -85092 -123018 -139370 -32404 -32237 -71758 20221
16326 20221 -112160 -20927 9038 153004 439288 460414 340325 253990 -8105 -46301 -18742
16315 -18742 -20430 14876 -179595 -206350 -141183 -307926 -424060 -454435 -201534 -160329 -213864
16304 -213864 -106059 -328205 -343676 -313947 -264749 -354356 -193972 -74156 -68069 -90781 270117
16293 270117 336932 11696 -109196 -223321 -198348 -202982 -419364 -527221 -75721 181839
16283 181839 -34629 -381459 -435895 -352073 -288190 -78897 309336 423421 437986 299327
16273 299327 16434 -151667 -159688 -86753 34800 -60862 -281260 -218334 -323987 -409539 -100127
16262 -100127 160040 70843 -43006 -224498 -308683 -298201 -191404 -279361 -467217 -366571
16252 -366571 -268971 -152324 2340 -7290 -239458 -155171 -174031 -258443 -325572 -160555 -90838
16241 -90838 -18834 163900 184998 327576 151814 -4979 52779 241764 210375 84155
16231 84155 116302 180912 271794 362944 380387 153263 68823 47652 10136 -40730 139930
16220 139930 95267 73218 149653 70426 140105 -148621 -185485 39066 101490 266351 301192
16209 301192 145255 211093 392853 281242 178514 180950 192138 126866 47976 9533 -3321
16198 -3321 254872 254439 241242 156454 208891 80628 347798 333695 221020 56968 -30211
16187 -30211 -37445 -42606 4576 -115057 -8570 4654 19387 73801 221608 55539 -33380
16176 -33380 -84244 -6628 -53655 -199848 -186511 63904 -57861 18205 420 132281 243754
16165 243754 213105 -996 -181736 -26466 126951 51957 18821 -185018 -546826 -411895
16155 -411895 -204416 -107145 73124 184019 249360 105912 -138609 -434706 -343485 -36578
16145 -36578 -80714 -346176 -423737 -240125 -164134 -13264 89635 -4999 125209 92088 16264
16134 16264 -19917 105248 45615 -169409 -155862 -58051 -32586 -251980 -192609 77509 41790
16123 41790 69223 -129125 -155032 18837 35513 19366 414468 601028 462262 429009 300492
16112 300492 108633 128662 178415 161757 -201514 -364475 -629493 -407282 5901 210846
16102 210846 325160 222971 81533 -19534 -111578 -177178 76735 314232 201169 -163870
16092 -163870 -393767 -162028 90271 105274 -59674 -200897 -80376 -122238 -167698 -233251
16082 -233251 -276095 -250489 -163014 16073 136557 106751 -54006 -234062 -195338 -288299 -455398
16071 -455398 -413562 -99969 109951 229320 108052 143713 223038 168910 171977 41559 -127382
16060 -127382 -154363 47692 99678 328967 345160 372986 441961 170405 -54230 344 142185
16049 142185 -21232 -70118 105149 222146 80566 -70758 -10075 52280 -116892 -115535
16039 -115535 -157876 -30027 -63552 -69652 -36224 -305350 -154862 -142290 -232848 -262634 -257202
16028 -257202 -122638 -189768 -86272 172680 64636 -55513 -9335 -68437 -294523 -113135
16018 -113135 -220751 -241634 -255947 -222491 -91402 293405 376847 301943 195981 204546 148108
16007 148108 101457 22915 -22280 -15162 -142336 -177558 -163336 20653 350836 501892 288679
15996 288679 230651 227004 -2177 -134004 9585 88534 -12170 -130102 173701 375072
15986 375072 433547 123881 -148192 -349120 -145487 22037 -25798 -78093 -10776 158785
15976 158785 279807 221341 49466 -123289 -128224 -73766 135577 -41343 -110444 114398
15966 114398 -69513 -238004 -281116 51284 227282 374994 425844 131456 -36744 11222
15956 11222 156803 279091 90593 -109140 -214719 -244739 -183736 150097 126796 242207
15946 242207 326367 494517 396586 90160 55879 4587 -102183 -84206 -51729 -165538 -68762
15935 -68762 -38506 -49743 70996 -30292 -147004 -238819 -412671 -163529 -46079 228861
15925 228861 175417 187672 165289 -9026 -114770 -194321 -303044 -220524 -79653 -216539
15915 -216539 -483437 -440532 -223897 -229925 -328053 -228906 50503 -5481 -220829 -139070 34918
15904 34918 -101902 -314898 -176194 -296438 -458564 -400430 -320401 -377826 -322563 -288950 -486337
15893 -486337 -544898 -276657 -266363 -122504 -89378 -281643 -201142 211196 428319 454460
15883 454460 285314 205558 219683 56109 50461 -79582 -23973 -45965 -15356 -23963 -240258
15872 -240258 -324823 -58490 6675 -245626 -212335 83735 87367 6147 114141 154202 55641
15861 55641 -92878 -54412 153631 449980 404597 108740 -71753 -198442 -14503 3299
15851 3299 -160062 -148693 -4598 -219587 -213461 -86412 -29115 202748 189419 145449 161094
15840 161094 252843 -115580 -95808 -142232 -153609 -208861 -364542 -214553 -165062 5690 231772
15829 231772 330593 85049 -72490 -125705 89855 91707 -144119 -360371 -396576 -380071 -341397
15818 -341397 -271513 -279580 -30346 170768 129783 270036 381308 299591 269295 258579 103815
15807 103815 14044 -193430 -21859 15600 42917 286262 -35630 -173366 83074 230302
15797 230302 255972 92408 -118414 -212358 -366146 -494100 -340302 -294760 -219957 -127211
15787 -127211 -134007 -195390 -113824 80817 15528 116894 109440 126166 298286 214730 20672
15776 20672 26891 -145788 -210332 -121420 -94766 -161395 -274427 -338679 -198653 -31243 78552
15765 78552 -80288 -347076 -434759 -449469 -468696 -218824 -68631 -94080 -35184 -37703 -36778
15754 -36778 -2238 -75028 -99981 -52726 -48590 -213934 -133619 -170163 166647 213431 126116
15743 126116 77534 82004 25323 75016 130491 213649 264017 407398 42060 -168024 9912
15732 9912 160161 302175 91470 171700 -33631 70471 109655 -74320 -284149 -406979
15722 -406979 -601900 -520141 -270883 -144957 81043 280079 226775 147503 164561 165726 352908
15711 352908 95867 44182 -75858 -222326 -264322 -179183 -11737 -228085 -405615 -91152
15701 -91152 37848 -85525 -78288 -242448 -389115 -319638 -24233 19561 -95938 -284145
15691 -284145 -57348 229699 370382 245694 779 -227928 -265133 -127760 -57225 -209187
15681 -209187 -291243 -188888 -227028 -355873 -338355 -314301 -171957 97694 171624 -38628
15671 -38628 69277 136930 203348 112377 26918 -150805 2693 123686 -22066 -294348
15661 -294348 -252756 -289985 -414597 -508649 -531562 -322621 -517741 -479221 -138045 25336
15651 25336 147987 300877 232482 186280 193220 122125 -160528 -102351 5898 -74214 -196367
15640 -196367 -101518 181720 111794 -124143 -23653 247249 224489 102548 -38902 -312350
15630 -312350 -260766 -195654 -155051 85144 211380 298331 274337 161945 126064 125847 -44576
15619 -44576 22717 127505 139674 209645 -142969 -399238 -225012 -178196 -255675 -362155 -431792
15608 -431792 -444953 -329804 -167976 -70523 16633 -48745 -86529 70156 30163 1201 162322
15597 162322 140557 -13807 -68464 -216860 -149451 -9660 106695 311449 276535 369860
15587 369860 37828 -352831 -307080 57252 73177 109304 100734 105038 123274 -10671 -98812
15576 -98812 -57728 -152581 -31559 107653 -87247 -100817 -184248 -215830 -162671 -198305 -96086
15565 -96086 19401 36727 8748 -78410 107060 341923 167025 14475 -16203 -94502 -160173
15554 -160173 -26722 274747 208997 68570 256623 246877 120174 -113507 -163662 45012
15544 45012 64843 -15127 112809 204055 186052 206455 79852 47739 263393 169569 78975
15533 78975 92580 11331 24289 100079 419955 225743 71563 62720 122177 115989 64610
15522 64610 -85185 -82427 121654 -2913 117772 126101 157787 126111 321729 352458 281025
15511 281025 85906 138743 -118849 -246864 93582 145507 82598 -65586 -218444 -331043
15501 -331043 -181533 59565 -44791 -198272 -18235 42767 69212 172535 512317 307786
15491 307786 345935 278233 313347 672114 609078 354155 276719 282908 -20037 -180765 -189418
15480 -189418 -114301 -274162 -304392 -290859 -321894 -324219 -251794 -131510 -242353 -93190 -23032
15469 -23032 -63104 -28949 -120976 -168282 -101666 30580 62057 -19716 -252264 -316616 -52820
15458 -52820 277314 393116 311749 374374 277660 63285 -213096 -265410 -28542 -41150 -54271
15447 -54271 -183487 -80600 -46226 170146 303877 275794 42950 -47888 22649 14448 117925
15436 117925 191130 395566 527600 208391 -131240 -260105 -233665 -1223 86946 54731
15426 54731 -105783 -362511 -161893 -95869 -91618 -111770 -54634 -93466 -150404 -191740 -190411
15415 -190411 -178197 -2939 23054 -61828 -18681 22759 22392 25302 83277 107064 300701 478870
15403 478870 476969 325981 68995 73575 314219 12404 -152995 117539 94538 192369 100778
15392 100778 -107503 52393 -30441 -242481 -206024 -317434 -316973 -20978 199703 168117 137530
15381 137530 -50014 -3155 -38132 10107 -154528 -215497 -99423 27954 -276667 -372846
15371 -372846 -160453 65311 49102 -209984 -56167 -30142 -171023 -197560 -143779 -132597
15361 -132597 55077 323477 286313 227796 107809 71328 258227 421236 204325 27342
15351 27342 -71530 -47429 84770 -21936 -334255 -509120 -325940 -45598 54200 31600
15341 31600 315391 299197 108046 -91318 49896 121500 -16929 -120173 -120317 -308870 -392962
15330 -392962 -48401 177518 222049 171755 27444 250533 223652 256991 360748 244020
15320 244020 22374 -35275 -121548 170692 549916 468242 367763 483691 175274 -101459
15310 -101459 -114556 58745 -60355 -49956 -135045 -63853 107529 74984 -412009 -346158 -300218
15299 -300218 -288025 -397746 -335651 470 70534 -83919 -82154 55963 266605 273016 505827
15288 505827 534410 226404 -33775 -110055 -83549 -296119 -394911 -158416 -78384 44172
15278 44172 151911 256283 397883 148243 -225813 -354816 -320017 -220233 -52800 2692
15268 2692 125767 137002 239066 44184 -149320 -182175 -202174 52367 89046 381 10231
15257 10231 82321 327349 522107 319921 13008 -264380 -296858 -78566 -43413 -60677
15247 -60677 -24590 -41700 -38553 -39722 -24231 -43618 -40672 -129534 -230640 -215749 -132554 -106288
15235 -106288 -127143 -67942 -63564 55297 97832 -85758 -214414 -397993 -157252 -7257
15225 -7257 -41369 90600 83729 95395 -755 -56516 -89319 -69511 98052 125746 43494 -21768
15213 -21768 -190029 -197223 -240293 -270600 -214846 -265374 -563406 -493426 -278205 -174124 -29412
15202 -29412 40149 19029 54356 -141100 -264587 -281279 -296286 -283123 -85228 8213 88252
15191 88252 28358 -7403 -275578 -384002 -273502 -70400 -116618 -128930 -297108 -315383 -195346
15180 -195346 -178318 57258 185799 99245 -101035 -240934 -163327 -42718 -15319 -111398
15170 -111398 -291757 -96318 109079 145997 174321 -30964 77519 160732 1953 -159559
15160 -159559 -55994 102492 199327 77788 209798 420507 401698 106834 205764 280848
15150 280848 443909 290065 35972 -161864 -283111 -428425 -406041 -344531 -302577 -156122
15140 -156122 -218175 -187803 -40231 -108518 -28062 -340602 -454229 -241690 -87075 85029
15130 85029 182518 297694 375218 151214 31536 -132463 -212891 -219715 -100409 -43793 122199
15119 122199 205950 297544 267309 159100 -94034 -121943 141411 370006 310614 329820 213431
15108 213431 258325 -82509 -7877 281565 97647 141297 280023 -16332 -53136 -49547 -105635
15097 -105635 100341 45567 62239 49150 86164 102450 -40511 -164933 -195418 -94320 -9628
15086 -9628 -113622 -174378 -140605 -36717 151156 117892 79591 -260934 -259172 -185879 -46827
15075 -46827 154027 246772 136019 -83369 -430083 -574945 -402821 -260986 -47195 222287
15065 222287 451516 511622 500435 308015 262513 141562 282398 273526 227543 98655 33324
15054 33324 -213346 -188580 -115085 1889 56258 -177281 -109580 -122246 -507233 -755746 -832131
15043 -832131 -778049 -581457 -554046 -712482 -587346 -317201 -280422 -62115 233510 519629
15033 519629 274289 -63307 -240679 -371858 -417489 -701670 -718408 -496884 -189497 -39170
15023 -39170 180582 154154 218545 307349 213487 108112 -49279 -105540 97781 124020 -127788
15012 -127788 -233033 -216016 -96149 -188016 -15033 -219159 -420599 -196411 -64404 -123037
15002 -123037 -207184 -371975 -369148 -297201 -141493 21303 -167975 -316075 -285825 -200587 -170752
14991 -170752 -203922 -316021 -455571 -397035 -329897 -158866 -39031 -160301 110171 283513
14981 283513 7604 -2418 106848 5367 -133674 100897 311334 146684 43548 -28229
14971 -28229 -132492 -130364 -5782 303363 224757 24049 -218315 -348840 -413876 -365251 -226989
14960 -226989 -338334 -253547 -172972 -330643 -463599 -429769 -166605 1400 -25297 70023
14950 70023 83174 -42707 -33262 148119 283781 160615 -121733 -238598 -201972 -79730
14940 -79730 -18089 -116460 -33111 244679 341536 387337 197392 29247 186904 114526 -87328
14929 -87328 143799 247650 -42937 -293930 -438419 -506103 -441344 -64919 134185 94085
14919 94085 -28111 -101486 -163766 17524 126303 274667 153645 48884 -70757 -123765
14909 -123765 -52659 -20267 -59337 -33898 -60822 181629 -127702 -238598 -94124 -49669 -111380
14898 -111380 -152892 -100956 -117639 -15679 -126232 -343964 -336582 -118434 -10212 -184975
14888 -184975 -280133 -285781 -356792 -559086 -191604 179525 133858 111661 121378 152812 68558
14877 68558 -290498 -203763 -168054 -112591 -33578 -112062 -30468 -192801 -427602 -375656 -434663
14866 -434663 -193387 33677 53769 92570 270871 258683 -88678 -71645 -112455 -132403 -197886
14855 -197886 -274664 -417066 -456313 -556027 -554730 -465687 -20181 16609 88200 166538 38686
14844 38686 -2711 265200 450329 550228 533210 166457 -11989 -199757 -175849 -32589
14834 -32589 159154 -3518 -177547 -204666 -346571 -371731 -133204 -204206 -158790 -120731 -143622
14823 -143622 -149565 -159615 -42750 -81729 -151724 110515 108574 -117028 -76220 3208 30671
14812 30671 -103822 13879 -63092 -176076 -49433 -71367 112691 248612 269131 115156
14802 115156 -85082 3361 80653 -170537 -292976 -89877 92721 201126 329669 -67606
14792 -67606 -406441 -278308 -274949 -231868 -251513 -367177 -385870 -183975 -63500 95953 -93359
14781 -93359 -233442 -283018 -259571 -282379 -466079 -557222 -543267 -579493 -367041 -125435 -75403
14770 -75403 -259421 -236227 -270284 -373984 -127569 -13387 54143 268977 188297 -100197
14760 -100197 -414963 -467565 -504161 -286247 -89916 -159182 -161515 -7388 -16284 156909 190490
14749 190490 152275 -25271 -228429 -193823 -78492 99301 -18931 12890 -174959 -428626
14739 -428626 -554518 -449768 -270385 -57699 -167301 -345903 -188998 -47436 9346 33385
14729 33385 -180246 -233856 -288660 -158555 -110843 -282992 -450806 -433357 -551255 -443516
14719 -443516 -327174 -315422 -231885 -118542 -28539 200562 278397 39886 159392 293088
14709 293088 205592 261214 240375 164410 -124857 -227682 -138908 -148885 -261802 -253524 -107416
14698 -107416 -313469 -542948 -293939 72657 -35268 -104667 -100709 21894 16176 -12233 -134448
14687 -134448 38797 164497 72116 153715 101946 146079 223667 161512 46279 182524 287817
14676 287817 71083 -107778 -67290 131107 100257 -123934 -297636 -213819 -233764 -97670
14666 -97670 -158088 -154122 95431 38522 -218815 -256135 -266794 -346323 -432305 -295141 -102838
14655 -102838 -184721 -79489 291510 252443 -56199 -53963 -7662 47746 194375 -2834 -158658
14644 -158658 -26660 -92380 -12460 -166359 -74206 96714 151056 -8339 14689 -46806 -62172
14633 -62172 145036 236841 102982 127506 66113 255680 299965 100935 -242110 -234577 -211131
14622 -211131 -183930 -113748 -75034 12963 118041 167906 91437 -12525 -110988 -124687 -172744
14611 -172744 -147250 -138531 -347184 -457909 -371604 -433029 -417516 -415482 -541768 -638905 -481980
14600 -481980 -125736 -94386 -143665 -111840 -63847 -117043 -226516 -215940 -98152 55365 108946
14589 108946 226656 -173585 -422865 -230169 20705 101418 208436 430210 498850 501538
14579 501538 229835 119872 146289 -9418 -250804 -418036 -306908 -217832 -127599 -168100
14569 -168100 1465 83450 -123011 -949 16212 -44257 185801 278019 194862 245214 279138
14558 279138 120446 -72874 -98005 -112223 -165894 86332 52949 -359606 -248695 -110527
14548 -110527 -148972 -139511 -172336 -239778 -148875 -19605 -126039 -138771 51022 -117283 -181756
14537 -181756 2092 -32924 -120049 86537 161348 -82749 -286295 -155274 9790 44376
14527 44376 -43966 -220956 -155270 -16444 -147514 -434507 -220344 67937 74550 58099 16050
14516 16050 86089 183209 231843 426222 427848 224094 168561 249952 217947 85566 141437
14505 141437 42192 -145806 -136597 -49715 -80630 -178778 -211191 -92803 45098 -80671 -132619
14494 -132619 -127563 -15303 203853 386408 320947 -125228 -199267 -299127 -448953 -254301
14484 -254301 -57733 -56008 -36852 23058 62330 184954 -48890 -382465 -421623 -351022 -71596
14473 -71596 74212 50875 60485 -31386 -150823 -340384 -351186 -5733 214064 125955 39265
14462 39265 29379 -85251 -178646 -92295 -181776 -347996 -431510 -351391 -343151 -362011 -344450 -101827
14450 -101827 4098 -83359 -98401 -187784 -208507 -56779 66159 394937 480602 382340 254143
14439 254143 53663 -136702 -122637 -101183 -27985 193449 129646 -213487 -395406 -209508
14429 -209508 -147446 1901 86025 203990 23450 -12038 -150869 -272535 -180249 54720
14419 54720 -48857 59217 129777 342070 423236 265671 89085 -1153 33234 155811
14409 155811 267371 78628 -39012 -68714 59821 63440 -230471 -286436 -22161 -67885
14399 -67885 -273325 -244564 -94333 -192214 -207985 -350898 -373356 -320361 -228747 -212075 -249823
14388 -249823 -352515 -424591 -383576 -458972 -426699 -264200 31780 96143 51316 18839 252127
14377 252127 220244 210105 188627 189975 320007 63001 106822 -229954 -118539 6097 117125
14366 117125 173471 -138387 -263358 22157 255953 638568 574879 298118 139390 156762
14356 156762 84088 -191077 -378983 -189195 -77584 -100421 -82168 54800 -24256 -224887
14346 -224887 -176471 235104 318836 189573 -161485 -232837 -148844 -110838 7233 -28626 203428
14335 203428 364685 195204 46190 164973 109361 -243182 -526580 -482645 -146650 71415
14325 71415 151513 105506 121400 1777 -122011 -236790 -163817 -130066 -306941 -382375 -362528
14314 -362528 -178019 -189289 -135820 -20513 110239 211592 141783 109609 322830 294754
14304 294754 292025 301347 33423 -137707 -319270 -190012 -204601 -270417 -146423 -117504 -108667
14293 -108667 102280 2164 -59950 -7425 88097 -160035 -208851 -279348 -338364 -130160 90264
14282 90264 73142 325142 237222 207024 64321 -98394 5809 51015 -64750 -50588 61385
14271 61385 36323 -64000 -129946 13233 -23512 -16962 152648 -41926 -247183 -534900 -632851
14260 -632851 -408383 -290382 -298619 -334866 -325993 -189407 -32075 -84753 116138 365889 416865
14249 416865 400776 307215 482258 289000 126823 61770 -112387 -116663 21428 97608 317567
14238 317567 487480 275537 324659 193996 80797 27058 156555 276775 277844 361649
14228 361649 310198 247797 183373 298029 208262 129096 102903 209433 235773 203122 180808
14217 180808 352762 283311 186627 137736 129139 -102520 28399 195801 156500 173930 179883
14206 179883 304531 92190 12798 -62594 -156368 22549 77832 40482 10648 185422 121572
14195 121572 129935 -18354 -184172 -38364 -50873 -88134 71119 315460 284995 307657 386013
14184 386013 389307 479746 676309 539476 381877 278827 145021 -1980 35484 128740
14174 128740 143913 -63103 -85607 84066 207686 248770 156281 290825 -8460 -379257
14164 -379257 -317188 -14126 63254 -165475 -137436 -141383 -294363 -282466 -269472 -205822 -155478
14153 -155478 -234188 -210933 -116064 -8536 44980 27737 25804 117745 191880 55280 -93796
14142 -93796 -331609 -254277 -131184 -156280 -143481 -113017 185232 394151 471708 591863 554185
14131 554185 595294 520608 282466 238165 195609 84882 -3624 -146943 -101271 -143857 -114695
14120 -114695 47681 40178 -25502 -132298 -234759 -327867 -351252 -353738 -507898 -580432 -498362
14109 -498362 -168346 -91073 -138866 81023 197273 93244 165811 179152 318877 -22499
14099 -22499 -104087 91368 -2791 48164 40161 4494 66058 134131 188999 43968 -93658
14088 -93658 -152502 -161860 -191829 -139739 -23653 -75174 -273287 91965 169601 185610 259626
14077 259626 403166 381843 241070 18204 -10619 -56069 -165628 -328537 -152383 -58101
14067 -58101 4426 20022 -88124 -14340 -80733 -185756 -87892 -214975 -260255 -189411 -237849
14056 -237849 -253178 -172804 -65682 30010 -183903 -295091 -69528 -5959 1040 134028 97415
14045 97415 56 109160 69216 46594 114132 87850 62750 -74000 -13419 -35096 -191954
14034 -191954 -187917 -105483 209765 324830 171046 -68201 149180 133068 -36934 -108978
14024 -108978 -304009 -548439 -720706 -291188 -159 -50865 -107164 -81832 -152884 -69400
14014 -69400 -119098 -306697 -175769 125117 329077 286208 299270 152913 200169 370352
14004 370352 128258 20719 19567 132913 279305 -37181 -87607 -225027 -388642 -46172
13994 -46172 38095 286547 293417 23343 -21382 -59122 -128966 -60307 -93776 -213878 -222536
13983 -222536 -175506 -226272 -86974 110867 162089 200990 88275 -241589 -162831 -144625 -67622
13972 -67622 120142 151427 35780 -96500 -84316 158998 366885 3496 -144303 -97174
13962 -97174 152586 178738 128536 -1757 -241529 -354736 -344455 -490514 -331010 -229763
13952 -229763 -307909 -151692 -53582 117188 16772 -68172 -126528 -292854 -374647 -201314
13942 -201314 -14867 8928 58783 -102562 -122743 92428 37273 -199589 -112628 81597
13932 81597 268341 301067 442032 358606 17131 -129763 -197724 -270119 -434663 -348753 -182481
13921 -182481 -40105 98019 -74445 -237426 -239293 -122017 -166490 -145347 89717 210013
13911 210013 326172 150199 133521 -38346 -334451 -376610 -226148 -19939 -48937 -314929
13901 -314929 -395821 -469499 -476559 -237743 -126299 -15273 -63839 -85738 63792 46207 2415
13890 2415 275938 321295 145927 48874 133061 85918 -118365 54140 50023 -175335 -342468
13879 -342468 -150267 20940 -34895 -43731 124855 350037 498902 449064 450323 314719 183607
13868 183607 260631 55569 -15472 -167011 -111043 -398028 -579448 -496847 -451544 -353489 -114819
13857 -114819 78425 43378 -193516 -215343 158301 414915 206623 -46404 12940 165182
13847 165182 -156750 -275760 -319794 -462168 -399276 -391957 -464965 -374436 -262473 -166521 155493
13836 155493 351117 56244 -239399 -372189 -59679 214372 104746 -64969 -24978 17283
13826 17283 272991 401626 401222 214249 171381 68419 29740 40077 123808 208571 153329
13815 153329 179359 216137 -18820 -213538 -349607 -442451 -405745 -325890 -5944 123442
13805 123442 147354 293632 452233 340529 164591 -150559 -156786 -42085 167785 265166
13795 265166 325894 445217 390057 320672 350842 274472 157556 -156113 -302496 -120705
13785 -120705 197691 525411 504629 345008 170788 149478 -61631 -250701 -328155 -316918
13775 -316918 -169607 -103769 44689 273205 224298 122865 -20688 -93188 95187 189095
13765 189095 5062 -195351 -282775 -318098 -159441 -207701 -394396 -460591 -404179 -209472
13755 -209472 -27531 -107470 -229682 -256951 -116127 -46413 19262 -18259 -122389 -105318 -104338
13744 -104338 -10064 92619 -168190 25330 141920 -62141 -279431 -441665 -507016 -378597
13734 -378597 -160370 8695 -101738 -116755 14699 -119011 -252060 -426841 -400310 -181909
13724 -181909 -71876 -300435 -514896 -339493 -201488 -100248 -156383 -53522 -122256 -332687
13714 -332687 -316028 -157273 -176239 -104125 -39884 -32474 15051 -28238 -150466 -146867 -59407
13703 -59407 -4457 -223709 -410052 -326917 -212242 -105078 91076 375044 217911 119782
13693 119782 -29817 -122307 -56427 -29759 152026 90531 -13586 -48840 -68700 -119518 101573
13682 101573 273311 302544 100051 -52134 57615 134118 363198 406565 322855 205744
13672 205744 207623 126286 205237 -1656 -234811 -73057 31509 81079 94513 -91904 -302784
13661 -302784 -294471 -213347 -168288 -76497 -233683 1039 144805 -114773 -58530 -195975 -392731
13650 -392731 -210097 176181 411624 365755 182043 -5907 -85495 -137100 -438415 -513503
13640 -513503 -480532 -440585 -237008 45078 186624 234278 258565 144942 -72430 -193556
13630 -193556 -123933 -57888 -100473 88313 58086 56265 173891 161048 143970 -84030 -331536
13619 -331536 -149786 -327493 -296184 -197410 -40634 -74189 -257371 -239127 -167163 -268897
13609 -268897 -357110 -43077 30953 -28693 -37937 -170499 -80016 388549 548492 172229 -202952
13598 -202952 679 16704 -145689 -91777 -222272 -285099 -284503 -308915 -498032 -624366 -691337
13587 -691337 -654164 -677338 -570557 -354708 -373922 -294358 -255180 -27170 42209 -103568 -52016
13576 -52016 -1793 159718 243388 -21618 131787 215209 119372 -12082 -112378 -142014 -116444
13565 -116444 -62601 -60817 -144671 -275491 -197363 -150256 -37715 -2364 -43188 -65476 -5309
13554 -5309 -248968 -246838 -6499 -342572 -409629 -165881 -42430 23452 -133857 -218862 -22710
13543 -22710 210820 205351 43133 -147233 33260 86338 104845 -217639 -334790 -176963
13533 -176963 161895 176975 120670 42974 -12382 -155046 -108088 -80308 -40807 -12310 133987
13522 133987 170593 103772 -54852 -282828 -344592 -353622 -269453 -276965 -405565 -282344 -257997
13511 -257997 -273101 -191533 -288889 -210094 -85954 -124965 91781 39165 -102866 -357247 -260355
13500 -260355 -128209 -300808 -414072 -317267 -365924 -518028 -567946 -366477 -505530 -539071
13490 -539071 -246021 -8409 52255 87342 -5271 -216315 -391935 -348375 -136153 -129108 -85306
13479 -85306 -137136 -42584 -114957 -345546 -538309 -565325 -283580 -377080 -206584 154757 200797
13468 200797 139352 -56654 -143181 -276829 -474813 -395650 -159457 -41978 -160810 -29197
13458 -29197 99345 13755 -18269 116542 -55681 -172526 -245873 -123440 -11338 125577
13448 125577 118825 85275 -149675 -157737 -24423 -34014 -141094 -168059 -231441 -295568 -72848
13437 -72848 -81592 -143104 -49697 -106047 -106700 -87403 -205900 -104029 -36125 -107929 -85614 61443
13425 61443 160728 99984 20224 68988 -13470 41856 -119356 -77131 -22120 63162 223760
13414 223760 161464 21323 197139 283108 283104 308724 215503 -42062 85927 -60963 -425507
13403 -425507 -265909 -4602 128251 107361 67981 -151495 -142153 -120443 -76332 55636 -3629
13392 -3629 -203294 -194954 -441605 -240216 -48705 -10159 -108448 196093 382390 395162 154653
13381 154653 328759 470541 204262 78888 -175303 -107971 162307 -35727 -132821 42339
13371 42339 33447 96100 526609 736972 571939 483358 206178 -7682 -54565 -315370 -304269
13360 -304269 -17915 24339 -71858 5987 -50046 -142714 13722 72640 251206 344170 419515
13349 419515 336674 407360 316706 93773 -34012 -52792 -147647 -49352 8512 -177611 -328840
13338 -328840 -262111 -219294 -152773 -51027 -148197 -335969 -327577 -247697 -120624 154672 22180
13327 22180 -191558 -305654 -214892 -58025 -12867 149626 93600 -293088 -176862 11721
13317 11721 -130829 -44412 8346 -10825 88908 -39645 -182269 -240095 94741 64448 -78913
13306 -78913 -219657 -276321 -200083 -64415 -3771 -155440 -288052 -7304 189329 317850
13296 317850 82177 -123654 -173041 44711 29491 -134165 -287225 -143856 113601 -58449
13286 -58449 -154780 -247650 -380037 -199092 -87286 22996 -112151 -244299 -77539 143923
13276 143923 20114 -148637 -268283 -169884 -38178 132613 10578 -374726 -615131 -446403
13266 -446403 -110256 135039 212468 123147 -35940 -67006 64856 -41077 -173956 -195870
13256 -195870 -22151 334782 311611 63816 -103337 -345856 -765670 -678192 -316838 -160690
13246 -160690 -61206 34548 174268 156273 -44708 -240219 -294905 -8163 -59755 -152087 -341899
13235 -341899 -125806 9327 -45741 -22844 20619 -222309 -250227 -27622 101954 174843
13225 174843 237224 241377 150179 126565 60094 102434 -213313 -128332 -16932 185480 49843
13214 49843 -24901 -99897 -294338 -268484 -164183 -356765 -293078 -334760 -300608 -274399 -275828
13203 -275828 -340591 -426055 -350690 -353113 -434944 -455455 -384996 -299620 -334343 -44618 180347
13192 180347 -133984 -464344 -556173 -471154 -189172 -70207 -135282 95306 162217 187292
13182 187292 111994 6582 -39363 -21296 94777 105708 -85302 -149950 -180146 128278 221681
13171 221681 224698 204419 -2201 -124747 -121274 -36296 10713 -86109 -131631 140119 137028
13160 137028 219190 69829 -72951 -164328 -93841 4992 61260 338038 271581 -154215 -58297
13149 -58297 -97493 -480244 -345800 52556 243616 249635 304185 380464 180782 -99225 -313417
13138 -313417 -42697 104227 262117 283432 300431 155084 -99887 -77675 218351 287261
13128 287261 223489 148795 234424 224276 89660 -242598 -171331 -64865 -33914 -266477 -316127
13117 -316127 -268066 -162734 -112929 -92565 -13580 -162182 -393652 -224943 57768 249278
13107 249278 190576 46233 -144071 -220964 -288333 -123918 89552 -121011 86630 408385
13097 408385 258072 31692 -132435 93240 40884 -107406 -49656 -139887 -144484 -9588
13087 -9588 43617 -219261 -433444 -348702 -157288 -115501 -32044 83609 143672 105646 206198
13076 206198 421662 234792 46615 125714 -29088 -1926 225543 396702 410449 240853
13066 240853 147303 179008 268539 113611 -31917 -270887 -483644 -527676 -319794 -231181
13056 -231181 -276989 -419517 -440185 -422135 -278948 -308974 36926 145804 -28300 -62896
13046 -62896 -97804 -278058 -316838 -385411 -231496 -109003 98750 228280 109553 90126
13036 90126 -83346 -255489 -65363 -117562 -202039 -172018 -212697 -275703 -170123 -148389 -83743
13025 -83743 -1378 -124063 -177936 -56087 173768 305493 442275 360971 135002 145483
13015 145483 141992 102898 -149666 -226036 19686 197247 212973 153281 16453 -58755 -97367
13004 -97367 -16800 -94840 -90657 53430 -61356 -120681 77493 70465 -86316 -163755 29429
12993 29429 89208 -83569 -50773 148580 204991 -5167 -154069 43222 160788 -36012
12983 -36012 21738 43653 9622 -12543 106831 162768 258889 120088 61998 -191715 -254844
12972 -254844 -284820 -253441 67943 36623 -70536 -37527 -23618 89313 308290 288239 213952
12961 213952 27044 -70893 58329 -137402 -376341 -653639 -542923 -320074 -286892 -195003
12951 -195003 -181682 -63427 -51945 -114194 41738 -32808 -121678 15996 -17998 62494 84101
12940 84101 51370 51370 127109 185366 135471 12505 -54390 -166909 -258172 -276876 -11640 76243
12928 76243 54381 171927 302594 129600 41385 -160928 -360775 -437314 -346259 -473070
12918 -473070 -385675 -31516 90509 -81624 -359620 -270848 -47538 -131711 -200660 -119204
12908 -119204 58470 76232 86751 74316 9999 -103785 -182824 -184014 -6010 -67451 -198937
12897 -198937 -266269 -202678 -170876 -182212 -10332 -88990 -50490 126058 56074 18034 -128446
12886 -128446 79803 117757 86954 138902 239085 80141 -73751 65085 210720 153047
12876 153047 -112071 -175732 -75716 25348 144303 217194 170230 185007 368288 489683
12866 489683 388914 458207 409678 264323 103993 59206 18845 24766 22303 21409 73690 281481
12854 281481 219389 6419 -178803 -165371 112733 270374 243437 136091 288686 185587
12844 185587 -54895 -113181 -46365 -64036 -28979 -12059 -206810 -109360 -92022 -112220 -264035
12833 -264035 -194267 -17769 75880 204461 172492 125621 154972 27833 63656 -225554 -376592
12822 -376592 -72054 204628 217763 129189 -84585 -325299 -455787 -351510 -286358 -329332
12812 -329332 -98310 8743 123456 329836 212983 451508 495615 605159 658719 627834
12802 627834 455504 104977 220393 255627 467986 645494 514626 427141 435250 398619
12792 398619 381553 334473 399082 629543 442841 144745 -107430 -17024 265750 216244
12782 216244 264043 17005 -27195 83950 4351 -158705 170245 362523 273492 333687
12772 333687 275578 41483 -46451 97012 180573 210110 335054 407953 359541 429885 207922
12761 207922 123658 214292 233485 344082 378762 171566 -83002 -83077 -203776 -365966 -201956
12750 -201956 28992 155543 103231 -67963 -152033 -155125 -69809 -170054 -171389 215578 337622
12739 337622 277006 145775 147071 -109691 -186267 -39153 -215312 -320009 -58094 93762
12729 93762 12624 -271663 -270882 -176344 29528 61784 209981 323373 233444 229955 197055
12718 197055 102561 -989 -13733 -88655 -12028 64251 27627 -137701 -135463 -186877 -186252 -40921
12706 -40921 99293 -43324 -158848 -212973 -334283 -373244 -248375 -99897 -134992 50065
12696 50065 -71021 -289997 -419962 -343405 -227749 64105 110769 -69718 -58076 -44774
12686 -44774 -100777 -297124 -233442 -58993 -68383 -105695 81653 116742 -163629 -235099 -487265
12675 -487265 -353540 -312799 -25038 344116 430839 429273 308965 424612 508399 418788 365161
12664 365161 279177 259885 285940 197689 66794 -322496 -380614 -210004 44089 412608
12654 412608 308052 71519 -78298 -126051 -327195 -254012 -132670 -172861 -218745 -201573
12644 -201573 -42445 12770 -299799 -276957 51277 178339 -57914 -214949 -381314 -211544
12634 -211544 -40831 -68810 136766 261833 106824 14752 30198 9198 -26957 -80073 -127975
12623 -127975 -131061 -40286 -53887 -69431 89816 -31143 -256504 -337109 -215646 -136155 18882
12612 18882 -99532 -400054 -342903 -271663 -193567 -328670 -155804 53078 -11885 -44804 -266725
12601 -266725 -122991 1223 -83788 19750 144597 62504 86160 183582 31742 32578 -167953
12590 -167953 -254005 -113019 14480 -46580 -123643 -224253 -231797 -152888 -19613 242400 164276
12579 164276 333627 88085 14434 -53348 -57906 16051 232813 57433 17999 -130713 -260515
12568 -260515 -74872 47397 -60251 78588 177579 258226 279399 235635 274446 400660
12558 400660 265513 209266 342587 275839 171715 108478 14210 276903 207341 99826
12548 99826 -46128 -544028 -636306 -471012 -456093 -326381 -118741 -24046 -96322 -182770 -362757
12537 -362757 -314628 -332876 -141838 59515 -75482 -220755 -354206 -300781 -133420 -92155
12527 -92155 -448097 -338943 -127554 247043 139510 -233699 -279191 -98492 -134865 -99546
12517 -99546 35195 -210631 -171116 7457 -185005 -103257 -200154 -76214 44413 -48633
12507 -48633 -232445 34641 215549 173068 178067 283465 220868 199883 126949 -45064 -233642
12496 -233642 -408575 -314468 -225434 -108776 -104308 -88275 -73843 -242510 -232425 -165142 -31412
12485 -31412 -110740 -75737 -36595 -56544 -92187 -34786 -65569 -173212 32454 13254 -70579
12474 -70579 150768 -105429 -251288 -229468 -230540 -180408 -269685 -254804 -258902 -195380 43920
12463 43920 -91008 -191995 25356 150041 -16849 -169159 -317455 -136914 -93866 -155625
12453 -155625 -252260 -277552 -203198 -105066 -302319 -200543 -241916 -170490 -32902 -108361 -93574
12442 -93574 -27635 -121679 -156214 -16858 -41702 -174039 -34912 8472 73371 -19113 -236848
12431 -236848 -5001 390924 467552 187784 -128483 -71664 -81701 -93135 -520876 -500050
12421 -500050 -382912 -345604 -255212 -194135 -138825 11615 34176 78671 -2830 128747 289526
12410 289526 399054 120576 -29434 -279591 -414508 -230420 166491 347607 139735 36087
12400 36087 143462 22209 -50822 -29707 -7725 -114097 -243344 -322344 65448 82494 171063
12389 171063 230283 267387 173978 75929 2577 10413 -310550 -394572 -276838 -214225 -101124
12378 -101124 183130 117064 2356 -191664 -450407 -414480 -316104 -154452 -355246 -291901
12368 -291901 -144189 15697 315880 485236 163732 -14703 8309 267622 295551 221142
12358 221142 127057 -53283 -170865 -378084 -415577 -370377 -233768 -160198 -126587 -306590
12348 -306590 -201042 -77952 -112547 -160405 -201550 -64465 -26718 -16332 163946 348443
12338 348443 352599 273523 382036 424374 324522 46831 6504 9847 39097 9194 -74957
12327 -74957 -14643 2459 -209433 -389354 -462961 -269424 -24005 -31803 -88931 -294861 -151476
12316 -151476 108604 80709 -100420 -145589 -206607 -166518 96706 259098 357383 314026 1677
12305 1677 -173503 5960 33285 -219901 -290060 -376048 -504255 -449649 12626 218256 -25180
12294 -25180 -204123 41725 43332 -155787 -89480 -20458 -83881 -261118 -575974 -723153 -1002585
12283 -1002585 -942745 -719127 -529250 -362597 -33786 -119892 -145485 -203762 -359796 -300313
12273 -300313 -191095 -215569 -231021 -330284 -183966 115096 196311 242265 -61185 -72384 -74482
12262 -74482 112257 213231 231278 99457 44054 309435 312321 340065 483957 525489 215449
12251 215449 233431 179975 61519 -46387 -62517 -139051 -230776 -253321 -291351 -281518 -224478
12240 -224478 39147 333396 183887 -66886 -193340 -3470 -153284 -406992 -285876 -141915
12230 -141915 -435652 -423048 -271497 -257838 -165930 -215327 -126045 -52168 -88079 109223 352985
12219 352985 78242 -205154 -137188 -80613 -24632 -24809 -292518 -362556 -148448 32437 -57678
12208 -57678 179515 214372 322509 333468 294631 75778 -193583 -380281 -335576 -186665
12198 -186665 -249173 -3283 178271 -1729 -155519 -190618 -296096 -109767 -15923 46089
12188 46089 -60475 115056 -15246 -74666 -62195 -40728 -6160 797 -107680 -103958 -23226
12177 -23226 77146 201989 322441 231851 43942 -130764 -2821 83147 54166 88186
12167 88186 176876 159196 14255 184141 249132 61789 -262029 -461325 -365657 -389805 -314734
12156 -314734 -192686 -57877 -33317 135379 58712 -38184 -262165 -305590 -222974 -400427
12146 -400427 -285211 167921 214921 11407 12233 -58090 -120446 -105726 -99077 -316327 -346704
12135 -346704 -323512 -318093 -183323 -32421 -35681 -65352 -5618 -34307 83300 77578 -35927
12124 -35927 54852 245868 114383 -19693 -86130 -251514 -379780 -86313 -85742 -213952 -1982
12113 -1982 148432 357242 377159 303219 128591 -132169 -107487 -193548 38890 169880 195875
12102 195875 213879 104018 -202957 -328201 -277764 -196841 -162626 -280514 -213801 -123864 -145394
12091 -145394 -275781 -408753 -116874 -215188 -411138 -364892 -152447 -67918 -44990 -21757
12081 -21757 52404 77272 277102 69435 -89211 -27639 -171295 -55734 -131625 -179466 -286829
12070 -286829 -146504 124529 198512 223712 100061 66894 -26920 -34206 -34523 153211 143809
12059 143809 -120357 -136613 -82259 174222 262566 108598 307691 273948 78927 -163450
12049 -163450 -160799 -194390 -169436 -232732 -134119 11653 39724 -87658 -93965 32099 83794
12038 83794 -255572 -281056 -174873 -19499 -102632 -136701 -57441 -318665 -353077 -259326 -255580
12027 -255580 -236351 -124321 -72886 36043 -95431 -314475 -142885 -1236 -157173 -163209
12017 -163209 -249126 -169798 -124502 -263259 -181672 -4726 91872 -68951 -362088 -446068 -519677
12006 -519677 -341981 -400402 -492708 -230539 -198709 -137434 -284375 -122219 57644 16090
11996 16090 -77115 -38241 63097 112005 200097 297110 281580 433090 346828 215995 185658
11985 185658 -48132 -209223 -146094 -172555 -211962 -168439 145066 281837 402133 434021
11975 434021 -13851 -149455 -289186 -325447 -332992 -351256 -211072 11446 323400 271988
11965 271988 190272 58585 -63581 -118394 104250 354938 438265 346904 61387 -49385
11955 -49385 122270 90635 -43611 18352 154066 45330 229042 393491 288847 35429
11945 35429 -381203 -391438 -59503 -18731 -41361 -43731 29583 91934 183958 -22517 -221280
11934 -221280 -288553 -406137 -171953 -29585 -113041 -73543 -166407 -116618 626 -62590 75535
11923 75535 129206 87593 72405 -30945 -164124 -111250 167730 258550 310548 239083 168739
11912 168739 171523 153982 118560 168983 233654 173199 217563 222419 189011 240990 285421 198428
11900 198428 226219 98052 -170438 -290206 -324446 -249278 -40127 180082 320744 33367
11890 33367 -159266 67941 288725 105481 -14728 -329893 -371544 -329713 -211193 -30018
11880 -30018 -86171 -112485 -20245 236102 301990 183683 110873 -517 -24556 21484 118834
11869 118834 -125889 -221526 -239329 -176409 -153325 -106293 -85781 25224 -94371 -119818 -208390
11858 -208390 -146452 -138303 109297 21148 172081 263825 158575 77602 39961 233548 230316
11847 230316 198974 265960 147844 102550 -24236 -186487 -110768 93365 255233 254598 162381
11836 162381 262554 219841 15204 -82603 6889 -126482 -95508 -119145 -137622 88920 -148724
11825 -148724 -125560 -209544 -201148 -33337 227102 -15896 -230604 -301937 -364931 -120603 -74156
11814 -74156 24778 -9594 44464 147465 331817 421485 345971 119983 100095 -30565 -37475
11803 -37475 14715 1308 -39884 43345 -157710 -310945 -438572 -226483 -217532 35054 242896
11792 242896 34880 -37250 -147723 46874 204995 59575 -116276 -113899 -182795 -70566
11782 -70566 72277 114419 85363 -2046 11077 -1463 -333535 -364348 -372911 -531825 -392496
11771 -392496 -109350 -231129 -298007 -406202 -320898 -164345 -33020 65719 -96076 -231138
11761 -231138 -130690 40013 296288 417147 289324 154249 71062 -83337 -419240 -138051
11751 -138051 -171226 -295043 -471594 -451617 -320124 -31652 11135 144982 142973 95198 88033
11740 88033 218618 250033 204350 -21252 -316550 -263466 -186296 21203 67804 23994 57218
11729 57218 69859 -205981 -312871 -274430 -403537 -440746 -317779 -303047 -179640 -153538 16513
11718 16513 -86515 -49623 111341 207705 -39593 627 95042 -87872 -141982 -96277 -71713
11707 -71713 108813 29963 -230498 -148568 20478 119061 -14978 13165 62767 -38888 -133466
11696 -133466 -141007 -129457 -167879 -74028 -43751 -86431 31684 286290 323719 251066 -21278
11685 -21278 -89924 89827 150317 289657 301859 313343 326744 134273 -101997 -218743 -326522
11674 -326522 -338450 -406133 -516779 -459934 -425442 -203103 49867 16844 -18998 -138816 -142836
11663 -142836 -71115 -113814 39502 64694 185807 335426 294606 88997 55952 -1904 -92278
11652 -92278 -46477 -84115 -7052 14330 -130583 92373 63041 142318 4425 -42705 -33379
11641 -33379 119460 245422 253816 274746 670149 488586 504169 581467 476257 349141 371955
11630 371955 207408 43264 14163 -275 289215 312868 33892 -37940 -7717 -197008
11620 -197008 -214840 -92682 -2975 42132 226661 190905 78158 -46355 -153482 -20942
11610 -20942 -164711 -234395 -145824 -61449 -235806 -395357 -448411 -181781 -143166 -425252 -552126
11599 -552126 -684451 -583500 -462979 -262656 -221023 -167832 -136353 -102150 -53779 -96380 14758
11588 14758 -3241 -44740 149923 227789 74677 -62307 -268222 -246121 -275922 -502068 -301646
11577 -301646 -30003 31994 -131432 31947 98709 54392 48082 68860 92058 -114931 -136051
11566 -136051 -135329 19371 307942 216960 128310 55483 40535 -55918 -280727 -597813 -458007
11555 -458007 -179973 -207981 8077 84428 -144971 -304591 -394047 -380644 -142233 260217
11545 260217 -13980 -60219 -120009 -85526 -23472 -110500 -135212 -44144 -103297 -154705 -265974
11534 -265974 -365452 -88662 -65132 -169495 7078 190290 158018 140299 -159327 -330689
11524 -330689 -117323 4611 -253453 -467380 -77260 42286 39015 -202240 -509447 -530912
11514 -530912 -242671 67448 -110883 -269542 -358588 -157798 -69788 3827 93626 284332
11504 284332 318997 211979 184484 57719 -181408 77221 75210 -124960 -117927 -291632 -270989
11493 -270989 -245016 -256895 -278062 -45045 294756 102443 139458 233120 146044 322038 176038
11482 176038 -150304 -287579 -258420 -188833 -52443 -124865 -146226 -32346 -178008 -235382
11472 -235382 -151366 -141593 -148755 -174031 -285126 56303 376733 527051 537597 355988 191128
11461 191128 96903 245963 178981 86873 38092 96250 208532 483269 233401 99781
11451 99781 116505 37387 96058 95761 134308 233943 302582 191182 -83203 -375634 -265525
11440 -265525 13890 349440 568019 374833 52225 37562 -43516 -34921 50029 376412
11430 376412 288301 -177981 -196535 -91832 12929 -55416 138400 196861 -67554 -166220
11420 -166220 -24005 106849 -27885 -36157 53893 110400 149445 -29073 -64595 -193044 -199351
11409 -199351 -276726 -264002 -202825 -439289 -503813 -324789 -105466 16007 -3682 -212826
11399 -212826 -277301 -216029 -215741 -253658 -627056 -636883 -132225 175967 143022 107689 43612
11388 43612 -392722 -265435 -177473 -43471 38692 -158818 -342604 -380203 -302259 -113642
11378 -113642 -84693 74331 345317 209976 120710 34617 73586 -1672 -69800 -20811 -144007
11367 -144007 -102932 -173623 -180082 -83840 96141 332405 273409 272437 284474 82849 -111734
11356 -111734 -97746 90107 193274 -30174 -118163 -116272 -316108 -281808 -264659 -148139 -4220
11345 -4220 -179260 -355113 -250736 -47509 -159498 -76600 32379 157627 284491 -776
11335 -776 -200285 -25396 63832 214916 374739 196030 67471 36074 90291 132498 92531
11324 92531 268460 112349 -95323 34473 73793 227075 150549 27652 -177308 -173279
11314 -173279 -125106 -69767 58467 48075 39443 -7590 -67158 -34569 115115 -26518 1180
11303 1180 39960 -30738 -5057 -36322 54012 66611 -24183 1515 32615 14472 -59402 -292379
11291 -292379 -192660 -76122 13580 -51654 95240 431906 370188 197160 99674 58826 -167762
11280 -167762 -210477 -544405 -760586 -511534 -211224 -23508 -368801 -382885 -163167 -163614
11270 -163614 -149179 33647 62747 -305519 -402852 -278717 -298857 10507 221486 170018
11260 170018 -78756 -98715 44778 69298 126664 87136 92061 -29656 -199290 -39068 -136965
11249 -136965 -232315 36636 53659 171027 154982 -44647 -96351 -166089 33988 14452 112873
11238 112873 -42040 -223863 -142144 -158912 -188364 -290443 -277644 -202565 -38596 285715
11228 285715 123234 -136074 -413023 -452708 -274182 -9143 8113 -19131 -235753 -374426
11218 -374426 -177151 -3400 -186854 -309317 -236330 -30733 -53663 -89685 -2568 99438
11208 99438 213302 109891 136243 240515 218230 100995 45345 160535 41073 -134124
11198 -134124 -182273 -17786 136775 78595 -54665 -207024 -900 -130805 -2011 234679
11188 234679 104883 153322 66314 187396 376740 188568 -40848 -136809 -206801 13418
11178 13418 -25844 -73351 35170 329079 465070 531440 365869 353211 284904 345107 285249
11167 285249 308469 133701 82218 277789 174064 204206 338187 -41618 -190356 -48365
11157 -48365 291723 228286 271644 622166 628114 410313 335286 111554 -206422 -281802 -256423
11146 -256423 -206073 -378299 -462698 -541912 -582186 -645884 -424427 -88854 2512 -51921 29752
11135 29752 190787 46432 33628 -33239 -269831 -360843 -481311 -633887 -663850 -746836 -703533
11124 -703533 -723070 -651188 -715102 -670120 -376513 -316748 -154514 103567 -50920 -24607 -29456
11113 -29456 -164454 -175481 -264778 -364188 -412215 -365567 -205796 -46875 118841 138353 79434
11102 79434 -23124 9881 -73604 -34484 140334 -136347 -339899 -264998 -184455 -175546 -184105
11091 -184105 -194490 -185101 -299117 -582199 -616102 -466181 -509038 -354930 -266500 -220264 -43776
$$ [...]
##END NTUPLES=NMR SPECTRUM
##END=
