##TITLE=Analysis number 323170
Compound Code cc 30946
Book Reference 458/198
Project Code adrs
Chemist Name stevem
##JCAMPDX= 6.0         $$ Bruker NMR JCAMP-DX V2.0
##DATA TYPE= NMR SPECTRUM
##DATA CLASS= NTUPLES
##ORIGIN= Bruker BioSpin GmbH
##OWNER= nmr
$$ XWIN-NMR		Version 3.5
$$ Tue Oct 17 19:57:58 2006 GMT Daylight Time (UT+1h)  MAYBRIDGE\nmr@NMR_250MHZ
##.OBSERVE FREQUENCY= 250.131544655141
##.OBSERVE NUCLEUS= ^1H
##.ACQUISITION MODE= SIMULTANEOUS (DQD)
##.ACQUISITION SCHEME= undefined
##.AVERAGES= 16
##.DIGITISER RES= 18
##SPECTROMETER/DATA SYSTEM= dpx250
##.PULSE SEQUENCE= zg30
##.SOLVENT NAME= CDCl3
##.SHIFT REFERENCE= (INTERNAL, CDCl3, 0, 16.522)
##AUDIT TRAIL= $$ (NUMBER, WHEN, WHO, WHERE, WHAT)
$$ ##TITLE= Audit trail, XWIN-NMR		Version 3.5
$$ ##JCAMPDX= 5.01
$$ ##ORIGIN= Bruker BioSpin GmbH
$$ ##OWNER= nmr
$$ C:\u/data/dgb/nmr/ADRS/830/pdata/1/auditp.txt
$$ ##AUDIT TRAIL=  $$ (NUMBER, WHEN, WHO, WHERE, WHAT)
(   1,<2006-10-17 19:57:36.71 +100>,<MAYBRIDGE\nmr>,<NMR_250MHZ>,
      <created by zg, POWCHK disabled, PULCHK disabled
       configuration hash MD5:
       49 4B E0 1D 92 C2 6B 37 9F E6 65 BC 52 41 86 1D
       data hash MD5: 64K
       C4 E9 DA F5 F3 44 E2 0B 38 A3 36 AB 76 6F 65 A5>)
(   2,<2006-10-17 19:57:49.33 +100>,<MAYBRIDGE\nmr>,<NMR_250MHZ>,
      <Start of raw data processing
       ef LB = 0.3 FT_mod = 6 PKNL = 1 SI = 32K 
       data hash MD5: 32K
       E5 20 A0 E5 68 F8 31 44 E0 93 50 13 23 2A 28 CE>)
(   3,<2006-10-17 19:57:51.16 +100>,<MAYBRIDGE\nmr>,<NMR_250MHZ>,
      <apk 
       data hash MD5: 32K
       5E B2 7F 44 EC C6 AD 50 64 98 7D BE 65 51 E5 5A>)
(   4,<2006-10-17 19:57:51.99 +100>,<MAYBRIDGE\nmr>,<NMR_250MHZ>,
      <abs ABSG = 5 
       data hash MD5: 32K
       14 63 43 D0 28 E0 EF 26 3E 16 9C C7 56 8F A8 C6>)
$$ ##END=
$$ 
$$ hash MD5
$$ EA F8 F1 72 EB A2 B4 EB E5 33 FA D8 36 28 93 DD
##$RELAX= 
##$RELAX= 
##$RELAX= 
##$RELAX= 
##$RELAX= 
##$RELAX= 
##$RELAX= 
$$ Bruker specific parameters
$$ --------------------------
##$DU= <C:\u>
##$EXPNO= 830
##$NAME= <ADRS>
##$PROCNO= 1
##$TYPE= <nmr>
##$USER= <dgb>
##$AMP= (0..31)
100 100 100 100 100 100 100 100 100 100 100 100 100 100 100 100 100 100 
100 100 100 100 100 100 100 100 100 100 100 100 100 100 
##$AQSEQ= 0
##$AQ_mod= 3
##$AUNM= <au_zg>
##$AUTOPOS= <31 >
##$BF1= 250.13
##$BF2= 250.13
##$BF3= 250.13
##$BF4= 250.13
##$BF5= 500.13
##$BF6= 500.13
##$BF7= 500.13
##$BF8= 500.13
##$BYTORDA= 1
##$CFDGTYP= 0
##$CFRGTYP= 5
##$CHEMSTR= <none>
##$CNST= (0..31)
1 1 145 1 1 1 1 1 1 1 1 1 1 1 1 1 1 1 1 1 1 1 1 1 1 1 1 1 1 1 1 1 
##$CPDPRG= <>
##$CPDPRG1= <>
##$CPDPRG2= <>
##$CPDPRG3= <>
##$CPDPRG4= <mlev>
##$CPDPRG5= <mlev>
##$CPDPRG6= <mlev>
##$CPDPRG7= <mlev>
##$CPDPRG8= <mlev>
##$CPDPRGB= <>
##$CPDPRGT= <>
##$D= (0..31)
0 1 0 0 0 0 0 0 0 0.06 0 0 0 0 0 0 0.0002 0 0 0 0 0 0 0 0 0 0 0 0 0 0 
0 
##$DATE= 1161111455
##$DBL= (0..7)
120 120 120 120 120 120 120 120 
##$DBP= (0..7)
150 150 150 150 150 150 150 150 
##$DBP07= 0
##$DBPNAM0= <>
##$DBPNAM1= <>
$$ [...]
##$SUBNAM7= <"">
##$SUBNAM8= <"">
##$SUBNAM9= <"">
##$SW= 20.6930455092707
##$SWIBOX= (0..15)
0 0 3 0 0 0 0 0 0 0 0 0 0 0 0 0 
##$SW_h= 5175.983436853
##$TD= 65536
##$TD0= 1
##$TE= 683.16
##$TE2= 300
##$TE3= 300
##$TEG= 300
##$TL= (0..7)
0 120 120 120 120 120 120 120 
##$TP= (0..7)
150 150 150 150 150 150 150 150 
##$TP07= 0
##$TPNAME0= <>
##$TPNAME1= <>
##$TPNAME2= <>
##$TPNAME3= <>
##$TPNAME4= <>
##$TPNAME5= <>
##$TPNAME6= <>
##$TPNAME7= <>
##$TPOAL= (0..7)
0.5 0.5 0.5 0.5 0.5 0.5 0.5 0.5 
##$TPOFFS= (0..7)
0 0 0 0 0 0 0 0 
##$TUNHIN= 0
##$TUNHOUT= 0
##$TUNXOUT= 0
##$USERA1= <user>
##$USERA2= <user>
##$USERA3= <user>
##$USERA4= <user>
##$USERA5= <user>
##$V9= 5
##$VALIST= <valist>
##$VCLIST= <CCCCCCCCCCCCCCC>
##$VD= 0
##$VDLIST= <DDDDDDDDDDDDDDD>
##$VPLIST= <PPPPPPPPPPPPPPP>
##$VTLIST= <TTTTTTTTTTTTTTT>
##$WBST= 1024
##$WBSW= 4
##$XGAIN= (0..3)
0 0 0 0 
##$XL= 0
##$YL= 0
##$YMAX_a= 331668
##$YMIN_a= -330678
##$ZGOPTNS= <>
##$ZL1= 120
##$ZL2= 120
##$ZL3= 120
##$ZL4= 120
##$ABSF1= 16.522
##$ABSF2= -4.171173
##$ABSG= 5
##$ABSL= 3
##$ALPHA= 0
##$AQORDER= 0
##$ASSFAC= 0
##$ASSFACI= 0
##$ASSFACX= 0
##$ASSWID= 0
##$AUNMP= <proc_1d>
##$AZFE= 0.1
##$AZFW= 0.1
##$BCFW= 0
##$BC_mod= 0
##$BYTORDP= 0
##$COROFFS= 0
##$CY= 12.5
##$DATMOD= 1
##$DC= 0
##$DFILT= <>
##$DTYPP= 0
##$F1P= 14.0000005364418
##$F2P= -0.99999901652339
##$FCOR= 0.5
##$FTSIZE= 32768
##$FT_mod= 6
##$GAMMA= 0
##$GB= 0
##$INTBC= 1
##$INTSCL= 1
##$ISEN= 128
##$LB= 0.3
##$LEV0= 0
##$LPBIN= 0
##$MAXI= 10000
##$MC2= 0
##$MEAN= 0
##$ME_mod= 0
##$MI= 0
##$NCOEF= 0
##$NC_proc= -3
##$NLEV= 6
##$NOISF1= 0
##$NOISF2= 0
##$NSP= 0
##$NTH_PI= 0
##$NZP= 0
##$OFFSET= 16.522
##$PC= 1
##$PHC0= -51.94902
##$PHC1= 0.8951095
##$PH_mod= 1
##$PKNL= yes
##$PPARMOD= 0
##$PSCAL= 4
##$PSIGN= 0
##$REVERSE= no
##$SF= 250.13
##$SI= 32768
##$SIGF1= 0
##$SIGF2= 0
##$SINO= 400
##$SIOLD= 32768
##$SREGLST= <1H.CDCl3>
##$SSB= 0
##$STSI= 32768
##$STSR= 0
##$SW_p= 5175.98343685301
##$SYMM= 0
##$S_DEV= 0
##$TDeff= 65536
##$TDoff= 0
##$TI= <Analysis number 999999
Compound Code 99
Book Reference 9
Project Code 9>
##$TILT= no
##$TM1= 0
##$TM2= 0
##$TOPLEV= 0
##$USERP1= <user>
##$USERP2= <user>
##$USERP3= <user>
##$USERP4= <user>
##$USERP5= <user>
##$WDW= 1
##$XDIM= 32768
##$YMAX_p= 427196910
##$YMIN_p= -53593
$$ End of Bruker specific parameters
$$ ---------------------------------
##NTUPLES= NMR SPECTRUM
##VAR_NAME=  FREQUENCY,     SPECTRUM/REAL,   SPECTRUM/IMAG
##SYMBOL=    X,             R,               I
##VAR_TYPE=  INDEPENDENT,   DEPENDENT,       DEPENDENT
##VAR_FORM=  AFFN,          ASDF,            ASDF
##VAR_DIM=   32768,         32768,           32768
##UNITS=     HZ,            ARBITRARY UNITS, ARBITRARY UNITS
##FACTOR=    0.157963299565203, 1,           1
##FIRST=     4132.6476996994, 0,             0
##LAST=      -1043.33573715361, 0,           0
##MIN=       -1043.33573715361, -53593,      0
##MAX=       4132.6476996994, 427196910,     0
$$ Real data points
##PAGE= N=1
##DATA TABLE= (X++(R..R)), XYDATA
$$ [...]
$$ plain form
16641 14080 -2030 -17984 -14945 -2219 -5988 -7953 -9684 4814 5497 -7356 -7054 -2348 6934 8823
16627 8823 8285 -4054 -4379 831 4377 13025 17355 18685 17414 5525 1797 7065 -1842 -605 3811
16612 3811 2610 20900 11779 -2440 -3609 -4760 -8008 -6161 -9540 -6915 -9808 -26573 -23194 -28534
16598 -28534 -41755 -31107 -12574 -3712 5940 20902 8323 -7930 -15673 -27900 -26303 -10140
16586 -10140 5158 14056 6909 -14716 -13762 -17628 580 -1434 -16735 -4836 12635 15159 11462
16573 11462 3984 6334 11693 19668 18996 17776 3303 -11224 -13268 1378 4685 -854 -3264 -18115
16559 -18115 -24410 -14880 -7082 15685 14844 6833 -1573 -13344 -4972 2667 2162 2750 -1582 -18124
16545 -18124 -22548 -8792 -5623 -15856 -18764 -28116 -22675 -26825 -16848 -11957 -29539 -40785 -31741
$$ packed form
16641A4080j6110j5954L039J2726l769j965j731J4498O83j2853L02M706R282J889
16627H823n38j2339l25N210L546Q648M330J330j271j1889l728N268q907J237M416
16612C811j201J8290r121j4219j169j151l248J847l379K625k893j6765L379n340
16598b8534j3221J0648J8533Q862R652J4962j2579j6253p743j2227J597J6163
16586a0140J5298Q898p147k1625R54l866J8208k014j5301J1899J7471K524l697
16573A1462p478K350N359P975o72j220j4473j4527k044J4646L307n539k410j4851
16559a8115o295R530P798K2767q41q011q406j1771Q372P639n05N88m332j6542
16545a8124m424J3756L169j0233k908r352N441m150R977M891j7582j1246R044
$$ plain form
16532 -31741 -24817 -22566 -9875 -7638 -6302 -13975 -15543 -17896 -6898 -11994 -11032 -8729 3892 -8830
16518 -8830 -18919 -20915 -11359 -20053 -33315 -24474 -4314 1375 -4158 -9141 -9502 -9697 -15367 -15602 -8328
16503 -8328 1196 -1579 -2334 -6280 -16795 -14558 3381 1463 -17714 -28222 -28567 -26810 -20595 -2182
16489 -2182 7583 22078 19001 -2621 -9963 -3949 12218 8688 -11321 -26335 -17300 -17714 -12102 7278
16475 7278 3326 -8952 -19231 -14760 -2057 2929 -3700 -28516 -31035 -21598 -18445 -19550 -12355 -4342
16461 -4342 2761 5087 -5453 571 -11198 -15227 -14071 -11643 -5985 4787 12499 8515 6830 6315
16447 6315 604 7919 3404 -1415 9826 4357 -1398 -9145 -14092 -14432 -6437 -15931 -17204 -13561 -21556
16432 -21556 -33472 -40302 -33688 -26732 -14563 -13378 -19029 -36325 -41437 -40785 -20810 -8458 -14788
$$ packed form
16532c1741O924K251J2691K237J336p673j568k353J0998n096R62K303J2621j2722
16518h830j0089j996R556q694j3262Q841K0160N689n533m983l61j95n670k35P274
16503h328R524k775p55l946j0515K237J7939j918j9177j0508l45J757O215J8413
16489b182R765J4495l077k1622p342O014J6167l530k0009j5014R035m14N612J9380
16475G278l952j2278j0279M471J2703M986o629k4816k519R437L153j105P195Q013
16461d342P103K326j0540O024j1769m029J156K428N658J0772P712l984j685n15
16447F315n711P315m515m819J1241n469n755p747m947l40P995r494j273L643p995
16432b1556j1916o830O614O956J2169J185n651j7296n112O52J9975J2352o330
$$ plain form
16419 -14788 -26125 -19686 -26329 -40427 -32211 -21877 -4927 -9103 -12383 -13202 -20999 -29239 -26151 -17132
16405 -17132 -10109 -4484 -11681 -6894 1688 12047 16123 -4562 -4585 5251 884 6543 15427 14596 15121
16390 15121 13280 9900 6579 -14680 -31723 -28330 -19889 -16264 -22913 -19228 -15590 -5045 -350 -8805
16376 -8805 -10155 -1927 1536 10348 1336 3504 7663 14549 13242 1876 -15547 -5494 3403 2838
16362 2838 -11825 -14721 -13098 4657 11523 6462 2436 4941 9649 10033 12988 9973 1409 -2207
16348 -2207 -8811 -3357 -8015 -8079 -2956 -13739 -17037 -18798 -20362 -19316 -19799 -26603 -22646 -12797 -5753
16333 -5753 -17030 -2789 2652 -4957 -6829 4464 3810 -3641 -24046 -33764 -28635 -23932 -16960 -2047
16319 -2047 671 9358 21393 18514 9749 2838 1877 5219 4969 -4962 -6531 -17272 -5369 5686
$$ packed form
16419a4788j1337O439o643j4098Q216J0334J6950m176l280q19p797q240L088R019
16405a7132P023N625p197M787Q582J0359M076k0685k3R836m367N659Q884q31N25
16390A5121j841l380l321k1259j7043L393Q441L625o649L685L638J0545M695q455
16376h805j350Q228L463Q812r012K168M159O886j307j1366j7423J0053Q897n65
16362B838j4663k896J623J7755O866n061m026K505M708L84K955l015q564l616
16348b207o604N454m658o4N123j0783l298j761j564J046m83o804L957R849P044
16333e753j1277J4241N441p609j872J1293o54p451k0405r718N129M703O972J4913
16319b047K718Q687J2035k879q765o911r61L342k50r931j569j0741J1903J1055
$$ plain form
16305 5686 -2819 -9773 -7462 6765 12428 -6739 -6274 -6303 -4683 -3469 -2523 -3091 -6645 -9389 -18671
16290 -18671 -9391 11998 25177 11494 -10420 -7601 -8542 -18188 -8285 -8257 -3850 17558 12526 5942
16276 5942 -987 -1549 -5535 -10250 -24744 -21170 -7496 -6480 -4283 -45 -1143 -3665 -11897 -7236
16262 -7236 -4669 -9798 -26518 -26515 -13249 -9052 -18445 -21865 -4943 -2642 1464 -685 -13221 -12739 -18369
16247 -18369 -13473 -5906 -2667 6046 15854 9980 19850 20022 81 -13264 -6527 10213 12729 1255
16233 1255 2085 2292 -8713 -1704 3360 -13348 -7287 -2756 5668 3707 -3966 3882 17437 7010
16219 7010 -3509 -14455 -16515 -5759 -2221 -9733 -7713 2074 -2147 6677 4854 -1872 9859 18946
16205 18946 13407 9806 10199 6775 10941 9188 902 6298 -2338 -2814 -3172 6116 -2676 -9951 -9754
$$ packed form
16305E686q505o954K311J4227N663j9167M65k9J620J214R46n68l554k744r282
16290a8671R280K1389J3179j3683k1914K819r41r646R903K8M407K1408n032o584
16276E942o929n62l986m715j4494L574J3674J016K197M238j098k522q232M661
16262g236K567n129j6720LJ3266M197r393l420J6922K301M106k149j2536M82n630
16247a8369M896P567L239Q713R808n874R870J72j9941j3345O737J6740K516j1474
16233A255Q30K07j1005P009N064j6708O061M531Q424j961p673P848J3555j0427
16219G010j0519j0946k060J0756L538p512K020R787m221Q824j823o726J1731R087
16205A8946n539l601L93l424M166j753q286N396q636m76l58R288q792p275J97
$$ plain form
16190 -9754 -11264 -21745 -33096 -32415 -15046 -10872 -7181 -3374 8212 14216 7540 7738 3196 -5921
16176 -5921 -1524 4413 8635 6677 8727 9265 5531 15090 18873 -11903 -43521 -45187 -44719 -28373
16162 -28373 -18891 -24840 -42468 -29526 -29319 -29200 -28800 -19083 -22999 -21366 -17342 -13873 -10441 -1785 9100
16147 9100 -157 -9841 -17495 -31870 -25909 -5465 -6644 -12073 -16981 -34889 -31266 -7920 -20557
16134 -20557 -25004 -21598 -15684 -21092 -24866 -17038 -22190 -25647 -21164 -4145 -10174 -13786 -16768 -12730
16120 -12730 -7627 -11881 -5475 616 -8528 -17184 -11022 -10568 -23410 -22401 -13523 -5595 5613 13496
16106 13496 13236 -2261 -13685 -25437 -28352 -20644 -14979 -17869 -22749 -24158 -26565 -18271 -16862 -19279
16092 -19279 -21902 -4900 4436 15844 8469 -715 -7024 -15422 -6901 3068 12264 8290 -15299 -25405
$$ packed form
16190i754j510j0481j1351O81J7369M174L691L807J1586O004o676J98m542r117
16176e921M397N937M222j958K050N38l734R559L783l0776l1618j666M68J6346
16162b8373R482n949j7628J2942K07J19M00R717l916J633M024L469L432Q656J0885
16147I100r257r684p654j4375N961K0444j179n429m908j7908L623K3346j2637
16134b0557m447L406N914n408l774P828n152l457M483J7019o029l612k982M038
16120a2730N103m254O406O091r144q656O162M54j2842J009Q878P928J1208P883
16106A3496k60j5497j1424j1752k915P708N665k890m880j409k407Q294J409k417
16092a9279k623J7002R336J1408p375r184o309q398Q521R969R196l974k3589j0106
$$ plain form
16078 -25405 -21090 -28661 -18902 -21655 -12325 -16614 -29436 -24845 -18473 -15555 -17475 -14508 -4505 -10999
16064 -10999 -12294 -5818 -2360 -141 -6331 -7824 15568 17922 5588 -5764 932 6616 6333 -3081
16050 -3081 -11582 -1223 10066 3523 -9796 -22511 -22157 -30752 -35533 -26923 -28117 -21836 -4928 4277
16036 4277 3956 73 -14643 -16806 -21171 -19550 -18640 -9508 -14914 -19766 -14132 -18010 -23947 -11095 11691
16021 11691 17377 9091 2880 2151 1327 -1476 -5053 -8323 -16721 -25273 -12509 -7606 -7340 -16529 -23011
16006 -23011 -14529 -17821 -17995 -9660 -9633 -12994 -28155 -31466 -14043 -7416 -11174 -6875 -19786 -21441
15992 -21441 -20546 -18232 -12715 -10510 -290 8327 5699 4494 1198 701 5098 5112 3455 -9691 -5717
15977 -5717 -8488 -1661 -16909 -21559 -28298 -33698 -16025 -3541 -6246 -4219 4914 23636 35834
$$ packed form
16078b5405M315p571R759k753R330m289j2822M591O372K918j920K967J0003o494
16064a0999j295O476L458K219o190j493K3392K354j2334j1352O696N684k83r414
16050c081q501J0359J1289o543j3319j2715L54q595m781Q610j194O281J6908R205
16036D277l21l883j4716k163m365J621R10R132n406m852N634l878n937J2852K2786
16021A1691N686q286o211p29q24k803l577l270q398q552J2764M903K66r189o482
16006b3011Q482l292j74Q335K7l361j5161l311J7423O627l758M299j2911j655
15992b1441Q95K314N517K205J0220Q617k628j205l296m97M397J4j657j3146L974
15977e717k771O827j5248m650o739n400J7673J2484k705K027R133J8722J2198
$$ plain form
15964 35834 38369 34892 28219 7794 -5566 -15182 -14414 -10090 -25506 -32064 -27172 -11497 -13430 -17144
15950 -17144 -11475 -6600 -10511 -23469 -17460 -14508 -6933 -4759 -8800 -12141 -10185 -8608 -16887 -26860
15936 -26860 -21090 -4287 8030 14228 185 -10899 -10262 -13517 -12017 -8079 -12507 -18915 -30023
15923 -30023 -30683 -22428 -11342 -10288 -14883 -17721 -14548 -22587 -15557 -20969 -31487 -24142 -28704 -25559
15909 -25559 -22661 -14751 -9963 -13519 -17978 -22348 -20756 -24116 -29477 -24592 -11400 -5952 -4231 -1358
15895 -1358 -19078 -22725 -5176 -3028 -4690 -6541 -8099 -4208 -1099 5167 1359 -13860 -18935 -19263
15881 -19263 -21374 -30822 -30472 -38899 -30378 -17101 -18758 -8770 1219 12219 12047 13093 7744 8677 6099
15866 6099 -16361 -25335 -10785 -13664 -17844 -11565 -2100 -10754 -21659 -21154 -25547 -23969 -22455 -17012
$$ packed form
15964C5834K535l477o673k0425j3360r616P68M324j5416o558M892J5675j933l714
15950a7144N669M875l911j2958O009K952P575K174m041l341J956J577q279r973
15936b6860N770J6803J2317O198j4043j1084O37l255J500L938m428o408j1108
15923c0023o60Q255J1086J054m595k838L173q039P030n412j0518P345m562L145
15909b5559K898P910M788l556m459m370J592l360n361M885J3192N448J721K873
15895a358j7720l647J7549K148j662j851j558L891L109O266l808j5219n075l28
15881a9263k111r448L50q427Q521J3277j657R988R989J1000j72J046n349R33k578
15866F099k2460q974J4550k879m180O279R465q654j0905N05m393J578J514N443
$$ plain form
15852 -17012 -13683 -5859 -4634 -5815 -7714 -19834 -23660 -8605 -3869 -13263 -13548 -6241 -1200 -6399
15838 -6399 -11810 3001 9110 -13343 -19704 -9713 -5243 -2772 16344 7473 -5945 -11263 -21543
15825 -21543 -32626 -32525 -31924 -15802 -20356 -21886 -23204 -24491 -30586 -23353 -8069 -12387 -14034 -5438
15811 -5438 8608 2441 -5932 -2580 -1212 -8208 -26259 -32443 -39105 -41275 -26415 -14813 -16531 -36964
15797 -36964 -37186 -19861 -4280 -4037 -9571 -2757 -5512 -17798 -34751 -26562 -9854 -1333 -4973 -10575
15783 -10575 -24365 -20828 -13175 -7560 -5062 -12660 -20815 -21793 -11730 -7269 -12674 -13764 -17436 -15198
15769 -15198 -19761 -17093 -6083 -4686 -16800 -23328 -37819 -36617 -23260 -15774 -18584 -25213 -25399 -25785
15755 -25785 -20969 -26518 -25862 -8392 -23495 -30938 -23145 -11758 -22145 -17584 81 -4873 84
$$ packed form
15852a7012L329P824J225j181j899j2120l826J5055M736r394k85P307N041n199
15838f399n411J4811O109k2453o361R991M470K471J9116q871j3418n318j0280
15825b1543j1083J01O01J6122m554j530j318j287o095P233J5284m318j647Q596
15811e438J4046o167q373L352J368o996j8051o184o662k170J4860J1602j718k0433
15797c6964k22J7325J5581K43n534O814k755j2286j6953Q189J6708Q521l640n602
15783a0575j3790L537P653N615K498p598q155r78J0063M461n405j090l672K238
15769a5198m563K668J1010J397j2114o528j4491J202J3357P486k810o629j86l86
15755b5785M816n549O56J7470j5103p443P793J1387j0387M561J7665m954M957
$$ plain form
15742 84 -4376 -12977 -3019 -2472 -7084 -12811 -15476 -23956 -28765 -19953 -19187 -19995 -27672 -10796 -2664 -2441
15726 -2441 -8736 -16297 -5614 1920 -7666 -283 -4166 -8425 -9944 -1282 3462 -5132 -6791 -7549 -6398
15711 -6398 -2177 -726 9154 5354 -9426 -10081 -8352 -12127 -17963 -20002 -10124 -9692 -7416 -722 -4027
15696 -4027 -4706 -9652 -22884 -16767 -1190 6131 7932 -6090 -22864 -23129 -18273 -14360 -4856 -4891 -2890
15681 -2890 -2815 9907 9454 10682 13369 20663 28702 24321 10889 966 -5089 -5068 -5573 -2169 -8220 -17270
15665 -17270 -14794 -18950 1019 16066 14617 1987 -916 -3512 4500 -7288 -10402 1898 1617
15652 1617 -10470 -10850 -8443 -8095 -29 -4731 -17111 -24013 -31448 -28027 -22739 -18037 -23890 -22406 -23564
15637 -23564 -36809 -31805 -30196 -27148 -31690 -18336 -10642 -1247 3340 -2433 -14493 -19405 -19380 -21438
$$ packed form
15742H4m460q601R958N47m612n727k665q480m809Q812P66q08p677J6876Q132K23
15726b441o295p561J0683P534r586P383l883m259j519Q662M744q594j659p58J151
15711f398M221J451R880l800j4780o55J729l775n836k039R878M32K276O694l305
15696d027o79m946j3232O117J5577P321J801j4022j6774k65M856L913R504l5K001
15681b890P5J2722m53J228K687P294Q039m381j3432r923o055K1n05L404o051r050
15665a7270K476m156J9969J5047j449j2630k903k596Q012j1788l114J2300k81
15652A617j2087l80K407L48Q066m702j2380o902p435L421N288M702n853J484j158
15637b3564j3245N004J609L048m542J3354P694R395M587n773j2060m912K5k058
$$ plain form
15623 -21438 -9693 -5223 -9743 -11316 -15415 -4181 -5554 -15042 -8053 -1590 -2137 -10528 -17656 -22340
15609 -22340 -17282 -7037 -8469 -12417 -7381 -9622 -27199 -16726 976 2326 -550 -9141 -9465 -6765
15595 -6765 -19283 -12645 -26712 -26431 -12630 -10510 -13039 -16740 -17537 -17943 -28158 -44729 -38388 -24269
15581 -24269 -10453 -9893 -17772 -30354 -27032 -29543 -40807 -39622 -33824 -23687 -13766 -16804 -16882 -20719
15567 -20719 -12941 -6419 -9034 -19174 -24018 -20666 -24360 -19486 -10633 -12034 -19444 -14905 -8843 -7567
15553 -7567 -5272 736 10074 4326 8550 15169 10157 -3464 -7936 -10087 -19577 -28457 -30896 -17590
15539 -17590 -14484 -13068 91 5938 -5198 -15494 -17060 -27261 -30470 -18213 -10035 -11826 -14775
15526 -14775 -9020 -4319 -2500 3898 2950 5325 3657 1692 -8334 -5691 -944 -9749 -26847 -28859
$$ packed form
15623b1438J1745M470m520j573m099J1234j373r488O989O463n47q391p128m684
15609b2340N058J0245j432l948N036k241j7577J0473J7702J350k876q591l24K700
15595f765j2518O638j4067K81J3801K120k529l701p97m06j0215j6571O341J4119
15581b4269J3816N60p879j2582L322k511j1264J185N798J0137R921l038p8l837
15567b0719P778O522k615j0140m844L352l694M874Q853j401p410M539O062J276
15553g567K295O008R338n748M224O619n012j3621m472k151r490q880k439J3306
15539a7590L106J416J3159N847j1136j0296j566j0201l209J2257Q178j791k949
15526a4775N755M701J819O398r48K375j668j965j0026K643M747q805j7098k012
$$ plain form
15512 -28859 -20831 -10403 -27994 -37933 -50527 -32992 -21421 -10934 7496 -538 -1228 346 2704
15499 2704 -553 -9497 -27470 -19427 2590 2495 -2652 -4266 2284 -6423 -853 6256 -3997 4438
15485 4438 1654 5509 -345 -7841 -4124 7700 10645 554 -15348 -30677 -28100 -18633 -8559
15472 -8559 -11137 -11659 -24231 -43513 -29451 -15553 -12588 -16817 -18426 -12670 -13685 -2249 -485 -10020
15458 -10020 -8870 -7394 -9554 -14489 -19471 -18500 -14804 -15702 -4318 -6796 -13826 -6673 5180 9529
15444 9529 -2601 -22072 -28728 -20637 -1482 53 -7885 -19786 -24431 -24838 -30011 -37844 -33506 -23472
15430 -23472 -6529 -16627 -16594 -2603 9626 3821 -3207 -4407 -8147 -7503 -6692 -322 8819 4778
15416 4778 -2598 -5292 -7555 -6154 -847 -6084 -11038 -6621 -7113 -2105 -8231 -20495 -17413 -10463 -10306
$$ packed form
15512b8859Q028J0428j7591r939j2594J7535J1571J0487J8430q034o90J574K358
15499B704l257q944j7973Q043K2017r5n147j614O550q707N570P109j0253Q435
15485D438k784L855n854p496L717J1824K945j0091j5902j5329K577R467J0074
15472h559k578n22j2572j9282J4062J3898K965m229j609N756j015J1436J764r535
15458a0020J150J476k160m935m982R71L696q98J1384k478p030P153J1853M349
15444I529j2130j9471o656Q091J9155J535p938j1901m645m07n173p833M338J0034
15430b3472J6943j0098L3J3991J2229n805p028j200l740O44Q11O370R141m041
15416D778p376k694k263J401N307n237m954M417m92N008o126j2264L082O950J57
$$ plain form
15401 -10306 -10221 -21313 -18494 -7669 -6780 3015 13451 15545 16574 20240 4626 -1762 -635 -8870
15387 -8870 -13346 -21963 -30185 -31261 -27993 -30053 -20368 -15864 -3052 -4753 -12796 -6985 4825 -2380
15373 -2380 -6017 -15006 -24896 -24544 -18922 -16871 -7721 -574 -2804 -6339 -12418 -15556 -5702 -11354 -12156
15358 -12156 -4311 629 992 170 -1675 -2254 -3108 -7843 -31 379 -4558 -7287 -24737 -33494 -31171
15343 -31171 -19524 -13199 -2469 -3648 -13692 -22106 -17196 -12146 -5717 -7600 -10583 -6903 -4049 12220
15329 12220 10174 -206 8921 10512 2473 -1353 13928 17302 8339 2064 -4404 -8542 -2798 3263
15315 3263 6112 -5880 -6043 9955 6666 -8824 -8018 -8991 -8724 -5303 -7525 -8236 -25049 -23763 -20053
15300 -20053 -19269 -6681 -3810 -4296 -3579 -6365 -9017 -10880 1816 -4457 -24287 -32052 -31690 -13920
$$ packed form
15401a0306Q5j1092K819J0825Q89R795J0436K094J029L666j5614o388J127q235
15387h870m476q617q222j076L268k060R685M504J2812j701q043N811J1810p205
15373b380l637q989r890L52N622K051R150P147k230l535o079l138R854n652q02
15358a2156P845M940L63q22j845n79q54m735P812M10m937k729j7450q757K323
15343c1171J1647O325J0730j179j0044q414M910N050O429j883k983L680K854J6269
15329A2220k046j0380R127J591q039l826J5281L374q963o275o468m138N744O061
15315C263K849j1992j63J5998l289j5490Q06r73K67L421k222p11j6813J286L710
15300b0053P84J2588K871m86P17k786k652j863J2696o273j9830p765L62J7770
$$ plain form
15286 -13920 -8970 -2376 -7812 -4210 2400 20080 10982 -12991 -22673 -15113 -9829 -4016 -16127 -28542
15272 -28542 -29299 -17187 -16009 -17860 -22293 -15400 -5195 -3308 -4880 -11724 -13768 -21380 -28594 -33273
15258 -33273 -33710 -38646 -42402 -39107 -40125 -49447 -53593 -47492 -35455 -29386 -23138 -13727 -13276 -8884 -2115
15243 -2115 -10846 -13529 -4807 11170 2810 -1296 -239 -7328 10535 26286 20098 2601 -1335 -2819
15229 -2819 -9328 -14118 -11256 -8324 -23493 -30515 -20707 -23457 -20222 -29987 -27299 -4663 6519 7036
15215 7036 -3738 -9621 -16006 -23993 -25967 -32766 -38059 -35646 -14845 -10603 -18033 -18521 -2305 7247
15201 7247 -2822 -17430 -18234 -7342 -12064 -28811 -31130 -30219 -27558 -22585 -9230 -885 -4962 -14211
15187 -14211 -16644 -10126 -10227 -7645 -9883 -14441 -15662 -33122 -28946 -19807 -10192 -11364 -14473 -9062
$$ packed form
15286a3920M950O594n436L602O610J7680r098k3973r682P560N284N813j2111j2415
15272b8542p57J2112J178j851m433O893J0205J887j572o844k044p612p214m679
15258c3273m37m936l756L295j018r322m146O101J2037O069O248R411M51M392O769
15243b115q731k683Q722J5977q360m106J057p089J7863J5751o188j7497l936j484
15229b819o509m790K862K932j5169p022R808k750L235r765K688K2636J1182N17
15215G036j0774n883o385p987j974o799n293K413K0801M242p430m88J6216R552
15201G247j0069j4608q04J0892m722j6747k319R11K661M973J3355Q345m077r249
15187a4211k433O518j01K582k238m558j221j7460M176R139R615j172l109N411
$$ plain form
15173 -9062 -8218 -4855 -14001 -3271 2064 2205 2319 -3853 -2665 2590 1081 -4956 252 -6280 4145
15158 4145 -2909 -8400 -12129 -17031 -17755 -15477 -9533 -7664 -13955 -34788 -35650 -32966 -23056 -15035 -13180
15143 -13180 -20125 -14822 7443 253 -12810 -7422 -8400 -15027 -2779 5283 18465 27802 17590
15130 17590 17039 6194 -4958 -3457 -9927 -17870 -25376 -21582 -15637 -12280 -15427 -10237 -6527 -29037
15116 -29037 -30095 -26829 -23161 -21112 -22516 -16960 -19395 -18370 -17252 -17026 -28566 -28420 -21764 -15120 -12379
15101 -12379 -2063 -19001 -17586 -20318 -25596 -19275 -16074 -17691 -15089 -3929 -279 -9543 2698
15088 2698 6099 3945 -4644 -7798 -13127 -24016 -22983 -18820 -11483 -4396 3361 6614 8323 -7522
15074 -7522 -16201 -9283 -18164 -12092 -6300 -13312 -23574 -19575 -29901 -26957 -32782 -35602 -24348 -23184
$$ packed form
15173i062Q44L363r146J0730N335J41J14o172J188N255j509o037N208o532J0425
15158D145p054n491l729m902p24K278N944J869o291k0833q62K684R910Q021J855
15143a3180o945N303K2265p190j3063N388r78o627J2248Q062J3182R337j0212
15130A7590n51j0845j1152J501o470p943p506L794N945L357l147N190L710k2510
15116b9037j058L266L668K049j404N556k435J025J118K26j1540J46O656O644K741
15101a2379J0316j6938J415k732n278O321L201j617K602J1160L650r264J2241
15088B698L401k154q589l154n329j0889J033M163P337P087P757L253J709j5845
15074g522q679O918q881O072N792p012j0262L999j0326K944n825k820J1254J164
$$ plain form
15060 -23184 -23539 -18971 -8241 5894 4613 9214 6149 2160 -8086 -19430 -15469 -20403 -18446 -8881
15046 -8881 2915 -8214 -8157 -12546 -25291 -23409 -10847 -5955 -4228 8576 17192 11447 5926 2722
15032 2722 892 -4275 -5511 -8753 -605 6726 -1562 -4645 -4040 -3611 611 -1169 -13312 -12672 3847
15017 3847 8038 15182 8335 -2065 -1960 9219 17104 2890 -953 8896 10140 4788 -8376 0
15003 0 -440 -10117 -23509 -27558 -30053 -19060 -496 1823 -2509 5453 26591 27739 20707 23750 37450
14988 37450 32754 27670 13035 -2211 999 25925 32754 35410 37295 37874 32744 26500 35986 51499
14974 51499 58938 74687 83286 99666 98920 95177 89458 78394 74797 65801 65998 66464 54778 46253
14960 46253 36642 37102 29466 19464 14996 31038 6209 -8086 14150 24334 11266 5300 8817
$$ packed form
15060b3184l55M568J0730J4135j281M601l065l989j0246j1344L961m934J957R565
15046h881J1796j1129N7m389j2745J882J2562M892J727J2804Q616n745n521l204
15032B722j830n167j236l242Q148P331q288l083O05M29M222j780j2143O40J6519
15017C847M191P144o847j0400J05J1179P885j4214l843R849J244n352j3164Q376
15003@m40r677j3392m049k495J0993J8564K319m332P962K1138J148p032L043J3700
14988C7450m696n084j4635j5246L210K4926O829K656J885N79n130o244R486J5513
14974E1499P439J5749Q599J6380p46l743n719j1064l597q996J97M66j1686q525
14960D6253r611M60p636j0002m468J6042k4829j4295K2236J0184j3068n966L517
$$ plain form
14947 8817 6326 11914 20142 11978 8597 -7974 -17723 -4264 3912 4178 -12303 -15278 -10133 -18516
14933 -18516 -17644 -18289 -12235 4054 5380 -6904 -5439 6766 11984 7680 -637 -6385 -9249 -18227
14919 -18227 -17715 -31807 -29810 -24359 -15738 -4338 2879 4970 -4761 -8350 -7333 -19052 -28303 -30139
14905 -30139 -12489 -4691 -4348 -2575 6383 18669 19546 10490 -8376 -6249 -4499 -7447 -11731 -2282
14891 -2282 3000 -4084 -8730 -20685 -26561 -19316 -16970 -17037 -12036 -12735 -11957 -9890 -20146 -15918 -7983
14876 -7983 5022 11179 7503 9930 -7980 -26452 -12126 3349 -914 -16300 -18528 -14606 -18161
14863 -18161 -23146 -18380 -15602 -9183 -13928 -18121 -12366 -12348 -17112 -20583 -25390 -23687 -12167 -21574 -27887
14848 -27887 -25205 -30843 -24094 -14964 -9158 -40 -11609 -18912 -13290 441 -2439 -8424 -16015 -14259
$$ packed form
14947H817k491N588Q228q164l381j6571r749J3459Q176K66j6481k975N145q383
14933a8516Q72o45O054J6289J326j2284J465J2205N218m304q317n748k864q978
14919a8227N12j4092J997N451Q621J1400P217K091r731l589J017j1719r251j836
14905c0139J7650P798L43J773Q958J2286Q77r056j8866K127J750k948m284R449
14891b282N282p084m646j1955n876P245K346o7N001o99P78K067j0256M228P935
14876g983J3005O157l676K427j7910j8472J4326J5475m263j5386k228L922l555
14863a8161m985M766K778O419m745m193N755J8m764l471m807J703J1520r407o313
14848b7887K682n638O749R130N806R118j1569p303N622J3731k880n985p591J756
$$ plain form
14834 -14259 -17829 -19988 -13532 -1270 -2110 -1111 1939 -158 1221 -682 5636 13085 2536 2742 1779
14819 1779 -1981 -2827 2130 3891 -2986 -7822 -4456 8776 8129 -5336 -12619 -20979 -35965 -27250
14805 -27250 -20551 -15949 -7493 -4465 -27446 -29021 -22925 -31255 -35384 -29468 -23747 -14509 -9111 -1504
14791 -1504 6511 -6291 -9092 -5578 -7640 -6126 316 9478 -2117 -723 -8202 -16877 -6347 530
14777 530 1957 12008 11050 -5156 -3152 -5758 -10463 -5584 -5625 -13373 -21277 -26720 -31705 -27198 -30974
14762 -30974 -24499 -24948 -28963 -25043 -14603 -5240 -9884 -17702 -19224 -22076 -22779 -16293 -20964 -22718 -3996
14747 -3996 -536 -9311 -11419 -8845 -3386 3388 -7702 -12963 -9496 -3674 7903 -2226 -17743 -10608
14733 -10608 -2288 2377 -7636 -4537 -5255 -9352 -12652 -9174 683 10876 19310 8935 15809 7811
$$ packed form
14834a4259l570k159O456J2262q40R99L050k097J379j903O318P449j0549K06r63
14819A779l760q46M957J761o877m836L366J3232o47j3465p283q360j4986Q715
14805b7250O699M602Q456L028k2981j575O096q330m129N916N721R238N398P607
14791a504Q015j2802k801L514k062J514O442R162j1595J394p479q675J0530O877
14777E30J427J0051r58j6206K004k606m705M879m1p748p904n443m985M507l776
14762c0974O475m49m015L920J0440R363m644p818j522k852p03O486m671j754J8722
14747c996L460q775k108K574N459O774j1090n261L467N822J1577j0129j5517P135
14733a0608Q320M665j0013L099p18m097l300L478R857J0193Q434j0375O874p998
$$ plain form
14719 7811 9613 10319 3956 658 4610 2498 851 -4428 -9517 1828 14062 4703 9259 15786
14705 15786 8159 -6452 -7756 -8164 6734 -411 -9704 -1389 6142 2110 -7357 -5197 12458 13120
14691 13120 7012 -1578 4315 21686 25770 9824 -2771 -5540 883 -4935 2117 11333 12812 11554
14677 11554 9795 9730 10288 7016 -4746 -14820 -9312 -8543 -15011 -11249 -19675 -20081 -13344 -6914 -1959
14662 -1959 -3741 -13520 -11248 -3870 -7024 -17204 -20975 -10767 -11594 3193 -4796 -10123 -8787 -11915
14648 -11915 -16505 -14501 -20134 -8880 2944 -2346 -12031 -5792 -1843 -1154 -6655 -8133 -8911 1115
14634 1115 560 5381 6518 -1306 -7899 -6200 -1086 13000 15732 538 -9326 -7002 -802 -1510 -8492
14619 -8492 -25541 -31585 -14988 -12052 -3613 4950 5536 -4656 -17343 -25086 -11350 -4112 -2575 -5058
$$ packed form
14719G811J802P06o363l298L952k112j647n279n089J1345J2234r359M556O527
14705A5786p627j4611j304m08J4898p145r293Q315P531m032r467K160J7655O62
14691A3120o108q590N893J7371M084j5946j2595k769O423n818P052R216J479j258
14677A1554j759o5N58l272j1762j0074N508P69o468L762q426m06O737O430M955
14662a959j782r779K272P378l154j0180l771J0208q27J4787p989n327J336l128
14648a1915m590K004n633J1254J1824n290r685O239L949O89n501j478p78J0026
14634A115n55M821J137p824o593J699N114J4086K732j5194r864K324O200p08o982
14619h492j7049o044J6597K936Q439Q563N86j0192j2687p743J3736P238J537k483
$$ plain form
14605 -5058 31 6100 1952 -6188 -3345 8844 11578 10272 7602 27738 21205 2200 -6832 -10350
14591 -10350 -18648 -20328 -17097 -15947 -12718 -2221 2488 -3525 6615 10341 8463 -9419 -12184 -6609
14577 -6609 -2051 -5056 -10984 -19842 -25675 -30784 -42266 -39363 -27902 -23340 -24286 -13656 -15650 -30900
14563 -30900 -30604 -22348 -12560 -2880 -667 3596 -11117 -17584 -20776 -29608 -23908 -17519 -1660 13141
14549 13141 439 -19161 -16716 -5576 -13271 -15840 -9107 2322 11072 6868 7030 7388 8042 3970
14535 3970 4341 -60 14380 16685 22116 12121 -2400 3206 18068 27376 15026 4436 4863 -5723
14521 -5723 -16659 -17379 -17000 -16290 -11939 -8453 -1912 -17358 -30102 -36700 -37347 -33900 -24649 -30529 -31906
14506 -31906 -39136 -35587 -26809 -26464 -24148 -14049 1920 1708 -12255 -15614 -17366 -29662 -35006 -41806
$$ packed form
14605e058N089O069m148q140K843J2189K734j306k670K0136o533j9005r032l518
14591a0350q298j680L231J150L229J0497M709o013J0140L726j878j7882k765N575
14577f609M558l005n928q858n833n109j1482K903J1461M562r46J0630j994j5250
14563c0900K96Q256R788R680K213M263j4713o467l192q832N700O389J5859J4801
14549A3141j2702j9600K445J1140p695k569O733J1429Q750m204J62L58O54m072
14535C970L71m401J4440K305N431r995j4521N606J4862R308j2350j0590M27j0586
14521e723j0936p20L79P10M351L486O541j5446j2744o598o47L447R251n880j377
14506c1906p230L549Q778L45K316J0099J5969k12j3963l359j752j2296n344o800
$$ plain form
14492 -41806 -33643 -13396 -486 -896 3392 7912 2066 7276 11367 12364 4113 -5142 -6334 1614
14478 1614 825 -12471 -6597 -1310 4137 5779 13145 19824 9579 -4179 -7216 -8205 -17428 -20550
14464 -20550 -16659 -21871 -22090 -20707 -11856 -22500 -25355 -22907 -16145 -17622 -12436 -8204 -11284 -17103
14450 -17103 -4864 8403 4008 -1132 -3462 -9079 -10534 -12692 -15867 -21526 -21137 -7542 -5598 -12838
14436 -12838 -15739 -6435 -129 -12300 -13074 -1103 4249 5811 9380 7545 12435 3173 8732 12965
14422 12965 27860 32307 29445 21954 18341 22885 15255 3386 15353 14849 14396 5279 -12585 -23293
14408 -23293 -24594 -22761 -12845 -691 7272 5521 8805 9024 -2703 -6922 -12153 -10043 -6090 -999
14394 -999 -10972 -17721 -9238 -16000 -21246 -34727 -30898 -27864 -25202 -11529 -3390 -8974 -9401 -12272 -11384
$$ packed form
14492d1806Q163K0247J2910m10M288M520n846N210M091R97q251r255j192P948
14478A614p89j3296N874N287N447J642P366O679j0245j3758l037r89r223l122
14464b0550L891n212k19J383Q851j0644k855K448O762j477N186M232l080n819
14450a7103J2239J3267m395n140k330n617j455k158l175n659L89J3595J944p240
14436a2838k901R304O306j2171p74J1971N352J562L569j835M890r262N559M233
14422A2965J4895M447k862p491l613M544p630j1869J1967n04m53r117j7864j0708
14408b3293j301J833R916J2154P963j751L284K19j1727m219n231K110L953N091
14394i99r973o749Q483o762n246j3481L829L034K662J3673Q139n584m27k871Q88
$$ plain form
14379 -11384 -6265 11504 18444 20933 20976 12317 13080 20393 26577 22923 13151 -2658 -10941 -16031 -20795
14364 -20795 -19841 -19448 -8979 -7943 -5341 -4536 -7883 -3334 12984 19235 9560 4828 -2891 -12605 -7056
14349 -7056 -11859 -6585 2292 -8347 -18502 -13732 -8660 -529 1535 -9924 -13662 -17218 -21527 -19577
14335 -19577 -22836 -15178 9957 9462 -5159 -859 -1779 8953 14212 -3113 -19364 -13475 -9065 7264
14321 7264 1338 -7048 -8513 -9625 -3515 -3398 -8802 -3782 -10708 -16067 -7609 -231 -13683 -19576 -12901
14306 -12901 -3398 9478 11888 13435 1244 862 6121 6075 16585 22019 21656 21276 19548 14766 9801
14291 9801 14092 14826 22 6990 14490 18623 9355 -5961 -15953 -8265 21221 34261 29129 27400
14277 27400 38215 45343 57674 46464 30238 30016 29238 35232 50245 66076 80830 79590 72313
$$ packed form
14379a1384N119J7769O940K489M3q659P63P313O184l654r772j5809q283n090m764
14364b0795R54L93J0469J036K602Q05l347M549J6318O251r675m732p719r714N549
14349g056m803N274Q877j0639j0155M770N072Q131K064j1459l738l556m309J950
14335a9577l259P658K5135m95j4621M300r20J0732N259j7325j6251N889M410J6329
14321G264n926q386j465j112O110J17n404N020o926n359Q458P378j3452n893O675
14306a2901R503J2876K410J547j2191l82N259m6J0510N434l63l80j728m782m965
14291I801M291P34j4804O968P500M133r268j5316r992P688K9486J3040n132j729
14277B7400J0815P128J2331j1210j6226k22p78N994J5013J5831J4754j240p277
$$ plain form
14264 72313 70283 68696 57970 58967 58109 61635 76899 87067 92396 107277 112127 106322 93554 105500
14250 105500 129884 161311 193262 216169 246022 291746 330579 387075 448630 524780 637207
14239 637207 820508 1110305 1602765 2339187 3213887 4088787 4811216 5327841 5615426 5708321
14229 5708321 5617703 5358223 4991015 4739299 4712574 4937115 5333412 5669246 5848482 5860616
14219 5860616 5695395 5294625 4671533 3862004 2969587 2166237 1590976 1223453 978091
14210 978091 817493 710476 625779 562863 505252 469225 423405 378219 348358 336220 319084
14199 319084 295459 280167 270267 246729 236735 221322 213228 208960 189110 169040 169983 172037 164277
14186 164277 158569 151539 147851 143429 143857 120322 104340 94803 96205 101066 98485 103665 109265 102118
$$ packed form
14264G2313k030j587j0726R97q58L526J5264J0168N329J4881M850n805j2768J1946
14250A05500K4384L1427L1951K2907K9853M5724L8833N6496O1555P6150J12427
14239F37207J83301K89797M92460P36422Q74700Q74900P22429N16625K87585R2895
14229E708321r0618k59480l67208k51716k6725K24541L96297L35834J79236J2134
14219E860616j65221m00770o23092q09529q92417q03350n75261l67523k45362
14210I78091j60598j07017q4697o2916n7611l6027m5820m5186k9861j2138j7136
14199C19084k3625j5292r900k3538r994j5413q094m268j9850k0070R43K054p760
14186A64277n708p030l688m422M28k3535j5982r537J402M861k581N180N600p147
$$ plain form
14172 102118 95045 97663 92861 92240 80849 88275 96526 94879 95005 87812 86211 93135 92254 93711 84227
14157 84227 80090 79987 74325 61368 55904 55110 51063 35688 30183 31830 27637 27938 40398 33374
14143 33374 36053 36227 44734 57452 57179 61340 62035 44018 23619 25677 38659 34968 25390 22443
14129 22443 9468 10358 18356 15987 9304 10703 15444 13749 28978 36431 22658 11980 9579 15489
14115 15489 27373 30869 30057 36969 35207 23843 11323 3907 4082 6600 -1386 -775 2099 3698
14101 3698 16468 10756 6562 10757 14272 13832 11601 10642 10185 13103 10419 5761 12661 17980 16847
14086 16847 16314 17415 8045 6341 19246 22654 21143 17264 12559 3837 -13213 -13256 -7348 -8212 -7884
14071 -7884 3956 12053 1621 2466 -3177 -4592 -5370 -8505 -5259 8090 22158 40739 42707 38830
$$ packed form
14172A02118p073K618m802o21j1391P426Q251j647J26p193j601O924q81J457r484
14157H4227m137j03n662j2957n464p94m047j5375n505J647m193L01J2460p024
14143C3374K679J74Q507J2718k73M161O95j8017k0399K058J2982l691r578k947
14129B2443j2975Q90P998k369o683J399M741j695J5229P453j3773j0678k401N910
14115A5489J1884L496q12O912j762j1364j2520p416J75K518p986O11K874J599
14101C698J2770n712m194M195L515m40k231r59m57K918k684m658O900N319j133
14086A6847n33J101r370j704J2905L408j511l879m705q722j7050m3N908q64L28
14071g884J1840Q097j0432Q45n643j415p78l135L246J3349J4068J8581J968l877
$$ plain form
14057 38830 46136 54564 60477 69987 79703 82483 79675 85963 77078 64243 71635 58589 43931 32174
14043 32174 22508 21517 30098 28346 10629 -4978 -3267 6132 11569 7925 7426 5430 -152 -7865
14029 -7865 -11548 -8141 -2641 5539 676 2792 25973 26300 20827 12790 16461 19589 4397 1362
14015 1362 1684 4987 3276 9662 20555 18609 7724 -13125 -16836 -1295 3891 -17837 -27918
14002 -27918 -29700 -21735 -1492 -292 -11498 -10611 -7594 -10305 -8036 -12787 1662 4233 -13749 -18169
13988 -18169 -17197 -9825 -4701 7030 13257 -872 -20465 -25889 -17111 -4471 6882 5248 5282 7576
13974 7576 -1091 -5702 -8325 -21103 -13895 -2383 8912 6599 3281 -1532 -4774 -10698 -8304 -14016
13960 -14016 -12976 157 2048 -5035 -13432 -6276 -31 1987 -11355 -12089 -15504 -16653 -19433 -8978
$$ packed form
14057C8830P306Q428N913R510R716K780k808O288q885j2835P392j3046j4658j1757
14043C2174r666r91Q581j752j7717j5607J711R399N437l644m99j996n582p713
14029g865l683L407N500Q180m863K116K3181L27n473q037L671L128j5192l035
14015A362L22L303j711O386J0893j946j0885k0849l711J5541N186k1728j0081
14002b7918j782P965K0243J200j1206Q87L017k711K269m751J4449K571j7982m420
13988a8169R72P372N124J1731O227j4129j9593n424Q778J2640J1353j634L4K294
13974G576q667m611k623j2778P208J1512J1295k313l318m813l242n924K394n712
13960a4016J040J3133J891p083q397P156O245K018j3342p34l415j149k780J0455
$$ plain form
13946 -8978 -20094 -16919 -5813 1685 -11512 -4016 4509 -6340 -5960 861 5500 -7892 -1692 286
13932 286 12693 29113 26548 24052 9756 -7410 -14023 -9172 2679 1366 -9241 -2228 8047
13919 8047 17015 25465 28341 24942 17639 5627 1432 -4563 432 4995 -2451 4615 22261 25840
13905 25840 19752 22433 4829 -11136 -12948 -6235 -18234 -26891 -23448 -22699 -19678 -6638 -912 3147
13891 3147 1925 5900 -130 -6091 -12718 -16869 -14319 -15879 -29795 -33174 -30484 -20378 -8591 14280
13877 14280 19889 14128 2833 -9430 -3485 -1876 -12677 -14589 -16941 -22422 -16068 -4046 8741
13864 8741 10117 1746 -1254 1386 3122 -4890 -10445 -121 9085 902 4240 9743 25343 29362
13850 29362 14545 5633 -6901 -1009 9958 9142 10896 9563 -7842 1647 22788 24700 22524
$$ packed form
13946h978j1116L175J1106P498j3197P496Q525j0849L80O821M639j3392O200J978
13932B86J2407J6420k565k496j4296j7166o613M851J1851j313j0607P013J0275
13919H047Q968Q450K876l399p303j2012m195n995M995M563p446P066J7646L579
13905B5840o088K681j7604j5965j812O713j1999q657L443P49L021J3040N726M059
13891C147j222L975o030n961o627m151K550j560j3916l379K690J0106J1787K2871
13877A4280N609n761j1295j2263N945J609j0801j912k352n481O354J2022J2787
13864H741J376q371l000K640J736q012n555J0324R206q183L338N503J5600M019
13850B9362j4817q912j2534N892J0967q16J754j333j7405R489K1141J912k176
$$ plain form
13837 22524 12448 8588 20301 17598 13240 3883 11696 9722 10389 16157 16450 11409 10011 7343
13823 7343 8734 6197 -2359 -3421 7111 4843 -16598 -29107 -21243 -2693 14643 13931 2554
13810 2554 403 2598 2051 6941 7898 992 7721 1140 8039 5845 -4898 -10686 -14113 -18189 -19529
13795 -19529 -24356 -32691 -28047 -21758 -15628 -19180 -9141 614 -1008 -767 -16825 -19296 -19533 -16310
13781 -16310 3707 9558 8666 8172 3743 16624 14241 1382 -282 12015 7573 2997 4956 14432
13767 14432 1765 -1357 -101 -1212 -2833 956 3128 15210 26866 28748 26655 30363 29362 14182
13753 14182 18883 16673 14168 -1905 -10271 -7387 -4707 5330 8447 3722 -8610 -7145 3653
13740 3653 3285 -92 21252 16383 4231 277 -871 6899 10675 4490 2300 482 -2403 -8177
$$ packed form
13837B2524j0076l860J1713k703m358r357P813j974O67N768K93n041j398k668
13823G343J391k537q556j062J0532k268k1441j2509P864J8550J7336p12j1377
13810B554k151K195n47M890R57o906O729o581O899k194j0743n788l427m076j340
13795a9529m827q335M644O289O130l552J0039R755j622K41j6058k471k37L223
13781a6310K0017N851q92m94m429J2881k383j2859j664J2297m442m576J959R476
13767A4432j2667l122J256j111j621L789K172J2082J1656J882k093L708j001j5180
13753A4182M701k210k505j6073q366K884K680J0037L117m725j2332J465J0798
13740C653l68l377K1344m869j2152l954j148P770L776o185k190j818k885n774
$$ plain form
13726 -8177 -14407 -6981 8056 10866 13492 10566 9707 3455 258 2187 5790 10142 2772 14290
13712 14290 24031 26951 7573 -4962 -6176 627 4745 5666 -3727 -10461 -8074 -1527 5138 -2674
13698 -2674 -19162 -14209 -9373 -5069 -6958 -13815 -12947 -1610 5404 3443 67 11473 22328 4871
13684 4871 -12598 -9643 10780 13570 17622 13540 15151 8394 -7115 -15895 -22100 -20014 -9382 -10349
13670 -10349 -4047 -6578 -50 -1727 -6293 -1404 4271 440 1013 -7254 -15413 -20056 -24351 -22722 -22188
13655 -22188 -17864 -7706 -2280 -2714 4939 4215 10698 -7072 -20692 -9412 -4291 4201 5032 10266
13641 10266 20653 18200 6386 4582 9076 1318 -3245 7248 9842 7512 -9460 -13838 -3960
13628 -3960 2110 1268 -10587 -24470 -23401 -22584 -19763 -4524 -287 7064 6334 -1104 -1594 -12349 -12931
$$ packed form
13726h177o230P426J5037K810K626k926q59o252l197J929L603M352p370J1518
13712A4290R741K920j9378j2535j214O803M118R21r393o734K387O547O665p812
13698b674j6488M953M836M304j889o857Q68J1337P014j961l376J1406J0855j7457
13684D871j7469K955K0423K790M052m082J611o757j5509q780o205K086J0632r67
13670a0349O302k531O528j677m566M889N675l831N73q267q159m643m295J629N34
13655b2188M324J0158N426m34P653p24O483j7770j3620J1280N121Q492Q31N234
13641A0266J0387k453j1814j804M494p758m563J0493K594k330j6972m378R878
13628c960O070q42j1855j3883J069Q17K821J5239M237P351p30p438m90j0755n82
$$ plain form
13613 -12931 -5992 -4646 -19270 -13813 -3945 -8460 -17761 -16563 -2752 -4063 -20845 -34973 -29737
13600 -29737 -18421 -8705 -10801 -13996 -17297 -16110 -13591 -10440 -10226 -9725 2563 12519 15025 30709
13586 30709 40479 34026 9340 -8878 -13530 -7982 -3510 -21196 -28431 -25584 -13373 -6503 -9953
13573 -9953 -15846 -15803 -21818 -16766 -20128 -25318 -11084 7340 14191 6182 -816 9022 5937 -14080
13559 -14080 -4705 11803 19900 11989 6271 5329 10726 12508 20933 21949 18143 12295 9694 9217 30229
13544 30229 31239 13914 8881 15435 15065 7047 1486 1454 -1743 -4345 4363 15221 12996 14059 12513
13529 12513 8994 -2822 -22585 -13206 8142 26471 30748 9316 -7620 -3463 3768 6488 10911
13516 10911 20483 25732 20225 3768 3541 7158 4242 -9258 -13133 -9553 5102 4884 3966 1847
$$ packed form
13613a2931O939J346j4624N457R868m515r301J198J3811j311j6782j4128N236
13600b9737J1316R716k096l195l301J187K519L151K14N01J2288R956K506J5684
13586C0709R770o453k4686j8218m652N548M472j7686p235K847J2211O870l450
13573i953n893M3o015N052l362n190J4234J8424O851q009o998R838l085k0017
13559a4080R375J6508Q097p911n718r42N397J782Q425J016l806n848k601m77K1012
13544C0229J010j7325n033O554l70q018n561l2l197k602Q708J0858k225J063j546
13529A2513l519j1816j9763R379K1348J8329M277k1432j6936M157P231K720M423
13516A0911R572N249n507j6457k27L617k916j3500l875L580J4655k18r18k119
$$ plain form
13502 1847 -15282 -20182 -8370 -1376 5653 -735 9903 12636 11716 18354 14945 -1473 -8187 -504
13488 -504 16556 25455 20185 11806 7028 17664 14736 20319 25848 30461 37295 21312 2359 -2151
13474 -2151 -4324 -9922 -14123 -17123 -10729 -9207 -10390 -5534 7871 20165 18875 19757 9254 5166
13460 5166 -1320 -15271 -8148 -5014 8173 19516 27576 27545 22346 19584 9213 10587 19825 13603
13446 13603 15302 10258 10988 7385 5113 8960 9293 19958 16331 11446 6731 -5705 -14133 -13614 -18652
13431 -18652 -9624 907 8158 7478 8653 9760 2646 2123 -7446 -10531 -15690 -3553 265 859 -5949
13416 -5949 -16354 -142 10436 9947 10403 16757 15694 4862 7458 9564 19023 15749 11331 7892
13402 7892 8942 12325 13751 18261 26012 14736 -3660 -12348 493 9360 -117 665 -6385 -10029
$$ packed form
13502A847j7129m900J1812O994P029o388J0638K733r20O638l409j6418o714P683
13488e04J7060Q899n270q379m778J0636k928N583N529M613O834j5983j8953m510
13474b151k173n598m201l000O394J522j183M856J3405J2294j290Q82j0503m088
13460E166o486j3951P123L134J3187J1343Q060l1n199k762j0371J374R238o222
13446A3603J699n044P30l603k272L847L33J0665l627m885m715j2436q428N19n038
13431a8652R028J0531P251o80J175J107p114n23r569l085n159J2137L818N94o808
13416e949j0405J6212J0578m89M56O354j063j0832K596K106R459l274m418l439
13402G892J050L383J426M510P751j1276j8396q688J2841Q867r477P82p050l644
$$ plain form
13388 -10029 -2191 4674 4238 3437 5600 2005 -3176 7039 20015 8566 -1936 6874 22252 26187
13374 26187 16417 13209 8545 -2628 -2898 -258 -2360 15968 32173 23080 10024 6482 19274
13361 19274 28676 28672 25062 21647 15179 7062 7727 23452 36143 25573 12689 12483 23221 30680
13347 30680 33452 22302 15901 15450 19881 26147 20261 17213 22014 14179 23120 27063 30884 32102
13333 32102 26464 15532 22243 33003 19348 9598 9105 163 -12048 94 17941 14051 11815
13320 11815 14942 12270 4304 -6398 -6713 2035 6388 12213 15707 24145 23902 9055 -648 14831
13306 14831 18253 7225 10296 22930 24361 19765 22625 21479 27842 21657 17976 25433 23699 19094
13292 19094 14096 21133 18327 1183 6287 17282 39212 44168 35809 38146 40065 32826 28907 42135
$$ packed form
13388a0029P838O865m36q01K163l595n181J0215J2976j1449j0502Q810J5378L935
13374B6187r770l208m664j1173k70K640k102J8328J6205r093j3056l542J2792
13361A9274R402ml610l415o468q117O65J5725J2691j0570j2884k06J0738P459
13347C0680K772j1150o401m51M431O266n886l048M801p835Q941L943L821J218
13333C2102n638j0932O711J0760j3655r750m93q942j2211J2142J7847l890k236
13320A1815L127k672p966j0702l15Q748M353N825L494Q438k43j4847r703J5479
13306A4831L422j1028L071J2634J431m596K860j146O363o185l681P457j734m605
13292A9094m998P037k806j7144N104J0995K1930M956q359K337J919p239l919J3228
$$ plain form
13278 42135 36666 48017 63516 69912 67767 75124 100890 134960 186156 269400 375141 479573
13266 479573 565900 636159 672488 639850 570642 488609 414799 361951 326764 328667 361333 417359
13254 417359 502051 593319 671182 708688 677988 626925 547844 449411 350833 266625 196903
13243 196903 149027 125089 108261 112850 96800 81232 65244 55728 63231 75998 61094 38466
13231 38466 27283 32133 38755 41980 51073 54494 54743 56271 62497 63979 64701 51364 51659 55321 55499
13216 55499 46101 48469 56206 41568 31404 31288 36204 46959 46173 45493 38189 28014 32777 26816
13202 26816 23981 27962 42544 49823 56721 42619 47234 66240 69466 43907 21845 24889 34932
13189 34932 36887 35581 34622 35440 48009 47256 35380 26012 30301 32597 41514 42345 37897 38788 42033
$$ packed form
13278D2135n469J1351J5499O396k145P357K5766L4070N1196Q3244J05741J04432
13266D79573Q6327P0259L6329l2638o9208q2033p3810n2848l5187J903L2666N6026
13254D17359Q4692R1268P7863L7506l0700n1063p9081r8433r8578q4208o9722
13243A96903m7876k3938j6828M589j6050j5568j5988r516P503J2767j4904k2628
13231C8466j1183M850O622L225R093L421K49J528O226J482P22j3337K95L662J78
13216E5499r398K368P737j4638j0164j16M916J0755p86o80p304j0175M763n961
13202B6816k835L981J4582P279O898j4102M615J9006L226k5559k2062L044J0043
13189C4932J955j306r59Q18J2569p53j1876r368M289K296Q917Q31m448Q91L245
$$ plain form
13174 42033 48003 52116 51399 49450 45512 49659 51680 48279 45993 40584 56376 49440 33163 32739
13160 32739 29078 31191 27264 26038 42995 57690 63195 68632 71625 60085 42361 43245 64283
13147 64283 56725 48920 50268 61727 55669 52394 54872 52680 50459 47861 53645 63706 78598 71982
13133 71982 57749 62214 88155 85887 78320 68259 68570 51618 41259 21958 26906 42658 62513
13120 62513 65001 55135 52419 50766 39758 37492 42713 41538 42377 46653 51701 49697 53924 70206
13106 70206 67765 52980 45595 41380 45446 67933 73487 59464 60753 73616 90897 104941 129934
13093 129934 168737 198832 217917 223987 207631 184187 160222 132830 115117 114302 112932 131418
13081 131418 157518 170005 192430 189688 188755 187166 177694 167737 149177 135032 108501 87163 78079
$$ packed form
13174D2033N970M113p17j949l938M147K021l401k286n409J5792o936j6277m24
13160C2739l661K113l927j226J6957J4695N505N437K993j1540j7724Q84K1038
13147F4283p558p805J348J1459o058l275K478k192k221k598N784J0061J4892o616
13133G1982j4233M465K5941k268p567j0061L11j6952j0359j9301M948J5752J9855
13120F2513K488r866k716j653j1008k266N221j175Q39M276N048k004M227J6282
13106G0206k441j4785p385m215M066K2487N554j4023J289J2863J7281J4044K4993
13093A29934L8803L0095J9085O070j6356k3444k3965k7392j7713q15j370J8486
13081A31418K6100J2487K2425k742r33j589r472r957j8560j4145k6531k1338r084
$$ plain form
13068 78079 62014 66915 63416 66192 77264 65907 58576 46073 40296 60615 79194 81947 65440
13055 65440 54523 54931 73438 79883 83578 83025 77211 79528 90296 97009 82256 80793 85609 79711
13041 79711 79335 96665 97504 91236 90541 98190 96337 88279 74967 82281 92038 96349 101471 107756 103186
13026 103186 103163 102716 87757 85643 93892 97637 90260 81694 80165 73455 69208 60968 59364 55467 53976
13011 53976 70223 85801 89273 78118 76395 87291 94089 97804 88203 79898 72826 76768 86589
12998 86589 96181 105708 112307 115567 112623 107213 114299 122053 136484 139065 144438 140259 151444 153755
12984 153755 165011 168238 158135 144943 146098 152620 149115 139516 138769 150397 158834 155576 164654
12971 164654 182756 187667 181957 185997 207670 206310 210877 215810 227997 240791 228935 223315 201660
$$ packed form
13068G8079j6065M901l499K776J1072j1357p331j2503n777K0319J8579K753j6507
13055F5440j0917M08J8507O445L695n53n814K317J0768O713j4753j463M816n898
13041G9711l76J7330Q39o268o95P649j853q058j3312P314R757M311N122O285m570
13026A03186k3m47j4959k114Q249L745p377q566j529o710m247q240j604l897j491
13011E3976J6247J5578L472j1155j723J0896O798L715r601q305p072L942R821
12998H6589R592R527O599L260k944n410P086P754J4431K581N373m179J1185K311
12984A53755J1256L227j0103j3192J155O522l505r599p47J1628Q437l258R078
12971A64654J8102M911n710M040K1673j360M567M933J2187J2794j1856n620k1655
$$ plain form
12958 201660 184068 189406 187549 190268 185299 192732 210170 211531 225836 226238 222330 222128 207328 187544
12944 187544 175978 169830 170086 180427 174463 163457 159563 182015 176147 169821 172068 175438 183573
12931 183573 192814 197673 204931 212806 226175 250125 262292 265960 280347 309366 334906 343266 337904
12918 337904 324381 335428 353519 353598 356598 343142 344473 350040 341921 337207 341268 351462 369462
12905 369462 383827 406055 417555 410323 416754 422241 424897 437553 451852 474568 501214 531812
12893 531812 553391 564363 580790 602182 602800 618433 638039 658374 685794 713300 735088 767628
12881 767628 809846 853427 894053 941370 992012 1043894 1090439 1120530 1146292 1186207 1245889
12870 1245889 1298867 1361113 1436041 1526318 1618532 1732232 1872752 2032962 2213869 2408993
$$ packed form
12958B01660j7592N338j857K719m969P433J7438J361J4305M02l908k02j4800j9784
12944A87544j1566o148K56J0341n964j1006l894K2452n868o326K247L370Q135
12931A83573R241M859P258P875J3369K3950J2167L668J4387K9019K5540Q360n362
12918C37904j3523J1047J8091P9L000j3456J331N567q119m714M061J0194J8000
12905C69462J4365K2228J1500p232O431N487K656J2656J4299K2716K6646L0598
12893E31812K1579J0972J6427K1392O18J5633J9606K0335K7420K7506K1788L2540
12881G67628M2218M3581M0626M7317N0642N1882M6545L0091K5762L9915N9682
12870A245889N2978O2246P4928R0277R2214J13700J40520J60210J80907J95124
$$ plain form
12860 2408993 2603526 2823441 3103123 3445531 3862969 4335778 4868290 5452127 6076553
12851 6076553 6739715 7471720 8333811 9443376 10946968 13074669 16184136 20944829 28481978
12842 28481978 40025839 56050257 75506845 95389993 111590563 120596265 120330830
12835 120330830 111417918 96520891 79544634 64568787 54316740 50323136 53111581
12828 53111581 62461089 77198216 94721534 110901519 121586141 123745025 116578499
12821 116578499 101945683 83105302 64076441 47849438 35708776 27477109 22052516
12814 22052516 18365966 15787337 13925083 12564063 11535068 10705558 10001839 9319782
12806 9319782 8640747 7989410 7386556 6839421 6371890 5992415 5679835 5429540 5247071
$$ packed form
12860B408993J94533K19915K79682L42408M17438M72809N32512N83837O24426
12851F076553O63162P32005Q62091J109565J503592K127701L109467M760693P537149
12842B8481978J1543861J6024418J9456588J9883148J6200570R005702k65435
12835A20330830q912912j4897027j6976257j4975847j0252047l993604K788445
12828E3111581R349508J4737127J7523318J6179985J0684622K158884p166526
12821A16578499j4632816j8840381j9028861j6227003j2140662q231667n424593
12814B2052516l686550k578629j862254j361020j028995q29510p03719o82057
12806I319782o79035o51337o02854n47135m67531l79475l12580k50295j82469
$$ plain form
12797 5247071 5134624 5074115 5073847 5131748 5277544 5514115 5803629 6073447 6263008 6314257
12787 6314257 6225403 6019142 5732856 5404151 5079506 4807135 4607405 4477342 4464238 4526877
12777 4526877 4642981 4818232 5020895 5193636 5250939 5165053 4948664 4620667 4234063 3831135
12767 3831135 3458753 3143177 2873098 2656457 2471347 2316423 2173934 2060106 1958263
12758 1958263 1867061 1790297 1743971 1718911 1705507 1707003 1718117 1744182 1756461 1760320 1739206 1706237
12746 1706237 1655265 1582167 1501702 1440033 1411860 1408245 1430246 1456075 1489211 1550810 1632171
12735 1632171 1700517 1752704 1778078 1795677 1801643 1813671 1847531 1941067 2092287 2330155 2678426
12724 2678426 3137090 3705539 4347557 4948713 5414189 5675630 5690405 5485468 5122766 4724006
$$ packed form
12797E247071j12447o0509k68N7901J45796K36571K89514K69818J89561N1249
12787F314257q8854k06261k86286l28705l24645k72371j99730j30063j3104O2639
12777D526877J16104J75251K02663J72741N7303q5886k16389l27997l86604m02928
12767C831135l72382l15576k70079k16641j85110j54924j42489j13828j01843
12758A958263r1202p6764m6326k5060j3404J496J1114K6065J2279L859k1114l2969
12746A706237n0972p3098q0465o1669k8173l615K2001K5829L3136O1599Q1361
12735A632171O8346N2187K5374J7599N966J2028L3860R3536J51220K37868L48271
12724B678426M58664N68449O42018O01156M65476K61441J4775k04937l62702l98760
$$ plain form
12714 4724006 4358912 4091387 3971473 4029323 4246120 4575640 4976930 5364494 5635267 5686470
12704 5686470 5499457 5079325 4492361 3840890 3223004 2683789 2265654 1956927 1728488
12695 1728488 1550478 1405792 1284825 1180973 1074088 1002516 953438 906258 857916 822256
12685 822256 800976 795454 794187 792189 784677 792057 847780 959824 1126430 1370611 1690533 2008949
12673 2008949 2310312 2585260 2826353 3069143 3330045 3548821 3623784 3527623 3299215 3043732
12663 3043732 2794347 2539642 2258103 1944027 1614287 1296676 1040976 880824 774367
12654 774367 696836 643307 598526 558730 532541 501497 472919 447633 434373 417256 395888
12643 395888 376797 364251 345592 319220 302673 277634 264553 259845 263151 265037 244035 231522
$$ packed form
12714D724006l65094k67525j19914N7850K16797L29520M01290L87564K70773N1203
12704E686470j87013m20132n86964o51471o17886n39215m18135l08727k28439
12695A728488j78010j44686j20967j03852j06885p1572m9078m7180m8342l5660
12685H22256k1280n522j267j998p512P380N5723J12044J66606K44181L19922L18416
12673B008949L01363K74948K41093K42790K60902K18776P4963r6161k28408k55483
12663C043732k49385k54705k81539l14076l29740l17611k55700j60152j06457
12654G74367p7531n3529m4781l9796k6189l1044k8578k5286j3260j7117k1368
12643C95888j9091j2546j8659k6372j6547k5039j3081m708L306J886k1002j2513
$$ plain form
12631 231522 221558 214307 211465 204853 213029 206876 191606 179356 159381 162574 169022 157076 154558
12618 154558 163471 169881 155896 155753 152723 139753 131127 115760 102934 105361 106947 118720 123547
12605 123547 120586 114434 111338 93310 79716 77313 65764 89706 98158 92912 91857 97179 93722
12592 93722 95199 91260 99054 110071 97650 87739 93648 102779 98960 102121 98754 96092 91670 82105
12578 82105 72171 77602 83255 76427 71683 79768 83315 78578 90660 106164 108328 102467 88787 91691
12564 91691 82608 76286 74166 62392 62461 67235 61042 59273 73498 74633 66883 60800 55604 52873
12550 52873 60984 71688 75853 71610 50655 43841 54666 59542 76760 88786 93557 101549 107339
12537 107339 114472 127213 127224 106333 84583 62674 40966 47142 51259 41544 41717 51821 60009
$$ packed form
12631B31522r964p251k842o612Q176o153j5270j2250j9975L193O448j1946k518
12618A54558Q913O410j3985j43l030j2970q626j5367j2826K427J586J1773M827
12605A23547k961o152l096j8028j3594k403j1549K3942Q452n246j055N322l457
12592I3722J477l939P794J1017j2421r911N909R131l819L161l367k662m422r565
12578H2105r934N431N653o828m744Q085L547m737J2082J5504K164n861j3680K904
12564I1691r083o322k120j1774O9M774o193j769J4225J135p750o083n196k731
12550E2873Q111J0704M165m243k0955o814J0825M876J7218J2026M771P992N790
12537A07339P133J2741J1k0891k1750k1909k1708O176M117r715J73J0104Q188
$$ plain form
12524 60009 73589 64436 42759 60125 84447 76712 80227 83271 89130 78718 70199 91137 114653
12511 114653 137727 165556 185962 199804 217825 240966 248962 256387 268774 261206 232249 217985
12499 217985 199662 178006 156028 145551 136929 133652 133371 152832 142615 121101 108795 127285
12487 127285 141853 137043 133385 157971 182859 203612 232353 273807 330720 397657 449253 510672
12475 510672 585572 657291 714143 772639 795274 800513 807488 804712 781003 740321 684689 612731
12463 612731 537910 473167 398352 344256 296420 251104 208616 159419 132207 129752 134397 136721
12451 136721 128902 99226 91479 93610 106000 104904 88524 92031 105015 96313 90621 91177 93184
12438 93184 103253 106810 102795 99205 99206 106753 112516 113403 131244 139316 143936 137732 127804 130533 138637
$$ packed form
12524F0009J3580r153k1677J7366K4322p735L515L044N859j0412q519K0938K3516
12511A14653K3074K7829K0406J3842J8021K3141P996P425J2387p568k8957j4264
12499B17985j8323k1656k1978j0477q622l277k81J9461j0217k1514j2306J8490
12487A27285J4568m810l658K4586K4888K0753K8741M1454N6913O6937N1596O1419
12475E10672P4900P1719N6852N8496K2635N239O975k776k3709m0682n5632p1958
12463F12731p4821o4743p4815n4096m7836m5316m2488m9197k7212k455M645K324
12451A36721p819k9676p747K131J2390j096j6380L507J2984q702n692N56K007
12438I3184J0069L557m015l590JP547N763Q87J7841Q072M620o204r928K729Q104
$$ plain form
12423 138637 155119 167977 177001 188026 210911 226441 265249 295809 318061 347687 395115 462618
12411 462618 536554 615478 700267 799606 955625 1153831 1377066 1616832 1909663 2286750
12401 2286750 2841802 3589006 4559731 5683023 6802744 7697161 8183820 8175012 7674807
12392 7674807 6837999 5872275 4957847 4200589 3667781 3367946 3343774 3618320 4211180 5105566
12382 5105566 6174384 7199528 7943292 8227144 7986228 7266681 6188469 5025699 3943949
12373 3943949 3031828 2351603 1856892 1524604 1303561 1146666 1023122 929861 851991 791185
12363 791185 728272 671073 624942 557718 512989 493395 471475 440175 404286 378157 348885
12352 348885 320722 305458 316971 319542 319462 324630 326687 313397 296258 287016 265214 251165 231575
$$ packed form
12423A38637J6482J2858R024J1025K2885J5530L8808L0560K2252K9626M7428O7503
12411D62618P3936P8924Q4789R9339J56019J98206K23235K39766K92831L77087
12401B286750N55052P47204R70725J123292J119721Q94417M86659q808n00205
12392G674807q36808r65724r14428p57258n32808k99835k4172K74546N92860Q94386
12382E105566J068818J025144P43764K83852k40916p19547j078212j162770j081750
12373C943949r12121o80225m94711l32288k21043j56895j23544r3261p7870o0806
12363G91185o2913n7199m6131o7224m4729j9594k1920l1300l5889k6129k9272
12352C48885k8163j5264J1513K571q0N168K057j3290j7139r242k1802j4049j9590
$$ plain form
12339 231575 209011 213948 206113 193438 195060 196097 189595 189090 188051 184786 174471 174852 160669 144960
12325 144960 145146 135027 135029 143899 146707 125786 112403 110225 99998 106755 126146 130217 136440 141126
12311 141126 126441 118705 121830 112274 108644 118883 135548 130720 116855 108409 96098 97916 101597
12298 101597 96184 75692 65222 67032 64380 80682 98039 106811 109218 107140 101596 97269 103631
12285 103631 102244 100140 103072 111302 98421 101855 110223 109802 110826 114203 121668 136548 153421 154458
12271 154458 154766 135668 115650 107487 115803 130716 134840 126008 118309 113211 108848 115576 104241
12258 104241 84234 68802 60608 62094 59558 71552 71692 61738 46799 46092 46894 43053 43062 44157 55650
12243 55650 76322 80657 81303 87896 95533 99322 96668 82233 59983 58178 65828 75166 64295 61637
$$ packed form
12339B31575k2564M937p835j2675J622J037o502n05j039l265j0315L81j4183j5709
12325A44960J86j0119KQ870K808k0921j3383k178j0227O757J9391M071O223M686
12311A41126j4685p736L125r556l630J0239J6665m828j3865q446j2311J818L681
12298A01597n413k0492j0470J810k652J6302J7357Q772K407k078n544m327O362
12285A03631j387k104K932Q230j2881L434Q368m21J024L377P465J4880J6873J037
12271A54458L08j9098k0018q163Q316J4913M124q832p699n098m363O728j1335
12258A04241k0007j5432q194J486k536J1994J40r954j4939p07Q02l841RJ095J1493
12243E5650K0672M335O46O593P637L789k654j4435k2250j805P650R338j0871k658
$$ plain form
12229 61637 62488 64106 66893 60594 43137 38118 49906 50674 52938 39162 42797 38560 29139 31898
12215 31898 38446 33108 31136 35354 16210 2879 2660 11126 10828 10058 9524 19957 17595 23952 15972
12200 15972 13384 4845 7083 8538 -5079 -11866 3361 6290 19474 38815 42071 45818 44068
12187 44068 40275 31175 24336 13038 3495 -2857 7783 10608 3324 9355 21870 18518 19542 26173
12173 26173 17397 11264 12932 10552 3679 16930 27204 35745 40029 42474 33678 55180 93846
12160 93846 118003 125389 121679 129290 144978 159697 173750 185046 189843 184246 173272 169796 166511
12147 166511 166447 149166 136000 124657 99464 88986 72082 59958 47230 31899 29091 28953 20545
12134 20545 21679 31456 27597 24892 6391 8445 1054 13336 17138 21793 27209 36457 36043 31100
$$ packed form
12229F1637Q51J618K787o299j7457n019J1788P68K264j3776L635m237r421K759
12215C1898O548n338j972M218j9144j3331k19Q466k98p70n34J0433k362O357p980
12200A5972k588q539K238J455j3617o787J5227K929J3184J9341L256L747j750
12187D4068l793r100o839j1298r543o352J0640K825p284O031J2515l352J024O631
12173B6173q776o133J668k380o873J3251J0274Q541M284K445q796K1502L8666
12160I3846K4157P386l710P611J5688J4719J4053J1296M797n597j0974l476l285
12147A66511o4j7281j3166j1343k5193j0478j6904j2124j2728j5331k808j38q408
12134B0545J134R777l859k705j8501K054p391J2282L802M655N416R248m14m943
$$ plain form
12120 31100 36858 40578 17761 11460 12378 6601 10015 17388 25586 12583 14938 2169 12360 29420
12106 29420 32996 36872 26979 13616 21284 21166 24023 26814 24224 9715 -10069 239 18351
12093 18351 24167 7961 1069 7299 21224 9796 512 -8431 -2784 -2987 1347 1310 1845 -5456 -14403
12078 -14403 -9023 -8052 -14846 -12777 -6912 4393 9409 4089 -6181 5698 8805 890 -4449 -3676
12064 -3676 -9099 -12380 -501 8271 6019 -1655 -1888 6317 9725 15525 13579 9877 29742 17909
12050 17909 6444 14680 10256 13318 11737 -378 -4624 -211 20676 26285 28868 25703 13696
12037 13696 19106 10743 3055 8931 11522 23071 21595 14450 20378 26555 22143 22737 21094 28423
12023 28423 31639 25528 22017 23340 28796 38706 27388 21402 13532 3203 6616 5001 12260 494
$$ packed form
12120C1100N758L720k2817o301R18n777L414P373Q198j3003K355j2769J0191J7060
12106B9420L576L876r893j3363P668j18K857K791k590j4509j9784J0308J8112
12093A8351N816j6206o892O230J3925j1428r284q943N647k03M334l7N35p301q947
12078a4403N380R71o794K069N865J1305N016n320j0270J1879L107p915n339P73
12064c676n423l281J1879Q772k252p674k33Q205L408N800j946l702J9865j1833
12050A7909j1465Q236m424L062j581j2115m246M413K0887N609K583l165j2007
12037A3696N410q363p688N876K591J1549j476p145N928O177m412N94j643P329
12023B8423L216o111l511J323N456R910j1318n986p870j0329L413j615P259j1766
$$ plain form
12009 494 -1206 12792 7328 8304 19573 16483 4108 -5527 -3538 -1434 2418 3684 16064 27631
11995 27631 27552 13373 2244 2692 6311 341 -10678 -17670 -10310 -9190 -1967 3878 6988 16440
11981 16440 18119 28057 32921 30377 16233 23384 13248 9136 20981 36455 31793 40292 57234
11968 57234 69559 70521 76631 78753 62957 55328 52744 44139 41946 52708 57401 59446 63151 59922
11954 59922 53324 54834 67491 67980 62801 65701 53980 52357 53363 62772 69660 55897 47693 58476
11940 58476 62283 41730 40527 44866 54624 45731 34641 34873 39986 41798 35648 29760 28134 39476
11926 39476 46055 36731 29058 23730 22055 20192 15521 20799 28330 40289 36493 36970 42491 45955
11912 45955 39251 48850 55910 65262 76142 96885 131359 173753 214390 235713 226590 201542 175185
$$ packed form
12009D94j700J3998n464R76J1269l090j2375r635J989K104L852J266J2380J1567
11995B7631p9j4179j1129M48L619n970j1019o992P360J120P223N845L110R452
11981A6440J679R938M864k544j4144P151j0136m112J1845J5474m662Q499J6942
11968E7234J2325R62O110K122j5796p629k584q605k193J0762M693K045L705l229
11954E9922o598J510J2657M89n179K900j1721j623J006R409O888j3763q204J0783
11940E8476L807k0553j203M339R758q893j1090K32N113J812o150n888j626J1342
11926C9476O579r324p673n328j675j863m671N278P531J1959l796M77N521L464
11912D5955o704R599P060R352J0880K0743L4474M2394M0637K1323r123k5048k6357
$$ plain form
11899 175185 155121 155495 163036 175360 197979 212056 210794 201340 175072 140491 97396 69257
11887 69257 54180 50368 48959 48915 32619 23262 24269 28824 16571 12391 22258 26451 33867 34523
11873 34523 38653 35096 23275 24673 45491 49838 46920 39565 41558 44338 43271 49522 56277 56960
11859 56960 49449 36875 37876 35226 32308 33100 18696 -90 -950 7563 4007 -49 -9927 -24186
11845 -24186 -8743 13332 2522 -5508 -5518 -9370 -9064 -5869 5406 8902 3347 -1087 2542 475
11831 475 8682 13714 23986 21903 18385 4068 5124 13138 17232 9055 21245 24457 12327 17956
11817 17956 27255 30670 24204 26453 23663 21829 23437 30075 28093 22895 17340 13215 4211 -6828
11803 -6828 -2970 13357 21612 33496 31829 30201 42128 38392 32880 23268 17054 19470 28092 31325
$$ packed form
11899A75185k0064L74P541J2324K2619J4077j262r454k6268l4581m3095k8139
11887F9257j5077l812j409m4j6296r357J007M555j2253m180R867M193P416O56
11873C4523M130l557j1821J398K0818M347k918p355J993K780j067O251O755O83
11859E6960p511j2574J001k650k918P92j4404j8786q60Q513l556m056r878j4259
11845b4186J5443K2075j0810q030j0l852L06L195J1275L496n555m434L629k067
11831D75Q207N032J0272k083l518j4317J056Q014M094q177J2190L212j2130N629
11817A7956R299L415o466K249k790j834J608O638j982n198n555m125r004j1039
11803f828L858J6327Q255J1884j667j628J1927l736n512r612o214K416Q622L233
$$ plain form
11789 31325 45506 31575 10316 3860 12406 20853 24806 29874 31413 21557 17321 28653 28489 21643
11775 21643 21273 23706 22886 26971 41966 38824 35061 36426 48567 47478 37192 32258 42760 51952
11761 51952 57335 56060 44154 38923 38608 37770 45659 53152 60648 58720 52767 49142 49542 57493 71614
11746 71614 72240 85017 84528 77357 77827 78763 90377 104485 98691 103190 106737 132213 154548 165299
11732 165299 177355 189518 209649 233724 255393 299150 351753 403667 443255 497057 565246
11721 565246 686405 833335 1042380 1351047 1794254 2391403 3131074 3924523 4637189 5103622
11711 5103622 5222743 4978557 4417782 3692627 2930985 2270293 1737568 1360556 1093570
11702 1093570 903250 775364 682003 601213 530595 480415 443131 413697 366679 329620 293441
$$ packed form
11789C1325J4181j3931k1259o456Q546Q447L953N068J539r856m236J1332j64o846
11775B1643l70K433q20M085J4995l142l763J365J2141j089j0286m934J0502R192
11761E1952N383j275j1906n231l15q38P889P493P496j928n953l625M00P951J4121
11746G1614O26J2777m89p171M70R36J1614J4108n794M499L547K5476K2335J0751
11732A65299J2056J2163K0131K4075K1669M3757N2603N1914L9588N3802O8189
11721E65246J21159J46930K09045L08667M43207N97149P39671P93449P12666M66433
11711E103622J19121k44186n60775p25155p61642o60692n32725l77012k66986
11702A093570j90320j27886r3361q0790p0618n0180l7284k9434m7018l7059l6179
$$ plain form
11691 293441 267967 257702 238631 218835 198454 185569 175295 169848 177709 163939 155301 135687
11679 135687 122993 125215 127483 117279 112291 105016 108870 109871 114003 104974 95986 94228 84003
11666 84003 93824 88343 93418 102795 94896 73403 53338 60772 67252 44853 35822 49525 64679
11653 64679 69843 74031 62544 62999 60598 52885 57085 45445 41907 49204 54468 56887 65036 63536
11639 63536 54874 60635 77996 83649 69077 72651 73797 67890 59105 54600 56624 55939 72839 72138
11625 72138 64989 57016 64595 67944 51834 48280 46721 47473 48042 47045 55873 72487 80988 93005
11611 93005 95335 85641 85061 90939 106059 115734 112645 121737 136720 156232 197725 254157 339006
11598 339006 451350 574318 740286 896970 1015455 1067150 1027306 916948 763866 617052
$$ packed form
11691B93441k5474j0265j9071j9796k0381j2885j0274n447P861j3770q638j9614
11679A35687j2694K222K268j0204m988p275L854J001M132r029q988j758j0225
11666H4003R821n481N075R377p899k1493k0065P434O480k2399r031J3703J5154
11653F4679N164M188j1487M55k401p713M200j1640l538P297N264K419Q149j500
11639F3536q662N761J7361N653j4572L574J146n907q785m505K024o85J6900p01
11625G2138p149p973P579L349j6110l554j559P52N69r97Q828J6614Q501J2017
11611I3005K330r694n80N878J5120R675l089R092J4983J9512M1493N6432Q4849
11598C39006J12344J22968J65968J56684J18485N1695l9844j10358j53082j46814
$$ plain form
11588 617052 492651 388728 305788 258592 225920 206296 186978 170743 154245 142895 124187
11577 124187 115408 103358 89819 78953 68750 67492 73290 76837 70776 66490 66319 67943 51618
11564 51618 42258 30469 43066 46580 47011 67663 74310 63192 54654 61813 71430 58936 36948
11551 36948 31984 49417 54025 39246 45620 65190 75715 79909 86354 94791 106117 114193 111597
11538 111597 95764 97241 104665 95767 90031 106633 124654 121909 116105 110416 115361 130247 123997
11525 123997 106625 88368 75684 80654 73689 82202 99188 104559 106774 96543 96189 95833 105125
11512 105125 105656 87728 77270 76428 80215 69645 59831 60707 70634 72826 77862 81212 80666 66983
11498 66983 54970 50340 43080 39127 29317 35333 42697 22664 20492 18943 16011 19727 32187 56906
$$ packed form
11588F17052j24401j03923q2940m7196l2672j9624j9318j6235j6498j1350j8708
11577A24187q779j2050j3539j0866j0203j258N798L547o061m286j71J624j6325
11564E1618r360j1789J2597L514M31K0652O647j1118q538P159R617j2494k1988
11551C6948m964J7433M608j4779O374J9570J0525M194O445Q437J1326Q076k596
11538A11597j5833J477P424q898n736J6602J8021k745n804n689M945J4886o250
11525A23997j7372j8257j2684M970o965Q513J6986N371K215j0231l54l56R292
11512A05125N31j7928j0458q42L787j0570r814Q76R927K192N036L350n46j3683
11498F6983j2013m630p260l953r810O016P364k0033k172j549k932L716J2460K4719
$$ plain form
11484 56906 53154 44213 29745 20358 26685 29961 28664 28275 31131 22002 26219 23746 13711 8669
11470 8669 26846 36078 34328 41331 54109 66651 70414 73614 71335 66833 57623 53914 65030 66400
11456 66400 62079 55359 49628 60696 70487 61134 45881 46139 39715 31567 25000 24382 41004 28435
11442 28435 20645 3775 6984 35484 43000 36817 32770 37569 44777 44034 48705 51751 38213 24062
11428 24062 13979 14949 14007 26026 34349 28224 32905 37938 34370 32552 26584 21305 26098 40706
11414 40706 34963 29818 32262 29184 37222 30581 33344 51493 41261 28798 37645 33587 42404 35406
11400 35406 18364 22172 35980 43803 35143 27772 25167 37556 38373 22719 34268 32098 21414
11387 21414 25061 31544 31074 34032 28078 25927 23292 27636 22560 20320 25090 24175 32619 32082 22506
$$ packed form
11484E6906l752q941j4468r387O327L276j297l89K856r129M217k473j0035n042
11470H669J8177R232j750P003J2778J2542L763L200k279m502r210l709J1116J370
11456F6400m321o720n731J1068R791r353j5253K58o424q148o567o18J6622j2569
11442B8435p790j6870L209K8500P516o183m047M799P208p43M671L046j3538j4151
11428B4062j0083R70r42J2019Q323o125M681N033l568j818n968n279M793J4608
11414D0706n743n145K444l078Q038o641K763J8149j0232j2463Q847m058Q817o998
11400C5406j7042L808J3808P823q660p371k605J2389Q17j5654J1549k170j0684
11387B1414L647O483m70K958n954k151k635M344n076k240M770r15Q444n37r576
$$ plain form
11372 22506 19689 13239 3150 -1486 834 12302 14142 16261 32654 45830 37089 42871 40460
11359 40460 34929 21585 21618 20393 19327 19431 16670 19494 16237 13734 32092 52250 54670 48211
11345 48211 44567 49262 36247 28338 46159 56792 57629 51500 52716 68617 79817 76563 73944
11332 73944 69982 78406 89907 90358 100489 109577 108558 114203 125628 137035 143424 129085 126400
11319 126400 124167 113759 101657 88926 95257 79603 70865 60146 40673 45239 55802 45166
11307 45166 39130 28662 33039 39170 35444 32099 35322 41285 46090 54718 63106 56487 42919 46505
11293 46505 58308 71641 80966 77839 79433 72800 87166 100115 108110 124522 171567 226973 262231
11280 262231 256466 224590 166110 112564 95699 88729 75318 73196 77406 71334 79886 87379 84247
$$ packed form
11372B2506k817o450j0089m636K320J1468J840K119J6393J3176q741N782k411
11359D0460n531j3344L3j225j066J04k761K824l257k503J8358K0158K420o459
11345D8211l644M695j3015p909J7821J0633Q37o129J216J5901J1200l254k619
11332G3944l962Q424J1501M51J0131R088j019N645J1425J1407O389j4339k685
11319A26400k233j0408j2102j2731O331j5654q738j0719j9473M566J0563j0636
11307D5166o036j0468M377O131l726l345L223N963M805Q628Q388o619j3568L586
11293D6505J1803J3333R325l127J594o633J4366J2949P995J6412M7045N5406L5258
11280B62231n765l1876n8480n3546j6865o970j3411k122M210o072Q552P493l132
$$ plain form
11267 84247 78094 76101 90505 96726 84588 74128 78252 76336 82599 106068 110903 116475 122059
11254 122059 126744 135680 123971 125381 131748 123891 100982 94217 96631 84972 82782 75715 77484
11241 77484 82285 70093 51722 49260 74041 78085 86335 74485 68492 65354 54485 54989 49235
11228 49235 40589 33442 25672 42349 59165 51676 55801 61216 59149 61356 65051 65257 57072 50326
11214 50326 47786 42838 50125 61109 60183 54104 46856 50467 47789 46433 41640 44382 55442 60923
11200 60923 66663 74639 75173 77622 82084 85743 88604 80621 67501 63302 56934 42488 45752 62225
11186 62225 68313 66194 74228 85722 81332 93436 86217 66671 60389 63960 56647 44798 46208
11173 46208 38700 46092 57537 47830 36447 24431 32437 40657 38411 46026 56104 54003 53563 58897
$$ packed form
11267H4247o153j993J4404O221j2138j0460M124j916O263K3469M835N572N584
11254A22059M685Q936j1709J410O367p857k2909o765K414j1659k190p067J769
11241G7484M801j2192j8371k462K4781M044Q250j1850n993l138j0869N04n754
11228D9235q646p147p770J6677J6816p489M125N415k067K207L695K06q185o746
11214E0326k540m948P287J0984r26o079p248L611k678j356m793K742J1060N481
11200F0923N740P976N34K449M462L659K861p983j3120m199o368j4446L264J6473
11186F2225O088k119Q034J1494m390J2104p219j9546o282L571p313j1849J410
11173D6208p508P392J1445r707j1383j2016Q006Q220k246P615J0078k101m40N334
$$ plain form
11159 58897 65139 67277 75167 66653 59675 74837 75021 76750 77206 90411 92864 95870 83352 72326
11145 72326 78188 83288 88658 82809 86971 100662 119740 141806 153571 147683 152307 142493 121540
11132 121540 108868 91255 87535 93303 90015 88529 101286 103070 102931 97691 82927 76149 62934
11119 62934 71431 89631 102101 101115 99210 115859 120055 124141 126252 126861 127346 141215 151608 169152
11105 169152 186660 204479 230805 255172 290313 371419 498124 694393 964600 1307007 1628837
11094 1628837 1811944 1784817 1551408 1209548 852284 590578 434873 348081 293253 264824
11084 264824 243191 226856 205547 184492 157916 153055 155239 150784 136053 132774 130175 137039 134628
11071 134628 130180 118919 121802 114061 119443 130844 136819 130345 114399 118628 128534 133665 146078
$$ packed form
11159E8897O242K138P890q514o978J5162J84J729M56J3205K453L006j2518j1026
11145G2326N862N100N370n849M162J3691J9078K2066J1765n888M624r814k0953
11132A21540j2672j7613l720N768l288j486J2757J784j39n240j4764o778j3215
11119F2934Q497J8200J2470r86j905J6649M196M086K111O09M85J3869J0393J7544
11105A69152J7508J7819K6326K4367L5141Q1106J26705J96269K70207L42407L21830
11094A628837J83107k7127k33409l41860l57264k61706j55705q6792n4828k8429
11084B64824k1633j6335k1309k1055k6576m861K184m455j4731l279k599O864k411
11071A34628m448j1261K883p741N382J1401N975o474j5946M229R906N131J2413
$$ plain form
11058 146078 146744 139910 145803 146840 144227 145260 141543 152966 143608 131505 134331 131627 130723 122298
11044 122298 122261 133064 130327 115413 106331 99595 104653 102775 103175 113666 116601 124875 145807 132247
11030 132247 120082 113428 107061 123480 128332 130214 142325 138200 131840 123782 141338 150618 140210
11017 140210 144909 160826 173308 174344 185218 192251 196121 176867 163131 179028 179920 163663 155507
11004 155507 169627 161132 148246 142389 127029 110481 124517 143705 159911 165222 160968 141617
10992 141617 126575 126177 122208 106742 96083 100973 111918 112821 111652 106766 107516 105326 116339 125961
10978 125961 129481 148672 145160 137809 135994 146984 149341 144676 153387 157932 162388 179478 193411
10965 193411 196381 175089 153766 151123 142403 131262 131620 125948 133409 136942 129962 139886 148867 141297
$$ packed form
11058A46078O66o834N893J037k613J033l717J1423r358j2103K826k704r04q425
11044A22298l7J0803k737j4914r082o736N058j878M00J0491K935Q274K0932j3560
11030A32247j2165o654o367J6419M852J882J2111m125o360q058J7556R280j0408
11017A40210M699J5917J2482J036J0874P033L870j9254j3736J5897Q92j6257q156
11004A55507J4120q495j2886n857j5360j6548J4036J9188J6206N311m254j9351
10992A41617j5042l98l969j5466j0659M890J0945R03j169m886P50k190J1013R622
10978A25961L520J9191l512p351j815J0990K357m665Q711M545M456J7090J3933
10965A93411K970k1292k1323k643q720j1141L58n672P461L533o980R924Q981p570
$$ plain form
10951 141297 133572 119828 133629 152600 154388 141386 140537 158908 169075 162857 167987 176474 163596
10938 163596 172075 201521 227926 249475 273621 332108 426582 551066 742692 1073923 1515377
10927 1515377 1968215 2296190 2333107 2085255 1666431 1217821 869274 648326 514267 430079
10917 430079 381738 349396 327046 311891 302055 287499 265244 253860 246615 230165 213726 214138
10905 214138 210982 212829 215254 208734 216592 223271 210019 208505 201255 190766 197672 199659 197222 195080
10891 195080 181484 177230 159536 151630 143306 128196 126231 133011 126193 119120 126991 135705 130982
10878 130982 118605 110591 124007 128942 115948 111902 117210 128440 126197 115789 119360 136371 172837
10865 172837 203603 218282 209368 178721 144372 126703 116049 96505 105148 113336 115719 122003
$$ packed form
10951A41297p725j3744J3801J8971J788j3002q49J8371J0167o218N130Q487j2878
10938A63596Q479K9446K6405K1549K4146N8487R4474J24484J91626L31231M41454
10927A515377M52838L27975L6917k47852m18824m48610l48547k20948j34059q4188
10917D30079m8341l2342k2350j5155r836j4556k2255j1384p245j6450j6439M12
10905B14138l156J847K425o520P858O679j3252j514p250j0489O906J987k437k142
10891A95080j3596m254j7694p906q324j5110j965O780o818p073P871Q714m723
10878A30982j2377q014J3416M935j2994m046N308J1230k243j0408L571J7011L6466
10865A72837L0766J4679q914l0647l4349j7669j0654j9544Q643Q188K383O284
$$ plain form
10853 122003 115198 109279 114266 118837 115332 129684 132411 133583 131719 119048 124579 120438 113381 138584
10839 138584 150344 129973 121302 118938 116074 124919 128305 137197 145522 129346 115977 110140 107192
10826 107192 111635 118277 108679 111707 127528 133401 151184 162732 170983 173790 182701 174202 161301
10813 161301 144483 134272 115773 94196 89414 81435 92934 104992 129119 145119 164195 178335
10801 178335 189316 175441 148623 141537 152880 147137 136381 120795 121478 119398 122927 125077 126306
10788 126306 127877 127947 130912 139025 136493 136575 129622 136657 129187 125558 150296 155400 144833 145071 174800
10773 174800 188418 181528 184271 199032 213509 228854 245532 257748 287145 349277 451082 589036
10761 589036 749255 882171 963479 980030 938250 862516 792767 727757 628651 519397 426896
$$ packed form
10853A22003o805n919M987M571l505J4352K727J172j864j2671N531m141p057K5203
10839A38584J1760k0371q671k364k864Q845L386Q892Q325j6176j3369n837k948
10826A07192M443O642r598L028J5821N873J7783J1548Q251K807Q911q499j2901
10813A61301j6818j0211j8499k1577m782p979J1499J2058K4127J6000J9076J4140
10801A78335J0981j3875k6818p086J1343n743j0756j5586O83k080L529K150J229
10788A26306J571P0K965Q113k532Q2o953P035p470l629K4738N104j0567K38K9729
10773A74800J3618o890K743J4761J4477J5345J6678J2216K9397O2132J01805J37954
10761E89036J60219J32916Q1308J6551m1780p5734o9749o5010r9106j09254r2501
$$ plain form
10750 426896 369957 333175 302991 273943 253903 226386 214329 195534 211357 214696 220740 217007
10738 217007 206255 199473 211983 222608 243363 248894 245154 237739 217895 203451 199371 202060 198208
10725 198208 200629 199952 201534 199454 193881 179367 181859 195771 208562 214510 200308 193646 202040
10712 202040 201827 208124 225350 244904 236004 232922 223732 232413 235836 229773 219536 225437 212950
10699 212950 208135 214366 202985 195945 205007 209920 215442 209781 220847 243914 256947 265628 266688
10686 266688 269763 281339 305260 333294 336488 351485 369864 390596 428305 466615 489170 503788
10674 503788 499506 483350 458863 438904 429288 420505 406963 385715 360854 340134 334271 326358
10662 326358 326977 339850 366823 382879 399050 418858 440826 452650 461638 467942 476189 467931 466488
$$ packed form
10750D26896n6939l6782l0184k9048k0040k7517j2057j8795J5823L339O044l733
10738B17007j0752o782J2510J0625K0755N531l740p415j9844j4444m080K689l852
10725A98208K421o77J582k080n573j4514K492J3912J2791N948j4202o662Q394
10712B02040k13O297J7226J9554q900l082r190Q681L423o063j0237N901j2487
10699B12950m815O231j1381p040R062M913N522n661J1066K3067J3033Q681J060
10686B66688L075J1576K3921K8034L194J4997J8379K0732L7709L8310K2555J4618
10674E03788m282j6156k4487j9959r616q783j3542k1248k4861k0720n863p913
10662C26358O19J2873K6973J6056J6171J9808K1968J1824Q988O304Q247q258j443
$$ plain form
10649 466488 465089 470211 480358 486345 499139 490826 463971 456916 467952 479468 502713 536975
10637 536975 586521 647185 728565 773723 830865 872716 893060 866572 806136 732603 668851
10626 668851 634641 611524 567173 510307 472506 440998 427406 407464 402940 412389 440103 445192
10614 445192 437511 444087 451253 456965 455276 454401 462780 493693 495976 505733 521190 521912 516657 508053
10600 508053 514848 522071 533983 547328 567720 594570 595204 600229 619652 654680 698799 719239
10588 719239 752680 768756 778954 789216 798309 794626 802618 795841 784280 799475 825630 847180
10576 847180 877773 937446 1011960 1083445 1206844 1382622 1603321 1843468 2020339 2069265
10566 2069265 1995218 1849511 1709006 1619348 1573046 1551680 1537103 1532479 1514721 1500934 1485501
$$ packed form
10649D66488j399N122J0147N987J2794q313k6855p055J1036J1516K3245L4262
10637E36975M9546O0664Q1380M5158N7142M1851K0344k6488o0436p3533o3752
10626F68851l4210k3117m4351n6866l7801l1508j3592j9942m524R449K7714N089
10614D45192p681O576P166N712j689q75Q379L0913K283R757J5457P22n255q604
10600E08053O795P223J1912J3345K0392K6850O34N025J9423L5028M4119K0440
10588G19239L3441J6076J0198J0262R093l683P992o777j1561J5195K6155K1550
10576H47180L0593N9673P4514P1485J23399J75778K20699K40147J76871M8926
10566B069265p4047j45707j40505q9658m6302k1366j4577m624j7758j3787j5433
$$ plain form
10555 1485501 1489250 1516980 1574991 1645653 1726001 1824244 1911752 1984804 2065835 2169845 2280060
10544 2280060 2398662 2546591 2681594 2801587 2911898 3013958 3116294 3264971 3444084
10535 3444084 3691967 4023259 4438634 4917923 5434038 5989795 6622436 7394297 8336992
10526 8336992 9388441 10432567 11343014 12060233 12694332 13426394 14502096 16107283 18375827
10517 18375827 21447243 25564753 31224909 39400055 51912688 72271576 106963191 164886097
10509 164886097 247513072 336409002 405817863 427196910 389805115 315099157 227150062
10502 227150062 153895014 106131375 76854416 58396237 46258559 37947840 32036304
10495 32036304 27690168 24403579 21860331 19931140 18555803 17603054 16877739 16190904
$$ packed form
10555A485501L749K7730N8011P0662Q0348R8243Q7508P3052Q1031J04010J10215
10544B280060J18602J47929J35003J19993J10311J02060J02336J48677J79113
10535C444084K47883L31292M15375M79289N16115N55757O32641P71861R42695
10526H336992J051449J044126R10447P17219O34099P32062J075702J605187K268544
10517A8375827L071416M117510N660156Q175146J2512633K0358888L4691615N7922906
10509A64886097Q2626975Q8895930O9408861K1379047l7391795p4705958q7949095
10502B27150062p3255048m7763639k9276959j8458179j2137678q310719n911536
10495C2036304m346136l286589k543248j929191j375337r52749p25315o86835
$$ plain form
10487 16190904 15382141 14505301 13744853 13395176 13751061 14751194 15960245 16881810 16961613
10478 16961613 15993660 14310039 12231481 10306231 8904621 7928563 7211830 6687581 6294273
10469 6294273 5980040 5725545 5511808 5314257 5141441 5013959 4927432 4896313 4902947 4879102
10459 4879102 4784279 4634931 4474887 4293461 4066821 3781611 3498383 3280004 3125787 3034937
10449 3034937 2943040 2874927 2802934 2728163 2649473 2573807 2501957 2419307 2346395 2285709 2235298
10438 2235298 2167914 2106251 2049045 1995252 1952681 1897623 1844648 1782706 1709208 1641737 1582622
10427 1582622 1521024 1488446 1445215 1404871 1391017 1367142 1327250 1311711 1301312 1277993 1255489
10416 1255489 1234363 1217214 1195875 1181330 1174818 1176510 1162954 1153367 1139475 1142410 1166402 1177783
$$ packed form
10487A6190904q08763q76840p60448l49677L55885J000133J209051R21565P9803
10478A6961613r67953j683621k078558j925250j401610r76058p16733n24249l93308
10469F294273l14233k54495k13737j97551j72816j27482q6527l1119O634k3845
10459D879102r4823j49348j60044j81426k26640k85210k83228k18379j54217r0850
10449C034937r1897o8113p1993p4771p8690p5666p1850q2650p2912o0686n0411
10438B235298o7384o1663n7206n3793m2571n5058n2975o1942p3498o7471n9115
10427A582622o1598l2578m3231m0344j3854k3875l9892j5539j0399k3319k2504
10416A255489k1126j7149k1339j4545o512J692j3556r587j3892K935K3992J1381
$$ plain form
10404 1177783 1164795 1139386 1110345 1053071 990646 933831 908791 897022 882758 866055 863543
10393 863543 852782 831493 819118 802868 789147 777775 763980 761305 769655 782177 809737 847236
10381 847236 882030 910017 930585 907083 858030 777295 689043 613940 560188 528669 511602
10370 511602 502060 476059 451955 449124 441270 437337 439626 435785 424963 413096 403099 392322 382277
10357 382277 370240 361364 350925 348633 374415 419560 443095 440900 423254 400898 374408 363198
10345 363198 364717 366098 369844 380353 391482 381331 391893 401951 412186 418637 444024 463941
10333 463941 476824 482190 490056 501338 534020 578124 616656 631722 660460 722066 788293 855378
10321 855378 962579 1125272 1342319 1620738 1934804 2290620 2672378 3060553 3414571 3704614
$$ packed form
10404A177783j2988k5409k9041n7274o2425n6815k5040j1769j4264j6703k512
10393H63543j0761k1289j2375j6250j3721j1372j3795k675Q350J2522K7560L7499
10381H47236L4794K7987K0568k3502m9053q0735q8252p5103n3752l1519j7067
10370E11602r542k6001k4104k831p854l933K289l841j0822j1867r997j0777j0045
10357C82277j2037q876j0439k292K5782M5145K3535k195j7646k2356k6490j1210
10345C63198J519J381L746J0509J1129j0151J0562J0058J0235O451K5387J9917
10333D63941J2883N366P866J1282L2682M4104L8532J5066K8738O1606O6227O7085
10321H55378J07201J62693K17047K78419L14066L55816L81758L88175L54018K90043
$$ plain form
10311 3704614 3887550 3936844 3824915 3603414 3291467 2927728 2548348 2180340 1846089 1563941
10301 1563941 1350151 1204229 1089939 1003803 958020 913360 875788 870056 871291 873427 882186
10290 882186 890620 904955 936848 968761 1011344 1048748 1086379 1137996 1221177 1334390 1490355
10279 1490355 1697703 1948984 2259921 2599217 2921231 3189480 3399392 3531266 3607080 3652991
10269 3652991 3691996 3775345 3983508 4389640 5049147 6078643 7731139 10417411 14728456
10260 14728456 21141573 29367257 37990082 45036013 49227018 49840164 46880790 40847355
10252 40847355 32700907 24381006 17591169 12892169 9892809 7989990 6767189 5964491
10244 5964491 5429222 5097195 4934375 4917158 5058278 5364555 5902615 6731841 7917919
$$ packed form
10311C704614J82936M9294j11929k21501l11947l63739l79380l68008l34251k82148
10301A563941k13790j45922j14290q6136m5783m4660l7572n732J235K136Q759
10290H82186Q434J4335L1893L1913M2583L7404L7631N1617Q3181J13213J55965
10279A490355K07348K51281L10937L39296L22014K68249K09912J31874P5814M5911
10269C652991L9005Q3349K08163M06132O59507J029496J652496K686272M311045
10260A4728456O413117Q225684Q622825P045931M191005O13146k959374o033435
10252D0847355q146448q319901o789837m699000k999360j902819j222801q02698
10244E964491n35269l32027j62820j7217J41120L06277N38060Q29226J186078
$$ plain form
10235 7917919 9474250 11264410 13067028 14596858 15613134 15953612 15574825 14509155
10227 14509155 12886076 10931244 8939580 7167435 5753370 4698497 3920625 3349108
10219 3349108 2938986 2631910 2406562 2239612 2085399 1939504 1807027 1704741 1608873 1511253
10209 1511253 1438755 1380912 1318371 1272008 1234853 1187299 1138725 1115827 1094786 1066899 1048787
10198 1048787 1037759 1026109 1039654 1061051 1110796 1219646 1352451 1497025 1602439 1642170
10188 1642170 1606768 1517342 1370872 1192376 1038083 914424 826102 751826 699583 665166
10178 665166 638845 633113 624977 609601 598601 581991 590961 605708 621591 630465 612618 589398
10166 589398 576175 564391 554389 562278 572555 590374 625572 683174 772034 889231 990035
$$ packed form
10235G917919J556331J790160J802618J529830J016276L40478l78787j065670
10227A4509155j623079j954832j991664j772145j414065j054873p77872n71517
10219C349108m10122l07076k25348j66950j54213j45895j32477j02286r5868r7620
10209A511253p2498n7843o2541m6363l7155m7554m8574k2898k1041k7887j8112
10198A048787j1028j1650J3545K1397M9745J08850J32805J44574J05414L9731
10188A642170l5402q9426j46470j78496j54293j23659q8322p4276n2243l4417
10178F65166k6321n732q136j5376j1000j6610Q970J4747J5883Q874j7847k3220
10166E89398j3223j1784j0002P889J0277J7819L5198N7602Q8860J17197J00804
$$ plain form
10155 990035 1062984 1071115 979793 851686 729220 650739 605138 572142 558426 543497 544681
10144 544681 524864 495347 486332 493070 512541 521192 522097 514692 510652 497297 472387 463477 478365
10131 478365 480952 479631 479355 483709 490353 493663 517286 552720 580795 605010 613389 601683 572122
10118 572122 567060 603859 669133 780892 927187 1105172 1310000 1498928 1652552 1742796
10108 1742796 1767874 1729480 1636222 1489846 1317321 1134565 979105 840730 733570 656727
10098 656727 617383 576970 544899 533276 531853 521285 519232 542370 559656 583673 637886 721859
10086 721859 857232 1091781 1462688 1923741 2358398 2616666 2589081 2292719 1849348 1418844
10076 1418844 1107924 883789 748419 655143 604991 567951 535793 516493 518839 515218 505604
$$ packed form
10155I90035P2949Q131r1322j28107j22466p8481m5601l2996j3716j4929J184
10144E44681j9817k9517r015O738J9471Q651R05p405m040j3355k4910q910J4888
10131D78365K587j321k76M354O644L310K3623L5434K8075K4215Q379j1706k9561
10118E72122n062L6799O5274J11759J46295J77985K04828J88928J53624R0244
10108A742796K5078l8394r3258j46376j72525j82756j55460j38375j07160p6843
10098F56727l9344m0413l2071j1623j423j0568k053K3138J7286K4017N4213Q3973
10086G21859J35373K34549L70907M61053M34657K58268k7585k96362m43371m30504
10076A418844l10920k24135j35370r3276n0152l7040l2158j9300K346l621r614
$$ plain form
10065 505604 510873 527247 529302 523630 513224 509945 490065 477129 468334 471727 494509 521029 523928
10052 523928 529847 521527 500951 491095 507409 522138 551282 595692 629640 663308 671788 693670
10040 693670 708244 706348 716070 722916 724475 740886 763205 784614 799748 818512 856137 902586
10028 902586 983477 1075135 1129822 1147942 1128992 1146127 1197467 1280091 1424726 1623089 1871485
10017 1871485 2179123 2621924 3338679 4548348 6804186 11296588 19891859 30144170
10009 30144170 34295900 32776472 22797539 13403399 8553033 5950703 4447548 3530891
10001 3530891 2924995 2490766 2176597 1943204 1775808 1658459 1549225 1457077 1405236 1389195
9991 1389195 1397002 1380115 1341241 1280781 1182707 1111511 1062640 1044900 1043943 1041903 1039639 1030436 1018470
$$ packed form
10065E05604N269J6374K055n672j0406l279j9880j2936q795L393K2782K6520K899
10052E23928N919q320k0576r856J6314J4729K9144M4410L3948L3668Q480K1882
10040F93670J4574j896R722O846J559J6411K2319K1409J5134J8764L7625M6449
10028I02586Q0891R1658N4687J8120j8950J7135N1340Q2624J44635J98363K48396
10017A871485L07638M42801P16755J209669K255838M492402Q595271J0252311
10009C0144170M151730j519428r978933r394140m850366k602330j503155r16657
10001C530891o05896m34229l14169k33393j67396j17349j09234r2148n1841j6041
9991A389195P807j6887l8874o0460r8074p1196m8871j7740r57k040k264r203j1966
$$ plain form
9978 1018470 1007590 994692 977366 955574 937416 907569 879779 888544 896278 912173 927688 932935
9966 932935 920902 915519 914520 912868 920216 919386 913457 916012 897746 900130 915070 915443 923968 935276
9952 935276 956787 958866 968115 969264 978910 986398 990155 993358 993313 998317 1019378 1015722 1020991 1043984
9938 1043984 1076724 1083422 1088929 1101320 1110219 1113918 1134659 1139490 1147430 1176458 1207243 1233338 1252617
9925 1252617 1274599 1293282 1319881 1342673 1366869 1378171 1404637 1436983 1453064 1469406 1497163
9914 1497163 1531603 1574845 1600246 1630086 1653712 1680922 1712571 1746386 1786695 1834915 1863283
9903 1863283 1906944 1954436 1985529 2041470 2088418 2136465 2170140 2219883 2276057 2343540 2399380
9892 2399380 2460791 2523932 2587780 2657758 2726357 2790796 2855512 2927548 3021438 3120913 3214375
$$ packed form
9978A018470j0880j2898j7326k1792j8158k9847k7790Q765P734J5895J5515N247
9966I32935j2033n383r99j652P348q30n929K555j8266K384J4940L73Q525J1308
9952I35276K1511K079R249J149R646P488L757L203m5N004K1061l656N269K2993
9938A043984L2740O698N507J2391Q899L699K0741M831P940K9028L0785K6095J9279
9925A252617K1982J8683K6599K2792K4196J1302K6466L2346J6081J6342K7757
9914A497163L4440M3242K5401K9840K3626K7210L1649L3815M0309M8220K8368
9903A863283M3661M7492L1093N5941M6948M8047L3675M9743N6174O7483N5840
9892B399380O1411O3141O3848O9978O8599O4439O4716P2036R3890R9475R3462
$$ plain form
9881 3214375 3310730 3397557 3481615 3570432 3659212 3760094 3866710 3999972 4125447 4263158
9871 4263158 4398682 4543397 4684095 4830997 4988539 5164091 5352922 5542451 5734823 5932450
9861 5932450 6155769 6394500 6628476 6873817 7142293 7429637 7724084 8049791 8391906 8729063
9851 8729063 9075778 9447962 9850203 10273724 10714296 11165253 11619604 12106091 12616174 13132075
9841 13132075 13664331 14214817 14790564 15394750 16005139 16626196 17239899 17848736 18454694
9832 18454694 19038499 19594598 20105176 20585060 21002733 21345610 21631953 21868787 22049629
9823 22049629 22166266 22221473 22192578 22079962 21908787 21667007 21371353 21007752 20585988 20130685
9813 20130685 19643102 19137160 18604574 18060605 17517770 16960629 16410305 15855954 15315073
$$ packed form
9881C214375R6355Q6827Q4058Q8817Q8780J00882J06616J33262J25475J37711
9871D263158J35524J44715J40698J46902J57542J75552J88831J89529J92372J97627
9861E932450K23319K38731K33976K45341K68476K87344K94447L25707L42115L37157
9851H729063L46715L72184M02241M23521M40572M50957M54351M86487N10083N15901
9841A3132075N32256N50486N75747O04186O10389O21057O13703O08837O05958
9832A8454694N83805N56099N10578M79884M17673L42877K86343K36834J80842
9823B2049629J16637N5207k8895j12616j71175k41780k95654l63601m21764m55303
9813B0130685m87583n05942n32586n43969n42835n57141n50324n54351n40881
$$ plain form
9804 15315073 14764987 14198130 13665965 13154409 12658699 12191267 11734518 11286220 10855746
9795 10855746 10447140 10061427 9681593 9315016 8973128 8656045 8370545 8082515 7798649
9786 7798649 7531743 7258973 6998086 6758936 6544697 6330931 6125039 5929709 5748125 5572283
9776 5572283 5396974 5235458 5068930 4897928 4745241 4596079 4460616 4352805 4241095 4126258
9766 4126258 4011075 3905933 3813882 3729131 3618339 3514777 3434300 3352970 3262514 3160539
9756 3160539 3080537 3003128 2922317 2859483 2794930 2725145 2648045 2589149 2521224 2458191 2394762
9745 2394762 2347134 2283923 2231907 2183421 2155270 2116683 2065942 2005622 1955355 1928955 1901356
9734 1901356 1863773 1816623 1772044 1740185 1706908 1671724 1634439 1608848 1572126 1541859 1520759
$$ packed form
9804A5315073n50086n66857n32165n11556m95710m67432m56749m48298m30474
9795A0855746m08606l85713l79834l66577l41888l17083k85500k88030k83866
9786G798649k66906k72770k60887k39150k14239k13766k05892j95330j81584j75842
9776E572283j75309j61516j66528j71002j52687j49162j35463j07811j11710j14837
9766D126258j15183j05142r2051q4751j10792j03562q0477q1330r0456j01975
9756C160539q0002p7409q0811o2834o4553o9785p7100n8896o7925o3033o3429
9745B394762m7628o3211n2016m8486k8151l8587n0741o0320n0267k6400k7599
9734A901356l7583m7150m4579l1859l3277l5184l7285k5591l6722l0267k1100
$$ plain form
9723 1520759 1493855 1456193 1431629 1401121 1374334 1344983 1323130 1301112 1286331 1270032 1235694
9712 1235694 1206710 1182537 1165043 1145839 1132106 1108394 1085307 1056345 1028864 1019695 1009977 1006656
9700 1006656 987770 966791 939723 920582 905810 892396 882105 866861 834539 826274 823631 814861
9688 814861 809043 800557 779905 765033 749797 722840 716461 719976 714156 708046 686601 663920 651285
9675 651285 652654 645935 630608 613520 598549 601255 602678 597075 590175 571580 551036 539316 536445
9662 536445 534278 524985 526691 541534 537624 512030 508131 511229 521536 535363 542478 551006 559016
9649 559016 559117 564565 558837 546731 534200 516317 495906 470261 446924 430296 435387 427703 415614
9636 415614 402944 388068 385805 357984 354620 354575 346943 348541 344446 326752 319854 329986 336236 320119
$$ packed form
9723A520759k6904l7662k4564l0508k6787k9351k1853k2018j4781j6299l4338
9712A235694k8984k4173j7494j9204j3733k3712k3087k8962k7481r169r718l321
9700A006656j8886k0979k7068j9141j4772j3414j0291j5244l2322q265k643q770
9688H14861n818q486k0652j4872j5236k6957o379L515n820o110k1445k2681j2635
9675F51285J369o719j5327j7088j4971K706J423n603o900j8595k0544j1720k871
9662E36445k167r293J706J4843l910k5594l899L098J0307J3827P115Q528Q010
9649E59016J01N448n728j2106j2531j7883k0411k5645k3337j6628N091p684j2089
9636D15614j2670j4876k263k7821l364m5p632J598m095j7694o898J0132O250j6117
$$ plain form
9622 320119 315955 302983 294080 298118 302676 308441 302115 289339 279603 274862 291487 294303 308213
9609 308213 309017 317832 332211 350002 350914 332127 325363 326407 313604 298486 271125 254593 240306
9596 240306 227448 229122 219835 210002 217601 221552 220314 217461 220405 217814 205130 187262 178210 182271
9582 182271 188625 196695 205868 205597 194283 186499 181242 173597 162378 164467 179983 183034 158902 150549
9568 150549 161106 176497 176664 168479 169764 167673 160653 150824 148848 156017 150101 148220 147461 138065
9554 138065 140301 151527 161228 166737 154414 134611 132349 127995 131997 121892 117369 123222 130428
9541 130428 135298 133818 128665 123201 126628 123480 132717 132681 133091 139787 132425 122081 120742 114627 99712
9526 99712 108118 112792 108379 108558 114671 96859 87533 105068 111486 104501 99179 101296 99209 104078
$$ packed form
9622C20119m164j2972q903M038M558N765o326j2776r736m741J6625K816J3910
9609C08213Q04Q815J4379J7791R12j8787o764J044j2803j5118k7361j6532j4287
9596B40306j2858J674r287r833P599L951j238k853K944k591j2684j7868r052M061
9582A82271O354Q070R173k71j1314p784n257p645j1219K089J5516L051k4132q353
9568A50549J0557J5391J67q185J285k091p020r829j976P169n916j881p59r396
9554A38065K236J1226R701N509j2323j9803k262m354M002j0105m523N853P206
9541A30428M870j480n153n464L427l148R237l6M10O696p362j0344j339o115j4915
9526I9712Q406M674m413J79O113j7812r326J7535O418o985n322K117k087M869
$$ plain form
9512 104078 97135 97127 87002 77160 68248 64592 69061 73321 81959 88310 102445 104476 93450 90789
9498 90789 90194 84472 74123 84104 99383 106069 105856 97734 90332 91322 87011 76764 66023 54538
9484 54538 44649 51468 58826 67677 69967 74316 71701 64487 72481 80137 79204 87700 81392 71146 65875
9469 65875 72236 77615 82298 81698 81499 74969 59290 56404 62368 72293 63866 64137 76036 82172 100060
9454 100060 91286 70700 49839 55480 73185 71246 65592 59751 60831 57849 55841 53425 51933 53590
9440 53590 55881 69202 75549 69845 54214 49073 50153 46563 42499 48075 54281 40830 34691 39598
9426 39598 43750 45021 39808 51541 54421 50242 51524 49166 45202 37346 37166 40797 43223 48688 47710
9411 47710 44335 49906 66208 55327 44160 38425 30203 24738 27192 25108 42549 46770 34695
$$ packed form
9512A04078o943qj0125r842q912l656M469M260Q638O351J4135K031j1026k661
9498I0789n95n722j0349R981J5279O686k13q122p402R90m311j0247j0741j1485
9484E4538r889O819P358Q851K290M349k615p214P994P656r33Q496o308j0246n271
9469F5875O361N379M683o00j99o530j5679k886N964R925q427K71J1899O136J7888
9454A00060q774k0586k0861N641J7705j939n654n841J080k982k008k416j492J657
9440E3590K291J3321O347n704j5631n141J080l590m064N576O206j3451o139M907
9426C9598M152J271n213J1733K880m179J282k358l964p856j80L631K426N465r78
9411D7710l375N571J6302j0881j1167n735q222n465K454k084J7441M221j2075
$$ plain form
9398 34695 32005 30757 36809 52032 49011 39902 26361 27850 24468 30985 35286 31264 34515 32701
9384 32701 17077 19108 27338 23313 24221 17746 29126 41547 36737 33089 35792 36685 41602 37982
9370 37982 37087 44722 41210 40312 41173 38304 38896 50543 56454 68893 68891 61255 60961 54043 55407 50593
9354 50593 60522 47554 45822 51157 48534 50283 51358 45766 56571 63436 60678 61390 55436 39613
9340 39613 27630 44457 47402 47088 48579 51344 54020 43912 28119 42715 52323 57560 60986 58674
9326 58674 53836 53227 61555 71296 75160 77633 70739 63763 48860 50677 58546 72629 82312 84073
9312 84073 79463 73569 61598 60768 60784 65748 74415 83815 71692 66396 68734 83724 88684 85790 80471
9297 80471 78587 80304 69810 67930 77581 82527 69762 49513 48575 52866 52432 52358 59770 62505 57138
$$ packed form
9398C4695k690j248O052J5223l021r109j3541J489l382O517M301m022L251j814
9384C2701j5624K031Q230m025R08o475J1380J2421m810l648K703Q93M917l620
9370C7982q95P635l512q98Q61k869N92J1647N911J2439kp636k94o918J364m814
9354E0593R929j2968j732N335k623J749J075n592J0805O865k758P12n954j5823
9340C9613j1983J6827K945l14J491K765K676j0108j5793J4596R608N237L426k312
9326E8674m838o09Q328R741L864K473o894o976j4903J817P869J4083R683J761
9312H4073m610n894j1971q30J6M964Q667R400j2123n296K338J4990M960k894n319
9297H0471j884J717j0494j880R651M946j2765k0249r38M291m34p4P412K735n367
$$ plain form
9282 57138 49269 53959 58952 49459 48032 39924 50500 63913 51405 53249 70222 78706 78967 73740
9268 73740 77428 91394 96406 103503 111330 122731 127975 130001 132386 130487 125744 129393 119180 118836
9254 118836 127281 112252 88533 76990 72286 65961 64878 58963 68851 77358 84111 85874 87210 92164
9240 92164 72455 56120 54170 49367 54406 49819 46722 49911 48488 46751 53488 57419 61879 54745
9226 54745 62175 71848 60999 67240 74718 72532 65064 60448 76524 87678 78046 87209 93504 81240
9212 81240 85049 88131 90657 84984 81785 63923 62158 67629 57312 59120 87752 90574 86915 79865
9198 79865 70065 68034 61385 50598 55099 47030 43133 38115 40568 39787 30386 17552 4910 837
9184 837 16444 30293 35814 27677 7821 -4196 662 12351 29418 19590 12209 27778 36697
$$ packed form
9282E7138p869M690M993r493j427q108J0576J3413j2508J844J6973Q484K61n227
9268G3740L688J3966N012P097P827J1401N244K026K385j899m743L649j0213l44
9254A18836Q445j5029k3719j1543m704o325j083n915R888Q507O753J763J336M954
9240I2164j9709j6335j950m803N039m587l097L189j423j737O737L931M460p134
9226E4745P430R673j0849O241P478k186p468m616J6076J1154r632R163O295j2264
9212H1240L809L082K526n673l199j7862j765N471j0317J808K8632K822l659p050
9198G9865r800k031o649j0787M501q069l897n018K453p81r401j2834j2642m073
9184H37J5607J3849N521q137j9856j2017M858J1689J7067r828p381J5569Q919
$$ plain form
9171 36697 33210 22097 31524 34924 24752 24455 32065 43496 50720 46151 41727 53945 61413 68403
9157 68403 67253 59472 56349 40720 31796 11654 22581 29244 35234 40436 23956 12233 17891
9144 17891 22407 20459 12054 2483 3926 15924 33776 35415 22226 31060 38555 38439 30660 25361
9130 25361 19093 6980 12752 29216 27626 41844 29271 14060 18977 19957 7505 2691 16894
9117 16894 24677 15886 -4087 -9182 1764 7815 -1703 7658 14669 4259 -7497 890 6135 13475
9103 13475 12763 27617 17278 24856 23574 11864 7945 6337 -6190 -1451 15128 31855 50428
9090 50428 49287 36112 27672 19233 8887 7567 21183 32392 32920 25481 23310 19109 19085 26518
9076 26518 23234 13880 990 -2710 -7530 -12360 -12112 -16491 -7671 -375 5197 9808 5936 12323 28626
$$ packed form
9171C6697l487j1113R427L400j0172k97P610J1431P224m569m424J2218P468O990
9157F8403j150p781l123j5629q924k0142J0927O663N990N202j6480j1723N658
9144A7891M516j948q405r571J443J1998J7852J639j3189Q834P495j16p779n299
9130B5361o268j2113N772J6464j590J4218j2573j5211M917R80j2452m814J4203
9117A6894P783q791j9973n095J0946O051r518R361P011j0410j1756Q387N245P340
9103A3475p12J4854j0339P578j282j1710l919j608j2527M739J6579J6727J8573
9090E0428j141j3175q440q439j0346j320J3616J1209N28p439k171m201k4P433
9076B6518l284r354j2890l700m820m830K48m379Q820P296N572M611l872O387J6303
$$ plain form
9061 28626 15558 17532 11939 2502 -604 12447 16014 13139 12130 6133 12849 9411 21060 14981
9047 14981 22593 39728 34188 31247 31271 29165 19764 21402 40038 46194 44271 52280 64017 63339 51134
9032 51134 41449 42670 43078 40486 34806 38403 28157 17140 19974 24226 47534 64371 34671 6870
9018 6870 5475 13121 8891 13163 12382 -2265 8114 26398 47442 47278 35323 41132 39823 40877
9004 40877 39029 43365 47070 47160 51965 47891 44863 46623 53113 44059 33017 38408 43376 47419 76804
8989 76804 102513 119750 124281 112388 103222 106060 95228 80634 71014 55716 37534 40879 40835
8976 40835 31390 37899 39598 54155 58949 63234 63462 61533 60844 65366 65051 63965 54126 59509 46380
8961 46380 42787 31974 33067 47416 48605 56446 56570 43672 56103 50617 42326 42632 39096 31187
$$ packed form
9061B8626j3068J974n593r437l106J3051L567k875j009n997O716l438J1649o079
9047A4981P612J7135n540k941K4k106r401J638J8636O156j923Q009J1737o78j2205
9032E1134r685J221M08k592n680L597j0246j1017K834M252K3308J6837k9700k7801
9018F870j395P646m230M272p81j4647J0379J8284K1044j64j1955N809j309J054
9004D0877j848M336L705R0M805m074l028J760O490r054j1042N391M968M043K9385
8989G6804K5709J7237M531j1893r166K838j0832j4594r620j5298j8182L345m4
8976D0835r445O509J699J4557M794M285K28j929o89M522l15j086r839N383j3129
8961D6380l593j0813J093J4349J189P841J24j2898J2431n486q291L06l536p909
$$ plain form
8947 31187 25946 37982 45201 34799 35109 49696 62845 78725 70791 76901 86327 90625 100822
8934 100822 97705 81210 60366 61806 70371 63458 52384 50718 62643 59808 52608 46396 47330 54416
8920 54416 61234 55519 50682 51610 42090 46647 44700 44182 42971 44979 39580 46181 53506 45841 38272
8905 38272 50548 48222 35815 28579 25316 14440 9726 24193 21884 31531 49990 61506 65435
8892 65435 57003 61529 65597 76488 93442 83832 66897 60022 54371 49283 44608 48747 51979 38517
8878 38517 31470 36091 31310 24122 23579 21597 31624 40724 42048 39834 42089 47014 41995 44147 42587
8863 42587 36025 32051 28010 27749 37324 54348 47342 30868 20843 32172 47806 44704 37946 35774
8849 35774 53442 71166 73194 68908 67525 55899 46749 67425 86701 98951 102010 94999 87903
$$ packed form
8947C1187n241J2036P219j0402L10J4587J3149J5880p934O110R426M298J0197
8934A00822l117j6495k0844J440Q565o913j1074j666J1925k835p200o212R34P086
8920E4416O818n715m837R28r520M557j947n18j211K008n399O601P325p665p569
8905C8272J2276k326j2407p236l263j0876m714J4467k309R647J8459J1516L929
8892F5435q432M526M068J0891J6954r610j6935o875n651n088m675M139L232j3462
8878C8517p047M621m781p188n43j982J0027R100J324k214K255M925n019K152j560
8863D2587o562l974m041k61R575J7024p006j6474j0025J1329J5634l102o758k172
8849C5774J7668J7724K028m286j383j1626r150K0676J9276J2250L059p011p096
$$ plain form
8836 87903 83689 79689 76321 73397 60348 51240 53703 59718 63482 83203 82551 78357 69580 60295
8822 60295 65041 74279 69017 68400 57578 58642 58662 64354 60634 58501 66660 75834 71043 64898 62133
8807 62133 58102 61580 79450 86646 88124 65826 66450 82675 91803 91661 101598 112037 95872 83547
8793 83547 78358 77578 85677 86395 77826 71562 77651 73941 76161 85860 79609 86095 99035 97294 88166
8778 88166 93193 102701 108518 95201 92075 91933 83491 87244 86790 89566 73370 64135 59768 68087 74195
8763 74195 76296 56772 47071 54461 54905 61014 62134 70171 87193 94822 92267 99165 99500 98293 93239
8748 93239 97074 97739 103863 113201 112637 104430 116599 114795 91461 77238 73258 83552 93427 89843
8734 89843 89075 97271 104768 110783 112790 100487 95482 102609 101982 88986 87362 67806 56982 67202
$$ packed form
8836H7903m214m000l368k924j3049r108K463O015L764J9721o52m194q777r285
8822F0295M746R238n262o17j0822J064K0N692l720k133Q159R174m791o145k765
8807F2133m031L478J7870P196J478k2298O24J6225R128j42R937J0439j6165j2325
8793H3547n189p80Q099P18q569o264O089l710K220R699o251O486J2940j741r128
8778H8166N027R508N817j3317l126j42q442L753m54K776j6196r235m367Q319O108
8763G4195K101j9524r701P390M44O109J120Q037J7022P629k555O898L35j207n054
8748I3239L835O65O124R338n64q207J2169j804k3334j4223l980J0294R875l584
8734H9843p68Q196P497O015K007j2303n005P127o27j2996j624j9556j0824J0220
$$ plain form
8720 67202 74131 79568 64733 53514 43010 46167 37292 24605 38252 73467 81395 77963 69061
8707 69061 72398 65008 57758 57640 52956 54847 55127 65644 74642 71510 75053 75084 73270 65751 70626
8692 70626 60694 49239 50867 50139 49212 69405 75236 63260 68382 74012 66141 59784 60584 55256 72819
8677 72819 73849 59892 56180 52699 49134 50832 41367 39351 32718 21790 21624 25503 33927 38181
8663 38181 43520 42512 50123 60310 54086 53128 52076 42411 46467 54086 61203 51715 41091 49768
8649 49768 55857 61878 63351 65419 81875 79851 76948 80106 87882 86031 86763 77435 65025 68239
8635 68239 66428 58055 60242 53148 55130 44504 47050 49488 56105 67081 69237 70357 72892 81151
8621 81151 102272 116908 127571 134704 128010 98700 77127 63018 46608 40114 49402 52805 55620
$$ packed form
8720F7202O929N437j4835j1219j0504L157q875j2687J3647L5215P928l432q902
8707F9061L337p390p250j18m684J891K80J0517Q998l132L543L1j814p519M875
8692G0626r932j1455J628p28r27K0193N831j1976N122N630p871o357Q00n328J7563
8677G2819J030j3957l712l481l565J698r465k016o633j0928j66L879Q424M254
8663C8181N339j008P611J0187o224r58j052r665M056P619P117r488j0624Q677
8649D9768O089O021J473K068J6456k024k903L158P776j851P32r328j2410L214
8635F8239j811q373K187p094J982j0626K546K438O617J0976K156J120K535Q259
8621H1151K1121J4636J0663P133o694k9310k1573j4109j6410o494R288L403K815
$$ plain form
8608 55620 72233 82985 79754 82094 74909 57786 52352 48308 45111 37146 29546 24899 24248 27749
8594 27749 32630 23586 28697 27479 20186 23841 19405 16739 36594 55078 64006 59793 52599 46535
8580 46535 48956 49606 48341 40701 58100 50805 52761 61874 76644 80733 68203 50255 61691 65015
8566 65015 63087 68098 72484 80508 79238 96934 96403 93717 91567 95951 95484 86771 64999 49712
8552 49712 41235 30966 40819 46863 48300 49338 46651 44965 38802 25612 20184 21171 30471 32870
8538 32870 38944 36219 30490 22207 37654 31474 16052 18710 26632 29263 33357 28568 24584 21593
8524 21593 30710 28700 18863 10374 21743 24775 22385 12630 8624 20810 33141 38420 28164 25368
8510 25368 16550 23998 17581 7641 3129 12371 22312 26000 24775 20324 16992 18537 7734 6977 12080
$$ packed form
8608E5620J6613J0752l231K340p185j7123n434m044l197p965p600m647o51L501
8594B7749M881r044N111j218p293L655m436k666J9855J8484Q928m213p194o064
8580D6535K421O50j265p640J7399p295J956R113J4770M089j2530j7948J1436L324
8566F5015j928N011M386Q024j270J7696n31k686k150M384m67q713k1772j5287
8552D9712q477j0269R853O044J437J038k687j686o163j3190n428R87R300K399
8538C2870O074k725n729q283J5447o180j5422K658P922K631M094m789l984k991
8524B1593R117k010r837q489J1369L032k390r755m006J2186J2331N279j0256k796
8510B5368q818P448o417r940m512R242R941L688j225m451l332J545j0803p57N103
$$ plain form
8495 12080 8322 5465 17722 13753 5597 -1249 -1928 -11321 -27702 -19995 -18125 -14201 3176 12112
8481 12112 14580 25037 22119 8662 6546 470 -10360 -14717 -2415 -13107 -24336 -23973 -10613
8468 -10613 1200 -6487 -6130 -16409 -3046 -3803 5555 1514 9233 11024 2851 2161 11025 7190 1617
8453 1617 -3408 611 10834 11833 24025 23313 9896 860 -5829 -5828 8708 15914 7759 -2248 -9193
8438 -9193 -1080 636 -385 -9246 -7530 -1132 6738 180 -2485 2381 8947 6362 5263 1849 6990
8423 6990 5861 -11053 -10244 -17502 -6783 9519 11675 4531 5942 5257 -1795 -5069 -5818 -11815 -18820
8408 -18820 -12398 -2902 6486 8002 16063 14477 10367 9447 5208 3332 11213 19725 17456 5287 -8536
8393 -8536 -9892 -4461 -2691 -715 32 -4391 7149 -9044 -20350 -19594 -16697 -15669 -19458 -16390 -10135
$$ packed form
8495A2080l758k857J2257l969q156o846o79r393j6381P707J870L924J7377Q936
8481A2112K468J0457k918j3457k116o076j0830m357J2302j0692j1229L63J3360
8468a0613J1813p687L57j0279J3363p57R358m041P719J791q173o90Q864l835n573
8453A617n025M019J0223R99J2192p12j3417r036o689JJ4536P206q155j0007o945
8438i193Q113J716j021q861J716O398P870o558k665M866O566k585j099l414N141
8423F990j129j6914Q09p258J0719J6302K156p144J411o85p052l274p49n997p005
8408a8820O422R496R388J516Q061j586m110r20m239j876P881Q512k269j2169j3823
8393h536j356N431J770J976P47m423J1540j6193j1306P56K897J028l789L068O255
$$ plain form
8378 -10135 -10409 -23406 -34562 -37478 -25063 -11888 -1592 12703 3318 -6925 3939 10543 11310
8365 11310 29279 36521 35391 43573 47037 43850 37128 23796 11256 -2772 1901 25085 32489
8352 32489 34784 28696 21458 13819 27047 32918 25339 24502 25167 9693 -1259 1071 5059 -4153
8338 -4153 -9321 -10528 -15989 -14464 -4079 16213 24618 12034 -578 -5163 -4168 5703 4642 -7951
8324 -7951 -4306 10106 -2342 -16314 -18293 -7866 7166 21597 38254 38345 24639 5393 82
8311 82 954 2303 3526 -635 -98 -3776 -3518 -4633 -14135 -14582 448 10592 12062 19715 28284 24468
8295 24468 13875 -2310 -11937 -9356 -17132 -25798 -3045 4323 1499 7990 -3220 -17382 -17008 -4530
8281 -4530 4500 3433 -7591 -7811 4991 8619 2786 -11963 -9638 -1628 1699 -187 -10998 -2805
$$ packed form
8378a0135k74j2997j1156k916J2415J3175J0296J4295r385j0243J0864O604P67
8365A1310J7969P242j130Q182L464l187o722j3332j2540j4028M673K3184P404
8352C2489K295o088p238p639J3228N871p579q37O65j5474j0952K330L988r212
8338d153n168j207n461J525J0385K0292Q405j2584j2612m585R95R871j061j2593
8324g951L645J4412j2448j3972j979J0427J5032J4431J6657R1j3706j9246n311
8311H2Q72J349J223m161N37l678K58j115r502m47J5030J0144J470P653Q569l816
8295B4468j0593j6185r627K581p776q666K2753P368k824O491j1210j4162L74J2478
8281d530R030j067j1024k20J2802L628n833j4749K325Q010L327j886j0811Q193
$$ plain form
8267 -2805 -5792 -1755 -2006 -5961 873 -3751 -10228 -13438 -6744 4216 16362 20850 13118 -6108
8253 -6108 -6789 -2095 14138 20553 25578 29785 13360 -2657 -12423 -13548 -12125 -10996 -10452 -1834 5329
8238 5329 9760 10611 13209 17199 2141 -8820 -14460 -4491 1795 12018 11010 -9380 -28100 -31672
8224 -31672 -23865 -6443 15087 23413 12313 15 -2676 -2856 -19384 -20365 -7855 3254 -189
8211 -189 -4479 964 4177 2163 3960 5532 6135 7743 21359 15962 -984 -11466 7577 8754
8197 8754 -547 -3702 654 13251 21442 27942 45337 43135 43281 37739 29369 23911 8172 -5454
8183 -5454 -4724 221 9908 16415 24004 33479 51303 57128 49760 39506 22717 5998 6756 17643
8169 17643 15845 15244 16931 11705 1583 -16536 -25846 -17677 -2896 -2499 -11694 -11 6220 5930
$$ packed form
8267b805k987M037k51l955O834m624o477l210O694J0960J2146M488p732j9226
8253f108o81M694J6233O415N025M207j6425j6017r766j125J423J129N44Q618P163
8238E329M431Q51K598L990j5058j0961n640R969O286J0223j008k0390j8720l572
8224c1672P807J7422K1530Q326j1100j2298k691j80j6528r81J2510J1109l443
8211a89m290N443L213k014J797J572O03J608J3616n397j6946j0482J9043J177
8197H754r301l155M356J2597Q191O500J7395k202J46n542q370n458j5739j3626
8183e454P30M945R687O507P589R475J7824N825p368j0254j6789j6719P58J0887
8169A7643j798o01J687n226j0122j8119r310Q169J4781L97r195J1683O231k90
$$ plain form
8155 5930 10211 7350 889 8370 7236 8287 22172 34878 35617 20602 17284 21384 21176 16113 10328
8140 10328 8546 2596 3210 14847 26312 32257 49335 65106 55457 56842 58484 46909 45015 49952
8126 49952 41328 34868 33162 35636 33147 36592 43721 26607 28171 19815 31440 39107 56347 60291
8112 60291 63406 74365 81902 100786 120038 159461 185821 193695 206612 207123 209819 196749 186580
8099 186580 192758 192988 191337 202020 195642 177779 167016 157772 151895 167215 192776 205706 203507
8086 203507 186912 170574 153763 131989 105577 84004 68631 72556 76756 69344 71307 70118 67790
8073 67790 68541 68619 58209 55102 62963 84363 103172 112736 122477 139525 163920 211718 268540 321473
8059 321473 360905 372240 359490 335722 319439 319095 319318 332848 353333 362675 351888 322460 295392
$$ packed form
8155E930M281k861o461P481j134J051J3885J2706P39j5015l318M100k08n063n785
8140A0328j782n950O14J1637J1465N945J7078J5771r649J385J642j1575j894M937
8126D9952q624o460j706K474k489L445P129j7114J564q356J1625P667J7240L944
8112F0291L115J0959P537J8884J9252L9423K6360P874J2917N11K696j3070j0169
8099A86580O178K30j651J0683o378j7863j0763r244n877J5320K5561J2930k199
8086B03507j6595j6338j6811k1774k6412k1573j5373L925M200p412J963j189k328
8073F7790P51P8j0410l107P861K1400J8809R564R741J7048K4395M7798N6822N2933
8059C21473L9432J1335j2750k3768j6283l44K23J3530K0485R342j0787k9428k7068
$$ plain form
8046 295392 270739 261745 258636 280580 322030 338844 323081 293133 263722 228173 181764 144428
8034 144428 134879 120355 116053 124145 152268 177328 193051 210040 196046 173987 167740 159003 137781
8021 137781 135955 134139 135339 130937 148523 166310 174541 178975 186407 194711 208944 212868 208927 213025
8007 213025 215801 214318 206632 202515 198033 210853 212824 217926 227492 259944 316046 367545 416827
7994 416827 438988 409370 345916 292819 255475 224591 195580 182135 181652 185086 203388 224185
7982 224185 235733 243912 263906 255745 226725 199998 185423 165282 149883 145735 139166 127815
7970 127815 132936 130829 115888 104340 95941 92205 92719 87304 96806 92227 75256 68535 71397 87107
7956 87107 102519 107640 118690 135509 142102 152796 167249 179785 171496 164530 150878 134138 113676
$$ packed form
8046B95392k4653q994l109K1944M1450J6814j5763k9948k9411l5549m6409l7336
8034A44428r549j4524m302Q092K8123K5060J5723J6989j3994k2059o247q737k1222
8021A37781j826j816J200m402J7586J7787Q231M434P432Q304J4233L924l941M098
8007B13025K776j483p686m117m482J2820J971N102R566L2452N6102N1499M9282
7994D16827K2161k9618o3454n3097l7344l0884k9011j3445m83L434J8302K0797
7982B24185J1548Q179J9994q161k9020k6727j4575k0141j5399m148o569j1351
7970A27815N121k107j4941j1548q399l736N14n415R502m579j6971o721K862J5710
7956H7107J5412N121J1050J6819O593J0694J4453J2536q289o966j3652j6740k0462
$$ plain form
7943 113676 97362 104368 121140 119072 94086 89032 93215 104120 121047 135449 159363 158404 147873
7930 147873 127761 128917 117607 110991 103876 112251 111493 98749 86144 85201 91299 78164 71945 62813
7916 62813 60654 64412 62193 58149 58591 55908 49255 50838 50604 44054 39478 42228 41702 35681 26730
7901 26730 12223 27068 40943 43664 50227 42745 42791 41140 27591 35471 47077 46334 27268 30449
7887 30449 35253 31359 27477 26857 27953 40376 56334 56590 35465 43685 49440 43960 36067 33174
7873 33174 45825 44979 44190 43882 35435 28429 24827 29959 41028 47022 43639 33768 31473 33839 23710
7858 23710 28191 31066 16939 17585 22590 19330 28399 32728 18312 22368 19624 16178 20356 18949
7844 18949 13060 16720 19623 10565 9532 5316 4018 5909 -2892 -4551 -4139 -3345 7238 30541 31696
$$ packed form
7943A13676j6314P006J6772k068k4986n054M183J0905J6927J4402K3914r59j0531
7930A47873k0112J156j1310o616p115Q375p58j2744j2605r43O098j3135o219r132
7916F2813k159L758k219m044M42k683o653J583k34o550m576K750n26o021q951
7901B6730j4507J4845J3875K721O563p482M6j651j3549P880J1606p43j9066L181
7887C0449M804l894l882o20J096J2423J5958K56k1125Q220N755n480p893k893
7873C3174J2651q46p89l08q447p006l602N132J1069N994l383r871k295K366j0129
7858B3710M481K875j4127O46N005l260R069M329j4416M056k744l446M178j407
7844A8949n889L660K903r058j033m216j298J891q801j659M12P94J0583K3303J155
$$ plain form
7829 31696 18629 15576 20722 26884 9471 -1643 -2634 2042 13815 19563 21560 19845 13308 12716
7815 12716 16833 14302 5577 12254 11569 3063 8598 11339 4310 7987 16437 17898 18132 24142 27063
7800 27063 22732 19570 35286 26746 18101 31518 30169 15639 3356 -6355 -15389 -11923 -15334 -6824
7786 -6824 -15788 -24026 -11361 9537 14170 9335 7164 -4913 -6597 -1004 1087 8555 8472 12654 12359
7771 12359 6731 -1455 -9326 -16812 -10101 -1059 7269 2197 -7562 -6952 1975 12188 10116 7421 58
7756 58 -10685 -8092 -14799 -8668 -6917 3174 12877 18985 13460 20382 15197 21876 28602 17365 9584
7741 9584 13623 16696 30138 35425 34088 33510 32606 32751 23464 13467 4442 -5637 -3697 -7485 -11555
7726 -11555 -2508 20974 21656 13370 2742 -19917 -26631 -32800 -18961 -2201 -3732 -4333 1494 17419
$$ packed form
7829C1696j3067l053N146O162j7413j1114r91M676J1773N748J997j715o537n92
7815A2716M117k531q725O677o85q506N535K741p029L677Q450J461K34O010K921
7800B7063m331l162J5716q540q645J3417j349j4530j2283r711r034L466l411Q510
7786f824q964q238J2665K0898M633m835k171j2077j684N593K091P468q3M182k95
7771A2359n628q186p871p486O711R042Q328n072r759O10Q927J0213k072k695p363
7756E8j0743K593o707O131J751J0091R703O108n525O922n185O679O726j1237p781
7741I584M039L073J3442N287j337n78r04J45r287r997r025j0079J940l788m070
7726a1555R047K3482O82q286j0628k2659o714o169J3839J6760j531o01N827J5925
$$ plain form
7712 17419 18649 13427 10006 11244 11930 2597 6128 12703 19603 12585 -11057 -6408 6537 -1033
7698 -1033 -994 12072 19465 41285 41246 40859 35858 46422 49807 50499 44939 42996 22733 3233 -10848
7683 -10848 -12337 -19038 -19381 -9434 -9335 -1989 2860 840 -14475 -22202 -12869 -13177 -7513 -11531 -10527
7668 -10527 -3846 -1855 -10862 1438 2885 -2030 3024 -1961 -16120 -18928 -23375 -23468 -13238 -4280
7654 -4280 -1024 -6631 735 9011 20960 31849 26335 19713 16773 12623 20875 23089 17766 15882
7640 15882 23917 7562 -9931 -14279 704 -8532 -16461 -8779 -6570 -15033 -16188 -16018 -8894 -12049
7626 -12049 -3772 1541 -2279 -7583 -6159 -1465 -743 -644 9279 1023 -3886 -10006 -10872 -8303 -11358 -12547
7610 -12547 -21110 -8605 -11610 -1938 4822 -3518 -15621 -14678 -22815 -19530 -15016 -14870 -19967 -22186 -24020
$$ packed form
7712A7419J230n222l421J238O86r333L531O575O900p018k3642M649J2945p570
7698a033L9J3066P393K1820l9l87n001J0564L385O92n560j943k0263j9500j4081
7683a0848j489o701l43R947R9P346M849k020j5315p727R333l08N664m018J004
7668a0527O681J991r007J2300J447m915N054m985j4159k808m447r3J0230Q958
7654d280L256n607P366Q276J1949J0889n514o622k940m150Q252K214n323j884
7640A5882Q035j6355j7493m348J4983r236p929P682K209q463j155J70P124l155
7626a2049Q277N313l820n304J424M694P22R9R923q256m909o120q66K569l055j189
7610a2547q563J2505l005R672O760q340j2103R43q137L285M514J46n097k219j834
$$ plain form
7595 -24020 -26775 -21777 -26148 -34281 -28494 -26090 -6527 2144 -5665 -3245 -1208 -24428 -26238 -23875
7581 -23875 -15949 -1557 2624 -3885 2987 8113 4925 -3771 -15279 -14797 -11506 -23700 -32988 -25353
7567 -25353 -11565 -7155 -11228 -8060 -11410 -17496 -10860 3600 15107 9989 -9999 -16176 -4921
7554 -4921 -11211 -15594 1010 12928 5325 -4274 -279 -9649 -16850 -14646 -14240 -9907 -13108 -9062 -10389
7539 -10389 -13905 -11303 -13062 -22044 -12122 -4172 -4550 -1259 -8658 -16574 -8670 4106 17547 12707
7525 12707 -4615 -20025 -18782 -11159 -1574 2372 2296 4146 2872 -2802 -15086 -32078 -32346 -34775
7511 -34775 -26977 -18233 -16000 -26520 -31043 -32317 -20006 -4620 -5294 -12149 -23169 -21904 -11103 -8558
7497 -8558 -9838 -1062 4863 -4115 -16242 6207 -2820 -20247 -24986 -21583 -29338 -22682 -11398 -11586
$$ packed form
7595b4020k755M998m371q133N787K404J9563Q671p809K420K037k3220j810K363
7581b3875P926J4392M181o509O872N126l188q696j1508M82L291j2194r288P635
7567b5353J3788M410m073L168l350o086O636J4460J1507n118j9988o177J1255
7554d921o290m383J6604J1918p603r599L995r370p201K204M06M333l201M046j327
7539a0389l516K602j759q982R922P950l78L291p399p916P904J2776J3441m840
7525A2707j7322j5410J243P623R585L946p6J850j274n674j2284j6992k68k429
7511c4775P798Q744K233j0520m523j274J2311J5386o74o855j1020J265J0801K545
7497h558j280Q776N925q978j2127K2449r027j7427m739L403p755O656J1284j88
$$ plain form
7483 -11586 -18441 -22033 -15625 -11420 -20729 -34214 -24575 -9134 -11756 -15057 -17683 -5375 -16820 -19130
7469 -19130 -18660 -18654 -10412 6537 17612 32162 24347 4067 5486 4293 -12934 -26311 -32215 -27204
7455 -27204 -30119 -25092 -19466 -18841 -13299 -12820 -12208 -5416 -16213 -22405 -17572 -11684 -13796 -12239 -17147
7440 -17147 -15452 -15672 -9797 -19669 -29366 -11695 5164 16045 14065 216 799 -1798 -7779 -8164
7426 -8164 -3176 -7804 -10638 -16674 -9137 -9285 -23395 -30169 -26185 -19581 -11419 -16640 -33332 -22618
7412 -22618 -23040 -26435 -21321 -11477 -9568 -17301 -34330 -44244 -38706 -22749 -20594 -16864 -7229 -7857 -9740
7397 -9740 -17441 -10765 -6463 -6824 -8985 -8380 -12219 -13079 -2127 272 9797 16368 7150 968 3376
7382 3376 6709 -5712 -18485 -23531 -27754 -41125 -50693 -46452 -36964 -28263 -36834 -37205 -21968 -24961
$$ packed form
7483a1586o855l592O408M205r309j3485R639J5441k622l301k626J2308j1445k310
7469a9130M70OQ242J6949J1075J4550p815k0280J419j193j7227j3377n904N011
7455b7204k915N027N626O25N542M79O12O792j0797o192M833N888k112J557m908
7440a7147J695k20N875r872r697J7671J6859J0881j980j3849N83k597n981l85
7426h164M988m628k834o036P537j48j4110o774L984O604Q162n221j6692J0714
7412b2618m22l395N114R844J909p733j7029r914N538J5957K155L730R635o28j883
7397i740p701O676M302l61k161O05l839q60J0952K399R525O571r218o182K408
7382C376L333j2421j2773n046m223j3371r568M241R488Q701q571l71J5237k993
$$ plain form
7368 -24961 -17380 -4490 -10320 -9468 -15239 -26644 -18183 -14072 -28052 -31177 -23646 -13174 -17051 -19650
7354 -19650 -11328 -4411 -20531 -35306 -23626 -20429 -21116 -17263 -19768 -19054 -16299 -11604 -3993 -7867
7340 -7867 -16949 -2392 -4099 284 12101 13712 11319 6201 13518 1589 -29579 -29504 -22034 -14364
7326 -14364 -21516 -32851 -28963 -29216 -14355 -27258 -48876 -47275 -28737 -20831 -17058 -26442 -34601 -38893
7312 -38893 -26396 -7886 -2462 -5629 -13534 -18780 -9341 -10410 -2967 357 2070 -3889 1515 -15165
7298 -15165 -11698 -4848 -5564 15945 13408 -149 -4791 4795 8740 -1535 -5132 -10502 -22664 -24785
7284 -24785 -11048 -11904 -3500 240 426 -4345 -5334 -10890 -11320 -21365 -23966 -13233 -11962 -14647 -9616
7269 -9616 -13520 -9239 -12016 -7608 -1178 -5840 -22087 -25020 -12400 -6240 -12015 -19800 -18479 -6372
$$ packed form
7368b4961P581J2890n830Q52n771j1405Q461M111j3980l125P531J0472l877k599
7354a9650Q322O917j6120j4775J1680L197o87L853k505P14K755M695P611l874
7340g867r082J4557j707M383J1817J611k393n118P317j1929l1168P5P470P670
7326a4364p152j1335L888k53J4861j2903k1618J601J8538P906L773r384q159m292
7312c8893J2497J8510N424l167p905n246R439j069P443L324J713n959N404j6680
7298a5165L467O850p16K1509k537j3557m642R586L945j0275l597n370j2162k121
7284b4785J3737q56Q404L740J86m771r89n556m30j0045k601J0733J271k685N031
7269i616l904M281k777M408O430m662j6247k933J2620O160n775p785J321J2107
$$ plain form
7255 -6372 -4896 -2824 9588 10734 11759 9448 4892 -11106 -13102 -6537 -6438 -5936 -2238 1399 -1842
7240 -1842 -2350 6006 -1121 -4006 -3251 -8673 -25315 -25937 -28454 -27472 -12727 -17652 -24851 -21507 -10620
7225 -10620 -7864 -5824 23 6453 6595 1568 -9186 -13667 -17902 -28997 -25763 -22647 -26454 -20716
7211 -20716 -28042 -19469 -13587 -25858 -30844 -37017 -37761 -25772 -26407 -25948 -27898 -21557 -8623 544 -13336
7196 -13336 -2517 -3396 -15535 -4522 -11759 -17198 -23597 -18558 -19985 -26563 -21161 -16384 -12493 -16195
7182 -16195 -21031 -9439 -8799 -14902 -9686 -9068 -5457 -2398 -9646 -12017 -3979 1573 -2215 865 -6386
7167 -6386 -6688 -6992 -8819 -8178 -3370 -9827 -15562 -17262 -20065 -14356 -12196 -22689 -20101 -26876 -28608
7152 -28608 -33085 -31630 -31909 -28425 -33350 -29393 -32878 -36336 -37488 -17136 -25364 -42037 -39208 -22501
$$ packed form
7255f372J476K072J2412J146J025k311m556j5998j996O565R9N02L698L637l241
7240a842n08Q356p127k885P55n422j6642o22k517R82J4745m925p199L344J0887
7225a0620K756K040N847O430J42n027j0754m481m235j1095L234L116l807N738
7211b0716p326Q573N882j2271m986o173p44J1989o35M59j950O341J2934R167j3880
7196a3336J0819q79j2139J1013p237n439o399N039j427o578N402M777L891l702
7182a6195m836J1592O40o103N216O18L611L059p248k371Q038N552l788L080p251
7167f386l02l04j827O41M808o457n735j700k803N709K160j0493K588o775j732
7152b8608m477J455k79L484m925L957l485l458j152K0352q228j6673K829J6707
$$ plain form
7138 -22501 -279 -8640 -23795 -24630 -30137 -25154 -2719 -5166 -7883 -3440 -21700 -28568 -16957 -11285
7124 -11285 -1456 -1062 -663 -12971 -8914 -6985 -4407 5945 11288 6615 8124 13577 15787 3979
7110 3979 2305 -4183 408 -5341 -21565 -13390 -1917 -3699 -2165 -2749 -6649 -14574 -17586 -21053 -28612
7095 -28612 -15648 -12134 -8146 -9925 -10848 -6297 11218 15311 -2807 -27506 -31601 -23630 -7462 -6403
7081 -6403 -11324 -14300 -17763 -18295 -11743 -2782 -3848 -9897 -15681 -5349 -5688 -219 -4625 -8427 2657
7066 2657 -14471 -26563 -25419 -15959 -1320 9414 9043 4205 -6787 -12786 -9638 -15650 -13935 -5850
7052 -5850 -6639 -15491 -29562 -26335 -26585 -32685 -23488 -23157 -17802 -2721 -7700 -6382 7438 12842 8224
7037 8224 -2688 -10476 -13139 -17773 -7493 -8376 -18200 -25738 -31956 -28214 -3088 18404 16308 3307
$$ packed form
7138b2501K2222q361j5155q35n507M983K2435k447k717M443j8260o868J1611N672
7124a1285R829L94L99j2308M057J929K578J0352N343m673J509N453K210j1808
7110C979j674o488M591n749j6224Q175J1473j782J534n84l900p925l012l467p559
7095b8612J2964L514L988j779r23M551J7515M093j8118k4699m095P971J6168J059
7081f403m921k976l463n32O552Q961j066o049n784J0332l39N469m406l802J1084
7066B657j7128j2092J144R460J4639J0734l71m838j0992n999L148o012J715Q085
7052e850p89q852j4071L227k50o100R197L31N355J5081m979J318J3820N404m618
7037H224j0912p788k663m634J0280q83r824p538o218L742K5126K1492k096j3001
$$ plain form
7023 3307 -8944 -9159 976 -3034 -7456 -3788 -7114 -890 2511 2334 -5695 -7018 1243 932 2589
7008 2589 8148 14714 29772 29685 13608 8914 16262 2744 -2672 -8885 -7421 -1982 2035 2072 -6111
6993 -6111 -5824 -13642 -17846 -21297 -19151 -10872 -5232 4846 1025 -11821 -19613 -2107 8643 -1879
6979 -1879 -12769 -18380 -10326 -6699 -16215 -24397 -19105 -28132 -28517 -27660 -28143 -17595 -7661 -5595 -10919
6964 -10919 -945 3619 750 -9355 -24042 -26625 -22270 -15560 -18599 -11943 1875 4590 -3257 -13939
6950 -13939 -14062 -10493 -12818 -20061 -30418 -29805 -25101 -20939 -10987 -13801 -12340 -3569 3453 -841 -8591
6935 -8591 -4085 6801 4376 -1546 -10079 -10575 -11052 -9912 -8012 -5560 -14346 -13063 -13600 -15464 -19601
6920 -19601 -10475 -15680 -23104 -29617 -38570 -42230 -31630 -31903 -27337 -19794 -11820 -9791 -10540 -11191 -1229
$$ packed form
7023C307j2251k15J0135m010m422L668l326O224L401j77q029j323Q261l11J657
7008B589N559O566J5058q7j6077m694P348j3518n416o213J464N439M017L7q183
6993f111K87p818m204l451K146Q279N640J0078l821j2846p792J7506J0750j0522
6979a879j0890n611Q054L627r516q182N292r027l85Q57m83J0548R934K066n324
6964a0919R974M564k869j0105j4687k583M355O710l039O656J3818K715p847j0682
6950a3939j23L569k325p243j0357O13M704M162R952k814J461Q771P022m294p750
6935h591M506J0886k425n922q533m96m77J140J900K452q786J283n37j864m137
6920a9601R126n205p424o513q953l660J0600k73M566P543P974K029p49o51R962
$$ plain form
6905 -1229 -15569 -15021 -7867 -12093 -12555 -13504 -21051 -22623 -20262 -20128 -10027 -15112 -15083 -4437 -11632 -22682
6889 -22682 -36458 -38173 -37351 -18832 -17109 -18089 -1635 -23 -18976 -20289 -14169 -16798 -17307 -21211
6875 -21211 -20502 -21493 -26773 -19532 -12038 -185 -2591 -9770 -2517 438 -13970 -28529 -26585 -21891
6861 -21891 -28945 -20857 -10107 -18634 -23179 -11890 -1163 10572 16876 12289 5907 7636 -754 -7128
6847 -7128 8444 2875 1073 1657 -14558 -20808 -22133 -17170 -22720 -32700 -38183 -28212 -20302 -21305 -14552
6832 -14552 -15551 -14823 -21107 -13716 -4430 -15413 1086 4947 6227 -2601 -10013 -2377 -1910 -2834 9605
6817 9605 12488 11992 -635 -25011 -19372 -9189 -18608 -28877 -22748 -26177 -18852 -9054 -25588 -44393
6803 -44393 -51972 -52105 -33560 -4506 3914 1176 -3157 -3186 -11716 -13613 -3972 -6503 3580 -6321 -26706
$$ packed form
6905a229j4340N48P154m226m62r49p547j572K361J34J0101n085K9J0646p195j1050
6889b2682j3776j715Q22J8519J723r80J6454J612j8953j313O120k629n09l904
6875b1211P09r91n280P241P494J1853k406p179P253K955j4408j4559J944M694
6861b1891p054Q088J0750q527m545J1289J0727J1735O304m587o382J729q390o374
6847g128J5572n569j802N84j6215o250j325M963n550r980n483R971P910j003O753
6832a4552r99P28o284P391R286j0983J6499L861J280q828p412P636M67r24J2439
6817I605K883m96j2627k4376N639J0183r419j0269O129l429P325R798j6534j8805
6803d4393p579j33J8545K9054Q420k738m333k9q530j897R641k531J0083r901k0385
$$ plain form
6788 -26706 -18243 -19279 -16417 -24021 -20803 -7642 -6857 -15364 -26260 -29126 -25604 -20489 -24227 -16462
6774 -16462 -8403 -5687 782 1440 10711 16544 14724 8760 9875 13296 2485 -252 1964 -1451 1938
6759 1938 -8651 -20766 -18492 -17985 -18970 -6159 730 -3049 -7759 -16920 -30582 -28399 -27031 -34567
6745 -34567 -48103 -39639 -24014 -13180 -20090 -23255 -16303 -13384 -13587 -34090 -41431 -36847 -21158 -17357
6731 -17357 -16918 -18443 -13278 -8369 -12197 -11418 -6774 897 -2643 -1639 -12253 -15837 -21475 -19215 -5409
6716 -5409 -14928 -7650 -5925 -12709 2562 11527 10544 9381 2385 14956 11318 10880 5416 1484 5236
6701 5236 -2905 -20462 -28765 -14141 -8157 2109 3844 -13277 -10992 -3482 -9147 -17590 6772 17913
6687 17913 6818 12113 5504 -91 -15165 -28613 -17402 -1287 -1002 3109 11070 16025 12012 4432
$$ packed form
6788b6706Q463j036K862p604L218J3161P85q507j0896k866L522N115l738P765
6774a6462Q059K716O469O58R271N833j820n964J115L421j0811k737K216l415L389
6759A938j0589j2115K274N07r85J2811O889l779m710r161j3662K183J368p536
6745c4567j3536Q464J5625J0834o910l165O952K919k03k0503p341M584J5689L801
6731a7357M39j525N165M909l828P79M644P671l540J004j0614l584n638K260J3806
6716e409r519P278J725o784J5271Q965r83j163o996J2571l638m38n464l932L752
6701E236q141j7557q303J4624N984J0266J735j7121K285P510n665q443K4362J1141
6687A7913j1095N295o609n595j5074j3448J1211J6115K85M111P961M955m013p580
$$ plain form
6673 4432 -5487 -10950 2190 476 -8506 -6998 -16586 -26809 -16868 5703 2810 -5972 -7465 -2532
6659 -2532 -1341 -9213 -18103 -25479 -25127 -29406 -37238 -19159 -11617 -25171 -22551 -26254 -24517 -13811
6645 -13811 -13387 -12189 -7685 5086 10111 10001 -1044 -5946 -240 1096 13764 9998 -3800 -12321
6631 -12321 -18658 -18321 -21914 -29094 -34472 -26827 -15788 -539 4944 -3861 -21269 -27012 -12425 6540
6617 6540 4771 -8270 -940 6737 -1199 -4058 7878 21732 3460 -17421 -10040 12160 10526
6604 10526 7558 3740 -2836 -3084 -8114 -7618 1654 1476 -12875 -11183 -5907 -3966 -1514 2728 -6458
6589 -6458 -17359 -11998 -14474 -25571 -19773 -8265 -8405 -3035 -16876 -35929 -39953 -30140 -12695 -9388
6575 -9388 -3664 -13763 -16730 -12763 -15047 -14162 -19259 -16679 -17438 -30891 -28874 -20311 -16218 -25189 -22097
$$ packed form
6673D432r919n463J3140j714q982J508r588j0223R941K2571k893q782j493M933
6659b532J191p872q890p376L52m279p832J8079P542j3554K620l703J737J0706
6645a3811M24J198M504J2771N025j10j1045m902N706J336J2668l766j3798q521
6631a2321o337L37l593p180n378P645J1039J5249N483q805j7408n743J4587J8965
6617F540j769j3041P330P677p936k859J1936J3854j8272k0881P381K2200j634
6604A0526k968l818o576k48n030M96R272j78j4351J692N276J941K452M242r186
6589f458j0901N361k476j1097N798J1508j40N370j3841j9053m024R813J7445L307
6575i388N724j0099k967L967k284Q85n097K580p59j3453K017Q563M093q971L092
$$ plain form
6560 -22097 -10285 -10954 -6563 -12713 -14466 -15860 -23844 -20251 -11993 -12903 -22918 -21645 -14653 -18333 -24637
6545 -24637 -18952 -25583 -24446 -13311 -16549 -16112 -21705 -19115 -13574 -10663 2095 2161 -396 4622 1537
6530 1537 -6982 -10429 -3328 3361 -4437 -16715 -13613 28 -3721 -16998 -13769 -19566 -25745 -16058
6516 -16058 -2987 584 -9230 -1878 6868 -1477 -15459 -26034 -23836 -14411 -8176 2304 6903 -778
6502 -778 -13266 -3289 7946 7970 14380 16804 1415 -8754 -4566 2424 7793 12912 12066 2056 -6455
6487 -6455 -9420 -18030 -22342 -21286 -9498 -3015 -9328 -20235 -24953 -17763 -8445 2649 7398 10465
6473 10465 -898 -4533 11965 20198 12849 13634 18516 20026 22607 16695 14163 12479 15711 16003 23448
6458 23448 20955 2495 722 26004 40329 29419 23847 10173 -7466 -12689 -10314 -11074 -3274
$$ packed form
6560b2097J1812o69M391o150j753j394p984L593Q258r10j0015J273O992l680o304
6545b4637N685o631J137J1135l238M37n593K590N541K911J2758O6k557N018l085
6530A537q519l447P101O689p798j2278L102J3641l749j3277L229n797o179R687
6516a6058J3071L571r814P352Q746q345j3982j0575K198R425O235J0480M599p681
6502g78j2488R977J1235K4O410K424j5389j0169M188O990N369N119q46j0010q511
6487f455k965q610m312J056J1788O483o313j0907m718P190R318J1094M749L067
6473A0465j1363l635J6498Q233p349P85M882J510K581n912k532j684L232K92P445
6458B3448k493j8460j773K5282J4325j0910n572j3674j7639n223K375p60P800
$$ plain form
6445 -3274 -581 -18061 -25551 -29171 -25671 -19329 -25074 -17514 -25427 -20892 -22552 -30603 -28265 -20273 -18001
6430 -18001 -7529 -15157 -9411 -7961 -19839 -17134 -13302 -15257 -4324 -7896 -6839 -5516 1112 3959
6416 3959 2242 -4403 -9959 7548 3094 -2699 6945 24046 16280 17520 20207 15652 8761 6745
6402 6745 11919 11879 5281 -2658 -5597 -12077 -10792 -12573 -26631 -23370 -9063 -3264 -9541 -19985 -17159
6387 -17159 -4304 -2890 -3683 972 -2085 -3653 5677 4086 7291 -350 -14997 -9442 -15749 -19375
6373 -19375 -23902 -12528 -6355 -11487 -16685 -3046 2224 -2168 -9894 -11305 -8565 -194 610 -6756
6359 -6756 -6394 5302 15348 17023 18582 9278 14854 19979 22957 19155 5773 -4550 -25885 -15762
6345 -15762 -9695 -4553 193 -7224 -5783 -14694 -14300 -9939 -3464 -1427 -9644 -10349 -17864 -25239 -25229 -30122
$$ packed form
6445c274K693j7480p490l620L500O342n745P560p913M535j660q051K338P992K272
6430a8001J0472p628N746J450j1878K705L832j955J0933l572J057J323O628K847
6416C959j717o645n556J7507m454n793R644J7101p766J240K687m555o891k016
6402F745N174m0o598p939k939o480J285j781j4058L261J4307N799o277j0444K826
6387a7159J2855J414p93M655l057j568R330j591L205p641j4647N555o307l626
6373a9375m527J1374O173n132n198J3639N270m392p726j411K740Q371Q04p366
6359f756L62J1696J0046J675J559r304N576N125K978l802j3382j0323k1335J0123
6345a5762O067N142M746p417J441q911L94M361O475K037q217p05p515p375J0m893
$$ plain form
6329 -30122 -24100 -13436 -2340 -5243 -10293 -16027 -28887 -34832 -28413 -18529 -14782 -18057 -5620 4115
6315 4115 -11644 -19136 -25954 -26534 -19236 -16061 -5911 -4832 -2239 995 -8383 -5033 313 12166
6301 12166 13078 8947 3678 4735 -618 -14432 -19675 -8321 12734 12587 2462 -2337 -8460 -12018
6287 -12018 -16277 -29110 -37808 -30287 -23184 -19300 -9819 -13615 -17448 -22815 -16714 -12844 -6962 -7681 -11367
6272 -11367 -22708 -29455 -22002 -21476 -18808 -14978 -6798 -2055 -2316 -4324 -16123 -25267 -20995 207
6258 207 12702 16923 11656 8974 10923 5395 1657 7231 11897 13988 7601 3622 -470 -10544 -18460
6243 -18460 -8341 -11421 -1498 -10199 -19090 -4494 -4538 -7442 -6237 -2265 -9400 -12731 -6315 -5565 -12595
6228 -12595 -22440 -16912 -9544 5171 2815 -10410 -15050 -12586 -11387 -13843 -7708 1446 -5368 -7780
$$ packed form
6329c0122O022J0664J1096k903n050n734j2860n945O419R884L747l275J2437R735
6315D115j5759p492o818n80P298L175J0150J079K593L234r378L350N346J1853
6301A2166R12m131n269J057n353j3814n243J1354K1055j47j0125m799o123l558
6287a2018m259j2833q698P521P103L884R481l796l833n367O101L870N882p19l686
6272a1367j1341o747P453N26K668L830Q180M743k61k008j1799r144M272K1202
6258B07J2495M221n267k682J949n528l738N574M666K091o387l979m092j0074p916
6243a8460J0119l080R923q701q891J4596m4k904J205L972p135l331O416P50p030
6228a2595r845N528P368J4715k356j3225m640K464J199k456O135R154o814k412
$$ plain form
6214 -7780 -11536 -18728 -12109 -12594 -16772 -23413 -24340 -17068 -19694 -8556 10517 11707 4824 -4691 -7872
6199 -7872 -7751 -7960 -15571 -8096 716 7515 -2209 -10469 -13439 -15410 -18388 -21003 -13906 -14533 -27506
6184 -27506 -37430 -20973 -4064 -2501 3562 8656 2877 -2645 1404 1764 12377 9940 1109 -11068
6170 -11068 -16644 -22780 -23141 -19782 -19920 -11235 7922 10078 -3589 5730 23371 17235 6425 10012
6156 10012 7551 -333 -11293 -25965 -15286 -3172 -1140 -2433 -20557 -37549 -23784 -14662 -11140
6143 -11140 -11386 -10146 -11044 -11731 -22472 -30181 -22069 -10465 -2371 -7261 -12690 11319 6387 343 -678
6128 -678 -5946 -10666 -19477 -21699 -19711 -10881 -11069 -15105 -25183 -30968 -28833 -21923 -5490 -17531 -15257
6113 -15257 -949 -10470 -5090 -7934 -15994 -5917 -5109 -7631 -6927 -4816 -2104 -10648 -20101 -27164 -19722
$$ packed form
6214g780l756p192O619m85m178o641r27P272k626J1138J9073J190o883r515l181
6199g872J21k09p611P475Q812O799r724q260k970j971k978k615P097o27j2973
6184b7506r924J6457J6909J563O063N094n779n522M049L60J0613k437q831j2177
6170a1068n576o136l61L359j38Q685J9157K156j3667R319J7641o136j0810L587
6156A0012k461p884j0960j4672J0679J2114K032j293j8124j6992J3765R122L522
6143a1140k46J240q98o87j0741p709Q112J1604Q094m890n429K4009m932o044j021
6128f78n268m720q811k222J988Q830j88m036j0078n785K135O910J6433j2041K274
6113a5257J4308r521N380k844q060J0077Q08k522P04K111K712q544r453p063P442
$$ plain form
6098 -19722 -20392 -17290 -18054 -15260 -5476 2135 -619 6880 20003 15533 1352 -19622 -32147 -37513
6084 -37513 -35824 -34986 -30864 -27365 -23976 -27936 -23275 -21617 -22449 -21267 -22251 -30355 -31515 -19549 -10141
6069 -10141 -3349 866 388 -12640 -12240 -2719 -9072 -10865 -9834 -11507 -1919 3957 4979 1624 -3087
6054 -3087 -6320 -22136 -11150 -9045 -11203 -19592 -8313 9470 22152 29584 32022 37589 37748 22364
6040 22364 8480 3060 -5971 -5783 -1175 780 -661 -914 3656 5470 -6657 -11695 -14427 -21340 -36428
6025 -36428 -18890 -17168 -11995 2781 581 -5589 2301 -1078 -5707 -10106 -10001 -3873 -13017 -22005
6011 -22005 -24885 -25894 -24092 -33747 -21653 -13065 -6177 -10182 -21181 -2060 -457 9788 3340 -4034
5997 -4034 -1195 -11172 -11619 -12708 -6122 -3867 -2404 -10493 -3975 10252 7633 4902 9478 11743 8932
$$ packed form
6098a9722o70L102p64K794R784P611k754P499J3123m470j4181k0974j2525n366
6084c7513J689Q38M122L499L389l960M661J658q32J182r84q104j160J1966R408
6069a0141O792M215m78j3028M00R521o353j793J031j673R588N876J022l355m711
6054c087l233j5816J0986K105k158q389J1279J7783J2682P432K438N567J59j5384
6040B2364j3884n420r031J88M608J955j441k53M570J814j2127n038k732o913j5088
6025c6428J7538J722N173J4776k200o170P890l379m629m399J05O128r144q988
6011b2005k880j009J802r655J2094Q588O888m005j0999J9121J603J0245o448p374
5997d034K839r977m47j089O586K255J463q089O518J4227k619k731M576K265k811
$$ plain form
5982 8932 -3351 -14367 -11580 -19162 -22212 -15727 2753 11207 9602 12462 15187 23373 11668 640
5968 640 4146 3209 19099 27265 14443 -2487 -919 -7240 -19948 -16095 -9693 151 -5444 -8962
5954 -8962 -17477 -22124 -16416 -11252 -17193 -35191 -35365 -19379 -5003 209 -2754 -10853 -11374 -605
5940 -605 -1612 -8696 -23863 -29755 -22394 -17294 -149 -4846 6533 10861 15247 13328 9277 9378 13943
5925 13943 17560 23759 11524 1185 -33 -709 3040 4951 -8307 -11402 -3758 -5423 -16434 -29101
5911 -29101 -39014 -41084 -38278 -23803 -18729 -15258 -6408 12705 12645 -2795 -1040 -3764 -10169 -7171
5897 -7171 2550 6293 7256 -3634 -16052 -19395 -30521 -32500 -23926 -4779 3992 4099 -16585 -13470
5883 -13470 -4159 -4599 -7622 -13989 -16296 -9355 -11426 -17364 -28490 -15791 -10082 -27259 -20736 -18036
$$ packed form
5982H932j2283j1016K787p582l050O485J8480Q454j605K860K725Q186j1705j1028
5968F40L506r37J5890Q166j2822j6930J568o321j2708L853O402R844n595l518
5954h962q515m647N708N164n941j7998j74J5986J4376N212k963q099n21J0769
5940f05j007p084j5167n892P361N100J7145m697J1379M328M386j919m051J01M565
5925A3943L617O199j2235j0339j218o76L749J911j3258l095P644j665j1011j2667
5911b9101r913k070K806J4475N074L471Q850J9113o0j5440J755k724o405K998
5897g171R721L743R63j0890j2418l343j1126j979Q574J9147Q771J07k0684L115
5883a3470R311m40l023o367k307O941k071n938j1126J2699N709j7177O523K700
$$ plain form
5869 -18036 -18309 -3663 2167 2669 -2000 -4835 -18915 -25368 -31503 -30856 -27769 -24706 -14277 -2867
5855 -2867 8424 10395 8422 11460 4666 4229 -3447 -16647 -20973 -17018 -15871 -5170 -3614 -6415
5841 -6415 -9854 -5972 -16524 -1435 6203 4269 8233 8255 8440 11492 9975 14107 13658 12952 12597 -671
5825 -671 -9345 -7034 -6273 -22534 -4562 -6123 -7927 -6641 149 1218 4138 1297 5064 1010 -488
5810 -488 -9284 -7233 2014 -6247 -12161 -4451 -1817 -10604 -10516 -2980 -4497 -19394 -27997 -13039 -10537
5795 -10537 -22307 -19384 -21372 -15789 309 -8208 -27266 -28893 -23977 -17393 -3106 10564 4268
5782 4268 -6960 -8994 -11976 -8704 -6045 -5338 -10903 -13853 -4458 -6904 -14346 -13674 -27819 -22287 -12775
5767 -12775 -10598 -16957 -20822 -12419 -7954 -13197 -11492 -884 10095 17114 21460 15613 16362 14857
$$ packed form
5869a8036k73J4646N830N02m669k835j4080o453o135O47L087L063J0429J1410
5855b867J1291J971j973L038o794m37p676j3200m326L955J147J0701J556k801
5841f415l439L882j0552J5089P638j934L964K2J85L052j517M132m49p06l55j3268
5825f71q674K311P61j6261J7972j561j804J286O790J069K920k841L767m054j498
5810d88q796K051R247q261n914P710K634q787Q8P536j517j4897q603J4958K502
5795a0537j1770K923j988N583J6098q517j9058j627M916O584J4287J3670o296
5782D268j1228k034k982L272K659P07n565k950R395k446p442O72j4145N532R512
5767a2775K177o359l865Q403M465n243J705J0608J0979P019M346n847P49j505
$$ plain form
5753 14857 17284 12924 6581 -2130 -4771 4027 -8075 -2829 -658 13766 12606 17297 16882 -2422
5739 -2422 -12297 -7816 -1491 -3615 855 10545 10851 -10305 -6262 5785 5972 6322 -4037 -18186 -18625
5724 -18625 -19389 -26939 -22197 -13311 -10318 -13159 -9756 -11048 -18519 -5263 -385 6579 358 -2301 -10888
5709 -10888 -19400 -23085 -16164 -13204 -8033 -11686 -13502 -12510 -9620 -18784 -20493 -25729 -8018 4273
5695 4273 8462 973 -494 -13822 -24756 -20859 -18126 -23944 -29603 -14785 -12721 -14511 -17483 -13768
5681 -13768 1355 3573 2586 -8872 -16339 -31861 -29311 -22913 -14551 -1553 -7508 -5065 -7915 -13946
5667 -13946 6453 13988 21487 20670 15363 9384 16936 25797 12787 5620 -4111 -817 13381 18491
5653 18491 16279 19729 18694 14960 6255 3339 -10052 -949 -3247 -16343 -13968 1963 -726 -6616
$$ packed form
5753A4857K427m360o343q711k641Q798j2102N246K171J4424j160M691m15j9304
5739b422r875M481O325k124M470R690L06k1156M043J2047J87L50j0359j4149m39
5724a8625p64p550M742Q886K993k841L403j292p471J3256M878O964o221k659q587
5709a0888q512l685O921K960N171l653j816R92K890r164j709n236J7711J2291
5695D273M189p489j467j3328j0934L897K733n818n659J4818K064j790k972L715
5681a3768J5123K218r87j1458p467j5522K550O398Q362J2998n955K443k850o031
5667a3946K0399P535P499q17n307n979P552Q861j3010p167r731L294J4198N110
5653A8491k212L450j035l734q705k916j3391R103k298j3096K375J5931k689n890
$$ plain form
5639 -6616 -25209 -20867 -23519 -14590 -7594 -9783 -31455 -41998 -23989 -12040 -12644 -8096 -7705 -4843
5625 -4843 -8405 -9673 -15571 -19500 -15077 -12698 -6004 -5967 -10126 -14250 -25585 -19230 -571 -10520 -13864
5610 -13864 -7613 -12338 -11868 -9849 -10040 -7606 -3491 -4954 -10863 -19074 -8713 9689 12950 19208 20128
5595 20128 7417 2658 13442 -1288 -14509 -10391 -12295 -8239 7610 2238 -9484 -11657 -19297
5582 -19297 -19974 -3879 6309 107 16977 16983 5034 3954 -2924 -6891 -4498 2758 13922 17057
5568 17057 8885 4358 4766 -711 -7255 -7215 -1230 4459 -20 -2293 -4297 661 1852 12582 -8358
5553 -8358 -23682 -11185 -2986 4129 855 -332 1056 -4026 -1464 -5128 -11405 -10268 -15834 -13924
5539 -13924 -2526 -2948 -16873 -22412 -21192 -8114 1154 -718 3547 5302 -10650 -20726 -22491 -14359
$$ packed form
5639f616j8593M342k652Q929O996k189k1672j0543J8009J1949o04M548L91K862
5625d843l562j268n898l929M423K379O694L7m159m124j1335O355J8659r949l344
5610a3864O251m725M70K019j91K434M115j463n909q211J0361J8402L261O258R20
5595B0128j2711m759J0784j4730j3221M118j904M056J5849n372j1722k173p640
5582a9297o77J6095J0188o202J6870Oj1949j080o878l967K393P256J1164L135
5568A7057q172m527M08n477o544M0N985N689m479k273k004M958J191J0730k0940
5553h358j5324J2497Q199P115l274j187J388n082K562l664o277J137n566J910
5539a3924J1398m22j3925n539J220J3078R268j872M265J755j5952j0076j765Q132
$$ plain form
5525 -14359 -24453 -22419 -26388 -17597 -15343 -5249 3019 7851 11624 13560 13824 14141 17658 26957 20558
5510 20558 14754 9416 5870 2764 -5920 -7823 3033 12999 4617 -2329 -10277 -16205 -16188 3188 5755
5495 5755 -2829 289 -13644 -17325 -10921 -268 -6271 -12726 -11518 4059 10625 9789 353 -6780
5481 -6780 -397 -912 -3473 -8602 -17962 -16856 -8142 -6417 -4794 -648 5868 9843 3013 8505 6703
5466 6703 -2352 -17051 -22422 -25879 -26754 -19759 -24172 -27277 -25899 -22706 -28464 -28508 -24820 -18865 -18516 -17929
5450 -17929 -9232 -14815 -20022 -2537 11129 13103 12687 -255 5603 15790 12829 7230 8334 -5627
5436 -5627 -16297 -9877 -258 3539 -5165 -11171 -4972 7064 1286 -6774 -449 -6962 -20547 -21994
5422 -21994 -27246 -20175 -7708 6182 -9574 -8735 -4476 -7473 -8001 -8478 -5306 -14955 -15889 -12694 -9967
$$ packed form
5525a4359j0094K034l969Q791K254J0094Q268M832L773J936K64L17L517R299o399
5510B0558n804n338l546l106q684j903J0856R966q382o946p948n928J7J9376K567
5495E755q584L118j3933l681O404J0653o003o455J208J5577O566q36r436p133
5481f780O383n15k561n129r360J106Q714J725J623M146O516L975o830N492j802
5466F703r055j4699n371l457q75O995m413l105J378L193n758m4L688N955L49N87
5450a7929Q697n583n207J7485J3666J974m16j2942N858J0187k961n599J104j3961
5436e627j0670O420R619L797q704o006O199J2036n778q060O325o513j3585j447
5422b1994n252P071J2467J3890j5756Q39M259k997n28m77L172r649r34L195K727
$$ plain form
5407 -9967 -18983 -19255 -16995 -24164 -27986 -21305 -15028 -18110 -19503 -16284 -22047 -25092 -14488 1114 2062
5392 2062 -6523 -15390 -13272 -5828 -10031 7657 17873 15370 10073 26098 20778 18221 15450 15235
5378 15235 17825 7800 2693 4029 -2487 -8697 -4230 -14345 -15422 -791 7362 7064 6926 11656
5364 11656 -1953 -11289 -18245 -2653 3244 11205 17672 15914 7616 2127 -3077 -1605 -10298 -17172
5350 -17172 -15515 -15807 -8208 -4520 -5975 -12994 -7016 -7410 1675 -1986 3936 4369 -13568 -23624 -17639
5335 -17639 3356 16958 21644 27450 26401 15440 16324 12945 25463 22524 12316 7976 6863 2987
5321 2987 -4421 -4224 -8821 -13147 -19587 -10251 -9647 -9090 8092 11207 4752 10217 10931 21223 34574
5306 34574 20522 10642 17030 12341 2163 -3427 -2003 -5789 -10463 -13177 -13745 -7460 -7748 -7962 -5930
$$ packed form
5407i967r016k72K260p169l822O681O277l082j393L219n763l045J0604J5602R48
5392B062q585q867K118P444m203J7688J0216k503n297J6025n320k557k771k15
5378A5235K590j0025n107J336o516o210M467j0115j077J4631Q153k98j38M730
5364A1656j3609r336o956J5592N897P961O467j758q298n489n204J472q693o874
5350a7172J657k92P599L688j455p019N978l94R085l661N922M33j7937j0056N985
5335a7639K0995J3602M686N806j049j0961Q84l379J2518k939j0208m340j113l876
5321B987p408J97m597m326o440R336O04N57J7182L115o455N465P14J0292J3351
5306C4574j4052r880O388m689j0178n590J424l786m674k714n68O285k88k14K032
$$ plain form
5291 -5930 -98 2434 -13200 -15055 -15438 -15314 -17228 -18705 -9432 2729 803 -13569 -12569 -6220 -6896
5276 -6896 -6806 556 8052 1920 2599 7367 12196 2747 -2976 -11894 -15277 -25716 -17959 -3507 5043
5261 5043 -11608 -5330 -4378 213 16289 17135 5101 842 -1161 -5086 -15872 -8454 -6290 -10085
5247 -10085 -12247 -10729 -14315 -16946 -3063 -370 -8009 -7331 -7951 -12173 -17812 -26681 -22747 -4818 -15021
5232 -15021 -7252 356 -3240 -5274 -5930 -5916 -9650 -7388 3374 -761 -3031 8896 33214 40045 31145
5217 31145 18404 9910 1168 2820 7432 9586 20525 16236 1382 -8313 -8596 -3701 11746 12438
5203 12438 22 -10705 899 6223 -249 -3664 74 5318 382 2545 -9498 -19518 -15979
5190 -15979 5393 -6830 -12246 -7236 -1885 202 -7984 -13492 -21270 -23319 -20542 -5365 7014 -2563
$$ packed form
5291e930N832K532j5634j855l83J24j914j477R273J2161j926j4372J000O349o76
5276f896R0P362P496o132O79M768M829r449n723q918l383j0439P757J4452Q550
5261E043j6651O278R52M591J6076Q46j2034m259k003l925j0786P418K164l795
5247a0085k162J518l586k631J3883K693p639O78o20m222n639q869L934J7929j0203
5232a5021P769P608l596k034o56J4l734K262J0762m135k270J1927K4318O831q900
5217C1145j2741q494q742J652M612K154J0939m289j4854r695k83M895J5447O92
5203A2438j2416j0727J1604N324o472l415L738N244m936K163j2043j0020L539
5190a5979K1372j2223n416N010N351K087q186n508p778k049K777J5177J2379r577
$$ plain form
5176 -2563 -16370 -16739 -8624 -2744 -1220 -6521 -7980 -23847 -36894 -13621 -9 -7688 -6549 -10164
5162 -10164 -6169 12093 15217 4477 -3673 -10624 -22900 -19210 -19981 -13105 -332 16518 21161 18255
5148 18255 12386 10170 -14300 -17734 -2939 782 16878 28454 34572 22846 9345 -4188 3142
5135 3142 17221 7748 -209 -9928 -20307 -16744 -14346 -19662 -23546 -20726 -4117 7978 5154 1672
5121 1672 9864 9981 10376 14721 1372 -2484 -1753 -3757 -6546 -14866 -1710 11517 19736 17791 -185
5106 -185 -14132 -14419 6001 14463 18694 3210 -10677 -9259 -5961 -8194 -3381 340 -2806 -10701
5092 -10701 -5781 1688 1940 -8869 -12814 -7941 5256 -1301 -11942 -15119 -10409 -5561 -12795 -13588
5078 -13588 -7493 1405 3992 -1891 -5109 -7855 -16259 -21831 -19128 -7611 -2732 4620 10904 11987
$$ packed form
5176b563j3807l69Q115N880J524n301j459j5867j3047K3273J3612p679J139l615
5162a0164L995J8262L124j0740q150o951j2276L690p71O876J2773J6850M643k906
5148A8255n869k216k4470l434J4795L721J6096J1576O118j1726j3501j3533P330
5135C142J4079r473p957r719j0379L563K398n316l884K820J6609J2095k824l482
5121A672Q192J17L95M345j3349l856P31k004k789q320J3156J3227Q219j945j7976
5106a85j3947k87K0420Q462M231j5484j3887J418L298k233M813L721l146p895
5092a0701M920P469K52j0809l945M873J3197o557j0641l177M710M848p234p93
5078a3588O095Q898K587n883l218k746q404n572K703J1517M879P352O284J083
$$ plain form
5064 11987 3979 -15505 -12587 -12732 -20700 -7353 352 1129 -5339 -13500 -10272 -9802 -21662 -20186 -19184
5049 -19184 -15420 -1548 -7736 -14738 -1164 -10805 -17335 -13001 -5084 -5571 -9167 -5786 4283 -3438
5035 -3438 -8975 21 5714 10998 12406 8221 -3925 -6274 -14774 -16337 -14867 -7175 -5550 -18935
5021 -18935 -10156 -17548 -3635 7899 15429 10150 2702 11952 1719 -8501 -9054 -16500 -11127 2651
5007 2651 2086 -132 3525 4784 -8911 -10218 -11340 -13456 -16529 -24084 -19353 -2844 -2517 -13074 -11527
4992 -11527 -23136 -31985 -32502 -31471 -19679 -4365 -830 4682 1289 8490 7966 3206 13102 9010
4978 9010 4451 990 2246 4528 5331 -1460 -8747 -12127 -7596 -3340 763 5508 2152 1549 13855
4963 13855 14369 16141 9928 10943 23620 9894 1185 8589 3427 -1322 2307 6612 -9166 -4024
$$ packed form
5064A1987q008j9484K918j45p968J3347P705P77o468q161L228M70j1860J476J002
5049a9184L764J3872o188p002J3574r641o530M334P917m87l596L381J0069p721
5035c438n537Q996N693N284J408m185j2146k349q500j563J470P692J625j3385
5021a8935Q779p392J3913J1534P530n279p448R250j0233j0220n53p446N373J3778
5007B651n65k218L657J259j3695j307j122k116l073p555M731J6509L27j0557J547
4992a1527j1609q849n17J031J1792J5314L535N512l393P201n24m760R896m092
4978I010m559l461J256K282Q03o791p287l380M531M256M103M745l356o03J2306
4963A3855N14J772o213J015J2677j3726q709P404n162m749L629M305j5778N142
$$ plain form
4949 -4024 8133 11517 1889 -6341 -14898 -11900 -1693 2644 -9195 -22040 -32088 -34221 -20148
4936 -20148 -11988 -9733 -14473 -29458 -32984 -15621 7125 -99 -9320 -6885 -11143 -20291 -18414 -6259
4922 -6259 9194 6869 7147 12799 550 -2157 1743 6704 3246 3336 -4016 -2376 6939 -1227 633
4907 633 -1031 -2679 -2377 -8244 -16416 -1859 13566 4949 4514 13161 14880 6569 12454 14152 18448
4892 18448 11042 12369 11639 2927 -13299 -13078 -5240 -4465 1628 -15880 -19325 -11785 -13957 -12269 -9298
4877 -9298 -12276 -12313 -8866 -14640 -9653 -6607 -7629 -20251 -28220 -35681 -35276 -31211 -21275 -13043 -9461
4862 -9461 -14918 -2698 10492 6621 -4637 -4909 4754 3976 2791 9827 9003 -2000 29 -5327 -3069
4847 -3069 15827 12515 11570 8445 4268 10915 8918 7212 -4850 608 -5879 -7771 6133 9132
$$ packed form
4949d024J2157L384r628q230q557K998J0207M337j1839j2845j0048k133J4073
4936b0148Q160K255m740j4985l526J7363K2746p224r221K435m258r148J877J2155
4922f259J5453k325K78N652j2249k707L900M961l458R0p352J640R315q166J860
4907F33j664j648L02n867q172J4557J5425q617m35Q647J719q311N885J698M296
4892A8448p406J327p30q712j6226K21P838P75O093j7508l445P540k172J688K971
4877i298k978l7L447n774M987L046j022j2622p969p461M05M065R936Q232L582
4862i461n457J2220J3190l871j1258k72R663p78j185P036q24j1003K029n356K258
4847c069J8896l312r45l125m177O647j997j706j2062N458o487j892J3904K999
$$ plain form
4833 9132 7369 -3320 -2011 -2108 7840 8856 4809 12273 13000 7086 7071 7076 -1003 11967 16100 11745
4817 11745 14774 5099 -15399 -25796 -5812 -7400 -6274 -8048 -21379 -18829 -3032 -2759 -18446
4804 -18446 -21800 -14287 -20766 -26958 -11771 -3375 2467 11449 13388 2336 2057 11218 7301 18461
4790 18461 10835 2143 9908 24294 17156 9657 -2989 -5418 11 2479 4621 14219 9315 -1429
4776 -1429 4865 7027 -2929 -2576 6925 13523 11587 23228 40251 32374 12809 5957 2984 7593
4762 7593 18737 5861 -5768 139 10724 9864 15899 28031 27153 23803 9754 8209 10443 8470
4748 8470 3271 -1046 5313 -8372 -13021 -15914 -15915 -18097 -26439 -17886 -11384 -10823 -4917 5084 -4116
4733 -4116 -3684 864 -11203 -19962 -3214 -3574 -17068 -123 7689 121 314 235 -1344 -3755 -4524
$$ packed form
4833I132j763j0689J309r7R948J016m047P464P27n914j5Nq079J2970M133m355
4817A1745L029r675k0498j0397J9984j588J126j774j3331K550J5797K73j5687
4804a8446l354P513o479o192J5187Q396N842Q982J939j1052k79R161l917J1160
4790A8461p626q692P765J4386p138p499j2646k429N429K468K142R598m904j0744
4776a429O294K162r956L53R501O598j936J1641J7023p877j9565o852k973M609
4762G593J1144j2876j1629N907J0585q60O035J2132q78l350j4049j545K234j973
4748H470n199m317O359j3685m649k893jk182q342Q553O502N61N906J0001r200
4733d116M32M548j2067q759J6748l60j3494J6945P812p568J93p9j579k411p69
$$ plain form
4718 -4524 -606 -2099 2253 3341 7760 7714 -1284 -5452 3422 8534 3144 10420 7620 3435 6591
4703 6591 10640 8950 9348 894 2816 5356 6267 9976 20986 24024 20189 13427 8470 9628 -2156
4688 -2156 9064 11988 4945 13148 12292 10124 12884 11366 7306 16134 13220 -1289 8430 6632 -7709
4673 -7709 7014 13441 4768 -5698 -8662 -10874 -3320 6742 46 8817 21707 14459 14696 13682
4659 13682 11657 9227 -7402 -15844 -8136 -2270 -5348 -4599 10274 11911 10120 371 7992 14581
4645 14581 22570 12519 -14660 -26240 -4553 10028 13524 17631 23236 10586 -815 -4263 614
4632 614 -6098 -20246 -18489 -12921 -15461 -8096 -1122 6329 5633 3501 -4990 -7006 -4830 4814 14907
4617 14907 16252 19075 6846 -4048 -4189 1814 5989 8156 1828 -10312 -14075 -15125 -12242 -5336
$$ packed form
4718d524L918j493M352J088M419m6q998m168Q874N112n390P276k800m185L156
4703F591M049j690L98q454J922K540R11L709J1010L038l835o762m957J158j1784
4688b156J1220K924p043Q203q56k168K760j518m060Q828k914j4509R719j798j4341
4673g709J4723O427q673j0466k964k212P554J0062o696Q771J2890p248K37j014
4659A3682k025k430j6629q442P708N866l078P49J4873J637j791r749P621O589
4645A4581P989j0051k7179j1580K1687J4581L496M107N605j2650j1401l448M877
4632F14o712j4148J757N568k540P365O974P451o96k132q491k016K176R644J0093
4617A4907J345K823j2229j0894j41O003M175K167o328j2140l763j050K883O906
$$ plain form
4603 -5336 2111 12870 14855 6675 6514 14934 12016 7136 1509 -2731 1137 15456 27382 15954
4589 15954 -4787 264 5142 11203 14320 24896 25976 20452 14121 4430 -511 -10925 -14044 -23582
4575 -23582 -36808 -22483 -7329 -12627 -23698 -16323 -9707 -1755 407 1825 10448 16047 26420
4562 26420 24527 18173 4728 -1804 -2563 1569 3645 -3892 -3082 -2414 -8943 -10975 -3290 7641 4094
4547 4094 1841 4068 1276 -5174 364 10349 16073 9447 8348 6463 17258 21333 16318 20922 24961
4532 24961 13662 10888 114 1418 13649 16070 8414 673 2351 4272 -5138 -506 -4521 -11777
4518 -11777 -17357 -15627 -1906 10637 -410 1815 11104 11201 330 2711 -4660 -2202 8349 15917
4504 15917 21043 22883 21110 7526 -1398 -2360 -8133 -6232 -7362 -15071 -17127 -3761 -927 -2858
$$ packed form
4603e336P447J0759J985q180j61Q420k918m880n627m240L868J4319J1926j1428
4589A5954k0741N051M878O061L117J0576J080n524o331r691m941j0414l119r538
4575b3582j3226J4325J5154n298j1071P375O616P952K162J418Q623N599J0373
4562B6420j893o354j3445o532p59M132K076p537Q10O68o529k032P685J0931l547
4547D094k253K227k792o450N538R985N724o626j099j885J0795M075n015M604M039
4532B4961j1299k774j0774J304J2231K421p656p741J678J921r410M632m015p256
4518a1777n580J730J3721J2543j1047K225R289R7j0871K381p371K458J0551P568
4504A5917N126J840j773j3584q924r62n773J901j130p709k056J3366K834j931
$$ plain form
4490 -2858 5204 9054 -1179 -5846 11195 10927 4571 -1626 -2138 -4428 9523 11630 7473 3640 5770
4475 5770 6485 2858 -1429 -10566 -8913 -470 20272 30307 19766 8475 -1275 -5211 -6709 -1505
4461 -1505 -1678 -6675 -3295 6942 10303 10515 16928 24683 32377 12203 4818 -5590 -5853 -9487 -8276
4446 -8276 -11000 -10823 796 9927 12904 4394 -9305 -13596 -3377 2891 -1175 -1822 -9109 7870
4432 7870 17530 6655 5958 16665 14982 18480 10204 1981 5443 -6840 -7779 -814 2965 -12285
4418 -12285 -19012 -8528 -16004 -14029 -4018 -563 -10542 -9185 -11520 -14838 -15851 -8410 -8604 -6423
4404 -6423 -13459 -5275 4200 6291 2593 -7225 -12938 -14211 -5682 -5768 -4014 -1808 -2719 3671 1343 -7727
4388 -7727 -11790 -1221 -4553 -12597 -2492 -15233 -15066 -11091 -10628 -4460 -8477 -25857 -19458 -2272
$$ packed form
4490b858Q062L850j0233m667J7041k68o356o197n12k290J3951K107m157l833K130
4475E770P15l627m287r137J653Q443K0742J0035j0541j1291r750l936j498N204
4461a505j73m997L380J0237L361K12O413P755P694k0174p385j0408k63l634J211
4446h276k724J77J1619R131K977q510j3699m291J0219O268m066o47p287J6979
4432G870R660j0875o97J0707j683L498q276q223L462j2283r39O965L779j5250
4418a2285o727J0484p476J975J0011L455r979J357k335l318j013P441j94K181
4404f423p036Q184R475K091l698r818n713j273Q529q6J754K206r11O390k328r070
4388g727m063J0569l332q044J0105j2741J67L975M63O168m017j7380O399J7186
$$ plain form
4374 -2272 -594 5716 -1997 -1293 2886 -5757 2585 8198 9696 8024 2136 13646 17644 6870 1236
4359 1236 6068 4529 -9961 -8885 -7776 473 -7448 -18983 -17472 -3114 5475 5221 -5542 -11835
4345 -11835 -5784 8082 9906 9632 7645 7249 5683 -5971 -3691 13956 7970 -4796 -959 -14071
4331 -14071 -11416 -10623 -16781 -14343 -6321 -11399 -20673 -5708 1111 -3011 6454 5693 -5185 -22428
4317 -22428 -28856 -14234 -8333 -10620 -3114 -10746 -20448 -19883 -8429 11649 21954 13497 13479 17666
4303 17666 2880 -3959 20636 22110 20368 10213 -3718 -4113 2301 -2929 -3354 5410 9720 10940
4289 10940 -969 4783 9024 22253 15295 9143 9081 10578 17683 11903 17327 23124 20902 13525 5304
4274 5304 2565 8858 6974 3284 3484 -2927 -3306 4908 15987 7704 5469 -2489 -1618 3486 8260
$$ packed form
4374b272J678O310p713P04M179q643Q342N613J498j672n888J1510L998j0774n634
4359A236M832j539j4490J076J109Q249p921j1535J511J4358Q589k54j0763o293
4345a1835O051J3866J824k74j987l96j566j1654K280J7647n986j2766L837j3112
4331a4071K655P93o158K438Q022n078r274J4965O819m122R465p61j0878j7243
4317b2428o428J4622N901k287P506p632r702N65J1454K0078J0305q457j8M187
4303A7666j4786o839K4595J474j742j0155j3931l95O414n230m25Q764M310J220
4289A0940j1909N752M241J3229o958o152o2J497P105n780N424N797k222p377q221
4274E304k739O293j884l690K00o411l79Q214J1079q283k235p958Q71N104M774
$$ plain form
4259 8260 13786 19573 20702 21617 28098 21772 9611 11906 14627 18886 13711 8728 -2666 -6132 -272
4244 -272 7875 8377 -5902 -23954 -26888 -11708 -17065 -11247 -12840 -19735 -21493 -23084 -17617 -10855 -2165
4229 -2165 13540 23947 16113 18086 22493 19859 11481 5056 -6582 -15200 -7366 -5853 -446 16913
4215 16913 2736 -5288 -12787 -2346 -8863 -13490 -9040 -167 902 -4339 -11039 -497 5567 8032
4201 8032 14277 9333 3426 -4723 -9777 -21143 -25177 -19487 6216 -6449 -16322 -24586 -17504 -19224
4187 -19224 -8512 6847 2780 -15087 -15295 -10785 -6618 -6118 -3446 4394 15145 17701 29739 32894
$$ packed form
4259H260N526N787J129R15O481o326j2161K295K721M259n175m983j1394l466N860
4244b72Q147N02j4279j8052k934J5180n357N818j593o895j758j591N467O762Q690
4229b165J5705J0407p834J973M407k634q378o425j1638q618P834J513N407J7359
4215A6913j4177q024p499J0441o517m627M450Q873J069n241o700J0542O064K465
4201H032O245m944n907q149n054j1366m034N690K5703j2665r873q264P082j720
4187a9224J0712J5359m067j7867k08M510M167N00K672P840J0751K556J2038L155
$$ [...]
##END NTUPLES=NMR SPECTRUM
##END=
