##TITLE=Analysis number 322864
Compound Code cc 48302
Book Reference 439/189/27
Project Code adrs
Chemist Name ronp
##JCAMPDX= 6.0         $$ Bruker NMR JCAMP-DX V2.0
##DATA TYPE= NMR SPECTRUM
##DATA CLASS= NTUPLES
##ORIGIN= Bruker BioSpin GmbH
##OWNER= nmr
$$ XWIN-NMR		Version 3.5
$$ Mon Oct 16 10:06:59 2006 GMT Daylight Time (UT+1h)  MAYBRIDGE\nmr@NMR_250MHZ
##.OBSERVE FREQUENCY= 250.131544655141
##.OBSERVE NUCLEUS= ^1H
##.ACQUISITION MODE= SIMULTANEOUS (DQD)
##.ACQUISITION SCHEME= undefined
##.AVERAGES= 16
##.DIGITISER RES= 18
##SPECTROMETER/DATA SYSTEM= dpx250
##.PULSE SEQUENCE= zg30
##.SOLVENT NAME= CDCl3
##.SHIFT REFERENCE= (INTERNAL, CDCl3, 0, 16.522)
##AUDIT TRAIL= $$ (NUMBER, WHEN, WHO, WHERE, WHAT)
$$ ##TITLE= Audit trail, XWIN-NMR		Version 3.5
$$ ##JCAMPDX= 5.01
$$ ##ORIGIN= Bruker BioSpin GmbH
$$ ##OWNER= nmr
$$ C:\u/data/dgb/nmr/ADRS/470/pdata/1/auditp.txt
$$ ##AUDIT TRAIL=  $$ (NUMBER, WHEN, WHO, WHERE, WHAT)
(   1,<2006-10-16 10:06:35.47 +100>,<MAYBRIDGE\nmr>,<NMR_250MHZ>,
      <created by zg, POWCHK disabled, PULCHK disabled
       configuration hash MD5:
       49 4B E0 1D 92 C2 6B 37 9F E6 65 BC 52 41 86 1D
       data hash MD5: 64K
       ED 34 93 F6 82 6A 6B 40 DA 14 CA 37 FA 09 78 96>)
(   2,<2006-10-16 10:06:49.05 +100>,<MAYBRIDGE\nmr>,<NMR_250MHZ>,
      <Start of raw data processing
       ef LB = 0.3 FT_mod = 6 PKNL = 1 SI = 32K 
       data hash MD5: 32K
       8E 77 48 FF E3 59 3D 59 AB 57 DC D6 8C 39 1E 84>)
(   3,<2006-10-16 10:06:50.85 +100>,<MAYBRIDGE\nmr>,<NMR_250MHZ>,
      <apk 
       data hash MD5: 32K
       BA AC 04 AC 1A AF 5B 87 7E 29 09 5E 26 70 88 C1>)
(   4,<2006-10-16 10:06:52.35 +100>,<MAYBRIDGE\nmr>,<NMR_250MHZ>,
      <abs ABSG = 5 
       data hash MD5: 32K
       D8 83 84 BC E0 F7 00 19 79 78 9B 3B 92 E4 D9 90>)
$$ ##END=
$$ 
$$ hash MD5
$$ D6 C1 62 66 BE FB 8C 75 FD 8B F8 A8 FC 58 60 D9
##$RELAX= 
##$RELAX= 
##$RELAX= 
##$RELAX= 
##$RELAX= 
##$RELAX= 
##$RELAX= 
$$ Bruker specific parameters
$$ --------------------------
##$DU= <C:\u>
##$EXPNO= 470
##$NAME= <ADRS>
##$PROCNO= 1
##$TYPE= <nmr>
##$USER= <dgb>
##$AMP= (0..31)
100 100 100 100 100 100 100 100 100 100 100 100 100 100 100 100 100 100 
100 100 100 100 100 100 100 100 100 100 100 100 100 100 
##$AQSEQ= 0
##$AQ_mod= 3
##$AUNM= <au_zg>
##$AUTOPOS= <33 >
##$BF1= 250.13
##$BF2= 250.13
##$BF3= 250.13
##$BF4= 250.13
##$BF5= 500.13
##$BF6= 500.13
##$BF7= 500.13
##$BF8= 500.13
##$BYTORDA= 1
##$CFDGTYP= 0
##$CFRGTYP= 5
##$CHEMSTR= <none>
##$CNST= (0..31)
1 1 145 1 1 1 1 1 1 1 1 1 1 1 1 1 1 1 1 1 1 1 1 1 1 1 1 1 1 1 1 1 
##$CPDPRG= <>
##$CPDPRG1= <>
##$CPDPRG2= <>
##$CPDPRG3= <>
##$CPDPRG4= <mlev>
##$CPDPRG5= <mlev>
##$CPDPRG6= <mlev>
##$CPDPRG7= <mlev>
##$CPDPRG8= <mlev>
##$CPDPRGB= <>
##$CPDPRGT= <>
##$D= (0..31)
0 1 0 0 0 0 0 0 0 0.06 0 0 0 0 0 0 0.0002 0 0 0 0 0 0 0 0 0 0 0 0 0 0 
0 
##$DATE= 1160989594
##$DBL= (0..7)
120 120 120 120 120 120 120 120 
##$DBP= (0..7)
150 150 150 150 150 150 150 150 
##$DBP07= 0
##$DBPNAM0= <>
##$DBPNAM1= <>
$$ [...]
##$SUBNAM7= <"">
##$SUBNAM8= <"">
##$SUBNAM9= <"">
##$SW= 20.6930455092707
##$SWIBOX= (0..15)
0 0 3 0 0 0 0 0 0 0 0 0 0 0 0 0 
##$SW_h= 5175.983436853
##$TD= 65536
##$TD0= 1
##$TE= 683.16
##$TE2= 300
##$TE3= 300
##$TEG= 300
##$TL= (0..7)
0 120 120 120 120 120 120 120 
##$TP= (0..7)
150 150 150 150 150 150 150 150 
##$TP07= 0
##$TPNAME0= <>
##$TPNAME1= <>
##$TPNAME2= <>
##$TPNAME3= <>
##$TPNAME4= <>
##$TPNAME5= <>
##$TPNAME6= <>
##$TPNAME7= <>
##$TPOAL= (0..7)
0.5 0.5 0.5 0.5 0.5 0.5 0.5 0.5 
##$TPOFFS= (0..7)
0 0 0 0 0 0 0 0 
##$TUNHIN= 0
##$TUNHOUT= 0
##$TUNXOUT= 0
##$USERA1= <user>
##$USERA2= <user>
##$USERA3= <user>
##$USERA4= <user>
##$USERA5= <user>
##$V9= 5
##$VALIST= <valist>
##$VCLIST= <CCCCCCCCCCCCCCC>
##$VD= 0
##$VDLIST= <DDDDDDDDDDDDDDD>
##$VPLIST= <PPPPPPPPPPPPPPP>
##$VTLIST= <TTTTTTTTTTTTTTT>
##$WBST= 1024
##$WBSW= 4
##$XGAIN= (0..3)
0 0 0 0 
##$XL= 0
##$YL= 0
##$YMAX_a= 522478
##$YMIN_a= -513059
##$ZGOPTNS= <>
##$ZL1= 120
##$ZL2= 120
##$ZL3= 120
##$ZL4= 120
##$ABSF1= 16.522
##$ABSF2= -4.171173
##$ABSG= 5
##$ABSL= 3
##$ALPHA= 0
##$AQORDER= 0
##$ASSFAC= 0
##$ASSFACI= 0
##$ASSFACX= 0
##$ASSWID= 0
##$AUNMP= <proc_1d>
##$AZFE= 0.1
##$AZFW= 0.1
##$BCFW= 0
##$BC_mod= 0
##$BYTORDP= 0
##$COROFFS= 0
##$CY= 12.5
##$DATMOD= 1
##$DC= 0
##$DFILT= <>
##$DTYPP= 0
##$F1P= 14.0000005364418
##$F2P= -0.99999901652339
##$FCOR= 0.5
##$FTSIZE= 32768
##$FT_mod= 6
##$GAMMA= 0
##$GB= 0
##$INTBC= 1
##$INTSCL= 1
##$ISEN= 128
##$LB= 0.3
##$LEV0= 0
##$LPBIN= 0
##$MAXI= 10000
##$MC2= 0
##$MEAN= 0
##$ME_mod= 0
##$MI= 0
##$NCOEF= 0
##$NC_proc= -2
##$NLEV= 6
##$NOISF1= 0
##$NOISF2= 0
##$NSP= 0
##$NTH_PI= 0
##$NZP= 0
##$OFFSET= 16.522
##$PC= 1
##$PHC0= -47.67512
##$PHC1= 3.583125
##$PH_mod= 1
##$PKNL= yes
##$PPARMOD= 0
##$PSCAL= 4
##$PSIGN= 0
##$REVERSE= no
##$SF= 250.13
##$SI= 32768
##$SIGF1= 0
##$SIGF2= 0
##$SINO= 400
##$SIOLD= 32768
##$SREGLST= <1H.CDCl3>
##$SSB= 0
##$STSI= 32768
##$STSR= 0
##$SW_p= 5175.98343685301
##$SYMM= 0
##$S_DEV= 0
##$TDeff= 65536
##$TDoff= 0
##$TI= <Analysis number 999999
Compound Code 99
Book Reference 9
Project Code 9>
##$TILT= no
##$TM1= 0
##$TM2= 0
##$TOPLEV= 0
##$USERP1= <user>
##$USERP2= <user>
##$USERP3= <user>
##$USERP4= <user>
##$USERP5= <user>
##$WDW= 1
##$XDIM= 32768
##$YMAX_p= 537906729
##$YMIN_p= -142132
$$ End of Bruker specific parameters
$$ ---------------------------------
##NTUPLES= NMR SPECTRUM
##VAR_NAME=  FREQUENCY,     SPECTRUM/REAL,   SPECTRUM/IMAG
##SYMBOL=    X,             R,               I
##VAR_TYPE=  INDEPENDENT,   DEPENDENT,       DEPENDENT
##VAR_FORM=  AFFN,          ASDF,            ASDF
##VAR_DIM=   32768,         32768,           32768
##UNITS=     HZ,            ARBITRARY UNITS, ARBITRARY UNITS
##FACTOR=    0.157963299565203, 1,           1
##FIRST=     4132.6476996994, 0,             0
##LAST=      -1043.33573715361, 0,           0
##MIN=       -1043.33573715361, -142132,     0
##MAX=       4132.6476996994, 537906729,     0
$$ Real data points
##PAGE= N=1
##DATA TABLE= (X++(R..R)), XYDATA
$$ [...]
19156h079O93m318k10O216Q121j4061l536P389L392j3452R115l635M221R802Q836
19141A0494R685n086q25J2689k682J760J1954r800j4465P366N323j4064j2856
19128e07K599J2716K856j2137p355M391r863m799J030O057J842N72J0033j5275
19114g840o246P214j2156P58K103J3870P924J209N31M910k498J0768q950j2091
19100d94L966P582J7338K309O533P615J695M838o886l3764m495o447j3558l178
19086a6946Q548M420k382j1027M665k57j1349N809J6511J0263p358J0028m565
19073F360j8083j396O864N9j6671r082O705L38J088J486J097M431K014O500o019
19058a4309Q674K0047m464r6k429O269L988j1306o91J9740J099m677j8007K031
$$ plain form
19156 -8079 -7386 -11704 -11914 -5698 2423 -11638 -15174 -7785 -4393 -17845 -8730 -12365 -8144 1658 10494
19141 10494 20179 15093 14268 26957 24275 26035 37989 28189 13724 21090 26413 12349 -507
19128 -507 2092 14808 17664 5527 -1828 2563 -7300 -12099 -11069 -5012 -3170 -2598 7435 -7840
19114 -7840 -14086 -6872 -19028 -18270 -16167 -2297 5627 6836 7367 12277 9779 20547 11597 -494
19100 -494 3472 11054 28392 30701 37234 44849 46544 51382 44496 10732 6237 -210 -13768 -16946
19086 -16946 -8398 -3978 -6360 -17387 -12722 -12979 -24328 -18519 -2008 8255 897 10925 6360
19073 6360 -11723 -13119 -6255 -6196 -22867 -31949 -25244 -24906 -23818 -22332 -21235 -16804 -14790 -8290 -14309
19058 -14309 -5635 14412 9948 9852 7423 13692 17680 6374 5683 25423 26522 21845 3838 5869
19044E869J1765K139J3533J4815J6164r462k4881L5434L3693M7952P4979P1011
19032B93011N1969K9257K0805j8736l4429o4406o0223l8915m4705j8184J7222
19021A32666J7142L3718N5717O9806P4830N0400J3990k9544o8523p6392p3464
19010B00346m8914m5096k1757l4766n934L584j1370M635p09k0674l083n975N840
18997A6127N853p872o91Q350n731R466k223k1399j3513j7343J1132J2396O93K396
18983b359J0754J4929j0287n456j1120k1020P662J6687J7179J1136k248j2651
18971A3206p864R834k693k928O462j570L402k757q736P283J91M553K4029r78N130
18956D6564l611p188M070m688q48j4815j9550P197M861l906K328j3090M619l715
$$ plain form
19044 5869 17634 19773 33306 48121 64285 54823 29942 65376 99069 147021 222000 293011
19032 293011 344980 374237 395042 376306 341877 277471 217248 178333 133628 115444 132666
19021 132666 149808 183526 239243 309049 383879 434279 448269 418725 350202 273810 200346
19010 200346 151432 106336 84579 49813 43879 47463 36093 40728 40019 19345 16262 10287 16127
18997 16127 21980 14108 13417 21767 16036 25502 23279 1880 -11633 -28976 -17844 -5448 -4755 -2359
18983 -2359 8395 23324 13037 7581 -3539 -24559 -16897 -210 16969 28105 25857 13206
18971 13206 5342 15176 12483 9555 16017 14447 17849 15092 6356 13639 13830 18383 42412 41434 46564
18956 46564 42953 35765 39835 35147 34299 19484 -66 7131 11992 8086 10414 -2676 1943 -1772
18942a772q407o442L110P010k371j7025M512K405j0203J4966L1606L3494j2393
18929C8490k775P910j4924j1715K038m655j6546j1295n296K1337Q156J0336J7158
18916C8219o135o735p141m815K002l927Q400J0494l127J465r119r328p78j0303
18902h28J360o452j1839k447l663P266K0325K016J286j0471j0576M975k552J7103
18888E503P865p835j2233l017J0805L413P769Q864o239p405k480j932J8354N813
18874B7245q038q002M781k990O736J774r951q918k2465L716K5802n368j9855N175
18860a0358K0591k621l118Q022O100r50M298K28j4721p533q204J4236K343J2875
18846B1188o116P587Q07j173l614j8568M374n962j2386L006J2441J5589l317j797
$$ plain form
18942 -1772 -10179 -16621 -13511 -6501 -8872 -25897 -21385 -18980 -29183 -14217 17389 50883 38490
18929 38490 35715 43625 28701 16986 19024 14369 -2177 -13472 -18768 2569 10725 21061 38219
18916 38219 32084 25349 18208 13393 15395 11468 19868 30362 27235 28700 19581 10253 9475 -828
18902 -828 532 -5920 -17759 -20206 -23869 -16603 3722 5738 7024 -3447 -14023 -9048 -11600 5503
18888 5503 13368 5533 -6700 -9717 1088 4501 12270 21134 14895 7490 5010 3078 21432 27245
18874 27245 19207 11205 15986 12996 19732 21506 11555 2637 -19828 -16112 9690 4322 -15533 -10358
18860 -10358 10233 7612 4494 12516 18616 17666 21964 22192 7471 -62 -8266 5970 8313 21188
18846 21188 15072 22659 23466 22293 18679 111 4485 -1477 -13863 -10857 1584 17173 13856 12059
18832A2059O611j6484J268J0774j139K4148J3726n630j4541k4640k031J1859R260
18819B5240o32j2012L374R073J0278j6877k7875j7686P664J8607Q444r43L480
18806A0135K48j7619K3045M920l263R275q639m42l494j412q304k926R189j717
18792H996J7397J942j273p09R321r343p12j0878m943o645P525M432J368K984p08
18777A8754O40p102J6732J261j0760O617J6399K2359K4796J3403J2042j0477l3959
18764G0705k3169j2457j1498j4022j3317J529L4N162K3104o20k2000Q268J0087
18751B1806J8114J298J2429M606j7756p539k600Q001l856k3572l441n599k0169
18738a8278q144L115m377j000J0919K0348L096K143O860k0173k3828m487l965
$$ plain form
18832 12059 18670 2186 3454 14228 13089 37237 50963 45333 30792 6152 4121 15980 25240
18819 25240 24608 12596 15970 25043 35321 18444 -9431 -27117 -19453 -846 7598 6655 10135
18806 10135 10383 -7236 15809 20729 17466 26741 18102 17660 14166 12754 4450 1524 10713 8996
18792 8996 26393 28335 27062 26353 35674 26331 25619 14741 9798 3153 10678 15110 16478 19462 18754
18777 18754 19394 12292 29024 30285 19525 26142 42541 64900 89696 103099 115141 104664 70705
18764 70705 47536 35079 23581 9559 -3758 -2229 -2195 2967 26071 25451 3451 11719 21806
18751 21806 39920 41218 53647 58253 40497 32958 30358 38359 34503 10931 7490 1891 -18278
18738 -18278 -26422 -23307 -27684 -28684 -17765 2583 5679 7822 14682 -5491 -29319 -33806 -37771
18725c7771q2k425M753K4631J3659p5o320L395o280l174j0772l184J0671n589
18711a8563K0167J7806j120j0167k152M747N617k141j4333j504O769j1716q149
18698a4739N513o316K947J9713J2318N269j997J6637J8059L181J0210M029J991
18685G6815j4411j7181j1464o520m275j0596K6824J5104O24J5040j2517j4652
18673D2791J6769J4796J985m682J643N76r505j5626q86k90k220k7685K818J1882
18659C2366m768k0042L419K5494J3657j5558j1671j8933J5912J1063J270R49k5427
18646G731k3602j6029L733N428K0566J1774P806P446n190k2667k897j932J7544
18633I711K2100j0714l4146o957K1441J1507R298J8513K025L737j1363P396J326
$$ plain form
18725 -37771 -37853 -40278 -35525 -10894 2765 2690 -3630 -235 -6515 -9689 -20461 -23645 -12974 -18563
18711 -18563 1604 19410 18290 8123 5971 10718 16335 14194 -139 -1643 5126 -6590 -14739
18698 -14739 -9226 -15542 -12595 7118 19436 24705 22708 39345 57404 60585 70795 74824 76815
18685 76815 62404 45223 33759 27239 22964 12368 39192 54296 54920 69960 57443 42791
18673 42791 59560 74356 76341 71659 73302 73878 64373 48747 47861 47571 45351 17666 20484 32366
18659 32366 27598 7556 10975 36469 50126 34568 22897 3964 19876 30939 32209 33158 7731
18646 7731 -15871 -31900 -28167 -22739 -2173 9601 17407 24853 19663 -3004 -5901 -7833 9711
18633 9711 31811 21097 -13049 -20006 1435 12942 22240 40753 42778 46515 35152 42548 43874
18620D3874k0113k1219J6576J4239Q511K695j1075k654J1170J1650J002Q403N843
18607F8902o235k8568n025k5856K715K8518N185o051K1093J4960j2391o970k1708
18594B8569j7947O056P647K674j3288j0159R541J4475L096M433K498K57J3795
18581E1647L874o856l0792J41J0041J5559J0134J5490J4498K658j6088J6285M949
18568I1540K472n36j6775l375K8867K6180Q286M40q127q917l727j0599l666j1643
18554I0420q419J1819M972q523P604L2753L3271J1488m676J0749j0406k9742L086
18541A44396O956J007j0204k1243k2941q760p108K3500Q378K142o104j032R758
18528A18745J3702J2585j9702j5421R239j4325J9083O904k1255o882J8911J0620
$$ plain form
18620 43874 23761 2542 19118 33357 41868 44563 33488 30834 42004 53654 54656 63059 68902
18607 68902 62667 34099 29074 3218 5933 34451 39636 33585 54678 69638 57247 50277 28569
18594 28569 10622 16678 24325 26999 13711 3552 13093 27568 30664 35097 37595 37852 51647
18581 51647 55521 48665 17873 18014 28055 43614 53748 69238 83736 86394 70306 86591 91540
18568 91540 94012 93476 76701 73326 102193 128373 136659 137099 128972 120055 116328 105729 102063 90420
18554 90420 82001 93820 98792 90269 97873 130626 163897 175385 170709 181458 171052 141310 144396
18541 144396 151352 152359 142155 120912 97971 89211 82103 105603 113981 116123 110019 108987 118745
18528 118745 132447 145032 125330 109909 119148 104823 123906 130810 109555 102673 121584 132204
18516A32204j1050n359J0004N031J6877P665m265q272K4941J2371K3670J3394
18504B17211j911M04P110r1N285K7733K1696k0984j2030K6090K3623J5076J6653
18491C25865J8924J5202J8m160N033J9865K3976k376J1034K2002P610l137J1549
18478D51405L1395L3423K1190K8414L0062L2635J4896J5521L9989N6344O8479
18467H23753R0997R2780J32772J44468J53507J80571J66176J29015N2582n571
18457A961050k4169j5573L8767R8497J23425J64040K37095L24401M17590M98495
18447C823618N61854O54200P38917Q66540J126639J621865K514859L952201O058634
18438B1919327Q733024J1360252J2935196J1872846Q076179J724204n578455j0009365
$$ plain form
18516 132204 121154 115795 125799 130830 147707 155372 151107 142835 167776 180147 203817 217211
18504 217211 215300 215704 222814 222723 228008 255741 277437 256453 244423 270513 294136 309212 325865
18491 325865 344789 359991 360009 355849 360882 380747 404723 402347 413381 435383 442993 439856 451405
18478 451405 482800 516223 537413 565827 595889 628524 643420 658941 698930 755274 823753
18467 823753 914750 1007530 1140302 1284770 1438277 1618848 1785024 1914039 1966621 1961050
18457 1961050 1936881 1921308 1960075 2058572 2181997 2346037 2583132 2907533 3325123 3823618
18447 3823618 4385472 5039672 5778589 6645129 7771768 9393633 11908492 15860693 21919327
18438 21919327 30652351 42012603 54947799 66820645 74896824 76621028 71042573 61033208
18430F1033208j2575924j1009742q016129m600194j520233J156133L936934P042775
18422C5446828J0087261J2219662J1934120Q619936K798188n142627j0327409
18415F5635959j3753309j3144238j0408522p281783m636217k971508j960734j337437
18407A0142211r96269p82161o81311o31528n93923n36037m67616m06947l39733
18398D706686k80633k03378j55707j11880n1935n4637o7580q8660j32219j89332
18388C370725k37911k55163k17284j66881j35375r2505p2818p9559n5505m8547
18378B009177q5724j07805q2888m1620k5219k3906n294N459J6235J8339j8148
18367A658606n4706o3357r6027j07143r1957n4425l0684l3873J1736K3879J6298
$$ plain form
18430 61033208 48457284 37447542 29431413 24831219 23310986 24467119 28404053 35446828
18422 35446828 45534089 57753751 69687871 78307807 81105995 75963368 65635959
18415 65635959 51882650 38738412 28329890 21048107 16411890 13440382 11479648 10142211
18407 10142211 9145942 8363781 7682470 7050942 6457019 5920982 5453366 5046419 4706686
18398 4706686 4426053 4222675 4066968 3955088 3903153 3848516 3780936 3692276 3560057 3370725
18388 3370725 3132814 2877651 2660367 2493486 2358111 2265606 2192788 2113229 2057724 2009177
18378 2009177 1923453 1815648 1732760 1691140 1665921 1642015 1636721 1642180 1658415 1676754 1658606
18367 1658606 1603900 1540543 1444516 1337373 1245416 1190991 1160307 1126434 1138170 1162049 1178347
18356A178347L8546M3285L7145j8643p5449p7570r7579q8746o0924m2550l4645
18345H01217k0614j9169k1555k6401k4619k9726l0242j3321k1397n086o380j8136
18333E64571j2274o822J1227j6260k7503k2460l2680k2532P832m033p334K055
18321D33787l608j6815j3737L736j0897j7235j103o95L847q721o157o440P604
18308C63566k1171l268j2196j0204j6271k4296P153l305n406p487J1393q275L724
18295B73957N132M491j934M550K541m19j4890l1737l0034k3685L418O331K830
18282B00551k372M60M723l555j5486l953j1538j2885j2256o43K1222L448j0k131
18268A65575j1769k84o236k73K2414o051j6712m805j097L292j6353k0380K0954
$$ plain form
18356 1178347 1216893 1260178 1297323 1278680 1203231 1125661 1028082 939336 878412 835862 801217
18345 801217 780603 761434 739879 713478 688859 659133 628891 615570 594173 589087 582707 564571
18333 564571 552297 545475 556702 540442 512939 490479 457799 435267 443099 439066 431732 433787
18321 433787 430179 413364 399627 403363 392466 375231 374128 373433 377280 368559 362402 355962 363566
18308 363566 342395 339127 326931 316727 300456 276160 283313 280008 274602 267115 278508 270233 273957
18295 273957 279089 283580 281646 286196 288737 288318 273428 241691 211657 187972 191390 197721 200551
18282 200551 198179 198639 203362 199807 184321 180368 168830 155945 143689 143046 164268 167716 167706 165575
18268 165575 153806 153522 147286 147013 169427 163376 146664 141859 140762 144054 127701 107321 128275
18255A28275J5792p14k1938j0334K212r986j0563j4898L659J904J3452O864o880
18242I6845k6316Q85K504J0838J1225L278o633j6858o60L960p552K844L953l171
18228G5142o226p593J17m724P561K0398K308q672j1881J0011j7553n027J406L555
18214E8822l568Q13l998L362J5281n816j3283k15J3520R06r374k492j2522R949
18200E1385j1228k89J5594J1433n374o166j1571J3461j0658r391m022O499J8697
18187E8370O04j0408J006J0801n902J1960R713K913q093M682r04K723J879R692
18173H9036N10l691m457M0J0526J8152J5905P094q593k010p569k2001J1705J4625
18159A19272O43j6590k6569K12K4541J4214P813M215K617K9294J9931R487L2218
$$ plain form
18255 128275 144067 143353 121415 111081 113293 103307 92744 77846 81505 83409 96861 103725 96845
18242 96845 70529 71414 73918 84756 95981 99259 92626 75768 75108 79068 71516 74360 78313 75142
18228 75142 68916 61323 61440 56716 64277 84675 86983 78311 66430 76441 58888 53861 55267 58822
18214 58822 55254 56067 52069 55431 70712 64896 51613 51398 64918 65824 56450 53958 41436 51385
18200 51385 40157 39868 55462 66895 61521 55355 43784 57245 46587 37196 33174 39673 58370
18187 58370 58974 48566 49572 60373 54471 66431 76144 79057 70964 75646 74742 77465 79344 89036
18173 89036 89546 85855 81398 81438 91964 110116 126021 133115 124522 122512 114943 92942 104647 119272
18159 119272 119915 103325 76756 76968 101509 115723 123536 127751 130368 159662 179593 189080 221298
18146B21298N9154Q4903R9622P8564M4360j0785p7310p2098o1581m2825k7992
18135B95310j949L0199L7419M1396N9245P7306R6639R3412O8371K4452l9531o9453
18123G12816k5034R607N2149R8476J59404K27006L22466M83932P80349J336865
18113D158036K346292L930394N428063M788823K402852j52020o557908o847113
18105I497419l606186j849807j042610o52112m30431k78767k10980j76644j24944
18096A124938j04950q1530q4924r8163p0321o0422m6310m0425k9936j9024l0322
18085D58611j8444j7261j6288j9186j9630k027k2905j4612j482q736j9387r530
18073B89123k611M721o395j8656q530k2451m223R259j5786j7447k348j788j7215
$$ plain form
18146 221298 280452 365355 464977 543541 587901 577116 499806 427708 366127 323302 295310
18135 295310 293361 323560 360979 402375 461620 538926 635565 728977 797348 821800 782269 712816
18123 712816 687782 697389 749538 848014 1007418 1234424 1556890 2040822 2821171 4158036
18113 4158036 6504328 10434722 15862785 20651608 23054460 22902440 16344532 9497419
18105 9497419 5891233 4041426 2998816 2346704 1916273 1637506 1426526 1249882 1124938
18096 1124938 1019988 938458 853534 755371 685050 624628 578318 537893 507957 488933 458611
18085 458611 440167 422906 406618 387432 367802 365775 342870 328258 326776 318040 298653 289123
18073 289123 286512 291233 284838 266182 257652 235201 230978 240237 224451 207004 204656 202868 185653
18060A85653j2045k476L657m815k5694m99n887q871o804J690j8183j0782P261
18047A02205J1340P942p267n185m874j4551o236J491N128J451j7637l824J7599
18034H7582Q254J5937j8163j2840j3585k173p639j4825R692K6999Q236j4222n563
18021F7690k316l756L541k673L697R126o300M766j2037j6092Q258K466j7860q47
18007C7663J0649L726o243J894r88J369j0728J1290J0176o620p867Q254R365Q626
17993G0566j0021j2003j2427o798q715M361K109r976R729J5283N05P661R734K322
17979F2330o737p253q615o903J0806N018j8851q498K2062J0348p078O056n494
17966D7191m107m028l807p74r880k935m776r60P404M541j4933l221R795Q367N147
$$ plain form
18060 185653 173608 171132 174789 169974 144280 143781 137894 129023 122219 123909 105726 94944 102205
18047 102205 113545 121487 114220 109035 104161 89610 83374 84865 89993 91444 73807 69983 87582
18034 87582 95836 111773 93610 80770 67185 65012 57373 42548 52240 79239 87475 73253 67690
18021 67690 65374 61618 65159 62486 66183 75309 69009 73775 61738 45646 53904 56370 38510 37663
18007 37663 48312 52038 45795 47689 46701 48070 37342 48632 58808 52188 44321 52575 61940 70566
17993 70566 60545 48542 36115 29317 20602 24963 27072 17096 26825 42108 42613 50274 60008 62330
17979 62330 55593 48340 39725 32822 43628 48646 29795 21297 43359 53707 46629 52685 47191
17966 47191 43084 39056 35249 34475 24595 21660 16884 15924 23328 27869 12936 9715 19510 27877 33024
17951C3024m931J353J4594r641r738R477J5605j4258j3519K777q302j9078j0910
17938a3547q14O535M769J3881J6146M836j722l0356o342L177K7222R764J2125
17925D5674m795k0734o262P079J8334K280j4802P999M558k0612K359m300P546
17912B4324R428L899r88j9035r738N00p774R942L784M94p108n353j133q865R252
17897A629K1580L007r55K517P389r50J0317o130m995j3427l724M984q23j6073
17883D346R785J5299J012Q945k665q514r450j2871R113j0315O350N355k456m90
17869A3444O34j0275j3327M894J7732r258o053O503R115N180p196k3654o061J0022
17855h300Q645o81K1601M497o320j4343L205N099j0357j268L095J1465O356l837
$$ plain form
17951 33024 28093 29446 44040 34399 24661 34138 49743 35485 21966 24743 16441 -2637 -13547
17938 -13547 -14361 -7826 -3057 10824 26970 31806 30084 -272 -6614 -3437 23785 33549 45674
17925 45674 40879 20145 13883 20962 39296 41576 26774 34773 39331 18719 21078 16778 24324
17912 24324 33752 37651 36663 17628 7890 8390 616 10558 14342 14836 7728 2375 1242 -7623 1629
17897 1629 23209 26216 25261 27778 35167 34217 44534 38404 33409 19982 16258 21242 20419 4346
17883 4346 14131 29430 30442 39387 36722 28208 18758 5887 15000 4685 11035 16390 13934 13444
17869 13444 14078 3803 -9524 -4630 13102 3844 -2209 4294 13409 18589 11393 -12261 -18322 -8300
17855 -8300 345 -336 21265 25762 19442 5099 8304 13403 3046 1778 4873 16338 22694 18857
17841A8857m440J6332K7319K5937P614N73J7468L2681M7624O7655P9121M2393
17829C79134J6623L724m809m5637o6892m9505k0613l244K5351L3584K1137K7437
17817C16290K7582N8746M4956L2655l44l8264n2602o1293p5371m8849k0125k148
17805A81233M711J004p558k9067p717l483k3975k6113j0061j4507k0008j533K617
17792D5543J4522N60k974k1633j8617j6945M468L4273J1361m091j152M475l78
17779D9412k46j4869o349L325p740J124L416P195l605O501N228p720n204j1452
17765A9016l863p63L061k03J980J0187J8271J694O621j1337j835p251K398R415
17751D7391M366K0640P588q623j2989j1272j669j1827O266k061L273P247O152
$$ plain form
17841 18857 14417 30749 58068 84005 91619 92192 109660 142341 189965 257620 336741 379134
17829 379134 395757 399481 394672 349035 282143 232638 212025 208781 234132 267716 288853 316290
17817 316290 343872 402618 447574 480229 479885 441621 389019 327726 252355 203506 183381 181233
17805 181233 185944 186948 179390 150323 142606 139123 115148 89035 78974 64467 44459 42926 45543
17792 45543 60065 60625 57651 36018 17401 456 4924 39197 50558 46467 45315 49790 49412
17779 49412 49166 34297 27948 31273 23533 24657 28073 35268 31663 38164 43392 35672 30468 19016
17765 19016 15153 14390 17451 17248 19228 29415 47686 49380 56001 44664 42829 35578 37976 47391
17751 47391 51757 72397 79985 71362 58373 47101 45432 33605 39871 37810 41083 48330 54482
17738E4482O173j5882J1603j847o399J2773J2586J1284n66o286l256k996o584
17725F5085K876L196l708k812j1652J7919J2338j9547j1610J0203k74M088R588
17712G5690J9126J512J2891k279j9288n949J3266O75j4711N071O055K569o328
17699H8300N972N786J4870J4229J3229L370P58k883k1011j4007p607k160J4338
17686A13184K9467j0535O22J1517K6870J5146j0380L017n895k3501k2281j4954
17674A12277j6040l438R433n150K306k48m372n374O406K5958K6358O2p301N063
17660A45940Q30q29L461n312j1078Q537O932m362L00j6982p631R389K3755J2399
17646A65349o2m578Q15N638j9072Q182M831K5680L8757J3275K330J7152O743l133
$$ plain form
17738 54482 60655 44773 56376 54529 48130 60903 73489 84773 84207 77921 74665 71669 65085
17725 65085 67961 71157 67449 64637 52985 70904 83242 63695 52085 62288 62014 66102 75690
17712 75690 94816 96328 109219 106940 87652 81703 94969 95644 80933 86004 92059 94628 88300
17699 88300 94272 100058 114928 129157 142386 145756 146514 143631 122620 108613 101006 98846 113184
17686 113184 142651 132116 132738 144255 171125 186271 175891 178908 173013 149512 127231 112277
17674 112277 96237 92799 102232 97082 99388 99140 94768 89394 95800 121758 148116 148178 140877 145940
17660 145940 146770 145941 149402 144090 133012 141549 148481 144119 144419 127437 119806 129195 152950 165349
17646 165349 165287 160709 161524 167162 148090 156272 161103 186783 225540 238815 241145 258297 265040 261907
17632B61907j7415P79J5980K1085O399O45M071R567J5992L1791J5885Q180J4338
17619C89204r88J8138J755J6866L3792L9283M5749M5176N0843N7737L9773K7711
17607G65039q41K563O596J8365K9696K8263N4327N5014N0557R1276J13623J50231
17595A364709J65808J66794J54161J19988N9580M6415R0663J02230J26283J30507
17585B527138J66706K02013K74115L66948N00972O13062P15575Q43254J001052
17576G210835J206017J628043K332956L548104N483035Q278499J1695594J4483114
17568E5866197J4460425J0231934K144863p778764j4714908j4970807j0923170
17561C4315770o655313l512615j172564Q93087L166654O060073R523376J2643363
$$ plain form
17632 261907 244492 245271 261251 282336 288735 289380 293451 303018 319010 350801 366686 374866 389204
17619 389204 388216 406354 408109 424975 458767 498050 543799 588975 639818 697555 737328 765039
17607 765039 764198 766761 773357 791722 821418 849681 904008 959022 1009579 1100855 1214478 1364709
17595 1364709 1530517 1697311 1851472 1971460 2031040 2077455 2168118 2270348 2396631 2527138
17585 2527138 2693844 2895857 3169972 3536920 4037892 4650954 5366529 6209783 7210835
17576 7210835 8416852 10044895 12377851 15925955 21408990 29687489 41383083 55866197
17568 55866197 70326622 80558556 82703419 74924655 60209747 45238940 34315770
17561 34315770 27660457 24147842 22975278 23868365 27035019 33095092 42618468 55261831
17553E5261831J3450172J0264614L146961o398349j4244127j5997325j2651100
17546C2832677q446204n432402l591053k472765j731967j222961q87650o94247
17538H353428n87886n78726o03719n90533n27080m04146l17910k88228k50410
17529D204790k53115k53896j81180j35130j00005r4746j03414j08558j37804j69651
17519B667291j73235j51878j01318r4224j13735q9932o5904n5798l8339o9930
17509A712998q5645o5591n6841m9424n0532m3785l7032l8373m0916l9988l8789
17498A166082l6957k7641p352k4836l1565l0223j8962l3312l2443k5033l0166
17487H67592k3705j3919j0267k0282j3160j8452k4315j5661j0119j7522k0163
$$ plain form
17553 55261831 68712003 78976617 82123578 75725229 61481102 45483777 32832677
17546 32832677 24386473 18954071 15363018 12890253 11158286 9935325 9047675 8353428
17538 8353428 7765542 7186816 6583097 5992564 5465484 5061338 4743428 4455200 4204790
17529 4204790 3951675 3697779 3516599 3381469 3281464 3186718 3083304 2974746 2836942 2667291
17519 2667291 2494056 2342178 2240860 2146636 2032901 1942969 1877065 1821267 1782928 1712998
17509 1712998 1627353 1561762 1504921 1455497 1404965 1361180 1324148 1285775 1244859 1204871 1166082
17498 1166082 1129125 1101484 1094132 1069296 1037731 1007508 988546 955234 922791 897758 867592
17487 867592 843887 829968 819701 799419 786259 767807 743492 727831 717712 700190 680027
17476F80027j0898j0969k7855j1837k0305q806j8676m830j9343m905R044j5812
17464E34835l1747j6571j4918k1935j067L870j884o821r882k0322L319K9860K8718
17451D75455K5896K1564M8872Q9463Q7456O0915M0980r576o7821p1367o5941p7029
17439E58867n7641m3569k2065j5233K6057P3690P6616Q8895N4702j7045o4038
17428F59236j14837q9337l8468l0111m1763n113j6550m2573m1454k6499k5092
17417A87439J5145M46q184p283k456l330j7398j4108l429M772J3074j635n211
17404A57842Q268j1240j8127J721J9586J5295L061L280o342m638j648O873j0669
17391A63262k8671k2500o260o828N375L0404K929j4105l309m736K344p666q22
$$ plain form
17476 680027 669129 658160 630305 618468 598163 589357 570681 565851 546508 541603 550647 534835
17464 534835 503088 486517 471599 449664 448597 452467 450583 443762 433880 413558 416877 446737 475455
17451 475455 501351 522915 571787 661250 748706 809621 850601 841025 773204 701837 635896 558867
17439 558867 501226 457657 435592 420359 446416 520106 596722 685617 740319 723274 659236
17428 659236 544399 455062 416594 386483 344720 339607 323057 280484 239030 212531 187439
17417 187439 202584 203030 194846 187563 185107 181777 164379 150271 146842 151614 164688 163053 157842
17404 157842 166110 154870 136743 138464 158050 173345 176406 179686 173344 168706 167058 173931 163262
17391 163262 134591 112091 105831 99003 104378 134782 137711 123606 120297 115561 117905 110239 109417
17378A09417q311l018r897k210j1817k865Q610k515l539l450L636j79r370r112
17364E5380j074K561p525L537J5427j3234o970N143J1713J9987j4650j4361l905
17351E2029M117K319J2463j6619Q469L501J071l163k929p63P254q198J043J0487
17337G1081k164N001n517r388j1155j0615n403N533L721l087O61J7150j1110j036
17323D3672p24j0205p602K4072N410n260k911L180n177K04j3616p679O398M340
17309C4102j7722J091J5279J3410k1468r231J4854N845O736O416Q881j030p62
17296E6401l619p960m385J313M60R210k1281J977J7083m234j304n979o490J611
17282C2803p449M338j645p630j172m942J2293J1251r22o407Q563k690k9563k007
$$ plain form
17378 109417 101106 98088 88191 85981 74164 71299 79909 77394 73855 70405 74041 73862 64492 55380
17364 55380 54306 56867 49342 52879 68306 55072 48102 53245 64958 84945 70295 55934 52029
17351 52029 56146 58465 70928 54309 62778 66279 67350 64187 61258 60495 67749 59551 60594 71081
17337 71081 68917 73918 68401 59013 47858 37243 31840 37373 41094 38007 38668 55818 44708 43672
17323 43672 42948 32743 25141 49213 54623 49363 46452 49632 44455 44659 31043 23364 29762 34102
17309 34102 16380 17471 32750 46160 24692 15461 30315 36160 42896 49312 58193 57163 56401
17296 56401 52782 44822 40437 41750 42210 51420 30139 32116 49199 44965 43661 37682 31192 32803
17282 32803 25354 29692 28047 20417 19245 14303 26596 37847 36925 30518 39081 36391 6828 4821
17268D821J2158L513K91p672qJ3069J8124Q105n213N181K463m486k3638n506r768
17253A1434m898M260M455o682O958J4660M607j870J5231N308k2163k6777M179
17240H702L559o02n261p818P3n833K625j584K627R098o34N020P042j4311j3294
17225a0591o468k774R083k920l704J1790r36k368J7414J534k636j2958m091L208
17211f417k485J7693R915j6135j9922J7729J9269j2597K977J255J2174J6893J398
17198D1747j0953p871j1906k1849n757J2871P354J0973j5416j3547j01Q808P567
17185A920o23Q076l845r330M383N089J0981j4110j3250k5277J7559J3204M306
17172i17m467j0572R090k118L363J2812O902j7096j0726o551N93m175n272L153
$$ plain form
17268 4821 16979 20492 20783 13111 13103 26172 44296 52401 47188 52369 54832 50346 26708 21202 11434
17253 11434 6536 10796 15251 8569 15527 30187 34794 32924 48155 53463 31300 4523 8702
17240 8702 12261 11659 6398 -1420 -1347 -7180 -4555 -6139 -3512 5586 4952 9972 17014 2703 -10591
17225 -10591 -17059 -19833 -10750 -13670 -17374 -5584 -6520 -8888 8526 10060 7424 -5534 -9625 -6417
17211 -6417 -8902 8791 18706 2571 -17351 378 19647 7050 10027 11282 23456 40349 41747
17198 41747 30794 22923 11017 -10832 -16589 -3718 3636 14609 -807 -14354 -14455 -5647 1920
17185 1920 1297 9373 5528 -3802 581 5670 16651 2541 -10709 -35986 -18427 -5223 -917
17172 -917 -5384 -15956 -6866 -8984 -5621 7191 14093 -3003 -13729 -20280 -19687 -23862 -29134 -25981
17158b5981P079q166k563J2052J0363J2407O832j3431Q866P495k3950M772k37
17145d462j4349k928J5154J0591j4j5893o498J2673j38Q728Q990J4823n337o618
17131A4722J2754m513j6109j2264K1559J795o436l727n319l215j332R25J587m895
17117d468m844O472M817p263N693O940l612m527k829n139K4k410p133m493J922
17102b0850Q398J3589K604O75K480j3761l202N972o688m424K734O526k398K725
17088e620j1532m997j226k812P943M952j3227J99K0601J3514j3601j4547Q28p574
17074b7099m051N541n96J4433J9024j4880k0211N51J1089K596K571K0R000j5282
17060a7294k232M468J0308J052J0752L563k1201o67R896j3967k119R260k133P592
$$ plain form
17158 -25981 -18902 -27068 -29631 -17579 -7216 5191 12023 -1408 7458 14953 -8997 -4225 -4462
17145 -4462 -18811 -21739 -6585 4006 3992 -11901 -18399 -5726 -5864 2864 11854 26677 21340 14722
17131 14722 27476 22963 6854 -5410 16149 17944 11508 7781 2462 -753 -2085 -1160 427 -4468
17117 -4468 -9312 -2840 1977 -5286 407 7347 3735 -792 -3621 -8760 -8736 -11146 -18279 -22772 -20850
17102 -20850 -12452 1137 3741 4416 6896 -6865 -10067 -4095 -10783 -15207 -12473 -5947 -8345 -5620
17088 -5620 -17152 -22149 -23375 -26187 -18244 -13292 -26519 -26320 -5719 7795 -5806 -20353 -19525 -27099
17074 -27099 -31150 -25609 -26205 -11772 7252 -7628 -27839 -27288 -16199 -13603 -11032 -11012 -2012 -17294
17060 -17294 -19526 -15058 -4750 -3698 7054 10617 -10584 -11251 -1355 -15322 -17441 -8181 -10314 -2722
17046b722J84L172K0283J9057j4842k2199j0024K82q420J125Q018Q173L778N055
17032A0920O319J9255J203m167r229j6328o508J920q358j989k0605J9905K14l801
17018a1249m59R666L1264J597o399k975J0204q788O730Q360r547j3329r385j2038
17004f348J1535J1696j0532r89J4007J6668k421o093k718J8312K2667K0039J2808
16991I8631K0913J4851L7604N1725P3499P1641N1134K8103l7540p8799n6023n1765
16979B23974m5539l0510j129l149R676K4197M1628N8052O5796N9588K1453k4902
16967C99135n5294q7837p4221n9675n0068k4892L206J4279K955j7237m71K343
16955E2223j0822k4575Q147J5277l026j1293n741P01Q001O913M331q900O479K793
$$ plain form
17046 -2722 -2538 634 20917 39974 25132 2933 -7091 -6809 -15229 -14104 -6086 2087 5865 10920
17032 10920 17239 36494 37697 33530 24301 7973 1465 3385 -4973 -6962 -27567 -7662 -7448 -11249
17018 -11249 -11708 -2042 29222 30819 24420 21445 31649 22861 29591 37951 28404 15075 5690 -6348
17004 -6348 5187 16883 6351 5362 19369 36037 33616 27523 24805 43117 65784 85823 98631
16991 98631 119544 134395 171999 223724 297223 368864 419998 448101 410561 331762 275739 223974
16979 223974 178435 147925 146796 143647 153323 177520 219148 277200 342996 402584 424037 399135
16967 399135 343841 256004 181783 122108 72040 47148 50354 64633 67588 50351 49880 52223
16955 52223 41401 16826 24973 40250 37224 25931 20190 20891 28892 35805 40136 31236 37715 40508
16941D0508j0768j2276o193j166k622j2680J1292J7079q653p954P374J3477R216
16928C6634k325p049k5091o992q151m438O82N881j3469Q64J0052R880K0986L373
16914B0837J814k0003k4434J344Q522J4779J2039m201k182P510J6183L654K679
16901C8541j2273n669j0151M576M739l160j1714o362K491J653q740J405J0789
16888F125R382K2819l952j2469N95m779k1817j0816o55k209r396J4790K5590l72
16874A2836J4402k80j8203o400P85n319j956m251k943p912m16J0495J1870J3327
16860A6035q920j0413M264N65o610R052O11j943q075n910L555Q251l229j2131
16846a4898J1391K0697j349m813j3409q55R517R946J2530J2679P863j6334j4503
$$ plain form
16941 40508 29740 17464 11271 10105 7483 -5197 6095 23174 14521 6567 13941 27418 36634
16928 36634 34309 27260 2169 -4823 -12974 -17412 -16730 -10849 -24318 -23454 -13402 -3522 17464 20837
16914 20837 22651 2648 -21786 -20442 -11920 2859 14898 10697 8515 16025 32208 35862 38541
16901 38541 26268 20599 10448 15024 19763 16603 4889 -1473 1018 2671 -6069 -4664 6125
16888 6125 15507 38326 34374 21905 22500 17721 -4096 -14912 -15567 -17776 -27172 -12382 13208 12836
16874 12836 27238 26958 8755 2355 3140 -2179 -4135 -8386 -11329 -19241 -19657 -9162 2708 16035
16860 16035 7115 -3298 966 1531 -5079 3973 4584 2641 -5434 -11344 -7789 462 -2767 -14898
16846 -14898 -3507 17190 15841 11028 -2381 -3236 6281 16227 28757 41436 49299 32965 18462
16833A8462n860N818N311k543p718n998o666j0294p032j733R016O725j1087k672
16819a6271J2443j2086R155N964j6086k275J0890k1787q305p561n802J2817J6828
16806b2076K1417P441p008J064m149O198q264r682N987m31L712M880o747J4201
16792F543k291O548q612j501o993J51K6092m853j0891o809j415P069o255R755
16778F538J1644k0858o198k279J990j946j985n043K5998O566p876L843j771l117
16764E506O38J1160j2459k1176P028K0952j1884j6008j6566p596q676p863J4180
16751d2764K7383l974m322m780j065l943N721J481j5026l663J834N607K0540J6159
16737h12Q979Q175M318n527j0933k2517J72N876J4613P805N637n39l643L708J8923
$$ plain form
16833 18462 12602 18420 23731 21188 13470 7472 806 -9488 -16520 -18253 -9237 -2512 -13599 -16271
16819 -16271 -3828 -15914 -6759 -795 -16881 -19156 -8266 -30053 -38358 -45919 -51721 -38904 -22076
16806 -22076 -659 6782 -226 838 -3311 2887 -5377 -15059 -9072 -9503 -5791 -911 -7658 6543
16792 6543 4252 10800 2188 687 -6306 -6155 19937 15084 4193 -2616 -4031 3038 -3217 6538
16778 6538 18182 -2676 -8874 -11153 -9163 -11109 -13094 -18137 7861 14427 6551 10394 8623 5506
16764 5506 6144 17304 4845 -16331 -9303 11649 -235 -16243 -32809 -40405 -49081 -56944 -42764
16751 -42764 -15381 -19355 -23677 -28457 -29522 -33465 -27744 -26263 -41289 -44952 -43118 -37511 -16971 -812
16737 -812 8167 16342 20660 15133 4200 -18317 -18145 -12269 2344 10149 15786 15247 11604 15312 34235
16722C4235j0606k7135n086J6869O33j1904O144k587O068K19J3622L298n629o047
16708A2094N710J0720m657p600j2423J3820K910j3524r67N819j2708j815p36K124
16694a233P610O574J5837j1147j6770j7470q396J869L030N276m452o183Q788J9005
16680B338P030N730j1844j0912l959O771m123j7695k0289J1321J3431J8880J7128
16667A3807M304j2273m80K0905K3650n184j5364j8502M796L252Q844M156J2894
16654D4805K7q647K455P532j0594n757q028p832j1051m441J3708J3587o611L816
16640B2969Q850j6875j1201j1714q930J0244j823l99J5718P728r945j1707k339
16627i424J9071Q182n719k0711M57m092p793k825K303K3836n901k0615Q851J1476
$$ plain form
16722 34235 23629 -3506 -8592 8277 8910 -2994 3150 563 6631 6850 20472 23770 18141 12094
16708 12094 17804 28524 23867 16267 3844 17664 20574 7050 6083 11902 -806 -2621 -3357 -1233
16694 -1233 6377 12951 28788 17641 871 -16599 -24995 -23126 -20096 -14820 -19272 -25455 -16667 2338
16680 2338 9368 15098 3254 -7658 -11617 -4846 -8969 -26664 -46953 -35632 -22201 -3321 13807
16667 13807 18111 5838 5358 26263 49913 44729 29365 10863 15659 18911 27755 31911 44805
16654 44805 44832 36185 38640 46172 35578 29821 21793 13961 2910 -1531 12177 25764 19153 22969
16640 22969 31819 14944 3743 -7971 -16901 -6657 -8480 -8879 6839 14567 4622 -7085 -9424
16627 -9424 9647 17829 12110 -8601 -8144 -12236 -20029 -22854 -20551 3285 -2616 -23231 -14380 -2904
16613b904j1995l528O040J8038o119j795J2014J343j0540j5596J4706J6980R968
16600B6612n839j3343O043N416J700l803K22L448j9956m237N825O617R146k688
16586A5163j4568O925J1245P338O551p852r929l217k2257j0062m453L0101R268
16573A4253J235J394p791r945j5193J7626k33m256R677J916k4635j0456J4717
16560a1691L264L154O316J921j7347j179J2161O588o16m622l348j052J709O84
16546d058j0964Q313j566j52j4445M50m434K0395P90J2046Q404j2284j0086q055
16532a5646J054L3893J5725j3640k3997j2606M888j0368M843P863j5588R321J6656
16519B398Q549j1539o948N386Q429J383p250j0926P796N589J888j4292p982Q387
$$ plain form
16613 -2904 -14899 -18427 -12387 5651 -468 -2263 9751 11094 554 -15042 -336 16644 26612
16600 26612 20773 7430 13473 18889 20589 16786 17008 20456 500 -3737 2088 8705 17851 15163
16586 15163 595 7520 18765 26103 32654 24802 14873 11656 -10601 -20663 -25116 4985 14253
16573 14253 15488 16882 9091 -854 -16047 1579 1346 -2910 6767 8683 -15952 -26408 -11691
16560 -11691 -8427 -5273 1043 2964 -14383 -15562 -3401 3187 2571 -2051 -5399 -6451 -4742 -4058
16546 -4058 -15022 -6709 -8275 -8427 -22872 -22422 -26856 -6461 -5671 6375 14779 2495 -7591 -15646
16532 -15646 -14592 19301 35026 21386 -2611 -15217 -10329 -20697 -15854 -7991 -23579 -14258 2398
16519 2398 10947 -592 -7540 -2154 6275 7658 408 -10518 -2722 2867 4755 -9537 -17519 -9132
16505i132J408R280M063q640p681J9588J3113q33k443j5614n235j6676K461M923
16491a1418l19J1444j207j0121n649K101J4616J5248J1587j5136j9487R095j4004
16478a3250M299M005j244l97m442p846m579R351m602j045J0247M043O17Q922J888
16463E967j1304O509N843K102l656q255j4837j1590J1484k032J3512J0611Q796
16450A3150O104q096j6377L260J5152m968q037R546j532m447J7000O86j2889j0212
16436a660J17r224n340q158J0165M720j6238k426J1253m207J6389Q234p599K290
16422a684L522L238k669Q240j080K374r203p659o548m890j4597o106J3551J9059
16408d452J933m81j7600j572m358k746n452l405J3537L5930J0127M574L880K27
$$ plain form
16505 -9132 -7724 1556 5619 -3021 -10702 8886 21999 21166 18723 3109 -2126 -18802 -16341 -11418
16491 -11418 -11737 -293 -1500 -11621 -17270 -15169 -553 14695 26282 11146 -8341 754 -13250
16478 -13250 -8951 -4946 -6190 -6587 -11029 -18875 -23454 -14103 -18705 -19750 -9503 -5460 -4843 4079 5967
16463 5967 -5337 1172 7015 9117 5461 -2794 -17631 -29221 -17737 -19769 -6257 4354 13150
16450 13150 19254 11158 -5219 -1959 13193 8225 188 9734 8202 3755 20755 21441 8552 -1660
16436 -1660 -1543 -10767 -16107 -24265 -14100 -9380 -25618 -28044 -16791 -20998 -4609 3625 -3974 -1684
16422 -1684 1838 5076 2407 10647 9567 11941 2738 -4921 -11469 -16359 -30956 -37062 -23511 -4452
16408 -4452 -2519 -3000 -20600 -22172 -26530 -29276 -34728 -38133 -24596 11334 21461 26035 29915 30142
16394C0142k616k2027j245k102o427n652N240P969q415k449O654M23j1436j4761
16380b6702J3435K5423Q645j0907L933K127r977K667j0474j0211j8605N303J0702
16367a4641M360K3633J105m300O285O004k0890p185K229o539J4114J7379k4849
16354c295r404l426j1296R118L286J4659l723J186J0098Q747L421r935q681M229
16340D984o638j3412r428R019K544L812K974J954l371P982j4502k0435R70J3445
16326b0102J6228k452J5943m463j3289p054m952L38K958N584O273Q993j1181l278
16312a0454l716Q78P510R919J7004j666P345M899j2065j6644k5286j4012j0381
16299d6669K2953J3107O734J3676J04q709K068j7147n599J6050R586M123k7594
$$ plain form
16394 30142 27526 5499 4254 2152 -4275 -9927 -4687 3282 -5133 -7582 -928 -505 -11941 -26702
16380 -26702 -13267 12156 20801 9894 13827 15954 5977 8644 -1830 -12041 -30646 -25343 -14641
16367 -14641 -10281 13352 14457 10157 16442 22446 1556 -5629 -3400 -9939 4175 21554 -3295
16354 -3295 -12699 -16125 -27421 -18303 -15017 -358 -4081 -2895 7203 15950 19371 9436 755 4984
16340 4984 -1654 -15066 -24494 -15475 -12931 -9119 -6145 -4191 -7562 420 -14082 -34517 -33547 -20102
16326 -20102 -3874 -6326 9617 5154 -8135 -15189 -20141 -19803 -16845 -11261 -4988 4005 -7176 -10454
16312 -10454 -14170 -13292 -5782 4137 21141 19475 26820 31719 19654 3010 -22276 -36288 -46669
16299 -46669 -23716 -10609 -3875 9801 9905 1196 3264 -13883 -19482 -3432 6154 10277 -17317
16286a7317j560J8392k976l844J1886k85p213P392L686j2452j2353k457n467J0744
16272a3824J4617k037j6584O820J6776L888m182r473l258N250J0836J298r681
16259D46j698j733k863j3978J2819J2925Q078L663R42j2446N342n428J763j6578
16245h746M810j3649k9J913k572R82m87J817N386M119o043r082N417K082J6785
16230B703J4347j9599j0057N140l027P171N759q349L095J5963P491j0699j6074
16217f136r986o98J1331J0839L185j1974j4777q91O188L1668L76j0137k4935l774
16203a9721K0671J4146q493k0270k375j7859m811j723J0067R21O705K392N958
16190a4392j1725J203J5325N486O887p79j9919L758m121J73Q766O86n133j0430
$$ plain form
16286 -17317 -18877 -485 -3461 -7305 4581 4296 -2917 4475 8161 -4291 -16644 -19101 -24568 -13824
16272 -13824 793 -1244 -17828 -11008 5768 9656 5474 -3999 -7257 -2007 8829 10127 446
16259 446 -1252 -2985 -5848 -19826 -7007 5918 13996 17659 18601 6155 11497 6069 7832 -8746
16245 -8746 -3936 -17585 -17614 -15701 -18273 -17291 -17778 -15961 -10575 -6456 -12499 -21581 -16164 -14082 2703
16230 2703 17050 -2549 -12606 -7466 -10493 -3322 2437 -5912 -2817 13146 20637 9938 -6136
16217 -6136 -16122 -16820 -5489 5350 8535 -3439 -18216 -19107 -12919 18749 19125 8988 -15947 -19721
16203 -19721 950 15096 6603 -13667 -16042 -33901 -38712 -40435 -30368 -29447 -22742 -20350 -14392
16190 -14392 -26117 -24914 -9589 -4103 2784 2005 -17914 -14156 -18277 -18104 -9338 -8652 -13785 -24215
16176b4215R58J7277J1745O266j8282j4498J8115M704J364J4509m713o750j0204
16163c724P51M418P848N53j6415j1501R350j9N847j370K504m097P709M509j4334
16148g971k20K085N616R779J4960J3355k7659k1676k199O246K147l91N244J4685
16134A4001K875O778j293l7834p036R535J8090K156j707K17L53M292Q420m779
16120A4068j5100j6196o195j406J8537O569k6628j4233l148J1212n01J116J3397
16107a8508M591k192N982J3575N86l673J9064n101m945q84J277j7213q431Q893
16093f979J342j0112j0625n307p115J8963O334q80Q832p387k906l170J1176N779
16079b055n317r251j6905P181K198n061j9080M157J4144K2256K9275O046q086
$$ plain form
16176 -24215 -23257 -5980 5765 12031 -6251 -20749 -2634 2070 3434 17943 13230 6480 -3724
16163 -3724 -2973 1445 9293 9846 -6569 -18070 -8720 -8739 -2892 -4262 -1758 -5855 1854 6363 -7971
16148 -7971 -8191 -6106 -490 9289 24249 37604 9945 -11731 -13930 -7684 -5537 -5928 -684 14001
16134 14001 16876 23654 22361 -15473 -22509 -12974 5116 7272 5565 5782 6135 10427 18847 14068
16120 14068 -1032 -17228 -23423 -24829 -6292 277 -26351 -40584 -43732 -32520 -33021 -31905 -18508
16107 -18508 -13917 -16109 -10127 3448 4034 361 19425 14324 9379 8495 9772 -7441 -15872 -6979
16093 -6979 -5637 -15749 -26374 -31681 -38796 -19833 -13499 -14379 -5547 -12934 -15840 -19010 -7834 -2055
16079 -2055 -7372 -16623 -33528 -26347 -24149 -29210 -48290 -44133 -29989 -7733 21542 27588 19502
16066A9502N575M128j3752K698j368p688j3641r924K0792J4819k3935q196m671
16053a5661p484l201P101Q670j8080M624R308j6473M59K3649J1971p74k373J698
16039C434r367L04k20j8689R502m910r678j195K25N768K3896J1491j4084j1310
16025a4833J2455J8614l03j0394j0746k5274j504J2161j65M064P85q692q22N520
16011a9134Q42K1932M388r378j0944K929j0436q316Q415m041r591j104M801L369
15997b6268J1429J6574K1571J2101m474j63j2907p174r439J001O48n007j2111
15984a4219L510o34j823l180R172N994L684j3286j1656j243J0122K3142J1506
15971B1089l110q975j2821p055M090j168j4839j5040J708l177J9769J3042j7227
$$ plain form
16066 19502 25077 29205 15453 18151 16783 9095 -4546 -14470 6322 21141 -2794 -10990 -15661
16053 -15661 -23145 -26346 -19245 -10575 -28655 -24031 -14723 -31196 -30737 -7088 4883 4109 1736 3434
16039 3434 -5933 -5629 -5849 -24538 -15036 -19946 -29624 -30819 -30594 -24826 -930 10561 -3523 -14833
16025 -14833 -2378 16236 15933 5539 -5207 -30481 -31985 -19824 -19989 -15925 -15140 -23832 -24654 -19134
16011 -19134 -18292 3640 8028 -1350 -12294 -9365 -19801 -28117 -19702 -23743 -33334 -34438 -29637 -26268
15997 -26268 -14839 1735 23306 35407 30933 30770 17863 10689 1250 2251 2899 -2108 -14219
15984 -14219 -10709 -11343 -13166 -16346 -7174 -1180 2504 -10782 -22438 -23681 -13559 9583 21089
15971 21089 17979 9004 -3817 -10872 -6782 -7950 -22789 -37829 -36121 -39298 -19529 -6487 -23714
15958b3714K11M607q673J3924Q894J2699J17j5351j427R412q251N425R483j0436
15944c080L02L492k954n05m864O620l263q407m974J5630J2455j4539l264Q693
15930A342J7998M190N431l873j0041j3020k286O201K477o068J2376k161j5905
15917c339o476M552p7k815l247j4479J3748Q613R12M825j0182l77L080k967p213
15902a5442P015P791L075j9563J255O316m32j515N913q455m957J504j554J9393
15888C44J4491O183N498j6731k174j3982j7572P675n417J3150L2775p459o764
15875A0017N892j1739k9553J0342K3969J9719j84l2355R04M901J0524j8360m960
15862a0883K9965J9985J8421j3345k7728j7951j3240l099L740R768J6258o660
$$ plain form
15958 -23714 -23503 -18896 -27569 -13645 -4751 7948 8065 -7286 -8713 699 -7552 -2127 7356 -3080
15944 -3080 -2778 714 -2240 -2745 -7609 -989 -4252 -12659 -17633 -2003 10452 -4087 -7351 1342
15930 1342 19340 23530 28961 25088 15047 2027 -259 5942 8419 2351 14727 12566 -3339
15917 -3339 -9815 -5263 -5340 -8155 -11402 -25881 -12133 -3520 -2608 2217 -7965 -8342 -5262 -8229 -15442
15902 -15442 -8427 -636 2439 -17124 -15869 -9553 -9985 -11500 -5587 -14042 -18999 -17495 -19049 344
15888 344 14835 21018 26516 9785 7611 -6371 -23943 -16268 -21685 -8535 24240 16781 10017
15875 10017 15909 4170 -25383 -15041 8928 28647 28463 -3892 -2988 1913 12437 -5923 -10883
15862 -10883 19082 39067 57488 44143 16415 -1536 -14776 -17875 -14135 -4367 11891 5231
15850E231q159j0739p510r383j968K371L213R3J9069Q455J0383q842n486L149
15836a23J5183M982j4772q561q166j2195R564P643O065q924l220Q491l853j6114
15822b4000l021L7700J121k666p105K081O062j1377p109P967r233o778r705k3187
15808d9250j825K0303J4373L968M91m307n42n423M924M610O547K111N941J3927
15794A5848m867L640L089j404o439Q014p674j4511r148J0274J2396j113j1106
15781c001O732L16k3891O799J9013j6823l477N359r840p14l06q08M048N857j0991
15766b1727J5464O396J184J0018L008J624j0809l053L310j4339J7340J0895J650
15753B0961k7994k1328O13P081M487J1421K1370J0174p294J0984k721k6175k4781
$$ plain form
15850 5231 -2928 -13667 -21177 -30560 -32528 -30157 -26944 -26851 -7782 673 11056 2214 -3272 -123
15836 -123 15060 20042 5270 -3291 -11457 -23652 -14088 -6445 -380 -9304 -12524 -4033 -7886 -24000
15822 -24000 -27021 10679 11800 9134 2029 4110 10172 -1205 -8314 -347 -9580 -16358 -26063 -49250
15808 -49250 -51075 -30772 -16399 -12431 -11940 -16247 -16789 -22212 -17288 -12678 -6131 -4020 1921 15848
15794 15848 10981 14621 17710 16306 9867 17881 10207 -4304 -13452 -3178 9218 8105 -3001
15781 -3001 3731 4047 -19844 -13045 5968 -10855 -14332 -8973 -18813 -19527 -19833 -20641 -16593 -10736 -21727
15766 -21727 -6263 133 1317 11335 14343 15967 5158 2105 5415 -8924 8416 19311 20961
15753 20961 -7033 -28361 -27748 -20667 -16180 -4759 16611 26785 19491 30475 27754 1579 -23202
15740b3202J2319Q411q907K673R98o765j277k108j356l449O438K0983J635J683
15726H076O63j1948j1364j1617R989l142M121J3320K180j143p567r946M312l464
15712a7530L1458J6134J0654j1364k3774J413o850j4390M28L938K0411K1789o075
15699B6242j5863m363j7777j405K0375O39j957m796p32J0835j2718p039J854K932
15685c773K756M373O346J37N613J0323P542p161k0300L356J1106l399K974k218
15671A7675k4767n379L82q490K743Q981Q057J2230R926K574o934j2189k44K27
15657D792l756l09m141k828k281J1359K406J7011O817j6358n385l440N408j132
15643H163j5425m565R441L5681P14j1702j8181l887m203Q007Q366n556O956l547
$$ plain form
15740 -23202 -10883 -2472 -11379 -8706 -7708 -14473 -15750 -17858 -19214 -22663 -16225 4758 6393 8076
15726 8076 8739 -3209 -14573 -26190 -16201 -19343 -15222 -1902 278 -865 -8432 -18378 -14066 -17530
15712 -17530 13928 30062 40716 29352 5578 6991 141 -14249 -13821 -9883 10528 32317 26242
15699 26242 10379 6016 -11761 -13166 7209 7848 5891 1095 363 11198 -1520 -8559 -6705 -3773
15685 -3773 -1017 3356 9702 9839 15452 25775 33317 26156 5856 9212 20318 16919 19893 17675
15671 17675 -7092 -12471 -12089 -20579 -17836 -8855 -798 11432 21358 23932 16998 4809 4565 4792
15657 4792 1036 727 -3414 -6242 -8523 2836 5242 22253 29070 12712 7327 3887 9295 8163
15643 8163 -7262 -11827 -2386 33295 34009 22307 4126 239 -3964 4043 12409 6853 13809 10262
15629A0262J539L966k393o358q14O816r043j7251K67O255J0049L298k876l141
15615E76j5569n61P986K369J1604P068j4476p926j846j3366j5733P876N098l861
15601c0761j087J4073J5722n97n064O222J1137r117j2323Qj883m078O905J3873
15587C030n823j1784j2456j668O456K133J0413N964m740J3494o217J539o758j2433
15573a8850j374K3810J2381k712J962J030N150k600q965k24K885k0958j7233L886
15559b1812J3534j559J404j4928j99L018L917L754m392o72j125L235n161R067
15545a1919J4042K196l022l901K14j393j056l0q926j3084N410K4245K8983j420
15531C0339k672n240J119k830q221o733k32j4944l834n375O621J6707k1298j0133
$$ plain form
15629 10262 11801 15767 13374 7016 6202 13018 3975 -13276 -13009 -6754 3295 6593 3717 576
15615 576 -14993 -15554 -7568 -5199 6405 13473 -1003 -8929 -10775 -24141 -39874 -31998 -26900 -30761
15601 -30761 -31848 -17775 -2053 -2650 -7714 -1492 9645 528 -11795 -11787 -13670 -17748 -10843 3030
15587 3030 -2793 -14577 -27033 -28701 -22245 -20112 -9699 -3735 -8475 5019 -1198 341 -6417 -18850
15573 -18850 -20224 3586 15967 13255 15217 16247 21397 18797 9832 9608 12493 -8465 -25698 -21812
15559 -21812 -8278 -9837 -8433 -23361 -23560 -20542 -16625 -12871 -17263 -17935 -19060 -15825 -20986 -11919
15545 -11919 2123 4319 1297 -2604 -2390 -3783 -4839 -4869 -13795 -26879 -21469 2776 31759 30339
15531 30339 27667 22427 23546 20716 12495 5762 5530 -9414 -13248 -18623 -12002 4705 -16593 -26726
15517b6726o689K1345j307J0503J7977K018n048l112k200j4574q082n55q970o823
15503c2243r469J3011K7474R491m263p245n719N169J660R251R649J2455o020j2207
15489A0994k5632L674M609j0824k162j4340J0950J3651J7701M663j5216O371q362
15476c923N666j7498j3711P111J8060P523J1466j0414m765J4878L778j9426l766
15463e021k840l680O679M23q731Q030P659l617K337M679Q811j7862r621O927j2450
15448a8277m953M836k613p626J219M582Q724K1727O363j1587j410r429p144j4667
15434c0255m141J1002P247O192N310q315j3312q4J0451O149K49K604o638q510
15420b2051o047M578J935j2922k413J5535Q335m49P587Q548j418K789j1061R708
$$ plain form
15517 -26726 -33415 -12070 -13377 -2874 15103 17121 12073 8961 6761 -7813 -15895 -16450 -25420 -32243
15503 -32243 -41712 -28701 -1227 8264 4001 -3244 -8963 -3794 -2134 7117 16766 29221 23201 10994
15489 10994 -14638 -10964 -6355 -17179 -19341 -33681 -22731 -9080 8621 13284 -1932 4439 -3923
15476 -3923 1743 -15755 -29466 -22355 -4295 3228 14694 4280 -485 14393 18171 -1255 -5021
15463 -5021 -7861 -11541 -4862 -4439 -13170 -5140 2519 -1098 1239 5918 14729 -3133 -12754 -5827 -18277
15448 -18277 -23230 -18394 -21007 -28633 -27414 -22832 -14108 7619 13982 2395 985 -8444 -15588 -30255
15434 -30255 -34396 -23394 -16147 -9955 -4645 -12960 -26272 -26356 -15905 -9756 -9507 -6903 -13541 -22051
15420 -22051 -28098 -23520 -21585 -34507 -36920 -21385 -13050 -13499 -5912 2636 1218 4007 -7054 2654
15406B654n144O112J4358J502Q319O555r644j8444j5737n42M047k327K620j636
15392g307J6390n131J3242R571j0894j1055j7962J4447J686j5215m52J5828N888
15379I036Q171j0160j6012J345O597P238j8040k153L30R917R310j340K672n985
15365I26k14J1264r318J1577J0484j0086J120R369m824M476r183k0247k754R266
15351A856j717J0153r293q868j298k657Q196L30n681M260J5697p159j6853j0539
15337b3573K156J7749L294j1349j7414J8514O759k739q374J021j1663J4666K0107
15324I154J5006p761J1184J6483q806j1274j8875p1K309N809n935j2307q851j3124
15310b7059Q679K3674J137Q223r440J960J5417J6646q268r147k100J282K80M591
$$ plain form
15406 2654 -2490 3622 17980 19482 27801 34356 24712 6268 -9469 -10011 -5964 -8291 -5671 -7307
15392 -7307 9083 3952 17194 26765 15871 4816 -13146 1301 2987 -12228 -12680 3148 9036
15379 9036 17207 7047 -8965 -7620 -1023 6215 -11825 -13978 -13648 -3731 5579 4239 6911 926
15365 926 712 11976 2658 14235 24719 14633 15753 25122 20298 24774 15591 -4656 -7410 1856
15351 1856 139 10292 999 -7869 -9167 -11824 -3628 -3298 -8979 -4719 10978 3819 -13034 -23573
15337 -23573 -21417 -3668 -374 -11723 -29137 -10623 -3864 -6603 -14977 -13956 -25619 -10953 9154
15324 9154 24160 16399 27583 44066 35260 23986 5111 5040 7349 13158 7223 -5084 -13935 -27059
15310 -27059 -18380 5294 6431 14654 5214 7174 22591 39237 30969 21822 19722 21004 21284 25875
15296B5875j0773q568j7558J0682R210j9428o251J3184M027J1703J308J855n504
15283I762N17n89j5078k241l899K0086J6892r519l801l803j0947J4858k22m274
15269G742j0525j6539J1701L115j237L4074J3414j8545j8026j5099k311J305J679
15256i252k360l092n4M36L887K269j683M272J0948j0746N184o458o298J4637J4228
15241A5918O729M890j4010q300o059P519L252Q12K4017j721l0394m128M904J0148
15227A3577j0791J6224J149J58J0156l175q020k0203k331O241O876M699l358M424
15213A5626j123j522p973p196J504j040r83q778N726k64j5236K1761J0096p50
15199I848N706j1685q188j5692M561J6206M728j857j8097O007O118K041j0924
$$ plain form
15296 25875 15102 6534 -11024 -342 8868 -10560 -16811 -3627 400 12103 13411 15266 9762
15283 9762 10279 9690 -5388 -7629 -11528 8558 25450 15931 12130 8327 -2620 12238 12016 7742
15269 7742 -2783 -19322 -7621 -4506 -5743 28331 41745 23200 5174 -9925 -12236 -10931 -9252
15256 -9252 -11612 -14704 -14758 -14322 -10435 -8166 -9849 -5577 5371 -5375 -191 -6649 -12947 1690 15918
15241 15918 22647 27537 13527 5227 -832 6687 9939 10751 34768 33047 2653 -1475 3429 13577
15227 13577 2786 19010 20159 20317 30473 27298 19278 -925 -3256 2985 9861 14560 11202 15626
15213 15626 14503 12981 5008 -2188 -684 -1724 -2707 -11485 -5759 -6023 -21259 502 10598 9848
15199 9848 15554 3869 -4319 -20011 -15450 756 5484 3627 -14470 -8463 -2345 -304 -11228
15186a1228m497p537p009R245J9883J8932j1790k2942j3198j6047L250J6611L725
15173b2602J136J3977P520o772J270L347J1895j1335k0127N763P783J3396n450
15160a99L963L212N958q082K219J6243L059j1118o687n352J8174m247r084j8536
15146a0477l901j1160l67O997J2004M891M833Q73K071p472J61K880M528o025J1908
15131A1744K0167l084j0491q807j4057j4406j0150q351K0310O499J6894L626R93
15118A0887J7320n700k8704K267n64P936L603l792l892j222n812j1316J805J3860
15104c324P37J915Q846n229J2748O370j2977K608m164l396n128j3747L795M378
15090f568M707j126L289r138k093J430K524J182k351J7859L4o737m195o367K104
$$ plain form
15186 -11228 -15725 -23262 -30271 -21026 -1143 17789 5999 -16943 -30141 -46188 -42938 -26327 -22602
15173 -22602 -21466 -7489 31 -6741 -5471 -2124 9771 -1564 -21691 -15928 -8145 5251 -199
15160 -199 3764 6976 12934 4852 7071 23314 26373 15255 8568 3216 21390 17143 8059 -10477
15146 -10477 -14378 -25538 -25905 -18908 -6904 -2013 2820 3693 5764 -1708 -1547 1333 5861 -164 11744
15131 11744 31911 28827 18336 9529 -4528 -18934 -29084 -37435 -17125 -10626 6268 9894 10887
15118 10887 28207 22507 -6197 -3930 -4494 3442 7045 3253 -639 -1861 -7673 -18989 -17184 -3324
15104 -3324 -2587 -672 8174 2945 15693 22063 9086 11694 7530 4134 -994 -14741 -10946 -6568
15090 -6568 -1861 -2987 302 -8836 -10929 -9499 -6975 -5793 -8144 9715 9749 3012 -1183 -7550 -5446
15075e446J3571n663k3135J527J4643P232K374N925P67N075O137j3277j617J0702
15061A8815q113k0851r555q590N155J9960O320j8869j223O739J1902P225L055
15048A1970N413N105p12q756k140n853j2102J165l154J2011j2833j8643m969Q528
15034b4970K3641J4537k0984r601q179K587o029L282K4377K038j0725R207L349
15021B530n529r14k033q870O56K834J0551N357J7041p500q518r948q228k408l232
15006a8211j0708M583O40J5465L600j856P347j0555O329n050J1919J5732k474
14993A6761r890j1415N414P836j0221j5708L367J3054r696j0116l362O576L1138
14980A3738M451j3182l999K38K379m513j2120n836n308r005L858J6283J317R550
$$ plain form
15075 -5446 8125 2462 -20673 -19146 -4503 2729 5103 11028 11795 16870 23007 9730 8113 18815
15061 18815 10702 -10149 -19704 -28294 -23139 -3179 3141 -15728 -16951 -10212 1690 8915 11970
15048 11970 17383 22488 21776 13020 10880 5027 -7075 -5910 -9064 2947 -9886 -28529 -33498 -24970
15034 -24970 -1329 13208 -7776 -17377 -25556 -22969 -28998 -25716 -1339 699 -10026 -819 2530
15021 2530 -2999 -3913 -5946 -14816 -14160 -11326 -775 4582 21623 14123 5605 -4343 -12571 -14979 -18211
15006 -18211 -28919 -24336 -23696 -8231 -4631 -6487 860 -9695 -3366 -8416 3503 19235 16761
14993 16761 6871 -4544 870 8706 -1515 -17223 -13856 -802 -10498 -20614 -23976 -17400 13738
14980 13738 18189 5007 1008 1246 3625 -888 -13008 -18844 -24152 -33157 -29299 -13016 -11699 -2149
14966b149J2852J9613n175l1160k210R349J5538L65j515j860j3865j2749r80K104
14952a1842J2471Q86J007j7870k947M733o7j1359o401L378L5626l116k8496j7597
14938d1594R26J8857L9205N792j6440j3438M250l523j6093L509P508Q559q695
14925a1177m622P114r540q879J9217l570o170P380j8009J1795J0378N68j081q189
14911a4785J0749j649j0646j6747K315J6105N611l436q237J1016J1176N071L246
14898I789r549j4934R374J0000j2851P767J3160p895j3212p494N308J7703n671
14885A495j200L955q247m214M399k443N78K8345J1756l178j3552j3986O4j209
14871B563j3408k648L08j0858J0138l322O49K5749p906M60J4223j139l298l907
$$ plain form
14966 -2149 10703 30316 25141 -6019 -8229 1120 16658 17023 15508 13648 -217 -12966 -13946 -11842
14952 -11842 629 1515 2522 -15348 -18295 -13562 -13629 -24988 -31389 -28011 7615 4499 -23997 -41594
14938 -41594 -40668 -21811 17394 23186 6746 -6692 -2442 -5965 -22058 -18549 -11041 -2482 -11177
14925 -11177 -15799 -8685 -18225 -27104 -7887 -11457 -17627 -10247 -28256 -16461 -6083 -5515 -6596 -14785
14911 -14785 -4036 -5685 -16331 -33078 -30763 -14658 -9047 -12483 -20720 -9704 1472 6543 9789
14898 9789 240 -14694 -5320 4680 -8171 -404 12756 4861 -8351 -15845 -10537 7166 1495
14885 1495 295 4250 -3997 -8211 -3812 -6255 -5677 22668 34424 31246 17694 3708 3772 2563
14871 2563 -10845 -13493 -13185 -24043 -13905 -17227 -16578 9171 1265 1725 15948 14809 11511 7604
14857G604j6269j8578n874J3325O17M079Q041K2272J1949o555j7283r061l26k442
14843h501J1224m421j4583J4098M572J448R564o62k0187K956j445m844J8676k871
14829E024k6946J768N398M706J1813Q373r756l3409l100N839r541J7141K6812
14816D122K599J153J2207K0134j7412n589J805L583n946j9387r483P149p99j5
14802e879m974P465J4982r50m528k150K0978J7233k0127j2521j6151n481j752
14789a3855m989R647k777l584n626Q849J4738L967k1111N43o68O541N586J9031
14775A6292J3050j0529N465R406M042r849q483q553p704L612o81q097j2649l513
14761a8191o285K5117r63k4825j338J1624Q27N561r231k5796q353J1912K619p381
$$ plain form
14857 7604 -8665 -27243 -33117 -19792 -19175 -15096 -7055 15217 27166 20611 3328 -5733 -6059 -8501
14843 -8501 2723 -1698 -16281 -2183 2389 3837 13401 12739 -7448 -4492 -5937 -10781 7895 5024
14829 5024 -21922 -20154 -14756 -10050 1763 10136 380 -33029 -36129 -30290 -39831 -22690 4122
14816 4122 6721 7874 20081 40215 22803 17214 19019 22602 16656 -2731 -12214 -5065 -5864 -5879
14802 -5879 -10853 -3388 11594 10644 6116 3966 24944 42177 22050 9529 -6622 -12103 -13855
14789 -13855 -18844 -9197 -11974 -15558 -21184 -12335 2403 6370 -14741 -14198 -14866 -8325 -2739 16292
14775 16292 29342 18813 24278 33684 37726 27877 19394 10841 3137 6749 6068 -2029 -14678 -18191
14761 -18191 -24476 641 -322 -25147 -26485 -14861 -14034 -8473 -17704 -43500 -51853 -39941 -37322 -44703
14747d4703j0975K2316J4405L990n075n024l357J3360K690J8175R00p428R714
14734H988J5528r545l240Q000o388Q377J0887q082l767o040k0449j0519J1079
14721e171J0458j4861j7928J3718R665J7764q960o42J7488r067j5258r188O22
14708a1360J3701M805J2356q94m650p188J0130M393P56j2619k90L932m934p191
14694I47j3436J3689J3136q033j0523L76j4429j2873K017K0163O834J5956j970
14681A1854p440j100J1197O033q636j9461k619J6400J1886j5856j6649J2943j0311
14668a1759L364j966o530J251R162N945j474m18N59N697j2846j9436j2814K0224
14654b1041K1494k833J35j7229P17j949J0437L413o471O561P691K033n734l607
$$ plain form
14747 -44703 -55678 -33362 -18957 -14967 -20042 -25066 -28423 -15063 -12373 5802 6702 -726 8988
14734 8988 24516 14971 11731 19731 13343 21720 32607 24525 20758 14718 -5731 -16250 -5171
14721 -5171 5287 -9574 -27502 -13784 -4119 13645 4685 4043 21531 12464 -2794 -11982 -11360
14708 -11360 2341 7146 19502 18608 13958 6770 16900 21293 22049 9430 9140 13072 8138 947
14694 947 -12489 1200 14336 6303 -4220 -3844 -18273 -31146 -29129 -8966 -2132 13824 11854
14681 11854 4414 3314 14511 20544 11908 -7553 -10172 6228 18114 2258 -14391 -1448 -11759
14668 -11759 -8395 -10361 -16891 -15640 -6478 -533 -2007 -2425 -1866 3831 -9015 -28451 -41265 -21041
14654 -21041 453 -2380 -2245 -19474 -18757 -20706 -10269 -6856 -13327 -6766 925 2958 -2776 -6383
14640f383l317J2970q675J4676J238j0878L062j537q955m073K726O363K799O425
14626F441j8031p90J4755N913O865M991p791O617J385j2707m247N578J0323q532
14612A0770p051O491J7364M087j7431N5J770l136Q628l131K313p914j9594j2341
14598a9120R138Q913p796N041l453P074J1208o583j978q272n842M414n073l960
14584a6289J4880m561k0013j2058m838L005K1774J815j53J8675K741r887m989
14571i898J0770n129j1758R495m844J0936J768O153N823j0661q290R184L769J4714
14557B2032J3393m114O585K650q679n095l732j9048N495j375K314k1782k337J1905
14543a788K3202Q546j113j4131j8228j6548k1576J0372J8483P807O751K703k618
$$ plain form
14640 -6383 -9700 3270 -5405 9271 10509 -369 2693 1156 -7799 -11872 -9146 -2783 16 6441
14626 6441 -11590 -12380 2375 8288 15153 20144 12353 18970 20355 7648 3401 8979 19302 10770
14612 10770 3719 10210 27574 31661 14230 14285 16055 12919 21547 18416 20729 12815 -6779 -19120
14598 -19120 -9982 -1069 -8865 -3824 -7277 -203 11005 4422 2444 -5828 -11670 -7256 -12329 -16289
14584 -16289 -1409 -5970 -25983 -38041 -42879 -39874 -18100 -16285 -16438 2237 4978 -4909 -9898
14571 -9898 872 -4257 -16015 -6520 -11364 -428 1340 7493 13316 2655 -5635 3549 7318 22032
14557 22032 35425 31311 37896 40546 31867 26772 23040 3992 9487 8112 10426 -11356 -13693 -1788
14543 -1788 21414 29960 28847 14716 -3512 -20060 -41636 -31264 -12781 -4974 1777 4480 1862
14530A862o153P033M595m997M119J622k967O694K2534Q187j8766l380M625q408
14516A6600k7700N771k551j3743m294J862J0554Q18N433N441j0195j6807j7930
14503d6741o527R553O445J1715K1203J0016j0916j89n891m427L413P388R797R771
14489A4610L009j2498L3l166j0731K168Q058R495j373J7579j301n594M8m441r166
14474F730k284N431n908P660P215q387R822N90o314p262o988p249k1378J2866
14460a5456J7690l496q9j3426j3736r4L49K4947R964J0952j999j3410j2275j4836
14446b4915n700N838R622J0225j307k553K9129J4070o093O483j5605k1060J4091
14433A2225n434O763P453r800j0550O016k759O298l747k220j1604j7190J816j222
$$ plain form
14530 1862 -4291 2742 7337 2340 6459 8081 5114 11808 34342 42529 23763 20383 25008 16600
14516 16600 -11100 -5329 -7880 -21623 -25917 -24055 -13501 -12683 -7250 -1809 -12004 -28811 -46741
14503 -46741 -53268 -43715 -37270 -25555 -4352 5664 -5252 -5441 -11332 -15759 -12346 -4958 4839 14610
14489 14610 17619 5121 5154 1988 -8743 -6575 1483 10978 9605 27184 25883 20289 20337 15896 6730
14474 6730 4446 9877 3969 11629 18844 10457 20279 20869 14555 7293 305 -6944 -28322 -15456
14460 -15456 2234 -1262 -1351 -14777 -28513 -28607 -28258 -3311 6653 17605 15606 2196 -10079 -24915
14446 -24915 -30615 -24777 -15155 -4930 -6237 -8790 20339 34409 28316 34799 19194 -1866 12225
14433 12225 6791 13554 21007 11207 657 6673 3914 10212 6465 4245 -7359 -24549 -22733 -23955
14419b3955j110O197J8738J2080J317o071p32o582J8978J2552r991l815j4048
14406C558j8199m848k572k4731L672K3059P196O425J5245Q992M955k0469j0703
14393h420K157j1411j644J4058j90j075o664J2142j0114j918J1946o780o155M106
14379i962m29L86P549K071o370l512o095L929P173o12K671J3616l59j5121j3678
14364a8743m420R276J289J3295R374k222O302k590o612n32n997j5606J990J3359
14350a837m758R887k807j7656m061K925M934J1137p249P599J7520q156r373J617
14336b78J0689O629J1941r460j2858L463j8281k4943m489J4393J0641R390K648
14323e15j3245O564J7955j1917n18L530J1718L047k2033q96J3655J8327m527j5504
$$ plain form
14419 -23955 -25065 -18868 -130 11950 13267 7196 6464 -118 18860 31412 21421 17606 3558
14406 3558 -14641 -19489 -22061 -46792 -43120 -20061 -12865 -6440 8805 17797 22752 2283 -8420
14393 -8420 -6263 -17674 -19318 -5260 -5450 -6525 -13189 -1047 -11161 -13079 -1133 -7913 -14068 -9962
14379 -9962 -10391 -10005 -2456 -385 -6755 -10267 -16362 -12433 -5260 -5872 -3201 10415 10056 -5065 -18743
14364 -18743 -23163 -13887 -12598 697 10071 7849 14151 11561 4949 4417 -1580 -17186 -15196 -1837
14350 -1837 -6595 3292 485 -17171 -21232 -18307 -13373 -2236 -9485 -1886 15634 7478 -1895 -278
14336 -278 10411 17040 28981 19521 6663 10126 -8155 -33098 -37587 -23194 -12553 -3163 -515
14323 -515 -13760 -7196 10759 -1158 -1676 1854 13572 16619 -5414 -6310 7345 25672 21145 5641
14309E641m666r18J30k158K493L412j616J0327P78K4699q808r423j756r973o548
14294A614K0333N362j0968q518j0860n52Q468K357n632o004J417O777L691j2847
14280e362M831j5485j8237M139K864J2828J4133J228Q317O190k822j2603m857
14267d836k725r161Q645J389l961J3679J44O524R216j3289j0150j4004q453J6125
14253a0857L3269L120o436j891M261r725p937K924J0382Q67l335M5o947J462k738
14238F464k4386Q909J2593j1637o223Q715O535J2675j4847M9K1889J1905m705
14225B7936k3619j7687O941r93q363J4270J9841R22m938j6664j1408k418K446
14212a3734J7727Q0j4522O847k789j3600j484J0810P133O533R608l989Q36J0039
$$ plain form
14309 5641 975 57 187 -1971 522 3934 2318 12645 13423 38122 29314 19891 18135 8162 1614
14294 1614 21947 27309 16341 7823 -3037 -3589 4879 7236 1604 -4400 -2983 3794 7485 -5362
14280 -5362 -531 -16016 -34253 -30114 -27250 -14422 -289 939 9256 15446 12624 21 -4836
14267 -4836 -7561 -16722 -8077 -6688 -10649 3030 3174 9698 18914 5625 -4525 -18529 -26982 -10857
14253 -10857 22412 25532 19096 17205 21466 11741 3804 6728 17110 17977 14642 14687 7740 9202 6464
14238 6464 -17922 -9013 3580 -8057 -14280 -5565 970 13645 -1202 -1153 20736 32641 27936
14225 27936 4317 -13370 -6429 -7422 -15785 -1515 18326 19248 14310 -2354 -13762 -16180 -13734
14212 -13734 3993 4073 -10449 -3602 -6391 -19991 -21475 -10665 -3532 3001 12609 8620 9456 19495
14198A9495n997l123r739n77K011J257M169J0738J2399K401k1191n957p084L814
14184B616j5327P521p186N523J167j0851j7599j588K499J2106O89J3931J4871
14171H372k496P643K827O619n931j403p351j80p296q714J0489J7699O733J9581
14157D6592K349k2540j6472o08J7306m230r980J555r261o001l2899j9201K3372
14144c0018O169K090J0932J3787M950M831R941j695o246l981Q818o21K406J310
14130B2673o72k0397o15O314K413N534K664m230n742p21j2414J0848J744o110
14116A289j0246R589O084L766Q304k431j6927L32Q276J416J5636k4868j7000J6284
14102d96L969j1003J275N001j501j8772l872O845O241J5097k603k0445Q308O321
$$ plain form
14198 19495 13498 10375 636 59 2070 3327 7496 18234 30633 33034 11843 5886 -1198 2616
14184 2616 -12711 -5190 -12376 -6853 -5686 -16537 -34136 -35724 -33225 -21119 -20430 -6499 8372
14171 8372 5876 13519 16346 22965 17034 15631 8280 8100 804 -7910 2579 20278 27011 46592
14157 46592 48941 26401 9929 9321 26627 22397 12417 13972 4711 -1290 -34189 -53390 -30018
14144 -30018 -23849 -21759 -10827 2960 7910 12741 22682 20987 14741 10760 19578 18957 21363 22673
14130 22673 22001 1604 989 7303 9716 15250 17914 13684 7942 7221 -5193 5655 7399 1289
14116 1289 -8957 632 6716 10482 18786 16355 -572 -240 8036 9452 25088 220 -16780 -496
14102 -496 3473 -7530 -6255 -1254 -2755 -21527 -25399 -18554 -12313 2784 181 -20264 -11956 -5635
14088e635r035l151Q516Q547j891j1772j5874J9508J6135R694R26R963J5984o402
14074C5513o673P61Q516l249j8374k5356M883J0766J4877j0679j1241m142K1229
14061A6831j2946j7444q891R159J5094R942j9000j0373P739j2620j6012J3691
14049b4830K7269J984p555q870j25m870j072M272N738Q03L298Q787O416k1877
14035a0632j7186M721O789P638Q567N548P606M857k3825M865J9402J1146j4353
14022A5143j3355j070J292j8305J1782K8725j2959j0597m302n322J22J0185r182
14009g843n990J4290R657j020n397J928K0352R085K861N85l599o783k0219k0185
13995a2278P111q15k661l277k74L0084K598k675j0305n91J8812k8p995J951j7020
$$ plain form
14088 -5635 -14670 -17821 -9305 -758 -2649 -14421 -30295 -10787 5348 15042 15968 25931 41915 35513
14074 35513 28840 29601 38117 34868 16494 -8862 -3979 6787 21664 10985 -256 -4398 16831
14061 16831 3885 -13559 -22450 -13291 1803 11745 -7255 -17628 -9889 -22509 -38521 -24830
14049 -24830 2439 4423 -3132 -12002 -12127 -16997 -18069 -13797 -8059 -7256 -3958 4829 11245 -10632
14035 -10632 -27818 -23097 -16308 -8670 -103 5445 13051 17908 -5917 -1052 18350 29496 15143
14022 15143 1788 718 2010 -16295 -4513 24212 11253 656 -3646 -8968 -8846 1339 -7843
14009 -7843 -13833 457 10114 9094 3697 5625 25977 35062 37923 38508 34909 28126 7907 -12278
13995 -12278 -5167 -5982 -8643 -11920 -12194 17890 20488 17813 7508 6917 25729 25701 17706 19657 2637
13980B637P687J0880J2653Q169o581l5802r955K5338N595O091O298m771j5257
13967A2982o145M009k0776M289l81k839j206n935L146Q110K434J90M34r42O129
13952C499M394j6791J4147O931j2635j5839j7479n19J4003J6493J8219k461M792
13939A6754m840j954J2619J6332k22j6179j5300k888l417O057j685j4444P449
13926a718N191M161j8154r828J4811Q843J3648n467j0766m486N331o347O415O215
13912G849K2291j505k671O624m118j5985j0040N947K561J5955M85j4204q098j563
13898C528O399k001J1006P732r687O466j37p258r120Q942J2074j4637m347J8928
13884B7888L931l270M749R368p03p916k2550m100J8710J3694J609k202j1521j0370
$$ plain form
13980 2637 10324 21204 33857 42026 35445 -357 -10312 15026 20621 26712 33010 28239 12982
13967 12982 6837 10846 -9930 -5641 -6022 -8861 -10067 -16002 -12856 -4746 -2312 -2122 -1688 -2630 3499
13952 3499 7893 -8898 5249 12180 -455 -16294 -33773 -34292 -20289 -3796 14423 11962 16754
13939 16754 11914 9960 22579 38911 38689 22510 7210 4322 905 6962 5277 -9167 -1718
13926 -1718 3473 7634 -10520 -20348 -5537 3306 16954 11487 721 -3765 1566 -4781 1634 7849
13912 7849 30140 28635 25964 32588 28470 12485 2445 8392 10953 26908 27393 13189 5091 3528
13898 3528 9927 7926 18932 26664 16977 23443 23306 16048 6928 15870 27944 13307 8960 27888
13884 27888 31819 28549 33298 42666 41963 34047 11497 7397 26107 39801 41410 39208 27687 17317
13870A7317J4598N379n427p340o095j401j1805k973m426Q443l368j630O98J5046
13856A7016Q624j0113l933r598N068J1787J098j3470R998o532O016Q030N588j2676
13842A6903M898M098L662q400M767N384q003L364N10j8077j4164m384K327J6258
13828I143J5169m81k8509r391J3260p317J943K0061N203J7072n49r783j1165l38
13814A4318P399J1589O98j613p682K762M391J3494j0757k6342o591m424L337K156
13800B735L881K65n521P793K581K351p175K898J8095n68m024m169k2971o597J3218
13785B792J0191J310N095K717p24j492J4675m453j2998J096K1591j211j3300n785
13771A9504K373p433K793j2897j6867J4830R161M216k534R239J3431q321j994
$$ plain form
13870 17317 31915 37294 31867 24527 18432 17031 5226 2253 -2173 6270 2902 1272 1970 17016
13856 17016 25640 15527 11594 1996 7064 18851 19949 6479 16477 9945 15961 23991 29579 16903
13842 16903 21801 25899 29561 21161 25928 31312 23309 26673 27183 9106 -5058 -9442 -7115 9143
13828 9143 24312 23831 -4678 -14069 -809 -8126 -6183 13878 19081 36153 35604 25821 14656 14318
13814 14318 21717 33306 34004 32391 24709 27471 31862 45356 34599 8257 1666 -2758 579 2735
13800 2735 6616 6881 1360 9153 11734 14085 6910 9808 27903 27335 23311 19142 -3829 -10426 2792
13785 2792 12983 14293 19388 22105 21381 19889 34564 30111 17113 18209 39800 38589 25289 19504
13771 19504 21877 14444 17237 4340 -12527 2303 11464 15680 13146 22385 35816 27495 25501
13758B5501K1218J3071k125k1423j2129j1835M725L51n578j3250L180J5859j7808
13745b43n724J772P420L313J6860p866q638J4070J0531j866q963j415j4159J6542
13731B1634P045N820n154K5204J1068j2600n84j1637k6015k2468J7175J7052P005
13718C3545J8049o910j4841N160J1229l3387j2632J068O132K1892j0637p562j8133
13705g027O793M607J795Q804L441n441q132J152J705n300q601J1678O282r27o526
13690D303J590J9444q1j790j400p978J905k798J1836l617J129K078r287o519J111
13675I926J4003P719j2996j5589M388N78K317r06P136m016j7458j1421P971J3913
13661E565J7335J0779n529L30o196j0868m040J2045J46j0747K403K04m877m41
$$ plain form
13758 25501 46719 59790 57665 36242 24113 12278 17003 17354 11776 -1474 1706 17565 -243
13745 -243 -5967 -4195 3225 6538 23398 15532 6894 20964 31495 29629 20666 19251 5092 21634
13731 21634 28679 34499 29345 54549 65617 53017 52433 40796 14781 -7687 9488 26540 33545
13718 33545 51594 44684 29843 35003 46232 12845 213 1281 7413 29305 18668 11106 -7027
13705 -7027 -234 4373 6168 14972 18413 12972 4840 5992 7697 2397 -6204 5474 11756 10829 4303
13690 4303 5893 25337 25256 23466 22066 14088 15993 13195 25031 21414 22543 24621 15334 8815 9926
13675 9926 23929 31648 18652 3063 7451 8029 10346 9440 16576 12560 -4898 -16319 -8348 5565
13661 5565 22900 33679 28150 28480 22284 11416 7376 19421 19567 8820 11223 11427 6550 6109
13647F109j809r036p654m21m654K728R839R024k7451L390O724k617J695K695J6332
13632D894m62r285L077N155M731J3332J987n356Q119n686K845K3611k918m263
13618C9781j891k153K197o692J4752M510j1179j9352L663M956n26j7094j3968
13605b996r490O338J8569j612j4693P039K2342N007M442j917M280N29k762p40
13591C4336j5845j1235P941J7366k448k3285k264J0271K4898J7714J202j6609
13579D2042j2447j347k1143N30k001R050J5802m770P907j7706j5931J436J4105
13566A5527O295O444k322j0594R121j0900j2377J8554J0384J4936j4760j9596
13554A0712J3253R859n202p436N043r956j9464J4553j740J5006L762l80J144J2482
$$ plain form
13647 6109 4300 -4736 -12390 -12811 -17465 -14737 -4898 4126 -23325 -19935 -13211 -15828 -14133 -11438 4894
13632 4894 4432 -4853 -1776 3379 8110 21442 23429 18073 26192 20506 23351 46962 44044 39781
13618 39781 37890 35737 37934 31242 45994 50504 39325 19973 23636 28592 28066 10972 -2996
13605 -2996 -12486 -6148 12421 10809 -3884 3155 25497 30504 34946 33029 37309 37838 35076 34336
13591 34336 18491 7256 15197 32563 30115 6830 4566 14837 39735 57449 58651 42042
13579 42042 29595 28248 7105 7635 5634 14684 30486 25716 33623 15917 -14 1422 15527
13566 15527 21822 28266 25944 15350 24471 13571 1194 19748 30132 45068 30308 10712
13554 10712 23965 33824 28622 21186 26229 16273 -3191 11362 9622 24628 28390 28010 29154 41636
13540D1636j0568K068p36k90j574j4861J8189J2284L933j8528l443J2724J7491
13527E8325j4767j9389J008k1685o213j108P70M594O666j592p19J7333R879q507
13513B4595l455J5313R119k347M309q129P339q21L251J4224J398k936M214J537
13499F7611R5p649m445J5508p034j2460j5535o518K0378J576j6332m782N928o09
13485C5732j4798M133J6501K0876j7279M476J1630J2618o95k783K207O28r82j1667
13471F0597j7063J2792L95j4809M655J3060J153n647j1079P462L737K432J008
13458E8693J2457J1164O486R753N237Q378J3915L1015L19M352K7363M5082L6009
13445B70223P2961R6298J17983K40107L86561N16675N46065M79122J93215k05734
$$ plain form
13540 41636 31068 33136 32400 32110 30536 15675 33864 46148 50081 31553 28110 40834 58325
13527 58325 43558 24169 25177 3492 -2721 -3829 -3059 1535 8201 6609 5890 23223 33102 24595
13513 24595 21140 36453 45572 43225 47534 39405 46744 45923 49174 63398 64796 61860 66074 67611
13499 67611 67706 60057 55612 71120 64086 51626 36091 29573 49951 51527 35195 30413 36341 35732
13485 35732 20934 25067 41568 62444 45165 49641 61271 73889 73194 70411 72618 73246 72264 60597
13471 60597 43534 56326 56721 41912 46567 59627 60780 55133 44054 51516 55253 57685 58693
13458 58693 71150 82314 88800 98553 103790 112168 126083 157098 157417 161769 189132 234214 270223
13445 270223 343184 439482 557465 797572 1184133 1700808 2246873 2725995 2919210 2713476
13435B713476m90981o17397n27334l26868j84060j15571p8758m9624l2655m6491
13425B43737j8068j3968j4988j2757r487k8114J6801J3472j1820p432j4343j1727
13413A31306j0412k4412j3953R346M374q548k081j68q432j3166K5742J8111j1611
13400I6096j2445l904J2305j344K2031r006j4880J2253j2545q895M01N546J0673
13387I6286M854j017Q5m212k4255P893L869o013j0898J0890O395O897P582j257
13373I7099p139j1095j3251J887j4882k1100N586O259J5847J1190m57J2541K361
13360H4846j3175K5039J2546j0010k923o155k2282J146N416m170J491p379p495
13347E6895K4114N463j128j079L70O757Q312j1635k9876N35J9259j0533j0839
$$ plain form
13435 2713476 2222495 1605098 1077764 750896 566836 451265 372507 322883 290228 243737
13425 243737 225669 211701 196713 183956 174469 146355 163156 176628 164808 157376 143033 131306
13413 131306 120894 96482 82529 91875 96249 87701 85620 85452 77020 63854 89596 107707 96096
13400 96096 83651 79747 92052 90708 112739 103733 88853 101106 88561 79666 80067 85613 96286
13387 96286 101140 100123 100208 95996 71741 79634 83503 77490 66592 77482 83877 90774 98356 97099
13373 97099 89960 78865 65614 67501 52619 31519 37105 43364 59211 70401 69944 82485 84846
13360 84846 71671 96710 109256 99246 96323 90168 67886 69032 74448 70278 71769 64390 56895
13347 56895 81009 86472 85344 84265 84635 91392 99704 88069 58193 58728 77987 67454 56615
13334E6615n652k1383O903R32J0705J3362K3405J4460J6152j1819p714j5544j1512
13321F8910Q404K7281J5113q983p088L2076K4798j591J053Q539J1298j1644P684
13308A75850l89j4985q558k1501l0614n6250o8509n4997l8602k3577M006J5895
13296a22231M6669M2161K1153J8567p748j0680O62o595K5940K7772J7953K823
13284E6446j0782k3343K405L917J3543J1812M977N62Q017k210j4821J6430J0404
13271G7357q529j1923r863K826J8769O832j1632j5787L487K2758P904l2082j2672
13258C7445R035J3966J9083J7527K0346N4036N9309O9691N4070O6565R9203Q6089
13246F06365J9320m5379q3121q2562p2091o9922m6579l3253k7889j703M099j0310
$$ plain form
13334 56615 50963 29580 36483 37415 48120 61482 84887 99347 115499 103680 95966 80422 68910
13321 68910 77314 104595 119708 110725 103637 135713 160511 158920 159973 168512 179810 168166 175850
13308 175850 175461 160476 151918 130417 99803 43553 -24956 -79953 -118555 -142132 -138126 -122231
13296 -122231 -75562 -33401 -12248 6319 -1429 -12109 -11447 -18042 7898 35670 53623 56446
13284 56446 45664 22321 24726 28643 42186 53998 58975 59537 67554 65344 50523 66953 77357
13271 77357 68828 56905 47042 49868 68637 75469 63837 48050 51537 74295 82199 50117 37445
13258 37445 46480 60446 79529 97056 117402 171438 230747 300438 354508 421073 520276 606365
13246 606365 625685 580306 497185 414623 342532 272610 226031 192778 164889 163186 167285 156975
13234A56975j0976q787L249r802k4815k8379j9973K620J8633N662J4920N232j6779
13221H7780j6516l132Q367j638J3264J7248J8322O625J180k111j3739k4260j2764
13208G8626m142P02J1210P54l819L529K7519J3401P366m964l309j3261k5004j2879
13194G5729l2729k1671j1401L132L2278J5052J0617J3029K3396P664j6787K7190
13182A25499L4416J7448J3060J4740R206L506J0926J9049K7266K5211j5740m9247
13170B35340l4274j5865j8067k9435r475P279k1410k2598K942K425m286n121p450
13157H0005O357O802J8511K2204K523q9J0637o924k3039j1909L465K6318N0330
13144A85191J7553R371R861J257J0156K1982p926K0251K5097K8608l491n45O225
$$ plain form
13234 156975 145999 137212 140461 130659 105844 77465 57492 60112 78745 84407 99327 104559 87780
13221 87780 71264 68132 76499 74861 88125 105373 123695 130320 131500 129389 115650 91390 78626
13208 78626 74484 75186 86396 87150 83331 86860 114379 127780 135146 130182 126873 113612 88608 75729
13194 75729 43000 21329 9928 13060 45338 60390 71007 84036 107432 115096 98309 125499
13182 125499 159915 177363 190423 205163 214369 217875 228801 247850 275116 300327 284587 235340
13170 235340 201066 185201 167134 137699 128224 135503 114093 91495 94437 96862 92576 87455 80005
13157 80005 86362 93164 111675 133879 136402 136313 146950 140026 116987 105078 108543 134861 185191
13144 185191 202744 212115 221976 223233 233389 255371 247445 267696 292793 321401 317910 317365 323590
13131C23590O210R002K254J0217L1194K7535M5916P4191J06628Q6703M2431j3068
13119G52803p3847j18072j03658o2573m1420j1597j7777K1280L0305M317L475
13108C83236o670o905j1651j7411N375K0438J6252r739n279j0651j427j4972j8863
13095C21733J4537L1429J1097L679K1407J8964R513J1592k142o94q262o453p867
13082D18533L2229J9882J34K0098M9166L6453L9394N6173K5223k451k2173l2693
13070F39968j8757l573J6967K5878M3385L7766M9806P1954O3922O9689O8848N7493
13058A123346L0198L453j8442M824K6716J7559K2589L4520M9036M1145L9910M1543
13046A416397L4538L8512N4401M8017P8574M3890L7867N6839O8937M9686M9443
$$ plain form
13131 323590 329800 338802 341056 351273 382467 410002 455918 530109 636737 723440 765871 752803
13119 752803 678956 560884 457226 394653 353233 341636 323859 345139 375444 379761 383236
13108 383236 376566 369661 358010 340599 345974 366412 382664 372925 367646 356995 355568 340596 321733
13095 321733 336270 367699 378796 382475 403882 422846 432359 443951 441809 441115 432853 426400 418533
13082 418533 450762 470644 470778 490876 540042 576495 615889 672062 697285 694834 672661 639968
13070 639968 621211 617638 634605 660483 703868 741634 791440 863394 927316 997005 1065853 1123346
13058 1123346 1153544 1156997 1138555 1143379 1170095 1187654 1210243 1244763 1293799 1334944 1374854 1416397
13046 1416397 1450935 1489447 1543848 1591865 1670439 1714329 1752196 1809035 1877972 1927658 1977101
13035A977101O6386P6922R3387J24970J62357J85378J83038J85103J90438J96783
13025C441863K00260K27551K71543L08787L27005L46738L48664L73049L87352
13016F232812M62493N58248O56206P83128Q85604J003917J136654J370793J736651
13007A4826506K267728L021347M057146N306175O859558R149697J2745032J9282716
12999G7515905L1108166N0707834P7272913R9298921J01628165P9493178K0881647
12992E37906729n1595134r8207307j16217290r3222144n5241078l1445101j9026468
12985G2952207j2629808r244249p296712n877888m710595l723815l011273k533953
12977B3923914k151663j811648j512115j305346j112792j015015r63867q98422
$$ plain form
13035 1977101 2043487 2120409 2213796 2338766 2501123 2686501 2869539 3054642 3245080 3441863
13025 3441863 3642123 3869674 4141217 4450004 4777009 5123747 5472411 5845460 6232812
13016 6232812 6695305 7253553 7909759 8692887 9578491 10582408 11719062 13089855 14826506
13007 14826506 17094234 20115581 24172727 29478902 36338460 45488157 58233189 77515905
12999 77515905 108624071 159331905 236604818 335903739 437531904 517025082 537906729
12992 537906729 486311595 388104288 271886998 178664854 123423776 91978675 72952207
12985 72952207 60322399 51078150 43781438 37903550 33192955 29469140 26457867 23923914
12977 23923914 21772251 19960603 18448488 17143142 16030350 15015335 14051468 13153046
12969A3153046q22878p32014o48693n78963n05587m43018m02941l84669l53486
12960H280797l18690k45478j62242q8654m4209m1751p9221k12966l62322m33020
12950F292244m45644l81998l01785k44291j92441j72121j53795j50142j39630
12941D110397j28695j10881j19858j28194j28685q6825o8004o6759o9611p5465
12931C127420o5300o9497q7540p1343o4266m8580k7296O089K9718N2841J14514
12920B896760K04668L32106M57422M81969L95196P1000l35135n59294o46806n19652
12910B778234l26157k13228j42847j03958r4485q6026o3819n7751o3584o4440
12900A561939n5071n8128n9793l5418m7459k7494j2409j9701k5222k8772k8008
$$ plain form
12969 13153046 12330168 11598154 10949461 10370498 9864911 9421893 9018952 8634283 8280797
12960 8280797 7962107 7716629 7554387 7465733 7421524 7379773 7300552 7087586 6725264 6292244
12950 6292244 5846600 5464602 5162817 4918526 4726085 4553964 4400169 4250027 4110397
12941 4110397 3981702 3870821 3750963 3622769 3494084 3407259 3339255 3272496 3202885 3127420
12931 3127420 3062120 2992623 2905083 2833740 2769474 2720894 2693598 2699687 2729405 2782246 2896760
12920 2896760 3101428 3433534 3890956 4372925 4768121 4839121 4503986 3944692 3297886 2778234
12910 2778234 2452077 2238849 2096002 1992044 1897559 1811533 1747714 1689963 1626379 1561939
12900 1561939 1506868 1448740 1388947 1353529 1306070 1278576 1266167 1246466 1221244 1192472 1164464
12889A164464k4500l1638o3341o7189l7835j7543r708l357j9388j4569l7558l5816
12877H02022j4259j3554Q15K0805L2594K3266M9565O5536N6752J8810l701l6803
12865A001848p0690r1965q2814o9105p2715n0575l1319k3169j6879k045l3461
12854D57111n1036j2539p403n9j759r138j2629r503q142l373K4397R109J5540
12841C90576K5039J4813R97j6196k7890j3841k695r496l312k730m540j7436J3632
12828C46921K4644J9102Q374j9056k9673k973j1503k5676k5090l4786l0606l3463
12816A86215m8366m1375k2784j1339L733J4716J7200J8967j1593o796l838K3253
12804A17993J5325l63K4716J1751q229J1109K1808J5831J2679j589j6694k2162
$$ plain form
12889 1164464 1139964 1108326 1044985 977796 939961 922418 912710 909353 889965 875396 837838 802022
12877 802022 787763 774209 775024 795829 828423 851689 901254 966790 1023542 1042352 1038651 1001848
12865 1001848 931158 839193 756379 687274 614559 563984 532665 509496 492617 490572 457111
12854 457111 406075 393536 386133 386074 384315 375177 362548 353045 344903 341530 365927 375036 390576
12841 390576 415615 430428 431425 415229 387339 373498 370803 361307 357995 355265 350725 333289 346921
12828 346921 371565 390667 399041 379985 350312 347339 335836 310160 285070 250284 219678 186215
12816 186215 137849 96474 73690 62351 66084 80800 98000 116967 105374 98578 94740 117993
12804 117993 133318 132955 157671 169422 161193 172302 194110 209941 222620 221031 204337 182175
12792A82175q569k5773j1636k3773j5632K789J0951Q956J3135J0269q259j1163
12780A23470J4958k055k1835j7977r567J3755m523j5874j0254K1016J8616m495
12768A05235Q399r381m023Q982k746j7376p284J5416R519j8387j7979o690q156
12755E5529k697n843n918K77M879K1196N594p788O00K3382N887P927R254j380
12741A10899k059R313J2279j0851O467j5718K199n835K333J0248J5560j2942n68
12728A21325j6933j7502j5354J0940M445Q89p431j4825L731k1251k9370N249K6118
12715E0031K6656l043j4648M099L414j4965k449L888p228K115J785p732q629R305
12701D2599R439J5367J6952K4557J3302K509k0601l327O866J6378J3173L3155
$$ plain form
12792 182175 173606 147833 136197 112424 96792 99581 110532 119488 132623 142892 134633 123470
12780 123470 138428 136373 114538 96561 86994 100749 96226 80352 70098 91114 109730 105235
12768 105235 113634 104253 100230 109212 106466 89090 81806 97222 106741 88354 70375 63685 55529
12755 55529 52832 46989 41071 41348 46227 67423 73017 65229 65829 89211 95098 103025 112279 110899
12741 110899 108840 118153 130432 119581 126048 110330 112529 106694 109027 119275 134835 121893 121325
12728 121325 104392 86890 71536 82476 86921 87810 80379 65554 69285 48034 18664 23913 50031
12715 50031 76687 73644 58996 63095 66509 51544 49095 52983 45755 47870 49655 41923 33294 42599
12701 42599 52038 67405 84357 108914 122216 124725 104124 100797 107663 124041 137214 170369
12689A70369L8336L7311m385k7521m5409q2273p7333n4529n0901l468J6458P224
12677g6121K4247J0919j4443o599p65j6907J7056K2962j1729j7775L3359K8651
12665g145p161j0840j0294R976j169J1498J1284j1756k439J073M438l021Q553
12652g003p839q40k707p930o198O669k143K1753N087k0621p681R590l96M229n876
12637b1906M702J1801J2483j1450l467K3567o510j4299J640L055n503k972l015
12624a1874K127j2745o498J7689J3811P438N972n445k3793j1375M920J0666J4522
12611E415P667j3051q458j795m455P159q246q181j0536r772m818J0331J7492R076
12597a2172n863Q764J6291j906M465r846k305r967j2058K599o431J01O796J7678
$$ plain form
12689 170369 208705 246016 241631 214110 168701 86428 9095 -45434 -96335 -99803 -83345 -76121
12677 -76121 -51874 -40955 -55398 -61997 -62762 -79669 -62613 -39651 -51380 -69155 -35796 -7145
12665 -7145 -14306 -25146 -35440 -25464 -26633 -15135 -3851 -15607 -18046 -16973 -12535 -15556 -7003
12652 -7003 -14842 -15682 -18389 -26319 -32517 -25848 -27991 -6238 -1151 -21772 -29453 -19863 -20259 -16030 -21906
12637 -21906 -17204 -5403 7080 -4370 -7837 15730 9220 -5079 -3439 -384 -5887 -8859 -11874
12624 -11874 -9747 -22492 -28990 -11301 2510 9948 15920 10475 -13318 -24693 -19773 -9107 5415
12611 5415 13082 31 -8427 -10222 -14677 -7518 -15764 -23945 -34481 -44253 -49071 -38740 -21248 -12172
12597 -12172 -18035 -9271 7020 5114 9579 -267 -2572 -12539 -24597 -21998 -28429 -28328 -21532 -3854
12583c854m445n057J0234o63Q12L182k617J2588K9643M076p299M004j0497j1655
12569A8452J0732J4527R36p029j5164o421m483K2267N835O944J3392N13P593J6282
12555H4376J7759K2138L7243M4440L7463N5810J28888J82786K93377M55812N58514
12544A918606N27234L71458J1840l64792n84252o04365m44743k68642j42064p8554
12534C41726o7834l1460j3447k6928j6858q332r185j0190k2912j4369j7449k7299
12522G5463k0209j202k107p91q10O756k418k286Q966n581o80r360l348j2819k5824
12507C750j6908P188J9994R037O210Q535p4m41R20l568N551j1339n078j0302k608
12492A0867J0931p227n916j3262k133J4831J0393o622k4040K477Q968j6935j71
$$ plain form
12583 -3854 -8299 -13356 -3122 -3785 -2973 209 -2408 10180 39823 43899 36600 40604 30107 18452
12569 18452 29184 43711 44647 37618 22454 16033 11550 33817 39652 46596 59988 60501 68094 84376
12555 84376 102135 124273 161516 205956 243419 299229 428117 610903 904280 1360092 1918606
12544 1918606 2445840 2817298 2829138 2464346 1880094 1275729 830986 562344 420280 341726
12534 341726 273892 242432 228985 202057 185199 176867 167682 157492 134580 120211 102762 75463
12522 75463 55254 54052 51945 51154 50344 57100 54682 52396 61362 55781 55101 45741 42393 29574 3750
12507 3750 -13158 -5970 14024 23061 29271 37806 37732 37291 38211 34643 40194 28855 23777 13475 10867
12492 10867 21798 14571 8655 -4607 -6740 8091 18484 11862 -12178 -9701 -733 -17668 -17839
12479a7839J1464j416l170p517N494M626J6380J135p881q000k677R348O785j3282
12465f550j5705l693L4859Q52J3661k953j1853p061k2285r855Q23k110k222j505
12451c5597P16n596K486J2751J1670O43l175M845J5052N854m94n229m726L146
12437B346O110k562j6865l36J374J1595J923q93l028n809L738J5965K5627k574
12423C6611j8371k3812m303J3761O931j753P197P139j5034j2435P570l522R890
12410I869J5959j3496j951j5702j2835J6100O955j3144p865K441P644J0361k0597
12397a6261J347m651k408m866J712J0422K596q634o604m693m046O901K5940K264
12383i81j6592r691j4431Q233K1620P284Q040J5561q808q30j1449r78j5541M900
$$ plain form
12479 -17839 -6375 -7791 -10961 -18478 -12984 -8358 8022 9157 1276 -6724 -9401 -53 6732 -6550
12465 -6550 -22255 -25948 8911 9763 23424 20471 8618 1557 -20728 -30583 -29760 -31870 -34092 -35597
12451 -35597 -34881 -40477 -37991 -25240 -13570 -12927 -16102 -11257 3795 9649 9155 3926 -800 2346
12437 2346 8456 5894 -10971 -11307 -9933 1662 3585 2692 -336 -6145 -2407 13558 39185 36611
12423 36611 18240 -5572 -9875 3886 10817 9064 16261 23400 8366 -4069 3501 -21 9869
12410 9869 25828 12332 10381 -5321 -18156 -2056 4899 -8245 -16110 -13669 -6025 4336 -16261
12397 -16261 -14914 -19565 -21973 -26839 -25127 -14705 -12109 -20743 -27347 -32040 -36086 -29185 -3245 -981
12383 -981 -17573 -27264 -41695 -33462 -11842 -4558 3482 19043 10235 9405 -2044 -3022 -18563 -13663
12369a3663K308n52p36N459j447j6371J1930K0990J0938j5267m736P033j667M070
12355H289l595j9790K174Q847L176J3000L376M653K516m513q828j3642j5035R008
12341a0364O656J2607j885O02J1143P344j6957k8404j3823J0451K2204Q787J1767
12328B0128j7894j8716j506m010N956K6459j2883k5936n398J3190J1726k517k082
12315a3483N254P936o597O569O075j0450N812K65m461N478J101L507Q355j4185
12301A176k2688k263l996n841J4937k666O416Q311K975n02M081j2839l390M779
12287a1510N171J0292l748o054Q714J7473q574m227R174l390k224j5740k1920
12274b6563j1427j902J5387J9432K3773l274m693p508J4437N184k8536k6245n917
$$ plain form
12369 -13663 -11355 -11907 -12643 -7184 -8631 -25002 -13072 7918 18856 3589 -1147 5886 4219 8289
12355 8289 4694 -15096 -12922 -4075 -899 12101 15477 20130 22646 18133 9305 -4337 -19372 -10364
12341 -10364 -3708 8899 7014 7616 18759 26103 9146 -19258 -33081 -22630 -426 8361 20128
12328 20128 2234 -16482 -17988 -21998 -16042 10417 -2466 -28402 -33800 -20610 -8884 -11401 -13483
12315 -13483 -8229 -293 -6890 -321 5754 -4696 1116 1381 -3080 2398 3499 7006 15361 1176
12301 1176 -21512 -23775 -27771 -33612 -18675 -21341 -14925 -6614 -3639 -4141 -60 -12899 -16289 -11510
12287 -11510 -6339 3953 205 -5849 2865 20338 11764 7537 16711 13321 11097 -4643 -26563
12274 -26563 -37990 -39892 -24505 -5073 18700 15426 10733 3225 17662 22846 -5690 -31935 -37852
12261c7852J4974K3145K7601q475J7135m107q420j4977j2681l353k3616m253J5429
12248a9450J8728K410j8368m240Q914N614M519P522L118k0004r491L257j292J2784
12234e979M388J0385k4320j4875n559K519Q912M83J7555J2742O352j3590k5978
12221b6965R524O321L165J937l382m469Q898k2651j9247K2556R844j3429o431
12208c4329J0542J2428q831J916L903r712J5073J5855J0503J938P211j4631k6694
12195a4828m7J5046J2899J0894J2360j2124k0216j0469j7748K527K1023M595n684
12182a772N56n747j209o231o076Q882M176k270j2660M305J3947K15R763J2784
12168A8663k833j1477k564L481J3422k092j2852N238n053R633K68k1892p210k760
$$ plain form
12261 -37852 -22878 267 27868 19393 36528 32421 24001 9024 -3657 -7010 -30626 -34879 -19450
12248 -19450 -722 1688 -16680 -20920 -12006 -6392 -1873 5649 8767 -11237 -20728 -17471 -18763 -5979
12234 -5979 -1591 8794 -15526 -30401 -35960 -33441 -24529 -24046 -6491 6251 12603 -987 -26965
12221 -26965 -17441 -11120 -7955 -6018 -9400 -13869 -4971 -27622 -46869 -24313 -14469 -27898 -34329
12208 -34329 -23787 -11359 -20190 -18274 -14371 -24083 -9010 6845 17348 19286 26497 11866 -14828
12195 -14828 -14875 171 13070 23964 36324 24200 3984 -6485 -24233 -21706 -683 3912 -1772
12182 -1772 -1216 -6963 -8172 -14403 -20479 -11597 -7421 -9691 -22351 -18046 -4099 -3884 5879 18663
12168 18663 15830 4353 1789 5270 18692 16600 3748 8986 3933 13566 13834 -8058 -15268 -18028
12154a8028Q953J1425l846R315p314p193j7795k658P507J4332J0141M291J1357
12141B0487o67r945j4876j263j759Q856j581M05k230j0091j444j0530n186J7732
12127a2092j9493k715J7139P192O637J9447K432n820M25l466j5074j0900j3099
12114b9387J2336K0430N59l21j2420o78L74p738L102R680j2726n973o02m269K3925
12099c708j408K0664O277K627n064K265m457j5950j5057k0263J7650R153r153
12086a6424n574Q735K300J3667k046l723n33n690N346L835J28Q719N53l3614M041
12071b0280R259J924n030n563j382n938J6348J6296j1629K09J6391J7314J5169
12058D3088m761k7209o533P126L61j7340l493M55J4983K240j3022P197k049P267
$$ plain form
12154 -18028 -9075 2350 -1496 7819 505 -6688 -24483 -27141 -19634 -5302 4839 9130 20487
12141 20487 19820 9875 -5001 -6264 -8023 833 -748 -343 -2573 -12664 -14108 -24638 -29824 -12092
12127 -12092 -31585 -34300 -17161 -9969 -3332 16115 18547 12727 13152 9686 -5388 -16288 -29387
12114 -29387 -17051 3379 3938 3617 -8803 -9481 -9107 -16845 -13743 -4063 -16789 -22762 -23364 -27633 -3708
12099 -3708 -5116 15548 21825 24452 19388 21653 17196 1246 -13811 -34074 -16424 -7271 -16424
12086 -16424 -21998 -13263 -10963 2704 658 -3065 -3598 -9288 -3942 -107 21 8740 9293 -24321 -20280
12071 -20280 -11021 -9097 -14127 -19690 -21072 -27010 -10662 5634 -5995 -5786 10605 27919 43088
12058 43088 38327 11118 4585 11711 12072 -5268 -8761 -8306 6677 8917 -4105 3092 1043 8310
12044H310o372j9893o590J7349L2474J007j8144j0731p214K1349m718q387L775
12031B215k625j7088n803p487J617J8705O63P766J4807r578j32l867R18o342j0955
12016a7186K956Q901j124N935O496j1505Q874P927q181q826j128O937J2428n542
12002F962q761r931q904J5416p751p792M143L538J2255J2746K1582j5537l7489
11989a9523J939J0113R811N048o263k6897l567j158Q251J2954K688M394J0353
11976H143m046K078K4387Q209l3438j6568J0128p896j0389M062J2492m494k1876
11963b9208J899J528N402J6241J6855j4223n241L65j052p829j1126p018O088P576
11949a9743M834P861J0813Q98m368M759k298K403j2202k190J2627J8936r788j3478
$$ plain form
12044 8310 1938 -17955 -24545 -7196 25278 26285 8141 -2590 -9804 11545 6827 -1560 2215
12031 2215 -410 -17498 -23301 -30788 -29171 -10466 -9803 -2037 12770 3192 3060 -807 111 -6231 -17186
12016 -17186 -14230 -5329 -6453 -518 5978 -5527 3347 11274 3093 -5733 -6861 76 12504 6962
12002 6962 -1799 -11730 -20634 -5218 -12969 -20761 -16618 -13080 -825 11921 33503 17966 -19523
11989 -19523 -17584 -7471 2340 7388 1125 -25772 -29339 -30497 -22246 -9292 -6604 -2210 8143
11976 8143 4097 6175 30562 38771 5333 -11235 -1107 -9003 -19392 -15330 -2838 -7332 -29208
11963 -29208 -27309 -25781 -20379 -4138 12717 -1506 -6747 -6382 -7434 -15263 -26389 -33407 -27319 -19743
11949 -19743 -14909 -7048 3765 4663 295 5054 2756 5159 -7043 -9233 3394 22330 12542 -936
11935i36j2576J025L886J2640n545k245l522Q336j024o479Q917j818j0432o074
11921a5847k311K0634j3132j8514O049J6044K525q48j0338o771K133J790j0681
11908b9267P069p926m380J7437p396j0530M810Q599J3047K332L314J1324J1998
11895B0431O680m16k6927j5372K6637j4664j0840R468l596q825m144J957K140
11882a7471R611J5867J2103J1190p540k2193N56J7377p961j5670j389n858p992
11869a9370j4506J0618N116M313M000N055N895j9595J792m525K80L345k211J3861
11855e932P975N175k759K482Q807q940n548j487r199m115j3248j2199l931J2762
11841c0157M977J135J2974Q9N463N949k19r716p107J631n259m309J008J1660P861
$$ plain form
11935 -936 -13512 -12487 -8601 4039 -1506 -3751 -7273 1063 39 -6440 2477 659 -9773 -15847
11921 -15847 -18158 2476 -10656 -29170 -23121 -7077 -4552 -5400 -15738 -22509 -20376 -18586 -29267
11908 -29267 -22198 -30124 -34504 -17067 -24463 -34993 -30183 -21584 -8537 -6205 -2891 8433 20431
11895 20431 27111 26695 -232 -15604 11033 -3631 -14471 -5003 -8599 -17424 -21568 -19611 -17471
11882 -17471 -7860 8007 20110 31300 23760 1567 2123 19500 11539 -4131 -5520 -11378 -19370
11869 -19370 -33876 -23258 -18142 -13829 -9829 -4774 1121 -18474 -16682 -21207 -20927 -17582 -19793 -5932
11855 -5932 2043 7218 4459 6941 15748 6808 1260 -227 -9426 -13541 -26789 -38988 -42919 -30157
11841 -30157 -25180 -24045 -11071 -10982 -5519 430 211 -9505 -16612 -14981 -20240 -24549 -23541 -11881 -4020
11826d020j486j8400l578N809k80j1815r303J0998K0356K4877J0687L601j9604
11813G842j4551q433L317q301r000m931J722J2443K1545j860L908j2332l610J9007
11799F766P325j638j0857P425K023j4918n848J2546o54j4527k139J4250Q201O108
11785A4063r958l499q284k979K5291K1150k233j5830q945q863q352M031J5402
11772A0994K902j2318p684L343o26j7532k161n005p628K4201P178k467R3K2802
11758A6092l665m882o304m375J7312Q121j1925n903q992n981L145M540j6371j1567
11744c0755L47N914P109R438j416r681K957J6533J922L153J1825J2233o805k5387
11730b613j6535J4405K070j0428j3478q330K187J4777L807k830L656k397j0188
$$ plain form
11826 -4020 -5506 -23906 -27484 -21675 -21955 -33770 -43073 -32075 -11719 13158 23845 27446 7842
11813 7842 -6709 -15142 -11825 -20126 -29126 -34057 -32335 -19892 1653 -207 3701 -8631 -12241 6766
11799 6766 14091 12453 1596 9021 11044 -3874 -9722 2824 2170 -12357 -14496 -246 7955 14063
11785 14063 4105 606 -7678 -10657 14634 35784 33551 17721 8776 -87 -8439 -4408 10994
11772 10994 13896 1578 -6106 -2763 -3389 -20921 -23082 -28087 -35715 -11514 -4336 -6803 -6710 16092
11758 16092 12427 7545 1241 -3134 14178 22299 10374 4471 -4521 -10502 -7357 -2817 -19188 -30755
11744 -30755 -30408 -24494 -17385 -7947 -9363 -19044 -16087 446 2368 5521 17346 29579 22774 -2613
11730 -2613 -19148 -4743 -2673 -13101 -26579 -34909 -32722 -17945 -14138 -16968 -13312 -15709 -25897
11717b5897m55N918j3078O005Q176o833Q678o238J2713K1596j2457j0697K055
11704a0514K63j2107N698O823j2338l050P454R582L926q091N216J401l172R502
11690E93R904o690M664j0105p020o426r637k573J5097J9655j0468k3525L069J3130
11676a0332K006k488J611J2923M237j1778L674J4221j4516N438l265R344q7k2988
11662a2000j1253o502K726R971J3247J3435R87R438q441n022q284J137k577p564
11648a0702o270k2633J0507J6944J0753r431o512j1141P157J325j3217j1047K5337
11635a8930K7161J5208p763q751n278k134j6035n48r252o223J6370J6956j33j3982
11621a3334j4290k549r94P338J3631o143N743k563q450j134R15R019K502j8894
$$ plain form
11717 -25897 -26352 -20434 -33512 -27507 -19331 -26164 -17486 -23724 -11011 10585 -1872 -12569 -10514
11704 -10514 -10251 -22358 -16660 -9837 -22175 -25225 -17771 -8189 -4263 -12354 -7138 -5737 -8909 593
11690 593 10497 3807 8471 -1634 -8654 -15080 -24717 -27290 -12193 7462 -3006 -26531 -23462 -10332
11676 -10332 -8326 -10814 -9203 3720 7957 -3821 -147 14074 -442 4996 1731 11075 10988 -12000
11662 -12000 -23253 -29755 -27029 -17058 -3811 9624 10611 20049 11608 6586 -1698 -561 -3138 -10702
11648 -10702 -16972 -39605 -29098 -12154 -1401 -10832 -17344 -28485 -21328 -20003 -33220 -44267 -18930
11635 -18930 8231 23439 15676 6925 1647 -487 -16522 -17070 -26322 -32545 -16175 781 648 -13334
11621 -13334 -27624 -30173 -31167 -23829 -10198 -16341 -10598 -13161 -21611 -22745 -21830 -12811 -10309 -29203
11607b9203j3689o27J3062J7591n116M814n265k646R380J6101J994q46p169j709
11593c328m447j0698r832Q834K7317J1662j1730p920J018j2780R411J148j1642
11580a2987j5635l486m66R903P325p669J2644M60m097l214j0955q203L619K436
11566c0325J550J0797J3796r09N559l926j2050N764J5834m59l924J4406j976j5275
11552a138J84Q275n832N236L203N432J4757J0631j0057j3502j3484j2406j3768
11539b2469J1077l80q831Q307k058j0047L339M630L277L062j5040N736K1446o150
11525d101J939j3262L525k073j777p667J7353j632j3734R04Q601J0784K105N585
11511F550p329k0667R314R579K109j9888M121J0585L407Q538M745l086O158K539
$$ plain form
11607 -29203 -42892 -43519 -30457 -12866 -17982 -13168 -18433 -21079 -11699 4402 6396 5550 -1619 -3328
11593 -3328 -7775 -18473 -28305 -19471 7846 19508 7778 -142 876 -11904 -2493 -1345 -12987
11580 -12987 -28622 -32108 -32574 -22671 -15346 -23015 -10371 -9911 -14008 -17222 -28177 -36380 -32761 -30325
11566 -30325 -28775 -17978 -4182 -5091 468 -3458 -15508 -9744 6090 5631 1707 16113 14137 -1138
11552 -1138 -954 7321 1489 6725 9928 15360 30117 40748 30691 17189 3705 -8701 -22469
11539 -22469 -11392 -11772 -20603 -12296 -14354 -24401 -21062 -16432 -13155 -10093 -25133 -19397 2049 -4101
11525 -4101 -2162 -15424 -11899 -13972 -15749 -23416 -6063 -7695 -21429 -20525 -11924 -1140 965 6550
11511 6550 -779 -21446 -12132 -2553 -444 -20332 -16211 -5626 -2219 6319 11064 7978 14136 16675
11497A6675k2870r496P521k55R29R460m31M295L303j2739J4903Q291r659j8337
11483h410M182J4576r64Q234j010j3892Q470j3270j244L612k56N688J5388M281
11469B5385j1138j6326P912n626o340R491L876l346Kj6016n138K0526R579p972
11455D869n32j667R256Q295o581m615l92j0626k0520k2475j1728L1413J8097K695
11441d511o505l755J015R269n050N420k021l632J7321r730K763J2263l470M890
11427A4267K017j0595p623k292K929K2536J2450j5427J987p222j2091K064j1630
11414h630J0820J0961k0169l227O321j4637j5405O885K4959J8986o362r227k921
11401a646k695Q986L717P097j0935k743P784J326J8775j0866l667L637n096k429
$$ plain form
11497 16675 -6195 -15691 -8170 -8425 -7496 1964 1533 5828 9131 -3608 11295 19586 9927 -8410
11483 -8410 -4228 10348 9384 17618 16608 2716 11186 -2084 -3328 284 28 5716 21104 25385
11469 25385 14247 -2079 5833 207 -6133 3358 7234 3888 3890 -12126 -17264 3262 12841 4869
11455 4869 4337 2670 11926 20221 13640 9025 8633 -1993 -22513 -44988 -56716 -25303 -7206 -4511
11441 -4511 -11016 -14771 -13756 -4487 -9537 -4117 -6138 -9770 7551 -2179 584 12847 9377 14267
11427 14267 16284 5689 -1934 -4226 -1297 21239 33689 18262 20249 13027 936 3000 -8630
11414 -8630 2190 13151 -7018 -10245 -3924 -18561 -33966 -27081 -2122 16864 10502 1275 -1646
11401 -1646 -4341 4645 8362 15459 4524 1781 9565 10891 29666 18800 15133 18770 13674 11245
11387A1245r884J731J5558J803L510n475j128p848M900n657j7153j1499O951r822
11373b2768k667N416M832l228p633J4418k508J1220r007j4896K069m164L205J2036
11359a3675R141L765j0113j3510k433K0782M738r351j2381n519L989N679O146
11346a2742l38K094Q138R65q661m705j0025r206J0173J1386P918J1472j3584j1280
11332a8395m259P592J4138j1933n750K6172L66Q386j6093j7442J5007J1784J8654
11319B8227N96l275j4064l779k702m774R419J1332J2516j7792k3409q572j427
11306a7704P366K662J2682K107j2946P301P244j2362l812K5884M784o54j5073
11293G479n421K9315Q590k6534k0515K430M702k854j0048n780L162K0988J687
$$ plain form
11387 11245 1361 3092 18650 20453 23963 18488 17360 9512 14412 8755 -8398 -19897 -12946 -22768
11373 -22768 -25435 -20019 -15187 -18415 -26048 -11630 -14138 -2918 -11925 -26821 -24752 -28916 -25711 -13675
11359 -13675 -4534 -769 -10882 -24392 -26825 -6043 -1305 -10656 -23037 -28556 -24567 -18888 -12742
11346 -12742 -13080 -10986 -2848 -1883 -10544 -15249 -25274 -34480 -24307 -12921 -5003 6469 -7115 -18395
11332 -18395 -22654 -15062 -924 -12857 -18607 7565 7931 16317 224 -17218 -2211 9573 28227
11319 28227 28823 25548 11484 7705 5003 229 9648 20980 33496 15704 -7705 -16277 -17704
11306 -17704 -10338 -7676 5006 7113 -5833 1468 8712 -3650 -7462 18422 23206 22552 7479
11293 7479 2058 31373 39963 13429 -7086 -4656 46 -2808 -12856 -18636 -15474 5514 7201
11280G201l0882k4092J8418M694J052P449R5J764l212j2025J2056p370L852R764
11266a1236N047l043R641j939K678j4509j40P251j288P263R146k845j4101J2304
11252D229Q759J218j2784j5642n754N548K062N420L119R728L916j8183Q14M144
11238c406J496K362l092l544j0865P419J0639P07R60J906j906M096j0820O826
11224B778M46o160O396J163q754r166l307K01j1331o720K2624M738m86J0830J4270
11209A7522j8604j1387J1578P164K641j3132j5211n343P805J5749J8978l812l329
11196A0619k4812k642R236J0924Q274p682k12p273K3080p448k1309J5012n631
11183A36n180j2299k026J218R715L905N978L707P517OO904O951p147L697j420
$$ plain form
11280 7201 -23681 -47773 -29355 -24661 -23609 -16160 -16065 -14301 -17513 -29538 -17482 -24852 -21000 -11236
11266 -11236 -6189 -9232 409 -1530 1148 -13361 -13501 -6250 -7538 -275 8871 6026 -8075 4229
11252 4229 12988 14206 1422 -14220 -19974 -14426 -12364 -6944 -3825 5903 9819 -8364 -7550 -3406
11238 -3406 -1910 452 -2640 -6184 -17049 -9630 1009 1716 2676 4582 2676 6772 -4048 2778
11224 2778 3224 -2936 3460 4623 -4131 -13297 -16604 -16403 -27734 -34454 -11830 -7092 -7578 3252 17522
11209 17522 -1082 -12469 -891 6273 8914 -4218 -19429 -24772 -16967 -1218 17760 13948 10619
11196 10619 -14193 -16835 -7599 3325 11599 3917 3705 -3568 19512 12064 -9245 5767 136
11183 136 -5044 -17343 -19369 -18151 -8436 -4531 1447 5154 12671 12677 19581 26532 19385 23082 21662
11168B1662l84K114m075k0464o482n60Q314J1702O531j2690j2970m563R32J6813
11154E880J1593o730j1240j238m53m89M752M048m328j5747q217l267J370o334
11140c0400K1183m136j0274N37J6111j352m854K637q955N219R075P608K5180J5683
11126D3262q761o721J370j3035j4316r015J0916J4357j018L211J62k9352k367
11113a1307J2264j821J021p053j2140M168K0820j3090k508J0141J635N57K564
11100E251k994M316p122o822K867n724N314k107R658J1648K529k666j925j1524
11086F99k1352j4599P444J2867l280r89j4956j494j658K6981J3711p131M300J0998
11072A1541l241p120k677j031l714K418j13K425n327j5924m153J8462l075r853
$$ plain form
11168 21662 21278 23392 19317 -1147 -7629 -8189 125 11827 18358 5668 -7302 -11865 -10933 5880
11154 5880 17473 10743 -497 -1735 -2188 -2677 2075 6123 1795 -13952 -22169 -25436 -24066 -30400
11140 -30400 -9217 -13353 -23627 -23090 -6979 -8331 -13185 -10548 -19503 -14284 -5209 2399 27579 43262
11126 43262 34501 27780 29150 16115 1799 -7216 3700 18057 17039 20250 20412 -8940 -11307
11113 -11307 957 -864 157 -6896 -19036 -14868 5952 -7138 -9646 495 2130 2687 5251
11100 5251 2257 6573 -549 -7371 -4504 -10228 -4914 -7021 2637 14285 16814 14148 12223 699
11086 699 -20653 -35252 -27808 -14941 -18221 -19210 -34166 -35660 -37318 -10337 3374 -3757 543 11541
11072 11541 8300 1180 -1497 -2528 -6242 -3824 -3937 -1512 -6839 -22763 -26916 -8454 -11529 -21382
11058b1382K957R015O318j892l97n384p900N984k483M128J5446J8169N291q188
11044A9682j1219o224N109k0482j1426J1825O176K308R192q158j3129R929K751
11031c666j6120J0033P33j2288M708O894O204K896m102M959o28J1265o035j501
11017C352J5951J2346m541J0279K829j2476j5345j0001q066l875K9453N647j5562
11004I991j5562j5624q075L749K442o129J5640K1473j016R486j8702k6721j8003
10991d7051j7997R460k163P401K0711J2933J1960J6164p822m289J472k0138k346
10978b1705J1118l416m796O427J502q400J825P75n869O401p376Q410R165m07J5954
10963I608P535J237p943o820r90J495k311J830q960N049P83N183j0900j2466P670
$$ plain form
11058 -21382 -18425 -9410 -3092 -4984 -5381 -10765 -18665 -12681 -15164 -11036 4410 22579 27870 19682
11044 19682 8463 2239 7348 -13134 -24560 -12735 -6559 -4251 4941 -3217 -16346 -6417 -3666
11031 -3666 -19786 -9753 -9020 -21308 -16600 -9706 -3502 -606 -4708 251 -377 10888 4853 3352
11017 3352 19303 31649 27108 37387 40216 27740 12395 2394 -5672 -9547 19906 25553 9991
11004 9991 -5571 -21195 -29270 -25521 -23079 -29208 -13568 7905 6889 16375 -2327 -29048 -47051
10991 -47051 -65048 -55588 -57751 -50350 -29639 -16706 -4746 11418 3596 -693 779 -19359 -21705
10978 -21705 -10587 -14003 -18799 -12372 -10870 -19270 -17445 -16670 -22539 -16138 -23514 -15104 -5939 -6346 9608
10963 9608 17143 18380 10437 3617 2627 4122 1811 3641 -5319 -270 513 5696 -5204 -17670 -10000
10948a0000J503J6325K693j8512j4901N523L815k950O076K352L583L333r844J033
10934i971J073Q486J3564J2288j3447j1029K343j5020J281Q259Q547o028p132
10921f786O36R77R577M516k784m717p344q814K989M511J2014J6318n156k0643
10907d706j3565j0563K0692J4641j145n759O817p775P334J7031J0754r752M612
10894B8616m160k2592j9571j325O942j684O096L468N423K2747M356J81r090r203
10880A0204n706m89J0535k347q267j3279L286J0753J75M846j152m424k548K577
10866D164J116j2626m521j337o766J142R577J6724L03M996M065m294j3441N651
10852D753k804m80R653K5835k739P504n177n741q525o148k603J6302j0959j5637
$$ plain form
10948 -10000 -8497 7828 10521 -7991 -22892 -17369 -13554 -16504 -10428 -8076 -4493 -1160 -11004 -9971
10934 -9971 -8898 -412 13152 25440 11993 964 3307 -11713 -10432 -2173 6374 346 -6786
10921 -6786 -6150 -5173 4404 8920 6136 1419 -5925 -14739 -11750 -7239 4775 21093 15937 -4706
10907 -4706 -18271 -28834 -8142 6499 5354 -405 6412 -1363 5971 23002 33756 24004 28616
10894 28616 24456 1864 -17707 -19032 -12090 -13774 -7678 -4210 1213 23960 28316 28497 19407 10204
10880 10204 4498 4009 14544 12197 3930 -9349 -6063 4690 4865 9711 8559 4135 1587 4164
10866 4164 5280 -7346 -11867 -13204 -19970 -18828 -9251 7473 7776 12772 16837 12543 -898 4753
10852 4753 1949 1469 11122 36957 34218 41722 36545 30804 22279 16131 13528 29830 18871 3234
10838C234j2278n111J861n554J668L131k735J0975K3188j0557k6549N946J0226
10825b555j5289P426J5043J926K998K634p290j2436j281l047N123K163q024j81
10811a2790q859m073J7428k908J2477J3873J1562r539m729n566o067J1548j56
10798A2201K2884o580n521J0109j903j0089k843l414j8333j7412P324J0266J1293
10785G982q74p365p765m120k502j575j1861P701K394M571J4594L977r964r486
10771a4293j0148j2736k513J7361J1421l00q872j0435P5O091J4545J0734j1047
10758a0117l456J693L84j4464N096l700N794J8736K617n390q769N867j166J8034
10744A1159J6967J41k1031j8045P918L609Q467K1183J0283M851j2393j7473m841
$$ plain form
10838 3234 -9044 -14155 -12294 -17848 -16180 -13049 -15784 -4809 18379 7822 -18727 -12781 -2555
10825 -2555 -17844 -10418 4625 6551 9549 12183 4893 -7543 -8824 -11871 -6748 -4585 -12609 -12790
10811 -12790 -21649 -25722 -8294 -11202 1275 15148 26710 17171 12442 6876 809 12357 12201
10798 12201 35085 28505 22984 33093 31190 21101 18258 14844 -3489 -20901 -13577 -3311 7982
10785 7982 7108 -257 -8022 -12142 -14644 -16219 -28080 -20379 -17985 -13414 1180 5157 -4807 -14293
10771 -14293 -24441 -37177 -39690 -22329 -10908 -11208 -20080 -30515 -30440 -24349 -9804 930 -10117
10758 -10117 -13573 -11880 -11496 -25960 -20864 -24564 -18770 -34 2583 -2807 -11576 -5709 -6875 11159
10744 11159 28126 28267 7236 -10809 -2891 718 9185 30368 40651 45502 33109 15636 10795
10731A0795j3360j8501L708J153m163J273j5888O72Q175l053L153K108N545J8710
10717C27N858J20P160mO95n083o549q60q270O185L777J6620m36J464J7679j9080
10701A9603k6031l898O286k12M779l943j0248p93J5341l262k694K206J1390j0040
10687a516o586J1765P471p621P510J866M386M703n0l915o275J8013j682j283j9859
10672F927j2898R026L471j119o735L122J3678Q699n798n847k959P64J5163K526
10658B8020j3932j6826j944R970k987m017K57R847O7j0431J0226m703L18N356
10644I221K3322L177n718J7154o384j8771j259M636J2988j0322q411Q813q687
10631A9759k6301q993O282J2568K949J43K0411M366q874p536k111p28q98L858
$$ plain form
10731 10795 -2565 -21066 -17358 -16205 -20368 -19095 -34983 -34311 -26136 -29189 -26036 -23928 -18383 327
10717 327 6185 6305 13465 13461 14156 9073 2524 1664 -6606 -421 3356 19976 19540 21004 38683 19603
10701 19603 -6428 -10326 -4040 -4252 527 -3416 -13664 -14457 884 -2378 -5072 -2866 8524 -1516
10687 -1516 -8102 3663 11134 3513 11023 12889 17275 21978 21928 18013 11738 29751 28069 26786 6927
10672 6927 -5971 3055 6526 5407 -1328 1794 15472 24171 18373 12526 9567 10331 25494 28020
10658 28020 14088 -2738 -4682 5288 2301 -1716 -1459 8388 8455 -1976 8250 3547 3865 9221
10644 9221 32543 35720 30002 47156 40772 22001 20742 25378 38366 28044 19633 28446 19759
10631 19759 -6542 -15535 -9253 3315 6264 6407 26818 31184 22310 14774 12663 11935 11037 14895
10617A4895j229N764K0852r409j1943m338K962K173j3797j74O233j1313Q607K916
10603A2199P674m053J631o621k968P599P167j0177j1581J5576J3906p477l436
10590A9439M120P87o984j5337N325K2112k038j1722j8770j0068k888R103K899
10577d022J3261p47J0610j043k4329L6J7431K0184m54N441J6559O669O677r373
10563E6900j2084J02J4559P226j8370k0331j4866j2993m51K0347j3424k0586m648
10550a8619N400L143q521r216O170L219O375J772M952J1611J5842K84L579O74
10536B6665j1670k1572p301J0365m367j6454J6760Q265j2630M220R264p242m872
10523a0569L42L91P260Q496J352j0390Q758L691j323N099k0536j2441J2013Q084
$$ plain form
10617 14895 13666 19430 40282 30873 18930 14592 17554 19727 5930 5756 11989 676 9283 12199
10603 12199 19873 15820 17451 10830 7862 15461 22628 12451 870 16446 30352 22875 19439
10590 19439 23559 24346 17362 2025 7350 29462 27424 15702 -3068 -13136 -16024 -6921 -4022
10577 -4022 9239 8492 19102 18059 -6270 -6234 11197 31381 30927 36368 52927 59596 66273 56900
10563 56900 44816 44918 59477 66703 48333 28002 13136 143 -308 20039 6615 -13971 -18619
10550 -18619 -13219 -10076 -18597 -27813 -21643 -18424 -12049 -10277 -5325 6286 22128 22412 25991 26665
10536 26665 14995 -6577 -13878 -3513 -7880 -24334 -7574 691 -11939 -7719 1545 -5697 -10569
10523 -10569 -10227 -9836 -2576 5920 7272 -3118 5640 9331 8008 13107 -7429 -19870 -7857 227
10509B27j61n509O436O155q828p295P998j7979j3374J0028J1262N13j8383R968
10495a8942J8904j5463n580k117J3478K2738M371r409L314j0983j3521O288R198
10482B276l491M705J6624n840J0983M677j1733j0850J570R848Q8m901j4309O660
10468F307m556j1702M279q330P012n381m889o15K1343Q851l120M7Q990q079r101
10453A056K094M357m109K596O043r130l335J9015J2265J680r670j8232r763M56
10439d677P438J9141j08n422k180n063r885K7689L540j1817R885K1087J878j2628
10425C8878J9482N10k3776j0952r165J5824J2009P472k311k4667o043o818j0078
10412C65K878J1644Q907m227J345k574j2579Q338J0436j1081j999K462N420k706
$$ plain form
10509 227 66 -5443 993 7148 -1680 -8975 -977 -18956 -32330 -22302 -11040 -10527 -28910 -18942
10495 -18942 -38 -15501 -21081 -23198 -9720 13018 17389 7980 11294 311 -13210 -6922 2276
10482 2276 -1215 3490 20114 14274 25257 29934 18201 7351 8921 18769 18857 13956 -353 6307
10468 6307 1751 -9951 -5672 -14002 -6990 -12371 -17260 -17875 3468 12319 9199 9246 18236 10157 1056
10453 1056 3150 7507 3398 5994 12037 2907 -428 18587 30852 32532 22862 4630 -5133 -4677
10439 -4677 2761 21902 21794 16372 14192 9129 -756 26933 30473 18656 28541 49628 51506 38878
10425 38878 58360 58870 35094 24142 14977 30801 42810 50282 47971 23304 17261 10443 365
10412 365 3243 14887 23794 19567 20912 18338 5759 14097 24533 13452 11453 13915 19335 16629
10398A6629J0563j4556j1840R376Q530m894k5683m710R062J1240O917J4357K618
10385B7609j5224n805j4544J2315J1764j4415p360J4266Q996N32n493K1R964M728
10371B7354j2766r411j9017L143J8069j61j260L010p786N114n088K831K088K0286
10357B6406r930k2238R308J7802K1282l015q314j6430p642M690J9286K396j153
10344C2448J2837k679j4343p855l300j3165j1328N424J882K1283o411k5692l808
10331a4707R054j326M132l338J0478J6539O38j1270J528J4182q827p998j5704
10318f619K0936j974j3897K427L811O679l395n992n266J0251l502p534J4942N978
10304A6845J6090J0995j9197q856l107m823j950R264P17j8198O771K0133J5488
$$ plain form
10398 16629 27192 12636 796 10172 18702 13808 -11875 -16585 -7523 3717 10634 24991 27609
10385 27609 12385 6580 -7964 4351 16115 1700 -5660 8606 17602 18134 12641 12662 22626 27354
10371 27354 14588 5177 -13840 -10697 7372 7211 5951 8961 1175 6289 1201 4032 6120 26406
10357 26406 16476 -5762 3546 21348 42630 39615 31301 14871 7229 11919 31205 33601 32448
10344 32448 45285 42606 28263 20408 17108 3943 -7385 -1961 -79 21204 14793 -10899 -14707
10331 -14707 -5653 -6979 -2847 -6185 4293 20832 21470 10200 11728 25910 17083 9085 -6619
10318 -6619 14317 12343 -1554 873 4684 11363 7968 1976 -3290 6961 3459 -4075 10867 16845
10304 16845 32935 43930 24733 15877 12770 7947 5997 15261 15978 -2220 4551 24684 40172
10291D0172n254k4887l170J5428K016j0020J270r146Q951J1939O701r754k1585
10278B661q139o769Q192k701Q971K8995J1300j6875k374R94k1529j6232r393K0003
10264b896J5864l990K2775O479k4967o213P059l168J1759P589k416n919O103n297
10250B2762j3597j8711j7929l282K5124J3298J7375J149j0447K65J1312J1516
10238C8835J46j8588j9838j2552O130K906K3595p4J247j2320k285J8052J1609
10225C6863R062j2659j7995o145J5990K5000p466j1898j0864J795j3718j2901
10213d936n4J4527J3445j1840K920k937O895J4050M42o607k363N358k528N719
10199C2091L886j7315o007J4701l182j3850J0730j0999L817K4658Q821j6269k897
$$ plain form
10291 40172 34918 10031 6861 22289 24305 14285 15555 6409 15360 27299 34000 24246 2661
10278 2661 -5478 -12247 -4055 -6756 2215 31210 42510 25635 23261 24255 2726 -13506 -22899 -2896
10264 -2896 12968 8978 31753 38232 13265 7052 14111 10943 22702 30291 27875 21956 28059 22762
10250 22762 9165 -9546 -27475 -30757 -5633 7665 25040 26189 15742 16007 27319 38835
10238 38835 38981 20393 555 -11997 -5867 -2961 20634 20560 21807 9487 7202 25254 36863
10225 36863 45925 33266 15271 9126 25116 50116 42650 30752 19888 21683 7965 -4936
10213 -4936 -4990 9537 22982 11142 14062 11125 18020 32070 32512 25905 23542 28900 26372 32091
10199 32091 35977 18662 12655 27356 24174 10324 21054 10055 13872 38530 47351 31082 28185
10186B8185N802M531J1615p806j300o173j1891R546j5915K909K2591l75k0829
10173B0890M810K4182m520k3748n837N758j3928J1476M693k413j481o108L169
10160A6943j3695O615J4114J4051K171m468K225k2152j8384O299k164k023O424
10147E956J4865L976j673J5198q661j6900j854J1600J387J24k36k1433m38R118
10133A1029M899J336M35j9453j961J2122m236n363j4063n667m6J3998J6909k699
10119G240j0841o714K788J5158r083R096P357K614k552J444n428j940p012R145
10105A1272n487K126J3844Q177P622K427j342n458o546j2685J658q134j1723Q170
10091C921K848J4869r08O914P081O851R212O76j4669m163K422P377N442M006r58
$$ plain form
10186 28185 33987 38518 50133 42327 41027 34854 22963 32509 16594 19503 42094 41719 20890
10173 20890 25700 49882 45362 21614 15777 21535 7607 19083 23776 21363 19882 13774 16943
10160 16943 3248 9863 23977 38028 40199 35731 37956 15804 -2580 3719 1555 -468 5956
10147 5956 20821 24797 23124 38322 29661 12761 10907 22507 23894 24018 23782 2349 1911 11029
10133 11029 15928 17264 17699 -1754 -3715 8407 4171 -1192 -15255 -20922 -20968 -6970 9939 7240
10119 7240 -3601 -10315 -7527 7631 -1452 7644 15001 17615 15063 16507 11079 9139 2127 11272
10105 11272 5785 7911 21755 29932 37554 39981 38639 33181 26635 13950 15608 7474 -4249 3921
10091 3921 6769 21638 20730 27644 34725 41576 50788 51464 36795 32632 35054 42431 47873 51879 50921
10076E0921j8352j6138o531j843o128J12K5667O590J8476N804j1076q373k0533
10063A8596o576M0n565J2682L141j7673p307M005K0402J3076O757L092k2856M469
10049B6283J7934J0685n740j261q663q726p699O14k730k710J1069P052k674J767
10035C5201j1129K989L152J4053m882m209K649M554j3792j9802J5795J7139l807
10022C7911L721m196j1688m169J1319k488K0347k099k003j6816j1469J176O166
10009B5712K3199j995o970j634j1879j3424J1499m056J313K463J7109J146p062
9996C5421K576P547j6376j103R245M576j1355L207R253k0109p285Q93O136L384
9982B6010N379q024L938J8389J1961j1388j5110j0468m804q239o332L073J0230
$$ plain form
10076 50921 32569 16431 9900 8057 1929 2041 27708 34298 52774 58578 47502 39129 18596
10063 18596 12020 12060 6495 19177 22318 4645 -2662 1343 21745 34821 41578 44670 21814 26283
10049 26283 44217 54902 49162 47901 39238 30512 22813 23427 20697 17987 29056 36108 33434 35201
10035 35201 24072 27061 30213 44266 39384 35175 37824 42378 28586 8784 24579 41718 37911
10022 37911 41632 37436 25748 21579 32898 30410 50757 48658 46655 29839 18370 19546 25712
10009 25712 48911 46916 39946 38312 26433 13009 24508 20452 21765 24228 41337 42483 35421
9996 35421 37997 45544 29168 28065 37310 41886 30531 33738 42991 22882 15597 16490 22626 26010
9982 26010 31389 23365 27303 45692 57653 46265 31155 20687 15883 7644 1312 4385 14615
9969A4615n161M441J7486Q062o856q97J378Q218k1840j0731N082K7061J8259K852
9955F1969m524L56J010O923k058j3679k4249j219J0149o143k101j1909j98O416
9941B0743q026l495K5381J0923Q01j4466Q762P192l481j1940J0617L667M180O074
9927E6932p016n519K8460K0000q886j3907r478j1005j2179M299J5874k54P16O115
9913F4152l1450L769J0862J9469K977j6135R951P093r40N185j3810j8342r93K1533
9899F3321O317J2539m826j4407k5864j8248M165J2275J6643o194p153R170M555
9886E2293o463K021J4314j1899j5397j4735J328K3920M691o86j0586M445J3053
9873E6299k53n087j2936m438N029m097j2968N724K738q277J9981J5760M43O99
$$ plain form
9969 14615 9454 13895 31381 39443 32587 31690 33068 41286 19446 8715 13797 40858 59117 61969
9955 61969 57445 57801 58811 65734 63676 49997 25748 24529 34678 28535 26434 14525 14327 20743
9941 20743 12717 9222 34603 45526 46327 31861 40623 47815 44334 32394 43011 46678 50858 56932
9927 56932 49916 44397 72857 92857 83971 70064 60586 49581 37402 41701 57575 57321 58037 64152
9913 64152 32702 36471 47333 66802 69779 53644 63595 70688 69748 74933 61123 42781 41788 63321
9899 63321 69638 82177 77351 62944 37080 18832 22997 35272 51915 45721 38568 47738 52293
9886 52293 45830 47851 62165 50266 34869 20134 21462 45382 50073 49387 38801 43246 56299
9873 56299 56046 50959 38023 33585 38614 34517 21549 27273 30011 21734 41715 57475 57918 58617
9859E8617n65n196L256K591l716j950l75k703n928K3556K1955r158k0874N223
9845F4733l359N748j2068j2457O464K0232j1097j6137M886J615n847J1724j0941
9832D3496q412j6538j500J0331K8433R308J598n592j222J1605p831q732J0756
9819F5700q79M308L763Q747P590l975K762j101j4512j7416K2003j0323k2490j4438
9805B9739l12K8757J1103k003J0606J3142J4698j599k5400k0722K319P585j1338
9792E6575J9734N665k4268j9818O303J5210J6995R050k659R442M36q435l278R794
9778I0746j1393j2124L345k03J3999j0818j897j0746l447r348P489O407m320O742
9764F4432Q51J958p019J075L676j038J6095R370J1833q769j4699n746o429j355
$$ plain form
9859 58617 58052 52856 56112 58703 54987 53037 52662 49959 44031 67587 89542 80384 59510 64733
9845 64733 61374 67122 55054 42597 49061 69293 58196 42059 46945 48560 42713 54437 43496
9832 43496 35084 18546 17046 27377 55810 65118 66716 61124 59902 71507 63676 54944 65700
9819 65700 64821 69129 72892 81639 89229 85254 88016 86915 72403 54987 76990 66667 44177 29739
9805 29739 29427 58184 69287 67284 77890 91032 105730 104131 78731 58009 60328 67913 56575
9792 56575 76309 81974 57706 37888 44191 59401 76396 85446 82787 92229 92665 84230 80952 90746
9778 90746 79353 67229 70574 70371 84370 73552 71655 60909 57462 48114 55603 62010 57690 64432
9764 64432 65283 67241 60222 61297 64973 63935 80030 89400 101233 92464 77765 72019 65590 64235
9750F4235K264J6951J9095m565p364j326O350J9747m797j1476k7015l330P853
9737G6622O082j1169N903J058j824N525J971J7271R614o658k659M963l018j469
9723A02212Q534R544k5464m138J3954J588J071l289o678L532j1920O95j3264P436
9709H3813r59L018J5889P389O962j2230N49N212J4709j0798j2727N595P391k337
9695A11476J7530J0459j1027j5755j0281j9828n835L0685O713r999j8920L070
9683H8288J583J1038J4738k194j1767j2864k04J8272j048J0187J2595K458O629
9670A37711j4526j2094r371j2358l315O585J2298q0R210J7061m9k4875j2354K2401
9656A16244P322r065l832q271J1475P877P913r44L39r903K867j459j4489m370
$$ plain form
9750 64235 66499 83450 102545 97980 90616 89290 95640 115387 110590 99114 72099 68769 76622
9737 76622 82704 71535 77438 78496 76672 82197 84168 101439 111053 104395 101736 106699 103681 102212
9723 102212 110746 120290 94826 90688 104642 106230 107301 104012 97334 100866 88946 89641 76377 83813
9709 83813 82854 85872 101761 109150 116112 103882 104431 109643 124352 113554 100827 106422 113813 111476
9695 111476 129006 139465 128438 112683 102402 82574 76739 107424 114137 104138 85218 88288
9683 88288 89871 100909 115647 113453 101686 88822 88618 106890 105842 116029 128624 131082 137711
9670 137711 123185 111091 101720 89362 86047 92632 104930 104850 114060 131121 131072 106197 93843 116244
9656 116244 123566 114501 110669 102398 113873 121750 129663 128719 129058 119155 122022 120563 106074 101704
9642A01704L203l980k020j0480N871J320K0723j923o39M708K9750N693j6482j2227
9628A25221N912J5826R869n377k0309j265J6029K343j6J5649p278P112l99j5650
9614A47667J3880o03j5060j1812L802O407L926M689n837R322P103k703q467m962
9600A47352N335O210n124N055m26P520L597o104j2721J2176N918Q77L130m955
9586A67840N428K4280k014o609k569K55m457o138P557K5178N88j0152M723m163
9572A99747j154J3068n523j1750j3467J2482J2525j2131J050J8140l1017p874
9560A74096M582Q773J4474J0679K02N800O088l647M786P173k281p708K302J3280
9546B38599j707j6489o896K4170P668j1727J394K613j6219K563J945R807R662
$$ plain form
9642 101704 104907 100927 98907 88427 94298 95618 116341 114418 113779 118487 148237 153930 137448 125221
9628 125221 131133 146959 156828 151451 131142 129877 145906 148249 148233 163882 156604 163716 163317 147667
9614 147667 161547 160944 145884 134072 137874 144281 148207 152896 147059 156381 163484 160781 152314 147352
9600 147352 152687 158897 153773 158828 158402 165922 169519 163415 150694 162870 168788 169665 172795 167840
9586 167840 173268 197548 195534 188925 186356 186611 182154 176016 183573 208751 209339 199187 203910 199747
9572 199747 198593 211661 206138 194388 180921 193403 205928 193797 194847 212987 181970 174096
9560 174096 178678 187451 201925 212604 212806 218606 224694 221047 225833 233006 230725 223017 225319 238599
9546 238599 236892 220403 213507 237677 245345 233618 235012 237625 221406 223969 225914 235721 245383
9533B45383Q372J253L158R838j0105n535J5697j3691j8676j4673k923J3081J2015
9520B43194M336n525J5038J0280j0931J6719l514j3786j1760K1055K0236k174
9508B83168k059K136m191N54o237O178J9312J0293K865k499L584R771q272r405
9494C05198J4639J3912Q17j2344q150L627p22R239j929J1471R992M755K3770j7951
9480C56324k676q033o146K616Q876J1046J3225J4359k874P615l774J8758o690
9467D02626R63L493K0927J7975O247m716j5909m279L819j158k0247J2720M344
9454D26805Q842j2093J2713J3673k081J2057k171J1375J4683J4718J050m61N14
9441D99624P257k019M131K1978l22M445M368k534N093R658M7n729O250P939N598
$$ plain form
9533 245383 253755 255008 258166 268004 257899 252364 268061 254370 235694 221021 218098 231179 243194
9520 243194 247530 242005 257043 267323 256392 273111 269597 255811 244051 265106 285342 283168
9508 283168 281109 283245 279054 279608 273371 279549 298861 309154 312019 309520 313104 322875 314603 305198
9494 305198 319837 333749 334566 322222 314072 317699 316977 326216 324287 335758 345750 350505 374275 356324
9480 356324 353648 345615 339469 342085 350961 362007 375232 389591 386717 394332 390558 409316 402626
9467 402626 403589 407082 428009 445984 452231 447515 431606 427327 431146 429988 409741 422461 426805
9454 426805 435647 423554 436267 449940 447859 459916 457745 469120 483803 498521 499571 499110 499624
9441 499624 506881 504862 508993 530971 530649 535094 539462 536928 542021 551679 551726 545997 552247 560186 565784
9426E65784k946Q673Q529Q540K7366J7878k546n531K311L990k319N130Q642J4790
9412F58291k815j3225N713J6788J0582j3864n808k063j2906P517J3181L1863L1604
9399G24858J8044j338k220j7669o81J1640J2727J3128m656L72J4372R529K7020
9386H05126K0878n459K6695J0514O51j1214j872J2908M0600O53o576k693n030
9373H85181J31J5789K321J7695L990l789P707R104J519O725R445P83K9743R055
9359I95399j1089J4554K0952L2824J9546J677N787l157o651K341J7686L1206Q357
9346A129432o029L562J2242J7547L268K5212J3706m571j4413K692Q293P066P457
9333A205464Q611J3342M774J6524m132N088P810J7559l510m639R590M695J2258
$$ plain form
9426 565784 562838 571511 580040 588580 615946 633824 631278 625747 628058 632048 629729 634859 643501 658291
9412 658291 655476 642251 647964 664752 675334 661470 655662 653599 640693 648210 661391 693254 724858
9399 724858 742902 741564 739344 721675 720994 732634 745361 758489 753833 754205 768577 778106 805126
9386 805126 826004 820545 847240 857754 858405 847191 845319 858227 898827 899480 892904 890211 885181
9373 885181 885312 901101 903422 921117 925107 921318 929025 938129 939648 946373 955818 956601 986344 995399
9359 995399 984310 998864 1019816 1052640 1072186 1073863 1079650 1076493 1069842 1072183 1089869 1121075 1129432
9346 1129432 1123403 1126965 1139207 1156754 1160022 1185234 1198940 1194369 1179956 1182648 1190941 1198007 1205464
9333 1205464 1214075 1227417 1232191 1248715 1244583 1249671 1257481 1275040 1271530 1266891 1276481 1281176 1293434
9320A293434P105R657J4331J4849J2603n752k7690r641J6990L0640o499j2809
9308A337218q991M242K2467K1216j4222M462m705K755K393J7294J8478J6476L963
9295A423046q521J7133P510j4378j5758r95j3019j0339j1931N388R851K767O369
9282A397123J853r674k936l556r604l100r616j6656r395p2J9336K864j7954k780
9268A335833K47l131r390J913p469l1676q560K9o702r230j1124M374j8728l184
9254A233202P791j268r530j6483j7368l516j5853J5950n245j5291j4167k61p301
9241A150660m162r725l487j6197k1507k0481K214N451o498k0503k3191j4622j6902
9228A001050j4562K2212R934k4992q807O611j3931o870K028p78k0010k2572j6911
$$ plain form
9320 1293434 1300539 1310196 1324527 1339376 1351979 1346227 1318537 1308896 1325886 1356526 1350027 1337218
9308 1337218 1328227 1332469 1354936 1376152 1361930 1366392 1361687 1364442 1366835 1384129 1402607 1419083 1423046
9295 1423046 1414525 1431658 1439168 1424790 1409032 1408037 1395018 1384679 1372748 1378136 1387987 1390754 1397123
9282 1397123 1398976 1389302 1386366 1382810 1373206 1370106 1360490 1343834 1334439 1334367 1353703 1356567 1338613 1335833
9268 1335833 1336080 1332949 1323559 1325472 1318003 1286327 1277767 1277796 1271094 1261864 1250740 1255114 1236386 1233202
9254 1233202 1240993 1239725 1230195 1213712 1196344 1192828 1176975 1192925 1187680 1172389 1158222 1157961 1150660
9241 1150660 1146498 1136773 1133286 1117089 1095582 1075101 1077315 1082766 1076268 1055765 1032574 1017952 1001050
9228 1001050 986488 1008700 1018634 993642 984835 991446 977515 970645 972673 971895 951885 929313 912402
9215I12402j1920k462l956P945N993P897P60j1519j6390k0047M035j1139k2024
9202H39575j3681R48Q815o855j1784k9061m2770q219J0604r872J425p094q125
9189G23906j9480m490P89p485j249j1993KJ3865M987j002k9969j3137n887O484
9175F55341k453O305R28k0989J987n092j0626q982K985N668p544m135o047j3235
9161E94111j6161r565J340j2267j0787M840p742j6843k1754k036O771N007n541
9148E09373J057k221k2036k9190n213K6898k931n09j4381p048n19N953l050l023
9134D53160Q719M916r114l460p362k127j0331p622j0842j8738k81N077K2374q10
9120D23559j4688j4986j1594K266N92q627k020K623j0496O375p532j279J4032
$$ plain form
9215 912402 900482 898020 894064 902009 908002 915899 916659 905140 888750 868703 872738 861599 839575
9202 839575 825894 826842 835657 828802 817018 787957 745187 736968 747572 737700 739125 732031 723906
9189 723906 704426 699936 700725 693240 691991 679998 680000 693865 698852 697850 667881 654744 648857 655341
9175 655341 652888 659193 660121 639132 641119 636027 625401 616419 619404 625072 617528 613393 607346 594111
9161 594111 577950 568385 569725 557458 546671 551511 543769 526926 505172 503136 509907 514914 509373
9148 509373 510430 508209 486173 456983 451770 478668 475737 475228 460847 453799 453280 459233 456183 453160
9134 453160 461879 466795 457681 454221 446859 444732 434401 426779 415937 397199 396918 401995 424369 423559
9120 423559 408871 393885 382291 384557 385149 376522 374502 377125 366629 373004 365472 364193 378225
9107C78225l943k0598j5867j3942R48K8981J9845k4352j3507l349n357J540O567
9094C35191o205q498l656q120r295p85O668k946p359O368o528Q373Q518o516j7549
9079B87661j2820j40j0514J446M77R343J838j7446j4557N66O421L400Q537Q274
9065B72486j1571q601l09o997N422J0834o835j4466j0956O915k858j1095m721
9052B17248l071J251K581P31K450J3329j4062k5106M029M63P660j0997J286J573
9038A99365M818m659r42q09j2850L057J0885m069J2014n328J1279L216j0324j0358
9024A95295k5907P724J9980j1071j7598r725N937J4288N515M911l902q079l624
9011A73744K0450L625j1474l025j3219r186l687O06j869Q880q979p267j0711K731
$$ plain form
9107 378225 374282 353684 337817 323875 324823 353804 373649 349297 335790 332441 327084 328624 335191
9094 335191 328986 320488 316832 308712 299417 298632 305300 302354 294995 301363 294835 303208 311726 305210 287661
9079 287661 274841 274701 264187 265633 266110 275453 277291 259845 245288 245854 252275 255675 264212 272486
9065 272486 260915 252314 252005 245008 250430 261264 254429 239963 229007 235922 233064 221969 217248
9052 217248 214177 215428 218009 218740 221190 234519 220457 195351 199380 199843 207503 196506 197792 199365
9038 199365 204183 199524 198582 197773 184923 187980 198865 194796 206810 201482 212761 215977 205653 195295
9024 195295 169388 177112 197092 186021 168423 158698 164635 178923 184438 189349 185447 177368 173744
9011 173744 194194 197819 186345 183320 170101 160915 157228 157834 155965 164845 155866 148599 137888 140619
8997A40619n303j659K1477J4767O035j4874q438m35J0597L362J0230K908j9689
8984A59597j3852j1783J3849P95j7210M476J4783p549j0609p835k4434l687K0150
8971A16691J8417o758M285Q862J0975q185p727L30Q44r629J736M199J4216J4618
8957A62874k2001j7501k629o505l890L632K664r736m46P039m069j527M005j5764
8943I6146q115J2513P75o754K576K103N463J0201K678K186l855m696K174q408
8929A04987l053p022p444J2645J6265j4577o26Q151p530r467M645J6555n411n909
8915A02209N003k390M913J839j0389k0232m820M678J0753J3320p951n54R867k071
8901A04175K46p99j2047m82O32r316o367M954J2613m39j2523m379j1536J2539
$$ plain form
8997 140619 135316 133657 155134 169901 175936 161062 152624 152189 162786 166148 176378 179286 159597
8984 159597 145745 133962 147811 148606 131396 135872 150655 143106 132497 124662 100228 96541 116691
8971 116691 135108 128350 132635 141497 152472 144287 136560 136890 137734 128105 129841 134040 148256 162874
8957 162874 140873 123372 120743 114238 110348 113980 116644 106908 106462 113501 109432 107905 111910 96146
8943 96146 88031 100544 101319 94565 97141 99244 104707 114908 117586 119772 115917 111221 113395 104987
8929 104987 101934 94912 87468 100113 116378 101801 101175 109326 101796 92329 96974 113529 108118 102209
8915 102209 107212 104822 109735 111574 101185 80953 76133 80811 91564 104884 96933 96379 106246 104175
8901 104175 104421 103622 91575 91093 91725 82409 76042 80996 93609 93170 80647 76268 64732 77271
8887G7271M18N153K132p1P359K615J6976k4l1749j6967J1751J105m509J1008J8143
8872A00611k94j2034n35J3351L170m882L26L527j2271n516n941j8604j1204M798
8858E4502K076O834k478k92l020K3174K67j943j5466n545K0147O992j8555J496
8844F8189J6534j756j9441r518J0122K579o478K594J4155k607j9552k817j4610
8831C7394J1193Q002J2367J3298j2254l141q670k3145J049R399K0101O054q285
8818F3362j1708j9947p781Q923L4276R086l076n799j7353K782p078l566m87K178
8804D3812K0801M349l553O871l323N175q55k542k288J3473n628j6201l528q246
8790D8317l554l511p440N113j027k249k0172M437J6915M506O16L941J1560K837
$$ plain form
8887 77271 77689 82842 84974 84903 92262 94877 111853 111829 80080 63113 74864 75969 71460 82468 100611
8872 100611 100317 88283 87748 101099 104269 99387 99713 103240 90969 85453 79512 60908 49704 54502
8858 54502 56578 63412 60934 60642 57622 80796 81063 79120 63654 58109 78256 85248 66693 68189
8844 68189 84723 82967 63526 54008 64130 66709 60231 62825 76980 74373 54821 52004 37394
8831 37394 48587 56589 68956 82254 70000 66859 58189 35044 36093 45492 65593 71647 63362
8818 63362 51654 31707 23926 32849 67125 76211 73135 67336 49983 52765 45687 42121 41634 43812
8804 43812 64613 68962 65409 72280 68957 74132 73277 70735 68447 81920 76292 60091 56563 48317
8790 48317 44763 41252 33812 38925 37898 35649 15477 19914 36829 41335 41951 45892 57452 60289
8776F0289j3979l701R44K534Q362J995j3913Q119m346l35J2825j0886j8906J1527
8762D0529J2898M53N482l311j0264K781N075j131j7961K057J0463k637J072L611
8748D9117j265j3659j3797m723n418N478J4897J9266K117k1178k0272P343J9672
8735C7578J4000R965j1608q211j009m199L331M700k228q066M40J0419j7088M224
8721C2248N474k549P576j2734p985k608J1056J3127m540M002P534N53N991L498
8707F0643j9628j4551K0867N607j2353l881n802j1709J2107J3022l348k2544k0362
8694a932M263l232M567J3674J0864p419k126M573J0266r419J1493J3293P121P938
8680F3924j6428j9332j8318n8R166P113m397J227J4639k283p720j179R033J7982
$$ plain form
8776 60289 46310 42609 43553 46087 54449 56444 42531 50650 46304 45969 58794 47908 29002 40529
8762 40529 53427 53880 59362 56051 45787 48568 53643 52512 34551 36608 47071 44434 45506 49117
8748 49117 47852 34193 20396 15673 10255 15733 30630 49896 52013 30835 10563 17906 37578
8735 37578 51578 61543 49935 41724 40715 36516 39847 44547 42319 34253 34693 45112 28024 32248
8721 32248 37722 35173 42749 30015 22030 19422 30478 43605 39065 43067 50601 51154 57145 60643
8707 60643 41015 26464 47331 52938 40585 36704 30902 19193 31300 44322 40974 18430 -1932
8694 -1932 2331 -901 3666 17340 28204 20785 18659 23232 33498 24079 35572 48865 55986 63924
8680 63924 47496 28164 9846 9788 18954 26067 21670 22897 37536 35253 27533 26354 35387 53369
8666E3369o145k0930p57L56M754j966J6406k3859p982J1344J6025J18j2870K58
8652B8121K449J302j5295j670N533P508Q038L346L132o039P815J373q555P807
8638D4865j2697j7165m797J359K70J3906m552ml607K2077J2457o546j4019l853
8624B7694j0864K246o66K679J935N70m814K310Q662K20q107p635m332N623Q468
8609B3989q920L254J3663N374Q441j5323j9996J054r646q446J6086M100k993p655
8595B982K086K2418J8445j4615j8107L633J4517J1407j6818R55K951J8205L43
8582D8402n303l801O051l8J712Q831K593r229p355J4571N391j399Q78o710j8753
8567C5841M326N906o091j4678j2990o992K721J4775J0403k277Q14j2221k2577
$$ plain form
8666 53369 47224 26294 25537 25893 30647 28681 45087 21228 13246 24590 40615 40733 27863 28121
8652 28121 30570 31872 16577 14907 20440 27948 35986 39332 42464 36425 44240 45613 37058 44865
8638 44865 32168 15003 10206 11565 11835 25741 21189 21185 17578 39655 52112 45566 31547 27694
8624 27694 16830 19076 18410 21089 23024 23594 18780 21090 29752 29972 21865 14230 9898 15521 23989
8609 23989 15069 18323 31986 37360 45801 30478 10482 11536 1890 -6556 9530 13630 10637 2982
8595 2982 5068 27486 45931 31316 13209 16842 31359 42766 25948 26903 29854 48059 48402
8582 48402 43099 39298 45349 45311 47023 55854 58447 49218 41863 56434 61825 60426 61304 54594 35841
8567 35841 40167 46073 39982 25304 12314 5322 8043 22818 33221 30944 31758 19537 -3040
8554c040M41n554M179J8118J5067j428M703J948k176o545l501l573k356K1949
8540C8232J0536n410k5712j7644p04N66m419k624K0797J579J647J13o570J933
8526A2320j2336O06J4588R608M135K014j2703K757N086n573N763K214n233J595
8512B4841P253J1955j5098j374M510P886o490r925j1844j3711J3964m59r128o513
8498d133N391J7095j5478k0654K8388J4215r784m438j9094o891M078J0411M421
8485C527J0385J3977o221J332p85O338j2478j0166l040K761J7729J0035j7489
8472A5905j3652n308j4320j34J2787j7305N460K2934J2016P646K184N065j6941
8459A6337j5184P606M431j2342M415K0257J7692M370J074j2368r430p697j2409
$$ plain form
8554 -3040 -2599 -8153 -3974 14144 29211 27783 32486 34434 32258 25713 22212 18639 16283 38232
8540 38232 48768 43358 17646 2 -702 -136 -4555 -7179 13618 15197 16844 16957 10387 12320
8526 12320 -16 590 15178 24786 28921 30935 18232 20989 26075 20502 26265 28479 23246 24841
8512 24841 32094 44049 28951 27577 32087 39973 33483 23558 11714 -1997 11967 11508 2380 -4133
8498 -4133 1258 18353 2875 -17779 10609 24824 15040 10602 -8492 -15383 -11305 -894 3527
8485 3527 13912 27889 21668 23000 22215 28553 16075 5909 2869 5630 23359 33394 15905
8472 15905 2253 -3055 -17375 -17509 -4722 -22027 -16567 6367 18383 26029 28213 33278 16337
8459 16337 1153 8759 13190 848 5263 25520 43212 47582 48656 36288 26858 19161 6752
8446F752k399l664N514O421o404O147p846K991j501P499L3587m891k4129j432
8432A6645j1941j8760j413J4160J4592J004j1617m127j402j6918J4067J6999J5365
8419B6654j3613j8631O057N510j315P896j174j8883m390m59m7K0859R582p863
8405A0183j6718J5202Q596q950k415K106k093n679o86o639R093R766o220p467
8391a921N021l206k027p10N082N173j3642n328K2050M430r099P912m234j7447
8377g946J164J2142J0517l360j7028p829R532r822L516l052J0423O562j26l255
8363A438j0961R67P14J233M590J1712p918J177k079J0316J1495L589N348j1894
8349A9727m617j1424p715m630p95M793q075R995J4978R10j1341N009j2896r742
$$ plain form
8446 6752 4353 689 6203 12624 6220 12367 4521 7512 6011 13510 47097 42206 18077 16645
8432 16645 4704 -14056 -15469 -1309 13283 14287 2670 -1457 -2859 -19777 -5710 11289 26654
8419 26654 13041 -5590 467 5977 4662 12558 11384 -7499 -11889 -12348 -12395 8464 18046 10183
8405 10183 -6535 8667 17263 8313 5898 8004 5911 232 -454 -7093 2000 11766 5546 -1921
8391 -1921 3100 -106 -2133 -2843 2239 7412 -6230 -11558 10492 14922 5823 13735 9501 -7946
8377 -7946 -6782 5360 15877 12517 -4511 -12340 -2808 -12630 -9114 -12166 -1743 4819 4693 1438
8363 1438 -9523 -8556 -7842 -6609 -2019 9693 1775 2952 873 11189 22684 26273 31621 19727
8349 19727 15110 3686 -4029 -8659 -9454 -4661 -12736 -2741 12237 13147 1806 6815 -6081 -15823
8335a5823r953K09K265L730Q13n553j398M418Q618P985R515k765N00N562J3135
8320B1258j1604k2842J5196K1170k0793N972K738J458L448P86j2147j542l86k628
8306H4L637J6326n143m146J23n652N010L010m350K673M406q89k0465k050L560
8291c866j085k763Q162J3921Q18j2972Q62m314M550J4205j623n792J6523J8450
8277D5076M740k6863m5552j2064N389Q060J2838J6064J363P986K3868m116m511
8264C2278k265j4306p973M600m499j9127j514K660R80J1184j413M075M398J2184
8250B1262N026n567j755j700N458j1722n058K502J3078J0648n703n482p925l233
8236I829j138j712k169R129o957j7342Q894O456j2287j309J1269J6167n729R266
$$ plain form
8335 -15823 -25776 -25567 -23302 -19572 -18759 -24312 -25710 -21292 -12674 -4689 4826 2061 2561 8123 21258
8320 21258 9654 -13188 2008 23178 2385 8357 11095 12553 16001 16787 4640 3098 2712 84
8306 84 3721 20047 14904 10758 10881 5229 10239 13249 8899 11572 15978 15089 -5376 -7426 -3866
8291 -3866 -4951 -7714 448 14369 15187 2215 3077 -1237 3313 17518 15895 10103 26626 45076
8277 45076 49816 22953 -22599 -34663 -29274 -21214 -8376 7688 9051 17037 40905 36789 32278
8264 32278 30013 15707 7734 12334 7835 -11292 -12806 -10146 -9166 2018 605 4680 9078 21262
8250 21262 26288 20721 18966 17266 22724 11002 5944 8446 21524 32172 26469 20987 13062 9829
8236 9829 8691 6979 4810 13939 6982 -10360 -1466 4990 -7297 -8606 2663 18830 13101 22367
8222B2367J0977q568k4480r230n508J8071J5043m324j3325n645p633K604J2477
8209B826k246j9581j7206J3484J2637P499j121n770M717K983N531j2853K0520
8196A1420M944j7557R754J5099N545L99p212K433j636k0243N712j2831q806J540
8182a1439R230n714P652m34J2343K6856q780k0264n349K197Q009k436p950K581
8168F502J1797q095L008j910R596l420j0816j051o199Q920J1361n708J187k0111
8154d939j32r918N03Q690j747j4411J1947Q034J237l851P981P547K406M647J5244
8139C3238q522q258j6128o123J4041q320k1065R88J0240J1269K3901J551L10l123
8125B3999p518n025L661O738j1853m228R283O671q211n866q715m00j0050p644
$$ plain form
8222 22367 33344 24776 296 -8934 -14442 3629 18672 14348 1023 -4622 -12255 -9651 2826
8209 2826 580 -19001 -36207 -22723 -10086 -2587 -3708 -9478 -4761 -1778 3753 -9100 11420
8196 11420 16364 -1193 8561 23660 29205 29604 22392 24825 23189 2946 8658 -4173 -12979 -11439
8182 -11439 -2209 -7923 -271 -705 11638 38494 29714 9450 4101 6298 14307 11871 3921 6502
8168 6502 18299 10204 13212 11302 20898 17478 6662 5611 -588 8332 19693 13985 15172 -4939
8154 -4939 -5071 -14989 -14486 -5796 -7543 -21954 -10007 -1973 -736 -4587 3394 10941 13347 17994 33238
8139 33238 24716 16458 330 -5793 8248 -72 -21137 -20149 -9909 1360 25261 26812 27122 23999
8125 23999 16481 11456 15117 21855 10002 5774 15057 21728 13517 7651 -1064 -1464 -11514 -19158
8111a9158J261J0983M851L22j615J986j687J3642j238o802j559M179P062m586
8097G641k865L771j4331R10L949P267Q043J2929K272J1938L00k1475j2575q649
8083h75j2042l132J325N494L937R88j5525l255K4738P102r778l925p949q374q346
8068b9617m28J4527P256o04O443M473J1243n077j5635j1759J7791J7750j3361
8055C002O772L284j2199o094J1619J6487k793j6139q662j5246L841N922N473O519
8041A786P637J0591K501K0661l056j7935m947K050J4426j7101j1909M695j2295
8028b896N002L00j598J400M333j2201O118j837n433n290K582J0954J2283n959
8014G758M132K4110N098q914k0082j3505n618J0842O203M219m749j1068K903m861
$$ plain form
8111 -19158 -17897 -6914 -2063 -1741 -3356 -1370 -3057 10585 9347 2545 986 5165 12227 7641
8097 7641 4776 8547 -5784 -4874 -925 6342 14385 27314 29586 41524 41824 20349 7774 -875
8083 -875 -12917 -16049 -14724 -9230 -5293 -4305 -19830 -23085 1653 8755 -1023 -4948 -12897 -21271 -29617
8068 -29617 -30045 -15518 -8262 -8866 -2423 2050 13293 8216 -7419 -19178 -1387 16363 3002
8055 3002 9774 13058 859 -5235 6384 22871 20078 3939 -4723 -19969 -16128 -10206 -4733 1786
8041 1786 9423 20014 22515 43176 40120 22185 17238 19288 33714 16613 4704 9399 -2896
8028 -2896 2106 2406 808 2208 6541 -5660 458 -1379 -6812 -12102 -9520 1434 13717 7758
8014 7758 11890 36000 41098 32184 12102 -1403 -7021 3821 10024 14243 9494 -1574 1329 -3532
8000c532J0866j504n869L155p931K060k764o221P709K2090P569k484R600O692
7986C9436l671k0860k3244O535P481K4525J2351j306j4984k0288j134R700j1299
7973C242q42n321L517J990k569m531j2933J2352J2694L563j4334j6056j839J5316
7959e751j384o263J7782n392q914J3069J2221J3578l634n948Q551K717r99l572
7945B6061j3947Q741J2467j6684j7099l285J1102K598Q713J0914q351j76m031
7932A7023j4264j0219J6348p592j6823J2492K462R52P507R146l957k920K3201
7919C3356J5412k0318j3887j641J276m756J059J3926J5799J0968j3157j2144J1074
7906C6967j0313l5598R112K0891j2661l941J74P653J5100j4069j4675n687J2964
$$ plain form
8000 -3532 7334 5830 -39 3116 -4815 -2755 -5519 -11740 -4031 18059 25628 23144 32744 39436
7986 39436 35765 14905 -8339 -1804 5677 30202 42553 41247 26263 5975 4841 14541 3242
7973 3242 2400 -2921 596 2586 17 -4514 -17447 -5095 7599 11162 -3172 -19228 -21067 -5751
7959 -5751 -7135 -13398 4384 -1008 -9922 3147 15368 28946 25312 19364 27915 30632 29633 26061
7945 26061 12114 20855 33322 16638 -461 -3746 7356 9954 18667 29581 21230 21054 17023
7932 17023 2759 -7460 8888 1296 -15527 -3035 -573 379 7886 17032 13075 10155 33356
7919 33356 48768 28450 14563 12922 14198 9442 10501 24427 40226 51194 38037 25893 36967
7906 36967 26654 -8944 168 21059 8398 4457 4631 12284 27384 13315 -1360 -7047 5917
7893E917J0058K6800l29j8833p149k756j135q399M075o246O906K957N844k918
7879A4792M397m142n555j7937O692J0106L53p018J2217M535K223n818n811J2832
7865B1866J966N625n595k0909k30J2551K087m238j651q122o357l726J4832J1339
7851A9438k1523j2702l924m006j5997K2261K4028R039N964o563j387n130J2639
7838B2137l043j4193m486n882j2097k11N413M524L070P220J0018o168m256n391
7824c345p608N254L161l615J894j4367n307M966P267K975Q668j0051j6439j891
7810b8438K0405M470M124O856m604j1611j3723O443J6382m929j4946k035p979
7797b9585K894j1444k087M942K2551J7193J5601m924q39l141j2177j4167r643
$$ plain form
7893 5917 15975 42775 42446 23613 16464 13708 12573 4174 8249 2003 8909 11866 17710 14792
7879 14792 19189 15047 9492 -8445 -1753 8353 8706 1688 13905 18440 20663 14845 9034 21866
7865 21866 23832 29457 23862 2953 2723 15274 17361 13123 11472 3350 -3007 -6733 8099 19438
7851 19438 -2085 -14787 -18711 -22717 -38714 -16453 7575 16614 22578 16015 14628 9498 22137
7838 22137 19094 4901 415 -5467 -17564 -17775 -12362 -7838 -4768 2452 12470 6302 2046 -3345
7824 -3345 -10953 -5699 -2538 -6153 -4259 -18626 -23933 -18967 -11700 -8725 -57 -10108 -26547 -28438
7810 -28438 -8033 -3563 561 7417 2813 -8798 -22521 -16078 304 -4625 -19571 -21606 -29585
7797 -29585 -26691 -38135 -40222 -35280 -12729 4464 20065 15141 14302 11161 -1016 -15183 -24826
7784b4826j877j356P471K648J1168l476n195N844k76J1608Q717r359n998J417
7770c490L996O145o962R02J2845j2368p219n593j6155j6686O185J5767J2693K2274
7756A2334m023q256P27K201l564L914n413N387J6658j3349j2897M435k841K621
7742b066J3228J6042m024p840j103k33j1141k0072L073J4417p329l133K83K293
7728g605L637j611l936J0224Q993j2753j3900m242M722J712J606r994N924K0013
7714B790J43l287K774j7862j565j06J4092K1057j9787k0169N276L910J5450n852
7700c136l128Q584R200p370l322Q599J920J1573K0428L280j5844p612j778q302
7686A3092J5129r392j0420j2875j5325J990J0807J2450j8772j2023k75P54J1960
$$ plain form
7784 -24826 -26703 -28059 -20588 -17940 -6772 -10248 -15443 -9599 -9875 1733 10450 1091 -4907 -3490
7770 -3490 506 6651 -311 591 13436 1068 -6151 -11744 -27899 -44585 -38400 -22633 -9940 12334
7756 12334 8311 55 782 2983 -581 3333 -2080 3307 19965 6616 -6281 -1846 -4687 -2066
7742 -2066 11162 27204 23180 15340 14237 14004 2863 -17209 -14136 281 -7048 -10181 -9898 -7605
7728 -7605 -3968 -5579 -9515 709 9702 -3051 -16951 -21193 -16471 -14759 -13153 -23147 -17223 2790
7714 2790 2933 -354 2420 -15442 -17007 -17113 -3021 18036 -1751 -21920 -16644 -12734 2716 -3136
7700 -3136 -6264 2320 11520 4150 828 9427 11347 22920 43348 46628 30784 23172 21394 13092
7686 13092 28221 18829 8409 -4466 -19791 -17801 -6994 5456 -13316 -25339 -25614 -24860 -12900
7673a2900l878j296o092j1592J9685R076j2005J6601R718j2705j0451O879J0464
7660A504L017j3901m104k056M816J729l234J5291M564j3179m932M744p008j3628
7646b6377P56J4308R890n890j3046p396Q824K0880n546K56K918p32J2247R599
7632B0691m948r656k108P031J1772Q224k1657j9605l864J2430L050J953m278j2340
7618a3305j740J0020J16J262M594k4008l893J0188N718O29m989O859M568j657
7604e638p91Q370R500J3826r412j3862j931Q047M201k591k467M041m004O751p728
7589F312k2262k55K543J1292J0117q493o652P336J2477k89j1070j5666j6378Q916
7575b2072J1019j0617J963o25n67J8514K177j6751J0250m030l73k0268l681K1509
$$ plain form
7673 -12900 -16778 -18074 -24166 -35758 -16073 -6997 -19002 -2401 7317 -5388 -15839 -8960 1504
7660 1504 4521 -9380 -13484 -15540 -10724 -8995 -12229 3062 7626 -5553 -10485 -5741 -12749 -26377
7646 -26377 -25621 -11313 -1423 -7313 -20359 -27755 -18931 1949 -3597 -3341 -423 -1155 11092 20691
7632 20691 15743 6087 3979 11010 22782 31006 9349 -10256 -14120 -1690 1360 3313 -965 -13305
7618 -13305 -15045 -5025 -4909 -3647 947 -23061 -26954 -16766 -11048 -10419 -15408 -8549 -3981 -5638
7604 -5638 -6429 1941 11441 25267 15855 1993 62 8109 12310 9719 7252 11293 7289 14040 6312
7589 6312 -15950 -16205 -13662 -2370 7747 -746 -7398 -62 12415 12126 1056 -14610 -30988 -22072
7575 -22072 -11053 -21670 -19707 -20332 -20899 -2385 -208 -16959 -6709 -10739 -11112 -31380 -35061 -13552
7561a3552m027j8752O718K3900J8770j1485P106J1678J141K743J300N988j028
7548C0500j7307k0284j588M636q771o38j1205K680K310k0541n90J4343K1022J8007
7534A2574j407j1719j0173m187L735P862O12J2400L685j517l385m930L416p716
7520g50n554l542K0305J1301r397k1613l70N670k234J4409P722O804L518j2089
7506A4180j3502j850O642P394o4j8719p407K1906K668m290R973J401q198M33O237
7491A6804J664j0160j1358j534p38l266r489N912J2097j280j4224q863m609J8850
7477a0194K6652k79j4417J0378R527k5258k2188L110Q210Q0k7403K322K1692M810
7463a2958J339k544j975P503Q917k441j5261p897o731J2453K7776o372j1433J01
$$ plain form
7561 -13552 -17579 -36331 -29613 -5713 13057 1572 8678 20356 21497 24240 25540 31528 30500
7548 30500 13193 -7091 -8679 -4043 -12814 -13452 -24657 -21977 -19667 -40208 -40798 -26455 -5433 12574
7534 12574 11167 -552 -10725 -14912 -11177 -3315 -2703 9697 13382 11865 8480 3550 6966 -750
7520 -750 -6304 -9846 10459 21760 12363 -9250 -9620 -3950 -6184 8225 15947 22751 26269 14180
7506 14180 678 -1172 5470 12864 12800 -5919 -13326 8580 11248 6958 16931 18332 10134 10567 16804
7491 16804 18468 8308 -3050 -4584 -5322 -8588 -18077 -12165 -68 -1348 -15572 -24435 -29044 -10194
7477 -10194 16458 16179 1762 12140 21667 -3591 -25779 -22669 -14459 -14379 -41782 -39460 -17768 -12958
7463 -12958 -11619 -14163 -16138 -8635 282 -2159 -17420 -25317 -32048 -19595 8181 1809 -9624 -9523
7449i523N762k1891k6128L540L4843k74N241J4873k197k0065j3221J0183J1394
7436g463K4708O783m960j8006j5474J1517j0546n256J8481K524J854m642J4915
7423A4435j472j5777j645j0929J0771P147K1577K003j5849q801N039L37J490j328
7409F998p988J09l939R309Q3o758M018J528R531j1658K067L459L873j623l895
7394E114j3121j316j6641j1228J7821R083j1402q317J3605m881K684R460M308
7381d831N904J3944J9632J996r176j9177O98J117l288p388l667r29J1439N290
7367A1564R96j8686j4794l767J3797n438r442Q371q750j1617j1629N989K2810
7354b0596R215L046K867R535N610J1465j1552j5153J0157K834Q09k876q4J1093
$$ plain form
7449 -9523 -3761 -25652 -51780 -48240 -13397 -13671 -8430 6443 4246 -15819 -29040 -18857 -7463
7436 -7463 17245 24028 19068 1062 -14412 -2895 -13441 -18697 -216 2308 4162 -480 14435
7423 14435 12963 -2814 -4459 -15388 -4617 2530 24107 26110 10261 1460 6499 6836 8326 6998
7409 6998 -990 -881 -4820 4489 4572 -2186 1832 3360 12891 1233 3300 6759 10632 9009 5114
7394 5114 -8007 -9323 -25964 -37192 -19371 -10288 -21690 -30007 -16402 -21283 -18599 -9139 -4831
7381 -4831 1073 15017 34649 36645 27469 8292 8990 10107 6819 -569 -4236 -5165 6274 11564
7367 11564 12560 -6126 -20920 -24687 -10890 -16328 -25770 -17399 -26149 -37766 -49395 -43406 -20596
7354 -20596 -11381 -8335 -5468 4067 9677 21142 9590 -5563 4594 7428 8237 5361 5277 16370
7340A6370l340M446J5030Q725p102o682K56l178m308J2438L191M9L013L3o937
7325C2004j4751o946k2569o028J2357R571j1812q224J4690J6031k508j6772L4
7312d923Q619K364j5234j368J0179k447j3987J0429K3269P514j1800j7652l490
7299h527J3482j0441j7842p748K0229N610J0488K150j1739o227K3742P918m918
7286A6177m540N772O396N182j5148j9094Q150K446j4699j2911J5751P540j3866
7273a2844J3384K076K912j777n659N825j2714p223N325Q259M391j7649j7787q625
7259d2106J6016K3142J176M385K978L437J3848o142n997m445K505l674r800j0848
7245a5525j0436J653K7741o122j665j285m749n397K1583J0781l422r221o780O335
$$ plain form
7340 16370 13030 17476 32506 41231 34129 27447 27703 24525 20217 32655 35846 35895 38908 38941 32004
7325 32004 17253 10307 -12262 -18290 -5933 3638 -8174 -16398 -1708 14323 11815 -4957 -4923
7312 -4923 3696 6060 -9174 -10542 -363 -2810 -16797 -6368 16901 24415 12615 -5037 -8527
7299 -8527 4955 -5486 -23328 -31076 -10847 -5237 5251 7401 -4338 -10565 13177 21095 16177
7286 16177 11637 17409 23805 28987 13839 -5255 2895 5341 -9358 -22269 -6518 1022 -12844
7273 -12844 540 2616 5528 3751 -1908 3917 -8797 -16020 -10695 -2436 1955 -15694 -33481 -42106
7259 -42106 -26090 -2948 -1772 2613 5591 9028 22876 16734 10737 6292 8797 5123 -4677 -15525
7245 -15525 -25961 -24308 3433 -2689 -4354 -5639 -10388 -15785 5798 16579 13157 3936 -2844 3491
7231C491M442Q648p39n784k865Q314j252j0090o829l259Q967j0964o696j5524
7217c0140p705Q759P518N837O85J5907J4130j807o655N58q977j0373L132J0827
7203A696L861J632n269J18K97K45J8288j2139Q106p930k1999j6129L523J0677
7189a5023j604r351O97J4094J2847M38j6365j1357M163L3184K3406k972j5591
7176A6566j210L469j4183n952P221j3253j2638K821O994o39J857J405m104Q049
7162c597J1763J0387r933R83j2607n508N136j4668J0861k215j2804n546J3815
7149a3933J4679j3591j5693K933O09J6637K5710j0197j7932m153P556J4717J2091
7136A9433j1869j1270J0177K507j7414J03m396K0129O102j7194j4487N170j672
$$ plain form
7231 3491 7933 16581 15842 10058 7193 15507 14255 4165 -2664 -5923 3044 -7920 -14616 -30140
7217 -30140 -37845 -29086 -21568 -15731 -15046 861 14991 13184 6529 7087 -1890 -12263 -9131 1696
7203 1696 5557 7189 1920 2038 2335 2580 20868 8729 16835 8905 -13094 -29223 -25700 -15023
7189 -15023 -16627 -25978 -25281 -11187 1660 2098 -14267 -25624 -21461 11723 35129 32157 16566
7176 16566 15356 18825 4642 -1310 5911 -7342 -19980 -17159 -10165 -10804 -8947 -7542 -11646 -3597
7162 -3597 8166 18553 8620 9603 -3004 -8512 -3376 -18044 -7183 -9398 -22202 -27748 -13933
7149 -13933 746 -12845 -28538 -25605 -24996 -8359 17351 7154 -10778 -14931 -7375 7342 19433
7136 19433 7564 -3706 6471 8978 -8436 -8333 -12729 7400 13502 -3692 -18179 -13009 -14681
7123a4681p259L766K3697J0306j2844j8846m447O527l5m883R316P121Q521q218
7109a959j1287Q32K3069J8377k947k2312j2432r57k250l938L43L890J2142k533
7095a962n237m701K104P980J995l605j4487j6948m665j2613L996K1399J4596j1467
7081b3615l227K104N524K4222J3476p011j2999J1952J445j7978O700l099M579
7068B073K3930j5683j3614j3514k705p624N577j1036Q952L047L305J0276J5854
7055H838o585n009m492M689J2642J228k2409O502r24k4071k1999q540J7276J9823
7041b3031Q84j0190k0596K0391L0684J1450k993j6670j7641n249J4813k102J183
7028a9067R834L365j4960j85J4582J3394p91j5993j1779n009L59J0889J196n428
$$ plain form
7123 -14681 -21940 -18174 5523 15829 2985 -15861 -20308 -13781 -13816 -18699 -9383 -2262 6259 -1959
7109 -1959 -13246 -12414 10655 29032 26085 3773 -8659 -9616 -11866 -15804 -15461 -11571 571 -1962
7095 -1962 -7199 -11900 -9796 -1816 179 -3426 -17913 -34861 -39526 -52139 -48143 -26744 -12148 -23615
7081 -23615 -26842 -24738 -19214 5008 18484 11473 -1526 10426 11871 -6107 593 -2506 2073
7068 2073 26003 10320 -3294 -16808 -19513 -27137 -21560 -32596 -23644 -20597 -17292 -7016 8838
7055 8838 2253 -2756 -7248 -2559 10083 11311 -11098 -4596 -5520 -29591 -51590 -60130 -42854 -23031
7041 -23031 -22147 -32337 -52933 -32542 -1858 9592 6599 -10071 -27712 -32961 -18148 -20250 -19067
7028 -19067 -9233 -5868 -20828 -21013 -6431 6963 6172 -9821 -21600 -26609 -26250 -15361 -14165 -19593
7014a9593M042K6377r413j2008j7950R13k634m407K013j360j662l988K5898K0044
7000F272R4Q15P77J2081l100p115m221j970J7353r172j7689j1385M00k08K737
6985a4331j285j1372r29K6444J4690j1186l236O441j5023J970r89o823K15O094
6971i320N27O555R845J5801j9192j2813k829j1409j0206N534p14k01J180Q796
6957a8446J6878L421p689m846K8784j372j0811m262m230o032j2936P368K130r194
6943b1237m741J1265J48N122M458P984J0651m932k56r364j0958j0803O373J6056
6929b34j860J0558K2626p040j6638j1340j8230r615l595q876K2808J9473J3332
6916A1369n027m870j2187K397K768qj0204J946M345j0288N416J9201K094j061
$$ plain form
7014 -19593 -15551 10826 1413 -10595 -28545 -27632 -30266 -34673 -32660 -34020 -35682 -39670 -13772 6272
7000 6272 6366 7181 7958 20039 16939 9824 5603 3633 20986 11814 -5875 -17260 -16860 -17068 -14331
6985 -14331 -15616 -26988 -27917 -1473 13217 2031 -1205 5236 -9787 -7817 -8806 -15629 -15414 -9320
6971 -9320 -8793 -2238 7607 23408 4216 -8597 -11426 -22835 -33041 -27507 -28221 -28422 -27242 -18446
6957 -18446 -1568 1853 -5836 -10682 18102 16730 5919 1657 -2573 -8605 -21541 -14173 -12043 -21237
6943 -21237 -25978 -14713 -14565 -9443 -4985 2999 13650 8718 8462 -902 -11860 -22663 -16290 -234
6929 -234 -2094 8464 31090 24050 7412 -3928 -22158 -31773 -35368 -44244 -21436 -1963 11369
6916 11369 6342 1472 -10715 -8318 -5550 -5558 -15762 -13816 -9471 -19759 -14343 4858 6952 5891
6902E891k735P200j0542j1349L220P973J149j4491k1568N958K0688l049o266o543
6888b4464j3734j7088m246K4582j229j0613J6062m622j4511K309R134o396L147
6875d1669K8682M329m424o5R693J8475K2850m574p277p372j397r067j5044N752
6861a108J2048n64k0262q278L737J2526j1877L676R134r997K139J8901K3824L32
6847C4231Q3j6741j8834O948J5208O049O965k951j3828j9436p577O425L049j0684
6833a1093K031K903j2559j2165o195Q675J5758N488R396N834R8K000L463n178
6819H456j1425j511k138r61n99P087k986J2606K680J257o692r386j1667M854m826
6804a5251K642o28Q3j275m813o304Q868K689m415N670o56Q509K1027N465k1651
$$ plain form
6902 5891 3156 10356 -186 -11535 -8315 -342 807 -13684 -35252 -29294 -8606 -11655 -17921 -24464
6888 -24464 -38198 -55286 -59532 -34950 -36179 -46792 -30730 -35352 -49863 -47554 -38420 -44816 -41669
6875 -41669 -12987 -8658 -13082 -13147 -3454 15021 37871 33297 26020 18648 17251 8184 -6860 -1108
6861 -1108 10940 10376 -9886 -18164 -14427 -1901 -13778 -10102 -968 -10965 -8826 10075 33899 34231
6847 34231 34314 17573 -1261 5687 20895 26944 33909 30958 17130 -2306 -9883 -3458 -409 -11093
6833 -11093 -9062 -6159 -18718 -30883 -37078 -28403 -12645 -7157 2239 8073 8171 10171 13634 8456
6819 8456 -2969 -4480 -6618 -7579 -8178 -1091 -4077 8529 11209 12466 5774 -3612 -15279 -10425 -15251
6804 -15251 -12609 -13237 -13154 -14429 -19242 -25546 -16678 -13989 -18404 -12734 -13390 -4881 16146 21611 -40
6789d0k9286J6848Q905M202k995P479L513j7866N684M803n868J0056l215L745
6775E965J622J8107o94j4677o049j2589q69J2757R827j1259p626J824L155p348
6761g854j4476j1764j926O546j371J48N029K0237J3133L177j0881l980l700k35
6747g917j1065P552M089K1166j2641n856J4537m872p97N581J0549J4779K40k588
6733C2757k9733m54Q402l123k367j1237m331n974n33m162p616K7305R616m525
6719D025L816m604j251k227R68R839J2338r778k7853O31J9591l238k0500R83J2742
6704d518P63J3703j818q050p392q602m989q13n325j863O404J6989J1588j230p892
6689c045m666r064L351N015J5879O046K42k280p159j9802r88p823j529Q629j8695
$$ plain form
6789 -40 -29326 -12478 -3573 629 -2366 5113 8626 -9240 -3556 1247 -4621 5435 2220 5965
6775 5965 7587 25694 25000 10323 4274 -8315 -9184 3573 13400 2141 -5485 -3661 -506 -7854
6761 -7854 -22330 -34094 -36020 -29474 -30845 -30697 -25668 -5431 7702 10879 -2 -3982 -7682 -7917
6747 -7917 -18982 -11430 -7341 13825 1184 -4672 9865 4993 4196 9777 20326 35105 35345 32757
6733 32757 3024 2570 10972 7849 5482 -5755 -10086 -16060 -16593 -20755 -28371 -1066 8550 4025
6719 4025 7841 3237 1986 -241 727 10566 22904 13126 -14727 -14096 5495 2257 -18243 -17260 -4518
6704 -4518 -3755 9948 8130 80 -7312 -15914 -20903 -21716 -27041 -28904 -22500 -5511 6077 4847 -3045
6689 -3045 -7711 -16775 -13424 -8409 7470 13516 13758 11478 4319 -15483 -16471 -24294 -25823 -17194 -35889
6674c5889J1019K2103Q388q598k4880N511M353K468L924n312o242K367J9250N995
6660D457j7981j2297L936j4707K968K4063N168J016k229j1509J0998K396J1656
6647G935O746J2817k697M717l16R960O987l4358l7225J290K0429J2472Q763j4886
6633B634j7371J7268r35J3750Q094j3564n008J8955Q304L916q759j8985k478J839
$$ plain form
6674 -35889 -24870 -2767 5621 -2977 -27857 -22346 -17993 -15525 -11601 -16913 -23155 -20788 -1538 4457
6660 4457 -13524 -25821 -21885 -36592 -33624 -9561 -4393 -3377 -5606 -17115 -6117 -3721 7935
6647 7935 14681 27498 24801 29518 29202 39162 46149 11791 -25434 -24144 -3715 8757 17520 2634
6633 2634 -14737 2531 1596 15346 23440 9876 4868 23823 32127 36043 27284 8299 5821 7660
$$ [...]
##END NTUPLES=NMR SPECTRUM
##END=
