##TITLE=Analysis number 323139
Compound Code cc 50204
Book Reference 464/66/3
Project Code adrs
Chemist Name chrisr
##JCAMPDX= 6.0         $$ Bruker NMR JCAMP-DX V2.0
##DATA TYPE= NMR SPECTRUM
##DATA CLASS= NTUPLES
##ORIGIN= Bruker BioSpin GmbH
##OWNER= nmr
$$ XWIN-NMR		Version 3.5
$$ Tue Oct 17 16:34:17 2006 GMT Daylight Time (UT+1h)  MAYBRIDGE\nmr@NMR_250MHZ
##.OBSERVE FREQUENCY= 250.131544655141
##.OBSERVE NUCLEUS= ^1H
##.ACQUISITION MODE= SIMULTANEOUS (DQD)
##.ACQUISITION SCHEME= undefined
##.AVERAGES= 16
##.DIGITISER RES= 18
##SPECTROMETER/DATA SYSTEM= dpx250
##.PULSE SEQUENCE= zg30
##.SOLVENT NAME= CDCl3
##.SHIFT REFERENCE= (INTERNAL, CDCl3, 0, 16.522)
##AUDIT TRAIL= $$ (NUMBER, WHEN, WHO, WHERE, WHAT)
$$ ##TITLE= Audit trail, XWIN-NMR		Version 3.5
$$ ##JCAMPDX= 5.01
$$ ##ORIGIN= Bruker BioSpin GmbH
$$ ##OWNER= nmr
$$ C:\u/data/dgb/nmr/ADRS/710/pdata/1/auditp.txt
$$ ##AUDIT TRAIL=  $$ (NUMBER, WHEN, WHO, WHERE, WHAT)
(   1,<2006-10-17 16:33:53.76 +100>,<MAYBRIDGE\nmr>,<NMR_250MHZ>,
      <created by zg, POWCHK disabled, PULCHK disabled
       configuration hash MD5:
       49 4B E0 1D 92 C2 6B 37 9F E6 65 BC 52 41 86 1D
       data hash MD5: 64K
       B5 12 06 21 8C 4B CD 89 AC 85 6C 4E 2E EA A9 E5>)
(   2,<2006-10-17 16:34:07.51 +100>,<MAYBRIDGE\nmr>,<NMR_250MHZ>,
      <Start of raw data processing
       ef LB = 0.3 FT_mod = 6 PKNL = 1 SI = 32K 
       data hash MD5: 32K
       B4 97 5C 59 68 0A 1B D5 7D A6 8D 92 62 52 15 26>)
(   3,<2006-10-17 16:34:09.20 +100>,<MAYBRIDGE\nmr>,<NMR_250MHZ>,
      <apk 
       data hash MD5: 32K
       2B CD 55 F1 8D 98 79 37 F4 5B D5 1B CC F3 34 74>)
(   4,<2006-10-17 16:34:10.21 +100>,<MAYBRIDGE\nmr>,<NMR_250MHZ>,
      <abs ABSG = 5 
       data hash MD5: 32K
       93 05 47 18 43 0D 99 B3 EE AD 92 1B 16 D9 6D 16>)
$$ ##END=
$$ 
$$ hash MD5
$$ F2 80 8D 50 32 D7 EA 53 00 32 77 A9 5D 39 7C 88
##$RELAX= 
##$RELAX= 
##$RELAX= 
##$RELAX= 
##$RELAX= 
##$RELAX= 
##$RELAX= 
$$ Bruker specific parameters
$$ --------------------------
##$DU= <C:\u>
##$EXPNO= 710
##$NAME= <ADRS>
##$PROCNO= 1
##$TYPE= <nmr>
##$USER= <dgb>
##$AMP= (0..31)
100 100 100 100 100 100 100 100 100 100 100 100 100 100 100 100 100 100 
100 100 100 100 100 100 100 100 100 100 100 100 100 100 
##$AQSEQ= 0
##$AQ_mod= 3
##$AUNM= <au_zg>
##$AUTOPOS= <6 >
##$BF1= 250.13
##$BF2= 250.13
##$BF3= 250.13
##$BF4= 250.13
##$BF5= 500.13
##$BF6= 500.13
##$BF7= 500.13
##$BF8= 500.13
##$BYTORDA= 1
##$CFDGTYP= 0
##$CFRGTYP= 5
##$CHEMSTR= <none>
##$CNST= (0..31)
1 1 145 1 1 1 1 1 1 1 1 1 1 1 1 1 1 1 1 1 1 1 1 1 1 1 1 1 1 1 1 1 
##$CPDPRG= <>
##$CPDPRG1= <>
##$CPDPRG2= <>
##$CPDPRG3= <>
##$CPDPRG4= <mlev>
##$CPDPRG5= <mlev>
##$CPDPRG6= <mlev>
##$CPDPRG7= <mlev>
##$CPDPRG8= <mlev>
##$CPDPRGB= <>
##$CPDPRGT= <>
##$D= (0..31)
0 1 0 0 0 0 0 0 0 0.06 0 0 0 0 0 0 0.0002 0 0 0 0 0 0 0 0 0 0 0 0 0 0 
0 
##$DATE= 1161099232
##$DBL= (0..7)
120 120 120 120 120 120 120 120 
##$DBP= (0..7)
150 150 150 150 150 150 150 150 
##$DBP07= 0
##$DBPNAM0= <>
##$DBPNAM1= <>
$$ [...]
##$SUBNAM7= <"">
##$SUBNAM8= <"">
##$SUBNAM9= <"">
##$SW= 20.6930455092707
##$SWIBOX= (0..15)
0 0 3 0 0 0 0 0 0 0 0 0 0 0 0 0 
##$SW_h= 5175.983436853
##$TD= 65536
##$TD0= 1
##$TE= 683.16
##$TE2= 300
##$TE3= 300
##$TEG= 300
##$TL= (0..7)
0 120 120 120 120 120 120 120 
##$TP= (0..7)
150 150 150 150 150 150 150 150 
##$TP07= 0
##$TPNAME0= <>
##$TPNAME1= <>
##$TPNAME2= <>
##$TPNAME3= <>
##$TPNAME4= <>
##$TPNAME5= <>
##$TPNAME6= <>
##$TPNAME7= <>
##$TPOAL= (0..7)
0.5 0.5 0.5 0.5 0.5 0.5 0.5 0.5 
##$TPOFFS= (0..7)
0 0 0 0 0 0 0 0 
##$TUNHIN= 0
##$TUNHOUT= 0
##$TUNXOUT= 0
##$USERA1= <user>
##$USERA2= <user>
##$USERA3= <user>
##$USERA4= <user>
##$USERA5= <user>
##$V9= 5
##$VALIST= <valist>
##$VCLIST= <CCCCCCCCCCCCCCC>
##$VD= 0
##$VDLIST= <DDDDDDDDDDDDDDD>
##$VPLIST= <PPPPPPPPPPPPPPP>
##$VTLIST= <TTTTTTTTTTTTTTT>
##$WBST= 1024
##$WBSW= 4
##$XGAIN= (0..3)
0 0 0 0 
##$XL= 0
##$YL= 0
##$YMAX_a= 532682
##$YMIN_a= -346241
##$ZGOPTNS= <>
##$ZL1= 120
##$ZL2= 120
##$ZL3= 120
##$ZL4= 120
##$ABSF1= 16.522
##$ABSF2= -4.171173
##$ABSG= 5
##$ABSL= 3
##$ALPHA= 0
##$AQORDER= 0
##$ASSFAC= 0
##$ASSFACI= 0
##$ASSFACX= 0
##$ASSWID= 0
##$AUNMP= <proc_1d>
##$AZFE= 0.1
##$AZFW= 0.1
##$BCFW= 0
##$BC_mod= 0
##$BYTORDP= 0
##$COROFFS= 0
##$CY= 12.5
##$DATMOD= 1
##$DC= 0
##$DFILT= <>
##$DTYPP= 0
##$F1P= 14.0000005364418
##$F2P= -0.99999901652339
##$FCOR= 0.5
##$FTSIZE= 32768
##$FT_mod= 6
##$GAMMA= 0
##$GB= 0
##$INTBC= 1
##$INTSCL= 1
##$ISEN= 128
##$LB= 0.3
##$LEV0= 0
##$LPBIN= 0
##$MAXI= 10000
##$MC2= 0
##$MEAN= 0
##$ME_mod= 0
##$MI= 0
##$NCOEF= 0
##$NC_proc= -5
##$NLEV= 6
##$NOISF1= 0
##$NOISF2= 0
##$NSP= 0
##$NTH_PI= 0
##$NZP= 0
##$OFFSET= 16.522
##$PC= 1
##$PHC0= -44.93576
##$PHC1= 2.630172
##$PH_mod= 1
##$PKNL= yes
##$PPARMOD= 0
##$PSCAL= 4
##$PSIGN= 0
##$REVERSE= no
##$SF= 250.13
##$SI= 32768
##$SIGF1= 0
##$SIGF2= 0
##$SINO= 400
##$SIOLD= 32768
##$SREGLST= <1H.CDCl3>
##$SSB= 0
##$STSI= 32768
##$STSR= 0
##$SW_p= 5175.98343685301
##$SYMM= 0
##$S_DEV= 0
##$TDeff= 65536
##$TDoff= 0
##$TI= <Analysis number 999999
Compound Code 99
Book Reference 9
Project Code 9>
##$TILT= no
##$TM1= 0
##$TM2= 0
##$TOPLEV= 0
##$USERP1= <user>
##$USERP2= <user>
##$USERP3= <user>
##$USERP4= <user>
##$USERP5= <user>
##$WDW= 1
##$XDIM= 32768
##$YMAX_p= 577766291
##$YMIN_p= -897495
$$ End of Bruker specific parameters
$$ ---------------------------------
##NTUPLES= NMR SPECTRUM
##VAR_NAME=  FREQUENCY,     SPECTRUM/REAL,   SPECTRUM/IMAG
##SYMBOL=    X,             R,               I
##VAR_TYPE=  INDEPENDENT,   DEPENDENT,       DEPENDENT
##VAR_FORM=  AFFN,          ASDF,            ASDF
##VAR_DIM=   32768,         32768,           32768
##UNITS=     HZ,            ARBITRARY UNITS, ARBITRARY UNITS
##FACTOR=    0.157963299565203, 1,           1
##FIRST=     4132.6476996994, 0,             0
##LAST=      -1043.33573715361, 0,           0
##MIN=       -1043.33573715361, -897495,     0
##MAX=       4132.6476996994, 577766291,     0
$$ Real data points
##PAGE= N=1
##DATA TABLE= (X++(R..R)), XYDATA
$$ [...]
27553G1291q3626j29412j71680O7698O2354J46171K82524J44878j51141j78960
$$ 71291 -12335 -141747 -313427 -245729 -183375 -37204 245320 390198 239057 60097
27543F0097n8748J87830Q3470k4696J42989o935j90898k32770l5543R951O5415
$$ 60097 1349 189179 272649 247953 390942 384007 193109 -39661 -75204 -65253 162
27532A62j54647k58248J1889K93420L09502J71137N9591j478k42947l84057j76146
$$ 162 -154485 -412733 -400844 -107424 202078 373215 432806 431328 188381 -195676 -371822
27521c71822M8216O5127J68492J36088K74443o2159k68401o2637k44696m6976
$$ -371822 -323606 -258479 -89987 46101 320544 258385 -10016 -72653 -317349 -364325
27511c64325K68865r5535n3110J27042J04176M46j20436P9252J28981o8504J79273
$$ -364325 -95460 -190995 -244105 -117063 -12887 -12441 -132877 -53625 75356 6852 186125
27500A86125k4964j0202p5654j12282k23273M5791M33784J78677j69268j03050
$$ 186125 161161 150959 75305 -36977 -260250 -214459 219325 398002 228734 125684
27490A25684j83439J66335L87439j61524k96447j27198J984J09198k00203j78725
$$ 125684 -57755 108580 496019 334495 38048 -89150 -87166 22032 -178171 -356896
27480c56896p3282J99304J48653j93219R7833M01974j45185j86293j5634N0016
$$ -356896 -430178 -230874 -82221 -275440 -177607 224367 79182 -107111 -122745 -72729
27470g2729L5206J25532K8208J89319j00047j65688k1496P9693J84207n5588j00002
$$ -72729 -37523 88009 116217 305536 205489 39801 18305 97998 282205 226617 126615
27459A26615j4813M9382l8356j58522J2392k27583M8471J32996J35761k9889P2922
$$ 126615 111802 161184 122828 -35694 -23302 -250885 -202414 -69418 66343 36454 109376
27448A09376J18954K32441j34730o046J435P4802k4980k33293m73675J55049J48922
$$ 109376 228330 460771 326041 319995 321430 396232 371252 137959 -335716 -180667 -31745
27437c1745M1713P008k5209k83137k7200K98171L50392j784p0687O7248j48806
$$ -31745 9968 16976 -8233 -291370 -318570 -20399 329993 328209 257522 324770 175964
27426A75964k33989j35955L32821J48151l1773k08209k25159J7389J47442J29132
$$ 175964 -58025 -193980 138841 286992 255219 47010 -178149 -160760 -13318 115814
27416A15814J74122J34038K5698l0312j99267j45479L8647l1275j00416j62558
$$ 115814 289936 423974 449672 419360 220093 74614 113261 81986 -18430 -180988
27406a80988m7046J39050k76189q0014M3020M0153J30979J02522J1729l2661j28208
$$ -180988 -228034 -88984 -365173 -445187 -402167 -362014 -231035 -128513 -116784 -149445 -277653
27395b77653j86597O4280J78398L62405K03837J7785l2921k42570l41773L9640
$$ -277653 -464250 -399970 -221572 140833 344670 362455 329534 86964 -254809 -215169
27385b15169J13796m2262k65461j13368J87055J68546J10469J38896J42665l6682
$$ -215169 -101373 -143635 -409096 -522464 -335409 -166863 -56394 82502 225167 188485
27375A88485l32801j75546j06682L81034k393J43212J89467M7845j65544j00789
$$ 188485 -144316 -319862 -426544 -45510 -47903 95309 284776 332621 167077 66288
27365F6288k13672k9284J11036o6497J61211P3377k24882O0902J01091l6405o3489
$$ 66288 -147384 -176668 -65632 -132129 29082 102459 -122423 -61521 39570 3165 -60324
27354f0324j50036L8697K59399J51714J66471J37518j29620J15037j17166k39339
$$ -60324 -210360 -171663 87736 239450 405921 543439 413819 528856 411690 172351
27344A72351j03618L4217N8104l6758q9221j87600n6102J50466r359L3638l9901
$$ 172351 68733 102950 161054 124296 35075 -152525 -208627 -58161 -67520 -33882 -73783
27333g3783k3894p3370j17506K13786J61724J0457P3044l2808j05240j9912K7232
$$ -73783 -97677 -171047 -288553 -74767 86957 97414 170458 137650 32410 12498 39730
27322C9730j26632k59559J05130J32616K2489N9552Q234J91949K37918j30250
$$ 39730 -86902 -346461 -241331 -108715 -86226 -26674 -18440 173509 411427 281177
27312B81177K3655N3971l3133p9040p0666K2564k04515k9278j8194p6995q8817
$$ 281177 304832 358803 325670 246630 175964 198528 -5987 -35265 -53459 -130454 -219271
27301b19271Q1432J92271J61473P9226p2697m68248k30758K76180Q7906q4635
$$ -219271 -137839 54432 215905 295131 222434 -245814 -476572 -200392 -112486 -197121
27291a97121j3701J80129K28125M754k06791R8492n3106M1701o8673N9229J1052
$$ -197121 -210822 -30693 197432 202186 -4605 93887 40781 82482 13809 73038 84090
27280H4090p4437R496j5737k14115R8246K89860l1931j55261J31229J13297k05946
$$ 84090 9653 19149 3412 -210703 -112457 177403 145472 -9789 121440 234737 28791
27269B8791p6940J06849L8839R4161m2623q7796j74088j01387J48714L08591J17199
$$ 28791 -48149 58700 97539 191700 149077 61281 -112807 -214194 -65480 243111 360310
27258C60310r2035n5427j56492k56281N4249J4044J33529j07417k56535n7227
$$ 360310 268275 212848 56356 -199925 -145676 -131632 1897 -105520 -362055 -419282
27248d19282l3274J9886K72613K4703Q8269q1964k35842N6854Q8001m1985J54979
$$ -419282 -452556 -432670 -160057 -135354 -47085 -129049 -364891 -308037 -220036 -262021 -107042
27237a07042J73358j92760l48911n6716J71401R9079j76358J58498J69710k0108
$$ -107042 66316 -126444 -475355 -532071 -360670 -261591 -437949 -279451 -109741 -129849
27227a29849Q1783K0557m5682k45657N1478m4022J3433J87717J24192r473k8455
$$ -129849 -48066 -27509 -73191 -318848 -267370 -311392 -297959 -110242 13950 4477 -23978
27216b3978j79495O4285J30101K05303K843J7607p6703j53814k02165j46315j22048
$$ -23978 -203473 -139188 -9087 196216 199059 216666 139963 -13851 -216016 -362331 -484379
27205d84379j26817j5826J14060J72399P2775Q4052K48633j27094j35937k149
$$ -484379 -611196 -627022 -512962 -340563 -267788 -183736 64897 -62197 -198134 -200283
27195b00283M516J45412o0707J08898j336k46736N5851k8315q4306j5230J67821
$$ -200283 -195767 -50355 -111062 -2164 -3500 -250236 -194385 -222700 -307006 -322236 -154415
27184a54415K14294J34647R4037j36525k38276J72331j9641j9948j75792P163
$$ -154415 59879 194526 288563 152038 -86238 86093 66452 46504 -129288 -122125
27174a22125m2863p901q5703m4573J53718L33230q4646j87371j1121J93149J33584
$$ -122125 -164988 -172889 -258592 -303165 -149447 183783 99137 -88234 -99355 93794 227378
27163B27378j21710m6351N8904J55945j19960o2862J1674N9451n2265j72423o7829
$$ 227378 105668 59317 118221 274166 154206 91344 103018 162469 110204 -62219 -130048
27152a30048R9387J01262j41270j12236J79263P1666N4427L6749k61356k29421
$$ -130048 -30661 70601 -70669 -182905 -3642 68024 122451 159200 -102156 -331577
27142c31577j16946J65364J02411j45726J80947Q5325O7935M3905k87733j3759
$$ -331577 -448523 -283159 -180748 -326474 -145527 -60202 7733 51638 -236095 -249854
27132b49854J97734K25450l9387p8825O937N1240J056J20285j57593K506M8667
$$ -249854 -52120 173330 133943 55118 62055 113295 114351 234636 77043 79549 128216
27121A28216J19889j49093o3003N4649p2288p8713j16034j59566l0709P3134J30656
$$ 128216 248105 99012 36009 90658 18370 -60343 -176377 -335943 -366652 -293518 -162862
27110a62862L82245J80053o9476J0731r6965J78927j7849j97595j56059j88912
$$ -162862 219383 399436 329960 340691 243726 422653 404804 207209 51150 -137762
27100a37762R322k2354J20835m8771j92459l5746j550L0192M6155K46283J89202
$$ -137762 -128440 -150794 -29959 -78730 -271189 -306935 -308485 -278293 -232138 14145 203347
27089B03347M9510j30157j14668K0273n5852N4911P2694J35612k4221k8129j19870
$$ 203347 252857 122700 8032 28305 -27547 27364 100058 235670 211449 183320 63450
27078F3450o8390J47858N471M0649O4886O8945O4381j29479R5780J59008j31866
$$ 63450 -4940 142918 148389 189038 253924 322869 387250 257771 353551 512559 380693
27067C80693m7396j99058j5660J19941Q6194J3030j7553J7172O5221J67009l6856
$$ 380693 333297 134239 118579 238520 324714 337744 320191 337363 402584 569593 532737
27056E32737j54439k42263k64118R2664P0252j28128o9881j93501l3262M62951
$$ 532737 378298 136035 -128083 -35419 34833 -93295 -163176 -356677 -389939 73012
27046G3012L44307q8766j17405O8601P7725J573K1440L5412j21365M6552q1862
$$ 73012 417319 328553 211148 279749 357474 359047 380487 415899 294534 341086 259224
27035B59224M1136j58820q7391J11654Q8418o3649J13903j02643j75892n1250
$$ 259224 300360 141540 54149 165803 254221 190572 304475 201832 25940 -25310
27025b5310K34468J8972j48193r9696J66732O9683k70556l342J24152j45806k06179
$$ -25310 209158 228130 79937 -19759 146973 216656 -53900 -57242 66910 -78896 -285075
27014b85075J03924Q4082Q3792J11773j92808k04482J25265J16675p6030r8442
$$ -285075 -181151 -97069 -13277 98496 -94312 -298794 -173529 -56854 -132884 -231326
27004b31326R1616N3770P9386K8242j9060j29200l085Q1343j414j01968j79758
$$ -231326 -139710 -85940 -6554 21688 2628 -126572 -129657 -48314 -49728 -151696 -331454
26993c31454M9723J45150J4242M59603K4292n6957k23115o7198k6987J02462K9831
$$ -331454 -281731 -136581 -122339 337264 361556 304599 81484 14286 -12701 89761 119592
26982A19592J26276n105j47833k51507r2520Q6639Q092j12261j37529J09587J46395
$$ 119592 245868 240763 92930 -158577 -251097 -164458 -156366 -268627 -406156 -296569 -150174
26971a50174k7329m0274K8190j3634l2601R5495K04688j15085j80619l06395J18914
$$ -150174 -177503 -217777 -189587 -203221 -235822 -140327 64361 -50724 -231343 -537738 -418824
26960d18824J62073J67203q5841P4306L7007K9650L9845J6726J897M5118J6279
$$ -418824 -256751 -89548 -175389 -101083 -64076 -34426 5419 22145 24042 69160 85439
26949H5439J14104K21951R5023k50150k10375P0982J15470l2648q0425k05246
$$ 85439 199543 421494 516517 266367 55992 126974 242444 209796 129371 -75875
26939g5875j85281l6912J05738J53389P2330O321O9057N5882M7298J58191R1478
$$ -75875 -261156 -298068 -192330 -38941 33389 39710 108767 164649 211947 370138 461616
26928D61616p6153N805L251j38594k67064Q5297J0287k58834k16697n8113J51293
$$ 461616 385463 391268 394519 255925 -11139 74158 84445 -174389 -391086 -449199 -297906
26917b97906K49306o0775P885r174R5032l32518j34877J72544L22122q5946K5347
$$ -297906 -48600 -109375 -101490 -110664 -15632 -348150 -483027 -310483 11639 -74307 -48960
26906d8960J2068J93477K07632k29952j06513j22814K45699K8956q0201L7592
$$ -48960 -36892 156585 364217 134265 27752 -95062 150637 179593 99392 136984
26896A36984J05257j96553j95249M1165K51185l4236j62255L646o3598K2959J58505
$$ 136984 242241 45688 -149561 -108396 142789 108553 -53702 -50056 -113654 -90695 67810
26885F7810j15493j70145J00573K28099J68983J1527Q8277o9442o844j70891m9034
$$ 67810 -47683 -217828 -117255 110844 279827 291354 379631 310189 303345 132454 83420
26874H3420O2306J81735M1025n6092P129j0903q4007p2074n7583L6805R5580n7822
$$ 83420 145726 327461 368486 312394 319523 308620 224613 152539 94956 131761 227341 169519
26862A69519K16675J84180j93298o1882o8552j26297R929Q6390P2823k02898p8672
$$ 169519 386194 570374 377076 315194 246642 120345 130274 216664 289487 86589 7917
26851G917M3782M6162j26695J43618K60519L4525j19130n1836O6859N5220j51220
$$ 7917 51699 97861 -28834 114784 375303 409828 290698 238862 305721 360941 209721
26840B09721p4528k0905l54607o8533n1111O3931J48926j30377J7549J39325J28864
$$ 209721 135193 114288 -240319 -308852 -359963 -296032 -147106 -277483 -259934 -120609 8255
26829H255J33001p5803j88206J4478l2355Q1696o548M3918N3882R5358J62821
$$ 8255 141256 65453 -122753 -108275 -140630 -58934 -65482 -21564 32318 127676 290497
26818B90497K69341j10189j44164k06035k5873J3357q1408O0272L4190J29891
$$ 290497 559838 449649 305485 99450 73577 86934 5526 65798 99988 229879
26808B29879M6865k69966l09568N4647J45444J64844M5350L8416N6698o2602Q7561
$$ 229879 276744 6778 -302790 -248143 -102699 62145 107495 145911 202609 140007 227568
26797B27568K5852l6866l07304p2583J19719m7507q4812q7382j54818l1286r4341
$$ 227568 253420 216554 -90750 -163333 -43614 -91121 -175933 -263315 -418133 -449419 -543760
26786e43760K14533K73163P6369j21471l5190r7884J50760l3183J121J27619j03431
$$ -543760 -329227 -56064 20305 -101166 -136356 -234240 -83480 -116663 -115542 12077 -91354
26775i1354p438J25375O2481Q6702J21872r2106l19487K9491J90769O5093q5184
$$ -91354 -98792 26583 89064 175766 297638 205532 -113955 -84464 106305 171398 86214
26764H6214L7757K7822r9892l2639R2660Q8873j51084j39635K05324M27934J24764
$$ 86214 123971 151793 51901 19262 111922 200795 49711 -89924 115400 543334 668098
26753F68098j20569k63318J07660J72608k53812j53763l1210m6160j18565K37696
$$ 668098 547529 284211 391871 564479 310667 156904 125694 79534 -39031 198665
26743A98665J15885k8361K13564p942r3380j66626l03415R3579j40795k90813
$$ 198665 314550 286189 499753 491811 398431 231805 -71610 21969 -118826 -409639
26733d09639j16502L03635L0072M9161J80548M12937j17433l35300l22191K3603
$$ -409639 -526141 -222506 -192434 -143273 37275 450212 332779 -2521 -324712 -301109
26723c01109J20187K89873o7978J14135K7323k63095l89254L0458J05077J96963
$$ -301109 -180922 108951 40973 155108 182431 -80664 -469918 -439460 -334383 -137420
26713a37420J81189L5044o4679J07206j26837j66765q9945L4171P7543j13978
$$ -137420 43769 78813 14134 121340 -5497 -172262 -262207 -228036 -150493 -264471
26703b64471L0697p5579j58660J00279J19703L4136p8238N3667r0017J21275K72240
$$ -264471 -233774 -309353 -468013 -367734 -248031 -213895 -292133 -238466 -328483 -207208 65032
26692F5032R7126k54100J54566Q3809j71935R7374J37544l48937k43484k2677
$$ 65032 162158 -91942 62624 146433 -25502 71872 209416 -139521 -383005 -405682
26682d05682J15634K56873j06175j34392J07944J95232L0078J31507p0942j63815
$$ -405682 -290048 -33175 -139350 -273742 -165798 29434 59512 191019 120077 -43738
26672d3738k00455n5642J38584Q5436J18152P0382K4365O8359l991K8n0805m1821
$$ -43738 -244193 -299835 -161251 -75815 42337 112719 137084 205443 201452 201480 150675 108854
26660A08854l4042Q3045M914J37465p1353q5534k14953J14312R2390k88317k4433
$$ 108854 74812 157857 162771 300236 228883 143349 -71604 42708 135098 -153219 -177652
26649a77652P5612P3267Q1497R2583m7773j49372K7970o1183J23960K70830j59851
$$ -177652 -102040 -28773 52724 145307 97534 -51838 -23868 -85051 38909 309739 149888
26638A49888j39651j92944k29818N0473p1662L98488J87745k74843l57779K1472
$$ 149888 10237 -182707 -412525 -362052 -433714 -35226 152519 -122324 -480103 -458631
26628d58631k3770P9050J68553n7599J12748q4496n9423J35886k4185P0244n1827
$$ -458631 -482401 -403351 -234798 -292397 -179649 -264145 -323568 -187682 -211867 -141623 -193450
26617a93450k20751j32910J76042J33708J53269K14781J1580q326q364k36743
$$ -193450 -414201 -547111 -371069 -237361 -84092 130689 142269 133943 125579 -111164
26607a11164J1824q8680R4859J15218k04058j21655J8107J62017J56310J19592
$$ -111164 -99340 -188020 -93161 22057 -182001 -303656 -285549 -123532 32778 152370
26597A52370J1092o6784K7015p0944j58944j9098M2740j6257J15223O3677O065
$$ 152370 163462 96678 123693 52749 -106195 -125293 -82553 -98810 16413 80090 86155
26586H6155N6270O156J56590j3536R0110j42960j84243M1009l5861k31138j55913
$$ 86155 142425 148581 305171 291635 381745 238785 54542 95551 59690 -171448 -327361
26575c27361K38142N3650J65311k12084k39068j32969Q4728L23923J54786j61387
$$ -327361 -89219 -35569 129742 -82342 -321410 -454379 -369651 -45728 109058 -52329
26565e2329R7697N0554m5307j917J96284o3714j53938p3198M6931L4885J48024
$$ -52329 45368 95922 50615 48698 244982 181268 27330 -45868 1063 35948 183972
26554A83972J44938l0565m9947J32504J7087k37625Q6854J3656m7528L4125J65339
$$ 183972 328910 298345 248398 380902 397989 160364 247218 260874 213346 247471 412810
26543D12810Q1909o3288j2215N8881l7131k25843l25702p8724K70437k46602j80422
$$ 412810 494719 431431 419216 478097 440966 215123 -110579 -189303 81134 -165468 -345890
26532c45890J94709L8968R82k1249K12411j30477l45533j53631L06554J41563
$$ -345890 -151181 -112213 -111231 -132480 79931 -50546 -396079 -549710 -243156 -101593
26522a01593O0743P6319m7560k09364k00894J16812K2811L5961J34214J0198J57641
$$ -101593 -40850 35469 -12091 -221455 -422349 -305537 -282726 -246765 -112551 -102353 55288
26511E5288J36280J25856j15762o8211Q1781k1878k73762r2398N2772J52063o5824
$$ 55288 191568 317424 201662 133451 215232 193354 -80408 -172806 -120034 32029 -33795
26500c3795k532R4113p6220K588P1643J8158l35981j42176O5017P8250J01815
$$ -33795 -36327 57786 -18434 -15846 55797 73955 -262026 -404202 -339185 -260935 -159120
26489a59120O3669L3462k7153J66307J12713n796r4316M4155K11786l52279k15959
$$ -159120 -95451 -61989 -89142 77165 189878 184082 89766 133921 345707 -6572 -222531
26478b22531N3101J70463K6062k19183l35780l4800J41280K22674L6704k022m0217
$$ -222531 -169430 1033 27095 -192088 -527868 -562668 -421388 -198714 -162010 -164032 -204249
26467b04249o6614o3410R792J56489R5301o1001l6056k906L3006L5645o3100J23047
$$ -204249 -270863 -334273 -324481 -167992 -72691 -133692 -169748 -172654 -139648 -104003 -167103 -44056
26455d4056J63059n9110j76709K05897Q7349P8297q7798k45760J20078K22591
$$ -44056 119003 59893 -116816 89081 176430 254727 166929 -78831 41247 263838
26445B63838j11955j13560k67418K8684J47392k184m4706j53912K18280K52512
$$ 263838 151883 38323 -229095 -200411 -53019 -55203 -99909 -253821 -35541 216971
26435B16971o083j95672R6746r2982J31958j61780l38279m5900K6238K42476L9596
$$ 216971 210888 15216 111962 18980 150938 -10842 -349121 -395021 -368783 -126307 -86711
26424h6711J05397K13366J67212k9063l85003k37816L41711J29535R3771P9383
$$ -86711 18686 232052 399264 370201 -14802 -252618 89093 218628 312399 391782
26414C91782j5178j54622j93806o2899P5953j7510p463J0395k2613j02262K33438
$$ 391782 376604 221982 28176 -34723 41230 23720 16257 26652 4039 -98223 135215
26403A35215K07187K45468j55931l26892j95448R925J31448K7382p676j93007
$$ 135215 342402 587870 431939 105047 -90401 -80476 50972 78354 70678 -122329
26393a22329J4865p0680k6571J17421J45409J29966J63145J8738r4962J39054
$$ -122329 -107464 -178144 -204715 -87294 58115 188081 351226 369964 275002 414056
26383D14056J56726j23522j54554l8275m0479r7707J81957R7082j27357j41075
$$ 414056 570782 447260 292706 254431 213952 116245 298202 395284 267927 126852
26373A26852J05098M2675q8914L421j08881n5310O7254Q0535O0093J13496j26968
$$ 126852 231950 274625 185711 189132 80251 24941 92195 172730 232823 346319 219351
26362B19351j08933Q4356l1759j45654p8717N6744k39901Q9295M12501J00004
$$ 219351 110418 194774 163015 17361 -61356 -4612 -244513 -155218 257283 357287
26352C57287j77372j98808k45189r6306J16513N2232J9966L58888K59105q6909
$$ 357287 179915 -18893 -264082 -360388 -243875 -191643 -171677 187211 446316 359407
26342C59407l05503J84452K89310J31641k6210j39932k65502j39665J08159R410
$$ 359407 53904 238356 527666 659307 633097 493165 227663 87998 196157 205567
26332B05567j65157J23164j60813M5550K15028J29051l651k4207J22823J23463
$$ 205567 40410 163574 2761 48311 263339 392390 388739 364532 487355 610818
26322F10818M858l37841n48538q965K63427P3851O9318J19405p7097J44781J427
$$ 610818 615676 277835 -270703 -279668 -16241 57610 126928 246333 169236 314017 315444
26311C15444k0844Q9632p8032j95985l2674k71731N3278L2796n048j09171r9951
$$ 315444 294600 384232 306200 110215 77541 -194190 -140912 -108116 -113164 -222335 -322286
26300c22286J95073J37382j45563j35421o095K7186n3776j22887k9590L1228R2735
$$ -322286 -127213 10169 -135394 -270815 -276910 -249724 -303500 -426387 -455977 -424749 -332014
26289c32014J88585J37388L3535p8406k17698j80372K07552K24266Q3467m5075
$$ -332014 -143429 -6041 27494 -50912 -268610 -448982 -241430 -17164 66303 21228
26279B1228J03175J821N339K38236q7741q559j83546J64217J94434q7632J4594
$$ 21228 124403 126224 131563 369799 282058 273499 89953 254170 448604 360972 375566
26268C75566j09819j98893p292J71359q9379k33961J47595L53206p5736j70212
$$ 375566 265747 66854 59562 230921 141542 -92419 55176 408382 332646 162434
26258A62434j55243q4813n0388L8811k33166N8357M61003J78799l13681j89968
$$ 162434 7191 -77622 -128010 -89199 -322365 -264008 196995 375794 62113 -127855
26248a27855M216J75419J5280j71257j761J0662q8462j26851O4651K1212L48786
$$ -127855 -123639 51780 67060 -104197 -105958 -95296 -183758 -310609 -245958 -224746 124040
26237A24040L0267J21653M7736k82596j37319J00280p4602q9256q2869m2148Q3085
$$ 124040 154307 275960 323696 41100 -96219 4061 -70541 -159797 -242666 -284814 -201729
26226b01729r0409q9340K2488j1649k1325J42102J01996J09791P1701j19364j52756
$$ -201729 -292138 -381478 -358990 -370639 -391964 -249862 -147866 -38075 33626 -85738 -238494
26215b38494k7235l7957J12279J48670J01237M1918l30849j00329M56851J69249
$$ -238494 -265729 -303686 -191407 -42737 58500 100418 -230431 -330760 126091 295340
26205B95340j48987J00234n9345r3722k44739j30547k10584M922K18000J69580
$$ 295340 146353 246587 187242 93520 -151219 -281766 -492350 -487428 -269428 -99848
26195i9848j2876j66556Q0623J71751J03319J01472L02109l2236k26749k32877
$$ -99848 -112724 -279280 -198657 -26906 76413 177885 479994 447758 221009 -11868
26185a1868Q8602J37341J2911j01115l65087p8380R1940J48338J60438J66929
$$ -11868 76734 214075 226986 125871 -239216 -317596 -225656 -77318 83120 250049
26175B50049k17905j88239K46034J2550R4084J26894j06278j0117q6851j63656
$$ 250049 32144 -156095 89939 102489 196573 323467 217189 207072 120221 -43435
26165d3435r2538k0014j26375K10677R369p3724N9669k61342L2901k9161j13307
$$ -43435 -135973 -155987 -282362 -71685 -62316 -136040 -76371 -337713 -304812 -333973 -447280
26154d47280K3761L9993J00170J769O3672M5635L38180J83501K3956j27915p2438
$$ -447280 -423519 -383526 -283356 -281587 -217915 -172280 165900 349401 373357 245442 173004
26143A73004j41154K3501m8715P9800J2232k34821l39886n507K00519R1257O2888
$$ 173004 31850 55351 6636 86436 98668 -136153 -476039 -481546 -281027 -189770 -126882
26132a26882J1922l0888J14198L7472j21358j83284J95998j27422l20900K06241
$$ -126882 -114960 -145848 -31650 5822 -115536 -298820 -102822 -230244 -551144 -344903
26122c44903L43728j55222k16098J44704Q0205O5043K91586p4284j48717m8422
$$ -344903 -1175 -156397 -372495 -227791 -147586 -82543 209043 134759 -13958 -62380
26112f2380j04776n909k81178j17278K22449K16864l8928j92678L1589K82088
$$ -62380 -167156 -173065 -454243 -571521 -349072 -132208 -171136 -363814 -332225 -50137
26102e0137J1398P7504n4637j78553M1217P1788K01995q9543j45625k49472M416
$$ -50137 -38739 38765 -15872 -194425 -153208 -81420 120575 31032 -114593 -364065 -359649
26091c59649O6302P7640K20829l2105n4356J08267J16261j10840j85399r3511
$$ -359649 -293347 -215707 5122 -26983 -81339 26928 143189 32349 -153050 -246561
26081b46561M4007M5465K62333K40242p8203k94270N1173J07101J34838j22512
$$ -246561 -202554 -157089 105244 345486 267283 -26987 24186 131287 266125 143613
26071A43613j32720p7639J23877R4137J49651j04352r8351N4182j29360j67770
$$ 143613 10893 -66746 57131 151268 300919 196567 98216 152398 23038 -144732
26061a44732K31004J79693J9210k65471J84842j6456o0168r9537q4680L2316J03408
$$ -144732 86272 265965 285175 19704 204546 188090 127922 28385 -56295 -23979 79429
26050G9429j53025J83677J48747k27951j62182K9164q762n7015J42942R7667j66607
$$ 79429 -73596 110081 258828 30877 -131305 -102141 -110903 -167918 -24976 72691 -93916
26039i3916M2026J9107k67254n2263m1269j32437M1363J00465J66572O4778O8334
$$ -93916 -51890 -32783 -300037 -352300 -393569 -526006 -484643 -384178 -217606 -152828 -84494
26028h4494j88742n1971j0164k30875J36066J48041K29115J59800j96020J51068
$$ -84494 -273236 -325207 -335371 -566246 -430180 -282139 -53024 106776 -89244 61824
26018F1824M9517K31584O7252r4338J396N5242R7051J8403m4062j15337o9182
$$ 61824 111341 342925 410177 315839 317235 372477 469528 487931 443869 328532 259350
26007B59350m585m0601j66387k40871J2129Q0702M5630K26872m9876k50366n1371
$$ 259350 254765 214164 47777 -193094 -180965 -100263 -54633 172239 122363 -128003 -179374
25996a79374J57017j64431r8023L02189K88257j00367k04800p2390K46780j21907
$$ -179374 -22357 -186788 -284811 17378 305635 205268 468 -71922 174858 52951
25986E2951k04496n2668L196J47407k2342L9542m5866j45042j33072O3407Q5592
$$ 52951 -151545 -204213 -201017 -53610 -75952 -36410 -82276 -227318 -360390 -296983 -211391
25975b11391r1040R0115J03276J11906J36860j84408L0839r5175l2887P8159J50786
$$ -211391 -302431 -212316 -109040 2866 139726 -44682 -13843 -109018 -141905 -63746 87040
25964H7040P506q4039j2008r7022R4387r3665K9108j54837q1752L9498J71639
$$ 87040 94546 10507 -1501 -98523 -4136 -97801 -68693 -223530 -305282 -265784 -94145
25953i4145J85493J03978m3874j08130o6137K9159O0857L1596J01035k10216j00077
$$ -94145 91348 195326 151452 43322 -22815 6344 67201 98797 199832 -10384 -110461
25942a10461k6623L1732Q4541k5259p9476J50233L35815J56540r0162k55885j61073
$$ -110461 -137084 -105352 -20811 -46070 -125546 24687 360502 517042 426880 170995 9922
25931I922O8854k18824j60362l2647K6223J45969k34023K6882J66286k04162p848
$$ 9922 78776 -140048 -300410 -333057 -306834 -160865 -394888 -368006 -201720 -405882 -413730
25920d13730J5684N2700j70430L3785J96837r0540J04698q3892l4543n398j04209
$$ -413730 -398046 -345346 -515776 -481991 -285154 -375694 -270996 -354888 -389431 -394829 -499038
25909d99038O7489R3423K22254p5266k12425J19704N0213K41739o7910K77865
$$ -499038 -431549 -338126 -115872 -191138 -403563 -283859 -233646 8093 -59817 218048
25899B18048j40109k74722K1063k4600j17095J71514J37737O2330k09963l1163
$$ 218048 77939 -196783 -175720 -200320 -317415 -145901 -8164 54166 -155797 -186960
25889a86960P5788M4032K3672J71073j87596J05600K19309j25432k89653j17968
$$ -186960 -111172 -67140 -43468 127605 -59991 45609 264918 139486 -150167 -268135
25879b68135J25374J30797J23236J67917k793j35518n3939k18922l5912J59150
$$ -268135 -142761 -11964 111272 279189 276396 140878 86939 -131983 -167895 -8745
25869h745K2680M6908l5104q0833J36713j624k10390n6828p989J52791j7835l18456
$$ -8745 13935 60843 25739 -55094 81619 79995 -130395 -187223 -195212 -42421 -60256 -378712
25857c78712K4988J89640J61640j39579j6805n1593J54825j58975j83192R4362
$$ -378712 -353724 -164084 -2444 -142023 -158828 -210421 -55596 -214571 -397763 -303401
25847c03401j0425k2455m0620p3546r7777J29482J42228k6202K45778J82102o6850
$$ -303401 -313826 -336281 -376901 -450447 -548224 -418742 -276514 -302716 -56938 125164 58314
25836E8314k57866l04113J67494K46719j18500j05410n2018k9045N2355j46501
$$ 58314 -199552 -503665 -336171 -89452 -207952 -313362 -365380 -394425 -342070 -488571
25826d88571Q816J02926J7373p8092N7658K48734J67524Q2073K42L03510M2152
$$ -488571 -479755 -376829 -359456 -437548 -379890 -131156 36368 118441 118683 422193 464345
25815D64345k34811k39114n7250l1872K20919R4004M1543p5820m3890R0432r5471
$$ 464345 229534 -9580 -66830 -98702 122217 216221 257764 181944 138054 228486 133015
25804A33015k7660j60414O1356K10243q5141j80403l0931M1258J24378L6367j20419
$$ 133015 105355 -55059 6297 216540 131399 -49004 -79935 -38677 85701 122068 1649
25793A649j27127o8776j56292p998L22685J62930K28747J44334l04775n6319q0452
$$ 1649 -125478 -194254 -350546 -358544 -35859 127071 355818 500152 195377 139058 58606
25782E8606P6632j71866l2966J665M2368K4639J57214P656j50526k06738j75637
$$ 58606 135238 -36628 -69594 -67929 -25561 -922 156292 163948 13422 -193316 -368953
25771c68953K40489p0293j42462J63493J60333J15174p620L5726J45442P0147
$$ -368953 -128464 -198757 -341219 -177726 -17393 97781 90161 125887 271329 341476
25761C41476m6814n8797k69914J02166P0099j30013O1320J0110m142r8470q0310
$$ 341476 294662 235865 -34049 68117 138216 8203 69523 79633 75491 -22979 -103289
25750a03289P6730j64073K23268J72244q0722o0705K6656q0543n7299k83898j18845
$$ -103289 -26559 -190632 32636 204880 124158 63453 90109 9566 -47733 -331631 -450476
25739d50476L3442K8064K76885M9193n936K10737J08910N6143n9916k72354K9329
$$ -450476 -417034 -388970 -112085 -62892 -68828 141909 250819 306962 247046 -25308 4021
25728D021J05360o4146m1308J6241j01736L2724j16603j16021N8967P4202N9423
$$ 4021 109381 45235 3927 20168 -81568 -48844 -165447 -281468 -222501 -148299 -88876
25717h8876m8335M0251K56684J52091r792k37100j25679j03250r2213J46667K47429
$$ -88876 -137211 -96960 159724 311815 302023 64923 -60756 -164006 -256219 -109552 137877
25706A37877R8157j32885l4757O5419j09217j47579n9999L7716J14067j08928
$$ 137877 236034 103149 68392 133811 24594 -122985 -182984 -145268 -31201 -140129
25696a40129l1693n404k219J19981L2918K49490R5620m38068M7026K48579J58755
$$ -140129 -171822 -177226 -179445 -59464 -26546 222944 318564 -119504 -72478 176101 334856
25685C34856r5317j60739j83370J2877J23997O9434o6197K15708J42249m7474
$$ 334856 239539 78800 -104570 -91693 32304 101738 35541 251249 393498 346024
25675C46024j10040o9347n7080N142R6435R2628K91081j35503k16309j62447O670
$$ 346024 235984 166637 109557 114699 211134 303762 594843 459340 243031 80584 87254
25664H7254M0713j49027l9148j63452Q4625K24444J0698P2122J08975o2656o8277
$$ 87254 127967 -21060 -60208 -223660 -139035 85409 96107 168229 277204 214548 146271
25653A46271j63012m2560R6324j5715P6481r5831l5392M5598j32387r3485O1530
$$ 146271 -16741 -59301 37023 21308 97789 1958 -33434 12164 -120223 -213708 -152178
25642a52178J33005M8967j95541P9621j70555j55382L9226K24916J11482P0475
$$ -152178 -19173 29794 -165747 -86126 -256681 -412063 -372837 -147921 -36439 34036
25632C4036j73306o6274K11690O285J57976j7886J238J09022J94912K590k30497
$$ 34036 -139270 -205544 6146 12431 170407 152521 153759 262781 457693 460283 229786
25621B29786j00000q2132j3994j15609k25477j7703j89905K63197J87543J11670
$$ 229786 129786 47654 33660 -81949 -307426 -325129 -515034 -251837 -64294 47376
25611D7376K14994J45005N3637j23628j44147j35879k93741J10479J35003j25137
$$ 47376 262370 407375 461012 337384 193237 57358 -236383 -125904 9099 -116038
25601a16038p0467J10558j2684J60192J4038m538k2756N6507r410P4120j8076
$$ -116038 -186505 -75947 -88631 71561 85599 81061 58305 114812 105402 179522 161446
25590A61446l44784k10272L14673K22281j48315k24711o2270O3606K56004K55630
$$ 161446 -183338 -393610 -78937 143344 -4971 -229682 -291952 -228346 27658 283288
25580B83288j2975j49701j08874J84208k5706k86801p7850n665M06243L26727
$$ 283288 270313 120612 11738 195946 170240 -116561 -194411 -200076 206167 532894
25570E32894K81118j49020k67727m66627j08629K3660J95440q01j30832J08343
$$ 532894 814012 664992 397265 -69362 -177991 -154331 41109 40308 -90524 17819
25560A7819Q4115J07338p5921r4070j9779k05149q1940R3314p6725P1673j13309
$$ 17819 101934 209272 133351 39281 19502 -185647 -267587 -174273 -250998 -179325 -292634
25549b92634j86384M332r5037p4659P1447L82320J90123o6407n331n3913o3627
$$ -292634 -479018 -474686 -569723 -644382 -572935 -190615 -492 -66899 -72230 -126143 -189770
25538a89770p7079J67082n7876r5512j32157J32966j8788o3874J25375k4390J70397
$$ -189770 -266849 -99767 -157643 -253155 -385312 -252346 -271134 -335008 -209633 -234023 -63626
25527f3626K87577m9039l56893j49448R0178N16903M0000k33146o2r0672k88687
$$ -63626 223951 174912 -181981 -331429 -241251 275652 315652 82506 82444 -8228 -296915
25516b96915k29695K3286N01619J17735j29391j62695k89007R5664N7452P7203
$$ -296915 -526610 -503324 -1705 116030 -13361 -176056 -465063 -369399 -311947 -234744
25506b34744L1108K26353l2994k31939P9385J43045j14603J3275Q2153J265J19107
$$ -234744 -203636 22717 -10277 -242216 -162831 -19786 -134389 -121114 -38961 -37696 81411
25495H1411m4556j94503J00561J98478n9834q8322J03746K08811L2833j77759
$$ 81411 36855 -157648 -57087 141391 81557 -6765 96981 305792 338625 160866
25485A60866j42419j74551O0823J75692J38005J24324j42346q1468l0203j99834
$$ 160866 18447 -156104 -95281 80411 218416 342740 200394 118926 88723 -111111
25475a11111l7991j33624j49950K33561J50213J36836R4988j22774J1141R5550
$$ -111111 -149102 -282726 -432676 -199115 -48902 87934 182922 60148 71289 166839
25465A66839m9194j90414Q6108n8835m6086L9186L7205j24458n1985Q6720N8661
$$ 166839 117645 -72769 13339 -45496 -91582 -52396 -15191 -139649 -191634 -104914 -46253
25454d6253J38469l4336N1349j24107k27028o6591m4025J38646J47904j43089
$$ -46253 92216 57880 109229 -14878 -241906 -308497 -352522 -213876 -65972 -209061
25444b09061k0275J81406J70733R8644Q9930k11739j01712n800j48982k55694
$$ -209061 -229336 -47930 122803 221447 311377 99638 -2074 -7874 -156856 -412550
25434d12550K1042J37389J56801K25179P1055K1746K4574K0108l0666j09600j80242
$$ -412550 -391508 -254119 -97318 127861 198916 220662 245236 265344 234678 125078 -55164
25423e5164N3177o2884J27284l2996J30242r0262j87460k64143r6438J87293l0875
$$ -55164 -1987 -64871 62413 29417 159659 69397 -118063 -382206 -478644 -291351 -322226
25412c22226K77334M67989K00204j07065k12699k25471n9449j36108r0998K61053
$$ -322226 -44892 423097 623301 516236 303537 78066 18617 -117491 -208489 52564
25402E2564J55546M9258j04504J22740L5095K69869j30521k09560j04826J94293
$$ 52564 208110 257368 152864 275604 310699 580568 450047 240487 135661 329954
25392C29954N5358j38596j75187j72831J04077n5952p7481N0985M8819j58278
$$ 329954 385312 246716 71529 -101302 2775 -53177 -130658 -79673 -30854 -189132
25382a89132k6083k0041k42329K07014k0038M0737O0483K33357l2420r7874j6068
$$ -189132 -215215 -235256 -477585 -270571 -290609 -249872 -189389 43968 11548 -86326 -102394
25371a02394o8343O6035K64945j10956l04950j87438L48815J13960k1606N8125
$$ -102394 -170737 -104702 160243 49287 -255663 -443101 -94286 19674 -1932 56193
25361E6193J8663L3824Q6928l14253P4115m2971j63503p9393k2663J43884o8076
$$ 56193 74856 108680 195608 -118645 -44530 -87501 -251004 -330397 -353060 -209176 -277252
25350b77252j51430N217m9981J8105j3326L08616J16687N8641j95033p0397Q9701
$$ -277252 -428682 -423465 -473446 -455341 -468667 -160051 -43364 15277 -179756 -250153 -160452
25339a60452l3262j05077l809L95886Q7905N4039j14283J26189L0082p0007p9004
$$ -160452 -193714 -298791 -302600 93286 181191 235230 120947 247136 277218 207211 128207
25328A28207R480K03663K505j44995J42247K4486O7257k0546j54322o8886j39618
$$ 128207 137687 341350 343855 198860 341107 365593 432850 412304 257982 189096 49478
25317D9478j87207J4410r5599o0275J36177J19918j63397p2665J71000K2665l4516
$$ 49478 -137729 -123319 -218918 -279193 -143016 -23098 -186495 -259160 -88160 -65495 -100011
25306a00011r520j70605J07599J82893n5076j40158M4309j13401q8288j6061j1240
$$ -100011 -109531 -280136 -172537 10356 -44720 -184878 -140569 -253970 -342258 -358319 -369559
25295c69559L8347O4537p195j94564M0779K01632k8755J87720K09431J24065O2566
$$ -369559 -331212 -266675 -273870 -468434 -427655 -226023 -254778 -67058 142373 266438 329004
25284C29004O8493k9749J75052k67593k89890N0650k1823j1011j00550j70516
$$ 329004 397497 367748 542800 275207 -14683 35967 14144 3133 -97417 -267933
25274b67933r7896K05359J50576L8848K80553j30635k04310k34462q1289r940
$$ -267933 -365829 -160470 -9894 28954 309507 178872 -25438 -259900 -341189 -351129
25264c51129J69837J48003k48623j65035J71491J93066N9574j89718K30360K30083
$$ -351129 -181292 -33289 -281912 -446947 -275456 -82390 -22816 -212534 17826 247909
25254B47909k7861L4832N0030l19881p3560J58048j92501J37219O4510M8466j1017
$$ 247909 220048 254880 304910 -14971 -88531 69517 -122984 14235 78745 127211 116194
25243A16194j5542n9851q2662j09955k47451P775K94528K58919j09582k10465
$$ 116194 100652 40801 -41861 -151816 -399267 -391492 -96964 161955 52373 -158092
25233a58092K7068n2511j56904K6046m9984J44875k0044Q355K482J83932J59540
$$ -158092 -131024 -183535 -340439 -314393 -364377 -219502 -239546 -231191 -228709 -44777 114763
25222A14763M3830L6129k81629q4652L13763j37253j45110n3001n7530p601K67298
$$ 114763 158593 194722 -86907 -171559 142204 4951 -140159 -193160 -250690 -258291 9007
25211I007Q0149p4118l9025j13810m2100K32154k45289j2643J26558J40820j9757
$$ 9007 89156 15038 -23987 -137797 -179897 52257 -193032 -205675 -79117 61703 41946
25200D1946Q6612q1863M6950j20457Q444o8734k75162P6186L29369L2737M9314
$$ 41946 128558 46695 93645 -26812 -18368 -87102 -362264 -286078 43291 76028 125342
25189A25342j14422m7720K83662O4005k42707j06895j8785j39736J51900J02975
$$ 125342 10920 -36800 246862 310867 68160 -38735 -57520 -197256 -45356 57619
25179E7619m0300P6973r7177K7812J62233J42026m3126n7114k11685j62796P300
$$ 57619 17319 94292 -2885 24927 187160 329186 286060 228946 17261 -145535 -138235
25168a38235R7969j1547j44597l4501J62713J14980K14652j18605o1449j15400
$$ -138235 -40266 -51813 -196410 -230911 -68198 46782 261434 142829 81380 -34020
25158c4020M0606J56009N5593p4198p9079j06535j16861J63289j21862j14463
$$ -34020 6586 162595 218188 143990 64911 -41624 -158485 4804 -117058 -231521
25148b31521K15623K31319J27130M5930J44771j38716o2299k09677j17290j2892
$$ -231521 -15898 215421 342551 388481 533252 394536 332237 122560 5270 -7622
25138g622L2591k90687l8344J43836J41762R4166R1669q9264j7943K7088j82829
$$ -7622 24969 -265718 -304062 -160226 -18464 75702 167371 78107 60164 87252 -95577
25127i5577J11225L13J85911j66480k29018J96580L06478L69296p8519k82001
$$ -95577 15648 15961 201872 35392 -193626 2954 309432 678728 600209 318208
25117C18208k21821j90638k69257L5122L4200j04059J9763J43236J73543L4078
$$ 318208 96387 -94251 -363508 -328386 -294186 -398245 -378482 -235246 -61703 -27625
25107b7625Q173n1602r2978J2223K16471l428m7144K5851O9012k35447j24750
$$ -27625 -19452 -71054 -164032 -151809 64662 61234 14090 39941 108953 -126494 -251244
25096b51244J63118O1178O7634j63983j00484J73229j5569M3575K06820q015j00390
$$ -251244 -88126 -26948 40686 -123297 -223781 -50552 -66121 -22546 184274 176259 75869
25085G5869O628K5115l41527J09938K24225J48599o1989r8515P4631m6780K4688
$$ 75869 82497 107612 -233915 -123977 100248 248847 186858 88343 162974 116194 140882
25074A40882k05045k009J07021J75832Q5466n1130K05027j9302k10679j25431
$$ 140882 -64163 -66172 40849 216681 302147 251017 456044 436742 226063 100632
25064A00632K96488J77320k05638j41376L4359k96390q5931J3094J36165R0665
$$ 100632 397120 574440 368802 227426 261785 -34605 -120536 -107442 28723 119388
25054A19388r4199J6925l7290J7462m3179K08197l493j32701N7843j58209j67135
$$ 119388 25189 42114 4824 22286 -20893 187304 183811 51110 108953 -49256 -216391
25043b16391J26340j7752m6372M31929K11375o865j4732o7933M0847J78188r0424
$$ -216391 -90051 -107803 -154175 277754 489129 482264 467532 399599 440446 618634 528210
25032E28210j86255j8128j33558O1532j14151N0597p566J849p8964p1383P7937
$$ 528210 341955 323827 190269 251801 137650 188247 180681 182530 103566 32183 110120
25021A10120J64385k12161l23639M2474K21694r8958R0237k8039o7584j00069
$$ 110120 274505 62344 -261295 -218821 2873 -96085 -5848 -33887 -101471 -201540
25011b01540r9521k3802Q8368O9585P7329N168R0437q0503o7728j8516P0091L9297
$$ -201540 -301061 -324863 -236495 -166910 -89581 -84413 6024 -74479 -142207 -160723 -90632 -51335
24999e1335L8278q3745r8714j30267L8624Q7595M407K62321p5346q4901j04276
$$ -51335 -13057 -96802 -195516 -325783 -287159 -199564 -195157 67164 -8182 -93083 -197359
24988a97359J6768k8804J62305q6558k46520K96692L18491k1535j55698M6470
$$ -197359 -180591 -209395 -47090 -133648 -380168 -83476 235015 213480 57782 104252
24978A04252j14745P570K8924o1508J24610j66433o8159L97923L88175l3311o3070
$$ 104252 -10493 -2923 26001 -35507 89103 -77330 -145489 252434 640609 607298 544228
24967E44228j29542l32440k7699J8277k03627l96990K45064J05611m6703m9366
$$ 544228 414686 82246 54547 72824 -130803 -527793 -282729 -177118 -223821 -273187
24957b73187O3658j31111n8297j1134Q3138J32101J10502M8743r905j61425j23032
$$ -273187 -209529 -340640 -398937 -410071 -326933 -194832 -84330 -35587 -45492 -206917 -329949
24946c29949K11006L39774l08680n0173J40235J4494K5663j87988k8180j15663
$$ -329949 -118943 220831 -87849 -138022 2213 16707 42370 -145618 -173798 -289461
24936b89461K29197K66408K5430M544Q0457n1611j23645k48686J28974p1678M9204
$$ -289461 -60264 206144 231574 236118 316575 264964 141319 -107367 21607 -50071 -867
24925h67L3092j24304p2275j1170J04696n4163k08429K01397j10205n7047J20050
$$ -867 32225 -92079 -164354 -175524 -70828 -124991 -333420 -132023 -242228 -299275 -179225
24914a79225J81989J44285J24467Q8493j65736j83094J66720L8294L1804q4058
$$ -179225 2764 147049 271516 360009 194273 11179 177899 216193 247997 163939
24904A63939L0144m9131j54989j58928Q4572M9693M8525j34536R9173N7264n8403
$$ 163939 194083 144952 -10037 -168965 -84393 -34700 13825 -120711 -21538 35726 -22677
24893b2677Q8585R7880K23045q3172j36161k60377N4660N7257n5948j48435q7446
$$ -22677 65908 163788 386833 303661 167500 -92877 -38217 19040 -36908 -185343 -272789
24882b72789j82345r3922K0638J61568J87386k0488N9845J7943J11201R0286N4011
$$ -272789 -455134 -549056 -528418 -366850 -179464 -199952 -140107 -122164 -10963 79323 133334
24871A33334j39902k33346k3492R8838J67752j13366k209l7604m5377K3438K0697
$$ 133334 -6568 -239914 -263406 -164568 3184 -110182 -112391 -149995 -195372 -171934 -151237
24860a51237o0524R2107N5637L5236K19208J34423N9315j0066j63866j7926l42392
$$ -151237 -211761 -119654 -64017 -28781 190427 324850 384165 374099 210233 192307 -150085
24849a50085k06787p7325Q7796J76370K42247K09494j33899j17014P087q2008
$$ -150085 -356872 -434197 -346401 -170031 72216 281710 147811 30797 37884 -44124
24839d4124J95082M1237o4610r8144j06183j07414J12904j4570Q3639k34310l8110
$$ -44124 150958 192195 127585 29441 -76742 -184156 -71252 -85822 -2183 -236493 -274603
24828b74603K01712K7323j42767j74009M16424L32744J79016k85642m9271j40600
$$ -274603 -72891 -45568 -188335 -362344 54080 386824 565840 280198 230927 90327
24818I0327L5891O1270m26059m80362O6770K40109M9054K41053K29761J14002
$$ 90327 126218 187488 -238571 -718933 -652163 -412054 -363000 -121947 107814 221816
24808B21816k35118j96948k1470Q2767K66939N936k67858l18387J43245J8513
$$ 221816 -13302 -210250 -231720 -148953 117986 123922 -143936 -462323 -319078 -300565
24798c00565J57309K84084j40587k55417J22400R7338m4321r6988J29509l9646
$$ -300565 -143256 140828 241 -255176 -132776 -35438 -79759 -176747 -47238 -86884
24788h6884l1486l6907o6629K9195K5523L15296J65497k4582k13794J36023j23755
$$ -86884 -118370 -155277 -221906 -192711 -167188 148108 313605 289023 75229 211252 87497
24777H7497m5766N5601m4755k07794M9362J6759k07911R8699L66328J12205q7095
$$ 87497 41731 97332 52577 -155217 -105855 -89096 -297007 -198308 168020 280225 193130
24766A93130k58500j42578R0133J29777M8581j0198j50893q1550K35290k4042
$$ 193130 -65370 -207948 -117815 11962 60543 50345 -100548 -182098 53192 29150
24756B9150J43661r5447J0889K3341j82835j91711l8516J14655J89184j82849
$$ 29150 172811 77364 88253 111594 -71241 -262952 -301468 -186813 2371 -180478
24746a80478k16145j42545J02395J08378J13974N9217N8615Q9732J4175m47216
$$ -180478 -396623 -539168 -436773 -328395 -214421 -155204 -96589 -6857 7318 -439898
24736d39898j0761J19374J21706r417k05403j89869J09455K24499J50492j04236
$$ -439898 -450659 -331285 -209579 -218996 -424399 -614268 -504813 -280314 -129822 -234058
24726b34058j24766L4303r42L8297K55534J72314J35586n7652k10032j00354L5616
$$ -234058 -358824 -324521 -325463 -287166 -31632 140682 276268 218616 8584 -91770 -56154
24715e6154J00464L7660J14963j75494k19042J26814r2665q9553j49229m3092
$$ -56154 44310 81970 196933 21439 -197603 -70789 -163454 -253007 -402236 -445328
24705d45328K66532K49674J66495J79290J1618k08169j8180q2707L5715K7547
$$ -445328 -178796 70878 237373 416663 428281 220112 201932 119225 154940 182487
24695A82487j5442K3734J16318k18677r4480K18890j97158o6277p2672K5577K10980
$$ 182487 167045 190779 307097 88420 -6060 212830 15672 -50605 -123277 -97700 113280
24684A13280m2075j72175j20585J21065J32659j12990J44963K06166j26462j14684
$$ 113280 71205 -100970 -221555 -100490 32169 -80821 64142 270308 143846 29162
24674B9162k63556L5609K10701J67190k17870r1820j24100o7232J08797J30320
$$ 29162 -234394 -198785 11916 179106 -38764 -130584 -254684 -321916 -213119 -82799
24664h2799K2006j3815j74285j583j29211P5033j13470r5592p8726Q3103J35255
$$ -82799 -60793 -74608 -248893 -250476 -379687 -304654 -418124 -513716 -592442 -509339 -374084
24653c74084J10332J2307O4244J55600j33086o0237L09626J87022M0076j37082
$$ -374084 -263752 -251445 -187201 -31601 -164687 -224924 84702 271724 311800 174718
24643A74718N2693K0238j24312R8388K54631Q1477j94932j69516j71986j14241
$$ 174718 227411 247649 123337 221725 476356 557833 362901 193385 21399 -92842
24633i2842J95587P6011r3589p8398j01143j24425j86333P7114j06091j1019K81045
$$ -92842 102745 178756 85167 6769 -94374 -218799 -405132 -328018 -434109 -445128 -164083
24622a64083J46326n8855J65794M83916q3906j61018k89102o4468J86780J45139
$$ -164083 -17757 -76612 89182 573098 489192 328174 39072 -25396 161384 306523
24612C06523j50828l51350m3262J60319J18818j5785j74515n4704J60568N4041
$$ 306523 155695 -195655 -238917 -78598 40220 24435 -150080 -204784 -44216 9825
24602I825r1830J78830p2883q9990J16661J16069l9047q3197r4072K66173q9819
$$ 9825 -82005 96825 23942 -66048 50613 166682 127635 44438 -49634 216539 126720
24591A26720j35798j77642m7665L1446m5808J59788J70504L7086j18624p1191
$$ 126720 -9078 -186720 -234385 -202939 -248747 -88959 81545 118631 7 -71184
24581g1184J46353K04857n1054l40053n1799p5022k43238J07784R1741K08833
$$ -71184 75169 280026 228972 -111081 -162880 -237902 -481140 -373356 -281615 -72782
24571g2782l5084P4566K54694r4322j80206j79868N9806K53945J05576O488j78373
$$ -72782 -107866 -33300 221394 127072 -53134 -233002 -173196 80749 186325 192813 14440
24560A4440j77539L7264J42570j25542J0876Q1328j82834j28004J68024J39414
$$ 14440 -163099 -125835 16735 -108807 -97931 -16603 -199437 -327441 -159417 -20003
24550b0003K19348R652j1954o8654j4818j51813p1513K6705k18231P1921P6181
$$ -20003 199345 208997 197043 128389 113571 -38242 -109755 -83050 -301281 -229360 -153179
24539a53179K8826k29758J65593L95467J60486j71712r8823j2229j5188m6567
$$ -153179 -124353 -354111 -188518 206949 367435 195723 96900 84671 69483 22916
24529B2916k9306R1649K26577m0919k00759l3982J36862r0857O1441L01700j8479
$$ 22916 -6390 85259 311836 270917 70158 36176 173038 82181 143622 445322 426843
24518D26843k62170j41684J39653J17347k74874k54532M4188K115N1456j99015
$$ 426843 164673 22989 162642 279989 5115 -249417 -205229 -203114 -151658 -350673
24508c50673N9583P9488o3893K63024j11973q8684L25990L23525J48104j84475
$$ -350673 -291090 -211602 -275495 -12471 -124444 -213128 112862 436387 584491 400016
24498D00016O1968k83225k78598k21554J82148K26752j34322m6438k7112r161
$$ 400016 461984 178759 -99839 -321393 -139245 87507 -46815 -93253 -120365 -129526
24488a29526K5641J85238K03158K0175j11070k02535k47499O5904J55587n102
$$ -129526 -103885 81353 284511 304686 193616 -8919 -256418 -190514 -34927 -40029
24478d0029P7207K3578j71261j1306j38012J60281K24030q2278l2078j24563j4029
$$ -40029 37178 60756 -110505 -121811 -259823 -99542 124488 42210 10132 -114431 -128460
24467a28460J70134L5683N0181k0850K8005J5426J60951J0212l13704j01609p9896
$$ -128460 41674 77357 127538 106688 134693 150119 311070 321282 7578 -94031 -173927
24456a73927K11779J66385P9578L36805K07560l21958j75384k09368k56831O4241
$$ -173927 37852 204237 283815 620620 828180 506222 330838 121470 -135361 -71120
24446g1120j6389L5534q5447p5920j30632J67795R3916k1974M7136N6729O1479
$$ -71120 -87509 -51975 -137422 -213342 -343974 -176179 -82263 -104237 -57101 -372 61107
24435F1107m791r3429k31061p8074N6633J88358J66457J25798j30911r2846R2753
$$ 61107 56316 -37113 -268174 -346248 -289615 -101257 65200 190998 60087 -32759 59994
24424E9994m206o8897J84861j08525j51188P8020j14317M5261M5052R4780J44906
$$ 59994 55788 -13109 171752 63227 -87961 -9941 -124258 -78997 -33945 60835 205741
24413B05741j02796l8258j56878j71073j12218l4879p1762M2425J05660N9225
$$ 205741 102945 64687 -92191 -263264 -375482 -410361 -482123 -439698 -334038 -274813
24403b74813L02173K39305J59350K8341k19388j26332K27175j10921J0053K20338
$$ -274813 27360 266665 426015 454356 234968 108636 335811 224890 234943 455281
24393D55281M5939R9456k09745k41451j12205j48860j06622r1771q4354j35191
$$ 455281 501220 600676 390931 149480 37275 -111585 -218207 -309978 -394332 -529523
24383e29523J4765M5479J17613O2411P7585j33978j35758p1642J19829M05637
$$ -529523 -514758 -469279 -351666 -289255 -211670 -345648 -481406 -553048 -433219 -27582
24373b7582M5316R6429q2075J70100l1823j92131l5997J12712o2547j91471N0141
$$ -27582 17734 114163 32088 202188 170365 -21766 -57763 54949 -7598 -199069 -148928
24362a48928R6313r3591O1482J93803Q6435j0116j3868P0963Q3089l15877k21555
$$ -148928 -52615 -146206 -84724 109079 195514 185398 171530 242493 325582 9705 -211850
24351b11850p3395n4827L7688l5319R1329J06784L352K27106N8726q4131J6695
$$ -211850 -285245 -340072 -302384 -337703 -246374 -139590 -136238 90868 149594 65463 82158
24340H2158J13458P6718J68419j25828l02882j14595N3568R4041N2188P4304j15443
$$ 82158 195616 272334 440753 314925 12043 -102552 -48984 45057 97245 171549 56106
24329E6106l3475O8329l9774K2698m7799j80043J17439j08956j80992P9694M0803
$$ 56106 22631 90960 51186 73884 26085 -153958 -36519 -145475 -326467 -246773 -205970
24318b05970j44055K98963J94918p7049j07757P0399j62312k80973j12508K99865
$$ -205970 -350025 -51062 143856 66807 -40950 29449 -132863 -413836 -526344 -226479
24308b26479K63384K36252J65238j64327j31950k1916J53864J02829j84022k66359
$$ -226479 36905 273157 438395 274068 142118 120202 274066 376895 192873 -73486
24298g3486j64420J44232K75080Q1315k36068J32615K31825J73193j70635k52955
$$ -73486 -237906 -93674 181406 262721 26653 159268 391093 564286 393651 140696
24288A40696j63601n1356J83836P6598J8952n4465r8639J47294n6060l51535k09932
$$ 140696 -22905 -74261 109575 186173 205125 150660 52021 199315 143255 -208280 -418212
24277d18212k63595J88062J03680P0144m627J28010k7145k65623Q7111J72254
$$ -418212 -681807 -493745 -390065 -319921 -324548 -196538 -223683 -489306 -402195 -229941
24267b29941K01859J19466o035j41618j23884R8489j02655M9763l4024o129M6402
$$ -229941 -28082 91384 85349 -56269 -180153 -81664 -184319 -134556 -168580 -174709 -128307
24256a28307K7460k33465j37951K93495K21097n51n8908K9670K29808N0634j78482
$$ -128307 -100847 -334312 -472263 -178768 42329 41778 -17130 12540 242348 292982 114500
24245A14500k43322j33851o7980J45180J1756M2260K16207J6889r4149q7801q6461
$$ 114500 -128822 -262673 -330653 -185473 -173717 -131457 84750 101639 7490 -80311 -166772
24234a66772N1696k3208M9570R3266k69635j6232m5254J10272L3770j22303K94274
$$ -166772 -115076 -138284 -88714 4552 -265083 -281315 -326569 -216297 -182527 -304830 -10556
24223a0556P2787O2010J73617j04788j64716k72992J07928l9201k31904M5620
$$ -10556 62231 124241 297858 193070 28354 -244638 -136710 -175911 -407815 -362195
24213c62195l354J32770J40725r6133J1050j54448P5463p2835J36680K49726K8350
$$ -362195 -365549 -232779 -92054 -188187 -177137 -331585 -256122 -328957 -192277 57449 85799
24202H5799j3083J05874N0012j91841N8365j1660J78828k27460j15206k0653j7171
$$ 85799 72716 178590 228602 36761 95126 83466 262294 34834 -80372 -101025 -118196
24191a18196n6001J56895J48711L1637K6856j13110j22088j83615r4361J05752
$$ -118196 -174197 -17302 131409 163046 189902 76792 -45296 -228911 -323272 -217520
24181b17520M4378K15477n0651Q0115j75947j57028M7723J06720P4959N3821J858
$$ -217520 -173142 42335 -8316 71799 -104148 -261176 -213453 -106733 -31774 22047 23905
24170B3905O921J06972m0333q9995j13640j20264j08976L1610K44775P9800L53714
$$ 23905 30826 137798 97465 7470 -106170 -226434 -335410 -303800 -59025 20775 374489
24159C74489J14651j77806k95362j28912q7061J10253J07730m9221j70558k11176
$$ 374489 489140 311334 15972 -112940 -200001 -89748 17982 -31239 -201797 -412973
24149d12973j6784J49516J94828N6624O6404m7857l8863J41534o3856q8186o8724
$$ -412973 -429757 -280241 -85413 -28789 37615 -10242 -49105 92429 28573 -59613 -128337
24138a28337J26898m2386M3048k97441j00724N2089J40747K66349J62127j90379
$$ -128337 -1439 -43825 -777 -298218 -398942 -346853 -206106 60243 222370 31991
24128C1991j90888k2779J89561L03013O6440j74644J04169n6395k26507j19946
$$ 31991 -158897 -181676 7885 310898 377338 202694 306863 250468 23961 -95985
24118i5985J63330j9157k4235L9225k82240j01936J72641j42568Q674N2939R5498
$$ -95985 67345 48188 23953 63178 -219062 -320998 -148357 -290925 -282251 -229312 -133814
24107a33814l9112q2043q8412j092J84597K69318l5347J22759j20315j74865j61871
$$ -133814 -172926 -254969 -343381 -344473 -159876 109442 74095 196854 76539 -98326 -260197
24096b60197R7347J1800m0393O9765J75928O7433N8277J85033j2081l60080k49646
$$ -260197 -162850 -151050 -191443 -121678 54250 121683 179960 364993 352912 -7168 -256814
24085b56814j13456N4445K06348k3974J08795j1839n4448r7488N0567L4016o6086
$$ -256814 -370270 -315825 -109477 -133451 -24656 -36495 -90943 -188431 -137864 -103848 -169934
24074a69934l0757J80062L26355j32613j23174j08340K9556J63956k3038L8136
$$ -169934 -200691 -20629 305726 173113 49939 -58401 -28845 135111 112073 150209
24064A50209L6486k14362q2487K20477M3953O282l0661p615O8889j23166l9684
$$ 150209 186695 -27667 -110154 110323 154276 160558 129897 122282 191171 68005 28321
24053B8321N0594O6310j45811p0636R4786J88376O5638j22314P6835O7100j91548
$$ 28321 78915 145225 -586 -71222 23564 211940 277578 155264 232099 299199 107651
24042A07651k65819J914J21857j9336J25544N3578J0957j24198j02641J06697
$$ 107651 -158168 -156254 -34397 -53733 71811 125389 136346 12148 -90493 16204
24032A6204J43606o1459m2712Q7984r8131l35387j49283K60127M61899j3461P4344
$$ 16204 159810 98351 55639 143623 45492 -289895 -439178 -179051 282848 269387 343731
24021C43731J65067r9196k05464K7868l5513j82493j75821j0244K08852P619j28428
$$ 343731 508798 409602 204138 232006 196493 14000 -161821 -172065 36787 44406 -84022
24010h4022K1660j2842J90704J09086j94717k2502N9397j43172k23105J49926
$$ -84022 -62362 -75204 115500 224586 29869 7367 66764 -76408 -299513 -149587
24000a49587K67627o0271J2790J9685k03487p6614K32861l0855j24013J36460
$$ -149587 118040 57769 70559 90244 -113243 -189857 43004 12149 -111864 24596
23990B4596q0939j64254j8795K2264K03304M78465p1556p3295O5170m1710p0370
$$ 24596 -56343 -220597 -239392 -217128 -13824 464641 393085 319790 384960 343250 272880
23979B72880o2502p4649J7172l5946j14098J1634k3236o5575M5307J48600J4087
$$ 272880 210378 135729 152901 116955 2857 14491 -8745 -74320 -29013 119587 133674
23968A33674j37790q1183k10241j73329J43663J94146l2507q3952O8002L4311
$$ 133674 -4116 -85299 -295540 -468869 -325206 -131060 -163567 -247519 -179517 -145206
23958a45206j4775K8101q6927j98099J24219o554j3252k3357k8471L9760M8988
$$ -145206 -159981 -131880 -218807 -416906 -292687 -299241 -312493 -335850 -364321 -324561 -275573
23947b75573R9709P7254q066N4573k50272q2806J36486O7815M4039O8279l714
$$ -275573 -175864 -98610 -106676 -52103 -302375 -385181 -248695 -180880 -136841 -68562 -72276
23936g2276R508j91723j75804J29702K89241O0986P8335n3245K6204P7997r6084
$$ -72276 -62768 -254491 -430295 -300593 -11352 49634 127969 74724 100928 178925 82841
23925H2841k20722k96793N7428L58013J05152Q7468j7733j25659j04791j42897
$$ 82841 -137881 -434674 -377246 -19233 85919 173387 155654 29995 -74796 -217693
23915b17693k8521j19125K64355K28004m4587o3077N8588J14382J07199o3453
$$ -217693 -246214 -365339 -100984 127020 82433 19356 77944 192326 299525 236072
23905B36072j62265K41983K7121k31480j49162M5401K3066O6766j17147k46091
$$ 236072 73807 315790 342911 111431 -37731 7670 30736 97502 -19645 -265736
23895b65736j52112P2199R6818P8434p4637J49385Q9126j30593k6526R6595k43235
$$ -265736 -417848 -345649 -248831 -170397 -245034 -95649 -6523 -137116 -163642 -67047 -310282
23884c10282j99605K01992K26090J84287Q758j91489p2986j8604J65029p8643
$$ -310282 -509887 -307895 -81805 102482 111240 -80249 -153235 -171839 -6810 -85453
23874h5453m8142M2670m4741O0353J35409K69988k6087l11992k77408l2575J35747
$$ -85453 -133595 -90925 -135666 -75313 60096 330084 303997 -7995 -285403 -317978 -182231
23863a82231J54629N0923o288Q4040q4665j37205K8677n4481P9131J80663M4065
$$ -182231 -27602 23321 17033 101073 16408 -120797 -92120 -146601 -67470 113193 157258
23852A57258j4936o1140Q4658k1720q0727J83567J1547q2358l2256J72439q7407
$$ 157258 142322 81182 165840 144120 63393 246960 258507 176149 143893 316332 228925
23841B28925Q9004p9245q8820o0969o040j49146m3158J28371P097M4165k79631
$$ 228925 317929 238684 149864 88895 82855 -66291 -109449 18922 26019 70184 -209447
23830b09447l57823j0088M40133L27807R3879j99040K3056N8137j68810k15004
$$ -209447 -567270 -577358 -137225 190582 284461 85421 108477 166614 -2196 -217200
23820b17200m132j82j14417J05991K30042M9286J6412M3234j53321p0950K30615
$$ -217200 -221332 -221514 -335931 -229940 102 49388 65800 109034 -44287 -115237 115378
23809A15378J15002r0241L083j28882o8776Q5166Q2626o7728j53614q1338j60902
$$ 115378 230380 140139 143222 14340 -54436 30730 113356 45628 -107986 -189324 -350226
23798c50226J03064J37232K54506J19957m9169k88560j58470J11999K77622K09885
$$ -350226 -247162 -109930 144576 264533 215364 -73196 -231666 -119667 157955 367840
23788C67840k03833j36997j3445j38906M1065Q4616M1378q8280k9205n4399r0433
$$ 367840 164007 27010 13565 -125341 -84276 340 41718 -46562 -75767 -130166 -220599
23777b20599l9454M8412j549l0549l9323K20536K25743k81358q2869M1689J1789
$$ -220599 -260053 -211641 -213190 -243739 -283062 -62526 163217 -118141 -201010 -159321 -147532
23766a47532n0154o3439R7582K69236k1278Q9730o7394k68184j68842p961k589
$$ -147532 -197686 -261125 -163543 105693 84415 174145 106751 -161433 -330275 -338236 -340825
23755c40825J30977j36489o9588L06336J33228j24821N3784L70000L10129q3336
$$ -340825 -209848 -346337 -415925 -109589 23639 -101182 -47398 322602 632731 549395
23745E49395j90261j45901o3931N4359K97k33917l9481M8934q6203o4764J8666
$$ 549395 359134 213233 149302 203661 203958 -29959 -69440 -20506 -106709 -171473 -152807
23734a52807L006K72656J09772k31489k38732j51741k2455R6093J27979k7912
$$ -152807 -149801 122855 232627 1138 -237594 -389335 -411790 -315697 -187718 -215630
23724b15630m8351n9292K2410J32889J15314J07850q9282j69271r0832J99726
$$ -215630 -263981 -323273 -300863 -167974 -52660 55190 -34092 -203363 -294195 -94469
23714i4469N5741j24529j78352m3205K44682n998q3821J42825J54376j46065R1576
$$ -94469 -38728 -163257 -341609 -384814 -140132 -146130 -229951 -87126 67250 -78815 12761
23703A2761m820q0256r7113j04002k9206K32519p9216j53532l2235Q9910k85686
$$ 12761 7941 -72315 -169428 -273430 -302636 -70117 -149333 -302865 -335100 -245190 -530876
23692e30876k94866l9814K95486K89547J29557j41951J82936J02699l34947j9001
$$ -530876 -825742 -865556 -570070 -280523 -150966 -292917 -109981 -7282 -342229 -361230
23682c61230J51657J47157R6542J50311J07579j69854l98344j05208J04706j9982
$$ -361230 -209573 -62416 34126 184437 292016 122162 -276182 -381390 -276684 -296666
23672b96666K99399J15137Q05j34717o5550l6200N5029Q9834p0520j31404j42701
$$ -296666 2733 117870 118675 -16042 -81592 -117792 -62763 27071 -43449 -174853 -317554
23661c17554j9279J41603K25347j77479l89222K42708L45232K1377K2771J43180
$$ -317554 -336833 -195230 30117 -147362 -536584 -293876 51356 72733 95504 238684
23651B38684J5986J38659Q5197j43911o9017j02504j57779j52996j69272j21750
$$ 238684 254670 393329 478526 334615 265598 163094 5315 -147681 -316953 -438703
23641d38703K10082J2099n7134N596K9714o38M1651J84253L11114Q0582j02285
$$ -438703 -228621 -216522 -273656 -268060 -238346 -238984 -197333 -13080 298034 378616 276331
23630B76331n29318R4285j22848k0115p8811K3282K66219R8261J71845M039l93341
$$ 276331 -252987 -158702 -281550 -301665 -380476 -357194 -90975 7286 179131 183170 -210171
23619b10171j24924j7675M2401J10131j63076J90028J03734J12460k13173j91706
$$ -210171 -335095 -352770 -310369 -200238 -363314 -173286 -69552 42908 -170265 -361971
23609c61971j89023J34625P3576J96770K15014J00132K50249J4854k4759j63672
$$ -361971 -550994 -416369 -342793 -146023 68991 169123 419372 434226 409467 245795
23599B45795q1357m6669j68758m10412j46895J37493j10345J77534L26050P6537
$$ 245795 164438 117769 -50989 -461401 -608296 -470803 -581148 -403614 -77564 -1027
23589a027J6495K28476P5506j13867k17042j4299j36793k04381q4885P439J63796
$$ -1027 15468 243944 319450 205583 -11459 -25758 -162551 -366932 -451817 -444378 -280582
23578b80582Q6868p0735J02925M7497J84933M6764L7020J33258P3798j56040j08754
$$ -280582 -193714 -264449 -161524 -114027 70906 117670 154690 287948 361746 205706 96952
23567I6952k28737k12953K4312J25372R9613J25723L8667m20q4030M7532J26832
$$ 96952 -131785 -344738 -320426 -195054 -95441 30282 68949 68529 -15501 32031 158863
23556A58863j56693j29466R7105J29057N492j67178p0294M7165L9910l1236m5176
$$ 158863 2170 -127296 -30191 98866 104358 -62820 -133114 -85949 -46039 -77275 -122451
23545a22451J64385n0689j95087K37585J72145j05169l1901j72087o6061j14029
$$ -122451 41934 -8755 -203842 33743 205888 100719 68818 -103269 -169330 -283359
23535b83359m7675l1331K59235J10773j82739j89531j39651j21095J16284P7798
$$ -283359 -331034 -362365 -103130 7643 -175096 -364627 -504278 -625373 -509089 -431291
23525d31291L37490M61853l1347k35268n005J90499k20846m3970J76631J43405
$$ -431291 -93801 368052 336705 101437 96432 286931 66085 22115 198746 342151
23515C42151j67931k32084j46467j0775J37576r684n9478m3636J03222K82024
$$ 342151 174220 -57864 -204331 -215106 -77530 -87214 -146692 -190328 -87106 194918
23505A94918l9852j37864J60661L1531r7236j45078J27708J38663j2501k65745
$$ 194918 155066 17202 177863 209394 112158 -32920 94788 233451 220950 -44795
23495d4795p182R487n8216L44N7420m4735Q236l3692P981l25291O1397J77406
$$ -44795 -51977 -42490 -100706 -100362 -42942 -87677 -79441 -113133 -105152 -430443 -369046 -191640
23483a91640m9261k0593J97518r1799k72097L2972R9165K604j99032J48074R8048
$$ -191640 -240901 -261494 -63976 -155775 -427872 -394900 -295735 -293131 -492163 -344089 -246041
23472b46041J62527j7204O1671K82392o7587k00791j98446J50799J76147o3262
$$ -246041 -83514 -100718 -39047 243345 175758 -25033 -223479 -72680 103467 40205
23462D0205j51375M2053K6275p3120M247j3164J69062L0943n7148M2013j25412
$$ 40205 -111170 -69117 -42842 -115962 -111715 -124879 44183 75126 17978 59991 -65421
23451f5421j18052k06031j38821k8597J24594L97380L51663P910j29209J20624
$$ -65421 -183473 -389504 -528325 -556922 -432328 -34948 316715 324625 195416 316040
23441C16040k02646j07650k99055O9790J29502K95658J78413r3304j97100r6413
$$ 316040 113394 5744 -293311 -223521 -94019 201639 380052 286748 89648 -6765
23431f765J67830P1006j01871k71742k22119q804J81515M30486N0498r8257k14796
$$ -6765 161065 232071 130200 -141542 -363661 -372465 -190950 239536 290034 191777 -23019
23420b3019j78807J96471L09417k24153j46200j27458N2161M978J82099N8318
$$ -23019 -201826 -5355 304062 79909 -66291 -193749 -141588 -136610 45489 103807
23410A03807m2018O1964q0688j54908j1L9503R5181l6629k59825J49866p0490
$$ 103807 61789 123753 43065 -111843 -111854 -72351 22830 -13799 -273624 -123758 -194248
23399a94248M956j2813N1540l5483K0187M2852L1579L5112m2283P1637p6662N8860
$$ -194248 -189292 -202105 -150565 -186048 -165861 -123009 -91430 -56318 -98601 -26964 -103626 -44766
23387d4766J87240m116k30473j86259L7444K42969Q4940J8005P7291k004J10060
$$ -44766 142474 138358 -92115 -278374 -240930 2039 86979 104984 182275 180271 290331
23376B90331L1724j07895j77394l87802j19003k02868J77046K75735J46699k9733
$$ 290331 322055 214160 36766 -351036 -470039 -672907 -495861 -220126 -73427 -103160
23366a03160R329Q576o4944m8769q5353K3071o1450K25698J69304M3024j4656
$$ -103160 -93831 -85255 -150199 -198968 -284321 -261250 -322700 -97002 72302 115326 100670
23355A00670J34263J00138o3787q2651J31903o6988l40484j99956k7780j06501
$$ 100670 234933 335071 271284 188633 320536 253548 -86936 -286892 -314672 -421173
23345d21173J1092J31559L11760j41328j31598R1159K0181l1702P2493J69418
$$ -421173 -410081 -278522 33238 -108090 -239688 -148529 -128348 -160050 -87557 81861
23335H1861J14708P5390j20203k77290j92117o4990J49602O1981R1294J73527
$$ 81861 196569 271959 151756 -125534 -317651 -382641 -233039 -171058 -79764 93763
23325I3763J13638j54395j424J5365J21536M1966j26256k47915n1199J34742j74689
$$ 93763 207401 53006 51582 66947 188483 230449 104193 -143722 -194921 -60179 -234868
23314b34868k10930J33210L7978j25365J65378J55447N7083n8276k04328R0002
$$ -234868 -445798 -312588 -274610 -399975 -234597 -79150 -22067 -80343 -284671 -194669
23304a94669J25686P8557j11514K9716J40655L9289M7960M1306k20795J33878
$$ -194669 -68983 9574 -101940 -72224 68431 107720 155680 196986 -23809 110069
23294A10069N4106k26868l0322n6707j9306P1463n6271Q5807M4098J67219k20264
$$ 110069 164175 -62693 -93015 -149722 -169028 -97565 -153836 -68029 -23931 143288 -76976
23283g6976k52979M5052J58508J43462j58243n1650k56252J60803Q6890L2346
$$ -76976 -329955 -284903 -126395 17067 -141176 -192826 -449078 -288275 -201385 -169039
23273a69039M0516j1201K5159j03153Q2775n5846p9314K94183K51186O0613l8779
$$ -169039 -128523 -139724 -114565 -217718 -134943 -190789 -270103 24080 275266 335879 297100
23262B97100j69414k94721J42609r8561j77560J35004k1459j00968m7440J1687
$$ 297100 127686 -167035 -24426 -122987 -300547 -165543 -187002 -287970 -335410 -323723
23252c23723L8064K82376j5134r2937J90210K16497p8469l1956m6119J25509q1527
$$ -323723 -285659 -3283 -18417 -111354 78856 295353 216884 184928 138809 264318 182791
23241A82791L3557j29008M1661m6513j79517k45736J23797K84897m4431j08405
$$ 182791 216348 87340 129001 82488 -97029 -342765 -218968 65929 21498 -86907
23231h6907K31620O0332k22648k01202J12646m7309Q2334K65840Q2268m9029J01109
$$ -86907 144713 205045 -17603 -218805 -106159 -153468 -71134 194706 276974 227945 329054
23220C29054j49310k25386n6250Q092m8813k08467j22530J56048J637J84371K49670
$$ 329054 179744 -45642 -101892 -93800 -142613 -351080 -473610 -317562 -315925 -131554 118116
23209A18116K8572J68655l0589l00931r4265j15269j15606L061K22352L15850
$$ 118116 146688 315343 284754 -16177 -110442 -225711 -341317 -338256 -115904 199946
23199A99946l4727n9271j35881J06432j2689k70536L4863Q7864L723n4680R934
$$ 199946 165219 105948 -29933 76499 63810 -206726 -171863 -83999 -80276 -134956 -125022
23188a25022j0809J05136R697P519K01760r019j61917Q9188J31177j59032o9750
$$ -125022 -135831 -30695 -20998 -13479 188281 179262 17345 106533 237710 78678 8928
23177H928k7906L53505J41329k35493N7395j85482k25342N2076r4645K8671p070
$$ 8928 -18978 334527 475856 240363 297758 112276 -113066 -60990 -155635 -126964 -134034
23166a34034l1131K99960k00703K4897O2711n644N1612J99889J90374k46719j81167
$$ -134034 -165165 134795 -65908 -41011 21700 16056 67668 267557 457931 211212 30045
23155C0045j1540j14886j89538k5512M8847K75682N0969j29837K6905Q4427Q0872
$$ 30045 18505 -96381 -285919 -311431 -262584 13098 64067 -65770 -38865 45562 126434
23144A26434M7666J00883K78329K4988l47031l07988k94343Q4688L34548K27738
$$ 126434 174100 274983 553312 578300 231269 -76719 -371062 -286374 48174 275912
23134B75912J26131j631k28491p6780M1459p3777r0843Q5688P9339n681N9539
$$ 275912 402043 400412 171921 95141 136600 62823 -28020 57668 137007 131326 190865
23123A90865r4365j33151J56460J3724q8772k2906k5595m29182M8227K09924q9809
$$ 190865 96500 -36651 119809 133533 44761 21855 -3740 -432922 -384695 -174771 -264580
23112b64580p4421K66364K1273l6967j77493r7156J7809J9687K06409N1531p9663
$$ -264580 -339001 -72637 -51364 -88331 -265824 -362980 -345171 -325484 -119075 -67544 -147207
23101a47207j14217k38568Q4200j58575J13212P0668J70058J40349j06879L8084
$$ -147207 -261424 -499992 -415792 -574367 -461155 -390487 -220429 -80080 -186959 -148875
23091a48875M2344J2706O6660K8513J42061k99518k24018r1880K48041J39915
$$ -148875 -106531 -93825 -27165 1348 143409 -156109 -380127 -472007 -223966 -84051
23081h4051j75040J13238J10380o11j01978N337K11661j20191j80986J10688m0573
$$ -84051 -259091 -145853 -35473 -36084 -138062 -132725 78936 -41255 -222241 -111553 -152126
23070a52126n300O6563J05408J60681J26537k7599j54539j05549k31988l33819
$$ -152126 -157426 -90863 14545 175226 301763 274164 119625 14076 -217912 -551731
23060e51731J30488L6683j60272R5602R9794K0804m6216P8088J05813Q2365J26893
$$ -551731 -421243 -384560 -544832 -449230 -349436 -328632 -374848 -296760 -190947 -108582 18311
23049A8311j55120M0433K44489j07667k15698M8300J66915p6669k0534J32475
$$ 18311 -136809 -96376 148113 40446 -175252 -126952 39963 -36706 -57240 75235
23039G5235m9797k07184N3446J92332p1724k09288M1864N7039J62897p3409j78107
$$ 75235 25438 -181746 -128300 64032 -7692 -216980 -175116 -118077 44820 -28589 -206696
23028b06696Q8795J44396J3966J93620K00910P4395m3014R5762j87772l09489
$$ -206696 -117901 26495 40461 234081 434991 509386 466372 562134 374362 64873
23018F4873p9112l146K37861L07571J47381j08924j83917K18615K44420J16963
$$ 64873 -14239 -17385 220476 528047 675428 566504 382587 601202 845622 962585
23008I62585N21851O05438P20780L71807k61559l27130l89465o02042m34793k38839
$$ 962585 1484436 2089874 2810654 3182461 2920902 2593772 2204307 1602265 1167472 928633
22998I28633k72034k35465J10374j52603j64665J26560j08258k17079k2074J94418
$$ 928633 656599 421134 531508 378905 214240 340800 232542 15463 -6611 187807
22988A87807j8375o4577j30311j14951j16251k3053J23771P0046m2900L7324K6888
$$ 187807 169432 104855 -25456 -140407 -256658 -279711 -155940 -85894 -128794 -91470 -64582
22977f4582L9252M7413J6822k6739M3646n5604J9709O9667q2434O073K7402K8433
$$ -64582 -25330 22083 38905 12166 55812 208 19917 89584 7150 13223 40625 69058
22965F9058k57638O3808L43106J24270l03653M9958K6516J00059P4264l25280
$$ 69058 -188580 -124772 218334 342604 38951 88909 115425 215484 289748 -35532
22955c5532k00682j02975K03351L72935q0195k39809M8108k36015o6890O5844
$$ -35532 -236214 -339189 -135838 237097 156902 -82907 -34799 -270814 -337704 -271860
22945b71860J29577J83307M3725O1313P7106k22631j2276K5525j44457k29773
$$ -271860 -142283 41024 84749 146062 223168 537 -11739 13786 -130671 -360444
22935c60444J98723J77498J62542j28798l6122r7426m3837l8565K2936J70572
$$ -360444 -161721 15777 178319 49521 13399 -84027 -127864 -166429 -143493 27079
22925B7079p5881R603J04592R3830j38101J51805j34638o9791o6015J88148m2701
$$ 27079 -48802 -39199 65393 159223 21122 172927 38289 -31502 -97517 90631 47930
22914D7930j4908K7282k10455l37819l06826n0465L90108J58770o43K2328J23844
$$ 47930 33022 60304 -150151 -487970 -794796 -845261 -455153 -296383 -297026 -274698 -150854
22903a50854Q8793Q5824j58501j06008r2909m579j26110J24485k3996J69141k3072
$$ -150854 -62061 23763 -134738 -240746 -333655 -338234 -464344 -339859 -363855 -194714 -217786
22892b17786j10067J51263r3642P0238J52463J24851k85064j34318l4667L5679
$$ -217786 -327853 -176590 -270232 -199994 -47531 77320 -207744 -342062 -376729 -341050
22882c41050m7575R8243J467J20791N88982J69064j80915l60116j92386J18881
$$ -341050 -388625 -290382 -288915 -168124 420858 589922 409007 48891 -143495 -24614
22872b4614R2543j5768j51779q6579J3862O1856j40514n1735J11411K02361J36173
$$ -24614 67929 52161 -99618 -186197 -172335 -110479 -250993 -302728 -191317 11044 147217
22861A47217j78r3886q6865j36120p987J88521N9029j84038j92098N1284K9378
$$ 147217 147039 53153 -33712 -169832 -177819 10702 69731 -114307 -306405 -255121 -225743
22850b25743K8212q5604K0872j23944P2959K62771R9824M2243k42738r5326J94494
$$ -225743 -197531 -283135 -262263 -386207 -313248 -50477 49347 91590 -151148 -246474 -51980
22839e1980M4733O3719j07582K926P5763o5885j39991j42646J10768K49553J68253
$$ -51980 -7247 56472 -51110 -48184 27579 -38306 -178297 -320943 -210175 39378 207631
22828B07631R3095k15811m11610j20462N0241N9722J0258R5422N01677j54189
$$ 207631 300726 84915 -326695 -447157 -396916 -337194 -326936 -231514 270163 115974
22818A15974j93281p8793k8743L6592q6160K05299R8953k19569k4047K47866M7232
$$ 115974 -77307 -156100 -184843 -148251 -234411 -29112 69841 -149728 -173775 74091 121323
22807A21323r1396J09191k561j72457l1406j02807K13042J78260q0720m6148j98516
$$ 121323 29927 139118 136557 -35900 -67306 -170113 42929 221189 140469 94321 -104195
22796a04195J46609k4797m3898L774k5088K97437l7739k58306j81584J5998M17061
$$ -104195 42414 17617 -26281 -22507 -47595 249842 212103 -46203 -227787 -211789 205272
22785B05272K2457l43032K05677j2478j54418P5334p4018j75564L8163L21024
$$ 205272 227729 -115303 90374 77896 -76522 -1188 -75206 -250770 -212607 108417
22775A08417J76050M0440n3615j32645P585j40085J26705L01331j33734j27621
$$ 108417 284467 324907 271292 138647 146232 6147 132852 434183 300449 172828
22765A72828j07088l27289L2502P2723K22408O1710O0865K6330l7784l28727k3985
$$ 172828 65740 -261549 -229047 -156324 66084 127794 188659 214989 177205 -151522 -175507
22754a75507L43528L3454O6397j95053k1822L55080j10532j60151N3105j02208
$$ -175507 168021 201475 267872 72819 50997 406077 295545 135394 188499 86291
22744H6291p2451n2597k33699q5416J25278J69078k59332P0293J48502M9559J87367
$$ 86291 13840 -38757 -272456 -357872 -232594 -63516 -322848 -252555 -104053 -54494 132873
22733A32873q9225J105K10017q2714j74663J3040J11645j61075J21574K8723k64436
$$ 132873 43648 44753 254770 172056 -2607 10433 122078 -38997 82577 111300 -153136
22722a53136n9316N7364R8508L0406j07906K5076j56191P2881J74324K9939j0601
$$ -153136 -212452 -155088 -56580 -26174 -134080 -109004 -265195 -192314 -17990 11949 1348
22711A348K82904k8187j63666m1788J86324L02423K04819r3742k28547o5472j34160
$$ 1348 284252 256065 92399 50611 236935 539358 744177 650435 421888 356416 222256
22700B22256k55483m4628K4707J23703j3537K1284k48335K9329L0951j80168J03152
$$ 222256 -33227 -77855 -53148 70555 57018 78302 -170033 -140704 -109753 -289921 -186769
22689a86769n5650J02333j2120n2270K52890J98856J9579R8916j82990l35606
$$ -186769 -242419 -140086 -152206 -204476 48414 247270 266849 365765 182775 -152831
22679a52831k11201O4815J06355J27083R2713o1791N2842j31176j22429l0501
$$ -152831 -364032 -299217 -192862 -65779 26934 -34857 17985 -113191 -235620 -266121
22669b66121Q6381N1404j10170N242R528j9088P9140p870j13702J48946K71965
$$ -266121 -179740 -128336 -238506 -233264 -223736 -242824 -163684 -171554 -285256 -136310 135655
22658A35655m3666m4869q7606l1837m5884J06592N2738K39059J20926k84958k1602
$$ 135655 91989 47120 -40486 -72323 -118207 -11615 41123 280182 401108 116150 94548
22647I4548O5607j12202j7344J11719N4538K02677J11543p4780k83798j10324
$$ 94548 160155 47953 30609 142328 196866 399543 511086 436306 152508 42184
22637D2184P8457K21847J7210j37387J2291q6809O1462r1370j08190q9973p7723
$$ 42184 120641 342488 359698 222311 234602 147793 209255 117885 9695 -80278 -158001
22626a58001j30122p5416K06417p18k5369J73921K8836j47343J31530N9667O8606
$$ -158001 -288123 -363539 -157122 -157840 -183209 -9288 19548 -127795 3735 63402 132008
22615A32008j86829j36137R1683L46935K61232j27309q9142n4027k9530j71686
$$ 132008 -54821 -190958 -99275 247660 508892 381583 292441 238414 208884 37198
22605C7198K83502P7991p4706l1624J0235k53547k19158M9451M3068K32227N7686
$$ 37198 320700 398691 323985 292361 302596 49049 -170109 -120658 -77590 154637 212323
22594B12323n0290o4980q1814N9323L4766O2288K63968M9446l24467j09272K13950
$$ 212323 162033 97053 15239 74562 109328 171616 435584 485030 160563 51291 265241
22583B65241K75377J91723L69006j95694j65940o5481n624l00931j75341k00101
$$ 265241 540618 732341 1101347 905653 739713 674232 668608 367677 192336 -7765
22573g765L1169l2195K15656K58191K4755m15007P2248K60904J12100j82284j92020
$$ -7765 23404 -8791 206865 465056 489811 74804 147052 407956 520056 337772 145752
22562A45752L18185K67912j11734k3437j07307j93292j78800J21271n2590j98078
$$ 145752 463937 731849 620115 596678 489371 296079 117279 238550 185960 -12118
22552a2118q9735P2573J57356N9336J08270L6580J01248J48786Q5444K6114k1381
$$ -12118 -101853 -29280 128076 187412 295682 332262 433510 582296 667740 693854 672473
22541F72473J17511J25187o2837J12636J93500K00738N72202O48485O33116L49971
$$ 672473 789984 915171 852334 964970 1158470 1359208 1931410 2579895 3213011 3562982
22531C562982K48299J06232l39648m83767m91211m29715k53457k00482L7136j14513
$$ 3562982 3811281 3917513 3577865 3094098 2602887 2173172 1919715 1719233 1756369 1641856
22521A641856j87546j19561k68641J90586J39303l9519J9196m9374k88815L4260
$$ 1641856 1454310 1334749 1066108 1256694 1395997 1356478 1375674 1326300 1037485 1071745
22511A071745J53775K1270J13985m7036K41195J56336J17472Q1168J26460J41481
$$ 1071745 1225520 1246790 1360775 1313739 1554934 1711270 1828742 1909910 2036370 2177851
22501B177851J08444N3923O9956L62844K03291K4237K2788j07357K29957J08539
$$ 2177851 2286295 2340218 2410174 2773018 2976309 3000546 3023334 2915977 3145934 3254473
22491C254473j16783K63821M07398K67082N37015O01485J72512J91124L61184
$$ 3254473 3137690 3401511 3808909 4075991 4613006 5214491 5387003 5578127 5939311
22482E939311L03035K75150N77190P03503O52983L16058J000744J157755J354342
$$ 5939311 6242346 6517496 7094686 7798189 8451172 8767230 9767974 10925729 12280071
22473A2280071J613344J561010J894878K415620K982233L665711M379325N885917
$$ 12280071 13893415 15454425 17349303 19764923 22747156 26412867 30792192 36678109
22465C6678109P379790R816069J3136766J7522858K4692660L6896198N5420112
$$ 36678109 44057899 53873968 67010734 84533592 109226252 146122450 201542562
22458B01542562P9638229J01887062J04056447P0537459K0104532l5506492q4591542
$$ 201542562 281180791 383067853 487124300 557661759 577766291 542259799 457668257
22451D57668257j00930938q9929812o8089222m7863835l3281069k3925312j7246116
$$ 457668257 356737319 266807507 198718285 150854450 117573381 93648069 76401953
22444G6401953j2847797r315972p007923n406816m313287l649795l003418k543475
$$ 76401953 63554156 54238184 47230261 41823445 37510158 33860363 30856945 28313470
22436B8313470k290382j835885j633835j475249j314813j154753r29217j029186
$$ 28313470 26023088 24187203 22553368 21078119 19763306 18608553 17679336 16650150
22428A6650150j081074j032213r55895o65672n95705n89181l87225k07810k39389
$$ 16650150 15569076 14536863 13580968 12915296 12319591 11730410 11343185 11135375 10895986
22419A0895986l57299m76654m87004l11397k30082l09562k75719J34n0613k07286
$$ 10895986 10538687 10062033 9575029 9263632 9033550 8723988 8448269 8448403 8397790 8190504
22409H190504k99478l29841j65061k10132l24456M5175k99464n57392k59000j54153
$$ 8190504 7891026 7561185 7396124 7185992 6861536 6906711 6607247 6049855 5790855 5636702
22399E636702q0947l50441j93025L3906j57986k9241k45416p7325j74719K4427
$$ 5636702 5555755 5205314 5012289 5046195 4888209 4858968 4613552 4536227 4361508 4385935
22389D385935p1815j10866n03578j51360K08721J57107O2998J67144O43122L88798
$$ 4385935 4314120 4203254 3699676 3548316 3757037 3914144 3977142 4144286 4787408 5176206
22379E176206L03962L54137K57114M71k43316m68196p72430o56219l62709k99844
$$ 5176206 5480168 5834305 6091419 6091890 5848574 5380378 4607948 3951729 3589020 3289176
22369C289176j89545o2667Q7900j82532l88370k94830j02406j17616j84245j3700
$$ 3289176 3099631 3036964 3124864 2942332 2553962 2259132 2156726 2039110 1854865 1841165
22359A841165J546q5098K04882R0858q3537N0711N1063j51660o0068r2721r3407
$$ 1841165 1842711 1757613 1962495 2053353 1969816 2020527 2071590 1919930 1859862 1767141 1673734
22348A673734j4745j32652J39256j25501j36551r0921k39340j3240m0833k1192
$$ 1673734 1658989 1526337 1665593 1540092 1403541 1312620 1073280 1060040 1019207 998015
22338I98015O6927J03177O8686J95771J7655j68979k53490K6413J90364N5022
$$ 998015 1064942 1168119 1236805 1432576 1450231 1281252 1027762 1054175 1244539 1299561
22328A299561o1186l5452j07906Q1385K58489P1308k10946l60322k092J34001
$$ 1299561 1238375 1202923 1095017 1176402 1434891 1506199 1295253 934931 932839 1066840
22318A066840N2793L8375n2649R9552K1463k53578j63310L9358k47901j54854
$$ 1066840 1119633 1158008 1105359 1204911 1226374 972796 809486 848844 600943 446089
22308D46089K5212J1830j55911M0851J05213L4055N5920R9879j16099j43195N4988
$$ 446089 471301 483131 327220 368071 473284 507339 563259 663138 547039 403844 458832
22297D58832l3521j82920N2343l8365r1980J67921J77087q4161j32049J80866
$$ 458832 425311 242391 294734 256369 164389 332310 509397 425236 293187 474053
22287D74053M7392k25185k68192j09227k951j340J53247K95671J86729J7059p5940
$$ 474053 521445 296260 28068 -81159 -84110 -85450 67797 363468 550197 567256 491316
22276D91316m83858r4506L01306Q3371J68710N2640k04482l69111k34797J76531
$$ 491316 7458 -87048 214258 297629 466339 518979 314497 -54614 -289411 -112880
22266a12880l1586J56702O8305M4861n5399o0217L6155K64185o714j60289m225
$$ -112880 -144466 12236 80541 125402 70003 9786 45941 310126 303412 143123 138898
22255A38898K2696J16632o2603r3165J13461l4279M8095J34712q4152n9094k19891
$$ 138898 161594 278226 215623 122458 235919 201640 249735 384447 300295 241201 21310
22244B1310k64447N2546J78896J49440j17923J01499Q8154N8288J80483O4416
$$ 21310 -243137 -190591 -11695 137745 19822 121321 209475 267763 448246 512662
22234E12662l2436K5167q5019R7988q6n5887j15079j16012n2787k8924j43044
$$ 512662 480226 505393 420374 518362 518276 462389 347310 231298 178511 149587 6543
22223F543j00825k87389o4638J38271J90716K51514O2890L1072q0954M7477K4533
$$ 6543 -94282 -381671 -446309 -308038 -117322 134192 197082 228154 147200 194677 219210
22212B19210l4439P4271j70865L6354R7591k41679l5290j7800L13785K32539K9503
$$ 219210 184771 259042 88177 124531 222122 -19557 -54847 -72647 241138 473677 503180
22201E03180j67464j6982j95429Q603m6476j94914K12362L7994J2112j28561j4277
$$ 503180 335716 318734 123305 131908 85432 -109482 102880 140874 152986 24425 10148
22190A0148q0168r3992K743l0120m1943l8109K49212K5696k14412m4473J5081
$$ 10148 -70020 -164012 -161269 -191389 -233332 -271441 -22229 3467 -210945 -255418 -240337
22179b40337K9210L352j7364o8551O529j8002J49014n6785K24101K73702j9037
$$ -240337 -211127 -207775 -225139 -293690 -287161 -305163 -156149 -212934 11167 284869 265832
22168B65832j13616r317r1447k36195p1147j36807J40876k0845J64535J0008j28108
$$ 265832 152216 142899 51452 -184743 -255890 -392697 -251821 -272666 -108131 -98123 -226231
22157b26231K48695K63214q499m5105k13623j88170K81037K62512J02883k26752
$$ -226231 22464 285678 277179 232074 18451 -169719 111318 373830 476713 249961
22147B49961j37753j29155j14498o5727J54308Q9712k54584K12367J744j30304
$$ 249961 112208 -16947 -131445 -197172 -42864 46848 -207736 4631 6375 -123929
22137a23929j25679J65377j1571J37624M8875o4446m5058k15007J61371K912K17963
$$ -123929 -249608 -84231 -95802 41822 90697 26251 -18807 -233814 -72443 -69531 148432
22126A48432o495j41737L304N459k56547O0515J04617L23909o1446J01580j29934
$$ 148432 141937 200 3504 8963 -247584 -187069 -82452 241457 180011 281591 151657
22115A51657l0562j23215l04136J70385P5937J44805O1960P8721K22061N6438
$$ 151657 121095 -2120 -306256 -135871 -59934 84871 146831 225552 447613 504051
22105E04051q7149L3295r0601j83073O5066J06685j03101k14099K7128k6960k04054
$$ 504051 416902 450197 359596 176523 241589 348274 245173 31074 58202 31242 -172812
22094a72812J7323K0640R90K14777j37593j2620j29554j11337k9392J52784P8505
$$ -172812 -155489 -134849 -133859 80918 -56675 -69295 -198849 -310186 -339578 -186794 -108289
22083a08289L7662l0185L3116n3396j14940p6135K47211J41735L5345R4204j26868
$$ -108289 -70627 -100812 -67696 -121092 -236032 -312167 -64956 76779 112124 206328 79460
22072G9460m3889j67127p2221O6614k54487j55755K53550L57732j00772o2387
$$ 79460 35571 -131556 -203777 -137163 -391650 -547405 -293855 63877 -36895 -99282
22062i9282q9946l5038K79224J07574N4422J0952j78984K5991J53871j18311k91676
$$ -99282 -189228 -224266 54958 162532 216954 227906 48922 74913 228784 110473 -181203
22051a81203M4073O7097j028J39192j90498k4331Q3134p0641J74410J75875P5960
$$ -181203 -137130 -70033 -71061 68131 -122367 -146698 -63564 -134205 40205 216080 292040
22040B92040O6978l85585r8245m860m06788J36161L78723M9609j28639l6835R1075
$$ 292040 359018 -26567 -124812 -129672 -536460 -400299 -21576 28033 -100606 -137441 -46366
22029d6366j83728k50538J54351P8468K39598K72818k353J64518p4580k56813
$$ -46366 -230094 -480632 -326281 -247813 -8215 264603 262250 426768 352188 95375
22019I5375j25790j96678m5325O9033J34946L17360l2288l62457j10926J9292
$$ 95375 -30415 -227093 -272418 -203385 -68439 248921 216633 -145824 -256750 -237458
22009b37458J17678j15927K9512L63194l5818j15248N8771L7358M3940K7309O3105
$$ -237458 -119780 -235707 -206195 156999 121181 5933 64704 102062 146002 173311 236416
21998B36416N0523J5311j53494q0576o531J15470J86972K02547o8148j11130j76098
$$ 236416 286939 302250 148756 68180 61649 177119 364091 566638 498490 387360 211262
21987B11262j41529j58146N7567M191j9548K59052n7159j8808j28310J04580N9899
$$ 211262 69733 -88413 -30846 -26655 -46203 212849 155690 136882 8572 113152 173051
21976A73051j06445O4693Q0462o1070J46068K9011j75839k29860m4038J41135
$$ 173051 66606 131299 211761 150691 296759 325770 149931 -79929 -123967 17168
21966A7168M4616j1092p0571O5082M3816K97964j73808l50556O6167J66952o850
$$ 17168 61784 50692 -19879 45203 89019 386983 213175 -137381 -71214 95738 88888
21955H8888M3123J27007j40752j53707j75013p7477o1792P489J35912k1392j82983
$$ 88888 132011 259018 118266 -35441 -210454 -287931 -349723 -342234 -206322 -227714 -410697
21944d10697J89217K38491Q1896j34021k41644q6911K02560M38421O6286k16891
$$ -410697 -221480 17011 98907 -35114 -276758 -363669 -161109 277312 343598 126707
21934A26707l942K47448r3880K217m4607j51455j54812j33589O577p2853k25910
$$ 126707 122765 370213 276333 278550 233943 82488 -72324 -205913 -199336 -272189 -498099
21923d98099J8650J51659K28303n3315k00627l5541j09287k9311K22684Q5114
$$ -498099 -479449 -327790 -99487 -152802 -353429 -388970 -498257 -527568 -304884 -219770
21913b19770J43712n9217K8606K38212J45177J78398J43868K31290q9854l69540
$$ -219770 -76058 -135275 -106669 131543 276720 455118 598986 830276 740422 370882
21903C70882k45553K6032K34824J69257J04995M10883P20399P75632L72540j54914
$$ 370882 125329 151361 386185 555442 660437 1071320 1791719 2567351 2939891 2784977
21893B784977k27941l25673n40282l15746j71765l11469m34030k20146J97083
$$ 2784977 2557036 2231363 1691081 1375335 1203570 892101 458071 237925 435008
21884D35008O695j84627l04151j3809L58860p7246k46776K55594J13353j93175
$$ 435008 441703 257076 -47075 -60884 297976 220730 -26046 229548 342901 149726
21874A49726l1748j23294K909Q2640j18820J80844l7103k6764J449q4461n1490
$$ 149726 117978 -5316 -2407 80233 -38587 142257 105154 78390 79839 -4622 -56112
21863e6112K03640j6714k32601q108j2969J9244p2973J14851J34523J98448k6188
$$ -56112 147528 130814 -101787 -109895 -122864 -103620 -176593 -61742 72781 271229 245041
21852B45041k5188k23103n3232J00061J0863N7566n7518J40575Q6454k6602k49236
$$ 245041 219853 -3250 -56482 43579 54442 112008 54490 195065 281519 254917 5681
21841E681j19990J86307J69082k15649k87266J71720K07594j2646o2121j4028
$$ 5681 -114309 71998 241080 25431 -261835 -90115 117479 104833 42712 28684
21831B8684L680m7844K3604j8513K6506o7636l4252J23035K24763J88587r6566
$$ 28684 32364 -15480 8124 -10389 16117 -51519 -85771 37264 262027 450614 354048
21820C54048q1871R8888k37322j49233J01221J2944j99033Q1212Q4379L0683k03817
$$ 354048 272177 371065 133743 -15490 85731 98675 -100358 -19146 65233 95916 -107901
21809a07901m8541K28089K77360r5834j33791N0575j48858j07916K25678Q7177
$$ -107901 -156442 71647 349007 253173 119382 169957 21099 -86817 138861 226038
21799B26038m48794l38102J55841K21000k880J07569N3307N7180j87273J87448
$$ 226038 -222756 -560858 -405017 -184017 -186897 -79328 -26021 31159 -156114 31334
21789C1334o688N593J92130m5198m376J29450j27311j33036l316q8519k88214
$$ 31334 24646 30239 222369 177171 172795 302245 174934 41898 38582 -49937 -338151
21778c38151j14603j18479J45962J17878l2684Q9983J75308J27940L77023l6323
$$ -338151 -452754 -571233 -425271 -307393 -340077 -250094 -74786 53154 430177 393854
21768C93854l24229l14798O6644L30215j66412J9597L38586j88484j99427J12136
$$ 393854 69625 -245173 -178529 151686 -14726 4871 343457 154973 -44454 67682
21758F7682k5641J2516J4832M4134J01669K0548K9144K35607j805j58196q9798
$$ 67682 42041 54557 69389 113523 215192 235740 264884 500491 498686 340490 250692
21747B50692j61475k10734j6486K00811J06409j7182o5063N8598K34060m2991
$$ 250692 89217 -121517 -138003 62808 169217 152035 86972 145570 379630 336639
21737C36639o4141P8587k25157j94155n7593l1090J23998j07606Q4070O4688q7089
$$ 336639 272498 351085 125928 -68227 -125820 -156910 -32912 -140518 -56448 8240 -78849
21726g8849k9419j2825J2168p6928k30025P038j00283K35935L20567j6836J85797
$$ -78849 -108268 -121093 -108925 -185853 -415878 -408840 -509123 -273188 47379 30543 216340
21715B16340j16151r3822l11799l26172J38309J61803K6899J35156J58515K1700
$$ 216340 100189 6367 -305432 -631604 -493295 -331492 -304593 -169437 -10922 10778
21705A0778N7307N3818j2120j09382J09468j02320J26657j68864j34412J53853
$$ 10778 68085 121903 109783 401 109869 7549 134206 -34658 -169070 -15217
21695a5217R727j23867k13797j13290L5178P0857J61735J98447P2034J46874k3291
$$ -15217 -5490 -129357 -343154 -456444 -421266 -350409 -188674 9773 81807 228681 205390
21684B05390k08409N5109l4437n9274M4382p8063J16931L007P6403q7353n3704
$$ 205390 -3019 52090 17653 -41621 2761 -75302 41629 44636 121039 33686 -20018
21673b0018o359j17983J34575J09247P4326Q2267r4661o1325J30659j83129o3616
$$ -20018 -26377 -144360 -9785 99462 173788 256055 161394 100069 230728 47599 -16017
21662a6017M6331K71189K55557k58926k27442J20910q940P0093j49914R6849J11644
$$ -16017 30314 301503 557060 298134 70692 191602 182662 252755 102841 199690 311334
21651C11334m28822k24859P7315K38750K53255p9974j57046j48555J47656J91033
$$ 311334 -117488 -342347 -265032 -26282 226973 146999 -10047 -158602 -10946 180087
21641A80087j33927k0215K8846N5859j37131n3890j31075N2959L15135L9367j36606
$$ 180087 46160 25945 54791 110650 -26481 -80371 -211446 -158487 156648 196015 59409
21630E9409p8567j11711p8945K4007j20496K68375K78720J35646M9442o6730r3214
$$ 59409 -19158 -130869 -209814 -185807 -306303 -37928 240792 376438 425880 359150 265936
21619B65936k21448R0713p048j21733j05946L1132K3285j38740j51410L7702K3971
$$ 265936 44488 135201 128153 6420 -99526 -68394 -45109 -183849 -335259 -297557 -273586
21608b73586r0485m9541J98236j01301N0520J74204J47497J49473J8674J57983
$$ -273586 -364071 -413612 -215376 -316677 -266157 -91953 55544 205017 223691 381674
21598C81674q2064o1581k45882J55820Q6267j54149K1525j8318J48571p8333m7555
$$ 381674 299610 238029 -7853 147967 234234 80085 101610 83292 231863 153530 105975
21587A05975L9430l1065L9554L6970k64149m2439J4602Q4210j8054j38290R815
$$ 105975 145405 114340 153894 190864 -73285 -115724 -101122 -16912 -34966 -173256 -163441
21576a63441j70181J52227J45710m0760j93036Q3033P0266O6413j60386P4435
$$ -163441 -333622 -181395 -35685 -76445 -269481 -186448 -116182 -49769 -210155 -135720
21566a35720o2206p5435R7588P5225K0412n1554J93074j85730J29972j89427L8699
$$ -135720 -197926 -273361 -175773 -100548 -80136 -131690 61384 -124346 5626 -183801 -145102
21555a45102M3349m3796j92674q5038P5779O8575O3324Q2478k7007j81807N34
$$ -145102 -101753 -145549 -338223 -423261 -347482 -278907 -215583 -133105 -160112 -341919 -341385
21544c41385q4920j60608J76167J97020J57590Q4729K03078J32088L5328k64300
$$ -341385 -426305 -586913 -410746 -213726 -56136 28593 231671 363759 399087 134787
21534A34787m8820k3010j33383j63862L5746J07499j22402l2406J14750q5989
$$ 134787 85967 62957 -70426 -234288 -198542 -91043 -213445 -245851 -131101 -217090
21524b17090L3704n7519n8622r0361l6150j8193M75667J02756j05468K6182q225
$$ -217090 -183386 -240905 -299527 -389888 -426038 -444231 31436 134192 28724 54906 46681
21513D6681J35675J30916J20170p7794l19239j86021K8271J42189k6269j5772
$$ 46681 182356 313272 433442 355648 36409 -149612 -121341 20848 -5421 -21193
21503b1193l0469j01508L6380R1963o5813q4388Q5450J93236M4639L964O94k19363
$$ -21193 -51662 -153170 -116790 -24827 -90640 -175028 -89578 103658 148297 152261 152955 -66408
21491f6408m1737J08500O24m1167q402M529m1850n6868n5595j06752J52982j05643
$$ -66408 -108145 355 979 -40188 -48590 -44061 -85911 -142779 -198374 -305126 -152144 -257787
21479b57787K73287J57090K3439j64630j85668K25953L45959l229j93344q0178
$$ -257787 15500 172590 196029 31399 -154269 71684 417643 414414 221070 140892
21469A40892j07933m32924K2211M8640P5144j8833m6393O4358J17520l6595n6190
$$ 140892 32959 -399965 -377754 -329114 -253970 -272803 -319196 -254838 -137318 -173913 -230103
21458b30103J61746J6437r332j90190Q5339L1917l8064o2623J28468J86541R8842
$$ -230103 -68357 -51920 -61252 -251442 -166103 -134186 -172250 -234873 -106405 80136 178978
21447A78978j64900Q0933N1663K199L8668k2740L999p8822N9882K07065J47472
$$ 178978 14078 95011 146674 148873 187541 164801 168800 89978 149860 356925 504397
21436E04397n1622j06006k7222j67848l1131j11752K1518p804m25701K0518J05130
$$ 504397 452775 346769 319547 151699 120568 8816 30334 22530 -403171 -382653 -277523
21425b77523J74918N1411J26555J63562k43599r4065j27213q6144L57267o6308
$$ -277523 -102605 -51194 75361 238923 -4676 -98741 -225954 -312098 45169 -21139
21415b1139k29133j93529k6254J12726J28596j74631O3458J9421j11849l5332
$$ -21139 -250272 -443801 -470055 -357329 -228733 -403364 -339906 -320485 -432334 -467666
21405d67666K08489L76837L75270j62737l06701m62821l17964J08815O6372k403
$$ -467666 -259177 117660 492930 330193 23492 -439329 -757293 -648478 -582106 -584509
21395e84509l0057J24107L74861L5691j24289J27825J21544Q2023j69386p8203
$$ -584509 -614566 -490459 -115598 -79907 -204196 -76371 45173 127196 -42190 -120393
21385a20393J41759J16067M4308k38541P0561L99J11693J28253j6258o6905Q3380
$$ -120393 21366 137433 181741 -56800 13761 14160 125853 254106 237848 170943 254323
21374B54323k23619j98774J4697m6176J01049j3831l8642j98453J6071J14856
$$ 254323 30704 -168070 -153373 -199549 -98500 -112331 -150973 -349426 -333355 -218499
21364b18499K06776J68840M6879n419k26662Q0564j7866J41885M8838k32233k35163
$$ -218499 -11723 157117 203996 198577 -28085 52479 34613 176498 225336 -6897 -242060
21353b42060J81063Q7295q9216P3812N6724j93367k58980O9707L620l7340K33042
$$ -242060 -60997 26298 -62918 10894 67618 -125749 -384729 -315022 -311402 -348742 -115700
21342a15700K22080j89415p5185J28215J354J04168o9267j26811r7629J79839
$$ -115700 106380 -83035 -158220 -30005 -28651 75517 6250 -120561 -218190 -38351
21332c8351J02932j35223l1238k31839J06433j5332l8999P4559m7316K18085L61125
$$ -38351 64581 -70642 -101880 -333719 -227286 -242618 -281617 -207058 -254374 -36289 324836
21321C24836J15599j31272k40922k80726j51088J18667K52907r518q1749J6731
$$ 324836 440435 309163 68241 -212485 -363573 -244906 8001 -1517 -83266 -66535
21311f6535p7052J05343J02675K16852j26506j28429j95132o8181l7675p4629
$$ -66535 -143587 -38244 64431 281283 154777 26348 -168784 -236965 -274640 -349269
21301c49269J56207j18742k39814P9543L59977R8560K69440j9781j79369l34999
$$ -349269 -193062 -311804 -551618 -472075 -112098 -13538 255902 236121 56752 -278247
21291b78247r0178n7959J25525K6253P5823N956O6332o5024q4321j5232m8119
$$ -278247 -368425 -426384 -300859 -274606 -198783 -192827 -126495 -191519 -275840 -291072 -339191
21280c39191r318q7919J54847K72551K58997J27785J4763j49968k36114k15418
$$ -339191 -348509 -436428 -281581 -9030 249967 377752 392515 242547 6433 -208985
21270b08985o8031J57368K40302N2501q5565k18747j54688J14471J15846j61147
$$ -208985 -277016 -119648 120654 173155 87590 -131157 -285845 -171374 -55528 -216675
21260b16675o1427K91712J97796j66843k73545r8207N2676J72411K7985K1017
$$ -216675 -278102 13610 211406 44563 -228982 -327189 -274513 -102102 -74117 -53100
21250e3100J34380l4366Q1054K43740M7199O2380l79574j58027O1274K41889r4743
$$ -53100 81280 46914 127968 371708 418907 481287 101713 -56314 4960 246849 152106
21239A52106k48450j31574J13214K97876K77711k2723j53821n1794J93784N7241
$$ 152106 -96344 -227918 -114704 183172 460883 438160 284339 232545 426329 483570
21229D83570r9337k06447j25253k30987J21129N0060q3795k15161J81542K11336
$$ 483570 384233 177786 52533 -178454 -57325 -7265 -91060 -306221 -124679 86657
21219H6657J54312l5902N4023p7707k04380k25632L863j16592J08373Q5305J35802
$$ 86657 240969 205067 259090 181383 -22997 -248629 -244766 -361358 -252985 -167680 -31878
21208c1878Q8449j79997n4240K7809Q9042J53593O5978M1415m6526j0211k20760
$$ -31878 56571 -123426 -177666 -149857 -60815 92778 158756 200171 153645 143434 -77326
21197g7326j13923L3158K21027J30677o655j08607k163Q9632n7180P7347j1780
$$ -77326 -191249 -158091 62936 193613 186958 78351 76188 165820 108640 185987 174207
21186A74207m6560J09152K00823r2014p4439n382j16518q2999O3833L3693Q6117
$$ 174207 127647 236799 437622 345608 271169 265787 149269 66270 130103 163796 249913
21175B49913Q2932q2278q5855o6900J99921R4220J25651k70742j21526K85988
$$ 249913 332845 250567 164712 97812 297733 391953 517604 246862 125336 411324
21165D11324K10104j12640k24204j84946j61501L7250J55797R8959M3373p4055
$$ 411324 621428 508788 284584 99638 -61863 -24613 131184 230143 273516 199461
21155A99461J30795j23965j32630j50863j12985p520J00233K15386L01035r1819
$$ 199461 330256 206291 73661 -77202 -190187 -197707 -97474 117912 418947 327128
21145C27128k9533j38217p1582j09273J2201P0342j2026j09236L9513N2282J69079
$$ 327128 297595 159378 87796 -21477 -9276 61066 49040 -60196 -20683 31599 200678
21134B00678n5423k77398r2419K72094j19934k24875J3673J86480K58062J60198
$$ 200678 145255 -132143 -224562 47532 -72402 -297277 -283604 -97124 160938 321136
21124C21136k42122k41549N1828o4512j58542m8800M8210J50506K0981J18784
$$ 321136 79014 -162535 -110707 -175219 -333761 -382561 -334351 -183845 -162864 -44080
21114d4080n3373j77806k04989K86472K90746n5274P1014j42265k63049j0089
$$ -44080 -97453 -275259 -480248 -193776 96970 41696 112710 -29555 -292604 -302693
21104c02693J23881J46337R5909J01213m9253k14813L9021J28807J75270L19575
$$ -302693 -178812 -32475 63434 164647 115394 -99419 -60398 68409 243679 563254
21094E63254k01504l12481k12351n290J79983p3398J74869o4944K6561p333o8057
$$ 563254 361750 49269 -163082 -168372 11611 -61787 113082 48138 74699 67366 -691
21083f91k41422j38624L99974Q7262l0347n8635l088j1800q4003K74624O6292
$$ -691 -242113 -380737 19237 106499 76152 17517 14429 2629 -81374 193250 259542
21072B59542j69118l6579L6169R6368L30928m101k36840O9762K31183J1321k85494
$$ 259542 90424 53845 90014 186382 517310 513209 276369 346131 577314 588635 303141
21061C03141j82064K09680J80593j79972j04622j98512l22237q0221l1801Q6562
$$ 303141 121077 330757 511350 331378 226756 28244 -293993 -374214 -406015 -319453
21051c19453J64522L2703k0193j30662j29956N751l2500K58964J98254Q3226j43956
$$ -319453 -154931 -122228 -142421 -273083 -403039 -397288 -429788 -170824 27430 110656 -33300
21040c3300K9514j97488l9265K21739K0416k09035j11603J97479K2080K78168
$$ -33300 -3786 -201274 -240539 -18800 1616 -207419 -319022 -121543 -99463 178705
21030A78705J44631j07007j98523Q597j71125o9324J53526J61347j868q0760j00338
$$ 178705 323336 216329 17806 26403 -144722 -214046 -60520 100827 98959 18199 -82139
21019h2139l1488J11722q7654k48234o2316Q12j14q6233M04377K03487l11554
$$ -82139 -113627 -1905 -89559 -337793 -400109 -399297 -399411 -485644 -81267 122220 -189334
21008a89334N2488M0299j15380K10461L9098r4005j35272N5226L8733l5219l19397
$$ -189334 -136846 -96547 -211927 -1466 37632 -56373 -191645 -136419 -97686 -132905 -452302
20997d52302O7023M530M9835r6461k68128m3404J90173J46982j3360K45698J32220
$$ -452302 -385279 -380749 -330914 -427375 -695503 -738907 -548734 -401752 -415112 -169414 -37194
20986c7194M019J07370K48298L9761m6154j31754K5835k18674k84229O0384j25312
$$ -37194 -33175 74195 322493 362254 316100 184346 210181 -8493 -292722 -232338 -357650
20975c57650k8231J7901J14805K51954K3351n5122j14936L9535n617P3216J71219
$$ -357650 -385881 -367980 -253175 -1221 22130 -32992 -147928 -108393 -114010 -40794 130425
20964A30425O2207j06512L058O2007j5409l10890R4779J43379j4409j01773j08874
$$ 130425 192632 86120 89178 151185 135776 -175114 -80335 63044 48635 -53138 -162012
20953a62012j28208K44959J84988l9096j65584j41267r3925K22455J65057P0752
$$ -162012 -290220 -45261 139727 100631 -64953 -206220 -300145 -77690 87367 158119
20943A58119M8560o7606L9351J4340r4904j62557k24938j86476j67912O5664L2218
$$ 158119 206679 139073 178424 192764 97860 -64697 -289635 -476111 -644023 -578359 -546141
20932e46141J12047j27656r8390K15400R9745J53622K50585L54322o3958j60707
$$ -546141 -434094 -561750 -660140 -444740 -344995 -191373 59212 413534 349576 188869
20922A88869o5689j99263o6607J18504N5291Q0945j39351k38716P1674Q4774J13754
$$ 188869 123180 -76083 -142690 -24186 31105 112050 -27301 -266017 -194343 -109569 4185
20911D185J13694J52049N9472l7681k64331n8771o7003M6497j9845k14549N831
$$ 4185 117879 269928 329400 291719 27388 -31383 -98386 -51889 -71734 -286283 -280452
20900b80452K74365M1074o4536J37335l48912k66031J17722K22943L31040J23790
$$ -280452 -6087 34987 -29549 107786 -241126 -507157 -389435 -166492 164548 288338
20890B88338m0434P688k51743M6383o7628l6218j37089O1300J26491j09819J39789
$$ 288338 247904 255592 3849 50232 -17396 -53614 -190703 -129403 -2912 -112731 27058
20879B7058R6290P305R557Q0897q9717j59683J11730K69238L9069M544j54842
$$ 27058 123348 130653 140210 221107 131390 -28293 83437 352675 391744 396288 241446
20868B41446o7402l04669N679l1982m2440K36578M62n4406P1531L9563j18243
$$ 241446 174044 -130625 -124946 -156928 -199368 37210 37672 -16734 54797 94360 -23883
20857b3883q1304J87297K31985p2531j32186J11920L24308l56441k24521J52679
$$ -23883 -105187 82110 314095 241564 109378 221298 545606 189165 -35356 117323
20847A17323J14072k49631J478K61215O7811k15060l7385j2451Q3683o0434J34278
$$ 117323 231395 -18236 -16758 244457 312268 97208 59823 47372 131055 70621 204899
20836B04899Q2373j0257n4948j76142q5226O3730J44176r6520o2280r0217q171
$$ 204899 287272 277015 222067 45925 -39301 24429 168605 72085 9805 -80412 -88583
20825h8583O2888J08052j21226j47717o7679l2516K27721M944j10047o8881j48431
$$ -88583 -25695 82357 -38869 -186586 -254265 -286781 -59060 -54116 -164163 -233044 -381475
20814c81475Q7320q3426P8933J22062J75700n165m2366j02635k45411K3617K70834
$$ -381475 -294155 -377581 -298648 -176586 -886 -6051 -48417 -151052 -396463 -372846 -102012
20803a02012J21250J90885j13065Q2820r4345j69078K5671K10957O7318j5971
$$ -102012 19238 210123 97058 179878 85533 -83545 -57874 153083 220401 204430
20793B04430m3541l9263N8495J41964l1449N3308J696J39721j45026k8655j87872
$$ 204430 160889 121626 180121 322085 290636 343944 345640 485361 340335 311680 123808
20782A23808k37329q6075Q1791j20675J2890K91521K980k16478k36841o6045J80328
$$ 123808 -113521 -199596 -117805 -238480 -225590 65931 68911 -147567 -384408 -450453 -270125
20771b70125K9539L11770K49405k36088j30519j90682P057n6249J6898M1484m9071
$$ -270125 -240586 71184 320589 84501 -46018 -236700 -229643 -285892 -268994 -227510 -276581
20760b76581m8119L1134r4234r0944L13684K11593K8798j03904j62403o7780N724
$$ -276581 -324700 -293566 -387800 -478744 -165060 46533 75331 -28573 -190976 -258756 -253032
20749b53032l2338J64717J70858j7860k38402l2644K578J47829L3155K93611J66729
$$ -253032 -285370 -120653 50205 32345 -206057 -238701 -236123 -88294 -55139 238472 405201
20738D05201j81846k95393J41653L4624O1443m0825j97809k74345N6375L45700
$$ 405201 223355 -72038 69615 104239 165682 124857 -72952 -347297 -290922 54778
20728E4778J9966Q7876O8697k67392r3303o7625Q7219K37385K77645j43149k84205
$$ 54778 74744 162620 231317 -36075 -129378 -197003 -109784 127601 405246 262097 -22108
20717b2108k1992q8635l86331L05278P2817K5644J39553P6350J76878p7367r2594
$$ -22108 -44100 -132735 -519066 -213788 -140971 -115327 24226 100576 277454 200087 107493
20706A07493k04761N0117L1956N7961k51864j88601j08275J84039P8975K26873
$$ 107493 -97268 -47151 -15195 42766 -209098 -397699 -505974 -321935 -242960 -16087
20696a6087k7834j16553j9804j03410K7748N4510l3204L4851J40736O3465j92470
$$ -16087 -43921 -160474 -180278 -283688 -255940 -201430 -234634 -199783 -59047 4418 -188052
20685a88052K6852k14K58121K81j31356J37125J80263R3184k27j5252J97243l5068
$$ -188052 -161200 -161414 96707 96988 -34368 102757 283020 376204 375977 360725 557968 522900
20673E22900k40542p1101j39122j07303J14092j17117J22797J37875J9722J05231
$$ 522900 282358 211257 72135 -35168 78924 -38193 84604 222479 242201 347432
20663C47432r6857j82157k159j71815K0836J09290J38917q975j28877r0102N3542
$$ 347432 250575 68418 66259 -105556 -84720 24570 163487 154512 25635 -64467 -10925
20652a0925n6828P5508Q7640l57728j3836K19962j5289K66558j0686j11355n9310
$$ -10925 -67753 7755 95395 -262333 -276169 -56207 -71496 195062 184376 73021 13711
20641A3711O1951M6943q039k13229N0104J06603j05265j51266J23308Q0389j00448
$$ 13711 75662 122605 114566 -98663 -48559 58044 -47221 -198487 -75179 5210 -95238
20630i5238P750J22265j04876m7377k48642n9628J36740K28993j7472J20327N8008
$$ -95238 -87488 34777 -70099 -117476 -366118 -425746 -289006 -60013 -77485 42842 100850
20619A00850j45683q7721J3782r4807L2924O0031n9130P4610m2676N7194J5971
$$ 100850 -44833 -132554 -118772 -213579 -180655 -120624 -179754 -105144 -147820 -90626 -74655
20608g4655j38453J1986k2813n920o094J46176M9799K0054j843J27275J0276r4590
$$ -74655 -213108 -201122 -223935 -229855 -235949 -89773 -39974 -19920 -21763 105512 115788 21198
20596B1198j41023J53522J65233j4672j33459m3972J99453O2361K5727k94324
$$ 21198 -119825 33697 198930 184258 50799 6827 206280 268641 294368 44
20586D4j57487M7985J01751q9410l18731O3586K53024J34905R3852q2754j81750
$$ 44 -157443 -109458 -7707 -97117 -415848 -352262 -99238 35667 129519 46765 -134985
20575a34985r1277J40863K47481l8444l61272k13461M0149J44784K4045j43790
$$ -134985 -226262 -85399 162082 123638 -237634 -451095 -410946 -266162 -242117 -385907
20565c85907K68648J16819j09718J797j39520n2568K1625J65806J81399J18388
$$ -385907 -117259 -440 -110158 -108361 -247881 -300449 -278824 -113018 68381 186769
20555A86769k2302n286N5061j68220k35973N0417J29663J49023k3928j94225k91261
$$ 186769 164467 159181 214242 46022 -189951 -139534 -9871 139152 115224 -79001 -370262
20544c70262l2765J16445L3422j44558Q4114J92675J67395j0833j44052N9524
$$ -370262 -403027 -286582 -253160 -397718 -313604 -120929 46466 35633 -108419 -48895
20534d8895o5590l327l2051q3581O8518q746n60R6469l3241J64258J1095o0984
$$ -48895 -114485 -117812 -149863 -233444 -164926 -173672 -174232 -77763 -111004 53254 64349 3365
20522C365k92784j29624L00576K55076N5105k05029j10181n4679O7722J8044j07000
$$ 3365 -289419 -419043 -118467 136609 191714 -13315 -123496 -178175 -110453 -92409 -199409
20511a99409J5858k0174K87997J61587m6209k45468k68441O2982j31984l3880
$$ -199409 -183551 -203725 84272 245859 199650 -45818 -314259 -251277 -383261 -417141
20501d17141K90449J78832P5207J27580R396L5311k05030j94201L2536N7014K8187
$$ -417141 -126692 52140 127347 254927 264323 299634 94604 -99597 -67061 -10047 18140
20490A8140K3211J19041j742j721j33884j05245l8113m3041O9918J15772J79993
$$ 18140 41351 160392 158650 156929 23045 -82200 -120313 -163354 -93436 22336 202329
20479B02329M514k82934n3626j14718K2299M5894K45692j01469k01067P196k6598
$$ 202329 206843 -76091 -129717 -244435 -222136 -176242 69450 -32019 -233086 -225890 -252488
20468b52488o3352O6606O0609j05670J5290P2018M6941j1087Q2501J33270J06050
$$ -252488 -315840 -249234 -188625 -294295 -279005 -206987 -160046 -171133 -88632 44638 150688
20457A50688l575l40161k09897J46960J48592J27012N428J21299J68327j76575
$$ 150688 147113 -193048 -402945 -255985 -107393 19619 25047 146346 314673 138098
20447A38098O0545K541j36589n436L7245r6411q3054o0041K6676m5851n8609J15610
$$ 138098 198643 201184 64595 59159 96404 -7 -83061 -143102 -116426 -162277 -220886 -105276
20435a05276k5709J52378K43907Q347l10468j30600m4128q6783P4146Q1268J27662
$$ -105276 -130985 21393 265300 273647 -36821 -167421 -211549 -298332 -224186 -142918 -15256
20424a5256j4075L19920J2919o651N9838j33178j50650p6404j88214j64970N9795
$$ -15256 -29331 290589 303508 296857 356695 223517 72867 -3537 -191751 -356721 -296926
20413b96926K33775J90146r5660j20994j27221j31246K28Q3875J16354n5353k18918
$$ -296926 -63151 126995 31335 -89659 -216880 -348126 -347898 -264023 -147669 -203022 -421940
20402d21940O4608J93521K93633q6767N1507P7155k2419l11852l449j4307j71350
$$ -421940 -357332 -163811 129822 43055 94562 171717 149298 -162554 -166003 -180310 -351660
20391c51660J17426J73043m1461P0358j61959j68663J72602K59375K33079K9274
$$ -351660 -234234 -61191 -102652 -32294 -194253 -362916 -190314 69061 302140 331414
20381C31414j24416k32373Q1430K4722k54905r9033K6735M2381q4186L10900K20959
$$ 331414 206998 -25375 56055 80777 -174128 -273161 -246426 -204045 -288231 22669 243628
20370B43628r3041o7638p2767J67029n3054r3699j55720o6295j5490K41913P8039
$$ 243628 150587 82949 10182 177211 124157 30458 -125262 -191557 -207047 34866 112905
20359A12905K3280N6533J47891L9842j94766q6534J77750L3201j28748r2894k03439
$$ 112905 136185 192718 340609 380451 185685 99151 276901 310102 181354 88460 -114979
20348a14979j39983p8771O0990K57272N6129j63092r4460n9669J74127O085o7656
$$ -114979 -254962 -333733 -272743 -15471 40658 -122434 -216894 -276563 -102436 -96351 -164007
20337a64007K21758J07581j12947j96934q6071J64143J15899R3983j72039k75980
$$ -164007 57751 165332 52385 -144549 -230620 -66477 49422 143405 -28634 -304614
20327c04614K4487J95536Q361k31127L0591L16100j799N575r4547J7509k7979
$$ -304614 -280127 -84591 -76230 -307357 -276766 39334 37535 43110 -51437 -33928 -61907
20316f1907J87392K94107q321l87318n7535L656k0121K07602L23390j67316q2953
$$ -61907 125485 419592 411271 23953 -33582 -29926 -50047 157555 480945 313629 230676
20305B30676j16277j72517N6648K53145P9633k59873j11539q2652m10795J3381
$$ 230676 114399 -58118 -1470 251675 331308 71435 -40104 -122756 -533551 -520170
20295e20170K46541P6144J63537L8839J06801n92M1068K16273j48723J8672P3928
$$ -520170 -273629 -197485 -33948 4891 111692 111100 152168 368441 219718 238390 312318
20284C12318j98392j26425q2886N3676J4219n8939K3983M1971O9471J2310k13969
$$ 312318 113926 -12499 -95385 -41709 -27490 -86429 -62446 -20475 48996 61306 -152663
20273a52663o4135J85255o2295k61844J31766L02637m6133k24177J19899K15848
$$ -152663 -216798 -31543 -93838 -355682 -223916 78721 32588 -191589 -71690 144158
20263A44158J17223J45356m1405k51630j71296j7940N4697K7996j79164N945M1507
$$ 144158 261381 406737 365332 113702 -57594 -75534 -20837 7159 -172005 -166060 -124553
20252a24553m4738k666L17391j9440k4342j1117n2617J11762L9379k61745j03701
$$ -124553 -169291 -171957 145434 125994 101652 90535 37918 149680 189059 -72686 -176387
20241a76387M51206j08965m88549j09079K77654J06624M0975k9212K91874M7367
$$ -176387 274819 165854 -322695 -431774 -154120 -47496 -6521 -35733 256141 303508
20231C03508k29449k72731M0211J34231l5351p3471j1034K24554J79689N5512
$$ 303508 74059 -198672 -158461 -24230 -59581 -133052 -144086 80468 260157 315669
20221C15669k67319k37022J53736J08650O8142J25942j18545K59896m7016j40675
$$ 315669 48350 -188672 -34936 73714 141856 267798 149253 409149 362133 221458
20211B21458j60096j16214J44538J69805o2195K35017j01249l8417k37112l16845
$$ 221458 61362 -54852 89686 259491 197296 432313 331064 292647 55535 -261310
20201b61310R9971J39385J01303K5429m5910Q0921J2184j97657m6472O552N2440
$$ -261310 -161339 -21954 79349 104778 58868 139789 151973 -45684 -92156 -85604 -33164
20190c3164q0566M9219q3698j28879J9Q8205J07953J25300N9794r0060p5186j28520
$$ -33164 -113730 -64511 -148209 -277088 -277069 -188864 -80911 44389 104183 14123 -61063 -189583
20178a89583n1185L51685K76253j93901j48883r8777L7203M65395J73499K5625
$$ -189583 -240768 110917 387170 193269 44386 -54391 -17188 448207 621706 647331
20168F47331K3212o0669j39086k30277J49899L94297j5969j52991M8018O4011
$$ 647331 670543 609874 470788 240511 390410 784707 768738 615747 663765 727776
20158G27776L0466j69458n3636N6372m1345K4669L29447m94m19502j75910J6081
$$ 727776 758242 588784 535148 591520 550175 574844 904291 903797 484295 308385 324466
20147C24466M7671j16371r9702Q313n0024p5646k9326K36611O1864j328j30837
$$ 324466 372137 255766 156064 164377 114353 38707 9381 245992 307856 306528 175691
20136A75691p1005P0327R8534J89205K91821K17615k53121k11906J27571k41587
$$ 175691 104686 175013 273547 462752 754573 972188 719067 507161 634732 393145
20126C93145j68615J98758R3600J6025k20734L2453J69682l56705j54283J34944
$$ 393145 224530 423288 516888 532913 312179 344632 514314 157609 3326 138270
20116A38270K09434q3692l9904J76847q0578j74526R5868K75725p0684j28306
$$ 138270 347704 264012 224108 400955 320377 145851 241719 517444 446760 318454
20106C18454k38165j93764K12179M6601J46264J07905j06593J37748k66438j33969
$$ 318454 80289 -113475 98704 145305 291569 399474 292881 430629 164191 30222
20096C0222J50951P4510k39380j24875k36035J20204J48015J41355K73514o3797
$$ 30222 181173 255683 16303 -108572 -344607 -224403 -76388 64967 338481 274684
20086B74684o7432j14070j54441j38915J57669R3023n6467k3987N6669R1560q0485
$$ 274684 207252 93182 -61259 -200174 -42505 50518 -5949 -29936 26733 118293 37808
20075C7808k9915j6502k40932m0701P7357P9725K06761j22005k09407K44463J74105
$$ 37808 7893 -8609 -249541 -290242 -212885 -133160 73601 -48404 -257811 -13348 160757
20064A60757J57146N3451j80616q3280j35755k18593R316m1425J16844p9636N2504
$$ 160757 317903 371354 190738 107458 -28297 -246890 -237574 -278999 -162155 -241791 -189287
20053a89287q9463k51368n7523q838L509L5207n2493L4907P1440L25383K36626
$$ -189287 -278750 -530118 -587641 -596479 -592970 -557763 -610256 -575349 -503909 -178526 58100
20042E8100r601J23424J82315j49400m8689n6041k36400j79180j25138j05845
$$ 58100 48499 171923 354238 204838 156149 100108 -136292 -315472 -440610 -546455
20032e46455J28023L14974K29681j95438k51369R3209M2650J10103j99351R0060
$$ -546455 -418432 -103458 126223 -69215 -320584 -227375 -184725 -74622 -273973 -183913
20022a83913J58915J64362K00078p1612j39051r6440j41028O1294k9179o6942
$$ -183913 -24998 139364 339442 267830 128779 32339 -108689 -47395 -76574 -143516
20012a43516J00955J39071j6781J46172m5291K3098j8925m074p8481K2842O1960
$$ -143516 -42561 96510 79729 225901 180610 203708 184783 180709 102228 125070 187030
20001A87030J13177O4375M9956j70356j26414p4495j36085k25653j45402j34419
$$ 187030 300207 364582 414538 244182 117768 43273 -92812 -318465 -463867 -598286
19991e98286K29589L81864J10857M8676l496j82991M1505l8178J2210J85014J44801
$$ -598286 -368697 13167 124024 172700 169204 -13787 27718 -10460 1750 186764 331565
19980C31565M0190k03342j75677o4785J316L18899K95023n4166k54399j45216
$$ 331565 371755 168413 -7264 -72049 -70733 248166 543189 489023 234624 89408
19970H9408L0125k92680R5387J29172L1498R1118j50325j76924J69998K34733
$$ 89408 119533 -173147 -77760 51412 82910 174028 23703 -153221 16777 251510
19960B51510K7579m483j29968J02251j10319j60678J63035L6336L9699p6462j22092
$$ 251510 279089 274606 144638 246889 136570 -24108 138927 175263 214962 138500 16408
19949A6408K3606k71779P2760P8300P3766K08936o266Q2089q6684k1775R6993
$$ 16408 40014 -231765 -159005 -80705 -6939 201997 195731 277820 191136 169361 266354
19938B66354j79985L972J53008Q749k58913N5992K04627J25918N9761p2486k31019
$$ 266354 86369 90341 243349 252098 -6815 49177 253804 379722 439483 366997 135978
19927A35978k88335K50341K98592k61455k43824m7137J49124J94390q8502p7109
$$ 135978 -152357 97984 396576 135121 -108703 -155840 -6716 187674 99172 22063
19917B2063J21179J95878o1507j82768m829M8898J36178l5339j25360j30020j90189
$$ 22063 143242 339120 277613 94845 90016 138914 275092 239753 114393 -15627 -205816
19906b05816K49738M00140r4608r8022k33533j06598K4784k2780N8677O0987o6249
$$ -205816 43922 444062 349454 251432 17899 -88699 -63915 -86695 -28018 32969 -33280
19895c3280P4622J34866K18249j94071j83962k45160o1111j19921k9338L7617
$$ -33280 41342 176208 394457 200386 16424 -228736 -289847 -409768 -439106 -401489
19885d01489M6933K55619J80633j35381r6675K05677J41998L7459J43902N1227
$$ -401489 -354556 -98937 81696 -53685 -150360 55317 197315 234774 378676 429903
19875D29903j50507n28182k82782J96142K40814J65309q0396j51505k16924J0028
$$ 429903 279396 -248786 -531568 -335426 -94612 70697 -9699 -161204 -378128 -368100
19865c68100L36531J81129L1199k09967p0938O2296J07378l304j58556M2424K2437
$$ -368100 -31569 149560 180759 -29208 -100146 -37850 69528 66224 -92332 -49908 -27471
19854b7471K7320n4900P2774k6297O0275J73240j71290Q242J14980Q9755J86737
$$ -27471 -151 -55051 17723 -8574 51701 224941 53651 61893 176873 266628 453365
19843D53365M3414L8727m4451J00671j51118k1516j20277N063J29224J34643j54018
$$ 453365 496779 535506 491055 591726 440608 419092 298815 303878 433102 567745 413727
19832D13727j65894q9075Q7173m9784j01976J8050j32839N2864N5006P6596K11658
$$ 413727 247833 158758 245931 196147 94171 112221 -20618 32246 87252 163848 375506
19821C75506J66020j20133k53971j28182q2564O7683K11105J04704L9483K0229
$$ 375506 541526 421393 167422 39240 -43324 24359 235464 340168 379651 399880
19811C99880j43543K13519J24704j42763p2155K343k00756R663J73808L1577M8988
$$ 399880 256337 469856 594560 451797 379642 381985 181229 190892 364700 396277 445265
19800D45265j72865p5559Q8998L9027j8732J41308q417j17933j43984m2260O315
$$ 445265 272400 196841 285839 324866 306134 447442 439025 321092 177108 134848 141163
19789A41163p7000k15980K0137J80572P4086J1609J14601l0693k15552o2718J20293
$$ 141163 64163 -151817 -131680 48892 122978 134587 249188 218495 2943 -59775 60518
19778F0518J74622j17437P5069P7897Q1072l2591r0035j92067j51867R2157K92028
$$ 60518 235140 117703 192772 270669 351741 319150 229115 37048 -114819 -22662 269366
19767B69366l0520j12424J83552J17496Q111p7055j10830J6533J06094K2502K0694
$$ 269366 238846 126422 309974 427470 435581 358526 247696 264229 370323 392825 413519
19756D13519O3806j65293o1016N4130L2948K31903l0610R7004j18661o0745J35684
$$ 413519 477325 312032 251016 305146 338094 569997 539387 636391 517730 456985 592669
19745E92669o5982r8573J60134m8301k01759N3886P6296J62533P6158l44671j93570
$$ 592669 526687 428114 588248 539947 338188 392074 468370 630903 707061 362390 168820
19734A68820J00549L1395J68817k70294k17483L3127K85066L04164K5606k531
$$ 168820 269369 300764 469581 199287 -18196 14931 299997 604161 629767 627236
19724F27236j12736j18673k06699n6111J77560j4840k26270J57244N06182p747
$$ 627236 514500 395827 189128 133017 310577 295737 69467 226711 732893 725146
19714G25146k1274K409j71344j90297J90622J03416l6927J26837j65635M822K16458
$$ 725146 703872 706281 534937 344640 535262 638678 601751 728588 562953 567775 784233
19703G84233K03574J09800k47325j61849j12095J1193j32737o5835J68291L12866
$$ 784233 987807 1097607 850282 688433 576338 587531 454794 388959 557250 870116
19693H70116P0086k98265O282K02240n766o4728k09669k29343N1659K12465J99542
$$ 870116 940202 641937 648219 850459 844693 779965 570296 340953 392612 605077 804619
19682H04619M4254j12316P8484N2664K5089J42586p0096j79823K61890R3779m4859
$$ 804619 848873 736557 815041 867705 892794 1035380 965284 785461 1047351 1141130 1096271
19671A096271N4059J40736P9218L3314j23382j46369P0292J38756J71512K4153
$$ 1096271 1150330 1291066 1370284 1403598 1280216 1133847 1204139 1342895 1514407 1538560
19661A538560m733l6215j94762n9816J11697K00838J25876o418j0984K50588J26287
$$ 1538560 1533827 1497612 1302850 1243034 1354731 1555569 1681445 1675027 1664043 1914631 2040918
19650B040918J17590Q4922k01797Q1877L09355K57318k1150m0884R491J29622
$$ 2040918 2158508 2243430 2041633 2123510 2432865 2690183 2669033 2628149 2637640 2767262
19640B767262J55557J25598K92511K55444K84860K7368L15670K98122K30494M9847
$$ 2767262 2922819 3048417 3340928 3596372 3881232 3908600 4224270 4522392 4752886 4802733
19630D802733K00003L86375N08212L91170N21969L41595K95664N15912L97786
$$ 4802733 5002736 5389111 5897323 6288493 6810462 7152057 7447721 7963633 8361419
19621H361419M66055N76370O22219M51376P10326P60353Q15241J059531J507131
$$ 8361419 8827474 9403844 10026063 10477439 11187765 11948118 12763359 13822890 15330021
19612A5330021J654279J853370K427890K998292M024343M791969N974725P449937
$$ 15330021 16984300 18837670 21265560 24263852 28288195 33080164 39054889 46504826
19604D6504826R134018J0368740J0516860Q832821O067337M049903K688544K535042
$$ 46504826 55638844 66007584 76524444 85357265 91424602 95474505 98163049 100698091
19596A00698091J326319q49057k858962k600016r54304J460008L811993M871788
$$ 100698091 102024410 101175353 98316391 95716375 94762071 96222079 100034072 104905860
19588A04905860L837472J641176k26059r81843j574028l320698n858246p744821
$$ 104905860 108743332 110384508 110158449 109176606 107602578 104281880 98423634 90678813
19580I0678813q722720p960932n843315l645544j342302R83706L237263N615102
$$ 90678813 81956093 73995161 68151846 64506302 63164000 64147706 67384969 73000071
19572G3000071P587274Q666239Q348642O430011M066903K154042J622953Q53959
$$ 73000071 80587345 89253584 97602226 104032237 108099140 110253182 111876135 112730094
19564A12730094o77572k831520l788793l139492j168739J559630L913714L802160
$$ 112730094 112052522 109221002 105432209 102292717 101123978 102683608 106597322 110399482
19556A10399482J891607l18596j722768k396247l409345n908180q789831j0695043
$$ 110399482 112291089 111972493 110249725 107853478 104444133 98535953 89746122 79051079
19548G9051079j0960480r839603q112503o663294n278463m338813l539281l078600
$$ 79051079 68090599 58250996 50138493 43475199 38196736 33857923 30318642 27240042
19540B7240042k482715j846925j594597j693257j328718r13137r33883q42421
$$ 27240042 24757327 22910402 21315805 19622548 18293830 17380693 16446810 15604389
19532A5604389o84503n01278o73295o61975n34814o99807m65170l82930n60829
$$ 15604389 14919886 14418608 13745313 13083338 12548524 11848717 11383547 11000617 10439788
19523A0439788n31072l75559n80935l10900m14775m06658k73838Q1386j28879
$$ 10439788 9908716 9533157 8952222 8641322 8226547 7819889 7546051 7627437 7498558
19514G498558k79446l44657l87954m11604k19712q5887j00454M8009k09822k30603
$$ 7498558 7219112 6874455 6486501 6074897 5855185 5769298 5668844 5716853 5507031 5276428
19504E276428m29957j00281l8816n15916j22239p0057k79917q5902J10472j06438
$$ 5276428 4846471 4746190 4707374 4191458 4069219 3999162 3719245 3633343 3743815 3637377
19494C637377n4551J34119k39183l71523n9853J14007p2866m2761K32678r180
$$ 3637377 3582826 3716945 3477762 3106239 3046386 3160393 3087527 3044766 3277444 3268264
19484C268264k91744M8931j09199n6033n51q0373j39571o8318J69621j18019l55333
$$ 3268264 2976520 3025451 2916252 2860219 2859668 2779295 2639724 2571406 2741027 2623008 2267675
19473B267675q9247j13135j1967r7738l3564L9059J29370k5005j90958l08196
$$ 2267675 2178428 2065293 2053326 1955588 1922024 1961083 2090453 2065448 1874490 1566294
19463A566294j06885K04352J66607r3651j03255J30159O8404j89043K416R4619
$$ 1566294 1459409 1663761 1830368 1736717 1633462 1763621 1832025 1642982 1645398 1740017
19453A740017J1712j40634n3081J20956n6044r3300k04820j46800o0761J68655
$$ 1740017 1751729 1611095 1558014 1678970 1622926 1529626 1324806 1178006 1117245 1285900
19443A285900J00320K4570m8457M1534k02426L8955J83952J39771j70602J9148
$$ 1285900 1386220 1410790 1362333 1403867 1201441 1240396 1424348 1564119 1393517 1412665
19433A412665O2475l5940j82839j81224M1067J939l8286j10938p5372J90068L7945
$$ 1412665 1475140 1439200 1256361 1075137 1116204 1118143 1079857 968919 893547 1083615 1121560
19422A121560j32322P6316L24100m962j24854j41533k16210n640L44087J63048
$$ 1121560 989238 1065554 1389654 1384692 1259838 1118305 902095 896455 1240542 1403590
19412A403590l22530l13178j45808j04753j94945K4301L29384j9979k6887O7210
$$ 1403590 1081060 767882 622074 517321 322376 346677 676061 656082 629195 696405
19402F96405m9440o2653K21944J13301p0977m1641R4030n5989n7516k1472l14647
$$ 696405 646965 584312 806256 919557 848580 806939 900969 844980 787464 765992 451345
19391D51345L5129L77376K80970M3186J16007L37890p9366l30069q9623J83863
$$ 451345 486474 863850 1144820 1188006 1304013 1641903 1562537 1232468 1142845 1326708
19381A326708M211k51709J4466K93842J23527r1405j24673K20302K40381q8824
$$ 1326708 1330919 1079210 1093676 1387518 1511045 1419640 1294967 1515269 1755650 1666826
19371A666826K0675p1057N1587K07231J37431k22896m28252j31645j82870k79657
$$ 1666826 1687501 1616444 1668031 1875262 2012693 1789797 1361545 1229900 1047030 767373
19361G67373K20953K23219j47305l94376j49380Q4863K5499Q7272Q7826j36553
$$ 767373 988326 1211545 1064240 669864 520484 605347 630846 718118 805944 669391
19351F69391j81599J94508o4913n4013j9441J04795J05772j47669l52028k7836
$$ 669391 487792 682300 617387 563374 543933 648728 754500 606831 254803 226967
19341B26967J97023J22513m5781N2123J88409J39428J47404J74528j47670q4773
$$ 226967 423990 546503 500722 552845 741254 880682 1028086 1202614 1054944 970171
19331I70171j5566J94668J22147j28453J16665j13813O6052J77810K4769J32237
$$ 970171 954605 1149273 1271420 1142967 1259632 1145819 1211871 1389681 1414450 1546687
19321A546687P9561j38428J32413J5602j14697m0718N4131j98800K8151K6629
$$ 1546687 1626248 1487820 1620233 1635835 1521138 1480420 1534551 1335751 1363902 1390531
19311A390531j17061l54390j10882J87362k99223k36047l11773j21718J54891
$$ 1390531 1273470 919080 808198 995560 696337 460290 148517 26799 181690
19302A81690q3303R0606K07451K0758M9936N9525J57404r3357l9335J1412o7617
$$ 181690 98387 188993 396444 417202 467138 526663 684067 590710 551375 562787 495170
19291D95170j782j39243j75072Q2827M6951L5862l9783J61807m5426j61143j03579
$$ 495170 493388 354145 179073 261900 308851 344713 304930 466737 421311 260168 156589
19280A56589r6096j7254O2633J23683j45754l4616J24979q7026J00484K90576
$$ 156589 60493 43239 105872 229555 83801 49185 174164 87138 187622 478198
19270D78198L6216K7332J71070J79884J51401K70433m6796p4018M5794j24295
$$ 478198 514414 541746 712816 892700 1044101 1314534 1267738 1193720 1239514 1115219
19260A115219p8342J54868M710q4799l361K668m1034k7825M18468L94758l82106
$$ 1115219 1036877 1191745 1196455 1111656 1108295 1110963 1069929 1042104 1460572 1855330 1473224
19249A473224k43857j68868L094O0780K8449R379j36139K90111P5093j47377l9089
$$ 1473224 1229367 1060499 1063593 1124373 1152822 1162201 1026062 1316173 1391266 1243889 1204800
19238A204800j61028k67981q1674m1910R998J04688p0198k20002m4875K05211
$$ 1204800 1043772 775791 694117 652207 662205 766893 696695 476693 431818 637029
19228F37029o2970J53324o0078P7074q7967J84428K2780p9594m6722l4484p1694
$$ 637029 574059 727383 667305 744379 656412 840840 863620 784026 737304 702820 631126
19217F31126k40163p8302J66851R0761P6836K7423p5225j93546k32125l1460R4767
$$ 631126 390963 312661 479512 570273 647109 674532 599307 405761 173636 142176 236943
19206B36943R5845k311j35998j02449j71357j095L48603M376k09764k8440M7537
$$ 236943 332788 330477 194479 92030 -79327 -80422 268181 272557 62793 34353 81890
19195H1890j78478m0378L36828N3551J05554J34207r494k8484j01873j24502P0178
$$ 81890 -96588 -136966 199862 253413 358967 493174 483680 455196 353323 228821 298999
19184B98999O0381J03675q3354p7625L00204k0406k17781k3964P4678P2876Q9913
$$ 298999 359380 463055 379701 302076 602280 581874 364093 340129 414807 487683 577596
19173E77596L40382J7325O606l4678P8055j25138j38773J21422j25096j40371
$$ 577596 917978 935303 941909 907231 985286 860148 721375 842797 717701 577330
19163E77330P8904N4945k3132O9146k2589m6374J13287j15976k8794n8256j03851
$$ 577330 656234 711179 688047 757193 734604 688230 801517 685541 656747 598491 494640
19152D94640J3947p8042J48943Q3187J6443j4517P9817J41889K55127R6955j30681
$$ 494640 508587 430545 579488 662675 679118 664601 744418 886307 1141434 1238389 1107708
19141A107708k40189r4433k10108o575J10142J59253M1693k8825J17222J15995
$$ 1107708 867519 773086 562978 556403 666545 825798 867491 838666 955888 1071883
19131A071883j32343j58637k2693K48891p5222m6275L21709J71942J15404J14570
$$ 1071883 939540 780903 758210 1007101 931879 885604 1207313 1379255 1494659 1609229
19121A609229J20947M0622m1886K6958q1935m1880k0522j24668j06682q3297k34248
$$ 1609229 1730176 1770798 1728912 1755870 1673935 1632055 1611533 1486865 1380183 1296886 1062638
19110A062638o4210J79937j39161K5390K70162M798j36665n1483j68084k33886
$$ 1062638 998428 1178365 1039204 1064594 1334756 1339554 1202889 1151406 983322 749436
19100G49436k5480j4448K2168J61359k6458R9120o8061r8853o6327j32535N770
$$ 749436 723956 709508 731676 893035 866577 965697 897636 798783 732456 599921 605691
19089F05691J71639p8376N742j42242m5300j17388L492J57301n0220J08925L7111
$$ 605691 777330 698954 704696 562454 517154 399766 403258 560559 510339 619264 656375
19078F56375j26632J7782J56245M87094K90772j3130j58180j13190L8489j79972
$$ 656375 529743 547525 703770 1190864 1481636 1468506 1310326 1197136 1235625 1055653
19068A055653p9955J87393j5346r7823j44352J62503K20503L4510l0467N8796
$$ 1055653 975698 1163091 1147745 1049922 905570 1068073 1288576 1323086 1292619 1351415
19058A351415j50601p1503k27467k9267K51773p9677k29149J8749K52832K18518
$$ 1351415 1200814 1129311 901844 872577 1124350 1044673 815524 834273 1087105 1305623
19048A305623k10973J12664Q1870o6997K04552m3611j02831j01394j55870j37052
$$ 1305623 1094650 1207314 1289184 1222187 1426739 1383128 1280297 1178903 1023033 885981
19038H85981k1880M05321K70975Q614j94829k41889l4103r7372J21032k12756
$$ 885981 864101 1269422 1540397 1549011 1354182 1112293 1078190 980818 1101850 889094
19028H89094l2686K67402N9009J37827N7131R1218N0754J73438L6420j22832j29477
$$ 889094 856408 1123810 1182819 1320646 1377777 1468995 1519749 1693187 1729607 1606775 1477298
19017A477298k5301P200J59461K45608J28198j78252j52560k0961j54831j26448
$$ 1477298 1451997 1459197 1618658 1864266 1992464 1814212 1661652 1640691 1485860 1359412
19007A359412k77083j71390p0149K44276L48669L299P3513k989R1393K65340L15859
$$ 1359412 1082329 910939 840790 1085066 1433735 1437034 1510547 1507558 1598951 1864291 2180150
18996B180150J38889l52865j02015J09915n5186j86217j38938O19k35038K2377
$$ 2180150 2319039 1966174 1864159 1974074 1918888 1732671 1593733 1594352 1359314 1381691
18986A381691K06431N19551J87561P5555j58924j06572m5554K15661k7596J26088
$$ 1381691 1588122 2107673 2295234 2370789 2211865 2105293 2059739 2275400 2247804 2373892
18976B373892J28585n12o1100k65686j97164n0468J34243N7409P2970P1612p1484
$$ 2373892 2502477 2501965 2440865 2175179 1978015 1927547 2061790 2119199 2192169 2263781 2192297
18965B192297j11678j30066j4234j05789q0860K13850Q0636J28533R3291L0764
$$ 2192297 2080619 1950553 1936319 1830530 1749670 1963520 2044156 2172689 2265980 2296744
18955B296744J08392K10981M0194Q9898L03611L08562k48p3259J86390J07711
$$ 2296744 2405136 2616117 2656311 2746209 3049820 3358382 3358134 3284875 3471265 3578976
18945C578976p414J5604J74299K95672M68363O26774K71431M3090L20136M13821
$$ 3578976 3571562 3587166 3761465 4057137 4525500 5152274 5423705 5466795 5786931 6200752
18935F200752L24331O74058O69269O01529J049561J303734J899137K313720L085173
$$ 6200752 6525083 7199141 7868410 8469939 9519500 10823234 12722371 15036091 18121264
18926A8121264M946402P323039J0245789J3362382J4582465R526876j816596r947804
$$ 18121264 23067666 30390705 40636494 53998876 68581341 78108217 76291621 66343817
18918F6343817j1956327j0005468o521619l325416o89968K188078N044530Q663297
$$ 66343817 54387490 44382022 37860403 34534987 33845019 36033097 41077627 49740924
18910D9740924J1998368J2364900O074495n130688j1787793j2651794j0433390
$$ 49740924 61739292 74104192 80178687 75047999 63260206 50608412 40175022
18903D0175022p748166n411929l608852k682684k031382j334615r22780j49594
$$ 40175022 32426856 27014927 23406075 20723391 18692009 17357394 16434614 16285020
18895A6285020j23499J6968j72348r6247J55567M25436P49331R93555Q78117J234675
$$ 16285020 16161521 16178489 16006141 15909894 16065461 16490897 17240228 18233783 19111900 20346575
18885B0346575J596011K295010K861440L935995N185154O822370J0054264J4107307
$$ 20346575 21942586 24237596 27099036 31035031 36220185 43042555 53096819 67204126
18877F7204126J7658108J8520597J2399315J727110k654480Q10978R415497J7720122
$$ 67204126 84862234 103382831 115782146 117509256 114854776 115665754 125081251 142801373
18869A42801373K0890626J4381947L406897m379423m326546K021416Q728938R900842
$$ 142801373 163691999 178073946 181480843 177101420 172774874 174796290 183525228 193426070
18861A93426070P761414R149383J0239011P697200M45926j0492118k1796894k5748993
$$ 193426070 201187484 210336867 220575878 228273078 228719004 218226886 196429992 170680999
18853A70680999k1310185j2154288m615871l823440j0389314j5967801j7125053
$$ 170680999 149370814 137216526 132600655 128777215 118387901 102420100 85295047
18846H5295047j4397583j0656388p439542n419451m134577l005730k251227j502531
$$ 85295047 70897464 60241076 52801534 47382083 43247506 40241776 37990549 36488018
18838C6488018r46238l94529j23668J70692O85065R92323J348653K160033L069006
$$ 36488018 35541780 35147251 35023583 35194275 35879340 36871663 38220316 40380349 43449355
18829D3449355M626655O714429J0245948J5062357J9978897K3820091K2198945
$$ 43449355 48076010 54790439 65036387 80098744 100077641 123897732 146096677
18822A46096677J3039188O000703K971478k952717r599382j0057708l322703Q023695
$$ 146096677 159135865 165136568 168108046 165155329 155555947 145498239 142175536 150199231
18814A50199231K1696038L4199130M0500618L3316118J0855006k0032038l8037845
$$ 150199231 171895269 206094399 246595017 279911135 290766141 270734103 232696258
18807B32696258l7673167k6516171j1925875m31753L692462l062549j5824344
$$ 232696258 195023091 168506920 156581045 156149292 159841754 156779205 140954861
18800A40954861k3086520k2429840j8164669j3343779j0013431p091542n141687
$$ 140954861 117868341 95438501 77273832 63930053 53916622 46825080 41683393
18793D1683393m006035l204889k751219k087470j703576j236151j124485r09888
$$ 41683393 37677358 34472469 31721250 29633780 27930204 26694053 25569568 24659680
18785B4659680j310379r13064q65722q02791m97291l97697p74306p63128p32778
$$ 24659680 23349301 22436237 21570515 20767724 20270433 19872736 19098430 18335302 17602524
18776A7602524n07309j36001k15796n5317K6128r423K63191O79573R07376N59857
$$ 17602524 17095215 16959214 16743418 16688101 16714229 16704806 16967997 17647570 18554946 19114803
18766A9114803N52646N10792O19373R77870R14131R92060J177404J864995K445692
$$ 19114803 19667449 20178241 20797614 21775484 22689615 23681675 24859079 26724074 29169766
18757B9169766L105776M345147O236971Q905169J3314729J8636912K3449606K4140066
$$ 29169766 32275542 36620689 42857660 51762829 65077558 83714470 107164076 131304142
18749A31304142J8535437J1578786O064041k185181j0846182j1847816n510648
$$ 131304142 149839579 161418365 167482406 165297225 154451043 142603227 137092579
18742A37092579M151288J1641272J2425189Q959439Q568459R553039Q023901P201443
$$ 137092579 141243867 152885139 165310328 174269767 182838226 192391265 200415166 207616609
18734B07616609N072680n5544l162290p822637j6067774j9654780j4859474n026939
$$ 207616609 212689289 212633745 209471455 201648818 185581044 165926264 151066790 146039851
18726A46039851M290673P988304L284849l031988p213773j3795676k0372489k1831516
$$ 146039851 150330524 158318828 161603677 158571689 151357916 137562240 117189751 95358235
18718I5358235j9205194j4341056j0303708p468166n423847m422396l349048k386559
$$ 95358235 76153041 61811985 51508277 44040111 38616264 34193868 30844820 28458261
18710B8458261j948867j601514j203629j238808j285607j360185j144594r20938
$$ 28458261 26509394 24907880 23704251 22465443 21179836 19819651 18675057 17754119
18702A7754119j097655r90139p09901m64332o86756p02344n13179m72405m17486
$$ 17754119 16656464 15666325 14956424 14492092 13805336 13102992 12589813 12117408 11699922
18693A1699922k81704o211j78155k30618p6819k3547j31561k76096Q3833K01504
$$ 11699922 11418218 11412007 11233852 11003234 10926415 10902868 10771307 10495211 10579044 10780548
18683A0780548p5743j21756j24922l01478n5173l1302o0080k11840k84939N4694
$$ 10780548 10704805 10583049 10458127 10156649 10101476 10070174 10010094 9798254 9513315 9568009
18673I568009J36243K11708K61016N74653O99687P42245Q08107J096140J239275
$$ 9568009 9704252 9915960 10176976 10751629 11451316 12193561 13001668 14097808 15337083
18664A5337083J758556K570891L801343N363644P522625J0772843J4656203J7926570
$$ 15337083 17095639 19666530 23467873 28831517 36354142 47126985 61783188 79709758
18656G9709758J8137944J5445936J1550654L530289n505401j1522634j5845254
$$ 79709758 97847702 113293638 124844292 128374581 122869180 111346546 95501292
18649I5501292j7781975j6336516j3307199r570550o948218m873812l624304k612058
$$ 95501292 77719317 61382801 48075602 38505052 31556834 26683022 23058718 20446660
18641B0446660j821501j321701r95019q54965o70059m43094k48671k08006k33741
$$ 20446660 18625159 17303458 16308439 15453474 14783415 14340321 14091650 13883644 13649903
18632A3649903j49271r2664l5516J55997n4411J35583J97077P6952K3971K13007
$$ 13649903 13500632 13407968 13372452 13528449 13474038 13609621 13806698 13883650 13907621 14120628
18622A4120628N10470O46323R14717J203437J461835J931571K294800L440145
$$ 14120628 14631098 15277421 16192138 17395575 18857410 20788981 23083781 26523926
18614B6523926M989249O697176Q867324J2435728J6798644K1339739K4990854
$$ 26523926 31513175 38210351 47077675 59513403 76312047 97651786 122642640
18607A22642640K8896664L0257287K5442240J6724607P802184n744994j8845315
$$ 122642640 151539304 181796591 207238831 223963438 231765622 226020628 207175313
18600B07175313k5676716k9325001k9850300k6405149k1041877j5544863j1179413
$$ 207175313 181498597 152173596 122323296 95918147 74876270 59331407 48151994
18593D8151994q008108n873349m234888l014315k419362j882592j686709j414718
$$ 48151994 40143886 34270537 30035649 27021334 24601972 22719380 21032671 19617953
18585A9617953p91303o28453n57231p76470m43487n18275m44222m75111k65517
$$ 19617953 18826650 18198197 17640966 16864496 16421009 15902734 15458512 14983401 14717884
18576A4717884k81632k69512k06356J74134L08134J24810K65711M04388P31314
$$ 14717884 14436252 14166740 13960384 14134518 14442652 14567462 14833173 15237561 15968875
18567A5968875J072028J551930K020337L189233M328850O416175R275365J3066391
$$ 15968875 17040903 18592833 20613170 23802403 28131253 34547428 43822793 56889184
18559E6889184J6881362J9182254J7113858J3538252P836964j886900r869838
$$ 56889184 73770546 92952800 110066658 123604910 131441874 129554974 119685136
18552A19685136j4457304j7870225j8027787j5520103j2123108q608810o272807
$$ 119685136 105227832 87357607 69329820 53809717 41686609 33077799 26804992
18545B6804992m058363k945834k394819k037428j560618j142257r96402q20031
$$ 26804992 22746629 19800795 17405976 15368548 13807930 12665673 11669271 10849240
18537A0849240l61954n38784n00665l08960l05495k72859k27712M9084k00623
$$ 10849240 10487286 9948502 9447837 9138877 8833382 8560523 8332811 8381895 8181272
18528H181272l41883k31834j64638j81546l10078k44041l81446m95001o33676
$$ 8181272 7839389 7607555 7442917 7261371 6951293 6707252 6325806 5830805 5197129
18519E197129m34418j24305n0380m9798j55663j6698K43377P0834m8529k18505
$$ 5197129 4762711 4638406 4588026 4538228 4382565 4365867 4609244 4680078 4631549 4413044
18509D413044k75728k18052j1257K57282J13587j33742l01253l06158l00464l78817
$$ 4413044 4137316 3919264 3908007 4165289 4278876 4145134 3843881 3537723 3237259 2858442
18499B858442j37187J00984o485L8162p0692j70170j00301o1946j34540r3227
$$ 2858442 2721255 2822239 2815754 2853916 2783224 2613054 2512753 2450807 2316267 2223040
18489B223040J2782M2845M8253Q2537j78127J81441Q4238J01522j15776M713J49401
$$ 2223040 2235822 2278667 2326920 2409457 2231330 2412771 2497009 2598531 2482755 2487468 2636869
18478B636869K13407M6631K4100n2182j98661q8676j28896j06135p0813p6641
$$ 2636869 2850276 2896907 2921007 2868825 2670164 2581488 2452592 2346457 2275644 2199003
18468B199003J56505L58901Q1825l60038k58424Q7073M08290K17870P8667Q2763
$$ 2199003 2355508 2714409 2796234 2436196 2177772 2264845 2673135 2891005 2969672 3052435
18458C052435Q5705Q7586J98140K8737k61686j00931k06172K76411J5354j91017
$$ 3052435 3138140 3225726 3423866 3452603 3190917 3089986 2883814 3160225 3175579 2984562
18448B984562j39177n5230k223J94751J43535j16402P7512K70714K95135J89001
$$ 2984562 2845385 2790155 2787932 2982683 3126218 3009816 3087328 3358042 3653177 3842178
18438C842178M38335K53637K76390P6937K00000L52196M44927P06404P36272N52085
$$ 3842178 4280513 4534150 4810540 4887477 5087477 5439673 5884600 6591004 7327276 7879361
18428G879361L60220O02181O70661N91116Q91195J216576J697676J937838K389469
$$ 7879361 8239581 8841762 9512423 10103539 10994734 12211310 13908986 15846824 18236293
18419A8236293K797215L750943N359457P952858J1668460J6790728K1112092K1052335
$$ 18236293 21033508 24784451 30143908 38096766 49765226 66555954 87668046 108720381
18411A08720381J2113761k977967j0484831r039625j611003P339765J3549033
$$ 108720381 120834142 117856175 107371344 98331719 96720716 104060481 117609514
18404A17609514J2943571J871441j0567117j4134540j0069709j339844P012375
$$ 117609514 130553085 132424526 121857409 107722869 97653160 96313316 103325691
18397A03325691J2102426J0481505r27713j0962920j2467634p524015M90255P655281
$$ 103325691 115428117 125909622 124981909 114018989 101551355 94027340 94517595 102172876
18389A02172876J0532391M575972r225874j7928389j8837997j5258052j0860982
$$ 102172876 112705267 117281239 108055365 90126976 71288979 56030927 45169945
18382D5169945p532829n228782l746954k898248k041886j471217j035210q09382
$$ 45169945 37637116 32408334 28661380 25763132 23721246 22250029 21214819 20405437
18374B0405437n54987l67116J07720J20141N16071P34582J446658K206636L240010
$$ 20405437 19850450 19483334 19591054 19711195 20227266 20961848 22408506 24615142 27855152
18365B7855152N163272P295587J0193957J3292300J3556593P289358k840461p269936
$$ 27855152 33018424 40314011 50507968 63800268 77356861 84646219 81805758 74535822
18357G4535822o071444j579916L990865Q254499P739087N18483o937717q782294
$$ 74535822 68464378 66884462 70875327 79129826 86868913 87387396 80449679 71667385
18349G1667385n787706k96059M919277Q374877O828230p96416p695027q546158
$$ 71667385 65879679 65583620 70502897 78877774 85706004 84909588 77214561 68668403
18341F8668403m953572L51554M969656O454293J792661o647907j1480955j2221934
$$ 68668403 63714831 64066385 69036041 75490334 77282995 70635088 59154133 46932199
18333D6932199r818136o849561m898316l672722k662032k099902j745039j075851
$$ 46932199 37114063 30264502 25366186 21693464 19031432 16931530 15186491 14110640
18325A4110640q26570p20008p77217p39199p66186n28269o08901n61584l29800
$$ 14110640 13284070 12564062 11786845 11047646 10281460 9753191 9144290 8582706 8252906
18316H252906k89274l56303o05218j77540p0365R436k2638j15786j88372j28820
$$ 8252906 7963632 7607329 7002111 6824571 6754206 6763642 6741004 6625218 6436846 6308026
18306F308026L4975k33736m63670j56968l14662j20636J26187Q8474J8445J51887
$$ 6308026 6343001 6109265 5645595 5488627 5173965 5053329 5179516 5267990 5286435 5438322
18296E438322K80673K5911l19539j69278j25198k95331j47849k0083p0762k32622
$$ 5438322 5718995 5744906 5425367 5256089 5130891 4835560 4687711 4667628 4596866 4364244
18286D364244l66622n55923j64402K67835K17969j8182k43417j3247j41111r8868
$$ 4364244 3997622 3441699 3277297 3545132 3763101 3744919 3501502 3488255 3347144 3248276
18276C248276l54753k95104m051k23808k68301J01313P8615J4853N9240Q8827
$$ 3248276 2893523 2598419 2594368 2370560 2102259 2203572 2282187 2297040 2356280 2445107
18266B445107j13807O6064q8591j20291J01087k4139q5813j5496J07824J74451
$$ 2445107 2331300 2397364 2308773 2188482 2289569 2265430 2179617 2164121 2271945 2446396
18256B446396k3416l42475j13279Q8240q1256k01776j89172o5184Q3705P6462
$$ 2446396 2422980 2080505 1967226 2055466 1974210 1772434 1583262 1518078 1601783 1678245
18246A678245R8228j474j75076K59139R9649J14421J54424P2847J41101J38569
$$ 1678245 1776473 1774999 1599923 1859062 1958711 2073132 2227556 2300403 2441504 2580073
18236B580073j94587j86312N0260J67866J94694K47756J74526o4964j59834k27064
$$ 2580073 2385486 2199174 2249434 2417300 2611994 2859750 3034276 2969312 2809478 2582414
18226B582414n0445l3047k38512l89710J62499K54876J05561p9000N1783l4260
$$ 2582414 2531969 2498922 2260410 1870700 2033199 2288075 2393636 2314636 2366419 2332159
18216B332159j41754j92575j49325J48940j80909J6058K50031K1708k12828j87756
$$ 2332159 2190405 1997830 1848505 1997445 1816536 1832594 2082625 2104333 1891505 1703749
18206A703749K1846j3776n0900l4207J31898J60990r6801l79481k93165j18752
$$ 1703749 1725595 1711819 1660919 1626712 1758610 1919600 1822799 1443318 1150153 1031401
18196A031401J8225L2888J42646J13543O1461j8591k2523m7579L79314K48401
$$ 1031401 1049626 1082514 1225160 1338703 1400164 1381573 1359050 1311471 1690785 1939186
18186A939186k47709j27444J96311R4641k4460J9580k22616j08434M0729L4586
$$ 1939186 1691477 1564033 1760344 1854985 1830525 1850105 1627489 1519055 1559784 1594370
18176A594370j85931k24239K8083L05787l9446l82547k12341P9197M30728k8061
$$ 1594370 1408439 1184200 1212283 1518070 1478624 1096077 883736 962933 1393661 1365600
18166A365600n17185o3626j12523J59766J98305J31877L12914M1718l04398r0922
$$ 1365600 848415 784789 672266 832032 1030337 1162214 1475128 1516846 1212448 1121526
18156A121526R3215M8372K92397J98644Q1323k8910q8021K592J54713N6582J6792
$$ 1121526 1214741 1263113 1555510 1754154 1835477 1806567 1718546 1721138 1875851 1932433 1949225
18145A949225K14254L41557j06652p7270J56560J08453J49317J24061J93989L34444
$$ 1949225 2163479 2505036 2398384 2321114 2477674 2586127 2735444 2859505 3053494 3387938
18135C387938L89872K45767L61709K43000K64069N23948O75360L95934J94108
$$ 3387938 3777810 4023577 4385286 4628286 4892355 5416303 6091663 6487597 6681705
18126F681705M06111N65350R99215J380891J444984J856353K197840L001798L924575
$$ 6681705 7087816 7653166 8652381 10033272 11478256 13334609 15532449 18534247 22458822
18117B2458822N028360P270856J0600293J6124110K5107467L8774077N2177343
$$ 22458822 27487182 34758038 45358331 61482441 86589908 125363985 177541328
18110A77541328N5188008K8586515k3647623m9306406n0895544l8711516k6524372
$$ 177541328 232729336 261315851 237668228 188361822 137466278 98754762 72230390
18103G2230390j8166504j2460628q588713n881003m350460k902962k282224k190093
$$ 72230390 54063886 41603258 33014545 27133542 22783082 19880120 17597896 15407803
18095A5407803j609446j096366j067764j237381q45305l47918m11154k23246j74121
$$ 15407803 13798357 12701991 11634227 10396846 9551541 9203623 8792469 8569223 8395102
18086H395102k58319l52522k53731l54686m13610m44523m40215p4711m18282m21576
$$ 8395102 8136783 7784261 7530530 7175844 6762234 6317711 5877496 5802785 5384503 4962927
18076D962927j55482j46175r8523j45877q8288j83513l22952k39775q5272k03851
$$ 4962927 4807445 4661270 4562747 4416870 4328582 4145069 3822117 3582342 3497070 3293219
18066C293219j098k2082j7403M1321j61744k03373N9638N1950j83687n5401l94466
$$ 3293219 3292121 3270039 3252636 3293957 3132213 2928840 2988478 3040428 2856741 2801340 2406874
18055B406874k53862j58704j4290K06278M4969m35276k24136J2546K03418p25
$$ 2406874 2153012 1994308 1980018 2186296 2231265 1795989 1571853 1584399 1787817 1787092
18045A787092p3379r3261J06569L5432o094j7529j7157K11683j23150J0715N6643
$$ 1787092 1713713 1620452 1727021 1762453 1756359 1738830 1721673 1933356 1810206 1820921 1877564
18034A877564Q865j60638j23340J41231L11306j61533l39351l45759j57864n5568
$$ 1877564 1886429 1725791 1602451 1743682 2054988 1893455 1554104 1208345 1050481 994913
18024I94913O0263O629P7670J28591j2095J25350j0387L1500K17857L1452j88749
$$ 994913 1055176 1061805 1139475 1268066 1255971 1381321 1370934 1402434 1620291 1651743 1462994
18013A462994j40728r6865J41765q2276k03080j39423J99089J70346p0950M9879
$$ 1462994 1322266 1225401 1367166 1284890 1081810 942387 1141476 1311822 1240872 1290751
18003A290751j38027j60315k25775r8726j77499o3591o924K82091p070j15186
$$ 1290751 1152724 992409 766634 667908 490409 426818 419894 701985 694915 579729
17993E79729K2984J12975O6213K6082J89155R4501l44064j57771Q4155K60974
$$ 579729 602713 715688 781901 807983 997138 1091639 747575 589804 673959 934933
17983I34933J04149j69300N0364M4296j68996o2127j8575o559J05560J9931q317
$$ 934933 1039082 869782 920146 964442 795446 733319 714744 708185 813745 833676 825359
17972H25359j21494j55504k44485J80051n4117J07981R4177L14020K14797K81120
$$ 825359 703865 548361 303876 483927 429810 537791 631968 945988 1160785 1441905
17962A441905k43948j75586J57907L5449j26160l26279M11o0191o3901M2975k6976
$$ 1441905 1197957 1022371 1180278 1215727 1089567 763288 763699 703508 639607 682582 655606
17951F55606K1580J48390l1425Q6834J00006j32305n9191k44693K6394L9380O7860
$$ 655606 677186 825576 794151 880985 980991 848686 789495 544802 571196 610576 678436
17940F78436O8648j50255j61511k13794J57135J35432J85300M398j36952J87592
$$ 678436 747084 596829 435318 221524 378659 514091 699391 703789 566837 754429
17930G54429M5438k10375j38489q4925K69788o2638j29014J09153K03929j36303
$$ 754429 799867 589492 451003 366078 635866 573228 444214 553367 757296 620993
17920F20993j17119j2400l4828k9102K09001K67148J64418j24080p364j28268
$$ 620993 503874 491474 456646 427544 636545 903693 1068111 944031 936667 808399
17910H08399p1559K2295J65200l1969p1119k33115Q8904L08321J80915L9129j26628
$$ 808399 736840 759135 924335 892366 821247 588132 677036 985357 1166272 1205401 1078773
17899A078773K55789J39757Q7400J32838r4646j60278K66189M7194o4029j63526
$$ 1078773 1334562 1474319 1561719 1694557 1599911 1439633 1705822 1753016 1688987 1525461
17889A525461j37076J15966O947j3500j6188r931P950J12697K02918o2389L6201
$$ 1525461 1388385 1504351 1511298 1497798 1481610 1471679 1479629 1592326 1795244 1732855 1769056
17878A769056K9251L6848j49944k59079L00045J75333K982K1296j97973k0277
$$ 1769056 1798307 1835155 1685211 1426132 1726177 1901510 1904492 1925788 1727815 1707538
17868A707538r9375j49178K62705J04043J47776q7150k11119K3650j29420k010
$$ 1707538 1608163 1458985 1721690 1825733 1973509 1886359 1675240 1698890 1569470 1567460
17858A567460M15583J77751J38996R000l86472l5617N2601K00002j60783k3J70033
$$ 1567460 1983043 2160794 2299790 2308790 1922318 1886701 1939302 2139304 1978521 1978498 2148531
17847B148531L72842K25570l7306j13614K63337J34341K85379J80980J39445K78877
$$ 2148531 2521373 2746943 2709637 2596023 2859360 2993701 3279080 3460060 3599505 3878382
17837C878382K61932K77834K41046L5066J38743L27461J85804K21121L14721M12232
$$ 3878382 4140314 4418148 4659194 4694260 4833003 5160464 5346268 5567389 5882110 6294342
17827F294342M88298N44157L58496P79831P48886J121118J271635J592967K025376
$$ 6294342 6782640 7326797 7685293 8465124 9214010 10335128 11606763 13199730 15225106
17818A5225106K394192L252653M842974O671646Q945646J2152474J4576547J4893964
$$ 15225106 17619298 20871951 25714925 32386571 41332217 53484691 68061238 82955202
17810H2955202R991990K270798j237501M29522M672703O310526P36221r403272
$$ 82955202 92947192 95217990 93980489 94410011 99082714 105393240 106129461 96726189
17802I6726189j5310264j5884294j3118015r738522p022754m824680l484060k633296
$$ 96726189 81415925 65531631 52413616 42675094 35652340 30827660 27343600 24710304
17794B4710304j813577r55387n22784m2202N58910Q39573J182251J628434K466913
$$ 24710304 22896727 21941340 21418556 21376354 21935264 22774837 23957088 25585522 28052435
17785B8052435L644981M991859O775457R579912J3026948J4346963J2717966O289519
$$ 28052435 31697416 36689275 43464732 53044644 66071592 80418555 93136521 99426040
17777I9426040O80266K86928L936477P375203O239070j611301r327971j1596827
$$ 99426040 100106306 100393234 104329711 111704914 117943984 116332683 107004712 95407885
17769I5407885q483208k536529M060754Q293197Q751123L904751k487842l995593
$$ 95407885 86924677 84388148 88448902 96742099 105493222 109397973 106910131 102914538
17761A02914538j211283K851414L636310k440963j1084504j4862531j4574868
$$ 102914538 101703255 104554669 108190979 105750016 94665512 79802981 65228113
17754F5228113j1842886q700580n972856m174319l507067k444163j396426r69324
$$ 65228113 53385227 44684647 38711791 34537472 31030405 28586242 27189816 26220492
17746B6220492o27497o6751M84230O69213J032309J400797K093266L437714M942666
$$ 26220492 25592995 25526244 26010474 26679687 27711996 29112793 31206059 34643773 39586439
17737C9586439P100560R752904J2771163J3941894J1247520L917305j115929q34397
$$ 39586439 46686999 56439903 69211066 83152960 94400480 98317785 97201856 96367459
17729I6367459L059640O005676L335076m777987j1537959j2671991j0168102o235319
$$ 96367459 99427099 105432775 108767851 103989864 92451905 79779914 69611812 63376493
17721F3376493k494347J333620M888837R233295J3469193J6993196J8043984J4562089
$$ 63376493 60882146 62215766 67104603 76337898 89807091 106800287 124844271 139406360
17713A39406360R997329R416253J2398758J4516360J0560586r18628j2320991
$$ 139406360 149403689 158819942 171218700 185735060 196295646 195377018 183056027
17706A83056027j6629042j4346581j0727156j0954354j4632597j7363074j6926109
$$ 183056027 166426985 152080404 141353248 130398894 115766297 98403223 81477114
17699H1477114j4275416j1148905q563467o193887m600836l587424k871855k542838
$$ 81477114 67201698 56052793 47489326 41295439 36694603 33107179 30235324 27692486
17691B7692486j890850j412219j111241r82839q79555p10566o32908m91194k32935
$$ 27692486 25801636 24389417 23278176 22295337 21415782 20705216 20072308 19581114 19348179
17682A9348179l33626j58575j86685J2643L64413L26799M39306O30748Q32647
$$ 19348179 19014553 18855978 18669293 18681936 19046349 19373148 19812454 20443202 21275849
17673B1275849J041236J669855K095252K811868L780865N074914O868628R335367
$$ 21275849 22317085 23986940 26082192 28894060 32674925 37749839 44618467 53953834
17665E3953834J2891127J6358199J7716716J5810956J1134647Q476234J0681606
$$ 53953834 66844961 83203160 100919876 116730832 127865479 136341713 147023319
17658A47023319J3753100J1999227L100645q237802j4250224j3607274j0276205
$$ 147023319 160776419 172775646 175876291 167638489 153388265 139780991 129504786
17651A29504786r294422j2242909j5674927j6213835j4306509j1042742q384089
$$ 129504786 120210364 107967455 92292528 76078693 61772184 50729442 42345353
17644D2345353o341225m944811l866784k727425k207701k161236j615440j018469
$$ 42345353 36004128 31059317 27192533 24465108 22257407 20096171 18480731 17462262
17636A7462262j096427j117842r90369p04763o93663p76741o66596n52595l93255
$$ 17462262 16365835 15247993 14257624 13552861 12859198 12082457 11415861 10863266 10470011
17627A0470011m07117m03053o43202n26799k76587j19944r0688l88662l83133
$$ 10470011 10062894 9659841 9016639 8489840 8213253 8093309 8002621 7613959 7230826
$$ [...]
##END NTUPLES=NMR SPECTRUM
##END=
