##TITLE=Analysis number 313113
Compound Code cc 42301
Book Reference 449/10
Project Code adrs
Chemist Name davee
##JCAMPDX= 6.0         $$ Bruker NMR JCAMP-DX V2.0
##DATA TYPE= NMR SPECTRUM
##DATA CLASS= NTUPLES
##ORIGIN= Bruker BioSpin GmbH
##OWNER= NMR
$$ XWIN-NMR		Version 3.5
$$ Wed Aug 24 14:21:02 2005 GMT Daylight Time (UT+1h)  MAYBRIDGE\NMR@NMR_250MHZ
##.OBSERVE FREQUENCY= 250.131544655141
##.OBSERVE NUCLEUS= ^1H
##.ACQUISITION MODE= SIMULTANEOUS (DQD)
##.ACQUISITION SCHEME= undefined
##.AVERAGES= 16
##.DIGITISER RES= 18
##SPECTROMETER/DATA SYSTEM= dpx250
##.PULSE SEQUENCE= zg30
##.SOLVENT NAME= DMSO
##.SHIFT REFERENCE= (INTERNAL, DMSO, 0, 16.522)
##AUDIT TRAIL= $$ (NUMBER, WHEN, WHO, WHERE, WHAT)
$$ ##TITLE= Audit trail, XWIN-NMR		Version 3.5
$$ ##JCAMPDX= 5.01
$$ ##ORIGIN= Bruker BioSpin GmbH
$$ ##OWNER= NMR
$$ C:\u/data/dgb/nmr/ADRS/8530/pdata/1/auditp.txt
$$ ##AUDIT TRAIL=  $$ (NUMBER, WHEN, WHO, WHERE, WHAT)
(   1,<2005-08-24 14:20:40.58 +100>,<MAYBRIDGE\NMR>,<NMR_250MHZ>,
      <created by zg, POWCHK disabled, PULCHK disabled
       configuration hash MD5:
       62 19 C7 07 E1 42 D1 B7 37 6C 3D D0 77 39 F9 E6
       data hash MD5: 64K
       D7 F9 EE 02 17 C5 31 41 A0 47 00 21 18 62 61 92>)
(   2,<2005-08-24 14:20:52.85 +100>,<MAYBRIDGE\NMR>,<NMR_250MHZ>,
      <Start of raw data processing
       ef LB = 0.3 FT_mod = 6 PKNL = 1 SI = 32K 
       data hash MD5: 32K
       A9 FA B4 C0 48 2C B7 78 AC CB C8 0F 98 A7 3B 73>)
(   3,<2005-08-24 14:20:55.14 +100>,<MAYBRIDGE\NMR>,<NMR_250MHZ>,
      <apk 
       data hash MD5: 32K
       CF A5 D6 BB 10 46 2A D2 D5 1C 73 E5 C3 85 43 5B>)
(   4,<2005-08-24 14:20:55.89 +100>,<MAYBRIDGE\NMR>,<NMR_250MHZ>,
      <abs ABSG = 5 
       data hash MD5: 32K
       BD EE 19 8D FC C0 10 02 4F 90 FC F8 B8 1D 06 97>)
$$ ##END=
$$ 
$$ hash MD5
$$ 35 6B 46 33 FA 14 76 56 6C E4 5F F2 F2 1C 6F E1
##$RELAX= 
##$RELAX= 
##$RELAX= 
##$RELAX= 
##$RELAX= 
##$RELAX= 
##$RELAX= 
$$ Bruker specific parameters
$$ --------------------------
##$DU= <C:\u>
##$EXPNO= 8530
##$NAME= <ADRS>
##$PROCNO= 1
##$TYPE= <nmr>
##$USER= <dgb>
##$AMP= (0..31)
100 100 100 100 100 100 100 100 100 100 100 100 100 100 100 100 100 100 
100 100 100 100 100 100 100 100 100 100 100 100 100 100 
##$AQSEQ= 0
##$AQ_mod= 3
##$AUNM= <au_zg>
##$AUTOPOS= <40 >
##$BF1= 250.13
##$BF2= 250.13
##$BF3= 250.13
##$BF4= 250.13
##$BF5= 500.13
##$BF6= 500.13
##$BF7= 500.13
##$BF8= 500.13
##$BYTORDA= 1
##$CFDGTYP= 0
##$CFRGTYP= 5
##$CHEMSTR= <none>
##$CNST= (0..31)
1 1 145 1 1 1 1 1 1 1 1 1 1 1 1 1 1 1 1 1 1 1 1 1 1 1 1 1 1 1 1 1 
##$CPDPRG= <>
##$CPDPRG1= <>
##$CPDPRG2= <>
##$CPDPRG3= <>
##$CPDPRG4= <mlev>
##$CPDPRG5= <mlev>
##$CPDPRG6= <mlev>
##$CPDPRG7= <mlev>
##$CPDPRG8= <mlev>
##$CPDPRGB= <>
##$CPDPRGT= <>
##$D= (0..31)
0 1 0 0 0 0 0 0 0 0.06 0 0 0 0 0 0 0.0002 0 0 0 0 0 0 0 0 0 0 0 0 0 0 
0 
##$DATE= 1124889639
##$DBL= (0..7)
120 120 120 120 120 120 120 120 
##$DBP= (0..7)
150 150 150 150 150 150 150 150 
##$DBP07= 0
##$DBPNAM0= <>
##$DBPNAM1= <>
$$ [...]
##$SUBNAM7= <"">
##$SUBNAM8= <"">
##$SUBNAM9= <"">
##$SW= 20.6930455092707
##$SWIBOX= (0..15)
0 0 3 0 0 0 0 0 0 0 0 0 0 0 0 0 
##$SW_h= 5175.983436853
##$TD= 65536
##$TD0= 1
##$TE= 295.16
##$TE2= 300
##$TE3= 300
##$TEG= 300
##$TL= (0..7)
0 120 120 120 120 120 120 120 
##$TP= (0..7)
150 150 150 150 150 150 150 150 
##$TP07= 0
##$TPNAME0= <>
##$TPNAME1= <>
##$TPNAME2= <>
##$TPNAME3= <>
##$TPNAME4= <>
##$TPNAME5= <>
##$TPNAME6= <>
##$TPNAME7= <>
##$TPOAL= (0..7)
0.5 0.5 0.5 0.5 0.5 0.5 0.5 0.5 
##$TPOFFS= (0..7)
0 0 0 0 0 0 0 0 
##$TUNHIN= 0
##$TUNHOUT= 0
##$TUNXOUT= 0
##$USERA1= <user>
##$USERA2= <user>
##$USERA3= <user>
##$USERA4= <user>
##$USERA5= <user>
##$V9= 5
##$VALIST= <valist>
##$VCLIST= <CCCCCCCCCCCCCCC>
##$VD= 0
##$VDLIST= <DDDDDDDDDDDDDDD>
##$VPLIST= <PPPPPPPPPPPPPPP>
##$VTLIST= <TTTTTTTTTTTTTTT>
##$WBST= 1024
##$WBSW= 4
##$XGAIN= (0..3)
0 0 0 0 
##$XL= 0
##$YL= 0
##$YMAX_a= 341310
##$YMIN_a= -338696
##$ZGOPTNS= <>
##$ZL1= 120
##$ZL2= 120
##$ZL3= 120
##$ZL4= 120
##$ABSF1= 16.522
##$ABSF2= -4.171173
##$ABSG= 5
##$ABSL= 3
##$ALPHA= 0
##$AQORDER= 0
##$ASSFAC= 0
##$ASSFACI= 0
##$ASSFACX= 0
##$ASSWID= 0
##$AUNMP= <proc_1d>
##$AZFE= 0.1
##$AZFW= 0.1
##$BCFW= 0
##$BC_mod= 0
##$BYTORDP= 0
##$COROFFS= 0
##$CY= 12.5
##$DATMOD= 1
##$DC= 0
##$DFILT= <>
##$DTYPP= 0
##$F1P= 14.0000005364418
##$F2P= -0.99999901652339
##$FCOR= 0.5
##$FTSIZE= 32768
##$FT_mod= 6
##$GAMMA= 0
##$GB= 0
##$INTBC= 1
##$INTSCL= 1
##$ISEN= 128
##$LB= 0.3
##$LEV0= 0
##$LPBIN= 0
##$MAXI= 10000
##$MC2= 0
##$MEAN= 0
##$ME_mod= 0
##$MI= 0
##$NCOEF= 0
##$NC_proc= -5
##$NLEV= 6
##$NOISF1= 0
##$NOISF2= 0
##$NSP= 0
##$NTH_PI= 0
##$NZP= 0
##$OFFSET= 16.522
##$PC= 1
##$PHC0= -115.7003
##$PHC1= 67.29778
##$PH_mod= 1
##$PKNL= yes
##$PPARMOD= 0
##$PSCAL= 4
##$PSIGN= 0
##$REVERSE= no
##$SF= 250.13
##$SI= 32768
##$SIGF1= 0
##$SIGF2= 0
##$SINO= 400
##$SIOLD= 32768
##$SREGLST= <1H.DMSO>
##$SSB= 0
##$STSI= 32768
##$STSR= 0
##$SW_p= 5175.98343685301
##$SYMM= 0
##$S_DEV= 0
##$TDeff= 65536
##$TDoff= 0
##$TI= <Analysis number 999999
Compound Code 99
Book Reference 9
Project Code 9>
##$TILT= no
##$TM1= 0
##$TM2= 0
##$TOPLEV= 0
##$USERP1= <user>
##$USERP2= <user>
##$USERP3= <user>
##$USERP4= <user>
##$USERP5= <user>
##$WDW= 1
##$XDIM= 32768
##$YMAX_p= 289221551
##$YMIN_p= -5738701
$$ End of Bruker specific parameters
$$ ---------------------------------
##NTUPLES= NMR SPECTRUM
##VAR_NAME=  FREQUENCY,     SPECTRUM/REAL,   SPECTRUM/IMAG
##SYMBOL=    X,             R,               I
##VAR_TYPE=  INDEPENDENT,   DEPENDENT,       DEPENDENT
##VAR_FORM=  AFFN,          ASDF,            ASDF
##VAR_DIM=   32768,         32768,           32768
##UNITS=     HZ,            ARBITRARY UNITS, ARBITRARY UNITS
##FACTOR=    0.157963299565203, 1,           1
##FIRST=     4132.6476996994, 0,             0
##LAST=      -1043.33573715361, 0,           0
##MIN=       -1043.33573715361, -5738701,    0
##MAX=       4132.6476996994, 289221551,     0
$$ Real data points
##PAGE= N=1
##DATA TABLE= (X++(R..R)), XYDATA
$$ [...]
$$ plain form
23593 -50823 -83314 -57677 -30327 -156007 -203937 -149350 -155000 -52832 -122340 -133324 -22327
23582 -22327 -35578 -84834 -74750 -63525 -101615 -118656 -87610 -21850 1746 73482 -34223
23571 -34223 -182899 -207430 -140340 -129813 -222958 -223752 -134321 -150050 -74159 15136 34879 -15828
23559 -15828 -94572 -84651 -125242 -193799 -102298 -78590 -137166 -109420 2443 -37757 -199286
23548 -199286 -293304 -258003 -214042 -157892 -167557 -164518 -168524 -64249 -123016 -287678 -351416 -347701
23536 -347701 -317437 -289466 -129812 -121352 -275109 -388086 -300484 -237916 -206302 -187177 -208639
23525 -208639 -149834 -87662 -129782 -82980 -125953 -178083 -74883 5969 88435 38860 42581
23514 42581 52984 61474 -27916 -79863 -80447 -192246 -156773 -102689 -104440 -125858 -63507 -15717
$$ packed form
23593e0823l2491K5637K7350j25680m7930N4587n650J02168o9508j0984J10997
23582b2327j3251m9256J0084J1225l8090j7041L1046O5760K3596P1736j07705
23571c4223j48676k4531O7090J0527r3145p94Q9431j5729P5891Q9295J9743n0707
23559a5828p8744R921m0591o8557R1501K3708n8576K7746J11863m0200j61529
23548a99286r4018L5301M3961N6150r665L039m006J04275n8767j64662o3738L715
23536c47701L0264K7971J59654Q460j53757j12977Q7602O2568L1614J9125k1462
23525b08639N8805O2172m2120M6802m2973n2130J03200Q0852Q2466m9575L721
23514D2581J0403Q490q9390n1947n84j11799L5473N4084j751k1418O2351M7790
$$ plain form
23502 -15717 -77722 -221669 -286962 -287552 -230082 -155056 -169421 -203069 -73244 -46457 -9200 -39705
23490 -39705 -98567 -117240 -196346 -245620 -235833 -215986 -157568 -90592 -31379 -34848 -120228 -181091
23478 -181091 -202838 -251043 -263875 -389991 -268561 -122804 -82160 -170641 -58262 -33819 -57188
23467 -57188 -57279 4535 30338 96594 50260 -7334 -71037 -246047 -303715 -272688 -328033 -313041
23455 -313041 -256517 -133123 -176403 -236908 -315801 -284339 -235854 -180201 -153060 -163992 -100238
23444 -100238 -72613 -89087 -130807 -158320 -180921 -210836 -182762 -203742 -207868 -249431 -269652 -329881
23432 -329881 -307058 -245204 -271924 -250691 -134449 -29900 31434 -19142 -124019 -180830 -100208
23421 -100208 -17987 34509 2410 -114674 -92409 -109970 -245986 -332673 -348907 -258976 -272894
$$ packed form
23502a5717o2005j43947o5293n90N7470P5026j4365l3648J29825K6787L7257l0505
23490c9705n8862j8673p9106m9274R787J9847N8418O6976N9213l469q5380o0863
23478a81091k1747m8205j2832j26116J21430J45757M0644q8481J12379K4443k3369
23467e7188r1O1814K5803O6256m6334n7594o3703j75010n7668L1027n5345J4992
23455c13041N6524J23394m3280o0505p8893L1462M8485N5653K7141j0932O3754
23444a00238K7625j6474m1720k7513k2601k9915K8074k0980m126m1563k0221o0229
23432c29881K2823O1854k6720K1233J16242J04549O1334n0576j04877n6811Q0622
23421a00208Q2221N2496l2099j17084K2265j7561j36016q6687j6234Q9931j3918
$$ plain form
23410 -272894 -149388 -139825 -108572 -167501 -244204 -260145 -333203 -345107 -451115 -407721 -286801
23399 -286801 -197365 -189931 -169872 -152704 -141190 -121799 -222953 -165557 -95994 -70535 -136258
23388 -136258 -146888 8587 37326 -89975 -74221 -97035 -41445 -46047 20578 -80991 -144360
23377 -144360 -74140 34662 65005 28965 111773 129358 165634 41337 -92376 -135884 -315338
23366 -315338 -455185 -371828 -377115 -378837 -330070 -245144 -247465 -239940 -146691 -96766 -39160 -15813
23354 -15813 -45120 -75503 -194245 -175742 -304384 -409226 -359696 -233031 -97527 -18896 -69085
23343 -69085 -183096 -266125 -240102 -205825 -331508 -364862 -291185 -181914 -173911 -240391 -159313
23332 -159313 -205220 -176589 -130090 -119720 -128267 -90697 -169297 -122158 66317 132722 77769
$$ packed form
23410b72894J23506R563L1253n8929p6703j5941p3058j1904j06008M3394J20920
23399b86801Q9436P434K0059J7168J1514J9391j01154N7396O9563K5459o5723
23388a36258j0630J55475K8739j27301J5754k2814N5590m602O6625j01569o3369
23377a44360P0220J08802L0343l6040Q2808J7585L6276j24297j33713m3508j79454
23366c15338j39847Q3357n287j722M8767Q4926k321P525R3249M9925N7606K3347
23354a5813k9307l0383j18742J8503j28642j04842M9530J26665J35504P8631n0189
23343f9085j14011q3029K6023L4277j25683l3354P3677J09271Q003o6480Q1078
23332a59313m5907K8631M6499J0370q547L7570p8600M7139J88475O6405n4953
$$ plain form
23321 77769 -1521 -98133 -159996 -168543 -138528 -39537 -48793 16946 -43830 -99568 -204075 -160182
23309 -160182 -85732 -104000 -93082 -32900 78324 83559 42911 -142650 -167990 -117588 28937
23298 28937 78114 29061 -16119 -66662 -32507 -48967 -124278 -137252 -212567 -259181 -205028 -124376
23286 -124376 1347 21477 -27688 -131183 -107424 -41705 25425 60082 25223 35311 35767
23275 35767 48379 104519 64637 107559 45693 -173212 -286222 -193343 -112818 -101032 -104640
23264 -104640 -7145 112147 31096 -11964 66533 87382 -38420 -101819 -82106 -124069 -157541
23253 -157541 -175652 -194448 -209109 -273301 -306378 -164855 -150576 -182871 -123410 -5003 1973
23242 1973 45544 25312 -60456 -146313 -143413 -114747 -200132 -263424 -293468 -185696 -129117 -188462
$$ packed form
23321G7769p9290r6612o1863q547L0015R8991r256O5739o0776n5738j04507M3893
23309a60182P4450j8268J0918O0182J11224N235m0648j85561k5340N0402J46525
23298B8937M9177m9053m5180n0543L4155j6460p5311j2974p5315m6614N4153Q0652
23286a24376J25723K0130m9165j03495K3759O5719O7130L4657l4859J0088M56
23275C5767J2612N6140l9882M2922o1866k18905j13010R2879Q0525J1786l608
23264a04640R7495J19292q1051m3060P8497K0849j25802o3399J9713m1963l3472
23253a57541j8111j8796j4661o4192l3077J41523J4279l2295N9461J18407O976
23242A973M3571k0232q5768q5857K900K8666q5385o3292l0044J07772N6579n9345
$$ plain form
23230 -188462 -238551 -225079 -105886 -28579 -39443 -106123 -140940 -107053 -108335 -297810 -362882
23219 -362882 -291181 -189629 -174977 -155725 -83619 -160626 -226392 -177806 -135195 -207510 -225734
23208 -225734 -201528 -94855 -84157 -105286 -125402 -168567 -123152 -160867 -115233 -135582 -129718
23197 -129718 -29212 -122122 -137123 -101079 -41429 -129205 -176720 -176586 -107959 -171342 -334411
23186 -334411 -269280 -112102 -37162 -138857 -139806 -114109 -154191 -138965 -83122 -128812 -199663
23175 -199663 -263778 -279581 -243113 -344615 -385408 -225519 -146206 -151703 -143148 -192165 -290683
23164 -290683 -294408 -191507 -107011 23651 -38366 -158092 -90824 -2779 66466 -85415 -237806
23153 -237806 -208809 -208834 -232707 -171525 -303141 -298576 -232728 -273682 -237087 -126421 96440 43028
$$ packed form
23230a88462n0089J3472J19193P7307j0864o6680l4817L3887j282j89475o5072
23219c62882P1701J01552J4652J9252P2106p7007o5766M8586M2611p2315j8224
23208b25734K4206J06673J0698k1129k0116m3165M5415l7715M5634k0349N864
23197a29718J00506r2910j5001L6044N9650q7776m7515J34O8627o3383j63069
23186c34411O5131J57178P4940j01695r49K5697m0082J5226N5843m5690p0851
23175a99663o4115j5803L6468j01502m0793J59889P9313n497Q555m9017r8518
23164b90683l725J02901Q4496J30662o2017j19726O7268Q8045O9245j51881j52391
23153b37806K8997k5k3873O1182j31616M565O5848m0954L6595J10666K22861n3412
$$ plain form
23141 43028 -102972 -161440 -196192 -213507 -200509 -228371 -322781 -342318 -402924 -320318 -277086
23130 -277086 -293244 -315444 -297484 -188812 -97062 -106149 -185654 -222979 -245257 -178196 -171542 -261363
23118 -261363 -174189 -158526 -160936 -240570 -193491 -96336 -132875 -77268 -94018 -118038 -300082
23107 -300082 -269991 -157609 -157511 -23043 -1498 44531 13804 -69549 -173073 -176294 -182616 -156094
23095 -156094 -42919 8248 -7815 -6494 -16427 -19050 -26889 33187 82209 110687 74595 23326
23083 23326 -154242 -203245 -208107 -189804 -301559 -228070 -138547 -68684 -99633 -198958 -104651
23072 -104651 -55244 43339 128803 594 -166155 -173038 -60570 -24700 -83521 -36311 -33770
23061 -33770 69466 -48835 -169968 -201285 -228413 -317416 -208708 -174359 -222635 -193602 -179618
$$ packed form
23141D3028j46000n8468l4752j7315J2998k7862r4410j9537o0606Q2606M3232
23130b77086j6158k2200J7960J08672R1750r087p9505l7325k2278O7061O654q9821
23118b61363Q7174J5663k410p9634M7079R7155l6539N5607j6750k4020j82044
23107c00082L0091J12382R8J34468K1545M6029l0727q3353j03524l221o322K6522
23095a56094J13175N1167j6063J321r933k623p839O0076M9022K8478l6092n1269
23083B3326j77568m9003m862J8303j11755P3489Q9523O9863l0949r9325R4307
23072a04651M9407R8583Q5464j28209j66749o883J12468L5870n8821M7210K541
23061c3770J03236j18301j21133l1317k7128q9003J08708L4349m8276K9033J3984
$$ plain form
23050 -179618 -180499 -327763 -239724 -129579 -135824 -115149 23305 -10344 -131105 -230429 -185883
23039 -185883 -210381 -272030 -224777 -72961 -112292 -147995 -119181 -182924 -206085 -168933 -165157
23028 -165157 -159527 -165974 -126858 -125763 -115987 -137370 -99061 -39775 745 -102123 -159379 -110922
23016 -110922 -99274 -147432 -45512 -67312 -188202 -167346 -60218 -60607 -96187 -80269 99727
23005 99727 195163 149109 147041 80580 99256 81130 -25264 -77318 -56187 -52781 -60102 -55218
22993 -55218 -7822 96318 113888 -22285 -80963 -168026 -262646 -209861 -169679 -114483 -162879
22982 -162879 -185270 -129191 -106962 -69635 -194923 -160168 -132153 -89676 -56884 -32090 -85891
22971 -85891 -64071 -10514 -97312 -149914 -128513 -248039 -275417 -333959 -353857 -277194 -258784
$$ packed form
23050a79618q81j47264Q8039J10145o245K0675J38454l3649j20761r9324M4546
23039a85883k4498o1649M7253J51816l9331l5703K8814o3743k3161L7152L776
23028a65157N630o447L9116J095R776k1383L8309N9286M0520j02868n7256M8457
23016a10922J1648m8158J01920k1800j20890K0856J07128l89l5580J5918J79996
23005I9727R5436m6054k068o6461J8676j8126j06394n2054K1131L406p321M884
22993e5218M7396J04140J7570j36173n8678q7063r4620N2785M0182N5196m8396
22982a62879k2391N6079K2229L7327j25288L4755K8015M2477L2792K4794n3801
22971h5891K1820N3557q6798n2602K1401j19526k7378n8542j9898P6663J8410
$$ plain form
22960 -258784 -142574 -31871 -61432 -47702 -128860 -223660 -293687 -318502 -375873 -423745 -405207
22949 -405207 -361998 -290731 -261097 -261380 -151556 -143122 -179932 -217494 -209292 -200659 -288211 -237213
22937 -237213 -251436 -148838 -173679 -217053 -119162 -155277 -200034 -81565 -102940 -183843 -275660
22926 -275660 -243932 -118130 -129135 -113607 -72292 20987 -48742 -63996 -52582 -23328 -83064
22915 -83064 -69830 15025 39245 -26546 -107129 -212445 -207581 -224816 -201847 -204013 -212843 -250697
22903 -250697 -276294 -309178 -346066 -267527 -225934 -178326 -153219 -63781 -76971 -88906 -10052
22892 -10052 -89237 -132870 -190127 -155703 -157958 -181822 -221276 -280527 -286214 -163990 -142214 -101509
22880 -101509 -206375 -340630 -344458 -227155 -215499 -132158 -87717 -122061 -265697 -306208 -375794
$$ packed form
22960b58784J16210J10703k9561J3730q1158r4800p0027k4815n7371m7872J8538
22949d05207M3209P1267K9634k83J09824Q434l6810l7562Q202Q633q7552N0998
22937b37213j4223J02598k4841m3374R7891l6115m4757J18469k1375q0903r1817
22926b75660L1728J25802j1005J5528M1315R3279o9729j5254J1414K9254n9736
22915h3064J3234Q4855K4220o5791q0583j05316M864j7235K2969k166q830l7854
22903b50697k5597l2884l6888P8539M1593M7608K5107Q9438j3190j1935P8854
22892a0052p9185m3633n7257L4424k255k3864l9454n9251n687J22224K1776M0705
22880a01509j04866j34255l828J17303J1656Q3341M4441l4344j43636m0511o9586
$$ plain form
22869 -375794 -274512 -215671 -131856 -39017 77677 65694 50236 39908 -1213 2216 -63151
22858 -63151 -44378 35336 33619 -21768 -64837 -179130 -162335 -27121 -61787 -218744 -338381
22847 -338381 -289915 -267846 -319155 -364849 -241060 -73921 -115545 -117165 -127639 -239871 -158404
22836 -158404 -120505 -131102 -132073 -72324 -98316 -174328 -196240 -189985 -96567 -93731 -108559 -105874
22824 -105874 -135409 -84326 -101576 -186272 -236243 -226779 -152428 -4263 29907 17771 5345
22813 5345 3978 -9028 -58046 -147496 -184375 -100101 -150734 -155578 -99540 -167945 -240330 -152354
22801 -152354 -155929 -273798 -340868 -278812 -215932 -183740 -127480 -162871 -168240 -70879 -44300 2595
22789 2595 30677 66609 8368 -50312 -47709 -39667 -57721 -146080 -253200 -293539 -217986 -121112
$$ packed form
22869c75794J01282N8841Q3815R2839J16694j1983j5458j0328m1121L429o5367
22858f3151J8773P9714j717n5387m3069j14293J6795J35214l4666j56957j19637
22847c38381M8466K2069n1309m5694J23789J67139m1624j620j0474j12232Q1467
22836a58404L7899j0597r71N9749k5992p6012k1912O255R3418K836j4828K685
22824a05874k9535N1083j7250q4696m9971R464P4351J48165L4170j2136j2426
22813E345j367j3006m9018q9450l6879Q4274n0633m844N6038o8405p2385Q7976
22801a52354l575j17869o7070O2056O2880L2192N6260l5391n369R7361K6579M6895
22789B595K8082L5932n8241n8680K603Q042j8054q8359j07120m0339P5553R6874
$$ plain form
22777 -121112 -46176 74750 151926 150261 40773 -150585 -213050 -97833 -102414 -237096 -189222
22766 -189222 -134226 -109448 -187871 -72188 60113 -75 -28789 -92479 -92549 -104546 -114423 -51592
22754 -51592 79405 22254 -15299 -9428 -109271 -146612 -226933 -185292 -127067 -154412 -213669 -139050
22742 -139050 -131545 -57682 -71983 -43403 53635 83610 -36797 -76271 -67286 -121224 -93969 -11783
22730 -11783 -43194 -101820 -31781 -4162 -85992 -88587 -68993 -91833 -50836 32524 -31657 13722
22718 13722 39551 41206 -2428 -35141 -42564 -11993 22880 -13425 -149144 -113609 -53850 -48117
22706 -48117 -58685 -132431 -131962 -143010 -126155 -127307 -172743 -3126 75804 85280 35422 -2014
22694 -2014 -5177 -94018 -195791 -223062 -304044 -331474 -300034 -202878 -221745 -316670 -321717 -269343
$$ packed form
22777a21112P4936J20926P7176j665j09488j91358o2465J15217m581j34682M7874
22766a89222N4996K4778p8423J15683J32301o0188k8714o3690p0j1997r877O2831
22754e1592J30997n7151l7553N871r9843l7341q0321M1641N8225k7345n9257P4619
22742a39050P505P3863j4301K8580R7038K9975j20407l9474Q985n3938K7255Q2186
22730a1783l1411n8626P0039K7619q1830k595J9594k2840M0997Q3360o4181M5379
22718A3722K5829J655m3634l2713p423L0571L4873l6305j35719L5535N9759N733
22706d8117j0568p3746M69j1048J6855j152m5436J69617P8930R476m9858l7436
22694b014l163q8841j01773k7271q0982k7430L1440R7156j8867r4925n047N2374
$$ plain form
22682 -269343 -137575 -77245 -103470 -248706 -271912 -84885 -106514 -181097 -320823 -377603 -317133
22671 -317133 -266444 -257825 -173362 -104725 -147699 -141206 -180588 -221225 -269129 -230811 -129006 -70532
22659 -70532 -62608 -153912 -234733 -274719 -301367 -274768 -233869 -173338 -138022 -13485 5704 -18002
22647 -18002 -122872 -154233 -103039 -71346 -169574 -233926 -295395 -132721 -84186 -201592 -194067
22636 -194067 -126360 -126162 -54766 -45685 -86435 -118558 -165151 -158104 -210370 -177190 -100868 -74080
22624 -74080 -36295 -8418 -76150 -166239 -212418 -187329 -39405 54661 27418 -60612 -117217
22613 -117217 -147742 -219007 -98285 -67637 -60980 -145836 -143723 -175202 -92969 -11524 36706 -50150
22601 -50150 -117488 -103713 -127895 -63131 -108343 -114775 -150786 -227820 -217818 -123567 -94432 27212
$$ packed form
22682b69343J31768O0330k6225j45236k3206J87027k1629p4583j39726n6780O0470
22671c17133N0689Q619Q4463O8637m2974O493l9382m0637m7904L8318J01805N8474
22659g0532P924r1304q0821l9986k6648K6599M0899O0531L5316J24537J9189k3706
22647a8002j04870l1361N1194L1693r8228o4352o1469J62674M8535j17406P525
22636a94067O7707J98P1396R081m0750l2123m6593P047n2266L3180P6322K6788
22624g4080L7785K7877o7732r0089m6179K5089J47924R4066k7243q8030n6605
22613a17217l0525p1265J20722L0648O657q4856K113l1479Q2233Q1445M8230q6856
22601e0150o7338J3775k4182O4764m5212o432l6011p7034J0002R4251K9135J21644
$$ plain form
22589 27212 109464 43573 -76669 495 -25698 -174100 -216469 -237054 -362372 -400473 -234059
22578 -234059 -131426 -218485 -302331 -306164 -155373 -40654 -54316 -69847 -72917 -89018 -23146
22567 -23146 31564 -69882 -197058 -305280 -198028 -93231 -72186 -118308 -157772 -287970
22557 -287970 -309831 -288719 -213895 -94477 -54108 -73850 -91571 -105152 -272465 -305221 -297599
22546 -297599 -260480 -147806 -170802 -232444 -323345 -175846 -100191 -87546 -129055 -172978 -125714
22535 -125714 -69338 -135815 -192105 -115126 -76268 -30808 -137852 -155465 -176155 -186838 -75685
22524 -75685 -69855 -79870 -130698 -108476 -102555 -31378 -36075 -31576 -52607 8623 27511 -73337
22512 -73337 -239282 -277603 -257147 -246323 -298053 -311904 -323159 -278992 -256338 -270945 -168517
$$ packed form
22589B7212Q2252o5891j20242P7164k6193j48402m2369k0585j25318l8101J66414
22578b34059J02633q7059q3846l833J50791J14719j3662j5531l070j6101O5872
22567b3146N4710j01446j27176j08222J07252J04797K1045m6122l9464j30198
22557b87970k1861K1112P4824J19418M0369j9742j7721j3581j67313l2756P622
22546b97599L7119J12674k2996o1642r0901J47499P5655J2645m1509m3923M7264
22535a25714N6376o6477n6290P6979L8858M5460j07044j7613k0690j0683J11153
22524g5685N830j0015n0828K2222N921P1177m697M499k1031O1230J8888j00848
22512g3337j65945l8321K0456J0824n1730j3851j1255M4167K2654j4607J02428
$$ plain form
22501 -168517 -158914 -231055 -107835 -104370 -200751 -141082 -48534 41568 5980 -240281 -300657
22490 -300657 -238864 -216709 -253985 -178443 -23226 74425 69453 -12569 -126329 -124550 -234501
22479 -234501 -309490 -291413 -129059 -5235 -3120 90182 129931 11293 49047 125296 139567
22468 139567 82230 -73290 -74089 -89281 -177880 -232870 -186257 -182133 -188332 -114511 -150362 -158847
22456 -158847 -197753 -169688 -31784 65655 26603 -25489 -21521 -130808 -182338 -114034 1310
22445 1310 -55532 -88024 -18926 -10841 84969 108310 98328 134358 66872 -32794 -68861 -10803
22433 -10803 54523 39429 -42930 -60300 -71997 -144040 -180769 -186188 -202080 -135176 -22217 -28107
22421 -28107 -60001 -120645 -33105 207 -31468 -235986 -288094 -211214 -92014 -79571 -68032
$$ packed form
22501a68517R603p2141J23220L465r6381N9669R2548R0102l5588k46261o0376
22490c00657O1793K2155l7276P5542J55217R7651m972q2022j13760J779j09951
22479b34501p4989J8077J62354J23824K115R3302L9749j18638L7754P6249J4271
22468A39567n7337j55520p99j5192q8599n4990M6613M124o199P3821l5851q485
22456a58847l8906K8065J37904R7439l9052n2092L968j09287n1530O8304J15344
22445A310n6842l2492O9098Q085R5810K3341r982L6030o7486r9666l6067N8058
22433a0803O5326j5094q2359j7370j1697p2043l6729n419j5892O6904J12959n890
22421b8107l1894o0644Q7540L3312l1675k04518n2108P6880J19200J2443J1539
$$ plain form
22410 -68032 -2168 13078 -41478 -30687 -11323 -36510 -94643 -104793 39041 29969 -95913
22399 -95913 -224800 -324320 -255314 -64079 37349 7574 -13521 -100760 -129939 -148846 -217369
22388 -217369 -161136 -239976 -175072 -114133 -186411 -307052 -432212 -513996 -480121 -477272 -385548
22377 -385548 -335900 -284195 -254517 -270060 -232958 -277832 -82228 -5667 -34973 -79111 -11976
22366 -11976 -119881 -299275 -287778 -230609 -170209 -138006 -226345 -272664 -302217 -255607 -191196
22355 -191196 -216406 -154086 -156393 -197191 -286760 -101455 -74239 -129463 -126335 -143813 -196579 -112763
22343 -112763 -212763 -106852 42911 -49318 -50044 -51849 -80521 -111379 -170450 -211736 -116611
22332 -116611 -89142 -50679 -74856 -52893 -22972 -56373 -86540 -102693 -227559 -197848 -119502
$$ packed form
22410f8032O5864J5246n4556J0791J9364k5187n8133j0150J43834r072j25882
22399i5913j28887r9520O9006J91235J01428k9775k1095q7239k9179j8907o8523
22388b17369N6233p8840O4904O0939p2278j20641j25160q1784L3875K849R1724
22377c85548M9648N1705K9678j5543L7102m4874J95604P6561k9306m4138O7135
22366a1976j07905j79394J1497N7169O0400L2203q8339m6319k9553M6610O4411
22355a91196k5210O2320k307m0798q9569J85305K7216n5224L128j7478n2766Q3816
22343a12763j00000J05911J49763r2229p26j805k8672l0858n9071m1286R5125
22332a16611K7469L8463k4177K1963K9921l3401l0167j6153j24866K9711P8346
$$ plain form
22321 -119502 -121358 -125301 -177079 -247786 -172316 4251 -34029 7554 -65514 -115310 -97372 -87027
22309 -87027 -151263 -217360 -146978 -74997 -81056 -60051 -5209 -68760 -151021 -111230 -78349 -36858
22297 -36858 -63276 -126909 -50665 68930 -18818 -43698 -102325 -137792 -239778 -193322 -207503
22286 -207503 -220470 -123028 -27879 79237 147152 84344 72413 33330 22747 12792 -13483
22275 -13483 -43911 -110109 -32891 68427 -19140 -121929 -58671 -79932 55975 76371 -28806
22264 -28806 -76325 -1493 35223 -87336 -231058 -136003 -82974 -114306 -134137 -148209 -270454
22253 -270454 -283583 -118501 -163962 -126861 -220966 -258584 -159638 -102910 -31324 -11015 -85218
22242 -85218 -198945 -151275 -94030 -205627 -247220 -170037 -177535 -227666 -263291 -218353 -94149
$$ packed form
22321a19502j856l943n1778p0707P5470J76567l8280M1583p3068m9796J7938J0345
22309h7027o4236o6097P0382P1981o059K1005N4842o3551q2261L9791L2881M1491
22297c6858k6418o3633P6244J19595q7748k4880n8627l5467j01986M6456j4181
22286b07503j2967R7442R5149J07116O7915o2808j1931l9083j0583r955k6275
22275a3483l0428o6198P7218J01318q7567j02789O3258k1261J35907K0396j05177
22264b8806m7519P4832L6716j22559j43722R5055N3029l1332j9831j4072j22245
22253b70454j3129J65082m5461L7101r4105l7618R8946N6728P1586K0309p4203
22242h5218j13727M7670N7245j11597m1593P7183p498n0131l5625M4938J24204
$$ plain form
22231 -94149 -16645 -219705 -285257 -208341 -130672 -85701 -84452 -165520 -116328 26120 9759
22220 9759 -45347 38645 75819 75436 -20112 -81874 -81310 -167979 -83583 -86104 -111765 -136174 -76928
22207 -76928 -123508 -255602 -151600 -93759 -66919 -158811 -125699 35261 -71698 -210396 -183039
22196 -183039 -117526 -235988 -277882 -301567 -212775 -89768 -98246 -127618 -125254 -2963 64324
22185 64324 110120 134081 12319 -37766 -36410 34191 138570 228199 220022 232038 203404 80563
22173 80563 11967 -18501 -18866 -29150 -26024 -130003 -153625 -99107 4502 39999 -50844 -11376
22161 -11376 -62172 -180274 -109604 -75823 -62062 -27750 -56089 -131741 -121929 -191688 -260826 -226091
22149 -226091 -219129 -157423 -55397 -154794 -278053 -355213 -274448 -242259 -223202 -136689 -50575
$$ packed form
22231i4149P7504k03060o5552P6916P7669M4971J249q1068M9192J42448j6361
22220I759n5106Q3992L7174l83r5548o1762N64q6669Q4396k521k5661k4409N9246
22207g6928m6580j32094J04002N7841K6840r1892L3112J60960j06959j38698K7357
22196a83039O5513j18462m1894k3685Q8792J23007q478k9372K364J22291O7287
22185F4324M5796K3961j21762n0085J356P0601J04379Q9629q177J2016k8634j22841
22173H0563o8596l0468l65j0284L126j03979k3622N4518J03609L5497r0843L9468
22161a1376n0796j18102P0670L3781J3761L4312k8339p5652R812o9759o9138L4735
22149b26091O962O1706J02026r9397j23259p7160Q0765L2189J9057Q6513Q6114
$$ plain form
22138 -50575 -15203 20685 48868 -36890 -87483 -101388 -108931 -180265 -236247 -224133 -244490 -216098
22126 -216098 -170861 -231283 -292705 -340481 -304629 -194361 -77616 -32144 -10672 -29468 -69691
22115 -69691 -115316 -134171 -58000 57384 3069 -14405 125237 126710 -53429 -125908 -39986
22104 -39986 -4455 -16788 5287 -63366 -58179 -41428 -109439 -128391 -81595 -42577 -116487 -190545
22092 -190545 -242205 -232470 -154518 -75766 -132504 -114784 -72406 -53054 278 -35051 -56496 1183
22080 1183 -44621 -98342 -76286 -121844 -112678 -167086 -258223 -197943 -175505 -201761 -232309 -302525
22068 -302525 -374984 -336169 -142142 -90617 -120799 -151572 -99092 -93373 -191621 -159671 -108360
22057 -108360 -86601 -38387 15145 97192 81513 84021 -7281 -24388 -116086 -263664 -278567
$$ packed form
22138e0575L5372L5888K8183q5758n0593j3905p543p1334n5982J2114k0357K8392
22126b16098M5237o0422o1422m7776L5852J10268J16745M5472K1472j8796m0223
22115f9691m5625j8855P6171J15384n4315j7474J39642J473j80139p2479Q5922
22104c9986L5531j2333K2075o8653N187J6751o8011j8952M6796L9018p3910p4058
22092a90545n1660R735P7952P8752n6738J7720M2378J9352N3332l5329k1445N7679
22080A183m5804n3721K2056m5558R166n4408r1137O0280K2438k6256l0548p0216
22068c02525p2459L8815J94027N1525l0182l0773N2480N719r8248L1950N1311
22057a08360K1759M8214N3532Q2047j5679K508r1302j7107r1698j47578j4903
$$ plain form
22046 -278567 -195027 -122148 -168041 -181243 -255893 -276104 -170036 -92296 -41841 -41805 -188238 -226824
22034 -226824 -195746 -273792 -159816 -119601 -130283 -307705 -386126 -259671 -146508 17659
22024 17659 104529 140462 -5940 -80021 15868 -49279 -61923 -62647 -93230 -58171 -193010 -270101
22012 -270101 -181944 -95748 -54435 -8613 -856 -29498 -55433 -29586 -40126 -73069 -50710 -56850
22000 -56850 -29707 78592 2833 -77858 -64192 -94282 -120374 -176760 -186159 -172123 -174494 -249031
21988 -249031 -325587 -284828 -93961 -74855 -147949 -194997 -159662 -156462 -187483 -243927 -251922 -320514
21976 -320514 -297285 -188016 -68967 -6597 -24089 -103183 -146555 -223209 -197673 -146323 -66953
21965 -66953 -40863 -67985 -87286 6527 93966 59735 17437 -45933 -120595 -145815 -111517 -176477
$$ packed form
22046b78567Q3540P2879m5893j3202p4650k0211J06068P7740N0455L6j46433l8586
22034b26824L1078p8046J13976M0215j0682j77422p8421J26455J13163J64167
22024A7659Q6870L5933j46402p4081R5889o5147j2644p24l0583L5059j34839p7091
22012b70101Q8157Q6196M1313M5822P757k8642k5935K5847j0540l2943K2359o140
22000e6850K7143J08299p5759q0691J3666l0090k6092n6386r399J4036k371p4537
21988b49031p6556M0759J90867J9106p3094m7048L5335L200l1021n6444p995o8592
21976c20514K3229J09269J19049O2370j7492p9094m3372p6654K5536N1350P9370
21965f6953K6090k7122j9301R3813Q7439l4231m2298o3370p4662k5220L4298o4960
$$ plain form
21953 -176477 -251634 -384185 -389667 -382492 -346046 -199348 -131673 -96032 -134898 -89852 -110570
21942 -110570 -154374 -240158 -205764 -133076 -72498 -81964 -16143 -136772 -109058 -96605 -137380
21931 -137380 -73095 2197 -157338 -227550 -228118 -256439 -197808 -51763 -89498 -32780 -61572
21920 -61572 -105853 -83506 -176907 -225269 -255178 -266781 -184517 -171598 -219802 -208113 -237226 -175910
21908 -175910 -186993 -115519 -1618 -13196 -10210 54253 162423 171293 47371 -133130 -182665
21897 -182665 -151947 -135612 -128812 -118576 -68735 -184568 -143938 -6623 -54143 -48781 7008
21886 7008 36849 -71559 -222234 -268591 -259714 -310150 -303676 -168973 -69599 4726 -22618 -39767
21874 -39767 92497 228454 194124 180318 122295 22676 -32485 -45709 19136 10066 -24844
$$ packed form
21953a76477p5157j32551n482P175L6446J46698O7675L5641l8866M5046k0718
21942a10570m3804q5784L4394P2688O0578r466O5821j20629K7714J2453m0775
21931a37380O4285P5292j59535p0212n68k8321N8631J46045l7735N6718k8792
21920f1572m4281K2347r3401m8362k9909j1603Q2264J2919m8204J1689k9113O1316
21908a75910j1083P1474J13901j1578K986O4463J08170Q870j23922j80501m9535
21897a82665L0718J6335O800J0236M9841j15833M0630J37315m7520N362N5789
21886G008K9841j08408j50675m6357Q877n0436O474J34703R9374P4325k7344j7149
21874c9767J32264J35957l4330j3806n8023r9619n5161j3224O4845r070l4910
$$ plain form
21863 -24844 -41177 -96083 -44189 54127 53881 83098 40970 76690 41560 -74867 -122025 -48211
21851 -48211 -18933 -45870 64305 57059 16122 -11792 16858 -28396 27890 40673 -141252
21840 -141252 -29113 91725 84608 -22209 2092 -8002 94095 7382 3937 5040 -92029
21829 -92029 -122995 -159536 -56536 38645 -57734 -88098 -77056 -19984 60940 -38894 -106581
21818 -106581 -149141 -226651 -190305 -139226 -169401 -181830 -207237 -219577 -171735 -75896 -70239 -213209
21806 -213209 -354993 -325909 -242679 -289480 -298387 -223209 -228283 -107527 44596 181657 149390
21795 149390 89550 63709 58081 31391 -90937 -201763 -143084 -62502 -40005 -47877 26602
21784 26602 22833 -24244 -173981 -147579 -68539 -91211 -20263 -48347 -93951 -93886 -56821 -112963
$$ packed form
21863b4844j6333n4906N1894R8316k46K9217m2128L5720l5130j16427m7158P3814
21851d8211K9278k6937J10175p246m0937k7914K8650m5254N6286J2783j81925
21840a41252J12139J20838p117j06817K4301j0094J02097q6713l445J103r7069
21829i2029l0966l6541J03000R5181r6379l0364J1042N7072Q0924r9834o7687
21818a06581m2560p7510L6346N1079l0175j2429k5407j2340M7842R5839N657j42970
21806b13209j41784K9084Q3230m6801q907P5178n074J20756J52123J37061l2267
21795A49390n9840k5841n628k6690j22328j10826N8679Q0582K2497p872P4479
21784B6602l769m7077j49737K6402P9040k2672P0948k8084m5604O5L7065n6142
$$ plain form
21772 -112963 -66578 -103202 -91391 -88947 -11124 -1075 -30615 -14624 81545 -55072 -233119
21761 -233119 -297327 -211026 -111230 -39435 -127635 -82696 -27916 63371 38204 -116363 -98258
21750 -98258 -17677 -90720 -53278 -67377 -121231 -163101 -153174 -71152 -64711 13033 2643 -9293
21738 -9293 25016 -5585 -94555 -173954 -175052 -106433 -5536 80759 56136 -4566 -65424 -149785
21726 -149785 -241557 -266716 -287388 -265278 -225365 -112832 -78446 -57265 -53118 -49727 23823 43817
21714 43817 32646 98782 4778 -68640 -8507 31552 -36149 -99866 7793 31274 23897 52215
21702 52215 31386 -31862 -84281 -19483 -12329 54889 -5656 7668 -70948 -81905 -71194 -110195
21690 -110195 -95912 -91934 -206780 -235452 -176021 -123900 -152290 -150373 -19225 -6656 -85884
$$ packed form
21772a12963M6385l6624J1811K444P7823J0049k9540J5991R6169j36617j78047
21761b33119o4208Q6301R9796P1795q8200M4939N4780R1287k5167j54567J8105
21750i8258Q0581p3043L7442j4099n3854m1870R927Q2022O441P7744j0390j1936
21738i293L4309l0601q8970p9399j098O8619J00897Q6295k4623o0702o0858q4361
21726a49785r1772k5159k0672K2110L9913J12533L4386K1181M147L391P3550J9994
21714D3817j1171O6136r4004p3418O0133M0059o7701o3717J07659K3481p377K8318
21702E2215k0829o3248n2419O4798P154O7218o0545J3324p8616j0957J0711l9001
21690a10195J4283L978j14846k8672N9431N2121k8390J917J31148J2569p9228
$$ plain form
21679 -85884 -130368 -157076 -159735 -128677 -140742 -220052 -241331 -262253 -138453 47210 38608 53393
21667 53393 43848 31498 -12933 30695 213814 119500 5828 -55731 -90035 -69319 -112491
21656 -112491 -141485 -148014 -129555 -125448 -80681 -69228 35760 106780 109018 123799 77265 643
21644 643 -50490 3051 -65 -19710 -3449 38278 -59973 -72831 -67588 -12101 17309 -38758
21632 -38758 -31042 29043 77914 117594 24944 51008 64324 34664 37062 -4349 -78139 -53122
21620 -53122 -43209 -77408 19176 -49591 -176198 -127721 -60677 -101485 -213002 -364172 -343032
21609 -343032 -270437 -157599 -71203 -62221 63297 121665 22090 31830 -3845 -61496 -63423 13462
21597 13462 61563 -16281 25013 -33382 -78217 -42866 -7602 -107216 -114161 -79590 2430 88095
$$ packed form
21679h5884m4484k6708k659L1058j2065p9310k1279k0922J23800J85663q602J4785
21667E3393r545j2350m4431M3628J83119r4314j13672o1559l4304K0716m3172
21656a12491k8994o529J8459M107M4767J1453J04988P1020K238J4781m6534p6622
21644F43n1133N3541l116j9645J6261M1727r8251j2858N243N5487K9410n6067
21632c8758P716O0085M8871L9680r2650K6064J3316k9660K398m1411p3790K5017
21620e3122R913l4199R6584o8767j26607M8477O7044m0808j11517j51170K1140
21609c43032P2595J12838Q6396Q982J25518N8368r9575R740l5675n7651j927P6885
21597A3462M8101p7844M1294n8395m4835L5351L5264r9614o945L4571Q2020Q5665
$$ plain form
21585 88095 33169 -94543 -215181 -159424 -132487 -176435 -153022 -71564 -24836 -104304 -103495 -63008
21573 -63008 -20509 -8291 29085 -52458 -54356 56263 20200 9637 -4071 -82916 -50740 46262
21561 46262 122424 39283 -103033 -185593 -170383 -140116 -216802 -230387 -175023 -106776 -114288 -155804
21549 -155804 -131005 -120106 -73104 -61810 -66643 -99719 -168951 -89628 -116719 -201736 -221904 -153567
21537 -153567 -163486 -98668 -116333 -73383 15091 112690 110815 89099 59206 -19893 2853 96734
21525 96734 58433 24436 -100713 -243281 -190251 -159455 -97374 28806 -51611 -80972 -149981
21514 -149981 -161674 -167300 -61710 -41782 -5814 -23215 67383 50527 -31143 -27172 -38445 -94773
21502 -94773 -179774 -131780 11504 46414 53903 -30122 -5568 12599 -9294 -4708 -45691 -141460
$$ packed form
21585H8095n4926j27712j20638N5757K6937m3948K3413Q1458M6728p9468Q09M0487
21573f3008M2499J2218L7376q1543j898J10619l6063j0563j3708p8845L2176R7002
21561D6262P6162q3141j42316q2560J5210L0267p6686j3585N5364O8247p512m1516
21549a55804K4799J0899M7002J1294m833l3076o9232P9323k7091q5017k0168O8337
21537a53567r919O4818j7665M2950Q8474R7599j875k1716k9893p9099K2746R3881
21525I6734l8301l3997j25149j42568N3030L0796O2081J26180q0417k9361o9009
21514a49981j1693n626J05590J9928L5968j7401R0598j6856q1670L971j1273n6328
21502i4773q5001M7994J43284L4910P489q4025K4554J8167k1893M586m0983r5769
$$ plain form
21490 -141460 -77119 -2959 -40778 -119563 -216413 -191539 -121958 -120719 -93260 -55761 -206584
21479 -206584 -210697 -91622 -147163 -223935 -272946 -325443 -274348 -206499 -141848 -115890 -93662
21468 -93662 -87803 54272 143101 131835 152147 63951 43798 87720 33761 -57752 -103036 -140232
21456 -140232 -158382 -30390 -37349 -49962 -25709 10741 91429 143709 274924 295474 79139
21445 79139 -81042 -116026 -189462 -221032 -275337 -124637 -46363 49715 79505 95925 171107
21434 171107 171337 123004 72702 -4870 -99714 -63147 11609 101646 39254 -82964 -111883 -109559
21422 -109559 -119355 -117420 -154419 -155713 -85319 -29471 57105 26444 -78859 -29627 -31050 -55408
21410 -55408 -25710 -73868 -155316 -269292 -188074 -106988 -106302 -119242 -64484 -97540 -114833 -48813
$$ packed form
21490a41460O4341P4160l7819p8785r6850K4874O9581J239K7459L7499j50823
21479b06584m113J19075n5541p6772m9011n2497N1095O7849O4651K5958K2228
21468i3662N859J42075Q8829j1266K0312q8196k0153M3922n3959r1513m5284l7196
21456a40232j8150J27992o959j2613K4253L6450Q0688N2280J31215K0550k16335
21445G9139j60181l4984p3436l1570n4305J50700P8274R6078K9790J6420P5182
21434A71107K30m8333n0302p7572r4844L6567P4756R0037o2392j22218k8919K324
21422a09559r796J935l6999j294P0394N5848Q6576l0661j05303M9232j423k4358
21410e5408K9698m8158q1448j13976Q1218Q1086O86j2940N4758l3056j7293O6020
$$ plain form
21398 -48813 -43779 12004 23147 -49110 -28039 44992 124587 125998 104099 99026 178844 243191
21386 243191 186568 131848 71781 60243 38461 2298 36541 82422 89952 219182 158514
21375 158514 156555 40046 10972 10232 70960 -79908 -151565 -23025 -67841 -84149 -106563
21364 -106563 -106992 -115671 -99799 -80185 -177519 -181989 -84852 -37286 -123269 -96741 -96322 -40349 -10164
21351 -10164 -37582 -79988 -33060 44717 2220 -3325 40910 140791 110333 68664 68429 85999
21339 85999 48247 -46167 -133768 -146875 -76965 -54005 -28266 109825 72070 -14398 -125749
21328 -125749 -156034 -66818 -8333 41983 104430 70538 70440 50109 62874 77504 42499 14148
21316 14148 68381 -16740 -4478 -19862 -24968 60417 -40565 -8100 81496 60459 -8445 -74223
$$ packed form
21398d8813N034N5783J1143p2257K1071P3031P9595J411k1899n073P9818O4347
21386B43191n6623n4720o0067j1538k1782l6163L4243M5881P530J29230o0668
21375A58514j959j16509k9074p40O0728j50868p1657J28540m4816j6308k2414
21364a06563m29q679J5872J9614r7334m470R7137M7566q5983K6528M19N5973L0185
21351a0164k7418m2406M6928P7777m2497n545M4235R9881l0458m1669k35J7570
21339H5999l7752r4414q7601j3107O9910K2960K5739J38091l7755q6468j11351
21328a25749l0285Q9216N8485N0316O2447l3892r8k0331J2765J4630l5005k8351
21316A4148N4233q5121J2262j5384n106Q5385j00982L2465Q9596k1037o8904o5778
$$ plain form
21304 -74223 -176638 -110024 -79272 -122148 -163451 -243646 -285439 -167562 -154900 -213384 -139129
21293 -139129 -179661 -183087 -48769 -49137 -38036 -167503 -283611 -338484 -331585 -204810 -47160
21282 -47160 75885 108860 8603 -116934 -49205 -38161 -117082 -86360 32642 121566 110828
21271 110828 -2428 -48285 -15366 50569 89461 -54972 -119447 -135026 -151728 -122678 -170129
21260 -170129 -198431 -215873 -166806 -241660 -204569 -219927 -130829 39103 -41298 -119604 -183756
21249 -183756 -184685 -130562 -70660 -8213 -9930 -74876 -175056 -252162 -293809 -246271 -17740 -67719
21237 -67719 -82767 -60366 -55083 -96938 35420 53175 -52184 -57664 17845 -90792 16476
21226 16476 102354 80432 -7952 -47945 45843 54224 17424 33246 118771 92712 -36701 -86936
$$ packed form
21304g4223j02415O6614L0752m2876m1303q0195m1793J17877J2662n8484P4255
21293a39129m0532l426J34318l68J1101j29467j16108n4873O899J26775J57650
21282d7160J23045L2975j00257j25537O7729J1044p8921L0722J19002Q8924j0738
21271A10828j13256m5857L2919O5935L8892j44433o4475j5579j6702K9050m7451
21260a70129k8302j7442M9067p4854L7091j5358Q9098J69932q0401p8306o4152
21249a83756r29N4123N9902O2447j717o4946j00180p7106m1647M7538K28531m9979
21237f7719j5048K2401N283m1855J32358J7755j05359n480P5509j08637J07268
21226A6476Q5878k1922q8384l9993R3788Q381l6800J5822Q5525k6059j29413n0235
$$ plain form
21214 -86936 -138646 -56702 -33512 -9340 -14474 13005 -22618 -43596 -68629 -24750 -58179 -56680
21202 -56680 -127175 -113212 -61860 -97435 -191513 -213003 -158290 -220601 -238538 -247349 -220711 -195278
21190 -195278 -13714 129348 129988 14511 -26619 -48939 -171410 -160490 -47246 -10708 -134741
21179 -134741 -37439 22806 -16567 46510 37333 -101629 -186671 -158980 -67374 16417 31758
21168 31758 202376 132807 -50066 -7348 9651 -74798 -59674 150606 259173 225984 204620
21157 204620 97444 161826 228930 55614 -68157 -135787 -115703 -128706 -146719 -166256 -205038
21146 -205038 -45143 -29466 7721 -24097 -34715 -18991 -11268 -10645 17601 -29671 -27599 -14799
21134 -14799 27585 57909 55294 57677 17445 1264 29103 59379 57554 38870 -58144 -131291
$$ packed form
21214h6936n1710Q1944K3190K4172n134K7479l5623k0978k5033M3879l3429J499
21202e6680p0495J3963N1352l5575r4078k1490N4713o2311j7937q811K6638K5433
21190a95278J81564J43062O40j15477m1130k2320j22471J0920J13244L6538j24033
21179a34741R7302O0245l9373O3077r177j38962q5042K7691R1606Q3791J5341
21168C1758J70618o9569j82873M2718J6999q4449J5124K10280J08567l3189k1364
21157B04620j07176O4382O7104j73316j23771o7630K0084j3003j8013j9537l8782
21146b05038J59895J5677L7187l1818j0618J5724P723O23K8246m7272K072J2800
21134a4799M2384L0324k615K383m0232j6181K7839L0276j825j8684r7014p3147
$$ plain form
21122 -131291 -56975 111175 18901 -21534 31894 93353 115914 77373 33144 -39970 -16841
21111 -16841 17281 98585 138597 167131 81274 22335 -9713 -32569 -86137 -110034 70553
21100 70553 180337 86707 -73208 -48079 -129039 -53178 71767 164824 89934 38319 -70044
21089 -70044 -185544 -126789 -64166 -109685 -70253 -109782 -138472 75946 176857 138019 95940
21078 95940 63860 34028 60209 82138 86798 79212 69126 48847 72062 58164 -23814 -134905
21066 -134905 -108753 -96439 -28266 101949 25019 -12277 12178 35189 23311 -80638 -58872
21055 -58872 26964 62106 154110 208640 118625 59887 -13878 123620 147447 129033 73991
21044 73991 72988 41002 -44496 -78078 -80966 18900 2727 13275 32486 20859 63161 4804
$$ packed form
21122a31291P4316J68150r2274m0435N3428O1459K2561l8541m4229p3114K3129
21111a6841L4122Q1304M0012K8534q5857n8939l2048k2856n3568k3897J80587
21100G0553J09784r3630j59915K5129q0960P5861J24945R3057p4890n1615j08363
21089g0044j15500N8755O2623m5519L9432l9529k8690K14418J00911l8838m2079
21078I5940l2080k9832K6181K1929M660p586j0086k0279K3215j3898q1978j11091
21066a34905K6152J2314O8173J30215p6930l7296K4455K3011j1878j03949K1766
21055e8872Q5836L5142R2004N4530r0015n8738p3765J37498K3827j8414n5042
21044G3991j003l1986q5498l3582k888R9866j6173J0548J9211j1627M2302n8357
$$ plain form
21032 4804 -36056 -66443 -58158 -64705 15652 27813 52443 -13408 -138146 -210337 -159308 -98645
21020 -98645 -95493 -59903 -173915 -198780 -101360 -66237 -60504 -99777 -55333 -48503 3970 -782
21008 -782 33298 29591 11173 100339 168691 133451 34342 -15766 5195 -64212 -86425 -77404
20996 -77404 -76349 -31483 22494 -43948 -21614 -36038 -74211 -11972 4219 -69922 -159933 -74926
20984 -74926 10562 -56112 -29928 -53842 -67059 -95704 -115971 -166663 -163865 -251705 -252574 -189557
20972 -189557 -227087 -271324 -239977 -175858 -93747 -24733 81691 26755 62231 98589 73056
20961 73056 56875 -100660 -180327 -53895 -26766 -183219 -230857 -63493 -101934 44774 76118
20950 76118 -6484 -20449 4686 76753 65068 -62930 -140591 -138471 16613 114349 44525
$$ packed form
21032D804m0860l0387Q285o547Q0357J2161K4630o5851j24738p2191N1029O0663
21020i8645L152L5590j14012k4865R7420L5123N733l9273M4444O830N2473m752
21008g82L4080l707j8418Q9166O8352l5240r9109n0108K0961o9407k2213R021
20996g7404J055M4866N3977o6442K2334j4424l8173O2239J6191p4141r0011Q5007
20984g4926Q5488o6674K6184k3914j3217k8645k0267n0692K798q7840q69O3017
20972a89557l7530m4237L1347O4119Q2111O9014J06424n4936L5476L6358k5533
20961G3056j6181j57535p9667J26432K7129j56453m7638J67364l8441J46708L1344
20950G6118q2602j3965K5135P2067j1685j27998p7661K120J55084R7736o9824
$$ plain form
20939 44525 49787 61 -58005 -43743 -7544 21457 -36377 -21025 -2907 28360 97701 35235
20927 35235 42968 91080 72315 56143 -25451 15629 32242 7451 40864 -7710 -127656 -146862
20915 -146862 -73096 7118 9782 9995 3844 56212 -15208 -72833 -118113 -58899 7476 40974
20903 40974 21066 -62621 -18869 -34706 -87116 -13726 77450 103694 56477 54456 25183 11104
20891 11104 44482 19000 -55402 -37386 76287 107998 -11078 -47786 -27656 7740 -64023
20880 -64023 -93231 -144508 -173962 -173388 -225033 -177330 -206315 -86153 23866 56098 74982 82007
20868 82007 125309 212947 91135 -42687 6155 64670 15282 16454 -90224 -133993 5923
20857 5923 114597 123785 35407 -37627 -60656 -66403 -156233 -126871 79729 196192 136653 6445
$$ packed form
20939D4525N262m9726n8066J4262L6199K9001n7834J5352J8118L1267O9341o2466
20927C5235P733M8112j8765j6172q1594M1080J6613k4791L3413m8574j19946j9206
20915a46862P3766Q0214K664K13o151N2368p1420n7625m5280N9214O6375L3498
20903D0974j9908q3687M3752j5837n2410P3390R1176K6244m7217k021k9273j4079
20891A1104L3378k5482p4402J8016J13673L1711j19076l6708K0130L5396p1763
20880f4023k9208n1277k9454N74n1645M7703k8985J20162J10019L2232J8884P025
20868H2007M3302Q7638j21812j33822M8842N8515m9388J172j06678m3769J39916
20857E923J08674R188q8378p3034k3029n747q9830K9362K06600J16463n9539j30208
$$ plain form
20845 6445 -105015 -113190 -56242 -30040 64018 47995 94549 159481 54027 -37903 -5564 37920
20833 37920 52559 61283 98135 -13168 -191921 -119407 -37757 -6753 56823 62577 17454 -116740
20821 -116740 -188288 -154622 -59571 -81633 -85571 -68900 -54202 29962 27117 88976 140496 32863
20809 32863 -86958 -31692 65438 107993 33712 47062 42027 -14461 -41709 -75809 13183 -59534
20797 -59534 -150191 -125800 -125398 -34982 69052 68291 -68353 -43162 132349 134803 76121 26017
20785 26017 -38489 -13909 -16458 -142928 -107744 -29726 -79381 15821 146862 155061 80817 2184
20773 2184 -87045 -62252 -83832 -60076 102359 28543 -21584 -106903 -18608 83117 161111
20762 161111 139853 63664 78705 38433 -39358 -50307 -82241 -118513 -61423 -76806 -155110
$$ packed form
20845F445j11460q175N6948K6202R4058j6023M6554O4932j05454r1930L2339M3484
20833C7920J4639Q724L6852j11303j78753P2514Q1650L1004O3576N754m5123j34194
20821a16740p1548L3666R5051k2062l938J6671J4698Q4164k845O1859N1520j07633
20809C2863j19821N5266R7130M2555p4281J3350n035n6488k7248l4100Q8992p2717
20797e9534r0657K4391M02R0416J04034p61j36644K5191J75511K454n8682n0104
20785B6017o4506K4580k549j26470L5184P8018m9655R5202J31041Q199p4244p8633
20773B184q9229K4793k1580K3756J62435p3816n0127q5319Q8295J01725P7994
20762A61111k1258p6189J5041m0272p7791j0949l1934l6272N7090j5383p8304
$$ plain form
20751 -155110 -204642 -140372 16624 31086 -8856 65897 27644 54091 83816 52836 -107618
20740 -107618 -145423 -147792 -117299 -192356 -179516 -139006 -63264 -162821 -99051 -41815 17346 -25522
20728 -25522 64268 73005 -38450 -102843 -212674 -109223 -32964 -87813 20679 179637 96777
20717 96777 61909 58302 57212 29195 11686 41911 18268 -15160 -26118 -119009 -89636 -101442
20705 -101442 -69400 -36387 -8017 -23553 15300 94590 51445 -23929 -106502 -61391 37040
20694 37040 69408 84598 49390 -1024 -114816 -102798 78787 177515 47618 52759 57751
20683 57751 15278 -58774 -26597 4728 -80370 -33202 5010 22854 -143922 -220291 -114921
20672 -114921 -38073 102012 102364 96665 180826 167574 100118 32783 85229 3384 -2187 20866
$$ packed form
20751a55110m9532O4270J56996J4462l9942P4753l8253K6447K9725l0980j60454
20740a07618l7805k369L0493p5057J2840M0510P5742r9557O3770N7236N9161m2868
20728b5522Q9790Q737j11455o4393j09831J03451P6259n4849J08492J58958q2860
20717I6777l4868l607j090k8017j7509L0225k3643l3428j0958r2891K9373j1806
20705a01442L2042L3013K8370j5536L8853P9290m3145p5374q2573M5111R8431
20694C7040L2368J5190l5208n0414j13792J2018J81585R8728j29897N141M992
20683E7751m2473p4052L2177L1325q5098M7168L8212J7844j66776p6369J05370
20672a14921P6848J40085L52n699Q4161j3252o7456o7335N2446q1845n571K3053
$$ plain form
20660 20866 3687 -71884 -49956 -19340 -72880 3963 80044 70132 53821 -1970 10579 59118
20648 59118 -21854 -127636 -15028 43959 -106322 -101646 36897 107029 1458 -67976 -38902
20637 -38902 -63158 -48805 -17271 21189 16316 -40740 -69966 -9527 21818 141624 190634 136830
20625 136830 9994 -73543 -99527 -11787 81942 97892 104667 85322 24180 -50289 -26010
20614 -26010 -32843 22998 69355 55491 5597 -49862 53591 115933 160668 76972 -12981 13665
20602 13665 53939 88745 -17414 23899 -63121 -109602 -69126 -52225 9839 221635 221167 149622
20590 149622 184494 146318 206781 185069 159382 187759 161160 68573 79556 151476 180130
20579 180130 65592 -122095 -215755 -193564 -190877 -200585 -212999 -131976 -121823 -11794 -48673
$$ packed form
20660B0866j7179p5571K1928L0616n3540P6843P6081r912j6311n5791J2549M8539
20648E9118q0972j05782J12608N8987j50281M676J38543P0132j05571o9434K9074
20637c8902k4256J4353L1534L8460m873n7056k9226O0439L1345J19806M9010n3804
20625A36830j26836q3537k5984Q7740R3729J5950O775j9345o1142p4469K4279
20614b6010o833N5841M6357j3864m9894n5459J03453O2342M4735q3696q9953K6646
20602A3665M0274L4806j06159M1313q7020m6481M0476J6901O2064K11796m68p1545
20590A49622L4872l8176O0463k1712k5687K8377k6599r2587J0983P1920K8654
20579A80130j14538j87687r3660K2191K687r708j2414Q1023J0153J10029l6879
$$ plain form
20568 -48673 -52775 -39322 -63448 -50137 30290 138499 202331 205551 110339 -8896 12234 25757
20556 25757 -44633 -59716 55607 170170 208148 236498 134978 35288 -8879 69623 -40811
20545 -40811 -13084 93456 141320 145201 136516 130605 211877 164719 60216 60041 124764 94007
20533 94007 211657 295049 261162 219707 134760 121073 220409 267245 278755 229272 141178
20522 141178 62042 -119482 -119803 -45028 11059 69450 40319 56388 18234 -38155 16004 122478
20510 122478 145747 123411 130723 48020 -9182 -37457 -29803 -46140 -42486 -59234 -158167 -170167
20498 -170167 -109588 -20498 -1893 58990 74483 -15349 -114270 -94283 -183287 -64173 45662
20487 45662 117534 195838 207262 99311 7062 -48454 -20657 42448 58543 -688 -27254
$$ packed form
20568d8673m102J3453k4126J3311Q0427J08209O3832L220r5212j19235K1130J3523
20556B5757p0390j5083J15323J14563L7978K8350j01520r9690m4167P8502j10434
20545d0811K7727J06540M7864L881q685n911Q1272m7158j04503j75O4723l0757
20533I4007J17650Q3392l3887m1455q4947j3687R9336M6836J1510m9483q8094
20522A41178p9136j81524l21P4775N6087N8391k9131J6069l8154n6389N4159J06474
20510A22478K3269k2336P312q2703n7202k8275P654j6337L654j6748r8933j2000
20498a70167O0579Q9090J8605O0883J5493q9832r8921J9987q9004J19114J09835
20487D5662P1872P8304J1424j07951r2249n5516K7797O3105J6095n9231k6566
$$ plain form
20476 -27254 -87045 -91400 -83240 -8426 160667 167833 125782 74199 66163 60324 119159 10951
20464 10951 21823 64538 -70065 -143560 -144434 -126877 -135964 -74059 -13880 -68191 -167644 -212680
20452 -212680 -90699 -42665 75755 220487 221476 167456 48599 -63381 4501 128316 79255
20441 79255 77909 135903 155301 111707 -50304 -149240 -55278 195987 264697 191064 218968
20430 218968 244862 149165 148031 171910 127295 58691 5810 -2820 44235 40723 41011 35565 -19801
20417 -19801 86796 42998 -81502 -90574 21294 -17850 35115 176506 230009 179199 137087
20406 137087 -52430 -194290 -197697 -97784 -3436 -41885 -93858 54062 125039 35217 3813
20395 3813 35042 104442 53472 43120 121578 76271 -26409 -58685 -83656 52409 91694
$$ packed form
20476b7254n9791m355Q160P4814J69093P166m2051n1583q036n839N8835j08208
20464A0951J0872M2715j34603p3495q74J7557r087O1905O0179n4311r9453m5036
20452b12680J21981M8034J18420J44732R89n4020j18857j11980O7882J23815m9061
20441G9255j346N7994J9398m3594j62011r8936R3962K51265O8710p3633K7904
20430B18968K5894r5697j134K3879m4615o8604n2881q630M7055l512K88n446n5366
20417a9801J06597m3798j24500r072J11868l9144N2965J41391N3503n0810m2112
20406A37087j89517j41860l407R9913R4348l8449n1973J47920P0977q9822l1404
20395C813L1229O9400n0970j0352P8458m5307j02680l2276k4971J36065L9285
$$ plain form
20384 91694 107806 204304 204457 278180 260071 136651 61288 66891 67317 49793 55640 108872 93958
20371 93958 70794 20712 -16596 -55556 4022 76610 20054 -51833 -43623 -61908 -91054 40239
20359 40239 129849 39590 -24314 -89074 -215149 -221976 -43429 58122 53669 -73670 -107430
20348 -107430 -28387 -29167 -34790 111602 145869 163746 239441 216086 54275 -86622 -121484
20337 -121484 61567 19766 -154120 -166119 -83328 33519 61525 33249 64444 30576 -25221
20326 -25221 -54007 -91417 -50506 -95564 -191074 -169393 -43875 -18124 58603 54499 30012 -4516
20314 -4516 6357 30329 -27508 -71060 -70926 -75974 20770 83141 177468 267968 186529 60959
20302 60959 3725 -34797 -91562 -30989 81116 75421 19623 22647 120196 171848 199141 189117
$$ packed form
20384I1694J6112R6498J53P3723j8109j23420p5363N603M26j7524N847N3232j4914
20371I3958k3164n0082l7308l8960N9578P2588n6556p1887Q210j8285k9146J31293
20359D0239Q9610r0259o3904o4760j26075o827J78547J01551m453j27339l3760
20348a07430P9043p80n623J46392L4267J7877P5695k3355j61811j40897l4862
20337a21484J83051m1801j73886j1999Q2791J16847K8006k8276L1195l3868n5797
20326b5221k8786l7410M0911m5058r5510K1681J25518K5751P6727m104k4487l4528
20314d516J0873K3972n7837m3552J34n048R6744O2371R4327R0500q1439j25570
20302F0959n7234l8522n6765O0573J12105n695n5798L024R7549N1652K7293j0024
$$ plain form
20290 189117 103041 73343 48915 20802 95929 72330 -3966 -15041 41387 -2019 -40829
20279 -40829 -10162 40417 97518 146682 175101 149681 159212 158252 84684 -19000 -129532 -165673
20267 -165673 -143170 -14378 -50416 23643 60006 132677 197847 193932 51989 7365 28864
20256 28864 116677 119486 73465 127825 28572 -96862 -122230 -84292 37775 69532 39488
20245 39488 62380 70219 108941 88419 84419 182121 281414 107376 -19734 18283 69705 108280
20233 108280 176356 170849 141066 91400 19843 34240 158007 287889 253714 219086 232035
20222 232035 192768 119472 128586 139764 188758 159161 146880 74157 105143 133484 129647 169412
20210 169412 163591 245908 226890 165456 88380 251859 230981 98514 130307 257978 244188
$$ packed form
20290A89117q6076k9698k4428k8113P5127k3599p6296j1075N6428m3406l8810
20279d0829L0667N0579N7101M9164K8419k5420R531r60p3568j03684j10532l6141
20267a65673K2503J28792l6038P4059L6363P2671O5170l915j41943m4624K1499
20256B8864Q7813K809m6021N4360r9253j25434k5368L7938J22067L1757l0044
20245C9488K2892P839L8722k0522m000R7702R9293j74038j27110L8017N1422L8575
20233A08280O8076n507k9783m9666p1557J4397J23767J29882l4175l4628J2949
20222B32035l9267p3296R114J1178M8994k9597j2281p2723L0986K8341l837L9765
20210A69412n821Q2317j9018o1434p7076J63479k0878j32467L1793J27671j3790
$$ plain form
20199 244188 120772 -3606 -38219 5156 25454 11026 -31887 -93313 -4594 24939 3604
20188 3604 66572 177969 216399 372102 325312 270662 216335 126750 24522 7583 6228
20177 6228 103611 138680 133684 220406 66100 -35449 32391 75125 -18063 57417 134796 82338
20165 82338 -33201 -81314 -89609 -25043 60 -44981 -31938 47158 85241 -10137 16293 14526
20153 14526 -24530 52013 41256 -3747 11997 26570 90215 140236 122723 97369 127746 158822
20141 158822 91875 38741 4678 48687 85783 86421 37894 57808 -22440 -102993 -65825 -126313
20129 -126313 -90642 -117118 -129374 -58242 -97063 -156733 -142155 -142635 -35366 138488 120230
20118 120230 113073 75352 -6548 44193 62863 28717 83951 108608 39372 -48233 -32489 30121
$$ packed form
20199B44188j23416j24378l4613M3375K0298j4428m2913o1426Q8719K9533k1335
20188C604O2968J11397L8430J55703m6790n4650n4327q9585j02228j6939j355
20177F228R7383L5069m996Q6722j54306j01549O7840M2734r3188P5480P7379n2458
20165H2338j15539m8113q295O4566K5103m5041J3043P9096L8083r5378K6430j767
20153A4526l9056P6543j0757m5003J5744J4573O3645N0021j7513k5354L0377L1076
20141A58822o6947n3134l4063M4009L7096O38m8527J9914q0248q0553L7168o0488
20129a26313L5671k6476j2256P1132l8821n9670J4578m80J07269J73854j8258
20118A20230p157l7721q1900N0741J8670l4146N5234K4657o9236q7605J5744O2610
$$ plain form
20106 30121 -18535 -150974 -83381 59149 11258 -35101 -42678 -62396 -52432 -13396 62643 192910
20094 192910 160970 -16516 -31230 -99584 -117802 -29044 92894 200573 121401 206460 431510
20083 431510 453974 308907 105608 22560 113910 127635 147437 116698 97566 78076 146506
20072 146506 137904 90066 186883 209245 87091 -27408 38045 129986 125775 81197 62358
20061 62358 3849 -18540 32326 -2120 -29311 91515 115913 95538 -15684 11917 88629
20050 88629 178768 157212 18252 60404 76452 31975 41293 119249 133312 177263 81840 80945
20038 80945 74869 16212 -36428 -37531 -11077 39210 118681 56072 182972 147141 -38610 -50777
20026 -50777 -10434 -22194 50072 163106 120702 29731 57271 91437 59339 -42442 16075
$$ packed form
20106C0121m8656j32439O7593J42530m7891m6359p577j9718R964L9036P6039J30267
20094A92910l1940j77486j4714o8354j8218Q8758J21938J07679p9172Q5059K25050
20083D31510K2464j45067k03299q3048R1350J3725J9802l0739j9132j9490O8430
20072A46506q602m7838R6817K2362j22154j14499O5453R1941m211m4578j8839
20061F2358n8509k2389N0866l4446k7191J20826K4398k0375j11222K7601P6712
20050H8629R0139k1556j38960M2152J6048m4477R318P7956J4063M3951r5423q95
20038H0945o076n8657n2640j103K6454N0287P9471o2609J26900l5831j85751j2167
20026e0777M0343j1760P2266J13034m2404r0971K7540L4166l2098j01781N8517
$$ plain form
20015 16075 -8827 -1659 6422 82649 176162 164548 149850 89709 128448 99004 -34238 7272
20003 7272 -23397 -4955 9752 87273 95346 139924 129349 139168 231970 231840 244706 214222 140644
19990 140644 91535 101035 117493 165502 225697 200522 259082 202317 192866 237363 288014 350104
19978 350104 321379 373396 251576 177281 137978 123917 129976 52867 10605 26042 19252 60803
19966 60803 61565 121832 230116 206338 251710 253035 265876 312243 304973 350837 261264 194232
19954 194232 195009 92314 79565 65705 51740 85466 112101 144824 138765 56563 42922 129791
19942 129791 225999 243469 326025 370290 387475 461171 414518 348955 310338 302105 388372 447838
19930 447838 361917 254980 237909 312537 274053 145322 137066 218767 251526 177075 336639
$$ packed form
20015A6075k4902P168Q081P6227R3513j1614j4698o0141L8739k9444j33242M1510
20003G272l0669J8442J4707P7521Q073M4578j0575R819R2802j30J2866l0484p3578
19990A40644m9109R500J6458M8009O0195k5175N8560n6765r451M4497N0651O2090
19978C50104k8725N2017j21820p4295l9303j4061O059p7109m2262J5437o790M1551
19966F0803P62O0267J08284k3778M5372J325J2841M6367p270M5864q9573o7032
19954A94232P77j02695j2749j3860j3965L3726K6635L2723o059q2202j3641Q6869
19942A29791R6208J7470Q2556M4265J7185P3696m6653o5563l8617q233Q6267N9466
19930D47838q5921j06937j7071P4628l8484j28731q256Q1701L2759p4451J59564
$$ plain form
19919 336639 331166 279480 294618 189053 192904 275230 305037 389390 473335 436620 364804 324808
19907 324808 327124 286365 386137 478833 469453 495206 576716 650299 498288 481932 687863
19896 687863 711866 644734 717871 821219 761630 769629 918170 1046447 1072889 1031127 839900
19885 839900 721656 655526 690523 689243 713995 771023 722933 609836 624553 572142 607853
19874 607853 694879 773874 834803 761643 642669 647027 760879 749496 689322 646482 636036
19863 636036 689854 598428 621713 681186 540862 446630 540906 674766 694403 629251 683555
19852 683555 640893 553871 635896 794821 827601 872724 981564 995868 1037851 1084911 1013381
19841 1013381 925510 904471 852935 758454 705184 620607 639848 705996 691870 588920 639352
$$ packed form
19919C36639n473n1686J5138j05565L851Q2326K9807Q4353Q3945l6715p1816l9996
19907C24808K316m0759R9772R2696r380K5753Q1510P3583j52011j6356K05931
19896F87863K4003o7132P3137J03348n9589P999J48541J28277K6442m1762j91227
19885H39900j18244o6130L4997j280K4752N7028m8090j13097J4717n2411L5711
19874F07853Q7026P8995O0929p3160j18974M358J13852j1383o0174m2840j0446
19863F36036N3818r1426K3285N9473j40324r4232R4276J33860J9637o5152N4304
19852F83555m2662q7022Q2025J58925L2780M5123J08840J4304M1983M7060p1530
19841A013381q7871k1039n1536r4481n3270q4577J9241O6148j4126j02950N0432
$$ plain form
19830 639352 703595 673909 622977 580145 673246 594527 438843 477113 444150 326310 396846
19819 396846 455395 358642 397181 413710 390925 385526 417061 372126 420449 424495 615460 578101
19807 578101 539115 520646 552622 544135 488342 416187 425919 407036 327559 368506 325561 294930
19795 294930 326064 405887 341717 299749 285831 379863 436921 413181 433852 383212 299749
19784 299749 351247 401918 370634 411931 365575 292565 299999 316141 318089 330740 195414 162433
19772 162433 202413 295646 285443 323734 370483 355760 398595 490821 553539 393640 316733
19761 316733 400714 288698 233734 367429 345047 290963 229387 106696 98025 91326 155294
19750 155294 256183 310966 197678 156889 122696 146855 11447 93113 122384 193466 147441
$$ packed form
19830F39352O4243k9686n0932m2832R3101p8719j55684L8270l2963j17840P0536
19819C96846N8549r6753L8539J6529k2785n399L1535m4935M8323M046J90965l7359
19807E78101l8986j8469L1976q487n5793p2155R732j8883p9477M0947m2945l0631
19795B94930L1134P9823o4170m1968j3918R4032N7058k3740K0671n0640q3463
19784B99749N1498N0671l1284M1297m6356p3010P434J6142J948J2651j35326l2981
19772A62433L9980R3233j0203L8291M6749j4723M2835R2226O2718j59899p6907
19761C16733Q3981j12016n4964J33695k2382n4084o1576j22691q671o699O3968
19750A55294J00889N4783j13288m0789l4193K4159j35408Q1666K9271P1082m6025
$$ plain form
19739 147441 190421 174042 69805 73978 174047 280166 372585 374064 266723 239528 273402
19728 273402 313212 322406 377240 276576 280798 230314 267621 339426 400610 311378 155255
19717 155255 131908 294904 455990 420168 434921 431281 514384 481980 431058 365024 263750
19706 263750 250362 361895 404298 460966 423764 282897 258161 198768 130900 163659 229820
19695 229820 266749 335702 278745 380013 350127 299111 354775 306996 323931 391393 440426
19684 440426 370055 391598 435170 391022 447310 516527 465244 388078 414185 421404 413477 500326
19672 500326 484898 401531 351470 297381 262231 422135 564154 646940 590696 542932 464444
19661 464444 342263 302860 462941 591511 564485 589350 539034 585314 540206 560076 679582
$$ packed form
19739A47441M2980j6379j04237M173J00069J06119R2419J479j07341k7195L3874
19728B73402L9810R194N4834j00664M222n0484L7307P1805O1184q9232j56123
19717A55255k3347J62996J61086l5822J4753l640Q3103l2404n0922o6034j01274
19706B63750j3388J11533M2403N6668l7202j40867k4736n9393o7868L2759O6161
19695B29820L6929O8953n6957J01268k9886n1016N5664m7779J6935O7462M9033
19684D40426p0371K1543M3572m4148N6288O9217n1283p7166K6107P219p927Q6849
19672E00326j5428q3367n0061n4089l5150J59904J42019Q2786n6244m7764p8488
19661D64444j22181l9403J60081J28570k7026K4865n0316M6280m5108J9870J19506
$$ plain form
19650 679582 609490 561573 437177 406674 551577 722398 681681 596495 548944 502732 481082
19639 481082 530793 619909 719598 748240 780567 780328 635969 651146 707360 775073 791900 822135
19627 822135 946540 941428 932414 833686 785773 780375 837080 741625 760375 764119 798698 780330
19615 780330 707374 635336 577801 664426 795991 819088 920104 909875 892718 840390 895830
19604 895830 835256 750556 680111 601880 601181 597363 725531 976120 1182485 1167511 1163414 1023132
19592 1023132 874857 887950 823569 820188 811289 773618 799647 712850 765242 965669 943637
19581 943637 784203 683409 680889 722071 832938 752520 709091 736950 811757 1018284 1056033
19570 1056033 1093927 1094429 1106963 1114996 1020650 870625 777495 835450 810615 755594 773985 757554
$$ packed form
19650F79582p0092m7917j24396l0503J44903J70821m0717q5186m7551m6212k1650
19639D81082M9711Q9116R9689K8642L2327k39j44359J5177N6214O7713J6827L0235
19627H22135J24405n112r014r8728m7913n398N6705r5455J8750L744L4579j8368
19615G80330p2956p2038n7535Q6625J31565K3097J01016j0229j7157n2328N5440
19604H95830o0574q4700p0445p8231o99l818J28168K50589K06365j4974m097j40282
19592A023132j48275J3093o4381l381q899l7671K6029q6797N2392K00427k2032
19581I43637j59434j00794k520M1182J10867q0418m3429K7859P4807K06527L7749
19570A056033L7894N02J2534Q033r4346j50025r3130N7955k4835n5021J8391j6431
$$ plain form
19558 757554 824814 953685 1001977 973356 1012761 1057258 1048439 1076406 1046700 1053927 1114487 1061353
19546 1061353 940014 977581 1090486 1234748 1410477 1581875 1568864 1486557 1389484 1281912
19536 1281912 1220246 1214842 1259272 1272042 1336782 1380941 1357603 1504576 1625906 1511813 1486877
19525 1486877 1538317 1547336 1439771 1351247 1422092 1507311 1490735 1553457 1683657 1665681 1719798
19514 1719798 1765997 1781561 1663601 1647500 1930118 2127518 2184241 2176057 2093748 2014595 1920293
19503 1920293 1866918 1835603 1814059 1763237 1595135 1504815 1565549 1664558 1738774 1781007 1814673
19492 1814673 1873034 1787780 1896818 1980873 2022118 1994906 2090583 2131236 2045733 2055839 2091592
19481 2091592 2138120 2242200 2336508 2381573 2305299 2178390 2107889 2119907 2190599 2235699 2187514
$$ packed form
19558G57554O7260J28871M8292k8621L9405M4497q819K7967k9706P227O0560n3134
19546A061353j21339L7567J12905J44262J75729J71398j3011q2307r7073j07572
19536A281912o1666n404M4430J2770O4740M4159k3338J46973J21330j14093k4936
19525A486877N1440R019j07565q8524P0845Q5219j6576O2722J30200j7976N4117
19514A719798M6199J5564j17960j6101K82618J97400N6723q184q2309p9153r4302
19503A920293n3375l1315k1544n0822j68102r0320O0734R9009P4216M2233L3666
19492A814673N8361q5254J09038Q4055M1245k7212R5677M0653q5503J0106L5753
19481B091592M6528J04080R4308M5065p6274j26909p0501J2018P0692M5100m8185
$$ plain form
19470 2187514 2164267 2178043 2309163 2414879 2417097 2446168 2416043 2397508 2452211 2521169 2716543
19459 2716543 2706294 2611140 2572317 2729785 2810734 2890469 2994966 3105359 3048091 3119979 3214190
19448 3214190 3176187 3190854 3283498 3524024 3633554 3615375 3667741 3873415 4098695 4303057
19438 4303057 4675567 4867209 4862215 4872809 4909485 5069618 5350279 5628344 5872198 6257680
19428 6257680 6731788 7123744 7669220 8105020 8296906 8557749 8978239 9598855 10188500
19419 10188500 10791409 11206620 11332345 11588101 11986937 12563387 13448380 14524737 15516621
19410 15516621 16245069 16448207 16257798 16256874 16423590 16720145 17319998 18237629 19423388 20907201
19400 20907201 22899178 25492971 28896999 33410407 39008123 45495056 52546137 60388506
$$ packed form
19470B187514k3247J3776J31120J05716K218K9071l0125j8535N4703O8958J95374
19459B716543j0249r5154l8823J57468Q0949P9735J04497J10393n7268P1888R4211
19448C214190l8003J4667R2644K40526J09530j8179N2366K05674K25280K04362
19438D303057L72510J91642m994J0594L6676J60133K80661K78065K43854L85482
19428F257680M74108L91956N45476M35800J91886K60843M20490O20616N89645
19419A0188500O02909M15211J25725K55756L98836N76450Q84993J076357R91884
19410A5516621P28448K03138j90409r24J66716K96555N99853R17631J185759J483813
19400B0907201J991977K593793L404028M513408N597716O486933P051081P842369
$$ plain form
19392 60388506 69536488 80800777 93602842 105147476 111178685 109222052 100848243 90542938
19384 90542938 82845359 79650046 81191089 87515326 98242746 112038778 126101731 137628340
19376 137628340 143370678 141552359 132103691 117010316 100765417 87297575 77876046
19369 77876046 72269391 69512711 68972481 69721460 70728887 71856648 73324057 76015303
19361 76015303 81040097 88832214 98761528 108862470 117510381 123791948 127559825 128739141
19353 128739141 127158263 122863523 117622735 113801440 113123458 115707709 119264132 120555107
19345 120555107 117985725 112601964 106997635 103041944 100660052 98376241 95465033 92468606
19337 92468606 90801441 91790890 95538192 101583502 108664753 115313146 120864532 126086407
$$ packed form
19392F0388506R147982J1264289J2802065J1544634O031209j956633q373809j0305305
19384I0542938p697579l195313J541043O324237J0727420J3796032J4062953J1526609
19376A37628340N742338j818319r448668j5093375j6244899j3467842r421529
19369G7876046n606655k756680n40230P48979J007427J127761J467409K691246
19361G6015303N024794P792117R929314J0100942Q647911O281567L767877J179316
19353A28739141j580878m294740n240788l821295o77982K584251L556423J290975
19345A20555107k569382n383761n604329l955691k381892k283811k911208k996427
19337I2468606j667165R89449L747302O045310P081251O648393N551386N221875
$$ plain form
19329 126086407 132810021 140858440 146392469 144711966 133904737 116818231 98805705
19322 98805705 83471241 71741638 63247109 56911443 52204537 48667209 46406421 45237955
19314 45237955 44717756 44112326 42606372 39919159 36336194 32628522 29486751 27122316
19306 27122316 25240061 23789003 22553510 21656901 20764317 20025595 19307218 18750835 18271359
19297 18271359 17968711 17726333 17478511 17130507 16568328 15600390 14503543 13384834 12451626
19288 12451626 11694054 11246811 10840296 10307717 9816975 9285789 8757392 8390951 8037126
19279 8037126 7787831 7507552 7076626 6608611 6286436 6094782 5857299 5628616 5221649
19270 5221649 4863486 4573437 4424785 4261958 3982969 3747537 3542365 3293147 3067583
$$ packed form
19329A26086407O723614Q048419N534029j680503j0807229j7086506j8012526
19322I8805705j5334464j1729603q494529o335666m706906l537328k260788j168466
19314D5237955n20199o05430j505954k687213l582965l707672l141771k364435
19306B7122316j882255j451058j235493q96609q92584p38722p18377n56383m79476
19297A8271359l02648k42378k47822l48004n62179r67938j096847j118709r33208
19288A2451626p57572m47243m06515n32579m90742n31186n28397l66441l53825
19279H037126k49295k80279m30926m68015l22175j91654k37483k28683m06967
19270E221649l58163k90049j48652j62827k78989k35432k05172k49218k25564
$$ plain form
19261 3067583 2980821 2946432 2937802 2711384 2464417 2337223 2351660 2268560 2129861 2031838 2038303
19250 2038303 1970002 1931511 1900562 1837848 1717049 1621597 1481643 1405217 1384976 1324371 1234637
19239 1234637 1197665 1102249 1139118 1191544 1255268 1287567 1341881 1364301 1427247 1444307 1378507
19228 1378507 1320267 1277995 1188612 1156729 1057790 894810 810279 872104 825999 777296 771499
19217 771499 782144 815290 892419 914328 916632 822401 700928 782699 804049 896285 930855
19206 930855 933878 936179 907772 820463 777622 817041 944552 936019 934902 1061907 1103624 1053055
19194 1053055 1064220 1012735 1056210 1090952 1104121 1031468 954563 903386 818389 862180 908083
19183 908083 919001 889829 1005982 1061975 1085547 1021677 1081870 1080651 1008849 1095814 1179318
$$ packed form
19261C067583q6762l4389q630k26418k46967j27194J4437q3100j38699r8023O465
19250B038303o8301l8491l0949o2714j20799r5452j39954p6426k0241o0605q9734
19239A234637l6972r5416L6869N2426O3724L2299N4314K2420O2946J7060o5800
19228A378507n8240m2272q9383l1883r8939j62980q4531O1825m6105m8703n797
19217G71499J0645L3146P7129K1909K304r4231j21473Q1771K1350R2236L4570
19206I30855L023K301k8407q7309m2841L9419J27511q533j117J27005M1717n0569
19194A053055J1165n1485M3475L4742J3169p2653p6905n1177q4997M3791M5903
19183I08083J0918k9172J16153N5993K3572o3870O0193j219p1802Q6965Q3504
$$ plain form
19172 1179318 1201565 1211443 1276497 1384679 1425900 1471191 1504531 1469750 1356809 1274126 1218957
19161 1218957 1254151 1240171 1279006 1168537 1180768 1288245 1359173 1407695 1293450 1122705
19151 1122705 1125162 1221765 1382928 1509852 1416590 1355637 1477105 1500711 1596102 1607411 1589717
19140 1589717 1611327 1551931 1490221 1533420 1604824 1636070 1588027 1575093 1774484 1850918 1846183
19129 1846183 1916336 1862200 1891628 1934646 1878785 2029014 2150353 2210704 2172666 2144305 2156872
19118 2156872 2224559 2304548 2254913 2340935 2397099 2480036 2511582 2473279 2573599 2558135 2576510
19107 2576510 2568591 2633405 2697992 2658630 2751012 2731247 2650464 2658737 2799115 2721388 2709648
19096 2709648 2812235 2870683 2870378 2974945 3178376 3357709 3558163 3720733 3848057 4032357
$$ packed form
19172A179318K2247R878O5054J08182M1221M5291L3340l4781j12941q2683n5169
19161A218957L5194j3980L8835j10469J2231J07477P0928M8522j14245j70745
19151A122705K457R6603J61163J26924r3262o0953J21468K3606R5391J1309j7694
19140A589717K1610n9396o1710M3199P1404L1246m8043j2934J99391P6434m735
19129A846183P0153n4136K9428M3018n5861J50229J21339O0351l8038k8361J2567
19118B156872O7687P9989m9635Q6022N6164Q2937L1546l8303J00320j5464J8375
19107B576510p919O4814O4587l9362R2382j9765q0783Q273J40378p7727j1740
19096B709648J02587N8448l05J04567K03431J79333K00454J62570J27324J84300
$$ plain form
19086 4032357 4256013 4487940 4773658 5130099 5513637 5982830 6203668 6342220 6507253
19077 6507253 6622985 6837828 7121698 7619333 8208679 8769811 9614749 10661448 11705200
19068 11705200 12415442 12638268 12407634 12152419 12062340 12253094 13014520 14068628 15172930
19059 15172930 16193480 16675735 16753683 17046904 17798448 18976604 20737731 23224165 26546791
19050 26546791 30703995 35869325 41875174 47801524 52777865 56868971 61089994 67134982
19042 67134982 76596371 88824366 100392972 106202910 103708973 95422452 87270280 82751250
19034 82751250 81687024 82190911 82226233 80937127 78156875 75516431 75117795 77365608 80427166
19025 80427166 82364890 82576384 81895545 82398595 86196959 94404767 107260672 123560438
$$ packed form
19086D032357K23656K31927K85718L56441L83538M69193K20838J38552J65033
19077F507253J15732K14843K83870M97635N89346N61132Q44938J046699J043752
19068A1705200P10242K22826k30634k55215r0079J90754P61426J054108J104302
19059A5172930J020550M82255P7948K93221P51544J178156J761127K486434L322626
19050B6546791M157204N165330O005849N926350M976341M091106M221023O044988
19042F7134982R461389J2227995J1568606N809938k493937q286521q152172m519030
19034H2751250j064226N03887L5322j289106k780252k640444l98636K247813L061558
19025H0427166J937724K11494o80839N03050L798364Q207808J2855905J6299766
$$ plain form
19017 123560438 139919630 150758428 152157483 144366271 132418751 121973503 116132236
19010 116132236 115053876 115170417 112376814 105011930 94813421 85042717 77952967 74201857
19002 74201857 73369578 74557273 76972399 80411631 85387842 93351818 105766792 122552538
18994 122552538 140746315 154143352 157013184 149759701 138781171 130103800 123034208
18987 123034208 114599967 104353905 95121234 90199058 90249555 95438001 105618614 120170595
18979 120170595 136080605 146684170 146017553 133596255 114654146 96218051 80819597
18972 80819597 68526890 59193595 52596664 48291046 45647807 43979958 42358671 40456254
18964 40456254 38371116 36318980 34649047 33552628 33176335 33410805 33985677 34469454 34446641
$$ packed form
19017A23560438J6359192J0838798J399055p791212j1947520j0445248n841267
19010A16132236j078360J16541k793603p364884j0198509r770704p089750l751110
19002G4201857q32279J187695K415126L439232M976211P963976J2414974J6785746
18994A22552538J8193777J3397037K869832p253483j0978530q677371p069592
18987A23034208q434241j0246062r232671m922176N0497N188446J0180613J4551981
18979A20170595J5910010J0603565o66617j2421298j8942109j8436095j5398454
18972H0819597j2292707r333295o596931m305618k643239j667849j621287j902417
18964D0456254k085138k052136j669933j096419l76293K34470N74872M83777k2813
$$ plain form
18955 34446641 33722618 32316505 30576215 28435296 26190171 24263779 22683477 21301115
18947 21301115 20023749 19022209 18281585 17868784 17592919 17073371 16302087 15103150 13754124
18938 13754124 12446229 11403314 10535053 9914486 9296032 8810574 8531767 8300653 7965886
18929 7965886 7559342 7218756 6831441 6480716 6172073 5725597 5396174 5181642 4951269
18920 4951269 4658167 4444438 4279446 4096611 3967459 3783710 3645120 3646270 3534083 3408044
18910 3408044 3272937 3174494 3092778 2868917 2695249 2679810 2629829 2489304 2488469 2510194 2330202
18899 2330202 2270154 2419379 2358807 2267776 2135668 2067749 2089121 2149507 2174951 2135301 2063180
18888 2063180 2027325 1898791 1791327 1861144 2003084 1983017 1928855 1947547 1899660 1764969
$$ packed form
18955C4446641p24023j406113j740290k140919k245125j926392j580302j382362
18947B1301115j277366j001540p40624m12801k75865n19548p71284j198937j349026
18938A3754124j307895j042915q68261o20567o18454m85458k78807k31114l34767
18929G965886m06544l40586l87315l50725l08643m46476l29423k14532k30373
18920D951269k93102k13729j64992j82835j29152j83749j38590J150j12187j26039
18910C408044j35107r8443q1716k23861j73668j5439m9981j40525q35K1725j79992
18899B330202o0048J49225o0572r1031j32108o7919K1372O0386K5444l9650p2121
18888B063180l5855j28534j07464O9817J41940k0067n4162J8692m7887j34691
$$ plain form
18878 1764969 1655610 1658786 1787298 1800384 1623382 1600238 1719045 1707798 1708057 1797587 1811069
18867 1811069 1811345 1768033 1756735 1785053 1701904 1665340 1650019 1721183 1791155 1849782 1935924 1877802
18855 1877802 1755113 1697815 1638848 1830750 1944351 1931210 1830803 1714783 1640825 1459958
18845 1459958 1372746 1269911 1281820 1339588 1472778 1502964 1501427 1551935 1537247 1569274 1664433
18834 1664433 1653975 1605176 1466780 1525161 1614515 1481631 1415337 1450630 1498378 1469620 1502679
18823 1502679 1575952 1586852 1526652 1397853 1225777 1184039 1178205 1163133 1137866 1151947 1177330
18812 1177330 1202620 1174891 1277137 1388371 1249550 1085383 925113 886680 929592 944910
18802 944910 968509 887354 964097 1083652 1054669 1100303 1088336 1119028 1111092 1087677 997769
$$ packed form
18878A764969j09359L176J28512J3086j77002k3144J18807j1247K59Q9530J3482
18867A811069K76m3312j1298K8318q3149l6564j5321P1164O9972N8627Q6142n8122
18855A877802j22689n7298n8967J91902J13601j3141j00407j16020p3958j80867
18845A459958q7212j02835J1909N7768J33190L0186j537N0508j4688L2027R5159
18834A664433j0458m8799j38396N8381Q9354j32884o6294L5293M7748k8758L3059
18823A502679P3273J0900o0200j28799j72076m1738n834j5072k5267J4081K5383
18812A177330K5290k7729J02246J11234j38821j64167j60270l8433M2912J5318
18802I44910K3599q1155P6743J19555k8983M5634j1967L0692p936k3415q9908
$$ plain form
18791 997769 842286 928484 885392 817201 862676 812294 734864 787867 851535 769467 650473
18780 650473 581504 563768 621319 657283 594647 633497 618876 560830 600234 590392 607943 524952
18768 524952 513113 702469 886779 725490 751177 775310 686352 621394 634153 707142 912854
18757 912854 916539 826542 782501 754494 747754 907071 767703 692892 778133 892591 848836
18746 848836 879279 876939 937955 970844 952482 923614 1003993 979856 971663 1065390 1113768 1204294
18734 1204294 1257431 1337076 1483376 1635946 1608552 1602935 1605384 1725282 1762415 1731335 1711220
18723 1711220 1747049 1668050 1580193 1614669 1711885 1679087 1632136 1649391 1733188 1805665 1853810
18712 1853810 1904168 1961781 1951397 1981936 1923046 2001132 2007024 2083711 2170166 2233133 2246708
$$ packed form
18791I97769j55483Q6198m3092o8191M5475n0382p7430N3003O3668q2068j18994
18780F50473o8969j7736N7551L5964o2636L8850j4621n8046L9404r842J7551q2991
18768E24952j1839J89356J84310j61289K5687K4133q8958o4958J2759P2989K05712
18757I12854L685q9997m4041k8007o740J59317j39368p4811Q5241J14458m3755
18746H48836L0443k340O1016L2889j8362k8868Q0379k4137q193R3727M8378R0526
18734A204294N3137P9645J46300J52570k7394n617K449J19898L7133l1080k0115
18723A711220L5829p8999q7857L4476R7216l2798m6951J7255Q3797P2477M8145
18712A853810N0358N7613j0384L0539n8890P8086N892P6687Q6455O2967J3575
$$ plain form
18701 2246708 2415765 2480485 2512295 2473587 2483891 2478610 2573287 2529987 2622491 2792776 2842888
18690 2842888 2910035 3029632 3136165 3199895 3331502 3504396 3659878 3858572 4001754 3980909
18680 3980909 3986660 4137848 4355358 4658446 4962057 5188608 5510551 6016760 6297845 6332080
18670 6332080 6104479 5973894 6008924 5977812 5987224 6247691 6849728 7535527 8255353 9116493
18660 9116493 9767095 10004575 9830643 9245426 8720500 8345037 8115000 8033556 8110980 8337405
18650 8337405 8559058 8862901 9318943 9880005 10409884 10923146 11507536 12302723 13331110
18641 13331110 14543714 16016707 17963361 20565434 23634662 27281805 31005599 33971473
18633 33971473 35438407 35730805 35983557 37044112 39037564 41541959 44064159 46568798
$$ packed form
18701B246708J69057O4720L1810l8708J0304n281R4677m3300R2504J70285N0112
18690B842888O7147J19597J06533O3730J31607J72894J55482J98694J43182k0845
18680C980909N751J51188K17510L03088L03611K26551L21943N06209K81085L4235
18670F332080k27601j30585L5030l1112R412K60467O02037O85799P19826Q61140
18660I116493O50602K37480j73932n85217n24926l75463k30037q1444P7424K26425
18650H337405K21653L03843M56042N61062N29879N13262N84390P95187J028387
18641A3331110J212604J472993J946654K602073L069228L647143L723794K965874
18633C3971473J466934K92398K52752J060555J993452K504395K522200K504639
$$ plain form
18625 46568798 49295239 52223217 55010193 56966957 58150783 59345851 61850889 66338512
18617 66338512 72922551 81150682 90578035 101085775 113615593 129940724 151577352
18610 151577352 178635411 209521152 239663291 261637026 268504457 257926409 236301156
18603 236301156 214726427 201476584 199058898 205741829 218597518 234412143 249870800
18596 249870800 261917118 268063089 266580251 257745964 243401821 225444356 205024429
18589 205024429 183192564 161852421 143355103 129005912 118885235 112479311 109136594
18582 109136594 108648037 110942591 115572698 122419976 131615417 142945834 155572610 167378554
18574 167378554 175430868 177239634 172535794 164395258 156813364 152188139 150663440 151207040
$$ packed form
18625D6568798K726441K927978K786976J956764J183826J195068K505038M487623
18617F6338512O584039Q228131R427353J0507740J2529818J6325131K1636628
18610A51577352K7058059L0885741L0142139K1973735O867431j0578048k1625253
18603B36301156k1574729j3249843k417686O682931J2855689J5814625J5458657
18596B49870800J2046318O145971j482838q834287j4344143j7957465k0419927
18589B05024429k1831865k1340143j8497318j4349191j0120677o405924l342717
18582A09136594m88557K294554M630107O847278R195441J1330417J2626776J1805944
18574A67378554Q052314J808766m703840q140536p581894m625225j524699N43600
$$ plain form
18566 151207040 153114714 156581180 161924078 167387720 169838567 166507238 156908392 142874416
18558 142874416 127026923 111791822 99179007 89628700 82643945 77357023 72886462
18551 72886462 68834031 64993972 61711054 59561559 58313636 57680520 57146962 56133938
18543 56133938 54624636 52808510 51689200 51625731 52843934 55064003 57820469 60347412
18535 60347412 60920183 58673476 53949266 48457101 43733303 40031205 36945069 34062815
18527 34062815 31459694 29332083 27633945 26400595 25779269 25489723 25254577 25315368 25684732
18518 25684732 26501054 27487315 28257139 28364705 27835331 26915711 25992081 25582596 25958582
18509 25958582 26694109 27305393 27617886 27701024 27574851 27363405 26767240 25412451 23602633
$$ packed form
18566A51207040J907674L466466N342898N463642K450847l331329r598846j4033976
18558A42874416j5847493j5235101j2612815r550307o984755n286922m470561
18551G2886462m052431l840059l282918k149495j247923o33116n33558j013024
18543E6133938j509302j816126j119310o3469J218203K220069K756466K526943
18535F0347412N72771k246707m724210n492165m723798l702098l086136k882254
18527C4062815k603121k127611j698138j233350o21326k89546k35146O0791L69364
18518B5684732Q16322R86261P69824J07566n29374r19620r23630m09485L75986
18509B5958582P35527O11284L12493Q3138j26173k11446n96165j354789j809818
$$ plain form
18500 23602633 21562320 19751282 18386431 17606795 17182951 16981234 17074096 17242413 17531375
18491 17531375 18019472 18660611 19502885 20421583 21593761 23363567 25769757 28707859 31861285
18482 31861285 34493837 36181427 37140461 38172935 40315665 43801528 48561623 53720730
18474 53720730 57780245 59383835 58712796 57471632 57634685 59290047 61426267 62847196
18466 62847196 63272235 63568718 64998601 68485062 74464881 82273257 91792697 104082193
18458 104082193 120889227 142542260 166008875 186102653 197627492 198610668 192471586
18451 192471586 185461618 182431250 184245252 186850352 185253790 177635936 166345252 156352453
18443 156352453 150928573 150019170 150976502 151062623 148662225 144321282 140218841 138833129
$$ packed form
18500B3602633k040313j811038j364851p79636m23844k01717R2862J68317K88962
18491A7531375M88097O41139Q42274R18698J172178J769806K406190K938102L153426
18482C1861285K632552J687590R59034J032474K142730L485863M760095N159107
18474E3720730M059515J603590o71039j241164J63053J655362K136220J420929
18466F2847196M25039K96483J429883L486461N979819P808376R519440J2289496
18458A04082193J6807034K1653033K3466615K0093778J1524839R83176o139082
18451A92471586p009968l030368J814002K605100j596562p617854j1290684r992799
18443A56352453n423880r09403R57332Q6121k400398m340943m102441j385712
$$ plain form
18435 138833129 142074646 151165311 166994937 189949434 218015417 245289962 265613581
18428 265613581 274842498 272561964 261632794 245333496 227712847 211262447 195583514
18421 195583514 180328063 166414355 156978809 154498777 159428790 172670025 194240567
18414 194240567 223485051 256355229 282565837 289221551 271696915 235953012 197585354
18407 197585354 167153865 145673153 130559521 118522161 107915009 99089966 92452098
18400 92452098 86984495 81608792 75700283 69641430 64412500 60344496 57333824 55269696
18392 55269696 54251835 54028680 54622983 55990865 57327519 57266674 55196867 51214539 46467466
18383 46467466 42054941 38297988 35332315 32766129 30629310 28697490 27043232 25588443
$$ packed form
18435A38833129L241517R090665J5829626K2954497K8065983K7274545K0323619
18428B65613581R228917k280534j0929170j6299298j7620649j6450400j5678933
18421A95583514j5255451j3913708r435546k480032M930013J3241235K1570542
18414A94240567K9244484L2870178K6210608O655714j7524636l5743903l8367658
18407A97585354l0431489k1480712j5113632j2037360j0607152q825043o637868
18400I2452098n467603n375703n908509o058853n228930m068004l010672k064128
18392E5269696j017861k23155N94303J367882J336654o0845k069807l982328m747073
18383D6467466m412525l756953k965673k566186k136819j931820j654258j454789
$$ plain form
18375 25588443 24103441 22808837 21717896 20852549 20040164 19382382 18862210 18386149 17901983
18366 17901983 17146142 16153139 15117605 14284612 13537192 12788846 12193993 11676707 11141272
18357 11141272 10733009 10424478 10021746 9594194 9202746 8831695 8386520 7864755 7557094
18348 7557094 7253056 6934542 6823319 6740685 6532622 6240031 5914143 5567371 5420240 5166419
18338 5166419 4888694 4712065 4587849 4496892 4376769 4298133 4166566 3996585 3792083 3775823
18328 3775823 3688843 3502244 3367180 3188771 3027032 2921878 2958068 2924853 2862943 2842533
18318 2842533 2715198 2720826 2646607 2605408 2569366 2373856 2337946 2382449 2396230 2246953 2071270
18307 2071270 2057076 2046789 2029599 1961322 2006778 2073321 2099382 2067838 2009843 1948460 1946100
$$ packed form
18375B5588443j485002j294604j090941q65347q12385o57782n20172m76061m84166
18366A7901983p55841r93003j035534q32993p47420p48346n94853n17286n35435
18357A1141272m08263l08531m02732m27552l91448l71051m45175n21765l07661
18348G557094l04038l18514j11223q2634k08063k92591l25888l46772j47131k53821
18338E166419k77725j76629j24216r0957j20123p8636j31567j69981k04502j6260
18328C775823q6980j86599j35064j78409j61739j05154L6190l3215o1910k0410
18318B842533j27335N628p4219m1199l6042j95510l5910M4503J3781j49277j75683
18307B071270j4194j0287j7190o8277M5456O6543K6061l1544n7995o1383k360
$$ plain form
18296 1946100 2019799 2014392 1865215 1895070 1934624 1906875 1991319 1977279 1934387 1907110 1930391
18285 1930391 2029730 2002839 1924943 1894778 1861986 1880551 1841951 1728087 1640616 1553588 1586188
18274 1586188 1579385 1478742 1530235 1669454 1657708 1673755 1814242 1802255 1770866 1757906 1751951
18263 1751951 1646845 1683797 1690249 1725207 1602830 1529405 1460283 1470897 1563474 1619394 1510720
18252 1510720 1556390 1704644 1607434 1547695 1463867 1396536 1427845 1378602 1299092 1260849 1360140
18241 1360140 1443203 1464053 1372748 1286532 1285042 1099801 1002210 1030543 1128803 1307242 1328178
18230 1328178 1257607 1225158 1235537 1264065 1201972 1153034 1157185 1137738 1186276 1118782 1051013
18219 1051013 1039130 1021072 934920 844544 849535 849301 910524 1099533 1144711 1133006 963759
$$ packed form
18296A946100P3699n407j49177K9855L9554k7749Q4444j4040m2892k7277K3281
18285A930391R9339k6891p7896l0165l2792J8565l8600j13864q7471q7028L2600
18274A586188o803j00643N1493J39219j1746J6047J40487j1987l1389j2960n955
18263A751951j05106L6952O452L4958j22377p3425o9122J0614R2577N5920j08674
18252A510720M5670J48254r7210n9739q3828o7331L1309m9243p9510l8243R9291
18241A360140Q3063K0850r1305q6216j490j85241r7591K8333R8260J78439K0936
18230A328178p0571l2449J0379K8528o2093m8938M151j9447M8538o7494o7769
18219A051013j1883j8058q6152r0376M991k34O1223J89009M5178j1705j69247
$$ plain form
18208 963759 956657 1011344 1009428 1036201 1043652 1043021 887605 815844 852404 825642 695952 637210
18196 637210 703790 778061 762959 642876 588898 699774 686337 672468 661116 612459 561645
18185 561645 594824 707432 757086 672074 499881 464236 540421 640836 583301 548609 493469
18174 493469 529761 526052 505043 443050 408054 443705 457215 504722 444730 390513 391624 409141
18162 409141 440162 393595 366942 429119 457173 370941 337173 317424 334575 409929 601768
18151 601768 559236 502832 409038 311273 469489 599765 586561 490760 482806 504250 574866
18140 574866 538624 600506 702518 702161 616949 532420 482679 482533 522961 484709 397514 328525
18128 328525 290675 339219 419208 525766 522636 494918 585664 790930 749802 774771 864594
$$ packed form
18208I63759p102N4687j916K6773P451o31j55416p1761L6560k6762j29690n8742
18196F37210O6580P4271j5102j20083n3978J10876j3437j3869j1352m8657n0814
18185E61645L3179J12608M9654q5012j72193l5645P6185J00415n7535l4692n5140
18174D93469L6292l709k1009o1993l4996L5651J3510M7507n9992n4217J111J7517
18162D09141L1021m6567k6653O2177K8054q6232l3768j9749J7151P5354J91839
18151F01768m2532n6404r3794r7765J58216J30276j3204r5801p954K1444P0616
18140E74866l6242O1882J02012l57q5212q4529m9741j46M0428l8252q7195o8989
18128C28525l7850M8544P9989J06558l130k7718R0746K05266m1128K4969Q9823
$$ plain form
18117 864594 946904 899925 849076 755664 712011 714742 717341 743208 775536 759896 811447 913250
18105 913250 946847 956076 1099617 1210342 1121312 1098747 1091920 1205884 1170233 1215644 1255414
18094 1255414 1246892 1061259 992913 1012614 943144 918030 851000 826269 869982 914425 902134
18083 902134 940926 986214 972660 880271 914331 943145 1002258 889105 862487 900520 975545
18072 975545 1055376 1066907 1076156 1079499 1114322 1046783 980534 1027703 1115647 1112748 1105233 1076700
18060 1076700 1124862 1083415 1056001 1051368 1049042 938811 801219 869250 891329 924366 903417
18049 903417 835731 851806 836563 856397 894487 882910 944265 949756 982437 1005520 907683 709395
18037 709395 645636 705358 773309 868481 822775 792225 811453 720420 709278 688669 795517
$$ packed form
18117H64594Q2310m6979n0849r3412m3653K731K599K5867L2328j5640N1551J01803
18105I13250L3597R229J43541J10725q9030k2565o827J13964l5651M5411L9770
18094A255414q522j85633o8346J9701o9470k5114o7030k4731M3713M4443j2291
18083I02134L8792M5288j3554r2389L4060K8814N9113j13153k6618L8033P5025
18072I75545P9831J1531R249L343L4823o7539o6249M7169Q7944k899p515k8533
18060A076700M8162m1447k7414m633k326j10231j37592O8031K2079L3037k0949
18049I03417o7686J6075j5243J9834L8090j1577O1355N491L2681K3083r7837j98288
18037G09395o3759N9722O7951R5172m5706l0550J9228r1033j1142k0609J06848
$$ plain form
18026 795517 956942 928384 718358 683478 743494 760591 805182 738754 697390 698506 636350
18015 636350 654038 540698 485968 470841 538599 581594 547985 587804 565675 569341 662290
18004 662290 600011 633447 700146 674194 673837 602403 666377 597984 605759 605524 579436 640547
17992 640547 576499 536145 447359 451880 621645 465986 447945 524221 533963 539523 557730 643229
17980 643229 655478 664121 625226 610309 538313 550046 535598 493127 515449 548784 517910 536037
17968 536037 546151 643306 736665 770525 735344 691595 780545 850937 896095 884212 935301
17957 935301 1015938 886051 764791 729364 705839 746707 731783 620491 581091 677437 744335
17946 744335 671881 594335 626252 699953 670568 589222 588727 699304 741292 678061 701150 679737
$$ packed form
18026G95517J61425k8558k10026l4880O0016J7097M4591o6428m1364J116o2156
18015F36350J7688j13340n4730j5127O7758M2995l3609L9819k2129L666R2949
18004F62290o2279L3436O6699k5952l57p1434O3974o8393P775k35k6088O1111
17992F40547o4048m0354q8786M521J69765j55659j8041P6276R742N560J8207Q5499
17980F43229J2249Q643l8895j4917p1996J1733j4448m2471K2322L3335l0874J8127
17968E36037J0114R7155R3359L3860l5181m3749Q8950P0392M5158j1883N1089
17957I35301Q0637j29887j21260l5427k3525M0868j4924j11292l9400R6346O6898
17946G44335p2454p7546L1917P3701k9385q1346m95J10577M1988o3231K3089k1413
$$ plain form
17934 679737 635675 512533 547077 638684 743355 826018 886994 918634 972495 918534 847815
17923 847815 897028 906039 947428 842322 760637 774683 754293 699751 713299 864689 1013395
17912 1013395 1047121 970713 949275 1075650 1192180 1170454 1019760 945477 1023150 1057532 1031785
17901 1031785 1000764 889249 872769 818504 736521 728251 709317 709076 752707 808134 798364 719731
17889 719731 665056 644448 566334 422196 395974 365101 416338 536238 599898 590703 551009
17878 551009 443821 475940 504599 581126 725200 673737 625596 641564 564660 531740 468252
17867 468252 464140 497833 483428 555218 597484 397163 222695 228942 211215 255525 141654
17856 141654 155134 238001 225818 186145 238791 292815 272865 252379 374380 332132 385598
$$ packed form
17934F79737m4062j23142L4544R1607J04671Q2663O0976L1640N3861n3961p0719
17923H47815M9213R011M1389j05106q1685J4046k0390n4542J3548J51390J48706
17912A013395L3726p6408k1438J26375J16530k1726j50694p4283P7673L4382k5747
17901A031785l1021j11515j6480n4265q1983q270j8934k41M3631N5427r770p8633
17889G19731n4675k0608p8114j44138k6222l0873N1237J19900O3660r195l9694
17878E51009j07188L2119K8659P6527J44074n1463m8141J5968p6904l2920o3488
17867D68252m112L3693j4405P1790M2266k00321j74468O247j7727M4310j13871
17856A41654J3480Q2867j2183l9673N2646N4024j9950k0486J22001m2248N3466
$$ plain form
17845 385598 328603 276905 219569 277431 259720 249009 276630 314716 220673 152444 251444
17834 251444 382945 258570 144805 90424 -2412 -7524 103733 144402 266950 338846 284820
17823 284820 285150 286405 373205 290824 172358 145112 261061 186702 85891 43393 40299 167887
17811 167887 200404 230167 162808 207355 292582 265823 194406 211262 120014 72612 124605
17800 124605 170837 185209 156935 219636 211611 248912 194818 139950 146518 84913 45102 52149
17788 52149 99935 135133 78544 56882 -22126 160310 115964 106023 58246 178433 330333
17777 330333 323770 213696 146953 85047 14946 38405 3223 -78922 16746 86053 82247 -733
17765 -733 35770 44996 -14008 -45378 -87373 -17780 23969 56368 -50460 -118341 -75311 -17174
$$ packed form
17845C85598n6995n1698n7336N7862j7711j0711K7621L8086r4043o8229R9000
17834B51444J31501j24375j13765n4381r2836n112J11257M0669J22548P1896n4026
17823B84820L30J255Q6800q2381j18466k7246J15949p4359j00811m2498l094J27588
17811A67887L2517K9763o7359M4547Q5227k6759p1417J6856r1248m7402N1993
17800A24605M6232J4372k8274O2701q025L7301n4094n4868O568o1605l9811P047
17788E2149M7786L5198n6589k1662p9008J82436m4346r941m7777J20187J51900
17777C30333o563j10074o6743o1906p0101K3459l5182q2145R5668O9307l806q2980
17765g33L6503R226n9004l1370m1995O9593M1749L2399j06828o7881M3030N8137
$$ plain form
17753 -17174 12205 35272 46824 77826 85161 78427 152615 30762 -44072 97764 173722 145262
17741 145262 -1740 -73893 -117095 -31170 59659 16587 2540 2446 60534 24442 -44111 -129175
17729 -129175 -96034 -49054 -68061 10310 47160 52415 77918 162096 199780 237310 284165 313822
17717 313822 304226 364886 277831 86086 17585 -56082 -41195 -137112 -161930 -137410 -27193
17706 -27193 115975 159920 161442 113269 120359 25114 -2893 -16668 -9777 -106512 -169455 -132936
17694 -132936 -156571 -164857 -159904 -44408 -17275 42839 82158 39562 18918 -53749 -152758 -43091
17682 -43091 44008 136334 67636 49241 152272 197247 246739 154068 212557 237763 130240
17671 130240 87204 125189 154339 214543 177267 173478 128771 210553 215644 198436 92966 -1943
$$ packed form
17753a7174K9379K3067J1552L1002P335o734P4188j21853p4834J41836P5958k8460
17741A45262j47002p2153m3202Q5925R0829m3072j4047r4N8088l6092o8553q5064
17729a29175L3141M6980j9007P8371L6850N255K5503Q4178L7684L7530M6855K9657
17717C13822r596O0660q7055j91745o8501p3667J4887r5917k4818K4520J10217
17706b7193J43168M3945J522m8173P090r5245k8007j3775O891r6735o2943L6519
17694a32936k3635q286M953J15496K7133O0114L9319m2596k0644p2667r9009J09667
17682d3091Q7099R2326o8698j8395J03031M4975M9492r2671N8489K5206j07523
17671A30240m3036L7985K9150O0204l7276l789m4707Q1782N091j7208j05470r4909
$$ plain form
17659 -1943 -99422 -62519 1765 -5069 -37912 -12640 -9132 -25173 -55030 -134575 -12916 62425
17647 62425 78669 80507 146251 153652 288634 277594 294662 224471 182918 197653 268454 232200
17635 232200 33442 -54502 -47139 -6157 132883 5898 -106227 -64170 34268 2735 39891
17624 39891 176914 272487 198079 175024 110039 42172 61429 55914 123647 92661 123909 147308
17612 147308 9895 47186 123435 83653 47486 175247 189063 74119 94489 150745 65613
17601 65613 86525 70828 44986 -59890 30434 128404 139388 63175 8509 10696 77198 134204
17589 134204 104012 25069 108773 153518 74670 48998 106031 142747 212690 192767 116860
17578 116860 98775 38256 -12202 16034 -96007 -86752 -55370 -85417 -74368 -64264 73891
$$ packed form
17659a943r7479L6903O4284o834l2843K5272L508j6041k9857p9545J21659P5341
17647F2425J6244J838O5744P401J34982j1040J7068p0191m1553J4735P0801l6254
17635B32200j98758q7944P363M0982J39040j26985j12125M2057R8438l1533L7156
17624C9891J37023R5573p4408k3055o4985o7867J9257n515O7733l0986L1248K3399
17612A47308j37413L7291P6249l9782l6167J27761J3816j14944K0370N6256q5132
17601F5613K0912j5697k5842j04876R0324R7970J0984p6213n4666K187O6502N7006
17589A34204l0192p8943Q3704M4745p8848k5672N7033L6716O9943j9923p5907
17578A16860j8085o0519n0458K8236j12041R255L1382l0047J1049J0104J38155
$$ plain form
17567 73891 203667 156953 -27857 -176843 -115718 -89509 -30220 5686 -16341 -61750 -79238
17556 -79238 -89933 17412 116959 126016 185208 64999 61297 47498 -13372 46518 78834 87749
17544 87749 87702 39216 109668 23628 -80838 -76405 -34921 -83206 -23238 -8995 26381 23166
17532 23166 67451 101793 207736 239219 196131 121085 1658 42264 37630 2623 91780
17521 91780 99368 128334 3041 -11916 41700 -20265 22541 148815 132033 82406 118004
17510 118004 165455 190477 11786 60125 113687 25765 -23998 11674 42002 -17614 -6069
17499 -6069 -85850 -158710 -121938 -150110 -136154 -8436 -25465 54344 11375 127885 192694
17488 192694 46672 -44472 -25876 -47826 11715 48514 147645 204964 112736 91898 154627
$$ packed form
17567G3891J29776m6714j84810j48986O1125K6209N9289L5906k2027m5409j7488
17556g9238j0695J07345R9547R057N9192j20209l702j3799o0870N9890L2316Q915
17544H7749m7m8486P0452q6040j04466M433M1484m8285N9968J4243L5376l215
17532B3166M4285L4342J05943L1483m3088p5046j19427M0606m634l5007Q9157
17521I1780P588K8966j25293j4957N3616o1965M2806J26274j6782m9627L5598
17510A18004M7451K5022j78691M8339N3562q7922m9763L5672L0328n9616J1545
17499f069p9781p2860L6772k8172J3956J27718j7029P9809m2969J16510O4809
17488A92694j46022r1144J8596k1950N9541L6799R9131N7319r2228k0838O2729
$$ plain form
17477 154627 135845 42343 117173 16534 -11709 32207 79855 184980 122831 33291 98608
17466 98608 67628 -30453 3236 -61006 -23190 -6585 -39610 -132866 -88922 -132193 -109501 22556
17454 22556 76065 62928 87200 87940 71246 29162 2989 100877 139420 34940 -19174 10107
17442 10107 37416 30436 -44055 -3260 127603 105764 -7190 -120890 -37277 69144 35890
17431 35890 9779 72120 44174 15926 -96696 -121751 -105715 -144076 -77470 -33760 26099
17420 26099 -11201 38069 76510 -4235 -36070 -69537 -59078 -66290 -75792 -102622 -90297 -13906
17408 -13906 79726 144196 179127 124868 128269 194595 135077 104786 127165 164879 179994 171691
17396 171691 153615 157458 117300 174408 187979 158104 26725 56875 29032 17918 -14442
$$ packed form
17477A54627j8782r3502P4830j00639k8243M3916M7648J05125o2149q9540O5317
17466I8608l0980r8081L3689o4242L7816J6605l3025r3256M3944m3271K2692J32057
17454B2556N3509j3137K4272P40j6694m2084k6173R7888L8543j04480n4114K9281
17442A0107K7309o980p4491M0795J30863k1839j12954j13700Q3613J06421l3254
17431C5890k6111O2341k7946k8248j12622k5055J6036l8361O6606M3710N9859
17420B6099l7300M9270L8441q0745l1835l3467J0459p212r502k6830J2325P6391
17408a3906R3632O4470L4931n4259L401O6326n9518l0291K2379L7714J5115q303
17396A71691j8076L843m0158N7108J3571k9875j31379L0150k7843j1114l2360
$$ plain form
17385 -14442 -153932 -142561 -60283 -47586 -121648 -182013 -149757 -55902 -43936 -77724 -52516
17374 -52516 92245 101830 -21634 -15441 93087 124760 60448 45526 1315 -9968 -106433
17363 -106433 -189186 -234827 -262076 -184734 -75288 -12931 -83119 -170738 -226281 -195583 -147440
17352 -147440 -147898 -70011 49072 158128 152581 87556 36842 84652 96470 45449 34039 74889
17340 74889 46873 38474 -38103 49505 37317 -57757 -46062 26548 75872 44948 14736 -50260
17328 -50260 -160296 -91009 37799 56478 -7435 -56464 -50701 -62291 -91318 33913 157302
17317 157302 137854 173354 143255 147571 215559 190918 179517 153921 226306 207270 136976 52433
17305 52433 28233 37774 -53425 -132631 -120862 -132487 -73935 -52020 -58347 6988 63509 120543
$$ packed form
17385a4442j39490J1371Q2278J2697p4062o0365L2256R3855J1966l3788K5208
17374e2516J44761R585j23464O193J08528L1673o4312j4922m4211j1283r6465
17363a06433q2753m5641k7249P7342J09446O2357p0188q7619n5543L0698M8143
17352a47440m58P7887J19083J09056n547o5025n0714M7810J1818n1021j1410M0850
17340G4889k8016q399p6577Q7608j2188r5074J1695P2610M9324l0924l0212o4996
17328e0260j10036O9287J28808J8679o3913m9029N763j1590k9027J25231J23389
17317A57302j9448L5500l0099M316O7988k4641j1401k5596P2385j9036p0294q4543
17305E2433k4200R541r1199p9206J1769j1625N8552K1915o327O5335N6521N7034
$$ plain form
17293 120543 131883 167652 109756 117723 81028 -142211 -92664 -30928 -49474 -10907 21444
17282 21444 20330 -45246 -41293 -37775 -8790 106785 57829 -52212 1225 12269 5058 -114948
17270 -114948 -201607 -224175 -137258 -45605 -78432 -20357 -52202 -35743 -22121 -1576 -33650
17259 -33650 -32920 -21788 -25581 -27773 45780 9235 35293 68748 -36012 -155488 -221131 -198244
17247 -198244 -158411 -54350 19363 85299 70231 41495 79625 221645 201451 128136 103977
17236 103977 137356 163190 57056 67435 -21609 43191 41741 59231 76681 39060 49199
17225 49199 18429 -53935 -125043 -174512 -235674 -149975 -193420 -115973 -86160 -154602 -308841
17214 -308841 -295187 -136707 -90753 -189605 -163390 -136746 -85387 -28120 19113 55188 -115672
$$ packed form
17293A20543J1340L5769n7896P967l6695k23239M9547O1736j8546L8567L2351
17282B1444j114o5576L953L518K8985J15575m8956j10041N3437J1044p211j20006
17270a14948q6659k2568Q6917R1653l2827N8075l1845J6459J3622K0545l2074
17259c3650P30J1132l793k192P3553l6545K6058L3455j04760j19476o5643K2887
17247a98244L9833J04061P3713O5936j5068k8736L8130J42020k0194p3315k4159
17236A03977L3379K5834j06134J0379q9044O4800j450J7490J7450l7621J0139
17225D9199l0770p2364p1108m9469o1162Q5699m3445P7447K9813o8442j54239
17214c08841J3654J58480M5954r8852K6215K6644N1359N7267M7233L6075j70860
$$ plain form
17203 -115672 -182426 -75411 -20205 -88266 -42479 77309 117016 167055 110644 9879 62507
17192 62507 176151 163082 47051 51277 74704 51460 -49670 -34599 -42738 -12661 8811
17181 8811 77724 195556 198662 208885 89441 -26462 43829 79090 34125 33264 -66788 -101248
17169 -101248 -92160 22819 81327 102422 207437 85104 -19049 -7436 -51741 -54729 -58820
17158 -58820 -86826 -67457 -85241 -104632 -45311 4022 -62866 -25656 84998 101582 159676
17147 159676 -42701 -134975 -121769 -99300 -250568 -290689 -282739 -195688 -151390 -54899 7074
17136 7074 -35021 -65867 -82472 -21486 -28058 -69275 -204087 -171246 -134027 -128011 -96414 -44437
17124 -44437 91575 77342 71104 99608 100431 67686 73191 -22 -87004 -88040 44917 61779
$$ packed form
17203a15672o6754J07015N5206o8061M5787J19788L9707N0039n6411j00765N2628
17192F2507J13644j3069j16031M226K3427k3244j01130J5071q139L0077K1472
17181H811O8913J17832L106J0223j19444j15903P0291L5261m4965q61j00052l4460
17169a01248R088J14979N8508K1095J05015j22333j04153J1613m4305k988m091
17158e8820k8006J9369j7784j9391N9321M9333o6888L7210J10654J6584N8094
17147A59676k02377r2274J3206K2469j51268m0121P950Q7051M4298R6491O1973
17136G074m2095l0846j6605O0986o572m1217j34812L2841L7219O016L1597N1977
17124d4437J36012j4233o238K8504Q23l2745N505p3213q6982j036J32957J6862
$$ plain form
17112 61779 40053 63429 147215 187796 92427 -21743 -201518 -193485 -74423 15152 -47663
17101 -47663 -143323 -256596 -225319 -159663 -168872 -69470 -2104 21023 -28219 -114186 -96721 -33227
17089 -33227 -70782 -83240 -71760 -103723 -143850 -132762 -109344 -107688 -258895 -199646 -93850
17078 -93850 -80947 -160263 -190567 -207176 -170800 -65877 590 26714 -65454 -119718 -166577
17067 -166577 -135748 -170904 -221602 -69151 -36708 21530 -13864 -202874 -122528 5831 108048
17056 108048 61456 51814 118897 29343 15505 -50127 76892 89666 -83586 -178856 -112330
17045 -112330 -227269 -252559 -178594 -175275 -121174 -46065 105668 223950 173984 34054 15135
17034 15135 15865 -34455 -128157 -161318 -69327 -17407 107583 23293 5083 5180 -12877 -33292
$$ packed form
17112F1779k1726K3376Q3786M0581r5369j14170j79775Q033J19062Q9575o2815
17101d7663r5660j13273L1277O5656r209R9402O7366K3127m9242q5967J7465O3494
17089c3227l7555j2458J1480l1963m0127J1088K3418J656j51207N9249J05796
17078i3850J2903p9316l0304j6609L6376J04923O6467K6124r2168n4264m6859
17067a66577L0829l5156n0698J52451L2443N8238l5394j89010Q0346J28359J02217
17056A08048m6592r642O7083q9554j3838o5632J27019J2774j73252r5270O6526
17045a12330j14939k5290P3965L319N4101P5109J51733J18282m9966j39930j8919
17034A5135P30n0320r3702l3161R1991N1920J24990q4290j8210R7j8057k0415
$$ plain form
17022 -33292 -49604 -25609 -34340 -69333 -81334 -38722 12047 -119426 -226998 -191290 -196462 -181359
17010 -181359 -144349 -93844 -114998 -103607 -103790 -71603 -74136 -143577 -209597 -267670 -322474 -257516
16998 -257516 -223714 -156706 -73618 -158014 -98311 -24543 53200 49277 36974 -37920 -100039 -79190
16986 -79190 -29527 -26620 44623 63266 -66187 -133759 -37397 46942 22622 -27908 -79794 -26759
16974 -26759 -41029 -133912 -163155 -190210 -133305 -69657 -93971 -126137 -96945 -130558 -159257 -124772
16962 -124772 -78108 1338 7725 23163 -20764 -38368 -69879 -87075 -127512 -200771 -177927 -169289
16950 -169289 -239561 -206045 -54662 36175 37788 11498 -27571 -74914 -156075 -178031 -172015 -115861
16938 -115861 -87368 -163227 -119651 -48094 46211 31996 -10253 -9811 -85006 -27668 -6617 -68985
$$ packed form
17022c3292j6312K3995q731l4993j2001M2612N0769j31473j07572L5708n172J5103
17010a81359L7010N0505k1154J1391j83L2187k533o9441o6020n8073n4804O4958
16998b57516L3802O7008Q3088q4396N9703P3768P7743l923j2303p4894o2119K0849
16986g9190M9663K907P1243J8643j29453o7572R6362Q4339k4320n0530n1886N3035
16974b6759j4270r2883k9243k7055N6905O3648k4314l2166K9192l3613k8699L4485
16962a24772M6664P9446O387J5438m3927j7604l1511j7196m0437p3259K2844Q638
16950a69289p0272L3516J51383R0837J613k6290l9069m7343q1161k1956O016N6154
16938a15861K8493p5859M3576P1557R4305j4215m2249M42p5195N7338K1051o2368
$$ plain form
16926 -68985 -153638 -58277 -35150 -254108 -363554 -263023 -222875 -177722 -42241 -13508 25782
16915 25782 -59159 -263507 -142150 -54488 13552 64547 -141185 -152555 -133769 -124786 -184253
16904 -184253 -313716 -225029 -120900 -98886 -119925 -77782 -6652 -80847 -42903 -42289 14906
16893 14906 95530 89452 93383 46084 25373 -56274 -122508 25077 10466 -84620 -106480 -78148
16881 -78148 -187819 -246484 -206576 -82039 -13394 14052 51768 131766 51820 -7429 -103793
16870 -103793 -103243 -2167 35723 -36072 -152938 -166602 -108847 -73325 -263586 -245393 -173482
16859 -173482 -62028 -13082 -18580 -57759 -30851 -41929 -21791 85442 41114 86866 61659
16848 61659 -58387 -189343 -235977 -186390 -109532 -162345 -160084 -17082 -10948 67824 141411
$$ packed form
16926f8985q4653R5361K3127k18958j09446J00531M0148M5153J35481K8733L9290
16915B5782q4941k04348J21357Q7662O8040N0995k05732j1370J8786Q983n9467
16904a84253j29463Q8687J04129K2014k1039M2143P1130p4195L7944O14N7195
16893A4906Q0624o078L931m7299k0711q1647o6234J47585j4611r5086k1860K8332
16881g8148j09671n8665L9908J24537O8645K7446L7716P9998p9946n9249r6364
16870a03793N50J01076L7890p1795j16866j3664N7755L5522j90261J8193P1911
16859a73482J11454M8946n498l9179K6908j1078K0138J07233m4328M5752k5207
16848F1659j20046j30956m6634M9587P6858n2813K261J43002O134P8772P3587
$$ plain form
16837 141411 129295 64249 172486 103830 11864 3785 -27347 -6709 -78153 -84 -12108
16826 -12108 -112863 -44946 51684 126728 185138 140134 20937 -10149 -27663 -96097 -101798
16815 -101798 -10306 50140 -102616 -141442 -84560 -111310 -159065 -206198 -230987 -176131 -69794
16804 -69794 -146868 -178648 -224639 -248296 -190301 -79745 -39513 -22010 -42990 -924 20827
16793 20827 -106126 -234529 -293558 -183587 -96131 -23967 -62413 -126050 -176730 -108678 -46576
16782 -46576 -114057 -63205 45973 81736 27873 -101417 -134705 -80513 86354 196965 144145
16771 144145 -25571 -49438 79592 45460 10467 -60195 -81898 -129831 -161588 -224116 -239710
16760 -239710 -215566 -151035 -58736 -94047 -117261 -28788 -15943 -63275 -87765 -62769 -51535
$$ packed form
16837A41411j2116o5046J08237o8656r1966q079l1132K0638p1444P8069j2024
16826a2108j00755O7917R6630P5044N8410m5004j19197l1086j7514o8434n701
16815a01798R1492O0446j52756l8826N6882k6750m7755m7133k4789N4856J06337
16804f9794p7074l1780m5991k3657N7995J10556M0232J7503k0980M2066K1751
16793B0827j26953j28403n9029J09971Q7456P2164l8446o3637n0680O8052O2102
16782d6576o7481N0852J09178L5763n3863j29290l3288N4192J66867J10611n2820
16771A44145j69716k3867J29030l4132l4993p0662k1703m7933l1757o2528j5594
16760b39710K4144O4531R2299l5311k3214Q8473J2845m7332k4490K4996J1234
$$ plain form
16749 -51535 -68415 35484 113583 88687 -45048 -132790 -217030 -287485 -256933 -141398 -207533
16738 -207533 -134807 6238 64456 -67348 -96212 -78675 -134495 -120802 80041 130939 -35563
16727 -35563 5534 70496 -23921 -179652 -140733 -197999 -218806 -62551 21400 118564 121554
16716 121554 91348 17018 -24902 -14031 -61941 -153764 -151404 -159860 -98420 -134911 -50614 -190562
16704 -190562 -323207 -174356 -176882 -220468 -231834 -158288 -11138 -39705 -78548 -115581 -169630
16693 -169630 -212743 -167070 -146173 -46792 -62685 -144364 -63956 11130 -62637 -78301 -86778 -199817
16681 -199817 -233525 -152739 -177891 -251538 -166026 -53423 -94109 -233331 -197711 -22947 22581
16670 22581 99748 51251 26416 59113 -66954 -208323 -207952 -141749 -56212 -100508 -235687
$$ packed form
16749e1535j6880J03899P8099k4896j33735q7742q4240p0455L0552J15535o6135
16738b07533P2726J41045N8218j31804k8864J7537n5820J3693K00843N0898j66502
16727c5563M1097O4962r4417j55731L8919n7266k0807J56255Q3951R7164K990
16716A21554l0206p4330m1920J0871m7910r1823K360q456O1440l6491Q4297j39948
16704a90562j32645J48851k526m3586j1366P3546J47150k8567l8843l7033n4049
16693a69630m3113M5673K0897R9381j5893q1679Q0408P5086p3767j5664q477j13039
16681a99817l3708Q0786k5152p3647Q5512J12603m0686j39222L5620J74764M5528
16670B2581P7167m8497k4835L2697j26067j41369L71O6203Q5537m4296j35179
$$ plain form
16659 -235687 -254461 -213054 -214503 -220267 -176545 -69092 -19536 -5707 5031 -43581 -98161 -52139
16647 -52139 -26387 -78651 -200256 -188547 -188209 -84919 29328 96176 121719 117923 195867 236106
16635 236106 105012 -9732 -10316 -14754 -8321 57426 -1228 -113033 -68575 -22676 -122287 -248335
16623 -248335 -290036 -137698 -51885 -58684 -83238 -136919 -223370 -91634 -143605 -87321 -14923
16612 -14923 -20298 -102655 -213743 -155588 -78345 50026 82319 163981 102810 -26437 -234941
16601 -234941 -231177 -125881 -234123 -288624 -255345 -114591 12366 -21521 -69736 -82973 -37236
16590 -37236 -137651 -152390 -197873 -216597 -203010 25838 35469 -27221 -6573 -67529 -109750
16579 -109750 -16181 -20686 -25583 -79258 -69911 -163573 -293881 -194694 -88643 -10100 34271 53903
$$ packed form
16659b35687j8774M1407j449n764M3722J07453M9556J3829J0738m8612n4580M6022
16647e2139K5752n2264j21605J1709L38J03290J14247O6848K5543l796P7944M0239
16635B36106j31094j14744n84m438O433O5747n8654j11805M4458M5899r9611j26048
16623b48335m1701J52338Q5813o799k4554n3681q6451J31736n1971N6284P2398
16612a4923n375q2357j11088N8155P7243J28371L2293Q1662o1171j29247k08504
16601b34941L764J05296j08242n4501L3279J40754J26957l3887m8215j3237M5737
16590c7236j00415j4739m5483j8724J3587K28848R631o2690K0648o0956m2221
16579a09750R3569m505m897n3675R347r3662j30308R9187J06051P8543M4371J9632
$$ plain form
16567 53903 -44221 -126975 -116470 -34127 17745 -53989 -93766 -105847 -94979 -159954 -236452 -158697
16555 -158697 -175419 -174389 -25633 128426 167957 64096 -15322 51726 69801 53392 103808
16544 103808 88881 29628 56116 28888 28679 -36228 -52597 -34421 -61273 -124181 -108989 -172472
16532 -172472 -142523 -183203 -194323 -178458 -150325 -81940 -93608 -164108 -139702 -28707 -20455
16521 -20455 -55609 -83691 -54812 -33222 -104817 -163418 -136404 -126674 -91740 -116374 -47063 52041
16509 52041 74462 30222 29011 -5222 -137573 -269539 -262556 -233858 -136733 -1225 22704
16498 22704 -14772 -117530 -144032 -177900 -191106 -138932 -83152 -40118 19108 68976 81531
16487 81531 37360 -81938 -119597 -142417 -188237 -192181 -71749 -43824 -125001 -212323 -192219
$$ packed form
16567E3903r8124q2754J0505Q2343N1872p1734l9777j2081J0868o4975p6498P7755
16555a58697j6722J030J48756J54059L9531j03861p9418O7048J8075j6409N0416
16544A03808j4927n9253K6488k7228k09o4907j6369J8176k6852o2908J5192o3483
16532a72472K9949m0680j1120J5865K8133O8385j1668p0500K4406J10995Q252
16521b0455l5154k8082K8879K1590p1595n8601K7014R730L4934k4634O9311R9104
16509E2041K2421m4240j211l4233j32351j31966O983K8698R7125J35508K3929
16498B2704l7476j02758k6502l3868j3206N2174N5780M3034N9226M9868J2555
16487H1531m4171j19298l7659k2820m5820l944J20432K7925q1177q7322K0104
$$ plain form
16476 -192219 -261819 -180256 -155364 -88559 -30656 -56436 -208902 -217409 -225378 -203017 -198482 -201007
16464 -201007 -206503 -125958 -150720 -166245 -68315 -70731 -19727 -174975 -182831 -251951 -278615 -257226
16452 -257226 -245719 -279365 -214601 -93928 -41851 -15625 -18633 -59479 -137684 -41139 -32209 21681
16440 21681 14384 -116318 -167260 -159479 -100439 -80522 -33037 -38534 -108631 -232121 -197397 -148454
16428 -148454 -18028 2174 -94101 -103532 -65231 -132082 -99323 -2610 74333 38564 -53102
16417 -53102 -98683 -102328 23615 71561 3796 -98672 -196175 -266744 -309460 -284798 -270135
16406 -270135 -118141 20466 -20190 -96033 -111431 -138412 -55848 -1961 -93618 -85098 13096
16395 13096 -124829 -261801 -140726 -60318 66982 -10964 -149961 -60735 -86320 -107534 -136520
$$ packed form
16476a92219o9600Q1563K4892O6805N7903k5780j52466q507p969K2361M535k525
16464b01007n496Q0545k4762j5525R7930k416N1004j55248p856o9120k6664K1389
16452b57226J1507l3646O4764J20673N2077K6226l008m0846p8205R6545Q930N3890
16440B1681p297j30702n0942P781N9040J9917M7485n497p0097j23490L4724M8943
16428a48454J30426K0202r6275r431L8301o6851L2759R6713P6943l5769r1666
16417e3102m5581l645J25943M7946o7765j02468r7503p0569m2716K4662J4663
16406b70135J51994J38607m0656p5843j5398k6981Q2564N3887r1657Q520R8194
16395A3096j37925j36972J21075Q0408J27300p7946j38997Q9226k5585k1214k8986
$$ plain form
16384 -136520 -116550 -28126 10605 14710 42134 -19237 -107945 -134948 -118866 -117652 -38531 -79535
16372 -79535 -141510 -64231 -12437 -63781 -202424 -232191 -139281 22148 88838 69340 82743
16361 82743 33045 -33027 -127950 -150780 -210427 -186544 -320789 -300274 -192029 -184324 -149259
16350 -149259 -220685 -292133 -185051 -130050 -220844 -126339 -84040 -144692 -203241 -192625 -263341
16339 -263341 -145630 -37614 3181 -21581 -97262 -72447 -28690 4973 -45305 -157483 -76093
16328 -76093 -79808 -155486 -96702 -170323 -102999 73892 66311 -130463 -220633 -266020 -207875 -77715
16316 -77715 -81759 -102029 -94208 -57371 58766 99034 42471 -422 -126454 -217595 -139515 -79729
16304 -79729 31327 34573 -79881 -202262 -144800 -41798 -16686 -69054 -69901 -13556 -9991 106999
$$ packed form
16384a36520J9970Q8424L8731M105K7424o1371q8708k7003J6082J214P9121m1004
16372g9535o1975P7279N1794n1344j38643k9767R2910J61429O6690j9498J3403
16361H2743m9698o6072r4923k2830n9647K3883j34245K0515J08245P705L5065
16350a49259p1426p1448J07082N5001r0794R4505M2299o0652n8549J0616p0716
16339b63341J17711J08016M0795k4762p5681K4815M3757L3663n0278j12178Q1390
16328g6093l715p5678N8784p3621O7324J76891p581j96774r0170m5387N8145J30160
16316g7715m044k0270P821L6837J16137M0268n6563m2893j26032r1141P8080N9786
16304g9729J11056L246j14454j22381N7462J03002K5112n2368q47N6345L565J16990
$$ plain form
16292 106999 75991 61850 21797 -59557 -138703 -96405 1877 -39395 -46459 -65456 -31745 -51000
16280 -51000 -120739 -121549 -66850 -185787 -173172 -127948 -135098 -26290 46875 207268 288023 231641
16268 231641 142075 -15109 -67644 -111292 -132678 -178754 -203060 -189181 -63575 -122877 -110261
16257 -110261 -59814 -84577 -94582 -90244 -67059 -60225 36922 59474 60352 -11399 -132320 -173622
16245 -173622 -248149 -261991 -177801 -144471 -121952 -135744 -101071 -51866 -178820 -192314 -178508
16234 -178508 -99786 -51905 -41786 -111355 -158343 -99309 -140136 -196186 -187493 -139505 -164245 -244530
16222 -244530 -293418 -241342 -138421 -46292 -7434 13547 -26637 -117833 -216346 -296904 -203464
16211 -203464 -128704 -138256 -105980 -117975 -20091 74257 53472 -13443 35976 6961 -154820
$$ packed form
16292A06999l1008j4141m0053q1354p9146M2298R8282m1272p064j8997L3711j9255
16280e1000o9739q10N4699j18937J2615M5224p150J08808P3165J60393Q0755n6382
16268B31641q9566j57184n2535m3648k1386m6076k4306J3879J25606n9302J2616
16257a10261N0447k4763j0005M338K3185O834R7147K2552Q78p1751j20921m1302
16245a73622p4527j3842Q4190L3330K2519j3792L4673M9205j26954j3494J3806
16234a78508P8722M7881J0119o9569m6988N9034m0827n6050Q693M7988k4740q0285
16222b44530m8888N2076J02921R2129L8858K0981m0184r1196r8513q0558R3440
16211b03464P4760r552L2276j1995R7884R4348k0785o6915M9419k9015j61781
$$ plain form
16200 -154820 -200951 -108174 -52172 -148834 -138400 -84990 -64697 -136103 -100489 -48645 -65300
16189 -65300 -105646 -78700 -58074 -82440 -70920 26705 63849 52704 -26431 -110650 -118623 -75886
16177 -75886 -10659 -34039 -59674 -41126 -4783 59641 127252 165416 169936 108759 75734 -11699
16165 -11699 -12323 -59093 -58388 -32616 -33271 -7441 -27315 -67026 -28024 13255 -52841 54357 130465
16152 130465 31198 -24935 -90926 -88273 -124974 -53813 -134632 -197475 -207232 -153981 -63744 21481
16140 21481 65465 90295 128254 119432 83885 87012 -44771 -77423 -141685 -157968 -65567 -7801
16128 -7801 -53208 -33725 78338 92419 -84568 -50472 -57239 6053 96300 114960 67091 -100208
16116 -100208 -99048 -80643 -117974 -63432 -25644 -6627 -20567 -121302 -238693 -271602 -107927
$$ packed form
16200a54820m6131R2777N6002r6662J0434N3410K0293p1406L5614N1844j6655
16189f5300m0346K6946K0626k4366J1520R7625L7144j1145p9135q4219p973M2737
16177g5886O5227k3380k5635J8548L6343O4424O7611L8164M520o1177l3025q7433
16165a1699o24m6770P05K5772o55K5830j9874l9711L9002M1279o6096J07198P6108
16152A30465r9267n6133o5991K653l6701P1161q0819o2843r757N3251R0237Q5225
16140B1481M3984K4830L7959q822l5547L127j31783l2652o4262j6283R2401N7766
16128g801m5407J9483J12063J4081j76987L4096o767O3292R0247J8660m7869j67299
16116a00208J160J8405l7331N4542L7788J9017j3940j00735j17391l2909J63675
$$ plain form
16105 -107927 7438 -2275 -30964 -122320 -200910 -191102 -212657 -229204 -212833 -253639 -212925 -256137
16093 -256137 -195487 -102968 -91652 -148722 -158015 -145872 -242952 -175886 -169957 -173302 -107644 -98084
16081 -98084 -118780 -122374 -69070 -58742 -148893 -218773 -216618 -206509 -154958 -83197 38709 49206
16069 49206 -31448 -83168 -73492 -84943 -277737 -388878 -228192 -136023 -175279 -257087 -255357
16058 -255357 -157816 -214199 -243645 -86416 -115504 -154172 -158858 -218065 -258747 -131094 -128169
16047 -128169 -82939 -56174 -74264 -69843 -62616 -112732 -182773 -127452 -35911 -58347 -101309 -123639
16035 -123639 -98827 -107752 -123949 -43594 -64180 -218870 -241142 -231917 -237822 -265053 -168097 -189358
16023 -189358 -161840 -224042 -236250 -194230 -174924 -72566 84 -31065 -92696 -108738 -62519
$$ packed form
16105a07927J15365r713k8689r1356p8590R808k1555j6547J6371m0806M0714m3212
16093b56137O0650R2519J1316n7070r293J2143r7080O7066N929l345O5658R560
16081i8084k0696l594N3304J0328r0151o9880K155J0109N1551P1761J21906J0497
16069D9206q0654n1720R676j1451j92794j11141J60686R2169l9256q1808J730
16058b55357R7541n6383k9446J57229k9088l8668m686n9207m0682J27653K925
16047a28169M5230K6765j8090M421P227n0116p0041N5321R1541k2436m2962k2330
16035a23639K4812q925j6197Q0355k0586j54690k2272R225n905k7231R6956k1261
16023a89358K7518o2202j2208M2020J9306J02358P2650l1149o1631j6042M6219
$$ plain form
16012 -62519 -147010 -167799 -113755 -90845 -72627 -17307 41489 139182 116938 42137 79065 87249
16000 87249 33067 -25972 -57258 -9899 -45563 -18219 -7442 -1540 -166613 -151947 -53979 -113620
15988 -113620 -157446 -183594 -195176 -138993 -64726 27820 56788 -10706 -111389 -157261 -221108
15977 -221108 -98492 10328 -67388 -193874 -223270 -156385 -155091 -121359 -43245 724 29405
15966 29405 69527 35129 -92634 -138421 -29794 132561 121037 44002 -1746 -55187 3882
15955 3882 -148102 -164297 -107358 -60998 -16054 -56574 -26751 -26147 24228 -53513 -136771 -65912
15943 -65912 -2062 -40640 -224146 -199470 -120667 -176602 -156560 -48636 53504 51775 133702
15932 133702 175419 80440 91204 206428 181669 49852 9408 29985 12979 -53590 -165742
$$ packed form
16012f2519q4491k0789N4044K2910J8218N5320N8796R7693k2244p4801L6928Q184
16000H7249n4182n9039l1286M7359l5664K7344J0777N902j65073J4666R7968n9641
15988a13620m3826k6148j1582N6183P4267R2546K8968o7494j00683m5872o3847
15977b21108J22616J08820p7716j26486k9396O6885J294L3732P8114M3969K8681
15966B9405M0122l4398j27763m5787J08627J62355j1524p7035m5748n3441N9069
15955C882j51984j6195N6939M6360M4944m0520K9823O04N0375p7741q3258P0859
15943f5912O3850l8578j83506K4676P8803n5935K0042J07924J02140j729Q1927
15932A33702M1717r4979J0764J15224k4759j31817m0444K0577j7006o6569j12152
$$ plain form
15921 -165742 -75608 -110769 -241858 -229991 -170261 -134347 -78202 -24699 -78431 -41007 -572
15910 -572 24213 67022 49327 -186 319 8035 -23266 -67273 -77853 -22640 -30690 7187 -54115
15897 -54115 -63206 44178 116558 175697 203892 153414 136598 187600 101806 95470 115353 240055
15885 240055 204232 55914 -142122 -281335 -238563 -142310 -65231 50056 193927 145468
15875 145468 3589 -69342 -193275 -138473 -63809 -163013 -186640 -60255 -3962 18956 -115680
15864 -115680 -199662 -194267 -119719 -81085 -50099 -203165 -247291 -244073 -91171 37276 35910
15853 35910 5416 -44736 3132 -5020 24537 -13430 -90547 -69563 -35088 -65300 -88479 -52908
15841 -52908 -167037 -230151 -179752 -139518 14642 18921 34878 -22987 -75363 84515 103298
$$ packed form
15921a65742R0134l5161j31089J1867N9730L5914N6145N3503n3732L7424M0435
15910e72K4785M2809j7695m9513N05P716l1301m4007j0580N5213q050L7877o1302
15897e4115r091J07384P2380N9139K8195n0478j6816N1002q5794o336J9883J24702
15885B40055l5823j48318j98036j39213M2772R6253P7079J15287J43871m8459
15875A45468j41879p2931j23933N4802P4664r9204k3627J26385N6293K2918j34636
15864a15680q3982N395P4548L8634L0986j53066m4126L218J52902J28447j366
15853C5910l0494n0152M7868q152K9557l7967p7117K0984L4475l0212k3179L5571
15841e2908j14129o3114N0399M0234J54160M279J5957n7865n2376J59878J8783
$$ plain form
15830 103298 70562 12740 -86504 -180592 -154508 -84508 -33181 -27742 -34353 -34459 92562 95931
15818 95931 42113 -50681 -147330 -159432 -78013 -4481 56291 17409 62235 47917 -77898
15807 -77898 -158001 -76846 -135997 -225865 -166285 43552 52072 64749 51499 10944 -30626 24823
15795 24823 -6548 -102477 -47371 9789 -3320 20804 -93108 -199507 -162865 -187072 -188485
15784 -188485 -121702 -133501 -118934 -93505 -48544 -213438 -185496 -61102 -62645 -86109 -21231
15773 -21231 -113900 -116794 -89966 5417 98583 6959 -48064 -123405 -146924 -149105 -127356 1270
15761 1270 16032 -58926 -90285 -116923 -234800 -145674 -166359 -103637 -191317 -331386 -380845
15750 -380845 -407506 -398823 -278176 -160390 -175288 -240764 -163428 -96105 -50300 71781 216893
$$ packed form
15830A03298l2736n7822r9244r4088K6084P0000N1327N439o611j06J27021L369
15818I5931n3818r2794r6649j2102Q1419P3532O0772l8882M4826j4318j25815
15807g7898q0103Q1155n9151q9868N9580K09837Q520J2677j3250m0555m1570N5449
15795B4823l1371r5929N5106N7160j3109K4124j13912j06399L6642k4207j413
15784a88485O6783j1799J4567K5429M4961j64894K7942J24394j543k3464O4878
15773b1231r2669k894K6828R5383R3166r1624n5023p5341k3519k181K1749J28626
15761A270J4762p4958l1359k6638j17877Q9126k0685O2722q7680j40069m9459
15750c80845k6661Q683J20647J17786j4898o5476P7336O7323M5805J22081J45112
$$ plain form
15739 216893 177068 50635 -104625 -225371 -167093 -56933 28735 146398 140658 108498 -985
15728 -985 -122255 -198748 -175046 -127793 -87347 -52884 -43085 -27134 -36183 -176705 -222561 -150890
15716 -150890 23231 160243 70292 -16688 -27520 -58854 44464 111978 114639 90007 11166
15705 11166 -18376 153 -57371 -103093 -40765 -35424 -161402 -89249 -18852 18571 67447 14901
15693 14901 -45767 1985 3197 105505 43408 -72235 -152275 -136507 -3157 -3776 45200 158560
15681 158560 136477 66138 -50779 -133457 -157152 -85687 -181605 -201928 -116703 -103768 -166603
15670 -166603 -218261 -161099 -182013 -142806 -59205 -96906 -161758 -54550 17506 -37058 -114350
15659 -114350 -181561 -111885 732 13432 13073 54813 -10422 -36824 -134982 -120490 -100130 -15117
$$ packed form
15739B16893l9825j26433j55260j20746N8278J10160Q5668J17663n740l2160j09483
15728i85j21270p6493K3702M7253M0446L4463R799J5951r049j40522m5856P1671
15716a50890J74121J37012q9951q6980j0832l1334J03318O7514K661k4632p8841
15705A1166k9542J8529n7524m5722O2328N341j25978P2153P0397L7423M8876n2546
15693A4901o0668M7752J212J02308o2097j15643q0040J5768J33350o19M8976J13360
15681A58560k2083p0339j16917q2678k3695P1465r5918k0323Q5225J2935o2835
15670a66603n1658N7162k0914L9207Q3601l7701o4852J07208P2056n4564p7292
15659a14350o7211O9676J12617J2700l59M1740o5235k6402r8158J4492K0360Q5013
$$ plain form
15647 -15117 -65206 -30650 -75541 -192823 -106308 -37777 -41356 -120489 -151757 -149978 -98822 -137756
15635 -137756 -111204 -20142 -134027 -216777 -146235 -55589 38455 -31768 -25779 41713 58503
15624 58503 34626 -25788 -134852 -177545 -131278 -125417 -132652 -245835 -212209 -208704 -213761 -151830
15612 -151830 -117009 -124167 -130703 -212905 -231763 -159716 -194553 -128240 -41825 54944 84913 78579
15600 78579 -9660 30137 109861 -26981 -42617 -130535 -130693 -175708 -161345 -59596 44828
15589 44828 19991 -43775 20473 60021 74229 -81551 -213292 -108430 -36957 54463 142777
15578 142777 36279 -123436 -95243 -92439 -123322 -72511 -122994 -150114 -165549 -52731 1347
15567 1347 -74421 -136202 -159647 -103949 -90871 -137509 -167283 -284560 -275926 -273666 -211693 -244468
$$ packed form
15647a5117n0089L4556m4891j17282Q6515O8531l579p9133l1268J779N1156l8934
15635a37756K6552R1062j13885q2750P0542R0646R4044p0223N989O7492J6790
15624E8503k3877o0414j09064m2693M6267N861p235j13183L3626L505n057O1931
15612a51830L4821p158o536q2202j8858P2047l4837O6313Q6415R6769K9969o334
15600G8579q8239L9797P9724j36842j5636q7918j58m5015J4363J01749J04424
15589D4828k4837o3766O4248L9548J4208j55780j31741J04862P1473R1420Q8314
15578A42777j06498j59715K8193K804l0883N0811n0483k7120j5435J12818N4078
15567A347p5768o1781k3445N5698J3078m6638k9774j17277Q634K260O1973l2775
$$ plain form
15555 -244468 -258345 -270711 -356076 -340929 -173497 -158529 -143983 -131174 -140798 -210771 -107958
15544 -107958 27374 49020 -34844 -83498 -118781 -119205 -52467 -21341 14518 21191 -91883 -168354
15532 -168354 -192565 -98722 5261 -21092 -131699 -291411 -286275 -170538 -122620 -121229 -117429
15521 -117429 -59045 -60215 -73444 -12495 -44681 -69647 -66107 11556 101829 156099 93642 12098
15509 12098 64239 -51488 -41740 689 42785 44379 -136370 -205368 -219340 -197845 -151666 -91625
15497 -91625 -37838 51709 151321 124805 107600 17899 -24472 34852 41416 -10629 -126340 -57059
15485 -57059 -5759 28497 -3940 -12455 96371 13549 -76023 -59477 -81760 -48837 -151151
15474 -151151 -214261 -142089 -89080 29715 -4901 -46763 -49701 -113479 -118891 -139808 -115333 -117926
$$ packed form
15555b44468j3877j2366q5365J5147J67432J4968J4546J2809r624o9973J02813
15544a07958J35332K1646q3864m8654l5283m24O6738L1126L5859O673j13074p6471
15532a68354k4211R3843J03983k6353j10607j59712N136J15737M7918J391L800
15521a17429N8384j170j3229O0949l2186k4966L540P7663R0273N4270o2457q1544
15509A2098N2141j15727R748M2429M2096J594j80749o8998j3972K1495M6179O0041
15497i1625N3787Q9547R9612k6516j7205q9701m2371N9324O564n2045j15711O9281
15485e7059N1300L4256l2437q515J08826q2822q9572J6546k2283L2923j02314
15474a51151o3110P2172N3009J18795l4616m1862k938o3778n412k0917K4475k593
$$ plain form
15462 -117926 -88935 -61228 -44641 -150154 -230657 -186546 -190506 -147448 -146976 -139442 -174942 -139387
15450 -139387 -224360 -327515 -299506 -334904 -222281 -119992 -123506 -67151 -175270 -187980 -205884
15439 -205884 -206803 -91562 -82980 -182469 -212218 -188286 -72543 7424 -2480 5145 18935 -94650
15427 -94650 -117862 -46778 62569 -7002 -56507 55651 144461 114611 20087 -64774 -100418
15416 -100418 -245999 -190006 -142017 -197308 -112628 -119488 -75898 -103480 -215879 -286990 -84238
15405 -84238 1120 -104322 -174570 -221227 -228679 -209628 -137712 -125960 -127574 -106112 -121324 -120789
15393 -120789 -119826 -209242 -246889 -135178 -212013 -194065 -42392 51871 -21176 -124936 -198641
15382 -198641 -104927 -56491 17692 -123974 -152405 -20286 26015 34533 -23947 -69461 -23231
$$ packed form
15462a17926K8991K7707J6587j05513q0503M4111l960M3058M72P534l5500L5555
15450a39387q4973j03155K8009l5398J12623J02289l514N6355j08119j2710j7904
15439b05884r19J15241Q582r9489k9749K3932J15743P9967r904P625J3790j13585
15427i4650k3212P1084J09347o9571m9505J12158Q8810k9850r4524q4861l5644
15416a00418j45581N5993M7989n5291Q4680o860M3590k7582j12399p1111K02752
15405h4238Q5358j05442p0248m6657p452J9051P1916J1752j614K1462j5212N35
15393a20789R63q9416l7647J11711p6835J7948J51673R4263p3047j03760p3705
15382a98641R3714M8436P4183j41666k8431J32119M6301Q518n8480m5514M6230
$$ plain form
15371 -23231 25125 -13135 -37266 -80167 -64128 74656 86947 11815 -36011 -74822 -190696
15360 -190696 -259499 -236114 -174627 -89188 -127523 -299504 -173463 -35739 38552 25989 -105512
15349 -105512 -139191 -200956 -182824 -98369 710 -36672 -32157 6236 -109496 -131129 -44069
15338 -44069 -61001 -108335 -121147 -102507 -60086 -203821 -272262 -368496 -312408 -145023 -113845
15327 -113845 -128397 -117186 28064 7356 -97699 -67339 -139440 -125183 -133619 -176952 -195569
15316 -195569 -222006 -193174 -208086 -147810 -57316 -113038 -102447 -44829 87275 -4980 -68332
15305 -68332 -16049 91098 24487 -10859 -120892 -148968 -91086 -91398 -132488 -158469 -86008 -80369
15293 -80369 -129921 -62051 -34989 -67248 -94226 -49570 -50035 -28595 -86122 -133929 -111523 -111834
$$ packed form
15371b3231M8356l8260k4131m2901J6039J38784J2291p5132m7826l8811j15874
15360a90696o8803K3385O1487Q5439l8335j71981J26041J37724P4291j2563j31501
15349a05512l3679o1765J8132Q4455R9079l7382M515L8393j15732k1633Q7060
15338d4069j6932m7334j2812J8640M2421j43735o8441r6234N6088J67385L1178
15327a13845j4552J1211J45250k0708j05055L0360p2101J4257q436m3333j8617
15316a95569k6437K8832j4912O0276R0494n5722J0591N7618J32104r2255o3352
15305f8332N2283J07147o6611l5346j10033k8076N7882l12m1090k5981P2461N639
15293h0369m9552O7870K7062l2259k6978M4656m65K1440n7527m7807K2406l11
$$ plain form
15281 -111834 -47247 -118628 -98661 203 -90228 -237917 -181833 -101010 -6069 -53870 -24849
15270 -24849 -34295 -82910 -151743 -57152 8047 37438 68386 22957 -9857 -71437 -169819 -122651
15258 -122651 -63974 -44482 -14770 32493 -90189 -150492 -97854 -92830 -72141 -45294 -33951
15247 -33951 27278 20673 -85715 -181117 -157534 -159684 35824 115355 75681 2565 -61244 -53857
15235 -53857 -33740 4576 -2615 39570 -27200 -170029 -149301 74266 149195 -62127 -218522
15224 -218522 -58102 15494 -46609 -126159 -114221 -114261 -127459 -162906 -172672 -132199 -147114 -85025
15212 -85025 -103752 -78135 -29885 43857 129298 65923 -3835 -104648 -192553 -195189 -164997 -36455
15200 -36455 33237 51818 61340 50087 51754 -19876 -33300 87004 67574 -24910 -111788 -156787
$$ packed form
15281a11834O4587p1381J9967R8864r0431j47689N6084Q0823R4941m7801K9021
15270b4849r446m8615o8833R4591O5199K9391L0948m5429l2814o1580r8382M7168
15258a22651N8677J9492K9712M7263j22682o0303N2638N024K0689K6847J1343
15247c3951O1229o605j06388r5402K3583k150J95508P9531l9674p3116o3809P387
15235e3857K0117L8316p191M2185o6770j42829K0728K23567P4929k11322j56395
15224b18522J60420P3596o2103p9550J1938m0j3198l5447r766M0473j4915O2089
15212h5025j8727K5617M8250P3742Q5441o3375o9758j00813q7905k636L0192J28542
15200c6455O9692J8581R522j1253J667p1630j3424J20304j9430r2484q6878m4999
$$ plain form
15188 -156787 -92240 -11535 -98258 -65499 40274 40637 16265 -15490 -60650 34957 6304 -103989
15176 -103989 -116593 -234593 -234288 -105410 8787 68371 -36805 -130068 -82967 -43158 -33450
15165 -33450 -11135 26889 25273 -136555 -209663 -198739 -199399 -135254 -126270 -168589 -153030 -62824
15153 -62824 20218 -1077 137723 137949 69309 102985 130483 38124 -119987 13178 45255
15142 45255 -35610 -117981 -213729 -233610 -119220 -156741 -202280 -213865 -210748 -53543 15748
15131 15748 -64538 -235541 -163276 -42654 -29865 -88738 -172963 -184793 -150859 -97363 -71693
15120 -71693 49708 111307 65234 -22592 -118959 -137556 -151441 -112304 -86786 -30759 -42652
15109 -42652 -16518 -17684 -29653 73448 -14534 -72915 -28714 30029 18953 -122446 -106628
$$ packed form
15188a56787O4547Q0705q6723L2759J05773L63k4372l1755m5160R5607k8653j10293
15176a03989j2604j18000L05J28878J14197N9584j05176r3263M7101L9809R708
15165c3450K2315L8024j616j61828p3108J0924o60O4145Q984m2319J5559R0206
15153f2824Q3042k1295J38800K26o8640L3676K7498r2359j58111J33165L2077
15142D5255q0865q2371r5748j9881J14390l7521m5539j1585L117J57205O9291
15131A5748q0286j71003P2265J20622J2789n8873q4225j1830L3934N3496K5670
15120g1693J21401O1599m6073q7826r6367j8597j3885L9137K5518N6027j1893
15109d2652K6134j166j1969J03101q7982n8381M4201N8743j1076j41399J5818
$$ plain form
15098 -106628 -73992 -135736 -174020 -184175 -156755 -175151 -171194 -174281 -72117 69831 15316
15087 15316 59102 165937 153355 51552 102384 142966 34542 -157343 -207449 -28235 -61089
15076 -61089 -109507 -63528 -18252 9312 -20090 -83591 -67227 -77653 57113 36680 -52633
15065 -52633 -72872 -105277 -23214 152910 201100 53343 387 -20155 -57660 -155042 -121252
15054 -121252 -125803 -168533 -73403 7053 93185 96128 30152 -3834 -138449 -240433 -145071
15043 -145071 17305 50092 -30311 -9286 -57560 -32922 86294 -18910 -157873 -143065 -42616
15032 -42616 39250 3250 -28888 -36596 -89837 -170500 -187833 -208181 -287559 -196224 -122943 -92818
15020 -92818 -150875 -162293 -77171 6364 -97746 -187791 -194126 -210795 -274496 -215700 -123603 -1962
$$ packed form
15098a06628L2636o1744l8284j0155K7420j8396L957l087J02164J41948n4515
15087A5316M3786J06835j2582j01803N0832M0582j08424j91885n0106J79214l2854
15076f1089m8418M5979M5276K7564k9402o3501J6364j0426J34766k0433q9313
15065e2633k0239l2405Q2063J76124M8190j47757n2956k0542l7505r7382L3790
15054a21252m551m2730R5130Q0456Q6132K943o5976l3986j34615j01984R5362
15043a45071J62376L2787q0403K1025m8274K4638J19216j05204j38963J4808J00449
15032d2616Q1866l6000l2138p708n3241q0663j7333k0348p9378R1335P3281L0125
15020i2818n8057j1418Q5122Q3535j04110r0045o335j6669o3701N8796R2097J21641
$$ plain form
15008 -1962 16878 -106832 -110768 -54143 9110 11080 -48177 -62182 -8686 102580 181255 157471
14996 157471 104242 7050 -14465 -30462 -5809 106172 -18586 -115136 -40639 -18210 84395
14985 84395 67596 116425 73299 101072 97544 121161 125610 69543 -28730 -95548 -41640 41366
14973 41366 17257 64117 74301 23517 -24987 -74632 19240 86015 -58757 -85110 -7185
14962 -7185 6940 -62328 -109713 -103730 -65829 -12382 -47692 -88620 -126083 16922 151794 49886
14950 49886 37829 193869 117161 4640 7762 57910 -70600 -99955 -69244 -33518 -131279
14939 -131279 -161390 -164884 -164538 -39511 105231 81629 95922 185887 263799 196155 14541
14928 14541 -93448 -80914 21627 87947 97331 111867 80909 7965 2840 30455 97509 -44817
$$ packed form
15008a962J8840j23710l936N6625O3253J970n9257j4005N3496J11266P8675k3784
14996A57471n3229r7192k1515j5997K4653J11981j24758r6550P4497K2429J02605
14985H4395j6799M8829m3126K7773l528K3617M449n6067r8273o6818N3908Q3006
14973D1366k4109M6860J0184n0784m8504m9645R3872O6775j44772k6353P7925
14962g185J4125o9268m7385N983L7901N3447l5310m0928l7463J43005J34872j01908
14950D9886j2057J56040p6708j12521L122N0148j28510k9355L0711L5726r7761
14939a31279l0111l494L46J25027J44742k3602J4293Q9965P7912o7644j81614
14928A4541j07989J2534J02541O6320R384J4536l0958p2944n125K7615O7054j42326
$$ plain form
14916 -44817 -80511 -19866 113630 -24527 -61273 100120 138229 164203 137256 79098 -71311
14905 -71311 -169907 -214032 -233187 -316548 -244141 -111244 49855 139415 117690 132283 149048
14894 149048 217509 123285 88293 47254 -30210 -28346 -86000 -83445 -106858 -72768 -4684 37990
14882 37990 46046 -66311 -128982 -152997 -237467 -240277 -165473 -141165 -83673 -37771 -83056 -56571
14870 -56571 -112447 -56057 -158337 -141319 -97504 -66378 -1659 -79362 -70135 -19821 -93883 -94707
14858 -94707 -26545 49170 41958 -66280 -175153 -175143 -148323 -71858 -43485 -151750 -168825 -36132
14846 -36132 10634 -9388 574 -114354 -48820 129188 90435 89730 122648 117572 26778 57287
14834 57287 105811 78577 47339 33882 -17151 81801 116795 81424 88481 48078 34491 72996
$$ packed form
14916d4817l5694O0645J33496j38157l6746J61393L8109K5974k6947n8158j50409
14905g1311r8596m4125j9155q3361P2407J32897J61099Q9560k1725J4593J6765
14894A49048O8461r4224l4992m1039p7464J864n7654K555k3413L4090O8084M2674
14882C7990Q056j12357o2671k4015q4470k810P4804K4308N7492M5902m5285K6485
14870e6571n5876N6390j02280J7018M3815L1126O4719p7703R227N0314p4062q24
14858i4707O8162P5715p212j08238j08873J0K6820P6465K8373j08265j7075J32693
14846c6132M6766k0022R962j14928O5534J78008l8753p05L2918n076r0794L0509
14834E7287M8524k7234l1238j3457n1033R8952L4994l5371P057m0403j3587L8505
$$ plain form
14822 72996 77585 135689 221430 161337 135398 21837 42259 -7180 -59402 -46457 -20188 -62985
14810 -62985 -80656 -121629 -182233 -148458 3286 22269 -68797 -90194 -174889 -88756 -86177 -123769
14798 -123769 -111332 -91246 -93460 -50972 72447 14148 3129 -84055 -183495 -116369 -37071
14787 -37071 -673 135413 221100 217361 159468 150607 87043 -19686 47574 3607 -36058 -53467
14775 -53467 -82136 -129836 -65719 -134691 -231062 -186501 -119877 1407 12667 -71957 -104624
14764 -104624 -82240 -93474 -187813 -258319 -122823 -69099 -187003 -203616 -199565 -134901 -139591
14753 -139591 -178975 -99276 22916 -12232 -83303 -50256 3003 28568 72361 67063 -51792
14742 -51792 -8796 23547 19102 -37849 -71808 -61157 -1995 -29041 -3996 23366 75652 77323
$$ packed form
14822G2996M589N8104Q5741o0093k5939j13561K0422m9439n2222J2945K6269m2797
14810f2985j7671m0973o0604L3775J51744J8983r1066k1397q4695Q6133K579l7592
14798a23769J2437K0086k214M2488J23419n8299j1019q7184r9440O7126P9298
14787c7071L6398J36086Q5687l739n7893q861o3564j06729O7260m3967l9665j7409
14775e3467k8669m7700O4117o8972r6371M4561O6624J21284J1260q4624l2667
14764a04624K2384j1234r4339p0506J35496N3724j17904j6613M051O4664m690
14753a39591l9384P9699J22192l5148p1071L3047N3259K5565M3793n298j18855
14742e1792M2996L2343m445n6951l3959J0651N9162k7046K5045K7362N2286J671
$$ plain form
14730 77323 -3588 -59054 -77019 -121754 -120868 -126969 -172479 -97784 -19548 -20780 -52684 -97359
14718 -97359 -224726 -314982 -197773 -63241 155466 219895 135834 -14839 -22415 -118920 -184528
14707 -184528 -140702 -68232 -46940 -16460 -14537 -68930 -82003 -7020 -91264 -88721 -120722 -37604
14695 -37604 -43802 -74695 -116919 -139609 -150909 -53774 -6108 -122357 -95591 -103709 -61159 35135
14683 35135 57238 -140751 -144394 -29903 50061 3493 61589 75854 -67570 -117800 -55041
14672 -55041 114808 41822 -62842 -53626 66738 162578 173397 147945 125606 31791 53425
14661 53425 62336 51858 89509 92639 106849 88053 117942 184197 145087 22696 -72854 -130044
14649 -130044 -46561 -30596 -146437 -150032 -56528 10080 -122170 -53446 39728 80495 32874
$$ packed form
14730G7323q0911n5466j7965m4735Q86o101m5510P4695P8236j232l1904m4675
14718i7359j27367r0256J17209J34532K18707O4429q4061j50673p576r6505o5608
14707a84528M3826P2470K1292L0480J923n4393j3073P4983q4244K543l2001Q3118
14695c7604o198l0893m2224k2690j1300R7135M7666j16249K6766q118M2550R6294
14683C5135K2103j97989l643J14491P9964m6568N8096J4265j43424n0230O2759
14672e5041J69849p2986j04664R216J20364R5840J0819k5452k2339r3815K1634
14661E3425Q911j0478L7651L130J4210j8796K9889O6255l9110j22391r5550n7190
14649a30044Q3483J5965j15841l595R3504O6608j32250O8724R3174M0767m7621
$$ plain form
14638 32874 42214 95851 54528 35527 127488 94858 160977 118948 105987 148396 39862 -79228
14626 -79228 -101190 -164701 -192004 -67099 15884 -50791 -81974 -59598 4661 50950 19869
14615 19869 18146 -142317 -46398 4735 -13437 -60377 -143988 -67959 -48440 -140206 -203077 -180216
14603 -180216 -161613 -117932 18163 96951 23915 -45484 -59989 -91748 -19515 67294 117206
14592 117206 101624 71192 -4268 -22438 -105304 -113459 -100658 -16099 -84372 -75434 -39978 -110182
14580 -110182 -115858 -5553 -72747 -127309 -33788 8716 -27327 -78043 -102022 -100715 -59290 -104132
14568 -104132 -1570 -1736 -140423 -198854 -122374 -115660 18721 28565 67322 1152 10636 50394
14556 50394 -17045 131443 206565 82075 18313 70700 94062 50451 24736 -30788 -4112
$$ packed form
14638C2874R340N3637m1323j9001R1961l2630O6119m2029j2961M2409j08534j19090
14626g9228k1962o3511k7303J24905Q2983o6675l1183K2376O4259M6289l1081
14615A9869j723j60463R5919N1133j8172m6940q3611P6029J9519r1766o2871K2861
14603a80216J8603M3681J36095P8788p3036o9399j4505l1759P2233Q6809M9912
14592A17206j5582l0432p5460j8170q2866q155J2801Q4559o8273Q938L5456p0204
14580a10182n676J10305o7194n4562R3521M2504l6043n0716k3979J307M1425m4842
14568a04132J02562j66j38687n8431P6480O714J34381R844L8757o6170R484L9758
14556E0394o7439J48488P5122j24490o3762N2387K3362m3611k5715n5524K6676
$$ plain form
14545 -4112 65955 54543 -2799 -14453 -36945 -63674 -132708 -245999 -133575 -100021 -79869
14534 -79869 -56812 -27612 14569 -56487 -121228 -141242 -221150 -171015 -78926 -123766 -234418
14523 -234418 -364615 -282954 -231214 -161407 -114041 -144496 -135218 -61405 65492 77774 -102121
14512 -102121 -176259 -149420 -113596 -126886 -167636 -168544 -165448 -221902 -173201 -110083 -122060 -59906
14500 -59906 -18088 -46191 -85854 -56330 -42780 64602 231891 236644 156392 98794 -92706
14489 -92706 -145894 -44455 -80449 -78336 -70394 -6751 88490 210583 42741 -89146 -208984
14478 -208984 -192142 -115536 -79020 -51320 -142472 -197212 -205767 -91142 -9059 -26069 -47983
14467 -47983 -65497 -12734 -12434 123442 129917 41442 -134698 -160401 -87249 -41194 12080 69774
$$ packed form
14545d112P0067j1412n7342j1654k2492k6729o9034j13291J12424L3554K0152
14534g9869K3057K9200M2181p1056o4741k0014p9908N0135R2089m4840j10652
14523b34418j30197Q1661N1740O9807M7366l0455R278P3813J26897J2282j79895
14512a02121p4138K6839L5824j3290m0750r08L096n6454M8701O3118j1977O2154
14500e9906M1818k8103l9663K9524J3550J07382J67289M753q0252n7598j91500
14489i2706n3188J01439l5994K113P942O3643R5241J22093j67842j31887j19838
14478b08984J6842P6606L6516K7700r1152n4740q555J14625Q2083j7010k1914
14467d7983j7514N2763L00J35876O475q8475j76140k5703P3152M6055N3274N7694
$$ plain form
14455 69774 5545 26850 57817 -68605 -206857 -274527 -283772 -184890 -25508 54877 52515
14444 52515 12691 -57417 -149083 -134495 -56747 -88638 -189341 -184910 -41935 50365 -45166
14433 -45166 -60858 5126 106107 67952 23931 135272 228543 83748 -21064 40330 56927
14422 56927 112273 152411 53966 -30293 -134846 -141203 20654 124466 205263 215414 75280
14411 75280 -44499 -82605 3687 12435 -45735 -191690 -322937 -250940 -94124 22163 118363
14400 118363 86402 34820 54966 72227 59025 16343 -48150 -50735 33266 60655 38125 -16452
14388 -16452 -19938 1045 22494 58743 94034 165673 110523 44822 34927 33831 19284 -40631
14376 -40631 -34838 -13355 -62820 -115766 -62117 39882 59380 37813 -2970 -21579 -106943 -67228
$$ packed form
14455F9774o4229K1305L0967j26422j38252o7670r245R8882J59382Q0385k362
14444E2515l9824p0108r1666J4588P7748l1891j00703M431J42975R2300r5531
14433d5166j5692O5984J00981l8155m4021J11341R3271j44795j04812O1394J6597
14422E6927N5346M0138r8445q4259j04553o357J61857J03812Q0797J0151j40134
14411G5280j19779l8106Q6292Q748n8170j45955j31247P1997J56816J16287R6200
14400A18363l1961n1582K0146J7261j3202m2682o4493k585Q4001K7389k2530n4577
14388a6452l486K0983K1449L6249L5291P1639n5150o5701r895j096j4547n9915
14376d0631N793K1483m9465n2946N3649J01999J9498k1567m0783j8609q5364L9715
$$ plain form
14364 -67228 -1267 14680 124939 96005 167343 221642 182844 158191 168851 124076 95782
14353 95782 72076 -3540 6608 -23333 -44493 49340 81276 27569 15147 -3312 -97312 -141763
14341 -141763 -70589 6383 -46505 -95415 -55511 -96184 -67844 2289 47767 64915 -37533
14330 -37533 -151387 18984 101521 53735 114148 80161 73434 23021 94627 199682 177788
14319 177788 145895 109803 77204 190951 281484 290670 232118 125384 55128 48893 88254
14308 88254 66455 69326 24061 23750 -47185 -87332 -80370 -748 -169 23105 -9388 -51578 -107758
14295 -107758 4771 113798 187151 204162 292049 333032 301450 266787 267424 90628 -68293
14284 -68293 -54775 -73938 -75532 -165737 -211521 -184315 -85830 -42246 -3173 45784 -4246 61679
$$ packed form
14364f7228O5961J5947J10259k8934P1338N4299l8798k4653J0660m4775k8294
14353I5782k3706p5616J0148k9941k1160R3833L1936n3707j2422j8459r4000m4451
14341a41763P1174P6972n2888m8910L9904m0673K8340P0133M5478J7148j02448
14330c7533j13854J70371Q2537m7786O0413l3987o727n0413P1606J05055k1894
14319A77788l1893l6092l2599J13747R0533R186n8552j06734p0256o235L9361
14308H8254k1799K871m5265l11p0935m0147O962P9622N79K3274l2493m2190n6180
14295a07758J12529J09027P3353J7011Q7887M0983l1582l4663O37j76796j58921
14284f8293J3518j9163j594r0205m5784K7206R8485M3584L9073M8957n0030O5925
$$ plain form
14272 61679 160758 235995 166092 -53646 -98453 -58937 -12408 -18145 -48877 -53277 70734 93580
14260 93580 51759 65614 57879 30525 -72472 -35112 -78326 -109673 80127 36935 -69300
14249 -69300 -178415 -219774 19821 195076 141558 64751 16459 21704 50463 -1545 -13712
14238 -13712 -71054 -171668 -155777 -46877 -143799 -106839 24465 -841 -18105 -7457 -37613
14227 -37613 -90986 -55877 -64891 -48776 -7465 80479 6577 15589 -11871 30220 82864 18638
14215 18638 19445 18525 89776 62048 -45782 -183348 -196315 -77939 -56381 -93295 -211242 -242237
14203 -242237 -215264 -220637 -187106 -172355 -115055 29298 48345 -13027 -148633 -170294 -121164
14192 -121164 22677 74545 76455 128549 141513 190088 168713 125380 26969 29977 46530 93224
$$ packed form
14272F1679R9079P5237o9903k19738m4807L9516M6529n737l0732m400J24011K2846
14260I3580m1821J3855p735k7354j02997L7360m3214l1347J89800m3192j06235
14249f9300j09115m1359K39595J75255n3518p6807m8292N245K8759n2008j2167
14238a3712n7342j00614J5891J08900r6922L6960J31304k5306j7264J0648l0156
14227c7613n3373L5109r014J6115M1311Q7944p3902R012k7460M2091N2644o4226
14215A8638Q07r20P1251k7728j07830j37566j2967J18376K1558l6914j17947l0995
14203b42237K6973n373L3531J4751N7300J44353J9047o1372j35606k1661M9130
14192a21164J43841N1868J910N2094J2964M8575k1375m3333r8411L008J6553M6694
$$ plain form
14180 93224 55028 91071 149642 86361 -70012 -183850 -37201 16266 11873 -43121 -168029
14169 -168029 -99715 20391 52154 62670 29255 -42788 -51684 -113402 -193263 -118672 27544
14158 27544 87591 36797 44684 72338 12395 -36771 -11081 -13402 27653 128456 168139 175912
14146 175912 54745 -11547 32888 145037 177830 122026 48179 54239 37125 66008 77997
14135 77997 65572 47210 107021 72808 -29389 23572 65152 124812 69346 289 58380
14124 58380 84791 55807 83742 -12560 -88655 -72301 4326 140283 249535 239586 254688
14113 254688 243754 198100 195246 95702 78037 37105 9680 -43087 -49592 -17356 -101471 -260973
14101 -260973 -271584 -191130 27549 26184 1033 -27623 -88881 -30369 -86448 -95262 -120161 -38599
$$ packed form
14180I3224l8196L6043N8571o3281j56373j13838J46649N3467m393n4994j24908
14169a68029O8314J20106L1763J0516l3415p2043q896o1718p9861P4591J46216
14158B7544O0047n0794P887K7654n9943m9166K5690k321M1055J00803L9683P773
14146A75912j21167o6292M4435J12149L2793n5804p3847O060j7114K8883J1989
14135G7997j2425j8362N9811l4213j02197N2961M1580N9660n5466o9057N8091
14124E8380K6411k8984K7935r6302p6095J6354P6627J35957J09252r949J5102
14113B54688j0934m5654k854r9544j7665m0932k7425n2767o505L2236q4115j59502
14101b60973j0611Q0454K18679j365k5151k8656o1258N8512n6079q814k4899Q1562
$$ plain form
14089 -38599 116112 158228 130830 122204 77977 -98969 -128508 -107877 -61156 -20946 -39991
14078 -39991 -494 115753 107546 -31289 -121754 -32243 49054 111777 32773 -56004 -33995
14067 -33995 998 46776 41837 71686 -29703 -96388 -104272 -133246 -110819 -115684 -147786 -89488
14055 -89488 -103711 -54341 -75534 -17677 46809 4895 -3449 49476 112719 106678 120053 103800
14043 103800 -87597 -212645 -112799 -36801 30506 14836 20944 -938 -20015 -25498 -81888
14032 -81888 -45778 71714 76824 35504 77612 47203 132863 162250 171551 167054 78010 78920
14020 78920 156678 221468 225878 141614 91870 1181 -82166 -141215 -150974 -99157 15317 94747
14008 94747 20755 -3611 15313 12542 43829 76928 116050 159637 165553 85420 -6218 97829
$$ packed form
14089c8599J54711M2116k7398q626m4227j76946k9539K0631M6721M0210j9045
14078c9991L9497J16247q207j38835r0465Q9511Q1297O2723p9004q8777K2009
14067c3995L4993M5778m939K9849j01389o6685p884k8974K2427m865l2102N8298
14055h9488j4223M9370k1193N7857O4486m1914q344N2925O3243o041J3375j6253
14043A03800j91397j25048R9846P5998O7307j5670O108k1882j9077n483n6390
14032h1888L6110J17492N110m1320M2108l0409Q5660K9387R301m497q9044R10
14020G8920P7758O4790M410q4264m9744r0689q3347n9049r759N1817J14474P9430
14008I4747p3992k4366J8924k771L1287L3099L9122M3587N916q0133r1638J04047
$$ plain form
13996 97829 203331 180722 188006 210502 56346 5284 67335 109088 100871 86472 -4941 -105069
13984 -105069 -173333 -208656 -129193 -162640 -71917 61118 -17767 22982 -29097 -16552 57733
13973 57733 37693 92444 97384 89951 103800 22709 -25440 -132347 -43246 16619 -12001 -55306
13961 -55306 -6515 25921 137104 203623 158416 65635 79717 -33303 -20579 9938 162131
13950 162131 105580 45511 106071 143486 137235 105353 -12250 16169 41556 105365 130129
13939 130129 107172 -10605 23551 25884 42803 94844 35527 -6663 61373 32366 82677
13928 82677 92973 153687 256931 272212 148704 66651 57183 77490 99259 72282 126419
13917 126419 199446 155366 136385 236226 324659 258131 152015 133033 63351 5543 -173190
$$ packed form
13996I7829J05502k2609P284K2496j54156n1062O2051M1753q217j4399r1413j00128
13984a05069o8264l5323P9463l3447R0723J33035p8885M0749n2079J2545P4285
13973E7733k0040N4751M940p433J3849q1091m8149j06907Q9101N9865k8620m3305
13961e5306M8791L2436J11183O6519m5207r2781J4082j13020J2724L0517J52193
13950A62131n6551o0069O0560L7415o251l1882j17603K8419K5387O3809K4764
13939A30129k2957j17777L4156K333J6919N2041n9317m2190O8036k9007N0311
13928H2677J0296O0714J03244J5281j23508q2053r468K0307K1769k6977N4137
13917A26419P3027m4080j8981R9841Q8433o6528j06116j8982o9682n7808j78733
$$ plain form
13906 -173190 -271404 -208704 -23777 53819 49092 -41723 27585 93858 127986 195774 204001 210332
13894 210332 257416 235981 159649 129568 90455 56263 78028 110211 196628 142944 56063
13883 56063 122632 156534 22721 -4465 70451 304630 255130 170658 136851 85328 63370
13872 63370 11241 -56048 -49216 -79021 -90760 -4291 94354 135363 141592 278546 218798 88765
13860 88765 -51686 44990 101473 68916 24274 -20647 72031 115341 130274 181400 145823
13849 145823 103810 -12145 -5002 54427 33271 44655 82785 122149 118475 67353 70960 -56892
13837 -56892 15604 146401 71343 128525 137395 105326 789 -23445 59620 77702 -21405
13826 -21405 -47699 -65991 -23426 14507 36513 103411 82996 108250 28083 8478 -11664 -124635
$$ packed form
13906a73190r8214O2700J84927P7596m727r0815O9308O6273L4128O7788Q227O331
13894B10332M7084k1435p6332l0081l9113l4192K1765L2183Q6417n3684q6881
13883E6063O6569L3902j33813k7186P4916K34179m9500q4472l3807n1523k1958
13872F3370n2129o7289O832k9805j1739Q6469R8645M1009O229J36954n9748j30033
13860H8765j40451R6676N6483l2557m4642m4921R2678M3310J4933N1126l5577
13849A45823m2013j15955P143N9429k1156J1384L8130L9364l674n1122L607j27852
13837e6892P2496J30797p5058N7182Q870l2069j04537k4234Q3065J8082r9107
13826b1405k6294j8292M2565L7933K2006O6898k0415K5254q0167j9605k0142j12971
$$ plain form
13814 -124635 -123375 11255 38397 -36565 -5571 122530 101614 130565 164434 106433 10055
13803 10055 59029 -1339 26734 37165 72640 54408 121048 97531 182242 262119 342107 345837
13791 345837 298740 143784 -54019 -35316 22515 27740 -15049 27958 118481 193587 200744
13780 200744 208292 267697 304110 108348 12604 -46996 -25934 52924 170999 210357 225004
13769 225004 267011 270461 254044 190564 105914 93557 155374 156544 79160 27422 -65350 9263
13757 9263 118144 64943 48964 61359 117898 126192 83522 154838 187736 228075 208427 225656
13745 225656 245719 106155 18611 73605 184598 264773 339990 274146 200125 166599 74856
13734 74856 -45914 -14541 106692 85948 103572 182441 204076 222725 289664 211808 166594
$$ packed form
13814a24635J260J34630K7142p4962L0994J28101k0916K8951L3869n8001r6378
13803A0055M8974o0368K8073J0431L5475j8232O6640k3517Q4711P9877P9988L730
13791C45837m7097j54956j97803J8703N7831N225m2789M3007R0523P5106P157
13780B00744P548N9405L6413j95762r5744n9600K1062P8858J18075L9358J4647
13769B25004M2007L450j6417o3480q4650j2357O1817J170p7384n1738r2772P4613
13757I263J08881n3201j5979J2395N6539Q294m2670P1316L2898M0339j9648J7229
13745B25656K0063j39564q7544N4994J10993Q0175P5217o5844p4021l3526r1743
13734G4856j20770L1373J21233k0744J7624P8869K1635J8649O6939p7856m5214
$$ plain form
13723 166594 138769 18290 -45084 99840 199861 102317 30560 11542 41559 19307 -18559
13712 -18559 41900 28853 -42168 -120259 -77214 10868 135373 112834 -31402 69693 85130
13701 85130 -112253 -114720 758 80785 142740 213634 236622 295512 166288 131187 241062
13690 241062 315599 317101 252547 261875 254246 335018 308745 241842 172352 103120 37083 -3287
13678 -3287 54770 91152 91393 -9678 -69507 54918 241286 233907 237583 368544 236641 75591
13666 75591 125634 184820 114795 150988 126942 114412 48099 4431 -84028 -17946 83948
13655 83948 141768 180230 88095 110356 114806 70070 45912 -22103 54141 114915 118978 228318
13643 228318 154552 87983 243590 237775 74715 117950 239364 127975 28578 137153 125284
$$ packed form
13723A66594k7825j20479o3374J44924J00021r7544p1757j9018L0017k2252l7866
13712a8559O0459j3047p1021p8091M3045Q8082J24505k2539j44236J01095J5437
13701H5130j97383k467J15478Q0027O1955P0894K2988N8890j29224l5101J09875
13690B41062P4537J502o4554R328p629Q0772k6273o6903o9490o9232o6037m0370
13678c287N8057L6382K41j01071n9829J24425J86368p379L676J30961j31903j61050
13666G5591N0043N9186p0025L6193k4046j2530o6313m3668q8459O6082J01894
13655H3948N7820L8462r2135K2261M450m4736k4158o8015P6244O0774M063J09340
13643B28318p3766o6569J55607n815j63060M3235J21414j11389r9397J08575j1869
$$ plain form
13632 125284 72204 33899 116543 230101 288976 310452 149451 1274 113516 186402 294657
13621 294657 328564 353513 455565 408680 323255 384048 449085 361660 317859 346247 320620
13610 320620 358505 320314 284723 282128 220704 108214 -107758 -146608 15168 70 -60919
13599 -60919 88398 119435 44967 76213 112705 197527 121956 109957 60462 25787 126002
13588 126002 211686 169803 154656 181564 227366 182378 211078 264747 268735 273728 235296 306878
13576 306878 344472 251441 195448 125579 170501 233571 333517 332255 289412 232386 214957 227264
13564 227264 238898 272849 223685 153302 68472 79974 210225 289686 243809 244905 181825
13553 181825 248002 225286 149648 112906 102374 115425 157813 323700 341128 216194 130967
$$ packed form
13632A25284n3080l8305Q2644J13558N8875K1476j61001j48177J12242P2886J08255
13621B94657L3907K4949J02052m6885q5425O0793O5037q7425m3801K8388k5627
13610C20620L7885l8191l5591k595o1424j12490k15972l8850J61776j5098o0989
13599f0919J49317L1037p4468L1246L6492Q4822p5571j1999m9495l4675J00215
13588A26002Q5684m1883j5147K6908M5802m4988K8700N3669L988M993l8432P1582
13576C06878L7594r3031n5993o9869M4922O3070R9946j262m2843n7026j7429J2307
13564B27264J1634L3951m9164p0383q4830J1502J30251P9461m5877J096o3080
13553A81825O6177k2716p5638l6742j0532J3051M2388J65887J7428j24934q5227
$$ plain form
13542 130967 187457 177007 229379 258326 357443 352055 313006 231088 229109 179759 18845 87898
13530 87898 258531 238831 124546 120529 164720 174179 191186 206048 191630 128271 146286 258870
13518 258870 300766 346200 468841 392837 297571 269513 265475 271534 204748 213649 247958 245887
13506 245887 83386 -3529 39719 67283 87314 103654 125685 110250 99960 209635 181939
13495 181939 95306 113980 217690 163589 160432 347459 345937 391352 371751 163050 44793
13484 44793 -52808 -75319 -21395 -19792 75868 223253 309995 400272 379992 387827 275062 83479
13472 83479 175624 203739 276619 397839 385671 289264 235439 228168 137248 222894 198572 145323
13460 145323 66193 147326 197134 92695 111831 238659 255959 257681 218501 229831 251424
$$ packed form
13542A30967N6490j0450N2372K8947R9117n388l9049q1918j979m9350j60914O9053
13530H7898J70633j9700j14285m017M4191R459J7007J4862j4418o3359J8015J12584
13518B58870M1896M5434J22641p6004r5266k8058m038O059o6786Q901L4309k071
13506B45887j62501q6915M3248K7564K0031J6340K2031j5435j0290J09675k7696
13495A81939q6633J8674J03710n4101l157J87027j522M5415j9601k08701j18257
13484D4793r7601k2511N3924J603R5660J47385Q6742R0277k0280P835j12765j91583
13472H3479R2145K8115P2880J21220j2168r6407n3825p271r0920Q5646k4322n3249
13460A45323p9130Q1133M9808j04439J9136J26828J7300J722l9180J1330K1593
$$ plain form
13449 251424 309022 351244 351579 427551 481829 256399 100616 76680 72520 144198 162441 213907
13437 213907 140040 194419 267158 332678 290010 217365 249675 228212 242363 251082 226946 336729
13425 336729 405625 371720 356004 278771 130283 147551 196185 240664 296340 231931 270816
13414 270816 188684 103300 87115 110307 181801 265758 235034 172312 194941 221990 271476
13403 271476 320656 322611 353199 251235 177060 262778 207987 217220 197830 228045 328748
13392 328748 294640 219288 185228 88250 149105 289654 361808 331694 312766 241183 264839
13381 264839 337978 248308 158841 174735 165048 347447 332063 278464 313217 278145 178669
13370 178669 107663 129390 122004 266802 303162 279457 424284 536050 397118 374869 502263
$$ packed form
13449B51424N7598M2222L35P5972N4278k25430j55783k3936m160P1678J8243N1466
13437B13907p3867N4379P2739O5520m2668p2645L2310k1463J4151Q719k4136J09783
13425C36729O8896l3905j5716p7233j48488J7268M8634M4479N5676o4409L8885
13414B70816q2132q5384j6185K3192P1494Q3957l0724o2722K2629K7049M9486
13403B71476M9180J955L0588j01964p4175Q5718n4791R233j9390L0215J00703
13392C28748l4108p5352l4060r6978O0855J40549P2154l0114j8928p1583K3656
13381B64839P3139q9670q9467J5894r687J82399j5384n3599L4753l5072r9476
13370A78669p1006K1727p386J44798L6360k3705J44827J11766j38932k2249J27394
$$ plain form
13359 502263 480638 467100 395906 381539 357818 306467 287023 241084 221533 172090 148591
13348 148591 131709 204062 302454 249037 113065 213885 253744 218893 222754 280750 276530
13337 276530 296908 274340 242712 146067 192538 305685 317436 324026 322497 375482 342723 257004
13325 257004 134344 203999 308505 419774 348314 318237 239576 192208 203384 220262 257554
13314 257554 253083 315613 380796 506097 506427 381894 344058 324315 239535 197425 131534 104802
13302 104802 194546 398410 400573 330704 237692 322958 478617 496409 415730 341187 289695
13291 289695 369707 415714 383891 397102 467740 390299 340315 318102 305342 291645 330811
13280 330811 477401 467869 463723 391625 332576 333932 382550 401910 385442 335048 264361 368786
$$ packed form
13359E02263k1625j3538p1194j4367k3721n1351j9444m5939j9551m9443k3499
13348A48591j6882P2353R8392n3417j35972J00820L9859l4851L861N7996m220
13337B76530K0378k2568l1628r6645M6471J13147J1751O590j529N2985l2759q5719
13325B57004j22660O9655J04506J11269p1460l0077p8661m7368J1176J6878L7292
13314B57554m471O2530O5183J25301L30j24533l7836j9743q4780m2110o5891k6732
13302A04802Q9744K03864K163o9869r3012Q5266J55659J7792q0679p4543n1492
13291B89695Q0012M6007l1823J3211P0638p7441m9984k2213j2760j3697L9166
13280C30811J46590r532m146p2098n9049J356M8618J9360j6468n0394p0687J04425
$$ plain form
13268 368786 447545 463573 434280 412206 385127 273479 222332 220557 229538 359903 431159
13257 431159 414190 351010 215999 263207 378680 419395 383304 322919 192041 152943 232078
13246 232078 398883 412591 252351 215013 238495 305807 321136 328724 245090 338947 402010
13235 402010 303287 357338 340076 287221 187343 224051 231025 163613 113378 200572 332690
13224 332690 387013 310459 318037 324077 273740 322914 186167 161756 235021 320408 362551 519210
13212 519210 456526 383341 401661 373494 297084 326949 356963 233667 132025 186153 273407
13201 273407 448687 475240 323577 184154 205813 395013 433541 486474 517147 513171 429831
13190 429831 419754 305394 240895 228650 170836 143871 222633 277320 255180 164286 143671
$$ packed form
13268C68786P8759J6028k9293k2074k7079j11648n1147j775Q981J30365P1256
13257D31159j6969o3180j35011M7208J15473M0715l6091o0385j30878l9098P9135
13246B32078J66805J3708j60240l7338K3482O7312J5329P588q3634R3857O3063
13235D02010r8723N4051j7262n2855r9878L6708O974o7412n0235Q7194J32118
13224C32690N4323p6554P578O040n0337M9174j36747k4411P3265Q5387M2143J56659
13212E19210o2684p3185J8320k8167p6410K9865L0014j23296j01642N4128Q7254
13201B73407J75280K6553j51663j39423K1659J89200L8528N2933L0673l976q3340
13190D29831j0077j14360o4499j2245n7814k6965P8762N4687k2140r0894k0615
$$ plain form
13179 143671 121841 199578 235344 328066 395908 366593 307287 288860 256270 232452 200372
13168 200372 335308 347217 382884 281198 313833 297751 287759 410875 539629 559213 468704
13157 468704 314121 339282 378635 415862 418540 455242 481383 434081 426970 332907 349562 417557
13145 417557 512292 524622 505246 548887 644072 683152 627271 518234 552175 560683 587775
13134 587775 604221 537555 529488 464570 488732 433851 403690 391925 275888 293959 336196
13123 336196 351238 320827 342508 345227 227660 198424 292000 394867 422304 512855 518141
13112 518141 548981 624466 617226 505016 437754 531058 504230 410132 377273 407722 413672 457978
13100 457978 436854 261358 339321 441557 335965 356642 467912 472536 430269 500360 492879
$$ packed form
13179A43671k1830P7737L5766R2722O7842k9315n9306j8427l2590k3818l2080
13168B00372J34936J1909L5667j01686L2635j6082r992J23116J28754J9584r0509
13157D68704j54583K5161L9353L7227K678L6702K6141m7302p111r4063J6655O7995
13145D17557R4735J2330j9376M3641R5185L9080n5881j09037L3941Q508K7092
13134E87775J6446o6666q067o4918K4162n4881l0161j1765j16037J8071M2237
13123C36196J5042l0411K1681K719j17567k9236R3576J02867K7437R0551N286
13112E18141L0840P5485p240j12210o7262R3304k6828r4098l2859L0449N950M4306
13100D57978k1124j75496P7963J02236j05592K0677J11270M624m2267P0091p481
$$ plain form
13089 492879 420596 397416 423276 455734 357483 357987 401817 402200 329706 213252 175311 249537
13077 249537 301572 374053 546853 587466 673173 640029 699845 782577 824835 851669 750549
13066 750549 624316 542056 596474 591739 672619 602890 486876 525784 506589 460690 386688
13055 386688 323919 386223 468462 547406 587984 569134 441917 297601 282331 319409 252707
$$ packed form
13089D92879p2283k3180K5860L2458r8251N04M3830L83p2494j16454l7941P4226
13077B49537N2035P2481J72800M0613Q5707l3144N9816Q2732M2258K6834j01120
13066G50549j26233q2260N4418m735Q0880o9729j16014L8908j9195m5899p4002
13055C86688o2769O2304Q2239P8944M0578j8850j27217j44316j5270L7078o6702
$$ [...]
##END NTUPLES=NMR SPECTRUM
##END=
