##TITLE=Analysis number 312223
Compound Code cc 42709
Book Reference 439/40/7
Project Code adrs
Chemist Name ronp
##JCAMPDX= 6.0         $$ Bruker NMR JCAMP-DX V2.0
##DATA TYPE= NMR SPECTRUM
##DATA CLASS= NTUPLES
##ORIGIN= Bruker BioSpin GmbH
##OWNER= NMR
$$ XWIN-NMR		Version 3.5
$$ Thu Jul 28 16:03:28 2005 GMT Daylight Time (UT+1h)  MAYBRIDGE\NMR@NMR_250MHZ
##.OBSERVE FREQUENCY= 250.131544655141
##.OBSERVE NUCLEUS= ^1H
##.ACQUISITION MODE= SIMULTANEOUS (DQD)
##.ACQUISITION SCHEME= undefined
##.AVERAGES= 16
##.DIGITISER RES= 18
##SPECTROMETER/DATA SYSTEM= dpx250
##.PULSE SEQUENCE= zg30
##.SOLVENT NAME= CDCl3
##.SHIFT REFERENCE= (INTERNAL, CDCl3, 0, 16.4585)
##AUDIT TRAIL= $$ (NUMBER, WHEN, WHO, WHERE, WHAT)
$$ ##TITLE= Audit trail, XWIN-NMR		Version 3.5
$$ ##JCAMPDX= 5.01
$$ ##ORIGIN= Bruker BioSpin GmbH
$$ ##OWNER= NMR
$$ C:\u/data/dgb/nmr/ADRS/6810/pdata/1/auditp.txt
$$ ##AUDIT TRAIL=  $$ (NUMBER, WHEN, WHO, WHERE, WHAT)
(   1,<2005-07-28 16:03:09.75 +100>,<MAYBRIDGE\NMR>,<NMR_250MHZ>,
      <created by zg, POWCHK disabled, PULCHK disabled
       configuration hash MD5:
       62 19 C7 07 E1 42 D1 B7 37 6C 3D D0 77 39 F9 E6
       data hash MD5: 64K
       F4 4C 39 0D 65 F8 AD A6 EB FF 7E 81 F0 68 CD 01>)
(   2,<2005-07-28 16:03:20.43 +100>,<MAYBRIDGE\NMR>,<NMR_250MHZ>,
      <Start of raw data processing
       ef LB = 0.3 FT_mod = 6 PKNL = 1 SI = 32K 
       data hash MD5: 32K
       1B A7 B1 07 75 D0 07 63 FB 36 EB 62 17 61 9B 5E>)
(   3,<2005-07-28 16:03:22.25 +100>,<MAYBRIDGE\NMR>,<NMR_250MHZ>,
      <apk 
       data hash MD5: 32K
       07 21 5A A1 92 69 CD 15 F2 29 5D E1 A2 26 9B 5D>)
(   4,<2005-07-28 16:03:22.93 +100>,<MAYBRIDGE\NMR>,<NMR_250MHZ>,
      <abs ABSG = 5 
       data hash MD5: 32K
       CC E7 A9 19 48 F1 1D E8 12 7A FC E5 27 13 59 D6>)
$$ ##END=
$$ 
$$ hash MD5
$$ 39 B2 D3 32 68 92 09 7C 9E 80 F9 1E 19 49 3F F3
##$RELAX= 
##$RELAX= 
##$RELAX= 
##$RELAX= 
##$RELAX= 
##$RELAX= 
##$RELAX= 
$$ Bruker specific parameters
$$ --------------------------
##$DU= <C:\u>
##$EXPNO= 6810
##$NAME= <ADRS>
##$PROCNO= 1
##$TYPE= <nmr>
##$USER= <dgb>
##$AMP= (0..31)
100 100 100 100 100 100 100 100 100 100 100 100 100 100 100 100 100 100 
100 100 100 100 100 100 100 100 100 100 100 100 100 100 
##$AQSEQ= 0
##$AQ_mod= 3
##$AUNM= <au_zg>
##$AUTOPOS= <17 >
##$BF1= 250.13
##$BF2= 250.13
##$BF3= 250.13
##$BF4= 250.13
##$BF5= 500.13
##$BF6= 500.13
##$BF7= 500.13
##$BF8= 500.13
##$BYTORDA= 1
##$CFDGTYP= 0
##$CFRGTYP= 5
##$CHEMSTR= <none>
##$CNST= (0..31)
1 1 145 1 1 1 1 1 1 1 1 1 1 1 1 1 1 1 1 1 1 1 1 1 1 1 1 1 1 1 1 1 
##$CPDPRG= <>
##$CPDPRG1= <>
##$CPDPRG2= <>
##$CPDPRG3= <>
##$CPDPRG4= <mlev>
##$CPDPRG5= <mlev>
##$CPDPRG6= <mlev>
##$CPDPRG7= <mlev>
##$CPDPRG8= <mlev>
##$CPDPRGB= <>
##$CPDPRGT= <>
##$D= (0..31)
0 1 0 0 0 0 0 0 0 0.06 0 0 0 0 0 0 0.0002 0 0 0 0 0 0 0 0 0 0 0 0 0 0 
0 
##$DATE= 1122562988
##$DBL= (0..7)
120 120 120 120 120 120 120 120 
##$DBP= (0..7)
150 150 150 150 150 150 150 150 
##$DBP07= 0
##$DBPNAM0= <>
##$DBPNAM1= <>
$$ [...]
##$SUBNAM7= <"">
##$SUBNAM8= <"">
##$SUBNAM9= <"">
##$SW= 20.6930455092707
##$SWIBOX= (0..15)
0 0 3 0 0 0 0 0 0 0 0 0 0 0 0 0 
##$SW_h= 5175.983436853
##$TD= 65536
##$TD0= 1
##$TE= 295.16
##$TE2= 300
##$TE3= 300
##$TEG= 300
##$TL= (0..7)
0 120 120 120 120 120 120 120 
##$TP= (0..7)
150 150 150 150 150 150 150 150 
##$TP07= 0
##$TPNAME0= <>
##$TPNAME1= <>
##$TPNAME2= <>
##$TPNAME3= <>
##$TPNAME4= <>
##$TPNAME5= <>
##$TPNAME6= <>
##$TPNAME7= <>
##$TPOAL= (0..7)
0.5 0.5 0.5 0.5 0.5 0.5 0.5 0.5 
##$TPOFFS= (0..7)
0 0 0 0 0 0 0 0 
##$TUNHIN= 0
##$TUNHOUT= 0
##$TUNXOUT= 0
##$USERA1= <user>
##$USERA2= <user>
##$USERA3= <user>
##$USERA4= <user>
##$USERA5= <user>
##$V9= 5
##$VALIST= <valist>
##$VCLIST= <CCCCCCCCCCCCCCC>
##$VD= 0
##$VDLIST= <DDDDDDDDDDDDDDD>
##$VPLIST= <PPPPPPPPPPPPPPP>
##$VTLIST= <TTTTTTTTTTTTTTT>
##$WBST= 1024
##$WBSW= 4
##$XGAIN= (0..3)
0 0 0 0 
##$XL= 0
##$YL= 0
##$YMAX_a= 379116
##$YMIN_a= -465195
##$ZGOPTNS= <>
##$ZL1= 120
##$ZL2= 120
##$ZL3= 120
##$ZL4= 120
##$ABSF1= 16.45848
##$ABSF2= -4.234692
##$ABSG= 5
##$ABSL= 3
##$ALPHA= 0
##$AQORDER= 0
##$ASSFAC= 0
##$ASSFACI= 0
##$ASSFACX= 0
##$ASSWID= 0
##$AUNMP= <proc_1d>
##$AZFE= 0.1
##$AZFW= 0.1
##$BCFW= 0
##$BC_mod= 0
##$BYTORDP= 0
##$COROFFS= 0
##$CY= 12.5
##$DATMOD= 1
##$DC= 0
##$DFILT= <>
##$DTYPP= 0
##$F1P= 14.0000005364418
##$F2P= -0.99999901652339
##$FCOR= 0.5
##$FTSIZE= 32768
##$FT_mod= 6
##$GAMMA= 0
##$GB= 0
##$INTBC= 1
##$INTSCL= 1
##$ISEN= 128
##$LB= 0.3
##$LEV0= 0
##$LPBIN= 0
##$MAXI= 10000
##$MC2= 0
##$MEAN= 0
##$ME_mod= 0
##$MI= 0
##$NCOEF= 0
##$NC_proc= -4
##$NLEV= 6
##$NOISF1= 0
##$NOISF2= 0
##$NSP= 0
##$NTH_PI= 0
##$NZP= 0
##$OFFSET= 16.45848
##$PC= 1
##$PHC0= -84.47778
##$PHC1= 13.39101
##$PH_mod= 1
##$PKNL= yes
##$PPARMOD= 0
##$PSCAL= 4
##$PSIGN= 0
##$REVERSE= no
##$SF= 250.130015888134
##$SI= 32768
##$SIGF1= 0
##$SIGF2= 0
##$SINO= 400
##$SIOLD= 32768
##$SREGLST= <1H.CDCl3>
##$SSB= 0
##$STSI= 32768
##$STSR= 0
##$SW_p= 5175.98343685301
##$SYMM= 0
##$S_DEV= 0
##$TDeff= 65536
##$TDoff= 0
##$TI= <Analysis number 999999
Compound Code 99
Book Reference 9
Project Code 9>
##$TILT= no
##$TM1= 0
##$TM2= 0
##$TOPLEV= 0
##$USERP1= <user>
##$USERP2= <user>
##$USERP3= <user>
##$USERP4= <user>
##$USERP5= <user>
##$WDW= 1
##$XDIM= 32768
##$YMAX_p= 431307044
##$YMIN_p= -287946
$$ End of Bruker specific parameters
$$ ---------------------------------
##NTUPLES= NMR SPECTRUM
##VAR_NAME=  FREQUENCY,     SPECTRUM/REAL,   SPECTRUM/IMAG
##SYMBOL=    X,             R,               I
##VAR_TYPE=  INDEPENDENT,   DEPENDENT,       DEPENDENT
##VAR_FORM=  AFFN,          ASDF,            ASDF
##VAR_DIM=   32768,         32768,           32768
##UNITS=     HZ,            ARBITRARY UNITS, ARBITRARY UNITS
##FACTOR=    0.157963299565203, 1,           1
##FIRST=     4116.76007274333, 0,            0
##LAST=      -1059.22336410968, 0,           0
##MIN=       -1059.22336410968, -287946,     0
##MAX=       4116.76007274333, 431307044,    0
$$ Real data points
##PAGE= N=1
##DATA TABLE= (X++(R..R)), XYDATA
$$ [...]
19174g7275J4989L2730k2374M435K202k5533j2505K4638L2823O590R998L1535
19162B2253k3088k1980k7500L3414J6752l0063l3606O4978M8616l6978m5352k1688
19150e4242k8074M5773k152L7673J0439r594P509K4576J9159j8568l1389L2594
19138C3704M4344j1334l0822k7125k0112K2740L837J2201r595n6194m6119J6052
19126f8423N6074K6287J0738o793K1154k9222j5341J8341j847r420j6109k9409
19114d3970j5632l011K2410L9805J3067j0886L7036K1624J367j01442r684N8581
19102I265P254M3531o604m2623l2039l861r475j4117K641J7308O181R520K2632
19089I613K8333L5467o940K7704K4459o6576L12R567m3879o2946k2445K1052K364
$$ plain form
19174 -77275 -62286 -29556 -51930 -47495 -45293 -70826 -83331 -58693 -25870 -19280 -9282 22253
19162 22253 -835 -22815 -50315 -16901 -149 -30212 -63818 1160 49776 12798 -32554 -54242
19150 -54242 -82316 -36543 -38695 -1022 9417 -177 7332 31908 51067 32499 1110 33704
19138 33704 78048 66714 35892 8767 -11345 11395 15232 27433 17838 -38356 -84475 -68423
19126 -68423 -12349 13938 24676 17883 39037 9815 -5526 12815 10968 1548 -14561 -43970
19114 -43970 -59602 -62613 -40203 -398 12669 1783 38819 60443 61810 -39632 -49316 9265
19102 9265 16519 60050 53446 10823 -21216 -25077 -34552 -48669 -46028 -28720 -22539 -13019 9613
19089 9613 37946 73413 66473 94177 118636 52060 52372 61939 18060 -44886 -67331 -46279 -43915
19076d3915Q119J3609l4846L241q130j1440M2304M3453j6417j6129l300K557J4431
19063f463j391n4862J1770L1969m2678n73J2010k964k9093N5658K9371j5716M3059
19050C0097Q375j0452j1076k8354p221N7072J8732m0722r911j8980j2375j1811
19038c6626J9838K9014j6777k4818K8956N6764J0395o3301q624L5473K6734l7064
19026A9964k6011l6856j2134l6006O0217L6925j2590j0401j9494l049J3703L849
19014b1883m277j9904k5017J5663J567K3136M3577m5631m0495L0779J5505l1252
19002e8232j3948K5191M8052J3968o827j3681p942L6781J4872J5068l949o174
18990D3179q606L608j6314j7442N1996j1174K6977J9193k2151k9957k8351J9823
$$ plain form
19076 -43915 -35796 -22187 -57033 -53792 -61922 -73362 -31058 12395 -4022 -20151 -23451 -20894 -6463
19063 -6463 -7854 -62716 -50946 -18977 -61655 -62228 -50218 -53182 -82275 -26617 2754 -12962 30097
19050 30097 38472 28020 16944 -11410 -18631 38441 57173 16451 6540 -12440 -24815 -36626
19038 -36626 -16788 12226 -4551 -29369 -413 56351 66746 3445 -5179 30294 57028 19964
19026 19964 -6047 -42903 -55037 -91043 -30826 6099 -6491 -16892 -36386 -39435 -25732 -21883
19014 -21883 -26160 -46064 -71081 -55418 -53851 -30715 12862 -32769 -73264 -42485 -26980 -58232
19002 -58232 -72180 -46989 1063 15031 8204 -5477 -13419 23362 38234 53302 49353 43179
18990 43179 34573 38181 21867 4425 56421 45247 72224 91417 69266 39309 10958 30781
18978C0781Q08m6037J457m394k6287k7330k08K0973J6555j4767k6080j7844M0087
18965e2286M8378M9404O307o0855m5975M7169J8872J6593j1103j3880J0388j321
18953A1691L1922Q1331n1095k6838k5016ok3695l349M0107j8598j2531J2508j1280
18940E151k0323l6511j5769m645P154J7512O7811p546J7498j1541Q469j998l0038
18927d776M4971J3899j2234n8865n9864o030l8287j1605L0096O3967K2351J2816
18915c561j1938K5372J1824l3156M284M6125n125k953k6065Q188N5J2509k0471
18902E088Q1194L5324p111o278k0944o3547j7734L753n2303K4297r971L0789K3600
18889B6157j9762J6699P405P165o71k2354k3778L0677J6307q750l7942l656O4899
$$ plain form
18978 30781 31589 -14448 -12991 -17385 -43672 -71002 -71210 -50237 -33682 -48449 -74529 -92373 -52286
18965 -52286 -3908 45496 51803 -9052 -55027 -7858 11014 27607 16504 2624 13012 11691
18953 11691 43613 124944 73849 47011 21995 21989 -1706 -5055 35052 16454 3923 16431 5151
18940 5151 -15172 -51683 -67452 -72097 -64943 -47431 20380 12834 30332 18791 27260 25262 -4776
18927 -4776 40195 54094 41860 -17005 -76869 -82899 -121186 -132791 -102695 -38728 -16377 -3561
18915 -3561 -15499 9873 21697 -11459 -7175 38950 33825 30872 4807 12995 13050 25559 5088
18902 5088 86282 121606 114495 108217 87273 23726 5992 9745 -42558 -18261 -28232 2557 26157
18889 26157 6395 23094 30499 37664 36993 14639 -9139 21538 37845 29095 -8847 -12503 52396
18876E2396k7155l4685j5879P278K6421J7964Q801L082J1648j2172o0503m0024
18864f2828M1285K1730k1661K3326K3396M971L409O623j9674l4256j6153J8995
18852a0837q843o087M2608j6679n3052m1812K4451L0960J7898N7941l709j5867
18840A6972l5745M3507Q5615L3005m7110k0109L155J4190m1669o414J7841J7502
18828H0740Q960m9478n8905l6319J6898O9917Q8331K1314l4222l7614o2403J1875
18816A9094j0577R769K5520j3077k192j8023j2495j1966O963L0567L6950l9521
18804B1012J1070M593k5089j7723K464j916J4129N4238M5084J3657N6840M0217
18792B18576K8090q352l2557j1080K2217L3799K635K8444J1227K8034q040j0645
$$ plain form
18876 52396 25241 -9444 -25323 -18045 8376 26340 35141 38223 49871 37699 -22804 -62828
18864 -62828 -21543 187 -21474 1852 25248 30219 33628 40251 20577 -13679 -29832 -10837
18852 -10837 -19680 -25767 16841 162 -52890 -94702 -70251 -39291 -21393 36548 32839 16972
18840 16972 -18773 24734 110349 143354 96244 76135 79290 93480 51811 45397 63238 80740
18828 80740 89700 40222 -18683 -55002 -38104 31813 120144 141458 107236 69622 7219 19094
18816 19094 8517 18286 43806 30729 28537 10514 -1981 -13947 -6984 23583 60533 21012
18804 21012 32082 36675 11586 -6137 -3673 -5589 8540 62778 107862 121519 178359 218576
18792 218576 246666 238314 205757 194677 216894 250693 253328 281772 292999 321033 312993 302348
18780C02348l5611j8523K2447j3445L0732Q9726L1449J1475M820J0230k3407L5446
18768D47687J04103Q8252J09958L2161j7048j37256j74560j35059o9875n6521
18758A91842l4417q981n0307k5383K314l51K3635L0718J8152l9471L87N043j409
18745A11772k0817q969R81N4704N0315N1575J07250J21668J0240n2463l3534l9723
18733C52999l9827j452P8902J0453o5895j7846L7817j3182m0064k8882M851L4854
18721C12728L1247M0485K9261n6225p6396p1963j15717N5464Q9530J09065R1051
18710D38530k5791j05443n9477l9510n3865m1844j3293l0482K6182L6268l1000
18699A00275k4300J013K6298n26J0766k4440k4670j7880m8858l1769l659K9273
$$ plain form
18780 302348 266737 248214 270661 257216 287948 377674 409123 420598 425418 435648 412241 447687
18768 447687 551790 640042 750000 782161 765113 627857 453297 318238 248363 191842
18758 191842 157425 148444 98137 72754 75068 74717 98352 129070 147222 107751 108138 113181 111772
18745 111772 90955 81986 82967 137671 187986 239561 346811 468479 478719 426256 392722 352999
18733 352999 313172 311720 390622 401075 335180 317334 355151 341969 301905 273023 277874 312728
18721 312728 343975 384460 413721 357496 281100 209137 93420 148884 238414 347479 438530
18710 438530 412739 307296 247819 208309 154444 112600 99307 68825 95007 131275 100275
18699 100275 75975 76988 103286 102760 113526 89086 64416 46536 -2322 -34091 -37750 -8477
18687h477K4198L6723J7826j8951k9778K4151L3166l5646k7554r495K267j1360
18675b930J2133Q6545M888k4376l216k3725J4398L1912P3888P5729P7244J02904
18663D25394L3391n7046j7532J7398L6606j2138o8882q1443p6581o2363P710o0075
18651H4439l1655J8316j5431M073M0333K5711j5344k7806J2179M4782L706M8422
18639A91725K6126j7344N5718N7885M6096N8028J06585M7882m0308p9154k7485
18628D25754J9477N22p5645o2258q469l0564j9815l9758J2445K4884L4385K7691
18616C08649k131J9250J3297J8889P3758R1668Q9899K3776L2940r860n729K8850
18604F83256j00859j07834m1243j00184p1181k46j2630l7547M184R350O236Q335
$$ plain form
18687 -8477 15721 52444 70270 51319 21541 45692 78858 43212 15658 6163 8430 -2930
18675 -2930 9203 95748 100636 76260 73044 49319 63717 95629 169517 245246 322490 425394
18663 425394 458785 401739 384207 401605 438211 426073 357191 275748 199167 136804 144514 84439
18651 84439 52784 71100 55669 59742 100075 125786 110442 82636 94815 139597 143303 191725
18639 191725 217851 200507 256225 314110 360206 418234 524819 572701 532393 453239 425754
18628 425754 445231 445753 370108 307850 299381 268817 249002 209244 221689 246573 280958 308649
18616 308649 306518 325768 339065 357954 431712 523380 613279 637055 669995 660135 654406 683256
18604 683256 582397 474563 433320 333136 261955 261709 249079 211532 215716 225066 231302 239637
18592B39637J0717k5564k0247J85L2220o949j4158M2902P4443J0023J5676P0934
18580D29819O9822N0625L614R381j9328J383J2233n862o5340n1881m3819n7963
18568C32684n5864k847J2770k3323q270L0496J0540J4439j344K903O466P636l5009
18555B91277m2996N9791N5999p4430m0951J3914O9985K7982L0765L9904k3632
18544D07608p6176q874J8878k8888l9459N23p530M0769j4970r1889n1402k8585
18532A20005l0456J3854K4359P956k4859K565K5354N009J3611K3854k2609N208
18520A63851J873j7510r196K380Q303M3904J132l4387r1150k879N401j3320O8766
18507A27168K4049Q52K2498l5405l8513l3225K6841P9147J5563j1453k7728q454
$$ plain form
18592 239637 250354 224790 204543 204728 236948 229999 215841 258743 333186 343209 358885 429819
18580 429819 499641 550266 553880 563261 543933 545316 557549 551687 486347 434466 390647 332684
18568 332684 276820 273973 286743 263420 255150 285646 296186 310625 309281 312184 318650 326286 291277
18555 291277 248281 308072 364071 289641 248690 262604 332589 360571 391336 431240 407608
18544 407608 331432 322558 341436 312548 273089 273612 266082 306851 291881 199992 148590 120005
18532 120005 89549 103403 127762 135718 110859 113424 138778 143787 157398 181252 158643 163851
18520 163851 165724 148214 139018 141398 149701 193605 194737 160350 69200 66321 71722 58402 127168
18507 127168 151217 152069 174567 139162 100649 67424 94265 173412 188975 177522 149794 141340
18495A41340Q917k0620j200M6117j983L7779j8752J2334K3087J8038n45K6274
18483B70786l5271k4570N73P5130L0753n0884l996J3913m9733n4336P330L8191
18471B17886L3750M3750k0980q545L447m280r727k4833M1286Q2201R6498P788
18459D58241j8024n7669n2299K0888L5986L4596L1866K5117K9008L2491j3810
18448E26391n6174M400K6234K9149o183K2200O2458K5567Q373m7383m3148l2529
18436E19355q4319p9607l8295J9213L2669K705q3454J2750M6654K0264N9090L0733
18424D57758J3956K7060j852k1052j0119P119K4405M614L1810L2182L2708J0130
18412F08719J1147Q751K8345k2830q536J9720l375J3349J4247j02107j01409m4006
$$ plain form
18495 141340 150257 129637 128437 174554 172571 210350 191598 203932 227019 245057 244512 270786
18483 270786 235515 210945 211518 286648 317401 266517 262521 276434 226701 172365 179695 217886
18471 217886 251636 295386 274406 265861 269308 265028 255301 230468 271754 353955 450453 458241
18459 458241 440217 382548 330249 351137 387123 421719 453585 478702 507710 540201 526391
18448 526391 470217 474617 500851 530000 523817 546017 608475 634042 642415 595032 551884 519355
18436 519355 435036 355429 317134 336347 369016 371721 288267 301017 347671 367935 427025 457758
18424 457758 471714 498774 496922 475870 465751 472870 497275 501889 533699 565881 598589 608719
18412 608719 619866 628617 656962 634132 625596 645316 641941 655290 669537 567430 466021 422015
18400D22015l7846m6919j9577L2060N5169L4248J0449K5300M1286J8352j8788
18389E15749R164K0436L6344J1417j9841J4115j3460k636P292n0741m3420O985
18377D91404O612j9081k3836P469o6475M357P4742L3714o6111k5654J3067N3188
18365D83396N9827P2424j2357K494L1339N666Q56Q249L0735j4591J3641L3938
18353G15617N8184O4745L2447k5837p5503q0439l5657n9865k1502R662p937P0643
18341F44558M7473k8952m4140q254k7774J2421O7265L6248P0463J2039q4240o838
18329F90269j6649q994P970K5608R4728M2028J1006m0877p3613q0125l7190N0051
18317F64212M1369L6675K2881L4732O4330O2238O9534N8303O1510N7545R0672
$$ plain form
18400 422015 384169 337250 317673 349733 404902 439150 449599 474899 516185 534537 515749
18389 515749 524913 545349 581693 593110 573269 587384 573924 571288 578580 527839 484419 491404
18377 491404 498016 478935 455099 462568 396093 400450 475192 508906 442795 417141 430208 483396
18365 483396 543223 615647 603290 605784 637123 642789 643645 651894 682629 668038 681679 715617
18353 715617 773801 838546 870993 845156 769653 689214 653557 593692 572190 581852 573915 644558
18341 644558 692031 663079 618939 610685 582911 595332 662597 698845 769308 781347 697107 690269
18329 690269 673620 664626 672596 698204 792932 834960 845966 805089 731476 651351 614161 664212
18317 664212 705581 742256 765137 799869 864199 926437 995971 1054274 1115784 1173329 1264001
18306A264001O1858N3598Q3666R0536J11629J15232J19801J23952Q8197O9555
18296B182025R3949R7780J23120K09787K60945L45173L48396L22678L92451M26541
18286D802845N71538P11198J032320J618719K598640M084644O613382R358774
18278C1392060P851955J417117l335685n363551n261678l011273J40398L901815
18270B7731158P896820Q557980K610859l377583o049754o469332m278509p30965
18262B5890674L294430O555516N066544m93546m199774n720769n205282k966494
18254B2221299m3923L274404O913047P477590J939843l787133o519187p321068
18246B4154872o116332m214223k689274j614471r20732m17160l4669J58531L23502
$$ plain form
18306 1264001 1325859 1379457 1463123 1553659 1665288 1780520 1900321 2024273 2112470 2182025
18296 2182025 2275974 2373754 2496874 2706661 2967606 3312779 3661175 3983853 4376304 4802845
18286 4802845 5374383 6085581 7117901 8736620 11335260 15419904 22033286 31392060
18278 31392060 39244015 40661132 37325447 31961896 26700218 23688945 23829343 27731158
18270 27731158 35627978 44185958 46796817 43419234 37369480 30900148 26621639 25890674
18262 25890674 29185104 35740620 40807164 40313618 36113844 30393075 25187793 22221299
18254 22221299 22177376 25451780 32364827 39842417 41782260 37995127 31475940 24154872
18246 24154872 18038540 13824317 11135043 9520572 8599840 8182680 8148011 8306542 8630044
18237H630044M62952N05847N30677N73923Q07511J237020J891545K920739M469295
18228B2029553P008660J1467292J7781949K0379690J0416861l233938j0371570
18221G5478497j2638132r895945l884660L120437J0978691J6568869J1296693
18214I1024450j431328r375570j2150334j0126985l686238M878637J3866449J6670437
18206H9669518N906472o619458j2643359j4230094j0897137m765770K159386R946532
18198E8526090J5491874J0016307l199304j1732869j5410516j4950640j1331111
18191B7409831p530480m849545l083969j946588j310658r70524p47473p69063
18183F201531p51608o34257n11212l62204k50973k13867j57630n7718o3984j58450
$$ plain form
18237 8630044 9092996 9598843 10129520 10703443 11510954 12747974 14639519 17560258 22029553
18228 22029553 29038213 40505505 58287454 78667144 89084005 85850067 75478497
18221 75478497 62840365 52944420 49059760 52180197 63158888 79727757 91024450
18214 91024450 89593122 80217552 68067218 57940233 54253995 59132632 72999081 89669518
18206 89669518 95575990 88956532 76313173 62083079 51185942 46420172 48579558 58526090
18198 58526090 74017964 84034271 80834967 69102098 53691582 38740942 27409831
18191 27409831 19879351 15029806 11945837 9999249 8688591 7718067 6970594 6201531
18183 6201531 5449923 4815666 4304454 3942250 3691277 3477410 3319780 3262062 3198078 3039628
18173C039628j14081p0409m7407k9802l0784q213M6730J36113J62399J87167K29609
18162C500950J89426J44734J26892J51020K01259J34288J59959K74238K76343
18153E159109L24051M76535N72498O86066P83388J033565J303802J652117K227971
18144A4219102L000316M169158O037758R274622J4712828K1119450K0490727R256123
18136A02280084Q02369P3750L772664L336865o650449j4890910j8162192j7805309
18128E2756872j3976479r458295o063025l874705k453021j502706p61451k26071
18120A4441119K17122O97414J234960J767515K545704L611944N218255P727869
18112C7461902J2089718J9562593L1162317M1405360L4885825R246672q998619
$$ plain form
18173 3039628 2925547 2855138 2807731 2777929 2747145 2738932 2785662 2921775 3084174 3271341 3500950
18162 3500950 3690376 3835110 3962002 4113022 4314281 4448569 4608528 4882766 5159109
18153 5159109 5483160 5959695 6532193 7218259 8001647 9035212 10339014 11991131 14219102
18144 14219102 17219418 21388576 27426334 36700956 51413784 72533234 93023961 102280084
18136 102280084 103082453 103156203 106928867 110265732 103615283 88724373 70562181 52756872
18128 52756872 38780393 29322098 23259073 19384368 16931347 15428641 14667190 14441119
18120 14441119 14658241 15355655 16590615 18358130 20903834 24515778 29734033 37461902
18112 37461902 49551620 69114213 100276530 141681890 176567715 185814387 176815768
18105A76815768j3170471j5929860k1633934k4233228k3364506k0792090j5875020
18098D1816659j0828414p111919m552805k998898j945332j107725m87965O7706
18090A2851307P48124J550467K733352M729327P791351R925293O737957J218438
18082D8285616q44880p4547J510443q73257n264012p401274q092804p077185n114815
18073A5053285l416094k154252j395025r86137o20757l62425k10113j5121K09188
18064F102549L40823O31401R95948J406490K051745L090097M894362P766882J0524000
18055C7804297Q414374K484395m54253K0433J458238r67381n718712q034359q661244
18046B6345788p668531n561359l670862k382194j549779j132690q02002o16231
$$ plain form
18105 176815768 163645297 147715437 126081503 101848275 78483769 57691679 41816659
18098 41816659 30988245 23876326 19323521 16324623 14379291 13271566 12783601 12851307
18090 12851307 13599431 15149898 17883250 22612577 30403928 40329221 47067178 48285616
18082 48285616 47440736 47366189 48876632 48003375 42739363 35338089 27245285 20168100 15053285
18073 15053285 11637191 9482939 8087914 7101777 6481020 6118595 5908482 5893361 6102549
18064 6102549 6443372 7074773 8070721 9477211 11528956 14619053 19513415 27280297 37804297
18055 37804297 46218671 48703066 48248813 48269246 49727484 48760103 43041391 35007032 26345788
18046 26345788 18677257 13115898 9445036 7062842 5513063 4380373 3578371 2962140
18038B962140m53725l62018k35336j80234j81434j58018j15643r3939m5168K4864
18028A161489o0508q6525l1066o816m703p7322j14357p6194n0548o4765r1005
18017D97680l4252r034n0893q0131j0748J3473J9672J2670L4986M7253p803j0756
18005D22117l0561l3244n1654n4560J0221L1369p735k7828R151L1955O5267J2390
17993C76888o4950l0336j9192m8523K879Q873j7673k1359l4601M7825M4823M420
17981B49074l8243J4885o211J4448L2651L0700n5160p3448o390m2987m7562o5154
17969F603M4852Q1768L9155K3144j0019n8513n078J9113K1440Q673N1050L3356
17957B55544r442j724L9727P8111M2247m1927n0905l5915n0705m1699j8626l2913
$$ plain form
18038 2962140 2508415 2146397 1911061 1730827 1549393 1391375 1275732 1181793 1136625 1161489
18028 1161489 1100981 1014456 983390 976574 971871 894549 780192 703998 653450 588685 497680
18017 497680 463428 454394 403501 323370 312622 326095 345767 358437 393423 440676 432873 422117
18005 422117 391556 358312 306658 252098 262319 293688 285953 258125 267276 299231 364498 376888
17993 376888 311938 281602 262410 213887 216766 225639 207966 186607 152006 199831 244654 249074
17981 249074 210831 225716 219505 233953 266604 297304 242144 168696 162306 119319 71757 6603
17969 6603 51455 133223 172378 195522 185503 126990 121912 141025 162465 171138 222188 255544
17957 255544 246102 244378 284105 362216 404463 362536 311631 275716 225011 183312 164686 131773
17945A31773l1445L3841J23646J48011J03682L3336J874N9804J00961L8227m9153
17934F94557n2148m1095J6036M5941n296m8056l2565R3399J18459J27468N2028
17923I68728q5879j12512j59548j10379j48983j09617n4544q8704m3462j7707
17913C7393Q167N091k9843Q235M4042M1269L0394O4830R9347N5175P4402Q76m891
17900D34487l2301J8999K9553p9187r6018o8175j06291r6028o3770l2833J3960
17889g7604m108N946P525O932r649k1361j9282M2519L5887J0470K0172L8018L7853
17876G3318r974K4350K4398k3779N98M5336r978N542q535q7121m5330j4808Q441
17863a7542K9212O212q1212l3570j2159j8515P487L3531P105L816K8067N13K1788
$$ plain form
17945 131773 100328 134169 257815 405826 509508 542844 544718 604522 705483 743710 694557
17934 694557 642409 601314 617350 663291 657995 609939 577374 670773 789232 916700 968728
17923 968728 882849 770337 610789 500410 351427 241810 187266 98562 55100 37393
17913 37393 45560 50651 20808 29043 73085 114354 144748 209578 308925 364100 438502 439378 434487
17900 434487 402186 421185 450738 371551 275533 207358 101067 5039 -58731 -91564 -77604
17889 -77604 -81712 -75766 -68241 -61309 -70958 -92319 -111601 -69082 -33195 -22725 -2553 35465 73318
17876 73318 63344 87694 112092 88313 88911 134247 124269 129811 121276 34155 -11175 -25983 -17542
17863 -17542 11670 17882 -63330 -96900 -109059 -127574 -120087 -86556 -79451 -75635 -47568 -47055 -25267
17850b5267k8576j3288q158m095J5489k3807K6690O8149L156n5235j0842j801
17838e7585P54L3361K5905k9331k6333K8305J4797R361J0093o635j4022j9467
17826c0797m6964K0765L0368l8530l2302O1757O4121J5361l2378P939k8179M2585
17814C3746K5089n6681j5753k1578p0708l0961M6412J7677l4647L6475J5471n8937
17802a14395j9386l299n158J0061L8574j2483p5154J092P3317N5827k9438J9689
17790f0753O3744m8939o3053J8640k581j8773k0023O532L9468j6470K472k4508
17778a24244j7307r581L0185N5947l1759j8285M8855L9159J6076m660n7826k50
17766g3690L4110M6314o334k6117l5130k5710K7144M0658l709K9364l001o2801
$$ plain form
17850 -25267 -53843 -67131 -75289 -79384 -63895 -87702 -61012 7137 10293 -44942 -55784 -57585
17838 -57585 -56831 -23470 2435 -26896 -53229 -24924 -10127 -766 9327 2692 -11330 -30797
17826 -30797 -77761 -56996 -26628 -65158 -97460 -35703 28418 43779 11401 19340 -8839 33746
17814 33746 58835 2154 -13599 -35177 -105885 -136846 -90434 -72757 -107404 -70929 -55458 -114395
17802 -114395 -133781 -137080 -142238 -132177 -93603 -106086 -181240 -180148 -106831 -51004 -80442 -60753
17790 -60753 2991 -45948 -109001 -90361 -92942 -111715 -131738 -125206 -85738 -102208 -99736 -124244
17778 -124244 -141551 -151132 -120947 -65000 -96759 -115044 -66189 -27030 -10954 -15614 -73440 -73690
17766 -73690 -39580 6734 400 -25717 -60847 -86557 -59413 -18755 -22464 6900 3899 -58902
17754e8902l1033M9801O3087R000L5538N2095Q6384L1722K2143N0865l5518j4008
17742B61174p6616j4064P9728Q2075N2966j5896m3047q4195k074n3858o6667n318
17730A14208K2588P9916M6218J6546r318j5734o7196r660M3429O8078N8035k4941
17718C22169r3294j48911o8632o4714l4950n631k3794L4740K9484K4320k58P019
17706b2452J8087O1636R645k2558n482m5004k8237J0613J7405J8440M3067L2463
17694H7623P4458O4138J7743m6711o0652o1704l8614k8961P1028J11859L8547
17683B28754l2546j4343j3741l8770J9056P249O5594N1950J5629L4297j4284q9551
17671B19294m8406l1402L1739J7020N3514O9256q4804p8124k5975k0082k9587
$$ plain form
17754 -58902 -89935 -40134 22953 31953 67491 119586 205970 237692 259835 310700 275182 261174
17742 261174 184558 170494 250222 332297 385263 369367 326320 242125 240051 186193 119526 114208
17730 114208 136796 216712 262930 279476 270158 254424 187228 177568 220997 289075 347110 322169
17718 322169 228875 79964 11332 -53382 -88332 -93963 -117757 -83017 -53533 -29213 -29471 -22452
17706 -22452 -4365 57271 66916 44358 38876 -6128 -34365 -23752 -6347 12093 55160 87623
17694 87623 162081 226219 243962 197251 136599 74895 36281 7320 78348 190207 228754
17683 228754 196208 181865 168124 129354 148410 155659 221253 273203 288832 323129 308845 219294
17671 219294 170888 139486 171225 188245 241759 311015 226211 148087 122112 102030 72443
17660G2443n472j9932l9474m2907k7669j6064J2974L1600J715p690J4645M1038
17648A5207p26j6130k8565l6312n365K1786J1998J2773L907m4307l3262K1442
17636g7554L3473K7473L0121l7638j9857K5370J1714j954N0490L702m3900l0086
17624b8646r292L5719N3988N3928P4050Q9139P4597O6957L390m4184M7793n1265
17612C66174p5378m4289m4923o0450l660j1509j3828L8013l3274n0224j8774L8016
17600H5894q818K1384r028q44k8614l5130J7938K5390K2456L4120L7188P4618
17588B36554J40560M7366l7223l0288j259J0088k9773m6788p6396p7091n7266
17577G8484k7950l2423l523P442r916n2001j5056N8217Q0024L6281jJ9316M7240
$$ plain form
17660 72443 66971 47039 7565 -35342 -63011 -79075 -66101 -34501 -32786 -40476 -25831 15207
17648 15207 14481 -1649 -30214 -66526 -71891 -50105 -38107 -25334 -21427 -65734 -98996 -77554
17636 -77554 -44081 -16608 13513 -24125 -43982 -18612 -6898 -8852 41638 45340 1440 -28646
17624 -28646 -37938 -2219 51769 105697 179747 268886 343483 410440 413830 369646 417439 366174
17612 366174 290796 246507 201584 141134 137474 125965 112137 150150 116876 66652 47878 85894
17600 85894 77076 98460 89432 88588 59974 24844 42782 68172 90628 124748 161936 236554
17588 236554 377114 424480 387257 356969 355710 365798 336025 289237 212841 135750 78484
17577 78484 50534 18111 14588 22030 12114 -39887 -54943 3274 83298 119579 119578 138894 186134
17564A86134O5658K9148M2468O2065m065k1972m6910k1183q6575r8792k0989n8485
17552B6502n9927n4121K2631M9570J9934l1417o4682R327K2614L0070j4016J0258
17540c3257J7763L5107J7565N615L1205R7890Q6770N8784K4243R142L1674j7536
17528C64965m3764j02613q0379q4074n7598M15J1603j9561o2537J2518M9074L868
17516h083n1064L3969K9670j3758q3926o4820K8817M1093J4335K5486n437O677
17504d7041o010k6114J0921K392L035k5440j8516M0285N7490J8604m1776r828
17492d1998J1272o857J622p97l10O561l73j5645j1499P67L1980r452k8916o849
17478g0494K9467l013N867R782k1068o631j3512k6842l3947K2999P1859K249l9824
$$ plain form
17564 186134 251792 280940 323408 385473 381408 359436 312526 291343 204768 105976 84987 26502
17552 26502 -33425 -87546 -64915 -15345 4589 -26828 -91510 -82183 -59569 -29499 -43515 -33257
17540 -33257 -15494 19613 37178 42793 73998 171888 258658 317442 341685 350827 382501 364965
17528 364965 321201 218588 138209 54135 -3463 -3048 8555 -11006 -73543 -61025 -11951 -8083
17516 -8083 -59147 -25178 4492 -9266 -93192 -158012 -129195 -88102 -73767 -48281 -53718 -47041
17504 -47041 -53051 -79165 -68244 -65852 -62817 -88257 -106773 -66488 -8998 9606 -32170 -41998
17492 -41998 -30726 -37583 -35961 -36758 -37068 -30507 -30880 -46525 -58024 -57257 -25277 -34729 -63645 -70494
17478 -70494 -41027 -44040 -38173 -28391 -49459 -56090 -69602 -96444 -130391 -107392 -35533 -33284 -73108
17465g3108Q650M995m375j6384l9726q726J9645q364J2806K2352J958K2355k413
17452f0335j5705O6080n3699O554K235J062P2466O1067K5168L8260J19883P4073
17440C37109J1846o1226o4145n6553p5448m4834n6785l0952m2216n1237Q938J615
17428a23888M5162O3467R588j7989k907j951j0028k790j4730l0237j0131k6973
17416a23407K8684k5469j0571P7301M3083j1713m2752N838J8066K9085J236J4544
17404C925j6783k8213R955j1485n9877q012J2358N566P777M2816M1812m3459M745
17391c8875M0257K1276k9964k3555o1111j4558J3079J4553L3645j8464m4379j9010
17379a27106J7897O185R521J7204k2984j993k0736O4881Q2972j7403n1724N3183
$$ plain form
17465 -73108 -64458 -59463 -63838 -80222 -119948 -128674 -109029 -117393 -104587 -82235 -80277 -57922 -60335
17452 -60335 -76040 -9960 -63659 -57105 -54870 -53808 18658 79725 104893 143153 263036 337109
17440 337109 348955 287729 223584 167031 91583 46749 -10036 -40988 -83204 -134441 -125503 -123888
17428 -123888 -78726 -15259 -5671 -23660 -26567 -28518 -38546 -41336 -56066 -86303 -96434 -123407
17416 -123407 -94723 -120192 -130763 -53462 -10379 -22092 -64844 -59006 -40940 -11855 -10619 3925
17404 3925 -12858 -41071 -31116 -42601 -102478 -110490 -98132 -92566 -84789 -41973 -161 -43620 -38875
17391 -38875 1382 22658 -7306 -30861 -91972 -106530 -93451 -78898 -45253 -63717 -108096 -127106
17379 -127106 -109209 -103024 -93503 -76299 -99283 -101276 -122012 -57131 25841 8438 -43286 9897
17367I897K1774k8323q250J0307j4090K055k2713P983J0163o5198l2478q827k4487
17354a42187N0313J9053L568L3246k184r896Q999l4933n6191m1096K0349k8012
17342a78971r756J8937J7905M1356L2525K2214K5562J8877J0836M184P993n973
17330E689m8922j3922l0829r412k9844j3832L2261j4945j264N6240L8698j2714
17318d2796j1319M1722K1996j3759l1018k7047k7847Q942L1369j6152M485L4567
17306b6857O410P081j3299l806j5531k3845j3837L3802K6546L3l0499J985k4042
17293g5859j8967j8314r035J1646j7237N134M1965N0853k4225J7677J8448o9932
17281h7846l9308m1637Q423L4274J2089L3885p473J6225J828J0543J0708J2497
$$ plain form
17367 9897 31671 3348 -4902 5405 -8685 -6630 -29343 -21360 -11197 -76395 -108873 -117700 -142187
17354 -142187 -91874 -72821 -69253 -36007 -38191 -48087 -39088 -74021 -130212 -171308 -150959 -178971
17342 -178971 -188727 -169790 -151885 -110529 -78004 -55790 -30228 -11351 -515 3669 11662 5689
17330 5689 -43233 -57155 -87984 -97396 -127240 -141072 -108811 -123756 -125020 -68780 -30082 -42796
17318 -42796 -54115 -12393 9603 -4156 -35174 -62221 -90068 -81126 -49757 -65909 -61424 -26857
17306 -26857 -20447 -13366 -26665 -30471 -46002 -69847 -83684 -49882 -23336 -23303 -53802 -51817 -75859
17293 -75859 -94826 -113140 -122175 -110529 -127766 -122632 -80667 -29814 -54039 -36362 -17914 -87846
17281 -87846 -127154 -168791 -160368 -126094 -114005 -80120 -87593 -71368 -69540 -58997 -48289 -35792
17269c5792J2268l5181r925K9359o187L8541K1008m481k0273k1720q133k175L968
17256c8723l660J0817J2107O811r478r085q509J4808j5424L2997J3242j7290n9370
17243g0757K5146K773k6005j7800l1803K4223J9693K3828M725k7424j456J192
17231g3665l904K9833M0837k393M155q62L3507J261l3948L2704N084j6854p538
17218H217k6563m7165M4894K1458k133l0995j1110K896J2394l1220k9635p773
17206i6735j749K3722k0857O535N0845O8351o090n4488p1979j8995J7227p314
17194a11527Q374k9313q139M6702N3773J632j9788k44k0958n258J8528J3612l168
17181e5774l3512K5872L2942j8801k9894Q870K8783L6143O0370j3326n2996J9973
$$ plain form
17269 -35792 -23524 -58705 -68630 -39271 -45458 -6917 14091 9610 -10663 -32383 -40516 -42691 -38723
17256 -38723 -42383 -31566 -19459 -12648 -22126 -31211 -39720 -24912 -40336 -7339 5903 -11387 -70757
17243 -70757 -45611 -42838 -68843 -86643 -118446 -94223 -74530 -50702 -45977 -73401 -74857 -73665
17231 -73665 -77569 -47736 -6899 -9292 -5137 -5999 27508 28769 -5179 27525 32609 15755 8217
17218 8217 -18346 -65511 -20617 841 -1292 -32287 -43397 -40501 -28107 -59327 -88962 -96735
17206 -96735 -98484 -74762 -95619 -89084 -38239 30112 24022 -30466 -102445 -121440 -104213 -111527
17194 -111527 -103153 -132466 -140605 -93903 -40130 -38498 -58286 -58530 -79488 -84746 -66218 -52606 -55774
17181 -55774 -89286 -63414 -30472 -49273 -79167 -70297 -41514 -5371 54999 41673 -11323 8650
17169H650j3577m1185k1628m7042k2378N8280j712R442N642k4595J2439J5197
17157f2467K1820J2705n155m9430J4603j3190J5719L781l4788O749R715J4523
17145f5415N7578L4951N527R39j6651n3223J2461J6658q4089o4499P469J1054
17133a37240M4681K7907m899N515L4104L394J5728P0J5893l8443n7998K1854L1950
17120c7484J1001l3171K1325m7439l2494N0805N5600K7303K0413l1771q271m282
17108h465m3869o3192J8735K7523L0629J8049K92p701j873p727l8832k8908O8432
17095c6907J3850j2722N2998O038m0813P445k2872k9440J179K7287K2060P5049
17083F3152M3155m693L4719K2311o635P423M632K194R5933J34191P1759Q5252
$$ plain form
17169 8650 -4927 -46112 -67740 -114782 -137160 -78880 -80592 -71150 -65508 -90103 -77664 -62467
17157 -62467 -40647 -27942 -33097 -82527 -67924 -81114 -65395 -61614 -96402 -89653 -79938 -65415
17145 -65415 -7837 27114 32641 33580 16929 -36294 -23833 -7175 -91264 -155763 -148294 -137240
17133 -137240 -92559 -64652 -69551 -64036 -29932 -26538 -10810 -10740 5153 -33290 -91288 -69434 -37484
17120 -37484 -26483 -59654 -38329 -85768 -118262 -67457 -11857 15446 35859 4088 -4183 -8465
17108 -8465 -52334 -115526 -96791 -69268 -38639 -20590 -20298 -27999 -29872 -37599 -76431 -105339 -36907
17095 -36907 -23057 -35779 17219 23257 -17556 -10111 -32983 -62423 -61244 -33957 -11897 63152
17083 63152 106307 101614 136333 158644 152009 159432 164064 166258 262191 396382 468141 553393
17071E53393Q9056J08693K1534n3332k224l1189j04651j17334j40146r1253l7727
17060A94820O083l2824k3475O2665P6331N3553N2799R8233P4925P3761J67363
17049H04234J00863k1208m2734p8521j21500q1948j10781j44825j17772k3966
17039A61842q33q629l5468o1875l7217L160J1711j9276J6501o879N204N742j3345
17026B0638M052K2186j1977O291k2718l4663J0833M3460J2328L1423p569l3920
17014D0364L6437k3650m0455j1647L0533r642r03J7735l292q7157k5447N3717
17002b3407J7520J1611l9256j8579M6678l5389K629k1110l913J7525n825J9986
16990c1530m778Q139L3196K4073J8200Q040l1517j6104j6426O804K6642k3366
$$ plain form
17071 553393 642449 751142 772676 719344 717120 685931 581280 463946 323800 232547 194820
17060 194820 200903 168079 144604 207269 283600 337153 389952 488185 563110 636871 804234
17049 804234 905097 883889 841155 762634 641134 559186 448405 303580 185808 161842
17039 161842 161009 152380 116912 55037 17820 20980 32691 13415 29916 23037 28241 33983 20638
17026 20638 24690 46876 34899 41190 18472 -16191 -5358 38102 50430 81853 74284 40364
17014 40364 76801 53151 12696 1049 31582 21940 21037 38772 35480 -51677 -77124 -23407
17002 -23407 -5887 5724 -33532 -52111 -5433 -40822 -38193 -59303 -63216 -45691 -51516 -31530
16990 -31530 -36308 -28169 5027 29100 47300 55340 23823 7719 -8707 -1903 24739 1373
16978A373Q591j6747Q849L6196L5792l0942K1905K1091l226j5185j7237k0441
16966C0019q921K2839l4773m5040m8510r729L6836k801n690o913O062L550L2349
16953c0722j0448j0300P935m701k292l067k4550K0795k3290j2574L372J7613M571
16940f7658p944j0451k2886K0814k0233K944O8093N9070L5702j6829j3228l8192
16928a0798m671k7539m1524R89N1216J8078M1377K2770k355j3935N612K7192L0378
16915I6790j5604k5228K803k2597l291k3508k4515L440j2563k0206L2565k2146
16903c4060J827L5192o565j0294l679j9165O661K9404j3267j9760J1845n975M8250
16890B0414m091m7897m1691M4266L7717l3840n7205J1969M098O1351K5958J072
$$ plain form
16978 1373 9964 -6783 2066 38262 74054 43112 65017 86108 82882 67697 50460 30019
16966 30019 21098 43937 9164 -35876 -84386 -94115 -57279 -60080 -65770 -72683 -66621 -63071 -30722
16953 -30722 -41170 -51470 -43535 -48236 -50528 -53595 -78145 -57350 -80640 -93214 -89842 -72229 -67658
16940 -67658 -75602 -86053 -108939 -88125 -108358 -105414 -37321 21749 57451 40622 27394 -10798
16928 -10798 -15469 -43008 -84532 -83543 -32327 -14249 27128 49898 47543 33608 39220 66412 96790
16915 96790 81186 55958 58761 36164 32873 9365 -15150 -11710 -24273 -44479 -11914 -34060
16903 -34060 -32233 2959 -3606 -13900 -17579 -36744 -30083 -679 -13946 -33706 -21861 -27836 20414
16890 20414 16323 -31574 -73265 -28999 8718 -25122 -82327 -70358 -66260 -4909 21049 22121
16878B2121J0498l26k2858o4028n0910M0084L2630j5235L4113o530m4524K2678
16866d2287j0026o6083n3663P6942Q1654k6925K925R824J5600K7719J7531J490
16854C4701j2524k5035r288K8747n2029o3300J2985j2738K1211J9942j4301K9633
16842d1996M2045j9035J47L5317j9219k4448o8998j3164K4221M0740m0818j5789
16830a00997K6903N2919K2171J9819M0564j5457m419L761J4077l949n7091k4440
16818b6139m8764j1741M3031L8592M068j0991j6086j0302k0250j5781K5503m041
16806e2901J475N5285r839K9007L3128j8185m4407j4593L1782K0485j7393l1323
16794a7479j2103L8779o01j4169J7563J3641K134K767J343j7369l749J2396J2272
$$ plain form
16878 22121 32619 32293 9435 -54593 -105503 -65419 -32789 -48024 -13911 -20441 -64965 -42287
16866 -42287 -52313 -118396 -172059 -95117 -13463 -40388 -37463 -27639 -12039 15680 33211 34701
16854 34701 22177 -2858 -12146 16601 -35428 -98728 -85743 -98481 -77270 -57328 -71629 -41996
16842 -41996 49 -18986 -18839 16478 -2741 -27189 -96187 -109351 -85130 -44390 -85208 -100997
16830 -100997 -74094 -21175 996 20815 61379 45922 41503 45264 59341 55392 -1699 -26139
16818 -26139 -74903 -86644 -43613 -5021 -953 -11944 -28030 -38332 -58582 -74363 -48860 -52901
16806 -52901 -51426 3859 -5980 23027 56155 37970 -6437 -21030 10752 31237 13844 -17479
16794 -17479 -29582 9197 8596 -5573 11990 25631 27765 30532 31875 14506 10757 23153 35425
16781C5425M3623L1959m661K9950n0825k270l2587q528O9486K7099R569m1888
16769A06352k5290k9078o285J9588j9692J2367j9473j9438j4337l283L917k3791
16757a8443L3927J7454O8457N4774L1291p636j4613J5901J3370K8286l0226q3180
16745A09362k0471K4065L0162m782l1252J2434p968l0975j3156J1025K8725r441
16733I7728p832k0173J1703K1587K3656J0337L941L6216j7889J6518j5181o809
16721A53802k4173L8312Q667L951l6320R669Q967m3689m5485P172J03364J8196
16709B02433p4981l8993J6337N4126k3763p1942j9158O3978J4605j9895J2880
16698A15627M3451j9070K366p460K9919j7527l8760K6017O3177J9243j7864K6473
$$ plain form
16781 35425 79048 111007 106346 136296 85471 83201 50614 42086 111572 138671 148240 106352
16769 106352 81062 51984 45699 65287 45595 57962 38489 19051 4714 1431 5348 -18443
16757 -18443 15484 32938 101395 156169 187460 179824 165211 181112 194482 222768 192542 109362
16745 109362 88891 112956 143118 138336 107084 119518 111550 80575 67419 78444 107169 97728
16733 97728 89896 69723 81426 103013 126669 137006 140947 177163 159274 175792 160611 153802
16721 153802 129629 167941 176608 180559 144239 153908 162875 119186 73701 80873 184237 202433
16709 202433 127452 88459 104796 158922 135159 63217 44059 108037 122642 102747 115627
16698 115627 159078 140008 142374 134914 164833 147306 108546 134563 197740 216983 199119 225592
16686B25592J1769l2229m3177j0983L0539o903l4291L7490L9979k0958J4087R842
16674B20757L4658N641l608j4616m1107o4822m9614n78r201K8541L2698K2820
16662A61569L4436L6201J1637k0846j2155N8614L5325l6639N2828L7502J6525
16651C74997r827K596K7181K2663l8263J9722n8284n5513n3560j2245m0754l0826
16639A47887j6524j712k9556q184M3090K9165J8695j0467M2132Q5288L4983K9362
16627C64159L972k8997j9806J6786j0406m9084n5787K2443j0338n2703l599m60
16615A76180J903m0682K2959K863K1897N5879L417O679K459J6766l2351K4295
16603B62264O2093Q960J3735R667M7357J5690m6610J5376j2526M6769R1599J3416
$$ plain form
16686 225592 237361 205132 161955 150972 181511 174608 140317 177807 217786 196828 210915 220757
16674 220757 255415 261056 257448 242832 201725 136903 87289 86711 77510 106051 138749 161569
16662 161569 196005 232206 243843 222997 210842 269456 304781 268142 320970 358472 374997
16651 374997 365170 367766 394947 417610 379347 399069 340785 285272 231712 219467 178713 147887
16639 147887 131363 129651 100095 91911 135001 164166 182861 172394 214526 299814 334797 364159
16627 364159 368131 339134 319328 336114 325708 276624 220837 243280 232942 180239 176640 176180
16615 176180 178083 137401 160360 163223 185120 240999 244416 251095 253554 270320 237969 262264
16603 262264 324357 333317 347052 356719 404076 419766 373156 388532 376006 422775 514374 527790
16591E27790L1608P7092N0664R1324J00082M2835j0395j8733n2648m4855J369
16580G96133P858o5769n7347n7820R497M8838N6948R0615Q5063R3701Q8252N9398
16568A155367P8248Q9051P6027R0676K4669L0972J2867L7886n5117j9606j0097
16557A510943R0412J22377J31249J27476K00117J95921K25825L21517L11252K45218
16547C482307K38244K03822J99784K10611J60869J48660K03266J88327K51806
16538E287696L13322M17839N66126P59315Q47931J034936J298356J593999J913701
16529A4033221K380344L125039M339834O369841R602006J4420995J8771847J8139619
16521I1182746J5699136J7990174K0533728J1494689l072954r729093j2245726
$$ plain form
16591 527790 559398 636490 687154 778478 878560 921395 911000 892267 839619 794764 796133
16580 796133 803991 738222 680875 623055 632552 681390 738338 828953 914016 1007717 1095969 1155367
16568 1155367 1233615 1322666 1398693 1489369 1514038 1545010 1557877 1595763 1540646 1521040 1510943
16557 1510943 1601355 1723732 1854981 1982457 2182574 2378495 2604320 2925837 3237089 3482307
16547 3482307 3720551 3924373 4124157 4334768 4495637 4644297 4847563 5035890 5287696
16538 5287696 5601018 6018857 6584983 7344298 8192229 9227165 10525521 12119520 14033221
16529 14033221 16413565 19538604 23878438 30248279 39850285 54271280 73043127 91182746
16521 91182746 106881882 124872056 145405784 156900473 153827519 144098426 131852700
16514A31852700j5582086j8384538j8183682j6203111j2818025q514055m519630
16507C7647573j143510K056832N774294J0796863J6457590J8621834J5902014
16500A06113490J5925118J9888902J6778318J827719r062295j2612817j5585028
16493A23273407j9178422k0427242j9120598j6398763j2460828q735384o010030
16486B0942140m078661k907040k193777j771459j459496j130177r91242q53868
16478E556420o30573n18824m16335l28494k64546j29184L8598Q2135M9561L0036
16468C468794N8499k9197j16861j40541k64180k29386k43787k50625k23007k62273
16458A767436k18948j23542j27462o6316l7592m1642o9460o0629p0909l0534q966
$$ plain form
16514 131852700 116270614 97886076 79702394 63499283 50681258 42167203 37647573
16507 37647573 36504063 38560895 44335189 55132052 71589642 90211476 106113490
16500 106113490 122038608 141927510 158705828 160533547 151471252 138858435 123273407
16493 123273407 104094985 83667743 64547145 48148382 35687554 26952170 20942140
16486 20942140 16863479 13956439 11762662 9991203 8531707 7401530 6410288 5556420
16478 5556420 4925847 4407023 3990688 3662194 3397648 3268464 3307062 3389197 3438758 3468794
16468 3468794 3527293 3498096 3381235 3240694 2976514 2747128 2503341 2252716 2029709 1767436
16458 1767436 1548488 1424946 1297484 1231168 1193576 1151934 1082474 1021845 950936 920402 911436
16447I11436n4281m4771m3292l7880k4040M5306l2414k5071m0809j7216O0673
16436F97641J5274m327J9754J0101q797N8464O2726P2770J23697J80750K6261
16425A254314j16707o2969r7007m1717n8631m1283n4248r0294m4722l4525j8674
16414E93537k6658O360M2087R8504Q3558J01905J67369J54976R8930K356q8450
16403A234474r4967j29315q0531p4401n6223r9192q1666J420l1888P425k7618
16392E67518l9532l936j0099R72r0548m3628K3323Q4035K0486L0005M3507K0921
16380F03024l1459m3982l4331j8508q410l5221p591k616K1229M4391j5831n506
16368D65189k2621n2827l8605l3868k7570M0459N035k3791J2360J8210P989J8664
$$ plain form
16447 911436 857155 812384 769092 731212 707172 752478 720064 694993 654184 636968 697641
16436 697641 712915 708588 728342 738443 729646 788110 850836 923606 1047303 1228053 1254314
16425 1254314 1137607 1074638 977631 935914 877283 836000 781752 691458 646736 612211 593537
16414 593537 566879 573239 615326 713830 797388 899293 1066662 1221638 1320568 1322924 1234474
16403 1234474 1139507 1010192 929661 855260 799037 699845 618179 619599 587711 595136 567518
16392 567518 527986 524050 513951 514923 424375 380747 404070 488105 508591 538596 582103 603024
16380 603024 571565 527583 493252 474744 466334 431113 423522 420906 442135 486526 470695 465189
16368 465189 442568 389741 351136 317268 289698 330157 335192 311401 323761 341971 349960 368624
16356C68624J483l133k4768m7944k4434P782o5660o0954o368m791m441N3994K1417
16343B10807K2648M3453L3690K8577K6363l647j2585M824j7686o8921o4802k8251
16331A74470k8838l0769m9626l5220R052K8584j7920n495K1851K1074N2473k9535
16319A10101l0951Q948q829j8696J0844j3854p238J6070j3842k1030m925J7879
16307D4477K8693O626M228k3501m2498m337K913p23k2061m0180l838L867N6840
16294A0506K821p352K3977J609k983k0505j7128K0522K4046K7961q192R226M0220
16281A04728P683m0470l6238q547j9565k7347k0919k5896l698J0153P969l0198
16269h2345J6520j7828m9242j698K3695N5042Q61K3004N824k1534r627J2796k9777
$$ plain form
16356 368624 370107 366974 342206 294262 269828 277610 211950 150996 144628 139837 135396 189390 210807
16343 210807 233455 276908 310598 339175 365538 361891 349306 354130 336444 267523 202721 174470
16331 174470 145632 114863 65237 30017 39069 67653 49733 44238 66089 87163 139636 110101
16319 110101 79150 88098 79269 60573 71417 57563 50325 66395 52553 31523 26598 44477
16307 44477 73170 79796 84024 60523 18025 13688 16601 15878 -6183 -46363 -50201 -46334 10506
16294 10506 13327 5975 29952 31561 28578 8073 -9055 11467 35513 63474 55282 64508 104728
16281 104728 112411 71941 35703 27156 7591 -19756 -40675 -66571 -70269 -60116 -52147 -82345
16269 -82345 -65825 -83653 -132895 -134593 -110898 -55856 -54995 -31991 -26167 -47701 -57328 -44532 -74309
16256g4309L103K7645j1135L188m0021J0818N1250K444l7597O937K8952N8303
16244B9578J3548r442j8975O838J0935k2930k3499j6378o1067K9611N3425L5969
16232B7613j2269j4229K0066m7857l7112J6372L3101m9778o3656p862L7759K6245
16220g1607K5706J5780K5254K0074L5423Q939o6078o9656K7463M119L013K6580
16208a4990Q522J4128P799o0924j1797L1838M6691m2378m2401m8026R054N1097
16196e1387L2387J3439m353l8755j3358m8955J9259L933q210l499L9931o064J968
16183f3664L1718k1215L2956L249j4791j2699l8134L2780M1913l1072J3108K1689
16171d162Q940l5928j9019k4093L5445L9957K2125O5673K767r9400n7857K5637
$$ plain form
16256 -74309 -71206 -43561 -54696 -51508 -91529 -80711 -29461 -27017 -64614 -57677 -28725 29578
16244 29578 43126 33684 14709 21547 32482 9552 -13947 -30325 -91392 -61781 -8356 27613
16232 27613 15344 1115 21181 -26676 -63788 -47416 -14315 -64093 -127749 -135611 -97852 -71607
16220 -71607 -45901 -30121 -4867 15207 50630 59569 -6509 -76165 -48702 -44583 -41570 -14990
16208 -14990 -6468 7660 15459 -45465 -57262 -25424 21267 -21111 -63512 -111538 -102484 -51387
16196 -51387 -19000 -5561 -9914 -48669 -62027 -110982 -91723 -87790 -96000 -99499 -59568 -65632 -63664
16183 -63664 -31946 -53161 -20205 -16956 -31747 -44446 -82580 -49800 -7887 -38959 -25851 -4162
16171 -4162 4778 -31150 -50169 -74262 -38817 1140 23265 88938 91705 -7695 -65552 -39915
16159c9915M0121k3226j2271j9564L0381o7802L137K7100k4618k0709K0904M7662
16147c8800K3843J390m7238K6605K746k2567k0798K9593M9683L9261j8154p5069
16135d9505j2353k1919o38J0512j3839l091J4393R226M3495k0788M430l7154L8638
16122c8593K6070l4112Q87m819m4316j8160K099J5011L7830j3455J866J0727j2690
16109g1655q183k685L9555K4511j2813l3055l7526k5404O7769K3982K2857O585
16097f062l8092l520k4825P08k0535O24K6179J416K0642m51M197M5148m4151M244
16083c4478N0642L96n5411k8094J0611K1052M247l4645k2878N395q666j992N2988
16070d0833J2091j67N85N619L6615j8587l1332p934j4850K7812N4346j7641J7869
$$ plain form
16159 -39915 206 -23020 -35291 -54855 -24474 -92276 -89139 -62039 -86657 -107366 -86462 -38800
16147 -38800 -14957 -13567 -60805 -34200 -31454 -54021 -74819 -45226 4457 43718 25564 -49505
16135 -49505 -61858 -83777 -84415 -73903 -87742 -90833 -76440 -67214 -23719 -44507 -40077 -77231 -38593
16122 -38593 -12523 -46635 -45748 -50567 -94883 -113043 -110944 -95933 -58103 -71558 -69692 -58965 -71655
16109 -71655 -79838 -82523 -42968 -18457 -31270 -64325 -101851 -127255 -59486 -35504 -12647 -6062
16097 -6062 -44154 -47674 -72499 -71791 -92326 -91702 -65523 -64107 -43465 -43916 -39719 5429 -38722 -34478
16083 -34478 16164 16560 -38851 -66945 -56334 -35282 -31035 -65680 -88558 -83163 -91829 -93821 -40833
16070 -40833 -28742 -28909 -28324 -22705 13910 -4677 -36009 -43943 -58793 -30981 23365 5724 23593
16057B3593K828J2360m2304m5767j5058q499j3825Q6324O8167J4283K2895m2951
16045F2046m577K3871j7257l1920r977O877J7887N543L79j8993m2302J4733M928
16032A1238k4136l8904M203L8304L6965j0477Q05J4744j0109K0896K9038n5949
16020A6618l0295O617k827M6907J2132J8509J1585O702j2649J8782j4815q683
16008F8583J3111j8437l403O077J05991R1194J10380J39862J89504J76975K04004
15997A083841R1768l3547j59935j86570k04239j77070j13129p5427j8044m7421
15987A60227l5885M2662J0517Q197L8033P5752J01211J33444J71672J71964J13437
15976I91231l652j19691q1048j23168j27727j06482q8962j2529k4965L0226L2838
$$ plain form
16057 23593 26421 38781 -3523 -49290 -64348 -72847 -86672 -348 67819 82102 104997 62046
16045 62046 57469 81340 64083 32163 22186 29063 46950 52493 52872 33879 -8423 6310 11238
16032 11238 -12898 -51802 -47599 -9295 27670 17193 17998 32742 22633 43529 72567 16618
16020 16618 -13677 -7060 -9887 37020 49152 67661 79246 85948 73299 92081 77266 68583
16008 68583 81694 63257 59854 65931 171922 263116 373496 513358 702862 879837 1083841
15997 1083841 1175609 1142062 982127 795557 591318 414248 301119 225692 207648 160227
15987 160227 124342 167004 177521 185718 223751 299503 400714 534158 705830 877794 991231
15976 991231 987579 867888 786840 663672 535945 429463 340501 327972 303007 333233 366071
15965C66071P7994R8962M9515M3951Q7151P8434l163m3848n4060q4220o7654q4691
15953D64442o6608k7853m4493r240j927n1819Q215O4751R9921R5266P6089P6627
15941F83371J25750R9658l6740l1153o2081r9645j15925j13695j45652j04326
15931A99562o6097m5339o1826K4531j3437j6479L5646N893k575k2600R461K1182
15919F7922M6163l861n7190J9787k2967k1916j4352K6582k4940j2572l2643j8280
15907d8267N0420J7620L9880k5795j9198K010l3706J2651J1555J9313k4442k4038
15895b1997J2120J9162j5912l492J2625k3648Q013J7225Q911m3564l9205L3559
15883c6203M1551k2882k9240m285J4354k928K0025L9945k9452m4702l3907M3765
$$ plain form
15965 366071 444065 543027 592542 636493 723644 802078 798915 755067 701007 616787 549133 464442
15953 464442 397834 369981 325488 316248 314321 262502 270717 335468 435389 530655 606744 683371
15941 683371 809121 908779 872039 840886 778805 679160 563235 449540 303888 199562
15931 199562 133465 88126 26300 50831 37394 20915 56561 62454 59879 37279 46740 67922
15919 67922 114085 110224 53034 72821 49854 27938 13586 40168 15228 2656 -29987 -48267
15907 -48267 2153 19773 59653 33858 14660 16670 -17036 -4385 7170 26483 2041 -21997
15895 -21997 -9877 9285 -6627 -10119 2506 -21142 -13129 4096 13007 -30557 -69762 -36203
15883 -36203 5348 -17534 -46774 -51059 -36705 -39633 -19608 20337 -9115 -53817 -87724 -43959
15871d3959L8277J895j6021j3401K2040j6456j9042L1401P2686j5258m2328m487
15859d653k2089l5324k8741O8969Q9163J322J3221k5566j228K6116k3265Q788
15847F6713n0511j8549J4803k5965k0913Q810L469j2979K6876K547k4500j3607
15835d3806K8600p207J2857M2282k1717m1455j4718J450l1285J6158J4236k4025
15823f8630J3818K2405L3954k4746j2677J5531j5307J7055j0014j5103N328K0491
15811a7895O595l3537j762j1264K6880n140m0533L6003J2736M091L2173L3150
15799D1497m4417k0623J5279K5967O068M180K203j1269Q601j7331J2708k80N690
15786B8273o6531j5789j0674J5163M5488Q618J4887P94J051k9482k28m8o0657
$$ plain form
15871 -43959 -5682 -3787 -19808 -33209 -11169 -27625 -46667 -15266 57420 42162 -166 -4653
15859 -4653 -26742 -62066 -90807 -21838 67325 68647 81868 56302 55074 81190 57925 66713
15847 66713 16202 -2347 12456 -13509 -34422 -25612 -22143 -35122 -8246 -5699 -30199 -43806
15835 -43806 -15206 -22413 -9556 32726 11009 -30446 -45164 -43714 -74999 -58841 -44605 -68630
15823 -68630 -54812 -32407 1547 -23199 -35876 -20345 -35652 -18597 -28611 -43714 -38386 -17895
15811 -17895 -11300 -44837 -46599 -57863 -30983 -36123 -76656 -40653 -27917 -23826 8347 41497
15799 41497 -2920 -23543 -8264 17703 23771 27951 30154 18885 27486 10155 22863 22583 28273
15786 28273 -38258 -54047 -64721 -49558 -4070 4548 19435 20229 21280 -8202 -8430 -8478 -69135
15773f9135l6902q322M5672N2595N74K0203k66l1406k4269k8636J8503N2692j9159
15760b7856K1802J7861R392M0486j2029q799r835k9718J090J715l1348l6651K4753
15747c9137O8051L1272k6710n068K6260m9405j4477R555j7693l163J7325j980
15735e170K4360K0708K0540k084j8981J1471J7959k2395l6741k3838J5398k009
15723g82j0636l5970J6030K3204L5203j4899l1676L1141M3542j2728J7817l0930
15711B9316l0531m0202L860K5544r223l7254K7243J4579O1864K0756n1185J0234
15699B5001M8218O8501k9879l4178j7930R018M3829J618N6502O121p015k1066
15687A48740l3037o420K4877K2783M3621K8776N0589R0289J29061J39181k571
$$ plain form
15773 -69135 -106037 -114359 -68687 -16092 -15518 4685 4419 -26987 -51256 -79892 -61389 -8697 -27856
15760 -27856 -6054 11807 21199 61685 49656 40857 31022 1304 2394 4109 -27239 -63890 -39137
15747 -39137 28914 60186 33476 28408 54668 5263 -9214 341 -17352 -20515 -3190 -5170
15735 -5170 19190 39898 60438 58354 39373 50844 68803 46408 9667 -14171 1227 -782
15723 -782 -11418 -47388 -31358 -8154 27049 12150 -19526 11615 55157 42429 60246 29316
15711 29316 -1215 -41417 -37557 -12013 -21236 -58490 -31247 -16668 45196 65952 14767 25001
15699 25001 73219 141720 111841 77663 59733 68751 112580 114198 170700 176821 169806 148740
15687 148740 115703 109283 134160 156943 200564 229340 279929 370218 499279 638460 635889
15676F35889o0983n4850r2347j51596j08582J3180k8909M703J5826K0380L4323
15665B27034K8014K3j5008L1447O1122Q5464R8793Q2914L826l4593q8259j28204
15653C52573j19806r8329k5054J5743m8453J5023L976k7146l4264Q060N4180K4184
15641A20687k4542m0261p030M1005P972M8119K8539j2950m2491j6160J8161J3583
15629A34632K7122k5960j0540M130o4657L4287M4459m5260m4657k0217K1054L2463
15617H6856K9524J2574K31M3723J8707k6594O034N296m651k1107J0726l826O165
15604A63658m8262m3288K9643L0544l1834j0928L9769M603K1868K9335j668o469
15592A76971L7719L2886K1903K4628j2683l1325m9187m9408j2286J2910j2183
$$ plain form
15676 635889 574906 520056 427709 276113 167531 180711 151802 156505 172331 192711 227034
15665 227034 255048 255071 240063 271510 332632 418096 516889 599803 603629 569036 480777 352573
15653 352573 232767 134438 109384 125127 76674 91697 95673 68527 34263 42323 96503 120687
15641 120687 96145 55884 48854 89859 97831 145950 174489 161539 119048 102888 121049 134632
15629 134632 161754 135794 125254 129384 64727 99014 143473 98213 53556 33339 54393 86856
15617 86856 116380 128954 129185 172908 191615 165021 171055 176351 171700 150593 161319 157493 163658
15604 163658 115396 72108 101751 132295 100461 89533 129302 133905 155773 185108 183440 176971
15592 176971 214690 247576 269479 294107 281424 250099 200912 151504 139218 152128 139945
15581A39945K0162J9465m2483n1617J5807M9315M3423M8113r77J3255M0314J3260
15569C07982k592k8163m658K4532L6743N2302L3809M8956R3058o4518j20875j22631
15557B53945r3265m8899o8150j3966J0737N3825L9973N3578M3846M295k836J9363
15545B52446L2197J1345K5268L2547M3386j62n8657j37330j33857j00144n1984
15534h4945M885O7541R0647N0672K7386M8400K7792M4642P158k4657n4585k5480
15522A79456n049k3242K5891L5459L1894J3404r641l7175N4476K5260k133n2174
15510B36426L9765M6727Q629J2893n040K0142K4570O044R529k06L4043J4111l0557
15497D17076q892K8852L7985k6884k7212q612J3597O2512J9208K5807L0479L4605
$$ plain form
15581 139945 160107 179572 137089 85472 101279 150594 194017 242130 241153 254408 294722 307982
15569 307982 305390 277227 272569 297101 333844 386146 419955 468911 561969 497451 376576 253945
15557 253945 160680 111781 43631 29665 40402 94227 134200 187778 231624 235919 233083 252446
15545 252446 284643 295988 321256 353803 397189 397027 338370 201040 67183 -32961 -84945
15534 -84945 -80060 -12519 78128 128800 156186 204586 232378 277020 284178 259521 204936 179456
15522 179456 174407 151165 177056 212515 244409 257813 248172 210997 265473 290733 288600 236426
15510 236426 276191 322918 331547 344440 339400 359542 384112 390156 399685 399479 433522 447633 417076
15497 417076 408184 437036 475021 448137 420925 412313 425910 488422 507630 533437 563916 598521
15485E98521M2382N1094O5405P9770K8388Q2004M7626M8923L8665J9660N2121
15474A154559L2370K8664N7073J2001K4652K6757R0432J15599J44461K30928K40637
15463B158133K41681L14182L81832M66499M53179M10806L09675K11419K15328
15454E162734K06142L28756N43689O51174P21426R27777J062271J145376J429470
15445A2178815J785382K168489K736998L603984N114976P638481J1858743J8805057
15437F5890925K8826876L8405634M1060435L0098494O278908j7075249l2622914
15430A60863109l6901506l2234621k4223567j6269188j0136596n949453l163702
15423C1984476j165289M33305K115155M387120P805279J3477838K2313140L2900502
$$ plain form
15485 598521 640903 691997 757402 837172 865560 947564 995190 1044113 1082778 1102438 1154559
15474 1154559 1186929 1215593 1272666 1284667 1309319 1336076 1426508 1542107 1686568 1917496 2158133
15463 2158133 2399814 2713996 3095828 3562327 4015506 4426312 4735987 4947406 5162734
15454 5162734 5368876 5697632 6241321 6892495 7613921 8541698 9603969 10749345 12178815
15445 12178815 13964197 16132686 18869684 22473668 27588644 35227125 47085868 65890925
15437 65890925 94717801 133123435 174183870 204282364 210561272 193486023 160863109
15430 160863109 123961603 91726982 67503415 51234227 41097631 35148178 31984476
15423 31984476 30819187 31252492 33367647 37754767 45560046 59037884 81351024 114251526
15415A14251526L9163583L4739326J5543455q576697k7281827l6231001l4872607
15408I6735758k8062317k0088860j3380548q774827n802717l930394k788196k095940
15400A1811959j591844j299158j137935q95227o76772m20647k97843j59728j98327
15391E134478k41586l13673l54708l80991l70968l58232k83135k37821j80313
15382B413051j61745q9959n2320p7663j27803j45249j33773j29569j18041j05937
15372A270992p2585k7040m5126m9013n6797j4736N2383O3924j7988J8352J67761
15361A290127J91933J97706J13153k3466r1016j46197k17616k14846r2432m3854
15351I63492o3232q4831m4646o226j6378j9169n8754R686M1548R6228J64877J98617
$$ plain form
15415 114251526 153415109 188154435 203697890 195121193 167839366 131608365 96735758
15408 96735758 68673441 48584581 35204033 26429206 20626489 16696095 13907899 11811959
15400 11811959 10220115 8920957 7783022 6887795 6211023 5790376 5492533 5332805 5134478
15391 5134478 4892892 4579219 4224511 3843520 3472552 3114320 2831185 2593364 2413051
15382 2413051 2251306 2161347 2109027 2031364 1903561 1758312 1624539 1494970 1376929 1270992
15372 1270992 1198407 1171367 1126241 1077228 1020431 1005695 1058078 1122002 1104014 1122366 1290127
15361 1290127 1482060 1679766 1792919 1769453 1678437 1532240 1314624 1099778 1007346 963492
15351 963492 900260 815429 770783 764557 748179 729010 670256 679942 721490 817718 982595 1181212
15339A181212J58573Q2660o4072j91725j94098k03770j58762q6410n0818n4110
15329D18680m6268M312L2730K7062l4510p0331p32j0877P317j7836L1990M3237
15317C84774J3726k3855k7708K4108m3099K1160J5208N3435M8821K8108o137o0814
15305D27727l4135m6517k8670J654j9243O578M0756j2503l1306O01L6042o175
15293C34809j5370l9934j3714P0894K5767j5788P507M530k5700n1893q858J1932
15281B84182k6811r0906l2653P955K3425P485j3163j550K1186N3066M3194O5242
15269C40652j8266m4681n0272j5774k9455J901J5803j7290j9054l2523n2894n4269
15257B3878m1645j214K4930j212K3024O9894J07626J9506R149N416l1820o8518
$$ plain form
15339 1181212 1339785 1422445 1358373 1166648 972550 768780 610018 523608 472790 418680
15329 418680 372412 376724 409454 436516 402006 331675 330943 320066 327383 309547 341537 384774
15317 384774 398500 374645 346937 371045 327946 349106 364314 417749 466570 494678 488541 427727
15305 427727 393592 347075 318405 320059 300816 307394 348150 335647 304341 304942 340984 334809
15293 334809 319439 279505 265791 336685 362452 346664 354171 358701 333001 281108 272250 284182
15281 284182 257371 166465 133812 141767 165192 172677 159514 157964 179150 232216 275410 340652
15269 340652 322386 277705 227433 211659 182204 184105 199908 182618 163564 131041 78147 23878
15257 23878 -17767 -18981 5949 4737 27761 97655 205281 224787 233936 239352 207532 139014
15245A39014l5260n8253q0784k3196o057p433n8188L4372L4779K1491N7872n695
15233A2662k9801q922L158K4694L382p980j0791K110k9441m1297n2095m5096P542
15220a71875r378O007J6116N8059M3130n1234n916L9029p230j1476J2347j8525
15208a00946O0131L5636l9157o2656J4202N5659K2644J3339J958m1282r0J9538
15196b1024j5904k276K8324K4125J7040l3496m2958Q529K4533l52m2668k0064
15184g6191k2159M8662l3308N27J4912J7748j0112N313P060J4011P4683K9907
15172G1053l8723r082m847o3629M5376J7514Q412j7307k9317J3261m887M217q99
15159h858k548j8899j4502K6296K4626l5204l0974L793k5k6470l4375j1119J2328
$$ plain form
15245 139014 103754 45501 -35283 -58479 -64536 -71969 -130157 -95785 -61006 -39515 18357 12662
15233 12662 -17139 -26061 -22903 1791 5173 -2807 -13598 -11488 -40929 -82226 -134321 -179417 -171875
15220 -171875 -181253 -175246 -159130 -101071 -57941 -109175 -115091 -76062 -83292 -94768 -82421 -100946
15208 -100946 -40815 -5179 -44336 -106992 -92790 -37131 -14487 -1148 810 -40472 -40562 -21024
15196 -21024 -36928 -39204 -10880 13245 30285 -3211 -46169 -37640 -13107 -13459 -56127 -76191
15184 -76191 -98350 -49688 -82996 -82469 -67557 -49809 -59921 -54608 -47548 -33537 41146 71053
15172 71053 32330 23248 18401 -45228 148 17662 26074 8767 -20550 -7289 -12176 -7959 -8858
15159 -8858 -11406 -30305 -44807 -18511 6115 -29089 -60063 -56270 -56295 -82765 -117140 -128259 -115931
15146a15931R087j6646j7548L4360K1401L1731L1345j0488k1235L1034M7931k2037
15134C004o8974j8980O433M8219K1407q21q042k0702k6951K841q319P742J2973
15121e0170L2609j2419n361K2617o789q45j9289j261L0660K0328K8163J3064K2970
15108G4277k5621r4101j1446Q310K9760N2936J9579l2191m7773k2973K4275N4422
15096B9454M3045m6400J881M703j1515j2351K3122K7803k8713n3719p910N0545
15084A9945J9601k6337L2551L06j3590k4149j7243J5037N2813J4661m2610n5776
15072b4791j2909M831r707k8593j9513M912L6725O8691J7084m7090j4275r333
15060c3968j0163j5587j7537K0562k2816L241N316R07j5685M2059j8961M497N7699
$$ plain form
15146 -115931 -106844 -123490 -141038 -106678 -85277 -53546 -22201 -32689 -53924 -22890 25041 3004
15134 3004 -65970 -84950 -78517 -30298 -8891 -9712 -17754 -38456 -65407 -62566 -70885 -63143 -50170
15121 -50170 -17561 -29980 -35341 -12724 -19513 -20358 -39647 -40908 -10248 10080 38243 51307 74277
15108 74277 48656 -45445 -56891 -48581 -18821 34115 53694 21503 -26270 -49243 -24968 29454
15096 29454 72499 26099 27980 32683 21168 8817 31939 59742 31029 -22690 -30600 19945
15084 19945 39546 13209 45760 46066 32476 8327 -8916 6121 58934 73595 30985 -24791
15072 -24791 -37700 -32869 -42576 -71169 -90682 -85770 -49045 19646 36730 -10360 -24635 -33968
15060 -33968 -44131 -59718 -77255 -56693 -79509 -76268 -70952 -70045 -85730 -43671 -62632 -58135 -436
15047d36l6865r01M4184L7651k824o277m2371N600j2982l3370j6133J0346q585
15034f2963N056k6483K775j0929K7642N7456K9363k1380k5397m4971J6666J9783
15022c3382O17k5862O229L8229L5167J8764j7252K4572R05l4868k7917j7128k39
15009c2165L4925J5445l2871m5087N345K833k0446n569j0434K0484J4425J7338
14997c5777K9355j4985k9830k9530N089N9047O2170L686j5736K5785R3823J28645
14985B81742J39097Q2154n0094p3416o5326o6016r8817j7786m6100j390K3792
14974A07840N791m899n5178l1859J169J6219k5016k3145k733J9174O275l4943
14962b1305p882K5211L9479n8527n1552j990J9357n231K6814k728k564M4692M6624
$$ plain form
15047 -436 -37301 -38202 5982 43633 40809 34532 -7839 -2239 -15221 -48591 -64724 -54378 -62963
15034 -62963 -57907 -84390 -81615 -92544 -64902 -7446 21917 537 -24860 -69831 -53165 -33382
15022 -33382 -32765 -58627 -52398 -14169 20998 39762 22510 47082 47987 13119 -14798 -31926 -32165
15009 -32165 2760 18205 -14666 -59753 -54408 -51575 -72021 -77590 -88024 -67540 -53115 -35777
14997 -35777 -6422 -21407 -51237 -80767 -75678 -16631 45539 49225 33489 59274 153097 281742
14985 281742 420839 502993 452899 379483 314157 248141 149324 131538 85438 84048 107840
14974 107840 113631 108732 53554 21695 22864 39083 14067 -9078 -11811 7363 13638 -21305
14962 -21305 -29187 -3976 35503 -23024 -74576 -76566 -57209 -62440 -35626 -38354 -40918 3774 50398
14949E0398O785n8377m5503m5318k233K1926J2892J3870k6617J4223J3924J1838
14937c2192K8466j3290j0291k3613j7195O1509L2091K0980N2044J3378n9298l2990
14925A9599m5899J2509l467m271L9867j3959M6032K5461j3519K329l1215m575
14913B8892j1042k1003K0525R893J7409M0260K8548o435l9821J2176M1499L1323
14901A52224N2811N5856R7806M4600k7294l4658qr5376n9921r1188l3927N936
14889F6861L3155n355l2538n804L4633K7535K5147K0507O0409M8238O1214K4047
14877C58049l6387m2281k0398k8947m7786Q845O4804N8629L4856J10337K05403
14866F65124K04187J95526R9369M5458j48542k05115j96380j43839j18411q3209
$$ plain form
14949 50398 57183 -1194 -46697 -92015 -94248 -72322 -59430 -45560 -72177 -57954 -44030 -32192
14937 -32192 -3726 -17016 -27307 -50920 -68115 -6606 25485 46465 98509 111887 52589 19599
14925 19599 -26300 -13791 -17258 -21529 18338 4379 50411 75872 62353 64682 33467 28892
14913 28892 17850 -3153 17372 27265 44674 84934 113482 107047 67226 79402 120901 152224
14901 152224 205035 260891 358697 403297 376003 341345 341337 245961 186040 94852 60925 66861
14889 66861 100016 94661 62123 56319 90952 118487 143634 164141 224550 272788 334002 358049
14877 358049 321662 279381 258983 230036 182250 191095 255899 314528 349384 459721 665124
14866 665124 869311 1064837 1164206 1209664 1061122 856007 659627 515788 397377 314168
14856C14168o9033p2692n7243L4244O8121L2445K2295P0329J34271J89187K02169
14845H68261J28627N0741J5007p5890j51642j77122j86253j12799j34842q3596
14835A40492k6656q214J3744l1641j5929K7162k1209R081K5361n6674l8438K7924
14823D5003m1333n1605J1548K5014P354J796l9136J5690M0405J7796J2911p961
14811C7482j2293k3695J6704K5621l057j3621p68L8076p063Q124K4668K6879M0726
14798A57783l910j2176L2386O841j7977J7101K4732M8588O1277K437N000J8581
14786C40663m3177K076j6376j7298k7666o065N1823J7902N4371j4100k5231k7709
14774B89213M919M5442J1600r117L51K2104J6949K1640j1327o7224J3173K4152
$$ plain form
14856 314168 245135 172443 115200 149444 217565 250010 272305 342634 476905 666092 868261
14845 868261 996888 1047629 1062636 986746 835104 657982 471729 358930 224088 140492
14835 140492 113836 105622 119366 87725 71796 98958 77749 86830 112191 55517 17079 45003
14823 45003 3670 -47935 -36387 -11373 -4019 -2223 -41359 -25669 14736 32532 45443 37482
14811 37482 25189 1494 18198 43819 40762 27141 26373 64449 57386 65510 90178 117057 157783
14798 157783 153873 141697 174083 180924 162947 180048 204780 253368 314645 317082 322082 340663
14786 340663 297486 299562 283186 265888 238222 232157 283980 301882 356253 342153 316922 289213
14774 289213 294132 339574 351174 342057 342408 364512 381461 403101 391774 324550 337723 361875
14762C61875j0727l3916o5768q480r492O6720J7773J4494J5256m4080M0826O9693
14750D14174K4411L4975m531o6749n145p3417l602p098l017M1323O0922k7124
14738C85122N016M731k5788m8084m0439m6874j4420J5718j2917l2804l6340p588
14726A45333j2493k989J1470Q586M1678O390J3017j3098N762k6498m856J8665
14714A90967j4888k8818q476j1695j2440j3156k200P211J001j1812M4277L7916
14702A77887M4517j0125J2935k8104j3519j2629j7609L2624p651l3915P169J1731
14690A63311k0918o8261o2270J0602p39J3768L2221K8650j6955n4288k3897R913
14678A1137M0822J5752k5427L9050O2593k5653n6376o3867o5284K2208M138j263
$$ plain form
14762 361875 351148 317232 251464 242984 233492 300212 317985 332479 347735 303655 344481 414174
14750 414174 438585 473560 469029 402280 397135 323718 320116 313018 310001 351324 412246 385122
14738 385122 390138 394869 369081 320997 280558 233684 219264 234982 222065 189261 152921 145333
14726 145333 132840 129851 141321 149907 191585 197975 210992 197894 203656 177158 172302 190967
14714 190967 176079 147261 138785 127090 114650 101494 99294 106505 107506 95694 139971 177887
14702 177887 222404 212279 225214 197110 183591 170962 153353 185977 178326 144411 151580 163311
14690 163311 142393 74132 11862 22464 21725 35493 67714 96364 79409 25121 1224 11137
14678 11137 51959 67711 42284 81334 143927 118274 61898 -1969 -67253 -45045 -40907 -42170
14666d2170o1942k8006m439M4178J5989j8009J2168L3112K9404K979M82K8991
14654A2737j4272M7479j7461j7630O1828k9120k766j8020O2353M8269K410O3752
14642A99559j1918l6453K7l6175n0995j00692p197K1199J8495K4061L016k148
14630B0779K2434K7638k8061p440K3688J6188J253M632M8939M1730J0840m6729
14618A35891p2392m691j770K6623j1793j6390m7211k4569O461j0709j6873k6128
14606f3551J7173J4816j9244J0158j3955M6782l833l1479n001k7625Q290J4013
14594e3456N657q885J6949J6836k0841J0233j4590o85K9841K8685l7768kk61j6634
14580d4921j4615N2423J7729k3658k9131k73L7019j8740l4075r38j2150j4751
$$ plain form
14666 -42170 -104112 -132118 -136557 -92379 -76390 -94399 -82231 -49119 -19715 -16736 -16254 12737
14654 12737 -1535 45944 28483 10853 72681 43561 40795 22775 85128 133397 135807 199559
14642 199559 187641 151188 151215 115040 64045 -36647 -43844 -22645 -4150 19911 22927 20779
14630 20779 43213 70851 42790 35350 59038 75226 76479 81111 130050 171780 182620 135891
14618 135891 63499 58808 57038 83661 71868 55478 8267 -16302 -9841 -20550 -37423 -63551
14606 -63551 -46378 -31562 -50806 -40648 -54603 -7821 -11654 -43133 -48134 -75759 -67469 -53456
14594 -53456 -47799 -56684 -39735 -22899 -43740 -33507 -48097 -48782 -18941 9744 -28024 -28026 -28287 -44921
14580 -44921 -59536 -7113 10616 -13042 -42173 -42446 -5427 -24167 -58242 -59180 -71330 -86081
14568h6081J6581L1811l2650k199o245L1526J5900J620N1553k1711l3920K9300
14556d515J3604L0783k4117J6339P751k2359p92k2022j7546j2841l0583k4845
14544i1143J8898L2621j4215l989R776r773K3970K829k9594J8154O2612J1173
14532C1319m3248l6693J9415J023q437J675r494l049M2628K0881m6555k6388j6678
14519g3601j1847L0795M0009k222j2965p496J1137K4481K9949n723l3972K4770
14507A3315K9890k4026r6755l329J5594L4203N2657k2250o3960k000P722j5955
14495g4894J042O8084K5072j7029o090Q783J1407P279J6116m31q207K9k5616K7100
14481C2645Q946J2865j9495k651j9196l7557o6441l4413o407O4881P8771k6879
$$ plain form
14568 -86081 -69500 -37689 -70339 -72538 -78783 -47257 -31357 -29737 21816 105 -33815 -4515
14556 -4515 9089 39872 15755 32094 39845 17486 16694 -5328 -22874 -35715 -66298 -91143
14544 -91143 -72245 -39624 -53839 -57828 -48052 -57825 -33855 -31026 -60620 -42466 20146 31319
14532 31319 -11929 -48622 -29207 -28184 -36621 -34946 -44440 -47489 -4861 16020 -30535 -56923 -73601
14519 -73601 -85448 -54653 -14644 -16866 -29831 -37327 -26190 -1709 28240 22517 -11455 13315
14507 13315 43205 19179 -77576 -80905 -65311 -31108 21549 -701 -64661 -66661 -58939 -74894
14495 -74894 -73852 -5768 19304 2275 -3815 4968 16375 23654 39770 39339 31132 31161 5545 32645
14481 32645 41591 54456 34961 32310 13114 -24443 -90884 -125297 -131704 -66823 11948 -14931
14469a4931j0292K8712l1245k6052K0348J3566j2202k4416k2733p396K6917R522
14457e0202k4838j8105L8804P0906p29J1633l1417o8811m1348M078M2856j1023
14445g8196l6009K0963O076J8199K3524k211K0588K0321j9207l2353j0838m902
14433g4045L584P1296l8184o771N6248N346R413k3118l0857J1734N9772k5582
14421A8836m2591k3565j6466r333K7449L9701l068p101m5602P05K581P525J0366
14408d0563K1450j4042j0036P9720N694k2730L780p099k9614o767R129J1727k297
14395a648j2098j1972l9487P426J2315L7781K4921L6457n533l4599J1521j5343
14383I741k5747k4099J9530k3354m7254K7481M1901j559j6446P228l800N2442
$$ plain form
14469 -14931 -25223 3489 -27756 -53808 -33460 -19894 -32096 -56512 -79245 -86641 -59724 -50202
14457 -50202 -75040 -93145 -54341 16565 15836 27469 -3948 -72759 -114107 -110029 -67173 -78196
14445 -78196 -114205 -93242 -87166 -68967 -45443 -47654 -27066 -6745 -25952 -58305 -69143 -74045
14433 -74045 -70461 835 -37349 -44120 12128 17474 26887 3769 -27088 -15354 44418 18836
14421 18836 -23755 -47320 -63786 -73119 -45670 -5969 -9037 -16138 -61740 -61035 -58454 -50929 -40563
14408 -40563 -19113 -33155 -43191 36529 42223 19493 23273 16174 -13440 -20207 -11078 649 -1648
14395 -1648 -13746 -25718 -65205 -57779 -45464 -7683 17238 53695 48162 13563 25084 9741
14383 9741 -16006 -40105 -20575 -43929 -91183 -63702 -21801 -23360 -39806 -32578 -36378 16064
14371A6064l490L9378j4911k4971j2849l9580p1623O127K8477J8867L5493J8921
14359d097K6628j1881J30j6175k699J6366L1050n948m1979K5106N6505l5158M424
14346D2272j3579N261m1255p848O10l1070K2188Q05j5924L2913L6071k571o951
14333B0922L0768o519o666o524k3O021M5351J4046r501m1815l3246J2396j3069
14320A2141k391l500o899j6998j9832l630j2636j3260j5521L720J0403L1455J084
14307c5864K202K2941p312k0658O442O3421K2465j6205J4187l5728m9293k1004
14295e4406L5075L1337J0129M117n974J2056L5671k6515k765n938r991Q5893J213
14282A09902L2175p769k2482k8995K6526M7610J7339o1852l7277k7843j9006k4683
$$ plain form
14371 16064 12574 51952 37041 12070 -779 -40359 -111982 -105855 -77378 -58511 -23018 -4097
14359 -4097 22531 10650 10780 -5395 -8094 8272 39322 33374 -8605 16501 73006 37848 42272
14346 42272 28693 33954 -7301 -15149 -14539 -45609 -23421 -22616 -38540 -5627 30444 27873 20922
14333 20922 51690 45171 38505 31981 31958 37979 83330 97376 87875 46060 12814 25210 12141
14320 12141 9750 6250 -649 -17647 -37479 -41109 -53745 -67005 -82526 -78806 -68403 -36948 -35864
14307 -35864 -33662 -10721 -18033 -38691 -32249 31172 53637 37432 51619 15891 -33402 -54406
14295 -54406 -19331 12006 22135 26252 20278 32334 68005 41490 38725 32787 22796 108689 109902
14282 109902 142077 134308 111826 82831 109357 156967 174306 112454 75177 47334 28328 3645
14270C645M6472L1331m1887k8465j0943J3840K1544J1966k62L3389j3768L727
14258G0589o476J3073j5168l6261k9036K1416Q318L6090K6450K8582l8237L761
14246H3101J6361K5538J5115k2114J2765L4497r337J3919L6970J2694k4141j2914
14234A82454j8160m3973N1725Q1970Q1381J9008O8197O7214Q3914J01700R5517
14223G70947J09264J30126K21326K34118J96023J48056J98586J56920P5099K9115
14213B269580n1256j36565j81102k00671k36611k18997k24199j49610j39741j67099
14203E63729o0079o3862l5626j2999o0749q6449N090J5675R898l6808j7787k3994
14191A96039j0272L4279L4355l2333P382J5107J5867j4857j4608l805k7764o2643
$$ plain form
14270 3645 50117 81448 39561 11096 153 13993 35537 47503 47241 80630 66862 70589
14258 70589 64113 77186 62018 25757 -3279 18137 26455 62545 88995 117577 79340 83101
14246 83101 99462 125000 140115 118001 130766 165263 155926 169845 206815 219509 195368 182454
14234 182454 164294 120321 172046 254016 335397 354405 422602 489816 573730 675430 770947
14223 770947 880211 1010337 1231663 1465781 1661804 1809860 2008446 2165366 2240465 2269580
14213 2269580 2218324 2081759 1900657 1699986 1463375 1244378 1020179 870569 730828 563729
14203 563729 503650 439788 404162 391163 330414 243965 249055 264730 274628 237820 220033 196039
14191 196039 185767 220046 254401 222068 229450 244557 260424 245567 230959 227154 199390 136747
14179A36747J0503L4841p391K4339J2803J8640j678p7576j7153J1897j3338j7210
14167A15424J5548J2251K7505J284M771m194j8184j3878k4786n1347L1201n815
14155H9780r090J3630N7799J0038q358m5238k1194K5799J4137J2511o369M4921
14143A78366N978o8812j3413J9877l546o492L2689l28K7720l903P318K354o992
14130A70816J3842k2178L579n813N8850L4943l2874m1196j4485O228J3201N2634
14118B37547J2759k1811M481j7727k5963K2133K7385L4193j0371n0969L46k1939
14106A90064l3661L7167K4808j4374J8611K4233K9136l0704k0316L3023O9252
14095C27239L4601q018l4274m277q627j2284j321k5594J3101O659n763l0410r437
$$ plain form
14179 136747 147250 182091 174700 199039 211842 230482 228804 151228 134075 145972 132634 115424
14167 115424 130972 143223 170728 172012 176783 172589 154405 140527 115741 64394 95595 89780
14155 89780 80690 94320 152119 162157 153799 108561 87367 113166 127303 139814 133445 178366
14143 178366 184344 115532 102119 121996 118450 111958 144647 144319 172039 168136 175454 177808 170816
14130 170816 184658 162480 166059 160246 219096 254039 221165 179969 165484 171712 184913 237547
14118 237547 250306 228495 232976 215249 189286 211419 238804 272997 262626 211657 212003 190064
14106 190064 156403 193570 218378 204004 222615 246848 275984 245280 224964 257987 327239
14095 327239 361840 353822 319548 315271 306644 294360 293039 267445 280546 287205 281442 251032 241595
14082B41595N6007J1369L4920l1371k5985K6604N770Q211J6400M6284o632m2831
14070C40341J800J8150n571o429n7739k1856J3262J3245m0984P432J0633L7343
14058C09627k6768O961K6139k1635l683n173L2051k7739p265o722M932N5748K8401
14045C64874k4615O613j6176p302L653j1822j7365k7461L5257L1325k24l7537
14033B99220L9955K1336q359M3881k3259m0403L941O5768N5076K5348k3748k6249
14021D32507O297J9822O1569L7726k2689O592K7652r120k1195j7942n363l0406
14009D85450j0301l3810l2171j403p5479J6697J743k5780k970R648o730n216J5302
13996C34980K3753k5262q129m8025M8993K4060J3313k3608L802l1279k5342K1289
$$ plain form
14082 241595 297602 308971 343891 312520 286535 313139 318909 327120 343520 389804 383172 340341
14070 340341 342141 360291 354720 348291 290552 268696 281958 295203 254219 261651 272284 309627
14058 309627 282859 289820 315959 294324 290641 285468 317519 289780 282515 275793 280725 336473 364874
14045 364874 340259 346872 330696 323394 327047 315225 297860 270399 305656 336981 336757 299220
14033 299220 339175 360511 352152 396033 372774 332371 336312 402080 457156 482504 458756 432507
14021 432507 438804 458626 520195 557921 535232 541824 569476 560356 539161 521219 515856 485450
14009 485450 475149 441339 409168 407765 332286 348983 350726 324946 321976 331624 324894 319678 334980
13996 334980 358733 333471 325342 277317 326310 350370 363683 340075 343877 312598 287256 308545
13984C08545Q370k8673m6362p154L4607N2185L2056L1L5917M8370l290k5009j9154
13971C90439M0215O9497N2873o002k1069N1267K1504o1368k5418O828j675J5547
13959E32638M4485k2367o680R824N579k2101J783m3731m1555n4081m8571o160
13947C49063N0634N723m2519l4136J7386Q3625l0598o4230L521P6113L6838l0570
13935D20850K592k912k267O7909O6272J8596J0942k0947P6281O6335O6604K9029
13923G99284J370L0661J6535K3795J0454m8283j2049n5793m9256n7383j8423K1857
13911F62769j0520k9144N0098O346K2306K978R238M4535K4376J9439L8478p479
13899H33420M7037Q7846M3203Q4948J14055O2698P681r154j9805n9849l3949r3509
$$ plain form
13984 308545 316915 288242 241880 234726 269333 321518 353574 353605 389522 437892 434602 409593 390439
13971 390439 430654 500151 553024 547022 525953 577220 598724 537356 511938 518766 517091 532638
13959 532638 577123 554756 548076 557900 563479 541378 543161 499430 457875 403794 355223 349063
13947 349063 399697 405420 362901 328765 346151 429776 399178 334948 338469 414582 451420 420850
13935 420850 423442 420530 418263 486172 552444 571040 581982 561035 637316 703651 770255 799284
13923 799284 800654 831315 847850 871645 882099 833816 821767 765974 716718 659335 640912 662769
13911 662769 652249 623105 673203 679549 701855 704833 714071 758606 782982 802421 840899 833420
13899 833420 880457 968303 1011506 1096454 1210509 1273207 1280888 1271734 1251929 1192080 1158131 1064622
13887A064622j31662j12637j37514p6793m0268j4324L8289M5359M3176k6098l260
13876F48890L3653L2085m545k4169k0889K4147P0763P3973M5392K8932K76L6072
13864I44580Q7685R1833N5615L9435o789k0490O304r11Q4117K4997O1396K3982
13852A391754k69O4237K8052M4472K2332L1086N2382L2669r691L9693J3778J541
13840A712036N7240P3600M0022K7464Q0031O4402Q4907R1524P7941J17099Q7302
13829B513568R4324Q6476K7565Q9928P8868P6817J11669J37739J76251J67238
13819C560443R5874J38322J91795K04093J57717J98066K55460K89512L21223K51787
13809E664292K35878K85813L07840K99893L55638L72409L59107L56494M49232
$$ plain form
13887 1064622 932960 820323 682809 606016 565748 551424 589713 635072 678248 652150 648890
13876 648890 682543 714628 710083 685914 665025 689172 759935 833908 879300 908232 908508 944580
13864 944580 1032265 1124098 1179713 1219148 1212359 1191869 1198173 1197262 1281379 1306376 1367772 1391754
13852 1391754 1391485 1455722 1483774 1528246 1550578 1581664 1634046 1666715 1657024 1696717 1710495 1712036
13840 1712036 1769276 1842876 1882898 1910362 1990393 2054795 2139702 2231226 2309167 2426266 2513568
13829 2513568 2607892 2694368 2721933 2811861 2890729 2967546 3079215 3216954 3393205 3560443
13819 3560443 3656317 3794639 3986434 4190527 4348244 4546310 4801770 5091282 5412505 5664292
13809 5664292 5900170 6185983 6493823 6793716 7149354 7521763 7880870 8237364 8686596
13800H686596N65576N71240O22965O93640Q33661R51684J047225J147421J166034
13791A6286042J275930J388502J514239J615701J788190J945023K199198K522052
13783C0534877K829835L355282L941633M626506N422069O366018P619591R071173
13775G3766984J0834497J3071679J5981910J9769113K4511386L0219292L6499032
13768B24653893M1958355M4792358M3310371L6874559K6399351J3318157j116159
13761D30190885j5734461k8972307l8760815m3845110m4246155m0960281l5673400
13754A81998356k9774330k4223994j9534885j5781892j2803192j0485151q732047
13747F0662865p344192o172093n187733m459070l842547l321692k820821k418486
$$ plain form
13800 8686596 9252172 9823412 10446377 11140017 11973678 12925362 13972587 15120008 16286042
13791 16286042 17561972 18950474 20464713 22080414 23868604 25813627 28012825 30534877
13783 30534877 33364712 36719994 40661627 45288133 50710202 57076220 64695811 73766984
13775 73766984 84601481 97673160 113655070 133424183 157935569 188154861 224653893
13768 224653893 266612248 311404606 354714977 391589536 417988887 431307044 430190885
13761 430190885 414456424 385484117 346723302 302878192 258632037 217671756 181998356
13754 181998356 152224026 128000032 108465147 92683255 79880063 69394912 60662865
13747 60662865 53318673 47146580 41958847 37499777 33657230 30335538 27514717 25096231
13739B5096231k068213j819044j559907j380828j228087j155786r94706q57724
13731A4031936p47165o68528o50357n91920n89930n35435m64371m26267m10890
13722H947073l37146l05364k87388k20845j67164j12144j3285m500L1397Q1119
13712G611753P3033j2100m5303p2272j44459k68831k86378l88740m15497l43106
13702E708100l06686l30430l12598k34140k16856j98851k17850k14741r6492o0992
13692C518464p5924j19169p1809n7350j07114r8577o4550j2100j7995o4128l3816
13681B795932K2049K1192R447m7039m9717J00J5682L5246q742J376l2342j07556
13669B655628j21930l0509l0705k4628l5882J9412l674l1571L4171J3057j2299
$$ plain form
13739 25096231 23028018 21208974 19649067 18268239 17040152 15884366 14889660 14031936
13731 14031936 13284771 12616243 11965886 11373966 10784036 10248601 9784230 9357963 8947073
13722 8947073 8609927 8304563 8017175 7796330 7629166 7517022 7503737 7499237 7530634 7611753
13712 7611753 7684786 7672686 7627383 7555111 7410652 7141821 6855443 6466703 6051206 5708100
13702 5708100 5401414 5070984 4758386 4524246 4307390 4108539 3890689 3675948 3579456 3518464
13692 3518464 3442540 3323371 3251562 3194212 3087098 2988521 2923971 2911871 2893876 2829748 2795932
13681 2795932 2817981 2839173 2848620 2801581 2751864 2751964 2767646 2802892 2794150 2795526 2763184 2655628
13669 2655628 2533698 2503189 2472484 2447856 2411974 2431386 2427712 2396141 2430312 2443369 2431070
13658B431070j7255k0822n9338o8707k5729m4593q7342r4738m7876n4627q5952
13647A824091l9077o6433n8700o1485k5199l264R436k2950l9193J0264q099j552
13635A517839j3076j6412m4983j08639j23269o5367r1307n9881j0421j2506j3351
13624I58627n154m9891n4081j2025j0621j0744k2713n6266l1759L8851j24256
13613F19968r8847j5732k2178j9564o1443m2062m2219o7999l0306l0083p096L0638
13601B13077O4982q873m168M6508M321K8316K2427j3591M0793J3722k1404p5068
13589C11042J7915J0249M999l0759N190J6138K4544M91Q681L4639j4627k8805
13577C59697j4095j891k9003k9657o5213m7653L737p6283J0454K5786r768L991
$$ plain form
13658 2431070 2413815 2392993 2333655 2264948 2239219 2194626 2107284 2012546 1964670 1910043 1824091
13647 1824091 1785014 1718581 1659881 1598396 1573197 1569933 1579369 1556419 1517226 1527490 1519391 1517839
13635 1517839 1504763 1488351 1443368 1334729 1211460 1146093 1054786 994905 984484 971978 958627
13624 958627 953473 903582 849501 837476 826855 816111 793398 737132 705373 744224 619968
13613 619968 521121 505389 483211 463647 402204 360142 317923 249924 219618 189535 182439 213077
13601 213077 278059 269186 265018 311526 315847 344163 366590 352999 393792 407514 386110 311042
13589 311042 328957 339206 344205 313446 318636 334774 359318 359809 368490 403129 388502 359697
13577 359697 345602 343711 314708 285051 219838 172185 175922 99639 110093 135879 126111 130102
13565A30102K691j6533k7936k4956L2774O0404J8618L1412r768k2981m1175j7976
13553A14676J6249p452j3318K1467O1315j7199M5824N28m3005k6075j6689q581
13541A27740K0134J1142k3286J5937J8578l0732m2315n5323Q66L6278P3225R9039
13529B51283q820j9901J2105p854J3100K5399j9970k051j7159o5500m8833M9871
13517A61670K9733K8613l2800l9473k2461K5206l113K455M960o304J9455L3448
13505B01389L1520m0018q980J2081j2028P486l2204J2860J8920J9995K2357o1283
13493A72095l656L266m7145L2251O7861k1651l1647R857L0789j2747n1888j1350
13481A36035K5676J9875k6623k1491J409j6446K2221O176l9743J7835J8830J4384
$$ plain form
13565 130102 132793 116260 88324 63368 96142 156546 175164 206576 196808 173827 132652 114676
13553 114676 130925 123473 110155 131622 192937 175738 221562 222090 179085 153010 136321 127740
13541 127740 147874 159016 135730 151667 170245 139513 97198 41875 42741 79019 152244 251283
13529 251283 242463 222562 234667 226813 239913 265312 245342 243291 226132 160632 111799 161670
13517 161670 191403 220016 187216 147743 125282 150488 147375 149830 154790 148486 167941 201389
13505 201389 232909 192891 183911 195992 183964 191450 159246 172106 191026 211021 233378 172095
13493 172095 168439 171705 124560 156811 224672 203021 171374 181231 212020 199273 147385 136035
13481 136035 161711 181586 154963 133472 134881 118435 140656 146832 107089 124924 143754 158138
13469A58138Q227l8356M2181j5145m9339k533o218K316L4587K8086k1668j8930
13457A21346m085j7219l3142L8945J8179p320m0717m0144J2888L3142R056l741
13445H7188j6794o148m9155K6815N3499M2568J2772m9197n1304k754K6467j6564
13433E7393M0320K8590j1013q702j1395n498J0252p594L7528O6742P858m6303
13421A58178j8573m5972n193p074j3088Q927J7660K2460j0565R824j6398k1421
13409G8765j2556k3120l0537j942L3369L1149j6463l317K9077O1259q768k877
13397A34039k1460m0853J296M2736j5910r016N5827J1294l4738j0527L749o260
13385A10177n3866k1848J2716Q771j262K5987k6597n1907j2017K8383R463L868
$$ plain form
13469 158138 166365 128009 170190 155045 105706 103173 96955 99271 133858 161944 140276 121346
13457 121346 117261 100042 66900 105845 124024 116704 75987 35843 48731 81873 90929 87188
13445 87188 70394 64246 15091 41906 95405 137973 150745 101548 50244 47490 73957 57393
13433 57393 97713 126303 115290 106588 95193 89695 99947 92353 129881 196623 204481 158178
13421 158178 139605 93633 88440 81366 68278 77205 94865 117325 106760 116584 100186 78765
13409 78765 66209 43089 12552 10610 43979 75128 58665 55348 84425 145684 136916 134039
13397 134039 112579 71726 73022 115758 99848 90832 146659 157953 123215 112688 116437 110177
13385 110177 56311 34463 47179 55950 54688 80675 54078 2171 -9846 18537 28000 31868
13373C1868l7407L5993N8119P5587J7060o9188k0427Q332l8588q129J2325K4117
13361H9662M6141n727n2390J2466j649Q651M0747q416l3424L7239l4187k7853
13349G1260k212J6564K0377J7068j9217j8517j3058j0774N33L3823L1959j9444
13337A08362j4625J0164L9224j1990k5539J0363l584R948L4168P669K637l3525
13325A33272mM0785P0989N1331R936M1143P8115O9856O7132O9352J1261O6607
13313G09775N3894J37869K12784J93093K12030K22254K08143K04763K11476R8314
13303B464395M1179n5075j52015k31933k58707k47185k17537j79976j57085r3956
13293I12105j44294j23343n1818j27773o8425p839J1143n691j7641j9622k7097
$$ plain form
13373 31868 -5539 30454 88573 164160 181220 112032 91605 99937 61349 53220 65545 89662
13361 89662 135803 130076 77686 90152 88503 97154 137901 129485 96061 133300 99113 71260
13349 71260 69048 85612 105989 123057 103840 85323 72265 61491 62024 95847 127806 108362
13337 108362 93737 103901 143125 131135 105596 115959 112375 122323 156491 164160 166797 133272
13325 133272 133268 174053 245042 296373 306309 347452 425567 495423 562555 631907 643168 709775
13313 709775 763669 901538 1114322 1307415 1519445 1741699 1949842 2154605 2366081 2464395
13303 2464395 2505574 2450499 2298484 2066551 1807844 1560659 1343122 1163146 1006061 912105
13293 912105 767811 644468 592650 464877 396452 388613 399756 394065 376424 356802 329705
13282C29705q4870m6441k8948l5425q232N5040n816K0674k127M1477l824o3177
13270A68036k2866j221K7401J6390R068o9071p3945K8172M0811l2636j6688J8241
13258I1692j3270M1617K9340M253k2847J6067L4196J1625K120k3133l9816m2794
13246H9050m012n155j7370O1134k3295J3018k6210l418k3119j3784m0652K0816
13234B7003O1225M4504k0449l1327K0701N9873P052J5335l0002m1188J5308J2523
13222A40558m1070P719O078J2042m1208L1674M3446Q992j6906l3101m3688j872
13210G2664j7206m7574K0008P7648L2175K4131r277L2601j5773q010m3958o726
13198A10703j3167k121L3151Q36L4353j8541k414j7406K7930n445Q439K8685L7685
$$ plain form
13282 329705 244835 198394 169446 134021 125789 180829 175013 195687 193560 235037 231213 168036
13270 168036 145170 143949 171350 187740 196808 127737 53792 81964 122775 90139 73451 91692
13258 91692 78422 120039 149379 153632 130785 146852 181048 192673 194793 171660 131844 89050
13246 89050 85038 79883 62513 123647 100352 113370 87160 83742 60623 46839 6187 27003
13234 27003 88228 132732 112283 80956 101657 161530 168582 183917 153915 112727 128035 140558
13222 140558 99488 107207 113285 125327 84119 115793 159239 168231 151325 118224 74536 72664
13210 72664 55458 7884 27892 105540 137715 161846 152569 185170 169397 161387 117429 110703
13198 110703 97536 95415 128566 129402 163755 145214 142800 125394 153324 147879 156318 185003 222688
13185B22688K4800K3751P4139J03287J12021O9835K5956k7912l0570r0567j06980
13174D00448p6024o8569m289n7483k2584J6539j5117j6794L1774J1712p875j0909
13162A80829k2563m180M7495j796p134J4805J4711P551k2506l8181M1534K8456
13150B39021m3230m6483k5009j3049J6307J3288M1041N2829L3664J1737P7222
13139C57338J11179J36792K47353L52478L54418K00643o6600k27502k79307l11499
13129H75293k52838j48539p8020k4849k8613o1136m2096j0838l1938m1028j0612
13118A44786M498j8771k1685J3874J6108K7796J2483o488m1505j1925Q858K8972
13106A57001N270K5684K9796m840J1210j7811n0899J7173K9581m211M4910L0326
$$ plain form
13185 222688 247488 271239 345378 448665 560686 630521 656477 628565 597995 507428 400448
13174 400448 324424 255855 251566 194083 171499 188038 172921 156127 187901 199613 191738 180829
13162 180829 158266 154086 201581 199785 192651 207456 222167 229718 207212 169031 210565 239021
13150 239021 195791 149308 124299 111250 127557 140845 181886 234715 268379 280116 357338
13139 357338 468517 605309 852662 1205140 1559558 1760201 1693601 1466099 1186792 875293
13129 875293 622455 473916 395896 371047 342434 281298 239202 228364 196426 155398 144786
13118 144786 149284 130513 108828 122702 138810 166606 179089 172601 131096 119171 128029 157001
13106 157001 162271 187955 217751 212911 224121 206310 155411 172584 202165 197954 242864 273190
13094B73190J00020J90442K50838K88789L51323K52779M3708j92952k64753k86452
13084A006932k53190k34519j28379n3574l9116l9033l5021K8817J864k6263o0153
13073A68365m6031L0806O7270K105O403L0314P2421J4534p439p2116m1916j6422
13061B08294n3111n242k9642l303J3154n6421l6103K5141N2237J346L1442J5849
13049A63641J0030P840N1573N4515R8269J05343O6047n4292j15900q8345k3208
13038B75513k2271n8098n5977n7318q0080n724K8000R362N713q561L8852O946
13026G6357k9206P6493J15681L9353M1549P782p7902p9127l7568l2618k7848K638
13014G5584j7417R06J0692J5508k5519J8311k0893k3871L705R878K7126K679l9975
$$ plain form
13094 273190 373210 563652 814490 1103279 1454602 1707381 1751089 1558137 1293384 1006932
13084 1006932 753742 519223 390844 337270 298154 259121 224100 252917 254781 228518 168365
13073 168365 122334 153140 220410 222515 228918 259232 331653 346187 338748 266632 224716 208294
13061 208294 155183 149941 120299 116996 130150 73729 37626 62767 115004 116350 147792 163641
13049 163641 173671 181511 233084 287599 385868 491211 557258 502966 387066 298721 275513
13038 275513 253242 195144 139167 81849 1769 -3955 24045 33407 39120 30559 69411 76357
13026 76357 47151 123644 239325 278678 320227 328009 250107 170980 133412 100794 72946 75584
13014 75584 58167 59073 69765 85273 59754 78065 57172 33301 37006 46884 74010 76689 36714
13001C6714k4059l0918R994K235R22k0594P618M5863J2851M4249P792J7612l6312
12988G3967m6460l9782j7417K2357n68j4088L5226L8818K7673M267N3120O4486
12976B01599n9528n3237j354m7468o3494o4687M9180O8456L6778L0081M3040J400
12964A40766l6156n4098l1964L0069J0632L9514M369j879l4664k4315m76J3230
12952E5028j4468m3515J0321j8107M2124M6031j0444J9940J488o081k2107N5448
12940A15658L5725k6008k4857k3113n3981j3921L9804J2174J4854K4038j2782
12929H7591j7153q477j0223n9037K8800J3481m4104o683K9065m314q59j9887N9554
12916D7754J5477k5215l6390P103K5979L6016J0286J148k689L0088N4554j3880
$$ plain form
13001 36714 12655 -18263 -8269 -6034 -5112 -25706 -18088 27775 40626 84875 92667 110279 73967
12988 73967 27507 -12275 -29692 -7335 -7903 -21991 13235 52053 79726 83993 137113 201599
12976 201599 142071 88834 87480 40012 -23482 -88169 -38989 29467 66245 96326 139366 140766
12964 140766 104610 50512 18548 48617 59249 98763 103132 101253 66589 42274 41798 55028
12952 55028 40560 -2955 7366 -10741 31383 77414 66970 86910 88398 82317 60210 115658
12940 115658 151383 125375 100518 77405 23424 9503 49307 61481 76335 100373 87591
12929 87591 70438 61961 51738 -7299 21501 34982 -9122 -15805 13260 8946 8087 -11800 47754
12916 47754 63231 38016 1626 8729 34708 70724 81010 82158 79469 109557 164111 150231
12904A50231l1161r285m6245n7411m3269N738L2113L4102R049L7405L8323R650
12892A29240j0404m1977l6311K4463j0838K3008l1598l7353p246l3726k7845N5082
12880e505J021J7333J5317Q080k8126N1029J263o614J0978O4148j1721k2626k1154
12867G3423l4663M3041l4921P724J9151l154j8445m642K2907K2702M1159Q708
12855A42990O120j5338J8926j742l076j1552j7851n0675J2475K0070J524r691
12843I2180p093J4008L011j2825L2335M2272l6944n1590K6431O2226N5086k2353
12831A96744k3774l1873j0193M7617K8535j8142m9217p7638m9816J7915R927K041
12819D2126k0406R000l4770L4077J9346N587P262j0003k0141j9671m3504k5138
$$ plain form
12904 150231 119070 109785 63540 6129 -37140 -31402 711 34813 43862 81267 119590 129240
12892 129240 118836 76859 40548 65011 54173 77181 45583 8230 984 -32742 -60587 -5505
12880 -5505 -4484 12849 28166 36246 8120 59149 60412 53798 64776 128924 117203 94577 73423
12867 73423 38760 81801 46880 54604 73755 70601 52156 47514 70421 93123 134282 142990
12855 142990 149110 133772 152698 150956 147880 136328 118477 67802 80277 100347 101871 92180
12843 92180 85087 99095 102106 89281 121616 163888 126944 75354 101785 164011 219097 196744
12831 196744 172970 141097 130904 178521 207056 188914 139697 62059 12243 30158 40085 42126
12819 42126 21720 30720 -4050 30027 49373 54960 62222 52219 32078 12407 -31097 -56235
12807e6235m6169L1982K1427o837J3931M4816J5253k5347j175L4010N4577j2167
12795F8066j8146m0312j9775K1710J8017j514L267j679j0381j9187l9362j4436
12783e3732N6496M3133k0954j6549Q5684n50l9714n6856m9161L3161K5698J0448
12771A7104j9793j0344J1953p290k0688j8460k4767N8857K8471K4569k4692l1035
12759a6115j1833J3999K4584m3706m3878J2308J5392L6137O844L2636K5941m2929
12747I380r382j2651m2458M990N924K3414L9641N437l0414n702l9735L5451N5716
12734C9611K3398j8736M1561J3286K9717k2422j463k0434l9951o1446q833O446
12722a9266n189m0145J8122L7187L7597k3906l9796L5581L8081p588l5364J9047
$$ plain form
12807 -56235 -102404 -70422 -48995 -55832 -41901 2915 18168 -7179 -8354 25656 80233 68066
12795 68066 49920 9608 -10167 11543 29560 28046 31313 29634 19253 66 -39296 -53732
12783 -53732 2764 45897 24943 8394 94078 93528 53814 -3042 -52203 -19042 6656 17104
12771 17104 -2689 -13033 -1080 -8370 -29058 -47518 -72285 -13428 15043 39612 14920 -16115
12759 -16115 -27948 -13949 10635 -33071 -76949 -64641 -49249 -13112 -6268 26368 52309 9380
12747 9380 -2 -12653 -55111 -50121 -44197 -20783 18858 24295 -6119 -11821 -51556 -16105 39611
12734 39611 63009 44273 85834 99120 128837 106415 104952 84518 44567 -16879 -25712 -19266
12722 -19266 -24455 -64600 -46478 -9291 28306 4400 -35396 185 38266 30678 -4686 14361
12710A4361M5092N270j4679j796j1654l0740K9186n633j7044j9960K0722K0199
12698C3324k1309J7274J8989J2791N597k0516k941J0020L1980K4774j6375j5954
12686G7654r981J0669L7132j9448l8296n9545k9986m896L9828K7370K2959k4438
12674B9022J8832M981k0684k972n094m8210L2256J2622n428K8607L7955N0956
12662A32843J6313P7591J18900L7038P316q348m4887k1018q5636j3549L7621l3881
12650B20303l2297k5140l0404j2278j9342J3550m437j9516j5584n9060l8197j8356
12638d0758m743K8570J1141l676J2987M2738k936n2108K2394N1733j9010k6201
12626B0131J0600N7576q760m2644K5079N0158j6991l1100K2394L2505M4050p3437
$$ plain form
12710 14361 59453 64723 50044 48248 36594 5854 35040 29407 12363 -7597 13125 33324
12698 33324 12015 29289 48278 61069 66666 46150 43209 53229 85209 109983 93608 77654
12686 77654 67673 78342 115474 96026 57730 -1815 -31801 -36697 3131 30501 53460 29022
12674 29022 47854 52835 32151 29179 24085 -24125 8131 20753 15325 43932 81887 132843
12662 132843 149156 226747 345647 382685 390001 381653 336766 315748 230112 216563 254184 220303
12650 220303 188006 162866 132462 120184 100842 114392 109955 90439 74855 15795 -22402 -40758
12638 -40758 -45501 -16931 -5790 -9466 3521 46259 43323 -8785 13609 65342 46332 20131
12626 20131 30731 88307 79547 36903 61982 112140 95149 64049 86443 118948 162998 89561
12614H9561n2829q206j6179R249K5188J2277L3581k5921p750K9159L7065m5363
12602G9832m5477N1L7538k28j0453j2091n4509j5827J3595K2316J1557R364J6120
12589E1788j0681R320m2395N768L0255L8176l4802o0264k1595M6056N5061p064
12577E9623m5443k3156k9389j9637N6292P0081K5101J3910l7213l4057o2647m2208
12565f8743P551M3309L0526R745k3061J6890N7836n134n3449l2942l1881J2861
12553c6492O2348p40J6780L5335j4382o465n163K0082K6753j3293J0165j8870
12541G6058L29K4599K4521k8636l5116m6543k679L8984K1970k6715J2164J8134
12529G7070K7209L6442j1280l061l5895o5733M211J9129Q864q351L3217j0748
$$ plain form
12614 89561 36732 28526 12347 21596 46784 59061 92642 66721 58971 88130 125195 79832
12602 79832 34355 34406 71944 71716 61263 49172 -5337 -21164 -7569 14747 26304 35668 51788
12589 51788 41107 50427 8032 13800 44055 82231 47429 -12835 -34430 11626 66687 59623
12577 59623 14180 -8976 -38365 -58002 -1710 68371 93472 107382 70169 36112 -26535 -68743
12565 -68743 -61192 -17883 12643 22388 -673 16217 74053 68919 15470 -17472 -49353 -36492
12553 -36492 25856 25116 41896 77231 62849 56384 51221 71303 98056 84763 94928 76058
12541 76058 76387 100986 125507 96871 61755 15212 12533 51517 73487 46772 58936 77070
12529 77070 104279 140721 129441 126380 90485 24752 28963 48092 56956 48605 81822 71074
12517G1074k4717j5441r873j8135O855j363J2046K1411K4018K6602j4137j7329
12505F1011K4273K9810n085r836j6106M0230m1510j015L0677j4371O4168K8423
12493A90669j8471l3508J3549J8691j3301k2966o2619l0693K9427j6751k6590
12482B7437p021J0045J5948l859m7918p840M2506K5369j1466L1418K3276j255
12470I6640m8480j0114n189L8533L7467l350m2326m2031n630J8402j5493L0636
12458D9065J3203l1809M416j1042J7097J8831J0586J1301j8335k7842l117N8965
12446I1319O4858K0371m0683k7810n2901N4480K0202J220J3824j3202O489k6763
12434A11404m9073L5233R215j9981j8697J2366K2331k9725k3400N0523N4201P812
$$ plain form
12517 71074 46357 30916 21043 2908 9763 8400 20446 41857 65875 92477 78340 61011
12505 61011 85284 115094 110009 100173 84067 124297 82787 81772 112449 98078 162246 190669
12493 190669 172198 138690 152239 170930 157629 134663 72044 41351 70778 54027 27437
12482 27437 20416 30461 46409 42550 -5368 -13208 29298 54667 43201 74619 97895 96640
12470 96640 48160 38046 32857 71390 108857 105507 63181 21150 15520 33922 18429 49065
12458 49065 62268 30459 34875 23833 40930 59761 70347 81648 63313 35471 32354 91319
12446 91319 156177 176548 135865 108055 55154 109634 129836 131056 144880 131678 138167 111404
12434 111404 62331 97564 106779 86798 68101 80467 102798 73073 49673 100196 154397 162209
12422A62209q8985k6101l0460K3935J6572k6579r066J4706K1451L4896N8121q259
12410A42440m2571O350J3227K3627Q152q288O671J4948o2280J6314p210j5472
12398I5908j6507j8779l6143j0052k386k1248j2832J1628N879M8621R7263K5893
12386A67245j5375Q500J768k9979k6188n1654l7357K5914j1860R070L6939n678
12374G1345k347K4438P906o7138k2744K8270J2581L9308L0867j3817j7119r739
12362H1811N124k3427K9006k6383K507J041K0681K0013k5243l4690l3094J531
12350A8877K3986K1084N2003M4774k0961l8042J353K1864l8600K2113M7111J0345
12338A65907q66k486M8239k0687k185m013m4330J0259K8995N2617N7706k6292
$$ plain form
12422 162209 73224 47123 16663 40598 57170 30591 21525 36231 57682 92578 150699 142440
12410 142440 99869 106219 119446 143073 151225 142937 149608 164556 102276 118590 111380 95908
12398 95908 79401 60622 24479 14427 12041 -9207 -22039 -10411 -4532 44089 141352 167245
12386 167245 151870 160370 162138 132159 105971 54317 16960 42874 31014 40084 77023 71345
12374 71345 68998 93436 101342 34204 11460 39730 52311 91619 122486 108669 91550 81811
12362 81811 86935 63508 92514 66131 68638 69679 90360 110373 85130 50440 17346 18877
12350 18877 42863 63947 115950 160724 139763 101721 103074 124938 86338 108451 155562 165907
12338 165907 165041 162555 210794 190107 187922 183909 139579 149838 178833 231450 289156 262864
12326B62864Q223m7996r0123r821p648K4804J4539l6260K1178L0898K0330O6709
12314B57697J1804m9485o8058M264P1170Q214n8007k7049J8622j2513N3834M967
12302B15460k3206k2449P680k9394r369K8216o98J5286q527L3304l0480o222k6334
12289A43267j3K6996k0370m1405l5104l8816l3038l6448O2565L2962k2838o700
12277C1058K0315N0394J116K4304L1764N574r960L4246j9041l7920p0743k1178
12265C9929K2258L5482K0082K222j9531o529k2838J4444k3917K3328K4369n5399
12253E3900l183J5320R619N9616J6953m5601Q730J5749j4759k7927J1414K1754
12241A21585R205l933R456J2612N5601N0591L4108J59q053J2327M3809J2228l4346
$$ plain form
12326 262864 271087 223091 132968 123147 115499 140303 154842 118582 139760 170658 190988 257697
12314 257697 269501 220016 151958 156222 227392 235606 177599 150550 169172 156659 210493 215460
12302 215460 192254 169805 177485 148091 138722 166938 166240 181526 172999 206303 175823 169601 143267
12289 143267 143254 170250 149880 108475 73371 34555 1517 -34931 27634 60596 37758 31058
12277 31058 51373 101767 102883 127187 158951 164525 154565 188811 169770 131850 61107 39929
12265 39929 62187 97669 117751 119973 100442 93913 71075 85519 61602 84930 109299 53900
12253 53900 50717 66037 75656 135272 152225 106624 115354 131103 116344 88417 99831 121585
12241 121585 130790 126857 136313 148925 204526 255117 289225 289384 281331 293658 337467 349695 315349
12228C15349l2614k4382k1951L2818L3917O2479R6002L2663j3303n5681k1927
12217D03370M087j6216N5525K4980m5835k0807j6840M8728J8732m6483J2117k9032
12205C92326k5855K4132Q7306J9121o6231l4802K13k7566J425r909K9090J4348
12193D03598M6098P749k9441m6349m5119k0471J5142L4891k1143m4332P396j5053
12181B92966l9952o2880J3442n0286k8304N0213K7602m753J1009l4364l7952l7287
12169I9454J836L534M3779J8839j5655L5951N879l3902J6280J5986p560n3456
12157A30965M71J5491j3970j6426O0518N3120K2191o6038l0322o03m4935l5670
12145G4792J4988N4332J3453k0470o0855j6464j0736L5862K9934Q99J5661L7169
$$ plain form
12228 315349 282735 258353 236402 269220 303137 365616 461618 494281 480978 425297 403370
12217 403370 407457 391241 446766 471746 425911 405104 388264 436992 455724 409241 421358 392326
12205 392326 366471 390603 477909 497030 430799 395997 396210 368644 370069 360160 389250 403598
12193 403598 449696 457445 428004 381655 336536 316065 331207 366098 344955 300623 308019 292966
12181 292966 253014 190134 203576 153290 124986 175199 202801 198048 209057 174693 136741 99454
12169 99454 101290 104824 148603 167442 151787 187738 193617 159715 175995 191981 184421 130965
12157 130965 131436 146927 132957 116531 177049 230169 252360 186322 156000 155397 110462 74792
12145 74792 89780 144112 157565 137095 76240 59776 49040 84902 114836 115735 131396 168565
12133A68565K4329n983l4541j4684k4928n3857K2221N6213J5367K4331N8349J9971
12121B55353m3818m2120M025L6458j4316m4070j9870K3412J3498k4752k0288P096
12109A30608J0100j4967k9217k3265O622j352k3624r282l5690l9007K2830N4822
12097D8578L6330l8230l2737J2877M9321m910L618K5570j8397M1347J2917J9551
12085A55835L2105J4541L4491n5194p9492K7330J621J0753q276l2033r111J2313
12073A04883J8630k3852R55P5487J9194n1265J4115p251L1109O8553m083l4067
12061B12408J6534O179l0278M018N4347N48j6881K2340O7452j64K9643j1529n6639
12048B97978k8277K8692M0609J9256j376n4226o2767p409j497L9205J0138J9982
$$ plain form
12133 168565 192894 186911 152370 137686 112758 58901 81122 137335 152702 177033 235382 255353
12121 255353 211535 169415 173440 209898 195582 151512 131642 155054 168552 143800 123512 130608
12109 130608 140708 125741 96524 73259 79881 78529 54905 45623 9933 -29074 -6244 48578
12097 48578 84908 46678 13941 26818 76139 71229 74847 100417 82020 123367 136284 155835
12085 155835 187940 202481 236972 181778 102286 129616 131237 141990 133714 101681 92570 104883
12073 104883 123513 99661 100616 176103 195297 144032 158147 150896 182005 250558 246475 212408
12061 212408 228942 235121 204843 208861 263208 263756 246875 269215 336667 336503 366146 354617 297978
12048 297978 269701 298393 339002 358258 356882 302656 239889 232480 230983 270188 280326 300308
12036C00308j3120p7599j2616L0067L7275M9897k5048k4963j7824j4423j669l6126
12024A94159m8155q623N4257L0289l4175m912l7524n0401K7537N9470n237n1383
12012A25302k2067j9053p027K0327o743m14j9623j3453K1947L4248L4947L2694
12000A81085l0845J3286J8873J6391l28q442K8898K5019J9665m721j3348l2960
11988B12573Q539L1975J4563L3993k295l1552l3122n741k1694K366L9129K492
11976B51226q196p14r712j5033K979m734O2857N4019L8615L9898k039M2707M8011
11963D99884L1482j0214l5445n7132J516P2866j1508l0232N160L9378K0704J5799
11951E42258J3418P1563N5536M1459p9l1403o527L5979n3086p567K7825q136o7201
$$ plain form
12036 300308 287188 209589 196973 227040 264315 314212 289164 264201 246377 231954 230285 194159
12024 194159 146004 137381 191638 221927 187752 182840 145316 94915 122452 181922 176685 125302
12012 125302 103235 84182 77155 97482 90739 90325 70702 57249 79196 113444 148391 181085
12000 181085 150240 163526 182399 198790 198462 190020 218918 243937 263602 258881 245533 212573
11988 212573 221112 253087 267650 301643 299348 267796 234674 228933 207239 209605 248734 251226
11976 251226 243030 242316 232604 217571 220550 215816 278673 332692 371307 411205 409166 451873 499884
11963 499884 531366 521152 485707 428575 430091 502957 491449 461217 466377 505755 526459 542258
11951 542258 555676 627239 682775 724234 724155 692752 686225 722204 669118 661551 689376 681240 614039
11938F14039l1473l3382L1454K0529k0804l2305m2706j4781q626M614k0714J3181
11926D79026q137K2328M036n89J499p3575n9627k2684K4254L25J3893k7604m974
11913C48171K3991j8092K393J8540L7090j2619p918l4018k4063k8101k1616p776
11901B75982L9597J6295j1505k7047j349n122k5020J7413m790Q579m830L598m7047
11888B34754m0414m4467j4565J2325K7011K2706M6157L8638J7114J1777J4161
11877C25197P723N8103O582j5035j1872J6931K6593J9308j3702p346L9440l4961
11865D16961k6962l8452K6434K3158r989q44n532k0953M490O1513l598l1468j931
11852C92827j0439p443K425q111M7148n163k7864m5394l1968K7787K1623J6080
$$ plain form
11938 614039 582566 549184 580638 601167 580363 548058 505352 490571 481945 486559 465845 479026
11926 479026 470889 493217 497253 496664 498163 424588 364961 342277 366531 366856 380749 353145 348171
11913 348171 372162 354070 356463 375003 412093 399474 391556 357538 333475 305374 283758 275982
11901 275982 315579 331874 320369 293322 291973 286851 261831 279244 274454 283033 278203 281801 234754
11888 234754 194340 149873 135308 147633 174644 197350 243507 282145 299259 311036 325197
11877 325197 332920 391023 397605 382570 370698 387629 414222 433530 419828 412482 451922 416961
11865 416961 389999 351547 377981 401139 391150 390306 384774 363821 368311 429824 426226 394758 392827
11852 392827 382388 374945 377370 369259 416407 411244 383380 337986 306018 333805 355428 371508
11840C71508K8386K9023J8870j949R786j0770j8523k6380J4426J816M8253L4590
11828D99036l3668m1805l6773k3049J143p53k6779O344O0209j5718m5445K2393
11816C65135K1656n2814o0237j0586k2072k0282k3835L370n032l6587L2653J8408
11804B09777L0038M0518j0886j4059p057K0602o041l6280o239K0201K4998J0575
11792B76147n6414k5194l9395L5610N7030k0152j9706J6934j785K2739L4200r592
11780B70422k7598k7492q311J0420j2341n2879n6626J083J9399J8787O4572m377
11768A95059J3471K6550L0384n2737J7248L4316O273K433m5440m025K9190r99
11756B51723O523J6492n028j4299k4034r060R4051M2992l3496n8672l1428j2179
$$ plain form
11840 371508 399894 428917 447787 445838 455624 444854 426331 399951 414377 416193 464446 499036
11828 499036 465368 423563 386790 363741 364884 364131 337352 343696 403905 388187 342742 365135
11816 365135 386791 333977 273740 263154 241082 220800 196965 200335 195303 158716 191369 209777
11804 209777 239815 280333 269447 255388 248331 268933 262892 226612 220373 240574 265572 276147
11792 276147 219733 194539 155144 190754 247784 227632 207926 224860 223075 245814 280014 270422
11780 270422 242824 215332 207021 217441 205100 152221 95595 96678 116077 134864 199436 195059
11768 195059 208530 235080 265464 212727 229975 264291 270564 272997 227557 223532 252722 251723
11756 251723 258246 274738 269710 255411 231377 222317 316368 359360 325864 267192 235764 223585
11744B23585K3649J8250J5660o472J2491j3219M5032k0479k0125j7586K4018J7449
11732C02253L9323J7429j260k2396k6873j6841K3580J9222M6132K5138j2404m2854
11720C50449p1457j1058M6248L255j7217l8298k0268l1252K4550J0014J7419J0526
11708B72911q061J9437M6249l802l8042J7662p60j898J5442K032O329K7676k4234
11695C30941M0415O3879m926k7200j4990J0143j230k1480l7032M818j757L0505
11683C72086K7993J4298J408J2297K6421k7511Q436n475N1482K0510q312m1338
11671D52295n1708l2841l0537k1479J2282J1424J6582J4019M122M894J9442j6810
11659C81685N9384O2147Q280N9236j703r9023m1744L5528J5870M5800L8131L729
$$ plain form
11744 223585 247234 265484 281144 274672 287163 273944 318976 298497 278372 260786 284804 302253
11732 302253 341576 359005 357745 335349 308476 291635 315215 334437 380569 405707 393303 350449
11720 350449 278992 267934 314182 317437 300220 261922 241654 210402 234952 244966 262385 272911
11708 272911 264850 284287 330536 326734 288692 306354 305594 303696 319138 321170 327499 355175 330941
11695 330941 371356 435235 430309 403109 388119 398262 397032 375552 338520 343338 341581 372086
11683 372086 400079 414377 415785 428082 454503 426992 435428 429953 481435 501945 493633 452295
11671 452295 400587 367746 337209 315730 328012 339436 356018 370037 374159 379053 398495 381685
11659 381685 441069 503216 511496 570732 569029 470006 428262 463790 479660 525460 563591 567320
11647E67320K362K0770k9327K830j2570n3042j6020J8579O2913J5991Q007n403
11635E82410L1348m640o1990j5880J2378o318k8844J37l0940M5780P1752J040
11623E96233l9323J3515J9880N6450M3716k9274n2856L7592j8465j9910K7690
11612F35248Q941N0882L6820m5221O409r02K0489K6409n685k1819L4216M9818
11600G95605N5156j2209K4613k3675J1328J351q264m015P407J9543o902R192Q310
11587H77440j6647m1056K7990P958L3684l5970K4611K0025K315j137K6913k0488
11575I05638k6676j3823K2494j1934K7841K6766K3209J4986J4921j7262K6952
11564I93112J4216M489j8037J9095K0305Q2631O1124l2731m6366j0627L1383J00374
$$ plain form
11647 567320 569682 590452 561125 563955 551385 498343 482323 500902 563815 579806 587813 582410
11635 582410 613758 609118 547128 531248 543626 537308 508464 508601 477661 523441 595193 596233
11623 596233 556910 570425 590305 646755 690471 661197 608341 645933 627468 607558 635248
11612 635248 644189 695071 731891 686670 693079 692177 712666 739075 733390 711571 745787 795605
11600 795605 850761 838552 863165 839490 850818 852169 843905 839890 847297 866840 859938 869130 877440
11587 877440 860793 819737 847727 855685 889369 853399 878010 898035 900350 899213 926126 905638
11575 905638 878962 865139 887633 875699 903540 930306 953515 968501 983422 966160 993112
11564 993112 1007328 1011817 993780 1012875 1033180 1115811 1176935 1144204 1097838 1087211 1118594 1218968
11552A218968L0298J9394r889k667j3875k5940L1682Q524n010K4547K2754M420
11540A303206K6317O314j0510M7106P520k1956j0479L5468m039J6210O4797M1044
11528A500998L345O4597J2171j1704k8838L6935J3169M8336J04855K8663K2542
11517A795069L4993M7554j0732n2117j9257J0103P8220O0708K1176j6686O238
11506A955269N238L4045L4408j930L7862K825J237Q3617M5008K2566K7664M5586
11494B293395N6052L5433q706N1460N3598M4459n968K1628O9530O2343k4975k1751
11482B626498J6256M2282P8833R2967O8040P1134O4238L3892K365L7684O0718
11471C194907N8913K3318L7297R2744P0333O3945N3376k9819N4310R7418Q8652
$$ plain form
11552 1218968 1249266 1268660 1258771 1256104 1242229 1216289 1247971 1256495 1251485 1276032 1298786 1303206
11540 1303206 1329523 1335837 1325327 1372433 1379953 1357997 1347518 1382986 1378947 1395157 1459954 1500998
11528 1500998 1504343 1568940 1581111 1569407 1540569 1577504 1590673 1639009 1743864 1772527 1795069
11517 1795069 1830062 1877616 1866884 1814767 1795510 1805613 1883833 1944541 1965717 1949031 1955269
11506 1955269 1960507 1994552 2028960 2027030 2064892 2067717 2068954 2152571 2197579 2220145 2247809 2293395
11494 2293395 2349447 2384880 2376174 2427634 2481232 2525691 2519723 2541351 2610881 2673224 2648249 2626498
11482 2626498 2642754 2685036 2763869 2856836 2924876 2996010 3060248 3094140 3096505 3134189 3194907
11471 3194907 3253820 3277138 3314435 3407179 3477512 3541457 3594833 3565014 3619324 3716742 3805394
11460C805394M0277P6382Q8730M9477P2023Q2194N8568M5392P4483O6437R6223
11449D555580O3595O0352O6037M7426Q1235J07618J12311R5302J25454J12723
11439E427633J07563J10660P0958J14496J71913J21306J38961J53433J36911J23681
11429F677515J43032J30242J79537J74657J50278J50561J18579J60851J51090
11420H036342J56035K14429K18822K22388J90420J71236K20540K14369K12921
11411I857502K18425K15815K28972K23373K12154K52949K49582L26301L01875
11402A2086948K84965L22183K59686K63304L28357L47330K93120L60745L72216
11393A4918854L88250L45081L46342L50515L17108L65825L63414M23635M37697
$$ plain form
11460 3805394 3845671 3922053 4010783 4060260 4132283 4214477 4273045 4318437 4392920 4459357 4555580
11449 4555580 4619175 4679527 4745564 4792990 4874225 4981843 5094154 5189456 5314910 5427633
11439 5427633 5535196 5645856 5716814 5831310 6003223 6124529 6263490 6416923 6553834 6677515
11429 6677515 6820547 6950789 7130326 7304983 7455261 7605822 7724401 7885252 8036342
11420 8036342 8192377 8406806 8625628 8848016 9038436 9209672 9430212 9644581 9857502
11411 9857502 10075927 10291742 10520714 10744087 10956241 11209190 11458772 11785073 12086948
11402 12086948 12371913 12694096 12953782 13217086 13545443 13892773 14185893 14546638 14918854
11393 14918854 15307104 15652185 15998527 16349042 16666150 17031975 17395389 17819024 18256721
11384A8256721M22286M14640L75548L89707M05383M46489M44889M57905M54238
11375B2067806M39719M73658M49261L88211M06614M64963M94599M33187L75791
11366B5993809M00582L75959L29409L27522L42647L56310L36793L12337K47112
11357B9022480J67997J53139J92333J90189J43339Q8025O1711M3391L756n5348
11347C0011012p5891j7359r3718j43089j85907k04461j59949j91576k73591k80147
11337B8385324l38992k89935l72930l86112l30039l60902l58592l46004l86762
11328B5215056m25532m64769m39154l91456l59248l81008m25816m55641m24063
11319B1448369m03011m25473m07420m60381m14303l75420l64515l68834l74908
$$ plain form
11384 18256721 18679007 19093647 19469195 19858902 20264285 20710774 21155663 21613568 22067806
11375 22067806 22507525 22981183 23430444 23818655 24225269 24690232 25184831 25618018 25993809
11366 25993809 26394391 26770350 27099759 27427281 27769928 28126238 28463031 28775368 29022480
11357 29022480 29190477 29343616 29535949 29726138 29869477 29957502 30019213 30062604 30066360 30011012
11347 30011012 29935121 29917762 29824044 29680955 29495048 29290587 29130638 28939062 28665471 28385324
11337 28385324 28046332 27756397 27383467 26997355 26667316 26306414 25947822 25601818 25215056
11328 25215056 24789524 24324755 23885601 23494145 23134897 22753889 22328073 21872432 21448369
11319 21448369 21045358 20619885 20212465 19752084 19337781 18962361 18597846 18229012 17854104
11310A7854104l73121l75361l65151l87685l23792l21011l23512l50323l57846
11301A4676302k91178l36859l13291l20301k28828k88054k28139k33564k52318
11292A2183770k34510k30578k28075k05759k38437k28829k43456k39131k19352
11283A0115643j81752j94905j96132j79929j79461j34239j82186j79444j24518
11274H563077j49937j81145j09250j12349j64782k16438j54365n5344j05702j57762
11264G156003k02697j49140p7988o6049j13706j21896j11088j15174j01723j38039
11254E958503j10128m7457m4024p2369j08282r5584q6802q8865j03240j00122
11244E101630j15513o9407j12546q5571m3057p2864o7111n9732n1228m8812l7039
$$ plain form
11310 17854104 17480983 17105622 16740471 16352786 16028994 15707983 15384471 15034148 14676302
11301 14676302 14385124 14048265 13734974 13414673 13185845 12897791 12669652 12436088 12183770
11292 12183770 11949260 11718682 11490607 11284848 11046411 10817582 10574126 10334995 10115643
11283 10115643 9933891 9738986 9542854 9362925 9183464 9049225 8867039 8687595 8563077
11274 8563077 8413140 8231995 8122745 8010396 7845614 7629176 7474811 7419467 7313765 7156003
11264 7156003 6953306 6804166 6726178 6660129 6546423 6424527 6313439 6198265 6096542 5958503
11254 5958503 5848375 5800918 5756894 5684525 5576243 5480659 5393857 5304992 5201752 5101630
11244 5101630 4986117 4916710 4804164 4718593 4675536 4602672 4535561 4475829 4424601 4375789 4338750
11233D338750r1868m6657k8457j2302n9286n9817k6358o8737j17165o4939j9117
11222C744047l9474m767l3369q1603n9495j1166l0357k8063m6088p7908n4036
11211C277721o2611q6631j3797m748m3367l8933j9349j1440m1392m1241k5163
11200B889049k9712p3310n5981m0960k6822l8193P159n64k7079o4525k0740m4563
11188B473759n5427J2885L2780k1618l6985n413m0619o1618l7812j3540j9922
11177B226470K7499j9480k5349n0284m6372j5497l6594r963K6896n563K3464K7813
11165B123040l8460l9776j8677k9299k7605M13k4097l8076j0267m0262n1508m1428
11153A763998l3440j2064K0256J8482o3426n3154O508J487K3920p478m2798j3402
$$ plain form
11233 4338750 4246882 4200225 4171768 4159466 4100180 4040363 4014005 3945268 3828103 3763164 3744047
11222 3744047 3704573 3699806 3666437 3584834 3525339 3514173 3483816 3455753 3409665 3331757 3277721
11211 3277721 3215110 3128479 3114682 3109934 3066567 3027634 3008285 2996845 2955453 2914212 2889049
11200 2889049 2859337 2786027 2730046 2689086 2662264 2624071 2631230 2630666 2603587 2539062 2518322 2473759
11188 2473759 2418332 2431217 2463997 2442379 2405394 2399981 2359362 2297744 2259932 2246392 2226470
11177 2226470 2253969 2234489 2209140 2158856 2112484 2096987 2060393 2050430 2077326 2071763 2095227 2123040
11165 2123040 2084580 2044804 2026127 1996828 1969223 1969636 1945539 1907463 1897196 1856934 1805426 1763998
11153 1763998 1730558 1718494 1738750 1757232 1693806 1640652 1647160 1648647 1672567 1665089 1622291 1608889
11141A608889Q556l319R097J9628k4282j3830j0404l844N754M2148R9984M5916
11129A784293J4766l74l4105n0562j13525r4761l7018m6222j286n3887l2594k0418
11117A314307l5765l393j4538k2186J8105l589k59q588m2573J7895p865m2970
11105A168581J8616K2306K6351l3859L6391o695n2901o822k4580M4644P1769M7839
11093A311640K4614K1278k83m6637m2740K1101j2387j9194j6445n5446k9764K7321
11081A183058J4363R860m445j56m0579o2127j045N8589J0336n2167o5736o6191
11069I83760k8469L202O716j3136j4539K7604k9324m7481j3609k753R788K470
11057H84229m302p213N957k7941m8081M094K9891J330P751Q837k8895l471K5977
$$ plain form
11141 1608889 1617445 1614126 1623223 1642851 1618569 1604739 1594335 1590491 1596245 1638393 1738377 1784293
11129 1784293 1799059 1798685 1764580 1714018 1600493 1505732 1468714 1422492 1421206 1367319 1334725 1314307
11117 1314307 1278542 1275149 1260611 1238425 1256530 1252941 1252682 1244094 1201521 1219416 1211551 1168581
11105 1168581 1187197 1209503 1235854 1201995 1238386 1231691 1178790 1171968 1147388 1192032 1263801 1311640
11093 1311640 1336254 1357532 1357249 1310612 1267872 1288973 1276586 1257392 1240947 1185501 1155737 1183058
11081 1183058 1197421 1207281 1202836 1202680 1162101 1099974 1098929 1157518 1167854 1115687 1049951 983760
11069 983760 955291 958493 965209 952073 937534 965138 935814 888333 874724 871971 881759 884229
11057 884229 879927 872714 878671 850730 802649 806743 836634 837964 845715 854552 825657 822186 848163
11044H48163P997j3593m871l0673l9044J6638O8876L2208l5809r631O677J8424
11032H65362m8342o7986n0541p735N7168J1704K3516L0803p042j3004m9857l1642
11020G12404M8160J7002n0532j7551L8905k542K3230M253j1811R59l4011L4634
11008G63100J6443j5837m140q948k1146o050j2442q745K669L7915o05P313j297
10995G48230Q36m158K1917P146J75Q147L8341L7258m7369k4447k4226p785L5144
10982G89209N6777J4757l9221m3090n4684K3329K5098j0839L6087K1806k7811
10971G91418m0733o0627j375m0760j557J7258l0285Q265O5570J5912j8185J9196
10959G24097j3943l6788j0896j3132M0670M5504m1476j8297J0785k8480n6991
$$ plain form
11044 848163 856160 842567 837696 807023 767979 784617 853493 885701 849892 840261 846938 865362
11032 865362 817020 749034 698493 690758 747926 759630 783146 813949 806907 793903 744046 712404
11020 712404 760564 777566 727034 709483 748388 745846 769076 773329 761518 762477 728466 763100
11008 763100 779543 763706 759566 750618 729472 723422 710980 702235 704904 742819 742214 749527 748230
10995 748230 749066 744908 766825 773971 774146 782293 820634 857892 810523 786076 761850 754065 789209
10982 789209 845986 860743 821522 778432 723748 747077 772175 761336 797423 819229 791418
10971 791418 750685 690058 688683 647923 646366 663624 633339 641604 707174 723086 704901 724097
10959 724097 710154 673366 662470 649338 690008 735512 694036 675739 686524 658044 601053
10948F01053J0979J5195l0421j7591q135J2906M5919L5382q237m4486j5748J754
10936E98570j4198M2625k1916N251j9481k3873K6159N4716J6814L154m9251j9746
10924E98824M7840R2454J9177j7657k2924j2802J0121J2979n4242q5212n656K8072
10912F10974M4412M6114L5275j350n8284o4694k5841K8065J2356P832m843J0502
10900F40518j3014K4101J7585j7225l9067p107K8862J6762N9138L5993m9228l4186
10888F63132K8215M4931K60k9356J5721Q36q946k2259j1574j0295n2152l6905
10876E81608k1539K1361j3159j1374m0693k6392l7016J8320j4403j3362N4900
10865D98251q21N23j6595m2406N764K2538M853l6073o9579m5595M6327J12334
$$ plain form
10948 601053 612032 627227 596806 579215 571080 583986 629905 665287 657050 612564 596816 598570
10936 598570 584372 626997 605081 610332 590851 566978 593137 647853 664667 667821 618570 598824
10924 598824 646664 739118 758295 740638 717714 704912 715033 728012 673770 588558 582902 610974
10912 610974 655386 701500 736775 735425 677141 612447 586606 614671 627027 634859 630016 640518
10900 640518 627504 651605 669190 651965 612898 605791 634653 651415 710553 746546 697318 663132
10888 663132 691347 736278 736538 707182 722903 723739 714793 692534 680960 670665 618513 581608
10876 581608 560069 581430 568271 556897 516204 489812 452796 471116 456713 443351 498251
10865 498251 497430 497953 481358 438952 444716 467254 472107 436034 366455 320860 367187 479521
10853D79521Q7007j8868l4771L0122N3475l6904l0847J3935L089o9037o929O7359
10841E37152O3791K3875J1509P493P999Q13l1927l2397Q166J5360k8822o5013
10829E17999l0491m916L9031k1347q6947k3053J3666O912j3463K6477N0315O6847
10817E41030M290Q890p13o271M1091J9841q463k7011J813K3215K9407Q050J0958
10804F46127k2393L6834N6100J367k5421m8455m3437o6172p3138q3642m9257N3472
10792C81985J6510j150P885J548K2170l5256k5690l2009j2930J3115j2151m592
10780C19435m547P591M3091K6539N026o224k9609j5807P4744J2234r266j6463
10768D06744J9132r938N4025O9263M5679l8222m9389l9670j4119j8662J0145L7247
$$ plain form
10853 479521 566528 547660 512889 543011 596486 559582 528735 542670 545759 476722 469793 537152
10841 537152 600943 624818 636327 643820 651819 652632 620705 588308 596474 611834 583012 517999
10829 517999 487508 482592 521623 500276 413329 390276 403942 410854 397391 423868 474183 541030
10817 541030 545320 554210 553497 547226 588317 608158 599695 572684 574497 597712 627119 635169 646127
10804 646127 623734 660568 716668 718035 692614 644159 600722 534550 461412 377770 328513 381985
10792 381985 398495 397345 405230 406778 428948 393692 368002 335993 323063 336178 324027 319435
10780 319435 314888 322479 365570 392109 397135 390911 361302 345495 420239 432473 423207 406744
10768 406744 425876 415938 469963 539226 584905 546683 497294 457624 443505 424843 434988 472235
10756D72235L8974r883l4794N126k2744J3640K0540k7014l7154q600J8383j9432
10744D09277j1170J8054J6574j1023J7820P703k8302M4980j3102j6687M2334Q934
10732D85392L3001J7099j2497J6729P1319M1757K1869M5632J6999R2159J39025
10721I68484L04754M47311O38777N71521j8126l83041m83114m64622l58089k35505
10711I88350k18697j26953q3190o3300k5071k6815m5666j5399N875L9433j2927
10700D15640n251j244M119k5553Q329L2090k8468n6520l0377k786J9506L3364
10688C62849J1658l5278p469k3052k0307L3376J0205o1727j8177L3897K5260R973
10676C21208j2738k933o101R215N8811L1185l0369m4974K3845K4748K0620j4803
$$ plain form
10756 472235 511209 501326 466532 471658 448914 462554 483094 456080 418926 410326 428709 409277
10744 409277 398107 416161 432735 421712 439532 447235 418933 463913 450811 434124 476458 485392
10732 485392 518393 535492 522995 539724 611043 652800 674669 720301 737300 829459 968484
10721 968484 1273238 1720549 2359326 2930847 2912721 2529680 2046566 1581944 1223855 988350
10711 988350 769653 642700 559510 496210 471139 444324 398658 383259 389134 428567 415640
10700 415640 410389 409145 413264 387711 396040 428130 399662 343142 312765 309979 329485 362849
10688 362849 374507 339229 331760 308708 288401 321777 331982 270255 252078 285975 311235 321208
10676 321208 308470 305537 299436 308651 367462 398647 368278 323304 347149 371897 392517 377714
10664C77714J8952K9877n328J4796m0794k4754J0861K0980K4214m0680M0197J6196
10652D42231m6874k1220q788K1324m3521r203j476j2482Q703L7379j900K459k7999
10639C38633R188N2056K9248k041k8530l961k4262k6003N5432K8210m6172m1678
10627C40120K0212L742k3862m3719j192O771K4316J3540l177L3755J2027j0998
10615C71535n7350K1032R0856K0p1957m3183o7365k1481J9833N3047J9672M7186
10603C61845r463k2360J041Q144R253k7902j1267j885J0337k6260l4380M979Q432
10590B70514L8241R3074K0589K6897P1957R9458M3785J35847Q8968N2112J1342
10579I52784p6846j10468j03343r7948p5198n3954k0172l4008J5479k202k1700
$$ plain form
10664 377714 396666 426543 421215 436011 395217 370463 381324 402304 426518 385838 426035 442231
10652 442231 395357 374137 365349 386673 343152 333949 332473 319991 328694 366073 364173 366632 338633
10639 338633 347821 399877 429125 427084 398554 394593 370331 344328 399760 427970 381798 340120
10627 340120 360332 364074 340212 296493 295301 302072 326388 339928 336751 370506 382533 371535
10615 371535 314185 335217 426073 426093 354136 310953 243588 222107 241940 294987 314659 361845
10603 361845 352382 330022 331063 339207 348460 320558 309291 307406 317743 291483 257103 262082 270514
10590 270514 308755 401829 422418 449315 521272 620730 664515 800362 889330 941442 952784
10579 952784 875938 765470 662127 564179 488981 435027 414855 380847 396326 394124 372424
10568C72424k7224l6443M7505J4954J2704J3525J4404l0674j9327l0068J8185
10557C49965J8000k8990q485L8603K7743N2158j7108k9267P58j2825m5743q10
10545C43999j778O437k8801j5744Q290j2091j5555N578Q313l6558k960K5041k4088
10532B60083k9289k844K8803R87p133j1943K0327L1187J6432j5734K3711j4005
10520C00582K8389r854r207O87k0030j6998n2832j5711J3365O8955M2317o5544
10508B64119m7597J4784L7003N0568m761k0536J4781o761J5192l0437m8398P192
10496B45149j202m784J5310j534K0931K9627Q188L1008K1608K7142k0052k7367
10484C44024j2341j9945J3644L4528n925J1440j9087k1397j2850l9573L980P6026
$$ plain form
10568 372424 345200 308757 356262 371216 383920 397445 411849 381175 361848 331780 349965
10557 349965 367965 338975 330490 369093 396836 448994 431886 402619 403377 390552 344809 343999
10545 343999 342221 348658 319857 304113 312403 300312 284757 290335 298648 262090 259130 284171 260083
10532 260083 230794 227950 256753 257740 250607 238664 258991 290178 306610 290876 314587 300582
10520 300582 328971 319117 309910 310597 290567 273569 220737 205026 218391 287346 329663 264119
10508 264119 216522 231306 268309 318877 314116 293580 308361 301600 316792 286355 237957 245149
10496 245149 243947 239163 254473 252939 273870 303497 311685 342693 364301 391443 371391 344024
10484 344024 331683 311738 325382 359910 353985 365425 346338 324941 312091 272518 276498 352524
10472C52524K1429l3366j2244j7136l0862Q971J6599J0712J4661m4443m3013m768
10460B39064M0396R893J3827P301M1504J7577k4942J6735k0954p484k2404l5539
10448B74974j0500L3954M8084M6182n808q408k201K0604j1768j731k4158J9934
10436C79158L52l4460m457L8074L8146m755M28K4104p4996r929M2885m697j3565
10423C76288K9664p1889j283k7945J0658Q377O2699L1686j0461k3479k527N1645
10411D33433J8193p522n3156l6378m712M9031k8119k2148K7133q484k5555k8354
10399C13362m9688k6613k2406M6610O8030j5718j4332K4040l9807L5584M2604
10388C61666K3074j0211n5904k3464L2912N7673k0707m5822j0421J5672L9705
$$ plain form
10472 352524 373953 340587 328343 311207 280345 289316 305915 316627 331288 286845 243832 239064
10460 239064 279460 289353 303180 310481 351985 369562 344620 361355 340401 332917 310513 274974
10448 274974 264474 298428 346512 392694 386886 378478 376277 396881 385113 383382 359224 379158
10436 379158 379510 345050 340593 378667 416813 412058 412486 436590 361594 351665 394550 389853 376288
10423 376288 405952 334063 332780 304835 315493 323870 386569 418255 407794 384315 381788 433433
10411 433433 451626 444104 390948 354570 349858 398889 370770 348622 375755 367271 341716 313362
10399 313362 263674 237061 214655 261265 329295 313577 299245 323285 283478 319062 361666
10388 361666 384740 374529 318625 295161 328073 385746 365039 319217 308796 324468 364173
10377C64173L1734P333K2259j900j5417k2288k1606J546l7542r690JN389N1730
10364C75722r63k593M3404N890q4232m4817M7291J9685J5116K4041L2565m3350
10352C87759k8930K6100O7295j4897L6404m6291l9055m3709j6044K8328N1383
10341D08343Q804N4326K7775J6329j5690m2989l0593l049K0625j6879m528O620
10329D29094r090l5594k0202N1509L9145J0441k3182j0371n697K9067P457O809
10317D69386p046k1326k9598J3061O4601K0557J2376K663N5520l8337o4650n8969
10305D18238r995K4547K1885L4064q799r568k8865K257K5327O9219j6953p0810
10293D50547l0432K6930J8914q131j8751K9670L2877r734P587k9121K0125L7662
$$ plain form
10377 364173 395907 403240 425499 423599 408182 385894 364288 365834 328292 318602 318603 323992 375722
10364 375722 374759 372166 415570 421460 337228 292411 339702 359387 374503 398544 431109 387759
10352 387759 358829 384929 452224 437327 473731 427440 388385 344676 328632 356960 408343
10341 408343 417147 471473 499248 515577 499887 456898 426305 423256 443881 427002 422474 429094
10329 429094 420004 384410 364208 415717 454862 465303 442121 431750 426053 455120 462577 469386
10317 469386 462340 441014 411416 424477 489078 509635 522011 524674 580194 541857 477207 418238
10305 418238 408243 432790 454675 488739 479940 470372 441507 443764 469091 538310 521357 450547
10293 450547 420115 447045 465959 457828 439077 468747 501624 491890 499477 470356 490481 528143
10281E28143N8390k1074j8772Q239k7706j8470k3088o803L3787K6529L051k4150
10269E18076K8606J08262J00483Q5989J41934J29547K9004L1163J1438J4749O667
10258A205918n1788q5122o9079j00926m7792o1825q3043o5588o7945m9221r864
10247E13725j5625J8558L6537K481k0368l9829l5372o0M0603M7805l1459Q395
10235E25391M9965O977j9834j7549p1520l9399J9151K452N6905K0300K7910j8288
10223E42461n8306j9939K9685j6015Q919O685J138j6009j10O16K6918N7520O7438
10210F31001Q633m1983K3192N3032K9672K1688o0142o4175N2727M0742K7926j6146
10198G06167j8276k6009m6778l6506N734L5923R3j9218N180M8171m9996n6359
$$ plain form
10281 528143 586533 565459 546687 554926 527220 508750 485662 478859 512646 539175 542226 518076
10269 518076 546682 654944 755427 841416 983350 1112897 1141901 1173064 1184502 1199251 1205918
10258 1205918 1154130 1069008 999929 899003 851211 789386 706343 640755 572810 523589 513725
10247 513725 498100 516658 553195 555676 535308 495479 460107 460047 500650 548455 516996 525391
10235 525391 575356 582333 562499 544950 473430 434031 453182 455634 512539 532839 560749 542461
10223 542461 484155 464216 493901 477886 486805 493490 494628 478619 478509 479125 506043 563563 631001
10210 631001 639634 597651 620843 673875 703547 725235 665093 600918 653645 694387 722313 706167
10198 706167 687891 661882 615104 578598 584332 620255 620348 601130 606310 654481 604485 548126
10186E48126M3056j1290K632j3363K0769k803o655J0936N589n8668n8701O893
10174D86521N3413P2628Q239k5210L3951k4168l550j989R003k7482R303P805M65
10161E98929Q959Q455k69j0432P443l2344O906k1694J8865N4663K5024j4331k2687
10148F27487L2279K881l3263j7199J0767l76J2219m0766k2230p48J7100M7295
10136F35446j2279m7710m7938M5191K1721k005l8326r456J0868k080J9044J290
10124E73766k0658J8082L1049j0790J3960L185m554k5771L755M2963L0786n871
10112F49902n9541j292J7713L3265L9261k5523o9618L992K9938l493J816q6J6410
10099F32744n8588j2827J8291J7867l2296J443j7162l1153M3775L334l172L7896
$$ plain form
10186 548126 591182 579892 582524 569161 589930 587127 580472 591408 596997 538329 479628 486521
10174 486521 539934 612562 620801 595591 629542 605374 601824 599835 608838 581356 590659 598464 598929
10161 598929 607888 616343 616074 605642 613085 580741 587647 565953 584818 639481 664505 650174 627487
10148 627487 659766 662647 629384 612185 622952 622576 634795 594029 571799 571051 588151 635446
10136 635446 623167 575457 527519 572710 594431 592426 554100 544644 555512 553432 572476 573766
10124 573766 553108 571190 602239 591449 605409 608594 604040 578269 582024 624987 655773 649902
10112 649902 590361 589069 606782 640047 679308 653785 584167 588159 618097 614604 616420 616334 632744
10099 632744 574156 561329 579620 597487 565191 566634 549472 518319 562094 565428 562256 600152
10087F00152j4378j8806k38n721J4571J3258r770L6018J1429l1584q1316J5669
10075E29284N7456L2817K3246m1584k5538J7460j2651j572K5558N5911M6961m692
10063G02656j1228p575m3061l9700j9330L8387R759K866K0037M882J1442M4972
10051G14107J1170k1825J413k9896m238K3166K5406K3213k7J549m5708J046K2681
10038G22057L2539L3962P96J2215M9186K9926K0590R1147J64683L28604L64030
10027A849735J93599m7485j89209k71906k78858k22289r5303l4495k5407l9892
10017H38490o3818k8626m3741J4242N2149J4522l233j0727l5316K3172j0318m5795
10005G01001Q378N7661m001p0234j5030k6416l131N0991M2350J1905O536k0732
$$ plain form
10087 600152 585774 566968 566730 561009 575580 588838 579068 615086 626515 594931 513615 529284
10075 529284 586740 619557 642803 601219 575681 593141 580490 578918 604476 660387 707348 702656
10063 702656 691428 683853 640792 601092 581762 620149 629908 632774 652811 657693 669135 714107
10051 714107 725277 703452 704865 674969 670731 693897 719303 742516 742489 744038 698330 699376 722057
10038 722057 754596 788558 789354 801569 850755 880681 901271 992418 1157101 1485705 1849735
10027 1849735 2043334 1995849 1806640 1534734 1255876 1033587 938284 903789 878382 838490
10017 838490 774672 746046 702305 716547 768696 783218 779985 769258 733942 757114 746796 701001
10005 701001 709379 767040 763039 692805 677775 651359 648228 699219 741569 753474 760010 739278
9993G39278P40J3670j7045J6837j4354q273J4480J7K2316N6082M2303j2074l1539
9980H22438k0226L3280K8171j5196L0835K0118k1371n8435j221P018P3848N9928
9968I59187j3075R39l875m0428j8493J7085J0963L2340m660l1257K0697J772p896
9955I23299K7176P741Q974n0097j1655K5603K0773L1186N8678J8869K1091l4827
9943A046811j7135N4160L7352j6203l1122l8623J6868j0477n6115K3454K2256
9932A031226R445R407L453O3947L4631m491L4283J2208n242l0218K7025L0056
9920A215730l4625j1974l95l181l2506q144K7692N1542J4341O356k244k3326o143
9907A193123J8885R477L6878P159k6465k53O4248J9251r824l3731K8128N5849
$$ plain form
9993 739278 740018 753688 736643 753480 739126 730853 745333 745350 767666 823748 866051 853977 822438
9980 822438 802212 835492 863663 848467 879302 899420 878049 819614 818393 825411 899259 959187
9968 959187 946112 947051 943176 902748 884255 901340 912303 944643 939983 908726 929423 931195 923299
9955 923299 950475 958216 967190 917093 905438 931041 951814 983000 1041678 1060547 1081638 1046811
9943 1046811 1029676 1083836 1121188 1104985 1073863 1035240 1052108 1041631 985516 1008970 1031226
9932 1031226 1040671 1050078 1053531 1117478 1152109 1147618 1181901 1194109 1188867 1158649 1185674 1215730
9920 1215730 1181105 1169131 1168736 1165555 1133049 1124905 1152597 1204139 1218480 1224836 1222592 1199266 1193123
9907 1193123 1212008 1221485 1258363 1265522 1239057 1238804 1303052 1322303 1312479 1278748 1306876 1362725
9895A362725M3213N5910k5158j0847P030k9308r683L89j462J6149J3849k5332
9883A397475j8924K4302L5499M4499L3355m573j8319K1231L8531L6914L5573L3283
9871A658846J1877j255O6922N6680Q1904M8804K6114k2263n7599q0256j12465
9860A677309k5139M5174R883j5922R090Q036j2174L5020N3856P9542M3612L8606
9848A946893K2420K456q928P60M366M2360J4788l5829L119N2060R9107J37740
9836B281312R0561N7995J25852K33313K05639L43957O82086J188254J647900J642227
9826H499096P58828m42742j146510j402335j281358r34706o28804l98046k59219
9817B764204j96830o4078k1086l7987o6111m9295m4567j8664J4581P986q196m7036
$$ plain form
9895 1362725 1405938 1461848 1436690 1425843 1432873 1403565 1393882 1394271 1392809 1408958 1422807 1397475
9883 1397475 1378551 1402853 1438352 1482851 1516206 1511633 1493314 1514545 1553076 1589990 1625563 1658846
9871 1658846 1670723 1669468 1736390 1793070 1874974 1923778 1949892 1927629 1870030 1789774 1677309
9860 1677309 1652170 1697344 1707227 1691305 1700395 1708431 1696257 1731277 1785133 1864675 1908287 1946893
9848 1946893 1969313 1971769 1962841 1963601 1967967 2010327 2025115 1989286 1992405 2044465 2143572 2281312
9836 2281312 2371873 2429868 2555720 2789033 2994672 3338629 4020715 5208969 6856869 8499096
9826 8499096 9257924 8815182 7668672 6266337 4984979 4050273 3421469 3023423 2764204
9817 2764204 2567374 2503296 2482210 2444223 2378112 2328817 2284250 2265586 2280167 2288153 2279957 2232921
9805B232921j1444P345J6837L5976j3937J8378L8722J3754l2962K9485J8329l379
9793B350025M5056L7667J7227l694N62k4500k6132M8123N8794L0684L6831m407
9781B566236j6030k196K4907N1779L1679k5357p8962n8787K6114L0919K3867O991
9769B581160p574R669L3458J9586K7048M2552l0534l6294o977J9114L0738j8302
9757B663644j9973j4099J9866J3327Q903K0970L6943J147l9461j6642k5388J8422
9745B667659j6737k4489j208m1858l1064N6314L263j6205m0124J0890j262j9155
9733B546024L5905O4345K3477m2465q833K2283N1576J5869j4723o9576k4842j8015
9721B581025k9543j1297R537O3141m5299r1292k1033K5781n44k2930l3270l788
$$ plain form
9805 2232921 2221477 2228822 2245659 2281635 2267698 2286076 2324798 2338552 2305590 2335075 2353404 2350025
9793 2350025 2395081 2432748 2449975 2446281 2446843 2422343 2396211 2444334 2503128 2533812 2570643 2566236
9781 2566236 2550206 2548010 2572917 2624696 2656375 2631018 2552056 2493269 2519383 2550302 2574169 2581160
9769 2581160 2573586 2583255 2616713 2636299 2663347 2705899 2675365 2639071 2632094 2651208 2681946 2663644
9757 2663644 2643671 2629572 2649438 2662765 2671668 2692638 2729581 2730728 2691267 2674625 2649237 2667659
9745 2667659 2650922 2626433 2625225 2583367 2552303 2608617 2611880 2595675 2555551 2566441 2565179 2546024
9733 2546024 2581929 2646274 2669751 2627286 2618453 2640736 2692312 2708181 2693458 2623882 2599040 2581025
9721 2581025 2551482 2540185 2549722 2612863 2567564 2476272 2455239 2481020 2480476 2457546 2424276 2420488
9709B420488N703K5814q929j1046j7538Q612J6664M929k7238n1469j1333l2069
9697B322588l7361j7286l083k3030l8958k0956J8300m5m1996o9990l4715l2004
9685B021464r770j6301J2331J3201n55J2148l916p150k0014o6084k5337Q264k1710
9672A896571j5695p693N100Q388p6041n3456l50L771j8429l3313j3561k0278Q031
9659A683045O104j2144J147K2586k2798n3450p916j6032j0764m6237l7625J0284
9647A516200K0018O18l7953j8679K8377K0423J8051l8194p6952J4188J2341J1573
9635A470011j4724m6298r122M520l7199J3156j776n6279q236j1228m5928q162
9623A248735L6492J7465j8517l3197K3537k2430k4548j6717J068q15L8012J3124
$$ plain form
9709 2420488 2426191 2452005 2443076 2432030 2414492 2423104 2439768 2444697 2417459 2365990 2354657 2322588
9697 2322588 2285227 2267941 2264858 2241828 2202870 2181914 2200214 2200169 2158173 2088183 2053468 2021464
9685 2021464 2011694 1995393 2007724 2020925 2020370 2032518 2028602 2021452 2001438 1935354 1910017 1918281 1896571
9672 1896571 1880876 1873183 1878283 1886671 1810630 1757174 1756824 1760595 1742166 1708853 1695292 1675014 1683045
9659 1683045 1689149 1677005 1678152 1700738 1677940 1624490 1616574 1600542 1589778 1543541 1505916 1516200
9647 1516200 1536218 1536836 1498883 1480204 1508581 1529004 1547055 1508861 1431909 1446097 1458438 1470011
9635 1470011 1455287 1408989 1399867 1404387 1367188 1380344 1378568 1322289 1314053 1302825 1256897 1248735
9623 1248735 1285227 1302692 1284175 1250978 1274515 1252085 1227537 1210820 1211888 1211073 1249085 1262209
9611A262209m5603k9451j3283L9019j636m8474k9571k7642l6473M0021J4470l1390
9599A092196n1357J3679l9415L0331j0965n2079j1824k9200m851K2622j8877J8044
9587I58304M4790j3149k6014N944J0932J160l6753m4305P75m116K3928K7544q230
9574I40810k7454n4594l9834J9989m801j7623j8719j8686l0842J7563k7592M6777
9562G84994M678k9245m3874J5823M0999L5425m562n253J7333m9493l1204l6782
9550F98839N748J7527P218J4583p522m6317n8596J1376K6478l5311o877J6850
9538F43996j7092n998J2372j3732k1708n593O210K0667M4083R205l7961l0903
9526F03546r571l2275N1157J0939p0727p4236j1883O5299O4725j7699l0109k057
$$ plain form
9611 1262209 1216606 1187155 1173872 1212891 1211255 1162781 1133210 1105568 1069095 1109116 1123586 1092196
9599 1092196 1040839 1054518 1015103 1045434 1034469 982390 970566 941366 936515 959137 940260 958304
9587 958304 1003094 989945 963931 969875 980807 981967 945214 900909 901684 897568 921496 949040 940810
9574 940810 913356 858762 818928 838917 834116 816493 797774 779088 748246 765809 738217 784994
9562 784994 789672 760427 716553 732376 773375 808800 804238 798985 816318 766825 735621 698839
9550 698839 704587 722114 729332 743915 736393 690076 631480 642856 669334 634023 627146 643996
9538 643996 626904 620906 633278 619546 597838 592245 598455 619122 663205 672410 634449 603546
9526 603546 593975 561700 612857 623796 553069 478833 466950 532249 596974 579275 549166 547109
9514E47109M2163j2852J900K3899J6173p201j3629k5981k7455Q513K6222K1740
9502F00601j9384n7714K191J2570j8912m6325j4079j5691k382J2563j2873L027
9490D43592L2847L8696J4776M177j448j6792k9583J9231M6574L5387k6470l1454
9478E29533k7450k2236l6345K1103L5013L080o709j9013M380J438q674l1870j6346
9465D25904n307J935j8777M4973j5656L6606j3709k1691l2795O453K4626L3070
9453D65632J9748l5958k9607L0113l904J271k3755j4440j6851l0581K4259l789
9441C82138N1077L9102p0198k9244P130k342K4625K432j0495k721L7420K1373
9429D50297l4992q1329j824K3016k9866l3339P4418N0488l6005j6682M2001J7413
$$ plain form
9514 547109 589272 576420 578320 602219 618392 611191 597562 571581 544126 552639 578861 600601
9502 600601 581217 523503 525694 538264 519352 473027 458948 443257 440875 453438 440565 443592
9490 443592 476439 515135 529911 534088 532640 515848 486265 505496 552070 587457 560987 529533
9478 529533 502083 479847 443502 464605 499618 502698 495989 476976 481356 482794 474120 442250 425904
9465 425904 420597 422532 403755 448728 433072 469678 455969 434278 401483 407936 432562 465632
9453 465632 485380 449422 419815 449928 446024 447295 423540 409100 392249 361668 385927 382138
9441 382138 433215 472317 402119 372875 380005 377663 402288 404720 394225 391504 428924 450297
9429 450297 415305 333976 332152 355168 325302 291963 366381 416869 380864 364182 406183 423596
9417D23596l2529K2966R350k1123l1491k5248k2625k8640J7386R669J7668l9616
9405B99363j6999j247J3693L0860j029j5935L8409Q079j515l0518l2489k965k6630
9392B61077N5257R817m619J76L1001L123r400k1910m8640L882J7981m199P084
9379C00630M8123L1963J9450k0383p498n7475k200J1216m5899j0431N1371K6669
9367C45536j3477j5677m2596J7212M2296K8202j8423k7237J431l4693l4438K5506
9355B73642P513m3644k7771K0529k9935J8278N241K0291k9902k703N0290j1542
9343B50287k2015M9165O6600J1959k3279q0298l793L2175J9650k0028k3246K092
9331B59269L7957P539m341J0049k4442J260J0659m3946l2801K0818K4306j673
$$ plain form
9417 423596 391067 414033 423383 402260 370769 345521 322896 294256 311642 321311 338979 299363
9405 299363 282364 281117 294810 325670 324641 308706 347115 355194 353679 323161 290672 287707 261077
9392 261077 316334 326151 321532 321708 352709 355832 346432 324522 275882 279764 297745 293546 300630
9379 300630 348753 380716 400166 379783 372285 314810 312610 323826 277927 267496 318867 345536
9367 345536 332059 316382 273786 290998 333294 361496 343073 315836 317267 282574 248136 273642
9355 273642 281155 237511 209740 230269 200334 218612 223853 244144 214242 211539 261829 250287
9343 250287 228272 277437 344037 355996 332717 252419 248626 280801 300451 280423 257177 259269
9331 259269 297226 304765 300424 310473 286031 287291 297950 254004 221203 242021 266327 264654
9319B64654Q097n415L9816m0262m1355p171M3288j6040n0223J5631O5861P635
9307B84516j1995k52Q040p343P036K2385k6864l0668m6475K8055K9222j0823n627
9294B39207K9788k062L9075j2039j5359K0005L0695L503n1357l0814K2883k9815
9282B43710P128M0636Q728j7263n4015q881K4385L7067p467j4992N1933L5914
9270C46883L2335j7783m0714l7394J672K1723N6053k721m7917l6975k3979N353
9258B56536K0883R525m2840K0975K6031P90K023L7198l7962n2717L2915J0716
9246B84073O066K5511m5628k8537l1063K3940K5361n2554j8379M316K4456N736
9234B23298K4014M4543k6907k4397J7753J6115J6348n86k819j0768o839N857l644
$$ plain form
9319 264654 272751 267336 307152 266890 225535 218364 261652 245612 195389 211020 276881 284516
9307 284516 272521 272269 280309 272966 280002 302387 275523 244855 198380 226435 255657 244834 239207
9294 239207 268995 266933 306008 293969 278610 298615 329310 332813 281456 250642 273525 243710
9282 243710 250838 291474 300202 282939 228924 220043 244428 281495 274028 259036 310969 346883
9270 346883 379218 361435 320721 283327 284999 306722 362775 360054 312137 275162 251183 256536
9258 256536 277419 286944 244104 265079 291110 291900 293923 331121 293159 240442 273357 284073
9246 284073 290139 315650 270022 241485 210422 234362 259723 207169 188790 193106 217562 223298
9234 223298 247312 291855 264948 240551 258304 274419 290767 290181 287362 276594 269755 275612 271968
9221B71968J8261K8950J8713k8073J5335l0004j1207m194N130k471m4745J6430
9209B54093L5071k2972p553K0586L2974J7696k4009m687K5139K5071K6011j6174
9197C61246l0215k1191l303m0968N2033O5531O30J5252P83l291j8518l5917m9760
9184B92312k57L6123j0289q951l1073k5462l139L1321k701q313J980k4831l154
9171B43566M2720n572m0701k9499N7199N8257l926m2644m7662r879l4753k9256
9159A57850M885k1452N1816L7303l3998l1739O534M8307K6107l9419l6816j6124
9147A53254J1544J1465M7613J8737J6229k777k9038m4345k4275K2207j4035j27
9135A66452J8059L5042L215L7587J7140J0733J2352l0105k2443k701K9438k575
$$ plain form
9221 271968 290229 319179 337892 309819 325154 295150 283943 279749 284879 282408 237663 254093
9209 254093 289164 266192 258639 279225 312199 329895 305886 301199 326338 351409 377420 361246
9197 361246 331031 309840 306537 265569 317602 383133 383763 399015 399798 396507 377989 342072 292312
9184 292312 292055 328178 317889 308938 277865 252403 249264 280585 277884 269571 271551 246720 243566
9171 243566 286286 280714 240013 210514 267713 325970 322044 279400 231738 221859 187106 157850
9159 157850 162735 141283 193099 230402 196404 164665 171199 219506 245613 206194 169378 153254
9147 153254 164798 176263 223876 242613 258842 256065 227027 182682 158407 180614 166579 166452
9135 166452 184511 219553 222768 260355 277495 288228 300580 270475 248032 245331 274769 272194
9123B72194P941L6944k2105J8973N0767k0057o5276o0439j6445J7868J8198K3107
9111B61670k0423n2270r497j0704R362M2632L5908k7619j5131J9054N7106o554
9099B83534j5028N95j423m8409j9367O9010j6961m1461J9557O8028j7856j2332
9087B67887J423L3838j0634p5148N460Q732o121j1414J8569N8745j7947l4430
9075B38960q634L1711J9079l5766k923j8793M9190K126l0504m8830P40K2111J4465
9062B32932N8180Q848l304J596j7882k439J1000L465j5087j2534K5706K974n2048
9049B41407j4925K9792j3611K8986J7947J7947R789j5029l0894l3499k7952j5621
9037A94337O5492k360j079m6567L4091M8456p4226r250J3211p6324K6546K0343
$$ plain form
9123 272194 280135 317079 294974 313947 364714 344657 279381 218942 202497 220365 238563 261670
9111 261670 241247 188977 179480 168776 178138 220770 256678 229059 213928 232982 290088 283534
9099 283534 268506 269101 267678 219269 199902 268912 251951 210490 230047 298075 280219 267887
9087 267887 269310 303148 292514 217366 222826 231558 225437 214023 232592 291337 273390 238960
9075 238960 230326 262037 281116 245350 242427 223634 272824 274950 244446 195616 196356 218467 232932
9062 232932 291112 299960 296656 298252 280370 277931 288931 292396 277309 264775 290481 293455 241407
9049 241407 226482 256274 242663 271649 289596 307543 317332 302303 271409 237910 209958 194337
9037 194337 259829 257469 256390 209823 243914 292370 218144 208894 222105 145781 172327 192670
9025A92670k4799j4465J8000J638L8836O3090j5705m9016o4368k4163L2153P217
9013A61088L9901N4382j4952j0659r859P748M4049K0545o9624l971L5846r767
9001B44727o8988k6269M9308K8807n122j026J5241M0754k9793l0019j6843K4370
8989B25147l0585J5276o657l219J8314K9200l6987j5046m645J0443n6409l5464
8977A09368K8402M9997K1388K2479k8481j6114P091j2219J9302L3857j1615m8817
8965A74638K4226K7305l2810L4580l162j9560K6458j794j4604l1791n4019N799
8953A35266K5097L8649J9826J5442k575j7406j4956k621k0227J0614l5680l1976
8941A19453m449k121J8023K3308Q110k571J5570J7283k9727l172J5831j5475M608
$$ plain form
9025 192670 167871 153406 171406 173044 211880 274970 259265 210249 145881 121718 153871 161088
9013 161088 200989 255371 240419 229760 219901 227649 271698 292243 222619 218648 254494 244727
9001 244727 175739 149470 198778 227585 222463 221437 236678 277432 247639 217620 200777 225147
8989 225147 194562 209838 203181 199962 218276 247476 210489 195443 190798 201241 144832 109368
8977 109368 137770 187767 209155 231634 203153 187039 194130 181911 201213 235070 223455 174638
8965 174638 198864 226169 193359 227939 224777 205217 231675 229881 215277 183486 129467 135266
8953 135266 160363 199012 218838 234280 231705 214299 199343 196722 176495 187109 151429 119453
8941 119453 115004 112883 130906 154214 162324 159753 175323 192606 162879 159707 175538 160063 164671
8928A64671L3654K3552P844r341j0193N0018J5586n9938o1609M1783N5011j2634
8916B38404j7239J5538K5092J1115k5322p385K1312K7823j6503n0368j8851J3466
8904B17082J6404K394m3194m8078J4890J6676j9462j8253J6549K4676L732L603
8892A87019l4239K989J280m1312p3308M734Q3911L2633M402p124k6896j0063R456
8879A33482J4272J9676k0557l313q333j961k75M3579m3828J3109J2733K1289r53
8866A78920n8123J897L7038N2039N257J6989J9250j3178Q361K0410j6910Q149
8854B60099k5094k4514J6265j1410k029K764J0754k6408M2420L1669J667Q0531
8842C56714R5045N1508j0850n9477o8522n4024n7085m7620n5424J2109M8429J2144
$$ plain form
8928 164671 198325 221877 229721 220380 210187 260205 275791 215853 154244 196027 251038 238404
8916 238404 221165 236703 261795 272910 247588 240203 261515 289338 272835 222467 203616 217082
8904 217082 233486 235880 192686 144608 159498 176174 156712 138459 155008 179684 183416 187019
8892 187019 152780 155769 157049 115737 42429 47163 131074 163707 168109 160985 134089 124026 133482
8879 133482 147754 167430 146873 143560 135227 133266 132991 176570 132742 145851 158584 179873 178920
8866 178920 120797 122694 159732 211771 217028 234017 253267 240089 248450 268860 251950 260099
8854 260099 235005 210491 226756 215346 213317 216081 226835 200427 242847 274516 276183 356714
8842 356714 451759 503267 492417 432940 364418 310394 253309 205689 150265 162374 210803 222947
8830B22947k2172j7746r043n557K2816L1711j6841n7320J4225J4835o922K9089
8818B00022M6222J2791l1554j8722J0054q086K0949P803j6943j6685k3448P468
8806A89871j3740J4253L4283L5179N8608K7033L7770J11976J65141J16231J395
8795G78000r9110j34802q9860q3637m0840k2353k5988l2032k2848m542K0868p291
8783B35565k4962o946N68J9928p242l0296l1008K6678L8700L595j8815K2133L1955
8770B59853k0164o5573K574K9526R469Q45N2240J5281L78l3071L16K6473K1941
8757C00088K3407j3079P952K1349P3657R2193k2848n2494m6110l0454p98m6430
8745C06433k4846J1036p695j1337j4736k6643J8851p264j7830L699K979k625P618
$$ plain form
8830 222947 200775 183029 173986 168429 191245 222956 206115 148795 163020 177855 170933 200022
8818 200022 246244 259035 227481 208759 218813 210727 231676 239479 222536 205851 182403 189871
8806 189871 176131 190384 224667 259846 318454 345487 383257 495233 660374 776605 778000
8795 778000 678890 544088 454228 370591 329751 307398 281410 249378 226530 221988 242856 235565
8783 235565 210603 203657 204225 224153 216911 186615 155607 182285 220985 224580 205765 227898 259853
8770 259853 239689 174116 176690 206216 215685 216530 268770 284051 284429 251358 251674 278147 300088
8757 300088 323495 310416 318368 339717 413374 505567 482719 430225 384115 353661 352863 306433
8745 306433 281587 292623 284928 273591 258855 232212 251063 243799 225969 229668 232647 230022 237640
8732B37640p3025L062L7824P65j8330L3357J9527K0593L1017L0479r68k9876k1267
8719B70798o867k2117J8532M9735j1346k1336L2111m4799n3142L688J3521M2243
8707B71021O3499l4973j2364m0429n7458K0286L2666N0018n5765m3948L8146L1404
8695B62103K9051L5297L1238p919j509k4139j0986K4522K6333K005m9758q4512
8683B31726j1527P6603K5931j2565n104J0549q773M2566l8912n0978K1867Q365
8671B89748l361K4477J1826q065k7022N1427k0713O432n897K2749R958K2958J2272
8658C86789m1985Q068O8993J6873l79l7208l6350M0586L1285l395M8077L5603
8646E16957M7940P765L165p6807Q783K6485J5829j1584l9846p35L8805N2645P4273
$$ plain form
8732 237640 164615 167677 205501 206266 187936 221293 240820 261413 292430 322909 321941 292065 270798
8719 270798 263931 241814 260346 310081 298735 277399 309510 264711 211569 215257 228778 271021
8707 271021 334520 299547 287183 246754 189296 209582 242248 292266 236501 192553 230699 262103
8695 262103 291154 326451 357689 349770 348261 324122 313136 337658 363991 365996 316238 231726
8683 231726 220199 296802 322733 310168 305064 315613 306840 349406 310494 259516 281383 289748
8671 289748 286387 310864 322690 314625 287603 339030 318317 324749 318852 341601 351559 374517 386789
8658 386789 344804 352872 421865 438738 438359 401151 364801 405387 436672 433277 481354 516957
8646 516957 564897 572662 575827 499020 507803 534288 550117 538533 498687 497952 536757 589402 663675
8633F63675N4266M9492N2071P2102J99116K69144M37302M75696K32791n8289k92645
8622B154721l51707l61124k31491j36573j30829q5618r8724j2712K8777m8886
8612G25834k2719j8124J2206k532O602N807K4466J0780j3806M9571N9588L7013
8600H74686L1450K1177J7909O7004L6701O2773N9746N9986J00562J60056R3158
8589A585208J06633J67106J36813J64253K27635L73939N65325Q74429J077830
8580E279171O42092j01050n50129p42597p19943n82498m92781l80568k99516j97464
8570A854717j88478j48891j62004j60761j09934o6274p8441o8886r6003o8345
8560G06700O270M174k5728o0459n4913K3506j4861j6325J2599J1763L3071j9301
$$ plain form
8633 663675 717941 767433 819504 891606 1090722 1359866 1797168 2272864 2505655 2447366 2154721
8622 2154721 1803014 1441890 1210399 1073826 942997 857379 758655 745943 774720 725834
8612 725834 703115 684991 697197 694665 701267 707074 731540 742320 728514 778085 837673 874686
8600 874686 906136 927313 945222 1012226 1048927 1111700 1171446 1231432 1331994 1492050 1585208
8589 1585208 1691841 1858947 1995760 2160013 2387648 2761587 3326912 4201341 5279171
8580 5279171 5921263 5820213 5270084 4527487 3807544 3225046 2732265 2351697 2052181 1854717
8570 1854717 1666239 1517348 1355344 1194583 1084649 1018375 939934 871048 775045 706700
8560 706700 712970 717144 691416 630957 576044 599550 584689 568364 580963 592726 625797 606496
8548F06496J5632N3391N6662K0520K4827k4358k7987m7100J2245N6350J62710
8537I09388L06839M85151M14546O2802k41063l50471l21407k68112j44494j03670
8527G49509j19123p4041m4142p7417j003k3101m690N087j0289R77j8574p576N942
8514C81559l8714m9533n786M0510J5263n67K3378k9204J040L5326j1305M944l1514
8501C35397j0594j2904k1532k6211m44M1679O623k7158l7481M951K084p666k554
8488B44190j3333j8420K1076M0875M4103J1569j6090j9196j3749l1225k4614K9427
8476B54613N497k5944j7827J4724K0210k2889P298n6007k7439p764l5795M0261
8464A48938J9889O9530J4508j2321j7493P2689M0549J387n6018o3768j0390k495
$$ plain form
8548 606496 622128 675519 732181 752701 777528 753170 725183 678083 690328 746678 909388
8537 909388 1216227 1701378 2115924 2178726 1937663 1587192 1265785 997673 853179 749509
8527 749509 630386 556345 512203 434786 433783 410682 405992 411079 400790 401767 383193 375617 381559
8514 381559 342845 293312 287526 328036 343299 342732 366110 336906 337946 373272 361967 366911 335397
8501 335397 324803 311899 290367 264156 263712 305391 312014 284856 247375 252326 254410 246744 244190
8488 244190 230857 212437 233513 274388 318491 330060 313970 294774 281025 249800 225186 254613
8476 254613 260110 234166 216339 231063 251273 228384 235682 179675 152236 144472 108677 148938
8464 148938 168827 238357 252865 240544 223051 295740 336289 337676 281658 217890 207500 205005
8452B05005J7026k586n2095J4660R569K0597R465j4364L2199J2771m4751P359
8440B14855J8243K9444J7765l5072q5250l4923J0244J0901L110K8499p15m2088
8428A35013k1727J7949M7754M0437N246k7433l0590O652r148L0988j6523M679
8416A83297M0142q66k503l0165L877n394M757J6622m3190j5390Q143M445l7570
8403A26205J2815M5551K96N43O608J2050j1405J5114k5883q520J0157P786l0049
8390A61268J12K9596J5400j03p586P526L6210l2852p3673j1646J6838J7627k0786
8377A37931Q423r366K4221M074k1312l2941M968o253M2138J0946j0578k8112k2953
8364A01186n5349L1429P08q78m564L855L33M5959l2871K8244k128J0115N6049
$$ plain form
8452 205005 222031 219445 167350 182010 191579 212176 221641 207277 239476 252247 207496 214855
8440 214855 233098 262542 280307 245235 159985 125062 135306 146207 149317 177816 177101 135013
8428 135013 113286 131235 178989 219426 224672 197239 166649 173301 164153 195141 178618 183297
8416 183297 223439 222573 220070 189905 193782 188388 193145 209767 166577 151187 159330 163775 126205
8403 126205 139020 184571 184867 185410 192018 204068 192663 207777 181894 173374 183531 191317 161268
8390 161268 161380 190976 206376 206273 198687 206213 242423 209571 135898 124252 141090 158717 137931
8377 137931 146354 136988 161209 165283 143971 111030 115998 109745 151883 162829 152251 124139 101186
8364 101186 45837 77266 77974 77096 72532 76387 76720 122679 89808 118052 115924 126039 182088
8351A82088j2112P227K3449N431j2308j5160j9078j222j7865j4011j8777K3770
8339A31432N7525K1588p9627j0217K4136q101l3826M4819K0020p793n1615q343
8327I9998K0162k276m2083J8449O1030J2218j9827m1400J1409N945K3945r876
8315A37694l7581l8873L8017K579j4983M0779P85j3442M624J2474M0903L022l0700
8302A45298m5653L7982O9841m3847j8799j0483l7560k0926M634j3537L3350j1457
8290H8843l0736J2280J6607N6457J5876j8998n9489J820R794l0079J8050N33K4674
8277A05632L4758n657l1544L952K8765L9823O312J1602J5950l7314m5098l1901
8265I5280K9603L7670k2879j7513K1885k9264m450k2032r685K2649N5584J4973
$$ plain form
8351 182088 169976 177203 200652 206083 193775 178615 159537 158315 140450 126439 107662 131432
8339 131432 188957 210545 130918 120701 144837 136736 102910 147729 167749 159956 108341 99998
8327 99998 120160 117884 75801 94250 155280 167498 147671 106271 117680 123625 147570 137694
8315 137694 100113 61240 99257 101836 86853 127632 128417 114975 119599 132073 172976 175998 145298
8302 145298 99645 137627 207468 163621 144822 134339 96779 75853 80487 66950 100300 88843
8290 88843 58107 70387 86994 143451 159327 140329 80840 82660 92454 62375 80425 80958 105632
8277 105632 140390 134733 103189 107141 135906 175729 182041 193643 209593 172279 127181 95280
8265 95280 124883 162553 139674 122161 144046 114782 110332 88300 78615 101264 156848 171821
8253A71821p675m3016m8310l4714K5122M5389l8344L365K655j5813q872k67K647
8240E3988K9268k0331l0019J5080R210J1591r313n0606L3271M5321K4575J1543
8228A23578N872Q852k5127L8300L4583k4020l8188n268M2725J5476k1436K6350
8216A81697J1164l7901p0760M740p341j1074l787J0603l0786N371N7799L2375
$$ plain form
8253 171821 164146 121130 72820 38106 63228 108617 70273 73638 76293 60480 51608 51341 53988
8240 53988 83256 62925 32906 47986 57196 68787 59474 8868 42139 87460 112035 123578
8228 123578 129450 138302 113175 151475 186058 162038 123850 118582 161307 176783 155347 181697
8216 181697 192861 154960 84200 88940 81599 70525 66738 77341 46555 51926 109725 142100
$$ [...]
##END NTUPLES=NMR SPECTRUM
##END=
