##TITLE=Analysis number 313117
Compound Code cc 42746
Book Reference 439/39/37
Project Code adrs
Chemist Name ronp
##JCAMPDX= 6.0         $$ Bruker NMR JCAMP-DX V2.0
##DATA TYPE= NMR SPECTRUM
##DATA CLASS= NTUPLES
##ORIGIN= Bruker BioSpin GmbH
##OWNER= NMR
$$ XWIN-NMR		Version 3.5
$$ Wed Aug 24 15:08:00 2005 GMT Daylight Time (UT+1h)  MAYBRIDGE\NMR@NMR_250MHZ
##.OBSERVE FREQUENCY= 250.131544655141
##.OBSERVE NUCLEUS= ^1H
##.ACQUISITION MODE= SIMULTANEOUS (DQD)
##.ACQUISITION SCHEME= undefined
##.AVERAGES= 16
##.DIGITISER RES= 18
##SPECTROMETER/DATA SYSTEM= dpx250
##.PULSE SEQUENCE= zg30
##.SOLVENT NAME= CDCl3
##.SHIFT REFERENCE= (INTERNAL, CDCl3, 0, 16.522)
##AUDIT TRAIL= $$ (NUMBER, WHEN, WHO, WHERE, WHAT)
$$ ##TITLE= Audit trail, XWIN-NMR		Version 3.5
$$ ##JCAMPDX= 5.01
$$ ##ORIGIN= Bruker BioSpin GmbH
$$ ##OWNER= NMR
$$ C:\u/data/dgb/nmr/ADRS/8560/pdata/1/auditp.txt
$$ ##AUDIT TRAIL=  $$ (NUMBER, WHEN, WHO, WHERE, WHAT)
(   1,<2005-08-24 15:07:41.44 +100>,<MAYBRIDGE\NMR>,<NMR_250MHZ>,
      <created by zg, POWCHK disabled, PULCHK disabled
       configuration hash MD5:
       62 19 C7 07 E1 42 D1 B7 37 6C 3D D0 77 39 F9 E6
       data hash MD5: 64K
       BF B2 A1 65 58 FD 7A 21 EC CE B6 8F 58 DD A3 F0>)
(   2,<2005-08-24 15:07:52.94 +100>,<MAYBRIDGE\NMR>,<NMR_250MHZ>,
      <Start of raw data processing
       ef LB = 0.3 FT_mod = 6 PKNL = 1 SI = 32K 
       data hash MD5: 32K
       B9 40 14 94 D9 BF B6 75 FE E6 13 4D E8 D7 1C 6C>)
(   3,<2005-08-24 15:07:54.69 +100>,<MAYBRIDGE\NMR>,<NMR_250MHZ>,
      <apk 
       data hash MD5: 32K
       4E 50 F3 A7 08 4F 06 DD 2B EC 06 23 30 97 00 2E>)
(   4,<2005-08-24 15:07:55.52 +100>,<MAYBRIDGE\NMR>,<NMR_250MHZ>,
      <abs ABSG = 5 
       data hash MD5: 32K
       96 D9 50 4C 80 62 79 5D FD 88 4E 2E 8A 68 95 32>)
$$ ##END=
$$ 
$$ hash MD5
$$ EB DD 57 15 0D 1D C7 A6 0E 54 4F EF F9 1B 21 66
##$RELAX= 
##$RELAX= 
##$RELAX= 
##$RELAX= 
##$RELAX= 
##$RELAX= 
##$RELAX= 
$$ Bruker specific parameters
$$ --------------------------
##$DU= <C:\u>
##$EXPNO= 8560
##$NAME= <ADRS>
##$PROCNO= 1
##$TYPE= <nmr>
##$USER= <dgb>
##$AMP= (0..31)
100 100 100 100 100 100 100 100 100 100 100 100 100 100 100 100 100 100 
100 100 100 100 100 100 100 100 100 100 100 100 100 100 
##$AQSEQ= 0
##$AQ_mod= 3
##$AUNM= <au_zg>
##$AUTOPOS= <46 >
##$BF1= 250.13
##$BF2= 250.13
##$BF3= 250.13
##$BF4= 250.13
##$BF5= 500.13
##$BF6= 500.13
##$BF7= 500.13
##$BF8= 500.13
##$BYTORDA= 1
##$CFDGTYP= 0
##$CFRGTYP= 5
##$CHEMSTR= <none>
##$CNST= (0..31)
1 1 145 1 1 1 1 1 1 1 1 1 1 1 1 1 1 1 1 1 1 1 1 1 1 1 1 1 1 1 1 1 
##$CPDPRG= <>
##$CPDPRG1= <>
##$CPDPRG2= <>
##$CPDPRG3= <>
##$CPDPRG4= <mlev>
##$CPDPRG5= <mlev>
##$CPDPRG6= <mlev>
##$CPDPRG7= <mlev>
##$CPDPRG8= <mlev>
##$CPDPRGB= <>
##$CPDPRGT= <>
##$D= (0..31)
0 1 0 0 0 0 0 0 0 0.06 0 0 0 0 0 0 0.0002 0 0 0 0 0 0 0 0 0 0 0 0 0 0 
0 
##$DATE= 1124892460
##$DBL= (0..7)
120 120 120 120 120 120 120 120 
##$DBP= (0..7)
150 150 150 150 150 150 150 150 
##$DBP07= 0
##$DBPNAM0= <>
##$DBPNAM1= <>
$$ [...]
##$SUBNAM6= <"">
##$SUBNAM7= <"">
##$SUBNAM8= <"">
##$SUBNAM9= <"">
##$SW= 20.6930455092707
##$SWIBOX= (0..15)
0 0 3 0 0 0 0 0 0 0 0 0 0 0 0 0 
##$SW_h= 5175.983436853
##$TD= 65536
##$TD0= 1
##$TE= 295.16
##$TE2= 300
##$TE3= 300
##$TEG= 300
##$TL= (0..7)
0 120 120 120 120 120 120 120 
##$TP= (0..7)
150 150 150 150 150 150 150 150 
##$TP07= 0
##$TPNAME0= <>
##$TPNAME1= <>
##$TPNAME2= <>
##$TPNAME3= <>
##$TPNAME4= <>
##$TPNAME5= <>
##$TPNAME6= <>
##$TPNAME7= <>
##$TPOAL= (0..7)
0.5 0.5 0.5 0.5 0.5 0.5 0.5 0.5 
##$TPOFFS= (0..7)
0 0 0 0 0 0 0 0 
##$TUNHIN= 0
##$TUNHOUT= 0
##$TUNXOUT= 0
##$USERA1= <user>
##$USERA2= <user>
##$USERA3= <user>
##$USERA4= <user>
##$USERA5= <user>
##$V9= 5
##$VALIST= <valist>
##$VCLIST= <CCCCCCCCCCCCCCC>
##$VD= 0
##$VDLIST= <DDDDDDDDDDDDDDD>
##$VPLIST= <PPPPPPPPPPPPPPP>
##$VTLIST= <TTTTTTTTTTTTTTT>
##$WBST= 1024
##$WBSW= 4
##$XGAIN= (0..3)
0 0 0 0 
##$XL= 0
##$YL= 0
##$YMAX_a= 407069
##$YMIN_a= -425540
##$ZGOPTNS= <>
##$ZL1= 120
##$ZL2= 120
##$ZL3= 120
##$ZL4= 120
##$ABSF1= 16.522
##$ABSF2= -4.171173
##$ABSG= 5
##$ABSL= 3
##$ALPHA= 0
##$AQORDER= 0
##$ASSFAC= 0
##$ASSFACI= 0
##$ASSFACX= 0
##$ASSWID= 0
##$AUNMP= <proc_1d>
##$AZFE= 0.1
##$AZFW= 0.1
##$BCFW= 0
##$BC_mod= 0
##$BYTORDP= 0
##$COROFFS= 0
##$CY= 12.5
##$DATMOD= 1
##$DC= 0
##$DFILT= <>
##$DTYPP= 0
##$F1P= 14.0000005364418
##$F2P= -0.99999901652339
##$FCOR= 0.5
##$FTSIZE= 32768
##$FT_mod= 6
##$GAMMA= 0
##$GB= 0
##$INTBC= 1
##$INTSCL= 1
##$ISEN= 128
##$LB= 0.3
##$LEV0= 0
##$LPBIN= 0
##$MAXI= 10000
##$MC2= 0
##$MEAN= 0
##$ME_mod= 0
##$MI= 0
##$NCOEF= 0
##$NC_proc= -3
##$NLEV= 6
##$NOISF1= 0
##$NOISF2= 0
##$NSP= 0
##$NTH_PI= 0
##$NZP= 0
##$OFFSET= 16.522
##$PC= 1
##$PHC0= 130.916
##$PHC1= 2.654938
##$PH_mod= 1
##$PKNL= yes
##$PPARMOD= 0
##$PSCAL= 4
##$PSIGN= 0
##$REVERSE= no
##$SF= 250.13
##$SI= 32768
##$SIGF1= 0
##$SIGF2= 0
##$SINO= 400
##$SIOLD= 32768
##$SREGLST= <1H.CDCl3>
##$SSB= 0
##$STSI= 32768
##$STSR= 0
##$SW_p= 5175.98343685301
##$SYMM= 0
##$S_DEV= 0
##$TDeff= 65536
##$TDoff= 0
##$TI= <Analysis number 999999
Compound Code 99
Book Reference 9
Project Code 9>
##$TILT= no
##$TM1= 0
##$TM2= 0
##$TOPLEV= 0
##$USERP1= <user>
##$USERP2= <user>
##$USERP3= <user>
##$USERP4= <user>
##$USERP5= <user>
##$WDW= 1
##$XDIM= 32768
##$YMAX_p= 351942000
##$YMIN_p= -64858
$$ End of Bruker specific parameters
$$ ---------------------------------
##NTUPLES= NMR SPECTRUM
##VAR_NAME=  FREQUENCY,     SPECTRUM/REAL,   SPECTRUM/IMAG
##SYMBOL=    X,             R,               I
##VAR_TYPE=  INDEPENDENT,   DEPENDENT,       DEPENDENT
##VAR_FORM=  AFFN,          ASDF,            ASDF
##VAR_DIM=   32768,         32768,           32768
##UNITS=     HZ,            ARBITRARY UNITS, ARBITRARY UNITS
##FACTOR=    0.157963299565203, 1,           1
##FIRST=     4132.6476996994, 0,             0
##LAST=      -1043.33573715361, 0,           0
##MIN=       -1043.33573715361, -64858,      0
##MAX=       4132.6476996994, 351942000,     0
$$ Real data points
##PAGE= N=1
##DATA TABLE= (X++(R..R)), XYDATA
$$ [...]
20868 -4033 -3990 1551 2544 -1756 -7939 -11353 -4116 -2519 -5124 -7319 -4193 -1046 -2195 -6529 -11300
20853 -11300 -15590 -11954 -9419 -6188 -2284 1368 -2552 -3551 -5789 -8652 -10331 -11853 -14916 -19547 -15613
20838 -15613 -7505 -6323 -4974 -1648 -780 -1316 -8347 -16084 -21458 -16387 -17910 -12662 -18959 -24923 -22282
20823 -22282 -10288 -11037 -12475 -8374 -8015 -13074 -10584 -9644 -9426 -8823 -4185 3169 -358 -13218 -18437
20808 -18437 -24690 -24949 -23553 -14267 -12194 -17520 -14799 -11534 -17741 -20988 -16609 -18236 -21695 -20342 -16190
20793 -16190 -15510 -16187 -16458 -14737 -12346 -7954 -15730 -24316 -27363 -23901 -24287 -24843 -17606 -10807 -8231 -4982
20777 -4982 -8934 -5184 -4942 -1185 -3908 -5990 -2821 -297 767 -2680 -1188 -5795 -7419 -4768 -8986
20762 -8986 -11040 -8858 -9259 -8847 -9097 -15449 -22203 -20257 -19407 -22345 -22868 -15181 -10724 -14446 -18738 -16963
20746 -16963 -8676 -4506 -5687 -11343 -9332 -16044 -25909 -17608 -12144 -9436 -9816 -7328 -8808 -5981 -5407
20731 -5407 -8605 -13898 -13582 -17212 -16854 -8199 -5466 -5359 -7990 -7468 -5158 -10675 -9555 -4403 -9094 -9684
20715 -9684 -7732 -7323 -2641 -1273 324 1663 -5680 -9696 -11234 -8262 -6128 -4042 -5994 -9902 -8493
20700 -8493 -10813 -9497 -9066 -15632 -13925 -8394 -6870 -13204 -17669 -13707 -5956 -9390 -9680 -8990 0
20685 0 748 -2771 -6910 -8794 -7358 -9424 -13677 -8957 -4811 -13929 -24084 -21917 -18738 -19574 -20857 -18465
20669 -18465 -13143 -14913 -10370 -3271 -4175 -8585 -9537 -5774 -4017 -2917 -967 -1759 -5416 -15078 -17750
20654 -17750 -10242 -11111 -7734 -5492 -11901 -7755 -2807 -3760 -5300 -7199 -11021 -13806 -12921 -8772 -6000
20639 -6000 -4083 -5652 -9436 -8736 -9397 -7575 -14216 -20785 -21066 -17137 -12626 -9502 -6081 -4327 -219
20624 -219 2046 -354 -5605 -10520 -17160 -24094 -19368 -21353 -26585 -25208 -24081 -18762 -18641 -15917 -17065
20609 -17065 -17189 -13473 -6243 -6205 -7158 -16170 -26766 -22551 -13558 -13870 -14105 -19751 -13801 -8643 -10123 -7412
20593 -7412 -4166 -4400 -1079 -3808 -7585 -10181 -12728 -15477 -17775 -19763 -20001 -14406 -6996 -5921 -6797
20578 -6797 -11063 -18797 -22945 -22827 -17182 -11990 -15187 -22665 -28035 -27105 -21450 -10535 -8639 -10714 -13804
20563 -13804 -17382 -22194 -24211 -23297 -21877 -18522 -19509 -19682 -19165 -14742 -8223 -7279 -1426 -9832 -12643 -11168
20547 -11168 -6129 -1442 2351 3861 1813 4349 -799 -4216 -3899 -2054 -1345 -7620 -9524 -10676 -10655
20532 -10655 -13900 -18424 -20980 -19365 -17607 -19811 -26427 -31597 -26749 -16793 -11765 -13618 -10297 -6905
20518 -6905 -13871 -16133 -15122 -18096 -17558 -13628 -11923 -12323 -18425 -15297 -18611 -17998 -22273 -13399 -12709 -10547
20502 -10547 -7013 -13267 -20234 -20690 -19337 -18198 -23540 -20438 -15416 -11222 -4507 -6161 -11703 -18674 -12724
20487 -12724 -9773 -15411 -11146 -7256 -11715 -9161 -5255 -1791 78 4424 -4823 -14527 -16776 -8192
20473 -8192 1842 3123 8861 8090 5979 11485 18323 23729 27763 29207 32356 42565 57435 64998
20459 64998 85875 117012 143717 175832 198315 211729 219771 224724 233456 228774 209933 192693
20447 192693 167122 136588 125380 118384 113099 111659 116676 141770 172569 202407 237581 254298
20435 254298 255041 252263 241037 219315 205360 182345 153170 120559 91535 75998 65280 58866
20423 58866 55580 50468 45324 40277 34655 35494 32540 33176 30881 26345 29263 34554 34859 26325 22752
20408 22752 26014 24782 14429 8419 4776 6024 17197 18605 16986 16635 15287 13818 15917 17296
20394 17296 18403 17476 18478 17489 19941 28750 32966 35252 42768 57970 76726 100965 120613 136948
20380 136948 149296 160486 160626 151176 137195 125569 120911 124995 141747 160911 166889 158784 147740
20367 147740 126995 98258 80430 73481 60867 58348 66955 61785 55262 64012 77123 88831 104874
20354 104874 123458 142299 162496 177661 182982 176875 163714 152706 140836 138866 148737 154508
20342 154508 166447 164893 157806 137778 109974 79562 65390 53708 43851 41440 37904 37502 33496
20329 33496 27464 29740 27822 29607 29285 33320 34207 25643 22736 19438 20589 20872 14096 11971 15307
20314 15307 13544 9769 4292 7533 7981 6073 10157 11555 3218 -2051 2114 -1850 -818 1828 4475
20299 4475 3489 923 5697 6931 11112 15370 12020 3894 -2634 -8032 -6110 -3461 -1311 627 -1000
20284 -1000 -1583 -1130 -2434 -1098 -1727 -1579 -3957 -4286 -1009 3513 9013 6282 988 -3143 -8209 -13892
20268 -13892 -18728 -12965 -17081 -19187 -19116 -15280 -7997 -3095 1902 336 740 -7281 -10207 -10318 -11558
20253 -11558 -6861 -3812 -7850 -9514 -3320 -76 3829 1463 -5737 -6501 -1947 4555 10258 2560 -2159
20238 -2159 -2212 3003 3911 3100 -2254 -3835 -11700 -10007 -5313 -1068 -1194 -3146 -2761 -9307 -9960 -13567
20222 -13567 -11374 -6775 -10778 -6890 2370 328 916 2024 -2413 -1809 -5653 -1132 -3070 485 5418
20207 5418 9891 11094 8196 4852 3985 8800 9438 5358 6017 12144 12760 4313 778 5113 3824 4848
20191 4848 6295 983 -1441 5368 8467 5752 2770 5760 6157 234 4885 5390 3375 4034 10142
20176 10142 10805 8289 4750 1978 -4273 -6531 -7043 -7180 -5027 -3781 1537 1697 -306 -2551 -2104 6732
20160 6732 2115 3918 7810 13828 26655 28891 13102 14470 14313 4450 2386 11687 12609 10878 13824
20145 13824 21965 21111 18579 22955 24641 37831 52309 56227 49520 44800 41779 39243 43721 39524
20131 39524 40005 47293 48871 38802 28584 31166 34057 35631 37488 42565 40845 33948 37779 38624
20117 38624 40313 35251 31216 35092 36492 32362 28538 28328 25206 22031 25685 24096 24947 27971 24364
20102 24364 23359 24626 25310 27366 27745 24049 22658 25732 27131 23305 15699 14395 9377 6225 10651
20087 10651 20542 25216 25172 22344 23881 21653 26393 34724 35324 40339 45830 55526 62239 71159 77126
20072 77126 79955 84286 85786 76152 77604 79390 71191 66641 59064 54867 51512 52020 57048 65683 70206
20057 70206 78872 81634 80083 76919 71907 67514 61778 52636 42115 35660 30861 29532 25181 23857
20043 23857 22043 24018 29003 37489 43698 38181 38126 38766 41761 42706 41277 35410 28865 34278 45347
20028 45347 47881 50495 44853 47359 48526 50369 50243 47227 42514 40635 39620 40475 49140 50764 54915
20013 54915 61378 80989 94017 98136 101279 103408 104720 107467 101608 90320 89306 84481 81982 82601
19999 82601 80044 79152 87225 91940 109212 125863 132647 135489 129618 124065 112885 99623 89346
19986 89346 80670 76800 72353 65143 57919 62117 70927 78283 89737 94337 106963 114470 120191 125220
19972 125220 119099 119826 121386 123292 125284 129958 135367 134999 138102 136352 129116 123252 123189 123674 129188
19957 129188 133485 138114 142139 142965 145136 151231 163408 175543 185784 194538 203029 214872 219583
19944 219583 232243 247784 262794 273297 281296 286884 294739 295326 295914 298142 305446 320620 337092
19931 337092 350757 364681 378964 387879 385175 385388 395224 415194 444854 482910 526564 572065
19919 572065 628269 694577 763918 834602 897139 952090 1005163 1058117 1112544 1157247 1195591
19908 1195591 1238714 1296548 1377941 1470594 1567960 1682004 1820200 1981012 2163399 2373840
19898 2373840 2623024 2928762 3317450 3806024 4405606 5134995 6031399 7130624 8504881
19889 8504881 10252933 12530356 15542765 19470381 24331895 29782897 35091103 39431196
19881 39431196 41869406 42561848 42167202 41075819 39694895 37371410 33862510 29830258
19873 29830258 25816974 22945113 21838148 22390244 24446240 27898729 32510785 37646530
19865 37646530 42344783 45608143 46603847 45868169 44254425 42510212 40469757 36927555
19857 36927555 31912669 26201594 20856526 16910218 14338773 12673605 11544478 10718246
19849 10718246 10057520 9499568 9002992 8539350 8106970 7718703 7391305 7132506 6936880
19840 6936880 6769897 6607591 6433310 6255421 6094168 5966745 5856296 5746202 5634175
19831 5634175 5516403 5414363 5332903 5293037 5300008 5377150 5533244 5768632 6109439 6569986
19821 6569986 7174297 7970374 9024675 10432943 12346269 14940232 18340041 22457134
19813 22457134 26785089 30460789 32540378 32200575 29899189 26805322 24206620 23353393
19805 23353393 24468570 27080711 30301000 32933773 33782656 31862939 27626130 22446386
19797 22446386 17871418 14803139 13073434 12229847 11958612 12112299 12663967 13644512 15158562
19788 15158562 17339970 20298766 24014238 28139925 31951081 34627188 35270290 33771328
19780 33771328 31164705 28332730 26481256 26482662 28194732 30897858 33486550 34839757
19772 34839757 33868694 30379144 25466361 20226038 15881716 12904820 10967335 9673760
19764 9673760 8758080 8064408 7508598 7065133 6701433 6399431 6138261 5888054 5647971
19755 5647971 5417917 5206759 5019516 4861903 4723528 4599883 4483621 4359321 4213460
19746 4213460 4049365 3859980 3660634 3469950 3284999 3106026 2941678 2796997 2659216
19737 2659216 2533368 2417868 2299542 2173422 2039964 1910013 1798759 1702868 1609693 1531443
19727 1531443 1455515 1382263 1317498 1263606 1215519 1159547 1100774 1057793 1020503 985782 954399
19716 954399 923129 894337 865993 831418 799134 777684 755622 735926 714341 686027 668324
19705 668324 656255 628671 601995 579677 564519 558640 543775 528385 525188 520423 505231 486489
19693 486489 468139 453428 433709 423731 417429 409141 407030 402535 400364 391961 378545 368319 369179
19680 369179 364947 354130 339574 327270 314705 304119 299847 289351 276926 264533 252621 241327
19668 241327 238761 234564 230676 236522 240071 236106 238588 236040 230457 228830 223616 216852 223681 231339
19654 231339 232480 232529 228916 228439 221191 214412 211165 207017 208364 206841 203776 204347 193706 186090 184266
19639 184266 180446 177367 177435 178813 177886 181997 186732 185679 191232 186188 190118 189638 181394 177343 173663
19624 173663 173175 167115 157567 155143 152547 152709 156436 150646 141011 133007 121124 117847 115035 114593 115836
19609 115836 111565 114124 121527 127560 120574 118621 125666 124570 124675 129229 132566 130822 128853 127344
19595 127344 123257 107104 96397 91774 88269 84788 85114 88518 89961 88337 83958 80527 76510 68440
19581 68440 67365 67001 68126 71273 78230 83421 87556 81948 77959 78074 79774 78568 80810 81383 86080
19566 86080 76859 68628 68443 71427 70983 76553 76510 73224 67385 64174 60503 56502 68905 77985 78300
19551 78300 73022 61675 56653 55606 56697 56369 61212 63787 58113 55846 59961 62190 65374 68321
19537 68321 67130 67330 66841 66659 62474 61240 57156 56821 59689 64795 65972 55101 51846 51986 48331
19522 48331 37144 34209 40119 37911 37223 37398 40901 40314 43604 47158 43373 44741 43679 44008 45404
19507 45404 47627 51935 53169 55956 55111 53007 58397 59312 63593 57875 56365 55400 56656 58711 56850
19492 56850 48822 52814 62205 66564 73705 85711 87555 88284 96798 101802 114950 138245 161183 190034
19478 190034 226690 271321 318518 358500 374041 382553 377873 374523 381074 386844 376905 351543 309982
19465 309982 273952 250424 255569 274675 301225 336962 364874 389148 405152 406347 402750 392308
19453 392308 385662 375244 351043 311161 252139 199182 164340 135356 124667 121857 119039 113776
19441 113776 106755 103490 102199 102399 98712 90126 80374 81854 82447 78816 82497 76385 69240 63770 65418
19426 65418 71174 69713 62492 55063 57871 59907 59583 56727 57566 50034 48317 47652 50632 49168 49389
19411 49389 53221 49219 48362 46876 44934 41691 43111 42792 37611 35834 31325 28148 31274 31670 29936
19396 29936 25098 25545 25928 25798 26653 26460 28613 24840 24193 21296 22506 23863 28957 29449 30034 35324
19380 35324 40612 43274 43738 45343 41137 39725 39934 43720 52049 49817 47154 48208 46655 50307 59989
19365 59989 62320 68293 74612 83014 97879 118513 145330 172056 209478 248507 281799 292669
19353 292669 272526 241067 214549 200311 191886 195629 213315 245845 272936 292502 289567 268396
19341 268396 235412 199864 166049 145371 132979 130689 138166 145956 159491 176927 210517 252987
19329 252987 297667 332651 353963 341148 306810 263255 230854 220764 229369 242834 264078 300202
19317 300202 334848 344627 335536 305926 259148 217843 193807 186623 192381 207314 226196 248460
19305 248460 271771 288051 302530 308190 304612 295887 291259 281893 266342 247523 226227 205518
19293 205518 196616 199072 209093 225392 243980 262047 281618 298716 301714 292583 291230 285566 274177
19280 274177 259974 232175 201287 176781 150834 125576 107130 92910 79050 73322 73484 74365
19268 74365 73284 69540 67339 61860 58438 68812 79041 74095 68648 64852 65508 65671 59689 57328
19254 57328 54205 57691 57826 55105 54262 60511 62337 62065 64290 64187 75611 86811 93121 108739 132226
19239 132226 160807 177744 192271 201193 197208 184106 165985 144996 144122 149967 167160 184109
19227 184109 194075 200164 192677 176927 160159 148555 134717 115662 107729 109459 111715 110901 111455
19214 111455 121631 140474 162018 172354 185410 206564 217132 222150 214107 192779 181907 179773
19202 179773 187544 203149 219898 227325 228076 215518 197718 174965 146792 122119 102524 88449
19190 88449 79029 73852 68907 67115 62228 57670 68850 70691 64382 61835 56992 56715 55012 53830
19176 53830 50656 46173 42092 43372 42590 32528 28611 22691 26513 23517 24694 27614 27023 32278 29346
19161 29346 25551 21704 30972 34022 27121 29279 32150 31013 31406 32566 31602 28343 19865 18378 19179
19146 19179 16840 17107 10797 16661 23099 21678 20354 28371 30428 23332 19768 22359 26705 27822 24169
19131 24169 18539 17365 20748 20961 16964 13833 14801 18366 25922 28385 21135 17845 10033 11710 9475
19116 9475 4868 6600 15389 10084 9250 6255 994 -2337 -109 9945 14607 13540 18441 14792 10806
19101 10806 5692 6676 8081 9888 12345 15265 18213 13730 11292 9428 6730 13858 18939 15060 9737
19086 9737 4913 834 532 1772 -1804 -1628 5215 2531 4219 7375 9128 539 378 174 -452 221
19070 221 2294 3278 3050 -981 -2872 -1261 167 1149 -1437 970 6340 5939 303 -498 1328 4628
19054 4628 7361 6389 540 5719 9133 5974 -2140 -1161 -6783 -8988 -975 6918 7853 2994 2028 -2794
19038 -2794 950 10944 12568 11562 8793 8357 15170 10781 10815 12090 14582 7238 3414 -2919 3336
19023 3336 6525 1329 2630 4272 9949 13356 8770 7805 8986 9546 11104 5465 4163 1698 1242
19008 1242 5398 5417 3376 8477 10018 7527 4689 910 4586 9676 9588 7595 943 -800 1997 6373
18992 6373 11594 5570 -4266 -4806 -3042 -6908 -4043 576 8153 10105 3175 590 139 -3151 -9252
18977 -9252 -13725 -1738 4480 4111 -1237 -2011 6719 14255 12819 12629 18668 17525 13043 12757 10307
18962 10307 2247 -6738 -9695 -8614 -3230 -544 62 -3336 -3080 -2407 -1569 -3671 -1560 2515 9302
18947 9302 7005 9555 10122 8153 8247 4489 4750 -1945 -1148 475 -2847 -5683 -3598 -306 6293 6635
18931 6635 4196 6642 4777 4226 850 -1660 1169 -2127 -863 -2504 -1878 2277 4937 1916 6576
18916 6576 7797 11812 15306 14322 14775 13542 12151 10212 -1100 -327 13282 12468 5452 5382 2480 56
18900 56 1901 5295 3722 6501 6521 3006 3455 3616 10180 11362 7895 1162 129 -1064 -2935 4029
18884 4029 5938 3137 2157 315 -6794 -8273 -2435 226 -1291 -1275 3076 -984 -2688 -2189 893 5812
18868 5812 6468 100 -4239 -6434 -13091 -11328 -11915 -13388 -6412 2250 4129 123 -5609 -6121 -5054
18853 -5054 -8192 -9122 -4193 -4772 -2321 4516 136 -2303 1439 5394 5410 4533 3087 1883 4636 2171
18837 2171 -4057 -2729 1382 -1931 -905 -2576 424 3076 5331 -24 -5964 -9090 -8185 -8954 -10601
18822 -10601 -14504 -10881 847 5185 1362 -1108 5184 3504 3303 3435 -3075 -5700 2644 3904 6531
18807 6531 3922 4952 3618 -920 -1006 -3862 -10633 -9948 -4508 -3988 -5033 -6808 -5314 -2607 -1346 -1793
18791 -1793 1519 -509 1171 9594 8739 10820 1100 -4990 -3612 -1081 -3795 -8453 427 1971 -3886
18776 -3886 -1043 5487 11531 19377 18121 19670 22837 31598 36235 41734 42476 42119 30545 25109 18197
18761 18197 13837 4664 6601 11117 13518 7342 8863 4427 -763 -4571 -3496 -1637 831 4179
18747 4179 5355 1506 4123 9451 7377 7593 13388 7824 3230 5790 714 3167 3930 2984 1719
18732 1719 -1869 -2163 -5346 -681 3608 5572 9401 8227 5533 8026 8556 6218 2278 4398 3367
18717 3367 6489 2875 -2097 2640 7321 3926 -3335 -11363 -10112 -4687 1164 384 -5935 -5633 -3872
18702 -3872 -760 4320 1504 312 245 1273 1360 7703 16066 13590 16345 23069 33755 52272 75634
18687 75634 89724 96198 102399 92516 80720 70245 69662 74382 87837 99027 103549 96478 83484
18674 83484 71020 61243 60922 69880 74956 86288 100662 101228 96818 82984 74706 71925 73489 81557
18660 81557 90698 95099 94781 82447 59669 39423 31296 27245 24811 20115 12963 12428 16828 19936
18646 19936 17635 23392 25236 29211 41874 40020 37933 41437 45842 51904 72529 93102 109065
18633 109065 122521 124621 112994 99798 84297 76683 84008 103302 114494 113009 117898 114779 99609
18620 99609 88167 83056 83913 91635 99868 116867 130411 132309 118895 98626 88561 83947 91551
18607 91551 105309 108251 107847 102134 84421 70659 56801 43908 34780 38616 41335 44670 58131
18594 58131 74126 85162 95834 106323 121255 126515 127048 132306 130617 119991 110736 90955 66491
18581 66491 52742 44636 41061 38391 29822 29070 30303 37770 46656 46233 40845 36827 37048 39984 44201
18566 44201 49652 57000 64039 77411 94041 113698 131640 135594 133702 133031 121300 109429 85974
18553 85974 70936 56932 48144 45142 38795 37566 35597 36349 43665 47755 53066 60334 65893 78952
18539 78952 97573 124239 152184 170790 167052 158202 154092 146063 127384 109328 85876 73077
18527 73077 68761 56334 52934 50493 44857 42013 50714 55421 44867 42924 38799 45573 48526 56103
18513 56103 68207 76653 93371 104034 114571 135302 152471 173669 180003 170838 154574 137356
18501 137356 124550 105313 81615 72583 63324 54328 52526 47063 44181 39773 32177 25712 24985 24112
18487 24112 28561 34571 33582 21672 22997 27544 27728 29106 25437 22027 17274 16279 23714 24223 16671
18472 16671 12082 16709 24593 23866 18982 13791 7112 4357 13628 16454 16445 14573 9664 8872 12601 19557
18456 19557 25465 26641 19604 22388 26391 21453 11740 14739 21028 22027 18363 24339 22227 23204 23504
18441 23504 23420 25606 28578 32078 25750 10415 9983 18195 21820 29315 33096 29635 33567 33769 34633
18426 34633 38559 36624 37313 28610 34000 39911 30474 25521 23702 22199 25289 30965 23141 15683 13655
18411 13655 16250 18220 22805 18844 10796 19187 25519 21001 16735 17422 18099 17792 21167 24692 23845
18396 23845 28313 33835 28335 28478 31425 25621 22304 19389 14836 10543 17568 20705 25474 27874 28670
18381 28670 35473 38453 38989 40101 42722 40620 30931 28263 31199 32933 39261 47122 51542 53186 59946
18366 59946 67465 68701 69605 69186 66590 65759 68742 74394 71389 68890 64502 61211 61886 63600 57421
18351 57421 56248 53063 52860 52703 51733 45830 35342 23839 21815 21825 21704 24750 27763 29578 28027
18336 28027 26523 27492 26213 23913 24137 25847 20559 15246 17142 26350 29807 41337 44958 49388 51415
18321 51415 54369 60513 61662 61097 67795 74490 83296 86320 81624 78991 84674 70313 56449 55992
18307 55992 63904 64209 60976 64607 71635 75050 73580 63937 61996 67927 71860 74658 88612 100510
18293 100510 104044 97092 86769 78014 75177 82781 88781 90308 92482 90850 85096 74684 57629
18280 57629 52724 55079 57626 64473 63115 58008 52966 42629 41056 36350 34505 43305 55107 60386
18266 60386 63265 62357 63671 71124 73103 66291 60082 70289 81233 86071 90094 91659 97167 106372
18252 106372 112970 118624 126212 126791 116355 105922 107205 97687 92142 98772 103965 112357 132865 152086
18238 152086 158979 154550 149266 140897 153223 168845 180437 178354 177149 166176 167620 165598 170154
18225 170154 176164 175854 177722 178383 181114 172687 152643 138664 131294 136911 146516 144071 149227 153073
18211 153073 156274 167707 185074 198221 213786 228012 244194 264518 291362 301976 310986 329622
18199 329622 357511 395617 428597 466389 499071 520433 560740 614970 672975 754405 859623
18188 859623 977275 1106710 1250026 1409205 1608053 1852282 2170696 2611418 3232439 4129046
18178 4129046 5357097 6869282 8487907 9746028 10262960 9774299 8310486 7049566
18170 7049566 6677753 7116711 8191129 9711402 11325879 12420554 12639057 11633830 9863323
18161 9863323 8760294 8704367 9338933 10179846 10671232 10517062 9430496 7967257 7074476
18152 7074476 6902584 7338033 8267761 9522433 10708698 11287506 10978293 9451942 7350150
18143 7350150 5789970 4875747 4362493 4086705 3960685 3934189 4001248 4139713 4322690 4549140
18133 4549140 4828496 5175780 5613684 6187989 6957342 8013668 9490926 11613456 14611923
18124 14611923 18493621 22970563 27086635 29446155 29367200 26125054 21815022 19440324
18116 19440324 19475112 21422976 24811208 29049119 33026352 35641543 36271247 34636292
18108 34636292 33087559 33295787 34710539 35815379 36177692 35412287 32396349 27030444
18100 27030444 22443933 20243785 20126705 21634393 24316114 27403826 29527975 29586675
18092 29586675 26857951 21447285 16293617 12940953 10957581 9759752 9013809 8535507
18084 8535507 8220819 8003519 7800893 7577403 7347619 7192355 7176820 7266908 7476625 7835373
18074 7835373 8369102 9113947 10116962 11417306 13151694 15593991 18980904 23302753
18066 23302753 28243187 32787110 35851340 36946028 35576152 34058617 33925672 33591019
18058 33591019 31617450 26810124 20365359 15323446 12211302 10357694 9235623 8561286
18050 8561286 8182168 8014012 8006921 8139834 8431902 8924445 9651472 10668053 12025483
18041 12025483 13904454 16567993 20138499 24515082 29204047 33101058 35513064 35805859
18033 35805859 34181967 33042585 32402645 30812684 27072718 21110593 15752159 12298230
18025 12298230 10238251 8998339 8230614 7761625 7495393 7382875 7394973 7533721 7842057
18016 7842057 8389737 9255762 10492740 12050092 13693884 14946860 15534406 15176124 14212102
18007 14212102 13680553 13476238 12978631 11770706 9672718 7649198 6299536 5473140 4950157
17998 4950157 4605458 4382834 4250084 4186167 4176551 4224268 4353537 4575601 4902749 5360220
17988 5360220 5984570 6874021 8131555 9759076 11651322 13431367 14636368 15068567 14415074
17979 14415074 13527193 13100693 12613477 11556287 9473759 7099155 5401745 4381941
17971 4381941 3749483 3331252 3034842 2811147 2638552 2493232 2362479 2247200 2140117
17962 2140117 2051414 1985351 1924397 1868446 1829752 1800915 1769718 1722892 1665505 1609141 1552541
17951 1552541 1489330 1416061 1336746 1261504 1189758 1125844 1067093 1017134 977483 942337 906502
17940 906502 872641 838340 800782 762662 727172 699489 668825 632766 601459 567734 544790
17929 544790 525176 502084 483886 466586 453821 445195 435999 421325 400077 378717 359652 351339
17917 351339 346202 337371 327342 323850 314173 309358 315570 314490 305388 303202 292922 281670 263884
17904 263884 256043 245004 232731 227825 224827 223771 213413 210852 211011 206981 197311 196227 194264 192878
17890 192878 193288 195158 199855 204439 204292 208869 209398 207727 209655 206890 204020 198061 186010 172282
17876 172282 158732 152118 139594 131110 126342 117790 117010 112598 113103 112105 115071 121773 130673 141435
17862 141435 143471 147285 150864 147978 147077 145592 147281 146989 147667 150977 150972 145924 136909 128990 120831 117732
17846 117732 112323 98845 98956 95222 89660 79743 74033 81707 92901 100444 108665 113415 115997 117922
17832 117922 131344 141473 147120 150002 163309 171338 172685 167875 166976 166313 164750 155459 137084 124574
17818 124574 120454 111146 106821 102251 96040 99440 107651 107236 100578 106404 112126 111237 114790 121526 132597
17803 132597 140703 147877 152358 155103 147826 150309 152935 153591 151757 144063 134864 120361 109139 101382
17789 101382 94892 92541 89020 101007 114340 125502 137042 149661 165463 190135 230945 283382
17777 283382 326231 352938 362737 360025 336666 326692 325800 324958 306130 265605 219201 182595 151667
17764 151667 137814 135645 141845 137083 140562 148853 161758 179150 197578 221473 252907 295472
17752 295472 341807 393623 443323 480520 487148 481964 481556 502309 544030 583479 596062 562577
17740 562577 483281 401025 340984 305919 300805 312341 340049 387087 441186 475719 478494 462560
17728 462560 429823 398449 393410 393638 378452 337689 280390 248057 242029 243725 254017 270809
17716 270809 298919 318486 319974 300299 262195 215988 173181 155281 145089 127903 123744 115542
17704 115542 105601 102594 103360 107128 107064 105088 97803 91754 89443 93641 91488 93218 105530 118066
17690 118066 127661 126481 116795 104696 93301 88189 80228 83615 90072 95900 100434 106347 111456 112150
17676 112150 112632 119799 127356 133154 127484 119028 108883 95166 83871 79509 78107 83419 93189 99586
17662 99586 103326 98364 86928 77626 67340 59573 58053 55347 54692 61204 67220 67851 67766 70699 77965
17647 77965 92488 106619 116132 123967 137746 144014 136659 114917 105859 110772 121339 136876 148183
17634 148183 148919 144252 127601 113962 113142 113742 114485 125295 140486 155522 163672 162437 137538 115872
17620 115872 106953 113017 128992 144674 151171 148184 130293 107120 89075 75379 64880 61241
17608 61241 63546 64289 68264 61334 55846 53775 55589 51867 54502 56195 54182 52863 54820 58096 67076
17593 67076 81954 96401 113663 127045 126603 117832 105246 96810 92565 95792 105313 116261 122714
17580 122714 121274 119120 107758 99540 97026 95536 101987 110875 116049 118142 119040 106019 99392 99730
17566 99730 104433 110118 121403 130630 134426 127335 106879 90563 76139 68905 62095 68384 77499
17553 77499 86745 90754 92433 101641 116567 136479 159438 175543 182724 179174 170999 167133 160262
17540 160262 142363 111354 83643 72979 71038 72002 62969 60340 58553 54652 52361 51091 43069
17527 43069 41866 48055 54980 60688 73483 87268 97283 108407 118052 139090 161873 171360 178124
17514 178124 178163 167757 163112 150537 125661 94640 73765 66287 59405 54096 49706 53350 60399
17501 60399 64607 65567 59624 60599 73067 92271 109293 129102 146835 158404 160691 158563 149208
17488 149208 135985 122364 103358 83987 76127 62205 52727 44934 40393 42005 40813 37313 34238
17475 34238 35687 35749 39833 49271 51325 56554 62186 67131 75788 86010 102848 120231 135016 146379
17461 146379 148931 142163 132333 117950 102536 91147 75027 63553 55171 49292 44223 44006 40560
17448 40560 40276 40766 40063 41084 50056 53311 61699 68743 69437 70691 64083 58278 45607 33918 35124
17433 35124 32142 26875 29318 34510 33506 21694 21526 19872 15899 25110 28519 20699 16647 14004
17419 14004 13249 18803 16772 16947 14181 13361 19198 16493 18265 23075 22394 21026 17449 5424 7286
17404 7286 13405 18558 16883 15388 16050 19382 17166 13622 4735 6038 5053 7379 11829 17332 15290
17389 15290 13990 13034 10548 8856 7179 5393 8892 12215 10875 6912 4893 3947 7911 10364 9848
17374 9848 7598 9360 6350 3851 11231 14287 11315 11750 11560 6763 1404 5151 11406 7490 9213
17359 9213 12508 11100 9639 8911 5157 10704 11702 11243 15175 12842 6404 8409 7089 6114 7406 6135
17343 6135 986 -3403 -2191 1108 3436 -1800 -4417 -2586 3913 5168 10994 6169 11925 10909 9423
17328 9423 12020 13691 10767 7500 6502 -1864 6084 11150 15866 10974 8139 9781 14363 18798 11643
17313 11643 10534 11691 14777 21868 11287 8034 14788 21385 23751 17311 10513 2269 -2237 -1157
17299 -1157 2245 4580 2783 400 -591 -811 680 2425 5564 3771 5751 10306 10714 10002 7720 13335
17283 13335 10223 7742 8773 7394 8238 15582 12740 5039 6354 3303 5380 3075 10410 13893 11302
17268 11302 14070 18082 14939 8000 3014 1105 -346 1115 6133 6350 8581 1866 -3710 -12344 -6511
17253 -6511 -4641 899 4873 3699 452 781 2690 361 -1853 -8883 -9152 -6702 -2047 7143 3081
17238 3081 3192 11239 8708 8119 13334 12216 5682 8530 16714 18683 12646 10379 10288 4515 1346 -5060
17222 -5060 -2304 1715 1242 2585 4945 5778 3233 6012 5253 3998 4663 5828 3535 2420 -1394 -7428
17206 -7428 -2224 1275 -1341 -3046 -2154 -5783 -3567 -669 -1106 -3478 -631 -4366 -2053 2870 6211
17191 6211 -1114 214 632 209 1176 1919 4258 5099 7157 10956 8409 2280 1951 -2273 -3235 -5399
17175 -5399 -10728 -7331 -4743 -4185 2146 3501 -804 -1489 -1338 -327 7217 4911 5126 7017 2181 -1311
17159 -1311 2243 1786 -282 4022 2143 1288 2005 -41 335 1695 197 -518 -545 -4527 5024 5591 4638
17142 4638 -1761 -5518 -7892 -8283 -6048 833 3128 3450 4493 -2978 -5422 -3911 -259 5180 9024
17127 9024 12265 10265 3162 499 2245 1965 -1629 979 522 -3076 339 6237 10124 9684 9859 10679
17111 10679 2373 -5614 -1002 1965 6020 4514 -245 1623 -2274 -4058 -4696 -1508 -5765 -4163 -1593
17096 -1593 -4416 -7251 -7976 -8456 -6294 -3296 -1179 -3332 -8253 -10361 -7772 -929 1465 1987 7291
17081 7291 7180 3436 -306 -3164 -1568 -2248 2491 4636 9048 7233 4996 2739 -3717 -12393 -18079
17066 -18079 -19409 -14578 -7045 -7706 -7076 -5974 -8293 -11062 -14018 -7881 3572 4816 -1218 -3668 -192
17051 -192 3307 5532 9872 5163 -2898 2004 8554 11467 13252 10459 8061 6535 -708 -2581 -138
17036 -138 -2653 -8218 -3475 3362 2103 1363 -1338 -6551 -3317 -3360 -9092 -7408 -2423 188 -2036 -3080
17020 -3080 4326 8773 5069 -540 -10473 -4248 -2032 -5080 1671 2551 1149 2052 874 836 -2221 -11865
17004 -11865 -12468 -3126 -3705 -6941 1932 5322 7362 12783 6281 1278 -116 3259 1043 -6563 -8652
16989 -8652 -6928 -8288 -9129 -2903 -4523 -6144 -6136 683 8577 9097 1955 -3336 -6238 -5483 3751 8084
16973 8084 3360 -1886 -2087 -2422 -3339 -4585 -9184 -11206 -8427 -7808 -4254 -5134 -1050 -4519 137 5791
16957 5791 857 2679 5885 462 3602 4770 4253 7704 7179 8257 7219 2014 1132 -1841 902
16942 902 7593 9404 2822 2447 1829 1852 -1263 -1967 -1596 -3544 -10838 -6919 1701 3903 -4184 -9343
16926 -9343 -3317 3409 921 -1377 -5156 -6983 3507 11558 9060 633 -7037 -5414 -4799 -5676 -5618
16911 -5618 -8189 -6791 -7855 -3096 -2597 -3519 -4006 -2295 1900 6632 6832 8635 5791 3078 -1415 101
16895 101 3247 3424 2509 6331 9686 11732 7361 -2163 3189 3910 2478 3834 6919 6597 7420 9800
16879 9800 2871 2706 12790 10555 5685 3691 3383 4678 817 1438 -5399 93 4369 6939 9755
16864 9755 12336 7260 5322 10087 9087 16114 25749 36703 54558 69474 82338 94437 111212
16851 111212 133166 155006 170608 192637 214101 229192 233191 232958 224306 199706 173729 158284
16839 158284 148263 135303 120596 106715 101665 104481 115619 130347 152280 178531 204520 226104
16827 226104 231259 242343 247946 248860 237808 216844 189081 169500 149097 129416 108966 87008
16815 87008 74610 61257 52734 49904 54921 52619 45109 44521 48215 42448 36586 36193 34380 38372
16801 38372 39507 37242 30984 26370 18664 11785 14481 16001 22161 28072 24563 22927 19912 14580
16787 14580 14704 12600 5671 4438 5112 3727 5499 5909 -1020 -2551 285 -8628 -11956 -15809 -12064
16772 -12064 -10618 -1457 -297 -6836 -5550 -2662 -1920 -599 2437 4122 1090 -2030 800 3830 33
16757 33 2399 1550 -2067 -4108 -7677 -3222 4207 7529 2936 451 -3944 -5538 -6368 -10470 -8626 -1134
16741 -1134 2370 3027 6989 6578 5167 7138 2120 -2027 2520 5082 5286 5474 6201 7638 8320 5632
16725 5632 4207 2576 10175 6858 3773 2870 -894 -3414 -2851 -5363 -5000 -1934 -1263 2934 6695 11398
16709 11398 11424 8951 12577 12359 8485 4990 7060 7099 12706 10233 8302 8717 11176 12012 12733 12344 14267
16692 14267 12161 6104 5803 7581 12395 9188 8515 7835 1965 1018 6035 6492 -1130 1574 787 335
16676 335 662 1698 3287 10076 12183 10811 6398 2733 1941 1256 -980 -4031 -4956 -1614 5594 10360
16660 10360 8960 1719 -3651 -1142 7036 4674 -1793 -7088 -4102 1410 5573 7326 7690 1930 -2167
16645 -2167 -2983 -5245 -483 964 589 -1858 -4520 -7866 -3490 -532 -3306 2437 4287 5301 7320
16630 7320 6474 11045 7573 5864 9150 7620 14747 14326 10793 5935 7533 3264 7480 11175 10057
16615 10057 12966 6875 4386 5669 4390 -846 -2582 564 1933 -1826 -647 2975 8380 15518
16601 15518 16654 14034 10616 12497 17489 14241 14830 21547 23632 22281 12140 13361 5303 2753
16587 2753 5717 4601 4185 203 -5533 -12067 -11219 -8570 -7605 -5596 -428 4164 6980 6779 10820 9757
16571 9757 12248 10548 11336 14048 18102 17250 20533 22100 15427 15516 22666 24582 28018 32008 39834 49460
16555 49460 47536 46154 44005 42541 46126 40286 34581 31817 30179 37449 44688 37924 33578 31710
16541 31710 28493 28261 34740 39064 38788 33541 37615 45191 38960 38356 45371 47039 43373 40999 42098
16526 42098 40934 33213 28166 31065 27342 17719 13048 12678 14004 8472 4371 9196 9992 8554 8136
16511 8136 1089 1836 9001 12331 16604 20950 23019 23640 26797 25555 24233 24133 23833 24473 22743 26199
16495 26199 32084 44435 52580 54354 56714 55187 56165 65909 72669 68939 64375 61120 55074 43962
16481 43962 44500 46687 41015 35395 25666 32479 38855 40109 43059 48606 54020 55228 58301 62036 66272
16466 66272 71904 66276 47633 42287 37702 43039 46607 40129 28064 23277 15625 9387 13512 14832
16452 14832 10984 9057 8636 10846 12172 17825 22437 22514 16681 14442 20190 26192 23210 26120 25429
16437 25429 23541 30753 39792 44264 43943 49388 50679 46228 50968 60642 65855 71546 76132 78374 79158
16422 79158 80775 81144 78271 65059 58785 59992 58679 58247 58022 60694 69135 84083 101862 114622
16408 114622 124179 133214 148225 170575 195026 216553 240376 263181 290020 301931 316833 325214
16396 325214 329711 321896 295697 263245 244234 224422 206671 182372 169631 174834 177461 179941
16384 179941 196514 214244 246057 280196 308840 342914 374221 408792 416389 408387 388688 355673
16372 355673 328161 302021 279507 261464 246528 242557 237875 232121 232006 236217 241156 231631 229445
16359 229445 231031 237433 246961 250935 258571 265134 265115 273255 282319 289282 295251 299053 310717 321646
16345 321646 333927 344282 352325 361732 366666 373582 392052 415877 439151 470456 508929 556091
16333 556091 601381 661306 735390 811655 891598 973745 1057744 1148201 1217296 1268049 1314943
16322 1314943 1365614 1415228 1458970 1514195 1583575 1677423 1824273 2030110 2295754 2633636
16312 2633636 3060765 3589316 4243436 5052908 6047385 7280631 8817191 10824423 13480210
16303 13480210 16886653 20992704 25451186 29797680 33742664 36941321 39814222 42529752
16295 42529752 43989814 43236473 39328105 34515359 31064655 28428107 25584917 22177369
16287 22177369 19321321 17979801 18139682 19604494 22237285 25847641 30008058 34180979
16279 34180979 38033680 41157297 43846706 46451762 47888137 47130013 43051807 37484893
16271 37484893 33144711 29689573 25969988 21435005 17033268 13822518 11731062 10333126
16263 10333126 9312373 8526482 7901477 7389243 6951215 6571960 6240666 5964186 5740801
16254 5740801 5555357 5390024 5257081 5145770 5047741 4927195 4772151 4603614 4443709 4275763
16244 4275763 4083373 3862431 3624972 3391359 3188069 3002666 2830004 2661328 2504129
16235 2504129 2369942 2242709 2126126 2020833 1911743 1792243 1687763 1591186 1497691 1412452
16225 1412452 1335860 1266271 1202371 1148930 1107062 1072596 1048601 1032628 1006241 981097 951064
16214 951064 928016 908841 884310 847878 793479 741259 689151 638868 598384 564495 530285
16203 530285 506668 484874 454820 434876 420446 403055 387429 372716 353501 336503 318134
16192 318134 302735 289382 283248 278205 274420 259071 245720 235821 235719 238617 240949 241976 235956
16179 235956 231400 226249 215898 204031 194498 184350 178412 176095 176359 169574 160832 149273 147222
16166 147222 145800 144199 141572 137986 138128 139548 140508 138164 141921 139344 137678 143102 143431 143461 137222
16151 137222 136324 135546 138905 145668 149183 141165 139506 137341 129356 123657 112685 111189 111553 112031 110560
16136 110560 106612 104389 99944 96926 95982 94461 97079 106774 114377 113753 115618 119023 122522 127195 127175
16121 127175 120204 115677 113546 111862 110095 114055 114773 111028 106136 92022 88365 87921 87185 87567 78398
16106 78398 68608 62692 62834 64098 60313 62935 66883 70560 76988 83226 83504 72358 73608 79600 73474
16091 73474 67159 63034 63127 50718 34863 28922 30788 23612 24004 23528 20963 23712 30651 38755 45193
16076 45193 45581 39823 34918 35029 32011 36572 33615 37631 36747 35229 28909 23037 27360 33789 39145
16061 39145 42512 33803 32825 32090 29983 29795 27793 28828 34538 35288 33142 29408 29270 24830 27198 27477
16045 27477 23415 28206 28008 25555 27578 31879 29997 23276 15093 6277 14809 25410 27814 22404
16031 22404 21016 19904 22219 24431 23039 17425 13377 12176 15042 14459 9867 13912 11325 13834 18076
16016 18076 17029 5793 3002 8464 12472 18173 16674 10867 11425 16061 14625 5188 -1476 2113
16002 2113 3590 9721 9596 3307 5460 6093 4833 7093 18592 20421 11638 11746 21049 20939 20412 19201
15986 19201 26796 33800 29934 29654 29070 24896 13950 7287 6996 7745 6635 5826 5730 13398 21307 21834
15970 21834 26464 25273 20152 15424 12897 8489 833 1404 6329 15579 20684 24630 29028 32284 32456
15955 32456 24954 22009 21036 19263 24024 22028 20051 27549 28111 36133 39971 41838 45789 55185 64324
15940 64324 74805 86993 104760 135350 180915 223580 268288 313915 345600 341611 312237 257176
15928 257176 199789 150695 123965 106764 92547 100407 110430 110512 113262 118950 128808 149697 183372
15915 183372 226535 267568 307879 330547 332019 305005 254527 196655 144459 111505 92018 70326
15903 70326 57397 43029 38884 34132 27094 30353 33978 32231 31357 39506 35392 33448 28306 22171
15889 22171 25604 32086 31691 25631 24090 19088 18779 19018 18978 25528 22213 15012 10889 7261 6585 2808
15873 2808 235 181 8249 6137 5355 4146 39 -1400 906 -969 -5782 -7507 -6045 -2427 2369
15858 2369 -163 -1029 -6104 -1919 -2078 -3425 1922 3184 3457 1944 7392 16103 9444 275 -4846
15843 -4846 -90 1685 -6097 -7662 -6324 165 2221 4267 2527 8459 9264 8646 6727 9566 7499
15828 7499 5184 10152 5945 4551 6448 1445 -5915 -7699 -3738 349 1317 3292 11088 12213 15724
15813 15724 19582 20733 17223 13013 7057 2624 7577 10838 13973 17466 25911 27065 17310 7074
15799 7074 4260 7482 10591 8894 8412 14187 19355 22700 16235 15326 19071 20487 24215 20687 12676
15784 12676 13600 15323 21818 30089 23120 19612 19864 18316 14101 6727 6759 14164 15055 12759 11114 13272
15768 13272 17713 20980 16829 13263 15573 20590 23874 27632 25957 25756 26227 28955 23964 22782 29054
15753 29054 35098 49513 56744 57128 68583 85684 101341 119293 147127 168878 189706 210950
15741 210950 224910 234932 245027 241239 225288 202991 178558 166946 157611 141468 128163 117971
15729 117971 120011 132934 145284 154784 172170 193404 212201 234099 251060 263606 276138 279008
15717 279008 266804 238730 211070 189805 167520 140655 119275 101146 84105 74336 66207 60084
15705 60084 53233 49453 48487 49316 42309 37845 42780 39846 34942 28095 33574 38562 41689 43247 39318
15690 39318 37250 37069 36043 41720 44622 38660 30292 26583 27932 27035 26058 24473 27525 27346 25754
15675 25754 24424 22649 30676 31820 33420 33939 32975 28124 23596 21428 23260 20791 13613 5038 5366
15660 5366 6009 4845 11020 15678 13964 11894 13008 16004 24501 23954 16116 12857 10572 4189 4089
15645 4089 11789 13923 17841 18683 18848 20387 18197 14288 14393 19512 24236 26637 29857 31010 40169
15630 40169 44671 41423 48436 56884 63761 62508 56133 52174 51292 50764 53205 50741 48059 43011 34057
15615 34057 22575 30866 42567 46730 49399 50245 51220 51656 51055 52315 58509 61333 55236 49597 52362
15600 52362 51669 47860 40387 35403 32563 28368 21856 23421 24750 22607 17958 13531 13618 17641 16865
15585 16865 10890 13853 20587 22329 19899 19010 22214 21329 17911 23815 26149 25678 33217 37274 40470
15570 40470 45951 42990 41484 52454 58873 60421 64588 74305 83126 83488 77142 67672 59081 55012
15556 55012 44221 28381 25127 25476 28230 34104 39104 45214 51835 54027 65056 73365 75310 78959
15542 78959 85863 92429 90397 71859 58887 45927 29388 20200 12771 7939 7787 9431 10723 14368
15528 14368 23927 24060 18444 12061 9505 21076 25331 26694 23750 20867 23004 27407 35820 43098
15514 43098 38369 43162 53673 50339 42911 40071 49777 49934 42391 42888 43939 49234 59855 77358
15500 77358 85520 92376 101867 100679 94025 75159 57409 40753 29942 32174 41450 39437 35687
15487 35687 41094 49247 60169 67871 82105 94824 112870 125762 137346 142408 138870 123348 107323
15474 107323 91163 62555 49617 53792 61142 60193 58004 61413 62635 72952 79220 82237 93518
15461 93518 99120 101773 104606 101598 103989 98997 98009 103920 114013 119151 119888 125898 130015 126503 126940
15446 126940 132690 135345 142587 150167 156843 161732 169251 175144 177102 175218 177121 181034 182112 186887
15432 186887 199379 200954 211274 227361 237247 242385 242146 242899 256013 271428 282050 291107 299620
15419 299620 311768 320109 326700 336279 337681 345065 357569 374561 394723 412310 431743 448623
15407 448623 470694 505999 545319 590405 642825 706799 772047 844986 933890 1039767 1159857
15396 1159857 1291515 1425910 1543002 1632841 1708495 1777265 1869534 2030578 2279703 2622346
15386 2622346 3050756 3566737 4173510 4892258 5739127 6757635 8040575 9672040 11766551
15377 11766551 14541582 18341348 23617461 30760307 39684616 49402612 57997982 62688571
15369 62688571 61508436 54163072 42876070 31868228 23598852 18530389 15832893 14594592
15361 14594592 14288870 14636116 15509191 16880429 18904081 21895219 26300497 32527151
15353 32527151 40573044 49613940 57868325 62710332 62025262 55348526 44407886 33279658
15345 33279658 24491957 18639797 15022983 12766858 11283280 10250943 9475558 8832722
15337 8832722 8261711 7750101 7305428 6925900 6609696 6338288 6102785 5907989 5745176
15328 5745176 5606804 5490626 5383838 5251908 5051790 4781890 4476714 4167958 3885379
15319 3885379 3637090 3405075 3189874 2999051 2821283 2654017 2507965 2372058 2235106
15310 2235106 2110727 1993135 1882444 1785418 1693343 1593143 1509387 1435976 1360293 1286839
15300 1286839 1219004 1157666 1095843 1035821 990854 946581 899975 858564 819972 790003 751440
15289 751440 720897 687245 654108 627125 600233 576600 547248 521831 497141 480899 461614
15278 461614 437764 416818 407814 395894 377286 356012 343608 325283 301230 290118 276928 258659
15266 258659 251571 247014 241475 235590 229358 221426 216666 210288 201913 198312 191005 187459 194825 203999
15252 203999 206952 206136 205631 200161 193388 177696 166953 163286 159056 150394 140563 131663 129152 124723
15238 124723 122505 112828 114943 120559 122990 131272 137686 136965 139144 140110 135681 137468 139438 139216 135477
15223 135477 131731 128861 127986 128269 124897 121178 115718 112294 109458 102939 98458 94422 91483 91272 91002
15208 91002 98549 105684 104203 98092 94170 95562 104867 114712 118761 125781 131311 130312 125961 119581 113317
15193 113317 109327 101048 96222 100087 104936 109571 108819 103932 95803 87555 79588 65846 48084 31388
15179 31388 21017 25138 34876 41742 50806 63288 70058 70487 71236 70980 74563 70777 66120 69620 71016
15164 71016 65830 50217 31535 16955 4209 -8593 -6585 -1762 1511 7236 17182 17038 18589
15151 18589 23941 29994 30202 32746 24107 20363 18497 16548 21374 23671 18645 22816 26186 18622 15310
15136 15310 25518 31659 23556 19620 17808 18588 19522 16817 14980 13874 18090 16010 14664 15554 16357
15121 16357 19765 25217 31027 28772 25868 21396 20585 20749 20355 16701 18827 16360 13870 15382 20697
15106 20697 19520 15075 14448 20113 21066 16103 10037 6613 11611 9124 -1726 -1740 3701 4769 4982
15091 4982 640 -2673 -3556 3301 4656 3553 -2497 -929 2760 -1686 2644 9663 8487 12576 7031
15076 7031 3528 7028 14531 9009 2559 3040 6635 8711 5411 207 -2472 710 10419 10692 8837
15061 8837 11051 13645 14959 14415 11695 10465 3903 -386 4284 160 -3218 -543 5319 5861 1191
15046 1191 3266 5881 2149 2116 4995 6008 7831 6324 3221 5795 2565 1799 4632 3857 3341 26
15030 26 2977 7089 4455 5220 6847 10230 11437 21406 20557 16892 16191 11504 2429 1983 7368 6387
15014 6387 6228 1877 -494 866 3591 -960 -5066 -2875 4133 7371 7268 733 -8118 -6276 2701
14999 2701 5597 463 3118 2412 -2509 -5840 2712 4312 960 -5663 -9569 -7044 -11365 -8904 -3529
14984 -3529 -4678 -1973 -3242 -8399 -9451 -6407 -9305 -5545 -1829 -5005 -11811 -10257 -8864 -10164 -9927
14969 -9927 -17120 -18320 -16273 -16153 -11072 -7330 -10861 -24463 -23034 -12478 -9292 -18399 -18316 -18732 -16927
14954 -16927 -18123 -15501 -16936 -16720 -14895 -12092 -14643 -19497 -18538 -13891 -20204 -22579 -13331 -6782 -396
14939 -396 -6338 -7175 -8183 -9429 -6870 -10784 -17581 -19543 -14077 -10495 -11334 -6627 3113 2566 -784 5
14923 5 -1146 -7959 -6918 6620 9508 -2391 -10243 -12625 -9800 -8121 1311 1284 -5526 -2086 91
14908 91 -1514 -9985 -11311 -8880 -7373 -4868 -5372 -3187 3306 3911 545 -5266 -3846 -3435 -3718 -2597
14892 -2597 -6652 -4004 32 -5274 -11300 -12702 -7100 -5196 -10900 -10810 -7429 1732 8185 7783 11020
14877 11020 5907 -2833 3298 17652 19421 8438 -1743 -3529 -23 8104 1998 -1331 3143 6012
14863 6012 1175 -1438 -4561 -1496 1133 -549 310 -10320 -11491 -279 2862 -871 -6578 -5145
14849 -5145 -10288 -10755 -5647 -6567 -5662 2211 2328 314 -642 -119 5342 11620 10715 9770 3113 8014 12406
14832 12406 15144 8497 2394 1858 5587 11582 9375 8048 8983 9599 6749 653 -2760 2068 5904
14817 5904 12121 21499 23858 30034 38890 45698 55369 73761 95759 123921 155132 198563 248335
14804 248335 289862 317424 323659 307772 264349 207679 157691 120305 98322 91502 89678 86947
14792 86947 89960 98946 111753 125761 149797 173234 202241 246771 284844 321819 333521 317942
14780 317942 272898 214382 163715 123504 103815 87857 70066 54048 47667 42391 39718 38431
14768 38431 39778 37563 33002 29482 27170 21299 18471 25963 31149 31357 31723 31831 32868 25119 20448
14753 20448 22360 19934 14688 11262 4369 -4299 -8237 -8612 -5905 1481 9541 9493 5259 4194 544
14738 544 -9122 -8137 -1748 -4084 -5744 -652 1182 301 -4765 -10026 -13968 -12254 -9831 -12367 -6354
14723 -6354 -3319 -4407 -9152 -6919 -4360 -6464 -10719 -7279 -1669 -698 -6090 -11680 -8316 -5740 -5648
14708 -5648 -5400 348 -1555 -11561 -9485 -7011 -857 8840 8224 2287 2785 594 -5150 -12333 -18036
14693 -18036 -15852 -16084 -13935 -11930 -12841 -18931 -16281 -17021 -16580 -10483 -5898 -8844 -12825 -7031 -8261
14678 -8261 -8398 -4720 -3021 -2029 -6373 -7234 -3978 -3140 -3716 -4446 -10967 -9121 -6938 -8939 -9174 -8573 -6963
14661 -6963 -4432 5519 6044 1864 -421 -2791 -829 -610 -4893 -5461 -3545 169 2203 -1140 -6397
14646 -6397 -9641 -8293 -7348 -6611 -5738 -9121 -11185 -5602 -998 -3449 -4849 -1986 943 2882 -240
14631 -240 -5641 -3962 -214 1411 -1889 -3913 -5886 -6832 -9484 -9475 -11187 -4630 -6737 -7978 -11115 -9615
14615 -9615 -11617 -12279 -7004 -4357 -4892 -2255 -6324 -12082 -15860 -12504 -11530 -7324 -10007 -6447 -7961
14600 -7961 -10377 -12229 -10106 -8727 -15925 -12621 -9372 -7172 510 -2431 -4773 -7259 -5326 -760 -4725
14585 -4725 -8235 -7419 -6009 -12098 -15230 -15887 -19703 -16850 -13965 -10127 -4895 -3841 -6144 -7808 -8269
14570 -8269 -2672 -1189 2251 -1990 -3249 2245 5034 -3068 -15357 -16172 -5954 -840 464 -7146
14556 -7146 -12648 -16645 -16159 -12569 -10616 -8145 -8557 -11831 -2213 -408 -2263 -5919 -14206 -19291 -11294
14541 -11294 -5233 -2251 -208 1047 3336 1896 -580 -5010 -8663 -14174 -15935 -12340 -10541 -8705
14527 -8705 -8475 -8075 -10813 -14997 -18615 -17821 -12443 -5950 2253 870 -2454 -6496 -4757 -6487 -10714
14512 -10714 -17896 -16984 -6243 49 -728 -2712 -1867 -6790 -6647 -2436 -5627 -14207 -11584 -13921 -9619
14497 -9619 -3630 -4031 -850 -4958 -5070 -421 1989 -3803 -2390 -859 -8668 -6460 -6778 -6779 -7193 -12440
14481 -12440 -12091 -2365 -43 2812 3550 2180 845 -4423 -12189 -11607 -7126 -5967 -11647 -11996 -12381 -17924
14465 -17924 -15018 -16772 -17883 -11297 -14603 -13080 -8249 -13250 -14091 -4239 -4491 -968 985 -7521 -16930
14450 -16930 -20617 -20216 -12192 -11594 -16943 -13908 -15876 -11965 -12570 -13627 -13982 -12138 -10370 -7842 -12250
14435 -12250 -13734 -10908 -8349 -8511 -6063 -6320 -4457 -7587 -6279 -6541 -6011 -4380 -2981 -7262 -4409
14420 -4409 -7102 -11318 -13164 -6122 -6094 -12774 -12329 -9389 -7622 -7498 -4471 -2610 -1857 -12004 -14263 -14468
14404 -14468 -15603 -19752 -18504 -18725 -17997 -14425 -10818 -8436 -4239 -6987 -8971 -6206 -6124 -7394 -5751
14389 -5751 -4416 -5032 -12077 -14093 -14308 -16477 -17476 -17286 -22524 -23683 -25493 -21552 -23937 -25294 -22741 -18075
14373 -18075 -16107 -13819 -12999 -10711 -14144 -20721 -23961 -21392 -21867 -21067 -15253 -16303 -19603 -14829 -7621
14358 -7621 -1943 -3302 -6177 -5892 -6218 -5340 -6595 -11927 -13632 -16939 -16329 -17178 -15653 -9267 -1369 3429
14342 3429 -1769 -7556 -7800 -2939 -1618 3910 4773 2456 26 -7507 -6285 -10725 -4995 -6104 -8866
14327 -8866 -10324 -14423 -18097 -17053 -12232 -11420 -9256 -5782 -6927 -9720 -10163 -4902 -4171 -2763 2188
14312 2188 3381 -3975 -14374 -17532 -23205 -20400 -19119 -17172 -19415 -17966 -12696 -4575 -589 2266
14298 2266 681 -3938 -7884 -8392 -7945 -1522 3177 1857 -2069 -590 1085 -1621 -2281 -8455 -15616
14283 -15616 -20616 -21633 -11146 -7856 -2567 -2321 -8318 -11686 -15184 -9891 -5309 -2731 -1588 -7095
14269 -7095 -10617 -6118 -6442 -4326 -2407 -2309 -1319 -1823 -487 -1692 -4966 -3095 -568 1227 7521 3262
14253 3262 1587 -3494 -7867 -4570 -5786 -2736 -3859 -4461 -2655 -2008 -3529 -7946 -4815 -2837 -7478
14238 -7478 -10430 -15132 -18804 -19873 -10764 -6684 -9960 -10703 -13432 -19079 -30725 -28008 -24112 -22016 -21222
14223 -21222 -24462 -23710 -22445 -23096 -14611 -9452 -11712 -6038 -5707 -7225 -11641 -10606 -10261 -3473 3260
14208 3260 -618 -2992 -6214 -4144 -906 -10701 -20241 -21270 -17941 -19667 -24659 -26431 -23150 -19526 -11934
14193 -11934 -11837 -15621 -18187 -18042 -17586 -18086 -17882 -17573 -12149 -11921 -15917 -16225 -9950 -15096 -15266 -13971 -13518
14176 -13518 -12483 -14520 -14369 -18157 -14457 -11450 -8545 -10599 -9089 -5222 -1460 -1442 -3523 -4222 -5174 -3444
14160 -3444 -7742 -3747 -1450 -827 -6073 -11356 -9240 -7247 -5726 -5600 -5337 -6177 -5059 -5856 -8567 -7369
14144 -7369 -2167 2442 1342 -2727 -2786 3126 4119 5212 580 -3561 -5614 -7866 -6844 -6592 -7593 -15991
14128 -15991 -13657 -15903 -18958 -15378 -11283 -10462 -12040 -8104 -12046 -12716 -4781 -7549 -9977 -4872 -2386
14113 -2386 -10716 -11342 -2404 -6224 -11729 -21920 -30080 -28425 -16979 -10236 -7973 -6837 -5368 -9465
14099 -9465 -9926 -13482 -14341 -9940 -11376 -9280 -4084 113 -1946 -2669 -217 76 2974 5326 5903 2209
14083 2209 -4064 -1799 3736 5749 4273 5514 3399 -4161 -3920 -6969 -1952 -2812 -9957 -1698 4641
14068 4641 6879 4778 -2232 -4750 -1642 42 -7044 -1551 -1880 -10674 -11010 -11378 -14334 -8973 -6145
14053 -6145 -5814 -9111 -12208 -11049 -3072 -53 -3594 -7830 -11119 -16062 -9330 -12511 -10257 -1112 -2426
14038 -2426 -7643 -12645 -12848 -17543 -22101 -18691 -19233 -23072 -24944 -22384 -17739 -16115 -11048 -10634 -17818
14023 -17818 -24640 -27021 -27404 -13547 -6173 -5019 -5682 -8942 -4516 -644 -1482 -1778 -7155 -10133 -4967
14008 -4967 -2950 -7296 -9952 -8282 -2783 -169 -170 -1885 -897 2386 3798 3126 -2462 -8597 -7626 -12316
13992 -12316 -14627 -14970 -14807 -15669 -13141 -7751 -1709 2413 5028 -3454 -10162 -10453 -6887 -5115 -8002
13977 -8002 -11445 -9500 -11536 -12768 -12057 -11376 -12718 -20669 -18623 -11192 -11877 -10487 -13433 -18852 -11322
13962 -11322 -10771 -9778 -5049 -3212 -7098 -14131 -13402 -10645 -3207 1907 -1270 -7292 -13734 -13514 -18217
13947 -18217 -19656 -19850 -13070 -9202 -5585 -6306 -4763 -5498 -8004 -4487 -1182 -7860 -5340 -1980 -10558
13932 -10558 -11025 -6134 -4976 -6170 -1324 697 -5876 -7393 -12770 -7281 93 3445 4154 7338 10328
13917 10328 4909 -4530 -9475 -7756 -2225 -3222 -4222 -3613 -8636 -7238 -3820 -1382 -9110 -10152 -7808
13902 -7808 -7246 -5965 -7436 -14736 -18504 -17037 -17037 -15208 -10330 -10275 -15004 -18818 -8716 -10013 -13779 -12890
13886 -12890 -7023 -10253 -17401 -9637 -6589 -4234 -9489 -15043 -16828 -14298 -18398 -22175 -22716 -18638 -17473
13871 -17473 -23403 -25751 -24580 -15816 -17419 -12178 -6136 -6108 -7820 -16580 -16271 -11265 -8363 -10985 -12367
13856 -12367 -13740 -13758 -12101 -10461 -11179 -11522 -8050 -4265 -5960 -15339 -7772 -5201 -3000 -2451 -1786 -7201
13840 -7201 -10769 -4460 -5292 -10670 -13380 -13606 -5955 -4075 -6669 -14575 -18762 -22244 -22529 -22432 -20635 -12297
13824 -12297 -14862 -16317 -14787 -11518 -7056 -4171 -9365 -13591 -13024 -3893 -1304 -3724 -3505 -3751 -8333
13809 -8333 -11983 -7556 -6132 -10474 -15429 -13996 -5123 -2294 -11109 -15463 -20527 -18291 -9984 -8721 -3799
13794 -3799 -9724 -14446 -11781 -5953 -6050 -10264 -4393 -3812 -8637 -11224 -13185 -11278 -14368 -12133 -5407
13779 -5407 2120 3825 -4263 -10160 -4662 -6008 -9736 -14160 -13106 -10695 -12258 -13906 -12631 -5229 -4030
13764 -4030 -5589 -4746 -9881 -10659 -9342 -12522 -7155 -6304 -5514 -8360 -6726 -12852 -19150 -21058 -19196 -8054
13748 -8054 1053 2245 -1704 -9635 -5941 -13311 -8798 -5640 -7114 -10925 -8736 -5215 -3888 -2848 -5680
13733 -5680 -7523 -5808 -5420 -6075 -8596 -10739 -11833 -10102 -10802 -6457 -2749 -2455 3396 6191 3122 -3877
13717 -3877 -15667 -19869 -17061 -7934 -5259 -5199 -13136 -14613 -12778 -4733 -5173 -7792 -5505 -3780 414
13702 414 2651 1346 861 2943 1991 -2785 -4268 100 -1185 -193 -4863 -3541 -5032 -3559 -2640 -2860
13686 -2860 -7458 -2972 -3821 -6750 -2706 4889 1088 -3540 160 -284 -4905 -7285 -4835 -630 500
13671 500 -6475 -3747 -3526 -3174 -2071 -2469 -1955 2819 5798 5991 4560 8384 8899 10695 9529 18267
13655 18267 17639 16070 25512 34922 40081 42508 53705 60174 71334 87248 107558 133852 160622
13642 160622 198899 247683 307622 378891 480097 610810 759592 903911 1018143 1076485
13632 1076485 1078257 1037388 962759 848954 706520 555134 419461 315576 243618 205400
13622 205400 182776 160358 141740 134648 127191 119785 111535 107637 103847 102320 95032 88193 86759
13609 86759 83191 85618 88146 79743 70386 67444 57696 54661 64004 65263 58010 49207 42514 37944
13595 37944 37245 34935 30413 33143 34009 33744 33196 31369 29019 22646 16940 15595 10734 15711 23923
13580 23923 23063 20992 23393 17728 10948 10908 8709 5334 3153 3752 1921 2332 7379 2942 -3933 -4132
13564 -4132 217 23 -747 1534 -965 -5605 -6490 -2874 2643 692 621 2901 6155 14200 21191 23276
13548 23276 21046 8798 6252 3861 5868 8002 8442 6091 5889 5804 6885 1924 2572 5767 6898
13533 6898 13608 13486 15472 13243 11849 13425 13221 7958 1291 -985 -3212 301 9989 13270 11381
13518 11381 10539 11749 5390 5930 7166 -253 -160 2438 2789 7993 6209 492 -5616 611 1564 83
13502 83 -1127 -6343 -9573 -8652 -8970 -11343 -4185 5303 6672 9863 8087 6793 3734 -2857 -5290 -7218
13486 -7218 -6883 -1819 -1204 826 3336 1939 -3518 -4719 -5870 -3955 -3668 -3948 559 4298 -3523 -11238
13470 -11238 -7138 -5063 892 1047 1804 1936 2025 -4307 -3551 458 1957 1526 7057 5851 4352 466
13454 466 3 -3051 -4410 -4641 -5534 -1612 -3865 -7257 -12830 -12892 -12649 -8454 -2456 -2893 1904 8296 8537
13437 8537 11514 13299 11128 2727 -7235 -1639 1765 4245 1097 -8855 -9535 -11897 -10271 -1743 -1041
13422 -1041 -4005 -4932 -3198 -3318 -5056 836 1169 407 2221 5389 5347 235 -2002 -2795 -9065 -11564
13406 -11564 -5958 2606 991 -6850 -5814 -1935 -2241 2931 1168 2310 8069 9384 5907 13779 12675
13391 12675 565 -4404 -11567 -13656 -8691 -5962 -9727 -14894 -9529 -3563 -4832 -3353 1123 -2406
13377 -2406 -2253 -3669 2035 1155 872 -166 53 3001 -1023 -7732 -4176 583 -1843 -7920 -7903 -4355
13361 -4355 -5311 -3684 -6682 -4846 4491 10308 3857 -4315 -9527 -10188 -10593 -8118 -8933 -14951 -19103 -10914
13345 -10914 -6866 -3904 -245 927 -1035 -3742 -4796 422 -4530 -5338 -3854 3078 4592 2683 2625
13330 2625 4033 -1325 -3959 -3577 -5162 -2850 -8570 -3913 858 1664 4192 5857 10381 12048 3002
13315 3002 -3375 -4437 -4829 -1750 -266 -5236 -4753 -3297 -12113 -8496 -3469 5936 4313 -299 -5434
13300 -5434 -6246 -8333 -12540 -11667 -9048 -13960 -17821 -7372 -1237 -1972 -1437 -490 1729 -60 -1065 879
13284 879 -2849 14 -1106 -8294 -2048 -3311 -7332 -4708 -4245 -2741 -1943 -6517 -9502 -10517 -7884
13269 -7884 -5069 18 1255 2134 -4327 -7905 -11999 -8397 -7598 -10987 -14634 -10533 -9196 -11091 -10761
13254 -10761 -13713 -11453 -2358 2804 4449 -2028 -11274 -13558 -11114 -6365 -1767 3614 3030 3033 -605
13239 -605 -4187 -2633 -2881 -2093 -517 -2971 -538 -4713 -8714 -8162 -9220 -2589 2425 2543 2710 5033
13223 5033 187 -5308 -207 6069 12430 6488 182 -7197 -6574 -2057 1518 -3486 -3806 -6181 -2482
13208 -2482 3680 2661 5070 -745 -5034 -2711 952 2199 3580 2602 -1064 -2386 -5985 -2982 -253
13193 -253 -4357 -1512 1248 -123 -51 1787 7169 10322 11808 15149 11790 9436 5874 -3673 -3788 2049
13177 2049 8414 3814 281 6816 9436 9585 7859 -697 410 3855 693 -7889 -5640 -2632 -8815
13162 -8815 -7514 -11025 -6705 -3429 -1453 -2100 1165 4653 879 5331 8605 4791 7487 8240 5178
13147 5178 9776 6760 1886 2418 8867 13105 8569 6138 7756 15202 15074 18527 16849 10261 11980
13132 11980 17026 14606 10379 15568 24327 28846 41941 56299 65656 78106 91400 90924 79693
13119 79693 66415 57480 40140 24724 18816 17746 18464 18396 24987 30509 21635 11481 8373 7623
13105 7623 6056 8413 12820 17347 16740 17548 18305 13245 9149 8601 10077 7838 7109 2364 -1179 -3480
13089 -3480 -1402 2816 -2068 -8205 -11360 -8175 -7080 1039 7003 12178 10706 3024 2541 2591 -1153
13074 -1153 1111 6652 1687 435 1571 1767 3932 3780 -2537 -9007 -16683 -13241 -3162 2710 186
13059 186 1802 204 -1432 6247 4017 1072 3824 2371 1194 2312 -127 -2519 -3399 -700 2007
13044 2007 5284 128 -5325 -4749 -4027 208 2273 708 583 5066 4933 -3101 -9674 -6163 -2753 -649
13028 -649 -44 -1157 -1341 -731 -6167 1768 -1710 -124 427 -2994 -2998 144 1322 2787 6739 7190 13014
13011 13014 17510 17556 8936 6655 8090 5163 5252 9104 8120 2649 -817 -5706 -5688 -10349 -9239 -9280 -9659
12994 -9659 -12769 -12123 -9909 -9699 -7528 -13726 -10931 -1886 -1876 -1195 -4874 -9836 -14265 -9367 -3372 -4530
12978 -4530 -4456 738 5030 3318 2124 191 -607 -100 -1880 -2237 -3972 -4595 6333 15179 13532 6647
12962 6647 9300 16211 15183 11890 11270 5417 -55 -5331 -2441 -1908 -8257 -9200 -3632 -1620 -4824
12947 -4824 -3143 3770 2341 1926 52 922 -4920 -2373 -2141 -4957 -1394 2507 3091 2813 -2521 -5207
12931 -5207 -6337 4414 9991 7519 1255 -1781 2173 -1072 5082 5338 9678 10852 10203 10671 376
12916 376 217 3572 11186 9563 5336 6127 16019 18433 21377 18722 14372 10500 12177 15980 9505
12901 9505 6539 7125 8953 4873 5183 5467 4438 4342 13558 20512 21050 19747 24312 21222 12424 14547
12885 14547 9814 10324 10504 11201 16695 17120 12070 9404 3711 2118 6272 6221 5398 7300 15284 11157
12869 11157 6156 4085 4457 8791 7965 5055 3683 3970 7448 9192 4486 2114 -2810 5459 7043
12854 7043 2997 3596 1268 3986 7965 6479 5450 2757 767 282 4797 9667 3913 5704 6423
12839 6423 -1513 -3775 255 2601 -3273 -11065 -9833 -4633 2654 13420 15451 17858 21986 23293
12825 23293 16775 10810 8751 8172 8309 4282 -1755 2795 7089 8475 9846 8692 10788 10152 11915
12810 11915 11355 19554 9706 6107 4642 8597 17371 18230 17333 21504 30253 33757 36177 35622 36531 39385
12794 39385 43523 45825 46666 40417 29926 28472 34277 38087 38147 36941 36318 40302 42592 40487 42289
12779 42289 46310 57352 73511 88526 109969 116950 132276 157897 188502 223036 262388 319025
12767 319025 395859 484855 586735 690371 791129 874907 931099 955733 949335 920160 869799
12756 869799 795193 687204 564914 452990 367875 312669 268363 237104 218135 203102 185255
12745 185255 171575 160929 152202 144116 137893 133217 130364 130299 132284 131905 124375 113242 108968 104392
12731 104392 102991 110004 112787 108714 109536 103574 104946 99293 91113 84789 76919 76802 77345 73218 74165
12716 74165 68722 58564 63173 65634 58729 53864 50850 50946 56111 49917 44371 44057 48687 57541 52074
12701 52074 50929 55602 58865 56000 59342 60018 59291 60650 56715 53915 52494 45301 41743 42787 45752
12686 45752 51121 51091 45326 48725 47530 39218 31318 26979 35038 34082 32903 38354 45113 47680 45670
12671 45670 47810 47845 45551 41247 42181 41862 43740 46094 42608 44338 52536 58493 56605 55571 63425
12656 63425 66057 61804 60120 56021 60560 60538 56418 55021 46297 42363 46343 47781 48104 41510 44978
12641 44978 50707 59984 58514 52622 52921 55434 61697 62730 59578 55018 57696 57991 58047 61012 63296
12626 63296 63579 58387 56191 53751 52951 49548 46216 48410 46713 50760 55599 54906 61475 66011 67806
12611 67806 71355 70880 64360 64757 66115 69408 73923 80331 82559 81273 87930 98187 105089 116265
12597 116265 133948 154019 172381 184295 201151 214014 218915 219893 221562 219516 208701 197185
12585 197185 185979 177045 166245 150143 142309 133126 124870 120905 105312 94038 90562 89073 86529
12572 86529 85930 79157 72626 73412 77992 82120 89075 97075 109546 115516 115665 116660 115517 105468 101459
12557 101459 107926 108306 100434 99436 104167 94445 93425 99998 107369 110873 112051 114525 119940 135536
12543 135536 146030 152788 159714 162733 166360 172722 175787 181987 191357 203782 218366 237093 255793
12530 255793 270618 287129 296848 305750 307212 295492 273191 253243 231995 208398 190820 167239
12518 167239 141416 134069 133325 136097 141363 141925 148046 154456 157112 158093 153792 150677 161079 159693
12504 159693 158771 156769 154647 159675 158619 158052 159169 158468 155544 159122 162746 155755 137732 121126
12490 121126 114976 111715 104233 96980 93528 91023 92710 102083 108598 121926 137138 140438 147529 160106
12476 160106 173204 194735 206460 219548 236318 248853 269141 298329 328371 358745 396209
12465 396209 416517 428163 431285 418851 406871 380854 337286 298769 264787 219469 176112 149443
12453 149443 146377 153794 167412 182697 190100 198364 200979 206937 213958 224674 234547 243028 251113
12440 251113 260284 274340 280157 290564 296635 298888 299054 302896 309220 316409 329692 341187 349550
12427 349550 361259 367648 373241 381930 390730 395079 406739 418342 420287 430211 443857 454718 464532
12414 464532 473848 487215 510404 528049 535108 545387 562478 574792 580916 598853 615104 625504
12402 625504 637505 649352 673754 692804 703933 718788 731673 750991 775307 803491 831829
12391 831829 859115 878999 897839 927145 962022 991062 1019688 1055802 1087657 1119861 1149628
12380 1149628 1185157 1231097 1277029 1319332 1364598 1420140 1478046 1553019 1639550 1735032 1848861
12369 1848861 1974591 2113782 2258226 2414134 2589520 2786944 3002491 3243364 3517934
12360 3517934 3841097 4216525 4654860 5179313 5804286 6570766 7520972 8679454 10073114
12351 10073114 11721002 13661360 15966486 18733186 22092440 26207517 31276786 37642514
12343 37642514 45861408 56686766 70838956 88598449 109247353 130695734 149887101
12336 149887101 163682739 170270530 170400095 165995578 158269726 146499981 129268606 107583425
12328 107583425 84943454 65414484 51087128 41481742 35170695 30942984 27987028
12321 27987028 25802615 24060062 22579888 21294914 20180402 19234233 18428105 17712836
12313 17712836 17073222 16506835 15996470 15508387 15027348 14539634 14048906 13514378 12900847
12304 12900847 12224893 11515139 10823358 10156376 9529720 8951585 8413433 7913207 7449329
12295 7449329 7017441 6613892 6241167 5886736 5549977 5235930 4938755 4664833 4405732
12286 4405732 4162027 3939785 3730977 3539002 3361777 3192191 3037412 2893368 2753115
12277 2753115 2615475 2478359 2357216 2244391 2143562 2047080 1945617 1866024 1781859 1693590
12267 1693590 1610842 1540632 1480284 1418223 1355617 1296814 1245294 1194233 1143774 1100450 1055962
12256 1055962 1005529 965693 929633 893990 860940 826261 787153 759489 736855 707281 674484
12245 674484 646155 623524 596387 579248 558885 545076 531263 512833 498795 481986 467411
12234 467411 457159 448107 436446 437091 431607 436711 450717 475299 506805 536526 580930 629657
12222 629657 682203 754031 819129 883403 926114 953767 964639 956348 932987 898682 855655 816505
12210 816505 790139 771860 776930 798166 832958 882667 930068 976275 1019153 1032649 1014047 975699
12198 975699 916591 840366 752438 662341 587894 518741 457860 425708 405479 389836 377927
12187 377927 375368 371169 373587 378580 380808 376632 367530 359652 356846 354442 341181 328698 314411
12174 314411 303902 293885 284671 280502 280519 281915 287048 280577 274439 270087 265734 266715 271965 276672
12160 276672 279497 278618 272023 264256 261966 270372 267594 259210 253074 243122 221059 196038 163960 129443
12146 129443 93440 61145 37701 24567 13264 5853 1279 11934 30553 44885 65999 82217
12134 82217 92406 87668 86069 85458 90148 90081 84218 89548 92135 94221 97853 97854 102046 104139 103095 98676
12118 98676 94306 85187 83717 72738 63221 64134 65721 59673 61580 64969 62500 57855 56282 60965
12104 60965 67042 70086 67039 67511 67887 72672 76685 71067 62113 62129 63828 63019 64654 65256 60863 60214
12088 60214 69272 77149 77084 79862 80502 75868 70737 62220 55568 53128 49132 46628 41662 39017 36393
12073 36393 34121 29530 30221 35286 40645 39867 33259 24367 30044 30226 33415 42962 43179 42445 46944 47451
12057 47451 47238 44283 42281 39035 26717 25969 26275 25609 31058 32213 34215 31257 23068 17603 22587
12042 22587 25672 30455 28589 22115 30044 28677 34208 39203 37661 33830 28483 22870 33426 46128
12028 46128 47946 50116 43617 43412 48682 43667 39768 40020 32850 19979 15368 19710 15746 20948 30246
12013 30246 36486 38193 27815 27897 33227 30253 30531 21722 13247 15965 17920 11591 15906 23701 27984
11998 27984 36132 42985 44812 37739 29176 30338 31261 33326 33115 27091 19218 17089 22297 27077 29011
11983 29011 23270 18309 13122 18321 25258 26655 23721 11883 6652 9240 13272 11848 1673 -1556
11969 -1556 1021 443 5253 12378 15041 11105 11469 11493 14614 12090 14462 21691 27332 18866 9107 7396
11953 7396 5299 4600 4365 8876 14518 16188 15164 10835 2866 864 10000 18634 24679 22011 17060
11938 17060 16441 25854 25357 26080 29713 37557 43723 50516 54636 53704 53458 56061 65823 79880 99023
11923 99023 109901 133935 160630 187067 224256 274545 336178 409857 488001 571141 644258 708530
11911 708530 774649 836024 892014 949457 1003172 1049873 1094394 1115524 1103304 1069141 1020199
11900 1020199 960336 885693 785420 669489 550998 442137 359134 308426 275925 256654
11890 256654 244881 229739 220586 209368 202593 200738 191622 185169 179018 166941 162581 152930 141671
11877 141671 137304 133172 134989 130524 116565 109326 105701 113331 114552 104766 100583 96476 94090 96049
11863 96049 97810 94577 87471 86975 93156 99891 101440 105352 110562 117273 131712 141498 151777 170086
11849 170086 186245 213153 252292 299598 359352 439393 545904 680081 811711 913874 974351
11838 974351 946929 831183 668238 507333 386481 299825 249182 212222 182122 169789 156764
11827 156764 149373 139531 134964 128766 126129 121490 116827 110967 98153 91668 84137 78268 78500 77566
11813 77566 82718 80828 74398 68392 65199 60722 53961 42323 41306 38306 38922 36071 37153 40220
11799 40220 41919 36765 28298 27330 32729 41874 40579 31545 28341 30501 25118 29369 35668 42569 35899
11784 35899 25973 21320 12275 11235 8077 10191 12641 18225 15847 11769 11813 6958 10083 14748 13499
11769 13499 16515 19025 19215 20491 20966 13454 7377 10933 11571 8105 6452 6124 14271 22001 20379
11754 20379 12799 12301 15374 9407 6680 8316 13371 13700 14287 17879 21818 22700 23473 21590 22593 28071
11738 28071 24100 17330 11923 19376 19348 11982 9960 2854 3950 3418 3917 5620 11354 15075 12327
11723 12327 12842 16297 17085 17312 23743 24831 15456 9545 8277 4620 3375 3017 4251 5504 8935
11708 8935 7973 8047 8771 15898 14949 10348 4055 -2290 -9211 -5456 -3974 -4767 1637 750 -3849 -2905 -4622
11691 -4622 -892 676 -606 -2092 -7497 -11818 -4556 997 -2821 -6933 -3873 -4139 20 2864 5755
11676 5755 3227 -390 -5238 -782 -2331 -5389 -3415 -1833 7771 8721 -965 -5265 -6317 -4954 1100
11661 1100 2582 5021 2810 -8150 -11360 -6652 -3901 -7099 -11115 -4496 -6059 -614 9768 10092
11647 10092 6473 5228 3411 2772 4951 4090 218 -434 1189 3972 493 -2032 2947 9532 5107
11632 5107 -7142 -4982 2184 -1263 -623 -3571 -291 6528 9614 7071 15128 13023 11439 10597 15097
11617 15097 18494 23809 20745 10904 8874 9137 13826 12210 9043 12141 7788 12577 23656 26751
11603 26751 20228 15158 18945 21557 20728 32168 36288 36583 42503 37366 26664 26116 26515 19757 18627
11588 18627 19238 22639 17036 15230 16491 6168 9384 13820 15388 13809 12287 11866 4685 2978 4632
11573 4632 5840 9225 18381 14730 10792 13847 18010 21664 18398 20366 23285 20292 24692 20553 21786
11558 21786 18664 15475 21071 22647 19059 16216 16230 11652 6942 12984 14795 7536 6332 8193 11137
11543 11137 10457 5420 2570 6090 10997 10729 8023 8618 11901 16886 14164 16670 20449 21516 14990
11528 14990 6719 7676 9126 12953 11830 7226 3865 7730 8005 7641 12940 10188 12192 8349 4849
11513 4849 6118 3772 -18 -1566 875 -1052 -631 293 8913 10638 4492 5037 11850 11351 13664 16404
11497 16404 15341 12303 11079 6372 7061 11583 10357 5859 6181 6957 9865 5900 8671 15357 17251
11482 17251 22224 19772 12424 15830 17314 15557 18948 21026 24940 24844 20649 15134 16022 21930 25218
11467 25218 25527 27100 16995 13536 12042 15363 19912 30690 31851 24047 11979 9575 8712 3825
11453 3825 1460 -1719 -753 1899 10520 18307 20128 15525 14236 8059 1640 -3280 -1986 9538 14551
11438 14551 20689 20839 18646 19701 11632 10012 6764 4671 8474 13186 12909 12523 14319 9563 3467
11423 3467 11989 13294 15781 21041 21533 18081 20220 21361 22175 27300 32296 26978 25637 22460 16550
11408 16550 14843 20552 27861 37529 37504 36285 39051 33655 32523 28437 23316 28176 38918 35495 37754
11393 37754 40763 39340 36606 37235 31544 27822 25758 23412 20885 17716 13310 8412 12169 12030 15429
11378 15429 17546 15334 16848 22009 29916 37273 46618 52601 53100 45619 38573 28135 19566 23402
11364 23402 28494 22803 19631 24501 25243 27651 26135 24261 21065 6464 4826 9247 9146 7249 1569
11349 1569 8226 15326 14958 15460 9944 8322 14219 17935 16247 19664 21500 19007 17476 18804 22039
11334 22039 28813 21666 18761 14513 19007 25302 25283 21705 16141 18322 24480 19754 18783 23619 23199
11319 23199 22816 26582 31742 34040 39984 37962 34252 34375 42807 54660 58326 60890 66397 72518 67588
11304 67588 68856 79929 84540 81343 90390 100110 109850 130889 152839 178464 211180 243151 283493
11291 283493 320566 350134 364429 351616 312817 263111 222795 185914 153290 128930 111407
11280 111407 92722 76084 74573 70228 60614 56068 53460 48733 48045 50395 51732 52789 51291 53083
11266 53083 58185 50877 50973 52496 48258 52037 52064 50655 48772 46183 49897 45113 48663 51741 48105
11251 48105 48148 49856 47852 39339 36561 37076 37033 28633 27248 27539 30785 38352 40401 30649 29843 31319
11235 31319 28340 25102 33259 34901 31861 26255 24759 18890 13041 9699 8885 10884 22484 28491
11221 28491 29594 28716 30753 36324 35872 41439 43759 37589 38628 42644 46717 44708 41581 40131 45816
11206 45816 56360 64648 62156 67863 73858 80912 79568 80670 80161 71086 61437 52814 51203 44555
11192 44555 38082 32290 29910 20993 18436 22716 25024 22181 19579 24078 33189 30095 32576 35413
11178 35413 35096 38954 40180 36554 40478 46395 46521 55005 59604 67368 65009 57273 50148 42347 40822
11163 40822 34592 32073 35980 37900 33570 29077 27321 23948 23414 31156 32662 31269 23360 26780 28763
11148 28763 26411 30330 28399 32388 36096 32595 22913 18940 21080 22878 27762 26741 30547 31665
11134 31665 33180 29305 23855 22770 28272 26937 27590 29708 30559 31137 28375 27150 20632 17335 12819
11119 12819 10960 18091 22809 26600 30566 32017 31617 32790 34673 34321 43546 44421 36492 35540 33403
11104 33403 32424 28296 31273 37232 32177 31145 32391 32900 29198 26379 31474 36668 38903 36275 34810
11089 34810 34927 29015 29675 31619 35738 38200 36046 28862 21361 19802 19389 29107 45250 43926 41928
11074 41928 34740 33824 33479 31377 36899 51195 49315 40539 39625 42562 40628 40533 47858 47820 44428 41825
11058 41825 43267 50817 51805 55036 53978 52155 46756 46004 41576 39114 38484 34468 27321 27192 26390 25454
11042 25454 24487 27857 28472 26796 27418 31755 38282 40702 44055 50312 53275 58136 69223 79714 81993
11027 81993 82692 89027 91365 96887 104583 109245 103663 98000 91471 80229 75442 78714 76335 69121
11013 69121 57315 54135 49918 45688 41230 40537 43991 47757 48751 51797 51037 54557 53450 43743 43390
10998 43390 46127 52233 56900 56108 51948 50199 51594 51900 48106 42968 45924 45626 39071 42735 48334
10983 48334 51377 51902 51910 51495 49986 48049 48551 49559 56608 65179 60570 53343 51814 49661 44048 36489
10967 36489 36820 39919 42163 38149 32505 27959 36240 40404 46023 42013 43574 44637 44969 44897 42009
10952 42009 38982 40915 38942 38944 37027 37715 41769 44546 45434 45155 39887 41388 45245 41773 37930 36483
10936 36483 38764 41941 45089 50715 48470 47210 54434 53531 51099 46127 46376 49614 55676 47915 43657
10921 43657 39171 33209 35784 38434 39437 42634 40395 38963 45660 49359 47384 38092 37239 34576 32312
10906 32312 33146 39943 44288 43897 43899 36523 35068 38604 38399 35550 30031 32171 34795 42764 39435 41609
10890 41609 44426 39247 39637 37996 42821 45446 35794 28323 30654 37379 41570 47193 49610 46639 42937
10875 42937 45919 51526 51106 52650 49587 43810 45112 50539 51965 44227 39840 43232 44029 44053 47904
10860 47904 50518 51491 50153 49548 48030 45566 49090 52458 56750 54760 55812 56431 56254 57906 67734
10845 67734 66203 75372 81755 86606 89185 95129 95655 97840 105731 104584 92489 80939 73830 70520
10831 70520 68967 71872 75980 76560 79437 77417 70796 70477 71487 73499 74809 83745 97901 106147 113068
10816 113068 115380 122201 129715 144080 161857 179812 204991 225928 252849 282175 319004 367960
10804 367960 424956 496190 588325 723116 912077 1152354 1434640 1714189 1922057 1981578
10794 1981578 1836792 1513723 1147987 841236 634102 509937 426915 367172 328918 307353
10784 307353 289306 273766 262402 249738 237446 226893 224525 221852 219126 215583 222740 224430 223781
10771 223781 222077 222134 213557 206962 205301 203378 198508 192307 182163 180399 173385 166930 164474 162084
10757 162084 151645 142756 141257 136944 130732 126152 126442 124478 121422 120781 120754 125245 132981 131828 132558
10742 132558 126726 119833 117358 123779 115651 110054 107743 99855 96632 98911 99844 97022 89814 78500
10728 78500 81941 87841 92108 91294 98249 98621 100448 107968 116501 121826 121887 117692 115615 115285 117177 116093
10712 116093 112109 111589 119173 120446 118750 121416 120086 119270 118258 118563 121236 128659 129313 138917 144932
10697 144932 147976 147383 146210 146465 141699 135836 138748 136879 129050 122609 119031 117282 118138 120634 119031
10682 119031 124637 137006 146425 150302 153206 161906 158653 151348 146973 142144 136380 140046 153197 161353
10668 161353 163213 161394 147548 136867 131896 134359 139537 152476 163625 172485 172559 173177 179297 174589
10654 174589 166096 156042 156316 158121 160367 163345 169339 172910 175627 185159 195135 197520 203546 229062
10640 229062 248723 271135 301622 336109 370580 392253 417969 443908 465923 464977 435840 404288
10628 404288 392806 368752 325778 291982 276687 253921 235513 220537 205161 194983 187591 183998
10616 183998 177253 170567 166764 157293 152732 152655 157202 163769 164670 172729 177505 183130 192233 198594 207515
10601 207515 208015 205085 209163 206057 205033 208557 208450 203093 189284 183151 188283 199776 205845 209997
10587 209997 218539 223228 230776 242142 251910 262125 275724 281997 279768 284313 293531 310995 330950
10574 330950 359501 392503 430661 475458 517381 548454 565495 574892 542992 467859 365184
10563 365184 279232 218192 182064 161435 154780 156517 166755 182311 194527 200091 203459 210034
10551 210034 228775 247834 263771 268865 268078 264349 270588 273079 274599 278704 278324 273953 274482 274555 277580
10536 277580 282773 285242 276639 257026 228845 210246 188567 181874 197547 215716 236129 255139
10524 255139 255502 263367 273195 280974 287493 300734 326804 342068 351844 370856 396404 417503 448053
10511 448053 483455 514779 555184 618028 696553 780314 828222 822413 782957 709971 609070
10500 609070 470847 353821 333353 366366 400316 417021 405564 387648 373639 368821 374459
10489 374459 381867 386988 392839 401960 413845 423302 433422 445740 467253 489629 505266 516900
10477 516900 535707 541665 540560 534390 536526 544650 560931 586614 617851 642222 658902 670822
10465 670822 679713 688856 699525 709596 725145 735980 751099 772126 792598 803995 816747 830309
10453 830309 850637 867990 894242 918857 947292 976774 996320 1014217 1033093 1053863 1075907
10442 1075907 1097962 1129968 1168622 1198008 1227887 1261538 1298651 1327269 1361649 1405494 1464411
10431 1464411 1527512 1584996 1625077 1670239 1713632 1754963 1800671 1846315 1893840 1947077 2002316
10420 2002316 2054169 2121532 2198431 2289690 2396722 2530642 2691393 2851368 3013265 3201933
10410 3201933 3414168 3662279 3942767 4260641 4578972 4896701 5211494 5545217 5920635
10401 5920635 6382461 6961532 7689876 8596788 9697753 10967763 12369686 13891527 15570311
10392 15570311 17532366 20033360 23389302 27819701 33406450 40278272 48733869 59237168
10384 59237168 72451341 89402433 111815091 142225792 182678389 232357744 285559850
10377 285559850 330263497 351942000 340892750 293438820 223898466 160125787 115395013
10370 115395013 87066614 69225159 57640544 49839904 44410116 40508318 37586857
10363 37586857 35290204 33390947 31748900 30256093 28924791 27788944 26785419 25845463
10355 25845463 24979004 24293827 23875765 23684489 23486659 22940897 21944197 20696444 19403890
10346 19403890 18172991 17021411 15955132 14964501 14043823 13187416 12385297 11646464 10968614
10337 10968614 10333169 9732799 9174095 8663770 8186254 7732428 7293981 6871903 6484456
10328 6484456 6132381 5805382 5496249 5211183 4943007 4698424 4463367 4255314 4058398
10319 4058398 3865625 3686480 3507902 3340982 3181995 3031920 2897826 2766710 2644698
10310 2644698 2530704 2416911 2308956 2201338 2106858 2017850 1940615 1857310 1778584 1709952
10300 1709952 1635614 1568157 1506799 1441065 1383855 1339370 1292781 1243358 1200275 1155754 1108248
10289 1108248 1063765 1024309 984558 948751 910678 871398 841196 821644 799788 770733 737344
10278 737344 686787 638989 596613 566637 539245 510478 497988 498668 496308 494522 489063 487071 491595
10265 491595 493869 499442 496969 508650 527139 561507 596573 629848 657471 668730 661831 649815
10253 649815 618781 592913 567008 559535 559596 549717 536444 513774 462332 405214 360641 329103
10241 329103 331682 334953 339877 344070 350349 355153 352179 353136 363896 378709 394276 415726 443046
10228 443046 474588 502767 513089 518770 517142 504473 493562 465871 430928 397362 378014 377699
10216 377699 378614 380956 391385 407341 415137 424424 430037 431645 427623 419031 426165 425672 414622 406518
10202 406518 411624 422519 436632 445092 448629 459504 466528 462790 459645 448839 424370 388453 340238
10189 340238 274552 189891 88466 -9700 -64858 -64311 -39982 1594 54785 102710 133295 152540
10177 152540 170919 194630 207816 213495 214896 212983 209215 212690 220710 227371 232277 239890 250813
10164 250813 266340 276241 286095 305775 319764 340082 367934 404972 450629 513949 599670 710204
10152 710204 852370 1022151 1205714 1375682 1488761 1508700 1439730 1295893 1106340 925139
10142 925139 779678 679703 619717 585409 580675 606615 639921 691385 761974 859387 974645
10131 974645 1098507 1225412 1323260 1369038 1349465 1268886 1163087 1056978 973770 918400 898934
10120 898934 925864 999976 1113716 1279125 1508536 1789291 2078727 2321977 2435324 2364934
10110 2364934 2116527 1755653 1403881 1138309 972207 876576 834386 827341 857667 928879
10100 928879 1039013 1196422 1388643 1579516 1701152 1702524 1558812 1281393 1015637 824939
10090 824939 704379 626011 571149 535898 506334 471338 439758 408900 387821 382561 378880 368710
10078 368710 362939 350715 341978 334918 336084 339576 341086 347743 349827 341019 327800 322219 314221 304013
10064 304013 287729 270379 262748 254759 237930 222199 206800 199236 197981 195676 189007 186698 187008
10051 187008 185532 181587 179407 187964 189809 186236 176246 170528 168805 172608 174080 167420 163049 167820
10037 167820 162965 160552 162348 161037 159050 155010 149346 149506 146464 144541 144144 142779 138478 135414 124862
10022 124862 116354 119247 122459 120366 117049 110888 105708 94011 93123 96831 103892 104518 98332 101851
10008 101851 113087 118631 120196 121057 118361 111934 114523 117087 112020 109276 115790 117141 113270 110282
9994 110282 106135 101071 97231 91713 88422 93111 94462 90541 96742 99020 96863 91986 86592 78290
9980 78290 78817 85279 90365 95649 102469 100702 101166 109966 118189 118961 118267 126059 137593 147845 163174
9965 163174 177556 192946 214239 245556 280529 327852 390540 463501 562927 691819 859902
9954 859902 1082132 1354990 1647829 1883143 1980843 1890455 1596942 1213505 882921 653338
9944 653338 504785 409868 356653 323093 301074 287310 278478 271520 251507 245401 241650 227225
9932 227225 218046 212126 211721 210182 208163 207800 203921 195946 194153 189878 181279 170196 157027 142822
9918 142822 130972 116103 101264 98994 104320 101909 98931 103395 112881 116922 110109 110637 113975 113924
9904 113924 108898 106427 108019 107204 103424 97718 91215 83785 81477 78440 78586 87554 90132 79718 75115
9889 75115 77112 74968 75493 77529 74717 70085 69715 70518 71563 67508 64779 64004 65716 69816 69733 72025
9873 72025 74741 72893 74151 78314 80069 74861 74912 75776 70691 75661 73233 65861 63176 63622 60506 58307
9857 58307 54597 47207 40958 41448 53368 56907 64622 58958 49915 44785 43060 39327 40134 41866 52203
9842 52203 46933 41452 46236 52074 45021 42996 50347 52992 54682 49651 41839 39077 41019 43787 45810
9827 45810 51464 52694 48850 50382 52252 54189 55392 59058 65625 68677 61588 62188 61762 58356 56290
9812 56290 51204 48915 48953 56745 67986 60471 55708 55875 58583 56940 56720 59466 62298 62777 68945 74269
9796 74269 74039 74478 79227 80630 79645 78548 71807 71572 66151 58043 62219 65638 67512 61352 55870 58971
9780 58971 67849 67197 64345 60127 62326 64581 64373 63190 67803 70339 67629 70341 73948 75562 79139
9765 79139 75802 70793 65936 68679 64642 62482 65428 61667 62067 61677 60016 64511 68732 67697 64602
9750 64602 57622 52907 48398 47091 54949 61149 65442 61545 61977 59454 54279 52960 55878 56122 57264
9735 57264 63132 54271 47437 53514 49265 46467 52485 56852 53056 59274 63543 71774 74168 74063 73966
9720 73966 68397 63401 69752 71612 71635 71393 71964 78633 78140 73297 71062 66738 65258 67440 68792 70948
9704 70948 70145 78314 81445 78480 79005 70232 64778 63895 68861 72087 74334 73460 71510 72398 73972 71461
9688 71461 74143 78347 80487 80049 92938 97011 91201 86464 83587 78857 74689 79171 83152 73366 69785
9673 69785 71737 79950 86547 86235 86899 90666 89890 86504 84627 85794 90652 87251 82291 83600 85476
9658 85476 81678 76625 85040 90004 87067 82582 88758 96141 93726 92277 87819 84180 78636 78751 80628
9643 80628 75371 79471 81643 77508 81227 86415 91701 92966 92214 93489 97850 103059 103883 100377 100607
9628 100607 101797 94868 88162 82289 79576 77348 71210 71015 84451 88810 86672 88070 81935 84186
9614 84186 85134 81489 82058 87014 87617 82261 81846 79359 81889 92667 90630 79019 76758 81452 76934
9599 76934 78637 86460 83588 78092 81263 87134 86119 87577 87185 87186 82482 72657 69806 68300 69205 66948
9583 66948 75403 81830 81542 77282 80953 85970 91453 97042 99696 98749 99036 94705 90718 85006 91754
9568 91754 102100 95947 83859 87969 90272 90098 90275 87047 87400 95845 99361 100325 93827 87340 90281
9553 90281 87392 84276 86336 92108 101983 95856 95332 94423 88433 87427 91086 94257 92355 96545 93932
9538 93932 91469 100733 100328 95420 98721 102829 96363 89527 84911 83632 89467 93612 92857 86328 90229
9523 90229 91611 92392 99044 101595 105260 104018 104887 112265 109409 109695 115433 114997 105082 98609 94050 97785
9507 97785 102813 103898 101801 103237 107576 121637 123300 115318 110140 111128 114422 115059 114912 112026 112831
9492 112831 117321 120701 117194 118244 117663 120199 122259 114907 114009 115445 117012 119627 115354 115524 119718
9477 119718 123915 126226 129268 126511 124066 124310 120856 116532 117064 126927 131267 126965 126200 124718 124528
9462 124528 123021 113513 120990 124286 127402 126314 125733 130745 132097 123394 126222 133930 135982 140124 136968
9447 136968 131486 134193 140690 137610 136552 134726 133549 138789 145435 147905 153106 149153 145650 149317
9433 149317 150911 157551 152520 149484 148040 143660 148362 147810 144541 140881 144073 142886 142903 146225 146781
9418 146781 147978 150683 154035 153599 149888 150886 151856 157163 163637 164319 168302 163555 160537 165674 169017
9403 169017 172201 169523 168072 167988 162576 159996 165642 173944 174119 174530 175569 182231 182118 182911 184346 186930
9387 186930 184820 185484 187384 187325 191809 193056 194555 198979 205201 204665 199012 195666 196737 195682 195884 201533
9371 201533 199588 201220 197617 200076 199524 203972 202870 209979 210309 211576 213067 211947 212298 209923 207442
9356 207442 212964 219366 217075 214966 216335 215033 220683 221775 214702 208397 211467 218304 221448 222753
9342 222753 220617 220585 220659 217754 221549 224102 223878 231624 237359 237172 238836 241825 237399 230674 228417 230469
9326 230469 233524 233474 235374 236947 231646 235252 240608 247891 246694 238147 237642 241298 245649 253196 254692
9311 254692 260959 262760 262028 264177 265580 271370 270393 270205 272202 276457 275777 274427 279972 285000 286069
9296 286069 289475 284653 283073 291078 299048 301746 303588 303045 303184 297615 293691 298783 299124 300726 310609
9281 310609 307237 302648 304702 305430 301842 311266 311676 312537 315863 321218 324775 329296 322610 315733 320013
9266 320013 322207 320909 326567 329946 327959 331421 329260 325182 325205 325623 321899 314609 311609 311914 312658 318465
9250 318465 317427 317657 320297 325263 326383 321067 324058 334085 337351 337610 334857 330117 333238 335782 339614
9235 339614 333147 325604 328262 335079 337501 340798 338718 336329 342935 348968 350522 358530 363830 357897
9221 357897 363119 368087 365984 360921 360663 360868 364048 367374 369252 369034 371564 371053 377482 383501 392456
9206 392456 399367 392796 390455 392277 391814 389576 386992 392787 390200 388690 389111 385221 387322 396656 403335
9191 403335 406352 405901 403090 407165 412341 413938 411372 414319 422356 428352 428133 431831 434770 434905 431902
9176 431902 437453 437181 434199 434655 435442 437327 438037 437778 436232 444590 449926 452801 452677 451237 449673 450716
9160 450716 463875 466838 463718 465338 457857 455634 464497 464686 466362 475316 479384 482054 479018 472221
9146 472221 470333 476731 481240 487103 491564 496294 500151 497530 501094 501716 502616 510738 519073 520954 520937
9131 520937 522335 529542 531579 526116 524461 522639 524251 528708 533863 539239 537409 539730 541756 544735
9117 544735 553424 553811 558377 567125 579690 585078 588875 589070 591161 594034 596729 604810 611758 609380 608011
9102 608011 609418 613909 617224 614716 617906 628113 634249 637753 635916 643568 643462 643574 647088 656062 657370
9087 657370 658488 663195 664816 665252 673753 679446 685240 688444 691798 699331 703395 708932 713375 719662 726612
9072 726612 732114 734718 743757 750120 748120 751679 757874 768053 773040 771219 774752 783624 794988 803088
9058 803088 807817 809738 816390 821476 830485 826252 830455 842004 847937 855148 859066 867548 877601 882801
9044 882801 890792 896440 900962 909127 917648 921170 920990 934546 952805 955053 958752 965944 970935 972366
9030 972366 980172 986617 998460 1010569 1014242 1023981 1027662 1031731 1044282 1051508 1057558 1064652 1070602 1079841
9016 1079841 1089127 1096614 1110542 1120308 1133013 1141801 1150447 1163620 1173441 1174270 1183824 1191851 1203526
9003 1203526 1218383 1228854 1233273 1243872 1251728 1260370 1272316 1286979 1295564 1301025 1303817 1314515 1334367
8990 1334367 1347925 1360344 1373931 1390380 1409652 1422962 1437335 1447331 1461483 1474117 1485941 1502352
8978 1502352 1513768 1523939 1535330 1547049 1554673 1566410 1583553 1595049 1604219 1616195 1631421 1647984
8966 1647984 1657814 1672997 1689919 1702640 1720798 1743695 1761503 1781621 1795687 1804804 1824319 1847772
8954 1847772 1863706 1876443 1888738 1901155 1911963 1929419 1947515 1962350 1977325 2002016 2023205
8943 2023205 2038909 2058081 2073428 2095873 2123551 2151318 2171177 2187162 2206952 2224837 2250463
8932 2250463 2272675 2291816 2317713 2340431 2360950 2387891 2409213 2426906 2451642 2475992 2499264
8921 2499264 2518611 2533558 2563741 2594290 2617154 2643058 2673440 2706122 2737973 2762012 2792860
8910 2792860 2818470 2841894 2867976 2896071 2924190 2955546 2979184 3003058 3032164 3062650 3087715
8899 3087715 3114150 3140583 3164513 3195923 3227087 3256857 3288089 3318326 3348410 3386497 3422901
8888 3422901 3453079 3489206 3511596 3546449 3580837 3616380 3651369 3681157 3705505 3739002 3770934
8877 3770934 3807315 3843569 3881311 3913618 3947925 3977977 4010563 4045927 4073621 4106453 4142861
8866 4142861 4179648 4222261 4251051 4284859 4321319 4350382 4378400 4411094 4449025 4483214 4513162
8855 4513162 4550059 4584763 4614983 4651683 4674959 4700271 4733437 4769560 4794867 4820486 4846454
8844 4846454 4875249 4907600 4937697 4964054 4988933 5005199 5021233 5044994 5066777 5081369 5100414
8833 5100414 5119293 5143260 5165638 5186952 5201084 5220591 5238476 5251839 5261221 5281070 5297858 5299909
8821 5299909 5306635 5314917 5322914 5334098 5344844 5348251 5343562 5347003 5354630 5351424 5345938 5348491 5344291 5343384
8807 5343384 5338802 5329300 5324433 5318384 5305861 5291042 5282599 5274334 5260542 5256940 5252047 5236916 5215972
8794 5215972 5200631 5180716 5158196 5134374 5114378 5095005 5077869 5058673 5030782 5002482 4983797
8783 4983797 4959986 4935985 4911104 4883107 4851475 4829053 4806750 4778619 4743095 4713718 4686561
8772 4686561 4654854 4623145 4600499 4567416 4534751 4510279 4477056 4442591 4410256 4372976 4337715
8761 4337715 4312866 4283059 4253030 4223803 4188894 4152810 4114418 4083774 4053555 4013410 3981615
8750 3981615 3952593 3920679 3881684 3840253 3807111 3774438 3736214 3698067 3665053 3635818 3606093
8739 3606093 3577437 3544391 3512345 3477022 3445667 3420104 3383297 3345775 3311120 3273630 3237777
8728 3237777 3210669 3182801 3153709 3127398 3097879 3068977 3037816 3003990 2972400 2943350 2910115
8717 2910115 2883752 2861754 2840319 2808106 2776605 2753138 2729315 2704417 2685864 2662174 2635340
8706 2635340 2614189 2586783 2554203 2528212 2507363 2485364 2462906 2432776 2407188 2382788 2354195
8695 2354195 2328466 2307187 2286831 2262919 2242548 2226110 2200965 2176188 2159723 2141179 2114695
8684 2114695 2097021 2078124 2058355 2040667 2019665 2000227 1972985 1952079 1937270 1914450 1904296
8673 1904296 1891019 1871724 1849932 1831356 1807301 1793525 1778249 1761962 1744106 1733739 1726680 1714529
8661 1714529 1692465 1675050 1657859 1636850 1619990 1607519 1591300 1576311 1560246 1542212 1526798
8650 1526798 1524041 1521047 1499115 1473577 1461317 1455272 1448456 1437356 1421465 1407383 1392258 1375911
8638 1375911 1367147 1366759 1354669 1342621 1326571 1316717 1300668 1284128 1275686 1274419 1264095 1254042 1247558
8625 1247558 1235161 1220510 1207003 1192773 1178261 1166627 1157035 1153871 1148638 1140646 1130092 1120628
8613 1120628 1108389 1096212 1083820 1065364 1055430 1054402 1047698 1045421 1037622 1026046 1009694 999112
8601 999112 992725 983279 974532 969668 965609 963210 960714 957448 953155 947142 939340 929786 915808 903636
8587 903636 897069 886795 879649 877227 875251 870672 863154 857253 849478 844162 836796 829484 825090 819583
8573 819583 812663 810001 804671 795872 789223 787523 787341 777260 773233 768400 759360 753188 746856 742926
8559 742926 742089 743912 743356 742871 740623 728702 717100 709260 707093 706899 706178 702351 693262 684623 682317
8544 682317 676206 674198 679191 674533 667733 665919 667534 671111 669351 662648 662041 660227 653640 656417 666699
8529 666699 669749 670081 664597 664350 666317 664582 673207 675518 675089 675011 684417 684895 688683 692167 682157 664731
8513 664731 659293 659687 648588 630464 617466 603683 589503 573719 557927 546493 544143 542590 534656
8500 534656 531711 521295 522334 520207 522953 522463 518466 513158 510024 506778 501037 490877 479382 472957
8486 472957 470599 475434 473016 468317 462425 462421 454474 445932 444407 450476 448012 443526 443201 440491 440229 436871
8470 436871 434193 432089 430314 418463 409848 413635 416801 414301 411870 403780 398272 392721 384678 384849
8456 384849 383047 378804 371544 371093 374365 370978 368566 368182 363320 360985 357250 357602 355479 349019 344587
8441 344587 347532 349782 341549 338061 344956 335348 331482 335705 339585 337443 333417 329762 326433 319991
8427 319991 318123 326637 341815 353939 359866 365037 364839 372262 382085 380323 371616 356661 342018 333508
8413 333508 321835 310736 301591 291591 288760 285334 283907 288139 287188 284480 284659 283122 278487 279286
8399 279286 281019 283341 281263 278364 281498 278835 272136 264645 267202 275288 275631 278746 278312 273814 267655
8384 267655 262990 258832 260461 264207 259531 259366 255804 255490 257675 257882 259987 262736 259619 253560 251204
8369 251204 255742 259016 261346 254240 240322 238473 241534 236125 232599 232706 233267 233488 227486 229715 230611
8354 230611 232232 229759 225740 223035 225771 227989 230105 228216 218874 216479 220360 225594 224488 218097
8340 218097 211059 213711 218058 224027 223586 214297 211519 214474 220556 217299 210208 209674 216790 209088 204081
8325 204081 205900 197417 193855 193348 186944 189962 194679 200141 198906 203109 204270 199194 197079 193496 187610
8310 187610 184434 186809 191588 193561 191680 189895 191234 188547 191047 193092 196291 197172 196691 199636 196287
8295 196287 191066 193115 196479 191464 188665 181239 174906 178434 182561 178130 181473 179364 181640 179308
8281 179308 175427 170551 173997 174675 169374 167486 168610 169254 172036 168589 163745 163055 163363 160842 165091
8266 165091 168045 168155 170519 170772 163348 161605 163137 166812 168328 166460 157319 159610 169053 169508 169817
8251 169817 163346 160579 154319 152691 152268 152196 151860 155960 150580 149437 144997 138784 137515 141911 141882 139978
8235 139978 142462 148342 145701 141190 143753 148063 150049 149258 149885 149601 152417 148191 150007 150019 143502 141204
8219 141204 132999 133171 135300 142237 146340 139995 139212 140770 139518 143321 149139 158505 166045 171175 170019
8204 170019 170484 167888 154946 144056 136506 132984 129346 125782 134239 133728 130539 129994 125050 122637 122672
8189 122672 122379 124635 121796 119980 121819 120826 110802 104057 106541 113860 120228 118535 115359 116098 122354
8174 122354 122438 119260 117587 119853 122533 127781 127987 128091 131579 141015 140360 140019 135789 128808 123169 116116
8158 116116 110372 109482 105817 104868 102481 103416 100013 102221 105607 106826 111241 114898 109320 103464 102947
8143 102947 100069 96055 91869 92460 92065 92126 90061 87202 83473 84242 86940 83548 86687 92599 94901 89437
8127 89437 94073 97013 94663 91260 85170 84637 84169 89565 87785 89477 87099 86876 91529 92834 92300 88193
8111 88193 87068 84736 79598 74139 77010 82668 84692 85434 83104 80542 73430 68405 69738 74221 78583
8096 78583 81070 79025 79201 75146 70541 77595 82061 83072 84327 81068 82609 80203 78833 83211 84616
8081 84616 77150 70166 73806 72783 72305 72184 69309 67442 73525 77640 83112 83166 81492 83818 83518 78268
8065 78268 78555 81699 74265 72198 70038 68104 69804 71002 70181 76073 80001 82028 81699 79988 76851
8050 76851 80596 84905 78330 73251 74139 68751 70011 70823 68453 66286 65499 65754 61656 60949 60692 63177
8034 63177 68031 72057 73033 74948 72609 67749 62015 61150 61183 66153 68042 62156 57610 55992 56929 54793
8018 54793 55247 58114 60403 59527 64215 69983 72655 74773 75232 69302 68254 72375 73530 75517 77982
8003 77982 73670 67733 68775 71014 68219 60300 62724 68116 64159 53456 48246 54231 57843 60853
7989 60853 60244 63222 61117 63558 62830 64647 62920 64750 69232 61294 67830 67691 63195 60998 63558
7974 63558 66798 67511 71098 70371 73421 68183 67209 59410 56811 61302 72796 79308 73560 69399 71110
7959 71110 75928 82299 86129 82736 72957 69829 75359 78005 70646 70657 72929 72679 72740 72868 72581 69141
7943 69141 62880 63090 66218 70094 72608 67516 63761 70493 64236 65245 61010 57639 57629 63679 66107
7928 66107 66196 72030 68771 58530 62025 73319 77386 80493 82942 82735 84500 83714 81910 81819 84305 78386
7912 78386 76097 78245 77937 83500 78528 69602 70767 69020 69353 70198 71623 68884 64032 59891 66327
7897 66327 69107 66574 72019 74714 75362 66880 57062 68911 76577 74364 74679 68283 65424 70197 73803
7882 73803 73330 82274 91529 92566 88850 84102 85410 89501 86193 78621 81782 83288 81351 70650 64384
7867 64384 68889 76023 75434 72728 75277 69626 63761 61075 65703 65286 59495 53435 53633 57050 59523
7852 59523 56854 55916 60346 61547 61453 57741 52496 57869 56293 59454 64461 63304 59018 60563 61033 54802
7836 54802 54578 55960 58502 61448 57048 50833 52103 49774 51290 49837 51880 49868 52070 49564 48150
7821 48150 55962 57240 58471 43971 39898 36980 41318 45682 45165 40499 43430 45694 41856 33935 35604
7806 35604 37361 39154 40288 36411 30269 33330 39374 40173 33466 29176 24512 20251 27076 35208 34595
7791 34595 34068 39971 40085 43114 43299 39932 34571 25987 18373 22533 30167 33342 31595 33393 35127
7776 35127 36078 37149 34443 30149 35229 36564 29716 26895 25978 28212 31128 24187 17295 17736 19688
7761 19688 25542 28025 32774 26337 25248 28311 30940 33383 37648 39361 31729 31273 27925 26433 32164
7746 32164 33517 30050 27529 28151 27492 25368 20970 24264 27204 29924 32249 28690 27880 29418 28767 26394
7730 26394 24775 24980 27581 22470 27961 28221 22847 23472 19671 15269 12130 8576 14622 18568 24702
7715 24702 27679 26820 28991 22326 19501 20239 17955 16019 18296 23288 23727 24667 18886 17597 13850 14649
7699 14649 20344 21835 19723 17295 23347 23003 17953 19289 23977 30315 28022 24543 14016 10886 15953
7684 15953 27696 31460 31987 31305 27488 27954 24583 21919 25410 26403 21495 17786 15135 11686 12158 20703
7668 20703 20257 13429 9336 7161 12054 16631 14925 13011 14650 13639 13439 17236 6185 -1567 536
7653 536 5536 12805 14414 12669 13819 11459 11618 10418 10916 17171 19178 20561 20030 9991 -1041
7638 -1041 -2463 -1222 1159 10631 14091 14699 12437 9215 17118 19256 15823 13367 19174 29280 33763
7623 33763 30060 27252 27406 23875 22047 23775 24186 21415 18365 22563 20003 17669 12469 13141 20881
7608 20881 19319 16147 18214 20555 23320 20147 18588 17135 17131 18258 21512 17543 14646 11704 7547
7593 7547 5739 2007 1784 2139 7052 14658 18187 19882 18686 17826 19215 18523 20724 26383 24944 22812
7577 22812 22637 19186 18483 25053 25768 28297 25495 18172 16096 16832 16938 14556 10085 8963 5632 7430
7561 7430 8984 9035 7941 9401 5852 8765 11529 11398 9303 5391 13100 11479 11927 18660 16313 11432
7545 11432 12782 10690 10063 10435 13035 8567 7216 12639 16346 12209 7957 10531 6982 -1206 945
7530 945 4463 7960 9618 12200 14285 14878 13955 16508 10631 4820 8011 9380 5962 5732 10726 9442
7514 9442 5421 -91 -5230 -398 5705 12506 15685 18747 16747 14149 17371 20147 18757 24052 25129
7499 25129 24778 21462 17684 18924 11816 9606 10806 12698 11104 7596 6457 7065 9224 13453 14817
7484 14817 14086 8364 -1546 129 7957 7852 7012 6277 9260 15039 19596 11305 7162 2778 4338 6910
7468 6910 20469 28082 15136 8906 9351 9904 9663 11227 6075 3653 4793 9212 14884 12858 10964
7453 10964 15585 18000 16193 5743 -811 1046 5197 5363 4970 6603 10643 5569 5445 6547 7185
7438 7185 7843 1589 -6502 -9038 -7653 -5124 -4295 -1504 -3004 -4655 -590 -548 -2435 1691 756 -2282
7422 -2282 -3388 -1909 1851 6447 10188 20299 21669 17285 10457 5232 6109 9775 15150 18675 14480
7407 14480 10957 11294 11658 6463 3158 4463 9619 9955 9374 9111 14046 11097 7000 2892 7841 14364
7391 14364 13095 9712 12951 15220 14200 16034 19904 21010 24267 18218 15508 13821 17108 18381 13295
7376 13295 11269 3518 149 3842 7592 7276 9408 8040 7291 12392 12577 15960 23654 21409 23194
7361 23194 21371 11562 6137 4985 4975 52 -358 2792 1016 3118 9898 12951 8874 6031 5141 8631
7345 8631 6095 8341 10133 16785 21738 19501 14238 12481 15797 18661 12893 15123 15683 10652 7763
7330 7763 8342 5158 677 2822 1381 -394 4049 10490 14886 11898 7041 8720 4533 7548 11698
7315 11698 13363 11237 12261 5801 2376 -1745 -3806 540 1944 1489 -3564 -7953 -9652 -1900 -2978
7300 -2978 -2950 16 5059 3879 1295 -204 4690 7147 2829 -953 2474 3167 2405 -2768 -2585 -1099
7284 -1099 -984 -1045 -725 1171 1939 6163 4589 2045 6103 15878 14215 13409 12180 13988 14424 15723 11795
7267 11795 7191 9818 12371 11812 11074 12364 12941 8848 1136 -321 2469 -2432 -5520 -7202 -1570
7252 -1570 6028 5662 2418 -1908 -3236 -7120 -7191 -1893 2368 473 -1536 -2845 -2380 -436 -13 -854
7236 -854 -1951 4081 11133 7422 12981 13076 8829 7773 -1314 1007 -3196 -4716 862 588 -975 -1034
7220 -1034 -3474 -4580 -11482 -12067 -9135 -7607 -11150 -16131 -13306 -10640 -11033 -8797 -1698 2848 2303 1591
7204 1591 2965 5063 768 -4687 -7294 -8092 -6002 -3167 -3534 -1974 -1499 3779 -573 -2970 -4312 -6281
7188 -6281 -8142 -9700 -7176 -4343 -3194 -1822 2005 10296 19273 15804 9508 -849 -4845 -6639 -4240
7173 -4240 -4688 -5532 -6205 -4679 -9387 -11090 -11850 -9536 -9772 -7864 -8713 -7792 -5922 -3079 -4756 -3500 -363
7156 -363 -1251 -1949 -7594 -7320 -6425 -5516 -8388 -9691 -12213 -13785 -12719 -4181 -2326 -754 2385 1705 4116
7139 4116 2496 601 3351 5473 676 -1440 -2364 -841 -826 -4522 -5158 -7763 -5492 -1352 -343 -3937
7123 -3937 -310 3089 -1233 -5914 -5382 242 892 2422 7748 6477 -332 3393 5316 -220 1723
7108 1723 2534 -4044 -5895 -4465 -6418 -6025 -2983 1489 2409 -4441 -4486 -5680 -4348 -8467 -11142 -14905
7092 -14905 -9510 -8176 -7257 -3167 -2413 -475 -4914 -622 4072 7147 3255 -10359 -12438 -8723 -1764
7077 -1764 3128 -1585 -6729 -9963 -8814 -7065 2383 4335 -5290 -13581 -8829 -2353 -580 1362 1831
7062 1831 -7028 -8087 -5207 -1895 -3457 -10158 -14151 -4700 2324 1644 -558 1349 -1891 -7430 -8566
7047 -8566 -8865 -3268 -2929 -939 1262 4253 7846 3447 -4218 -4923 2377 8452 10085 4317 -1239 1187
7031 1187 2342 -3871 -7994 -11921 -4309 -194 -4136 -12143 -13827 -15769 -12822 -11515 -5615 -3960 -3463
7016 -3463 -3362 -3099 -1282 3358 -998 -1134 -1900 -1974 -5004 -3785 -1481 1010 4663 6965 5701 4784 6791
6999 6791 3535 -202 -3405 -4293 -4766 1853 6225 7119 10105 8422 11334 12159 9870 5453 2388 137
6983 137 -8821 -18691 -15973 -8621 -6726 234 3125 -302 -4581 -5531 -662 -1458 -4501 -3152 -266 1860
6967 1860 1528 -1177 -4209 -4265 148 1055 -336 -7543 -12509 -11563 -4648 2527 4262 -2276 -9401 -6522
6951 -6522 -3705 -624 -2283 -1538 -4201 -1989 3066 6773 -199 -2067 -3168 -4445 -6129 -12851 -14032
6936 -14032 -9182 -10706 -7868 -719 -701 -465 -136 -336 4931 8701 6610 4996 -2933 -4918 -6695 -7255
6920 -7255 -7884 -3744 2505 -3025 -5283 -6425 -5900 -4586 -5655 -832 1611 -2576 -6990 -6256 13 3829
6904 3829 1292 -3011 -7116 -9001 -9156 -12023 -14863 -16575 -16474 -12634 -8367 -2571 2120 -1951 -5315
6889 -5315 -7335 -8174 -8222 -7923 -5003 -4435 965 -1821 -7085 -8383 -3524 -4035 572 3556 1036 1746 1888
6872 1888 -3009 -2274 -3750 -1015 -83 -2910 -8186 -11169 -9057 -8228 -10737 -8222 -638 6809 3764 -114
6856 -114 -557 5109 6694 5329 656 -5934 -5399 -5651 -5623 -6631 -7012 -7096 -7368 -1165 1346 -2900 -5873
6839 -5873 -8477 -6059 -8081 -9203 -4309 -8286 -10060 -2395 4366 2681 3268 4507 7309 6443 6367 5755
6823 5755 2110 -80 1418 420 -4991 -3228 2697 5920 6002 -2180 -6999 -705 -1567 -7798 -11556 -10082
6807 -10082 -4218 109 -1962 -8018 -5431 2110 4930 500 -363 -3891 -1167 109 -3269 -10084 -20874
6792 -20874 -11541 -6865 -8573 269 2985 1467 1232 -3564 -8638 -4652 -2702 -1913 -1923 -9336 -10019 -5122
6776 -5122 -7329 -13466 -10378 -12326 -11118 -3021 -567 -12769 -9766 -8188 -13731 -14600 -13152 -3193 -2381
6761 -2381 -2061 -718 1876 3281 -700 1643 -1304 -7607 -1507 2799 1098 -9632 -9071 -9087 -9487 -4726
6745 -4726 -5527 -942 1961 -1187 356 -3521 -4280 835 8429 12056 6512 316 -3173 -4127 -3996 -7604
6729 -7604 -4700 -1412 -5473 -10984 -1794 4562 -1455 -1699 -1461 7411 8214 343 -5971 -2917 876 -21
6713 -21 -5624 -5761 -10445 -10917 -8642 -1729 -4682 -7489 -5569 -3941 -6153 -5487 -5786 -2158 4839 2780
6697 2780 2077 1580 1009 2767 6605 6058 3582 1020 1090 -2826 -5146 -4359 -5707 -8738 -7085 -6362 -12865
6680 -12865 -13119 -9612 -7517 -9285 -5300 2525 5923 1296 3956 8216 12473 12079 7894 9084 5308
6665 5308 5436 1717 812 3815 8375 11895 8275 8638 10086 5488 -3652 -4777 -2958 -6580 -7587 -7145
6649 -7145 -5909 -7390 -8387 -5109 -2160 -643 -554 4960 4614 2017 380 -149 -2491 -4390 -7933 189
6633 189 3063 1147 2601 8360 10619 1712 -675 756 3960 3852 -285 61 -6046 -9424 -10725 -13760
6617 -13760 -13518 -10214 -7574 -9442 -8589 -8333 124 4979 2349 -1856 -4967 -4243 2958 8950 5806 -3032
6601 -3032 -10299 -8826 -5504 -1471 -7138 -5489 -4335 -5941 -7651 -675 9159 12602 6252 1005 -522
6586 -522 -8576 -11000 -12241 -8576 -3950 180 -1330 -5946 -10370 -14850 -11037 -10769 -11720 -18187 -14914 -11011
6570 -11011 -5731 -4688 -6690 -5559 3722 3786 -954 -1569 -4154 -8345 -6271 -2527 -10612 -15025 -10182
6555 -10182 -4497 -2711 -2138 -5942 -7916 -9152 -11945 -19414 -25434 -21397 -13655 -8854 -8120 -10239 -8678
6540 -8678 -8111 -8831 -4463 -3750 -2156 512 -3309 -5647 -9127 -13472 -11003 -990 -809 3586 5032 481
6524 481 -5463 -3707 -6937 -6537 -1085 8363 7147 -1387 -4596 -1778 -9136 -12099 -6856 -2062 248
6509 248 -1701 -1899 -2172 -4011 -5415 -7260 -15676 -6903 -7445 -10546 -9589 -6149 -5722 -7807 -7094 -8427 -12137
6492 -12137 -10533 -7838 -3051 -8263 -9318 -12231 -16940 -6684 1746 2528 -310 -4568 -7768 -11352 -2432
6477 -2432 -936 -3286 804 -94 -6518 -10208 -5298 -5959 -10170 -12653 -12987 -12343 -12002 -13484 -20830 -22609
6461 -22609 -19816 -14486 -19333 -26922 -27362 -23187 -16550 -3918 1508 -2522 -4457 -8139 -7338 -8891 -8030
6446 -8030 -5422 445 1944 4672 4244 2156 6455 4086 2792 6905 8636 9437 11050 9190 5131
6431 5131 2225 -48 -2575 -8299 -12789 -12288 -5298 -2310 -2492 -4946 -9779 -8288 -2691 -6159 -11172
6416 -11172 -5010 7085 4314 2833 1028 -216 1634 -703 2218 -4435 -6936 -4117 -5768 -2867
6402 -2867 927 -119 -2979 322 2259 5047 5594 4846 -1700 -8440 -11401 -8830 -4501 -7651 -10711
6387 -10711 -3939 2578 -1231 -3918 -880 -3190 -2313 -893 1896 -3182 -8295 -7081 -2978 3121 9524
6372 9524 7105 -6773 -8300 -5004 -14927 -20608 -17298 -7925 394 1142 -5591 -13856 -9265 -5000 -12944
6357 -12944 -18113 -14731 -5409 -2033 -6195 -6776 -6627 -5466 -3382 -1017 1941 645 2804 5598 5217
6342 5217 -2607 -7549 -4682 -3734 -7025 -7213 -4789 -1729 2387 -886 -6298 -7904 -1891 -6638 -5781 -2582
6326 -2582 -6633 -7764 -7807 -7733 -5127 -101 -9638 -15752 -12196 -1853 -5372 -7446 -7590 -15262 -7953 -2909
6310 -2909 -5868 -4389 1820 -3056 -2298 2988 13853 10537 6527 2293 -6457 -10846 -7735 -7142 -6409
6295 -6409 -9919 -13318 -12390 -1232 482 -2397 -7337 -11988 -12533 -9229 -7312 -15583 -10627 -9906 -11434
6280 -11434 -11837 -15804 -17447 -8429 -11570 -3847 1796 1916 -54 -2166 -3621 -6128 -4584 -4497 -2497 45
6264 45 -1188 -4544 -360 -5265 -7247 -2393 1777 -4201 -8693 -9911 -10497 -9435 -8248 -2689 -365 4479
6248 4479 2162 -547 5511 2688 -698 -7959 -18161 -17114 -12943 -11883 -7514 -3776 -8913 -6182 1838
6233 1838 -308 -7626 -7728 -4696 3100 5567 -595 -5942 -3863 -4736 -4730 -12858 -15035 -11301 -7033 -5056
6217 -5056 -6440 -5960 -879 -4950 -6175 -5197 56 -1408 389 -4634 -2996 -1017 4230 8057 1265
6202 1265 -3293 -7448 -11240 -10901 -17379 -20775 -13232 -6648 -1298 -4453 -3147 -6250 -10220 -8056 -16521
6187 -16521 -19059 -10841 -12616 -13373 -10942 -5998 -1245 630 874 545 -1632 -4976 -5142 -6247 -1776 -1938
6171 -1938 -11149 -12705 -10431 -12983 -16368 -12010 -6478 1803 4734 6368 4853 1598 -3458 -859 -5372
6156 -5372 -4595 -831 -1589 -3635 -3325 -4506 -9163 -8758 -9177 -3503 -475 6539 2059 -5890 -9334 -5394
6140 -5394 -11542 -4862 -947 981 7886 4485 4283 3546 3692 2356 593 -996 -4763 -2265 -4335 -8374
6124 -8374 -6536 -8171 -2309 35 -5032 -5662 -5737 -399 3798 6195 3738 -298 -3430 -10621 -9082 4136
6108 4136 3107 -1038 822 -2106 7147 4764 4377 5018 971 4393 12243 12150 8175 7180 4315 1086
6092 1086 -3724 -4749 -5511 -5173 -8344 -8603 -13938 -12991 -4158 -8092 -16786 -17286 -11416 -8297 -3461 1663
6076 1663 1779 -5432 -11010 -14606 -20903 -19696 -14387 -11385 -3545 -4472 -5926 -11167 -14550 -14996 -13397 -9342
6060 -9342 -14525 -9782 -7840 3696 13162 9153 -852 -8271 -9011 -13247 -9153 -3887 -2815 -6798 -9318
6045 -9318 -7448 -7447 -11779 -11549 -2915 -1949 -4454 -4237 -1469 -2419 353 1791 4101 3828 1062 1801 8275
6028 8275 8996 2660 -1951 -5204 -6332 -5087 -9255 -12966 -10527 -884 4700 3032 -679 -2359 -1404
6013 -1404 1007 5799 6777 3999 -125 -4877 -9056 -8791 -5095 -5908 -5361 -7473 -11815 -7047 -2130 -2556
5997 -2556 -4035 -7571 -4201 -4861 -340 2531 888 2098 3639 -1855 -4560 -3287 2806 -256 -4393
5982 -4393 -3394 -787 -3934 -9935 -8925 -3384 99 -1541 8 4722 697 -564 166 3825 -5664
5967 -5664 -11816 -6130 -822 -2472 4207 11069 6311 7197 215 1508 3012 1964 -153 -3568 -9825
5952 -9825 -9076 1244 5302 4876 3524 -795 943 3948 2985 -1714 -4269 -7601 -16207 -24082 -21029
5937 -21029 -15131 -4673 669 -344 -2442 -2527 -1404 -2960 -5690 -7233 -10060 -8786 -11369 -11359 -10967 -11261
5921 -11261 -8131 -3730 -6713 -8783 -4632 2836 10645 13853 9102 4216 1963 -1959 731 -823 -1792
5906 -1792 -7157 -13775 -13101 -12628 -8042 -9582 -9194 -8520 -14012 -7884 1083 696 -2944 -5930 -2955 -1011
5890 -1011 -630 -1626 -6353 -13754 -12915 -7697 -2258 -499 -3640 -961 -2520 -7174 -1919 -260 -537 2319
5874 2319 5435 2449 1364 883 -5764 -8066 -3123 -4633 -3094 -2167 235 4465 -2232 -4389 -7993
5859 -7993 -7536 -1290 3847 -3710 -7066 -8265 -5274 -5752 -6065 -8451 -8850 -9305 -2679 -3123 -3535 -1083 -1112
5842 -1112 -216 -1454 -3025 -2324 -6931 -4105 -1894 -5273 -4231 645 5004 1475 -2253 -9187 -10366
5827 -10366 -11047 -15348 -15767 -9518 -4495 1319 -4193 -12703 -12993 -13290 -6017 -2181 1727 -2207 -2156 -968
5811 -968 -328 -6451 -5150 -2598 -1740 -3843 2023 7982 3272 5046 3304 -3391 -4088 -3907 -2788 -4742
5795 -4742 -9712 -14921 -14091 -9506 -1283 -436 -298 1182 2552 7664 9273 5856 3668 1285 943 4516
5779 4516 2157 5125 6393 2134 134 6176 2303 -2869 -929 -5418 -8591 -9450 -15021 -7442 -2755
5764 -2755 -4124 -4867 -4537 -2050 241 -4628 -6281 -10163 -15603 -10241 -4802 3367 -126 -5067 -2259
5749 -2259 -3785 -8042 -10269 -9726 -15971 -24126 -21388 -10046 -9760 -10272 -7029 -9814 -7881 -7216 -4540 -3845
5733 -3845 -14129 -22344 -16752 -10359 -10019 -10421 -8208 -10223 -4975 1294 -3731 -1560 2610 -482 2430
5718 2430 6232 5200 -55 2867 7940 5347 -420 -4222 -2867 1609 373 437 -7649 -6494 -10214
5703 -10214 -16152 -14997 -7533 -5270 -8064 -11849 -22341 -18369 -9107 -9076 -5439 -4294 -9970 -9799 -5318
5688 -5318 -2009 -7630 -8718 -8106 -9472 -5387 -9416 -11770 -15320 -17438 -14739 -8926 -12292 -10863 -5277
5673 -5277 186 1205 3601 7223 3229 -4917 -2017 -664 -3276 -5974 -5977 -6001 -5695 486 3335 -2471
5657 -2471 -7498 -7993 -5693 -3943 -5140 -3449 -3540 -4115 -3045 -6750 -8391 -4260 -2866 -2518 -6417 -12380
5641 -12380 -11324 -7455 -14492 -16255 -6643 -1025 -4067 -6971 -13710 -10701 -5523 -861 -8399 -7063 -6074
5626 -6074 -2352 -5454 -6485 -3803 -4990 -7162 -13935 -11267 -6519 -8481 -11758 -7910 -6277 -9973 -9983
5611 -9983 -5654 -6146 -7421 -4280 -3447 -5483 -5784 -314 -840 -5732 -11077 -9928 -11204 -11714 -13355 -10016
5595 -10016 -9080 -13147 -11175 -10978 -15986 -18142 -11383 -10110 -7938 -8242 -14191 -16593 -15340 -12911 -5374
5580 -5374 -6771 -9329 -6963 -9002 -10282 -8478 -8858 -10371 -8507 -8681 -8402 -9168 -5761 -10218 -9237 -9541
5564 -9541 -15192 -18398 -15411 -12627 -10299 -9326 -981 1904 -2048 -8983 -6064 -3587 -4848 -1485 4454
5549 4454 1369 -9735 -15810 -12152 -16903 -12098 -7547 -4895 -4865 -385 -1222 -3269 -2262 5189 1877
5534 1877 3000 4120 5233 -2714 -5420 318 1079 -6634 -8427 -6804 -10357 -10646 -14671 -13558 -10618
5519 -10618 -3834 -275 -55 -5991 -4895 2607 4394 -1477 -9688 -5614 -5226 -8893 -7898 -10163 -8587
5504 -8587 -10867 -14110 -15274 -11570 -10070 -13636 -13718 -10333 -7684 -13847 -11106 -6122 145 6180 4774
5489 4774 3787 6243 -3661 -10948 -8711 -5530 -4007 712 280 -2177 -9457 -9861 -6132 -3217 -10554 -8757
5473 -8757 -5884 -8205 -4141 741 -7188 -10912 -11070 -12920 -9206 -6826 -6598 -8715 -13451 -12586 -10663 -9100
5457 -9100 -12586 -16233 -11885 -11556 -10263 -10365 -10912 -7024 -3559 2501 1789 -619 1898 1349 -1953 -5115
5441 -5115 -4257 -4114 -3642 -5920 -8487 -7538 -7916 -7423 -4669 -1716 6025 8634 2332 -3311 -4643 120
5425 120 -1470 -3457 -2047 -6803 -10174 -6404 -4177 -11621 -13142 -12867 -12166 -13699 -5882 8829 6319
5410 6319 -1631 -18993 -22659 -10016 1153 4578 13771 19800 9829 -2740 -2206 -622 -3914 -8800
5396 -8800 -13079 -11278 -182 7110 4633 5045 5561 -6089 -7229 28 7877 11205 14153 14594 10884
5381 10884 6586 7004 7785 -3730 -13314 -21735 -15311 -8079 -6488 -9051 -11727 -10697 -7392 -7754 -4813
5366 -4813 -6702 -6461 -10811 -10549 -10306 -9792 -5992 -1227 2816 257 -7963 -10339 -7645 -3068 -4867 -9369
5350 -9369 -1221 1784 817 6244 3799 1372 5175 -1547 -6329 -8725 -14118 -11574 -6712 -11166 -15304
5335 -15304 -6350 -2627 -3477 -7440 -8457 -12275 -13368 -14332 -14427 -8249 -10617 -12210 -8936 -9250 -4418 3900
5319 3900 8262 5268 -12 544 3730 2220 -3640 -82 672 -3610 -6930 -7593 -2987 6130 7345 9574
5303 9574 7468 -955 -3639 -7418 -7061 -6320 -4325 -422 6241 2 -6940 -8975 -10082 -8341 -8273 -10007
5287 -10007 -11926 -2444 1192 146 3503 7556 9025 8876 2645 2419 2591 2594 -7534 -7404 -5460 -21
5271 -21 -1315 -9220 -11919 -10350 -10091 -7046 -1497 4569 -482 -4765 -3480 6053 4783 2219 1448 564
5255 564 126 -8152 -7699 -2605 -354 5163 11589 9485 5732 -3180 -8714 -4886 -993 -2046 -4398 554
5239 554 3370 30 -4201 -3427 -1547 -7293 -11942 -9161 -6561 -10259 -13057 -7549 -7170 -7349 -5731 -6903
5223 -6903 -7962 -4522 -451 -4412 -10310 -12697 -10954 -8092 -11088 -10862 -7554 -10874 -18024 -14246 -13263
5208 -13263 -15519 -10308 833 5790 -289 -3823 -6360 -9703 -13903 -10559 -13661 -15918 -13956 -14108 -4347
5193 -4347 6290 2625 -159 829 -4486 2995 6088 6958 5218 -3925 -3741 1299 4376 4461 1581 886
5177 886 -7450 -9400 78 -2671 -3387 -1719 777 41 -1513 1041 4341 3621 6606 2284 -646 928
5161 928 -1343 -7392 -1332 2047 6006 11691 4466 1075 -4469 -9451 -9980 -1692 -1670 1024 5551 295
5145 295 -4497 -3911 -1229 -3039 1311 6859 3075 -5216 -4756 -5631 -4007 2339 163 4515 8023 6934
5129 6934 5863 -4099 -6136 381 1317 392 4568 5714 1828 -2391 -3498 -160 2356 -2812 -8984
5114 -8984 -7429 -7216 1698 291 -5423 -8210 -12104 -11470 -2600 2087 2987 -2549 2766 -1433 -5785 -5480
5098 -5480 -1445 5400 4419 1252 1998 5051 3061 -4272 -6493 -6534 -3392 -5630 -9886 -10303 -8605 -9902
5082 -9902 -9331 -8212 -9393 -8701 -855 3464 1212 -3114 1770 1251 -8670 -10287 -9723 -11227 -4421 -2278
5066 -2278 -4049 -6646 -13941 -9406 -5455 -418 -140 -45 1160 -4903 -6870 -9524 -9838 -8687 -8442 -9012
5050 -9012 -9444 -7012 -6506 -2460 790 609 4318 -1954 -5575 -8363 -6651 -6194 -5892 -572 697 337
5034 337 1038 1854 4281 3530 1221 -3115 -4251 2113 2081 -4405 -10141 -9460 -4766 -1593 -902 -2835 -7847
5017 -7847 -11153 -13069 -5579 -3565 -2959 -11431 -16574 -12984 -13341 -15147 -10174 -10134 -1561 -1362 -749 1988
5001 1988 -2159 -4770 -8081 -3668 -4732 -4895 -3918 -6300 -8009 -3486 -6490 -11365 -11784 -6790 1151 3209
4985 3209 -3722 -1502 -466 -328 -3061 -8780 -5430 -464 -6179 -9229 -10980 -16835 -12385 -12085 -6200
4970 -6200 -2911 3065 4348 -2910 -8610 -7612 -9029 -6676 -1508 6696 10592 8711 12881 13718 12731 1495
4954 1495 1418 7891 2482 -6191 -5217 -1990 -1090 -4872 -7361 -3403 3448 4588 4111 11338 13871 7165
4938 7165 4056 1437 7687 4942 156 -3167 1448 5110 5127 -601 -9111 -15123 -9375 -4541 -787
4923 -787 -3784 -5126 -2599 735 1025 502 -588 -3041 -9913 -9477 -4291 -5402 -13227 -10286 -9264 -10222
4907 -10222 -3554 1487 3316 1183 -1363 -186 1832 940 -758 3637 466 -95 12091 13933 10299
4892 10299 9982 1040 -4289 -3258 -7482 -8753 -4284 -6351 -4043 1437 -1707 -1230 -3594 -15321 -15263
4877 -15263 -9682 -3801 -4850 -1673 932 -5946 -12463 -7763 -3726 -9073 -7959 -2463 -3013 -3055 -4685
4862 -4685 -4818 -384 -5666 -4937 -3750 -10701 -11374 -7805 -5151 -2404 3806 3718 -2087 -481 515 3004
4846 3004 4545 -3202 -2951 -1709 -6201 -9280 -11557 -7429 -5750 -9466 -10021 -8551 -5591 1626 6524
4831 6524 -552 -8773 -9473 -8882 -5418 -6914 -1685 3522 -4829 -7636 -10125 -13047 -2013 1372 3700
4816 3700 -1651 -5341 -5897 -3518 -1953 -794 -1101 -2482 -1833 -1878 -2137 570 4010 2056 4770 3694
4800 3694 2411 -3743 -3021 -6878 -5315 1163 3218 -4637 -5315 -5400 -1481 492 1736 3910 -767 1142
4784 1142 1662 -2567 -8142 -7164 -544 -5411 -6112 -1431 -2406 -2140 -3771 -5430 1639 7096 185 1162
4768 1162 3651 1796 -3155 -2780 3144 4513 5785 6335 3588 257 -151 -1781 941 1479 1713 3518
4752 3518 -1216 -3847 325 7008 4451 -363 3730 -2417 3818 3034 -3794 -1433 -6282 -11272 -9814
4737 -9814 -8679 -5742 356 253 -2441 -2267 -5389 -8036 -11368 -10553 -9056 -8843 -13225 -13489 -11082 -3745
4721 -3745 -10446 -13050 -8924 -6582 -4373 647 -3348 -10718 -10911 -6330 -5381 -4759 -9212 -9835 -8730 -455
4705 -455 4675 4922 3843 3215 -1111 -2440 4570 11180 7635 790 -941 1250 1703 -2012 -5566 -4664
4689 -4664 -7532 -16658 -19697 -10200 793 5291 2513 2635 2938 9465 12431 5513 3537 3011 2927 6799
4673 6799 7503 178 268 1472 2933 3551 5606 4872 7646 29 -6007 -4928 -9410 -6347 -2645 2506
4657 2506 6852 7764 4021 -1372 -2545 -2361 -275 1767 6654 6560 2435 1010 3448 12179 8961 65
4641 65 2389 4172 5973 10007 4869 183 -5096 -4721 -3580 -3910 -2043 -6099 -580 865 1267 7535
4625 7535 7190 5754 4030 1474 8203 12709 14168 8006 9642 7262 8240 11845 8591 8929 16936 19652
4609 19652 14550 4662 1315 -585 5793 9727 4341 5351 3560 -179 -5321 -8990 -7267 -5352 -1152
4594 -1152 5063 10082 6232 2558 3970 -730 -10371 -8129 -3642 -2951 -2632 -3871 -593 5759 6220 9474
4578 9474 6839 -1852 -1835 -208 3345 9079 12926 5889 -1447 -3889 -1322 -6935 -11625 -12000 -7949 -2681
4562 -2681 -3434 -5207 -9663 -5434 4070 -2512 -8884 -4120 -2165 -7659 -11056 -8231 -4635 6397 9846
4547 9846 4254 -262 -3833 -3822 -2057 1420 5320 3773 3005 284 3577 5189 7971 3770 24 -846
4531 -846 597 4087 2018 -2976 -1083 4333 1847 610 3475 -1153 -846 2288 6219 6306 3825 1377
4515 1377 5876 3668 -4059 -1289 575 -2754 -584 5644 5558 5421 7626 3839 -6945 -6200 -629 3445
4499 3445 6840 803 -2359 -3018 -13271 -17207 -15669 -5383 6049 9520 6480 1327 -3821 -5295
4485 -5295 -6764 -5626 -3820 -4001 -1137 9089 12924 14095 7111 8670 13821 8809 1195 -720 -691
4470 -691 5089 4079 2506 -2111 -6490 -3602 6061 7769 7245 12388 16416 21131 18027 9497 7418
4455 7418 10440 11015 3054 -3318 -7443 -5210 -1706 4541 4608 309 -438 2072 4197 -6209 -7038 -7474
4439 -7474 -8431 -8397 -12296 -8753 -6735 -4516 -3628 -6131 -236 6368 5278 -206 -2340 -4260 -2158 -525
4423 -525 -5903 -11613 -8786 1255 5445 12254 11144 5308 4714 4697 7559 7779 6446 4591 2385 -2074
4407 -2074 -7469 -10109 -8512 -4010 2028 2401 2163 5000 8292 -170 -2901 -2907 41 4149 4066 4343 8434
4390 8434 7538 8425 3841 -369 1615 1028 -380 3581 6504 145 -4221 -3610 -1559 -5504 -6229 -5277
4374 -5277 564 6698 10087 11346 9159 3746 3421 4869 10523 9973 2667 6 -401 -621 -809 -2718
4358 -2718 -5647 -552 2712 5978 6084 4594 3784 5307 5531 1841 854 -231 1506 9645 13515 5308
4342 5308 998 -5688 -5150 -1328 -4179 4584 10003 12647 12109 9947 5744 3362 5232 4664 1405 773
4326 773 2372 6235 9880 17977 17363 10802 11355 6242 3297 207 -2227 -2124 -3385 -2048 -322 -185
4310 -185 3030 3919 5572 1411 -8395 -10101 -10397 -12300 -7400 -1763 -2746 231 6981 8113 7484 6002
4294 6002 1246 198 3970 539 4503 5854 -108 590 1151 35 -1663 -3681 -2937 -8214 -9584 -11547
4278 -11547 -11364 -16117 -10881 -6079 -952 425 -2650 -5193 -3401 3373 906 -4380 -3006 3737 6415
4263 6415 10705 10935 2046 309 -854 -129 4490 3916 4501 209 1634 3363 -395 -4977 -6016 -5010
4247 -5010 1510 62 -3957 -2947 -4932 -4440 -7558 -8206 -9115 -7390 -8279 -9012 -8517 -1274 1551 1463 -7946
4230 -7946 -10311 -7999 -10777 -8595 -3975 -4224 -2168 2062 5951 9635 15846 10212 4080 -4285 -8980
4215 -8980 -9536 -9191 -3483 -2142 -8495 -5565 1228 5569 11830 9386 3153 745 1444 -2075 -3366 -5818
4199 -5818 -6438 -5486 -5092 -5817 -10153 -11702 -4334 -2109 -4200 -8731 -2011 -212 704 -401 -1995 -8203
4183 -8203 -3859 -295 -11655 -12707 -7951 -8696 -11970 -9422 966 -3083 -3118 3380 2244 -1673 -9571
4168 -9571 -8962 -6526 -1297 5153 5419 9535 9390 8742 7651 5665 -1309 2948 5638 6959 4708 5132
4152 5132 517 -2706 -8463 -13684 -9208 -4023 -5460 -3165 3106 2799 2149 2333 2560 -205 -504 -178
4136 -178 2354 646 4153 132 -1007 1137 1431 -685 5403 3515 -182 -2472 -3523 -1736 -2501 3791
4120 3791 -181 -3998 -2435 1425 2951 -1476 -4629 -11701 -12569 -9534 -5990 -6122 -5407 -4451 4536 10358
4104 10358 4895 5510 9759 7924 6664 39 722 4598 473 -4656 -4677 -8292 -10331 -8985 -9950 -4605
4088 -4605 -2181 4243 4650 1794 421 -2332 -1190 -4727 -5299 -8990 -13280 -13977 -11856 -8071 -2891 1708
4072 1708 6866 6808 4182 2246 2171 982 3978 5743 3493 142 1400 5840 7176 5182 5562 3246
4056 3246 -4288 -14215 -12379 -6918 -2386 -2727 -5462 -10132 -9458 -6807 -5568 -1323 -239 -1716 -4599
4041 -4599 -3908 -1880 -1801 -1478 299 -928 -2898 -2386 -6803 -5953 1987 8986 6296 6517 7647 3422 4310
4024 4310 6335 -1150 -3993 -2687 3670 7568 7236 5957 3627 1151 3411 2006 5886 3018 -2259
4009 -2259 -1211 -1308 626 1293 4724 9442 3774 -2009 -6030 -2425 -3263 -1586 -2306 203 3495 2214
3993 2214 3686 1082 -8217 -9609 -1833 4422 2520 2250 5069 7557 2153 510 3841 1037 9901
3978 9901 11064 7175 9694 9046 1978 -5690 -9752 -10369 -5962 -5124 -4422 -8395 -6210 -613 6027 1901
3962 1901 5260 10338 7292 1434 -2521 -2137 -7334 -11745 -5223 445 2433 -3073 -3690 5990 9706
3947 9706 5003 4264 4310 -2764 -1636 978 2850 7664 9729 6919 -904 -353 -3709 -3596 -9122 -13885
3931 -13885 -13967 -11738 -3800 653 1677 -1981 -2398 -2918 54 3539 2555 -3005 1321 6046 6369 3323
3915 3323 3843 373 504 -285 -6009 -8377 -14183 -12669 -6153 -2988 -12020 -12546 -8161 -4159 -2686 975
3899 975 2777 9265 9240 6707 3403 3622 4475 1387 -5571 -5254 -2959 -7163 -5279 -1225 5786 9078
3883 9078 4288 -4725 254 3515 6096 12030 8284 8880 7726 351 -2150 -2421 -2432 -1572 -2030 -4450
3867 -4450 -3932 2866 8206 2393 -932 -8103 -9587 -3757 -1608 -5067 -6089 -7939 -6798 -3967 19
3852 19 1429 6164 4626 1225 -4014 -3801 -4627 -5152 -8831 -10650 -12022 -6451 759 3606 7157 11518
3836 11518 14058 8739 797 2022 3975 3248 11026 11392 9355 6610 124 -1511 740 7747 7640
3821 7640 6080 -1498 -10437 -16778 -10583 -7851 958 8065 14421 18665 20778 14810 8549 6708 6343
3806 6343 6855 8246 9475 8521 10403 4546 3951 13149 8525 7126 3236 -5348 -6870 -10032 -5694 -2139
3790 -2139 -3774 -6863 -7200 -3588 -1116 2699 8747 11578 13473 12328 9924 8052 10361 13593 5961
3775 5961 4313 5431 -22 2540 -7216 -7585 -5989 -9754 -5584 -4249 -2482 2504 3515 2782 -2843
3760 -2843 -1032 512 -1754 -6066 -2370 -844 -2705 -2324 -2330 -994 170 -1089 -3420 -1840 -1352 -7948
3744 -7948 -11741 -11863 -7604 1464 3068 3393 -2271 2481 -527 -3934 -5050 -4339 4762 4221 -5961 -12889
3728 -12889 -4915 4560 8666 8486 7828 3227 -3845 -6408 -7689 -1018 14276 12858 11342 9573 16583
3713 16583 15752 10840 8713 8996 4770 1188 2959 3786 5031 2477 -1263 -1003 5632 5758 7585 1764
3697 1764 -2609 -5788 -6307 -1690 -4416 -2031 -2525 2584 5637 9343 14931 10983 3685 -1848 -423
3682 -423 582 1407 9003 8152 2515 3964 1337 636 2862 8226 12198 15471 14723 11168 7875 610
3666 610 -2013 -1745 -2034 -420 -7378 -11215 -8558 -1808 -3775 -4427 -6236 -1860 2354 4324 1436 -3434
3650 -3434 -5960 -8662 -8010 -7507 -3969 154 -7035 -11631 -6668 -1284 -423 -1710 -1408 -1129 898 68
3634 68 -688 54 -2791 -4395 -4569 -397 5349 4428 2060 -3915 -5465 2455 3466 401 1304 -2424 -3835
3617 -3835 722 2421 4381 6363 6660 9238 13192 11003 3505 5018 7389 4051 -2786 -2408 3768
3602 3768 8499 6129 3572 3001 -4720 -6585 -8104 -11226 -4515 172 5029 1893 -5131 -846 4096
3587 4096 6173 -1053 -2109 -4582 -8229 -7023 -5105 -4730 -4355 -5527 -5038 -4927 -7640 -9404 -3649 -1551
3571 -1551 2121 11530 13641 9754 9163 11137 6501 5769 4831 2573 3417 6429 4197 -3398 -8144 -5643
3555 -5643 -2559 1194 -2682 -7726 -1429 5218 5218 3928 789 -3620 -6527 -4300 2273 3281 6562 6269
3539 6269 4495 1249 -5343 -724 998 -926 841 1035 6280 9022 9613 12751 15425 14035 14072 10080
3523 10080 8435 5453 5056 7040 6076 9796 9622 4067 752 -5262 -8906 -6965 -123 7093 7653 6603
3507 6603 -1090 -5636 -5828 -2157 1819 -2592 -6760 -7235 -11256 -10879 -11144 -2442 5828 6225 3681 4772
3491 4772 7727 2600 2545 -1411 -3453 -2878 -2775 -4185 -1735 882 782 -4623 -8729 -9939 -874 6199
3475 6199 5496 -734 -1516 -5791 -4154 943 8805 10436 7002 3652 1139 4080 12633 7656 134
3460 134 -132 3117 4380 3957 5431 1705 -63 744 1895 -343 -5465 -5018 -6490 -8629 -16538 -21379
3444 -21379 -16354 -18741 -19186 -16316 -16354 -10351 -7910 -3251 7083 10790 13956 14736 6673 -914 1998
3429 1998 5351 1607 -499 -2779 -14078 -19165 -11431 560 8400 10227 5447 903 -4092 -9554
3415 -9554 -4431 3968 8137 5570 -586 -2504 -3530 -7651 -3563 -900 -6873 -8873 -9488 -9080 -6386
3400 -6386 -6739 -3693 -2934 2423 4371 4497 5945 3394 -872 -4445 -6572 -5145 -12508 -13839 -8527 -2995
3384 -2995 -1296 -3875 -3370 -4414 -9397 -7945 -1866 -90 1284 3534 7719 5494 1362 2615 6182
3369 6182 2975 -3626 -3999 48 3328 4836 12651 17016 2473 -9539 -8920 -5136 -935 4587 4597
3354 4597 -259 -2805 94 580 1623 4555 4116 2160 -489 -3245 -5318 -6240 -914 -53 -1367 3693
3338 3693 709 301 2212 185 -9981 -7257 2038 9794 11903 10633 9976 9632 3399 -11555 -13768
3323 -13768 -6758 -3734 -5779 -9780 -12435 -7756 -4973 -2815 -5097 -6482 -450 -6644 -8840 -10159 -8318
3308 -8318 -136 -3381 2450 8184 3879 -897 -862 -2255 -3168 -6003 -9794 -6468 -818 6556 3398 -6647
3292 -6647 -8428 -7681 -6542 -370 122 -782 -4232 -7244 -166 9569 7784 2715 2523 7523 5240 3107
3276 3107 1902 -5131 -4877 3935 1911 -5644 -7193 -576 5835 3699 3253 2980 2702 1911 -1350 696
3260 696 -1520 2256 -1634 -5791 -7872 -13831 -8161 4064 4885 9865 7521 6087 1857 3330 2081
3245 2081 -986 -2096 -677 -794 1646 4709 12744 11262 8957 2719 3097 4917 5420 2685 5673 3966
3229 3966 -3462 -4869 -8431 -6224 -7621 -3719 1617 3238 2945 7387 8707 8589 8442 5230 6596 11012
3213 11012 5722 4033 -357 -2810 -3447 -3479 -522 -1088 -141 5435 5333 4599 5361 2469 3064 950 -5230
3196 -5230 -4816 4186 5626 -1775 -6012 -2709 1443 7656 10245 10465 5784 11936 16055 12607 3731
3181 3731 666 1359 -1356 -7428 -8664 -1532 3027 6176 161 -218 5864 6618 -60 -6504 -4716 -3350
3165 -3350 -9788 -8363 -2423 -2021 3940 10133 12103 10006 10417 5895 7062 6179 835 -2141 6048 6874
3149 6874 8436 11516 7673 406 -2854 -8266 -1989 1241 -1564 -3072 -5062 -7807 -726 4130 2320
3134 2320 1760 5538 3239 146 3302 1627 2271 5144 4026 3887 -248 -3541 -1236 252 -3176 -1596
3118 -1596 -2690 -507 2913 -102 2943 7627 7826 14110 9231 7184 9333 9812 11690 11494 15214 13698
3102 13698 7477 2312 6841 4101 5221 9891 6260 4597 3945 8986 7092 7706 5466 138 -1319
3087 -1319 -1657 -2370 -1656 -1252 -3496 -6744 -9108 -4234 -3794 -1314 -831 -3091 -405 7247 12039 8904
3071 8904 9628 13899 11626 5045 6297 10445 5270 -521 1247 1624 -1786 -6685 -5314 769 3335
3056 3335 12385 13577 7971 2716 7278 5745 3239 5679 9055 6329 877 -1324 -1665 4020 3900
3041 3900 3215 766 -1023 2330 6235 3395 2637 -94 2456 3432 3374 6153 303 -1579 188 -990
3025 -990 1851 1260 2133 5154 13370 12126 4976 1736 3336 7005 9984 4666 -603 7579 12265 11844
3009 11844 10466 10739 7716 6932 9672 4825 -258 -3124 -3461 -810 -3129 -6958 -5975 -5921 -3641 -2885
2993 -2885 -14633 -18948 -11844 -3460 -5233 1287 7454 7759 -1471 -4752 1699 68 -3231 -903 92
2978 92 -4406 -7766 -11447 -9783 -2759 -3587 1805 3194 -1850 -3522 -2370 2513 -831 -3591 -4995 -6135
2962 -6135 -461 9698 8540 2529 -3291 -3349 8209 7716 5234 4826 4320 7091 968 -5356 -6127 -3398
2946 -3398 -301 -272 -4824 -1812 5897 3134 3671 8033 10531 9463 9851 7936 10603 18395 23218 22452
2930 22452 12840 7318 3560 8267 2860 2520 8100 8107 5818 6650 1139 -267 9716 5935 1651 3774
2914 3774 11711 20097 17339 8362 4330 819 -369 1292 -2575 -5067 -1912 -1978 -2974 -4032 -2677 -4325
2898 -4325 -1304 1735 -250 -1453 -97 -1312 -904 -4863 -4284 -3411 214 3911 -482 -7806 -10930 -7237
2882 -7237 -1676 -5220 -6606 -7567 -1757 2723 8578 4004 6590 1724 1436 4667 3235 1906 3385
2867 3385 5741 6594 219 567 216 704 -1450 -876 1443 5872 3220 459 320 5968 10890 11677 9513
2850 9513 11234 11301 11910 11351 13537 12688 8310 2382 -5845 -933 1150 -2509 -8408 -10776 -9223 -8083
2834 -8083 -2731 4287 13786 14089 12753 15147 7281 -1914 -6821 -15303 -12210 -9744 -5000 -4126 -5680
2819 -5680 -3891 1302 3011 2574 3435 6185 5427 -999 -4531 -3553 -2797 -3084 -6359 -5264 -114 919
2803 919 576 4307 2617 745 989 5487 5999 7932 1560 4092 -233 1303 -3547 -3994 238 627
2787 627 -3920 -162 1702 -1801 -3662 -8359 -9742 -5438 -4935 -2784 12851 19058 13679 9399 6472
2772 6472 3669 6810 5845 4698 5330 -1258 -4110 -6541 -5300 -7070 -7361 -5815 -3303 6616 7478 1802
2756 1802 -813 7633 10838 9899 9318 7584 11501 11685 13196 17807 17751 13725 15706 15543 11149 2701
2740 2701 -4420 -6349 -1307 280 2100 8410 3067 251 3952 10974 4863 -695 3728 2508 -355
2725 -355 6799 4098 -2174 -4145 1637 6946 8866 10406 1712 -7441 -7694 -4360 -5519 -8683 -9781
2710 -9781 -4939 2281 -1967 -4140 -7016 -11027 -10360 -5935 -8913 -15155 -21854 -20515 -9247 2060 7554
2695 7554 10116 9116 13653 16550 20407 18680 10272 4218 5988 7131 6810 5052 -449 -3117 -3269
2680 -3269 209 2628 10085 16647 16733 12201 12227 13351 3838 -1504 -8959 -4124 2425 2736 -1503 -4107
2664 -4107 -61 6430 8727 3012 -1312 2037 2740 1436 260 -8102 -11860 -11511 -6826 4404 12936
2649 12936 15034 10721 4024 41 2645 -900 -617 3870 9341 12068 11331 14523 10163 -155 -4484
2634 -4484 -2082 1974 8612 10318 7528 6263 5655 5036 2590 185 -2611 -757 3649 9379 8669 2026
2618 2026 -1932 -5692 -4198 2790 471 -8229 -5960 3747 5985 10851 9813 11280 10184 7632 5622
2603 5622 8997 6277 76 2829 2134 767 2212 4872 -2264 -71 2174 3197 5886 5965 8496 9964
2587 9964 10362 12244 12105 11374 6969 10907 12592 9915 9603 10523 14202 18818 18042 12802 6370 7437
2571 7437 1058 -2197 -3099 2025 9017 8397 2484 110 -5241 -9917 -9006 -7239 -7212 -5370 -6906 -1616
2555 -1616 4137 7274 10483 6831 -2238 -11614 -5927 -626 -8715 -8176 -2850 -5646 -13925 -18437 -13388
2540 -13388 -7519 -3713 373 -3110 1155 3909 5861 4061 1408 3716 8400 10958 9849 1048 3855
2525 3855 12823 14465 10520 12350 11659 7155 1929 -295 2904 -3585 -2950 -628 -4616 -3469 -2222
2510 -2222 2844 7598 9074 6383 902 -2175 -1875 -2974 -3566 -2917 2286 2082 -1889 -450 3723 10050
2494 10050 9030 6039 11681 11491 1147 -3168 1417 4372 6181 7569 11869 13412 8481 680 -4475
2479 -4475 -578 2718 3818 3932 6312 1401 3154 7767 7398 9196 10664 12202 7487 1175 -2254
2464 -2254 521 5374 4159 1331 3223 8370 9753 9407 9453 3498 5569 15179 15247 13078 8069 -1071
2448 -1071 -4857 -3385 51 3011 1739 2577 3474 1811 1961 5390 3847 8282 7994 4136 352 744
2432 744 -65 3184 2305 -288 -1888 -731 -1363 -3378 484 5190 -1609 -6471 1582 6910 4817 -3313
2416 -3313 -2830 -6383 -7486 -4429 513 1741 562 -594 216 5146 6953 1990 3541 8286 4194
2401 4194 1046 102 1608 -5573 -5605 1173 3986 6408 3743 1926 -1537 -5990 -1386 -887 -1794 1994
2385 1994 3970 3705 404 2754 679 1847 -4825 -3683 3587 4005 2800 -75 -4010 -12462 -15617
2370 -15617 -11341 -5178 -4791 -5995 -8454 -4687 -626 2581 3777 2527 5281 5880 1429 6415 5419
2355 5419 3797 1114 -2755 -547 -2128 -2357 -4573 -5435 -9215 -9031 -2379 4387 7827 3788 1142 5063
2339 5063 10266 12427 12327 21203 26995 17701 10239 7711 3522 795 3799 6427 8085 4421 7896
2324 7896 17728 17095 16652 17119 16463 10733 7855 4812 4586 5136 5667 7602 7743 8195 9055 5687 -1657
2307 -1657 -5172 -1958 3187 2709 5896 5768 1991 1002 5050 12261 11497 9233 7249 5321 6237 2670
2291 2670 -1344 -511 -2339 -302 1284 -303 -879 3365 5514 2782 -1 7284 3312 30 -3714
2276 -3714 -7214 -6624 -7599 -11436 -5626 -2528 -5208 -4845 556 2086 -1815 -3936 -5507 -3962 5441 5797
2260 5797 4566 3897 1155 118 7668 7443 -13 5284 8606 9470 4074 -1032 -3771 -3122 2637 5062
2244 5062 3912 6960 9094 4245 3355 5506 7277 7399 7432 3802 6243 4736 -2702 -2043 -1834 -4544
2228 -4544 -8545 -2160 6858 3793 -467 -1262 -4661 1781 3539 4647 7943 4661 3794 3535 -4229 -8125
2212 -8125 -1405 -3800 -3370 -3401 -3068 4473 12121 17465 17116 11547 5064 -4712 -3791 3019 4814 2158
2196 2158 311 1565 4315 -2138 -4069 3121 10608 9552 8812 8989 11662 12301 16680 23839 19527 14786
2180 14786 7057 2255 -2492 -5809 -7889 -5679 -403 6193 8180 7930 5793 1985 -2319 -1495 -132
2165 -132 -7042 -9025 -4640 -1770 1203 -2797 -11918 -16420 -11071 -7888 -6997 2195 3451 4802 5911
2150 5911 5103 9814 10562 12902 9689 2455 -3601 -7401 -3556 -3908 -2744 -611 847 1075 -3164 -1071
2134 -1071 -3699 -1187 3681 10453 7563 2170 6496 11777 15159 10881 3603 1603 -1580 -6306 -9176
2119 -9176 -8150 -8973 -9223 -3373 -5873 -1768 1870 1704 -2498 284 3050 1583 1427 7439 9106 10879
2103 10879 8152 3219 -653 -3219 -4155 -9322 -15018 -16052 -13824 -9146 -6630 1487 3846 -359 -88
2088 -88 -2872 -5997 -5433 -4480 -8 4674 1839 11447 15344 13116 4579 1368 6092 8152 8086 5136
2072 5136 4043 2008 3524 3269 4339 6245 6868 -2901 -3992 2710 10799 10749 8096 4438 -1073 -1260
2056 -1260 -2729 -6777 3087 6731 4158 -3114 -6630 -7905 -7115 359 1984 -6586 -13213 -5082 1247
2041 1247 3106 -1001 1721 5684 9344 10765 665 -3053 586 3173 -2401 -7210 -3458 3910 10639
2026 10639 9372 4109 3496 2972 6948 7512 12663 12244 6864 2951 -4306 -5160 2757 10971 7962 3709
2010 3709 1579 1021 -4255 -1301 2176 2309 2030 4310 -1217 -4474 -5585 -4243 3805 6872 9383 10113
1994 10113 6073 1095 -1487 5723 16221 10288 3851 4812 524 -4676 -5451 -778 -197 1635 -2174
1979 -2174 -3207 -5235 1821 3441 5057 5925 6528 6921 3361 6819 3171 -1249 -1713 -323 1065 4562
1963 4562 4948 -5305 -10255 -10744 -7669 2377 9687 8054 6071 5456 5256 4403 4800 3146 326 373
1947 373 6430 13851 12519 11211 12681 -932 -5176 -2464 -5756 -1884 7671 9272 8713 10358 10189
1932 10189 12500 12180 13204 10032 5856 8406 6938 2211 -2177 4375 8750 7007 2632 -890 -2629
1917 -2629 860 271 -1711 -2341 -7595 -5887 -1236 -4077 -3940 -1517 -1968 992 2075 1769 3465 1122
1901 1122 -2850 -6798 -4851 -1075 463 -1760 -1460 3382 -746 -507 -5217 -6216 -4526 -2779 -4162 -4486
1885 -4486 -4768 -725 -3722 -4467 2226 2371 4806 5160 4368 -3267 -8761 -2928 -2524 5609 11319 12549
1869 12549 15756 13057 3379 620 3844 3455 6522 14391 19743 14302 7409 7294 11569 8199 8789
1854 8789 8855 5227 5055 2480 2425 4805 6612 2511 -6613 -8794 -2033 -1749 994 10193 12732 1569
1838 1569 510 5881 3179 -2744 -7251 -1840 5592 6908 6948 2780 -6597 -8477 -4214 1678 1868 6358
1822 6358 3684 1236 272 -4350 -5232 1977 6740 2663 1378 -499 7019 6132 629 4466 10026 7183
1806 7183 6851 7693 5040 6759 8154 3585 -95 -54 -1814 -1661 -9148 -12732 -9371 -6197 -7444 -4128
1790 -4128 -1070 2015 -2551 -96 -2298 -8113 -12894 -18816 -15516 -14033 -16082 -9855 -2723 -1582 -4139
1775 -4139 -4928 -8941 -8400 -2974 540 4449 8822 11293 8029 10688 8862 6180 8796 6950 -129
1760 -129 -4257 -5466 -8359 -8976 -2065 1438 1248 -636 721 6756 9215 2901 3466 1035 395 5776
1744 5776 6881 10600 6019 1413 4378 6451 4807 2961 1333 -1572 -5231 -1991 -2160 1794 2776
1729 2776 6928 3282 -316 559 -222 845 4684 7469 11643 12080 6152 1647 288 -3271 1784 7673
1713 7673 5324 9190 16537 13604 9847 11682 11959 5205 -2186 -5285 -787 4854 7517 6296 609
1698 609 5510 8042 10358 7682 11728 9108 6674 4708 699 -235 -4074 -1095 1000 6870 11804
1683 11804 12987 3662 4360 4912 11072 16115 14472 2538 -1799 1930 3957 6534 7184 2697 -2568
1668 -2568 -4765 -5833 -1550 -4915 -2544 2255 349 -10597 -11772 -2076 3178 3937 1400 2834 2713
1653 2713 2391 -1578 -2285 4148 4377 4605 7063 9947 6297 1518 3855 7095 9471 6551 1374 1287
1637 1287 2389 413 -5130 -6372 -2410 2160 2509 -2572 -2867 -8886 -8692 -6164 2136 4853 -474 -5685
1621 -5685 -335 -2051 -2468 3453 -562 -2678 1364 -1884 -777 4739 6625 8264 7512 3241 2608 -3050
1605 -3050 -5364 3487 8774 6590 5930 4384 3698 -1430 -2759 1311 6585 12121 14897 18065 14825
1590 14825 6299 5177 1702 4311 8283 1622 -1970 535 -5437 -9457 -5725 -5900 -9055 -9281 -2718
1575 -2718 -2561 -2409 -409 -1572 -5672 -944 3825 3496 -496 -4099 -8975 -8409 -6413 -10238 -7615 -5662
1559 -5662 -2678 -2983 -2399 -1855 -6577 -4020 -1223 4907 5289 3116 -799 -1879 -3418 2621 300 1214
1543 1214 3673 4517 7868 3500 2496 1230 3990 1921 7277 15918 12601 5684 6899 10803 12089
1528 12089 -686 -10062 -11554 -6752 4194 5185 3349 3549 635 4120 6518 -3338 -6234 -7780 -1169
1513 -1169 4225 14181 13112 16000 11425 5443 114 -64 5725 10139 9020 5283 7143 353 -5008
1498 -5008 -1268 -2074 -5448 -3547 247 -3382 -9870 -6972 -4186 2050 2150 4554 6721 9358 10017 6672
1482 6672 1208 -2506 -1585 -1535 -3006 -5579 -2603 461 -1076 1233 5170 7345 4969 7897 13718 10027
1466 10027 3899 -876 -216 -1525 -536 -2177 -2777 -6559 -19785 -16732 -8137 -211 2513 327 2921
1451 2921 8277 1350 -1758 -2517 -2456 -8008 -3169 -1549 -4039 -11577 -14828 -12903 -2526 957 4237
1436 4237 2891 -749 -906 6179 2592 4216 6795 2182 3319 9112 8005 9162 8639 5727 1561
1421 1561 -3292 -2522 1222 990 -4092 -3886 2336 -2625 -3342 2463 9420 4955 -257 -7567 -5457 531
1405 531 1759 1023 7148 5564 6741 9516 10503 7566 -407 -3339 496 4157 5572 -1549 -1942 1460
1389 1460 2847 8597 8596 12160 12087 17260 15662 7307 5686 6800 1847 -5610 -6356 -5380 -8308 -2379 1313
1372 1313 -373 -124 522 -2783 -2660 1303 -467 -5157 572 5311 -839 -8275 -11591 -3494 -3337 8574
1356 8574 17364 17662 11178 6741 -470 797 -2631 -4329 -7526 -5567 -12025 -10323 -7186 -5502 -4756
1341 -4756 -3608 -3377 -1567 1913 -2053 2782 1921 1355 -93 -3895 -5790 -2665 -45 -5523 -10007 -11303
1325 -11303 -4803 -4642 -5552 -6946 -4845 -2009 -4513 -3696 -1121 -6726 -9723 -1371 3582 2465 -2596
1310 -2596 -6341 -8979 -11037 -4640 -2244 -3502 -4954 -3935 -7319 -1920 7626 8013 6110 12673 3546
1295 3546 -3174 -5288 -8255 -7377 -2130 1317 -2699 -8741 -13200 -9737 -9080 -9561 -5312 -2970 1613 7899
1279 7899 9858 2631 -5482 -2195 -1818 -2681 -1872 4873 12496 6841 1056 -2186 -7407 -8915 -3681 -6156
1263 -6156 -6340 -2850 -5400 -13211 -15999 -15849 -8537 -781 -2097 -9479 -4505 -4441 -3002 -2396 630 407
1247 407 2963 8245 7328 2780 4430 9089 11946 8710 3551 1374 -1194 2983 5992 2806 1239
1232 1239 -2686 -1289 252 4830 3816 3337 2801 1486 -8055 -9960 -3294 2075 819 -211 -4684
1217 -4684 -6858 -4334 1441 -1808 -3886 -3800 180 8554 12859 13267 2999 -4746 -5352 -1609 1076 4116
1201 4116 3505 -53 -2133 -1254 -3275 -5456 -5140 -3947 -3262 -3238 2263 3164 -3262 -6069 -4956 700 -1699
1184 -1699 -2135 3216 -1798 -4171 -4085 -3806 -1725 -2978 113 -2781 -9359 -6242 2015 155 -3156 -397
1168 -397 -3800 -6476 31 3589 3142 -3739 -6845 -7368 -3908 -2823 2370 4642 -5185 -13495 -11102 -11790
1152 -11790 -19397 -19911 -13113 -7566 -6142 -4512 623 -4262 -4780 -3296 -8881 -9099 -5442 -7098 -6838 -8167
1136 -8167 -10541 -6069 -2468 -5588 2073 1958 2839 654 -7832 -12311 -9882 -12059 -13264 -2859 -1694
1121 -1694 -6583 -3969 -4641 -8381 -8627 -13801 -9244 -5689 -1804 7227 6194 3344 -4811 -8590 -9378 -6404
1105 -6404 -3720 -1862 293 -1230 -5239 -2774 -3475 -5552 -3808 -3617 -3135 -1348 300 4276 7495 4343
1089 4343 929 -327 4337 1433 3435 -81 -4132 -4674 -173 2210 7346 5359 -2523 -5128 -2611
1074 -2611 -6944 -6005 -3299 -2282 441 2441 1097 -3197 -4192 -5303 826 6735 7523 2337 -4430 -5836
1058 -5836 -5346 -7756 -9154 -645 568 1909 -932 -3666 -3895 -6624 -2774 383 3956 7434 3848
1043 3848 1450 450 -2838 2262 2623 4078 1267 913 2961 1395 -3668 -6724 -7769 -2152 2952
1028 2952 9028 5203 -7070 -4164 1210 4714 7029 5628 346 -5417 -5879 -3086 -5148 -1278 5767
1013 5767 6980 370 -6324 -13090 -16083 -15861 -16829 -11364 -8787 -12862 -14249 -15818 -15648 -15388 -15623 -5706
997 -5706 -949 -1350 -3431 -3851 -2391 -1188 -4434 -6694 -8804 -8830 -4491 -3660 -5630 -7120 -765 2144
981 2144 1986 5166 10082 8720 -1906 -6242 -6024 -6702 -15684 -22139 -14255 -8296 -4166 -1247 -3940 -5319
965 -5319 -8417 -10777 -13485 -14920 -15623 -11667 -8172 -8328 -5222 -619 3541 12116 16261 18471 15460 11187
949 11187 9083 5404 -267 -5661 -2510 5598 15065 18105 16371 21633 10991 -1173 -10139 -11100 -5764
934 -5764 -3070 -2455 -952 1896 1463 1018 411 210 -3855 -10324 -7086 1551 -678 908 2246 6063
918 6063 10976 7483 4557 8428 7220 699 -471 725 -4137 -4685 -10728 -14929 -9113 -5826 -8604
903 -8604 -7179 -463 -2119 -4713 -17041 -17973 -12721 -3309 2726 4006 14082 21009 17383 12360 6371
888 6371 5000 5456 6683 7872 8752 4954 -2007 -1948 -1284 4588 11470 18789 17371 10610 15836 16766 12106
871 12106 9581 3700 -1410 2063 3163 1141 2747 4814 1926 -1195 2595 -616 -7197 -968 6651
856 6651 7639 4322 10537 13743 8482 1608 -4976 -7670 -11772 -8993 356 -1328 -265 3678 416
841 416 3565 10516 10589 5251 162 -5358 -6352 -2881 -4242 -1652 2725 -4100 -1365 -1432 956 -918 -10015
824 -10015 -10097 -9628 -7833 -6245 -8572 -7603 -7725 -7680 -12525 -11362 -1196 3664 -1975 -6685 -5360 -7249
808 -7249 -8857 -10303 -6951 -8282 -3589 -4583 -9989 -11067 -15396 -13334 -6355 -4198 775 -3035 -6997
793 -6997 -4794 -5400 -5841 -3641 -5193 -5255 -3405 -1724 -3175 -22 8625 13701 3073 -3623 -6666 -2313
777 -2313 -3233 -13224 -17945 -16999 -13111 -8913 -2753 90 1902 2842 -1064 -852 -192 -2217 -367 -2485
761 -2485 -6012 -3296 1166 6105 10231 16590 16751 13680 5330 2540 617 -241 1831 -1783 344 51
745 51 -6799 -11453 -10760 -3517 2539 -1899 -8265 -11657 -7381 -8522 -10479 -14848 -12907 -12598 -8585 1417
729 1417 -3602 -5595 -148 -5035 -6567 -12359 -4523 2341 1036 196 -983 2519 5264 5474 8126 8962
713 8962 6386 2610 -152 5455 8449 8850 10258 1250 -6353 471 -846 -7334 -9658 -5257 -6248 -9918
697 -9918 -11555 -6009 -9600 -12517 -10972 -15556 -20112 -21711 -18139 -13920 -15503 -12288 -10637 -2159 1469
682 1469 -7768 -10934 -11244 -13139 -13820 -12056 -11413 -8124 -7756 -12487 -9409 -3108 -4343 2893 743 4144
666 4144 5220 6425 1297 -2092 -7864 -15358 -18364 -19959 -15929 -15558 -18600 -16288 -11539 -3730 -850
651 -850 -7769 -3725 652 -3867 -11358 -18030 -17070 -9102 1198 -3459 -10019 -7397 -4041 -1628 -1662 -1902
635 -1902 -3109 -3687 -1533 2929 -4181 -8089 -10522 -7123 -3470 -2601 -1553 -5647 -15187 -18522 -16619 -12919
619 -12919 -14561 -15705 -13693 -12078 -9019 -2738 -2727 -1092 481 2319 4161 -950 2693 5743 4255
604 4255 5194 8982 9718 3600 -765 -3916 -4331 -2071 -6015 -3707 1867 3390 323 -8309 -10552 -9133
588 -9133 -13560 -17256 -18850 -15535 -15406 -14514 -8877 -6462 -6692 -3016 6707 6390 -5924 -9495 -7269 -8363
572 -8363 -2516 3085 -245 -8603 -14846 -13970 -9431 -2792 1096 3208 5033 7339 14206 16890 5591
557 5591 -1571 -1200 1114 -5495 -3030 4781 1969 -2660 -5191 -3284 -3832 -4268 -7123 -6054 -3727 -80
541 -80 893 10 -2339 -8439 -10731 -11795 -15630 -15071 -13120 -5685 -3587 -3749 -625 -115 -3451 -6223 -3653
524 -3653 -4101 83 -3567 -783 1207 655 936 -6511 -8352 -14165 -14501 -11339 -10060 -6490 -4904 -2270
508 -2270 -5933 -14177 -13643 -10782 -11046 -7213 -4869 -5834 -6735 -6241 -3793 -2154 -4087 -10497 -11943 -10693
492 -10693 -7190 -4526 -1930 692 -4209 -5572 -8150 -7055 -2380 368 -2427 -5903 -1900 -638 -4034
477 -4034 -2353 -59 5747 8057 7521 -180 -4653 -3072 -2982 -6245 -9952 -8183 -11496 -14834 -11092 -10472
461 -10472 -7301 -1909 -1176 -7630 -13763 -15783 -11576 -13385 -10255 -9418 -9516 -12503 -14271 -13507 -12894 -9036
445 -9036 -5732 -2629 -5920 -7196 -9205 -6094 -9022 -9946 -11294 -9533 -8676 -10062 -17398 -19031 -20995 -14910
429 -14910 -7768 -3662 -2440 -1386 -7343 -9664 -11633 -8946 -4258 -3423 -1481 3111 -583 1611 3811
414 3811 4066 -1108 -2636 -3991 -5660 -10473 -6576 -3219 -8700 -5711 -5474 -1062 -1410 -6685 -6772 -3355
398 -3355 -4200 -1945 2716 1747 222 5505 5722 1189 -2357 -9102 -11666 -9584 -5144 -4515 -3889 1725
382 1725 346 -995 -4447 -7755 -9933 -4779 57 -8847 -15575 -17046 -12765 -10733 -8380 -3987 743
367 743 7075 4575 4846 6942 4956 1416 -1403 -3713 -1559 2577 1092 -3437 -2611 -2995 -9000 -8738
351 -8738 -9476 -7758 -9898 -10784 -7117 -3716 1596 10392 8435 9120 4868 5392 2872 4833 5232 -1303
335 -1303 -5634 -8731 -13519 -13624 -13250 -6110 -3698 -9663 -9114 -5906 -10862 -11201 -8478 -9074 -4241 -5937
319 -5937 -5610 9408 6665 3552 87 -4539 -8799 -2616 -1527 -6166 -10069 -8722 -12080 -13447 -11551
304 -11551 -10015 -11925 -10143 -7568 -12783 -13396 -4556 -2732 -6707 -5052 -1458 -3176 -8304 -8744 -5952
289 -5952 -9065 -9881 -10468 -9670 -11981 -12511 -9169 -9685 -4748 -123 231 -4013 -12812 -12636 -15691 -17827 -14615
272 -14615 -11033 -10228 -7214 -4047 -7269 -10974 -14828 -13292 -10631 -8221 -8084 -7539 -4594 -6872 -8434 -8923
256 -8923 -6604 -5244 -6483 -7619 -3373 -4800 -13356 -16941 -9046 -7777 -7191 -1858 -2040 -8107 -5903 -1145
240 -1145 -2583 -2587 -4600 -11489 -6738 -4744 -3769 -2569 444 -2149 -2411 -2393 -4544 -938 -1371 -6012 -3565
223 -3565 -8661 -9617 -11223 -16115 -18645 -16725 -16118 -19074 -20555 -18409 -17845 -16071 -10291 -14762 -14231 -13245
207 -13245 -12280 -2635 2340 1827 -2793 297 4109 196 -716 -270 -5015 -4873 -5661 -4999 -4159 -3298 -4420
190 -4420 -5075 -4712 -3952 -1716 -5264 -4106 -8007 -5274 -3124 -1735 -5164 -7980 -8092 -9632 -11701 -5533
174 -5533 696 332 -2185 -3917 -4584 -1721 1901 -821 -5838 -9559 -5486 -4249 -7735 -8040 -7325 -8372
158 -8372 -10278 -11858 -9257 -12007 -13382 -13694 -6211 -2799 -1003 -1918 -3111 -6015 -8329 -11470 -12654 -7713
142 -7713 535 5958 2689 -2257 -1589 1851 3328 5098 5753 1510 803 -6437 -12797 -12584 -8624 -12830
126 -12830 -9402 -7042 -8971 -9881 -8304 -11890 -16472 -13693 -9630 -9797 -8251 -7118 -8498 -10450 -8308
111 -8308 -763 1160 -2611 -1976 532 728 -621 -4005 -4946 -7881 -8199 -1982 -2599 -4362 -8192 -10394
95 -10394 -6741 -6131 -9490 -10429 -10669 -11674 -5856 -1076 -2023 -4956 -6264 -9720 -8366 -1173 2557 -1443
79 -1443 -4442 -2991 -3426 -7164 -8157 -7935 -8175 -9074 -9592 -3291 -1519 -6591 -9657 -9530 -9067 -8261 -14065 -15037
61 -15037 -7385 -747 -6751 -5952 -4931 -5893 -7986 -6614 -2224 -1671 -2078 -3426 -6282 -7924 -11125 -12540
45 -12540 -10593 -6655 -5958 -5341 -2054 -1658 -3814 -9570 -13304 -12408 -12397 -8972 -10471 -15651 -17743 -18140 -15558
28 -15558 -11908 -8149 -13019 -11910 -5371 -1529 203 2381 -2015 -6218 -11456 -12344 -8652 -4783 -2742
13 -2742 -2773 -2010 384 -2968 -7351 -8130 -7676 -5752 -5488 -3104 -2866 -6634 -9035
0 -9035
$$ Imaginary data points
##PAGE= N=2
##DATA TABLE= (X++(I..I)), XYDATA
32767 82972 82012 83186 85425 93043 92063 91721 93520 98008 104204 107841 102754 101068 104640 107806 104659
32752 104659 102304 100407 100672 103383 104921 105588 113245 113578 111739 111353 111562 112208 110938 114623 117224 117808
32736 117808 118735 116342 116521 115973 119362 120800 121181 126803 127874 129353 127238 125340 128177 128534 122647
32721 122647 123825 129276 131191 131232 131655 132565 136689 141831 143092 137183 136035 137579 141019 142443 138023
32706 138023 139502 139709 138975 140100 143247 146647 149681 147409 144636 145136 146048 151291 155708 156572 151865
32691 151865 148564 148553 148698 151102 151831 151696 157032 159262 157039 153330 155718 160317 162276 164461 169249
32676 169249 172987 170043 160723 160143 166080 171460 167910 170580 171786 174657 179253 174632 171814 171790 171548
32661 171548 176063 181228 185059 190313 186596 188213 191234 186494 184915 187858 187450 184565 182217 186163
32647 186163 189642 196356 198572 196220 196990 198330 201937 204781 200997 199213 196110 193786 192712 192665 196652
32632 196652 199095 200816 206245 209248 213461 210670 207768 208038 211062 210270 210349 209399 210785 218487 216745
32617 216745 216519 211726 206104 204279 203175 205440 209947 213471 219421 218907 220973 220227 224414 224457 221933
32602 221933 227095 232547 234484 230061 230036 229079 228022 225115 225874 223423 224162 223003 227775 232124 230644
32587 230644 229948 233776 239941 242492 244055 240766 236938 236905 229861 233160 237767 237331 235194 238949 243015
32572 243015 246197 248248 246980 249808 253598 252367 249112 249681 248092 246405 246238 254302 258789 259231 253654
32557 253654 250734 248457 247876 250284 251299 253661 252428 255852 257416 260132 263713 263402 263713 259179 258483
32542 258483 259923 263758 263864 269869 271236 268696 271186 274002 271639 270404 265559 262078 264895 268445
32528 268445 267748 263777 266196 267694 267227 268655 275171 276885 276936 275589 274130 279608 282559 283896 287718
32513 287718 282548 279722 279558 280783 279656 280680 286313 289493 291965 291731 287476 283001 287866 290133 289652
32498 289652 287786 288554 287355 285102 288228 287682 286895 288880 291331 292375 287927 287739 288241 287010 286161 292785
32482 292785 301817 299140 292414 290032 289587 285015 294605 300261 299313 297648 299030 300302 302133 305386 306818
32467 306818 299283 294745 298454 300030 300604 305123 309020 311923 308856 306042 307273 305512 307598 308522 309951
32452 309951 306304 308575 311147 309179 310453 309287 314598 312271 307772 311246 313371 315178 320686 325457
32438 325457 320215 315717 314574 308483 309125 309456 318207 318320 320149 320660 324234 325709 327705 328732 326111
32423 326111 324379 322625 328181 334283 327473 318721 321364 323416 321989 319866 321551 318684 320181 322668
32409 322668 328791 329417 325484 323796 328978 334284 333456 330928 328983 331344 335299 337690 335736 331407 333344
32394 333344 335155 335251 334179 332470 331488 329894 329020 326136 326509 332981 335860 335255 335400 341395 341335 339852
32378 339852 340857 334670 332343 329876 333528 337216 337972 336022 336716 338089 338825 341202 344759 344714 348947
32363 348947 351206 351506 355723 354615 350554 343850 339616 341535 337420 336386 333645 330975 335460 339737
32349 339737 343910 351576 352116 350098 344166 344630 347133 349931 351485 351010 348677 344213 339193 342879 338255
32334 338255 337304 343024 348474 355995 358792 355761 348339 349182 355354 353274 345963 347019 349197 357124 351240
32319 351240 342974 343068 350726 353976 350276 346431 352279 357319 354980 355991 361182 357883 349867 348014 349258
32304 349258 349975 358043 356963 353715 351645 344626 344929 349191 359110 360453 359627 360234 355988 353268 361524
32289 361524 367339 361460 359202 359843 365824 367892 362018 360429 362662 364569 362274 360385 362493 368376
32275 368376 367109 362766 359521 364422 361943 356346 349253 349777 357755 355676 362849 372986 380688 371344
32261 371344 365409 355724 354914 359130 356914 358303 364813 360375 361462 363011 361169 357037 355201 362215
32247 362215 372274 370382 369220 367718 367445 373694 375997 372322 371470 375344 376242 374733 360594 352495
32233 352495 355455 358143 362693 364279 365195 364200 364058 366970 367891 373108 375304 374796 368529 367179 364567
32218 364567 363508 365286 361632 362417 365259 366415 365574 365113 360592 366060 368278 362847 356536 364612 379118
32203 379118 379492 373965 368191 367585 365093 363233 361981 362475 360031 362864 360801 360329 363069 364448 367320
32188 367320 365579 365265 364899 366216 364416 360482 355087 357598 358797 357805 359272 364070 370473 362810 354133
32173 354133 362491 370225 370171 371245 367541 366676 371355 375552 372548 374902 375678 366711 359682 363171 371859
32158 371859 373283 373320 371957 371781 365583 365552 364206 362436 365495 371882 375384 381286 377553 373587 372638 368489
32142 368489 369674 371270 370513 368387 372673 371530 369984 374364 373387 373921 382651 384688 379056 381113 381249
32127 381249 377450 377844 372839 372222 369215 372716 372796 375329 373268 372542 367171 372173 372321 369368 370707 371580
32111 371580 373937 377979 375012 373602 374091 380349 386215 384378 381254 381292 376427 374974 379159 381940 377364
32096 377364 376594 371212 367386 365213 364863 366506 363951 362619 357774 361273 367207 365555 364013 370027 370863
32081 370863 367546 364438 361320 360556 363989 372641 375764 371470 374783 374221 378345 377213 374324 376345 378720
32066 378720 377600 374466 370814 368031 365780 368446 374077 377096 372270 372311 374076 371744 369670 371585 371255
32051 371255 371535 372729 373431 373847 378899 377929 376995 382411 383271 380662 371907 371323 367500 363590 368889 371579
32035 371579 371973 365965 363585 367142 367110 367405 368569 368959 367139 370260 367627 374084 377831 379417 379289 383117
32019 383117 384448 380350 379947 377115 379272 384011 378304 376908 374625 380891 384819 379344 373164 376743
32005 376743 377390 376483 376108 381392 386517 388064 386890 380958 378039 378729 379818 376413 380314 384641 383981
31990 383981 386305 389963 385420 385568 383066 378554 375632 377053 375784 376829 378368 379589 379742 377299 373822
31975 373822 376407 378650 370897 369388 369094 375856 381709 378247 375986 373771 380375 385303 382155 380539
31961 380539 375311 373380 375940 372489 377959 378192 377130 381322 383598 381890 389546 387735 376409 377875
31947 377875 379977 381020 380545 378020 380211 381552 383680 381330 385958 392727 389747 385156 383587 383943 384340
31932 384340 385391 382653 376603 374081 374174 378917 384037 386297 388256 386865 382978 384517 386855 392604 389141
31917 389141 384009 382152 377207 377009 385731 388723 388435 390631 386391 378772 372770 373360 375954 376586 378201
31902 378201 382621 385450 384528 378660 374642 378876 386669 387832 384526 381543 381405 378653 379717 384021 390212
31887 390212 392953 389201 385455 379920 380762 376991 380055 388442 385088 376785 373685 375476 376069 380398 377661
31872 377661 378970 372145 369016 370735 373949 377657 384741 385157 380763 381463 379070 378316 373394 375134 377512
31857 377512 376071 373920 374073 374599 375637 379927 391005 386678 381452 382290 377812 374757 367776 362853 368269
31842 368269 374425 374878 373882 373008 368053 361813 372644 378493 382327 382147 381427 380190 381805 385370 387493
31827 387493 386478 386034 380337 369608 367210 368796 379533 385803 387110 390331 390531 383358 381606 377761
31813 377761 377557 383536 393442 390877 388983 392293 393293 391179 382892 373437 371849 375922 369977 368904
31799 368904 371678 369855 371191 376816 378950 381651 380918 377936 379627 385502 387129 378666 373979 376806
31785 376806 381633 386115 382455 382357 385525 385195 386958 387038 386732 384053 382406 385573 386110 379871 378150 378755
31769 378755 379920 383046 386076 384599 384366 386858 379621 377974 381802 387241 388027 386606 387922 384829 387828
31754 387828 392877 398376 402309 396422 391453 387594 381656 384640 389213 391746 387929 385710 384159 389092
31740 389092 386995 387822 390795 392533 391549 388940 385880 383811 385693 381866 383035 380172 380016 381214 378768
31725 378768 386798 381954 381438 379829 381556 385771 389096 390780 392051 390926 388646 382824 382049 388789 387575
31710 387575 387190 386406 388867 387345 387685 391262 392314 395571 398237 394524 392684 386687 385369 383958 380026
31695 380026 382196 388575 390168 392564 391903 392808 391164 389767 390419 389245 384701 384550 388871 394649 390964
31680 390964 384172 382915 382613 382203 381659 380904 378910 375950 379657 385086 384453 382793 382298 379971 381875 381262
31664 381262 383330 381282 381889 383489 386117 385094 380816 382566 382096 383817 386552 389762 385656 377821 380545
31649 380545 385842 390431 398573 404001 395499 391902 389381 386474 384804 384326 389418 390021 386084 386936 392497
$$ [...]
##END NTUPLES=NMR SPECTRUM
##END=
