##TITLE=Analysis number 313065
Compound Code cc 43911
Book Reference 407/91
Project Code adrs
Chemist Name andyw
##JCAMPDX= 6.0         $$ Bruker NMR JCAMP-DX V2.0
##DATA TYPE= NMR SPECTRUM
##DATA CLASS= NTUPLES
##ORIGIN= Bruker BioSpin GmbH
##OWNER= NMR
$$ XWIN-NMR		Version 3.5
$$ Wed Aug 24 14:00:55 2005 GMT Daylight Time (UT+1h)  MAYBRIDGE\NMR@NMR_250MHZ
##.OBSERVE FREQUENCY= 250.131544655141
##.OBSERVE NUCLEUS= ^1H
##.ACQUISITION MODE= SIMULTANEOUS (DQD)
##.ACQUISITION SCHEME= undefined
##.AVERAGES= 16
##.DIGITISER RES= 18
##SPECTROMETER/DATA SYSTEM= dpx250
##.PULSE SEQUENCE= zg30
##.SOLVENT NAME= CDCl3
##.SHIFT REFERENCE= (INTERNAL, CDCl3, 0, 16.456)
##AUDIT TRAIL= $$ (NUMBER, WHEN, WHO, WHERE, WHAT)
$$ ##TITLE= Audit trail, XWIN-NMR		Version 3.5
$$ ##JCAMPDX= 5.01
$$ ##ORIGIN= Bruker BioSpin GmbH
$$ ##OWNER= NMR
$$ C:\u/data/dgb/nmr/ADRS/8520/pdata/1/auditp.txt
$$ ##AUDIT TRAIL=  $$ (NUMBER, WHEN, WHO, WHERE, WHAT)
(   1,<2005-08-24 14:00:34.94 +100>,<MAYBRIDGE\NMR>,<NMR_250MHZ>,
      <created by zg, POWCHK disabled, PULCHK disabled
       configuration hash MD5:
       62 19 C7 07 E1 42 D1 B7 37 6C 3D D0 77 39 F9 E6
       data hash MD5: 64K
       7F E1 3C FD 24 1F B3 D4 76 38 C3 7F F2 2C 6A 88>)
(   2,<2005-08-24 14:00:46.53 +100>,<MAYBRIDGE\NMR>,<NMR_250MHZ>,
      <Start of raw data processing
       ef LB = 0.3 FT_mod = 6 PKNL = 1 SI = 32K 
       data hash MD5: 32K
       5E 52 5F B6 C3 26 FD 24 F2 AD 8D 6A E0 41 FD 4D>)
(   3,<2005-08-24 14:00:48.38 +100>,<MAYBRIDGE\NMR>,<NMR_250MHZ>,
      <apk 
       data hash MD5: 32K
       37 A2 66 85 ED EB DE 70 30 E2 2E FC 70 11 A8 DD>)
(   4,<2005-08-24 14:00:49.03 +100>,<MAYBRIDGE\NMR>,<NMR_250MHZ>,
      <abs ABSG = 5 
       data hash MD5: 32K
       0C D7 39 D1 51 D5 BF 87 8F 51 4A 0F D2 C0 49 D8>)
$$ ##END=
$$ 
$$ hash MD5
$$ DC 59 2E 43 A7 3C B2 70 89 80 A6 52 73 14 67 2A
##$RELAX= 
##$RELAX= 
##$RELAX= 
##$RELAX= 
##$RELAX= 
##$RELAX= 
##$RELAX= 
$$ Bruker specific parameters
$$ --------------------------
##$DU= <C:\u>
##$EXPNO= 8520
##$NAME= <ADRS>
##$PROCNO= 1
##$TYPE= <nmr>
##$USER= <dgb>
##$AMP= (0..31)
100 100 100 100 100 100 100 100 100 100 100 100 100 100 100 100 100 100 
100 100 100 100 100 100 100 100 100 100 100 100 100 100 
##$AQSEQ= 0
##$AQ_mod= 3
##$AUNM= <au_zg>
##$AUTOPOS= <38 >
##$BF1= 250.13
##$BF2= 250.13
##$BF3= 250.13
##$BF4= 250.13
##$BF5= 500.13
##$BF6= 500.13
##$BF7= 500.13
##$BF8= 500.13
##$BYTORDA= 1
##$CFDGTYP= 0
##$CFRGTYP= 5
##$CHEMSTR= <none>
##$CNST= (0..31)
1 1 145 1 1 1 1 1 1 1 1 1 1 1 1 1 1 1 1 1 1 1 1 1 1 1 1 1 1 1 1 1 
##$CPDPRG= <>
##$CPDPRG1= <>
##$CPDPRG2= <>
##$CPDPRG3= <>
##$CPDPRG4= <mlev>
##$CPDPRG5= <mlev>
##$CPDPRG6= <mlev>
##$CPDPRG7= <mlev>
##$CPDPRG8= <mlev>
##$CPDPRGB= <>
##$CPDPRGT= <>
##$D= (0..31)
0 1 0 0 0 0 0 0 0 0.06 0 0 0 0 0 0 0.0002 0 0 0 0 0 0 0 0 0 0 0 0 0 0 
0 
##$DATE= 1124888434
##$DBL= (0..7)
120 120 120 120 120 120 120 120 
##$DBP= (0..7)
150 150 150 150 150 150 150 150 
##$DBP07= 0
##$DBPNAM0= <>
##$DBPNAM1= <>
$$ [...]
##$SUBNAM7= <"">
##$SUBNAM8= <"">
##$SUBNAM9= <"">
##$SW= 20.6930455092707
##$SWIBOX= (0..15)
0 0 3 0 0 0 0 0 0 0 0 0 0 0 0 0 
##$SW_h= 5175.983436853
##$TD= 65536
##$TD0= 1
##$TE= 295.16
##$TE2= 300
##$TE3= 300
##$TEG= 300
##$TL= (0..7)
0 120 120 120 120 120 120 120 
##$TP= (0..7)
150 150 150 150 150 150 150 150 
##$TP07= 0
##$TPNAME0= <>
##$TPNAME1= <>
##$TPNAME2= <>
##$TPNAME3= <>
##$TPNAME4= <>
##$TPNAME5= <>
##$TPNAME6= <>
##$TPNAME7= <>
##$TPOAL= (0..7)
0.5 0.5 0.5 0.5 0.5 0.5 0.5 0.5 
##$TPOFFS= (0..7)
0 0 0 0 0 0 0 0 
##$TUNHIN= 0
##$TUNHOUT= 0
##$TUNXOUT= 0
##$USERA1= <user>
##$USERA2= <user>
##$USERA3= <user>
##$USERA4= <user>
##$USERA5= <user>
##$V9= 5
##$VALIST= <valist>
##$VCLIST= <CCCCCCCCCCCCCCC>
##$VD= 0
##$VDLIST= <DDDDDDDDDDDDDDD>
##$VPLIST= <PPPPPPPPPPPPPPP>
##$VTLIST= <TTTTTTTTTTTTTTT>
##$WBST= 1024
##$WBSW= 4
##$XGAIN= (0..3)
0 0 0 0 
##$XL= 0
##$YL= 0
##$YMAX_a= 436264
##$YMIN_a= -533776
##$ZGOPTNS= <>
##$ZL1= 120
##$ZL2= 120
##$ZL3= 120
##$ZL4= 120
##$ABSF1= 16.45599
##$ABSF2= -4.237183
##$ABSG= 5
##$ABSL= 3
##$ALPHA= 0
##$AQORDER= 0
##$ASSFAC= 0
##$ASSFACI= 0
##$ASSFACX= 0
##$ASSWID= 0
##$AUNMP= <proc_1d>
##$AZFE= 0.1
##$AZFW= 0.1
##$BCFW= 0
##$BC_mod= 0
##$BYTORDP= 0
##$COROFFS= 0
##$CY= 12.5
##$DATMOD= 1
##$DC= 0
##$DFILT= <>
##$DTYPP= 0
##$F1P= 14.0000005364418
##$F2P= -0.99999901652339
##$FCOR= 0.5
##$FTSIZE= 32768
##$FT_mod= 6
##$GAMMA= 0
##$GB= 0
##$INTBC= 1
##$INTSCL= 1
##$ISEN= 128
##$LB= 0.3
##$LEV0= 0
##$LPBIN= 0
##$MAXI= 10000
##$MC2= 0
##$MEAN= 0
##$ME_mod= 0
##$MI= 0
##$NCOEF= 0
##$NC_proc= -3
##$NLEV= 6
##$NOISF1= 0
##$NOISF2= 0
##$NSP= 0
##$NTH_PI= 0
##$NZP= 0
##$OFFSET= 16.45599
##$PC= 1
##$PHC0= -78.1708
##$PHC1= 5.145494
##$PH_mod= 1
##$PKNL= yes
##$PPARMOD= 0
##$PSCAL= 4
##$PSIGN= 0
##$REVERSE= no
##$SF= 250.130016509787
##$SI= 32768
##$SIGF1= 0
##$SIGF2= 0
##$SINO= 400
##$SIOLD= 32768
##$SREGLST= <1H.CDCl3>
##$SSB= 0
##$STSI= 32768
##$STSR= 0
##$SW_p= 5175.98343685301
##$SYMM= 0
##$S_DEV= 0
##$TDeff= 65536
##$TDoff= 0
##$TI= <Analysis number 999999
Compound Code 99
Book Reference 9
Project Code 9>
##$TILT= no
##$TM1= 0
##$TM2= 0
##$TOPLEV= 0
##$USERP1= <user>
##$USERP2= <user>
##$USERP3= <user>
##$USERP4= <user>
##$USERP5= <user>
##$WDW= 1
##$XDIM= 32768
##$YMAX_p= 538404568
##$YMIN_p= -78644
$$ End of Bruker specific parameters
$$ ---------------------------------
##NTUPLES= NMR SPECTRUM
##VAR_NAME=  FREQUENCY,     SPECTRUM/REAL,   SPECTRUM/IMAG
##SYMBOL=    X,             R,               I
##VAR_TYPE=  INDEPENDENT,   DEPENDENT,       DEPENDENT
##VAR_FORM=  AFFN,          ASDF,            ASDF
##VAR_DIM=   32768,         32768,           32768
##UNITS=     HZ,            ARBITRARY UNITS, ARBITRARY UNITS
##FACTOR=    0.157963299565203, 1,           1
##FIRST=     4116.1370097754, 0,             0
##LAST=      -1059.84642707761, 0,           0
##MIN=       -1059.84642707761, -78644,      0
##MAX=       4116.1370097754, 538404568,     0
$$ Real data points
##PAGE= N=1
##DATA TABLE= (X++(R..R)), XYDATA
$$ [...]
15003c8298J8127Q640L977j3265P250P424Q765M931O676P831J017k2760j048J0506
14989I773J369k0598q250q666n987J4852R639N188k211N207J1480r44j8549n174
14975a2871o141k3932k2957K0336j7J0947K2469J4301M567j5521j7985n130K0217
14962a1717k393j0323L797n618n69K751j5549N545J2940K760J5191J3872j4137
14949c450j5487o153K3900J3598j0026j5566j8627o408r86Q509R492m236r40K0731
14935e649j0163j7520R375j0484j1595l73J0866J4823m037R509L025k1615j9524
14922e3362J5029k173J827R694j1233n51J4385O780k903J6149J2187r825o842
14909a0838o148N728O882l3109j5986J3799r88j1049N015K7058K445R551J6348
$$ plain form
15003 -38298 -20171 -11531 -7554 -20819 -13569 -6145 2620 7551 14227 22058 23075 315 -733 9773
14989 9773 11142 -9456 -17706 -26372 -32359 -17507 -7868 -2680 -4891 316 11796 10852 -7697 -12871
14975 -12871 -19012 -42944 -65901 -45565 -45582 -34635 -12166 2135 6702 -8819 -26804 -31934 -11717
14962 -11717 -14110 -24433 -20636 -26254 -26823 -24072 -39621 -34076 -21136 -18376 -3185 10687 -3450
14949 -3450 -18937 -25090 -1190 12408 2382 -13184 -31811 -38219 -39205 -30696 -21204 -25440 -26380 -5649
14935 -5649 -15812 -33332 -23957 -34441 -46036 -46409 -35543 -20720 -24757 -15248 -12223 -33838 -53362
14922 -53362 -38333 -40506 -38679 -28985 -40218 -40769 -26384 -19604 -22507 -6358 5829 -3996 -10838
14909 -10838 -16986 -11258 -4376 -37485 -53471 -39672 -40660 -51709 -46694 -19636 -17191 -7640 8708
14896H708l381j711j3015j3577O440j1852J43K5774p99q681j1428J26l888O768
14882b0373J1208K2956n033j3968J0815J8339L848k2535k3025j3747q65K8148
14870d232M488M376m651j4869q592j2762J3198L687K742p084N943P288j5564o528
14856c2560K35L720l35J4785J5197R11j7459p276L700K2846j1269p341j5145P728
14842b2263J3148M716P986p353j0157J639q846k790N23R388M26j5968q676p73
14828c9000J8732J6080q916o866J9854J2232n382k2041O37J3790N76K755j9602
14815a7151j0578K0402J9395J3959L543j4052k858j7628p159j2212K165j3540
14803c5714K6770J6741k292L959j5243o208k818j4356r882J0511J5415J3645K746
$$ plain form
14896 8708 5327 3616 -9399 -22976 -16536 -28388 -28245 -2471 -3270 -11951 -23379 -23253 -27141 -20373
14882 -20373 -9165 13791 8758 -5210 5605 23944 27792 5257 -17768 -31515 -32380 -4232
14870 -4232 256 4632 -19 -14888 -23480 -36242 -23044 -19357 -16615 -23699 -17756 -10468 -26032 -32560
14856 -32560 -32325 -28605 -28940 -14155 1042 1953 -15506 -22782 -19082 3764 -7505 -14846 -29991 -22263
14842 -22263 -9115 -4399 3587 -3766 -13923 -12284 -21130 -23920 -23397 -14009 -13583 -29551 -38227 -39000
14828 -39000 -20268 -4188 -13104 -19970 -116 12116 6734 -15307 -14670 -880 -304 2451 -17151
14815 -17151 -27729 -7327 12068 26027 29570 15518 12660 -4968 -12127 -24339 -22174 -35714
14803 -35714 -8944 7797 5505 9464 -5779 -11987 -14805 -29161 -39043 -28532 -13117 528 3274
14790C274k1307J205J525j4492j1033Q499Q60j599M24N156j9024l2132M424L571
14776g0649R487J1477P66j546j4385n188K0625J1564Q978J0755K4022j6258n08
14763a0860O248j8066L979K0593n790J5974J1001L181j3886l9696O255K4544J2490
14750A5967l490k5962j9948k598J3113J1129R35m352Q57K3095J7030j2514k6679
14737a3417J501Q081j909j3322n104k6939L312Q989o335L059J2020M110N299n451
14723b6106q868J2116J29j4080L02K3612K621l610q298k031l270Q682N215j2497
14709b6083R78j0748P119J3909M61Q642R661p720J6104J4883m759j4787k6745
14696a9085n755J9562L948k900J405L408k717l51J5542j2850n965Q646k6215l088
$$ plain form
14790 3274 -18033 -16828 -15303 -29795 -40828 -32329 -31469 -33068 -32644 -27488 -46512 -78644 -74220 -70649
14776 -70649 -61162 -49685 -48919 -50465 -64850 -70038 -49413 -37849 -28871 -18116 5906 -10352 -10860
14763 -10860 -4612 -22678 -18699 1894 -3896 12078 23079 26260 12374 -27322 -21067 3477 15967
14750 15967 12477 -13485 -33433 -36031 -22918 -11789 -10854 -15206 -14349 8746 25776 13262 -13417
14737 -13417 -11916 -3835 -5744 -19066 -24170 -51109 -47797 -38808 -45143 -42084 -30064 -25954 -20655 -26106
14723 -26106 -34974 -22858 -22729 -36809 -36507 -12895 -10274 -13884 -22182 -24213 -27483 -18801 -13586 -26083
14709 -26083 -25105 -35853 -28734 -14825 -14364 -5722 3939 -3781 12323 27206 22447 7660 -19085
14696 -19085 -24840 -5278 -1330 -4230 -2825 583 -2134 -2485 13057 207 -5758 2888 -23327 -26415
14682b6415J1294K375j561L223l703o589j5652j6074J0528K6419J1670j3054j2614
14669c0153m088r542r036K3902J5955Q280j5129q10P389J7227k5105k812J3082
14656a0840j5062o489J5520L518J1381j433J0908n734q118J755m849j6363J0590
14643a5216L761r577Q769k054j1002l530J547r355j1704K9772K780k5509J0445
14630c0873K4403n406k2135k192J2172j458J3639J6809p330n014q111j6923O118
14617b6301J5481O416j2586j0099J4472O991M557j372L017N234j2464j5251N069
14604a6836J1985l826j0476m44J1927p497m095J6161P969j1616l815j9257M165
14591b5655O577l663J0076J2796m831m546J6012o300k5222Q321K923j4718J24
$$ plain form
14682 -26415 -15121 -12746 -14307 -11084 -14787 -21376 -37028 -53102 -42574 -16155 -4485 -17539 -30153
14669 -30153 -34241 -43783 -52819 -28917 -12962 -4682 -19811 -20621 -13232 3995 -21110 -23922 -10840
14656 -10840 -25902 -32391 -16871 -13353 -1972 -3405 7503 1769 -6349 -4594 -9443 -25806 -15216
14643 -15216 -11455 -21032 -12263 -14317 -25319 -28849 -27302 -36657 -48361 -18589 -15809 -41318 -30873
14630 -30873 -6470 -11876 -34011 -36203 -24031 -25489 -11850 4959 -2371 -7385 -15496 -32419 -26301
14617 -26301 -10820 -4404 -16990 -27089 -12617 -5626 -1069 -2441 576 5810 -6654 -21905 -16836
14604 -16836 -4851 -8677 -19153 -19597 -7670 -15167 -19262 -3101 4868 -6748 -10563 -29820 -25655
14591 -25655 -19078 -22741 -12665 131 -4700 -9246 6766 466 -24756 -16435 -13512 -28230 -28106
14578b8106J5290M635P845q183k5130m162J4833J1863J971P377o98K2423j2759
14565G199j6230R68Q426M553m559L535L820K447j5579r254K7208J6573p584k1489
14551C4j3244r157j4950N952J5559j2873j0799o821k453o08J2735J391J1608R190
14537a4436j3433P775Q008P317p500M606R79j4324R760K0833k942j5013j2875
14524b1245m540J7384L3357J8257j1620l5689k6996J3889N649L278m73p492M051
14511a2190M150o795J295l250j2482j5339j1074j3968N879K4294K0657M567J926
14498a2330K175k497L2250l035N4k665k3l304j1469k0454r461J3078J9571N048
14484F938r227o942l153k1637O86R986o341K613J8016J6608p709j0372j429j8064
$$ plain form
14578 -28106 -12816 -8181 -336 -8519 -33649 -37811 -22978 -11115 -9144 -1767 -2465 19958 7199
14565 7199 -9031 -8063 363 4916 357 3892 7712 10159 -5420 -14674 12534 29107 21523 34
14551 34 -13210 -22367 -37317 -31365 -15806 -28679 -39478 -46299 -48752 -49360 -36625 -35234 -23626 -14436
14537 -14436 -27869 -20094 -12086 -4769 -12269 -7663 -6684 -21008 -11248 9585 6643 -8370 -21245
14524 -21245 -25785 -8401 24956 43213 31593 -4096 -31092 -17203 -11554 -8276 -8749 -16241 -12190
14511 -12190 -8040 -14835 -13540 -16790 -29272 -44611 -55685 -69653 -63774 -39480 -18823 -14256 -12330
14498 -12330 -10155 -12652 19598 16563 16617 13952 13929 10625 -844 -21298 -30759 -17681 1890 6938
14484 6938 -2289 -9231 -12384 -34021 -33335 -23349 -29690 -27077 -9061 7547 -162 -10534 -11963 -30027
14470c0027m612K463p502j4794o550J3920K4179J444m729J3668j984q828J9219
14457d133J2245j4932n65l832O729J2518M788o918l224Q522j1096l6047P384J0906
14443a7655j2763j1372k1126L2778K4676K1992m264k1734j6643m984N374R432
14431a6289l179n726r063n517j8909R200K1773J2399n923r496j3529j0426K1954
14418c2731K2486k3142l113L3448j207p364j0606r242K1337J192N991N211k5651
14405b3391j071L429R850q54q6m875l526P39O278M601j6325k526K0550N050p101
14390i258M436J0840M012r674r298m581J2180o742j3457p817o75N129Q577j4145
14376c0473P586M550q862j7207o861j516N655J0376k973j1137J5825J884J0528
$$ plain form
14470 -30027 -34639 -32176 -39678 -54472 -61022 -47102 -22923 -21479 -26208 -12540 -14524 -23352 -4133
14457 -4133 8112 -6820 -7385 -11217 -4488 8030 12818 5900 2676 11198 102 -35945 -28561 -17655
14443 -17655 -30418 -41790 -62916 -30138 -5462 16530 12266 -9468 -26111 -31095 -25721 -16289
14431 -16289 -19468 -25194 -34257 -39774 -58683 -49483 -27710 -15311 -21234 -30730 -44259 -54685 -32731
14418 -32731 -10245 -33387 -36500 -3052 -4259 -11623 -22229 -31471 -10134 -8942 -2951 2260 -23391
14405 -23391 -24462 -21033 -11183 -12037 -12123 -16998 -20524 -19785 -13507 -8906 -25231 -27757 -7207 -2157 -9258
14390 -9258 -4822 6018 10030 356 -8942 -13523 -1343 -8085 -21542 -29359 -30034 -24905 -16328 -30473
14376 -30473 -22887 -18337 -27199 -44406 -51267 -52783 -47128 -36752 -39725 -50862 -35037 -33153 -22625
14363b2625P590k495r055L568J1864J501L317j690j0049O885J242N605j7576j5950
14349c7868P169l701J660Q937L739p405j1494R958K624J5882J5607J6963N529
14336B7600k1821j1322J0317j1509k3864M377J9155L175k111n955j076K307J1512
14323G85J7782J153p156n648j7997l788J1691j105J7742L362j5812k915K1978
14310B0072j0967j8598p677m963M626J949p734j0583L457O787Q109k8230r116
14297e2868Q744K0087J7271Q177Q42r180J4916r74l615P856o755j5038k1688l056
14283c5281K739R179J3872N911K516r150r254l52J0289R474J6714M844r631r89
14269A0881l655j8994Q614N000k494m720m680M906J4289j3917j7655j2014M445
$$ plain form
14363 -22625 -15035 -17530 -26585 -23017 -11153 -9652 -6335 -8025 -18074 -11189 -9947 -4342 -21918 -37868
14349 -37868 -30699 -34400 -32740 -23803 -20064 -27469 -38963 -29005 -26381 -10499 5108 22071 27600
14336 27600 5779 -5543 4774 -6735 -30599 -26222 -7067 -3892 -6003 -11958 -13034 -10727 785
14323 785 18567 19720 12564 6916 -11081 -14869 -3178 -4283 13459 16821 1009 -1906 20072
14310 20072 9105 -9493 -17170 -22133 -17507 -15558 -23292 -33875 -30418 -23631 -15522 -43752 -52868
14297 -52868 -44124 -24037 -6766 1411 2253 -6927 7989 7015 3400 11256 4501 -10537 -32225 -35281
14283 -35281 -32542 -23363 -9491 -3580 -1064 -10214 -19468 -19820 -9531 -57 16657 21501 11870 10881
14269 10881 7226 -11768 -3154 1846 -648 -5368 -10048 -5142 9147 -4770 -22425 -34439 -29994
14256b9994N478j447j0273j112J2451J0187m368l900j3625J5212J6707R51o561
14243a0294K818j8780j2821J9861J1394r213l307p876j8808o310J1120J39P419
14230c4658R535Q40Q970o713J195Q985j8553J0717k932j0029K4307J0133l1342
14217b9545j4732l335k846k854J612p85K2656J0337j0704j4147J3590L162O690
14204b0901M477O206L40Q188J2009O287j1994r714Q172K319J0263o405r67J990
14190A0270k012q601j7321j0335J973K9455J2768p457q614p726O842K076n710
14177d392j230j0333K81r271l983R329o384P785K148m096M760K1596k654j686
14163A870k6104P917J4484K449J923j3020k97K427k78O184j4725j8560N129J0057
$$ plain form
14256 -29994 -24516 -25963 -36236 -37348 -24897 -14710 -19078 -22978 -36603 -21391 -4684 -3733 -10294
14243 -10294 -7476 -26256 -39077 -19216 -7822 -17035 -20342 -28218 -47026 -53336 -42216 -42077 -34658
14230 -34658 -25123 -24283 -15313 -22026 -20831 -11846 -30399 -19682 -22614 -32643 -8336 1797 -29545
14217 -29545 -44277 -47612 -50458 -53312 -51700 -52485 -29829 -19492 -30196 -44343 -30753 -27591 -20901
14204 -20901 -16424 -10218 -9878 -1690 10319 16606 4612 -5102 3070 5389 15652 9247 8280 10270
14190 10270 8258 -343 -17664 -27999 -26026 3429 16197 8740 126 -7600 -758 1318 -4392
14177 -4392 -5622 -15955 -15674 -24945 -28928 -19599 -25983 -18198 -16050 -20146 -15386 6210 3556 1870
14163 1870 -24234 -16317 -1833 616 2539 -10481 -10778 -8351 -8629 -2445 -17170 -35730 -30601 -20544
14149b0544Q386K3233J0212k5241j5499O886M933r755p48j2520N613J0330M894
14136i820m713j843o016N629J4965l35q660p561M949L338L574j0091R407j708
14122h885k2800k130J0670J2963k872k136q164O41J97K835R023J0294J1878p936
14108C578Q132O179k2335k0518k166J3351J631J451j949O370R18j0806l391k173
14094b1728L31j5302j688J4015P288O484l466Q26j188J8732Q973l177p680p160
14080d740j3957R809k978q962J169P997O079p78m261P588j1471k4693J0007J2976
14066a6215R814O36L484j952k289K387p414j5887M048P370j3370J4142K0971Q533
14052A4258k2248k5437P977J4113q579k889J5982p127m423O139k803K277J081
$$ plain form
14149 -20544 -12158 11075 21287 -3954 -19453 -12567 -7634 -17389 -18137 -30657 -25044 -14714 -9820
14136 -9820 -14533 -16376 -22392 -16763 -1798 -2133 -10793 -18354 -13405 -10067 -6493 -16584 -7177 -8885
14122 -8885 -31685 -33815 -23145 -10182 -13054 -15190 -23354 -22713 -22516 -19681 -10658 -364 11514 3578
14108 3578 11710 17889 -4446 -24964 -27130 -13779 -12148 -10697 -12646 -6276 -5358 -16164 -19555 -21728
14094 -21728 -21397 -36699 -38387 -24372 -17084 -10600 -14066 -13240 -14428 4304 13277 10100 2420 -4740
14080 -4740 -18697 -8888 -11866 -20828 -19659 -11662 -5583 -6361 -10622 -3034 -14505 -39198 -29191 -16215
14066 -16215 -6401 -5765 -2281 -4233 -6522 -4135 -11549 -27436 -23388 -16018 -29388 -15246 5725 14258
14052 14258 -7990 -33427 -25450 -11337 -19916 -22805 -6823 -13950 -18373 -12234 -15037 -12760 -11679
14039a1679j5018n449j0921l905R432J0647J9693P348Q015O938K502k2532j7355
14026b2284J9982K7477j2972j6159j2741m867j3917J3968m420J321J548l174J2968
14013a3270p227j863N476L696r354r923n227j1191j3409J3878P691N36J3197J8522
13999h468O504k312J006j9569M053k706l512p999r661p687N289J6585K0541N255
13985b681J0435L686L811j956j6458q415q629m117k464r013M295J2466K0985K8466
13971C0411M143r606p24k4810j989k051j631r235j4251L457L842N112R64j0329
13957b6697J320J560N690l134l721P956K124j0124K41J6575j680J9026j0669j5370
13943a6903K142J1098p184j2640J1098K037R170P753m670M24j0156j4965O451
$$ plain form
14039 -11679 -26697 -32146 -43067 -46972 -37540 -26893 -7200 148 8163 15101 17603 -4929 -22284
14026 -22284 -2302 25175 12203 -3956 -16697 -21564 -35481 -21513 -25933 -24612 -23064 -26238 -13270
14013 -13270 -20497 -22360 -16884 -13188 -22542 -32465 -37692 -48883 -62292 -48414 -40723 -40187 -26990 -8468
13999 -8468 -1964 -4276 -3270 -22839 -18786 -21492 -25004 -33003 -42664 -50351 -45062 -28477 -7936 -2681
13985 -2681 7754 11440 15251 13295 -3163 -11578 -20207 -24324 -26788 -35801 -31506 -19040 1945 30411
13971 30411 34554 24948 24224 -586 -2575 -4626 -6257 -15492 -29743 -26286 -22444 -17332 -16368 -26697
13957 -26697 -25377 -23817 -18127 -21261 -24982 -17026 -14902 -25026 -24785 -8210 -9890 9136 -1533 -16903
13943 -16903 -14761 -3663 -10847 -23487 -12389 -10352 -1182 6571 1901 2325 -7831 -22796 -16345
13930a6345Q86j7377m737K2983J423M936J9313l771q570k0092K924J3990j5051
13917a9488j3814M893O257L991J3033J1768j1173j2830q478l346J3618K976j9946
13904c2539N724K984r105o00l729J036q47j6454P202J7696K4143O077j3997J0382
13890b027p319k5466K2775K3481J988o4p494o6p205k216k0901L714O547k953J6537
13875f69K6862L204p34j2978m482N520j692O855j3471o20R955J533J2121q722
13861B2682m201j4278j8476l910K8346J9845O867k9277n982P568J8784j0459j0374
13848G135q924r079k064l016l331J2483j542K530m372L787J0050p905Q933n926
13834a241O637m693k3718j0220J8904k646q055k434M763R080j1263L500l515J0208
$$ plain form
13930 -16345 -15459 -32836 -37573 -14590 -13167 -8231 11082 7311 -1259 -21351 -18427 -4437 -19488
13917 -19488 -33302 -28409 -22152 -18161 -5128 6640 -4533 -17363 -25841 -29187 -15569 -12593 -32539
13904 -32539 -26815 -23831 -32936 -33536 -37265 -36229 -37076 -53530 -46328 -28632 -4489 1588 -12409 -2027
13890 -2027 -9346 -34812 -12037 11444 13432 13368 5874 5808 -1397 -3613 -24514 -20800 -14253 -17206 -669
13875 -669 26193 29397 28663 15685 11203 16723 15031 21886 8415 7795 17750 19283 31404 22682
13861 22682 18481 4203 -14273 -18183 10163 30008 36875 7598 1616 9184 27968 17509 7135
13848 7135 -1789 -10868 -12932 -15948 -19279 -6796 -8338 -5808 -10180 -6393 3657 -4248 4685 -1241
13834 -1241 5396 703 -23015 -33235 -14331 -16977 -25032 -27466 -22703 -13623 -24886 -21386 -24901 -14693
13820a4693L929K2800J5868q984Q254k742j3977j1808j097j409P909j3520k972
13807a2442J503J2574P754L28j4085k2368L452J4859J1194Q365K966p357o077
13794F66J6144j744m027k1569M963J2454K025L805j438R3m782K158N351J5815
13780B9914j9797j4857Q393k335l6578k0892K4925K6386J2107k97R952j3995k2064
13767a9138j2736P014o625Q86j0282j8737M708J4131J8794R872P010J0339q836
13754c600j6275Q100M975R900M988k194k1309r801k0436M309K8061n278j1063
13741b9623q07N822j2589K76j8100M584J9834k101k866J8076K451J415k62O195
13727g695j1306j729L049J3232k864k012j2030p590r682P969R613L889m571j4024
$$ plain form
13820 -14693 -10764 12036 27904 18920 27174 24432 10455 -1353 -2450 -3859 4050 -9470 -12442
13807 -12442 -10939 1635 9389 9717 -4368 -26736 -23284 -8425 2769 11134 14100 6743 666
13794 666 16810 15066 11039 -10530 -5567 6887 8912 12717 11279 11372 6590 8748 14099 29914
13780 29914 10117 -4740 3653 1318 -35260 -56152 -31227 -4841 7266 6969 16921 2926 -19138
13767 -19138 -31874 -24860 -31485 -30599 -40881 -59618 -54910 -40779 -21985 -12113 -5103 5236 -3600
13754 -3600 -19875 -11775 -6800 3100 8088 5894 -15415 -25216 -45652 -41343 -13282 -18560 -29623
13741 -29623 -30430 -24608 -37197 -36921 -55021 -50437 -30603 -32704 -35570 -17494 -15043 -13628 -13890 -7695
13727 -7695 -19001 -20730 -17681 -4449 -7313 -9325 -21355 -28945 -38627 -30658 -21045 -17156 -21727 -35751
13713c5751O989K0288R447l465j1387J394j498j0138p848J0168K8990K619m25
13700I383O509J2091J413j1770M58n422q290m974J0647k365M03P780L546j4339
13686E070N710j2728k2139q397N657j7316J1183K2924K525l970P788J7813j015
13673A3105J005j491q853o350N056J3908O525k832j2439j1601q603n453r392J3758
13659a3657J4860J7886j0348L1444L09k5033l1114j2845M104P789J2438K883J8323
13646A7039M749J6429M252k4991r857J823J036j3695j6656L481J5130R551M764
13633A3055J4945j663j6111O386m066p499k451Q109Q73P961N860k774j0394j3057
13619h26J1429K60m802K239M288q888j2630J8405nm607r707j137L325K517J9431
$$ plain form
13713 -35751 -28762 -8474 973 -2492 -13879 -12485 -13983 -24121 -31969 -21801 7189 9808 9383
13700 9383 15892 27983 29396 17626 18084 12662 4372 -602 10045 7680 8083 15863 19409 5070
13686 5070 10780 -1948 -24087 -32484 -26827 -44143 -32960 -10036 -7511 -11481 -3693 14120 13105
13673 13105 14110 12619 3766 -2584 2472 16380 22905 20073 7634 -3967 -12570 -18023 -27415 -13657
13659 -13657 1203 19089 8741 40185 40494 15461 -15653 -28498 -24394 -16605 -4167 -1284 17039
13646 17039 21788 38217 42469 17478 7621 9444 10480 -3215 -19871 -16390 -1260 8291 13055
13633 13055 28000 26337 10226 16612 12546 5047 2596 10705 11578 19539 25399 22625 12231 -826
13619 -826 10603 10863 6061 8300 12588 3700 -8930 9475 9470 4863 -4844 -5981 -2656 -139 19292
13604A9292p913j9614J0821j960j0459r586J518M020R962Q283J7380J0743k655
13591B9832L3877K1037r913m3231j7020O668K304q205N137J223j5097k5736J8713
13578d11N467R9L3438M709q671L28j6622j7029k847J2557O747q076M618J837r103
13563G041j350K2162j160n108l964j2804j7982l83P935j1086r661O134J786L327
13549a5113J3268j028J2878P653O283O284j2737J024L313J460J157J3949L844
13536D2235j9597k6105j094J3866J7828J7294J0841p969l423J2095j2251k3594
13524B0126O282K8116o169l2256l6173o413M872L809P142o353k396K1980n13l544
13510a490K89K759K334M948k1945p867J4138J7523j244o184k429j006j1703r550
$$ plain form
13604 19292 11379 -8235 2586 626 -9833 -19419 -17901 -13881 -3919 4364 21744 32487 29832
13591 29832 63709 84746 74833 31602 14582 21250 23554 15349 20486 21709 6612 -19124 -411
13578 -411 5056 5155 38593 43302 34631 34959 18337 1308 -1539 11018 17765 9689 14307 16144 7041
13563 7041 5691 27853 26693 21585 17621 4817 -13165 -13548 -5613 -16699 -26360 -20226 -18440 -15113
13549 -15113 -1845 -2873 10005 17658 23941 30225 17488 18512 21825 23285 24442 38391 42235
13536 42235 22638 -3467 -4561 9305 27133 44427 55268 47299 43876 55971 43720 20126
13524 20126 26408 54524 48355 16099 -20074 -26487 -21615 -17806 -10664 -17017 -19413 2567 2054 -1490
13510 -1490 -1201 1558 3892 8840 -13105 -20972 -6834 10689 9445 3261 832 -174 -11877 -21427
13496b1427o126o911j896l490K349J7325R100r154O512J5630j1854M275J4341
13483H674o878o464K6409k655R456p138l242j3926J0034M800M689m015j0025o401
13469C318M02L122O820J1311R16p510j7253j531J4188J98l079J336m757L121l569
13454G033m572Q73j9215o596K044J0646n330q572P471j012m430Q940K0139L435
13440A0854l351L422k0371p360J7305J2024p142L456p269j058Q534K0010J2187
13427D1241k1027k2010L702N203J292J4725j040k2045j1728j3806m942J2808K1090
13414C463j850j5102N865P241J467j9251j3225R357Q771Q846n990N433j9157n027
13400b9159K1338P471q022J805P685q838j1863J1177K1167J1940N897j559l933
$$ plain form
13496 -21427 -27553 -34464 -36360 -39850 -37501 -20176 -11076 -20230 -13718 1912 -9942 -5667 8674
13483 8674 1796 -4668 21741 19086 28542 21404 18162 4236 14270 19070 23759 19744 9719 3318
13469 3318 3720 6842 13662 24973 25889 18379 1126 -405 13783 13981 10902 12238 7481 10602 7033
13454 7033 2461 3334 -15881 -22477 -20433 -9787 -15117 -23689 -16218 -17230 -21660 -12720 7419 10854
13440 10854 7503 10925 -9446 -16806 499 12523 5381 8837 1568 510 9044 29054 41241
13427 41241 20214 -1796 1906 7109 8401 23126 22086 41 -11687 -25493 -30435 -17627 3463
13414 3463 1613 -13489 -7624 -383 1084 -18167 -31392 -22035 -13264 -4418 -10408 -4975 -24132 -29159
13400 -29159 -7821 -350 -8372 -6567 1118 -7720 -19583 -8406 12761 24701 30598 29039 25106
13387B5106k3213n250L524k745k805K598N197l579Q780J6895J5523m179R046M86
13373D5384m980p774j7250j4920j1321J3320l13k38Q012l644r782R700P582L779
13359A7555K0404K1455r945j5305L838M970j8359q947k338o283R207K2745k45
13346C8752j1117M378o744J521K005j653o945J215j944J4519n669j3944N603j7456
13332B521J3330m122k6064p215p649r425K4581R408q428j772K251K7702J9053
13319C4171O475r924j0098r558N096J1013m236M886J332l607j5079k5184n638
13306b0351q334Q617J2368K0454J0798O828M085k7365k2572R974Q586J4813Q963
13293B6864J8889n462k712n224j2452j5646r14O303N393J9319n830n904O810j0901
$$ plain form
13387 25106 1893 -3357 167 -2578 -5383 -2785 2412 -1167 7613 24508 40031 35852 44898 45384
13373 45384 40404 32630 15380 460 -10861 2459 2146 1908 9920 6276 -3506 6194 13776 17555
13359 17555 37959 59414 49469 34164 38002 42972 24613 15666 13328 7045 16252 38997 38752
13346 38752 27635 32013 25269 26790 28795 27142 20197 21412 19468 33987 28318 14374 19977 2521
13332 2521 15851 11729 -14335 -21550 -29199 -38624 -14043 -4635 -13063 -14835 -12584 15118 34171
13319 34171 40646 30722 20624 11066 16162 27175 22939 27825 29157 25550 10471 -14713 -20351
13306 -20351 -28685 -20068 -7700 12754 23552 30380 34465 7100 -15472 -5498 3088 17901 26864
13293 26864 45753 40291 37579 32355 19903 4257 3343 9646 15039 34358 28528 22624 29434 18533
13279A8533J1368P981r099j3189O797R501k719N989M129o773N07j8933Q060J7075
13265C9227n754O373R988m177J404L807j2362j9274n636o650K1561L4534J0182
13252G3223r239j5459n135m537P151J332m760j7548j295n263j6948j1812L193
13239g097K8129N991l983r909J427j6898P575P777N396J9715J0039O230J1474
13226F5866J6405J2371l691k6649n285k5526k448K3148q82m716J7967K2275j5701
13213G3134k8999m0165J3362N229p823m954K244L650q748R253N266M241J3733
13200C9423n244q513k903N062J1908j4256n080j019O128o7J358j1585J316J7275
13186C3803M618j8614j0651M570J3935P056p591j5934Q961O016J6269q901j4340
$$ plain form
13279 18533 29901 37882 28783 15594 22391 31892 29173 35162 39291 32518 33025 14092 22152 39227
13265 39227 33473 39846 49834 45657 47061 50868 38506 19232 13596 6946 28507 63041 73223
13252 73223 63984 48525 43390 38853 46004 47336 42576 25028 23733 18470 1522 -10290 -7097
13239 -7097 21032 27023 23040 13131 14558 -2340 5235 13012 18408 38123 48162 54392 65866
13226 65866 82271 94642 90951 64302 59017 33491 31043 54191 53309 48593 66560 88835 73134
13213 73134 44135 3970 17332 22561 14738 9784 12028 15678 6930 16183 21449 25690 39423
13200 39423 34179 25666 22763 27825 39733 25477 20397 19378 25506 25439 26797 15212 16528 33803
13186 33803 38421 19807 9156 13726 27661 34717 27126 11192 20153 26169 42438 33537 19197
13173A9197j5086q174m29P120R069J6326J6160J1238j4289k1360j99Q772Q843
13160C7188j408Q90J0957l39j8300L68j2561L982J990J8502N51k532l20n00n954
13145C2514p400K515J8572L420J020M695j012J3051n046k1055l243k853q461j2615
13131A4102p681J2417K0242o234n770R856J0295K06k7751o610P290J0761K206
13118C3329J167L778q82m414N240N044j2079j6988j2692j9966O244J0228K0066
13105A8075K688o838J4993J552r080L174j262m767o608l386O799j92j1880m170
13091i02R490O638m816j6272K3477K2113J1152r793J2085j1359q483L817J7593
13078E4740j1239P169j4868k773m682q248N19P575Q807r99q688r679l666r421
$$ plain form
13173 19197 4111 -4063 -4492 2628 11697 28023 44183 55421 41132 19772 19573 28345 37188
13160 37188 35780 36670 47627 47288 28988 29356 16795 20777 22767 41269 41820 39288 38968 38468 32514
13145 32514 25114 27629 46201 49621 50641 55336 54324 67375 62329 41274 38031 35178 26717 14102
13131 14102 6421 18838 39080 32846 27076 36932 47227 47433 19682 13072 20362 31123 33329
13118 33329 34496 38274 37392 32978 38218 43262 31183 14195 1503 -18463 -12219 -1991 18075
13105 18075 20763 13925 28918 30470 21390 24564 23302 18535 11927 8541 15340 15148 3268 -902
13091 -902 8588 15226 10410 -5862 17615 39728 50880 41087 53172 41813 33330 37147 54740
13078 54740 43501 50670 35802 33029 28347 20099 20618 28193 37000 36001 27313 17634 13968 4547
13064D547Q091R17j6532o427Q903Q321n462O385J1572O275N618M843q975R18J2608
13049D1602q052k0473Q163R223L206q251R980N743L868J37J2069l1922o267K823
13035B1849J9439r930j7018J0058P75j562O014J3466j3346k1163J558K471J623
13022A4234P395J2664k17m008k6784j2288K4130J7039N997k595j474k884R358
13009D0567M650q902l880j1371J4570J1278j1763m765R992P434L743J5788p27
12996F6614k1992q917J3967R864l748r544k5813p627n720P994P093k892L965J23
12982B3367J0531j680q256j336J1959J919J1305k630n736M401m660j9262P833
12969B7755K4010l415p095m418j812q440j1462K106K2140j7767k7311o392j006
$$ plain form
13064 4547 12638 13555 -2977 -9404 -501 7820 2358 8743 20315 26590 32208 37051 28076 28994 41602
13049 41602 33550 13077 21240 30463 33669 25418 35398 41141 45009 45146 57215 25293 19026 21849
13035 21849 41288 31358 14340 24398 25173 23611 29625 43091 29745 8582 10140 12611 14234
13022 14234 21629 34293 34076 30068 3284 -9004 15126 32165 38162 35567 34093 31209 40567
13009 40567 45217 36315 32435 21064 35634 46912 35149 30384 40376 47810 51553 67341 66614
12996 66614 44622 35705 49672 59536 55788 46244 20431 12804 7084 15078 22171 19279 23244 23367
12982 23367 33898 32218 23962 22626 34585 36504 47809 45179 39443 43844 39184 19922 27755
12969 27755 51765 48350 41255 36837 35025 26585 15123 17229 39369 21602 -5709 -12101 -13107
12956a3107N709j060J3517J4028O581j2706j546o417p354m798Q598l228J2649
12943A0866q724L796M019K4771J2427k4252j4454L548Q235P556J2600J4898j6078
12930C9208m932q258M662L060j4717J4157K379o376q993j0220l765L950J1600
12917B1755L619J3914L9181m525r991l920j5163j3307k602J583j878j3258j5783
12904c75j7760K93K737Q640J5476K1843j8674n335R798J0071J4687R973j0210
12891D1164q519n566r404K915J0562Q5J179j5552K096J0808o214J1389n73k005
12877C2365O326J235j316o317O749p063M725N686j3042Q818l360o217Q821N102
12863D2512q253n073N506M99j1620l324J2469q139j5894m55J0127j3301p540m833
$$ plain form
12956 -13107 -7398 -8458 5059 19087 25668 12962 11416 4999 -2355 -7153 1445 -1783 10866
12943 10866 2142 5938 9957 34728 47155 22903 8449 11997 20232 27788 40388 55286 39208
12930 39208 34276 26018 30680 33740 19023 33180 35559 29183 20190 9970 6205 10155 21755
12917 21755 25374 39288 78469 73944 63953 60033 44870 31563 28961 30544 28666 15408 -375
12904 -375 -18135 -17842 -15105 -6465 9011 30854 12180 6845 16643 26714 41401 51374 41164
12891 41164 32645 27079 17675 20590 31152 31237 32416 16864 18960 29768 23554 34943 34370 32365
12877 32365 38691 39926 38610 32293 39042 31979 36704 42390 29348 38166 34806 28589 37410 42512
12863 42512 34259 29186 34692 35191 23571 20247 32716 24577 8683 8228 18355 5054 -2486 -7319
12849g319J987J9176N738J531J1796J152o877n865J0280O306n822o592j4318n091
12835F082J6209K63n165R224R671O006m37j3940L301O867L310N980O617j6950
12821C7038M395J0131j4489K72Q979M657J8940n015j3548K185M306n172J2201
12808F4880n742o818r13r76R755M938m39q797K487N335N725j0991j0761N944j0133
12793D3494p144m490J7572R249k312N913j270j3902n937Q15M286Q76j0592Q468
12779D5026o463M117K931o822J9508J2456k16r117J6903K711j0020J229j2683
12766E9560k7728R307r063K236k173J697M528o2O946j1227J174J5161R602j3565
12752D6393j3694J0980O42m904J6422N504p872O118j6807j574L307P119P340Q307
$$ plain form
12849 -7319 -5332 13844 19582 21113 32909 34061 27184 21319 31599 37905 32083 25491 11173 6082
12835 6082 22291 22554 17389 26613 36284 42290 41853 27913 31214 38081 41391 47371 53988 37038
12821 37038 41433 51564 37075 37347 46326 50983 69923 64908 51360 53545 57851 52679 64880
12808 64880 59138 52320 51407 50431 60186 65124 64685 55888 58375 63710 69435 58444 47683 53627 43494
12793 43494 36350 31860 49432 58681 56369 62282 61012 47110 41173 41988 46274 47150 36558 45026
12779 45026 38563 42680 45611 38789 58297 70753 70537 61420 78323 81034 71014 72243 59560
12766 59560 31832 41139 32076 34312 32139 33836 38364 38302 45248 34021 35195 50356 59958 46393
12752 46393 32699 43679 44321 39417 55839 61343 53471 59589 42782 41208 44515 51634 58974 67281
12738F7281P094K311m954J7498J0033L664M036L437r634j631j2945m248p82k333
12724G8827j591k240k680J1681J6293j3977n370n916N099Q609R191j8026k8904
12711E0996o9K3567l349R844J370K320M334N166J3731L769J11o685j1914j4727
12697G8464l617J4253R827K307Q28P660k877j9518K74L198K2739q614j0201l62
12683I4361J795N889J643J2859J1084l248j853o491j0224P281k714j1111N738
12670A05009R147M585K721J0628M532J0460J2122R189J5312K122L102K201J4068
12657B05198J1158M528J4773r240q21Q48n085p740O804O318k560o993n481L135
12643B14842O269J897L655L979Q205o943K1604K7799J739m67J8118J6953J929
$$ plain form
12738 67281 74375 76686 71732 89230 99263 102927 106963 110400 100766 99135 86190 81942 81160 78827
12724 78827 77236 74996 72316 83997 100290 86313 80943 75027 80126 88735 97926 79900 50996
12711 50996 50927 74494 71145 80989 82359 84679 89013 94179 107910 111679 111790 105105 93191 78464
12697 78464 74847 89100 98927 101234 102062 109722 106845 87327 87601 90799 113538 104924 94723 94361
12683 94361 96156 102045 103688 116547 127631 124383 122530 116039 105815 113096 110382 99271 105009
12670 105009 114156 118741 121462 132090 136622 147082 159204 168393 183705 185827 188929 191130 205198
12657 205198 216356 220884 235657 226417 225596 226444 221359 213619 220423 226741 224181 217188 211707 214842
12643 214842 221111 223008 226663 230642 238847 231904 253508 281307 283046 282579 300697 317650 319579
12630C19579O383L0413R428j1476l486J8746o538r750q544O344J8833M110M6P810
12616C81898O499L542L423R343L2035L8015J223n455N575j7576j2242p04j9850
12603D25726j6857k5921r445q446p394Q85n244R056J7989L488K2394K3604M905
12590D34740K1103L3274J3809J3123n200P35J0167K332k0930k2126r145P288P501
12577D86671j7840n132j0923k8766k1800k0396k0716q133n364P02l991P410K246
12564C53968J2611K1872K0098k1719l8132j2525k9828k7728r908J0582N363m764
12552B79890K365q028J1843J7578O355K6210J7380L9155L892r931L197J8133J1122
12539D19161k4758j4294k1273l3486k9392j0143k6203k1840j8053j4398N393j5592
$$ plain form
12630 319579 325962 356375 365803 354327 350841 369587 363049 353299 344755 351099 369932 374042 374088 381898
12616 381898 388397 391939 395362 404705 436740 474755 475978 470523 476098 458522 446280 445576 425726
12603 425726 408869 382948 373503 365057 357663 358548 353304 362360 380349 383837 406231 429835 434740
12590 434740 455843 489117 502926 516049 510849 511584 521751 524083 503153 481027 471882 479170 486671
12577 486671 468831 463699 452776 424010 402210 381814 361098 352965 347601 348303 344312 351722 353968
12564 353968 366579 388451 408549 386830 348698 336173 306345 278617 268709 279291 284654 279890
12552 279890 282255 274227 286070 303648 310003 336213 353593 392748 396640 386709 389906 408039 419161
12539 419161 394403 380109 358836 325350 295958 285815 259612 237772 219719 205321 210714 195122
12527A95122r780M334k478n661m486Q982M179j619j1370P302k0345j4140j4742
12514A35298j0785R350P306n90m716j266J336K692Q99K818m799r277j0592J0816
12500A28490L2658K4448J875k0824j2082J852k172j8523J7721R145o528l102J2312
12487A65270J0296r112j3423n881J2268O320q655J7266J390R295J1338j3851q254
12474A74267m173K2654K2099k8504j0366J0663K8077J3498n50J155L762l765j5029
12461B13788P241O271J7966P419m632m124j894r089K0117Q503j6749P890K4977
12448B77684J3280m887j0925P511J6872R013r972k1029m965K4338O874L963J2364
12435C20121J3714R735K540o188J5067J9118K0937L994L39J0660K0101O081K86
$$ plain form
12527 195122 185342 189676 187198 181537 177051 186033 190212 188593 177223 184525 164180 150040 135298
12514 135298 124513 133863 141169 140579 135863 134597 135933 138625 139524 142342 137543 128266 117674 128490
12500 128490 161148 185596 187471 166647 154565 156417 154245 135722 153443 162588 156060 152958 165270
12487 165270 175566 166454 153031 147150 159418 165738 157083 174349 175739 185034 196372 182521 174267
12474 174267 170094 192748 214847 186343 175977 186640 214717 228215 227665 228820 232582 228817 213788
12461 213788 221029 227300 245266 252685 248053 243929 242035 232946 253063 261566 244817 252707 277684
12448 277684 290964 286077 275152 282663 299535 308548 298576 277547 272582 296920 303794 307757 320121
12435 320121 333835 343570 346110 339922 354989 374107 395044 399038 399377 410037 430138 436219 436505
12422D36505n503J652M870J5686J1063N137J6402m341Q262O677J3963o777M715
12409E08311J0595l470n75o072M358M0116J4868p827j4068j2539O495K024l16
12396E41900j1405j042J3118R834N840n20K1403J429J884J6649O111J6804J2290
12383F34295K1929j1243j0712l563J3572L8608K7646J3516R502l513j8950j1871
12371F99216o547q555Q41p155M066J7154K5196L3152L6838J6021J0316N111k662
12358H22992Q740J3073L1577K0298J567P37J4520K9935J8705K9071J3978J2215
12346A017408K2946J1179O761J4529L4413J2064J6868K5909J6363J3859J0383
12335A202682n638O270K6294J7828K5948L1008J9387J4436J8513K4882M5373M1153
$$ plain form
12422 436505 431002 432654 437524 453210 464273 469410 485812 481471 489733 496410 510373 503596 508311
12409 508311 518906 515436 514861 508789 513147 553263 568131 560304 546236 533697 540192 542216 541900
12396 541900 530495 529453 542571 552405 558245 557725 579128 580557 582441 599090 605201 622005 634295
12383 634295 656224 644981 634269 630706 644278 682886 710532 724048 733550 730037 711087 699216
12371 699216 692669 684114 684955 677800 681866 699020 724216 757368 794206 810227 820543 825654 822992
12358 822992 831732 844805 876382 896680 898247 898984 913504 943439 962144 991215 1005193 1017408
12346 1017408 1040354 1051533 1058294 1072823 1107236 1119300 1136168 1162077 1178440 1192299 1202682
12335 1202682 1197044 1203314 1229608 1247436 1273384 1304392 1323779 1338215 1356728 1381610 1426983 1468136
12323A468136L0054K3943M2903Q0351N1973N6571N7510N4704P1847R2218O9837
12312B100047M2659L6381K8284M5281J2377O7m030K1781J8356K1270l184j3548
12300B305741l2595m1957m1720n6402o3378o1571o4688l4154j2015j7469j3618
12289A866174k2272k8066k8771j6937m380O754K2725K3087k479j368P735j6617
12277A805585j7956j5513j9736l4261j5362r420P258J558j387Q567O970L1175
12265A747478K9858L1361K4212K5793N4117L8570J9284L4689K6169K7452N0723
12254B109706P1225R1237J03424Q0566P4607Q6455J15503J20050J38415J52448
12244C143636J77206K08148K42476K64577K79447L27912L37586L48083L56288
$$ plain form
12323 1468136 1498190 1522133 1565036 1645387 1697360 1753931 1811441 1866145 1937992 2030210 2100047
12312 2100047 2142706 2179087 2207371 2252652 2265029 2265096 2261066 2282847 2301203 2322473 2319289 2305741
12300 2305741 2273146 2231189 2189469 2133067 2069689 2008118 1943430 1909276 1897261 1879792 1866174
12289 1866174 1843902 1815836 1787065 1770128 1765748 1772502 1795227 1818314 1815835 1814467 1822202 1805585
12277 1805585 1787629 1772116 1752380 1718119 1702757 1693337 1700595 1702153 1700766 1709333 1716303 1747478
12265 1747478 1777336 1808697 1832909 1858702 1912819 1951389 1970673 2005362 2031531 2058983 2109706
12254 2109706 2180931 2272168 2375592 2456158 2530765 2617220 2732723 2852773 2991188 3143636
12244 3143636 3320842 3528990 3771466 4036043 4315490 4643402 4980988 5329071 5685359
12235E685359L41175K90828J93643R7669N6478K5180L7285R7918J52823K12364
12225G190722K89450L35845L79762M01317M03876M23536M10591L87537L78246
12216A0600882L52882L07162K90542K54813J67624J14787R6170O2423R3567J56818
12206A2497670K39212L42245M86830O39869P88795R32765J044160J127730J135247
12197A9234523J054346Q84970O56797M45165K48649J94231K38318M04097O75792
12188B4036888R91687J348159J714947K079210K468798K845685L257409L699993
12180D2442776M170942M660805N162373N680753O142184O559566O832134O966287
12172H8617820P052409P137232P236393P301149P266718O954047O257673N155710
$$ plain form
12235 5685359 6026534 6317362 6511005 6608674 6665152 6690332 6727617 6825535 6978358 7190722
12225 7190722 7480172 7816017 8195779 8597096 9000972 9424508 9835099 10222636 10600882
12216 10600882 10953764 11260926 11551468 11806281 11973905 12088692 12184862 12247285 12340852 12497670
12206 12497670 12736882 13079127 13565957 14205826 14994621 15927386 16971546 18099276 19234523
12197 19234523 20288869 21173839 21830636 22275801 22524450 22718681 22956999 23361096 24036888
12188 24036888 25028575 26376734 28091681 30170891 32639689 35485374 38742783 42442776
12180 42442776 46613718 51274523 56436896 62117649 68259833 74819399 81651533 88617820
12172 88617820 95670229 102807461 110043854 117345003 124611721 131565768 137823441 142979151
12164A42979151L783215K426586J393144Q48459Q04802R15544R26273M61059o28367
12155A53909866k303842m285700o060187p227696p521545p130630o576316o347563
12147A06456387o569956p058561p425301p315430o727463n883843n058951m375563
12139E6041319l833434l383344k959232k538758k152027j756892j410837j044324
12131C6962471o88495l90528j34234J1680J649j77719n73245j084467j576754
12122C2350358j927909k051745j986881j742906j451049j138799r00391o77282
12114B0473396m93712l60058k43123j91883j73252k52411l34061m85542o30429
12105A7308925p49400p81379p83561p53763p12829o71053o14236n73451n37569
$$ plain form
12164 142979151 146762366 149188952 150582096 151430555 152235357 153150901 154077174 154538233 153909866
12155 153909866 151606024 147320324 141260137 134032441 126510896 119380266 112803950 106456387
12147 106456387 99886431 92827870 85402569 78087139 71359676 65475833 60416882 56041319
12139 56041319 52207885 48824541 45865309 43326551 41174524 39417632 38006795 36962471
12131 36962471 36273976 35883448 35749214 35760894 35762543 35584824 35011579 33927112 32350358
12122 32350358 30422449 28370704 26383823 24640917 23189868 22051069 21150678 20473396
12114 20473396 19979684 19619626 19376503 19184620 19011368 18758957 18424896 17939354 17308925
12105 17308925 16559525 15778146 14994585 14240822 13527993 12856940 12242704 11669253 11131684
12096A1131684m63946m03458l62614k82864k09503j39020j15821j14344j37533
12087H902581k12901k96634m04773n12736n50143n43268m96784m38742l74358
12078E072242l26731k83660k44951k31504k10051j80807j83163j71077j41250
12069C099048j13887j20956j31570j29641j00365q8974o8467o5924q5641p6540
12059B117083p7080q2863o5266n5407n3473p3085n3943l7390l3781n5413m4000
12048A485382k9715l4571m5682l8970l0656k8236m0854j6699k6999l5840l4763
12037A122397k1477l6105k0681m746j7250j9524l2723j7577j5949k8553k5699
12026H82113j5681l1908q456l0980k4218r440j6392k121q634l140j5487o251o061
$$ plain form
12096 11131684 10667738 10264280 9901666 9618802 9409299 9270279 9154458 9040114 8902581
12087 8902581 8689680 8393046 7988273 7475537 6925394 6382126 5885342 5446600 5072242
12078 5072242 4745511 4461851 4216900 3985396 3775345 3594538 3411375 3240298 3099048
12069 3099048 2985161 2864205 2732635 2602994 2502629 2413655 2345188 2279264 2193623 2117083
12059 2117083 2040003 1957140 1891874 1836467 1782994 1709909 1655966 1618576 1584795 1529382 1485382
12048 1485382 1455667 1421096 1375414 1336444 1305788 1277552 1236698 1219999 1193000 1157160 1122397
12037 1122397 1100920 1064815 1044134 1039388 1022138 1002614 969891 952314 936365 907812 882113
12026 882113 866432 834524 826068 795088 770870 761430 745038 742917 734283 731143 715656 709405 703344
12013G03344M348p57l862o731p630r81j559L199J3143j694q914q168L204O621
11999F93563q105r058m520J5826l63k5792j364p820R661o840M836p449j2906q21
11985F38848J0k853j1610N855J596r850k2309n390J4015l287J286n291K505l060
11971F00465r335O186j0454M996J601J803M685n426m177q903j7719L636k834k8315
11957E36209j0354j1909j0081j1514q587k1879j7574j5530J0874l022j2981J1561
11945D35213J3602k4875m1121r641K650o29R7j6345J1742j2956j9165j392Q105
11932C45285o438j6701n329k364k2955j464J232j1585j0554n044Q078K0972j4651
11919B78482j9084j6048Q028R733p000L509j341l362n509p090K745n197k3324
$$ plain form
12013 703344 707692 706935 703073 696342 688712 687731 686172 689371 702514 700820 691906 683738 686942 693563
11999 693563 685458 676400 671880 687706 687343 661551 660187 652367 662028 655188 660024 652575 639669 638848
11985 638848 638858 636005 624395 630250 631846 621996 599687 594297 608312 605025 606311 601020 603525 600465
11971 600465 591130 597316 586862 591858 593459 595262 599947 594521 590344 581441 563722 567358 564524 536209
11957 536209 525855 513946 503865 492351 483764 461885 444311 428781 439655 436633 423652 435213
11945 435213 448815 423940 382819 373178 375828 375199 375296 358951 370693 357737 338572 337180 345285
11932 345285 338847 322146 316817 314453 291498 290034 291266 279681 269127 264083 272161 293133 278482
11919 278482 259398 243350 251378 261111 254111 257620 256279 252917 247408 240318 243063 237866 214542
11906B14542j1159O499M570O175j109J5124J660r313l796j2567l771m956K259
11893B04158l97l55J699j845l50k988j6234j2184J0548N39o592J0839j4911R92
11879A72919k598k820o439j2855J327J1502J5049n15j5490L231J71k3731j6692
11866A23059N098P537J4942J2312j461q652r512K750q521k701J0623L983N313
11853A54770k996n652K860N89J8021n721k4597j1087K3834M071N197j541J777
11840A59525K6367J8175K427j6011j6518R500J3521R245L991m994k3200k0911
11828A61117j915k071k4550p157P934J0770j0123J275l180J978m419j6085j1434
11815A02140J1533J966j1360J789J49n094K945K537N318j1082n97j964J4244K0697
$$ plain form
11906 214542 203383 209882 214452 220627 219518 234642 236302 226989 223193 210626 206855 201899 204158
11893 204158 203761 203406 205105 203260 202910 199922 183688 171504 182052 182591 175999 186838 171927 172919
11879 172919 170321 167501 161062 148207 149534 161036 176085 175570 160080 163311 163482 139751 123059
11866 123059 128157 135694 150636 162948 161487 152835 143323 146073 137552 134851 145474 149457 154770
11853 154770 151774 146122 148982 149571 167592 161871 137274 126187 150021 154092 159289 157748 159525
11840 159525 185892 204067 206494 190483 173965 183465 196986 206231 210222 205228 182028 161117
11828 161117 159202 157131 132581 125424 133358 144128 134005 135280 132100 134078 129659 113574 102140
11815 102140 113673 115639 104279 106068 106217 101123 104068 106605 111923 100841 100244 98280 112524 133221
11801A33221P99R59j6148j9513l236K1726L219r206L397q88J1683R982P727k649
11787A41073o16p193P412j319Q149o098k700J8211J1423q611q176Q048R564L0920
11773B00087L4607J8549J7223J1239P055M983l216l105o199m178j5334n136k1768
11760B34807j6534r116j3635O005K2686N083L96K682K3688O100L947J4936K3494
11747C04539M583m649J4662p854O310K1440N246J1433K109K3213M8027L7070M0436
11734E06565L3026K3392K3726K2948M555j0086k7794k9564j6898m0118n3414l1932
11722D04406l964j3014j4606j3153K662n185J4615R587J0110J0839k578k540J3
11709C97192J6736J9415J0227o213j155q195P060P579K1550P234J1127J1422j1499
$$ plain form
11801 133221 134020 134979 118831 99318 96082 117808 121027 111821 115218 114330 126013 135995 143722 141073
11787 141073 140457 133264 140676 139357 147506 141408 138708 156919 168342 159731 151555 159603 169167 200087
11773 200087 234694 253243 270466 281705 288760 293743 290527 287422 281223 277045 261711 256575 234807
11760 234807 218273 209157 195522 201527 224213 229296 229692 232374 256062 262162 266109 281045 304539
11747 304539 309122 304473 319135 311281 317591 339031 344277 355710 357819 381032 429059 466129 506565
11734 506565 539591 562983 586709 609657 614212 604126 576332 546768 529870 489752 436338 404406
11722 404406 400442 387428 372822 359669 362331 357146 371761 381348 391458 402297 399719 397179 397192
11709 397192 413928 433343 443570 437357 436202 428007 435067 442646 464196 471430 482557 493979 482480
11696D82480k1135m841q349k8146k7322k0149k4764j4386J8414j839j5320m381
11684C30262j4251l1441k2280j6300j6999j9823K745j196m602k2812q617J2106
11672A86792K5570J5691J5689K8143J0140k449j113J5792R967k3299k4974r730
11660B46219N555k4360k8502k0805j1544J767j3687j4893p787j2066j5891j565
11648A02441Q466m399m226r032K0716m444j9716j843j3230k0281N781Q866j0066
11635E9033Q663M9j005J0109k3635j0174K703r230M998L2790J6728k0954j3550
11622E6525l991J5678n814o015j2287M299N171m573j1168o635P701l389J1864
11609D7366R160N089j028R235j6153k6834j5811K2799j473j3027J845k144L072
$$ plain form
11696 482480 461345 456504 448155 420009 392687 372538 347774 333388 351802 349963 334643 330262
11684 330262 316011 284570 262290 245990 228991 209168 211913 210717 206115 183303 174686 186792
11672 186792 212362 228053 243742 271885 282025 279576 278463 294255 304222 280923 255949 246219
11660 246219 251774 227414 198912 178107 166563 168330 154643 139750 131963 119897 104006 102441
11648 102441 110907 106508 102282 93250 113966 109522 89806 87963 74733 54452 60233 69099 59033
11635 59033 67696 67745 66740 76849 53214 43040 45743 36513 41511 74301 91029 70075 56525
11622 56525 52534 68212 62398 56383 44096 48395 53566 48993 37825 31190 38891 35502 47366
11609 47366 56526 61615 60587 69822 53669 26835 11024 33823 32350 19323 21168 19024 22096
11596B2096L0917K1811m718p433l435l462k406j4663j9900m155J5724P487Q593
11583D6456q150Q778K2328j4206m3073q772J3800N101o037j2850J0818L6823r47
11570E0069j7733n592q834j638J2095j4428l045J680R053k395j910j2735j019
11557C568Q663M046j0106M513R721l801k0322n907M294j034J8321K4118M781j7859
11543B2996j3899j312R104R934J6896R471j2133j8958K757l786m529L138m077
11530A5602p830L143p925r983k474j154r341m231k73L8266K3672L82j5934p940
11516A3980J1095J6829J4655q022m279m758j1761j1523M235l686j0828k145K3565
11503B7357L319j0554j3326J3352K8690j191j2937o545n047J7766j98k544k6563
$$ plain form
11596 22096 53013 74824 70106 62673 59238 55776 53370 38707 18807 14652 30376 37863 46456
11583 46456 38306 47084 69412 55206 12133 3361 17161 22262 16225 3375 14193 51016 50069
11570 50069 32336 26744 17910 16272 28367 13939 10894 12574 21627 19232 17322 4587 3568
11557 3568 12231 16277 6171 10684 20405 16604 -3718 -9625 -5331 -6365 11956 36074 40855 22996
11543 22996 9097 7785 16889 26823 43719 53190 41057 22099 24856 21070 16541 19679 15602
11530 15602 7772 10915 2990 -6993 -9467 -10621 -19962 -24193 -24466 13800 37472 37854 21920 13980
11516 13980 25075 41904 56559 48537 44258 39500 27739 16216 20451 16765 5937 3792 27357
11503 27357 30676 20122 6796 20148 48838 47647 34710 28165 23118 40884 40686 38142 11579
11490A1579k764R539J2475k260j1623K81j18o100K294K0859j166r215N388m43
11476B8726l865j1830j999J1109j218q955n424O958k0543n267K906O932R167J1840
11462A8537j1382r873J6398O798k67J7366j3570j4201R87J399J060K671J4294
11449C0217N13q271J139j538K4174O575J1865j0683k4813j7263N160k016j0029
11436E030j1700J2062J2552J585N586J5505j88j5139j2496n756Q42o430K9116
11423C0569j124m759j4686k782j1094J885J774M849J5889K3230j0275k3944j6231
11410f699Q59j0348K917K549J5960j0909K074j58P243N794L65k978j0974Q992
11396D687Q918j363Q364N824k56m045j3346o523o067O188K7454J3530q718K101
$$ plain form
11490 11579 8815 18354 30829 28569 16946 17227 17109 11009 13303 34162 32996 23781 29169 28726
11476 28726 24861 13031 11032 22141 20923 11968 6544 13502 -7041 -12308 -9402 -2470 6697 18537
11462 18537 7155 -2718 13680 20478 20211 37577 24007 9806 10793 12192 13252 15923 30217
11449 30217 30730 22459 23598 22060 46234 52809 64674 53991 29178 11915 17075 15059 5030
11436 5030 -6670 5392 17944 19529 25115 40620 40432 25293 12797 7041 7883 1453 30569
11423 30569 29445 24686 10000 7218 -3876 -1991 -217 4632 20521 43751 33476 9532 -6699
11410 -6699 -5840 -16188 -13271 -10722 5238 -5671 -3597 -3755 3488 9282 9647 6669 -4305 4687
11396 4687 13605 12242 20606 26430 26174 22129 8783 2260 -3807 2381 29835 43365 34647 36748
11382C6748j5018l2145k913R655J4380n320j3367Q882P395r758j0043J90j0620
11369b1934m245M107K2137J8965J074l082k7828q60k786Q419J721j5368R334Q856
11355a490N554J4644p672p28J5320N290k7307j4547R398O260p26J7203Q833j2959
11341A7073o752l83k082R399J3157n739J9021q790p239n939q69l403P350m790
11327B0014k3223J0846M55M206q388j345q756j6297O498J8198j381q104J1504
11314D227O061J9062L73j0135k97q685j0053M351J0000n766j1249J3512J3550
11301B4951j1862R624p511j2437j0321L828p608l242K885Q857p137j966J0398
11288a541N460p862r779J1574j4112j1431P990J2507K253J7924N744j9682r01
$$ plain form
11382 36748 21730 -10415 -13328 -3673 10707 5387 -7980 902 8297 -1461 -11504 -11314 -21934
11369 -21934 -26179 -22072 65 19030 20104 17022 -10806 -11666 -14452 -6033 -4312 -19680 -10346 -1490
11355 -1490 4064 18708 11036 10308 25628 30918 3611 -10936 -1538 4722 3996 21199 30032 17073
11341 17073 10321 9938 7856 17255 30412 24673 43694 34904 27665 21726 20857 17454 24804 20014
11327 20014 -3209 7637 8092 12298 3910 2565 -6191 -22488 -15990 2208 827 -7277 4227
11314 4227 10288 29350 29723 19588 19291 10606 553 4904 14904 9138 -2111 11401 24951
11301 24951 13089 22713 15202 2765 -7556 -3728 -11336 -14578 -11693 -2836 -9973 -11939 -1541
11288 -1541 3919 -3943 -13722 -2148 -16260 -27691 -19701 -7194 -4941 12983 18727 -955 -1856
11275a856J6176J2628P274j8595R915n60J1428R175L74j5310k337k760k284m304
11261A8964j4927j4128K14J6230O706M810j4270R394P186K3811P336l576j7599
11248C0151j1036n454m054J0643j0467m98K271p020j9140O271n070j4611J2754
11235a5260J0366j4559J2265N758O215j9305k710J1252J6480j1925p155N846N258
11222B526j735J3137j3739j5263r350N906J8241J6601j3q1L758j7946j8433M034
11208a2357J0185L1704N560j048o682q489m884K298j2514l33o024j6445R004Q296
11194a729j3363j690n762J0818K1468r955j365L097R250m112N445J4867j4551
11181A2418o527J0329j9554o21O355l075J794J393R943J5696o677k4671n802Q192
$$ plain form
11275 -1856 14320 26948 34222 15627 25542 24982 36410 45585 45959 30649 28312 25552 23268 18964
11261 18964 4037 -10091 -9877 6353 13059 17869 3599 12993 20179 43990 51326 47750 30151
11248 30151 19115 13661 9607 20250 9783 9285 11556 4536 -14604 -8333 -13403 -28014 -15260
11235 -15260 -4894 -19453 -7188 -1430 4785 -14520 -17230 -5978 10502 -1423 -8578 -2732 2526
11222 2526 791 13928 189 -15074 -24424 -18518 -277 16324 16311 16230 19988 2042 -16391 -12357
11208 -12357 -2172 29532 35092 34044 27362 18873 13989 16287 3773 3440 -2584 -19029 -10025 -1729
11194 -1729 -15092 -16782 -22544 -11726 9742 -213 -1578 1519 10769 6657 12102 26969 12418
11181 12418 5891 16220 -3334 -3955 2400 -675 1119 2512 12455 28151 21474 -3197 -8999 -807
11167h07M339K69k2125j320J0868r900r098J4675J6996J6878J954j2300n718M481
11153I192k0021P208O999p944o517l874k67n275J2368j0191O338M038Q831J0680
11139A1565J9679j0830j6561N139J8998j3365j8871m969R22m98J6494J27j2791
11126d961n72K624p11n620n532L288n797N172l052m834J2074M292R552O771q137
11111D557r078o189J2921P487M653P123q906p236L495J0592J4332j1997o729j5210
11097a85j3524k630J6511J094j6488J3612j4947j1685J081P062J1034J3648J3422
11084A8005R66l059J5514q068r501l124k305M631O667O772j0446J7130O301J3468
11070E2951j2772j7592k7504j2177m940l079M99N016R405j7784O358p060J1012
$$ plain form
11167 -807 3532 3801 -18324 -19644 -8776 -18676 -27774 -13099 3897 20775 22729 10429 4711 9192
11153 9192 -10829 -3621 3378 -4566 -11083 -14957 -15224 -20499 -8131 -18322 -11984 -7946 885 11565
11139 11565 31244 20414 3853 8992 27990 14625 -4246 -9215 -8293 -8791 7703 7830 -4961
11126 -4961 -5533 -2909 -3620 -9240 -14772 -11484 -17281 -12109 -15161 -19995 -7921 -3629 5923 12694 4557
11111 4557 -4521 -10710 2211 9698 14351 21474 12568 5332 8827 19419 33751 21754 15025 -185
11097 -185 -13709 -16339 172 1266 -15222 -1610 -16557 -28242 -27161 -20099 -9065 4583 18005
11084 18005 18971 15912 31426 23358 13857 10733 8428 13059 19726 26498 16052 33182 39483 52951
11070 52951 40179 22587 -4917 -17094 -22034 -25113 -24614 -19598 -10193 -27977 -21619 -28679 -17667
11057a7667J2928q765P342J1490Q082m563Q165J2388Q952o505p313J1525J7946
11044E4005j4351l2290p284O810P180k074M77j1877j5613p37K269n348j575l764
11030b4172l409J4385K2009K2381M000j8873j7915n247J5520k63M812N428J0727
11017B9383R43j7705p653p979P840k628n339j4151R454N087q242m488J1666m329
11003h141j113l980J1740o955M860M972O857M246N856p263J1257P333J939k520
10989B9088p542j462k0106p177J329O271m227M509j5403M3495Q734k1348L724
10976A9885L359L176L543J617m589k590o065q432L217q567J805n62j4172j7014
10962b5389K994j1575j945J0438J101J0570j048r663K977J0889l429O089K3961
$$ plain form
11057 -17667 -4739 -13504 -6162 5328 13410 8847 17012 29400 38352 31847 24534 36059 54005
11044 54005 39654 7364 80 6890 14070 11996 12473 596 -15017 -15754 -13485 -18833 -20408 -24172
11030 -24172 -27581 -13196 8813 31194 35194 16321 -1594 -6841 8679 8416 13228 18656 29383
11017 29383 30326 12621 4968 -3011 4829 2201 -3138 -17289 -7835 -2748 -10990 -15478 -3812 -8141
11003 -8141 -9254 -13234 -1494 -8449 -3589 1383 8240 12486 18342 11079 22336 29669 31608 29088
10989 29088 21546 20084 -22 -7199 -5870 401 -3826 683 -14720 28775 37509 16161 19885
10976 19885 23244 26420 29963 31580 26991 24401 18336 9904 13121 4554 6359 5797 -8375 -25389
10962 -25389 -22395 -33970 -35915 -25477 -24376 -13806 -14854 -24517 -21540 -10651 -14080 -7991 15970
10949A5970J1837j3677j0705p93J3219Q648k0600n487R531k3179j4854M380L2747
10936G037L182M008l017K0800m932n18j668P53r162j6008j1228r30J8807J3854
10922B0978q768J139K322J1831L076P93l775j6554j3195P879q528j070K2384M987
10908B3499k1123k6845J335L1453K6645j7551k0770L578N097J574N717j0112J5528
10895A8025p97j0747O010K911q127J5981J1313N159k6438l710K660J2638j9687
10882E191q111k366R55j9644J7830R644R982o598m611J63J8706J2673k0278j5482
10868a946m012O736o569n148L324K1604R915K6878j5004j3666j8084j2436j349
10855i757K0189K1946j7489J185Q004o370q924j0964p195m693J0083J2684m25
$$ plain form
10949 15970 27807 14130 3425 2632 15851 24499 3899 -1588 7943 -15236 -30090 -25710 7037
10936 7037 10219 14227 11210 32010 27078 26560 24892 25645 16483 475 -10753 -11683 7124 20978
10922 20978 12210 13349 15671 27502 30578 31371 27596 11042 -2153 5726 -2802 -3872 18512 23499
10908 23499 2376 -24469 -23134 8319 34964 17413 -3357 221 5318 6892 12609 2497 18025
10895 18025 17228 6481 12491 15402 7275 23256 34569 39728 13290 9580 12240 24878 5191
10882 5191 -2920 -5286 -4331 -23975 -6145 3499 13481 6883 2272 2435 21141 33814 13536 -1946
10868 -1946 -5958 778 -5791 -10939 -7615 13989 23904 50782 35778 22112 4028 -8408 -9757
10855 -9757 10432 32378 14889 16074 24078 17708 8784 -2180 -9375 -14068 -3985 8699 8274
10842H274k2989j1938J8702J936R921J460M181j3110j0217j509N09l324K3828
10829E724K387L121K342q829j8328o216J6617N538J5598J0955K833r93K020O521
10815C9290l2726j608M512j9102j6177o50J8482J5199Q671r031j4087j134K940
10802e421j0676N021J4191L772j182j599J6786K2968j4024l2431j2208k049K2398
10789E546k715j178K6472Q52j0633K0046n628j3209P155k684m68j201k1621m191
10775c457J1162K2588P126o948J993L006k3877R30r860r945M431Q458J0585L482
10761A9674O056O377M489l101j1751l881J2901K2256j0077m253J0898N265j8607
10748C6246p149n22l753r666J1703k1240m844J7313K413N263N328J5700p389O160
$$ plain form
10842 8274 -14715 -26653 -7951 -6015 3906 5366 9547 -3563 -13780 -15289 -14780 -18104 5724
10829 5724 8111 11232 13574 4745 -13583 -19799 -3182 2356 17954 28909 31742 30749 32769 39290
10815 39290 6564 4956 9468 -9634 -25811 -26461 -7979 7220 15891 6860 -7227 -8361 -5421
10802 -5421 -16097 -11076 3115 6887 5705 4106 20892 43860 29836 -2595 -14803 -16852 5546
10789 5546 2831 1653 28125 28977 18344 38390 32762 19553 26708 24024 23556 22355 734 -3457
10775 -3457 7705 30293 37419 30471 32464 35470 11593 12523 2663 -7282 -2851 5607 16192 19674
10761 19674 25730 32107 36596 33495 21744 17863 30764 53020 42943 38690 49588 54853 36246
10748 36246 29097 28575 24822 15156 26859 5619 775 18088 20501 25764 31092 46792 39403 45563
10734D5563m973l635j249k2079J0905J2829j6129k2164N291M213J3229m997j2448
10721D356M962o621K047q62j0188R491m519K337j504k060J6771Q313o402q864
10707G257M979J4588j8080n341K516Q331l335M784O092m449P912Q564M156M862
10693D2836m454j0409r157q261J6639r752J815L391j6960K873Q499J2713M770
10680C4543j1446j0606q102J7220l548j5107q997O635L321K4671M619j2811l118
10667A7274R051k005Q574N617J314j4982j2296O478J0428P761j0769N959j0952
10654B1452j4594L1553Q946j3325N880j959j7341j0691J3054N653O372l190r958
10641B1852o362K776J9564J0827o71m140p279j6510j814K355j397N05N422J4100
$$ plain form
10734 45563 40590 36955 35706 13627 24532 37361 21232 -932 4359 8572 21801 16804 4356
10721 4356 9318 2697 4744 3882 -6306 3185 -1334 1003 -501 -2561 14210 22523 16121 7257
10707 7257 12236 26824 8744 3403 5919 14250 10915 15699 21791 17342 25254 33818 37974 42836
10693 42836 38382 27973 18816 10555 27194 17442 19257 22648 5688 8561 17060 29773 34543
10680 34543 23097 12491 4389 21609 18061 2954 -6043 592 3913 28584 33203 20392 17274
10667 17274 26325 24320 32894 38511 39825 24843 12547 19025 29453 37214 26445 32404 21452
10654 21452 6858 38411 47357 34032 39912 37953 20612 9921 22975 28628 35000 31810 21852
10641 21852 15490 18266 37830 48657 47986 43846 36567 20057 18243 20598 19201 19706 25128 39228
10627C9228o544k3611k2279L881J8881J5403J8K379K529l0610J0020M738k7460
10614a3427p148J2310r629M221R543O099l066J8835J4386K646k248L735j4858
10601B1399r808J1959J5932j0579K860l858j9343j2882l293J7446M497j5331m299
10588e300J9335J867n03J854j1662R782P596J0466m05n415J7528m812q197O543
10574C8677p018j3813R164J2078p662j9069l419o192m297n617J1946J695p530
10561a057K6813P104n46K222n667j8207j38K3899K364l46m338k0126k623J544
10547A0898m758j078P80P942P225P699j1123m90p129k560K887l574M310P393k056
10532A6366Q081P550k6797k7655J784K6086P895l282l416J4274K462J3293J2710
$$ plain form
10627 39228 32684 9073 -13206 -9325 9556 24959 24977 27356 29885 -725 9295 14033 -13427
10614 -13427 -20575 -8265 -17894 -13673 -4130 1969 -1097 17738 32124 34770 32522 36257 21399
10601 21399 11591 23550 39482 28903 31763 27905 8562 -4320 -7613 9833 14330 -1001 -5300
10588 -5300 14035 15902 15399 17253 5591 15373 22969 33435 33030 27615 45143 40331 32134 38677
10574 38677 31659 17846 27010 39088 31426 12357 8938 2746 -1551 -7168 4778 6473 -1057
10561 -1057 25756 32860 32314 34536 28869 10662 10524 34423 36787 36441 32103 11977 9354 10898
10547 10898 6140 5062 5842 13784 21009 28708 17585 17095 9966 7406 10293 6719 11029 18422 16366
10532 16366 24447 31997 5200 -22455 -20671 5415 13310 10028 6612 20886 23348 36641 49351
10519D9351j5794n483P720q466j3569k274J054J3151J2216k7439k8247M369K1737
10506H326m446M563M261P824l85N772J3756L882n265j8798o545L922Q259k941
10492B2185k959j034J609l356M812o578q718Q610K4026J1492O869K5m558j2298
10478D0127j0039q205J3006J2793J895j7349o991j4906P305j1018j091J0669L027
10465A9223r86J2196r922j7950J9611J5809o355k9773j0343k3434n613J2595J0188
10452a4754J8697n408j82J7581K347J953J1101r02R32k089L699J1036j3819j5980
10438A4212n695m489M12O072J6752K1365j9j9652p239j5135N531K0687j462O254
10424C7594j0903J040J5128r946j8745o748J4949j6737n16K3323K0580m399j4632
$$ plain form
10519 49351 33557 28074 35794 27328 13759 11485 12539 25690 37906 10467 -17780 -13411 8326
10506 8326 3880 8443 12704 20528 20143 25915 39671 43553 38288 19490 12945 16867 25126 22185
10492 22185 19226 18192 19801 16445 21257 14679 5961 14571 38597 50089 56958 56983 52425 40127
10478 40127 30088 21883 34889 47682 49577 32228 25237 10331 17636 6618 5527 16196 19223
10465 19223 18237 30433 20511 2561 22172 37981 31626 1853 -8490 -31924 -37537 -24942 -14754
10452 -14754 3943 -1465 -1647 15934 18281 20234 31335 30433 31365 29276 32975 44011 30192 14212
10438 14212 8517 4028 4440 10512 27264 48629 48610 28958 21719 6584 12115 32802 31340 37594
10424 37594 26691 27731 42859 32913 14168 7420 22369 5632 5116 28439 49019 44620 29988
10411B9988r076j7972j1541J2919J2728M475J9860m379p554J5651R101L074p393
10398D9881j4926J0837J3087j5420k0970J0233K2509r595j2232q278J903M522
10386C1551J0517o612j0716J6957J0951o251n093j3456K412R697J5285J1390n471
10373F1161j5968j7807m140J3770J6731j1992p870o241L434J307m49O12J1513
10360D4061j5284O476m809j7975r122K3363J1552N25R087P987M779k2421O44k83
10346C8580j8912J172j844o568J0908L956j5293J06K2227q070N549K5775L983
10333F1569k7087R37n990R838J518m046J5970J9781L901m138o079j3511j774M154
10319E5043m803j4305n146K500K355J7555j0258P537J7991j8692j8448m099R631
$$ plain form
10411 29988 20912 2940 -8601 4318 17046 21521 41381 37002 29448 45099 54200 57274 49881
10398 49881 34955 45792 58879 43459 22489 32722 55231 45636 33404 25126 27029 31551
10386 31551 42068 35456 24740 41697 52648 46397 41304 27848 30260 39957 55242 66632 61161
10373 61161 45193 27386 23246 37016 53747 41755 33885 27644 31078 32385 31936 32548 44061
10360 44061 28777 35253 30444 12469 3347 26710 38262 38787 47874 55861 60640 38219 38863 38580
10346 38580 19668 20840 18996 12428 23336 27292 11999 12105 34332 26262 31811 57586 61569
10333 61569 34482 35419 29429 39267 40785 36739 52709 72490 76391 72253 66174 52663 50889 55043
10319 55043 50240 35935 30789 33289 35644 53199 42941 50478 68469 49777 31329 27230 36861
10306C6861J9901l283k860R99Q873J2907J8917q081j6652j5637j7903N636J8572
10293E8250o20l341L520j3645j7248J4560q332P659j0876j0135K8177J7213J744
10280F6926k5514k3334O088j624r235P054K4216J5237r517k7186q103N156J276
10267B1440J4862L186k113q587P01O584Q780K808K700J833Q609j5392r528J1093
10253D6976j0464m953M019K572J282K801L223m317j2313J0004L239r692Q02l938
10239B9241M115M633O913M957J0192J2478R996l0610j9927O211K009j0489O855
10226C6574O464J4854K0570J3402j4334p101P255J3858L732j1631j6005j5455
10214E2183j3647J3843K0257j357O453j5150m256o025n70O590L248j45J7858O901
$$ plain form
10306 36861 56762 53479 50619 51618 60491 73398 92315 84234 67582 51945 34042 39678 58250
10293 58250 57630 54289 57809 44164 26916 41476 33144 40803 29927 19792 47969 65182 66926
10280 66926 41412 18078 24166 22542 13307 20361 44577 59814 50297 23111 15008 20164 21440
10267 21440 36302 39488 37375 28788 29489 36073 44853 47661 50361 52194 60803 45411 35883 46976
10253 46976 36512 31559 35578 38150 39432 42233 45456 41139 28826 38830 42069 32377 33179 29241
10239 29241 33356 37989 44902 49859 60051 72529 82525 51915 31988 38199 40208 29719 36574
10226 36574 43038 57892 78462 91864 77530 70429 77684 91542 95274 83643 67638 52183
10214 52183 38536 52379 72636 71279 77732 62582 58326 52301 51731 58321 61569 61424 79282 86183
10200H6183j3225k886j7633q183N442N623m358K2006N868j7133l0332M358J6331
10187E2061L627J4592J5826q405r771r433Q886j0113j6437r35J4868Q585J3420
10174G6771j1212j1675j135O983q625j3419J713J1830Q314J528p433O404K5702
10161H5746J8360q597k1748o974j612j8883O50J569Q149j546M397J8520O489j5276
10147F9244j4575J693q513j2403l015J9307J5056L794q404q698K461J9951R839
10134H5737N411q601j2720j6880P94k086k348K0340k4562L072J3813M220j3698
10121E2492q055J5572K079N152L917n76j240l847n839j110L418K9173l391n532
10107H2213j22p698k880J249K703M72P456l824r909L516L82K656k713j0375l104
$$ plain form
10200 86183 72958 70072 52439 44256 49698 55321 50963 72969 78837 61704 31372 35730 52061
10187 52061 55688 70280 86106 77701 67930 58497 67383 57270 40833 39898 54766 63351 76771
10174 76771 65559 53884 52749 59732 51107 37688 39401 51231 59545 61073 53640 60044 85746
10161 85746 104106 95509 73761 66787 65175 46292 46942 48511 56660 55114 59511 78031 84520 69244
10147 69244 54669 56362 47849 35446 32431 51738 66794 70588 62184 53486 55947 75898 85737
10134 85737 91148 82547 69827 52947 53741 51655 49307 69647 45085 48157 61970 66190 52492
10121 52492 44437 60009 62088 67240 71157 70581 69341 65494 59655 58545 61963 91136 87745 82213
10107 82213 82091 74393 71513 72762 75465 75937 83393 79569 69660 73176 73558 76214 73501 63126 60022
10092F0022R53r962j4511J1435K4101J411k0510j3996M500m572M659p51m458j41
10078C8180q453O10K1558J2673L858j3873J5838J1247j9771k2113k24J5409J7553
10065G2492N197q941J327J3178j8003k7750m741J2981L0182J0230Q620n809j5034
10052G3929j9425m905O809J9968j5716j7645L931J0191J0888J7623j387k0972
10040F3289j0742J0398M728p004q054J9075J5372l4581r505P245O382P486M133
10027F8222L341k645j0037j1960l407J1215o457L108l593j457K6929J0728l326
10014H0661j0515p283L934Q244J2077r536J6543N289K1206j1138j1127n716k240
10001I0399m507r319N150N869j3283j464J4871J5773k1426J279N976J183R045
$$ plain form
10092 60022 60975 51013 36502 47937 72038 73449 52939 38943 43443 38871 43530 42779 38321 38180
10078 38180 29727 30337 51895 64568 68426 54553 70391 81638 61867 39754 39530 54939 72492
10065 72492 77689 68748 70075 83253 65250 37500 32759 45740 75922 86152 94772 88963 73929
10052 73929 54504 49599 56408 76376 60660 43015 46946 57137 68025 85648 84261 63289
10040 63289 52547 62945 67673 60669 52615 71690 87062 52481 42976 50221 56603 64089 68222
10027 68222 71563 68918 58881 46921 43514 54729 48272 51380 47787 46330 73259 83987 80661
10014 80661 70146 62863 66797 75041 87118 77582 94125 99414 120620 109482 98355 92639 90399
10001 90399 85892 76573 81723 87592 74309 72845 87716 103489 82063 83342 89318 90501 99546
9988I9546Q012o620m393n316Q263J2624q408P911k0794j4428j712J7573m456j114
9974H6688M882M442J3704j6889k8128r57J6714l488J7648J4291l31q759j1832
9961H7985q158j0283K0399J8464M574J2543p317j6073k117k265r339R161K4270
9948A21844l805q682M03J2404p004j2831R24L973j796j0122k621m08q193m307
9934G9779n046j1053O327L020j4942p186R600J5487J8395K339n378j8832o497
9921F6013J2837K106L586N671m332j0447j4640o042n480n828O655N030J4649J9407
9907H9185N751o747j931J776K0823K766q919o485j211K583Q511m743k0978j4616
9893F5765J3580L1939N033K587O639R453j9469j3381j1256o588O90J2018K1068
$$ plain form
9988 99546 107558 100938 96545 91229 99492 112116 103708 111619 90825 76397 74685 92258 87802 86688
9974 86688 91570 96012 109716 92827 64699 63742 80456 76968 94616 108907 108576 99817 87985
9961 87985 79827 69544 89943 108407 112981 125524 118207 102134 100017 97752 88413 97574 121844
9948 121844 118039 109357 109760 122164 115160 102329 103253 107226 105430 95308 92687 92279 84086 79779
9934 79779 74733 63680 70007 73027 58085 50899 60499 75986 94381 96720 91342 72510 66013
9921 66013 78850 80956 84542 90213 85881 75434 60794 54752 49272 43444 50099 55129 69778 89185
9907 89185 94936 88189 86258 88034 108857 111623 102704 96219 95008 97591 106102 101359 80381 65765
9893 65765 79345 111284 116317 118904 125543 134996 115527 102146 90890 84302 84992 97010 118078
9880A18078K935j0567j4006j7314n719J1057J6943j691m732j458J0103N644M637
9867A13910r387o427J058j833j0419J0923K3234P911p185k2260j4058M883L126
9854I3476J0935J07N905L634j1832O586J6282J221O787j557o638R926N248r274
9840A30806j2946J398j8468Q495J0861J941n141J2177l884l887L560k6915l63
9827I7634K185k473j6434M01N643P575J2812M620j2432j7696l195K0047J8768
9814A17455L886J0936J0713R66j1523j4775J66J1536n76m532n389l009L335J4261
9800A33450k582j0924Q970k5843j6006K3783K2119R525j4740j2764J0869J2256
9788A38113l977J1328Q961M793j8844j3987l642j4464K665n894O968J5191N264
$$ plain form
9880 118078 121013 110446 96440 79126 73407 84464 101407 99716 94984 93526 103629 109273 113910
9867 113910 104523 98096 99154 97321 86902 97825 121059 128970 121785 99525 85467 90350 93476
9854 93476 104411 104518 110423 114057 102225 108811 125093 126314 133101 131544 124906 134832 140080 130806
9840 130806 117860 119258 100790 109285 120146 122087 116946 129123 125239 121352 124912 97997 97634
9827 97634 99819 97346 80912 81313 86956 94531 107343 111963 99531 81835 78640 98687 117455
9814 117455 121341 132277 142990 143956 132433 117658 117824 129360 128784 124252 118863 115854 119189 133450
9800 133450 130868 119944 128914 103071 87065 110848 132967 142492 127752 114988 125857 138113
9788 138113 134136 145464 154425 159218 140374 126387 122745 108281 110946 105052 112020 127211 132475
9775A32475L071K095J557j0545j1275k5544R789O782N473O821L884q560l676J7830
9761A30177J1489n072q702j8870p581K0219J0657L217n982l1460m174n101J966
9748I0783J2676J6104J0622q419k763q691R657j834j8845J159J9851O100j3587
9735A12813k6031N135K0167J0319M292l759n225n509j720J5654j3236j3953j2878
9722H6069K2393J6954q273j8863J7981J13j0062p47k892K255J6923K4143n26k0068
9708A25400K899Q256L550l70J4657N909j1428r491j8672L116N65r41P105p760
9694A22795o512j2809M597Q198N515n952Q93j6739J4192J9932q251R817J0165
9681A45841l908n400j1813j4057J213n399J8496J1392o342j059K778m396J3944
$$ plain form
9775 132475 135546 137641 139198 128653 117378 91834 101623 108405 113878 120699 124583 116023 112347 130177
9761 130177 141666 136594 127892 109022 101441 121660 132317 135534 129552 98092 93918 88817 90783
9748 90783 103459 119563 130185 121766 119003 110312 119969 118135 99290 100449 120300 126400 112813
9735 112813 86782 91917 112084 122403 126695 122936 117711 112202 110482 126136 112900 98947 86069
9722 86069 108462 125416 117143 98280 116261 116374 106312 105565 102673 104928 121851 145994 145468 125400
9708 125400 128299 136555 140105 139735 154392 160301 148873 139382 120710 123826 124391 123450 130555 122795
9694 122795 116283 103474 108071 116269 121784 115832 116725 99986 114178 134110 125859 135676 145841
9681 145841 141933 136533 124720 110663 111876 106477 124973 136365 130023 128964 131742 127346 141290
9668A41290N047q024j0036Q301K3050o329j4447N997p632j6343L954K281P152
9655A34261J0337l960q890M144k552j2990j143L472R454j997j823P948K019m964
9641A33316O185l910J869N784j491m949J4710O088n239j1325j8255J168j4478
9628A09473K8029M932j7225m485K5159J2200n408j2249j3070j8441j077J2240
9616A20078P082P291j634o562j0985o14J5522n377P903j5083J894M034q204n221
9602A10124K4777M539R772R056n394L729n647j3722N335q115j0744k5773L743
9589A01680J9191K5921n341R424J944L201J8710k1318j7410Q180m877k3937j36
9576A15232N986j492N777L276n226P156J4783q111j1976p67j2050o415l315n308
$$ plain form
9668 141290 146337 138313 128277 136578 159628 153299 138852 144849 137217 120874 124828 127109 134261
9655 134261 144598 140638 131748 135892 133340 120350 119207 122679 132133 130136 128313 136261 138280 133316
9641 133316 139501 135591 137460 143244 141753 136804 151514 157602 152363 141038 122783 123951 109473
9628 109473 137502 142434 125209 120724 145883 158083 152675 140426 127356 108915 107838 120078
9616 120078 127160 134451 132817 126255 115270 114656 130178 124801 132704 117621 119515 123549 115345 110124
9602 110124 134901 139440 149212 158268 152874 156603 150956 137234 142569 134454 123710 97937 101680
9589 101680 120871 146792 141451 150875 152819 156020 174730 153412 136002 144182 139305 115368 115232
9576 115232 121218 119726 125503 128779 123553 130709 145492 137381 125405 124638 112588 106173 102858 97550
9562I7550J9601K7713J411j8039j4324j5372J4758L7090K0940j8529k8160o220
9550A18419p887l112J4719k994r602n30R505P331r782K505j2583J1067Q105J1613
9536A36774R688l109L938P290l041k580j125n133p930l184j750j2121J2536J2155
9522A42408o911j5901P016N289n371k0470P084J425Q680m090O06r77P673k369
9508A24092K2597j0910r444p046R985o023L050J4849N782j1765p754O765L520
9495A37698J5236j4083l0823r659K1067M841m96k1261J0766J3677l230J5771R492
9482A48996m463q210j2209N391r799n911J3941J0346p434K797P249O511n632j043
9468A40530k405R002M231j8656P234J0132P823r373j2463j7918R801J0363R876
$$ plain form
9562 97550 117151 144864 146275 128236 113912 98540 113298 150388 171328 152799 124639 118419
9550 118419 110532 107420 122139 119145 109543 109013 118518 125849 116067 118572 105989 117056 125161 136774
9536 136774 146462 143353 147291 154581 151540 148960 147835 142702 134772 131588 129838 117717 130253 142408
9522 142408 135497 119596 126612 131901 126530 106060 113144 114569 123249 119159 119765 118788 126461 124092
9508 124092 146689 135779 126335 119289 129274 123251 126301 141150 146932 135167 127413 134178 137698
9495 137698 152934 138851 108028 98369 119436 124277 123781 102520 113286 126963 123733 139504 148996
9482 148996 144533 136323 124114 129505 119706 113795 127736 138082 130648 133445 140694 147205 141573 140530
9468 140530 138125 147127 151358 132702 139936 150068 157891 148518 136055 118137 127938 138301 148177
9455A48177N578r597p781r513m514J4998k29l661J0463R57l086k14O655k606j7129
9440A28498q234r923O701R685K947j2401q030q133N237j8226Q557j3268J1526
9427I4936K6029L3338j0181j0980m495r643n582R105l666n19k0019k59O396J4991
9413A19451K6630L1767J1916n95K3885K4565L380n996k3054k6506k0035j8673
9401A46735j0330P11Q855J7702K215j4395J902m776q552J5259J3794Q385o826
9388A70679j0002r737N097K1830L3017J1009j6075j2465q436p610n447j7646j4550
9375A39664l386j2747J712J5626J5732J288j689N891L6466K6742P529K8153K9685
9362B90666J3831K6587K5479J7855M7575O8921O9464P4103R3532J01623J09468
$$ plain form
9455 148177 153755 144158 136377 126864 122350 137348 137119 133458 143921 144878 141792 141578 148233 145627 128498
9440 128498 120264 110341 117042 126727 129674 117273 109243 101110 106347 88121 96678 83410 94936
9427 94936 120965 154303 144122 133142 128647 119004 113422 122527 118861 118342 98323 98064 104460 119451
9413 119451 146081 177848 189764 189169 213054 237619 240999 235003 211949 185443 165408 146735
9401 146735 136405 137116 145971 163673 165888 151493 153395 148619 140067 155326 169120 177505 170679
9388 170679 160677 150940 156037 177867 210884 221893 205818 193353 184917 177307 171860 154214 139664
9375 139664 136278 123531 125243 140869 156601 157889 156200 162091 198557 225299 232828 260981 290666
9362 290666 304497 331084 356563 374418 421993 490914 560378 634481 728013 829636 939104
9351I39104J36520J54925J64370J72171J60247J55342J32554P8127J6327k5864
9341B083823q2956j34681j83440j79552j67309j68866j64846j41281j14830o7884
9331F78178o2536l9936m9178l8946j7077l0234k4765j0880n882m534J0994o229
9319C98975k6989k0081j3169n25j1890j8071p12j9199q662J6289o220r386q985
9306B71375k0934j1183j0993K0074J0646j1849q985J728p324j9977j2488R385
9294B09475O391j3391p346j7669q431K0984K5934O56k3133J316J1480j5077p370
9281A83819j8623k1064q648J3051J3225J1405O34m655k5074j1534J905Q991L073
9268A46505K401P98o419k3122m224O231j5612P216Q919J4667J004k0906l499R061
$$ plain form
9351 939104 1075624 1230549 1394919 1567090 1727337 1882679 2015233 2093360 2109687 2083823
9341 2083823 2000867 1866186 1682746 1503194 1335885 1167019 1002173 860892 746062 678178
9331 678178 615642 575706 526528 487582 470505 440271 415506 404626 398744 394210 405204 398975
9319 398975 371986 351905 338736 338211 326321 308250 307538 288339 279677 295966 289746 280360 271375
9306 271375 250441 239258 228265 248339 258985 247136 238151 239879 232555 212578 200090 209475
9294 209475 215866 202475 195129 177460 169029 190013 215947 216603 193470 194786 206266 191189 183819
9281 183819 165196 144132 135484 148535 161760 173165 173799 169144 144070 132536 134441 143432 146505
9268 146505 148906 149704 143285 120163 115939 122170 106558 113774 122693 137360 138364 117458 113959 123020
9254A23020K3296K1255J490q802n647N813J4390Q589K5871J2292O996p511L133
9241B24185O012j3914l2687j0367m96o817j6606j7053L398J1399K807J769k358
9228A49272J2157J5131j550Q132J6669J8230K6641K056J709J909j8853j2796K3029
9215B41736J4010l986Q471J8440J1685K0413m304M477J0135j0220j6448P588J5936
9202C17933J2194J7338J6875Q612k828J138p586k8009k7774l3959L314R045J3663
9189B99956k1705r881O391J0779J1287J821r620j3987j0903j1662j4068P906r219
9176B37095p285q858N243K1023J6611M535j2503j9010n121n84l0808l5473j5299
9163A49566L723k847K1323M204Q949R499N678J0982K2913R813m530j3038j7816
$$ plain form
9254 123020 146316 167571 169061 160259 154612 160425 174815 183404 209275 221567 228563 221052 224185
9241 224185 230197 216283 183596 173229 172733 165916 149310 132257 135655 147054 149861 151630 149272
9228 149272 161429 176560 175010 183142 199811 218041 244682 246738 248447 250356 231503 218707 241736
9215 241736 255746 251760 260231 278671 290356 310769 306465 310942 321077 310857 294409 301997 317933
9202 317933 330127 347465 364340 372952 370124 371262 363676 335667 307893 273934 277248 286293 299956
9189 299956 278251 268370 274761 285540 296827 298648 289028 275041 264138 252476 238408 246314 237095
9176 237095 229810 220952 226195 247218 263829 268364 255861 236851 231730 231146 200338 164865 149566
9163 149566 153289 150442 171765 175969 184918 194417 200095 211077 233990 243803 239273 226235 208419
9150B08419n307l5998l8242j470P626R611K5261K1541K316O737p449j701k7169
9137A64175j2659K6077N4918M7449M575R622M095m2077m1271j5677j449L0523
9125B28301N8491K3966J5248J7007J0583p720k3689k2060K4886K7232J6664k1375
9113C47534k2677J1168K2259J4397l471j1650k4161j1993j7048j2972l978J4255
9101C01663k0404j4738J3959L4901K5824N3927K2554J9021L0208l48J4962L3149
9089E14678J8557K4772K8587M4089M8542N1443P7871R3300Q9999Q8209P6154N0749
9077A206950M0930K2900L6402L631r6217j45738q3493J2835L264k8392k3600l4296
9065I15176l9556J8696M2837N7131M0541K6155l23r915k9279k0814O054p776m694
$$ plain form
9150 208419 203112 167114 128872 127402 135028 144639 169900 191441 193757 200494 193045 191344 164175
9137 164175 151516 177593 232511 279960 284535 294157 298252 256175 214904 199227 197778 228301
9125 228301 286792 310758 326006 343013 353596 345876 322187 300127 325013 352245 368909 347534
9113 347534 324857 336025 358284 372681 369210 357560 333399 321406 304358 291386 287408 301663
9101 301663 281259 266521 280480 315381 341205 395132 417686 436707 466915 466567 481529 514678
9089 514678 533235 558007 586594 630683 679225 730668 808539 901839 991838 1080047 1156201 1206950
9077 1206950 1247880 1270780 1307182 1310813 1214596 1068858 985365 998200 1001464 973072 949472 915176
9065 915176 875620 894316 937153 994284 1034825 1060980 1060657 1050742 1021463 1000649 1006703 998927 994233
9052I94233K4813R456K8685L8906L6345K1225M895N2195M3015M9362K0642j5510
9040A308262j9802J8923L2398M6865M0852M1677N3741N5754P8858O7336P6407
9029A801271P7259Q2492R4882Q8757O6719P7955R8600Q5352R7718J18115J31789
9018B820909J38978J04328K8207j05941j45951r1628j7689M4962M9465P1388R4710
9007B991738J14333J23959J22951J64151K31262K80294L01386K83166K27628J45027
8997D985895M1489o4597o7493q019N8082J16735J16814J04823P1348M5908N1805
8986E452790P2683J48562K25642K60739L08148L45935L92291M16184M45906N45192
8976H614072O20325O86195P69848Q77066J008212J162926J341164J556059J872549
$$ plain form
9052 994233 1019046 1028502 1057187 1096093 1132438 1153663 1158558 1210753 1253768 1303130 1323772 1308262
9040 1308262 1288460 1307383 1339781 1386646 1427498 1469175 1522916 1578670 1657528 1724864 1801271
9029 1801271 1878530 1961022 2055904 2144661 2211380 2289335 2387935 2473287 2571005 2689120 2820909
9018 2820909 2959887 3064215 3092422 2986481 2840530 2748902 2731213 2776175 2825640 2897028 2991738
9007 2991738 3106071 3230030 3352981 3517132 3748394 4028688 4330074 4613240 4840868 4985895
8997 4985895 5027384 4962787 4895294 4887275 4945357 5062092 5178906 5283729 5355077 5400985 5452790
8986 5452790 5525473 5674035 5899677 6160416 6468564 6814499 7206790 7622974 8068880 8614072
8976 8614072 9234397 9920592 10690440 11567506 12575718 13738644 15079808 16635867 18508416
8967A8508416K259225K678760L159573L688806M212244M827589N570448O428750
8959E1333811P499005Q835644J0456967J2386220J4711844J7469142K1062126
8952A43754759K5870388L2403209M1443834N2839483O5190979P3635171O6420545
8945E01558368L6846200q522513o3662451j01715411r4979019o7816318m4562049
8938A57146807k9373853k0083064j4153286j0186041p560875n739336m567595
8931F5482757l914648l605623l432285l246479k878445k381733j854216j356608
8923D2812720r18394n40605l05735l84435q92481j532681j944839k093611k087045
8914C2112894k004996j890620j753390j613713j498719j393575j274348j162632
$$ plain form
8967 18508416 20767641 23446401 26605974 30294780 34507024 39334613 44905061 51333811
8959 51333811 58832816 67668460 78125427 90511647 105223491 122692633 143754759
8952 143754759 169625147 202028356 243472190 296311673 361502652 435137823 501558368
8945 501558368 538404568 529882055 466219604 364504193 269525174 201708856 157146807
8938 157146807 127772954 107689890 93536604 83350563 75789688 70050352 65482757
8931 65482757 61568109 57962486 54530201 51283722 48405277 46023544 44169328 42812720
8923 42812720 41894326 41353721 41047986 40663551 39771070 38238389 36293550 34199939 32112894
8914 32112894 30107898 28217278 26463888 24850175 23351456 21957881 20683533 19520901
8906A9520901j076764r90688r43861r06122q75836q05569p34828o67916o03416
8897A1915901n43986n05772m94950n04670m44859m09868m02671l75501l33776
8888G899848l19955l14253l08167k79270k29271k49378k42310k72839k58140k17069
8878E209196k06997j99745j89518j63132j53325j60649j62831j76291j93181j87403
8868C416124j55222j39503j17208j13247r7977j28224j14385j10795r2906p1005
8858B275652n1970n4557n6787p2527q9496r1992p2293o4576m7859o3963o0278
8847A549354m9177o6075m6181m1340l7577j5940k2223k0891j9770l5281m111k043
8835A188745k7477q730r166P087l378q872J4248L2307J1251J8848P054j7997j7053
$$ plain form
8906 19520901 18444137 17453449 16509588 15603466 14727630 13922061 13187233 12519317 11915901
8897 11915901 11371915 10866143 10371193 9866523 9421664 9011796 8609125 8233624 7899848
8888 7899848 7579893 7265640 6957473 6678203 6448932 6199554 5957244 5684405 5426265 5209196
8878 5209196 5002199 4802454 4612936 4449804 4296479 4135830 3972999 3796708 3603527 3416124
8868 3416124 3260902 3121399 3004191 2890944 2792967 2664743 2550358 2439563 2346657 2275652
8858 2275652 2223682 2169125 2112338 2039811 1950315 1858323 1786030 1721454 1673595 1609632 1549354
8847 1549354 1500177 1434102 1387921 1346581 1309004 1293064 1270841 1249950 1230180 1194899 1190788 1188745
8835 1188745 1161268 1152538 1143372 1150459 1147081 1138209 1152457 1184764 1196015 1214863 1221917 1203920 1186867
8822A186867l4579n9372l2650k5202j4161l6866r8356j30455r9318q1831k9149
8811E44928j7381Q476K5877K4909M9009M2555L1868M113L720M88Q942J4729K6468
8798G68701J9923L193j2284N715Q380K2700Q676L2830K9927j3254q6m447p668
8785H62306j6075k892p928K162j5385j6361j0901k9754j8361J3933j1161l084
8773G46499J4765K2110J3337R53j6125l7404j8597j1517m989L2217L6009K8792
8761H06050P983j4790o0969n9735k930R090Q283K9631L7835J4409o306k1386l2594
8748G14571o975M162m744K1932R014L49j5266k6754m1494l1657k0920j9744j6913
8735E65561j4517J201k3372k2174k88j0625L221k354k0209j9932l4447l7523q478
$$ plain form
8822 1186867 1152288 1092916 1060266 1035064 1020903 984037 885681 755226 655908 574077 544928
8811 544928 527547 536023 561900 586809 635818 678373 710241 714354 718074 718562 727504 742233 768701
8798 768701 788624 791817 779533 785248 793628 816328 825004 857834 887761 874507 874421 869974 862306
8785 862306 846231 843339 835411 837573 822188 805827 794926 765172 746811 760744 749583 746499
8773 746499 761264 783374 796711 797664 781539 744135 725538 714021 709032 741249 777258 806050
8761 806050 814033 799243 738274 678539 675609 684699 692982 722613 760448 774857 768551 747165 714571
8748 714571 707596 711758 707014 728946 737960 738309 723043 696289 654795 623138 602218 582474 565561
8735 565561 551044 552245 528873 506699 506411 495786 499007 496653 476444 456512 422065 384542 376064
8722C76064j845M107j3550j0890q605q872J0060q719l8558k2942k5428p621O722
8709B49923N045K5480j5384j7441K456J2320K2722q686N121J7776K360l84O241
8696C07549N308K0949L357r714q892r357p293O781O302o418M531M875K3480J5765
8682C57223k3637l718l93j0097m645l3880l2318k26J77j3743o791j0592j695P067
8668B22732N770j8855q154J3475l788k3424q03j2803l515N78L709l461q814j9676
8654A42971j4031j2376j0198L582M78R186J726k5190j068J6472L4075M4813K0683
8641B11123J7419J0138L295J6912J8043j3032q737K0451M925J2983P003J8900
8629C19423K4034J76M883l292p598m02K494K7334K1433j6029K3498P3980O2787
$$ plain form
8722 376064 374219 378326 364776 353886 345281 336409 346469 337750 299192 276250 250822 243201 249923
8709 249923 254968 280448 265064 247623 250079 262399 285121 276435 281556 299332 301692 301308 307549
8696 307549 312857 333806 337163 327449 318557 309200 301907 308688 314990 308572 313103 317978 341458 357223
8682 357223 333586 329868 329475 319378 314733 280853 248535 248309 248486 234743 227952 217360 215665 222732
8668 222732 228502 209647 201493 214968 211180 187756 186953 174150 170635 171213 174922 171461 162647 142971
8654 142971 128940 116564 106366 109948 110426 119612 121338 96148 95080 111552 145627 190440 211123
8641 211123 228542 238680 241975 258887 276930 263898 255161 275612 280537 293520 300523 319423
8629 319423 343457 343633 348516 345224 337626 337224 339718 367052 388485 372456 395954 469934 532721
8616E32721M2226L8334n920p5006q4068m5931m1830l8865j1514j2759j1192M868
8604B91064J1208j1065P845j3570r718k6234k1326Q402j2322p087J5321R093L368
8591B44979M256p518P040j0540l325J0345p271k9317q286o27L610k523p187M324
8577A97960J262j5902J1290J910J728j043k598j6172Q728P093P739q442m312K8740
8563B17981L5254L3172K2591L0830L8078J3443L637K0386N0671N5153Q3024J00196
8551G04416J01345J20374J39450J55245J59836J75683J69180J36245R8892P2024
8541B032690J7206n2807q4861j24460j50943j76564j85988j79280j46966j30879
8531H17148j15851o4322o8958m8209l8279l4513j0132j6728k2447k4521p343j0777
$$ plain form
8616 532721 574947 613281 607361 532355 448287 402356 360526 321661 310147 297388 286196 291064
8604 291064 302272 291207 299052 285482 275764 249530 228204 236606 224284 217197 232518 241611 244979
8591 244979 249235 241717 248757 238217 234892 245237 237966 208649 200363 199736 203346 200823 193636 197960
8577 197960 199222 183320 194610 196520 198248 197205 194607 178435 187163 194256 201995 193553 189241 217981
8563 217981 253235 286407 308998 339828 377906 391349 394986 415372 466043 521196 604220 704416
8551 704416 805761 926135 1065585 1220830 1380666 1556349 1725529 1861774 1960666 2032690
8541 2032690 2049896 1997089 1912228 1787768 1636825 1460261 1274273 1094993 948027 817148
8531 817148 701297 636975 568017 519808 481529 447016 436884 420156 397709 373188 365845 355068
8519C55068j826j8435r696j4842j1512M958j0711l4085l1418p225k260p867O251
8506B16400k0589j6042K0959L346n390j5150j3278M437K574j3793k2017p726J2654
8493A46385O857j2308L50K2737n261j4221l7j8061j7998q135k1732l0989j6795
8480C0792J0865K5003L4203J8935Q5J2918j374O501p666j4256N065O608L349O119
8466A37147N04k8778q198m912J3918j5071j5582J7216k102j5162j1267L01o38
8453F7376l881O636o204M084M354Q27j2663j1880N605O978j5400Q629K125k79
8439E6307m02j6142P484m314J5467J3791N680j4537k3217P58J1124j4549n431
8426C2019J0599j2670J5352l850k901R733l50j3663J2510R205K560K4395j0805
$$ plain form
8519 355068 353242 334807 325111 310269 298757 303715 293004 258919 227501 220276 218016 210149 216400
8506 216400 195811 179769 200728 204074 198684 183534 170256 174693 177267 163474 141457 133731 146385
8493 146385 153242 140934 141284 164021 158760 144539 144502 126441 108443 100308 78576 47587 30792
8480 30792 41657 66660 100863 119798 119883 132801 131427 137928 130262 116006 121071 127679 131028 137147
8466 137147 137651 108873 100675 95763 109681 94610 79028 96244 94142 78980 67713 68014 67376
8453 67376 63495 70131 63927 68011 72365 73192 60529 48649 54254 61232 45832 54461 56586 56307
8439 56307 55905 39763 47247 42933 58400 72191 77871 63334 40117 40875 51999 37450 32019
8426 32019 42618 29948 45300 41450 38549 48282 47932 34269 46779 55984 58544 82939 72134
8413G2134L337k1444r250m459p194n175P209M0257R597j2157P221l780k0420o190
8399D9686J4059K41k8168j6974n568P861J4132J3693J4242j0057j0967j6934o434
8386A8812J0982L954l297O48R620r55L746j0651j1764L683M767J0697k377J4466
8372E2331K1968j9769j3010n907N07N658L993j052K136J8532P414n499K796r260
8358F0838l967O874P025J3091j4764k2759l704j3736K902K5521K508l0126J783
8345C1486l935N613P86k97k093J739P024J7279q353j2772M981R138j365O483j3874
8330D1840k3729J3563J8214j145k5397j3410J0955R765R60r479r559J0611R218
8317C2407r138N444O426N840q142m459R344m201k543j3005K584k230j2075o576
$$ plain form
8413 72134 75471 54027 44777 40318 33124 27949 35158 75415 85012 72855 80076 76296 55876 49686
8399 49686 63745 63986 35818 18844 13276 21137 35269 48962 63204 53147 42180 25246 18812
8386 18812 29794 33748 30451 31099 40719 39764 43510 32859 21095 24778 29545 40242 37865 52331
8372 52331 74299 54530 41520 35613 36120 41778 45771 44719 46855 65387 72801 67302 70098 60838
8358 60838 56871 63745 70770 83861 69097 46338 42634 28898 31800 57321 59829 29703 31486
8345 31486 27551 33164 33950 33653 31560 33299 40323 57602 49249 36477 41458 50596 49231 55714 41840
8330 41840 18111 31674 49888 48743 23346 9936 20891 30656 31616 22137 12578 23189 32407
8317 32407 23269 28713 35139 40979 32837 28378 37722 33521 30978 17973 20557 18327 6252 -324
8303c24J5174l031M065o256J6517O221J1338q764j2822j1736j2874O29K5267J5356
8289C8760p126J874j4715J0338N470j0734Q754K199P063n048k616J0445J5790
8276F0454o912o800m376r337j1791M540m107l18J245j1141P724K615p098l267
8262A1431K1328n60m945j4643l75j155J2678J9911j1089k3300j8813J4380k312
8249B536n580O969M28l455j587j1307J4113J8976J3214J6653m622j5409k1948
8236H981J5429J5061J8668q640k6254m448j7189k908O274J2650J0014J784k1057
8223H365M628J6429o791k4229M599N855J6395K795m870M223K552n537j8029j0676
8209d291J77J5770R943r522k8273K075J4379N579j0743o849K3888L997Q506j1361
$$ plain form
8303 -324 14850 11819 15884 9628 26145 32366 43704 34940 22118 10382 -2492 -1863 23404 38760
8289 38760 31634 33508 18793 29131 34601 23867 32621 34820 41883 36835 34219 44664 60454
8276 60454 53542 46742 42366 33029 21238 25778 21671 21353 22598 11457 19181 21796 14698 11431
8262 11431 32759 32199 27254 12611 12236 11081 23759 43670 32581 9281 -9532 4848 2536
8249 2536 -3044 3925 4353 898 -689 -11996 2117 21093 34307 50960 46338 30929 8981
8236 8981 24410 39471 58139 49499 23245 18797 1608 -1300 4974 17624 27638 29422 8365
8223 8365 12993 29422 22631 -1598 3001 8856 25251 28046 23176 27399 29951 24414 6385 -4291
8209 -4291 -4114 11656 21599 12077 -16196 -14121 258 5837 -4906 -11755 12133 16130 24636 13275
8195A3275j0305k3860%J7647J4289O188m478j5430O211J3048M847p710j2281M755
8181F196l115j6681J0775N39k682J3283R767Q532K349k4914r804J6923K571j384
8167A2355J25m10Q091k9163Q084R314M223P447j4323j0692q497N133J7115K3272
8153C2074j2657K744k726j0510J507j699M393J4184J1001R85K243J7770J3418
8140G2727r632k2871j2232j5156j2971N976L883Q777K1166r449p902j4273j4086
8127f043J6012K0176O627J02j9675m865J754M261J7251J6235L33k4125j7145j2801
8113a903R701j6305J4384N109j5552K2988K2662j4662R606P55k0108j0811O069
8100A1933k836k884p764j3147J7287M654j744J5811J2489O405j5808j2840n183
$$ plain form
8195 13275 2970 -20890 -20890 -3243 11046 17234 12756 -2674 3537 16585 21432 13722 1441 6196
8181 6196 3081 -13600 -2825 -2286 -4968 8315 18082 26614 28963 4049 -5755 11168 13739 12355
8167 12355 12480 12070 20161 -9002 -918 8396 12619 20066 5743 -4949 -13446 -8313 8802 32074
8153 32074 19417 22161 19435 8925 10432 8733 13126 27310 38311 39296 41539 59309 72727
8140 72727 63095 40224 27992 12836 -135 5841 9724 18501 39667 30218 22316 8043 -6043
8127 -6043 9969 30145 36772 36874 17199 12334 14088 18349 35600 51835 52168 28043 10898 -1903
8113 -1903 7798 -8507 5877 10986 -4566 18422 41084 26422 36028 36783 16675 5864 11933
8100 11933 9097 6213 -1551 -14698 2589 7243 5499 21310 33799 40204 24396 11556 6373
8087F373r173R716J6105L1890O816k2148k0258l580N168p435r951O920J0j3043
8073b590j6337P992j278J290p23k61L994l350J4862j0351L032J3973J7177J4348
8059D1778K1542J7529j5211l1564p154N968k817k4587j0661p516M049K677J7855
8046A1888K0178O317n395k4466J2762O539n455K2483q177j5011j7860j2185J0251
8033A869O397K0015m833K096m391R7J9859J0515k6819l668J4824J3195K707R641
8019F1504k5314k8027M526J8571n283n346m528Q119J094j8730J603k466N614K0206
8005C1543M947j2352P963K0566J0187J5430O416J846k238L600M60K459k23r683
7991H0921j0870m666j0013j873j2584p011K2286L799j0076j2226k998j64j5343
$$ plain form
8087 6373 -2800 6916 23021 54911 61727 39579 19321 15741 20909 13474 3523 10443 10453 -2590
8073 -2590 -18927 -10935 -12213 -10923 -11646 -11907 -7913 -11263 3599 -6752 -3720 10253 27430 41778
8059 41778 63320 80849 65638 34074 26920 32888 30071 5484 -5177 -12693 -8644 -5967 11888
8046 11888 32066 38383 32988 8522 21284 27823 22368 44851 36674 21663 3803 -8382 1869
8033 1869 8266 28281 23448 25544 21153 21250 41109 51624 24805 21137 35961 49156 51863 61504
8019 61504 36190 8163 12689 31260 25977 20631 16103 24222 25316 6586 8189 5723 11337 31543
8005 31543 36490 24138 32101 52667 62854 78284 84700 86546 84308 87908 88368 90827 90604 80921
7991 80921 70051 65385 55372 53499 40915 33904 56190 59989 49913 37687 34689 34525 19182
7978A9182j0534K578j803Q262J3257j0503J0267Q16J239q758p923J6689o302j3735
7964A2732p9r694J1846J0074N035P220Q336L970r823J1266J9740K065j3075j6611
7950D3002J1100J6824j3739j4147R197r43R740M298n118j102K275M613L216R08
7936G0124j6153o16r128M050J134r889q049j0305k217L398J2541p860M63K301
7922B9794O706J4573j883M506R545j4980r441j0568k2589J825n97N574K3003J2083
7908D7551q644Q484M823j3890l763P75k963N273j1349n199J3293q976q005K441
7894A9851N285k3386n738m695m882J6458J8623R910p331K0330l094j0540k1964
7881H827j1368p775q141J4068j5097J3279K5455Q274p418q836P354j8154j2630
$$ plain form
7978 19182 8648 11226 9423 17685 30942 20439 30706 31522 32761 24003 16080 32769 26467 12732
7964 12732 12653 2959 14805 24879 29914 37134 45470 49440 39617 50883 70623 72688 59613 43002
7950 43002 54102 70926 57187 43040 52237 51294 61034 65332 60214 59112 61387 66000 69216 70124
7936 70124 53971 53355 44227 48277 49411 39522 31473 21168 18951 22349 34890 27030 27493 29794
7922 29794 36500 51073 49190 53696 63241 48261 38820 28252 5663 7488 6891 12465 35468 47551
7908 47551 38907 47391 52214 38324 34561 35336 32373 37646 26297 21098 34391 25415 17410 19851
7894 19851 25136 1750 -3988 -8683 -13565 2893 21516 31426 24095 44425 41331 30791 8827
7881 8827 -2541 -10316 -18457 -4389 -19486 -6207 19248 27522 20104 11268 18622 468 -12162
7868a2162J8434R481j8492k362K1676Q824o349Q044j1542k5757O5K5316J2428
7855B7604m777r612j9541k004J7623K582j5659O285l734j3558P077q631P563n010
7841a3792J3533O56r18K841L560m444J4639O40k302J5064J9740j8049k1711k328
7827G129o762l648J6832L173p575J0280j3373n20r839j5126J7904J6083j2029
7814B529M734P808l506M60P803j7163k1830n064J1603K5698j2298k238n674p354
7800a4492K067J3524K4676J737p382j2037Q673l021l768O435n298m98j3117R307
7786F806J1561q349q165l143Q553J7024j0061k5142k9809L368R518J4673J392
7773a1774n872l832n753P73K5349m138r955k97N471N073j081m541l333R960Q122
$$ plain form
7868 -12162 6272 15753 -2739 -5101 16575 25399 19050 27094 15552 -10205 -10140 15176 27604
7855 27604 22827 13215 -6326 -8330 9293 11875 -3784 2501 -1233 -14791 -7714 -16345 -8782 -13792
7841 -13792 -259 397 -521 2320 5880 1436 16075 16715 14413 29477 49217 31168 9457 7129
7827 7129 367 -3281 13551 16724 9149 19429 6056 5536 -4303 -19429 -1525 14558 2529
7814 2529 7263 15071 11565 12025 19828 2665 -19165 -24229 -12626 13072 774 -1464 -7138 -14492
7800 -14492 -12425 1099 25775 27512 20130 8093 16766 13745 9977 16412 11114 10616 -2501 6806
7786 6806 18367 10018 1853 -1290 7263 24287 14226 -10916 -40725 -37357 -27839 -13166 -11774
7773 -11774 -17646 -21478 -27231 -26458 -1109 -5247 -15202 -15499 -10028 -4955 -6036 -10577 -13910 -3950 4172
7758D172j306K548r882j533l178M203R851J154j5213j929J4334J2622j1828k9874
7744b5859K351R156R515P355L471k856k0090K1004J242j2913q155p598K627O027
7730a4723l124O633K6624R621p299j0989k530o071n344l771m530P211n85j5790
7716b4667p025P662R504J0045J401k648K3975Q647j8022k0566j7981O466J5308
7703g901N930m294J158j1170j6187n172q464J1538J6876J9845J4993J4076O347
7690C7575j9438o967k5753p296J3412M550m401M012p772J8845M45j1284m616P443
7676a245K4366J0753j6452j5428n40J2813j2167j1419n023K1980R530j7237M899
7663D830J3368p643j4793l627q955R166L013J7827o384o702P608J1312n851j1323
$$ plain form
7758 4172 2866 5414 -4468 -6001 -9179 -4976 4875 6029 -9184 -11113 3221 15843 4015 -25859
7744 -25859 -23508 -14352 -4837 2518 5989 3133 -16957 4047 5289 -7624 -15779 -23377 -20750 -14723
7730 -14723 -17847 -11214 15410 25031 17732 6743 4213 -1858 -7202 -10973 -15503 -8292 -8877 -24667
7716 -24667 -31692 -24030 -14526 -4481 -3080 -5728 18247 26894 8872 -11694 -29675 -23209 -7901
7703 -7901 -1971 -6265 -5107 -16277 -32464 -37636 -46100 -34562 -17686 2159 17152 31228 37575
7690 37575 18137 11170 -14583 -21879 -8467 -3917 -8318 -4306 -12078 6767 7212 -4072 -8688 -1245
7676 -1245 23121 33874 17422 1994 1454 14267 2100 -9319 -14342 7638 17168 -69 4830
7663 4830 18198 10555 -4238 -7865 -16820 -7654 -4641 13186 6802 100 7708 19020 13169 1846
7649A846j0539j4880K8004J8382R734k9728j0747O154P413j2456J522p586k295
7636a5176J969j0551L553K0042J0939J0244J3379O127j1243j4668j922j4105P12
7623g00o562n728J6830L414k1567m754q219J0335O763j512k95O302j820L504l78
7608d387k1079P342L38K922L677O604m400O408K080L273J9818r224r432n550m693
7593f303j2795K664K1132L944j67k4443J3724J5304J9470M861j4700r952j4060
7580a321r002J3358K692k9694j0877J0769J2854M521N563J0939j1768j7750k734
7567b2450L103J4951j471m992J5990K4383p890j4192o037m255N549K0125l996
7554A8818l797j7035j3288m335J4244m226L996M203q761K3568N714j6658j028
$$ plain form
7649 1846 -8693 -23573 4431 22813 32547 2819 -7928 -1774 5639 -6817 -5295 -12881 -15176
7636 -15176 -13207 -23758 -20205 -163 10776 21020 34399 40526 29283 14615 12693 -1412 -700
7623 -700 -7262 -12990 3840 7254 -14313 -19067 -27286 -16951 -10188 -11700 -11995 -5693 -7513 -4009 -4387
7608 -4387 -25466 -18124 -17786 -14864 -11187 -4583 -8983 -2575 -495 2778 22596 13372 3940 -1610 -6303
7593 -6303 -19098 -16434 4698 8642 8475 -15968 -2244 13060 32530 37391 22691 12739 -1321
7580 -1321 -10323 3035 5727 -23967 -34844 -24075 -11221 -6700 -1137 9802 -1966 -19716 -22450
7567 -22450 -19347 -4396 -5867 -10859 5131 29514 21624 7432 1395 -2860 2689 22814 18818
7554 18818 15021 -2014 -15302 -19637 -5393 -9619 -5623 -1420 -10181 13387 19101 2443 1415
7541A415K378Q652M903P314n080r949K2127j4231k865O270L317k366j2071j192
7527H622j3388n320J9147n049n815j1148q389K0065r014j4034P606O500r488J4795
7513d910K0973L271j6998q556o259q342j2643n159J2824J5445Q689J2835K624
7500A3794l222n499R247j3670j3726P325K0260N753j0214j9054j2381J3682k901
7487a0606L00j7261q953N77r117J3223J1025Q907J971N12J0234Q791r132K547
7473C018q01M203K886l038M885n922j4862m391m484N188O64P135R062j2141j3609
7458b2207M443n322P937K375j0908k989Q299L025J5316j5294l975K3935J3153
7445A7788j0982n269j8132j0790J4404L3916n5p608p028o340m266N877J49J5557
$$ plain form
7541 1415 3793 12445 17348 24662 19582 9633 31760 17529 14664 20934 24251 21885 9814 8622
7527 8622 -4766 -10086 9061 4012 -1803 -12951 -21340 -1275 -10289 -24323 -16717 -10217 -19705 -4910
7513 -4910 16063 19334 2336 -6220 -12479 -20821 -33464 -38623 -25799 -10354 -1665 11170 13794
7500 13794 10572 5073 14320 650 -13076 -5751 14509 20262 10048 -9006 -21387 -7705 -10606
7487 -10606 -10306 -27567 -36520 -35943 -45060 -31837 -20812 -11905 -9934 -9422 812 9603 471 3018
7473 3018 2217 6420 9306 6268 11153 5231 -9631 -14022 -18506 -13318 -12654 -5519 3543 -8598 -22207
7458 -22207 -17764 -23086 -15149 -12774 -23682 -26671 -18372 -15347 -31 -15325 -19300 4635 17788
7445 17788 6806 1537 -16595 -27385 -12981 20935 20880 13272 6244 -96 -4362 1515 1664 17221
7431A7221k578r188j089j8167j0284K648J0825J23M377M634r146Q512K635J129
7417A652r281L472J3938j4819R061P602O329j3288r759j457j8834p697M621J939
7403b6521q451j993O53j669L675m25L044n546R476k703j1457K868K0951J3791
7389d307Q515l683o215P548o227m234K907p83P258J0025m995k0091O775M530j603
7374d580J1541l648m262l604l531R220j346q213M935P165k849r316n832J735k518
7359a5103J481o815R978k40r916J1785J9954j828j8136n629Q406K0012r60j3372
7345c83O105k261j8272n395M298L607J3319L0739R70l4002j3752J5663J1947J4794
7331B7377L0193j2164p286k845k4389j1663N678J1914j8665k7343r075R092K7479
$$ plain form
7431 17221 14643 5455 4366 -13801 -24085 -21437 -10612 -10489 -6112 -1478 -10624 -2112 523 1652
7417 1652 -7629 -4157 9781 -5038 4023 11625 17954 4666 -5093 -6550 -25384 -33081 -28460 -26521
7403 -26521 -34972 -36965 -36312 -37981 -34306 -34731 -31687 -37233 -27757 -30460 -41917 -39049 -18098 -4307
7389 -4307 4208 525 -5690 1858 -4369 -8603 -5696 -6479 779 10804 5809 -14282 -7507 -2977 -4580
7374 -4580 6961 3313 -949 -4553 -8084 1136 -210 -8423 -3488 3677 828 -8488 -14320 -12585 -15103
7359 -15103 -13622 -20437 -10459 -10699 -20615 -8830 11124 9296 -8840 -14469 -6063 13949 12989 -383
7345 -383 5722 3461 -14811 -20206 -15908 -12301 1018 31757 32727 -1275 -15027 636 12583 27377
7331 27377 57570 45406 38120 35275 10886 -777 4901 16815 -1850 -29193 -38268 -29176 -1697
7318a697L892p485N194j0080m494p243o013o722n686j0087K7004K0013o705N547
7304d562J2091j5046l417O716J6340j6963m885L558k2911K426o572p917k00J2404
7290b8938R824J0994J070p580q880l284M045p077N283J7863K353P856J3620O888
7276B4037N46j5485j560L521j0234r7j0920k910Q565J0845j4763p510J0293l053
7262h725l61P834l175p956L358K817j9924K0474J0281j3159m181m104l77J6280
7248i18J6097N933j0468j6586O48J1537L423Q089l906p862J0266j1507j3537J5406
7234F615P476J12o438o861l900j559q411m599j589j4062m135o258J1810O161J2438
7219a3200J1893p419m331R82n254l485Q111J2061q216j1163M066J1783m647l132
$$ plain form
7318 -1697 2195 -5290 -96 -10176 -14670 -21913 -27926 -34648 -40334 -50421 -23417 -3404 -10109 -4562
7304 -4562 7529 -7517 -10934 -4218 12122 -4841 -9726 -6168 -29079 -26653 -33225 -41142 -41342 -28938
7290 -28938 -19114 -8120 -7050 -14630 -23510 -26794 -22749 -29826 -24543 -6680 -4327 3529 17149 24037
7276 24037 24583 9098 7538 11059 825 728 -10192 -13102 -4537 6308 -8455 -15965 -5672 -8725
7262 -8725 -9086 -1252 -4427 -12383 -9025 -6208 -26132 -5658 4623 -8536 -12717 -16821 -17198 -918
7248 -918 15179 21112 10644 -5942 -5294 6243 9666 17755 13849 5987 16253 4746 -8791 6615
7234 6615 14091 14203 7765 904 -2996 -4555 -12966 -17565 -19154 -33216 -37351 -43609 -31799 -25638 -13200
7219 -13200 -1307 -8726 -13057 -12075 -17329 -20814 -12703 -642 -8858 -20021 -15955 -4172 -8819 -11951
7205a1951M507n314J167L266K325j948p267j3740l132J4271P795j477K2419J2999
7191B3920j6984k9208j0617J5134m705J1204J3582m491q113r556P413j2776j843
7178b7040J5338o307O858J96m737M40Q686J3607j4342J688J2672P610l268o935
7164D466l241n241J2568o777l0263p256J5535J3133N271j6708p692O347l55j437
7150b1650Q766J5744M9n420m955J1583l460k0544j1895J2445j1751n548J8638
7137a7998J3434j4532M274n489j6490J9180J4008p663O198p53P093j9214j2036
7124b9988J361J2143l746j136O564P676j824O162j527J0250j5251j615M773P533
7110A375n785K193k0365q124n612l595P439M346K3764K3558m382N055K010K655
$$ plain form
7205 -11951 -7444 -12758 -11591 -8325 -6000 -7948 -15215 -28955 -32087 -17816 -10021 -11498 10921 23920
7191 23920 6936 -22272 -32889 -17755 -22460 -11256 2326 -2165 -10278 -19834 -12421 -25197 -27040
7178 -27040 -11702 -18009 -11151 -10955 -15692 -15252 -6566 7041 -7301 -5613 7059 14669 11401 4466
7164 4466 1225 -4016 8552 1775 -28488 -35744 -20209 -7076 -1805 -18513 -26205 -19858 -20213 -21650
7150 -21650 -12884 2860 2909 -2511 -7466 4117 657 -19887 -31782 -19337 -31088 -36636 -17998
7137 -17998 -4564 -19096 -14822 -20311 -36801 -17621 -3613 -11276 -5078 -5831 1262 -17952 -29988
7124 -29988 -28627 -16484 -20230 -21366 -14802 -7126 -8950 -2788 -4315 5935 -9316 -10931 -6158 1375
7110 1375 -4410 -2217 -22582 -30706 -36318 -39913 -32474 -28128 -4364 19194 14812 19867 21877 24532
7096B4532k1515r232j759p383p679P46n202O186J0252j666N866j639J312j8683
7082b5864K199J9768r883L840J6980n516q477o257J8874K905r831o077J1512J453
7068E626l6301j8974m748J3811J6300R876K4222q482J2198p986j6800K9K259n360
7054a4330O701k2650o941K4307M506j2764Q320r883N188M406r365J376K0976J0938
7040A0785p879J4789N607m297j0110n318r742O820P355q501O014J8623o986j6304
7026H56k86j7086O145J6805m563J350j3166j101Q81k518r666k80P401J7994J347
7011D113j1684J5213Q64l4138l221J6216J2982M496J9072p026O282J862j0042
6998A4989q779J3716m733k2779p041O515N541k88j3912J0441n152j4525j4283
$$ plain form
7096 24532 3017 -6215 -7974 -15357 -23036 -22290 -27492 -21306 -11054 -12720 -6854 -8493 -7181 -25864
7082 -25864 -23665 -3897 -13780 -9940 7040 1524 -6953 -13210 5664 8569 -1262 -7339 4173 5626
7068 5626 -30675 -49649 -54397 -40586 -24286 -14410 9812 1330 13528 5542 -11258 -11229 -8970 -14330
7054 -14330 -7629 -30279 -37220 -12913 -8407 -21171 -12851 -22734 -17546 -13140 -22505 -21129 -153 10785
7040 10785 2906 17695 23302 19005 8895 3577 -6165 655 8010 -491 5523 24146 17160 856
7026 856 570 -16516 -10371 6434 1871 3221 -9945 -11046 -10165 -12683 -22349 -22629 -15228 2766 4113
7011 4113 -7571 7642 8506 -25632 -28853 -12637 345 4841 23913 16887 23169 25031 14989
6998 14989 6210 19926 15193 -7586 -14627 -8112 -2571 -2859 -16771 -6330 -11482 -26007 -40290
6985d0290J6480L283O35O516q373J3685N501r201J2456Q647l054J01n264j3549
6971a2427k7768N58K7319J8248J8445O07j3463j5208q147K204j3364M08K5829
6958C241K1017L237l926o574R939L246j831j3660j0388j9354L45k766P563K409
6944g502j0216j089R635r046j3422j719J4304J2833o816J0066J2808m258o645
6931a067L623M366p777n448l851o600j6178n025R236P26J0499j1642R094J1177
6917h867J4146J407j959M604q84j237k7681r951J6151J861J68j148k129K599L310
6902i610n631j145J4684J4249o266m566k441J061N832j2365j4428J0761P352l623
6888f136P74j5969K755K041o583n405Q545J2857J4044J5401j7545j0090K0716
$$ plain form
6985 -40290 -23810 -20527 -19892 -13376 -21749 -8064 -2563 -11764 692 9339 6285 6386 1122 -12427
6971 -12427 -40195 -39637 -12318 5930 24375 24982 11519 -3689 -11836 -9632 -22996 -22588 3241
6958 3241 24258 27495 23569 16995 26934 30180 28349 14689 4301 -15053 -14708 -17474 -9911 -7502
6944 -7502 -17718 -18807 -9172 -18218 -31640 -33359 -19055 -6222 -13038 -2972 9836 5578 -1067
6931 -1067 2556 6922 -855 -6303 -10154 -16754 -32932 -37957 -28721 -27995 -17496 -29138 -20044 -8867
6917 -8867 5279 6686 4727 9331 8447 7210 -20471 -30422 -14271 -12410 -12242 -13390 -15519 -12920 -9610
6902 -9610 -15241 -16386 -1702 12547 6281 1715 -726 335 6167 -6198 -20626 -9865 -2513 -6136
6888 -6136 -5362 -21331 -18576 -16535 -23118 -28523 -19978 -7121 6923 22324 4779 -5311 15405
6875A5405J0622o136J1320j6436l3029r481k395R997J1326J555j1485j0074Q639
6862b0172J8684J205m044q71r346J596Q662K0594m592q846J6090K2485k0348j2833
6848H264j513j4967p402J1487L391M746l758p447n5J3848n671k6141j7533K6842
6834a5909J5120m826k623R949O353j5004N771J6742O579j2737k7155R16o412l490
6820b6726k041o762K0008K5379k826r177j1943k794J8574K5849m39k1464j4245
6807h607q517P550L360j8840k3561Q330J0626K082L552M618L302P023M253M70
6793d359K926J5535J2595m702j3416p890q599J2681K7171P110m330r223j966l908
6779A9625m340q693m373O914K152k0302k4265o377K4646J0058R674J3849J6422
$$ plain form
6875 15405 26027 19891 31211 14775 -18254 -27735 -30130 -20133 -8807 -7252 -18737 -28811 -20172
6862 -20172 -1488 -283 -4327 -5198 -14544 -12948 -4286 16308 11716 2870 18960 41445 21097 8264
6848 8264 6751 -8216 -15618 -4131 -740 4006 248 -7199 -7254 6594 923 -25218 -42751 -15909
6834 -15909 -789 -5615 -8238 1711 8064 -6940 -1169 15573 22152 9415 -17740 -16824 -23236 -26726
6820 -26726 -28767 -35529 -15521 9858 7032 -2145 -14088 -16882 1692 27541 27102 5638 -8607
6807 -8607 -17124 -9574 -6214 -25054 -48615 -40285 -29659 -27577 -24025 -19407 -16105 -9082 -4829 -4359
6793 -4359 -1433 14102 26697 21995 8579 689 -7910 4771 31942 39052 34722 25499 23533 19625
6779 19625 15285 6592 2219 9133 11285 -9017 -33282 -39659 -15013 -4955 4719 18568 34990
6766C4990l217p232j4084J0958N881L359O3j3129j704J2328Q038o506q037k5862
6752d154J898J8417J3256P22J1221J2814m763j6831p782Q312Q870J0896q79J6034
6738F8031J1346O565J3609L110l116K9597M642k470L856N937k11j584J6318L8470
6724A94100L5702M2905L8590M4670N1023Q2367J13784J27019J70994K15192K78942
6713A395288L22316L73084L58942K09853l7667l39644n98337n21682l36834k00669
6703F24650j28582q1976m4230l2250l1019q636n355k3547k7789m955j9192j548
6691B15571J5009J7433J0991J910o099j066m491M208j5573k6614j9119j7949P235
6678A81446k2040r897j3965L816k0503q183k3935k776N174j362j6205j3702r961
$$ plain form
6766 34990 31773 24541 10457 21415 27296 30655 30718 17589 15885 28213 36251 29745 21708 -4154
6752 -4154 -2256 16161 29417 30139 41360 54174 49411 32580 24798 33110 41980 52876 51997 68031
6738 68031 79377 85942 99551 102661 99545 129142 133784 131314 135170 141107 140896 139312 155630 194100
6724 194100 229802 272707 311297 355967 406990 489357 603141 730160 901154 1116346 1395288
6713 1395288 1717604 2090688 2449630 2659483 2621816 2282172 1683835 1162153 825319 624650
6703 624650 496068 414092 369862 337612 306593 297957 292602 269055 241266 236311 217119 215571
6691 215571 230580 248013 259004 260914 254815 253749 249258 253466 237893 211279 192160 174211 181446
6678 181446 159406 149509 135544 139360 118857 110674 86739 83963 89137 87775 71570 57868 47907
6665D7907j5875K158o133K930K3166M205j3258N172K7251m399k8060j5152J4009
6652D3921k077J1068R109j9189k5434j1823p674k8845L971K4351Q186m180L721
6639E105P781J0080r861O772j7094j9386J5412m775l539O03o790P253j354n481
6625a5274J13j0364j2480J6643R572j1805J2532J0824N039J2936L912j0956j220
6612I472p004J457M641P166j0582r662R370J2030r046j8605r157K628J4438N823
6598B969N46J5077J1635m726R21j6471k6553Q365j0298R824J5715j2896r495P172
6584h215Q463K743j1531J2494Q064m537M955j0692p70M902J3029J509o42k1q352
6569A1399l204j8944L022K6715m015O55k905j1419q623O233n349O192M203k1878
$$ plain form
6665 47907 32032 34190 28057 30987 54153 58358 45100 50272 77523 73124 45064 29912 43921
6652 43921 41844 52912 62021 42832 17398 5575 -2099 -30944 -26973 -2622 5564 1384 5105
6639 5105 12886 22966 13105 19877 2783 -16603 -1191 -5966 -9505 -8902 -15692 -8439 -9793 -15274
6625 -15274 -15161 -25525 -38005 -21362 -11790 -23595 -11063 -239 4800 17736 21648 10692 9472
6612 9472 2468 3925 8566 15732 5150 -4512 4858 16888 7842 -10763 -19920 -17292 -2854 2969
6598 2969 3515 18592 30227 25501 26422 9951 -16602 -8237 -18535 -8711 7004 -5892 -15387 -8215
6584 -8215 248 2991 -8540 3954 12018 7481 12436 1744 974 5876 18905 20414 19772 19751 11399
6569 11399 8195 -10749 -7727 18988 14973 15628 12723 1304 -7319 -1086 -6435 -243 3960 -17918
6555a7918J205M153n392n843q6J6012J1747l564K46k67n996J3976Q504j0536L294
6540I535K083j4624k2993L630K4233J2159j5922k466m969o344q262R294k388M690
6526a2344N901J5144J2568j4309j8539J987R917P263Q169q269k036j3947o018
6513a4513R323j293N85J688j6751o941N480l13P288L577K004L754J7555J6076
6499B7519k0069j2628o99K7818K0526j6038J4696J641J0333n457m320P705j8017
6486C3010k1369k1399n289j1613Q881K7180m75k9211n442J5852J0588j7725r228
6473b6240j1495j2413r63J8484N810J3778L099O512o330j4440J391J4952K676
6460e179O040N370j3566j3789L831K7322N060p762J759J0340r63N440p98r995
$$ plain form
6555 -17918 -16713 -12560 -17952 -23795 -23881 -7869 3878 314 560 293 -5703 8273 16777 6241 9535
6540 9535 11618 -3006 -25999 -22369 1864 14023 -1899 -4365 -9334 -15678 -23940 -14646 -17034 -12344
6526 -12344 -6443 8701 21269 6960 -11579 -9592 325 7588 15757 7488 5452 -8495 -14513
6513 -14513 -5190 -6483 -5898 -4210 -20961 -27902 -22422 -22735 -15447 -11870 -9866 -6112 11443 27519
6499 27519 7450 -5178 -5877 21941 42467 26429 41125 42766 53099 47642 43322 51027 33010
6486 33010 11641 -9758 -15047 -26660 -17779 9401 8926 -20285 -25727 -9875 713 -17012 -26240
6473 -26240 -37735 -50148 -51111 -32627 -26817 -13039 -9940 -3428 -9758 -24198 -22807 -7855 -5179
6460 -5179 861 6231 -7335 -21124 -17293 10029 15089 7327 9086 19426 18463 23903 23105 13110
6446A3110p144j8452j3752M002M943J0303O343p735r945R879J690P29J1017K914
6432G902q28j7637N935j0025j4013N649O716M541K2099N83j4241j1933r986q197
6418c3435o813N653J9539P974J2171L912j4388q934l640q098J0285J6373L592
6405D191m824N195j430k659N956J603M147P315J0260r925l207N690j580j748K521
6390B1505o615l1090q522J1413J7050K5265K0252k9545k7338p12K804R832p018
6377b719r469k945k7182j7238R961K1416Q093K3664J3392j1926q350P635N38q808
6363c938m858j6731j5309J3651J2958k580k1645r696J7472J4683J7751K3265j2349
6350A2674l1999N867Q446J8272K320j6735K416k714j1104J1428J0715j4786L271
$$ plain form
6446 13110 5966 -12486 -26238 -22236 -17293 -6990 -647 -8382 -18327 -8448 -6758 -6029 4988 7902
6432 7902 7074 -10563 -4628 -14653 -28666 -23017 -16301 -11760 10339 10922 -3319 -15252 -25238 -33435
6418 -33435 -40248 -34595 -15056 -7082 5089 9001 -5387 -14321 -17961 -26059 -15774 599 4191
6405 4191 -633 4562 3132 473 6429 8032 12179 19494 29754 19829 16622 22312 20732 18984 21505
6390 21505 14890 -16200 -24722 -13309 3741 29006 49258 19713 -7625 -8337 -5533 4299 -2719
6377 -2719 -12188 -15133 -42315 -59553 -49592 -28176 -20083 3581 16973 5047 -3303 4332 4870 -3938
6363 -3938 -8796 -25527 -40836 -27185 -14227 -16807 -38452 -48148 -30676 -15993 1758 25023 12674
6350 12674 -19325 -13458 -5012 13260 15580 -1155 1261 -1453 -12557 -1129 9586 -5200 -1929
6337a929M735o458j0124l291Lk392J976m432O457R059q18m698L20J1917p704J8811
6321A1432j715k1769j0537k266L955n786Q602R326J2461J5622L387j4251k5470
6308a7009J283N200J9549j2162o026p381Q178P004j3259j685J3361J607p095L602
6294d833Q45m359J0891N921J085J1898n931k896l225n066j066J6643O350L399
6280B9656j7662k4440p146l342J904J8401J5080j656Q011j25o141j0614l930P864
6266E860m851l020j7578Q247J8453O921o861o883j1159o144P015O673O773j3440
6252i994k4852M706N721j802L800n847j3987o187N947J7519M866o200k110j054
6238b9474P124J328r662N933K2282j050j4157L315R658j5244j3411M808J3425
$$ plain form
6337 -1929 2806 -3652 -13776 -17067 -17064 -19456 -17480 -21912 -15455 -6396 -7214 -11912 -11592 325 -7379 11432
6321 11432 9717 -12052 -22589 -24855 -20900 -26686 -18084 -8758 3703 19325 22712 8461 -17009
6308 -17009 -15726 -10526 9023 -3139 -9165 -16546 -8368 -1364 -14623 -16308 -2947 -1340 -8435 -4833
6294 -4833 -3988 -8347 2544 8465 9550 21448 15517 12621 9396 4330 3264 19907 26257 29656
6280 29656 11994 -12446 -19592 -22934 -21030 -2629 12451 10795 18806 18681 12540 1926 -2004 5860
6266 5860 1009 -2011 -19589 -11342 7111 14032 7171 288 -10871 -17015 -10000 -3327 3446 -9994
6252 -9994 -34846 -30140 -24419 -26221 -22421 -28268 -42255 -48442 -42495 -24976 -20110 -26310 -28420 -29474
6238 -29474 -22350 -21022 -30684 -24751 -2469 -3519 -17676 -14361 -4703 -19947 -33358 -28550 -15125
6225a5125N962o991l084J2008r66r827j2153J9947N89k280M107M121Q64O166L76
6210C714l580L970Q407j0699j2343P484M350O321K71q527l925J8029o367j5725
6196h620M665K02j3756o373P710q609J2597j5450k6993K64J3911L5063Q310j3486
6182a0565m5J6940R406O000j687j9037l854j698k184j3551m518j2230J0633N336
6168b1054R943P809K368Q919k752j0350j988L766j806J8525Q437O213j9924k6856
6154a8750J9094L85m517k6J244P205j3866q649K1410R585m238k0896m677K4712
6140H016J2212j6015j4405L739m378j1359q589P79K2322R145J8470J1107j510
6127B9534j4290k0740M757m069J5241q535j3218Q011j4835k828K0558J776k8789
$$ plain form
6225 -15125 -9163 -16154 -19238 -7230 -8196 -18023 -30176 -10229 -9640 -11920 -7813 -3692 -2828 3338 3714
6210 3714 134 4104 12511 1812 -10531 -3047 1303 7624 7895 -632 -4557 13472 7105 -8620
6196 -8620 -3955 -3753 -17509 -23882 -16172 -24781 -12184 -27634 -54627 -54363 -40452 -5389 2921 -10565
6182 -10565 -10610 6330 15736 21736 20049 1012 -2842 -4540 -6724 -20275 -24793 -37023 -26390 -21054
6168 -21054 -11111 -3302 -934 7985 5233 -5117 -7105 -3339 -5145 13380 21817 28030 8106 -18750
6154 -18750 344 729 -3788 -3814 -2570 4635 -9231 -17880 3530 13115 8877 -12019 -16696 8016
6140 8016 20228 4213 -10192 -6453 -10831 -22190 -30779 -30000 -7678 1467 19937 31044 29534
6127 29534 15244 -5496 -739 -4808 10433 1898 -11320 -3309 -18144 -20972 -414 1362 -27427
6114b7427l190J9957J4877n635L50J342l959q777P085O94R527k552m050j4397
6100a6155L450J9425k97N22l154r94q394J672n158N396j2860P802l367R68p999
6085a9143J074l734j088P485m914Q101J3125J8532Q9n30j1163j0162L134J2596
6071A3402J0382P95O47m275q275k6506l0176j893J5051J2921K5641J5541k1704
6058A551j6551J1336m149o265k520K7965J0561j8534l753N951r090N674o633j0226
6044a4683R709q640J317m616J9704J2898N76k6529k0317J1784O421j1945K245
6031b2076R415Q203J5250p319m334J5840j3116k2540K159j0250J769J7832J2042
6018B875j1378k103j0053J1247K001m962J2424j733R911J6629j3741r838N84r24
$$ plain form
6114 -27427 -30617 -10660 4217 -1418 -1068 274 -3685 -12462 -5377 -4683 4844 2292 -1758 -16155
6100 -16155 -12705 6720 6423 6945 3791 2797 -5597 -3925 -9083 -3687 -16547 -8745 -12112 -11144 -19143
6085 -19143 -18069 -21803 -22891 -15406 -20320 -12219 906 19438 19527 18997 7834 -2328 806 13402
6071 13402 23784 24579 25226 20951 12676 -13830 -44006 -45899 -30848 -17927 7714 23255 1551
6058 1551 -15000 -3664 -7813 -14078 -16598 11367 21928 3394 -359 5592 -3498 2176 -4457 -14683
6044 -14683 -4974 -13614 -12297 -16913 2791 15689 16265 -10264 -30581 -18797 -12376 -24321 -22076
6031 -22076 -12661 -4458 10792 3473 -861 14979 1863 -20677 -18518 -28768 -26999 -9167 2875
6018 2875 -8503 -10606 -20659 -9412 -7411 -12373 51 -1682 8229 24858 11117 1279 1863 939
6004I39r765j1195N151m539j7389N989J1077K767j449O254R084n954N797J6107
5990A2874n528k0062K323n807l061j3521K29P228R34P273J5363Q337p88j3145
5976g351j2585o929l11n768k99J738J8276J4851n413j2514k3033N787o73j8712
5962e2936L937K1402Q617L951J6607M409O687o024l252j5897m790O535K4755J3050
5948B7051j6330o115l039J3420J1657p196j8611p403M204Q543L955k6334j2460
5935b8658J3981m685j8380k707m547J1747P757j88J749J3352j4020j3743J9031
5922a9311J3073j41j4710o169L040O393K6036K7572j005l1876o473N692J8506
5909B0627j1095j8846r276K975l563K088O546N557j2868J407K3700p092p964M903
$$ plain form
6004 939 -8826 -20021 -14870 -19409 -36798 -30809 -19732 -16965 -18414 -12160 -3076 -9030 -3233 12874
5990 12874 7346 -12716 -10393 -16200 -19261 -32782 -32553 -25325 -24391 -17118 -1755 6582 5794 -7351
5976 -7351 -19936 -26865 -27176 -32944 -33243 -31505 -13229 1622 -3791 -16305 -39338 -33551 -34224 -52936
5962 -52936 -48999 -27597 -18980 -15029 1578 5987 12674 6650 3398 -12499 -17289 -10754 14001 27051
5948 27051 10721 4606 1567 14987 26644 19448 837 -6566 -2362 6181 10136 -16198 -28658
5935 -28658 -14677 -19362 -37742 -40449 -44996 -33249 -25492 -25680 -23931 -10579 -24599 -38342 -19311
5922 -19311 -6238 -6379 -21089 -27258 -24218 -17825 8211 35783 34778 2902 -3571 2121 20627
5909 20627 9532 -9314 -18590 -15615 -19178 -17090 -10544 -4987 -17855 -16448 7252 160 -7804 -2901
5895b901J7054O903p059o866J2981J6137q768l43l305p009j3258J5859j7508q06
5881A111J1729j5709m331J0132O174r21m701j6284P85P240o237n34J8202l172
5867C484q73n680M880J8029R987p672k1487q245O989j4018K692M922L128K3075
5853A9211J993k2421l78j4215q512Q757m365J1127J4572L66o642J2182j2869R262
5839H068O261l403j1238n257m744k385M226L543R955o299j528K789k483j2426
5825a4921n774Q600K8985J8109k892k4747j6340J3475J4471k4955k3753j509M308
5812b6943J0500M478J2583M166p531j971k83r32J6681P312j0452p465j0077Q195
5798a739Q242l336M381K766K26J5614q831k3418j5182l33p38L937R231P228m792
$$ plain form
5895 -2901 14153 21056 13997 7131 20112 36249 27481 27138 23833 16824 3566 19425 1917 1111
5881 1111 12840 -2869 -7200 2932 9106 8185 3484 -12800 -12015 -4775 -11012 -11546 6656 3484
5867 3484 2611 -3069 1811 19840 29827 22155 668 -7577 -588 -14606 -11914 -6992 -3864 19211
5853 19211 21204 -1217 -1595 -15810 -24322 -15565 -19930 -8803 5769 6135 -507 11675 -1194 8068
5839 8068 14329 10926 -312 -5569 -10313 -12698 -8472 -4929 5026 -1273 -2801 -12 -2495 -14921
5825 -14921 -20695 -12095 16890 34999 32107 7360 -8980 4495 18966 -5989 -29742 -31251 -26943
5812 -26943 -16443 -11965 618 4784 -2747 -4718 -5001 -5933 10748 18060 7608 143 -9934 -1739
5798 -1739 6503 3167 7548 10314 10540 26154 17323 -6095 -21277 -21610 -22348 -18411 -9180 -1952 -6744
5783f744J1602l423j6300j8459J983J0248p510l981J3189r083Q9r780K0217K4827
5769F875O499k587P322p732j0820R635J2733q139j3983K030Q28k958o577j2705
5755a9579J770P211O595j120m946j7955R454J5947J1044M648j6008p220m246J5587
5741A182K1798K074J203l883q35M141K416o596l431J277n346r533m2133O901L5459
5726D694J0448N349M051R127r964k0156L506p402j517l933l585K485j8501L109
5712b2289l305r195N309J1571K715L344L245j1474j7527l882L2841K3134K967
5699A7454k7264j3019K359J5822o205J0948N044j1764k9264K9L8R558n504k1200
5685e2968Q730J5464J219J8632J1825k0424p230J2686L796m536j7411j2740K2351
$$ plain form
5783 -6744 4858 1435 -14865 -33324 -31341 -21093 -28603 -32584 -19395 -28478 -28389 -38169 -17952 6875
5769 6875 13374 10787 18109 10377 -443 9192 21925 13786 -197 1833 2661 -297 -6874 -19579
5755 -19579 -17809 -10598 -4003 -5123 -10069 -28024 -18570 -2623 8421 13069 -2939 -10159 -14405 1182
5741 1182 22980 25054 26257 22374 21539 25680 28096 21500 18069 19346 14000 4467 -37666 -30765 4694
5726 4694 15142 20491 24542 33669 23705 3549 7055 -347 -1864 -5797 -9382 -6897 -25398 -22289
5712 -22289 -25594 -34789 -29480 -17909 -15194 -11850 -8605 -20079 -37606 -41488 -8647 14487 17454
5699 17454 -9810 -22829 -20470 -4648 -10853 95 5139 -6625 -35889 -35860 -35822 -26264 -31768 -52968
5685 -52968 -44238 -28774 -27555 -8923 2902 -17522 -24752 -12066 -8270 -12806 -30217 -42957 -20606
5672b0606J5776K760l063q719J2003R162M490p604J778k39q841L966r485l788
5658a2410N237N191N236K0481R408k5967k9116J7348n290k1063J460j1544K923
5645c8106J5321Q364o677K688j4465J4818J7592J8383M968k3217n303K722K124
5632g88J4311j417k1430k1740o654Q928M284M726O233O92L06J2559j3372j7190
5618c0552o948O119J6292J798p612L855j94J862J2940m820M839J3271j1574p396
5604h120j0056r250j6552m628J5580P915M967j7773J456J8158l5J2025P759p099
5590e653j646K084M532P028k585j3887l821k814J1532K810n405o481j550K3314
5576G458J4257Q469L767j9917j7698J921l979J463j5014J1285p60K0577m724j3272
$$ plain form
5672 -20606 -4830 -2070 -5133 -13852 -1849 7313 11803 4199 5977 5738 -3103 863 -8622 -12410
5658 -12410 -7173 -1982 3254 23735 33143 7176 -21940 -4592 -9882 -30945 -29485 -41029 -38106
5645 -38106 -22785 -14421 -21098 -18410 -32875 -18057 -465 17918 22886 -331 -5634 -2912 -788
5632 -788 13523 12106 -9324 -31064 -37718 -28790 -24506 -19780 -13547 -12855 -12549 10 -13362 -30552
5618 -30552 -37500 -31381 -15089 -13291 -20903 -17048 -17242 -15380 -2440 -7260 -2421 10850 -724 -8120
5604 -8120 -18176 -27426 -43978 -48606 -33026 -25111 -20144 -37917 -36461 -18303 -18338 -6313 1446 -5653
5590 -5653 -7299 -5215 -683 6345 3760 -10127 -13948 -16762 -5230 -2420 -7825 -14306 -15856 7458
5576 7458 21715 30184 33951 14034 -3664 -1743 -5722 -4259 -19273 -7988 -8748 11829 7105 -6167
5562f167j3810R823J7310Q752j345k6826k1831L316J3372J8287o366J2362K66
5549G143j2838J132R396j0877O566q42m368J906j1550J4149Q435o656l002j7079
5535a8485j1531L0939J5652j0176m464j183j3874L279N790L081O050J2708J0413
5522B8199j1723K49N151j3521j0289K369j7560p166m242O312l577n296K798J0526
5508a7770J998q640l550J987J2693R920o455n91J7242j1863p809O538M86j1365
5494a7179r270J3540K322k687j8043O571J9972Q960j493j7086j0155N381J8499
5481f68K858j2192j2450k1311j3132N268J9247J1944P809j1222q566J3658J3108
5468e649P711k579J3352j3O943J162m016J3102j3952k1847m810J1684j0945j5578
$$ plain form
5562 -6167 -19977 -10154 7156 15908 14563 -12263 -34094 -30778 -17406 881 -5485 6877 7143
5549 7143 -5695 -4563 4833 -6044 522 -320 -4688 -2782 -14332 -183 8252 1596 -1406 -18485
5535 -18485 -30016 923 16575 6399 1935 752 -13122 -9843 -4053 -972 5078 17786 28199
5522 28199 16476 16725 21876 8355 -1934 435 -17125 -24291 -28533 -22221 -25798 -31094 -28296 -17770
5508 -17770 -15772 -24412 -27962 -25975 -13282 -3362 -9817 -10408 6834 -5029 -12838 -6300 -5814 -17179
5494 -17179 -26449 -12909 -10587 -13274 -31317 -24746 -4774 4186 2693 -14393 -24548 -19167 -668
5481 -668 2190 -10002 -22452 -43763 -56895 -51627 -32380 -20436 -12627 -23849 -32415 -18757 -5649
5468 -5649 2062 -517 12835 12822 19765 20927 16911 30013 16061 -5786 -10596 1088 -9857 -25435
5454b5435o01J2322J2930o135o546q805O566J9682J9534j0871p343m581l013J856
5440d40m255q865L540O66q503m747k86j0609K477Q040j21l857J4774M191J355
5425f640P553K132j0489k79K857m6j0360L791K3239J1783J3042O103j4037l322
5411B5327j8264j4186l522N774m658O833J641n278M433N099N425j5970k494J8879
5397I039Q314j688k922j5503j1697N448Q708J2593N216J8230N074r24o916j7582
5383A5390k1948J0791M745p275m590K4574K0529k126P366K340j5065p526n639
5370B1566k917o330j986p334J4466J0352j4047j1218R039o909K874n750Q996J2495
5356B3297J981L701j5628k4004j6200M895L147M035N508J5464o022m409r942J575
$$ plain form
5454 -25435 -26036 -13714 -784 -6919 -13465 -22270 -15704 3978 23512 12641 5298 717 -2296 -440
5440 -440 -4695 -13560 -10020 -9354 -17857 -22604 -22890 -33499 -31022 -22982 -23103 -26960 -12186 -7995 -6640
5425 -6640 913 3045 -7444 -7723 -4866 -4912 -15272 -11481 11758 23541 36583 42686 28649 25327
5411 25327 7063 -7123 -10645 -4871 -9529 -2696 -1055 -6333 -1900 3199 8624 -7346 -9840 9039
5397 9039 17353 15665 12743 -2760 -14457 -9009 -301 12292 17508 35738 40812 39888 32972 15390
5383 15390 -6558 4233 8978 1703 -2887 21687 42216 40090 47456 49796 34731 27205 21566
5370 21566 18649 12319 10333 2999 17465 27817 13770 2552 11591 4682 7556 1806 10802 23297
5356 23297 25278 28979 13351 -10653 -26853 -21958 -18811 -14776 -9268 6196 174 -4235 -14177 -12602
5342a2602J3609j8051j5985M580J0255N5P291J1772K5401k762k6558J1785L947
5329A2737j6736j1700j0572J2786K5060l232j4918q812J0434n8m089m034J7810
5316D676J9110n554q245m527p197n456J7543J7727n544n691J1138j1820q258Q150
5302A6052k297o410j3748r180j8336M848p356J2774L1633N779l828j3604l1357
5289c5030k944K1756Q701Q328L695j6922j0121n508R739N354K4432m336j7258
5276a0114q733r488Q368J5812m996p832N818l689o799Q02J0227J2077o889L199
5262b237L639P622M461k4183k0957p254J5865J8716R478j5032R471M347o464l113
5248e641P30J0132k757j6775k621J8178k169P858k150j1357j3224n268O091q151
$$ plain form
5342 -12602 1007 -17044 -33029 -28449 -18194 -18139 -10848 924 26325 23563 -2995 8790 12737
5329 12737 -3999 -15699 -26271 -13485 11575 8343 -6575 -15387 -4953 -5011 -9100 -13134 4676
5316 4676 23786 18232 9987 5460 -1737 -7193 10350 28077 22533 16842 27980 16160 7902 16052
5302 16052 13755 7345 -6403 -15583 -33919 -29071 -36427 -23653 7980 13759 9931 -3673 -35030
5289 -35030 -37974 -16218 -7517 811 4506 -12416 -22537 -28045 -18306 -12952 11480 7144 -10114
5276 -10114 -18847 -28335 -19967 -4155 -9151 -16983 -11165 -14854 -21653 -20851 -10624 1453 -5436 -2237
5262 -2237 1402 9024 13485 -10698 -31655 -38909 -23044 -4328 5150 -9882 -411 3936 -2528 -5641
5248 -5641 -4911 5221 2464 -14311 -16932 1246 -923 6935 4785 -6572 -19796 -25064 -18973 -27124
5234b7124J0707J2365P449N82l010P603J3469M749m902q759j390N994r344j4484
5220f095p512j1617j620K6532J9433L083Q705k5341K961j2377Q922K925r690k616
5206d307n809j682K881M718K3920q970j4140p494j8668j4962R191p666K86J643
5192d1059j849L047K1396L1434N66j6941j3557l265J7060J327p912q045O043Q139
5178c616j0975n366Q999j175k5356P623j57J1595n071n516J0765J0548j882n652
5164a5236N086l464j0496M861K0837o06Q017j4901P82K973j0744l655l800J847
5150a8499N251Q447P331K0100O489l257k1409j0916P053O7j8349j2023Q664P214
5136a3837o038J7266M003P784k816J448J1243j0770j1415K623j0058l504O377
$$ plain form
5234 -27124 -16417 -4052 3397 3979 969 8572 22041 26790 21888 13129 11739 17733 8389 -6095
5220 -6095 -13607 -25224 -26844 -312 19121 22204 30909 5568 8529 -3848 5074 7999 -1691 -4307
5206 -4307 -10116 -11798 -8917 -4199 19721 10751 -3389 -10883 -29551 -44513 -35322 -42988 -42702 -41059
5192 -41059 -42908 -39861 -18465 12969 13535 -3406 -16963 -20228 -3168 -1841 -9753 -17798 -11755 -3616
5178 -3616 -14591 -19957 -10958 -12133 -37489 -29866 -30023 -18428 -23499 -29015 -18250 -7702 -9584 -15236
5164 -15236 -10150 -13614 -24110 -19249 1588 982 8999 -5902 -5120 -2147 -12891 -16546 -20346 -18499
5150 -18499 -13248 -4801 2530 22630 29119 25862 4453 -6463 590 657 -17692 -29715 -21051 -13837
5136 -13837 -19875 -2609 1394 9178 6362 7810 19053 8283 -3132 -509 -10567 -14071 -7694
5123g694J3158j6021r181n782K490J4072q501j5710J1658K0698l511K988p316
5110h652Q712J1641j0467O267J3099Q423k4237j8898k324n79l288R006n282J2483
5096d096J929j0131l724K6311k6977j7198R722J4418K5007j8813L316q54j6624
5083a7714l591N716K951J3293j099j0938Q603J1224j050j8774J0129K6097J7843
5070D2690j0836J148k125k6140q454k23l207J547J7488l755n292q039j0647K920
5056a2925N63j0352r246J6360Q679k746J3536L919n019M70K833P865m027k2306
5042a2396J3342J0106J2704j796L225O148l502j8179j6742J36K179L153K575J570
5028B523J886o531P657K787Q896K796J4370J0712j5913l0500j633J0942O14r611
$$ plain form
5123 -7694 5464 -10557 -19738 -25520 -23030 -8958 -17459 -33169 -21511 -813 -4324 -1336 -8652
5110 -8652 60 11701 1234 7501 20600 29023 4786 -14112 -16436 -17015 -20303 -11297 -16579 -4096
5096 -4096 -2167 -12298 -16022 10289 -16688 -33886 -24164 -9746 15261 -3552 -236 -1090 -17714
5083 -17714 -21305 -15589 -12638 655 -444 -11382 -2779 8445 7395 -11379 -1250 24847 42690
5070 42690 31854 33002 30877 4737 -3717 -3940 -7147 -5600 11888 8133 2841 -5198 -15845 -12925
5056 -12925 -12362 -22714 -31960 -15600 -6921 -9667 3869 7788 2769 3239 6072 13937 9910 -12396
5042 -12396 946 11052 23756 21960 25185 31333 27831 9652 -7090 -6954 -4775 -1622 953 2523
5028 2523 4409 -2122 5535 8322 17218 20014 34384 45096 29183 -1317 -2950 7992 8606 -1005
5014a005k129J2047J2376r906k6551o332j951o224L183L937j2770J304L105K836
5000b8080P137J9864L4932R165k6154j5619j5889k80N706J3826J7403p288j3363
4987A360l182L025j007J963O409j3065M191n656j391l708j6713P661L602k751
4973a9262q377N078K0464J5632J010j6614j481j8881r328Q991j797q414J48m049
4959c6880J3361J1537j655J0687J623n903J5181J1257L253j2119j6413N743J3756
4946A3428M356k856j5326n232O089n757j0572K451J5890O011K274L240J7001l945
4932B7052k2532l294j2712n052N061M858R788j8177l437J2399n555J4972J35j0737
4918g231Q140N412l431j1622O121J0465n544l907m606J2702q959p512j195Q134
$$ plain form
5014 -1005 -3134 8913 21289 11383 -15168 -21500 -23451 -29675 -26492 -22555 -35325 -34021 -30916 -28080
5000 -28080 -20943 -1079 33853 43018 16864 1245 -14644 -14924 -9218 4608 22011 14723 1360
4987 1360 -1822 1203 196 2159 8568 -4497 -306 -5962 -7353 -11061 -27774 -20113 -16511 -19262
4973 -19262 -27639 -22561 -2097 13535 14545 -2069 -3550 -22431 -31759 -22768 -24565 -32979 -32831 -36880
4959 -36880 -23519 -11982 -13637 -2950 -1327 -7230 7951 19208 22461 10342 -6071 -328 13428
4946 13428 17784 14928 -398 -5630 459 -5298 -15870 -13419 2471 8482 10756 13996 30997 27052
4932 27052 4520 1226 -11486 -16538 -11477 -6619 3169 -15008 -18445 -6046 -11601 3371 3506 -7231
4918 -7231 909 6321 2890 -8732 -2611 7854 2310 -1597 -6203 6499 -2460 -9972 -11167 -3033
4904c033J3402j1729j971K0164j5269k987Q072M635k831o846p215j2768N177K7700
4890A4501K0274J03l0661j1682J582L192J0089J4358n624j3220p70N507J0469
4877A8118q062j1268l3992M504L5057J2629j33m481k856o954R84J8021J628K041
4863B5236M724p158k2710j7828N231J1917j3763m922K0024n130j2271O241j4696
4850b5105p205J0457j2833l344J7455J3336p273j7811O670J6677K0983L979r840
4837F146j3399K674Q653J3312l59L639M129K454j3408j0058L815k83n400k086
4823a71M078j0130o529J5360J1112J7867r631m155k3010l5514J3365L669J0031
4810a3658L6000Q096j4769k3852J0295Q555N677Q882j5708k489Q243l357m637
$$ plain form
4904 -3033 10369 -1360 -3331 16833 1564 -1423 6649 11284 8453 1607 -5608 -18376 -13199 14501
4890 14501 34775 34878 4217 -7465 -5883 -2691 7398 21756 16132 2912 2142 7649 18118
4877 18118 10056 -1212 -35204 -30700 4357 16986 16853 12372 9516 2562 3546 21567 23195 25236
4863 25236 29960 22802 92 -17736 -12505 -588 -14351 -19273 751 -4379 -16650 -10409 -25105
4850 -25105 -32310 -21853 -34686 -38030 -20575 -7239 -14512 -32323 -25653 -8976 12007 15986 6146
4837 6146 -7253 -4579 4074 17386 17027 20666 24795 27249 13841 3783 7598 7315 1915 -171
4823 -171 3907 -6223 -12752 2608 13720 31587 21956 17801 -5209 -40723 -27358 -23689 -13658
4810 -13658 22342 30438 15669 -8183 2112 10667 16344 25226 9518 7029 15272 11915 7278
4797G278j3778p140N257n978J2647J1679j3647j1956R141J0809J0400k175j9448
4784f911k0915l734J7944J3315J3136J0625Q820n037o536k7874j6432J5638l784
4771a1745J6065K0132p718l0924K1660P856p368l467Q15Q668K1505N054j8210
4758B2323r571r818j4870q20n259J023j81P599J4313J3924k7996j3479O508j3518
4744b9822M438J5232N127j07j2884M444J9079j4302L368J8997K315r783l1208
4731b5106O825K3422j5282k750M231m339m786P192M445j7960J594J3995k1296
4718b9815p945N49J1587J3989o34N011R730J8381j842n940Q693m403q181j0187
4704a007J3343R585j975J6705O425o57j5820j1132j1235p439j7737M582p933P480
$$ plain form
4797 7278 -6500 -13640 -8383 -14361 -1714 9965 -3682 -15638 -6497 4312 14712 12537 -6911
4784 -6911 -27826 -31560 -13616 -301 12835 23460 32280 27243 20707 -7167 -23599 -7961 -11745
4771 -11745 4320 24452 16734 -14190 7470 15326 7958 4491 5306 13974 35479 40533 22323
4758 22323 12752 2934 -11936 -12756 -18015 -16992 -17173 -9574 4739 18663 -9333 -22812 -16304 -29822
4744 -29822 -25384 -10152 -5025 -5132 -18016 -13572 5507 -8795 -5427 13570 15885 6102 -25106
4731 -25106 -18281 5141 -10141 -12891 -8660 -12999 -17785 -10593 -6148 -24108 -22514 -8519 -29815
4718 -29815 -37760 -37211 -25624 -11635 -12269 -7258 2472 20853 19011 13071 21764 17361 9180 -1007
4704 -1007 12336 21921 19946 36651 43076 42419 26599 15467 4232 -3207 -20944 -16362 -24295 -16815
4690a6815K0679p975N475n04m484o551n323j5751J8837J6259J3061j7722j1160
4677a1974j0912o842O849K0383P307O532l619o336N76N075R645k861j0093j5506
4663a1776p650o96J5845j100M013J3844l764j2138j0376K2477j81r473J2663o277
4649E411r574n085j9420O97P584Q775j1816N612o579p792Q193J7489R485J0623
4635A3603K982j1655q977j0719j4500J279j676J170K1208J4383P970q23r721K414
4621F938l3711m934J7379L624O213m533o946J0190l415l368N240K418J2963K583
4607A0641M515j0453l264N926J0032k707l386k5763k0900J8739L081L744J442
4594h353l154K774n917j0844P261J2114J5890J262k2174r903J6432J364j4818
$$ plain form
4690 -16815 3864 -4111 1364 860 -3624 -10175 -15498 -31249 -12412 3847 16908 -814 -11974
4677 -11974 -22886 -29728 -22879 -2496 4811 11343 7724 1388 1964 7039 16684 13823 3730 -11776
4663 -11776 -19426 -20122 -4277 -5377 -1364 12480 8716 -3422 -13798 8679 8498 -975 11688 5411
4649 5411 -4163 -9248 -28668 -27971 -20387 -11612 -23428 -17816 -24395 -32187 -23994 -6505 2980 13603
4635 13603 16585 4930 -4047 -14766 -29266 -27987 -29663 -28493 -7285 7098 15068 14245 4524 6938
4621 6938 -26773 -31707 -14328 -10704 -4491 -9024 -15970 -5780 -9195 -12563 -7323 -4905 8058 10641
4607 10641 15156 4703 1439 7365 17397 14690 11304 -14459 -35359 -16620 -13539 -9795 -8353
4594 -8353 -11507 -8733 -14650 -25494 -18233 -6119 9771 11033 -11141 -21044 -4612 -3248 -18066
4581a8066j7903j1405J5442J0103j720p406j13J9968k295r514m137q11o08R258
4567a9207K743j6296J2082J8748J0139j4451j4366k640J2594J0241P998K0586
4555B8171m112j9076N915R834j8687j3813n034r719K931L6913o95j1782p952n383
4541a2489p022k7120l013J4312L4532k5l272M607P261n480q314l078k178j1261
4527b2540j7634l637o265R053j435J6573J2240M932j9354j600M234J0956J1095
4514c382m829J2515J1529j1583j5013Q99n576j2488J450P626J4260j0298J157
4501a3733K569K31M077K2900J2918J7163j7864j4131n343J99J153J4802J3376
4488C8317m95o189k3394j2883J420q933q667o428L641J1460l812J5760M644j0555
$$ plain form
4581 -18066 -35969 -47374 -31932 -21829 -23549 -30955 -31068 -11100 -13395 -22909 -27046 -27857 -28465 -19207
4567 -19207 -16464 -32760 -20678 -1930 8209 -6242 -20608 -23248 -10654 -413 7585 28171
4555 28171 24059 4983 10898 20732 2045 -11768 -16802 -26521 -23590 13323 12628 846 -7106 -12489
4541 -12489 -19511 -46631 -49644 -35332 -800 -825 -4097 510 7771 2291 -6023 -9101 -11279 -22540
4527 -22540 -40174 -43811 -50076 -41023 -42458 -25885 -13645 -8713 -28067 -29667 -25433 -14477 -3382
4514 -3382 -8211 4304 15833 4250 -10763 -9864 -15440 -27928 -26478 -18852 -4592 -14890 -13733
4501 -13733 -11164 -10933 -6856 16044 28962 46125 28261 14130 8787 8986 10139 24941 38317
4488 38317 37822 31633 8239 -4644 -3224 -12157 -20824 -27252 -23611 -12151 -15963 -203 4441 -6114
4474f114q46J0640o851r253Q663L547J7411k55O840k287R211J0774j1417J282
4460C1345K607K58j1181q962M037k785P614R31L045j0383K984m606q948n222j5563
4445a4829L596O563J3155j7513n429j2066k6213K1490J7905k393P673J5673K161
4432I773P519P818r07k841j0161q53j4106j7587J264M837L291J3148j6654q336
4418b3795K0394j178j5398l87J9620r385J3037J415p003p197J4516j9759j4844
4405b9964M295K1860R791J616P38j2862N147o238j8718j4370K1427L2300j819
4392A3203j4471j8233l674Q536R42j1842k2o476J4381J3346q563K293J4923j2838
4378h495m610l965r144J3627N85k0055j3122m070J4133N933K7128J6492P349K45
$$ plain form
4474 -6114 -6960 3680 -3171 -12424 -3761 -214 17197 16942 23782 21495 30706 41480 30063 31345
4460 31345 33952 34210 23029 14067 18104 15319 22933 23864 26909 16526 19510 14904 5956 734 -14829
4445 -14829 -11233 -4670 8485 -9028 -14457 -26523 -52736 -31246 -13341 -15734 -8061 7612 9773
4432 9773 17292 25110 24203 21362 11201 10348 -3758 -21345 -20081 -15244 -11953 1195 -15459 -23795
4418 -23795 -3401 -4579 -19977 -20364 -744 -10129 2908 4323 -2680 -9877 4639 -15120 -29964
4405 -29964 -25669 -3809 5982 7598 8336 -4526 621 -5617 -24335 -38705 -17278 15022 13203
4392 13203 -1268 -19501 -23175 -14639 -13697 -25539 -25561 -32037 -17656 -4310 -12873 -10580 4343 -8495
4378 -8495 -13105 -17070 -26214 -12587 -12002 -32057 -45179 -49249 -35116 -29183 -2055 14437 21786 22031
4364B2031o508L685r363k1391q136j4570o566J3174J2537n103K55m345N500J8112
4350f88J8644j0399j2320O25J1288p912p156K007P893m127j3356L7994j575r697
4336A1221N792j3637j9685Q863L995p746J5117j84j4283Q856J0750m105n024L372
4322C302P765j6125l855J2909P41l892n548K1259J3598j2683j4018k360J2368
4309A3461m422r923J1039p759j1861k553J7039Q854L385J3192j5310n457o450
4296C235J0927K0430j4957j7981r376J962K0488p85o471N509O102Q67J0433q871
4282B1512j3716P01J2084K770j0085l090j1238j895j0736R195K6254o067n068
4269A0621J974r681p639j815J0374k779j678m268J388J2272j6004l725R099J0757
$$ plain form
4364 22031 15523 19208 9845 -11546 -19682 -34252 -40818 -27644 -15107 -20210 -19955 -24300 -18800 -688
4350 -688 17956 7557 -4763 -4138 7150 -762 -7918 -5911 1982 -2145 -15501 22493 20918 11221
4336 11221 17013 3376 -16309 -7446 -3451 -11197 3920 3736 -10547 -1691 9059 4954 -70 3302
4322 3302 11067 -5058 -8913 3996 4737 845 -4703 16556 30154 17471 3453 1093 13461
4309 13461 9039 -884 10155 2396 -9465 -12018 5021 13875 17260 30452 15142 9685 3235
4296 3235 14162 34592 19635 1654 -7722 -5760 14728 13943 7472 12981 19083 19950 30383 21512
4282 21512 7796 8497 20581 23351 13266 10176 -1062 -2957 -13693 -4498 21756 15689 10621
4269 10621 12595 2914 -4725 -6540 3834 1055 -623 -4891 -3503 8769 -7235 -10960 -1861 8896
4255H896L3422j310q606q447j224l012j7878k0052j3920j914K0082N355J846O273
4241d89j953J2605l825J1021k49J1320n314j1525j2544K126J9462k975k0473j4485
4227a7298K1279J6836J668j1695n848Q547J0783k9615Q394L187R107r406o493
4214e54r924j699K142O521L944J849N048R155l87o254Q639J358j6548J938o100
4199h72j4009k66O298r500r42j1817j2022J4497q09l434R353J6230Q333K658j718
4184A980R815r815j3962q633q916L393O211J8348j345j8476j567J0319K1565R897
4170A8814k4072j8173R440J5156O648j0716l473n142Q544L69l832M318O582k878
4156A585m043M756n869q423j0708J5141J596k0628m16J2016K1364O344q202J106
$$ plain form
4255 8896 42318 41008 32402 23955 22731 19719 1841 -18211 -32131 -34045 -13963 -8608 -6762 -489
4241 -489 -2442 10163 6338 17359 17110 28430 23116 11591 -953 1173 20635 17660 -2813 -17298
4227 -17298 3981 20817 22485 10790 4942 13489 24272 -5343 3051 6238 15345 5939 -554
4214 -554 -10478 -12177 -10035 -3514 430 2279 7327 16482 16095 9841 18480 19838 3290 5228 -872
4199 -872 -14881 -15147 -8849 -18349 -19291 -31108 -43130 -28633 -29442 -32876 -23523 -7293 1040 3698 1980
4184 1980 11795 1980 -11982 -20615 -29531 -26138 -19927 -1579 -2924 -21400 -22967 -12648 8917 18814
4170 18814 -5258 -23431 -13991 1165 7813 -2903 -6376 -11518 -2974 -2605 -6437 -2119 4463 1585
4156 1585 -2458 2298 -3571 -11994 -22702 -7561 -5965 -26593 -27009 -14993 6371 12715 4513 5619
4142E619P056J1849q349r049k3097p138P658N666l746j5292r138n638R531J5248
4128a8820J4343j6516j1983K2853n29j3125L862L2011J1135j7541j9216J1580
4116a946Q225q474M547J1580J0144R098P101k02O733J382k2766p467n076k0491
4102g612l880J4493J754o978P700J5133m936m506o859p703j191q442J5302O643
4088H918n56q707N415j0000J031J0821J9714k264o281n175l2927j5175j047J0789
4074b5444J6423q82N460l103j6769l87J5824L564N51J3566J2484K482k2446l029
4060a706N329K0858j990m7P75Q866n861j9510K461J3653L207k2681j5320q9n619
4045a7674J1850j6209m727J3237j252r27n401j506J5802J1929j4910k3331Q80
$$ plain form
4142 5619 12675 24524 16175 7126 -15971 -23109 -15451 -9785 -13531 -28823 -37961 -43599 -34068 -18820
4128 -18820 -4477 -20993 -32976 -10123 -10652 -23777 -19915 12096 23231 5690 -13526 -1946
4116 -1946 6279 -2195 2352 13932 24076 33174 40275 40073 46806 48188 25422 17955 12879 -7612
4102 -7612 -11492 3001 4755 -2223 5477 20610 15674 11168 4309 -3394 -4585 -13027 2275 8918
4088 8918 8362 -345 5070 -4930 -3899 6922 26636 24372 18091 12916 -20011 -35186 -36233 -25444
4074 -25444 -9021 -9903 -4443 -7546 -24315 -24702 -8878 -5314 -4763 8803 21287 23769 1323 -1706
4060 -1706 3623 24481 22491 22444 23219 32085 26224 6714 9175 22828 26035 3354 -11966 -12055 -17674
4045 -17674 -5824 -22033 -26760 -13523 -14775 -15702 -21103 -22609 -6807 5122 -9788 -33119 -32239
4032c2239J1877J6541j0955k3305l143J0732K2374K4903n498k7799Q2M096r612
4019b1946L409J2339O175k464k243j1348m855M429Q312J0862l21j5199l379J1592
4005d637J3377q400p524q382j3223J6700J8833k630j2477k4442K381K5726J6042
3992A1344j0146K061j308q61j6065n274j1589p80L598J2121R930m779N623o279
3978a2404m737J1398J2945n740j9764p144j1773o524j732J2822J7744j915q12
3965a7636o388k893J1068J9161l384K75j975N535j9859L456O151K805K273j1199
3951a2610k871K291M422P311P548k1864j1317J0997q484N301R974m932j402Q794
3937f842J852J5241j2401J2879m89j7347J110J4560j991p593n047j9597k36J1735
$$ plain form
4032 -32239 -20362 -3821 -14776 -38081 -41224 -30492 -8118 16785 11287 -16512 -16430 -12334 -21946
4019 -21946 -18537 -6198 -23 -2487 -4730 -16078 -20933 -16504 -8192 2670 2349 -12850 -16229 -4637
4005 -4637 8740 340 -7184 -15566 -28789 -12089 6744 4114 -8363 -32805 -30424 -4698 11344
3992 11344 1198 3259 1951 1090 -14975 -20249 -31838 -32618 -29020 -16899 -6969 -11748 -6125 -12404
3978 -12404 -17141 -5743 7202 1462 -18302 -25446 -37219 -43743 -45475 -32653 -14909 -16824 -17636
3965 -17636 -24024 -26917 -15849 3312 -72 203 -1772 3763 -16096 -12640 -6489 -3684 -1411 -12610
3951 -12610 -15481 -13190 -8768 -1457 6091 -15773 -27090 -16093 -24577 -19276 -9302 -14234 -15636 -6842
3937 -6842 -4990 10251 -2150 10729 10240 -7107 -5997 8563 6572 -1021 -6068 -25665 -25901 -14166
3923a4166J5429J281J4214L399j7591l3904k0962l022P567J3719K1857o889k326
3910b1394K1629k3864p636R392m124r730n203K3596k04k4868k875L7243J2677
3897D639j5366p506J2444o862J602J2069j491j505K589n043O566L569l423J6455
3883A8737o418l86k612l02k3751p489K0838j05k2422r785K134j293O114J095m018
3868b9663J0481K0004J0506m196j2613n198j5012q957n974J2659J2239n667j783
3855b3174j0209R749p245M203K2490k281J3861R39j6689j3439o670p464L752J6970
3841a5207M135n67j9435k1728P107o70K1726J0555j3415k2190R852J3882p90L1657
3827D912J6181j5940j259o414j0962J621r75j1262o768K667Q787K575R905j508
$$ plain form
3923 -14166 1263 2544 16758 20157 2566 -31338 -52300 -55322 -47755 -34036 -12179 -19068 -21394
3910 -21394 235 -23629 -31265 -21873 -25997 -35727 -40930 -17334 -17538 -42406 -45281 -8038 4639
3897 4639 -10727 -18233 -5789 -12651 -11049 1020 -471 -1976 613 -4430 2136 5705 2282 18737
3883 18737 12319 11933 9321 9019 -14732 -22221 -1383 -1488 -23910 -33695 -31561 -32854 -26740 -25645 -29663
3868 -29663 -19182 822 11328 7132 -5481 -10679 -25691 -34648 -40622 -27963 -15724 -21391 -23174
3855 -23174 -33383 -23634 -30879 -26676 -4186 -6467 7394 8333 -8356 -21795 -28465 -35929 -32177 -15207
3841 -15207 -11072 -11639 -31074 -52802 -45695 -46365 -24639 -14084 -27499 -49689 -39837 -25955 -26745 4912
3827 4912 21093 5153 3894 -2520 -13482 -11861 -12836 -24098 -30866 -28199 -19412 -16837 -6932 -8440
3813h440q234N456M971L201n761n732P679P197M260j630j4890J1551R11j6602
3799a6063j2480K989J4331J7431N52L913K4744j8214k4364P183N235L84j6027
3786a0386J282K4221Q151l531j0153k277n086o013j2877q994J565P53K9967J1274
3772A7896l345k906J799J4537K414j8483M305P00m397J3931l582j6730q769R802
3758G172J7116k730J282n302n752q850L946P085P366j68K54k111o903m787R412
3743A7030J272j3342P411N824J48P050k3996j7538M76J6829j0060K784o846L172
3729i786J6935R561q679L178Q322k811j6798J3216j6725P998K1112L928o160m783
3715A8508j974j4600j9770p088O252J2614M916k995Nr375k0535N182J5162J5509
$$ plain form
3813 -8440 -16674 -11218 -6247 -3046 -8807 -14539 -6860 337 4597 2967 -11923 -372 539 -16063
3799 -16063 -28543 -25554 -11223 6208 6760 10673 35417 17203 -7161 22 5257 5641 -10386
3786 -10386 -9104 15117 23268 19737 9584 7307 2221 -3792 -16669 -25663 -24098 -23345 6622 17896
3772 17896 14551 11645 13444 27981 30395 11912 16217 16917 12520 26451 22869 6139 -2630 7172
3758 7172 24288 21558 22840 17538 11786 2936 6882 13967 21333 21165 21419 19308 12405 7618 17030
3743 17030 18302 4960 12371 18195 18343 25393 1397 -16141 -15665 1164 -8896 -6112 -12958 -9786
3729 -9786 7149 16710 8031 11209 19531 16720 -78 13138 -3587 4411 25523 29451 23291 18508
3715 18508 16534 1934 -17836 -24924 -18672 -6058 -1142 -4137 -4132 -13507 -34042 -28860 -13698 1811
3701A811j491M275J4957O88j9891j5603n010Q629P246j0358Q810P0j0107n863
3687b1837j043N403P860Q756J0805R989p93j366k260P760q009j284J234r096k7218
3672b1099k749J887L784j3868j3545K8311J2594J7222J0094q152j4267j5724r640
3659b5152K6600N981m039j2457N882N602L625L998o966O802j668J0838J2964j1714
3645B0296k4245J074L590R723L198j2134J1565J3120N4j8372j2813j0624j7814
3632c3382J4321J5783Q341P43Q657N779j2886j4287O143J1676l138q214j3241
3619a3705j3054l635K303P804J5422J1196P347k848k0635r642J0916K766k338
3606h103O550J4879q325k0421m257M237r100N92L3700j190m911j4716k2766J9493
$$ plain form
3701 1811 320 4595 19552 20240 349 -15254 -20264 -11635 -4389 -14747 -5937 -5867 -15974 -21837
3687 -21837 -22880 -17477 -9617 -861 9944 19933 19140 17774 15514 23274 15265 13981 15215 6119 -21099
3672 -21099 -23848 -21961 -18177 -32045 -45590 -17279 -4685 12537 22631 14479 212 -15512 -25152
3659 -25152 1448 7429 3390 -9067 -3185 2417 6042 10040 3074 9876 8208 19046 32010 20296
3645 20296 -3949 -2875 715 10438 13636 1502 13067 26187 26241 7869 -4944 -15568 -33382
3632 -33382 -19061 -3278 5063 5806 14463 20242 7356 -6931 -788 10888 7750 -464 -13705
3619 -13705 -26759 -30394 -28091 -20287 -4865 6331 13678 10830 -9805 -19447 -8531 -5765 -8103
3606 -8103 -1553 13326 5001 -15420 -19677 -15440 -24540 -23948 9752 8562 3651 -11065 -33831 -14338
3592a4338K1326q522q439O420J1966J9655p493j6001k5352M430J7898K600j0337
3579f187j16J4676J1698r38m964o344j0276q124k844j0860o917J5471J3129L287
3565F91K0886J3175j3696j4335R31q904q92N288n63n950q332L360J6731k039n792
3550E59R849O809m461k5088r19R61p994K831O462J2157J8898L618k9858k6830
3536c3006J7231K7279j038p229l300j083L267Q843o597r449K057L704J0406j4
3522A1071j559l881l44k338O280j194Q024q181j6457q521J8197J6303o374k5053
3508a4027j030n338O868J5540J5567L68j0595j0638R707N875k0485j3757n778
3495b7723J4223J732m783K802L527r639L601q649R227K7880N66k26r737k376J3541
$$ plain form
3592 -14338 6988 -1534 -9973 -3553 8413 28068 20575 4574 -20778 -16348 1550 4150 -6187
3579 -6187 -6303 8373 20071 19133 14169 7825 -2451 -10575 -13419 -24279 -31196 -15725 -2596 691
3565 691 21577 34752 21056 6721 7652 -1252 -2144 3144 2581 -3369 -11701 -8341 8390 6351 559
3550 559 10408 17217 12756 -12332 -13251 -12290 -20284 -17453 -10991 1166 20064 23682 -6176 -33006
3536 -33006 -15775 11504 10466 3237 -63 -1146 2121 10964 4367 -5082 -3025 679 11085 11071
3522 11071 9512 5631 5287 2949 9229 8035 16059 7878 -8579 -17100 1097 17400 11026 -14027
3508 -14027 -15057 -20395 -13527 2013 17580 17948 7353 -3285 6422 12297 -8188 -21945 -27723
3495 -27723 -13500 -11768 -16551 -13749 -10222 -19861 -16260 -24909 -15682 12198 12764 12538 2801 425 13966
3480A3966J0131m210j4178p824L068J0998r016j4836k891L827N09O198J3558J5705
3466B5005j292q480j0234K99j642R58k5Q482J8434n843k2131r116O169J9470L813
3451B3867j3373q628q006q687J6011K208m314J318P96j2145J0197J3789J7110
3438C0143O930j7024j7527J2619J0133M179k2591j0958r28k638k1717o059J5022
3425b0416J0009L281l709L62K6714P106k2102K070J1107j351J5168j446j2497
3412A4296O178n864j5045J2491J509M675j3020o729J1237j604j4181l88Q556N275
3398G386J3391k3829q276l983R705J2474j3431q679J1075O272r540L410J9255
3385A5230J2317l035N114n553j0674j0200p642J666K6198J2146j6140j1202l227
$$ plain form
3480 13966 24097 19887 5709 -2115 953 11951 2935 -11901 -14792 -10965 -10456 -4258 9300 25005
3466 25005 23713 15233 4999 5298 3656 4614 4589 13071 31505 25662 3531 -5585 584 20054 23867
3451 23867 10494 1866 -6140 -14827 1184 3392 -922 396 1192 -10953 -756 13033 30143
3438 30143 37073 20049 2522 15141 25274 29453 6862 -4096 -5024 -7662 -29379 -35438 -20416
3425 -20416 -10407 -7126 -10835 -10473 16241 23347 1245 3315 14422 13071 28239 26793 14296
3412 14296 20474 14610 -435 12056 13565 18240 5220 -1509 9728 8124 -6057 -6445 2111 7386
3398 7386 20777 -3052 -11328 -15311 -5606 6868 -6563 -15242 -4167 2105 -7435 -4025 15230
3385 15230 27547 24512 29626 24073 13399 3199 -4443 -2777 23421 35567 19427 8225 4998
3372D998K916r511L56o610M155R523Q536N227m795j3345m606k820j526m568p372
3357a9442j4456j1247l173k434J1700j1021M0787R064j7357j3511P382K6336P316
3344I944O304J0109j1353j8258J1088j7068J6174P282j412J0530r893o503L85
3331G329j0406Q013P614r133J201N363q175j4672j1624K204K7437J8750n88k5208
3317a895k5009n354K5396J1851J342k7230P974J5749J1176Q91O518j6244L079
3304H244k025k237L790N671j4076n844m851L657P558J8762o951j0198q978j9367
3290b6845L2317J6703N843q546n309R61n713p541k950j3257O063L0332J310q075
3276A5293n331j378q42Q098m764J554j372N36l490J351p681j6845j7504j4210
$$ plain form
3372 4998 7914 -1597 -1241 -7851 -3696 5827 14363 19590 14795 1450 -3156 -5976 -7502 -12070 -19442
3357 -19442 -33898 -45145 -48318 -50752 -39052 -50073 -9286 -222 -17579 -31090 -23708 2628 9944
3344 9944 16248 26357 15004 -3254 7834 -9234 6940 14222 12810 23340 13447 6944 7329
3331 7329 -3077 4936 12550 3417 4618 9981 1806 -12866 -24490 -22286 5151 23901 23313 -1895
3317 -1895 -26904 -32258 -6862 4989 6331 -20899 -12925 2824 14000 14891 21409 5165 8244
3304 8244 6219 3982 7772 13443 -633 -6477 -11328 -7671 -113 18649 11698 1500 -7478 -26845
3290 -26845 5472 22175 28018 19472 14163 15124 9411 1870 -1080 -14337 -8274 22058 23368 15293
3276 15293 9962 8584 7742 15840 11076 12630 11258 11794 8304 9655 1974 -14871 -32375 -46585
3262d6585J180L2311j253l462j6170n509K7025J5798R078l48r161o079J0264N736
3248A2825q373j0987m619J2078J0645m96m013j602r218j3911n469J299R727Q113
3234d001J3184j080p939N377m704o764J5384K3895K295q054j9690j3781J9373
3221A3495J0001j5385J8865Q631q158k4686O93L159J0266J382j503r957j5845
3208i042j6318O8R873M951j2890J4188K393k6956j2717J2804R535J6491Q303J3182
3194A3865j6650o554O009j6019p06K1435o168k306Q88Q756J8144J3000n12o420
3180B6762j536K09O866P857q979j6684l059J7967p844n937J7863n592j3673k229
3166A1991L060j3717k8541q175Q027K9934J4497j311j6147R08J2966j45L423J564
$$ plain form
3262 -46585 -45405 -13094 -14347 -17809 -33979 -39488 -12463 3335 12413 12065 2904 -3175 7089 12825
3248 12825 4452 -6535 -11154 924 11569 11073 7060 5458 -3760 -17671 -23140 -21841 -12114 -4001
3234 -4001 9183 8103 164 5541 837 -5927 9457 33352 35647 27593 7903 -5878 13495
3221 13495 23496 8111 26976 35607 27449 2763 3456 6615 16881 18263 16760 6803 -9042
3208 -9042 -25360 -25292 -15419 -10468 -23358 -9170 -6777 -33733 -46450 -33646 -24111 -7620 683 13865
3194 13865 -2785 -9339 -3330 -19349 -20055 1380 -4788 -7094 -6206 2550 20694 33694 33182 26762
3180 26762 25226 25435 32301 40158 31179 14495 11436 29403 21559 15622 33485 27893 14220 11991
3166 11991 15051 1334 -27207 -35382 -27355 2579 17076 15765 -382 526 13492 13347 16770 18334
3152A8334O799p753n730K073m163M101m030M320m99j1577L972O181K538l548k419
3137H599n183q814m340P464P067j6943l335L527j4233j3052J0375J4319l974k782
3123b1305l010J2729j756J1725J4723q065q039j0850k002O423J1142m13k6668
3110b5366R76K791L824K5196M87k0501N506O560j4702J5506j0213q680R68K355
3096a5293O773P594K0696J2091m396j6158r116j6230O365R5l079J5439J866J9168
3082B5815l446M967m005o327j7516k3381j470L5748J4291j8794n268l843K798
3069d31J3074J7790p186j6160N926n084j4004R53N267k09j1344Q290l002j9098
3055b5218J3755N908n094J3168K194O219j745l428r809q633R297J6371O880j2046
$$ plain form
3152 18334 25133 17380 11650 13723 9560 13661 9631 13951 13452 1875 5847 12028 14566 11018 8599
3137 8599 3416 -5398 -9738 -2274 4793 -12150 -15485 -11958 -26191 -39243 -28868 -14549 -18523 -21305
3123 -21305 -24315 -11586 -13342 -1617 13106 5041 -2998 -13848 -15850 -9427 1715 1302 -25366
3110 -25366 -24390 -21599 -17775 7421 7908 -12593 -7087 -527 -15229 277 -9936 -18616 -17648 -15293
3096 -15293 -8520 -926 19770 31861 27465 11307 2191 -14039 -7674 -7579 -10658 4781 6647 25815
3082 25815 22369 27336 23331 17004 -512 -23893 -25363 10385 24676 5882 614 -3229 -431
3069 -431 12643 30433 23247 7087 13013 7929 -6075 -5122 145 -64 -11408 -3118 -6120 -25218
3055 -25218 -11463 -5555 -10649 2519 4713 10932 9187 5759 -4050 -12683 -3386 12985 19865 7819
3041G819n895j177p609n778l089r416j21J3547n475o565J0480K992p340o470J5865
3026h232R963Q99j1760M449j6163J0915Q127R800j64N448J2378k596o355j0169
3012F540M87q346j3761K1916K7314p963j0209j3499O812J5081k1229n830r50J5263
2998A1626q573q581R175K962K2534k0195k0457l985K887J7840k311j8193j1768
2985b7039K6918J3759j5717j4647j100N331J6462J7162k7436m845J412q728j506
2972a9974J5568J6369J514p287M606q164R177m544O629J1226p088j7867R690J6712
2958B6567M664j7111O602o89k9213J9576J7913m150k7274J2283J0940r111j2676
2945a679L739n783J4m603J216P838k550o498L430J1296R354j2758M044R566j1069
$$ plain form
3041 7819 1924 747 -6862 -12640 -15729 -25145 -25266 -11719 -17194 -23759 -13279 -10287 -17627 -24097 -8232
3026 -8232 1731 2630 -9130 -4681 -20844 -9929 -1802 7998 7834 13282 25660 23064 16709 6540
3012 6540 7027 -1319 -15080 6836 34150 26187 15978 2479 9291 24372 3143 -2687 -3637 11626
2998 11626 3053 -5528 3647 6609 29143 8948 -11509 -15494 -12607 5233 2922 -15271 -27039
2985 -27039 -121 13638 -2079 -16726 -17826 -12495 3967 21129 -6307 -11152 -9740 -18468 -19974
2972 -19974 -4406 11963 13477 6190 10796 2632 11809 7265 13894 25120 18032 165 9855 26567
2958 26567 31231 14120 20722 20033 -9180 10396 28309 24159 -3115 9168 20108 10997 -1679
2945 -1679 2060 -3723 -3709 -8312 -7096 742 -1808 -8306 -4876 6420 15774 3016 7060 16626 5557
2930E557J084Q828l52j4247j6521k03M695Q076p406M111J2103R243j512j9934
2916f478r108R404k205l260r863O207J8756j0466q465j54J3331Q34j2538L554
2902a0451Q088J993K6022j760k274Q190K101O840o02j8193q503k802J3845n835
2888A6659l9167p670l212K842J5960K0686M187N8N218j6715k496J1815j514n701
2874I50m403L774j0032P460L922P203L160O753q103j0996j5847r551L63J5627
2860i720J6967P421j1010o749K59M924R942j9171j2920P713N846k4042R078K3861
2846B399Q236j4791n621Q894j1534J9769M264r250k69j471j6749L706J3661Q740
2832I984N710O894j279k6702o204K64k824q787P843J8723J0146P1q35J971J4187
$$ plain form
2930 5557 6641 15469 15117 870 -15651 -15854 -11159 -3083 -10489 -6378 5725 14968 13456 -6478
2916 -6478 -15586 -6182 -8387 -11647 -21510 -15303 3453 -7013 -15478 -15632 -2301 -1467 -14005 -10451
2902 -10451 -2363 -370 25652 23892 21618 29808 31909 38749 38147 19954 11451 8649 22494 16659
2888 16659 -22508 -30178 -33390 -30548 -14588 6098 10285 10343 15561 -1154 -3650 8165 6651 950
2874 950 -3453 321 -9711 -2251 1671 8874 12034 18787 10684 -312 -16159 -25710 -25347 -9720
2860 -9720 7247 14668 3658 -3091 -2832 2092 12034 -7137 -20057 -12344 -6498 -30540 -21462 2399
2846 2399 10635 -4156 -9777 -883 -12417 7352 11616 2366 2097 626 -16123 -12417 1244 9984
2832 9984 15694 22588 21309 -5393 -11597 -11333 -14157 -22944 -15101 3622 13768 13839 13004 14975 29162
2817B9162l830M394N127j6278j586k089k917k457J2965j1738p525K1747p399j3372
2803D204j0203J3375j5411j2713J6350J5045p968K399O862K435k213j4151O40
2790a349m414P348l772J0578R204Q336l53j6092n210k3173J9420J7381J6366j861
2776C2409k0525j2055j5115K62j271P006J2741O570J4242j6330r386J0738j552
2763G734q337M425j039p123q901j8155P256K3076j1770Q38J0815L190K3274J5358
2749D0641J2399j3937j3305j3568k8388m1919j924J7366J538J3263L8817j1846
2737h63J12R224j6156J4692o98j5364J484O33l469J8574J0446n725l796N598j751
2722A2941k438n915R69R399R768L724L395N707j4527j6549j912J3737L686j6048
$$ plain form
2817 29162 25332 29726 34853 18575 16989 14900 11983 9526 22491 10753 3228 24975 17576 4204
2803 4204 -5999 7376 -8035 -20748 -4398 10647 2679 5078 11940 14375 12162 -1989 -1349
2790 -1349 -5763 1585 -2187 8391 17595 25931 25578 9486 4276 -18897 523 17904 34270 32409
2776 32409 11884 -171 -15286 -15024 -16295 -9289 3452 10022 24264 7934 -1452 9286 7734
2763 7734 -603 3822 2783 -4340 -13241 -31396 -24140 -1064 -12834 -11996 -1181 2009 25283 40641
2749 40641 53040 39103 25798 12230 -16158 -58077 -60001 -42635 -41097 -27834 10983 -863
2737 -863 -751 8473 -7683 7009 6311 -9053 -7569 -6936 -10405 8169 18615 12890 9094 14692 12941
2722 12941 10503 4588 5557 14956 24724 28448 31843 37550 23023 6474 4562 18299 21985 5937
2708E937j8823M812J7238J1405j953n848k2546p912N712J8765J8745j0667q523
2695F342j7697m559P029q149j1413J8480P154J0791n043k549k701j1393o637o804
2681b7149o923J6718M434j534k539N608M113K17m026j0653J5409K5528K0572M337
2667D4112j3922j5103J068r148l486q170j4611r395R283J2780p627r702J7259
2654f662q340j5701j303O828Q413J2149j8209J634J6960o212k327J7791J8460
2641B3481o019k9882k1012N934M480K3345j1394p8l378P402o109L60M192K630
2627f048K1550j8158m484J0695p222k373Q008k657j9404K676K3716J4143l984
2614A6458J2183j8453j2074k341J7837l077q797j8419o684J7754J2544k1159m294
$$ plain form
2708 5937 -12886 -8074 9164 20569 18616 12768 -9778 -17690 -11978 6787 25532 14865 6342
2695 6342 -11355 -15914 -8885 -17034 -28447 -9967 -2813 7978 2935 386 -2315 -13708 -20345 -27149
2681 -27149 -34072 -17354 -12920 -14454 -16993 -11385 -7272 -7055 -11081 -21734 -6325 19203 39775 44112
2667 44112 30190 15087 16155 7007 3521 -4649 -19260 -28655 -19372 -6592 -14219 -23921 -6662
2654 -6662 -15002 -30703 -32006 -25178 -16765 -4616 -22825 -21191 -4231 -10443 -12770 5021 23481
2641 23481 17462 -12420 -33432 -27498 -23018 327 -11067 -11145 -14523 -7121 -13230 -12870 -8678 -6048
2627 -6048 15502 -2656 -7140 3555 -3667 -6040 1968 -689 -20093 -17417 6299 20442 16458
2614 16458 28641 10188 -1886 -4227 13610 10533 1736 -16683 -23367 -5613 6931 -14228 -18522
$$ [...]
##END NTUPLES=NMR SPECTRUM
##END=
