##TITLE=Analysis number 313058
Compound Code cc 45214
Book Reference 397/78/1
Project Code adrs
Chemist Name brucer
##JCAMPDX= 6.0         $$ Bruker NMR JCAMP-DX V2.0
##DATA TYPE= NMR SPECTRUM
##DATA CLASS= NTUPLES
##ORIGIN= Bruker BioSpin GmbH
##OWNER= NMR
$$ XWIN-NMR		Version 3.5
$$ Wed Aug 24 12:27:34 2005 GMT Daylight Time (UT+1h)  MAYBRIDGE\NMR@NMR_250MHZ
##.OBSERVE FREQUENCY= 250.131544655141
##.OBSERVE NUCLEUS= ^1H
##.ACQUISITION MODE= SIMULTANEOUS (DQD)
##.ACQUISITION SCHEME= undefined
##.AVERAGES= 16
##.DIGITISER RES= 18
##SPECTROMETER/DATA SYSTEM= dpx250
##.PULSE SEQUENCE= zg30
##.SOLVENT NAME= CDCl3
##.SHIFT REFERENCE= (INTERNAL, CDCl3, 0, 16.522)
##AUDIT TRAIL= $$ (NUMBER, WHEN, WHO, WHERE, WHAT)
$$ ##TITLE= Audit trail, XWIN-NMR		Version 3.5
$$ ##JCAMPDX= 5.01
$$ ##ORIGIN= Bruker BioSpin GmbH
$$ ##OWNER= NMR
$$ C:\u/data/dgb/nmr/ADRS/8490/pdata/1/auditp.txt
$$ ##AUDIT TRAIL=  $$ (NUMBER, WHEN, WHO, WHERE, WHAT)
(   1,<2005-08-24 12:27:14.74 +100>,<MAYBRIDGE\NMR>,<NMR_250MHZ>,
      <created by zg, POWCHK disabled, PULCHK disabled
       configuration hash MD5:
       62 19 C7 07 E1 42 D1 B7 37 6C 3D D0 77 39 F9 E6
       data hash MD5: 64K
       43 6E D8 06 31 E8 4F 2A 43 9C 27 ED FD 4D C3 C5>)
(   2,<2005-08-24 12:27:25.91 +100>,<MAYBRIDGE\NMR>,<NMR_250MHZ>,
      <Start of raw data processing
       ef LB = 0.3 FT_mod = 6 PKNL = 1 SI = 32K 
       data hash MD5: 32K
       74 55 56 DF 14 A6 59 23 59 D7 71 63 8C A3 FC 7C>)
(   3,<2005-08-24 12:27:27.63 +100>,<MAYBRIDGE\NMR>,<NMR_250MHZ>,
      <apk 
       data hash MD5: 32K
       A4 44 F8 9A 7B D7 3B DF 14 86 4D 80 36 79 3A 52>)
(   4,<2005-08-24 12:27:28.36 +100>,<MAYBRIDGE\NMR>,<NMR_250MHZ>,
      <abs ABSG = 5 
       data hash MD5: 32K
       3D 3C D5 1D C3 74 84 4C 55 07 50 66 00 AB 17 48>)
$$ ##END=
$$ 
$$ hash MD5
$$ 10 BB C7 80 57 DA C5 80 8C D5 D0 A8 5A 17 B6 5D
##$RELAX= 
##$RELAX= 
##$RELAX= 
##$RELAX= 
##$RELAX= 
##$RELAX= 
##$RELAX= 
$$ Bruker specific parameters
$$ --------------------------
##$DU= <C:\u>
##$EXPNO= 8490
##$NAME= <ADRS>
##$PROCNO= 1
##$TYPE= <nmr>
##$USER= <dgb>
##$AMP= (0..31)
100 100 100 100 100 100 100 100 100 100 100 100 100 100 100 100 100 100 
100 100 100 100 100 100 100 100 100 100 100 100 100 100 
##$AQSEQ= 0
##$AQ_mod= 3
##$AUNM= <au_zg>
##$AUTOPOS= <26 >
##$BF1= 250.13
##$BF2= 250.13
##$BF3= 250.13
##$BF4= 250.13
##$BF5= 500.13
##$BF6= 500.13
##$BF7= 500.13
##$BF8= 500.13
##$BYTORDA= 1
##$CFDGTYP= 0
##$CFRGTYP= 5
##$CHEMSTR= <none>
##$CNST= (0..31)
1 1 145 1 1 1 1 1 1 1 1 1 1 1 1 1 1 1 1 1 1 1 1 1 1 1 1 1 1 1 1 1 
##$CPDPRG= <>
##$CPDPRG1= <>
##$CPDPRG2= <>
##$CPDPRG3= <>
##$CPDPRG4= <mlev>
##$CPDPRG5= <mlev>
##$CPDPRG6= <mlev>
##$CPDPRG7= <mlev>
##$CPDPRG8= <mlev>
##$CPDPRGB= <>
##$CPDPRGT= <>
##$D= (0..31)
0 1 0 0 0 0 0 0 0 0.06 0 0 0 0 0 0 0.0002 0 0 0 0 0 0 0 0 0 0 0 0 0 0 
0 
##$DATE= 1124882833
##$DBL= (0..7)
120 120 120 120 120 120 120 120 
##$DBP= (0..7)
150 150 150 150 150 150 150 150 
##$DBP07= 0
##$DBPNAM0= <>
##$DBPNAM1= <>
$$ [...]
##$SUBNAM7= <"">
##$SUBNAM8= <"">
##$SUBNAM9= <"">
##$SW= 20.6930455092707
##$SWIBOX= (0..15)
0 0 3 0 0 0 0 0 0 0 0 0 0 0 0 0 
##$SW_h= 5175.983436853
##$TD= 65536
##$TD0= 1
##$TE= 295.16
##$TE2= 300
##$TE3= 300
##$TEG= 300
##$TL= (0..7)
0 120 120 120 120 120 120 120 
##$TP= (0..7)
150 150 150 150 150 150 150 150 
##$TP07= 0
##$TPNAME0= <>
##$TPNAME1= <>
##$TPNAME2= <>
##$TPNAME3= <>
##$TPNAME4= <>
##$TPNAME5= <>
##$TPNAME6= <>
##$TPNAME7= <>
##$TPOAL= (0..7)
0.5 0.5 0.5 0.5 0.5 0.5 0.5 0.5 
##$TPOFFS= (0..7)
0 0 0 0 0 0 0 0 
##$TUNHIN= 0
##$TUNHOUT= 0
##$TUNXOUT= 0
##$USERA1= <user>
##$USERA2= <user>
##$USERA3= <user>
##$USERA4= <user>
##$USERA5= <user>
##$V9= 5
##$VALIST= <valist>
##$VCLIST= <CCCCCCCCCCCCCCC>
##$VD= 0
##$VDLIST= <DDDDDDDDDDDDDDD>
##$VPLIST= <PPPPPPPPPPPPPPP>
##$VTLIST= <TTTTTTTTTTTTTTT>
##$WBST= 1024
##$WBSW= 4
##$XGAIN= (0..3)
0 0 0 0 
##$XL= 0
##$YL= 0
##$YMAX_a= 332305
##$YMIN_a= -558845
##$ZGOPTNS= <>
##$ZL1= 120
##$ZL2= 120
##$ZL3= 120
##$ZL4= 120
##$ABSF1= 16.522
##$ABSF2= -4.171173
##$ABSG= 5
##$ABSL= 3
##$ALPHA= 0
##$AQORDER= 0
##$ASSFAC= 0
##$ASSFACI= 0
##$ASSFACX= 0
##$ASSWID= 0
##$AUNMP= <proc_1d>
##$AZFE= 0.1
##$AZFW= 0.1
##$BCFW= 0
##$BC_mod= 0
##$BYTORDP= 0
##$COROFFS= 0
##$CY= 12.5
##$DATMOD= 1
##$DC= 0
##$DFILT= <>
##$DTYPP= 0
##$F1P= 14.0000005364418
##$F2P= -0.99999901652339
##$FCOR= 0.5
##$FTSIZE= 32768
##$FT_mod= 6
##$GAMMA= 0
##$GB= 0
##$INTBC= 1
##$INTSCL= 1
##$ISEN= 128
##$LB= 0.3
##$LEV0= 0
##$LPBIN= 0
##$MAXI= 10000
##$MC2= 0
##$MEAN= 0
##$ME_mod= 0
##$MI= 0
##$NCOEF= 0
##$NC_proc= -5
##$NLEV= 6
##$NOISF1= 0
##$NOISF2= 0
##$NSP= 0
##$NTH_PI= 0
##$NZP= 0
##$OFFSET= 16.522
##$PC= 1
##$PHC0= -75.6429
##$PHC1= 3.487836
##$PH_mod= 1
##$PKNL= yes
##$PPARMOD= 0
##$PSCAL= 4
##$PSIGN= 0
##$REVERSE= no
##$SF= 250.13
##$SI= 32768
##$SIGF1= 0
##$SIGF2= 0
##$SINO= 400
##$SIOLD= 32768
##$SREGLST= <1H.CDCl3>
##$SSB= 0
##$STSI= 32768
##$STSR= 0
##$SW_p= 5175.98343685301
##$SYMM= 0
##$S_DEV= 0
##$TDeff= 65536
##$TDoff= 0
##$TI= <Analysis number 999999
Compound Code 99
Book Reference 9
Project Code 9>
##$TILT= no
##$TM1= 0
##$TM2= 0
##$TOPLEV= 0
##$USERP1= <user>
##$USERP2= <user>
##$USERP3= <user>
##$USERP4= <user>
##$USERP5= <user>
##$WDW= 1
##$XDIM= 32768
##$YMAX_p= 455996680
##$YMIN_p= -310673
$$ End of Bruker specific parameters
$$ ---------------------------------
##NTUPLES= NMR SPECTRUM
##VAR_NAME=  FREQUENCY,     SPECTRUM/REAL,   SPECTRUM/IMAG
##SYMBOL=    X,             R,               I
##VAR_TYPE=  INDEPENDENT,   DEPENDENT,       DEPENDENT
##VAR_FORM=  AFFN,          ASDF,            ASDF
##VAR_DIM=   32768,         32768,           32768
##UNITS=     HZ,            ARBITRARY UNITS, ARBITRARY UNITS
##FACTOR=    0.157963299565203, 1,           1
##FIRST=     4132.6476996994, 0,             0
##LAST=      -1043.33573715361, 0,           0
##MIN=       -1043.33573715361, -310673,     0
##MAX=       4132.6476996994, 455996680,     0
$$ Real data points
##PAGE= N=1
##DATA TABLE= (X++(R..R)), XYDATA
$$ [...]
$$ plain form
17348 280866 252377 326687 324208 277644 354006 369065 331978 358387 369604 379050 394899 409473
17336 409473 410913 506692 559860 512892 496945 574526 591704 573997 578911 558813 488862 367473
17324 367473 305844 293580 332006 375294 428716 432825 456100 601837 607952 580364 578497 566647
17312 566647 633900 643655 702382 726946 789854 797020 830947 825281 834198 867147 935792 981925
17300 981925 972762 983363 904495 806445 731308 670850 678814 701921 660519 757280 837186 906046
17288 906046 911041 958441 1020777 1120149 1224363 1366092 1482824 1569944 1566324 1445339 1331868
17277 1331868 1233573 1152675 1096163 1118855 1151514 1187593 1299764 1388876 1541006 1673950 1766927
17266 1766927 1800697 1935980 2035307 2159082 2386269 2683364 2958949 3115064 3243420 3484721
$$ packed form
17348B80866k8489P4310k479m6564P6362J5059l7087K6409J1217R446J5849J4574
17336D09473J440R5779N3168m6968j5947P7581J7178j7707M914k0098o9951j21389
17324C67473o1629j2264L8426M3288N3422M109K3275J45737O115k7588j867j1850
17312E66647O7253R755N8727K4564O2908P166L3927n666Q917L2949O8645M6133
17300I81925r163J0601p8868r8050p5137o0458P964K3107m1402R6761P9906O8860
17288I06046M995M7400O2336R9372J04214J41729J16732Q7120l620j20985j13471
17277A331868r8295q0898n6512K2692L2659L6079J12171Q9112J52130J32944R2977
17266A766927L3770J35283R9327J23775K27187K97095K75585J56115J28356K41301
$$ plain form
17256 3484721 3797925 4238406 4676894 5275680 6052608 6844920 7907264 9314701 11053502
17247 11053502 13210898 15846612 19017130 22627594 26468371 30505433 35072115 40271321
17239 40271321 45944108 52022440 59259179 67819160 76989829 86546202 96502283 105924441
17231 105924441 114537525 123541489 132155528 139056114 145471975 151222557 154044671 153983075
17223 153983075 152023351 146014396 135935216 126859531 120963918 116904061 114917557 116277848
17215 116277848 120282671 125757240 131503266 135604437 136610816 135433566 133264324 129511656
17207 129511656 123249551 116046491 110871288 108385154 107322496 107555419 108940097 110552681
17199 110552681 111746492 112204843 110573531 106670381 102951821 100448848 98326698 96509218
$$ packed form
17256C484721L13204M40481M38488N98786P76928P92312J062344J407437J738801
17247A1053502K157396K635714L170518L610464L840777M037062M566682N199206
17239D0271321N672787O078332P236739Q559981R170669R556373R956081R422158
17231A05924441Q613084R003964Q614039O900586O415861N750582K822114o1596
17223A53983075j959724o008955j0079180r075685n895613m059857j986504J360291
17215A16277848M004823N474569N746026M101171J006379j177250k169242l752668
17207A29511656o262105p203060n175203k486134j062658K32923J384678J612584
17199A10552681J193811M58351j631312l903150l718560k502973k122150j817480
$$ plain form
17191 96509218 95743314 96432078 97139901 97196717 97800842 98902966 98999005 98132677 96558898
17182 96558898 93100921 87737833 82289217 76655944 70230322 64279256 59336034 54799834
17174 54799834 50620497 46840155 43012102 39039883 35365861 32006490 28907204 26190082
17166 26190082 24074284 22409926 20998135 19846098 18919349 17996115 17198384 16492057 15836305
17157 15836305 15148298 14476479 13859772 13208631 12644168 12113260 11522121 10906524 10373706
17148 10373706 9929223 9488232 9050204 8594948 8250163 7861926 7396342 7066602 6758545
17139 6758545 6397130 6053489 5755525 5508082 5302607 5120809 4820889 4628023 4543772 4420819
17129 4420819 4283966 4122294 3961321 3853784 3715834 3546541 3477342 3422063 3279446 3175406
$$ packed form
17191I6509218p65904O88764P07823N6816O04125J102124R6039q66328j573779
17182I6558898l457977n363088n448616n633273o425622n951066m943222m536200
17174E4799834m179337l780342l828053l972219l674022l359371l099286k717122
17166B6190082k115798j664358j411791j152037r26749r23234p97731p06327o55752
17157A5836305o88007o71819o16707o51141n64463n30908n91139o15597n32818
17148A0373706m44483m40991m38028m55256l44785l88237m65584l29740l08057
17139F758545l61415l43641k97964k47443k05475j81798k99920j92866q4251j22953
17129D420819j36853j61672j60973j07537j37950j69293o9199n5279j42617j04040
$$ plain form
17119 3175406 3089150 2972260 2910845 2862369 2876381 2803278 2703939 2682505 2652683 2575134 2521210
17108 2521210 2445733 2358622 2275084 2236448 2212167 2217533 2153472 2148485 2130992 2082316 2101024 2046289
17096 2046289 1969869 1922699 1951845 1935613 1911146 1977896 1948499 1887196 1887996 1928214 1980499 2029642
17084 2029642 2067348 2150475 2244891 2295228 2300894 2403353 2562277 2766841 2941574 3046180
17074 3046180 3124828 3301140 3561527 3815859 4049624 4387146 4730537 5253042 6055108 7058318
17064 7058318 8180447 9593063 11570132 14337830 17874114 22291910 27833254 34212291
17056 34212291 41057819 47921695 53792498 57945093 60394399 60792654 60375152 60285435 60726104
17047 60726104 61257871 61323040 60655884 58730603 56669273 55530066 55553829 56753702 58311401
$$ packed form
17119C175406q6256j16890o1415m8476J4012p3103r9339k1434k9822p7549n3924
17108B521210p5477q7111q3538l8636k4281N366o4061m987j7493m8676J8708n4735
17096B046289p6420m7170K9146j6232k4467O6750k9397o1303Q00M0218N2285M9143
17084B029642L7706Q3127R4416N0337N666J02459J58924K04564J74733J04606
17074C046180P8648J76312K60387K54332K33765L37522L43391N22505Q02066J003210
17064G058318J122129J412616J977069K767698L536284M417796N541344O379037
17056C4212291O845528O863876N870803M152595K449306L98255m17502q9717M40669
17047F0726104N31767O5169o67156j925281k061330j139207K3763J199873J557699
$$ plain form
17038 58311401 59268234 59284673 57932620 56184031 54840466 53696698 52258443 50065135
17030 50065135 46618542 41407401 35614971 30256588 25720798 22358272 19973911 18399626
17022 18399626 17275753 16377073 15740247 15265542 14857199 14713691 14807425 15161766 15853631
17013 15853631 16869801 18349043 20389759 23139332 26786282 31242599 36487369 42266020
17005 42266020 48108794 52976903 56281915 58012001 57985052 57191079 56792495 56831981 56936987
16996 56936987 56678277 55743198 53830442 51999448 51164647 51454245 52733377 54203919 55103987
16987 55103987 54993233 53582144 51803436 50387352 49156371 47652082 45392051 42003634
16979 42003634 37133654 31763163 26793206 22573316 19288745 16966019 15340128 14152305
$$ packed form
17038E8311401R56833J6439j352053j748589j343565j143768j438255k193308
17030E0065135l446593n211141n792430n358383m535790l362526k384361j574285
17022A8399626j123873q98680o36826m74705m08343j43508R3734L54341O91865
17013A5853631J016170J479242K040716K749573L646950M456317N244770N778651
17005D2266020N842774M868109L305012J730086k6949p93973l98584L9486J05006
16996E6936987k58710r35079j912756j830994q34801K89598J279132J470542R00068
16987E5103987j10754j411089j778708j416084j230981j504289k260031l388417
16979D2003634m869980n370491m969957m219890l284571k322726j625891j187823
$$ plain form
16971 14152305 13245125 12478058 11791883 11273015 10775650 10240468 9821525 9565308 9248103
16962 9248103 8894288 8548295 8219268 7788274 7482989 7231240 6948402 6626609 6313514
16953 6313514 5945066 5577807 5348861 5137189 4918914 4750292 4527772 4316495 4183091
16944 4183091 3996865 3771417 3573171 3400495 3229486 3136917 3056656 3007532 2872555 2758808
16934 2758808 2666080 2521860 2414675 2369847 2314069 2184745 2151828 2113200 2042790 1988586 1908073
16923 1908073 1808539 1739290 1690307 1660558 1650741 1677897 1646449 1675516 1637579 1619053 1517604
16912 1517604 1453831 1484503 1491935 1435236 1361606 1315485 1261426 1268116 1228936 1217908 1175707 1179040
16900 1179040 1229015 1255139 1269063 1246832 1222997 1173089 1068266 1070127 1122346 1155062 1168182
$$ packed form
16971A4152305r07180p67067o86175n18868m97365n35182m18943k56217l17205
16962I248103l53815l45993l29027m30994l05285k51749k82838l21793l13095
16953F313514l68448l67259k28946k11672k18275j68622k22520k11277j33404
16944D183091j86226k25448j98246j72676j71009r2569q0261m9124j34977j13747
16934B758808r2728j44220j07185m4828n5778j29324l2917l8628p0410n4204q0513
16923A908073r9534o9249m8983k9749r817K7156l1448K9067l7937j8526j01449
16912A517604o3773L0672P432n6699p3630m6121n4059O690l9180j1028m2201L333
16900A179040M9975K6124J3924k2231k3835m9908j04823J861N2219L2716J3120
$$ plain form
16889 1168182 1158584 1083756 995549 1014648 1023893 1041187 1049517 1038787 984439 942308 887981 981035
16877 981035 1045626 1057441 977919 995011 934528 920542 899111 947323 932714 877565 841086
16866 841086 871653 929478 918956 878734 821004 831144 824586 834902 839496 807266 795316 789262
16854 789262 816522 827947 809372 729163 732363 735064 708871 669892 666464 676637 789138 839752
16842 839752 751496 688976 688747 653838 672234 694884 652054 587404 498566 492417 544456 658816
16830 658816 700078 676003 627076 601336 624351 611243 532057 478889 465146 437380 499065
16819 499065 601516 612924 596352 576319 532465 509945 536568 505129 529164 483478 468564
16808 468564 531004 481656 424062 448618 512121 600322 591151 566689 538806 518592 478169 463831
$$ packed form
16889A168182r598p4828q8207J9099R245J7294Q330j0730n4348m2131n4327R3054
16877I81035O4591J1815p9522J7092o0483j3986k1431M8212j4609n5149l6479
16866H41086L0567N7825j0522m0222n7730J0140o558J0316M594l2230j1950o054
16854G89262K7260J1425j8575q0209L200K701k6193l8979l428J0173J12501N0614
16842H39752q8256o2520k29l4909J8396K2650m2830o4650q8838o149N2039J14360
16830F58816M1262k4075m8927k5740K3015j3108p9186n3168j3743k7766O1685
16819D99065J02451J1408j6572k0033m3854k2520K6623l1439K4035m5686j4914
16808D68564O2440m9348n7594K4556O3503Q8201r171k4462k7883k0214m0423j4338
$$ plain form
16796 463831 481341 520204 470208 482499 526513 532715 571651 551261 553083 539782 533722 497560
16784 497560 507497 497463 521146 470922 503217 534920 494831 422602 402827 407065 427013 402638
16772 402638 413204 361491 351238 410287 415253 443998 445712 367306 317176 310512 357647 364454
16760 364454 413530 422015 387506 452386 448459 435462 381397 397164 489943 473485 498646 505842
16748 505842 494908 500752 520401 527062 504355 468189 555008 613886 655264 755794 796404 793621
16736 793621 833874 874390 982721 1052939 1122128 1140555 1164972 1240064 1320604 1293097 1242633
16725 1242633 1230975 1240840 1282441 1312762 1254864 1284574 1357348 1326779 1276601 1181345 1102163
16714 1102163 1055739 1059970 952654 918153 908906 807199 682146 620791 663078 678470 587208
$$ packed form
16796D63831J7510L8863m9996J2291M4014O202L8936k0390J822j3301o060l6162
16784D97560R937j0034K3683n0224L2295L1703m0089p2229j9775M238J9948k4375
16772D02638J0566n1713j0253N9049M966K8745J714p8406n0130o664M7135O807
16760C64454M9076Q485l4509O4880l927j2997n4065J5767R2779j6458K5161P196
16748E05842j0934N844J9649O661k2707l6166Q6819N8878M1378J00530M0610k783
16736G93621M0253M0516J08331P0218O9189J8427K4417P5092Q0540k7507n0464
16725A242633j1658R865M1601L0321n7898K9710P2774l0569n0178r5256p9182
16714A102163m6424M231j07316l4501r247j01707j25053o1355M2287J5392r1262
$$ plain form
16703 587208 544340 542722 542790 526186 455238 412629 368160 380740 464932 522295 494178 468602
16691 468602 486901 510819 478370 499677 513796 549405 628161 599111 629261 641946 635966 651406
16679 651406 781554 813038 776214 741653 764055 752532 695789 655469 630940 684273 642140
16668 642140 610134 589204 613955 612895 515527 435238 374856 307849 334038 316050 220758 208492
16656 208492 232047 258474 335923 389987 341549 235997 261686 287238 267625 308934 264422
16645 264422 278948 265273 269149 271803 244041 189434 175097 252673 245009 255843 257840 311667
16633 311667 344783 359731 294776 251976 247710 230327 220636 256247 279562 242225 157720 137677
16621 137677 173713 157758 141452 84560 101536 252966 294959 241635 244013 247070 223318 197636
$$ packed form
16703E87208m2868j618O8j6604p0948m2609m4469J2580Q4192N7363k8117k5576
16691D68602J8299K3918l2449K1307J4119L5609P8756k9050L0150J2685n980J5440
16679F51406J30148L1484l6824l4561K2402j1523n6743m0320k4529N3333m2133
16668F42140l2006k0930K4751j060r7368q0289o0382o7007K6189j7988r5292j2266
16656B08492K3555K6427P7449N4064m8438j05552K5689K5552j9613M1309m4512
16645B64422J4526j3675L876K654k7762n4607j4337P7576p664J0834J997N3827
16633C11667L3116J4948o4955m2800m266j7383r691L5611K3315l7337q4505k0043
16621A37677L6036j5955j6306n6892J6976J51430M1993n3324K378L057k3752k5682
$$ plain form
16609 197636 136367 163267 184780 215624 165388 118997 127809 151255 181477 238568 295957 235220
16597 235220 200109 170850 193150 177651 108605 108761 124503 211526 296899 285838 263159 267317
16585 267317 256997 280969 348566 300086 215519 207498 251885 311132 258878 226896 303961 307733
16573 307733 282100 223987 224820 240879 203438 223086 186248 189557 145756 152189 149844 215013
16561 215013 354496 415897 392584 413155 394740 360425 397622 520148 534119 540925 570042
16550 570042 606830 536462 491107 475841 485840 514912 480871 525278 504767 468670 397719 372523
16538 372523 375576 387790 376664 348228 319721 353376 382692 379322 347905 284734 241688 309398
16526 309398 288301 249901 233521 219374 179084 133129 164229 177422 134368 250975 264533
$$ packed form
16609A97636o1269K6900K1513L0844n0236m6391Q812K3446L0222N7091N7389o0737
16597B35220l5111k9259K2300j5499o9046J56J5742Q7023Q5373j1061k2679M158
16585B67317j0320K3972O7597m8480q4567q021M4387N9247n2254l1982P7065L772
16573C07733k5633n8113Q33J6059l7441J9648l6838L309m3801O433k345O5169
16561B15013J39483O1401k3313K0571j8415l4315L7197J22526J3971O806K9117
16550E70042L6788p0368m5355j5266R999K9072l4041M4407k0511l6097p0951k5196
16538C72523L053J2214j1126k8436k8507L3655K9316l370l1417o3171m3046O7710
16526C09398k1097l8400j6380j4147m0290m5955L1100J3193m3054J16607J3558
$$ plain form
16515 264533 219512 278562 302891 380865 357763 388061 443196 483730 449762 547760 546503 489468
16503 489468 510363 561547 591086 595547 590160 532815 509073 499052 435120 368782 328152 371585
16491 371585 467250 487659 505609 484042 416371 391202 402595 377566 381986 310824 240728 247277
16479 247277 265201 174985 74392 119414 238591 265029 270359 315529 312437 233328 167087
16468 167087 111269 185499 191552 217851 252382 224352 241926 283100 210885 228837 258920 246346
16456 246346 264832 272537 177338 184410 221105 161954 148774 217055 221969 185696 115650 122650
16444 122650 173699 172198 186599 228736 211887 158290 231534 272768 248220 261539 276229 322656
16432 322656 206514 95708 1209 -7602 9734 46376 66154 118034 118705 148929 166881 99717
$$ packed form
16515B64533m5021N9050K4329P7974k3102L0298N5135M0534l3968R7998j257n7035
16503D89468K0895N1184K9539M461n387n7345k3742j0021o3932o6338m0630M3433
16491C71585R5665K0409J7950k1567o7671k5169J1393k5029M420p1162p0096O549
16479B47277J7924r0216j00593M5022J19177K6438N330M5170l092p9109o6241
16468A67087n5818P4230O053K6299L4531k8030J7574M1174p2215J7952L0083j2574
16456B46346J8486P705r5199P072L6695n9151j3180O8281M914l6273p0046P000
16444A22650N1049j501J4401M2137j6849n3597P3244M1234k4548J3319J4690M6427
16432C22656j16142j10806r4499q811J7336L6642J9778N1880O71L0224J7952o7164
$$ plain form
16420 99717 45304 46282 99740 135829 178143 74554 30585 47416 92030 64687 86607 156984
16408 156984 106681 128771 115582 90412 148037 180049 161264 139504 148763 131648 185898 165310
16396 165310 107318 24119 -58937 -93167 -36985 38076 67777 39132 38967 43879 58936 67718
16384 67718 124009 148161 112933 151694 228344 237077 186407 159932 131829 54636 20554 33062
16372 33062 96795 155165 99959 81945 108299 67695 53734 118029 110948 107022 140326 163862
16360 163862 151291 123442 158707 169018 100748 105218 56851 91500 136155 125116 76659 80775
16348 80775 43828 17985 -53356 -99621 -21813 53111 63813 15420 53618 2073 -21083 48808
16336 48808 51759 63560 66696 112478 106962 79644 39143 13229 4681 6586 79290 179711
$$ packed form
16420I9717n4413R78N3458L6089M2314j03589m3969J6831M4614k7343K1920P0377
16408A56984n0303K2090j3189k5170N7625L2012j8785k1760R259j7115N4250k0588
16396A65310n7992q3199q3056l4230N6182P5061K9701k8645j65M912J5057Q782
16384F7718N6291K4152l5228L8761P6650Q733n0670k6475k8103p7193l4082J2508
16372C3062O3733N8370n5206j8014K6354m0604j3961O4295p081l926L3304K3536
16360A63862j2571k7849L5265J0311o8270M470m8367L4649M4655j1039m8457M116
16348H0775l6947k5843p1341m6265P7808P4924J0702m8393L8198n1545k3156O9891
16336D8808K951J1801L136M5782n516k7318m0501k5914q548J905P2704J00421
$$ plain form
16324 179711 214898 124104 111477 90318 118734 42708 -38051 7104 88566 154756 163783 63914
16312 63914 -15982 66909 96094 31217 35489 76244 42365 70831 83828 105654 116747 102760
16300 102760 138557 128955 78069 48790 44188 23758 47300 13434 33875 41746 12026 -9822
16288 -9822 6288 117491 147432 121056 102470 100164 50699 12465 7099 34410 72361 82633
16276 82633 114436 89296 93116 121894 122172 124306 108484 103125 68460 -8807 -13894 27398 55260
16263 55260 24417 37493 60708 21029 37843 54279 74108 70023 16903 32071 78650 47130
16251 47130 42569 75092 93294 86899 65528 73507 174114 230346 192685 169707 181956 156441
16239 156441 127183 183783 164150 137504 176190 210794 215873 199290 118797 118383 78021 46748
$$ packed form
16324A79711L5187r0794j2627k1159K8416p6026q0759M5155Q1462O6190R027r9869
16312F3914p9896Q2891K9185o4877M272M0755l3879K8466J2997K1826J1093j3987
16300A02760L5797r602n0886k9279m602k0430K3542l3866K0441P871k9720k1848
16288i822J6110J11203K9941k6376j8586k306m9465l8234n366K7311L7951J0272
16276H2633L1803k5140L820K8778K78K134j5822n359l4665p7267n087M1292K7862
16263E5260l0843J3076K3215l9679J6814J6436J9829m085n3120J5168M6579l1520
16251D7130m561L2523J8202o395k1371P979J00607N6232l7661k2978J2249k5515
16239A56441k9258N6600j9633k6646L8686L4604N079j6583q0493m14m0362l1273
$$ plain form
16227 46748 71440 89751 120971 99564 121469 115728 68083 77865 104480 126190 99166 84096
16215 84096 66664 42984 69548 115888 134492 54440 71350 105292 147722 111214 45979 52943
16203 52943 51220 40117 67256 49046 42454 63537 52743 32970 44982 -21013 -78180 -17292
16191 -17292 -39200 -29977 -35658 25363 122211 72468 36821 88539 173204 155712 60105 -28931
16179 -28931 -63752 -80493 -45211 -56457 2537 -16197 -41994 -74879 -21344 56020 31414 -20806
16167 -20806 -30227 -78 63505 70575 47030 59110 23748 26148 -6228 -25210 -27633 51273
16155 51273 51719 -32965 61825 119110 168384 66866 -65931 -17506 54435 -8522 41600 108966
16143 108966 -11512 -16303 113909 78142 46441 29833 -18791 -75907 -66511 -60095 -28948 5702
$$ packed form
16227D6748K4692J8311L1220k1407K1905n741m7645R782K6615K1710k7024j5070
16215H4096j7432k3680K6564M6340J8604q0052J6910L3942M2430l6508o5235O964
16203E2943j723j1103K7139j8210o592K1083j0794j9773J2012o5995n7167O0888
16191a7292k1908R223n681O1021R6848m9743l5647N1718Q4665j7492r5607q9036
16179b8931l4821j6741L5282j1246N8994j8734k5797l2885N3535P7364k4606n2220
16167b0806r421L0149O3583P070k3545J2080l5362K400l2376j8982k423P8906
16155E1273M46q4684R4790N7285M9274j01518j32797M8425P1941o2957N0122O7366
16143A08966j20478m791J30212l5767l1701j6608m8624n7116R396O416L1147L4650
$$ plain form
16131 5702 79675 94096 141109 77412 18764 8546 -68465 -68028 -107927 -79721 -14763 -28884
16119 -28884 -38130 -19029 47173 72316 104878 175275 138737 99266 46182 -20962 -25452 25247
16107 25247 73006 101845 111282 155410 238194 230990 145815 83670 23002 18255 28330 141020
16095 141020 174478 173008 132614 132436 112127 61338 60003 126805 148365 137614 190525 169953
16083 169953 112043 125295 149938 168727 143609 157976 137985 100430 -41607 -56869 -31108
16072 -31108 -5088 11351 9433 -16467 26705 80163 93641 73303 49388 -13116 -61641 28737
16060 28737 36375 35916 52749 95888 88868 58339 4735 14198 11744 33950 85077 45726 65337
16047 65337 64777 39009 113211 63375 -3170 -55871 -64210 9402 31521 -35819 -72588 -30911
$$ packed form
16131E702P3973J4421M7013o3697n8648j0218p7011M37l9899K8206O4958j4121
16119b8884r246J9101O6202K5143L2562P0397l6538l9471n3084o7144m490N0699
16107B5247M7759K8839R437M4128Q2784p204q5175o2145o0668m747J0075J12690
16095A41020L3458j470m0394j78k0309n0789j335O6802K1560j0751N2911k0572
16083A69953n7910J3252K4643J8789k5118J4367j9991l7555j42037j5262K5761
16072c1108K6020J6439j918k5900M3172N3458J3478k0338k3915o2504m8525R0378
16060B8737P638m59J6833M3139p020l0529n3604R463k454K2206N1127l9351J9611
16047F5337n60k5768P4202m9836o6545n2701q339P3612K2119o7340l6769M1677
$$ plain form
16035 -30911 -34557 -24736 53641 57406 24633 -2004 38561 122623 126929 55066 -15405 19380
16023 19380 21822 5450 -10994 -53295 -17338 40549 89557 56053 14465 52826 50530 45395
16011 45395 97655 168203 147426 34616 20835 24356 77537 97596 102098 120770 95620 137265
15999 137265 40064 -28694 -34008 -46248 -87686 -68862 -90338 -90339 -83615 -51565 -275 24610 26571
15986 26571 31193 6298 -53905 -25816 -11799 -34603 -51674 -101746 -51133 48204 102539 102692
15974 102692 79333 52276 63600 58121 20583 21699 -29937 21547 91366 91023 33109 -20955
15962 -20955 -37188 -35499 -68951 -5266 55844 47777 6054 -2330 5433 -38303 -57051 -27468
15950 -27468 12748 65490 71143 74003 78103 125204 85261 24680 20865 90373 140936 177595
$$ packed form
16035c0911l646R821P8377L765l2773k6637M0565Q4062M306p1863p0471L4785
16023A9380K442j6372j6444m2301L5957N7887M9008l3504m1588L8361k296n135
16011D5395N2260P0548k0777j12810j3781L521N3181K0059M502J8672k5150M1645
15999A37265r7201o8758n314j2240m1438J8824k1476jO724L2050N1290K4885J961
15986B6571M622k4895o0203K8089J4017k2804j7071n0072N0613R9337N4335J53
15974A02692k3359k7057J1324n479l7538J116n1636N1484O9819l43n7914n4064
15962b0955j6233J689l3452O3685O1110q067m1723q384P763m3736j8748K9583
15950b7468M0216N2742N653K860M100M7101l9943o0581l815O9508N0563L6659
$$ plain form
15938 177595 123283 104195 134105 241982 181658 118792 121130 101519 81022 87465 33374 -8212
15926 -8212 -11631 78944 89347 55435 96118 128547 149621 144900 118739 89183 94905 60245
15914 60245 -9088 -64397 -9325 38047 20521 55841 115050 56116 67143 144676 159528 104556
15902 104556 33488 -21008 -14896 24073 77611 64880 68908 63156 37826 65500 57451 75919
15890 75919 42429 -60512 26100 96199 61648 39948 -55382 -33142 79779 113676 105638
15879 105638 154736 88821 28562 5711 31488 65345 94471 59771 67076 13117 -57331 -95661
15867 -95661 -32317 884 84337 99746 48286 -79481 4032 25933 30262 79718 128943 80743
15855 80743 87345 92470 112599 51373 63036 101373 143350 185846 175661 180808 161353 50094
$$ packed form
15938A77595n4312j9088K9910J07877o0324o2866K338j9611k0497O443n4091m1586
15926h212l419R0575J0403l3912M0683L2429K1074m721k6161k9556N722l4660
15914F0245o9333n5309N5072M7372j7526L5320N9209n8934J1027P7533J4852n4972
15902A04556p1068n4496O112L8969N3538j2731M028n752k5330K7674q049J8468
15890G5919l3490j02941Q6612P0099l4551k1700r5330K2240J12921L3897q038
15879A05638M9098o5915o0259k2851K5777L3857K9126l4700P305n3959p0448l8330
15867i5661O3344L3201Q3453J5409n1460j27767Q3513K1901M329M9456M9225m8200
15855H0743O602N125K0129o1226J1663L8337M1977M2496j0185N147j9455j11259
$$ plain form
15843 50094 -23779 -55502 -80282 -50124 45311 46058 41978 -9954 -38947 22606 64688 79303
15831 79303 28717 -52652 -52172 -72203 -87190 -100164 -170837 -135586 -113276 5089 114913 151131
15819 151131 113294 34031 108752 92054 18445 -20153 79673 71508 14504 -780 -35022 -5276
15807 -5276 43459 10597 -327 15343 -69697 -151266 -93918 -60423 -67677 -89670 -81277 -81331 -66076
15794 -66076 -31908 -26389 63090 131441 52008 1730 69384 135339 55261 -52199 -19392 117562
15782 117562 149194 166654 137946 152061 102798 62329 31591 29172 61687 27940 -53 -10820
15770 -10820 -31707 -37885 -3009 7010 -6149 -76226 -88733 -14668 13489 21350 869 53275
15758 53275 75084 -21975 3278 92165 54323 3428 -74518 -120431 -78455 55454 142750
$$ packed form
15843E0094p3873l1723k4780L0158R5435P47m080n1932k8993O1553M2082J4615
15831G9303n0586q1369M80k0031j4987j2974p0673L5251K2310J18365J09824L6218
15819A51131l7837p9263P4721j6698p3609l8598R9826q165n7004j5284l4242K9746
15807e276M8735l2862j0924J5670q5040q1569N7348L3495p254k1993Q393n4J5255
15794f6076L4168N519Q9479O8351p9433n0278O7654O5955q0078j07460L2807J36954
15782A17562L1632J7460k8708J4115m9263m0469l0738k419L2515l3747k7993j0767
15770a0820k0887o178L4876J0019j3159p0077j2507P4065K8157P861k0481N2406
15758E3275K1809r7059K5253Q8887l7842n0895p7946m5913M1976J33909Q7296
$$ plain form
15747 142750 102170 64014 63209 44883 -10591 -66940 -62448 28473 143636 139580 89596 84443
15735 84443 89661 83818 36395 -5763 -19134 3958 28507 66781 40930 23299 14116 -39592
15723 -39592 -105872 -32965 -35144 -48508 -53183 26546 90127 93500 157520 145712 100872 159017
15711 159017 120560 69269 46938 18810 21689 -1998 90 60649 80549 67236 101702 64726
15699 64726 80338 92196 66498 -31725 -82030 11904 24165 -40956 -86399 -50015 -10162 83442
15687 83442 140433 106241 35799 73050 105522 105213 95395 97866 57025 -22475 -84583 -49999
15675 -49999 -47674 -96218 -97046 -71748 -67670 -12626 -7835 -10045 -36573 -68725 -27970 -64366 -89842
15662 -89842 -116210 -69320 -48448 -51604 72058 90210 23510 44503 46516 -15162 -81532 -114699
$$ packed form
15747A42750m0580l8156q05j8326n5474n6349M492R0921J15163m056m9984n153
15735H4443N218n843m7423m2158j3371K3092K4549L8274k5851j7631r183n3708
15723c9592o6280P2907k179j3364m675P9729O3581L373O4020j1808m4840N8145
15711A59017l8457n1291k2331k8128K879k3687K088O0559J9900j3313L4466l6976
15699F4726J5612J1858k5698r8223n0305R3934J2261o5121m5443L6384L9853R3604
15687H3442N6991l4192p0442L7251L2472l09r818K471m0841p9500o2108L4584
15675d9999K325m8544q28K5298M078N5044M791k210k6528l2152M0755l6396k5476
15662h9842k6368M6890K0872l156J23662J8152o6700K0993K013o1678o6370l3167
$$ plain form
15650 -114699 -80099 -53094 -18384 18814 23011 4028 66626 65815 60583 28737 3522 50032
15638 50032 88288 82764 82133 74308 116853 98464 88073 126308 107505 -36550 -145226 -57551
15626 -57551 36460 14182 -78347 -142640 -102905 -67023 -14153 16575 -26753 -80288 -83418 -120295
15614 -120295 -48932 -36304 -83398 -99647 -37435 -5850 6328 63399 406 -6219 -11501 -55006
15602 -55006 -64807 -39614 50163 108007 95327 39469 27870 65514 73543 88891 86520 56111
15590 56111 -13207 47325 79163 100621 82425 13636 -25981 -31564 14333 24800 77271 60014
15578 60014 88957 121078 38840 21616 90338 88297 93071 81684 74817 32829 -12864 45243
15566 45243 79798 76584 59078 54512 -1453 37488 -40347 -22281 18916 34237 33892 -13578
$$ packed form
15650a14699L4600K7005L4710L7198M197j8983O2598q11n232l1846k5215M6510
15638E0032L8256n524o31p825M2545j8389j0391L8235j8803j44055j08676Q7675
15626e7551R4011k2278r2529o4293L9735L5882N2870L0728m3328n3535l130l6877
15614a20295P1363J2628m7094j6249O2212L1585J2178N7071o2993o625n282m3505
15602e5006r801K5193Q9777N7844j2680n5858j1599L7644Q029J5348k371l0409
15590E6111o9318O0532L1838K1458j8196o8789l9617n583M5897J0467N2471j7257
15578F0014K8943L2121q2238j7224O8722k041M774j1387o867m1988m5693N8107
15566D5243L4555l214j7506m566n5965L8941p7835J8066M1197J5321l45m7470
$$ plain form
15554 -13578 -48697 -22575 -13949 -38759 -28950 31762 1394 -62192 -80206 -61969 2638 -13803
15542 -13803 -20190 5312 39918 -6357 10959 18361 -21363 -49933 -125697 -40237 29567 45173
15530 45173 57164 166043 204566 200886 242424 378268 486725 418093 322586 305933 293478
15519 293478 296715 385269 480393 496028 422440 359921 327685 363282 421421 420478 395265 398096
15507 398096 296717 251200 229416 211669 229576 204650 197222 185535 153920 138175 154473
15496 154473 154915 126073 116298 8519 -17766 45649 52799 97286 127402 124375 88177 51575
15484 51575 4360 13861 68128 73563 54037 39728 57230 65661 -19181 -67473 -62319 -92073
15472 -92073 -51425 17135 43843 77241 90768 165701 140128 124523 65427 -11075 -30846 -45670
$$ packed form
15554a3578l5119K6122Q626k4810R809O0712l0368o3586j8014J8237O4607j6441
15542a3803o387K5502L4606m6275J7316P402l9724k8570p5764Q5460O9804J5606
15530D5173J1991J08879L8523l680M1538J35844J08457o8632r5507j6653j2455
15519B93478L237Q8554R5124J5635p3588o2519l2236L5597N8139r43k5213K831
15507C98096j01379m5517k1784j7747J7907k4926p428j1687l1615j5745J6298
15496A54473M42k8842r775j07779k6285O3415P150M4487L0116l027l6198l6602
15484E1575m7215R501N4267N435j9526j4309J7502Q431q4842m8292N154k9754
15472i2073M0648O8560K6708L3398J3527P4933k5573j5605n9096p6502j9771j4824
$$ plain form
15460 -45670 -27810 -21305 -27082 -9277 -16893 14203 36302 39243 672 13600 54650 71240
15448 71240 3550 -38034 -51158 -46305 -6027 -10055 -85805 -63226 -40560 -79652 -58025 -33987
15436 -33987 -105306 -74505 -17392 -452 -2136 -11736 -35535 29598 53869 83202 61190 -15601
15424 -15601 -30102 19610 57906 107203 75905 67629 118970 91877 29431 54572 15507 19180
15412 19180 55851 86304 32863 -23890 -18960 -51697 -29214 13053 25439 48356 -18468 -34680
15400 -34680 -37444 -95711 -126013 -103618 -17008 -113053 -129127 -47221 -86998 -63990 59357 45162
15388 45162 -20092 -25208 -17877 33415 32411 52982 64440 40512 -40149 -97918 -172243 -139092
15376 -139092 -89878 -10380 1867 2345 -54837 -139218 -94945 -52751 -35198 26061 34589 5927
$$ packed form
15460d5670J7860O505n777J7805p616L1096K2099K941l8571J2928M1050J6590
15448G1240o7690m1584j3124M853M0278m028p5750K2579K2666l9092K1627K4038
15436c3987p1319L0801N7113J6940j684r600k3799O5133K4271K9333k2012p6791
15424a5601j4501M9712L8296M9297l1298q276N1341k7093o2446K5141l9065L673
15412A9180L6671L0453n3441n6753M930l2737K2483M2267J2386K2917o6824j6212
15400c4680k764n8267l0302K2395Q6610r6045j6074Q1906l9777K3008J23347j4195
15388D5162o5254n116P331N1292j004K0571J1458k3928q0661n7769p4325L3151
15376a39092M9214P9498J2247M78n7182q4381M4273M2194J7553O1259Q528k8662
$$ plain form
15364 5927 -37077 9794 77617 132776 44266 46775 56153 -29144 -21462 6033 68968 160041
15352 160041 63270 -112262 -88559 -91031 -100653 -103839 -132618 -108123 -62414 -32776 -63434 -21415
15340 -21415 -80038 -123410 -100953 -129932 -137397 -185912 -148450 -78286 -58159 -21888 -25507 -119278
15328 -119278 -97117 -79318 -56812 -29887 -37355 16308 38131 6889 -46970 -55082 -40254 10847
15316 10847 44441 16861 13835 12989 68221 47263 42378 46876 28949 11541 -37454 -62601 -1360
15303 -1360 -7755 -41173 -38656 -22087 25942 57317 32924 1523 8318 -11077 17791 39774
15291 39774 -3490 -55923 -52847 -831 -33144 -104185 -52389 -48185 -62194 -48073 -43110 -63552
15279 -63552 -58767 -31214 -27173 -417 48948 73867 103406 102518 26516 -61559 -145955 -150925 -70290
$$ packed form
15364E927m3004M6871O7823N5159q8510K509R378q5297P682K7495O2935R1073
15352A60041r6771j75532K3703k472r622l186k8779K4495M5709K9638l0658M2019
15340b1415n8623m3372K2457k8979p465m8515L7462P0164K0127L6271l619r3771
15328a19278K2161J7799K2506K6925p468N3663K1823l1242n3859q112J4828N1101
15316A0847L3594k7580l026q46N5232k0958m885M498j7927j7408m8995k5147O1241
15303a360o395l3418K517J6569M8029L1375k4393l1401O795j9395K8868K1983
15291C9774m3264n2433L076N2016l2313p1041N1796M204j4009J4121M963k0442
15279f3552M785K7553M041K6756M9365K4919K9539q88p6002q8075q4396m970Q0635
$$ plain form
15266 -70290 50706 62396 57686 59558 59063 37356 27277 122880 131146 76483 80355 74788 43901
15253 43901 59643 47150 20028 -13713 -57839 -56139 -26717 21153 9138 37519 97918 73644
15241 73644 4428 46476 68835 46016 31660 -48503 -49145 81340 82709 76727 93701 35244
15229 35244 64175 20082 -4214 -29768 9135 8675 -12469 -4239 9766 -14155 -63305 -67937
15217 -67937 -49325 -51168 -102566 -100911 -58809 -21289 -18948 -48400 -59756 -33461 36659 23813
15205 23813 38062 -24109 -33487 -61922 78556 107455 104929 59553 19480 18855 -22952 -69563
15193 -69563 -9733 -107691 -116766 -100756 -170096 -109032 -68413 7535 5502 -14213 -75143 -57280
15181 -57280 -25018 -18568 -68020 -57454 -35649 -22561 -53894 -104684 -114739 -130628 -101887 -74696
$$ packed form
15266g0290J20996J1690m710J872m95k1707j0079R5603Q266n4663L872n567l0887
15253D3901J5742j2493k7122l3741m4126J700K9422M7870j2015K8381O0399k4274
15241G3644o9216M2048K2359k2819j4356q0163o42J30485J369n982J6974n8457
15229C5244K8931m4093k4296k5554L8903m60k1144Q230J4005k3921m9150m632
15217f7937J8612j843n1398J655M2102L7520K341k9452j1356K6295P0120j2846
15205B3813J4249o2171r378k8435J40478K8899k526m5376m0073o25m1807m6611
15193f9563N9830r7958r075J6010o9340O1064M0619P5948k033j9715o0930J7863
15181e7280L2262O450m9452J0566K1805J3088l1333n0790j0055j5889K8741K7191
$$ plain form
15169 -74696 -102368 -71285 4863 26778 35238 -22306 -61252 -51386 -61476 -32108 15506 4596
15157 4596 26099 28509 -61411 -95187 -99227 -156328 -139280 -50848 -96423 -163888 -84470 17752
15145 17752 103558 125680 74345 49067 56550 58711 48771 56273 25583 -40392 -51345 -21934
15133 -21934 5193 -56655 4532 30809 -34488 -89715 -106463 -148796 -106922 -34105 -73448 -54325
15121 -54325 21370 27879 -25992 -82355 -22141 68255 33243 -25025 9448 -17758 -18936 32004
15109 32004 43873 -29617 -48447 -14591 -15304 -26133 32868 77725 2521 -44699 -56138 -33954
15097 -33954 -4926 13874 -9733 15048 5942 -13014 25087 5823 21418 34559 72136 104031
15085 104031 146124 93853 32604 13554 67796 48519 24141 -27799 -32699 -65006 -117178 -102417
$$ packed form
15169g4696k7672L1083P6148K1915Q460n7544l8946R866j0090K9368M7614j0910
15157D596K1503K410q9920l3776m040n7101J7048Q8432m5575o7465P9418J02222
15145A7752Q5806K2122n1335k5278P483K161r940P502l0690o5975j0953K9411
15133b1934K7127o1848O1187K6277o5297n5227j6748m2333M1874P2817l9343J9123
15121e4325P5695O509n3871n6363O0214R0396l5012n8268L4473k7206j178N0940
15109C2004J1869p3490j8830L3856p13j0829N9001M4857p5204m7220j1439K2184
15097c3954K9028J8800k3607K4781r106j8956L8101j9264J5595J3141L7577L1895
15085A04031M2093n2271o1249j9050N4242j9277k4378n1940m900l2307n2172J4761
$$ plain form
15073 -102417 -92533 -95149 -114897 -134925 -131917 -130713 -145268 -114997 -120609 -121478 -35782 -42036 -44667
15060 -44667 -42266 -81583 -39571 -19867 -46842 -96703 -14149 -23181 -91528 -119512 -101742 -128210
15048 -128210 -119778 -108177 -82142 -53215 5932 45605 58957 69034 85570 97392 43146 1416
15036 1416 -77721 -80737 -19857 50996 101088 74406 -12371 -48722 -68248 -7575 24412 -94290
15024 -94290 -67172 -2122 20565 14559 14885 87103 86732 93831 20652 29597 39286 6579 28748
15011 28748 45892 44676 12120 -14890 101270 124707 35965 52858 83675 107152 91125 50475
14999 50475 60512 -50020 -99462 -30174 -5258 -65434 -102980 -76150 -14243 -40022 -20376
14988 -20376 -42259 -65315 -126849 -106142 -62379 -16560 -7714 5389 5187 -25561 -104001 -109675
$$ packed form
15073a02417R884k616j9748k0028L008J204j4555L0271n612q69Q5696o254k631
15060d4667K401l9317M2012J9704k6975m9861Q2554r032o8347k7984J7770k6468
15048a28210Q432J1601K6035K8927N9147L9673J3352J0077J6536J1822n4246m1730
15036A416p9137l016O0880P0853N0092k6682q6777l6351j9526O0673L1987j18702
15024i4290K7118O5050K2687o006L26P2218l71P099p3179Q945R689l2707K2169
15011B8748J7144j216l2556k7010J16160K3437q8742J6893L0817K3477j6027m0650
14999E0475J0037j10532m9442O9288K4916o0176l7546K6830O1907k5779J9646
14988b0376k1883k3056o1534K0707M3763M5819Q846J3103k02l0748p8440n674
$$ plain form
14976 -109675 -102256 -48484 -56646 -146193 -111517 -93230 -37383 24185 -11420 -64272 -29617 -11065
14964 -11065 -43231 -60964 -66451 -31615 -34606 66597 39729 -50336 -5886 -34161 -20400 24277
14952 24277 41484 -15675 -160338 -185982 -184662 -179353 -178477 -57686 49872 16634 -17954 1450
14940 1450 -37515 -121058 -90020 -14404 -5742 -29116 -74027 -32159 7937 51314 42105 25562
14928 25562 61963 11664 13132 -61689 -121652 -9067 54814 8612 -44781 -71549 -100588 -50408
14916 -50408 -11088 -19693 36425 -3862 -5633 59781 22940 -23443 40251 31941 83865 74275
14904 74275 118753 109991 31053 -69655 -125798 -126643 -71104 13788 46768 22970 -5437 3326
14892 3326 4780 34875 2254 -27232 -10020 -2189 -85981 -237387 -220715 -134508 -67318 -76684
$$ packed form
14976a09675P419N3772q162q9547L4676J8287N5847O1568l5605n2852L4655J8552
14964a1065l2166j7733n487L4836k991J01203k6868r0065M4450k8275J3761M4677
14952B4277J7207n7159j44663k5644J320N309Q76J20791J07558l3238l4588J9404
14940A450l8965q3543L1038P5616Q662k3374m4911M1868M0096M3377r209j6543
14928B5562L6401n0299J468p4821n9963J12585O3881m6202n3393k6768k9039N0180
14916e0408L9320q605N6118m0287j771O5414l6841m6383O3694q310N1924r590
14904G4275M4478q762p8938j00708n6143q45N5539Q4892L2980k3798k8407Q763
14892C326J454L0095l2621k9486J7212P831q3792j51406J6672Q6207O7190r366
$$ plain form
14880 -76684 -83123 -63012 -49351 7355 20021 9165 -11766 -79145 -43930 -35169 -27237 -23854
14868 -23854 -68292 -86367 -47374 -37396 -55381 -104655 -141448 -156790 -144281 -155575 -187008 -196266
14856 -196266 -182480 -205711 -168997 -137193 -74494 -78907 -139845 -131199 -111045 -49136 -20383 -54284
14844 -54284 -27850 42929 62398 46785 43655 -10782 -10969 36975 9158 -49186 -39717 4017
14832 4017 27893 3682 10469 20557 100189 166721 188856 55234 33515 -20186 -69801 -40345
14820 -40345 -7412 -69290 -97527 -138018 -96927 -108523 -30839 13228 -19920 -28471 -29236 -39909
14808 -39909 -26767 -22970 232 -15887 18606 69189 137440 165327 136977 109848 83544 18940
14796 18940 -30327 -57630 -91666 -53988 -59183 -65605 -29684 -1219 -10843 -61951 -101523 -98472
$$ packed form
14880g6684o439K0111J3661N6706J2666j0856k0931o7379L5215Q761P932L383
14868b3854m4438j8075L8993R978j7985m9274l6793j5342J2509j1294l1433r258
14856a96266J3786k3231L6714L1804O2699m413o0938Q646K0154O1909K8753l3901
14844e4284K6434P0779J9469j5613l130n4437j87M7944k7817n8344R469M3734
14832D017K3876k4211O787J0088P9632O6532K2135j33622k1719n3701m9615K9456
14820d0345L2933o1878k8237m0491M1091j1596P7684M4067l3148q551p65j0673
14808c9909J3142L797K3202j6119L4493N0583O8251K7887k8350k7129k6304o4604
14796A8940m9267k7303l4036L7678n195o422L5921K8465r624n1108l9572L051
$$ plain form
14784 -98472 -51522 -36600 -25007 8225 -41436 -21448 -10729 -11386 -29230 -17561 6849 -3051
14772 -3051 -15728 -113859 -103026 -7098 104646 94471 74188 102871 42596 9193 84580 85479
14760 85479 82720 53828 76345 109120 51940 -7318 -91908 -79053 22307 129561 118119
14749 118119 44643 -11749 12086 9753 36255 65122 61249 89547 13608 39859 90683 102281
14737 102281 90609 77425 67143 76131 60580 9048 -47935 -98486 -95844 -51497 -14095 39678
14725 39678 105615 94952 34582 5965 -33786 -79914 -120793 -39188 -60912 -62691 -46895 35914
14713 35914 2639 -95405 -85919 -11604 8187 -67515 -29049 -1999 -25038 -42962 -24541 16351
14701 16351 5820 75469 89487 63745 56980 5900 -4503 60202 60517 17515 -61123 -117254
$$ packed form
14784i8472M6950J4922J1593L3232m9661J9988J0719o57j7844J1669K4410r900
14772c051j2677r8131J0833R5928J11744j0175k0283K8683o0275l3403P5387Q99
14760H5479k759k8892K2517L2775n7180n9258q4590J2855J01360J07254j1442
14749A18119p3476n6392K3835k333K6502K8867l873K8298p5939K6251N0824J1598
14737A02281j1672j3184j0282Q988j5551n1532n6983n0551K642M4347L7402N3773
14725C9678O5937j0663o0370k8617l9751m6128m0879Q1605k1724j779J5796Q2809
14713C5914l3275r8044R486P4315J9791p5702L8466K7050k3039j7924J8421M0892
14701A6351j0531O9649J4018k5742o765n1080j0403O4705L15m3002p8638n6131
$$ plain form
14689 -117254 -175448 -179654 -186445 -57735 -4437 -19585 -82656 -124760 -93255 -58365 -45142 -57659
14677 -57659 11310 98366 88334 71592 -16058 -94072 -147663 -118353 -69762 -55139 -51027 -61875
14665 -61875 -63680 -38882 -43411 -59383 -48013 -32702 -69149 -82307 -76140 -99960 -62902 18027
14653 18027 42733 35687 -95281 -134667 -153870 -127064 -64320 -24260 14171 58066 35677 17581
14641 17581 -11025 -109103 -53178 -7357 -24906 -19666 -29819 -10787 27446 84347 53831 59559
14629 59559 66910 27060 36893 50495 51106 35228 68246 75176 7220 -62188 -38315 -78507 -143450
14616 -143450 -147971 -92695 -37300 -57471 -44044 -47359 -87046 -106257 -98126 -46059 24330 71778
14604 71778 15458 -79502 -66596 -14698 -38548 -48342 -34869 -42852 -10128 57940 100720 92102
$$ packed form
14689a17254n8194m206o791J28710N3298j5148o3071m2104L1505L4890J3223j2517
14677e7659O8969Q7056j0032j6742q7650p8014n3591K9310M8591J4623M112j0848
14665f1875j805K4798m529j5972J1370J5311l6447j3158O167k3820L7058Q0929
14653A8027K4706p046j30968l9386j9203K6806O2744M0060L8431M3895k2389j8096
14641A7581k8606r8078N5925M5821j7549N240j0153J9032L8233N6901l0516N728
14629E9559P351l9850R833J3602O11j5878L3018O930o7956o9408K3873m0192o4943
14616a43450m521N5276N5395k0171J3427l315l9687j9211Q131N2067P0389M7448
14604G1778n6320r4960J2906N1898k3850r794J3473p983L2724O8068M2780q618
$$ plain form
14592 92102 65679 120603 121814 56660 -13820 -86905 -123265 -116308 -79636 -66727 -1451 19015
14580 19015 36861 74686 64627 27953 76884 23600 -93117 -110974 -59523 -29161 57928
14569 57928 53168 13063 16086 -32153 -34265 -41939 -63925 30643 35737 19551 47962 37842 -10199
14556 -10199 -77609 -73610 -18220 -21041 997 -27125 -73650 -44261 -36728 -30499 -62962 -124359
14544 -124359 -74510 13401 -16136 -67540 -54769 -59163 20018 127690 124539 84793 -79601
14533 -79601 -109577 -76245 -89326 -68328 -79404 -81734 -53657 -89861 -113908 -154751 -205189 -183581
14521 -183581 -58181 -36862 -62079 -29866 -17524 -41511 -45033 -54557 -71611 -67938 -50353 -59138
14509 -59138 -36398 47885 78437 36616 41972 22057 -19775 -63411 -43335 -120813 -160808 -65534
$$ packed form
14592I2102k6423N4924J211o5154p0480p3085l6360O957L6672J2909O5276K0466
14580A9015J7846L7825j0059l6674M8931n3284j16717j7857N1451L0362Q7089
14569E7928m760m0105L023m8239k112p674k1986R4568N094j6186K8411j0120m8041
14556a0199o7410L999N5390k821K2038k8122m6525K9389P533O229l2463o1397
14544a24359M9849Q7911k9537n1404J2771m394P9181J07672l151l9746j64394
14533g9601k9976L3332j3081K0998j1076k330K8077l6204k4047m0843n0438K1608
14521a83581J25400K1319k5217L2213J2342k3987l522r524j7054L673J7585q785
14509e9138K2740Q4283L0552m1821N356j9915m1832m3636K0076p7478l9995R5274
$$ plain form
14497 -65534 -113155 -169496 -60974 -50409 -108668 -128734 -67831 -19929 -39257 -49065 -61137 -100613
14485 -100613 -52171 9220 24313 -4322 44021 80324 66927 15182 -28247 -62371 1123
14474 1123 16585 19018 -24146 -23136 -39813 -105220 -147174 -88084 -90047 -53341 -5375 10098
14462 10098 20850 8227 -33346 -76363 -33490 65386 75948 63931 1948 -25732 -52164 -50068
14450 -50068 -69482 -75790 -39500 -90480 -103494 -57736 -103020 -73129 3575 -30931 -31684 -25566
14438 -25566 -17877 -67760 -112858 -37352 57642 66109 77552 89542 5350 -101972 -100812 -81796
14426 -81796 -74242 -136054 -165657 -100658 -42673 -18168 -75669 -124065 -139387 -124015 -20443 -19992
14414 -19992 -41642 -95766 8617 -864 11808 -32552 -58990 -13150 -23914 -8895 -51668 -57164
$$ packed form
14497f5534m7621n6341J08522J0565n8259k0066O0903M7902j9328r808j2072l9476
14485a00613M8442O1391J5093k8635M8343L6303j3397n1745m3429l4124O3494
14474A123J5462K433m3164J010j6677o5407m1954N9090j963L6706M7966J5473
14462A0098J0752j2623m1573m3017M2873R8876J0562j2017o1983k7680k6432K096
14450e0068j9414o308L6290n0980j3014M5758m5284K9891P6704l4506p53O118
14438b5566P689m9883m5098P5506R4994Q467J1443J1990q4192j07322J160J9016
14426h1796P554o1812k9603O4999N7985K4505n7501m8396j5322J5372J03572M51
14414a9992k1650n4124J04383r481J2672m4360k6438M5840j0764J5019m2773n496
$$ plain form
14402 -57164 -78727 -144894 -102049 -49681 -45892 -101918 -90291 -68323 -51269 -39122 2188 -23856
14390 -23856 -75073 -88455 -107769 -178511 -214184 -197071 -130924 -4298 43246 22847 13514 -39926
14378 -39926 -34421 -3965 -42356 -81333 9353 22630 51889 66936 50034 50679 66944 18384
14366 18384 15420 65235 56203 58 -26767 -62160 -31611 1551 98701 104115 -44112 -103129
14354 -103129 -52509 -32493 -80356 -73375 -86896 9325 17073 47833 35412 -108834 -174863 -104663
14342 -104663 21695 71116 6435 -59796 -107696 -128305 -104018 -33908 34955 -20857 -95162
14331 -95162 -96037 -46092 -81465 -69791 -67779 -29473 58870 48797 -9430 -75382 -119590 -160440
14319 -160440 -122864 -102095 -60261 -82013 -114059 -116982 -71421 -53855 -28253 -22729 -38919 -51103
$$ packed form
14402e7164k1563o6167M2845N2368L789n6026J1627K1968J7054J2147M1310k6044
14390b3856n1217j3382j9314p0742l5673J7113O6147J26626M7544k0399r333n3440
14378c9926N505L0456l8391l8977R0686J3277K9259J5047j6902O45J6265m8560
14366A8384k964M9815r032n6145k6825l5393L0549L3162R7150N414j48227n9017
14354a03129N0620K0016m7863O981j3521R6221P748L0760j2421j44246o6029P0200
14342a04663J26358M9421o4681o6231m7900k0609K4287P0110O8863n5812p4305
14331i5162q75M9945l5373J1674K012L8306Q8343j0073n8227o5952m4208m0850
14319a60440L7576K0769M1834k1752l2046k923M5561J7566K5602N524j6190j2184
$$ plain form
14307 -51103 -38990 6205 10155 49653 16716 2750 -28156 -14731 -6447 35770 28123 32716
14295 32716 78516 187069 187615 151876 154894 104151 94268 84102 -4800 42924 61448 36184
14283 36184 43930 56863 -15369 -126004 -80031 33914 53428 73715 51950 18112 8339 90885
14271 90885 100285 33147 80314 63827 63609 70984 -27606 2708 11234 13425 -684 -49799 -31169
14258 -31169 -49066 -60126 -14217 -22978 -14691 -9152 -36232 13186 -5621 7226 -2893 -7851
14246 -7851 -7690 -50130 -91374 -144491 -146062 -101783 -70257 -81678 -180419 -186937 -160116 -139081 -104422
14233 -104422 -90420 -68175 3985 40639 -31049 -100815 -91865 -145843 -53273 34381 -7580 -34493
14221 -34493 2968 -13967 -120191 -198536 -150011 -99178 -40343 -28219 -20822 -5643 -48614 -74726
$$ packed form
14307e1103J2113M5195L950L9498l2937j3966l0906J3425Q284M2217p647M593
14295C2716M5800J08553N46l5739L018n0743r883j0166q8902M7724J8524k5264
14283C6184P746J2933p2232j10635M5973J13945J9514K0287k1765l3838r773Q2546
14271I0885R400o7138M7167j6487k18P375r8590L0314Q526K191j4109m9115J8630
14258c1169j7897j1060M5909q761Q287N539k7080M9418j8807J2847j0119m958
14246g851J61m2440m1244n3117j571M4279L1526j1421r8741o518K6821K1035L4659
14233a04422J4002K2245P2160L6654p1688o9766Q950n3978R2570Q7654m1961k6913
14221c4493L7461j6935j06224p8345M8525N0833N8835J2124P397J5179m2971k6112
$$ plain form
14209 -74726 -125899 -190409 -169417 -88418 -39832 -58142 -17813 -5997 -42019 -21254 8374 -31173
14197 -31173 -6715 726 -58017 6894 20110 27181 9519 -51380 -26821 -44420 -94808 -153915
14185 -153915 -100517 -8751 38718 51117 83807 67217 44201 18116 26856 -10326 -64637 -55002
14173 -55002 -101161 6904 21757 -29454 -52450 -104287 -108762 -115182 -77643 -48307 -23377 -2983
14161 -2983 5276 38077 -11000 -18471 -35283 -73441 -162092 -143112 -135979 -130190 -81516 -20671 -38331
14148 -38331 -104087 -109519 -125223 -119383 -135406 -199682 -202055 -142727 -91551 -86315 -94828 -45442 -13018
14135 -13018 -48899 -97864 -123677 -212999 -200056 -100710 -19560 -14418 -10238 -64639 -48915 -62681
14123 -62681 -98810 -83445 -54079 30200 36263 67925 91237 25469 50736 5295 -37809 -37753
$$ packed form
14209g4726n1173o4510K0992Q0999M8586j8310M0329J1816l6022K0765K9628l9547
14197c1173K4458P441n8743O4911J3216P071j7662o0899K4559j7599n0388n9107
14185a53915N3398R1766M7469J2399L2690j6590k3016k6085Q740l7182n4311R635
14173e5002m6159J08065J4853n1211k2996n1837m475o420L7539K9336K4930K0394
14161b983Q259L2801m9077p471j6812l8158q8651J8980P133N789M8674O0845j7660
14148c8331o5756n432j5704N840j6023o4276k373N9328N1176N236q513M9386L2424
14135a3018l5881m8965k5813q9322J2943R9346Q1150N142M180n4401J5724j3766
14123f2681l6129J5365K9366Q4279O063L1662K3312o5768K5267m5441m3104N6
$$ plain form
14111 -37753 30892 93890 121290 115391 102875 64702 56824 34616 53303 9389 28585 36033
14099 36033 50320 26904 29777 -22261 -50134 -83431 -89130 -48955 -7595 -75470 -35942 -34590
14087 -34590 -113199 -148941 -171274 -152282 -102803 -21020 55340 102543 89830 12209 -5548 13560
14075 13560 -17977 -82384 -63447 -79975 -92619 -62048 15728 23065 55484 41694 68843 49389
14063 49389 3827 12679 -14967 75139 94552 39406 -27149 -38557 -65782 -50848 -4347 26085
14051 26085 82766 72747 -12169 -57942 30945 85796 74727 78252 128118 140331 48411 63562
14039 63562 137516 111365 -5449 -73876 39 18964 -26737 -42734 -42868 -86538 -109373 -5454
14027 -5454 66096 108911 104601 59959 24962 15799 6206 4746 -50972 -118496 -71451 -29910 -36096
$$ packed form
14111c7753O8645O2998K7400n899j2516l8173p878k2208J8687m3914J9196P448
14099C6033J4287k3416K873n2038k7873l3297n699M0175M1360o7875L9528J352
14087c4590p8609l5742k2333J8992M9479Q1783P6360M7203j2713p7621j7757J9108
14075A3560l1537o4407J8937j6528j2644L0571P7776P337L2419j3790K7149j9454
14063D9389m5562Q852k7646R0106J9413n5146o6555j1408k7225J4934M6501L0432
14051B6085N6681j0019q4916m5773Q8887N4851j1069L525M9866J2213r1920J5151
14039F3562P3954k6151j16814o8427P3915J8925m5701j5997j34m3670k2835J03919
14027e454P1550M2815m310m4642l4997r163r593j460n5718o7524M7045M1541o186
$$ plain form
14014 -36096 -102560 -165639 -114394 -78068 -88658 -142696 -80131 -22606 -44483 -112117 -133735 -180454
14002 -180454 -207761 -159836 -60621 -25580 -33721 -95545 -37939 -8180 -23058 -21724 -43523 20900
13990 20900 90150 71172 81287 59509 64968 84313 37362 5997 70624 94857 77169 80396
13978 80396 9484 -87926 -111341 -47187 -16484 -38150 11285 87259 97640 68827 64145 3096
13966 3096 41925 75487 40780 17493 -50061 -43907 -23812 -7448 30376 11990 -34169 52147
13954 52147 27567 15342 -13996 -22530 -37378 -61660 -96776 -64344 -60073 -58096 -67416 -26650
13942 -26650 -12315 16187 -10565 -25794 6399 77938 18946 -3358 -20671 52064 31563 59203
13930 59203 58499 28038 76161 37356 47338 56767 21256 65849 78261 98361 82732 117701
$$ packed form
14014c6096o6464o3079N1245L6326j0590n4038O2565N7525k1877o7634k1618m6719
14002a80454k7307M7925R9215L5041q141o1824N7606K9759j4878J334k1799O4423
13990B0900O9250j8978J0115k1778N459J9345m6951l1365O4627K4233j7688L227
13978H0396p0912r7410k3415O4154L0703k1666M9435P5974J0381k8813m682o1049
13966C096L8829L3562l4707k3287o7554O154K0095J6364L7824j8386m6159Q6316
13954E2147k4580j2225k9338q534j4848k4282l5116L2432M271J977r320M0766
13942b6650J4335K8502k6752j5229L2193P1539n8992k2304j7313P2735k0501K7640
13930E9203p04l0461M8123l8805R982R429l5511M4593J2412K0100j5629L4969
$$ plain form
13918 117701 129747 68219 104817 117219 94467 63993 -20079 -41319 57198 118047 103333
13907 103333 19489 19620 10773 89803 187685 164776 120339 81277 48605 111636 153625 223813
13895 223813 211543 201898 151382 83014 60112 28136 51438 39142 42217 -6745 -51164 -6514
13883 -6514 53254 85471 66317 103898 72445 31295 91243 69363 -38648 -117826 -184521 -140641
13871 -140641 -22132 4728 -42669 -88271 -67722 11084 80084 113730 94406 91276 71715
13860 71715 25823 81700 92045 78455 31019 -23825 -100609 -41951 -4823 50128 54749 2872
13848 2872 8165 54536 52891 85004 54612 4711 9182 14022 29944 -24312 -29229 -942 -39495
13835 -39495 -118357 -171345 -177394 -70683 27245 79774 82823 70558 99381 61917 -25040 -51886
$$ packed form
13918A17701J2046o1528L6598J2402k2752l0474q4072k1240R8517O0849j4714
13907A03333q3844J31q847P9030R7882k2909m4437l9062l2672O3031M1989P0188
13895B23813j2270r645n0516o8368k2902l1976K3302j2296L075m8962m4419M4650
13883f514N9768L2217j9154L7581l1453m1150N9948k1880j08011p9178o6695M3880
13871a40641J18509K6860m7397m5602K0549P8806O9000L3646j9324l130j9561
13860G1715m5892N5877J0345j3590m7436n4844p6784N8658L7128N4951M621n1877
13848B872N293M6371j645L2113l0392m9901M471M840J5922n4256m917K8287l8553
13835c9495p8862n2988o049J06711R7928N2529L049j2265K8823l7464q6957k6846
$$ plain form
13823 -51886 -44190 9787 8663 -54197 -110320 -101286 -103793 -160285 -170546 -95688 -100939 -143377 -60779
13810 -60779 49751 -2291 -40356 25368 17900 1463 60956 30218 -23881 -8669 -1849 -65508
13798 -65508 -79922 -55198 12487 3795 -1321 -24673 -51809 -131782 -104535 -2086 8077 -53322
13786 -53322 -126789 -45522 40283 104419 101951 19548 -6253 42502 11926 -35139 -46113 -26654
13774 -26654 -14499 26875 51403 16050 52277 13133 -42473 -2491 10775 11421 -4639 -12623
13762 -12623 34113 56799 37961 59575 79579 85147 88930 81107 -7394 -54884 -152485 -169404
13750 -169404 -108117 66515 86262 -56383 -70884 29211 25871 51629 31808 23123 38707
13739 38707 91339 35108 53167 -27418 -50792 -11133 19399 54912 -22338 -96416 -102415 -76286
$$ packed form
13823e1886P696N3977j124o2860n6123R034k507n6492j0261P4858n251m2438Q2598
13810f0779J10530n2042l8065O5724p468j6437N9493l0738n4099J5212O820o3659
13798f5508j4414K4724O7685q692n116k3352k7136p9973K7247J02449J0163o1399
13786e3322p3467Q1267Q5805O4136k468q2403k5801M8755l0576m7065j0974J9459
13774b6654J2155M1374K4528l5353L6227l9144n5606L9982J3266O46j6060p984
13762a2623M6736K2686j8838K1614K0004N568L783p823q8501m7490r7601j6919
13750a69404O1287J74632J9747j42645j4501J00095l340K5758j9821q685J5584
13739C8707N2632n6231J8059q0585k3374L9659L0532L5513p7250p4078n999K6129
$$ plain form
13727 -76286 -9814 87992 82377 90568 48840 17146 25076 29133 38969 85585 27229 -52231 -60382
13714 -60382 -39568 -71627 -38045 25451 76095 118654 158788 80162 11882 -70004 -117254 -121121
13702 -121121 -103984 2751 45793 36373 11509 20944 -8906 21308 99916 179485 165903 171142
13690 171142 231718 244712 165816 97470 110995 70365 87489 7041 20331 -16414 -63962
13679 -63962 -26107 27288 10396 -61934 -58383 -54126 -48348 -9153 -13028 23270 20219 -12648 -35277
13666 -35277 641 22282 50762 65696 64247 45502 33631 36879 47751 79261 147989 118743
13654 118743 78139 158811 180564 168735 221556 225036 195374 143303 143382 148797 188586 268341
13642 268341 363336 427668 500758 514701 454715 415982 410997 382406 300153 257848 270711 291262
$$ packed form
13727g6286O6472R7806n615Q191m1728l1694P930M057R836M6616n8356p9460q151
13714f0382K0814l2059L3582O3496N0644M2559M0134p8626o8280q1886m7250l867
13702a21121J7137J06735M3042r420k4864R435k9850L0214P8608P9569j3582N239
13690A71142O0576J2994p8896o8346J3525m0630J7124q0448J3290l6745m7548
13679f3962L7855N3395j6892p2330L551M257N778L9195l875L6298l051l2867k2629
13666c5277L5918K1641K8480J4934j449j8745j1871L248J0872L1510O8728k9246
13654A18743m0604Q0672K1753j1829N2821L480k9662n2071P9N415L9789P9755
13642B68341R4995O4332P3090J3943n9986l8733m985k8591q2253m2305J2863K0551
$$ plain form
13630 291262 256673 292853 374688 407006 419245 353310 288259 299383 295060 351016 382805 317987
13618 317987 298647 287478 225954 230040 252376 212300 153001 21658 37157 71335 58506
13607 58506 23657 27977 58308 99748 145984 54766 -25235 -33235 -26767 -31672 27241 68063
13595 68063 22929 23907 30455 10903 -21191 -19039 7778 -4860 28243 45195 19255 -54474
13583 -54474 -82298 -42802 4816 18475 -13905 -28271 -74399 -106308 -20378 48927 59043 51809
13571 51809 -5262 -13271 581 -11054 -13833 -34995 -60548 13849 60269 -4835 -37536 -42852
13559 -42852 21587 30263 40272 1925 -22498 28961 44582 38818 34276 66637 122507 66935
13547 66935 24105 -1006 -46996 25481 56351 16769 55282 53258 62654 103192 155496 167883
$$ packed form
13630B91262l4589L6180Q1835L2318J2239o5935o5051J1124m323N5956L1789o4818
13618C17987j9340j1169o1524M086K2336m0076n9299j31343J5499L4178j2829
13607E8506l4849M320L0331M1440M6236r1218q0001q000O468m905N8913M0822
13595F8063m5134R78O548j9552l2094K152K6817j2638L3103J6952k5940p3729
13583e4474k7824L9496M7618J3659l2380j4366m6128l1909Q5930O9305J0116p234
13571E1809n7071q009J3852j1635k779k1162k5553P4397M6420o5104l2701n316
13559d2852O4439Q676J0009l8347k4423N1459J5621n764m542L2361N5870n5572
13547F6935m2830k5111m5990P2477L0870l9582L8513k024R396M0538N2304J2387
$$ plain form
13535 167883 136033 106195 109100 16033 -56095 -114488 -79037 -79436 -75816 -40987 14972 33160
13523 33160 -3941 -66412 -116769 -139470 -148652 -180594 -118093 -5810 44884 57668 122232 99330
13511 99330 11411 -50389 -19404 17552 23894 1236 -14162 35766 10233 2676 -18052 8837
13499 8837 -12057 -38132 -111448 -41209 -29341 22997 52396 6976 -33355 -140741 -115937 -37062
13487 -37062 33114 46170 3192 -24112 6585 37332 -39341 -130905 -56681 44744 107815
13476 107815 122692 82921 58741 124762 172890 153056 139244 52314 -43496 -99938 -14363
13465 -14363 23637 -28201 -32043 -70994 -68036 49400 7270 -75686 -117305 -191023 -213068 -162309
13453 -162309 -142873 -174743 -132343 -10774 20319 8459 -31037 11135 50389 2122 -14992
$$ packed form
13535A67883l1850k9838K905r3067p2128n8393L5451l99L620L4829N5959J8188
13523C3160l7101o2471n0357k2701r182l1942O2501J12283N0694J2784O4564k2902
13511I9330q7919o1800L0985L6956O342k2658j5398M9928k5533p557k0728K6889
13499H837k0894k6075p3316P0239J1868N2338K9399m5420m0331j07386K4804P8875
13487c7062P0176J3056m2978k7304L0697L0747p6673r1564P4224J01425O3071
13476A07815J4877l9771k4180O6021M8128j9834j3812q6930r5810n6442Q5575
13465a4363L8000n1838l842l8951K958J17436m2130q2956m1619p3718k2045N0759
13453a62309J9436l1870M2400J21569L1093j1860l9496M2172L9254m8267j7114
$$ plain form
13442 -14992 -14297 13319 -4549 -56712 -78310 -98645 -97401 -59107 17664 95514 97350 74091
13430 74091 -30730 -46824 -25277 -2465 26501 -29904 -14258 -13788 27849 18944 -9348 -21108
13418 -21108 -25844 16101 108405 83877 34467 40117 81293 43529 -65178 -44086 -40136 -13289
13406 -13289 24852 63239 60190 48094 21291 50448 16431 -22125 95192 134818 99807 41581
13394 41581 79929 49696 -14838 67622 77326 26560 118448 193494 216736 197744 275546 389879
13382 389879 408139 438049 459427 526007 590706 649244 665868 687532 610527 474385 356228
13371 356228 283537 175820 167571 193155 186756 180502 103599 81768 131667 214081 223362 164439
13359 164439 168358 103621 34023 14796 39853 68514 63131 54436 40901 52651 34285 -29425
$$ packed form
13442a4992O95K7616j7868n2163k1598k0335J244L8294P6771P7850J836k3259
13430G4091j04821j6094K1547K2812K8966n6405J5646M70M1637q905k8292j1760
13418b1108m736M1945R2304k4528m9410N650M1176l7764j08707K1092L950K6847
13406a3289L8141L8387l049j2096k6803K9157l4017l8556J17317L9626l5011n8226
13394D1581L8348l0233o4534Q2460R704n0766R1888P5046K3242j8992P7802J14333
13382C89879J8260K9910K1378O6580O4699N8538J6624K1664p7005j36142j18157
13371C56228p2691j07717q249K5584o399o254p6903k1831M9899Q2414R281n8923
13359A64439L919o4737o9598j9227K5057K8661n383q695j3535J1750j8366o3710
$$ plain form
13347 -29425 10441 71035 82132 37748 22652 -37908 -66337 -8576 71908 116930 102482 118979
13335 118979 163379 84645 80531 103006 115317 61344 -28376 -20490 -23138 -60621 -24631 40418
13323 40418 120854 153897 115737 39064 58399 -13112 -67408 -38303 -17729 -37210 -64547 5321
13311 5321 95163 79058 -56669 -124570 -90056 -49788 -54471 -19413 40897 44282 58215 3895
13299 3895 -2389 -20103 12922 44397 -7373 -17750 -59001 -34366 28967 -14357 -14167 -63753
13287 -63753 -112474 -100624 -21940 -17677 -80645 -120241 -115051 15516 141193 162115 84304 -11888
13275 -11888 -42229 -63260 -47908 -31115 -63893 -74289 20623 45980 -58230 -113043 -30991
13264 -30991 87442 63455 6141 -4765 -25985 -1670 17918 -6080 -37859 -65839 -56467 -11745
$$ packed form
13347b9425L9866O0594J1097m4384j5096o0560k8429N7761Q0484M5022j4448J6497
13335A18979M4400p8734m114K2475J2311n3973q9720P886k648l7483L5990O5049
13323D0418Q0436L3043l8160p6673J9335p1511n4296K9105K0574j9481k7337O9868
13311E321Q9842j6105j35727o7901L4514M0268m683L5058O0310L385J3933n4320
13299C895o284j7714L3025L1475n1770j0377m1251K4635O3333m3324J90m9586
13287f3753m8721J1850P8684M263o2968l9596N190J30567J25677K0922p7811r6192
13275a1888l0341k1031J5352J6793l2778j0396R4912K5357j04210n4813Q2052
13264c0991J18433k3987n7314j0906k1220K4315J9588k3998l1779k7980R372M4722
$$ plain form
13252 -11745 92292 109716 55303 25432 10378 -77132 -95776 -22707 27819 43194 131710
13241 131710 118780 44766 38768 102252 117195 109967 87335 46325 17698 18075 23306 -31825
13229 -31825 -33719 -71347 -116720 -127696 -156061 -112139 -89701 -58092 -54396 -2698 80058 47857
13217 47857 7001 9270 5341 63600 98736 61253 -32323 -13606 33815 82057 126675 167044
13205 167044 173814 110632 36138 16814 -15633 -10163 27756 -8826 32053 5450 7874 11057
13193 11057 40112 88862 106523 72696 82750 44708 14352 105810 107751 35503 42640 103041
13181 103041 147832 121796 68855 23585 53225 105266 129623 41699 54336 64352 87674
13170 87674 157531 191292 159044 122435 137304 172406 260950 351747 390825 426464 395137 285005
$$ packed form
13252a1745J04037J7424n4413k9871j5054q7510j8644P3069N0526J5375Q8516
13241A31710j2930p4014n998O3484J4943p228k2632m1010k8627L77N231n5131
13229c1825j894l7628m5373j0976k8365M3922K2438L1609L696N1698Q2756l2201
13217D7857m0856K269l929N8259L5136l7483r3576J8717M7421M8242M4618M0369
13205A67044O770o3182p4494j9324l2447N470L7919l6582M0879k6603K424L183
13193A1057K9055M8750J7661l3827J0054l8042l0356R1458J941p2248P137O0401
13181A03041M4791k6036n2941m5270K9640N2041K4357q7924J2637J0016K3322
13170H7674O9857L3761l2248l6609J4869L5102Q8544R0797L9078L5639l1327j10132
$$ plain form
13158 285005 190298 153269 154541 120999 82017 164889 204197 162545 111190 91278 75142 39273
13146 39273 52763 79039 81127 -9164 -25768 -55994 -39822 21319 89750 73971 -27549 -48339
13134 -48339 51858 190418 250330 181752 94822 122192 145029 137867 142281 130782 130970 260683
13122 260683 304522 315696 329794 393440 454532 500753 482001 444717 385796 336139 232697
13111 232697 127476 62070 90090 165700 129279 40251 30220 55588 102386 137757 116573
13100 116573 96200 24157 27509 109793 84072 23236 -51173 -41880 55061 69505 -20847 -14391
13088 -14391 78175 101827 64405 82232 140777 110058 50229 84571 69014 37842 12862 55788
13076 55788 96980 170577 237410 207949 206458 169493 168114 231479 185429 134147 148839 190995
$$ packed form
13158B85005r4707l7029J272l3542l8982Q2872L9308m1652n1355j9912j6136l5869
13146C9273J3490K6276K088r0291j6604l0226J6172O1141O8431j5779j01520k0790
13134d8339J00197J38560N9912o8578q6930K7370K2837p162M414j1499J88J29713
13122B60683M3839J1174J4098O3646O1092M6221j8752l7284n8921m9657j03442
13111B32697j05221o5406K8020P5610l6421q9028j0031K5368M6798L5371k1184
13100A16573k0373p2043L352Q2284k5721o0836p4409R293R6941J4444r0352O456
13088a4391R2566K3652l7422J7827N8545l0719n9829L4342j5557l1172k4980M2926
13076E5788M1192P3597O6833k9461j491l6965j379O3365m6050n1282J4692M2156
$$ plain form
13064 190995 165121 129927 53971 -108 -6234 75190 136389 149325 122383 104364 123959 127916
13052 127916 31949 7830 68530 79614 37909 -3139 12779 22331 111028 164543 107698 65705
13040 65705 52884 128158 132157 87984 120002 96922 71333 134718 30770 37407 140906 175067
13028 175067 195758 143968 153492 125630 137110 140817 128411 67944 52274 45482 -13993 -86234
13016 -86234 -40491 33842 44811 103589 127729 91436 -1999 1253 68640 105630 103393 146967
13004 146967 211637 182087 147062 93430 108049 188264 207590 146717 104486 96953 64574 110372
12992 110372 152023 171956 162448 214266 252463 145395 128741 115720 145835 111226 134361
12981 134361 173408 183474 206904 183574 144150 160297 100330 40477 29329 66557 118112
$$ packed form
13064A90995k5874l5194p5956n4079o126Q1424O1199J2936k6942j8019J9595L957
13052A27916r5967k4119O0700J1084m1705m1048J5918R552Q8697N3515n6845m1993
13040F5705j2821P5274L999m4173L2018k3080k5589O3385j03948O637J03499L4161
13028A75067K0691n1790R524k7862J1480L707j2406o0467j5670o792n9475p2241
13016h6234M5743P4333J0969N8778K4140l6293r3435L252O7387L6990k237M3574
13004A46967O4670k9550l5025n3632J4619Q0215J9326o0873m2231p533l2379M5798
12992A10372M1651J9933r508N1818L8197j07068j6654j3021L0115l4609K3135
12981A34361L9047J0066K3430k3330l9424J6147n9967n9853j1148L7228N1555
$$ plain form
12970 118112 156911 110349 68078 84593 126688 162231 200944 284045 255033 209750 163062
12959 163062 134299 179742 120402 76507 97480 63040 44301 70190 102433 165219 259832
12948 259832 249464 192037 191958 186237 216884 214869 194670 199005 240456 276177 254028 201466 131731
12935 131731 89673 54584 9925 30957 62757 92557 117390 187803 251569 190077 164930
12924 164930 204594 217570 216156 146364 121623 141014 150860 184336 214511 239868 148805 147818
12912 147818 228437 240582 236215 230288 226478 154810 105650 65702 51497 109407 172144 136039
12900 136039 176609 202268 149983 164826 191127 142868 145675 87014 41112 86878 141277 167842
12888 167842 159236 111146 99580 103873 78008 25334 18807 157239 183881 153275 147395 184968
$$ packed form
12970A18112L8799m6562m2271J6515M2095L5543L8713Q3101k9012m5283m6688
12959A63062k8763M5443n9340m3895K0973l4440j8739K5889L2243O2786R4613
12948B59832j0368n7427p9n721L0647k015k0199M335M1451L5721k2149n2562o9735
12935A31731m2058l5089m4659K1032L1800K9800K4833P0413O3766o1492k5147
12924A64930L9664J2976j414o9792k4741J9391R846L3476L0175K5357r1063r87
12912A47818Q0619J2145m367n927l810p1668m9160l9948j4205N7910O2737l6105
12900A36039M0570K5659n2285J4843K6301m8259K807n8661m5902M5766N4399K6565
12888A67842q606m8090j1566M293k5865n2674o527J38432K6642l0606n880L7573
$$ plain form
12876 184968 225099 218333 180868 219846 221673 254122 179430 133660 78768 74549 81661 40889
12864 40889 79941 150744 213123 222179 217083 179352 145000 141389 214412 224425 219349 149857
12852 149857 148055 209426 187371 193089 166068 170172 189716 197465 201196 177870 221370 218588 225446
12839 225446 216540 225053 259630 316614 319985 310587 398050 318514 221233 239409 284563 259039
12827 259039 267023 292351 308226 333953 334181 259262 233982 339669 339174 257434 188225 183445
12815 183445 230415 275572 256815 304352 338667 355706 294099 283432 196084 210638 273777
12804 273777 316456 356625 377746 409412 436340 445741 358932 296228 294119 322244 294751 315200
12792 315200 327140 177435 156620 249196 401471 392425 308673 312358 277945 277353 234298 284910
$$ packed form
12876A84968M0131o766l7465L8978J827L2449p4692m5770n4892m219P112m0772
12864D0889L9052P0803O2379R056n096l7731l4352l611P3023J0013n076o9492
12852A49857j802O1371k2055N718k7021M104J9544P749L731k3326M3500k782O858
12839B25446q906Q513L4577N6984L371r398Q7463p9536r7281J8176M5154k5524
12827B59039P984K5328J5875K5727K28p4919k5280J05687m95q1740o9209m780
12815A83445M6970M5157j8757M7537L4315J7039o1607j0667q7348J4554O3139
12804B73777M2679M0169K1121L1666K6928R401q6809o2704k109K8125k7493K0449
12792C15200J1940j49705k0815R2576J52275r046q3752L685l4413n92m3055N0612
$$ plain form
12780 284910 322996 311898 357221 335758 357805 360419 337785 338581 401364 376825 365429 380054
12768 380054 371777 370166 384618 426077 397073 381112 395640 385391 413669 430682 453533 520592
12756 520592 530759 405357 399045 524396 512274 480857 502747 500014 440923 425565 476096
12745 476096 555312 555555 527302 534912 492719 443261 392802 387732 361895 414120 464203 477157
12733 477157 507024 601132 578201 531021 459891 393943 421990 373521 405484 520359 539308
12722 539308 501320 420110 429879 456325 451744 461829 495883 497248 560120 613403 585472 576136
12710 576136 557858 562839 530395 529206 493528 432051 435073 561401 618231 621752 672651 630055
12698 630055 572376 573079 542529 511349 548131 573856 525602 491501 554557 669355 692278 733776
$$ packed form
12780B84910L8086j1098M5323k1463K2047K614k2634P96O2783k4539j1396J4625
12768C80054q277j611J4452M1459k9004j5961J4528j0249K8278J7013K2851O7059
12756E20592J0167j25402o312J25351j2122l1417K1890k733n9091j5358N0531
12745D76096P9216K43k8253P610m2193m9458n0459n070k5837N2225N0083J2954
12733D77157K9867R4108k2931m7180p1130o5948K8047m8469L1963J14875J8949
12722E39308l7988q1210R769K6446m581J0085L4054J365O2872N3283k7931r336
12710E76136j8278M981l2444j189l5678o1477L022J26328N6830L521N0899m2596
12698F30055n7679P03l0550l1180L6782K5725m8254l4101O3056J14798K2923M1498
$$ plain form
12686 733776 692395 656981 674751 711056 701092 671328 631687 639691 715925 761788 733716 741880
12674 741880 708321 707425 758572 705039 663797 697996 657651 660144 790641 902489 874613 868762
12662 868762 807770 806562 817259 827910 862688 802417 785769 859211 869001 898470 851814 809887
12650 809887 828848 919679 952885 948262 928168 938430 927545 836590 890170 1023247 1038702
12639 1038702 999836 938887 949225 926711 885093 925316 998413 1057499 1086023 1088634 1131620
12628 1131620 1178739 1167402 1194411 1208457 1215241 1232139 1235247 1171614 1094763 1104553 1170688 1236625
12616 1236625 1156385 1129374 1256506 1347025 1413554 1454501 1470924 1400534 1415187 1417171 1431978
12605 1431978 1569616 1627427 1558418 1511132 1536431 1479119 1529946 1583424 1583460 1627512 1650872 1628852
$$ packed form
12686G33776m1381l5414J7770L6305r964k9764l9641Q004P6234M5863k8072Q164
12674G41880l3559q96N1147n3533m1242L4199m0345K493J30497J11848k7876n851
12662H68762o0992j208J0697J0651L4778o0271j6648P3442R790K9469m6656m1927
12650H09887J8961R0831L3206m623k0094J0262j0885r0955N3580J33077J5455
12639A038702l8866o0949J0338k2514m1618M0223P3097N9086K8524K611M2986
12628A131620M7119j1337K7009J4046O784J6898L108o3633p6851R790O6135O5937
12616A236625q0240k7011J27132R0519O6529M0947J6423p0390J4653J984J4807
12605A431978J37638N7811o9009m7286K5299n7312N0827N3478L6M4052K3360k2020
$$ plain form
12593 1628852 1600413 1678256 1695716 1672228 1671684 1650244 1711244 1793394 1749384 1765976 1716282 1713574
12581 1713574 1717625 1838504 1862270 1811334 1799639 1809568 1755984 1706275 1750095 1797074 1868575
12570 1868575 1942946 2011428 2000555 1941277 1985088 1996889 1964916 1977869 2019149 2066785 2076884
12559 2076884 2095312 2084840 2076844 2041973 2036246 2082106 2186649 2235406 2271962 2262503 2232481 2223937
12547 2223937 2221005 2227503 2223144 2263604 2352615 2360767 2412458 2516318 2556412 2682342 2706059 2661355
12535 2661355 2618465 2667617 2741732 2756757 2779679 2764139 2772945 2814474 2812958 2840495 2810527 2835001
12523 2835001 2958326 2999809 3010125 3004631 2988126 3024662 3152039 3270986 3342335 3396542 3368355
12512 3368355 3287870 3315037 3310887 3347152 3436979 3524980 3565532 3538612 3479414 3519372 3581273
$$ packed form
12593A628852k8439P7843J7460k3488n44k1440O1000Q2150m4010J6592m9694k708
12581A713574M051J20879K3766n0936j1695R929n3584m9709M3820M6979P1501
12570A868575P4371O8482j0873n9278M3811J1801l1973J2953M1280M7636J0099
12559B076884J8428j0472p996l4871n727M5860J04543M8757L6556r459l0022q544
12547B223937k932O498m359M0460Q9011Q152N1691J03860M0094J25930K3717m4704
12535B661355m2890M9152P4115J5025K2922j5540Q806M1529j516K7537k9968K4474
12523B835001J23325M1483J0316n494j6505L6536J27377J18947P1349N4207k8187
12512C368355q0485K7167m150L6265Q9827Q8001M0552k6920n9198L9958O1901
$$ plain form
12501 3581273 3621987 3682838 3649020 3630918 3669582 3749627 3897665 4070108 4152017 4206060 4191514
12490 4191514 4234169 4373403 4422224 4425239 4556736 4708260 4753606 4816729 4881462 4937219 4950524
12479 4950524 5008229 5100351 5171936 5224646 5279352 5314338 5459129 5601475 5757878 5874045
12469 5874045 6069143 6169247 6215276 6237945 6297835 6409442 6459096 6495900 6629882 6805520
12459 6805520 6956819 7079365 7208282 7285631 7341241 7495079 7724238 7939261 8157738 8334648
12449 8334648 8514151 8689135 8845283 8971075 9063197 9255690 9392603 9564704 9763249 9956709
12439 9956709 10215203 10445931 10631270 10909176 11184442 11380403 11553145 11818097 12111558
12430 12111558 12361306 12621722 12898556 13178064 13524122 13804608 14110769 14419950 14777458
$$ packed form
12501C581273M0714O0851l3818j8102L8664Q0045J48038J72443Q1909N4043j4546
12490D191514M2655J39234M8821L015J31497J51524M5346O3123O4733N5757J3305
12479D950524N7705R2122P1585N2710N4706L4986J44791J42346J56403J16167
12469E874045J95098J00104M6029K2669N9890J11607M9654L6804J33982J75638
12459F805520J51299J22546J28917P7349N5610J53838K29159K15023K18477J76910
12449H334648J79503J74984J56148J25792R2122J92493J36913J72101J98545J93460
12439I956709K58494K30728J85339K77906K75266J95961J72742K64952K93461
12430A2111558K49748K60416K76834K79508L46058K80486L06161L09181L57508
$$ plain form
12421 14777458 15042279 15356922 15734117 16112135 16424535 16838197 17319668 17893400 18402326
12412 18402326 18791710 19183589 19686673 20224820 20753680 21293456 21877691 22527168 23211374
12403 23211374 23862817 24413015 25036224 25829021 26565641 27343083 28141869 28957674 29888905
12394 29888905 30929030 31846344 32835358 33934101 35012969 36127513 37336579 38635158
12386 38635158 39967255 41244174 42523723 43869826 45152867 46363995 47618691 48758905
12378 48758905 49769537 50801623 51844122 52998212 54142146 55243554 56350302 57570928
12370 57570928 58728226 59889989 61098224 62366810 63528789 64636859 65686941 66626310
12362 66626310 67522476 68430124 69240640 69981249 70580517 71122171 71564710 71891879 72059767
$$ packed form
12421A4777458K64821L14643L77195L78018L12400M13662M81471N73732N08926
12412A8402326L89384L91879N03084N38147N28860N39776N84235O49477O84206
12403B3211374O51443N50198O23209P92797P36620P77442P98786Q15805R31231
12394B9888905J040125R17314R89014J098743J078868J114544J209066J298579
12386C8635158J332097J276919J279549J346103J283041J211128J254696J140214
12378D8758905J010632J032086J042499J154090J143934J101408J106748J220626
12370E7570928J157298J161763J208235J268586J161979J108070J050082R39369
12362F6626310Q96166R07648Q10516P40609N99268N41654M42539L27169J67888
$$ plain form
12353 72059767 72139650 72144926 72077414 71856794 71609392 71248968 70825882 70285717 69629679 68848199
12343 68848199 68025196 67176260 66289554 65444109 64530873 63524744 62446593 61388117 60367664
12334 60367664 59283121 58113700 56958645 55883377 54831037 53745530 52612385 51396684
12326 51396684 50296755 49230173 48125900 47063951 45973720 44948639 43849730 42839580
12318 42839580 41824797 40833532 39876842 38931234 38050570 37186544 36196392 35258327 34510472
12309 34510472 33743563 32981282 32202981 31478835 30679774 29901673 29233601 28559346 27902185
12300 27902185 27248376 26626990 25991030 25416941 24785135 24299318 23804635 23213504 22652513
12291 22652513 22173980 21693765 21194585 20689972 20200076 19772310 19414161 19001917 18621160
$$ packed form
12353G2059767P9883N276o7512k20620k47402l60424m23086n40165o56038p81480
12343F8848199q23003q48936q86706q45445r13236j006129j078151j058476j020453
12334F0367664j084543j169421j155055j075268j052340j085507j133145j215701
12326E1396684j099929j066582j104273j061949j090231j025081j098909j010150
12318D2839580j014783r91265r56690r45608q80664q64026r90152r38065p47855
12309C4510472p66909p62281p78301p24146p99061p78101o68072o74255o57161
12300B7902185o53809o21386o35960n74089o31806m85817m94683n91131n60991
12291B2652513m78533m80215m99180n04613m89896m27766l58149m12244l80757
$$ plain form
12282 18621160 18240044 17959577 17627799 17333045 17045558 16709637 16481007 16323977 16189467
12273 16189467 16089656 15914646 15704139 15514834 15296454 15011091 14789681 14553234 14088665
12264 14088665 13645757 13236545 12889983 12603585 12263435 11893421 11649915 11411707 11191981
12255 11191981 10994363 10865464 10627224 10340355 10156716 10052890 9813105 9545914 9372404
12246 9372404 9229639 9092114 9012772 8852096 8684705 8566990 8384373 8240741 8176038 8125150
12236 8125150 7957324 7760822 7680201 7662894 7585098 7438596 7283394 7246565 7256898 7186123
12226 7186123 7150005 7017750 6900730 6844245 6752702 6667776 6657832 6504660 6351656 6226814
12216 6226814 6115598 5969062 5805453 5736704 5707756 5625459 5529627 5449245 5393733 5334498 5289634
$$ packed form
12282A8621160l81116k80467l31778k94754k87487l35921k28630j57030j34510
12273A6189467r9811j75010k10507j89305k18380k85363k21410k36447m64569
12264A4088665m42908m09212l46562k86398l40150l70014k43506k38208k19726
12255A1191981j97618j28899k38240k86869j83639j03826k39785k67191j73510
12246I372404j42765j37525p9342j60676j67391j17715j82617j43632o4703n0888
12236H125150j67826j96502q0621j7307p7796j46502j55202l6829J0333p0775
12226G186123l6118j32255j17020n6485r1543q4926r944j53172j53004j24842
12216F226814j11216j46536j63609o8749k8948q2297r5832q0382n5512n9235m4864
$$ plain form
12205 5289634 5237402 5126513 5080214 5018896 4992576 4870661 4753268 4726995 4724935 4657889 4593648
12194 4593648 4495384 4479418 4516764 4485768 4423356 4318069 4213796 4099995 4066271 4066536 4077270
12183 4077270 4030011 4045334 4096864 4079752 3969395 3869930 3808043 3847293 3844423 3780010 3706939
12172 3706939 3650573 3667752 3623526 3560632 3529804 3473332 3317644 3286629 3319713 3227375 3145870
12161 3145870 3109275 3023881 3004886 3064479 3084086 3059660 2963654 2940822 2907846 2904796 2903806 2917623
12149 2917623 2946246 2885946 2920053 2939992 2902590 2817874 2785828 2767170 2844523 2862871 2729599
12138 2729599 2683056 2650990 2667521 2695156 2734205 2650139 2569959 2574076 2535450 2508513 2470983
12127 2470983 2350625 2193053 2085071 1932947 1786838 1669522 1598749 1623151 1657823 1760810
$$ packed form
12205E289634n2232j10889m6299o1318k6320j21915j17393k6273k060o7046o4241
12194D593648r8264j5966L7346l0996o2412j05287j04273j13801l3724K65J0734
12183D077270m7259J5323N1530j7112j10357r9465o1887L9250k870o4413p3071
12172C706939n6366J7179m4226o2894l0828n6472j55688l1015L3084r2338q1505
12161C145870l6595q5394j8995N9593J9607k4426r6006k2832l2976l050r90J3817
12149B917623K8623o0300L4107J9939l7402q4716l2046j8658P7353J8348j33272
12138B729599m6543l2066J6531K7635L9049q4066q0180M117l8626k6937l7530
12127B470983j20358j57572j07982j52124j46109j17316p0773K4402L4672J02987
$$ plain form
12117 1760810 1807338 1779050 1778249 1866927 1925563 1980585 2017527 2032101 2145347 2226502 2217048 2278623
12105 2278623 2373426 2415832 2456367 2414437 2462042 2556035 2609341 2608047 2677475 2710962 2727851
12094 2727851 2730877 2688362 2580346 2503505 2389181 2182890 2016399 1940099 1806591 1727812
12084 1727812 1669863 1649032 1699766 1768869 1734898 1618625 1615628 1601961 1591393 1663616 1727332
12073 1727332 1746813 1701695 1701507 1763468 1711206 1704730 1743996 1724302 1751500 1812773 1798746 1817515
12061 1817515 1844701 1890433 1947307 2039276 2005846 2027265 2038333 1989626 2078822 2098875 2118832
12050 2118832 2118119 2103149 2108360 2140820 2094954 2105936 2159907 2213825 2180260 2165043 2236486 2353052
12038 2353052 2357031 2360963 2378764 2441629 2490490 2582449 2548978 2544694 2601735 2581564 2489933 2510058
$$ packed form
12117A760810M6528k8288q01Q8678N8636N5022L6942J4574J13246Q1155r454O1575
12105B278623R4803M2406M0535m1930M7605R3993N3306j294O9428L3487J6889
12094B727851L026m2515j08016p6841j14324k06291j66491p6300j33508p8779
12084A727812n7949k0831N0734O9103l3971j16273k997j3667j0568P2223O3716
12073A727332J9481m5118j88O1961n2262o476L9266j9694K7198O1273j4027J8769
12061A817515K7186M5732N6874R1969l3430K1419J1068m8707Q9196K0053J9957
12050B118832p13j4970N211L2460m5866J0982N3971N3918l3565j5217P1443J16566
12038B353052L979L932J7801O2865M8861R1959l3471m284N7041k0171r1631K0125
$$ plain form
12026 2510058 2621547 2680709 2623187 2636703 2686992 2718866 2811187 2820898 2817966 2875511 2906081
12015 2906081 2920059 3056473 3066842 3076174 3085078 3142414 3265650 3370726 3457566 3639002 3840581
12004 3840581 4042023 4344579 4697724 5026030 5353332 5700971 6187557 6693685 7333806
11995 7333806 8014546 8804643 9889040 11208910 12610035 14204635 16186965 18539121
11987 18539121 21292960 24426713 28002861 32193460 36930918 42371702 48865865 56937851
11979 56937851 67398123 81212775 99422996 123201786 153689377 191381175 235669931
11972 235669931 284687322 334744504 381136424 419571329 445808484 455996680 448206651
11965 448206651 423894282 386427836 339842837 289074639 239861429 196104313 159377204
$$ packed form
12026B510058J11489N9162n7522J3516N0289L1874R2321R711k932N7545L0570
12015B906081J3978J36414J0369R332Q904N7336J23236J05076Q6840J81436K01579
12004C840581K01442L02556L53145L28306L27302L47639M86586N06128O40121
11995G333806O80740P90097J084397J319870J401125J594600J982330K352156
11987A8539121K753839L133753L576148M190599M737458N440784O494163Q071986
11979E6937851J0460272J3814652J8210221K3778790L0487591L7691798M4288756
11972B35669931M9017391N0057182M6391920L8434905K6237155J0188196p790029
11965D48206651k4312369l7466446m6584999n0768198m9213210m3757116l6727109
$$ plain form
11958 159377204 130486982 109663011 95317054 85478459 78410018 72963210 68420544
11951 68420544 64443809 60822632 57411687 54389447 51668574 49383907 47397583 45638090
11943 45638090 44091765 42692778 41415502 40047433 38494122 36882081 35248613 33546787
11935 33546787 31786518 30028824 28455994 26924515 25490628 24107692 22867996 21711193
11927 21711193 20604516 19539900 18543488 17610581 16696518 15800600 14996397 14308501 13590705
11918 13590705 12898347 12344857 11884611 11304021 10731298 10210452 9716994 9261277 8912873
11909 8912873 8513634 8040723 7705320 7414672 7173792 6865814 6617230 6335966 6027804
11900 6027804 5783485 5587502 5396930 5230062 5030085 4859534 4743057 4632418 4501265
$$ packed form
11958A59377204k8890222k0823971j4345957r838595p068441n446808m542666
11951F8420544l976735l621177l410945l022240k720873k284667j986324j759493
11943D5638090j546325j398987j277276j368069j553311j612041j633468j701826
11935C3546787j760269j757694j572830j531479j433887j382936j239696j156803
11927B1711193j106677j064616r96412r32907r14063q95918q04203o87896p17796
11918A3590705o92358n53490m60246n80590n72723n20846m93458m55717l48404
11909H912873l99239m72911l35403k90648k40880l07978k48584k81264l08162
11900F027804k44319j95983j90572j66868j99977j70551j16477j10639j31153
$$ plain form
11891 4501265 4329368 4094933 3874587 3702064 3545553 3540742 3519878 3448355 3396001 3297595
11881 3297595 3171959 3072156 3006391 2940725 2872943 2800233 2639860 2509314 2469270 2426518 2388080
11870 2388080 2374476 2379412 2358827 2269374 2260604 2237851 2140496 2054492 1955505 1922686 1932488 1983663
11858 1983663 1995088 1944689 1907952 1949993 2096857 2110163 2103571 2103173 2082599 2060013 2051048 2067000
11846 2067000 2175664 2269691 2270738 2242616 2109522 2033960 2046949 1990583 1864436 1704966 1531935
11835 1531935 1427713 1395111 1417413 1431298 1421528 1410465 1319064 1323019 1346258 1366263 1452536
11824 1452536 1475984 1491400 1547795 1581495 1730336 1829544 1861388 1945025 2010936 2058973 2093592
11813 2093592 2038215 1977827 1838816 1730958 1612429 1474701 1395721 1259162 1049798 1006363
$$ packed form
11891D501265j71897k34435k20346j72523j56511m811k0864p1523n2354r8406
11881C297595j25636r9803o5765o5666o7782p2710j60373j30546m0044m2752l8438
11870B388080j3604M936k0585q9453q770k2753r7355q6004r8987l2819R802N1175
11858A983663J1425n0399l6737M2041J46864J3306o592l98k0574k2586q965J5952
11846B067000J08664R4027J047k8122j33094p5562J2989n6366j26147j59470j73031
11835A531935j04222l2602K2302J3885r770j1063r1401L955K3239K0005Q6273
11824A452536K3448J5416N6395L3700J48841R9208L1844Q3637O5911M8037L4619
11813B093592n5377o0388j39011j07858j18529j37728p8980j36559k09364m3435
$$ plain form
11803 1006363 1025302 1094235 1204953 1211010 1196216 1236272 1221197 1143610 1149092 1258999 1287062
11792 1287062 1212290 1290767 1290828 1294991 1278341 1215048 1122490 1088807 1140034 1202971 1185121 1158784
11780 1158784 1222475 1250900 1242454 1205995 1191172 1141554 1128058 1153917 1135541 1025689 991398
11769 991398 976050 951758 912830 862657 835794 828585 895092 988987 931269 892025 872972 915612
11757 915612 951969 947291 898426 921876 923949 897657 914645 914009 798590 796333 813966 786098
11745 786098 771385 808811 892071 934954 927762 832701 788607 766517 812836 766371 751740 772522
11733 772522 814887 803365 749619 698341 749284 754656 775474 786519 805436 800696 827199 746296
11721 746296 718397 762076 816985 851067 877810 955115 923406 833743 771838 815543 865972
$$ packed form
11803A006363J8939O8933J10718O057j4794M0056j5075p7587N482J09907K8063
11792A287062p4772P8477O1M163j6650o3293r2558l3683N1227O2937j7850k6337
11780A158784O3691K8425q446l6459j4823m9618j3496K5859j8376j09852l4291
11769I91398j5348k4292l8928n0173k6863p209O6507R3895n7718l9244j9053M2640
11757I15612L6357m678m8865K3450K073k6292J6988o36j15419k257J7633k7868
11745G86098j4713L7426Q3260M2883p192r5061m4094k2090M6319m6465j4631K0782
11733G72522M2365j1522n3746n1278N0943N372K0818J1045J8917m740K6503q0903
11721G46296k7899M3679N4909L4082K6743P7305l1709q9663o1905M3705N0429
$$ plain form
11710 865972 819997 776237 856457 879239 804248 806188 682130 641465 685606 609947 568526
11699 568526 675052 662906 615060 633746 694035 719062 678242 716389 783355 806605 780584
11688 780584 791504 800438 781532 761696 736650 713925 671053 592879 533368 540691 565933 533303
11676 533303 534969 536225 572623 656654 695120 706027 681620 684090 737864 697568 622628 652678
11664 652678 665780 720347 792716 777997 832029 913831 950567 884259 855903 960334 1049038
11653 1049038 1029699 1020523 963088 952061 925014 909122 1008200 993424 865905 862945 925903
11642 925903 931491 962657 912494 834729 888570 881472 847590 856427 942514 991658 972632 929492
11630 929492 925898 882761 888929 917141 895798 907935 963822 892824 847303 828070 717546 745159
$$ packed form
11710H65972m5975m3760Q0220K2782p4991J940j24058m0665M4141p5659m1421
11699E68526J06526j2146m7846J8686O0289K5027m0820L8147O6966K3250k6021
11688G80584J0920Q934j8906j9836k5046k2725m2872p8174n9511P323K5242l2630
11676E33303J666J256L6398Q4031L8466J0907k4407K470N3774m0296p4940L0050
11664F52678J3102N4567P2369j4719N4032Q1802L6736o6308k8356J04431Q8704
11653A049038j9339r176n7435j1027k7047j5892R9078j4776j27519k960O2958
11642I25903N588L1166n0163p7765N3841p098l3882Q837Q6087M9144j9026m3140
11630I29492l594m3137O168K8212k1343J2137N5887p0998m5521j9233j10524K7613
$$ plain form
11618 745159 839844 813319 850193 855435 828405 847054 808639 727677 585446 512420 615479
11607 615479 665588 763644 794178 707799 645935 602580 655243 667224 646532 607622 505930
11596 505930 459563 420249 425804 492736 633708 707924 705903 698704 666014 647349 621152 619035
11584 619035 574986 577997 576168 529845 565178 687204 736383 745203 736047 705575 699283 734879
11572 734879 803165 750019 658022 687202 735393 745099 798768 809446 823708 855601 887148 843844
11560 843844 867915 975548 1053812 1195660 1329384 1437859 1639868 1874492 2126663 2376563
11550 2376563 2592354 2775826 2962696 3100705 3183143 3147138 3009027 2849180 2607088 2422544
11540 2422544 2107975 1889140 1757594 1585836 1313277 1170643 1233663 1215008 1180087 1176649
$$ packed form
11618G45159R4685k6525L6874N242k7030J8649l8415q0962j42231p3026J03059
11607F15479N0109R8056L0534q6379o1864m3355N2663J1981k0692l8910j01692
11596E05930m6367l9314N555O6932J40972P4216k021p199l2690j8665k6197k117
11584F19035m4049L011j829m6323L5333J22026M9179Q820r156l0472o292L5596
11572G34879O8286n3146r1997K9180M8191R706N3669J0678J4262L1893L1547m3304
11560H43844K4071J07633P8264J41848J33724J08475K02009K34624K52171K49900
11550B376563K15791J83472J86870J38009Q2438l6005j38111j59847k42092j84544
11540B422544l14569k18835j31546j71758k72559j42634O3020j8655l4921l438
$$ plain form
11530 1176649 1139375 1069712 1010852 1027346 1042518 1017757 1045240 1041385 963588 967605 1004560 883174
11518 883174 771752 771579 768730 727202 705013 683829 654771 660503 707094 683925 610000 566174
11506 566174 551581 581637 576485 586201 609675 577230 543559 467487 475381 545004 625883 614857
11494 614857 551346 553705 651387 666006 673686 639899 630499 544874 479943 541590 561130 597210
11482 597210 611226 530408 495619 496660 469935 490195 543247 627598 617515 628201 613926 542449
11470 542449 561898 566279 531378 524941 630171 659870 619941 485582 356714 379900 402506
11459 402506 407766 442019 451115 455694 455215 432041 450083 521773 476960 472178 539727 626940 574092
11446 574092 568727 528318 449450 333391 299647 281597 379384 392327 413070 408290 387276 377481
$$ packed form
11530A176649l7274o9663n8860J6494J5172k4761K7483l855p7797M017L6955j21386
11518H83174j11422j73k849m1528k2189k1184k9058N732M6591k3169p3925m3826
11506E66174j4593L0056n152R716K3474l2445l3671p6072P894O9623Q0879j1026
11494F14857o3511K359R7682J4619P680l3787r400q5625o4931O1647J9540L6080
11482E97210J4016q0818l4789J041k6725K0260N3052Q4351j0083J0686j4275p1477
11470E42449J9449M381l4901o437J05230K9699l9929j34359j28868K3186K2606
11459D02506N260L4253R096M579m79k3174J8042P1690m4813m782O7549Q7213n2848
11446E74092n365m0409p8868j16059l3744j8050R7787J2943K0743m780k1014r795
$$ plain form
11434 377481 362317 364450 344871 418135 458792 395783 380402 342567 268399 267262 269518 281944
11422 281944 302153 327478 339625 353834 365948 413188 395701 381918 321861 279795 350882
11411 350882 400388 391813 340508 325373 416531 454289 362811 287347 309400 373433 365885 389234
11399 389234 348435 362853 392160 319357 284717 296148 280812 249917 232162 267697 310997
11388 310997 386517 356152 325644 289706 308767 350801 345400 305275 297744 292739 314158 300106
11376 300106 253646 260089 387624 445057 421735 422470 398877 356321 370269 333108 291032 345084
11364 345084 358026 311165 295943 206882 226257 314781 330970 347406 391464 356050 277510
11353 277510 269086 252838 245189 282849 329967 360323 301769 310722 284750 230429 236757 219941
$$ packed form
11434C77481j5164K133j9579P3264M0657o3009j5381l7835p4168j137K256J2426
11422B81944K0209K5325J2147J4209J2114M7240j7487j3783o0057m2066P1087
11411C50882M9506q575n1305j5135R1158L7758r1478p5464K2053O4033p548K3349
11399C89234m0799J4418K9307p2803l4640J1431j5336l0895j7755L5535M3300
11388C10997P5520l0365l0508l5938J9061M2034n401m0125p531n005K1419j4052
11376C00106m6460O443J27535N7433k3322P35k3593m2556J3948l7161m2076N4052
11364C45084J2942m6861j5222q9061J9375Q8524J6189J6436M4058l5414p8540
11353B77510q424j6248p649L7660M7118L0356n8554Q953k5972n4321O328j6816
$$ plain form
11341 219941 228623 190889 196665 224231 242555 284045 292743 332985 368938 315882 285655 320118
11329 320118 340086 337218 310656 228000 263513 300848 256052 281213 268923 272633 278804 183245
11317 183245 162288 214252 265363 300520 294274 300322 256212 265136 339383 347881 288552 243987
11305 243987 270112 227336 181389 245591 271286 290605 235184 162194 158903 159624 67485 84490
11293 84490 164746 176295 184631 186701 273413 331270 280925 163066 162780 243564 269187 332523
11281 332523 279590 240356 245603 274673 265336 305162 370172 305931 264973 298496 253018 229490
11269 229490 275309 281933 202678 104016 143779 204481 279453 333028 301395 248115 238974 274902
11257 274902 309379 321262 325429 264093 202699 201376 153976 150512 114776 218406 310254 284030
$$ packed form
11341B19941Q682l7734N776K7566J8324M1490Q698M0242L5953n3056l0227L4463
11329C20118J9968k868k6562q2656L5513L7335m4796K5161j2290L710O171r5559
11317A83245k0957N1964N1111L5157o246O048m4110Q924P4247Q498n9329m4565
11305B43987K6125m2776m5947O4202K5695J9319n5421p2990l291P21r2139J7005
11293H4490Q0256J1549Q336K070Q6712N7857n0345j17859k86Q0784K5623O3336
11281C32523n2933l9234N247K9070r337L9826O5010o4241m0958L3523m5478k3528
11269B29490M5819O624p9255r8662L9763O0702P4972N3575l1633n3280r141L5928
11257B74902L4477J1883M167o1336o1394j323m7400l464l5736J03630R1848k6224
$$ plain form
11245 284030 296970 354317 384616 292654 240217 217970 188688 175738 143901 161346 165535 211962
11233 211962 169170 109053 84937 88646 155906 220675 152837 156395 233385 232924 216304 269866
11221 269866 291909 325990 356348 368876 323234 328523 262669 182951 237327 289861 279424 277455
11209 277455 242839 298373 315225 255313 344233 334652 264329 276254 383910 402482 328685
11198 328685 292063 263408 307228 271008 310199 358591 300261 212692 188346 166260 225264
11187 225264 275116 274313 239018 148993 110091 110348 53330 88762 167355 199767 204097 228005
11175 228005 294212 336958 269045 264112 253615 190071 157372 157596 257427 362562 376247 265920
11163 265920 215818 261061 333151 288703 186259 157503 185688 193360 222522 251162 220871
$$ packed form
11245B84030J2940N7347L0299r1962n2437k2247k9282j2950l1837J7445M189M6427
11233B11962m2792o0117k4116L709O7260O4769o7838L558P6990m61j6620N3562
11221B69866K2043L4081L0358J2528m5642N289o5854p9718N4376N2534j0437j969
11209B77455l4616N5534J6852n9912Q8920r581p0323J1925J07656J8572p3797
11198C28685l6622k8655M3820l6220L9191M8392n8330q7569k4346k2086N9004
11187B25264M9852q03l5295r0025l8902K57n7018L5432P8593L2412M330K3908
11175B28005O6207M2746o7913m933j0497o3544l2699K24R9831J05135J3685j10327
11163B65920n0102M5243P2090m4448j02444k8756K8185P672K9162K8640l0291
$$ plain form
11152 220871 211302 244263 226227 180609 203373 195221 180984 240784 269734 285190 315913 251817
11140 251817 245512 192341 104740 151228 199382 280536 307236 281493 299260 248039 208011 168484
11128 168484 176760 174126 190735 232500 256690 215759 134934 112432 137564 267918 325945 359412
11116 359412 258659 179783 254006 264537 297438 300781 240062 194735 155586 186673 251784
11105 251784 247845 278482 246142 224959 252304 185577 133572 136758 119072 122311 196236 258888
11093 258888 302610 308139 343754 319227 273984 231864 175180 174626 199301 238595 337667 338847
11081 338847 274972 253614 292830 329545 403304 367651 415714 409490 385100 387601 371826 366241
11069 366241 347391 372640 394155 353039 228331 212247 277485 342227 331466 254599 229801
$$ packed form
11152B20871r569L2961j8036m5618K2764q152j4237N9800K8950J5456L0723o4096
11140B51817o305n3171q7601M6488M8154Q1154K6700k5743J7767n1221m0028l9527
11128A68484Q276k634J6609M1765K4190m0931q0825k2502K5132J30354N8027L3467
11116C59412j00753p8876P4223J0531L2901L343o0719m5327l9149L1087O5111
11105B51784l939L0637l2340k1183K7345o6727n2005L186j7686L239P3925O2652
11093B58888M3722N529L5615k4527m5243m2120n6684n54K4675L9294R9072J180
11081C38847o3875k1358L9216L6715P3759l5653M8063o224k4390K501j5775n585
11069C66241j8850K5249K1515m1116j24708j6084O5238O4742j0761p6867k4798
$$ plain form
11058 229801 257866 284573 257477 269418 266575 302822 280660 296695 261715 251219 275787 326697
11046 326697 305009 287144 253429 211717 228967 371855 502730 497616 428922 399056 353842
11035 353842 350264 366657 393152 372288 367701 397967 365747 322591 309808 343771 327307 307555
11023 307555 261465 291591 276379 301499 327267 307070 319468 375039 457686 504628 471344
11012 471344 353188 370331 362048 390314 393240 375723 336149 305871 299829 294892 370639 463662
11000 463662 413088 313897 322565 329903 330642 324944 363692 378079 353707 361324 326608 286919 258527
10987 258527 284854 251545 247228 254146 309747 305743 301387 290459 389819 454545 398404 337408
10975 337408 277884 237991 301601 396304 372382 327300 326276 343339 350119 362386 298806 280951
$$ packed form
11058B29801K8065K6707k7096J1941k843L6247k2162J6035l4980j0496K4568N0910
11046C26697k1688j7865l3715m1712J7250J42888J30875n114o8694k9866m5214
11035C53842l578J6393K6495k0864m587L0266l2220m3156j2783L3963j6464j9752
11023C07555m6090L0126j5212K5120K5768k0197J2398N5571Q2647M6942l3284
11012D71344j18156J7143q283K8266K926j7517l9574l0278o042m937P5747R3023
11000D63662n0574r9191Q668P338P39n698L8748J4387k4372P617l4716l9689k8392
10987B58527K6327l3309m317O918N5601m004m356j0928R9360O4726n6141o0996
10975C37408n9524l9893O3610R4703k3922m5082j024J7063O780J2267o3580j7855
$$ plain form
10963 280951 286685 288993 314097 385477 371686 473422 545846 481477 457193 416438 411958 382544
10951 382544 388500 421093 451108 454872 488373 501140 443227 422255 365674 294117 268972 250166
10939 250166 234094 235975 257590 239433 282407 277954 290567 350932 356749 358576 396865 434419
10927 434419 350189 360275 385307 406701 440439 413619 384676 369863 316859 337923 403471
10916 403471 416740 416775 368244 336857 356476 373325 336079 339600 325735 301202 353786 457128
10904 457128 533220 486980 448974 426738 375280 391081 453160 506672 446037 459399 378231
10893 378231 346281 400929 467703 531308 489596 448793 417480 471597 545290 514031 490563
10882 490563 429301 433409 495261 486234 440911 438836 494805 467909 427112 401542 349980 370523
$$ packed form
10963B80951N734K308K5104P1380j3791J01736P2424o4369k4284m0755m480k9414
10951C82544N956L2593L0015L764L3501J2767n7913k0972n6581p1557k5145j8806
10939B50166j6072J881K1615j8157M2974m453J2613O0365N817J827L8289L7554
10927D34419q4230J0086K5032K1394L3738k6820k8943j4813n3004K1064O5548
10916D03471J3269L5m8531l1387J9619J6849l7246L521j3865k4533N2584J03342
10904D57128P6092m6240l8006k2236n1458J5801O2079N3512o0635J3362q1168
10893C78231l1950N4648O6774O3605m1712m0803l1313N4117P3693l1259k3468
10882D90563o1262M108O1852r027m5323k075N5969k6896m0797k5570n1562K0543
$$ plain form
10870 370523 450245 495311 607621 553991 513352 511673 546765 601862 636470 599513 610052
10859 610052 523418 463112 377224 416509 417158 513404 586183 538146 478936 436177 494795 563745
10847 563745 610629 535892 537685 571667 565959 610621 658420 652593 615985 612426 602787 604591 643397
10834 643397 639156 570143 554065 580889 626189 659188 609516 606599 669255 809438 785453 741693
10822 741693 777914 881673 915283 912458 938111 914824 901521 1015459 1010979 985134 1025888
10811 1025888 1069325 1059104 1017792 1062659 1122492 1155376 1075929 1119025 1114054 1128405 1099944
10800 1099944 1062916 1076673 1091887 1140098 1223039 1132215 1200176 1260073 1202395 1111848 1173771
10789 1173771 1257830 1315496 1407295 1444739 1466258 1450455 1513448 1531794 1527448 1548381 1526503
$$ packed form
10870C70523P9722M5066J12310n3630m0639j679L5092N5097L4608l6957J0539
10859F10052q6634o0306q5888L9285O49R6246P2779m8037n9210m2759N8618O8950
10847E63745M6884p4737J793L3982n708M4662M7799n827l6608l559r639J804L8806
10834F43397m241o9013j6078K6824M5300L2999m9672k917O2656J40183k3985m3760
10822G41693L6221J03759L3610k825K5653k3287j3303J13938m480k5845M0754
10811A025888M3437j0221m1312M4867N9833L2884p9447M3096m971J4351k8461
10800A099944l7028J3757J5214M8211Q2941r0824O7961N9897n7678r0547O1923
10789A173771Q4059N7666R1799L7444K1519j5803O2993J8346m346K0933k1878
$$ plain form
10778 1526503 1532578 1493974 1509078 1483652 1454446 1424676 1352645 1341465 1345232 1321671 1450891
10767 1450891 1422278 1392718 1378814 1391403 1363961 1394630 1398928 1429951 1390104 1339654 1229135
10756 1229135 1176212 1219785 1244147 1281883 1285863 1209945 1223960 1327749 1390901 1342797 1295173
10745 1295173 1300827 1371249 1450065 1445959 1407717 1369675 1339907 1368139 1400630 1400362 1356262 1356043
10733 1356043 1356513 1317886 1311331 1254192 1208932 1231973 1217083 1104640 1106877 1130746 1114303 1029729
10721 1029729 983020 1038175 1050271 1043291 1049644 1073324 1044592 982248 915969 898182 909847 899237
10709 899237 832921 832993 955114 1012558 1046443 1077162 1076905 1030234 995252 943931 935134 953745
10697 953745 964896 1031097 1068236 1018748 1009104 1059606 1053088 1086303 1056031 1038574 1078100 1090855
$$ packed form
10778A526503O075l8604J5104k5426k9206k9770p2031j1180L767k3561J29220
10767A450891k8613k9560j3904J2589k7442L0669M298L1023l9847n0450j10519
10756A229135n2923M3573K4362L7736L980p5918J4015J03789O3152m8104m7624
10745A295173N654P0422P8816m106l8242l8042k9768K8232L2491k68m4100k19
10733A356043M70l8627o555n7139m5260K3041j4890j12443K237K3869j6443q4574
10721A029729m6709N5155J2096o980O353K3680k8732o2344o6279j7787J1665j0610
10709H99237o6316P2J22121N7444L3885L0719k57m6671l4982n1321q797J8611
10697I53745J1151O6201L7139m9488r644N0502o518L3215l0272j7457L9526J2755
$$ plain form
10685 1090855 1036117 953095 899074 854546 856034 930102 964861 942847 896807 894613 914740 945068
10673 945068 937806 985755 1035066 1064029 1095021 1118407 1117687 1156178 1136406 1116890 1072501 1068274
10661 1068274 1121473 1160422 1303368 1309398 1283602 1299993 1261149 1203024 1119195 1027673 1097587
10650 1097587 1217837 1244959 1255934 1167392 1249654 1252216 1208680 1226888 1244047 1248604 1257007 1252921
10638 1252921 1281928 1345061 1359808 1366872 1356510 1307797 1268128 1318600 1401785 1496090 1439702
10627 1439702 1434837 1439935 1438351 1403312 1384363 1392050 1391186 1411298 1460499 1537160 1575448 1593409
10615 1593409 1617038 1564121 1555410 1559479 1513790 1430846 1459473 1496665 1528787 1559319 1573420 1580764
10603 1580764 1564584 1612276 1669798 1693381 1703647 1689048 1667322 1661098 1682632 1642730 1697702
$$ packed form
10685A090855n4738q3022n4021m4528J488P4068L4759k2014m6040k194K0127L0328
10673I45068p262M7949M9311K8963L0992K3386p20L8491j9772j9516m4389m227
10661A068274N3199L8949J42946O030k5796J6391l8844n8125q3829r1522O9914
10650A097587J20250K7122J0975q8542Q2262K562m3536J8208J7159M557Q403m086
10638A252921K9007O3133J4747P064j0362m8713l9669N0472Q3185R4305n6388
10627A439702m865N098j584l5039j8949P687q64K0112M9201P6661L8288J7961
10615A593409K3629n2917q711M069m5689q2944K8627L7192L2122L0532J4101P344
10603A580764j6180M7692N7522K3583J0266j4599k1726o224K1534l9902N4972
$$ plain form
10592 1697702 1765982 1709974 1784967 1845045 1852348 1807040 1890154 1904708 1855831 1850819 1827318 1829210
10580 1829210 1815384 1859609 1890813 1991356 2065386 2069003 2132262 2106407 2031833 2064300 2129239
10569 2129239 2110172 2120827 2208307 2261676 2273433 2261883 2261280 2185606 2157305 2120153 2163089 2234566
10557 2234566 2275853 2286686 2250950 2338970 2361884 2267046 2321845 2313835 2370197 2480906 2564033
10546 2564033 2552833 2506249 2506072 2536845 2504666 2534965 2698869 2725326 2745579 2823152 2881752
10535 2881752 2831161 2800276 2791585 2799514 2768482 2824843 2907647 2990035 3001298 3024488 3104175 3162285
10523 3162285 3195373 3230679 3325790 3418582 3535175 3534870 3500335 3550380 3583914 3584516 3607977 3693846
10511 3693846 3790113 3809087 3818150 3837469 3881167 3920574 4086147 4160988 4205995 4213371 4301268
$$ packed form
10592A697702O8280n6008P4993O0078P303m5308Q3114J4554m8877n012k3501J892
10580A829210j3826M4225L1204J00543P4030L617O3259k5855p4574L2467O4939
10569B129239j9067J0655Q7480N3369J1757j1550o03p5674k8301l7152M2936P1477
10557B234566M1287J0833l5736Q8020K2914r4838N4799q010N6362J10709Q3127
10546B564033j1200m6584j77L0773l2179L0299J63904K6457K0253P7573N8600
10535B881752n0591l0885q691P929l1032N6361Q2804Q2388J1263K3190P9687N8110
10523C162285L3088L5306R5111R2792J16593l05l4535N0045L3534O02K3461Q5869
10511C693846R6267J8974R063J9319M3698L9407J65573P4841M5007P376Q7897
$$ plain form
10500 4301268 4340316 4409944 4522306 4654396 4678874 4807028 4936585 5029073 5170422 5263938
10490 5263938 5308572 5294753 5343360 5420661 5504540 5610053 5666778 5833886 5911957 5970770 6063471
10479 6063471 6128854 6235646 6391603 6459904 6486950 6670886 6865165 7021823 7104177 7175244
10469 7175244 7274107 7416010 7623320 7877758 8062658 8231416 8452933 8606650 8754317 8948881
10459 8948881 9159882 9396607 9618577 9844644 10006717 10222865 10489837 10757423 10966724
10450 10966724 11221660 11589894 11919842 12132148 12430533 12798135 13058305 13327193 13755285
10441 13755285 14180241 14600751 15016152 15421179 15963740 16560746 17077739 17593593 18171098
10432 18171098 18762971 19434201 20274937 21105855 21912430 22847128 23847072 24839140 25957862
$$ packed form
10500D301268L9048O9628J12362J32090K4478J28154J29557R2488J41349R3516
10490E263938M4634j3819M8607P7301Q3879J05513N6725J67108P8071N8813R2701
10479F063471O5383J06792J55957O8301K7046J83936J94279J56658Q2354P1067
10469G175244R8863J41903K07310K54438J84900J68758K21517J53717J47667J94564
10459H948881K11001K36725K21970K26067J62073K16148K66972K67586K09301
10450A0966724K54936L68234L29948K12306K98385L67602K60170K68888M28092
10441A3755285M24956M20510M15401M05027N42561N97006N16993N15854N77505
10432A8171098N91873O71230Q40736Q30918Q06575R34698R99944R92068J118722
$$ plain form
10423 25957862 27225037 28526912 30015614 31482356 32993370 34749393 36568851 38509884
10415 38509884 40704574 43193535 45686489 48261637 51108506 54135564 57291267 60708586
10407 60708586 64276903 68008973 71963521 76007853 80149839 84335231 88472376 92488517
10399 92488517 96354516 99941592 103242004 106310347 108954008 111246140 113193853 114799881
10391 114799881 116008120 116949164 117731328 118334721 118889975 119567078 120186974 121005258 122085939
10382 122085939 123466099 125021972 126806926 128885887 131269806 133883522 136645295 139592550
10374 139592550 142766896 145977689 149401595 152665293 155770185 158754928 161466280 163972536
10366 163972536 166110459 167771131 169044740 169915997 170406048 170484082 170106523 169273501 168090524
$$ packed form
10423B5957862J267175J301875J488702J466742J511014J756023J819458J941033
10415C8509884K194690K488961K492954K575148K846869L027058L155703L417319
10407F0708586L568317L732070L954548M044332M141986M185392M137145M016141
10399I2488517L865999L587076L300412L068343K643661K292132J947713J606028
10391A14799881J208239R41044P82164O03393N55254O77103O19896Q18284J080681
10382A22085939J380160J555873J784954K078961K383919K613716K761773K947255
10374A39592550L174346L210793L423906L263698L104892K984743K711352K506256
10366A63972536K137923J660672J273609Q71257M90051P8034l77559q33022j182977
$$ plain form
10357 168090524 166549461 164667891 162674272 160509607 158197443 155822036 153353618 150875728
10349 150875728 148576106 146349079 144298980 142453433 140862137 139516594 138385659 137546950
10341 137546950 136952804 136564652 136386671 136425197 136750228 137228248 137732621 138174546 138571302
10332 138571302 138780607 138760021 138404827 137658953 136537019 134880635 132737677 130060864 126896238
10323 126896238 123403910 119654706 115668214 111553480 107205292 102802730 98517103 94290914
10315 94290914 90177112 86140663 82306688 78669609 75292866 72076349 69035373 66154501
10307 66154501 63458696 60879054 58375139 55942352 53707046 51675214 49783600 47891690
10299 47891690 46017856 44355040 42843353 41363192 39904996 38417576 37083248 35819251
$$ packed form
10357A68090524j541063j881570j993619k164665k312164k375407k468418k477890
10349A50875728k299622k227027k050099j845547j591296j345543j130935q38709
10341A37546950n94146l88152j77981L8526L25031M78020N04373M41925L96756
10332A38571302K09305k0586l55194p45874j121934j656384k142958k676813l164626
10323A26896238l492328l749204l986492m114734m348188m402562m285627m226189
10315I4290914m113802m036449l833975l637079l376743l216517l040976k880872
10307F6154501k695805k579642k503915k432787k235306k031832j891614j891910
10299D7891690j873834j662816j511687j480161j458196j487420j334328j263997
$$ plain form
10291 35819251 34528865 33285799 32175397 31125527 30072762 29088669 28161553 27163129
10283 27163129 26279327 25516618 24757069 23973978 23276345 22592215 21879538 21199776 20594972
10274 20594972 19964887 19386529 18800146 18401434 17877823 17363262 16873645 16385131 15947867
10265 15947867 15562860 15129639 14731569 14378104 14104266 13748532 13496437 13210973 12781933
10256 12781933 12496414 12270675 12010310 11812141 11639370 11403005 11174810 10887285 10688113
10247 10688113 10464624 10202089 10006088 9875632 9666855 9573367 9486874 9311215 9182965 8982846
10237 8982846 8826320 8649592 8525293 8420880 8351471 8260676 8235076 8082630 7903731 7838201
10227 7838201 7723228 7545030 7355679 7190298 7058960 6983200 7005599 6918930 6799274 6801474
$$ packed form
10291C5819251j290386j243066j110402j049870j052765r84093r27116r98424
10283B7163129q83802p62709p59549p83091o97633o84130p12677o79762o04804
10274B0594972o30085n78358n86383l98712n23611n14561m89617m88514m37264
10265A5947867l85007m33221l98070l53465k73838l55734k52095k85464m29040
10256A2781933k85519k25739k60365j98169j72771k36365k28195k87525j99172
10247A0688113k23489k62535j96001j30456k08777r3488q6493j75659j28250k00119
10237H982846j56526j76728j24299j04413o9409r0795k5600j52446j78899o5530
10227G838201j14973j78198j89351j65381j31338p5760K2399q6669j19656K200
$$ plain form
10217 6801474 6777842 6679893 6637157 6598259 6509466 6517181 6494550 6406525 6302812 6198698 6148430
10206 6148430 6063686 5992327 5952032 5849043 5732474 5664676 5542425 5520875 5484445 5401629 5292893
10195 5292893 5166240 5043894 4953104 4947112 4938857 4862899 4742976 4739511 4729363 4631627 4534673
10184 4534673 4481386 4523784 4535023 4582756 4541438 4463068 4399587 4347354 4270486 4224461 4208914
10173 4208914 4147711 4104800 4088502 4064423 3999750 3996210 3969114 3867919 3774173 3666393 3591385
10162 3591385 3627639 3709625 3666955 3530502 3392616 3319445 3332842 3343762 3309486 3369717 3376021
10151 3376021 3346939 3305634 3258536 3196947 3134885 3178360 3189320 3224936 3198271 3128774 3122445
10140 3122445 3145133 3086458 3009315 2951533 2963280 2919029 2751996 2708830 2736966 2709104 2702513
$$ packed form
10217F801474k3632r7949m2736l8898q8793P715k2631q8025j03713j04114n0268
10206F148430q4744p1359m0295j02989j16569o7798j22251k1550l6430q2816j08736
10195E292893j26653j22346r0790n992q255p5958j19923l465j0148r7736r6954
10184D534673n3287M2398J1239M7733m1318p8370o3481n2233p6868m6025j5547
10173D208914o1203m2911j6298k4079o4673l540k7096j01195r3746j07780p5008
10162C591385L6254Q1986m2670j36453j37886p3171J3397J0920l4276O0231O304
10151C376021k9082m1305m7098o1589o2062M3475J0960L5616k6665o9497o329
10140C122445K2688n8675p7143n7782J1747m4251j67033m3166K8136k7862o591
$$ plain form
10129 2702513 2618258 2599630 2569950 2577089 2581303 2561419 2615102 2630691 2606949 2533858 2378282
10118 2378282 2346608 2358392 2396409 2402649 2390516 2345864 2299410 2300160 2343222 2279458 2249458 2224513
10106 2224513 2160381 2118252 2077577 2119555 2130204 2145158 2119300 2123158 2140362 2155202 2168733
10095 2168733 2137625 2127412 2156164 2158202 2134023 2076050 2002849 1972107 1932433 1985331 2018379
10084 2018379 1954925 1918507 1954624 1885965 1715721 1732533 1752724 1749543 1814582 1886578 1908278
10073 1908278 1953261 1937229 1876345 1825102 1760961 1825326 1819302 1803652 1791755 1777083 1758135
10062 1758135 1756164 1825238 1823289 1801956 1722746 1599907 1621434 1592411 1544347 1548801 1547616 1531836
10050 1531836 1534725 1558437 1555407 1631961 1629468 1616420 1683629 1685702 1618243 1651562 1618766 1557470
$$ packed form
10129B702513q4255j8628k9680P139M214j9884N3683J5589k3742p3091j55576
10118B378282l1674J1784L8017O240j2133m4652m6454P50M3062o3764l0000k4945
10106B224513o4132m2129m0675M1978J0649J4954k5858L858J7204J4840J3531
10095B168733l1108j0213K8752K038k4179n7973p3201l0742l9674N2898L3048
10084B018379o3454l6418L6117o8659j70244J6812K0191l181O5039P1996K1700
10073A908278M4983j6032o0884n1243o4141O4365o024j5650j1897j4672j8948
10062A758135j971O9074j949k1333p9210j22839K1527k9023m8064M454j185j5780
10050A531836K889K3712l030P6554k493j3048O7209K073o7459L3319l2796o1296
$$ plain form
10038 1557470 1539509 1530254 1457509 1371808 1364950 1407124 1425096 1478207 1487643 1503884 1458024 1445805
10026 1445805 1454930 1485721 1444217 1366322 1348754 1350397 1403960 1372797 1411851 1467178 1466810 1421448
10014 1421448 1421513 1410061 1424018 1446135 1505454 1510589 1453281 1412820 1449434 1444970 1344954 1305518
10002 1305518 1378819 1466189 1498000 1516001 1511667 1496417 1492586 1476452 1462989 1489354 1476083 1500766
9990 1500766 1395055 1283230 1293390 1284302 1335315 1432429 1430198 1435998 1489670 1604771 1672371
9979 1672371 1662240 1612661 1532599 1522716 1525524 1530515 1581591 1631167 1598467 1616566 1671922 1693490
9967 1693490 1678127 1677465 1679497 1610896 1565172 1585309 1556696 1562371 1567757 1561367 1531256 1487708 1532714
9954 1532714 1634550 1723081 1778388 1735738 1691128 1726107 1826042 1867724 1817643 1815247 1722080
$$ packed form
10038A557470j7961r255p2745q5701o858M2174J7972N3111R436J6241m5860j2219
10026A445805R125L0791m1504p7895j7568J643N3563l1163L9054N5327l68m5362
10014A421448O5j1452J3957K2117N9319N135n7308m0461L6614m464j00016l9436
10002A305518P3301Q7370L1811J8001m334j5250l831j6134j3463K6365j3271K4683
9990A500766j05711j11825J0160r088N1013R7114k231N800N3672J15101O7600
9979A672371j0131m9579q0062r883K808M991N1076M9576l2700J8099N5356K1568
9967A693490j5363o62K032o8601m5724K0137k8613N675N386o390l0111m3548M5006
9954A532714J01836Q8531N5307m2650m4610L4979R9935M1682n0081k396r3167
$$ plain form
9943 1722080 1673091 1672557 1752489 1800140 1735855 1633122 1603563 1662561 1723164 1714303 1707614 1687810
9931 1687810 1676448 1729773 1713608 1679538 1646273 1646867 1612026 1585137 1605382 1578677 1548565 1515790
9919 1515790 1462583 1461406 1510503 1483365 1488219 1476001 1513622 1561486 1526661 1509283 1462634 1487962
9907 1487962 1552417 1514576 1480250 1495016 1460832 1444268 1437633 1364361 1310426 1280268 1248668 1180861
9895 1180861 1144481 1080587 1038696 1010722 995112 1017764 937407 907739 1016107 1028940 987251
9884 987251 870542 868066 891152 932828 945068 859715 801679 782848 825376 891507 932764 950250
9872 950250 916274 913991 906468 915404 938800 899626 899229 962199 1023591 1047251 1043141 1087821 1146433
9859 1146433 1276510 1472985 1627885 1846295 2024061 2212273 2377066 2390165 2290478 2039103
$$ packed form
9943A722080m8989n34P9932M7651o4285j02733k9559N8998O0603q861o689j9804
9931A687810j1362N3325j6165l4070l3265N94l4841k6889K0245k6705l0112l2775
9919A515790n3207j177M9097k7138M854j2218L7621M7864l4825j7378m6649K5328
9907A487962O4455l7841l4326J4766l4184j6564o635p3272n3935l0158l1600o7807
9895A180861l6380o3894m1891k7974j5610K2652q0357k9668J08368J2833m1689
9884I87251j16709k476K3086M1676J2240q5353n8036j8831M2528O6131M1257J7486
9872I50250l3976k283p523Q936K3396l9174l97O2970O1392K3660m110M4680N8612
9859A146433J30077J96475J54900K18410J77766J88212J64793J3099r9687k51375
$$ plain form
9849 2039103 1764086 1404926 1165330 1102127 921008 890181 895183 900321 854727 892440 928096
9838 928096 880078 792856 810153 823865 730837 736274 717833 673077 666734 718674 718731 743898 771903
9825 771903 712554 574661 494921 594619 646548 636903 616699 522765 517606 540585 518190 467169
9813 467169 451927 459434 493012 517298 515575 512278 507970 495928 501587 507838 462156 408478 388423
9800 388423 439279 477061 472477 432475 452983 478017 528756 539905 494436 461960 439220 461779
9788 461779 506045 561015 566068 541566 577834 630210 605630 548576 511422 499940 505871 568822
9776 568822 589166 630037 632151 583404 554893 508570 540960 605431 581002 509783 437329 392069
9764 392069 426235 450574 478305 463682 462907 451077 446734 441913 452743 451519 463303 436608 411100
$$ packed form
9849B039103k75017l59160k39596o3203j81119l0827N002N138m5594L7713L5656
9838I28096m8018q7222J7297J3712r3028N437j8441m4756o343N1940N7K5167K8005
9825G71903n9349j37893p9740R9698N1929r645k0204r3934n159K2979k2395n1021
9813D67169j5242P507L3578K4286j723l297m308j2042N659O251m5682n3678k0055
9800C88423N0856L7782m584m0002K0508K5034N0739J1149m5469l2476k2740K2559
9788D61779M4266N4970N053k4502L6268N2376k4580n7054l7154j1482N931O2951
9776E68822K0344M0871K114m8747k8511m6323L2390O4471k4429p1219p2454m5260
9764C92069L4166K4339K7731j4623p75j1830m343m821J0830j224J1784k6695k5508
$$ plain form
9751 411100 393961 378636 437243 458043 354567 385208 521890 439542 412789 453696 477381
9740 477381 519487 499268 491422 480657 460872 454234 431097 418573 370384 472754 537792 485745
9728 485745 465868 439123 475524 495871 466741 420953 447044 486193 434652 282018 181559
9717 181559 260591 324349 282976 282996 401118 482265 477864 360532 344438 401861 533232 563110
9705 563110 434329 382696 445859 475789 407253 399849 365145 328936 381115 385462 357730 379265
9693 379265 385646 414072 424083 440000 383348 336889 396601 376118 411998 418843 422717 432669
9681 432669 394692 348976 334158 323203 293896 379750 385546 265997 289139 340771 314262 178879
9669 178879 246182 302080 277899 310356 368184 391907 393283 376516 429037 536141 529039 439940
$$ packed form
9751D11100j7139j5325N8607K0800j03476L0641J36682q2348k6753M0907K3685
9740D77381M2106k0219p846j0765j9785o638k3137j2524m8189J02370O5038n2047
9728D85745j9877k6745L6401K0347k9130m5788K6091L9149n1541j52634j00459
9717A81559P9032O3758m1373K0J18122Q1147m401j17332j6094N7423J31371K9878
9705E63110j28781n1633O3163K9930o8536p404l4704l6209N2179M347k7732K1535
9693C79265O381K8426J0011J5917n6652m6459N9712k0483L5880O845L874R952
9681D32669l7977m5716j4818j0955k9307Q5854N796j19549K3142N1632k6509j35383
9669A78879O7303N5898k4181L2457N7828K3723J376j6767N2521J07104p102q9099
$$ plain form
9657 439940 431979 395346 357453 358521 374955 358209 374006 346620 336948 337105 298359 321103 370451
9644 370451 393899 399583 376931 404794 425334 396969 357077 362424 361468 375573 392835 390575 376226
9631 376226 331994 338549 400998 341468 285353 236900 241943 296750 293491 327698 313186 312038
9619 312038 246742 241689 259239 281649 335868 291778 305092 324023 349103 327732 270550 161136
9607 161136 159869 298549 373862 359701 272398 249815 243877 256810 343104 346224 322821 290269
9595 290269 328018 347048 299996 323400 353579 358688 468522 530072 493537 484234 454088 406272
9583 406272 420832 407409 393807 359582 345270 336552 338109 360081 363449 387920 408015 369281
9571 369281 352003 431909 463704 518127 527285 540238 626696 666922 530317 482261 499039 436176
$$ packed form
9657D39940p961l6633l7893J068J6434j6746J5797k7386r672J57l8746K2744M9348
9644C70451K3448N684k2652K7863K0540k8365l9892N347r56J4105J7262k260j4349
9631C76226m4232O555O2449n9530n6115m8453N043N4807l259L4207j4512j148
9619C12038o5296n053J7550K2410N4219m4090J3314J8931K5080k1371n7182j09414
9607A61136j267J38680P5313j4161q7303k2583n938J2933Q6294L120k3403l2552
9595B90269L7749J9030m7052K3404L0179N109J09834O1550l6535r303l0146m7816
9583D06272J4560j3423j3602l4225j4312q718J557K1972L368K4471K0095l8734
9571C69281j7278P9906L1795N4423R158J2953Q6458M0226j36605m8056J6778o2863
$$ plain form
9559 436176 389152 425276 519188 479632 401517 369373 387259 391239 422593 398696 388436 381052
9547 381052 448811 525290 535636 517100 531035 551364 635755 701733 699445 759748 835015 898572
9535 898572 861466 827452 784703 812986 864096 912848 888634 888111 870809 880177 854537 796313
9523 796313 784553 701533 665036 692805 719426 700459 728772 703755 651179 634825 684236 757793
9511 757793 836734 817995 818385 790452 811378 813549 868702 1017652 1012230 1071603 1192867 1271947
9499 1271947 1342906 1376660 1242192 1158600 1212957 1311233 1340482 1330459 1278732 1303490 1278934
9488 1278934 1161383 1071992 1060840 992392 930127 927703 876862 815520 813991 780511 737490 674028
9476 674028 661524 742306 765328 794198 788432 842507 945233 1024429 1019381 1052067 1065743 1119359
$$ packed form
9559D36176m7024L6124R3912l9556p8115l2144J7886L980L1354k3897j0260p384
9547C81052O7759P6479J0346j8536J3935K0329Q4391O5978k288O0303P5267O3557
9535H98572l7106l4014m2749K8283N1110M8752k4214n23j7302R368k5640n8224
9523G96313j1760q3020l6497K7769K6621j8967K8313k5017n2576j6354M9411P3557
9511G57793P8941j8739L90k7933K0926K171N5153J48950n422N9373J21264P9080
9499A271947P0959L3754j34468q3592N4357R8276K9249j0023n1727K4758k4556
9488A278934j17551q9391j1152o8448o2265k424n0841o1342j529l3480m3021o3462
9476F74028j2504Q0782K3022K8870n766N4075J02726P9196n048L2686J3676N3616
$$ plain form
9464 1119359 1172946 1142772 1068967 1067285 1089571 1115050 1085543 992076 931638 858621 893615 938255
9452 938255 888891 764377 703302 744309 794490 735407 656511 680050 651890 623379 604183
9441 604183 633150 612005 659233 706537 654435 641259 663607 617990 600938 566014 553484 575464
9429 575464 612316 646956 726476 710349 649635 674252 638555 574610 560631 508265 507328 464825
9417 464825 426922 483690 494961 501235 478683 455109 507788 476971 457324 377453 336011 424546
9405 424546 486853 499647 461243 456036 418678 379703 426617 423394 432603 531606 525726 482343
9393 482343 449329 497945 586403 547415 563748 627618 631631 562039 489628 546475 589156 531739
9381 531739 428003 409023 408138 392993 392762 406013 366253 303407 407874 432996 449273 497811
$$ packed form
9464A119359N3587l0174p3805j682K2286K5479k9507r3467o0438p3017L4994M4640
9452I38255m9364j24514o1075M1007N0181n9083p8896K3539k8160k8511j9196
9441F04183K8967k1145M7228M7304n2102j3176K2348m5617j7052l4924j2530K1980
9429E75464L6852L4640P9520j6127o0714K4617l5697o3945j3979n2366r37m2503
9417D64825l7903N6768J1271O274k2552k3574N2679l0817j9647p9871m1442Q8535
9405D24546O2307J2794l8404n207l7358l8975M6914l223R209R9003n880m3383
9393D82343l3014M8616Q8458l8988J6333O3870M013o9592p2411N6847M2681n7417
9381E31739j03736j8980q85j5145k31J3251l9760o2846J04467K5122J6277M8538
$$ plain form
9369 497811 524828 557112 550338 507430 502840 604464 635126 642902 610454 561429 558654 537644
9357 537644 530073 578102 611022 633160 603916 605535 641807 561062 584412 658940 719654 658154
9345 658154 568023 548512 526904 570200 632303 602845 582338 561411 568980 589792 622206 656920
9333 656920 701660 652863 622255 595698 616795 615320 574242 589209 610865 654787 647026 571313
9321 571313 560344 557690 575886 580914 550615 576702 621416 712553 724100 746922 766651 718577
9309 718577 635953 602349 612851 642725 698136 692961 695474 714317 721597 753276 737575 702200
9297 702200 688740 693875 695338 761245 788813 774187 766221 731993 744713 751928 761993 710046
9285 710046 707921 685010 679139 776607 780945 824269 864467 895653 908698 979762 983290 1134187
$$ packed form
9369D97811K7017L2284o774m2908m590J01624L0662P776l2448m9025k775k1010
9357E37644p571M8029L2920K2138k9244J619L6272q0745K3350P4528O0714o1500
9345F58154r0131j9511k1608M3296O2103k9458k0507k0927P569K0812L2414L4714
9333F56920M4740m8797l0608k6557K1097j475m1078J4967K1656M3922p761p5713
9321E71313j0969k654J8196N028l0299K6087M4714R1137J1547K2822J9729m8074
9309G18577q2624l3604J0502K9874N5411n175K513J8843P280L1679j5701l5375
9297G02200j3460N135J463O5907K7568j4626p966l4228J2720P215J0065n1947
9285G10046k125k2911n871R7468M338M3324M0198L1186J3045P1064L528J50897
$$ plain form
9273 1134187 1221138 1243130 1281815 1233399 1179554 1195478 1177234 1154558 1155472 1115975 1103863 1086069
9261 1086069 1030033 989580 889138 860420 946315 960123 1001330 962239 968943 974061 972508 993901
9249 993901 1049528 1047848 1010793 1020387 1114087 1185504 1197676 1153735 1165478 1266673 1302031 1289241
9237 1289241 1322724 1370153 1341676 1425316 1473049 1565736 1623113 1637524 1686700 1692916 1621505 1659163
9225 1659163 1699565 1710907 1646836 1611604 1573079 1595105 1621485 1580891 1589814 1686573 1664343 1726968
9213 1726968 1806739 1902184 2009127 2052545 2207685 2263195 2421168 2597295 2681551 2730708 2761077
9202 2761077 2879310 3029127 3162531 3221664 3403204 3622797 3806507 4026120 4319025 4580821
9192 4580821 4877284 5202398 5684277 6265156 6969986 7736419 8622019 9788610 11238269
$$ packed form
9273A134187Q6951K1992L8685m8416n3845J5924j8244k2676R14l9497j2112j7794
9261A086069n6036m0453j00442k8718Q5895J3808M1207l9091O704N118j553K1393
9249I93901N5627j680l7055R594R3700P1417J2172m3941J1743J01195L5358j2790
9237A289241L3483M7429k8477Q3640M7733R2687N7377J4411M9176O216p1411L7658
9225A659163M0402J1342o4071l5232l8525K2026K6380m0594Q923R6759k2230O2625
9213A726968P9771R5445J06943M3418J55140N5510J57973J76127Q4256M9157L0369
9202B761077J18233J49817J33404N9133J81540K19593J83710K19613K92905K61796
9192D580821K96463L25114M81879N80879P04830P66433Q85600J166591J449659
$$ plain form
9183 11238269 12945178 14833923 16923349 19290658 21894335 24712045 27703113 30780071
9175 30780071 33875811 36668808 39004642 40722190 41725884 41750166 40649453 38720050
9167 38720050 36350479 33911282 31661215 29724732 28202688 27044558 26445184 26357014 26681077
9158 26681077 27440684 28588536 30211970 32366830 34965799 38029058 41583759 45612884
9150 45612884 50030238 54794610 59898077 65394692 71336471 77503907 83693585 89675820
9142 89675820 95359734 100426535 104840583 108502488 111395415 113692391 115393790 116426466
9134 116426466 116865342 116587296 115508100 113693187 111085478 107779536 104361558 100987058
9126 100987058 97719680 94764784 92298439 90412718 89212420 88790318 89301654 90649656
$$ packed form
9183A1238269J706909J888745K089426K367309K603677K817710K991068L076958
9175C0780071L095740K792997K335834J717548J003694K4282j100713j929403
9167C8720050k369571k439197k250067j936483j522044j158130n99374q8170L24063
9158B6681077P59607J147852J623434K154860K598969L063259L554701M029125
9150D5612884M417354M764372N103467N496615N941779O167436O189678N982235
9142H9675820N683914N066801M414048L661905K892927K296976J701399J032676
9134A16426466M38876k78046j079196j814913k607709l305942l417978l374500
9126A00987058l267378k954896k466345j885721j200298m22102N11336J348002
$$ plain form
9118 90649656 92717308 95581833 99301993 103592646 108538895 114094931 120199810 126805907
9110 126805907 133970765 141530330 149309205 157254407 165155846 172682447 179608734 185738213
9102 185738213 190819107 194747501 197188106 197876962 196431788 192772928 187122727 179937338
9094 179937338 171685793 162983829 154298616 146012321 138443691 131708369 125982746 121298771
9086 121298771 117606436 114861004 113010850 111939491 111747215 112506941 114110924 116391829
9078 116391829 119392000 123130126 127555080 132501394 137891306 143526762 149187842 154760980
9070 154760980 159818958 164131272 167563575 169660906 170249575 169160978 166321392 161884256
9062 161884256 156016362 149045540 141334329 133292527 125403875 117809267 110653087 104054057
$$ packed form
9118I0649656K067652K864525L720160M290653M946249N556036O104879O606097
9110A26805907P164858P559565P778875P945202P901439P526601O926287O129479
9102A85738213N080894L928394K440605O88856j445174l658860n650201p185389
9094A79937338q251545q701964q685213q286295p568630o735322n725623m683975
9086A21298771l692335k745432j850154j071359j92276P59726J603983K280905
9078A16391829L000171L738126M424954M946314N389912N635456N661080N573138
9070A54760980N057978M312314L432303K097331N88669j088597k839586m437136
9062A61884256n867894o970822p711211q041802p888652p594608p156180o599030
$$ plain form
9054 104054057 98049018 92612282 87742513 83379448 79533545 76222322 73410709 71056937
9046 71056937 69326475 68092925 67465814 67398008 67807517 68768541 70210534 72062776 74187891
9037 74187891 76299910 78267544 79839343 80680340 80680672 79828566 78060537 75501029 72189857
9028 72189857 68251557 63990385 59668799 55436569 51433542 47820950 44690431 41896449
9020 41896449 39519523 37451333 35613719 33915555 32289186 30769670 29346233 27888306
9012 27888306 26554056 25252418 24053112 22916482 21813628 20798768 19885974 19027356
9004 19027356 18293968 17452082 16711643 16199034 15629440 15136074 14722891 14221899 13892570
8995 13892570 13537030 13184559 12908880 12681553 12436461 12165523 11935797 11724329 11491660
$$ packed form
9054A04054057o005039n436736m869769m363065l845903l311223k811613k353772
9046G1056937j730462j233550o27111o7806M09509R61024J441993J852242K125115
9037G4187891K112019J967634J571799Q40997L32q52106j768029k559508l311172
9028G2189857l938300m261172m321586m232230m003027l612592l130519k793982
9020D1896449k376926k068190j837614j698164j626369j519516j423437j457927
9012B7888306j334250j301638j199306j136630j102854j014860r12794q58618
9004A9027356p33388q41886p40439n12609n69594m93366m13183n00992l29329
8995A3892570l55540l52471k75679k27327k45092k70938k29726k11468k32669
$$ plain form
8986 11491660 11236196 11033058 10825255 10659083 10626786 10480383 10279902 10080879 10014245 9956892
8976 9956892 9825475 9726947 9626359 9576338 9561660 9529753 9519582 9596009 9730552 9959026 10094824
8965 10094824 10248020 10449886 10732392 11101630 11591887 12047548 12455435 12865672 13349078
8956 13349078 14072818 14807850 15436017 16033459 16729453 17459348 18121175 18911097 19743727
8947 19743727 20610718 21472209 22428934 23434794 24475195 25551875 26716771 27927742 29170313
8938 29170313 30505601 31895144 33327390 34818334 36327629 37814506 39143145 40220627
8930 40220627 40961196 41301249 41199578 40771842 40220310 39656139 39275857 39121953 39287345
8921 39287345 39707402 40421385 41363764 42391482 43497749 44752520 45869129 46854906 47718584
$$ packed form
8986A1491660k55464k03138k07803j66172l2297j46403k00481j99023o6634n7353
8976I956892j31417r8528j00588n0021j4678l1907j0171P6427J34543K28474J35798
8965A0094824J53196K01866K82506L69238M90257M55661M07887M10237M83406
8956A3349078P23740P35032O28167N97442O95994P29895O61827P89922Q32630
8947A9743727Q66991Q61491R56725J005860J040401J076680J164896J210971J242571
8938B9170313J335288J389543J432246J490944J509295J486877J328639J077482
8930D0220627P40569L40053j01671m27736n51532n64171l80282j53904J65392
8921C9287345M20057P13983R42379J027718J106267J254771J116609R85777Q63678
$$ plain form
8912 47718584 48447597 49109866 49815126 50630599 51529015 52636964 53997046 55649757 57556015
8903 57556015 59673136 61902448 64203638 66575691 68839733 70889535 72639648 74005975
8895 74005975 74917400 75451485 75675421 75587100 75262600 74725772 73871365 72765930 71438038
8886 71438038 70028094 68584514 67122048 65592102 63997131 62484768 61122224 59976283
8878 59976283 59059748 58427062 58215799 58385404 58951542 59936102 61286498 62915024 64926674
8869 64926674 67222807 69702970 72293670 74662875 76735350 78428855 79620064 80186522
8861 80186522 80066499 79373444 78128678 76511602 74655254 72645754 70542366 68457486
8853 68457486 66454704 64526574 62714418 60973588 59440650 57959805 56614328 55453641
$$ packed form
8912D7718584P29013O62269P05260Q15473Q98416J107949J360082J652711J906258
8903E7556015K117121K229312K301190K372053K264042K049802J750113J366327
8895G4005975R11425N34085K23936q8321l24500n36828q54407j105435j327892
8886G1438038j409944j443580j462466j529946j594971j512363j362544j145941
8878E9976283r16535o32686k11263J69605N66138R84560J350396J628526K011650
8869F4926674K296133K480163K590700K369205K072475J693505J191209N66458
8861H0186522j20023o93055j244766j617076j856348k009500k103388k084880
8853F8457486k002782j928130j812156j740830j532938j480845j345477j160687
$$ plain form
8845 55453641 54499381 53636004 52823344 52019932 51274044 50506726 49612293 48701644 47861494
8836 47861494 47017319 46319892 45761310 45321645 44997440 44798392 44679798 44605554 44389201 44169805
8826 44169805 43833140 43347957 42863739 42427452 42034967 41570941 41071320 40479617 39839356
8817 39839356 39121676 38226776 37228062 36019444 34551943 32999487 31384129 29649724 27928584
8808 27928584 26423299 24981123 23631128 22536407 21634098 20833204 20130571 19514263 19152794
8799 19152794 18884709 18749519 18710741 18592339 18423635 18278126 18074106 17760664 17407908 16978325
8789 16978325 16513365 16085917 15711819 15425585 15159181 14857425 14445695 13993438 13482871
8780 13482871 12844298 12138422 11446968 10814524 10201543 9657234 9161098 8677739 8205558
$$ packed form
8845E5453641r54260q63377q12660q03412p45888p67318q94433r10649q40150
8836D7861494q44175o97427n58582m39665l24205j99048j18594p4244k16353k19396
8826D4169805l36665m85183m84218m36287l92485m64026m99621n91703o40261
8817C9839356p17680q94900r98714j208618j467501j552456j615358j734405j721140
8808B7928584j505285j442176j349995j094721r02309q00894p02633o16308l61469
8799A9152794k68085j35190l8778j18402j68704j45509k04020l13442l52756m29583
8789A6978325m64960m27448l74098k86234k66404l01756m11730m52257n10567
8780A3482871o38573p05876o91454o32444o12981n44309m96136m83359m72181
$$ plain form
8771 8205558 7874596 7540840 7244523 6992075 6773762 6565859 6311839 6146796 5988902 5798757
8761 5798757 5611204 5406549 5242625 5067660 5028667 4888439 4733587 4637899 4532975 4396528
8751 4396528 4264747 4188230 4145349 4068006 3990661 3813882 3682271 3701270 3656049 3540087 3492181
8740 3492181 3477312 3460498 3403683 3368646 3357345 3272041 3283717 3334270 3333693 3313622 3241803 3215457
8728 3215457 3230378 3215515 3164168 3116446 3100019 3105522 3041166 2980809 2972184 2938406 2855749 2763383
8716 2763383 2718538 2684134 2663828 2607458 2544466 2451599 2463262 2516427 2488169 2460567 2414239
8705 2414239 2425008 2384063 2465238 2463355 2370862 2327687 2427680 2456279 2535293 2458172 2457226 2517214
8693 2517214 2565215 2548464 2502754 2526886 2526280 2412946 2390387 2366685 2348239 2215003 2180770
$$ packed form
8771H205558l30962l33756k96317k52448k18313k07903k54020j65043j57894j90145
8761E798757j87553k04655j63924j74965l8993j40228j54852r5688j04924j36447
8751D396528j31781p6517m2881p7343p7345j76779j31611J8999m5221j15962m7906
8740C492181j4869j6814n6815l5037j1301q5304J1676N0553n77k0071p1819k6346
8728C215457J4921j4863n1347m7722j6427N503o4356o0357q625l3778q2657r2366
8716B763383m4845l4404k0306n6370o2992r2867J1663N3165k8258k7602m6328
8705B414239J0769m0945Q1175j883r2493m3175R9993K8599P9014p7121r46N9988
8693B517214M8001j6751m5710K4132o06j13334k2559k3702j8446j33236l4233
$$ plain form
8682 2180770 2154209 2154874 2147916 2124222 2082222 2034047 2005707 2008451 1972860 2010505 2014828 2042929
8670 2042929 2006936 1937163 1858402 1834674 1858716 1861893 1886082 1885265 1831743 1786273 1819352 1838522
8658 1838522 1822196 1900306 1931724 1989544 1999277 2018309 2068758 2052948 1952399 1763551 1725016
8647 1725016 1698415 1604899 1609472 1633529 1508420 1428950 1400958 1404680 1381055 1360693 1315290 1191669
8635 1191669 1143653 1155498 1134897 1067816 1074488 1072068 1139325 1216549 1243566 1257471 1214916 1156930
8623 1156930 1155435 1140365 1137032 1116445 1157891 1291075 1360695 1369107 1372073 1287196 1215858 1216597
8611 1216597 1286837 1319121 1421892 1527848 1708661 1748876 1657135 1442447 1245209 1079206
8601 1079206 1081145 1092306 1030521 960750 924648 972507 1023499 1032829 977581 913592 921205 874953
$$ packed form
8682B180770k6561O65o958k3694m2000m8175k8340K744l5591L7645M323K8101
8670B042929l5993o9773p8761k3728K4042L177K4189q17n3522m5470L3079J9170
8658A838522j6326P8110L1418N7820R733J9032N0449j5810j00549j88848l8535
8647A725016k6601r3516M573K4057j25109p9470k7992L722k3625k0362m5403j23621
8635A191669m8016J1845k0601o7081O672k420O7257P7224K7017J3905m2555n7986
8623A156930j495j5070l333k0587M1446J33184O9620Q412K966q4877p1338P39
8611A216597P0240L2284J02771J05956J80813M0215r1741k14688j97238j66003
8601A079206J939J1161o1785o9771l6102M7859N0992R330n5248o3989P613m6252
$$ plain form
8589 874953 849489 881120 884670 806498 820458 754148 792151 751077 761563 820511 874414 959793
8577 959793 978054 940861 1027007 1073133 1120539 1067517 997573 910439 873237 848433 865961 815745
8565 815745 831110 910771 1016612 1010478 1010169 1104486 1048342 985131 914265 869015 824729 811881
8553 811881 717718 630423 665502 716764 735442 708100 658190 658817 711547 722879 663772 690234
8541 690234 769772 793531 820810 791003 753559 728562 712604 686210 674082 717306 752856 811442
8529 811442 823269 843047 810876 725317 616068 516555 519430 627128 669880 685818 637684
8518 637684 598195 554750 584216 704533 676669 690901 664687 668631 724882 734917 773810 769343
8506 769343 784541 820608 771318 754238 754655 793556 779504 845074 917360 894532 862088 846814
$$ packed form
8589H74953k5464L1631L550p8172J3960o6310L8003m1074J0486N8948N3903Q5379
8577I59793J8261l7193Q6146M6126M7406n3022o9944q7134l7202k4804J7528n0216
8565H15745J5365P9661J05841o134l09R4317n6144o3211p0866m5250m4286j2848
8553H11881r4163q7295L5079N1262J8678k7342m9910O27N2730J1332n9107K6462
8541F90234P9538K3759K7279k9807l7444k4997j5958k6394j2128M3224L5550N8586
8529H11442J1827J9778l2171q5559j09249r9513K875J07698M2752J5938m8134
8518F37684l9489m3445K9466J20317k7864J4232k6214L944N6251J0035L8893m467
8506G69343J5198L6067m9290j7080M17L8901j4052O5570P2286k2828l2444j5274
$$ plain form
8494 846814 862090 802409 781330 828973 810712 691465 706062 740365 693197 719361 709241
8483 709241 717370 788904 802727 807949 764837 681437 737694 770261 786266 780435 699139 705988
8471 705988 676681 701386 778381 850067 923369 952019 1007038 981793 910183 914767 883616 915755
8459 915755 890205 884798 891592 815253 797384 754285 734259 718388 704783 702791 673040 659663
8447 659663 659433 648442 659739 683899 689820 652190 635443 646210 554947 489206 401216 497200
8435 497200 614175 653676 648450 577783 594205 584621 616788 685244 657604 690311 646536 617048
8423 617048 645774 678742 653468 623114 613655 590220 574484 572465 549822 521965 533753 568744
8411 568744 536734 480245 466059 468789 521660 578967 550876 498997 439758 398032 391119 415939
$$ packed form
8494H46814J5276n9681k1079M7643j8261j19247J4597L4303m7168K6164j0120
8483G09241Q129P1534J3823N222m3112q3400N6257L2567J6005n831q1296O849
8471G05988k9307K4705P6995P1686P3302K8650N5019k5245p1610M584l1151L2139
8459I15755k5550n407O794p6339j7869m3099k0026j5871j3605j992k9751j3377
8447F59663k30j0991J1297K4160N921l7630j6747J0767r1263o5741q7990R5984
8435D97200J16975L9501n226p0667J6422r584L2167O8456k7640L2707m3775k9488
8423F17048K8726L2968k5274l0354r459k3435j5736k019k2643k7857J1788L4991
8411E68744l2010n6489j4186K730N2871N7307k8091n1879n9239m1726o913K4820
$$ plain form
8399 415939 403292 415142 476791 527515 470024 468130 509359 559451 603080 519141 400256 401599
8387 401599 443597 431271 374407 390152 401274 359437 318231 270242 277557 309828 276844 258190
8375 258190 303779 293065 325744 371175 381073 376116 358433 346175 252886 228808 203507 185904
8363 185904 340984 391692 339029 355639 240309 232985 278148 347689 344276 370996 332154 250786
8351 250786 276680 280016 283022 243598 262025 256868 179810 139525 183947 201236 216633 233276
8339 233276 211634 194422 195242 213551 140294 59179 106036 125323 96767 136418 173074 231030
8327 231030 228515 157268 97598 115696 129519 132031 155079 173680 194988 240154 130439 44553
8315 44553 42452 91294 124580 228854 241502 185317 171615 129632 162299 172141 172002 207916
$$ packed form
8399D15939j2647J1850O1649N0724n7491j894M1229N0092M3629q3939j18885J343
8387D01599M1998j2326n6864J5745J1122m1837m1206m7989P315L2271l2984j8654
8375B58190M5589j0714L2679M5431R898m957j7683j2258r3289k4078k5301j7603
8363A85904J55080N0708n2663J6610j15330p324M5163O9541l413K6720l8842q1368
8351B50786K5894L336L006l9424J8427n157p7058m0285M4422J7289J5397J6643
8339B33276k1642j7212Q20J8309p3257q1115M6857J9287k8556L9651L6656N7956
8327B31030k515p1247n9670J8098J3823K512K3048J8601K1308M5166j09715q5886
8315D4553k101M8842L3286J04274J2648n6185j3702m1983L2667R842j39L5914
$$ plain form
8303 207916 242405 163367 170466 203165 201928 221438 137659 186521 245136 205678 190825 269661
8291 269661 236576 179602 217148 167391 156837 192436 288322 359613 361485 259786 159282
8280 159282 107443 133727 156417 150808 194695 204816 263467 208593 192736 160608 179813 194498
8268 194498 164154 169324 183026 194151 149905 113272 107524 91023 94604 213382 217575 212808
8256 212808 153867 120151 112443 93019 113764 216357 286079 327422 260261 191472 202646 201587
8244 201587 136907 106636 126993 134618 89095 91799 111646 129924 211783 205405 127730 137719
8232 137719 156859 182773 197454 121624 126847 124215 147093 163770 207941 207505 186662 186678 192324
8219 192324 100766 175733 209223 184358 192351 238660 192686 133358 191696 160279 138878 157657
$$ packed form
8303B07916L4489p9038P099L2699j237J9510q3779M8862N8615l9458j4853P8836
8291B69661l3085n6974L7546m9757j0554L5599R5886P1291J872j01699j00504
8280A59282n1839K6284K2690n609M3887J0121N8651n4874j5857l2128J9205J4685
8268A94498l0344N170J3702J1125m4246l6633n748j6501L581J18778M193m767
8256B12808n8941l3716p708j9424K0745J02593O9722M1343o7161o8789J1174j059
8244B01587o4680l0271K0357P625m5523K704J9847J8278Q1859o378p7675R989
8232A37719J9140K5914J4681p5830N223k632K2878J6677M4171m36k0843J6N646
8219A92324r1558P4967L3490k4865P993M6309m5974n9328N8338l1417k1401J8779
$$ plain form
8207 157657 144083 108922 120166 155499 198938 219601 225810 207764 203430 208488 233286 270734
8195 270734 218804 207949 218427 207897 223229 240991 226478 222775 135795 88663 111168 120829
8183 120829 119713 66239 51470 99838 109996 105757 43309 54950 105353 139885 73309 155860
8171 155860 169256 118761 122287 226273 252667 214048 173411 96446 82729 159580 124427 93797
8159 93797 118942 197648 221228 227162 204993 203886 188077 177606 189435 155335 149014 161948
8147 161948 156107 153203 166404 165242 206246 212375 188793 118883 59424 57051 57745 7026 33752
8134 33752 59429 65308 101679 100329 85689 53832 62677 115422 165481 114550 90479 105404
8122 105404 166893 232626 249878 276928 214592 155709 191671 167790 97229 108237 168984 172735
$$ packed form
8207A57657j3574l5161J1244L5333M3439K0663O209j8046m334N058K4798L7448
8195B70734n1930j0855J0478j0530J5332J7762j4513l703q6980m7132K2505R661
8183A20829j116n3474j4769M8368J0158m239o2448J1641N0403L4532o6576Q2551
8171A55860J3396n0495L526J03986K6394l8619m0637p6965j3717P6851l5153l0630
8159I3797K5145P8706K3580N934k2169j107j5809j0471J1829l4100o321J2934
8147A61948n841k904J3201j162M1004O129k3582o9910n9459k373O94n0719K6726
8134C3752K5677N879L6371j350j4640l1857Q845N2745N0059n0931k4071J4925
8122A05404O1489O5733J7252K7050o2336n8883L5962k3881p0561J1008O0747L751
$$ plain form
8110 172735 150270 216830 231951 289970 311873 191455 78768 33994 46369 103974 114154
8099 114154 106303 145974 132644 87796 89441 84617 152802 199586 193170 136906 66774 94108
8087 94108 151793 97209 73294 84253 106209 131813 149152 150428 219859 225189 194745 211498
8075 211498 228346 181556 185859 247466 187138 119704 143784 245539 288728 237741 184404 132734
8063 132734 141046 110075 54542 9627 115544 226167 135110 18819 3052 21561 -908
8052 -908 31341 91725 111389 144564 151802 191806 201132 182502 137397 116205 120587 97605 110295
8039 110295 134655 173265 191315 177335 156223 111689 145171 203524 235380 229974 230922 227057
8027 227057 230597 229568 223795 205118 241175 256334 217790 231238 199895 207886 245348 246675 218487
$$ packed form
8110A72735k2465O6560J5121N8019K1903j20418j12687m4774J2375N7605J0180
8099A14154p851L9671j3330m4848J645m824O8185M6784o416n6264p0132K7334
8087I4108N7685n4584k3915J0959K1956K5604J7339J276O9431N330l0444J6753
8075B11498J6848m6790M303O1607o0328o7434K4080J01755M3189n0987n3337n1670
8063A32734Q312l0971n5533m4915J05917J10623r1057j16291j5767J8509k2469
8052i08L2249O0384J9664L3175P238M0004R326j8630m5105k1192M382k2982J2690
8039A10295K4360L8610J8050j3980k1112m4534L3482N8353L1856n406R48l865
8027B27057L540j029n773j8677L6057J5159l8544J3448l1343P991L7462J327k8188
$$ plain form
8014 218487 112119 96893 162085 164079 130970 95581 156014 195244 134754 100143 98952 114667
8002 114667 149350 142089 137549 181929 170654 153716 98239 196185 299413 295013 157124 89429
7990 89429 58315 102065 92136 83214 93979 109430 65932 -1758 44920 160091 170944 183300
7978 183300 188961 129499 128862 117352 111047 102830 118306 50656 54216 44958 42159 35186 8916
7965 8916 135827 184445 174492 199039 205992 181883 227353 265968 215281 217068 167830 238223
7953 238223 252644 227007 211152 182927 150470 197767 269389 264679 186036 182987 223788 195406
7941 195406 219529 214690 169841 158704 182259 202946 217875 209254 163462 192476 226616 178504
7929 178504 105841 113264 143633 135000 151948 151382 42943 -13137 -24814 18068 12865 29516
$$ packed form
8014B18487j06368j5226O5192J994l3109l5389O0433L9230o0490l4611j191J5715
8002A14667L4683p261m540M4380j1275j6938n5477R7946J03228m400j37889o7695
7990H9429l1114M3750r929q922J0765J5451m3498o7690M6678J15171J0853J2356
7978A83300N661n9462o37j1510o305q217J5476o7650L560r258k799o973k6270
7965H916J26911M8618r953K4547O953k4109M5470L8615n0687J787m9238P0393
7953B38223J4421k5637j5855k8225l2457M7297P1622m710p8643l049M0801k8382
7941A95406K4123m839m4849j1137K3555K0687J4929q621m5792K9014L4140m8112
7929A78504p2663P423L0369q633J6948n66j08439n6080j1677M2882n203J6651
$$ plain form
7917 29516 71168 107081 92774 71442 104926 117001 135881 182557 221401 154413 98895 112107
7905 112107 111950 138337 171735 223225 251919 181654 82094 38940 -32510 4559 58727 165219
7893 165219 166379 107949 84503 98772 177058 193735 184506 172004 197814 175007 161851 195314
7881 195314 188135 178462 201391 190899 151480 75953 84704 169950 232061 234961 284656 372615
7869 372615 372477 280089 242093 189319 168762 134751 63584 26343 67224 108534 156036 190413
7857 190413 137913 115980 113323 169692 111561 56969 -29889 -66790 10527 37279 84020 135703
7845 135703 126609 100118 83011 52519 4869 -21236 38386 74457 93312 121971 161433 125934
7833 125934 114964 77375 -24665 -49751 -6180 51540 134347 228900 157628 136255 105139
$$ packed form
7917B9516M1652L5913j4307k1332L3484J2075J8880M6676L8844o6988n5518J3212
7905A12107j57K6387L3398N1490K8694p0265r9560m3154p1450L7069N4168J06492
7893A65219J160n8430k3446J4269P8286J6677r229j2502K5810k2807j3156L3463
7881A95314p179r673K2929j0492l9419p5527Q751Q5246O2111K900M9695Q7959
7869C72615j38r2388l7996n2774k0557l4011p1167l7241M0881M1310M7502L4377
7857A90413n2500k1933k657N6369n8131n4592q6858l6901P7317K6752M6741N1683
7845A35703r094k6491j7107l0492m7650k6105N9622L6071J8855K8659L9462l5499
7833A25934j0970l7589j02040k5086M3571N7720Q2807R4553p1272k1373l1116
$$ plain form
7822 105139 30484 52092 41812 83585 155434 118917 104984 172712 107783 98581 121499 121927
7810 121927 123804 151476 104240 140294 85123 6930 33445 65522 105951 126884 96014 43195
7798 43195 19192 15735 65200 80145 41155 37024 -9336 34791 28099 30730 64349 87349 2600
7785 2600 -46049 17210 93907 169215 163862 77953 55229 98671 66741 -7751 -87073 -87844 -8381
7772 -8381 35704 39921 27384 9305 -15366 -56152 -32583 -45888 -28719 49840 35108 -14094
7760 -14094 -79481 -53339 -44096 -20948 40184 73629 119615 146905 152032 171051 209250 132438
7748 132438 136795 95294 63575 56070 -9732 37154 39743 3717 -46253 -32528 13369 5735
7736 5735 39492 93211 115768 114660 68396 -31598 -65237 -76227 -70865 12633 26121 98846
$$ packed form
7822A05139p4655K1608j0280M1773P1849l6517j3933O7728o4929r202K2918M28
7810A21927J877K7672m7236L6054n5171p8193K6515L2077M0429K0933l0870n2819
7798D3195k4003l457M9465J4945l8990m131m6360M4127o692K631L3619K3000q4749
7785B600m8649O3259P6697P5308n353q5909k2724M3442l1930p4492p9322p71P9463
7772h381M4085M217j2537j8079k4671m0786K3569j3305J7169P8559j4732m9202
7760a4094o5387K6142R243K3148O1132L3445M5986K7290N127J9019L8199p6812
7748A32438M357m1501l1719p505o5802M6886K589l6026m9970J3725M5897p634
7736E735L3757N3719K2557j108m6264r9994l3639j0990N362Q3498J3488P2725
$$ plain form
7724 98846 149434 112010 86490 7695 -3949 44860 85767 84627 85605 50208 20054 -29084
7712 -29084 -44576 17025 66123 60408 29078 -2036 -26353 -31387 -7316 16845 62847 74225
7700 74225 32601 28216 42354 11365 60696 56910 -33865 -14254 21779 8545 -32472 -27391
7688 -27391 28790 75550 146716 87369 120293 66116 74062 106409 157625 83229 50149 69895
7676 69895 58723 64322 95802 94908 22341 -11598 -53794 -4803 54462 88334 52427 25933
7664 25933 83424 103685 97187 118247 54056 24425 600 32747 -542 -36375 -98742 -35721
7652 -35721 37537 35453 31336 65723 39230 82804 63778 53272 11259 -31428 54506 146412
7640 146412 134012 146319 164546 104292 28016 34105 80000 113272 111542 30873 -13288 -15314
$$ packed form
7724I8846N0588l7424k5520p8795j1644M8809M0907j140R78l5397l0154m9138
7712b9084j5492O1601M9098n715l1330l1114k4317n034K4071K4161M6002J1378
7700G4225m1624m385J4138l0989M9331l786r0775J9611L6033j3234m1017N081
7688b7391N6181M6760P1166n9347L2924n4177P946L2347N1216p4396l3080J9746
7676F9895j1172N599L1480q94p2567l3939m2196M8991N9265L3872l5907k6494
7664B5933N7491K0261o498K1060o4191k9631k3825L2147l3289l5833o2367O3021
7652c5721P3258k084m117L4387k6493M3574j9026j0506m2013m2687Q5934R1906
7640A46412j2400J2307J8227o0254p6276O089M5895L3272j730q0669m4161k026
$$ plain form
7628 -15314 -34390 -28766 -54266 -37023 -54820 -40764 40612 10519 2749 23926 8986 36895
7616 36895 60176 72026 72715 57918 16096 44149 80471 46966 14590 21233 -28065 35835
7604 35835 138945 103999 72313 -2425 34828 83565 95002 34302 29048 15919 7463 68363
7592 68363 25593 13917 29388 9335 47096 -16865 -95449 -94559 -29328 24679 20090 62765
7580 62765 144112 169495 47057 -9527 20465 -14542 -69132 -48395 -17079 -10175 29233 3455
7568 3455 -3884 -45652 -30102 -49555 2929 -41027 -27170 46585 11560 -48790 -110660 -50931
7556 -50931 52266 18628 15494 104258 109475 146894 122785 60066 -21987 -94060 -105994 -49079
7544 -49079 -59830 -20864 -11997 14899 -17353 -56721 -32227 -5454 23124 43379 11027 -34496
$$ packed form
7628a5314j9076N624k5500J7243j7797J4056Q1376l0093p770K1177j4940K7909
7616C6895K3281J1850O89j4797m1822K8053L6322l3505l2376O643m9298O3900
7604C5835J03110l4946l1686p4738L7253M8737J1437o0700n254j3129q456O0900
7592F8363m2770j1676J5471k0053L7761o3961p8584Q90O5231N4007m589M2675
7580F2765Q1347K5383j22438n6584K9992l5007n4590K0737L1316O904L9408k5778
7568C455p339m1768J5550j9453N2484m3956J3857P3755l5025o0350o1870N9729
7556e0931J03197l3638l134Q8764N217L7419k4109o2719q2053p2073j1934N6915
7544d9079j0751L8966Q867K6896l2252l9368K4494K6773K8578K0255l2352m5523
$$ plain form
7532 -34496 -73965 -172534 -143608 -68400 17542 51929 42088 83640 68950 24734 -14309 -41055
7520 -41055 -52030 -68681 -78132 -10879 7881 6852 13103 59486 113898 50458 1380 47565
7508 47565 49079 53913 106899 133558 171907 102112 50580 81860 50908 18121 36827 43834
7496 43834 35753 76360 149570 114807 92967 55997 42157 89828 54366 -58299 -98502 -17545
7484 -17545 11859 -2758 15093 -5176 -19182 -15209 -1874 38040 23925 26001 25831 90648 82977
7471 82977 22978 64406 136302 129222 87504 4457 -94758 -62843 -13323 20596 -2635 -70786
7459 -70786 -84258 -54610 -28161 -86384 -34111 47056 -62354 -131592 -32233 54968 66950 91105
7447 91105 47308 7378 17730 15958 20220 103334 82067 22152 -14933 -23617 -233 55396
$$ packed form
7532c4496l9469r8569K8926P5208Q5942L4387r841M1552j4690m4216l9043k6746
7520d1055j0975j6651r451O7253J8760j029O251M6383N4412o3440m9078M6185
7508D7565J514M834N2986K6659L8349o9795n1532L1280l0952l2787J8706P007
7496D3834q081M0607P3210l4763k1840l6970j3840M7671l5462j12665m0203Q0957
7484a7545K9404j4617J7851k0269j4006L973J3335L9914j4115K076j70O4817p671
7471H2977n9999M1428P1896p080m1718q3047r9215L1915M9520L3919k3231o8151
7459g0786j3472K9648K6449n8223N2273Q1167j09410o9238R9359Q7201J1982K4155
7447I1105m3797l9930J0352j772M262Q3114k1267n9915l7085q684K3384N5629
$$ plain form
7435 55396 83610 19799 12152 17061 10773 36844 13141 -23400 31876 86289 52223 40720
7423 40720 15574 54764 20145 -8414 31516 8564 52030 69820 -34627 -49519 -5743 -3820
7411 -3820 -36900 -72010 -72313 6531 70105 23109 60696 48971 38833 27069 39307 70913
7399 70913 74174 47980 17582 18673 8032 34814 53156 77079 93278 80559 -10908 -88538
7387 -88538 -50935 1828 -30846 -35686 12896 7537 -47036 51804 90107 56256 74403 86097
7375 86097 109758 123015 61529 22760 32216 -7687 -16430 14678 36398 69140 95545 96099 108999
7362 108999 106314 67502 76602 77127 50093 -44276 -84432 -63296 -4561 -42998 -48418 14180 65988
7349 65988 -15730 11698 74416 110367 70010 66699 68498 87093 49859 88262 87463 44178 27867
$$ packed form
7435E5396K8214o3811p647M909o288K6071k3703l6541N5276N4413l4066j1503
7423D0720k5146L9190l4619k8559L9930k2952M3466J7790j04447j4892M3776J923
7411c820l3080l5110l03P8844O3574m6996L7587j1725j0138j1764J2238L1606
7399G0913L261k6194l0398J091j0641K6782J8342K3923J6199j2719r1467p7630
7387h8538L7603N2763l2674m840M8582n359n4573R8840L8303l3851J8147J1694
7375H6097K3661J3257o1486l8769R456l9903q743L1108K1720L2742K6405N54J2900
7362A08999k685l8812R100N25k7034r4369m0156K1136N8735l8437n420O2598N1808
7349F5988q1718K7428O2718L5951m0357l311J799J8595l7234L8403p99m3285j6311
$$ plain form
7336 27867 31447 67012 42845 -17347 38488 79857 65133 23121 74135 88775 42063 22917
7324 22917 -26711 -58223 -76969 -58477 -15377 -6958 33702 36477 -31867 -32445 -44835 -102124 -33273
7311 -33273 61436 25304 -50017 -23653 5664 20386 49606 -34685 -147742 -74409 -61587 -87273
7299 -87273 -45538 19181 4234 -56205 -21803 -51936 -88043 -52199 -36619 19535 33988 94101
7287 94101 118775 105063 -2616 -53900 -10372 27419 51024 115992 109474 128079 83789 78448
7275 78448 73664 -2188 -24308 -32419 30287 4391 -37069 -13226 29415 -563 15883 -11052
7263 -11052 -93905 -103385 -78870 -3816 -19856 -99887 -76614 -45213 -48054 -126896 -135925 -54031
7251 -54031 13020 -10998 23719 66642 83892 77061 107686 50566 -8302 3049 123767 95944
$$ packed form
7336B7867L580L5565k4167o0192N5835M1369j4724m2012N1014J4640m6712j9146
7324B2917m9628l1512j8746J8492M3100Q419M0660K775o8344n78j2390n7289O8851
7311c3273R4709l6132p5321K6364K9317J4722K9220q4291j13057P3333J2822k5686
7299h7273M1735O4719j4947o0439L4402l0133l6107L5844J5580N6154J4453O0113
7287I4101K4674j3712j07679n1284M3528L7791K3605O4968o518J8605m4290n341
7275G8448m784p5852k2120q111O2706k5896m1460K3843M2641k9978J6446k6935
7263a1052q2853r480K4515P5054j6040q0031K3273L1401k841p8842r029Q1894
7251e4031O7051k4018L4717M2923J7250o831L0625n7120n8868J1351J20718k7823
$$ plain form
7239 95944 29262 25189 -2634 -70654 -98058 -27641 -5322 17787 -13706 -74484 -64429 -60398
7227 -60398 -105420 -87370 -66067 600 12275 -4814 -76629 -19418 -14761 12218 13828 -18088
7215 -18088 -33402 15562 25340 6034 5393 -6708 5278 4367 9092 83629 203058 226580 141745
7202 141745 104900 15072 3007 49241 20083 15603 17536 25396 91472 143444 133137 119535
7190 119535 49823 21809 44774 75769 135639 150402 99524 81303 21687 -10300 32208 38556
7178 38556 64658 64431 84425 92721 53649 39563 10161 -14235 9028 24974 -37504 -5799
7166 -5799 61507 16934 16954 77923 5330 -29917 -32944 19811 92687 80077 915 -44480 -84319
7153 -84319 -53059 20706 13050 23707 -5024 44414 52335 29820 129895 158676 140034 140121 129746
$$ packed form
7239I5944o6682m073k7823o8020k7404P0417K2319K3109l1493o0778J0055M031
7227f0398m5022J8050K1303O6667J1675j7089p1815N7211M657K6979J610l1916
7215a8088j5314M8964R778j9306o41j2101J1986r11M725P4537J19429K3522q4835
7202A41745l6845q9828j2065M6234k9158m480J933P860O6076N1972j0307j3602
7190A19535o9712k8014K2965L0995N9870J4763n0878j8221n9616l1987M2508O348
7178C8556K6102k27J9994Q296l9072j4086k9402k4396K3263J5946o2478L1705
7166e799O7306m4573K0O0969p2593l5247l027N2755P2876j2610p9162m5395l9839
7153h4319L1260P3765p656J0657k8731M9438P921k2515J00075K8781j8642Q7j0375
$$ plain form
7140 129746 94947 43152 49056 -10992 44851 4636 -30157 -31857 48797 59964 52349 65826
7128 65826 75201 -53955 -104569 32333 41650 -4903 17249 -16062 2583 34592 -36503 -82159
7116 -82159 -110522 -79884 -21719 34940 40400 12630 25980 82821 81738 87060 35861 13955
7104 13955 40189 -23458 -84199 -124611 -46436 44580 42114 88541 81219 6376 19193 7513
7092 7513 -33367 -396 -16587 -85294 -136661 -178598 -162564 -143862 -92853 -40044 -66684 -71319
7080 -71319 21068 27663 -41161 -73846 -74376 -107483 -106059 13677 41794 -30557 -71695 -148277
7068 -148277 -126316 -82545 -3471 -3338 25929 64382 52836 23783 24050 4880 -44587 -8291
7056 -8291 -34741 -107443 -51735 -33609 13969 55477 23236 25964 124459 137980 69578 14180
$$ packed form
7140A29746l4799n1795N904o0048N5843m0215l4793j700Q0654J1167p615J3477
7128F5826R375j29156n0614J36902R317m6553K2152l3311J8645L2009p1095m5656
7116h2159k8363L0638N8165N6659N460k7770J3350N6841j083N322n1199k1906
7104A3955K6234o3647o0741m0412P8175R1016k466M6427p322p4843J2817j1680
7092G513m0880L2971j6191o8707n1367m1937J6034J8702N1009N2809k6640m635
7080g1319R2387O595o8824l2685n30l3107J424J19736K8117p2351m1138p6582
7068a48277K1961M3771P9074J33K9267L8453j1546k9053K67j9170m9467L6296
7056h291k6450p2702N5708J8126M7578M1508l2241K728R8495J3521o8402n5398
$$ plain form
7044 14180 11612 -24396 -50176 -60338 -52137 -54727 -30811 56482 179222 236388 199655 148773
7032 148773 109183 109068 80032 32666 32757 968 44740 85067 143350 152367 111938 56982 10295
7019 10295 -6330 9825 32031 48324 48657 -10133 -85684 -21086 41406 22842 10433 29580
7007 29580 52159 29430 69396 109682 111554 69845 15732 -31781 -83089 -3697 88711 50996
6995 50996 25461 8226 30123 27598 40751 59360 65168 109188 111636 85438 34782 -16440
6983 -16440 -38020 -53882 -69320 -45295 -451 14918 9744 -29350 -64284 -101017 -87047 -18400
6971 -18400 -31924 -68527 -30041 -38858 9300 5474 32612 39598 -48886 -87345 -127268 -106268
6959 -106268 -52609 -12647 -4941 -27880 -11262 5799 -21752 -52506 -14039 70491 112237 90316
$$ packed form
7044A4180k568l6008k5780j0162Q201k590K3916Q7293J22740N7166l6733n0882
7032A48773l9590j15k9036m7366R1l1789M3772M0327N8283R017m0429n4956m6687
7019A0295j6625J6155K2206J6293L33n8790p5551O4598O2492j8564j2409J9147
7007B9580K2579k2729L9966M0286J872m1709n4113m7513n1308P9392R2408l7715
6995E0996k5535j7235K1897k525J3153J8609N808M4020K448k6198n0656n1222
6983a6440k1580j5862j5438K4025M4844J5369n174l9094l4934l6733J3970O8647
6971a8400j3524l6603L8486q817M8158l826K7138O986q8484l8459l9923K1000
6959a06268N3659L9962P706k2939J6618J7061k7551l0754L8467Q4530M1746k1921
$$ plain form
6947 90316 94887 49515 26961 30134 59200 85280 17644 -43842 -4493 78150 115717 106913
6935 106913 25521 23838 35660 99193 129271 85711 127735 98704 42028 17345 7499 50854
6923 50854 98030 118781 22980 -89115 -39390 23552 57716 146905 87161 -25881 -22054 -20240
6911 -20240 10252 -89110 -117154 -70611 -110998 -104582 -110893 -64890 -68452 -28092 28015 20801 4122
6898 4122 50321 67059 -1083 12852 -7050 -59922 -11323 -16379 -23331 -24298 50667 81843 93213
6885 93213 92036 2098 -12110 -9383 -7891 -109545 -119269 -82819 -27025 -10796 -33419 29962
6873 29962 7307 -80094 1093 62731 -5439 -72972 -52782 -14385 -10893 -35900 -90069 -43965
6861 -43965 29060 -41713 -64845 -102438 -91938 -76241 -115283 -72445 -5247 -45525 -49012 42589
$$ packed form
6947I0316M571m5372k2554L173K9066K6080o7636o1486L9349Q2643L7567q804
6935A06913q1392j683J1822O3533L0078m3560M2024k9031n6676k4683r846M3355
6923E0854M7176K0751r5801j12095M9725O2942L4164Q9189n9744j13042L827J814
6911b0240L0492r9362k8044M6543m0387O416o311M6003l562M0360N6107p214j6679
6898D122M6199J6738o8142J3935j9902n2872M8599n056o952r67P4965L1176J1370
6885I3213j177q9938j4208K727J492j01654r724L6450N5794J6229k2623O3381
6873B9962k2655q7401Q1187O1638o8170o7533K0190L8397L492k5007n4169M6104
6861d3965P3025p0773k3132l7593J0500J5697l9042M2838O7198m0278l487R1601
$$ plain form
6849 42589 88843 94773 85118 10631 26913 22525 -51640 -130405 -100260 14344 92550 90615
6837 90615 95727 111840 129104 47962 73701 119413 89513 26295 -56661 -69362 -72342 -4653
6825 -4653 57053 51350 -23208 -49717 -29949 -34290 -13421 -33459 -33116 6239 81227 21472 34384
6812 34384 10306 -11412 -31806 -17050 12522 -44230 -42361 -36422 -14741 38707 91947 121824
6800 121824 68916 23780 86923 73119 36140 -1829 -35228 41480 39617 25682 -62839 -67649
6788 -67649 62050 6054 -47835 -78612 -38272 30724 46817 9468 10209 75654 107650 41009
6776 41009 -29742 -38079 -29709 -2362 -52001 -48399 22501 64837 -25319 -29333 11058 9041 -41246
6763 -41246 -127047 -179561 -175944 -171495 -139955 -137225 -85332 -48523 -65699 -107412 -70638 -122659
$$ packed form
6849D2589M6254N930r655p4487J6282m388p4165p8765L0145J14604P8206j935
6837I0615N112J6113J7264q1142K5739M5712k9900o3218q2956j2701k980O7689
6825d653O1706n703p4558k6509J9768m341K0869k0038L43L9355P4988n9755J2912
6812C4384k4078k1718k0394J4756K9572n6752J869N939K1681N3448N3240K9877
6800A21824n2908m5136O3143j3804l6979l7969l3399P6708j863j3935q8521m810
6788f7649J29699n5996n3889l0777M0340O8996J6093l7349P41O5445L1996o6641
6776D1009p0751q337Q370K7347m9639L602P0900M2336r0156m014M0391k017n0287
6763d1246q5801n2514L617M449L1540K730N1893L6809j7176m1713L6774n2021
$$ plain form
6751 -122659 -108117 -21384 23895 48577 8138 10499 20603 20476 36777 -72860 -44804 4852
6739 4852 -2053 30071 82220 71978 38794 1054 -63302 -112079 -103303 -151874 -65279 -84013
6727 -84013 21359 77258 91588 135548 92807 75077 76932 64136 -19154 -72955 -94329 -131496
6715 -131496 -92037 -48396 -16464 36334 13557 -46601 -26722 -9644 2426 10574 -1321 -1077
6703 -1077 73043 60760 58692 79173 89417 44941 66420 52263 67307 22340 11294 93193
6691 93193 72057 22945 8496 24828 60156 60316 24458 41645 50145 3873 10407 -7184 -26284
6678 -26284 54465 48155 40365 34420 -8627 -47685 -57221 -54311 -285 13848 18773 -73545 -114740
$$ packed form
6751a22659J4542Q6733M5279K4682m0439K361J0104j27J6301j09637K8056M9656
6739D852o905L2124N2149j0242l3184l7740o4356m8777Q776m8571Q6595j8734
6727h4013J05372N5899J4330M3960m2741j7730J855j2796q3290n3801k1374l7167
6715a31496L9459M3641L1932N2798k2777o0158J9879J7078J2070Q148j1895K44
6703a077P4120j2283k068K0481J0244m4476K1479j4157J5044m4967j1046Q1899
6691I3193k1136m9112j4449J6332L5328J60l5858J7187Q500m6272O534j7591j9100
6678b6284Q0749o310p790n945m3047l9058r536K910N4026J4133M925r2318m1195
$$ [...]
##END NTUPLES=NMR SPECTRUM
##END=
