##TITLE=Analysis number 313126
Compound Code cc 45514
Book Reference 397/72/5
Project Code adrs
Chemist Name brucer
##JCAMPDX= 6.0         $$ Bruker NMR JCAMP-DX V2.0
##DATA TYPE= NMR SPECTRUM
##DATA CLASS= NTUPLES
##ORIGIN= Bruker BioSpin GmbH
##OWNER= NMR
$$ XWIN-NMR		Version 3.5
$$ Thu Aug 25 09:23:37 2005 GMT Daylight Time (UT+1h)  MAYBRIDGE\NMR@NMR_250MHZ
##.OBSERVE FREQUENCY= 250.131544655141
##.OBSERVE NUCLEUS= ^1H
##.ACQUISITION MODE= SIMULTANEOUS (DQD)
##.ACQUISITION SCHEME= undefined
##.AVERAGES= 16
##.DIGITISER RES= 18
##SPECTROMETER/DATA SYSTEM= dpx250
##.PULSE SEQUENCE= zg30
##.SOLVENT NAME= CDCl3
##.SHIFT REFERENCE= (INTERNAL, CDCl3, 0, 16.522)
##AUDIT TRAIL= $$ (NUMBER, WHEN, WHO, WHERE, WHAT)
$$ ##TITLE= Audit trail, XWIN-NMR		Version 3.5
$$ ##JCAMPDX= 5.01
$$ ##ORIGIN= Bruker BioSpin GmbH
$$ ##OWNER= NMR
$$ C:\u/data/dgb/nmr/ADRS/8590/pdata/1/auditp.txt
$$ ##AUDIT TRAIL=  $$ (NUMBER, WHEN, WHO, WHERE, WHAT)
(   1,<2005-08-25 09:23:16.88 +100>,<MAYBRIDGE\NMR>,<NMR_250MHZ>,
      <created by zg, POWCHK disabled, PULCHK disabled
       configuration hash MD5:
       62 19 C7 07 E1 42 D1 B7 37 6C 3D D0 77 39 F9 E6
       data hash MD5: 64K
       D6 C8 CF 8E 8C 29 96 DE E4 97 58 95 77 76 40 99>)
(   2,<2005-08-25 09:23:29.02 +100>,<MAYBRIDGE\NMR>,<NMR_250MHZ>,
      <Start of raw data processing
       ef LB = 0.3 FT_mod = 6 PKNL = 1 SI = 32K 
       data hash MD5: 32K
       41 F7 A3 1B C5 C0 B4 72 3F B0 27 C8 FD CC 9C 02>)
(   3,<2005-08-25 09:23:30.83 +100>,<MAYBRIDGE\NMR>,<NMR_250MHZ>,
      <apk 
       data hash MD5: 32K
       56 3B F4 D1 06 EC F4 1E C8 C0 4E 40 6C 1B 81 95>)
(   4,<2005-08-25 09:23:31.74 +100>,<MAYBRIDGE\NMR>,<NMR_250MHZ>,
      <abs ABSG = 5 
       data hash MD5: 32K
       8C 24 3D A8 C8 FE 7A 7F 9B 7B 97 EE 15 0D 40 23>)
$$ ##END=
$$ 
$$ hash MD5
$$ 7A 96 56 8E B5 97 6F C7 53 A3 D2 C2 15 F0 D2 03
##$RELAX= 
##$RELAX= 
##$RELAX= 
##$RELAX= 
##$RELAX= 
##$RELAX= 
##$RELAX= 
$$ Bruker specific parameters
$$ --------------------------
##$DU= <C:\u>
##$EXPNO= 8590
##$NAME= <ADRS>
##$PROCNO= 1
##$TYPE= <nmr>
##$USER= <dgb>
##$AMP= (0..31)
100 100 100 100 100 100 100 100 100 100 100 100 100 100 100 100 100 100 
100 100 100 100 100 100 100 100 100 100 100 100 100 100 
##$AQSEQ= 0
##$AQ_mod= 3
##$AUNM= <au_zg>
##$AUTOPOS= <4 >
##$BF1= 250.13
##$BF2= 250.13
##$BF3= 250.13
##$BF4= 250.13
##$BF5= 500.13
##$BF6= 500.13
##$BF7= 500.13
##$BF8= 500.13
##$BYTORDA= 1
##$CFDGTYP= 0
##$CFRGTYP= 5
##$CHEMSTR= <none>
##$CNST= (0..31)
1 1 145 1 1 1 1 1 1 1 1 1 1 1 1 1 1 1 1 1 1 1 1 1 1 1 1 1 1 1 1 1 
##$CPDPRG= <>
##$CPDPRG1= <>
##$CPDPRG2= <>
##$CPDPRG3= <>
##$CPDPRG4= <mlev>
##$CPDPRG5= <mlev>
##$CPDPRG6= <mlev>
##$CPDPRG7= <mlev>
##$CPDPRG8= <mlev>
##$CPDPRGB= <>
##$CPDPRGT= <>
##$D= (0..31)
0 1 0 0 0 0 0 0 0 0.06 0 0 0 0 0 0 0.0002 0 0 0 0 0 0 0 0 0 0 0 0 0 0 
0 
##$DATE= 1124958195
##$DBL= (0..7)
120 120 120 120 120 120 120 120 
##$DBP= (0..7)
150 150 150 150 150 150 150 150 
##$DBP07= 0
##$DBPNAM0= <>
##$DBPNAM1= <>
$$ [...]
##$SUBNAM7= <"">
##$SUBNAM8= <"">
##$SUBNAM9= <"">
##$SW= 20.6930455092707
##$SWIBOX= (0..15)
0 0 3 0 0 0 0 0 0 0 0 0 0 0 0 0 
##$SW_h= 5175.983436853
##$TD= 65536
##$TD0= 1
##$TE= 295.16
##$TE2= 300
##$TE3= 300
##$TEG= 300
##$TL= (0..7)
0 120 120 120 120 120 120 120 
##$TP= (0..7)
150 150 150 150 150 150 150 150 
##$TP07= 0
##$TPNAME0= <>
##$TPNAME1= <>
##$TPNAME2= <>
##$TPNAME3= <>
##$TPNAME4= <>
##$TPNAME5= <>
##$TPNAME6= <>
##$TPNAME7= <>
##$TPOAL= (0..7)
0.5 0.5 0.5 0.5 0.5 0.5 0.5 0.5 
##$TPOFFS= (0..7)
0 0 0 0 0 0 0 0 
##$TUNHIN= 0
##$TUNHOUT= 0
##$TUNXOUT= 0
##$USERA1= <user>
##$USERA2= <user>
##$USERA3= <user>
##$USERA4= <user>
##$USERA5= <user>
##$V9= 5
##$VALIST= <valist>
##$VCLIST= <CCCCCCCCCCCCCCC>
##$VD= 0
##$VDLIST= <DDDDDDDDDDDDDDD>
##$VPLIST= <PPPPPPPPPPPPPPP>
##$VTLIST= <TTTTTTTTTTTTTTT>
##$WBST= 1024
##$WBSW= 4
##$XGAIN= (0..3)
0 0 0 0 
##$XL= 0
##$YL= 0
##$YMAX_a= 290738
##$YMIN_a= -513744
##$ZGOPTNS= <>
##$ZL1= 120
##$ZL2= 120
##$ZL3= 120
##$ZL4= 120
##$ABSF1= 16.522
##$ABSF2= -4.171173
##$ABSG= 5
##$ABSL= 3
##$ALPHA= 0
##$AQORDER= 0
##$ASSFAC= 0
##$ASSFACI= 0
##$ASSFACX= 0
##$ASSWID= 0
##$AUNMP= <proc_1d>
##$AZFE= 0.1
##$AZFW= 0.1
##$BCFW= 0
##$BC_mod= 0
##$BYTORDP= 0
##$COROFFS= 0
##$CY= 12.5
##$DATMOD= 1
##$DC= 0
##$DFILT= <>
##$DTYPP= 0
##$F1P= 14.0000005364418
##$F2P= -0.99999901652339
##$FCOR= 0.5
##$FTSIZE= 32768
##$FT_mod= 6
##$GAMMA= 0
##$GB= 0
##$INTBC= 1
##$INTSCL= 1
##$ISEN= 128
##$LB= 0.3
##$LEV0= 0
##$LPBIN= 0
##$MAXI= 10000
##$MC2= 0
##$MEAN= 0
##$ME_mod= 0
##$MI= 0
##$NCOEF= 0
##$NC_proc= -5
##$NLEV= 6
##$NOISF1= 0
##$NOISF2= 0
##$NSP= 0
##$NTH_PI= 0
##$NZP= 0
##$OFFSET= 16.522
##$PC= 1
##$PHC0= -73.862
##$PHC1= 3.975836
##$PH_mod= 1
##$PKNL= yes
##$PPARMOD= 0
##$PSCAL= 4
##$PSIGN= 0
##$REVERSE= no
##$SF= 250.13
##$SI= 32768
##$SIGF1= 0
##$SIGF2= 0
##$SINO= 400
##$SIOLD= 32768
##$SREGLST= <1H.CDCl3>
##$SSB= 0
##$STSI= 32768
##$STSR= 0
##$SW_p= 5175.98343685301
##$SYMM= 0
##$S_DEV= 0
##$TDeff= 65536
##$TDoff= 0
##$TI= <Analysis number 999999
Compound Code 99
Book Reference 9
Project Code 9>
##$TILT= no
##$TM1= 0
##$TM2= 0
##$TOPLEV= 0
##$USERP1= <user>
##$USERP2= <user>
##$USERP3= <user>
##$USERP4= <user>
##$USERP5= <user>
##$WDW= 1
##$XDIM= 32768
##$YMAX_p= 529509953
##$YMIN_p= -417581
$$ End of Bruker specific parameters
$$ ---------------------------------
##NTUPLES= NMR SPECTRUM
##VAR_NAME=  FREQUENCY,     SPECTRUM/REAL,   SPECTRUM/IMAG
##SYMBOL=    X,             R,               I
##VAR_TYPE=  INDEPENDENT,   DEPENDENT,       DEPENDENT
##VAR_FORM=  AFFN,          ASDF,            ASDF
##VAR_DIM=   32768,         32768,           32768
##UNITS=     HZ,            ARBITRARY UNITS, ARBITRARY UNITS
##FACTOR=    0.157963299565203, 1,           1
##FIRST=     4132.6476996994, 0,             0
##LAST=      -1043.33573715361, 0,           0
##MIN=       -1043.33573715361, -417581,     0
##MAX=       4132.6476996994, 529509953,     0
$$ Real data points
##PAGE= N=1
##DATA TABLE= (X++(R..R)), XYDATA
$$ [...]
17268I10859j39493j64704k3489Q1226p478r4975N873k1332m1925j35192p1850
17257B97520k990q3154J8616L9606J7093M5650l23Q539N0052l6123p1593k7443
17245B55450q0016K3536j746M8117J22258N7100K8556J46813R7625Q0922J18296
17234H96911n4018p781n7466k323N4101K7657n290m4195L2122P9759L1307R7690
17222A048474J39924Q3043J15241J7153O8997o9607O63q5658k05295k76174q8826
17211G47935Q4958J38082P7908J10314N7359k8901M8147J8887k0625n0766L8693
17200A221991M1808L9032J26336K13249J30276J84963L42614N04754O99459P51717
17190D256199M87686J4966j44133j49514k39995l25647r2781p783J00015J24640
$$ y = [910859, 771366, 606662, 583173, 664399, 656921, 561946, 567819, 546487, 504562, 369370, 297520, 294530, 211376, 229992, 269598, 286691, 332341, 332018, 340557, 390609, 354486, 282893, 255450, 175434, 198970, 197224, 245341, 367599, 424699, 453255, 600068, 697693, 778615, 896911, 842893, 835112, 777646, 775323, 829424, 857081, 851791, 807596, 839718, 919477, 950784, 1048474, 1188398, 1271441, 1386682, 1403835, 1472832, 1403225, 1403888, 1318230, 1112935, 836761, 747935, 832893, 970975, 1048883, 1159197, 1216556, 1187655, 1235802, 1254689, 1234064, 1183298, 1221991, 1263799, 1302831, 1429167, 1642416, 1772692, 1957655, 2300269, 2805023, 3504482, 4256199, 4743885, 4758851, 4614718, 4465204, 4225209, 3899562, 3806781, 3798998, 3899013, 4023653]
17180D023653Q5247K56727L36368K88787L38077M95544N56402O96852Q30213J031530
17170H939400J287468J644377K127327L003782M117284N123531N076752L555119
17162C4875040Q30113j286167j982624j254143K25283J862013L492473N274996
17154D2036984P550879J0948988J6519033K4838687L6150465M6423642M6839071
17147B31307749L0724658K937077k1048811l2697501l4138903l1368959k7043504
17140A18671806k1169709j4454517p761338j633910L481316N869146L834696k176195
17132H4661295q902742j2693547j2778715j0464438p727826n384061l524336k161176
17124B1024454j506140j143261p62393n23904j08063J68685L34202O70402R97614
$$ y = [4023653, 4108900, 4365627, 4701995, 4990782, 5328859, 5824403, 6380805, 7077657, 7907870, 8939400, 10226868, 11871245, 13998572, 17002354, 21119638, 26243169, 31319921, 34875040, 35705153, 34418986, 32436362, 31182219, 31407502, 33269515, 36761988, 42036984, 49587863, 60536851, 77055884, 101894571, 138045036, 184468678, 231307749, 262032407, 264969484, 243920673, 211223172, 177084269, 145715310, 118671806, 97502097, 83047580, 75286242, 73652332, 77133648, 83002794, 86837490, 84661295, 75758553, 63065006, 50286291, 39821853, 32094027, 26709966, 23185630, 21024454, 19518314, 18375053, 17612660, 17088756, 16980693, 17149378, 17483580, 18153982, 19151596]
17115A9151596J300187J850821K735727L941060N780959Q163997J0970420J2593846
17107F6488613J0939639N466101r93693m840086m609056j271262L775976R454736
17099H4410968J5023649J9758105K3273261K6902470K9011737K3400555N879981
17092B27660726j8380616l5742437m0043162l4527066k5715534j7770443j2004843
17085D3476625q131749n454452l551751k318250q54566N35342J628982J851408
17077B7181589Q92792j095402k827040l335843k888631k054327j413746j143418
17069A3315974r91471r60021j145962j121566j047315p58455p44090o64665m44470
17060E437959k53561j86466q0700j76497j55685j92684j54191k12853l38321j77099
$$ y = [19151596, 20451783, 22302604, 25038331, 28979391, 34760350, 42924347, 53894767, 66488613, 77428252, 82894353, 81900660, 77060574, 72451518, 71180256, 74956232, 84410968, 99434617, 119192722, 142465983, 169368453, 198380190, 221780745, 227660726, 209280110, 173537673, 133494511, 98967445, 73251911, 55481468, 43476625, 35344876, 29890424, 26338673, 24020423, 23165857, 23701199, 25330181, 27181589, 28074381, 26978979, 24151939, 20816096, 17927465, 15873138, 14459392, 13315974, 12324503, 11364482, 10218520, 9096954, 8049639, 7291184, 6547094, 5882429, 5437959, 5184398, 4997932, 4917232, 4740735, 4585050, 4392366, 4238175, 4025322, 3687001, 3509902]
17050C509902j40169j39804r4286j42931j76671q7155o1696q8218r5669j57095
17040B326208q0915M1440L7580M5456L2413n2756O1779M3852J0038N4800J04593
17029B624488P1712O2797N402j08510M3096L7041J4089J69377J03337J82429L87680
17018C592938L61102K68745L36770J02989k56048m08314n70746n04481l49057
17009B573898k01896j61769k56805r8273L7755j50288k12630j31656j5752N4440
16999A437024l6621r6073q3316J24489n6627j14390K722j027l5087j7193l8744
16988A085157l2454j22217O0233l7912L0906m187J4337J09422N7019Q4012m5437
16977A198879j42566o6247j4630n1412n0420J0062l4440o5657K5377M2396J19007
$$ y = [3509902, 3369733, 3229929, 3135643, 2992712, 2816041, 2728886, 2667190, 2578972, 2483303, 2326208, 2245293, 2286733, 2324313, 2369769, 2402182, 2349426, 2411205, 2455057, 2465095, 2519895, 2624488, 2696200, 2758997, 2764399, 2655889, 2698985, 2736026, 2750115, 2919492, 3022829, 3205258, 3592938, 3954040, 4222785, 4559555, 4662544, 4406496, 3998182, 3427436, 2922955, 2573898, 2372002, 2210233, 1953428, 1855155, 1892910, 1742622, 1529992, 1398336, 1382584, 1437024, 1400403, 1304330, 1221014, 1345503, 1288876, 1174486, 1177208, 1176181, 1141094, 1123901, 1085157, 1052703, 930486, 990719, 952807, 983713, 979526, 993863, 1103285, 1160304, 1244316, 1198879, 1056313, 990066, 975436, 924024, 873604, 883666, 849226, 783569, 808946, 851342, 970349]
16966I70349J25728j8399j05295q3504J1592o4510j02902K9337m7113k9428M5771
16955G31626j14569p1207m5948l5635O2524P7449N9876k1576m5007o638J01977
16944F92872M9851p7444r1108j1625P0741j07909J8505J54273K9971r7592K9640
16933F60175l1285p2150k8561L7295k548j7344L8127o4353m6038n6824P7717O0921
16921E55132q696M7529l2651j09177J9904Q43j58637o5193J22863j4151l9456
16910C18310j0668L319J7314k2822R381J9691r689P3225j1577l5095n174P9180
16898D25395o5211l7767j5932j4941n0856j6902J2178J0934J13495j5120q0052
16887B65221J19549k0589j3673r0075J3622O3700r498K2185r3686J7512N1906
$$ y = [970349, 1096077, 1077678, 972383, 888879, 900471, 835961, 733059, 762396, 715283, 685855, 731626, 617057, 545850, 499902, 464267, 526791, 604240, 664116, 642540, 597533, 590895, 692872, 742723, 665279, 574171, 562546, 633287, 525378, 543883, 698156, 728127, 630535, 660175, 628890, 556740, 528179, 565474, 562926, 545582, 583709, 519356, 473318, 416494, 494211, 555132, 546436, 593965, 561314, 452137, 472041, 472884, 314247, 249054, 371917, 357766, 318310, 307642, 310961, 328275, 305453, 314834, 334525, 324836, 398061, 386484, 351389, 346215, 425395, 360184, 322417, 306485, 291544, 240688, 223786, 235964, 246898, 360393, 345273, 265221, 384770, 364181, 350508, 260433, 274055, 337755, 328257, 350442, 256756, 274268, 326174]
16876C26174n13J2641p0453k2054o1129k6160J29740j04293l4162N2911k1685
16865A81017k4947o8152M2981R4873R2551r467N153K6208Q696J4985q737j1488
16853C43673j0149P500j0169L608O049M5922m090p259Q5873M5866m9520o1155
16841C96149K7386O0069r5000l9415N001p251j0361N2710K6689j37520M774Q4354
16829C67585K6111J6689o7487p0307k7191K4483Q8485l0900o4068l7165J5911
16818B42146L5153N8580M0063p562j2562l8527Q379K6929q8384k4219l0708q9532
16806A19756K9696N9416Q4114N5509j1127p248o7402K3875j01855r1935K8550
16795A21349J5047K0137J7812K790N6452J00274K8941m2360r0525k5202K2001
$$ y = [326174, 325661, 338302, 267849, 245795, 184666, 158506, 288246, 183953, 149791, 202702, 181017, 156070, 87918, 130899, 225772, 318323, 308856, 314009, 340217, 348913, 363898, 355161, 343673, 333524, 341024, 330855, 334463, 340512, 386434, 382344, 375085, 460958, 506824, 457304, 396149, 423535, 483604, 388604, 349189, 354190, 346939, 336578, 389288, 415977, 278457, 283231, 367585, 393696, 410385, 342898, 272591, 245400, 269883, 358368, 327468, 263400, 226235, 242146, 277299, 335879, 375942, 368380, 355818, 317291, 325670, 352599, 264215, 239996, 209288, 119756, 149452, 208868, 292982, 348491, 337364, 330116, 262714, 286589, 184734, 92799, 121349, 136396, 156533, 174345, 177135, 233587, 333861, 362802, 320442, 229917, 204715, 226716]
16784B26716K1019K7288O0754Q8307K7336j8755p4993l0955L4408K1226l2470
16773C49881n5135l2665Q5150O1218n6425m6596k6392m164L2417p1740n5718L5636
16761B15467R8699l9155N0454J6093o4745j15244L2849P1418P3096J7786r6029
16750B60689p7298l2707R275R360Q933n6102L9195n684L3884L3985m9205J968
16738A76293J1634K5939K7341L3143k0518p7416J0271M0927m2460l2701L1879
16727A84332n4750L5987Q663M7422K9127j2371r191n390k1106q8346o9369L5412
16715H0420L0800J01187N6840o995J9072J4993l9022r7193p9994K9474Q9699K3062
16703B22343l9505j3078M6474m98q5242o0251j08667p4476J36340J21251K1641
$$ y = [226716, 247735, 275023, 335777, 424084, 451420, 432665, 357672, 326717, 361125, 382351, 349881, 294746, 262081, 347231, 408449, 352024, 305428, 279036, 274872, 307289, 235549, 179831, 215467, 314166, 275011, 325465, 341558, 276813, 161569, 194418, 265836, 338932, 356718, 260689, 183391, 150684, 159959, 169319, 178252, 122150, 161345, 155661, 189545, 223530, 174325, 176293, 187927, 213866, 241207, 274350, 253832, 176416, 186687, 227614, 185154, 152453, 184332, 129582, 165569, 174232, 221654, 250781, 238410, 229219, 223829, 202723, 114377, 45008, 80420, 111220, 212407, 269247, 262252, 281324, 296317, 257295, 160102, 80108, 109582, 199281, 222343, 182838, 169760, 216234, 215736, 130494, 70243, -38424, -112900, 23440, 144691, 166332]
16692A66332R9741J59727r8238o1926P5549J1475j16352q9226o0287P2048J2524
16681A71367j9132Q7199K9019J9500J6503j39294j13083Q7685J90899l3480o2378
16670B34805K5388L1966j124J0788M6083J8368J6534J02375K29061K36444R1313
16659A042001K6462n3179j8253m7684L5574m5477r0706j8865o3679l1853m6391
16648F87950p9229Q9536J09755J42566J7863r9943l8063n5137k05341j24977M2210
16637D87190p8561r800J4402p7557n099m1840Q292R8337M3952m4012P4899j8843
16625D51360j2653j478j58364l6779O2325k7630L2220Q8204O1088J2379l7806
16614D32866R7732K23508N8022J09612k139m3462Q5744m057L2934L8132j4350
$$ y = [166332, 266073, 425800, 327562, 265636, 341185, 352660, 236308, 147082, 86795, 158843, 171367, 152235, 239434, 268453, 287953, 304456, 165162, 52079, 139764, 330663, 297183, 234805, 260193, 292159, 291035, 301823, 347906, 366274, 382808, 485183, 714244, 950688, 1042001, 1068463, 1015284, 997031, 949347, 984921, 939444, 848738, 829873, 766194, 734341, 687950, 608721, 698257, 808012, 950578, 968441, 868498, 830435, 775298, 569957, 444980, 487190, 408629, 398829, 413231, 335674, 330575, 288735, 297027, 395364, 439316, 395304, 470203, 451360, 438707, 437229, 278865, 242086, 304411, 276781, 309001, 397205, 458293, 470672, 432866, 530598, 754106, 812128, 921740, 919601, 876139, 961883, 957826, 990760, 1028892, 1014542]
16603A014542j86599j99211j79522r5023N0683K6704j01770j15145l3792k119
16593A78748Q3377J95431J86881J07059O942N506j2241j47573j59148j35607m0236
16582B69139m9156L9375K3628m3720r4173k6868L6277O0239M2020M9227M1778
16571C47766j06397o2317o5975l7849k9421N5623k4999O8052P579n4774j1068
16560H6220n3178R1152J23883N5822J4943K9841r9591L3673n2175j02597m6346
16549H1647o8771R7232K6355j9989R6301L064l2011J4229j3812n6067m0675j5693
16537G1810N0604j3413p582O1470l5018P999M211o0075O1989L4813o7388l6340
16525G3080J5346j2086j4317Q844J6638R231K8112l2290j01841r6350N666L806
$$ y = [1014542, 827943, 628732, 449210, 354187, 404870, 431574, 329804, 214659, 180867, 178748, 262125, 457556, 644437, 751496, 758438, 763944, 751703, 604130, 444982, 309375, 269139, 219983, 259358, 282986, 239266, 145093, 118225, 154502, 214741, 256761, 305988, 347766, 241369, 179052, 113077, 75228, 45807, 101430, 76431, 144483, 152062, 97288, 86220, 33042, 124194, 248077, 303899, 318842, 348683, 249092, 282765, 230590, 127993, 81647, 12876, 110108, 136463, 116474, 212775, 215839, 183828, 198057, 184245, 128178, 87503, 71810, 122414, 109001, 101419, 162889, 127871, 135870, 140081, 80006, 141995, 176808, 109420, 73080, 88426, 76340, 62023, 70867, 87505, 96736, 124848, 92558, -9283, -105633, -99967, -96161]
16513i6161L4027O7322R7325O8201J2983O5833J6497j07600r7466l0990Q4141
16502A14112j5201l1113P5454M5938q164o6616m7365J4185O389j7738l1756R2026
16490A30151J5316K3377K6260N8387L7156p3490k064J2632o2031k525o2101o8206
16478C2862j29619r9806L1011J44839J18905m4895q6695j4614n554k398L7850
16467a8114O6106q782K3243J18181K154j5513k5830l6413k6544M3683J822K43
16455A24236n669Q1373N8970j54817j39394P0235J3118O0341j7326o1390o2840
16444c3163M1325J260o571l6882O281Q4135M8584K5125m5795j01560n5488Q7126
16432A4377O1349N7762j1681M3517P978r8607n6579L6118J02140P2488K0891p0912
$$ y = [-96161, -62134, 5188, 102513, 170714, 183697, 249530, 266027, 158427, 60961, 29971, 114112, 98911, 67798, 143252, 189190, 181026, 114410, 67045, 81230, 87619, 69881, 38125, 130151, 145467, 168844, 195104, 253491, 290647, 217157, 215093, 227725, 165694, 163169, 101068, 32862, -96757, -196563, -165552, -20713, 98192, 53297, -33398, -48012, -53566, -55964, -18114, 47992, 39210, 62453, 180634, 182788, 167275, 141445, 105032, 78488, 122171, 123993, 124236, 118567, 199940, 258910, 104093, -35301, 34934, 48052, 108393, 91067, 29677, -33163, 8162, 9422, 2851, -34031, -27750, 56385, 104969, 130094, 84299, -17261, -72749, 14377, 75726, 133488, 121807, 165324, 173302, 74695, 18116, 54234, 156374, 228862, 249753, 178841]
16420A78841m5119r777K0965j6410j9121k544q1293L084q4800N1025J8202p6398
16408f3345n5856L2320J39939K7018J33697J4081r6677j3461m5117R109J02051
16397A83759P4162m8954r7806k4431o3371j22398J3576P937m2468j000Q3341Q901
16385b8752P9135O1091n9695p9378n6131J00268O6603k2360J0101l5070j3262
16374B2550L6797K4433J1936k0567L320n4737k765J4753l1012l8394J0236q8919
16362a12369K8217N1662M733j0367N0627M995r522K6615K1610Q5876N0202m1228
16350A51051j04970P3559o7596p5484o8718J91J99946j6357J8633k7774o3855
16339A8626k2840J5936P8324R2403Q3826r038p555P2318p7491n4006l1086n8080
$$ y = [178841, 133722, 123945, 144910, 128500, 109379, 106835, 25542, 28626, -56174, -5149, 13053, -63345, -119201, -86881, 53058, 80076, 213773, 227854, 131177, 117716, 72599, 81708, 183759, 257921, 208967, 111161, 86730, 23359, -99039, -85463, -77526, -119994, -120994, -37653, -28752, 50383, 111474, 51779, -27599, -83730, 16538, 83141, 60781, 70882, 35812, 22550, 59347, 83780, 95716, 75149, 78469, 23732, 20967, 35720, 4708, -33686, -23450, -112369, -84152, -32490, -27757, -38124, 12503, 17498, 7976, 34591, 56201, 142077, 192279, 151051, 46081, 119640, 52044, -23440, -92158, -91967, 107979, 91622, 110255, 82481, 18626, -4214, 11722, 90046, 182449, 266275, 257237, 249682, 322000, 244509, 190503, 159417, 101337]
16327A01337j33390M980o3808j9813K7099R6344j3906q9919p907M7125M7291p2616
16315g7183l3001m8982M8634N6679M9196j9154k4688N392Q3619j5866J2752J19863
16303A57261m33j0520j1517O1002L9541p8199K8754p595k7583o0590l9494K1873
16291G2500L8734J878q6150j07705p4697J3018k9804k4065R952Q7341J13203M4650
16279E8855j23923o2769Q0515Q0798R2019M3208m8411L4076r8100r8975p1161
16268a13868O4578J07489q8655j31977l9510O6073K2907M2779J6730N0136J09371
16257A06053J5787j21156l8094J14513P4328j4345q4373Q128J7730R1984j1217
16246A59338m6618n4875l9832n5810M3977J48010K8868J1120k7789J1935j09280
$$ y = [101337, -32053, -27073, -90881, -110694, -83595, 12749, -1157, -91076, -98983, -51858, -4567, -77183, -110184, -159166, -110532, -53853, -4657, -23811, -48499, -43107, 40512, 24646, 37398, 157261, 156828, 146308, 134791, 195793, 235334, 157135, 185889, 178294, 150711, 90121, 50627, 72500, 111234, 113112, 26962, -80743, -155440, -142422, -172226, -196291, -186339, -98998, 14205, 58855, -65068, -127837, -47322, 33476, 125495, 168703, 120292, 154368, 56268, -42707, -113868, -49290, 58199, -30456, -162433, -201943, -135870, -112963, -70184, -53454, -3318, 106053, 121840, 684, -37410, 77103, 151431, 137086, 52713, 60841, 78571, 170555, 159338, 112720, 57845, 18013, -37797, 6180, 154190, 183058, 194178, 166389, 178324, 69044]
16235F9044o8851O201k8814Q8035J39726k1950p5129P4848m984m7442R1751J4403
16223B36838o8287l0877M7513j13536N8331L9703p598j9648k9156l2197L7654
16212A18740o620j2405q2409Q1212M6887o7401K5545L4754p2435J5097l6785L9588
16200H3768q871j27464n4678M1355K05843J53477o0397p0451n9981j17022r3265
16189a07686J10910J29121J05630m5780n8266m3820q2321n8480p8691n8928l0418
16178b18729O8368R5207N2854m057o1853l2526o7692M1355N7162P6291P0597k1702
16166E5275j10440l2682P9197K0984O0672O8740l3767j41975j5552p92k8930K201
16154g7069K3278P1634m3086O6339R1651n754n0812j5578J5128Q3208K8710l1202
$$ y = [69044, 193, 6394, -22420, 65615, 205341, 183391, 108262, 183110, 178126, 130684, 222435, 236838, 168551, 137674, 185187, 71651, 129982, 169685, 162087, 142439, 113283, 81086, 118740, 112120, 99715, 17306, 98518, 145405, 78004, 103549, 138303, 65868, 80965, 44180, 83768, 74897, -52567, -107245, -65890, 139953, 293430, 233033, 162582, 102601, -14421, -107686, 3224, 132345, 237975, 192195, 133929, 90109, 7788, -50692, -129383, -188311, -218729, -150361, -55154, -2300, -6357, -68210, -100736, -168428, -127073, -69911, 6380, 76977, 55275, -55165, -87847, -8650, 12334, 73006, 141746, 107979, -33996, -49548, -50340, -79270, -77069, -53791, 17843, -25243, 41096, 132747, 126993, 76181, 60603, 75731, 158939, 187649, 156447]
16142A56447K2341r680l4472k5517J7318o674n432K3148P8635R361k4971j02751
16130I7753k4804O4013p6322j39698M9691L8768M4417L9531J0539p5326m2621
16119a4059j0814J34211Q8573L729j66720j9203J04124M7627m5216j76654m3928
16108i8330O3298J9024J8949K1964R7266M6709J2977l2074j23254m7863k7645
16097d8979P9837j1948j8406l0497R0064L0732m9888k4551k4022M4452J3344l5700
16085A4438m4102j5665O2664L9369o0324K2199J602n207M436K0455k9755k3184
16073a3074M3363N0970k6512o4233J3124L8584O2817q260P1914k6207k4267q467
16061A09752o632L8569J6768p0329r0029n5403N3404K8828k1580M4351k9243o0849
$$ y = [156447, 178788, 169108, 134636, 109119, 126437, 119763, 114331, 137479, 216114, 225475, 200504, 97753, 72949, 136962, 60640, -79058, -29367, 9401, 53818, 93349, 103888, 28562, -14059, -24873, 109338, 197911, 201640, 34920, 15717, 119841, 167468, 122252, -54402, -98330, -35032, -16008, 2941, 24905, 122171, 168880, 181857, 149783, 26529, -21334, -48979, 30858, 18910, 504, -29993, 60071, 90803, 40915, 16364, -7658, 36794, 50138, 14438, -29664, -45329, 17335, 56704, -3620, 18579, 20181, 14974, 19410, 39865, 10110, -13074, 30289, 81259, 54747, -9486, 3638, 42222, 105039, 96779, 168693, 142486, 118219, 109752, 103120, 141689, 158457, 88128, -1901, -57304, -3900, 24928, 3348, 47699, 18456, -42393]
16049d2393L5196M5635O7297k8792j23297o3308M2117N1973N6032J49436p049
16038A82847n3168q3698l8855l260P5710K8783o2278n1363J11626L3478l720r2729
16026D3373p1883j0336N5757K0709L8479P1217r5130k9313P9729m9187j05458
16015e2043J8327M1339L7752r0580j1798P5194j6859P719L8851L3812N1746M9396
16003A82856m0347J4342P9062j9918j01447M166q5018k2014P7781k0909l5106
15992C3448L6770j64225j08319R2219J26379L7353N5630j09202k7569L4253M992
15981A1729J00338k5019j04901m6532P001p1509j8998N8474K7006m6384R0852
15970a7943L6497r876J4337K1140j6861J9110Q9281n3400j13879O0365M0464J71
$$ y = [-42393, -7197, 38438, 105735, 76943, -46354, -109662, -67545, -15572, 40460, 189896, 182847, 129679, 45981, 7126, 3866, 79576, 108359, 46081, -5282, 106344, 139822, 136102, 43373, -28510, -38846, 16911, 37620, 76099, 147316, 52186, 22873, 102602, 53415, -52043, -33716, 7623, 45375, -45205, -57003, 18191, 1332, 9051, 47902, 81714, 133460, 182856, 142509, 156851, 235913, 215995, 114548, 118714, 33696, 11682, 89463, 68554, 33448, 70218, -94007, -202326, -110107, 16272, 53625, 109255, 53, -27516, 6737, 11729, 112067, 87048, -17853, -64385, -57384, -128893, -147891, -89417, -62411, -108795, -17943, 18554, 8678, 23015, 44155, 27294, 46404, 135685, 82285, -31594, 28771, 69235, 69406]
15958F9406j0577M4122J676r2793M2809N1060l312o5467r560l0388J6323m2725
15946b9426L5948J0804l3196j3770K9048M4200j7179J2120K8748J2688M1013M0817
15934A61815J208k7319p5566j2419O6902R8467l8806k6529M0804Q5094o7727j22400
15922H3524L1072J1985j34048L4443K1107J0886Q1099m3228o2120j25910L1835
15911e9355J05953k0334J8705J4710n6444K5490P638k006k998K9606J0754p8302
15899f583k0691Q3905l3205o5437N8098J27403o4359k8587j8314l5046P1383L7399
15887A05966j84638o7482l3439K0803N6182J9373J9494O5897Q3063l8249j02154
15876e5184p0211K7382J41410L5618K5301K0879o0454J2945n956K8810J3525j8688
$$ y = [69406, 58829, 102951, 104627, 11834, 54643, 105703, 102391, 36924, 27364, -3024, 13299, -29426, 6522, 17326, -15870, -29640, -592, 43608, 26429, 38549, 67297, 79985, 120998, 161815, 163023, 135704, 60138, 47719, 114621, 213088, 174282, 147753, 188557, 273651, 205924, 83524, 114596, 126581, -7467, 26976, 48083, 58969, 140068, 96840, 34720, -91190, -59355, 46598, 26264, 44969, 59679, 3235, 28725, 36363, 34357, 31359, 60965, 71719, -6583, -27274, 56631, 23426, -42011, 16087, 143490, 79131, 50544, 32230, -2816, 68567, 105966, -78672, -146154, -179593, -158790, -102608, -83235, -63741, 2156, 85219, 46970, -55184, -125395, -98013, 43397, 79015, 104316, 125195, 64741, 77686, 71730, 100540, 114065, 95377]
15864I5377k1881K3090O2408l0507q9171k5196L2292K4636J502j0955M1478K4671
15852A27744N2538K3473o1942l2083q72K3376O88o8273p0360k4219P7604L9338
15840H7012n167o2546J545N2375l708J6471m7422l3836N373l283Q4696N5235m1339
15827A05406j02268o2636J30895O3777k9040K2344M3917k7402j25875o6623k8858
15816g6363O8574Q1635L8172j2031J5194O3269j3229o611k8603L9298L901o4782
15804A08424r1910q0409j3608J13432L6023K4971N2769n3444o8966o8649j0614
15793e1981j9534Q1358Q0857K4758N4800n3863j84841M0640Q3852K7476n2078
15782C1444K8133O7287Q63M0127p015Q02m2308J0116J7974m523M9024r747n4606
$$ y = [95377, 73496, 96586, 158994, 128487, 39316, 14120, 46412, 71048, 72550, 61595, 103073, 127744, 180282, 203755, 141813, 109730, 108858, 132234, 132922, 64649, -5711, -29930, 47674, 87012, 81845, 19299, 20844, 73219, 69511, 85982, 38560, 4724, 10097, 6814, 91510, 146745, 105406, 3138, -59498, 71397, 135174, 106134, 128478, 172395, 144993, 19118, -47505, -76363, -7789, 73846, 112018, 99987, 115181, 178450, 165221, 158610, 130007, 169305, 173206, 108424, 16514, -63895, -77503, 35929, 71952, 96923, 149692, 96248, 27282, -41367, -51981, -71515, 9843, 90700, 115458, 170258, 116395, -68446, -27806, 56046, 83522, 31444, 59577, 126864, 127727, 167854, 160839, 161641, 119333, 129449, 147423, 142900, 191924, 182177, 127571]
15769A27571o5904L6667M575J7L970O5130O1939l0588n6240r9804q2280k8561
15757f3508l8393P2337J27660l0860p6867l4765q003N7370L2118q7541K5958P1354
15745D6860Q7717m169N1815j0361j0815R3238m7002j33513l459P4413p5856n177
15733F3691m9934r15l5062j7185M5798K2694l0162k6272N7598M4240r599o12m644
15720E9636l0852Q938M095j19469q2108O5845P9138L8319P2484K4666r4046j26685
15708a00039N638J15282m4167N4972Q6305M5306q44p5543p5759O0919O3369l6919
15696I8520r3408J5950M3324k5584k5872J0428l4577m0359l4253N0525m6068K707
15684g8667o8342k2199M8728J445M5191M2136o942L8596k0251j0739P7985J800
$$ y = [127571, 61667, 98334, 102909, 102926, 106896, 172026, 233965, 203377, 147137, 47333, -34947, -63508, -101901, -29564, 98096, 67236, -9631, -44396, -52399, 4971, 37089, -50452, -24494, 46860, 134577, 130408, 182223, 171862, 161047, 254285, 207283, 73770, 70311, 144724, 68868, 63691, 13757, 12842, -22220, -39405, 6393, 29087, -1075, -27347, 30251, 74491, 64892, 64280, 59636, 28784, 37722, 41817, -77652, -159760, -93915, -14777, 23542, 96026, 120692, 26646, -100039, -94401, 20881, -23286, 31686, 117991, 163297, 162453, 86910, 11151, 72070, 135439, 98520, 5112, 21062, 64386, 38802, 12930, 23358, -11219, -51578, -85831, -35306, -81374, -78667, -147009, -169208, -120480, -119035, -73844, -31708, -38650, -54, -20305, -31044, 46941, 48741]
15672D8741o8857n2780Q9142m6024r1118l5451n3485J03767M6976j300l8566O4131
15660c4824J01926l1764m7852j6364p8238J02669k7981j07042M233O2087O4481
15649h669J9308r919k5613q8422p896R1443O0146l5329r3235J60J6800J04864
15637B3638o830J9817J547j3644n3635k7784l4766k2549k9677r327k1652N8294
15625a16568M4615l8439o7642L1423K1000J1461m2038k0847O4858J26628O4881
15614G9332j12443m0998O0696o1090j2704j9339N947K2708M9646j0641k9174J1484
15602e6576O9510M0168J21377l5228q1674P1690N7369M720n3970r2397l4425K4412
15590C4976Q973K7480m4894P6061L6688O7171N8726n14k01268l0452n724K8086
$$ y = [48741, -20116, -72896, 16246, -29778, -120896, -156347, -209832, -106065, -59089, -60389, -98955, -34824, 67102, 35338, -12514, -28878, -107116, -4447, -32428, -139470, -135237, -73150, -8669, 10639, 720, -24893, -113315, -121211, -29768, 30378, -4951, -98186, -98026, -81226, 23638, 16808, 36625, 38172, 24528, -29107, -56891, -91657, -114206, -143883, -153210, -174862, -116568, -71953, -110392, -178034, -146611, -125611, -114150, -156188, -177035, -112177, 14451, 79332, -33111, -74109, -13413, -74503, -87207, -106546, -100599, -77891, -28245, -38886, -68060, -56576, 12934, 53102, 174479, 139251, 57577, 129267, 186636, 191356, 137386, 44989, 10564, 34976, 43949, 71429, 26535, 102596, 139284, 206455, 265181, 264667, 63399, 32947, 27223, 55309]
15578E5309q118q583n7983l8104O3046J33367J9243m5112n7055j6859P9245k0433
15566I7963j59270J1278j8228R0529M5710p360Q727N9078r1641m6682J9044N964
15554A5112m4598J6236n877o5091L8011N3754N0931l7155m0800j6184K3638Q0172
15542F8149P0854j66364m4977n5882k3324M6553O2780L7582k2948N7511l1192
15531a258L3363q266j5425N8177J277k8679m149J7870k0643p1586K9502k4908
15519c4725m0975J852J02906N3498L6131L929J7702j15791m5856j2700k467M0640
15507D144m21m0855o146J8095P698Q2293q5107j10210j6561R5594R7212m2709
15495C027O474M2273p580m9271p7533J6702R3892O618R2364j6332j72533m3887
$$ y = [55309, 47191, 38608, -19375, -57479, 5567, 138934, 158177, 113065, 56010, 39151, 118396, 97963, -61307, -50029, -68257, 22272, 67982, 60622, 69349, 128427, 36786, -9896, 9148, 15112, -29486, -13250, -19127, -84218, -46207, 7547, 58478, 21323, -19477, -35661, -12023, 68149, 139003, -27361, -72338, -128220, -151544, -104991, -42211, -4629, -27577, 29934, -1258, 32105, 23839, 8414, 66591, 67868, 39189, 35040, 52910, 32267, -39319, -9817, -34725, -75700, -73848, 29058, 82556, 118687, 122616, 140318, 24527, -21329, -34029, -36496, 4144, 3723, -37132, -43278, -25183, -17485, 64808, -20299, -130509, -147070, -51476, 45736, 3027, 9501, 51774, 44194, -5077, -82610, -65908, 27984, 34602, 126966, 110634, -61899, -105786]
15483a05786O6379J03897P5428l8857L6350M7147j55481q3591O969P9286J22615
15472A54356K6141N6484m3584q1540j77778n243M2592J0530j750p2746L077R9663
15460A0202o5098n5740P3254M6185M025j23981J9977J20780N1534M17k9742k5326
15448B6487n1864L4361P203j05327m534L4160m49K5360j0401K0276N1598J9602
15436D6472j01573r9341P7969J14716O3489l2619J9160O954l1574o9594L5451
15425B9510O6703J430q7939m5428o9837o8581M5572l6729k9390R2277L0686o4811
15413a36537J1855o7501R4563J10079J2677q1804j77381p3070M5562N2949N5105
15402a53503Q8125J12784L7047J1466o4116J5056p3216n8159L5120N6467p7882
$$ y = [-105786, -39407, 64490, 139918, 101061, 137411, 184558, 29077, -54514, -47545, 31741, 154356, 180497, 236981, 193397, 111857, -65921, -71164, -28572, -18042, -19792, -92538, -89461, 10202, -54896, -110636, -37382, 8803, 12828, -111153, -91176, 29604, 81138, 81555, 51813, 26487, -25377, 8984, 16187, -89140, -93674, -59514, -59963, -34603, -45004, -24728, 26870, 46472, -55101, -154442, -76473, 38243, 101732, 69113, 88273, 95227, 63653, -5941, 29510, 96213, 97643, 9704, -35724, -105561, -174142, -128570, -165299, -194689, -102412, -71726, -136537, -124682, -192183, -97620, 12459, 25136, -56668, -234049, -307119, -261557, -208608, -153503, -65378, 47406, 84453, 95919, 31803, 46859, -26357, -84516, -49396, 7071, -70811]
15391g0811R658N7806l1438k8027k3856j3416L3533J1853N4393o50k6348k1090
15379d8393r3228O9259P5741J33016Q9832j7457L7165k3776j55620j09725m3701
15368h6887M1057L0725q149j2028l1415n6844p2363O6975N4166l1112q236O5639
15356d8472P3807R7631r1086j75841o1333J01241P7664Q982l8432L9183O9991
15345E3335R569n1432r139r952k3380l7265m6754J33235O2884M2237l0793k8992
15333F3553q7989N126O5932Q270o2266p6618N507J55798n310k6035J279J0641
15321E7888l3016m2493j5400o2075J2128O4953j857p7306j3406Q779J32281N7572
15309H8048M803L5962n4295j0358m8210o8234j2048J06526O57j0817p412p8235
$$ y = [-70811, -61153, -3347, -34785, -62812, -86668, -100084, -66551, -54698, -305, -955, -27303, -48393, -141621, -72362, 3379, 136395, 226227, 208770, 245935, 222159, 66539, -43186, -86887, -45830, -15105, -23254, -35282, -66697, -123541, -195904, -128929, -74763, -105875, -114111, -48472, 25335, 122966, 31880, -143961, -205294, -104053, -26389, -17407, -55839, -16656, 53335, 62904, 11472, 2333, -7619, -30999, -68264, -115018, 18217, 81101, 123338, 92545, 63553, -24436, -19310, 46622, 54892, -7374, -83992, -78485, 77313, 72003, 45968, 47247, 57888, 24872, -17621, -33021, -95096, -82968, -18015, -19872, -97178, -110584, -101805, 30476, 88048, 92851, 128813, 74518, 64160, 15950, -52284, -64332, 42194, 42851, 32034, 24622, -53613]
15297e3613J1261o873R674p9606p7689J0614J62960J17905Q2501m3991q0312L0063
15285H2894p3268o8024N1855L3270O7716p788q1046j7746N4393l2007m3667q9407
15273a22825l1133J17906Q7769l9976o412l4594M3604j7822j17182k884J12872
15262a0677N4647q4275o6181M0825K05732M4544j27128Q198K8320j946N463j821
15250I5701K5702r0750m2635O8693K3877k0999R8574Q1990p1014j71464l5234
15239c7559K8875P86k9738n525k1032K3233P5387N6514k2524o3201L40O7717K4473
15226I7746m5040j5623N7868p280o488J3487J1938j1768K3773l3058K3163N4440
15214A63158n7969r2247L1785M3711o7825j23140k0343J3575L6582P5411m7707
$$ y = [-53613, -42352, -49225, -39551, -119157, -196846, -186232, -23272, 94633, 177134, 133143, 52831, 82894, 9626, -58398, -6543, 26727, 94443, 86655, 5609, -12137, 42256, 10249, -33418, -122825, -153958, -36052, 51717, 11741, 5329, -29265, 14339, -3483, -120665, -123549, -10677, 43970, -40305, -106486, -65661, 140071, 184615, 57487, 65685, 94005, 92059, 97522, 95701, 121403, 30653, -11982, 56711, 80588, 59589, 158163, 240153, 169139, -2325, -37559, -8684, -7898, -37636, -43161, -64193, -40960, 34427, 90941, 68417, 5216, 5556, 73273, 97746, 52706, 37083, 94951, 87671, 81183, 94670, 106608, 94840, 118613, 85555, 108718, 163158, 105189, 12942, 44727, 88438, 20613, -102527, -122870, -109295, -72713, 2698, -45009]
15203d5009l1620l7008M3450L4035J4137Q5719j7575m7268j695o8323k5468J54497
15191E7872j53244q9645J10914P6090O7839o6972J0184l8599q763m1831K2840
15180e3315R8205J22820j6087q8109J2378m5419J1701P4349l7327q3659p4362
15169g8825K7736p799l4971J37780J3075j41641M2741L1376l2907K8683n5538
15158g0290j4158J7428M5746l9268m2873K7895j4929Q965n2433M8907Q5236M4073
15146D4299J5646M4061N1083o9040n3830L46J9009o1803m4763J8001j6926P35
15134e3182j3420j705L4902j0338l396N3848L3930p8759o2659o3016M9092J35212
15122B0509J3817n0798m3459N9037r289q4805n3498J9203R4660k8512n0950M332
$$ y = [-45009, -76629, -113637, -70187, -36152, -22015, 63704, 46129, -1139, -2834, -71157, -96625, 57872, -95372, -185017, -74103, 1987, 69826, 2854, 13038, -25561, -34324, -76155, -53315, 44890, 167710, 151623, 63514, 75892, 30473, 42174, 116523, 79196, -4463, -78825, -51089, -58888, -93859, 43921, 56996, -84645, -41904, -10528, -43435, -14752, -70290, -84448, -67020, -21274, -60542, -103415, -75520, -90449, -81484, -133917, -85010, 226, 44299, 59945, 104006, 155089, 86049, 32219, 32565, 51574, -10229, -54992, -36991, -53917, -53182, -66602, -68307, -33405, -43743, -47139, 6709, 40639, -38120, -100779, -163795, -114703, 20509, 34326, -16472, -59931, -894, -10183, -94988, -148486, -129283, -34623, -63135, -114085, -109753]
15110a09753M2994R543n15K0088J2252l60k3260k3525P5620P7092R863K2423l8045
15097G4417l8498j2123K2926o801J35995J8707q5378m396M4425J18324p2280j40597
15085E4721m845m7646R244k7127L7260R4465l9902n7895p8294M204P6944N5699
15073G6828M3675n8466L2153l6768m5043r1179j4838l9502l6391j2915J35509
15062d6937J44821p5582k3867M5961r760L0376k9538j7604o60O5081o1338r0959
15050g0006k511Q4739J6829N2841k5807l0592r6241m7914K013Q976O0157j0260
15038e7776K8101o8813m6920P2203O3440k5100O0875r973q1879J7446o0291l6108
15026a44795O4404o0812O3851N4736M933l3579R376l599J29909R1307j02864r4934
$$ y = [-109753, -66759, -57216, -57731, -37643, -25391, -25751, -49011, -72536, 3084, 80176, 90039, 112462, 74417, 35919, 23796, 46722, 39921, 175916, 194623, 109245, 104849, 149274, 267598, 195318, 54721, 49876, 2230, 11474, -15653, 21607, 116072, 76170, 18275, -60019, -55815, 21129, 76828, 120503, 62037, 94190, 57422, 12379, -78800, -93638, -133140, -169531, -182446, -46937, 97884, 22302, -1565, 44396, 34636, 65012, 35474, 17870, 17210, 82291, 20953, -70006, -72517, 12222, 29051, 81892, 56085, 25493, -70748, -118662, -116649, -107673, -47516, -57776, -29675, -98488, -145408, -73205, -9765, -34865, 26010, 16037, -65842, -48396, -108687, -144795, -80391, -141203, -77352, -22616, -17683, -51262, -41886, -45485, 84424, 175731, 72867, -22067]
15014b2067J0460J6556k4339K8156q4946J4706M0268l880n8033k3648J12975O1560
15002F7768m8545M3843J1069l3771k2536J254j03873m1070J5448O4427r2594n7588
14990a96168N4153L5087J8720J08849J3028p7440O3515R53o4837n355m1599M5360
14978d5734k4660M8728N0777m6042K63o4957L2995P7846l4932N0171K4840j1412
14966E7883k8334j21r9492j8000o0308l4922J9274L9456J4067K9515K6592M1319
14954a3071M8286k9311j16194O0045Q7351K8076L8456l0791M449j7167N43n478
14942E5194n3711K6871n439o9083r1046m9709P706O8225j6651o0533M8333R0361
14930d9482O6686K7534q1798m1798L58P251J9690j05687j4834L8037L1455N7717
$$ y = [-22067, -11607, 4949, -19390, 8766, -76180, -61474, -21206, -25086, -83119, -106767, 6208, 67768, 19223, 63066, 74135, 40364, 17828, 19082, -84791, -125861, -110413, -45986, -138580, -196168, -142015, -106928, -88208, 20641, 33669, -43771, 19744, 20697, -44140, -49495, -91094, -45734, -70394, -21666, 29111, -16931, -16668, -81625, -48630, 29216, -5716, 44455, 69295, 57883, 29549, 29428, -70064, -88064, -148372, -183294, -164020, -124564, -110497, -80982, -54390, -13071, 35215, 5904, -110290, -50245, 37106, 65182, 103638, 72847, 77296, 60129, 60672, 55194, 1483, 28354, 22915, -46168, -137214, -186923, -179217, -110992, -127643, -188176, -139843, -49482, 17204, 44738, -37060, -78858, -78500, -71249, -51559, -157246, -172080, -134043, -102588, -44871]
14918d4871Q3347L073J3419o2331K0316p8869j34716n6917R9760K71587p201r6198
14906A0399m9436N0985K6088j3257o1599j7417K0137k564m2199n1105J0473j5777
14894a35272K1007J5731r2593N2313J8071l9837J0238Q5234m957l1537J2293j48853
14882b38162n9953J13486J37487O1684M5291n0279k0233q9475J02453K9689q9354
14871e7366n3585M5698O4835Q4567M7263J1833j7643j19823q426L8688l18j1622
14859B4101O6r10J2018K2460k2753n3223O6412M0323o0571L8856J2860J6026M4784
14846A40449k3775K1633l6272j12940m4227M8717N2143k4928n5164N061N4606
14835B5303M6906K2883m6484r4297l1928O0286j3173k9803J02636j5733r3853
$$ y = [-44871, 38476, 41549, 54968, -7363, 12953, -65916, -200632, -257549, -157789, 113798, 106597, 10399, -39037, 11948, 38036, 24779, -36820, -54237, -34100, -36664, -78863, -129968, -119495, -135272, -114265, -98534, -191127, -138814, -120743, -160580, -150342, -65108, -70065, -101602, -89309, -238162, -298115, -184629, -47142, 14542, 59833, 9554, -10679, -100154, 2299, 31988, -57366, -110951, -65253, -418, 84149, 131412, 143245, 125602, 5779, -2647, 36041, 35723, 24101, 24167, 23257, 35275, 57735, 34982, -18241, 48171, 88494, 27923, 66779, 79639, 95665, 140449, 116674, 138307, 102035, -10905, -55132, -6415, 45728, 20800, -34364, -29303, 25303, 72209, 95092, 48608, -45689, -77617, -17331, -30504, -60307, 42329, 26596, -67257]
14824f7257P4274J38149n9089p1405p938j1908N1814K8030k343N7730k3458n8596
14812D8003k6147L0751j4184k385J04698N1429m0510j09352m2194n160n5531O1721
14800A139R2104J9460n7142k7M1682Q535j13912m6423R294K8325K6704N933K4706
14787D0378m5401o4938M76P8451K5256k3471J1535M590m9941J02597j4392l4425
14775C0715J8689L1034K9462L0168n1703q2213o6846L4418n3302K50p7L4409O8734
14762B3738k5628K2628M8968r1497o8225P2073M9458k0558l2365k8643M4841Q2017
14750G6807n8629o588M1561q9556j33955O0454Q4031O6793l9964K9292k8648J443
14738C041n8367q0327m5180M9374j9963n3719M4516L2753l9896L480M4416L1793
$$ y = [-67257, 7017, 145166, 86077, 14672, 6734, -5174, 46640, 74670, 72327, 130057, 106599, 48003, 21856, 52607, 38423, 36038, 140736, 192165, 151655, 42303, 109, -5051, -60582, 1139, 93243, 112703, 55561, 55534, 97216, 105751, -8161, -54584, -45290, -16965, 9739, 15672, 40378, -5023, -69961, -69485, 8966, 34222, 10751, 22286, 26876, -23065, 79532, 65140, 30715, 49404, 80438, 109900, 140068, 88365, 6152, -60694, -26276, -79578, -79328, -79405, -44996, 23738, -1890, 20738, 69706, -21791, -90016, -17943, 31515, 10957, -21408, -50051, -5210, 76807, 18178, 11590, 53151, -36405, -170360, -109906, -25875, 40918, 954, 30246, 1598, 3041, -55326, -135653, -180833, -131459, -151422, -205141, -160625, -127872, -167768, -164288, -119872, -88079]
14726h8079M2335L0025p7790j2030Q0289M9778j4727p2881n6885M1570M3820M4998
14714A0423k1270m2140K3369L8760k0102j07399r6443J11661N1798O3860K5194
14703C7711K5575q9872K9856l5241j4923L6255N2798n8827j9878K6740j784n9387
14691g0977q3359N2319J4577N6455m876m6448K0071k2108n0839O300L7357k6466
14679a17994k13P0724N5278l3348O3666M3056o0924Q265L4826l6423o7116K0762
14667a9441q8966j8455l5419k4495m0178M4125J13112J12177K2217k6393r8966
14656f0682J7772p0763l4119n4010N3559k6155m0273l423N5340J07246N6853l994
14644b649M0576l0150l499j7970p4551l882j1421K9403M272p0957m9275K3811
$$ y = [-88079, -45744, -15719, -93509, -105539, -25250, 24528, 9801, -63080, -119965, -78395, -34575, 10423, -10847, -52987, -29618, 9142, -10960, -118359, -214802, -103141, -51343, 12517, 37711, 63286, -26586, 3270, -31971, -46894, -10639, 42159, -16668, -36546, -9806, -11590, -70977, -154336, -102017, -87440, -30985, -35861, -82309, -62238, -84346, -135185, -128885, -91528, -117994, -118207, -47483, 7795, -25553, 38113, 81169, 20245, 28510, 63336, 26913, -40203, -19441, -108407, -126862, -162281, -186776, -226954, -182829, -69717, 42460, 64677, 38284, -60682, -42910, -113673, -147792, -201802, -148243, -174398, -214671, -218094, -162754, -55508, 1345, -2649, 37927, 7777, 4278, -13692, -88243, -92125, -103546, -74143, -69871, -140828, -190103, -166292]
14632a66292M1376N3487N8222p2336K6063K7079K751L5538m0542p6299k4363J22124
14620a3192M3488j69174n8246M7504N8378k02Q79K1016R0103q9329n0743j1459
14608a30977J8130J3886M0112K7403m9190K4878K5882K5046O2969J8668j9011
14597E7796r3850k0967L8180l7988r3262J9905P3905O4949n0997j08408M9656
14586a01081N9437J49492j7473j04147l5518m6881n8028q808J59411L2473j7291
14575A1586L0877L6727K465m0754o0476J7324J5869N7501N1969j4838j06940r9028
14563i7718q652P010o6844O2614J0023l380j4935J4624Q2774Q2530o001l8338
14551B3707O3817p0216r6460P058P9084k3491m2012K8384l984o102L6616n0901
$$ y = [-166292, -124916, -71429, -13207, -85543, -59480, -32401, -29650, 5888, -34654, -110953, -135316, -13192, 30296, -138878, -197124, -149620, -91242, -91444, -90565, -69549, 20554, -68775, -119518, -130977, -112847, -98961, -58849, -31446, -80636, -55758, -29876, -4830, 58139, 76807, 57796, -36054, -57021, -18841, -56829, -150091, -130186, -56281, 8668, -42329, -150737, -101081, -41644, 107848, 90375, -13772, -49290, -96171, -154199, -163007, -3596, 28877, 11586, 42463, 79190, 81655, 40901, -19575, -2251, 13618, 71119, 123088, 108250, 1310, -97718, -106370, -99360, -166204, -103590, -93567, -96947, -111882, -97258, -14484, 68046, 62045, 23707, 87524, 17308, -79152, -72094, 6990, -16501, -58513, -30129, -34113, -40215, -3599, -54500]
14539e4500l3389k2644K3850O2718L1640q150M2028L5792m5349p0367O8472J00012
14527A30113j132L1777r6810j49260r4753M9709J73j1962R859R2395K621j28746
14515a66016o8262m1665j2716J19491J13669j0549j4732K9688L6278j093o5865
14504h1772k0467J2306m5344r4409R1304M5696O6087N2444k4568P7263N5227l2439
14492A01328m7064j6728j55707n9440Q5927N0528n299J2539L6696Q1160r5134
14481a1194n3997P257k151k0440l0066M0581O4785K5449p6088k3430K2092M4657
14469a2545p360k0101p9033K752J14637P5785q2799p0954j7526k107M3638J1520
14457d4093O8076M8366N5967q2865l7966l4714r3995O6595J1214q5490j9019M9264
$$ y = [-54500, -87889, -110533, -86683, -23965, 7675, -475, 41553, 77345, 31996, -38371, 30101, 130113, 128981, 160758, 63948, -85312, -180065, -130356, -130183, -142145, -132286, -39891, -37270, -166016, -234278, -275943, -288659, -169168, -55499, -66048, -80780, -51092, -14814, -15907, -81772, -102239, -89933, -135277, -229686, -138382, -92686, -26599, 25845, 1277, 78540, 133767, 101328, 54264, 37536, -118171, -177611, -91684, -41156, -46455, -33916, 2780, 83940, -11194, -65191, -57934, -60085, -80525, -110591, -70010, -5225, 20224, -55864, -79294, -57202, -12545, -19905, -40006, -119039, -116287, -1650, 74135, -8664, -79618, -97144, -99251, -55613, -44093, 23983, 72349, 128316, 45451, 7485, -27229, -121224, -54629, -43415, -128905, -147924, -98660]
14445i8660j9291M2220Q0109m1420l503M568K3598o9557k8366O6449j3549J1436
14433d5966J4918P0734o4917j0129O5593Q0O4638j7089q8111j37171j02914L8396
14421b11938J86651M2635N6981J0526k2177k867m6250n0972m6488l3288l1678
14410a48865K2863M2131O3166J0973r86j24225m8583N7340K9368L2059Q0453n5128
14398c9434m5340L7977Q2218M6691j1465k2399n4013J9151Q8393O0654l191p5825
14386H3417j50798l9050R6315P09N532J11954J0512o7075n1785k1762N3334r3308
14374f2005o81K1535M2922M1061N3266n5407n2939R677m7077n9789J8861l595
14362i4171J4504K1394L8011k571o0870N0634L3765J3614q2014o7190n4266J6431
$$ y = [-98660, -117951, -75731, 4378, -37042, -40545, -35977, -12379, -81936, -110302, -43853, -57402, -45966, -31048, 39686, -25231, -35360, 30233, 30313, 94951, 77862, -10249, -147420, -250334, -211938, -25287, 17348, 74329, 84855, 62678, 59811, 13561, -37411, -83899, -117187, -148865, -126002, -83871, -20705, -9732, -10718, -134943, -183526, -126186, -96818, -64759, 15694, -39434, -84774, -46797, 35421, 82112, 70647, 48248, -5765, 13386, 101779, 162433, 159242, 83417, -67381, -106431, -10116, -9407, -3875, 108079, 118591, 51516, -269, -22031, 31303, -62005, -62686, -41151, 1771, 42832, 96098, 40691, -12248, -2571, -49648, -109437, -90576, -94171, -79667, -58273, -20262, -22833, -83703, -33069, 696, 14310, -67704, -134894, -189160, -172729]
14350a72729N5310J6200o2081M6511N1775m4593O5005J22134m89p6869k7663K2783
14338d706K608k0996o9241j9681L0805L5796l2684K3354l3651r5026l8209N3548
14326a68083P7526J27620J4383O406l8004q6586n561K0585P136L2628j15924M5956
14314h1918j8759p540J13032L0541J9460N0806n1408O449J5613o0354r9567n1068
14302a34713K476k1318L5261K9892J1896K0589J3057N5160n4894J7168J2872n8143
14290g0697M609O955L8089j22446m7853J48539Q4360j3156K6258n17k1156L950
14278C6935Q751K0904P471n0271o204m8354j5798m9447K5006q3559r0531j8328
14266b63425r161J18855J9090M4823M012j14446o7628R7565M8363N8114J1845
$$ y = [-172729, -117419, -101219, -163300, -116789, -65014, -109607, -44602, 77532, 77043, 174, -27489, -4706, -2098, -23094, -92335, -112016, -81211, -45415, -78099, -54745, -88396, -183422, -221631, -168083, -90557, 37063, 51446, 57852, 19848, -66738, -72299, -51714, -44578, -11950, -127874, -81918, -100677, -108217, 4815, 35356, 54816, 105622, 54214, 60663, 76276, 15922, -83645, -134713, -132237, -153555, -118294, -88402, -76506, -55917, -42860, 12300, -42594, -25426, -12554, -70697, -66088, -59133, -21044, -143490, -191343, -42804, 41556, 28400, 54658, 54141, 32985, 36935, 45686, 66590, 74061, 23790, 17586, -30768, -46566, -96013, -71007, -154566, -245097, -263425, -272586, -153731, -134641, -89818, -85806, -200252, -267880, -170315, -121952, -63838, -51993]
14255e1993l7524o3047j1781N2792J578j4131J2048P9656j846O7674N0520m1174
14243D2772j773R274m627j7064K9818j9423k7523p4019Q178k4286p166n6886L1512
14230a11213M5926J30630O9426q8315j16405k7359j925j9038P6373P7875k2512
14219A3463j12120p0146n3934R3955N7277q484j8936l0185o5834k6119L6156N2111
14207a32796k9014j0395P0388J05601j49877o2088m033M5356k6111p899J8996
14196a81872M0523N6761R982p765k1178J743J5327q500J0391P7329J3160o5114
14184e9213p0792N0396N5335N2162L6738O2378m2689m5571m9251O436J4422m2118
14172c1767J9913j23775l0472j3658M2163Q6602N2685P195o969M3814N8542L0868
$$ y = [-51993, -89517, -152564, -164345, -111553, -109975, -124106, -112058, -32402, -34248, 33426, 83946, 42772, 40999, 50273, 45646, 28582, 58400, 38977, 11454, -62565, -54387, -78673, -85839, -142725, -111213, -65287, 65343, 134769, 46454, -69951, -97310, -99235, -118273, -41900, 35975, 13463, -98657, -168803, -222737, -128782, -71505, -79989, -98925, -129110, -194944, -221063, -184907, -132796, -161810, -172205, -101817, 3784, -146093, -208181, -212214, -166858, -192969, -200868, -181872, -141349, -84588, -74606, -82371, -103549, -101806, -86479, -94979, -84588, -7259, 5901, -59213, -130005, -79609, -24274, 27888, 64626, 127004, 84315, 38744, -10507, -4071, 10351, -31767, -11854, -135629, -166101, -179759, -137596, -50994, 1691, 8886, 1917, 45731, 104273, 135141]
14160A35141m5602j5767l4350N9926p5181o4826l4229K4811j2289j3970n851m7355
14148a29542L7173N6119N491k9534M0513k4971J7626n1044n1431Q6384R0489l3629
14136A3644m0040k1032j5026j03563j2221k6503J6269P2486O7802P3594m1823
14125a6413j07790M5935K0718l7970k6240P3847N9937M1809j9961k0455m6026
14114c2609j12171k2974K9349N5893k5377k1569K0219p644Q5414q618O8083K2442
14102E0438Q970q6935K8826N7360J8023M4515j9474m1731k7926k8994l4421p510
14090c8859J0213P041R2286J7138n8644Q4246m9270L7576L5100j42539l9244O971
14078c7985o8671J3694J46548N3954M976M1984M5285j2335p9491L833k5270O0878
$$ y = [135141, 89539, 73772, 39422, 99348, 24167, -40659, -74888, -50077, -62366, -76336, -82187, -129542, -92369, -36250, -30759, -60293, -19780, -44751, -27125, -78169, -129600, -43216, 47273, 13644, -26396, -47428, -62454, -166017, -178238, -204741, -188472, -115986, -48184, 25410, -16413, -124203, -78268, -57550, -95520, -121760, -47913, 12024, 53833, 33872, 13417, -32609, -144780, -167754, -138405, -82512, -107889, -129458, -109239, -116883, -31469, -40087, 27996, 50438, 59408, -27527, 1299, 58659, 76682, 121197, 101723, 59992, 32066, 3072, -31349, -38859, -28646, -21605, 70681, 87819, 29175, 113421, 64151, 101727, 136827, -5712, -44956, -37985, -106656, -92962, 53586, 107540, 112516, 154500, 199785, 187450, 107959, 111792, 86522, 147400]
14066A47400J7604n4976p1094m9129l2464K4837j7232R9307M6761n3732n2663
14055D619J6116k9873k8163j14107M1425K4169j1802l1334L0763R6383R9388M9425
14043A47009N2103m8912Q471q6712n5179n675k6948K4387J25663M7241m8911n3348
14031G9189r4768N3350n0544n7125p3560l078O4020l1234m452q489M0376N9582
14019b6733N1729l0134n3180K7879L729P7166M9629L5469l1270j3485q5452q4655
14007g9308M1886P1386Q2279j3956J0420j50n6210q4744L7864l4357p0013n9848
13995a54751M2310J09111O6446K6534M667P4757l3508j26160K0684l3436N7039
13984E3693L527j7187L2160P599N1297m8127n0493n2624O2865k4924m5049N3223
$$ y = [147400, 165004, 110028, 38934, -10195, -42659, -17822, -35054, 64253, 111014, 57282, 4619, 20735, -9138, -37301, -151408, -109983, -85814, -97616, -128950, -98187, -1804, 97584, 147009, 199112, 150200, 158671, 71959, 16780, 11105, -15843, 8544, 134207, 181448, 132537, 79189, -15579, 37771, -12773, -69898, -143458, -146536, -82516, -113750, -118202, -126691, -86315, -26733, 24996, -5138, -58318, -30439, -26710, 50456, 100085, 135554, 104284, 90799, 5347, -79308, -37422, 33964, 116243, 102287, 112707, 112557, 56347, -28397, 9467, -24890, -94903, -154751, -112441, -3330, 63116, 89650, 94317, 169074, 135566, 9406, 30090, -3346, 53693, 57220, 40033, 72193, 79792, 131089, 82962, 32469, -20155, 42710, 17786, -27263, 25960]
13972B5960P338l775N6969L8655l4880j4394l5959p3832l5792Q362k7870J1016
13960g8202K3910l381n9760Q7437P5351Q684Q9797R0292K4497j60285j34654n2883
13948h9197N2640M7956n8631k2682M7678P9245j0192J4244n866n3732R0639R483
13936A01585l1889j20917l1507P0429N9419J8146o4129j6913j376o2452o1447
13925a41051M7920l0541p3726j888l5944J55565O9581n6837n4177k72Q0725P4950
13913C4305L6436o6551j9777N876L768l2434M3427J5370l2918j4759n2641K4597
13901e5301j1119P365m7929q1913n255M9332R2407M4300M282J6161m1775l1653
13889f1098L1530l030k5527p2899k3174k2415O5919O809l1523j0123J25828L6298
$$ y = [25960, 33298, 29523, 86492, 125147, 90267, 75873, 39914, -33918, -69710, -61348, -89218, -78202, -54292, -57673, -117433, -29996, 45355, 54039, 143836, 234128, 258625, 98340, -36314, -89197, -36557, 11399, -47232, -69914, -22236, 57009, 46817, 61061, 55195, 1463, 92102, 101585, 69696, -51221, -82728, -12299, 47120, 65266, 1137, -15776, -17152, -79604, -141051, -93131, -123672, -197398, -199286, -235230, -79665, -10084, -66921, -121098, -121370, -40645, 34305, 70741, 4190, -15587, -9711, -5943, -38377, 5050, 20420, -12498, -27257, -79898, -55301, -66420, -59055, -106984, -188897, -194152, -144820, -52413, -8113, -3831, 12330, -29445, -61098, -29568, -32598, -58125, -131024, -154198, -176613, -110694, -103885, -135408, -145531, -19703, 16595]
13877A6595n3686L8026J162p7532O6169R5746P0383n6349o0195j5127J24451O5837
13865B15480k0233j9625r8763k7542j1542m2383j8895j0056q328n6408k4170p0520
13853a92985m0802P1942R9193K7819Q5759j2222k2181J08458j13716r4851L6017
13842d7569K5795K8287j8812n8715K2781M2442J00731L8668M0117L4111J4523
13831B22359j3509l6418R168J12398J42781N0978J57851R3045P3131j16775j13176
13820E81833j06327m4737j17679r4481m3819M095q7520o7279P3497L4275n4970
13809G6888q600M6628o0550k3733M067M695r4331n1800O1277l8164l111M0531
13797d6203n6648R594J15368L2284j15298k2993O2572L4279M1102k0161j35890
$$ y = [16595, -37091, 935, 2097, -75435, -9266, 86480, 156863, 100514, 40319, 25192, 149643, 215480, 195247, 175622, 76859, 49317, 37775, -4608, -23503, -33559, -41887, -98295, -122465, -192985, -233787, -161845, -62652, -34833, 50926, 38704, 16523, 124981, 11265, -83586, -47569, -21774, 6513, -12299, -71014, -48233, -5791, 94940, 133608, 173725, 207836, 222359, 208850, 172432, 181600, 293998, 436779, 487757, 645608, 738653, 811784, 695009, 581833, 475506, 430769, 313090, 218609, 174790, 178885, 91365, 24086, 97583, 131858, 76888, 68288, 114916, 54366, 30633, 34700, 39395, -54936, -106736, -45459, -83623, -86734, -46203, -102851, -93257, 22111, 54395, -60903, -83896, -21324, 12955, 54057, 33896, -101994]
13786a01994m4461j2215P8656N7338j8183N2081m5212K2058M9755k2199R1160
13775A06784k9230n1762L1832o5079q5073J1858N3198k4291P8696J3866k1872
13764A8927l9822m4943M4693L486K4950m7487n1434r717Q5946L6082n0618m6451
13752g6388j2106L6345n646l8193K5977K6031L7487J23998R4196q8057o2016p6621
13740a4993j00721j7111J268l1641k4914Q000J356R9061R1019N2540O2273j9301
13728A06836J2587r4174o439R4822M7617k0549j6490j30695j8830j5206q8769
13717a29290R720k3488k35M651J48768m1067j11699o1706L9346L6170J36486N4409
13705F2065m840o4927l1248R1076Q378q0733m6519j11692J5785J09874Q1772o15
$$ y = [-101994, -146455, -158670, -80014, -22676, -40859, 11222, -33990, -11932, 37823, 15624, 106784, 77554, 25792, 57624, -7455, -92528, -80670, -27472, -51763, 26933, 40799, 18927, -20895, -65838, -21145, -17659, 7291, -40196, -91630, -101347, -15401, 20681, -29937, -76388, -88494, -52149, -57795, -95988, -70011, -43980, -6493, 117505, 211701, 123644, 61628, -14993, -115714, -132825, -131557, -163198, -188112, -180112, -178756, -79695, 11324, 63864, 126137, 106836, 119423, 25249, 18810, 113632, 161249, 140700, 124210, -6485, -25315, -40521, -129290, -119570, -143058, -143293, -138642, 10126, -30941, -142640, -204346, -165000, -128830, 7656, 62065, 57225, -7702, -38950, 52126, 60504, -20229, -66748, -178440, -162655, -52781, 28991, 28376]
13693B8376K2242N0050J1781n2349K8406r447k2596N8889p5388m3840j4322J7976
13681b22J06171P5966l8685L7797q8533j24311n6991m5325P215O4800R448L9684
13669a2986O91J1976k5291M6678M084j3982q0714L8357M3119q713j8522j8340
13657c3643r4793Q5026P9018m5534q6257O8318m6268r6759M1361J02014L4372
13646F855k6178O97P6442M5177m8639k1863k9221Q4300j5657q0493j7405M3892
13634A7907J8973Q238o5941j277M804j3492k7808P900m5520q2747K8873O0333
13622h9757K5153Q9950J05422q9395p5365r9820p365m1901R8993J47172j54279
13611i1192j33309N9888Q9302N5875J6532L8550q468o3546j5718K0528O7594K2322
$$ y = [28376, 50618, 100668, 112449, 60100, 88506, 79059, 56463, 115352, 39964, -3876, -18198, -222, 105949, 181915, 143230, 181027, 92494, -31817, -88808, -134133, -126918, -62118, -52670, -12986, -12295, -319, -25610, 21068, 25152, 11170, -69544, -31187, 11932, 3219, -15303, -33643, -128436, -43410, 35608, -9926, -96183, -27865, -74133, -170892, -129531, -27517, 6855, -19323, -18626, 57816, 102993, 54354, 32491, 3270, 87570, 71913, -8580, -25985, 17907, 36880, 45118, -20823, -22100, -17296, -30788, -58596, -50696, -96216, -178963, -150090, -89757, -64604, 25346, 130768, 41373, -33992, -133812, -141177, -183078, -84085, 63087, -91192, -224501, -164613, -75311, -19436, -2904, 35646, 27178, -36368, -52086, -31558, 36036, 58358]
13599E8358m6862K8497K1239n7950j00276j6704J5628K2134M3424o9066J2104
13588h9474L3516Q6355Q5198n8575j50308m7645K2363M1307O9409K3632o1019
13577d5241l7145N9423J5521Q745j2630n9001p1594J0238L9418L2333K0333J9249
13565b0351p7075N0489M4243m5737J5651L7332J3899l3904J3347L8416m0059k020
13553e769K0695q8865j17632J26349J30793q2093L460P7858o650l3238N9006P506
13541I1420l749l793j3763j5163j587O3618N0254M331k1291k9499P039j5408Q6877
13528A99286m933m4342j31359j4551o753R2908M916o0758k4522J5052j5814L6076
13516D5206n5061q4101k1775Q2724O4893l0113L749L3441j04317k9854O2360j8889
$$ y = [58358, 11496, 39993, 61232, 3282, -96994, -113698, -98070, -75936, -32512, -101578, -89474, -55958, 30397, 115595, 57020, -93288, -140933, -118570, -77263, -7854, 15778, -45241, -82386, -22963, -7442, 1303, -11327, -70328, -141922, -131684, -92266, -59933, -39600, -20351, -97426, -46937, -2694, -48431, -32780, 4552, 18451, -15453, -2106, 36310, -3749, -5769, 14926, -73939, -191571, -65222, 65571, -16522, -13062, 64796, 58146, 24908, 83914, 91420, 87671, 83878, 70115, 54952, 53365, 116983, 167237, 171568, 150277, 120778, 127817, 112409, 199286, 194353, 150011, 18652, 4101, -2652, 90256, 95172, 34414, 9892, 24944, 9130, 45206, -9855, -93956, -115731, -33007, 31886, 1773, 5522, 38963, -65354, -95208, -32848, -51737]
13504e1737R2567O6705l5541p8675n4952m1551J5117J43266J01400j29858n5617
13493b8876M9614J01788K155J6390K6709K8234q5804j5646O385m5915o7812J26062
13481A13284j202q8741M555o1231o5873M9840L7013N8739K9463P8218O5437J0018
13469B29520p8246r9116L0545N4962o981K7487o6736M059J3540m6169o2609O994
13457G250N4088R4846J5135P3699O6729Q559L3646r8785j18805P545l7729M6938
13445A53116N65R7100k4809p8735k3444j9989L3000p167J3031L1850Q4004n6572
13433B01950m3340P0090l3669m3153O7103K4043l0040J8578j4005m6608R4878
13422B65827o83q88Q2097m1169j73932p5536N2034K1648k4559J6215N9176K1800
$$ y = [-51737, 40830, 107535, 71994, -6681, -61633, -103184, -88067, 55199, 156599, 26741, -28876, 20738, 122526, 124681, 141071, 167780, 196014, 110210, 94564, 100949, 55034, -12778, 113284, 112082, 23341, 27896, -33335, -99208, -49368, -12355, 46384, 75847, 154065, 219502, 229520, 151274, 52158, 82703, 137665, 130684, 158171, 91435, 95494, 109034, 62865, 256, 7250, 61338, 156184, 171319, 245018, 311747, 320306, 353952, 255167, 136362, 143907, 106178, 153116, 153681, 250781, 225972, 147237, 123793, 103804, 136804, 129637, 142668, 174518, 258522, 201950, 158610, 228700, 195031, 151878, 218981, 243024, 212984, 231562, 217557, 170949, 265827, 265144, 264256, 346353, 305184, 131252, 55716, 107750, 129398, 104839, 121054, 180230, 202030]
13410B02030o0289o7664M1636N8854M2911O643l4918r0590j35435j17379M1302
13399a12899N3846J06186K1174j03477m1479O1217K7694n6204O0333P6456j0943
13388H1904l1359l5970j01198L423M6057J07741m523P561m645r6140m0660k8606
13376i6415K3929J28396J50530m728N8369k4135n3310p0583j1322L2726p6393
13365E7064J6552N2185m7091o9005K934k8348L1855j5620J08471L6424n0235k127
13353I3059L5706j0362o2040k1291m8380O1579M3459P9216l0897l4492k6047j2322
13341F7188m6349K9410N5968M6188m6198L7557L7609l1542j19181j1130M8935
13330F8455N04j41377M4516M3618k4618K8272m6220j207J45360R3842o1390j8721
$$ y = [202030, 141741, 74077, 115713, 174567, 217478, 224121, 189203, 98613, -36822, -154201, -112899, -59053, 47133, 68307, -35170, -76649, -15432, 12262, -43942, 16391, 92847, 81904, 50545, 14575, -86623, -83200, -37143, 70598, 66075, 73636, 68991, -27149, -67809, -96415, -72486, 55910, 206440, 201712, 260081, 235946, 182636, 112053, 100731, 133457, 57064, 73616, 125801, 78710, 9705, 12639, -15709, 16146, 526, 108997, 145421, 95186, 93059, 128765, 118403, 56363, 35072, -13308, 48271, 91730, 170946, 140049, 105557, 79510, 67188, 20839, 50249, 106217, 152405, 106207, 143764, 181373, 149831, 30650, 19520, 68455, 68959, -72418, -27902, 15716, -8902, 19370, -26850, -28057, 117303, 211145, 149755, 131034]
13318A31034r5362M668p575p0912l6619J04098M7096J09781k1374o2139m3815
13307E8881K0058k0906K5971p261o4720j07564l8410K5552m0688m3918J8008O7747
13295a07250P0473N3127n0089L0189Q5993l4367L9477k817L3962m2507n4328l904
13283A7959O764K0956j3J1533L3335o8398K3789l9321r4211P2965J43905n8086
13271G1177j3753k6221o2101K1367K2351O6279L8669M2268J6634M6289l093n2189
13259A67677j23472R6112N2568K6787P0637O0591L7332j164p0988j6710k5603
13248B73767l4616J01146N8423m4243M881Q3906P1775J3573p3018k5469K0359
13237D50484R9086J23758J21639k5770N1482J14708R5147L1272R5368J76128K28748
$$ y = [131034, 35672, 40340, 32765, -38147, -74766, 29332, 76428, 186209, 164835, 102696, 58881, 78939, 58033, 84004, 76743, 12023, -95541, -133951, -108399, -149087, -193005, -174997, -107250, -36777, 16350, -33739, -3550, 82443, 48076, 87553, 84736, 118698, 76191, 21863, 17959, 24723, 45679, 45666, 57199, 90534, 22136, 45925, 6604, -87607, -14642, 129263, 71177, 57424, 31203, -30898, -9531, 12820, 79099, 117768, 160036, 176670, 222959, 219866, 167677, 44205, 140317, 192885, 219672, 290309, 350900, 388232, 387068, 316080, 299370, 273767, 239151, 340297, 398720, 354477, 359358, 443264, 515039, 528612, 455594, 430125, 450484, 549570, 673328, 794967, 769197, 820679, 935387, 1030534, 1061806, 1157174, 1333302, 1562050]
13226A562050K00433J87428R8622J59111J02499J72764K02506J54103J37080O9627
13216C046223L300K9872m5503l9959o3527n7757l3058j41716j19767k60471k74459
13205B043178j88491j54205m7330j1525j17234k52165j18655m4575r1188j37853
13195H79957K7802L7795q4222q6279p1187j18124j32745j03734K843n5367j35868
13184A60871m6782O7666R0686K6441l4052m1613n7956O8583j872p0359K2659k742
13172A81530O053M510J3116M4710p4446m1339n4079k4534N2541n234K449j50569
13160d5292M6428N9778J21821l2846o9920p6342q9589R3255O5911m7196N4522
13149H0530R5197p6275j16987K238R4204L8825o8809p5480L7643R7904M4309k521
$$ y = [1562050, 1762483, 1949911, 2048533, 2207644, 2310143, 2482907, 2685413, 2839516, 2976596, 3046223, 3049523, 3079395, 3033892, 2993933, 2930406, 2872649, 2839591, 2697875, 2578108, 2317637, 2043178, 1854687, 1700482, 1653152, 1641627, 1524393, 1272228, 1153573, 1108998, 1017810, 879957, 907759, 945554, 861332, 775053, 703866, 585742, 452997, 349263, 352106, 296739, 160871, 114089, 181755, 272441, 298882, 264830, 223217, 165261, 233844, 231972, 161613, 184272, 181530, 187583, 192093, 205209, 249919, 175473, 134134, 80055, 55521, 108062, 102828, 105277, -45292, 1136, 60914, 182735, 149889, 79969, 3627, -85962, 7293, 73204, 26008, 80530, 175727, 99452, -17535, -15297, 78907, 117732, 48923, -26557, 11086, 108990, 153299, 150778]
13137A50778o5327k5114m664o1659J7277N7550l260j24467o1739O4919L952K2789
13125b8965R2844m0479j22526J9835n0503J0256O5713Q4494L0949L474o0052J054
13113F094Q000P4616K7074l9236o9104N2351K6004o6395k9002J4462L7355j00513
13101e8294k024P3475R5629k7923p4256j4130M1966P8867k7221j17006n3470J00476
13089A6089N7848o6468M1459n2696n8454M8488J01698O9534l3281J2766L3803
13078A70786L7655l366k8484j8032p5194k2712J22222R9036m0955N88K4651m8110
13066B18085j19072p0122J2891l0273l690J07393J4443l4405j28277q8852N4754
13055f7125O6207K2396J12408N2077j00557l0514P7841m9078P87N7794O0214k2969
$$ y = [150778, 85451, 60337, 55673, -5986, 11291, 68841, 65581, -58886, -120625, -55706, -51754, -28965, 63879, 23400, -99126, -79291, -129794, -119538, -53825, 30669, 61618, 65092, 5040, 6094, 14094, 88710, 115784, 76548, 7444, 59795, 85799, 19404, -9598, 4864, 42219, -58294, -60318, 13157, 108786, 80863, 6607, -7523, 34443, 113310, 86089, -30917, -84387, 16089, 73937, 7469, 48928, -3768, -62222, -13734, 87964, 157498, 124217, 136983, 170786, 208441, 205075, 176591, 158559, 83365, 60653, 182875, 281911, 240956, 241544, 266195, 218085, 99013, 28891, 41782, 11509, 7819, 115212, 129655, 95250, -33027, -121879, -67125, -918, 21478, 133886, 185963, 85406, 54892, 132733, 83655, 84442, 142236, 202450, 179481]
13043A79481l9305L4219k3465k1800l8670m2477k6788r7930n7192J04109m9493
13032g9311N228L7081P4249P1037k1751K0238O2904M3074r7513j1022P0235o1894
13020A12555m69J5470k588k8816o708R1561Q1674k2062j62535j36499Q4937L0247
13008E6767j7934l1150O3499j0153p6617K4631J27939N3494l1681J4809o6390
12997A07214J6278J04966K5468k4244m6523L2485M2358p830R9388N7100q3358
12986C23302l7578N3561L383p9512k884k0633m943j5090P3276M5096Q1257J03834
12974E23069n9389j64017J6364M1077M5390P4163M528P5489M6677J9249j16792
12963E05808p6986M5180J07722J17283m1985j12314k2163j9760R2519k6055Q2492
$$ y = [179481, 140176, 174395, 150930, 129130, 90460, 47983, 21195, -76735, -133927, -29818, -79311, -74083, -37002, 37247, 108284, 86533, 106771, 169675, 212749, 115236, 104214, 174449, 112555, 112086, 127556, 124968, 96152, 89444, 181005, 262679, 240617, 78082, -58417, 26520, 56767, 38833, 7683, 71182, 61029, -15588, 9043, 136982, 190476, 158795, 173604, 107214, 123492, 228458, 253926, 229682, 183159, 215644, 258002, 250172, 349560, 406660, 323302, 285724, 339285, 342668, 263156, 260272, 239639, 234696, 219606, 292882, 337978, 419235, 523069, 463680, 299663, 316027, 357104, 402494, 476657, 481185, 556674, 603351, 622600, 505808, 428822, 474002, 581724, 699007, 657022, 544708, 522545, 502785, 595304, 569249, 651741]
12952F51741R2100m5752K0367n230o6465O5868l2208p3463L7743M8745m5792N6600
12940G04254q1055J484j06738K3875J59721n13N4777j03586m3115N6803r1892
12929E74015K4572l1282K029J6912k5832p0475J8651J2721l6234r7618q679m1257
12917C37523j5856J5617j9896K8655K2007r258o8506j8545O9028o0992k7318J8049
12905B70508K8101p15j6823j1453J13630j9183k6106j6020Q5932p3487o0188L8482
12893C12678K7307j9422p8424p5049j5883l3826k9284J06380L7858J512P1420
12882C05267O9754k4003j00749j04108j9437O1224L7551K8158K9170K4343l6139
12871B71031r7482k6878n0994K068J0232n6193R057P8147J12685M5003Q876j01914
$$ y = [651741, 743841, 698089, 718456, 713226, 646761, 712629, 680421, 606958, 644701, 693446, 647654, 704254, 623199, 624683, 517945, 541820, 701541, 701028, 755805, 652219, 609104, 665907, 574015, 598587, 567305, 569334, 586246, 560414, 489939, 508590, 521311, 485077, 387459, 378780, 337523, 321667, 337284, 317388, 346043, 368050, 358792, 290286, 271741, 340769, 279777, 252459, 270508, 298609, 297894, 281071, 269618, 383248, 364065, 337959, 321939, 407871, 334384, 274196, 312678, 339985, 320563, 242139, 167090, 151207, 117381, 88097, 194477, 232335, 233847, 305267, 375021, 351018, 250269, 146161, 126724, 187948, 225499, 253657, 282827, 307170, 271031, 173549, 146671, 95677, 97745, 107977, 51784, 60841, 138988, 251673, 296676, 305552, 203638]
12859B03638P308Q7575R4752o4200j20733j0443L211M445O7808J6355m7355k7166
12847B15195J2730M8933j9751L9817R135j3825L9439k5951k192r4316k1166K5633
12835B13681K0499M8338L9601p5661l9934J4768P7192N4486l4879q4509j0639
12824B22943L3757l0677j2103J5791K6922L3363L9806K924j4751j8493n8790m3325
12812A97367K5313J203O4159O2683k037K3986k0452n9266O1956J1836M2014n3811
12800C54951k4796Q4388J19137j13461j05788q3997M4175m3537K8027n8295l3411
12789A67393L8366Q6575K9279M2960j5411o3825k6530Q4944L0458j6656k5463
12778C32090N8105L5990n1378M7231j6354J4315j3605q8748R894K3201K8950R0492
$$ y = [203638, 210946, 298521, 393273, 329073, 208340, 197897, 201108, 205553, 273361, 289716, 242361, 215195, 227925, 276858, 257107, 296924, 306059, 292234, 331673, 305722, 303530, 209214, 188048, 213681, 234180, 282518, 322119, 246458, 206524, 221292, 298484, 352970, 318091, 233582, 222943, 256700, 226023, 213920, 229711, 256633, 289996, 329802, 332726, 317975, 299482, 240692, 197367, 222680, 223883, 288042, 350725, 348688, 372674, 352222, 292956, 354912, 366748, 408762, 354951, 330155, 414543, 533680, 420219, 314431, 230434, 274609, 231072, 259099, 200804, 167393, 205759, 292334, 321613, 364573, 349162, 285337, 258807, 343751, 374209, 357553, 332090, 390195, 426185, 374807, 422038, 405684, 419999, 406394, 317646, 327540, 350741, 379691, 470183]
12766D70183r5618L24k2955J54185Q7091n0138m0887M6710r5934j3468O1427J4206
12754E15126k1501n5840K1202K5788P309k0104l5116O9032M3189q4124N9918l349
12742E21530n5130L8373N1109O2779l9077m8440r679L1072k7737o6097n0870M9748
12730D57581Q7426R5632r0641r3456k7415P8093N9080N4809R1838M123l1597K1808
12718G07281J1686l4748Q8359M8273P030j19943o0988N4707j0794j1968m7871
12707F31024l3569j1377K1970L0531J14657M3127p119J2368j365k9386O9314p9040
12695G61135j2101J19143K6326M4918L2347k743j24441j34523n1200N44Q2814
12684G42219l0299K7918K6424M6151N1168l373o4248k3601l738o2441N0416N691
$$ y = [470183, 374565, 374889, 351934, 506119, 593210, 543072, 502185, 548895, 452961, 439493, 500920, 515126, 493625, 437785, 458987, 484775, 492084, 471980, 436864, 505896, 549085, 464961, 524879, 521530, 466400, 504773, 555882, 618661, 579584, 531144, 521465, 552537, 524800, 458703, 407833, 457581, 545007, 640639, 549998, 456542, 429127, 507220, 566300, 621109, 712947, 717070, 685473, 707281, 718967, 684219, 772578, 820851, 827881, 707938, 646950, 701657, 690863, 678895, 631024, 597455, 586078, 608048, 638579, 753236, 796363, 789244, 801612, 800247, 770861, 840175, 761135, 749034, 868177, 894503, 939421, 971768, 969025, 844584, 710061, 658861, 659405, 742219, 711920, 739838, 766262, 812413, 863581, 860208, 795960, 772359, 768621, 706180, 756596, 762287]
12672G62287Q528J54948O0238Q656O4996L0190L3575j28307l154k9384K6182N1764
12660A040519M666m295J4140K699p9066j9853K4822j0431k4250j84O9840J13391
12648A131998M3948J2744m3760q7394n6859n8160q096m6304q8183k3800J08418
12637H84552Q6739m0686p2630l4417M4066q515J9960O2284m710L3866M2445l5210
12625I77744J3798Q6565k5719J765p3678p4471J6627P0732r570n0415M3345l9590
12613I37133r4594J481K5539M8725Q31N986L4310J7433M198o469L8141J6557P5563
12600A104834l6769J3888J10662M9476m2504k9580O463M3239j27049M6950R1821
12589A231431k9687n7244l76M9928K2595O6969p562m5103m8913K215m7201J4824
$$ y = [762287, 770815, 925763, 986001, 994657, 1059653, 1089843, 1123418, 995111, 991957, 962573, 988755, 1040519, 1045185, 1040890, 1055030, 1057729, 978663, 958810, 983632, 973201, 948951, 948767, 1018607, 1131998, 1175946, 1188690, 1144930, 1057536, 1000677, 942517, 934421, 888117, 799934, 776134, 884552, 971291, 930605, 857975, 823558, 867624, 859109, 879069, 941353, 936643, 970509, 1012954, 977744, 991542, 1078107, 1052388, 1054153, 980475, 906004, 922631, 993363, 983793, 933378, 976723, 937133, 842539, 844020, 869559, 918284, 919115, 925101, 959411, 976844, 981042, 974573, 1012714, 1029271, 1104834, 1068065, 1081953, 1192615, 1242091, 1199587, 1170007, 1176470, 1219709, 1092660, 1139610, 1231431, 1201744, 1144500, 1144124, 1194052, 1216647, 1283616, 1276054, 1230951, 1182038, 1184253, 1137052, 1151876]
12577A151876N8228O4684J04260l5187j13964P3169N4071J27499L8763j3767l3394
12566A476238l460M4640j0349K4010n857K3803k3979m0109K8579N3180N6864R7456
12554A721016N3441o1264j19046l3789O3083K6714J4686K6307l1442J6407m507
12543A671606J6197j19632J1499M0895Q1307N5172L2215L462L773o4246l2460
12532A699788R5709K2336L2990K5866K383J00309N4623m8879r8017J6733l374
12521A900467p6487L8068L6599l290M0444J20924O2664l3759o318L3362P6731
12510B189405J8466l4807o026J8575Q1834P8295o6979r86J09608k923j9658J3845
12498B378649J1065L8176Q892Q2861M2145P1862P5424n868L7001j308k5432l434
$$ y = [1151876, 1210104, 1274788, 1379048, 1343861, 1229897, 1303066, 1357137, 1484636, 1523399, 1509632, 1476238, 1472778, 1517418, 1507069, 1531079, 1525222, 1549025, 1525046, 1484937, 1513516, 1566696, 1623560, 1721016, 1774457, 1713193, 1594147, 1560358, 1623441, 1650155, 1664841, 1691148, 1659706, 1676113, 1671606, 1687803, 1568171, 1579670, 1620565, 1701872, 1757044, 1789259, 1792721, 1796494, 1732248, 1699788, 1795497, 1817833, 1850823, 1876689, 1879072, 1979381, 2034004, 1985125, 1887108, 1903841, 1900467, 1823980, 1862048, 1898647, 1895357, 1935801, 2056725, 2119389, 2085630, 2079312, 2112674, 2189405, 2207871, 2173064, 2167038, 2185613, 2267447, 2345742, 2278763, 2277777, 2387385, 2384462, 2364804, 2378649, 2389714, 2427890, 2436782, 2519643, 2561788, 2633650, 2709074, 2703206, 2740207, 2738899, 2713467, 2710033]
12486B710033M3506Q0319O6460Q6920J24656M4194n6095n0006P685l6969J18356
12475C139059J29072M6337P7759J6990j9789q090N154Q870P7114Q5915L7520k908
12463C593003N4511k409J01934Q4063j7989j4735K02818l8319M5625K04767O0829
12452D274098m5390N1807J51829N2421K2732R7199J21576M544O6058Q8636J01118
12441D986628J72986K84523N7088O9217J72729P323m279L0769J88170L6121k7438
12430E973837O0691J63793K12276J08594J75530K00803J60076L8946J43589Q8587
12420G326722R7425J06496J08415P8688O5168K01190K01568K01351J51152J10530
12410H648705J96998J53560K48710K07809K70027K63319K45321K25571K04274
$$ y = [2710033, 2753539, 2833858, 2900318, 2987238, 3111894, 3156088, 3099993, 3049987, 3057672, 3020703, 3139059, 3268131, 3314468, 3392227, 3409217, 3389428, 3381338, 3386492, 3395362, 3472476, 3558391, 3595911, 3593003, 3647514, 3645105, 3747039, 3831102, 3813113, 3798378, 4001196, 3962877, 4008502, 4213269, 4274098, 4228708, 4280515, 4432344, 4484765, 4507497, 4604696, 4726272, 4730816, 4796874, 4885510, 4986628, 5159614, 5444137, 5501225, 5570442, 5743171, 5750494, 5746215, 5776984, 5965154, 6001275, 5973837, 6034528, 6198321, 6410597, 6519191, 6694721, 6895524, 7055600, 7094546, 7238135, 7326722, 7424147, 7530643, 7639058, 7717746, 7782914, 7984104, 8185672, 8387023, 8538175, 8648705, 8845703, 8999263, 9247973, 9455782, 9725809, 9989128, 10234449, 10460020, 10664294]
12401A0664294L48055K04400J50510K45094J96148J85714L25460K67612K16948
12392A2804235K56081K97554K07034L61257N12052K70244K68058K94360K16561
12383A5487436K53523K99733L68911L13872M65650L67333K97904L60743N42055
12374A8757160M08338M46121N40797M17494N39008O16260N02606N71903P04667
12365B3504354O48206N76831N95738P43120P63023P94005R44289J069506J071791
12356C0710863J102290J175680J114334R27743R09051O72326O85118O72820N84733
12347C8554958O43524O54745P39167P98800Q42710R70589J020543R93850R96633
12338D6215519R92726J114575J206202J136003J118834J065191R19170R79804
$$ y = [10664294, 11012349, 11216749, 11367259, 11612353, 11808501, 11994215, 12319675, 12587287, 12804235, 13060316, 13357870, 13564904, 13926161, 14438213, 14708457, 14976515, 15270875, 15487436, 15740959, 16040692, 16409603, 16723475, 17189125, 17556458, 17854362, 18215105, 18757160, 19165498, 19611619, 20152416, 20569910, 21108918, 21725178, 22227784, 22799687, 23504354, 24152560, 24729391, 25325129, 26068249, 26831272, 27625277, 28569566, 29639072, 30710863, 31813153, 32988833, 34103167, 35030910, 35939961, 36612287, 37297405, 37970225, 38554958, 39198482, 39853227, 40592394, 41391194, 42233904, 43204493, 44225036, 45218886, 46215519, 47208245, 48322820, 49529022, 50665025, 51783859, 52849050, 53768220, 54748024]
12330E4748024R06341R76555J006519Q44786P79035O66860O85889O57919O60390
12321F1932318N18974M16382L90011J84800J14991K5371O596m2035j97806k74175
12311F3075427l80627l63288m88762o51894o35082p05732p96380q29159q92284
12302E7332219q34635r48374r45491r38884j064553j076326j067539r98068j115188
12293D8343161j102219j033996j121645j065350j042832j064168r57322j005711
12285C9949918j110980r80229r57262r45711q48180q06185q28082q82303q30961
12276C1760025q89948q16962p24884o34760p64035p37761o52787o06938n99770
12267B5332180o35002o25771p08660n65278n24117m25769m54340o05474n58981
$$ y = [54748024, 55654365, 56630920, 57637439, 58482225, 59261260, 59928120, 60614009, 61271928, 61932318, 62451292, 62867674, 63257685, 63442485, 63557476, 63582847, 63589443, 63547408, 63349602, 63075427, 62694800, 62331512, 61842750, 61190856, 60555774, 59850042, 59053662, 58224503, 57332219, 56497584, 55549210, 54603719, 53664835, 52600282, 51523956, 50456417, 49458349, 48343161, 47240942, 46206946, 45085301, 44019951, 42977119, 41912951, 40955629, 39949918, 38838938, 37858709, 36901447, 35955736, 35107556, 34301371, 33473289, 32590986, 31760025, 30870077, 30053115, 29328231, 28693471, 27929436, 27191675, 26538888, 25931950, 25332180, 24697178, 24071407, 23362747, 22797469, 22273352, 21847583, 21393243, 20787769, 20228788]
12258B0228788m75281m33639m69680m46396m14542l80494m16876l96803m26733
12249A6368344l04750l19976l93650k75341l14966k89619k31077k27425j92482
12240A3819058l06646k16852j03712k77937l87928l67059l04631j47225k19964
12231A1487104j86169o2331j69107p7472j77572k15675k73821j70031j54280j83900
12221I816746j12563q5226j30585j31943j20629j49409j43897j62233j92764j45401
12211H442096j43962j24067j39858j36610o8211j25601j48457j64602q6725j36844
12201G167159j40626r4189m0647p1921n3625o4349o7577k8526o9828q9576j03877
12190F342418j33574n4987n3723q8603j53574r9345j76193r1609q4576p0250m2407
$$ y = [20228788, 19753507, 19319868, 18850188, 18403792, 17989250, 17608756, 17191880, 16795077, 16368344, 16063594, 15743618, 15349968, 15074627, 14759661, 14470042, 14238965, 14011540, 13819058, 13512412, 13295560, 13191848, 12913911, 12525983, 12158924, 11854293, 11707068, 11487104, 11300935, 11238604, 11069497, 10992025, 10814453, 10598778, 10324957, 10154926, 10000646, 9816746, 9704183, 9618957, 9488372, 9356429, 9235800, 9086391, 8942494, 8780261, 8587497, 8442096, 8298134, 8174067, 8034209, 7897599, 7829388, 7703787, 7555330, 7390728, 7304003, 7167159, 7026533, 6932344, 6891697, 6819776, 6766151, 6701802, 6634225, 6605699, 6535871, 6446295, 6342418, 6208844, 6153857, 6100134, 6011531, 5857957, 5758612, 5582419, 5490810, 5406234, 5335984, 5293577]
12179E293577j08388j2693o0061q7743l9660r9138r7950o7391q6681k6943j03380
12168D503549N59m0592P7688L5025j06306q3570J4724m5947j3259r8160p1547
12157D172164J0647j9691o4484N860o5030j23002j0812n4712j40475n8624j00215
12146C551626k8665K3213L6199L007J9998J2870j03064k7001L1844N8061k5699
12135C552389K8732m9604m3361m1462j55254j57719k1061P2219R0497p7114j2991
12124C185271q4035k1087J06099R6955O2705Q0496J03927J72602J22695K4982
12114C850610O5194O4172n3730j33930j84811k40812k65654k60779p6741j10643
12104B652876m7902j6569j23882o9127P980L056j15354n6570o6877j1236L8288
$$ y = [5293577, 5185189, 5172496, 5112435, 5024692, 4985032, 4885894, 4787944, 4720553, 4633872, 4606929, 4503549, 4504108, 4463516, 4541204, 4576229, 4469923, 4386353, 4401077, 4355130, 4341871, 4243711, 4172164, 4182811, 4163120, 4098636, 4104496, 4039466, 3916464, 3905652, 3850940, 3710465, 3651841, 3551626, 3522961, 3546174, 3582373, 3585380, 3605378, 3618248, 3515184, 3488183, 3520027, 3578088, 3552389, 3581121, 3531517, 3488156, 3446694, 3291440, 3133721, 3112660, 3184879, 3275376, 3198262, 3185271, 3101236, 3080149, 3186248, 3283203, 3345908, 3426404, 3530331, 3702933, 3825628, 3850610, 3915804, 3979976, 3926246, 3792316, 3607505, 3366693, 3101039, 2840260, 2763519, 2652876, 2604974, 2588405, 2464523, 2395396, 2403376, 2406432, 2291078, 2234508, 2167631, 2156395, 2194683]
12093B194683K3105l7781p3254P532M1185m305j4940n5059l8918P6845J06147
12082B225240J6695j5124k2933n0123L8978J3699k9888k6573J6309K2895J8504
12071B207679J23253Q23n0491q7326k2462K5365J15865Q5578P5666L7583m7949
12060B463584j6923j09499j98478j03324J4622m4951l0524j01646n7781l9340
12050A775740K3336j44796l8249P9849R9998P356j24264n4319O0474j1871M698
12039A677952k0354k5049j4748p5833j07002j1690L2075k5749k4223O924K6201
12028A438504m4187R2282J04571m028j9819j3152m5686M7315Q4650q1410l276
12017A555764n619M8555O798m0631K5893L0437L4442P981O1814N9138K0548p2283
$$ y = [2194683, 2217788, 2180007, 2106753, 2114285, 2155470, 2151165, 2136225, 2081166, 2042248, 2119093, 2225240, 2241935, 2226811, 2203878, 2153755, 2192733, 2206432, 2176544, 2149971, 2166280, 2189175, 2207679, 2330932, 2331755, 2281264, 2193938, 2171476, 2196841, 2312706, 2398284, 2473950, 2511533, 2463584, 2446661, 2337162, 2138684, 2035360, 2049982, 2005031, 1974507, 1872861, 1815080, 1775740, 1799076, 1654280, 1616031, 1695880, 1795878, 1803234, 1678970, 1624651, 1685125, 1673254, 1677952, 1657598, 1632549, 1617801, 1541968, 1434966, 1423276, 1455351, 1429602, 1405379, 1412303, 1438504, 1394317, 1486599, 1591170, 1587142, 1567323, 1554171, 1508485, 1555800, 1640450, 1559040, 1555764, 1550145, 1598700, 1605498, 1564867, 1590760, 1621197, 1655639, 1663620, 1725434, 1784572, 1805120, 1732837]
12005A732837J5981R6789L361M805k9436K1325N6292O0277P0993R7912L8910k5424
11993B144622M3743J33174Q4624J2759K3688Q6195N6054Q7103K52943J84265R5033
11982C204203N4362O8156K32140J96989J63226K37208K77932J71912J56279K37207
11972D999614K91110M86026N82585O43154O60671P40706Q24080R60301J137828
11963A1326075J369751J691166K052842K700240L232412L769902M317009M889769
11955C5349166N200895N420443N556719N884434O569629P898558J0146298J3667715
11947I5693857J9230362K7972177L9811353N2666398O2811572O7130161O4673980
11940D29989860N4678805L5761390R079898j9952843m4026549o0159877o8337100
$$ y = [1732837, 1748818, 1845607, 1848968, 1853773, 1824337, 1845662, 1901954, 1962231, 2033224, 2131136, 2170046, 2144622, 2188365, 2321539, 2406163, 2418922, 2442610, 2528805, 2584859, 2671962, 2924905, 3109170, 3204203, 3258565, 3326721, 3558861, 3755850, 3919076, 4156284, 4434216, 4606128, 4762407, 4999614, 5290724, 5776750, 6359335, 7002489, 7663160, 8403866, 9227946, 10188247, 11326075, 12695826, 14386992, 16439834, 19140074, 22372486, 26142388, 30459397, 35349166, 40550061, 45970504, 51527223, 57411657, 63981286, 71879844, 82026142, 95693857, 114924219, 142896396, 182707749, 235374147, 298185719, 365315880, 429989860, 484668665, 520430055, 529509953, 509557110, 465530561, 405370684, 337033584]
11933C37033584o8909120o2128377n0144205l7027236k5890067j7664956j2065757
11926F3203866q423835n925495m629115l897085l820825l700597l526248l474444
11918B5806222l260442k863148k430932k008433j593037j266442j037817q24155
11910A0521816o31481o03255n39497m95091m65589m87581m29307l41050l12060
11901F216905l64903k11019k28184j39860j69121j94991k13350j54556r7223j67403
11891D276295j28215p1363q841j5744o9922j90870j39928r0276q6746p9726k6040
11880C368624j91811j75942j17236O4639K7472p0753p7759o7773k7989N1466o4357
11869B718581j04230j3193j12642p5975o1125j51708m9162n8965m3421K7570M1605
$$ y = [337033584, 268124464, 205996087, 155851882, 118824646, 92934579, 75269623, 63203866, 54780031, 48854536, 44225421, 40328336, 36507511, 32806914, 29280666, 25806222, 22545780, 19682632, 17251700, 15243267, 13650230, 12383788, 11345971, 10521816, 9890335, 9287080, 8747583, 8252492, 7786903, 7299322, 6870015, 6528965, 6216905, 5852002, 5640983, 5412799, 5272939, 5103818, 4908827, 4695477, 4540921, 4443698, 4276295, 4148080, 4076717, 4067876, 4052132, 3982210, 3791340, 3651412, 3561136, 3474390, 3394664, 3368624, 3176813, 3000871, 2883635, 2948274, 2975746, 2904993, 2827234, 2759461, 2731472, 2782938, 2718581, 2614351, 2601158, 2488516, 2412541, 2351416, 2199708, 2150546, 2091581, 2048160, 2075730, 2117335]
11858B117335N3837N4578m1891p7106q6193j07907n9621m859r7950n0503j5387
11847A684333m049M2911k1264m937l3963l182m6603O7050Q816L299n4989q8285
11835A549137m4543L109N3495P3762J1892k4173n5484n471N4761q1134o6222j00323
11823A368806n5593R7144K8669n6744N8943N0183M0073J35418R0205J26779l390
11812A880493N5254J47712J9369m3682j22183r6224j46199k3563m9497q7499K7164
11801A561145p7086j55515l3048L943m1329K3172m8208p4452k9377n4976q8656
11790I85613R255L8793O9372N2824o477j8041L5362p9810j4625O9687R508j10128
11778A041333J392J1802J8357K6452o8687l0701M4120L3190l2304j08510j6145
$$ y = [2117335, 2171172, 2225750, 2183859, 2106753, 2020560, 1912653, 1853032, 1848173, 1750223, 1699720, 1684333, 1680284, 1723195, 1701931, 1696994, 1663031, 1659849, 1613246, 1680296, 1689112, 1692411, 1637422, 1549137, 1504594, 1507703, 1561198, 1634960, 1646852, 1622679, 1567195, 1561724, 1616485, 1535351, 1469129, 1368806, 1313213, 1410357, 1439026, 1382282, 1441225, 1491408, 1531481, 1666899, 1757104, 1883883, 1880493, 1935747, 2083459, 2102828, 2059146, 1936963, 1840739, 1694540, 1670977, 1621480, 1533981, 1561145, 1484059, 1328544, 1295496, 1299439, 1258110, 1281282, 1233074, 1158622, 1129245, 1074269, 985613, 994868, 1033661, 1103033, 1155857, 1149380, 1131339, 1166701, 1086891, 1072266, 1141953, 1151461, 1041333, 1042725, 1054527, 1072884, 1099336, 1030649, 999948, 1044068, 1077258, 1044954, 936444, 920299]
11767I20299l2153M0870R5709P1193r1206m8433j2774K4397k3335m5934j9640
11756H78993m3631l3347L7232l3418k4640j06859o215K0758l4900j22589m9132
11745D82252K0095K7331J30756M6441k424k310n0442N9537M0577K3917m0497p0266
11733F64967k9089j03611R5536l81j29866o211P4775N1834q7014n3416L3047L5411
11721E45982n5665N2762R5621J9835o1329j17755p4749m6910O8152R2198N9164
11710E77306O1082n9355q3996N6554P4940O5555p8355j00301p4115r2832j03125
11699B43358K1093O1425K9925n2496M9172M8253J7279J18769N8708N5226k0957
11688F29755L4975L5477r522j8628k344p2209N2367j04890j45239q5581J12247
$$ y = [920299, 888146, 929016, 1024725, 1095918, 1004712, 956279, 943505, 967902, 944567, 898633, 878993, 835362, 802015, 839247, 805829, 781189, 674330, 668115, 688873, 653973, 531384, 482252, 502347, 529678, 660434, 706875, 704451, 702141, 651699, 711236, 751813, 775730, 735233, 664967, 635878, 532267, 627803, 627422, 497556, 491345, 566120, 617954, 530940, 477524, 510571, 545982, 490317, 543079, 638700, 658535, 597206, 479451, 404702, 357792, 425944, 518142, 577306, 638388, 579033, 495037, 551591, 626531, 692086, 613731, 513430, 439315, 346483, 243358, 264451, 325876, 355801, 303305, 352477, 400730, 418009, 536778, 595486, 650712, 629755, 664730, 700207, 690685, 672057, 669713, 597504, 649871, 544981, 399742, 314161, 426408]
11677D26408Q6611p2868o6617L9997K5685n2594p5810O191l4615O2184M4558P5266
11665D64396M2570O4396M6178l8741k2508M2319o0760j36187j05235M7709R3316
11654D37453O4360p6702p5954k3189n8415k2520n3735N1333R4663J37098Q631
11643D83023j58309k3586N2955Q7221q194K2305j7918N528K0932J43502J0871
11632F18330j33449j03424j451J9510m3861m2805p1L6548P1789k7350r6861J20499
11620D17404J13392L8656p17m0872m9431M408M1362n8954j05724o4368n7431r618
11608B28107L7728r2268P5516J41064N0862l3854j26599p113O1104M3060Q7746
11597D65353N1561n4137L1595J6491L7887n0727j23705j9130o4520N992J20055
$$ y = [426408, 513019, 440151, 373534, 413531, 439216, 386622, 310812, 317003, 282388, 344572, 389130, 464396, 506966, 571362, 617540, 578799, 556291, 598610, 537850, 401663, 296428, 344137, 437453, 501813, 425111, 349157, 325968, 267553, 245033, 191298, 242631, 337294, 474392, 483023, 324714, 301128, 354083, 441304, 433110, 455415, 437497, 443025, 463957, 607459, 618330, 484881, 381457, 380006, 399516, 355655, 312850, 312779, 349327, 421116, 393766, 296905, 417404, 530796, 569452, 568735, 527863, 478432, 482840, 524202, 465248, 359524, 295156, 237725, 228107, 265835, 173567, 249083, 390147, 441009, 407155, 280556, 273443, 334547, 377607, 465353, 516914, 462777, 494372, 510863, 548750, 498023, 374318, 355188, 290668, 296660, 416715]
11586D16715L7026M8805N3471m3315n5792N037J01952o7257m1756M8706m4566
11575D59026l6385J1151p4895p021J30186o4995j20939j5787K2205J8598n4379
11564B66765L6967j9901K063M5347M7937j6149p9304N3183j0678j4681N2528j0206
11552C53871K5066k8417j5924L5577j0938l2466Q4504p283r2886K8576N5291R4666
11540D89637k6435n5199K2075j9279O1449R9414j4264R0165J0801j8358O9050
11529G09056J5498O4090L2787J02944J67464K48519L19359L29152K53093K87623
11519B529585K31099K48504K6633l0925k52901l85607l88170l14028l29485l33864
11509A000841q0303j40193j94401p9292j6643p720m0174q7218N2077j6188o6188
$$ y = [416715, 453741, 502546, 556017, 512702, 456910, 461947, 563899, 496642, 454886, 503592, 459026, 422641, 433792, 358897, 351876, 482062, 417067, 296128, 280341, 302546, 321144, 266765, 303732, 283831, 285894, 331241, 379178, 363029, 283725, 336908, 326230, 311549, 364077, 353871, 378937, 350520, 334596, 370173, 359235, 326769, 411273, 403990, 311104, 339680, 394971, 489637, 463202, 408003, 430078, 410799, 472248, 571662, 557398, 647563, 658364, 640006, 709056, 724554, 788644, 821431, 924375, 1091839, 1340358, 1659717, 1988869, 2241962, 2529585, 2760684, 3009188, 3035821, 3004896, 2751995, 2366388, 1978218, 1664190, 1334705, 1000841, 920538, 780345, 585944, 506652, 490009, 482289, 442115, 354897, 406974, 390786, 324598]
11498C24598n4268L7902R3352j08500J39K7700M450O2745J2325O187l1873q0973
11486B93784j04873J4028O1315L8987K5308m8552J9300J39531J01710l4010r0830
11475D15698m8261l3160q8203o0432P0630k0313r38j7410p2771K7327J5326p8688
11463A08805j0791N3491J60593P6063j7585l4337J2404p8345L8104J4668m1024
11452B82046M3599J06858q478j48174p7589K0227Q2568K5537n6863m7111m3835
11441A78785N7439P2937l9877k321q6821l5162K1189K7366P4425J4671N1873p4134
11429B60370K535P6096m3270M5140M5474l9086j12499m6593J0709q761n0788K2859
11417A62186j3401J5348Q023k8873n0925J1969L7464J3268K1791P958k6164L4701
$$ y = [324598, 270330, 308232, 401584, 293084, 293223, 320923, 325373, 388118, 400443, 406630, 374757, 293784, 188911, 202939, 264254, 303241, 328549, 279997, 299297, 438828, 540538, 506528, 415698, 367437, 334277, 246074, 185642, 256272, 235959, 235021, 217611, 144840, 172167, 187493, 108805, 98014, 151505, 312098, 388161, 370576, 336239, 348643, 270298, 308402, 323070, 282046, 325645, 432503, 424025, 275851, 198262, 218489, 301057, 326594, 269731, 222620, 178785, 236224, 309161, 269284, 266963, 180142, 144980, 166169, 193535, 267960, 282631, 334504, 260370, 262905, 339001, 295731, 340871, 386345, 347259, 234760, 188167, 198876, 190115, 139327, 162186, 148785, 164133, 172156, 143283, 92358, 104327, 141791, 155059, 176850, 184808, 158644, 193345]
11405A93345K4596k4442O4372n1505Q426M6349L7136L8186O113o3897p4243q5341
11393A19095R438J0740N2042J05139k6369j13795k8157L701K5040p897l8811o0809
11381D9357k2608O9530R9754L8267p5856j7231O1922N9140J8145m0464j6065m1655
11369A82236m4437K5615M2482j3291L0757m7889r3612l9356K8717N115K8472p499
11357I7310N2473q4734O6198P7175l4235m9737M9587M2112q9067o9747J5897p5258
11345b026p2772K7595M5710L590L1182L6817J03967P1937M1131r2544r8565J7170
11333A13192l2504j1252K3301J0345O952Q4597N7173K9864L929p3210j51201m739
11321E6447J01372Q0214k2997l3731M2669r368n7614O7319J8268K2100M8642p0949
$$ y = [193345, 217941, 193499, 257871, 206366, 214792, 261141, 298277, 336463, 342576, 278679, 204436, 119095, 128533, 139273, 191315, 296454, 270085, 156290, 128133, 131834, 156874, 148977, 110166, 49357, 26749, 96279, 196033, 234300, 158444, 141213, 203135, 262275, 280420, 239956, 223891, 182236, 137799, 163414, 205896, 192605, 223362, 175473, 81861, 42505, 71222, 76337, 104809, 97310, 149783, 65049, 131247, 208422, 174187, 124450, 174037, 216149, 127082, 57335, 73232, -2026, -74798, -47203, -1493, 2097, 33279, 70096, 174063, 246000, 287131, 194587, 96022, 113192, 80688, 69436, 92737, 103082, 110034, 194631, 251804, 281668, 285597, 212387, 61186, 56447, 157819, 238033, 215036, 181305, 223974, 214606, 156992, 224311, 242579, 264679, 313321, 242372]
11309B42372p8540J4184l4333j1796k3557n37N6510l7865N583Q2849j5084n4099
11297A45687o605N1852J6542K2207K5344Q9138K9682l3763N0635P3018k2149r8082
11285C43506j6496q1159m5261l8353m3221O1385k6102P4502Q3417o3606k7497
11274B21115K4861o3200O9288o3217l9124k5419J0796K1171p7904l7796J756m845
11262C7482m7528J2322O8741O773J5760k816J3154O6791L3034p6093j59873J1821
11250b0432O5565L5690q861O2640J33402R274k795k1672p8464o5817m945p5207
11238B8378k1892N023R7435O9182j8220p0519m3399J3840K1357K4534P4059K2139
11226B01917n971q127p9413l3177n0349J2050K3663L4356p848k5374N5102k0150
$$ y = [242372, 163832, 178016, 143683, 131887, 108330, 107793, 164303, 126438, 132021, 214870, 199786, 145687, 139082, 190934, 207476, 229683, 255027, 344165, 373847, 340084, 390719, 463737, 441588, 343506, 327010, 245851, 200590, 162237, 119016, 180401, 154299, 228801, 312218, 248612, 221115, 245976, 182776, 252064, 188847, 149723, 124304, 135100, 156271, 78367, 40571, 42327, 37482, -10046, 2276, 71017, 77790, 93550, 90734, 103888, 170679, 203713, 127620, -32253, -20432, 45133, 80823, 71962, 134602, 268004, 277278, 274483, 252811, 174347, 108530, 103585, 28378, 6486, 11509, 108944, 178126, 159906, 89387, 45988, 59828, 81185, 105719, 179778, 201917, 195946, 187819, 108406, 75229, 24880, 36930, 60593, 94949, 87101, 61727, 116829, 96679]
11214I6679K8217p755N9926N7775p3285l4392R494L0580O5130J21279O5207o5460
11202C53395j01335p9628K4351p8493o6288l2184J6534J0729m099J3893N9141
11191A16016M8811R043n4906M1586k5196Q3589K6349N1034L7770q6768M4897O7878
11179C60103O4597k3616j73581r3381O2814J6987q7505j9371J2419K9385R9l9197
11167A09753J5232N4418o9542j04158j8315m2477Q3701J06609J34403n1659j14793
11156A03172N1323J7907n4467N2043q249K7610Q134k5497J9244J6924N6007m367
11144B59784J8949l0683J06548O79j4419k1166l3653l1787j57871m1680P859m5520
11132A7040K3728k15k4946l5725Q6284J31220L4358m9175q7607l2814P7622N0080
$$ y = [96679, 124896, 117141, 177067, 234842, 161557, 127165, 136659, 167239, 232369, 353648, 418855, 353395, 252060, 172432, 196783, 118290, 52002, 19818, 36352, 47081, 42982, 56875, 116016, 164827, 173870, 118964, 160550, 135354, 218943, 245292, 296326, 334096, 247328, 292225, 360103, 424700, 401084, 227503, 134122, 196936, 213923, 126418, 107047, 119466, 148851, 148950, 109753, 124985, 179403, 109861, 5703, -12612, -55089, 28612, 135221, 269624, 217965, 103172, 154495, 172402, 117935, 169978, 161729, 189339, 197473, 171976, 191220, 208144, 264151, 259784, 278733, 248050, 354598, 355277, 340858, 319692, 286039, 254252, 96381, 54701, 62560, 17040, 40768, 40553, 15607, -20118, 66166, 197386, 231744, 182569, 94962, 62148, 139770, 189850]
11120A89850r5124p9141K1033J17339J09852j6792j05110n8958j954K7293R8362
11109B06650K555j14931L2317N1171k2787j3934K6752m7027P579N3851l6521J0792
11097A56467K6726j299M7877j0469l5827m1929O4771O5931O3995P5413l0463j18961
11085B62232O7269j26743p7971K9158Q931r133M630L4251K3323j6537L0202l837
11073B25775o2211R9847j9222k0116n930l4881p6712l0877L4327k6693L9149N8380
11061A80836K9741J8392j5482k867O9149q5040n4892M8283J13439r11R248O1998
11049C71894k1310q5487q8235J5631l3348K2934j7067j9268P4725n263r2494m2235
11037H0477m3189j4454J804R9541j24777j1539J23001L6702m7279R903L7008J3325
$$ y = [189850, 94726, 15585, 36618, 153957, 263809, 247017, 141907, 82949, 80995, 108288, 206650, 209205, 94274, 126591, 177762, 154975, 141041, 167793, 120766, 128345, 182196, 145675, 156467, 183193, 181894, 229771, 219302, 183475, 141546, 206317, 272248, 336243, 411656, 381193, 262232, 329501, 202758, 124787, 153945, 162876, 153743, 158373, 192624, 215947, 199410, 229612, 225775, 163564, 263411, 244189, 224073, 218143, 183262, 106550, 75673, 110000, 83307, 122456, 180836, 210577, 228969, 213487, 210620, 279769, 194729, 139837, 188120, 301559, 300648, 309896, 371894, 350584, 265097, 176862, 192493, 159145, 182079, 165012, 145744, 220469, 215206, 122712, 80477, 37288, 22834, 24638, 124179, -598, -12137, 110864, 147566, 100287, 110190, 147198, 160523]
11025A60523j466o12K3594k4518O6170M7577m8152r0035n0767P903J17488K7947
11013B35652q2984r2318L1854K0158K7850N5232o706l8804l258M4857K7054L0149
11001B48736o1167n5142O9750K0389L9544n7416n8709Q230q502m374J4282j03259
10989E2362l8075N2853O3503R2391K8496M7974n8875n9975K3123J8758k2788l7838
10977A61909P518k7000o2024k4654n4793L6940l3713j8176m762O1103K8939L3044
10965A04331R0625m3882J7618P5634Q946m0500K624K9087n4656p701O0751R9576
10953C42453k6422j94239J6825M9458q527L3170L8144n2473r8351M2659Q8984
10942B31681o6791l4016R0915j2714j7962K3667l0279k2639N7989O0577l6109
$$ y = [160523, 159057, 158445, 182039, 157521, 223691, 271268, 223116, 133081, 82314, 90217, 207705, 235652, 152668, 60350, 92204, 112362, 140212, 195444, 188738, 149934, 146676, 191533, 218587, 248736, 187569, 132427, 202177, 222566, 262110, 204694, 145985, 154215, 145713, 141339, 155621, 52362, 14287, 67140, 130643, 223034, 251530, 299504, 240629, 180654, 203777, 222535, 199747, 161909, 169427, 142427, 80403, 55749, 956, 37896, 4183, -13993, -18755, 42348, 71287, 104331, 194956, 151074, 168692, 244326, 253272, 212772, 215396, 244483, 189827, 182126, 242877, 342453, 316031, 121792, 138617, 188075, 179548, 212718, 250862, 198389, 100038, 142697, 231681, 164890, 130874, 221789, 209075, 191113, 214780, 184501, 161862, 219851, 280428, 244319]
10931B44319l0780M037j3136P0079j203j4339J20513L069j03489J641L7446J8238
10919C36395j25104j22133k8509p063R7636J39054J9606j22968R62N802k5955
10908A67723k0072Q5761J6566J1290j7460o9437L5657P8756K7691n5846j06661
10897A53968k7147o6482Q7359L0239Q2238l6055l8714o5517k3102K0374P7361
10886A94522L0240J778M1427K2377q0408p9926p9669P885J26400L3373j08910
10875A09089k1230N1364k7401J22226J10374j23324M5191P6810k6661j8686M2664
10864C40416K2337n809j16430J3962m2522N4105N8600j5409j07956L5418J19319
10853C56031K8269o2688j04070Q2337N4999J8878J3952o7568j7908k6840M188
$$ y = [244319, 213539, 217576, 204440, 274519, 273316, 258977, 379490, 382559, 279070, 280711, 318157, 336395, 211291, 89158, 60649, 53586, 151222, 290276, 309882, 186914, 187876, 193678, 167723, 147651, 233412, 249978, 261268, 243808, 174371, 210028, 288784, 316475, 260629, 153968, 126821, 60339, 147698, 177937, 260175, 224120, 185406, 119889, 96787, 117161, 194522, 224762, 226540, 267967, 290344, 209936, 130010, 50341, 58226, 184626, 217999, 109089, 87859, 139223, 111822, 234048, 344422, 221098, 266289, 343099, 316438, 297752, 340416, 362753, 356944, 240514, 254476, 211954, 266059, 324659, 309250, 201294, 236712, 356031, 384300, 321612, 217542, 299879, 354878, 373756, 387708, 320140, 302232, 275392, 279580]
10842B79580n2293p9007N3980n3588Q415k217J69929K5852p5321L2015p0113J141
10830B38373n9423j02733J00740J35006J4333M4240j5355j04939l0456P6609R0029
10819C86424k8145M231m0613l4298j4449J6137j217M3098j4823r0228j11406k3722
10807I0989N3238P3153K130K7212k247N4804l1443N9698M7984N6594J9935r9833
10795C52214K7492M1885M3151N9741R5911m1212j30275o0711o383P3394J18056
10784E73263P7037o0997N2880J325q9202o3459O2580J6113L6402P9945P7725O5851
10772H29463J00979j06567O751J5406p5793l3683K329O5163J49660N7485j2235
10761I98958p0251j58642m5098m0654K7613J00420J19265J44118k2168k9492n2337
$$ y = [279580, 227287, 148280, 202260, 148672, 157087, 154870, 324799, 350651, 275330, 307345, 237232, 238373, 178950, 76217, 176957, 311963, 326296, 370536, 355181, 250242, 219786, 296395, 386424, 358279, 362510, 321897, 287599, 273150, 289287, 288070, 331168, 316345, 226117, 114711, 90989, 144227, 217380, 219510, 246722, 244475, 299279, 267836, 327534, 375518, 432112, 452047, 352214, 379706, 421591, 464742, 524483, 620394, 579182, 448907, 388196, 381813, 455207, 573263, 650300, 589303, 642183, 643508, 554306, 490847, 553427, 569540, 605942, 685887, 763612, 829463, 930442, 823875, 830626, 846032, 770239, 736556, 738885, 804048, 953708, 1011193, 998958, 928707, 770065, 724967, 684313, 711926, 812346, 931611, 1075729, 1053561, 1024069, 971732]
10750I71732j45815p7271k8221N6653J3458R1802J30194J6414n3713l3930J9594
10739I60897J09470P2309L4261O4163j648N3623k7319l9687m086L0084m6487j8296
10727A187284N4359m3616j39316j2622J08402R4300l2236j6570j71806n3122l2362
10716I42695J9653J8472j1701L6640K8931P6512o8513j13429o6583M4525K3166
10705I30368L524K2152J3285j490O9852J00454O5874q9635p0180m2367l9000P0237
10693A033074N0098J723j38524j88029q3516J45564m7268r9018l0673N9585q726
10682F94290O3655L1019r9520j12391J308J16533q6900j06545J659M5820r4015
10671D54913K4148L4722j7397M84J163M1309L8341J8175M5721o3734q434L3307
$$ y = [971732, 825917, 748646, 720425, 777078, 790536, 882338, 1012532, 1028946, 975233, 941303, 960897, 1070367, 1142676, 1176937, 1241100, 1239452, 1293075, 1265756, 1226069, 1221983, 1252067, 1205580, 1187284, 1241643, 1198027, 1058711, 1046089, 1154491, 1248791, 1216555, 1199985, 1028179, 975057, 942695, 962348, 980820, 969119, 1005759, 1034690, 1111202, 1042689, 929260, 862677, 907202, 930368, 933892, 956044, 969329, 967839, 1037691, 1138145, 1204019, 1114384, 1044204, 1001837, 962837, 1033074, 1083172, 1084895, 946371, 758342, 674826, 820390, 773122, 674104, 643431, 703016, 694290, 757945, 788964, 689444, 577053, 578361, 694894, 607994, 501449, 503108, 548928, 454913, 479061, 513783, 496386, 496870, 498033, 539342, 577683, 595858, 641579, 577845, 569411, 602718]
10659F02718m9225k46M5453N743J8119Q03K2802m2481p8780J4955l1152J09161
10647F17870R4438r1440J6647K2682K3287O943m3039p0648k7643m2882l5151l971
10635D67093M5056R9098J38433r4912j31515R254J00469M7175m2887n8402M4656
10624F23518P7366O2614k4793j0827l469L0288p7029m5943L618N9667o373N7794
10612G46431M5946j6503P1150J4250n5576l3228M6863M566N8773m4986q7195P4655
10600H25146R5225Q8062j763j8179k7742j8810M8865j191L527K5915l5116r0129
10588H93810O7581Q1354O1911k1896l1429p4270N4887J9459l3708n4695O0743
10577A023747M3706L0645L5091K1012Q728l2510k5275L7221J7097Q0653M7911
$$ y = [602718, 553493, 553247, 598700, 604443, 622562, 623365, 646167, 603686, 524906, 539861, 508709, 617870, 712308, 620868, 637515, 660197, 683484, 690427, 647388, 576740, 549097, 506215, 471064, 467093, 512149, 611247, 749680, 654768, 523253, 532507, 632976, 680151, 637264, 578862, 623518, 700884, 763498, 738705, 727878, 724409, 754697, 677668, 631725, 635343, 695010, 688637, 746431, 792377, 775874, 847024, 861274, 805698, 772470, 819333, 823899, 882672, 837686, 750491, 825146, 920371, 1008433, 1006670, 988491, 960749, 941939, 990804, 989613, 993140, 1019055, 983939, 893810, 961391, 1042745, 1104656, 1082760, 1051331, 977061, 1031948, 1051407, 1017699, 963004, 1023747, 1067453, 1098098, 1133189, 1154201, 1162929, 1130419, 1105144, 1142365, 1159462, 1240115, 1288026]
10566A288026O7331R4877j6511o7303J1074m1846K3027L8791m6373j49925Q5759
10555A286927J46628m4922o5909K0770M1088M9583J2104o618j0793K1858P743
10544A458459M0811R8870k2090o7043J2384k2640q658j232p1830l0952J55469
10533A541548n516l4802j4550j2413J14645J21274p2857k8182J209m0901N9435
10522A628890L1049M5896K2573K4854n382L9164N269N8495j06658m359Q7805k9322
10510A798274n4388K0701J3902P1280R2084l2753M166N1178J56063J61378j1614
10499B270271k8580k073l7426k6031K1874M5755Q7104N7184R5886J50997K0066
10488B655027j02803J9740J9277n3696N4934M8561M5218N5139M8541N8561M5186
$$ y = [1288026, 1355357, 1450234, 1433723, 1366420, 1377494, 1335648, 1358675, 1397466, 1351093, 1201168, 1286927, 1433555, 1388633, 1322724, 1343494, 1384582, 1434165, 1446269, 1439651, 1428858, 1450716, 1458459, 1499270, 1598140, 1576050, 1509007, 1521391, 1498751, 1490093, 1488861, 1417031, 1386079, 1541548, 1536032, 1501230, 1486680, 1474267, 1588912, 1710186, 1637329, 1609147, 1610356, 1569455, 1628890, 1659939, 1705835, 1728408, 1753262, 1747880, 1787044, 1792313, 1850808, 1744150, 1739791, 1827596, 1798274, 1743886, 1764587, 1778489, 1849769, 1941853, 1909100, 1913266, 1964444, 2120507, 2281885, 2270271, 2241691, 2239618, 2202192, 2176161, 2198035, 2243790, 2330894, 2388078, 2483964, 2634961, 2655027, 2552224, 2571964, 2591241, 2537545, 2592479, 2641040, 2686258, 2741397, 2789938, 2848499, 2893685]
10477B893685J3799N8828M7857k5255K1829N9071m2224k2949N7616M0293L3828
10466C136378Q2476R20R1151Q3987J06185k6467J512J48901J20779M6004P4204
10455C866030J0683M5695q139J35515J29715P2971J44263R0181L9232O1967J09019
10444D697132N9602O8815Q2294J39595J07169M695J48586Q2872N8091Q5518J34241
10433E668610J54382J08016Q4791J16618J01563R9458J48480J62296J75491J86925
10423G006630P7292Q2161J44964L05666L26308K59098Q3724K09163K12273J56722
10413H864001K96785L10361K62188K20182J84074L61895K42339K17483K85784
10404A1245092L47625L38070L75929M05076M69608N12234M87319N28195M99216
$$ y = [2893685, 2907484, 2966312, 3014169, 2988914, 3010743, 3069814, 3027590, 3004641, 3062257, 3102550, 3136378, 3218854, 3219774, 3310925, 3394912, 3501097, 3474630, 3476142, 3625043, 3745822, 3791826, 3866030, 3876713, 3922408, 3914269, 4049784, 4179499, 4252470, 4396733, 4486914, 4526146, 4588113, 4697132, 4756734, 4825549, 4907843, 5047438, 5154607, 5159302, 5307888, 5390760, 5448851, 5534369, 5668610, 5822992, 5931008, 6015799, 6132417, 6233980, 6333438, 6481918, 6644214, 6819705, 7006630, 7083922, 7166083, 7311047, 7616713, 7943021, 8202119, 8285843, 8495006, 8707279, 8864001, 9160786, 9471147, 9733335, 9953517, 10137591, 10499486, 10741825, 10959308, 11245092, 11592717, 11930787, 12306716, 12711792, 13181400, 13693634, 14180953, 14709148, 15208364]
10395A5208364M84900O27383O32675O27626P22585P28734P53501Q45516Q29142
10386B1460426R31169R74630J150325J110808J137856J224123J392754J418325
10378C0800416J531038J730556J916038J962913K040916K243995K216737K573763
10370D7016372K827959K876712K941111L265541L366861L396009L609408L756631
10362G3056604L921362L904256L885679L902177L902375L693730L383923L082281
10354A02732387K776357K438934J975843J492580J292662J114064Q77218P04958
10346A15405003L89261L06165M49853O13642O16386Q53618R73683J210452J546495
10337A22364558J771224K011920K201273K520212K682867K673850K798903K848754
$$ y = [15208364, 15693264, 16320647, 16953322, 17580948, 18303533, 19032267, 19785768, 20631284, 21460426, 22391595, 23366225, 24516550, 25627358, 26765214, 27989337, 29382091, 30800416, 32331454, 34062010, 35978048, 37940961, 39981877, 42225872, 44442609, 47016372, 49844331, 52721043, 55662154, 58927695, 62294556, 65690565, 69299973, 73056604, 76977966, 80882222, 84767901, 88670078, 92572453, 96266183, 99650106, 102732387, 105508744, 107947678, 109923521, 111416101, 112708763, 113822827, 114700045, 115405003, 115794264, 116100429, 116550282, 117163924, 117780310, 118633928, 119607611, 120818063, 122364558, 124135782, 126147702, 128348975, 130869187, 133552054, 136225904, 139024807, 141873561]
10329A41873561K761947K718701K516038K353713K095338J724541J510380J130774
10321A58684993O24597q6038o91398j078257j392515j641522j919602k163259
10313A50336999k345110k460496k541497k664744k794952k667939k508380k365819
10305A29988062k211087j977281j761454j564337j320948j024330p02451m07815
10297A19018359k80915j908J25147K19196K92901K69691K87989Q3788j53564n09816
10287A19350868r34215j371393j841809k203253k645568l124046l512136l751230
10279I9967218l930066m049223m069858m124871m223290m124868m027314l855951
10271F7561777l734298l495557l222287l040144k792873k667242k547747k317737
$$ y = [141873561, 144635508, 147354209, 149870247, 152223960, 154319298, 156043839, 157554219, 158684993, 159309590, 159223552, 158532154, 157453897, 156061382, 154419860, 152500258, 150336999, 147991889, 145531393, 142989896, 140325152, 137530200, 134862261, 132353881, 129988062, 127776975, 125799694, 124038240, 122473903, 121152955, 120128625, 119426174, 119018359, 118737444, 118735536, 118860683, 119079879, 119372780, 119642471, 119930460, 120014248, 119860684, 119350868, 118416653, 117045260, 115203451, 113000198, 110354630, 107230584, 103718448, 99967218, 96037152, 91987929, 87918071, 83793200, 79569910, 75445042, 71417728, 67561777, 63827479, 60331922, 57109635, 54069491, 51276618, 48609376, 46061629, 43743892]
10263D3743892k187879k114708j884576j874101j735565j546247j457778j377095
10255B9565943j197099j161068j079885j054443j040686j034546q06343o97143
10247B1494730p85484p03268p38820n72315o45416o57478m92895n59167n75310
10238A5764577m24303m56334l08813l52295k89622l72803n09799l62678l51230
10229A2336700m29937l35959k16503j76158k58032k59631k64798l35498k77654
10220I782530j98212p9915j89013j42304j34013j61214j82980k87790j14579j7215
10210H275295j51116j98672k24123j59877j61001j69917j53364j50486p4036q774
10200F823929j2396j31501j27892j16826q7343o2856n3398l8110r0189j48788
$$ y = [43743892, 41556013, 39441305, 37556729, 35682628, 33947063, 32400816, 30943038, 29565943, 28368844, 27207776, 26127891, 25073448, 24032762, 22998216, 22191873, 21494730, 20709246, 20005978, 19267158, 18694843, 18049427, 17391949, 16899054, 16339887, 15764577, 15340274, 14883940, 14575127, 14222832, 13933210, 13560407, 13050608, 12687930, 12336700, 11906763, 11570804, 11354301, 11178143, 10920111, 10660480, 10395682, 10060184, 9782530, 9584318, 9504403, 9315390, 9173086, 9039073, 8877859, 8694879, 8407089, 8292510, 8275295, 8124179, 7925507, 7701384, 7541507, 7380506, 7210589, 7057225, 6906739, 6832703, 6823929, 6811533, 6680032, 6552140, 6435314, 6347971, 6285115, 6231717, 6193607, 6103418, 5954630]
10190E954630q3423J6808n036m0506p0017r6532j17368m5739j83270q0364n3750
10179E195433o3653j30895q8979n872j6186k4414m0755k7868J1499o9141j73395
10168D565774j58736j3077l1137q5562k0373j0090n1782p4783k0498L1619k7044
10157D104311k3483j9914o5211j13955P110l0514j32759o3718J3441M113r3400
10146C586021n1512J4420p9936o3026j56491m6748m7391m4466k9940N2642j1790
10135C121783m2077o1556j38967j45438r7786l4287J4028N8769n5114k3547N8517
10124B654325o5844l178o1004p7846O483J2033j18644j38556q5600K7856J05452
10113B255477N8077O084m5675q514l6368j12471m5336k3357L5499N7212m2204
$$ y = [5954630, 5871207, 5888015, 5882979, 5842473, 5772456, 5675924, 5558556, 5512817, 5329547, 5249183, 5195433, 5131780, 5000885, 4911906, 4906034, 4889848, 4865434, 4824679, 4796811, 4808310, 4739169, 4565774, 4407038, 4393961, 4362824, 4277262, 4256889, 4246799, 4195017, 4120234, 4099736, 4131355, 4104311, 4080828, 4060914, 3995703, 3881748, 3888858, 3858344, 3725585, 3661867, 3675308, 3679421, 3586021, 3534509, 3548929, 3468993, 3405967, 3249476, 3202728, 3155337, 3110871, 3080931, 3133573, 3121783, 3079706, 3018150, 2879183, 2733745, 2635959, 2601672, 2615700, 2674469, 2619355, 2595808, 2654325, 2588481, 2585303, 2524299, 2446453, 2452936, 2464969, 2346325, 2207769, 2122169, 2150025, 2255477, 2313554, 2319638, 2273963, 2265449, 2229081, 2116610, 2071274, 2047917, 2083416, 2140628, 2098424]
10102B098424p5868k4142Q7025M1917k6163m7402j6983l3357M2642k533o7870
10091A975690M1192K3421n4273k6859q9225L848K4255l6578L7519j9642m815n0161
10079A824372o9223o4110Q9413J12619k6039J23884L1105K5607r3168m3037L2356
10068A943779L1262k9294n2030l8325j3166J5353R5576P6488M0003R4978K27579
10057B392203K48923K88819L91146Q08646J321563J570341M68796j088765j408638
10048D993034j185701p88079l67885l00376j86615p6293j06577r7675j52886o3184
10038A667763o1510L839N8900L5876m6585m046L4165j7395l2581R304L6487m7394
10026A636823k0693j6540k4889p2325K2715R8603k5970k186M6357n3875j5777
$$ y = [2098424, 2022556, 1998414, 2085439, 2127356, 2101193, 2053791, 2036808, 2003451, 2046093, 2043560, 1975690, 2016882, 2040303, 1986030, 1959171, 1869946, 1873794, 1898049, 1861471, 1898990, 1879348, 1874533, 1824372, 1755149, 1691039, 1780452, 1893071, 1867032, 1990916, 2022021, 2047628, 1954460, 1911423, 1943779, 1975041, 1945747, 1893717, 1855392, 1842226, 1857579, 1953155, 2029643, 2069646, 2164624, 2392203, 2641126, 2929945, 3321091, 4129737, 5451300, 7021641, 7490437, 6401672, 4993034, 3807333, 3019254, 2651369, 2350993, 2164378, 2088085, 1981508, 1883833, 1730947, 1667763, 1606253, 1610092, 1668992, 1704868, 1658283, 1654237, 1688402, 1671007, 1638426, 1647730, 1684217, 1636823, 1616130, 1599590, 1574701, 1502376, 1525091, 1623694, 1597724, 1595538, 1641895, 1588020, 1572243]
10015A572243k6494j26217k3635J7111P4233P6960l6810l9557J6113M8052k0413
10004A531586l4501L6212n3716M7930L3606l6656r961l8015m3829j4823K2117
9993A439950K6834N0523R271R2139O1211j24206j16477j05031N3628K6200r4276
9982A319766l295N3404j9074j523L2532K5764j9141n4285l8750m9173J6586M7500
9970A310311M7293M3700O3504L3506r4561p9452L0950L8681M3209J28763J5160
9959A581064k3159r9039m7154J06902J05923M2006m7715m2769j3725P5966M8793
9948A687093M0544M9713O1483O4246J1784j17120p7440R2041M3963r262L4957
9937A882002J443K3019m75Q7370M5364M1133m2492L1462j21477j10396L0084N6830
$$ y = [1572243, 1545749, 1419532, 1395897, 1413008, 1487241, 1564201, 1527391, 1487834, 1503947, 1551999, 1531586, 1497085, 1533297, 1479581, 1527511, 1561117, 1524461, 1514500, 1476485, 1432656, 1417833, 1439950, 1466784, 1517307, 1526578, 1618717, 1679928, 1555722, 1439245, 1334214, 1387842, 1414042, 1319766, 1316471, 1369875, 1350801, 1349278, 1381810, 1407574, 1388433, 1334148, 1295398, 1246225, 1262811, 1310311, 1357604, 1401304, 1464808, 1498314, 1403753, 1324301, 1355251, 1393932, 1437141, 1565904, 1581064, 1557905, 1458866, 1411712, 1518614, 1624537, 1666543, 1618828, 1576059, 1562334, 1638300, 1687093, 1727637, 1777350, 1838833, 1903079, 1914863, 1797743, 1720303, 1812344, 1856307, 1847045, 1882002, 1883445, 1906464, 1905989, 1993359, 2038723, 2079856, 2037364, 2068826, 1947349, 1836953, 1867037, 1923867]
9925A923867N6004p1945O5807j1134n6828L6661J1876Q994K0184n6610n2454J38921
9913B013343P2499O8774Q1144R0724Q5440k8481O9005K4402o6818q7214k6384
9902B296434N4127j5979j8867N8832P8956M2497j7963l0623l1627j0207j02504
9891B303076q9065M6421J8633l5688n1234j2280O84P7799J26034k1541n0784l0758
9879B281297m0982m4476M397L1182J4727K6824p1859P7095M4318Q894l5789o410
9867B289218j4820o422M0371p2941n0389J3705O8569N6911K1831m8103m2333q6058
9855B169539J6578O0704j7598j20923q5333m757J05042j1786J20040R6748k002
9844B326252M8451K12418K8945Q3454L16632M45369K69077K7999k82409l82742
$$ y = [1923867, 1979871, 1907926, 1973733, 1962599, 1905771, 1942432, 1954308, 1963302, 1983486, 1926876, 1874422, 2013343, 2085842, 2154616, 2235760, 2326484, 2411924, 2383443, 2452448, 2476850, 2410032, 2322818, 2296434, 2350561, 2334582, 2315715, 2374547, 2453503, 2496000, 2478037, 2447414, 2415787, 2405580, 2303076, 2214011, 2260432, 2279065, 2243377, 2192143, 2179863, 2180547, 2258346, 2384380, 2362839, 2312055, 2281297, 2240315, 2195839, 2200236, 2231418, 2246145, 2272969, 2201110, 2278205, 2322523, 2331417, 2295628, 2289218, 2274398, 2267976, 2308347, 2235406, 2185017, 2198722, 2267291, 2324202, 2346033, 2297930, 2255597, 2169539, 2186117, 2246821, 2229223, 2108300, 2022967, 2018210, 2123252, 2111466, 2231506, 2328254, 2326252, 2374703, 2587121, 2616066, 2699520, 3016152, 3461521, 3730598, 3758597, 3476188, 3093446]
9834C093446k88821j89765j13343n2746k5865q7412o3280j02501n2733N5606N0379
9823B222965j6774O71M4114r02o220j688L9474l6713J3304R1870j7889j6652J01402
9810B416962J04710K7251r669r449M870q1385j10940M9085R00j4676o699K6009
9798B396969k1050o7891k7946r089l7562m5470r065P5064L534N517k5301Q9672
9786B327382K8819l5776l7603O2080J38861L0456J1641J7112L9733K0527l2760
9775B570472m8599M3832O3539n0741P22m0302l2781J1986j4251l9273J0932L5865
9763B511401m8940J7454O9718J21005m5026j0703n4392j4133j19114L294L5815
9752B466379q054m0951K127L5888k654M4934M4801k0336O0616j0441p7382o8251
$$ y = [3093446, 2804625, 2614860, 2501517, 2448771, 2422906, 2335494, 2272214, 2169713, 2116980, 2172586, 2222965, 2206191, 2206862, 2250976, 2250074, 2243854, 2242166, 2281640, 2244927, 2258231, 2350101, 2332212, 2315560, 2416962, 2521672, 2548923, 2539254, 2529805, 2534675, 2453290, 2342350, 2391435, 2392335, 2377659, 2370960, 2396969, 2375919, 2308028, 2280082, 2270993, 2233431, 2187961, 2178896, 2253960, 2257494, 2263011, 2237710, 2327382, 2356201, 2320425, 2282822, 2344902, 2483763, 2514219, 2525860, 2542972, 2582705, 2603232, 2570472, 2521873, 2565705, 2629244, 2578503, 2579225, 2538923, 2506142, 2518128, 2503877, 2464604, 2475536, 2511401, 2462461, 2479915, 2549633, 2670638, 2625612, 2614909, 2560517, 2546384, 2427270, 2430564, 2466379, 2458325, 2417374, 2419501, 2455389, 2452735, 2497669, 2542470, 2522134, 2582750, 2572309, 2494927, 2426676]
9740B426676j7039L7090J27991P6382m3131o0241L0987l1259J4629m7885p6796
9729B437404q6353K3827J4738l7622L4947j6140k339J18366J130m9979M0121M1550
9717B519650m1288j4211O9854p4184j19932J1697L4892o3790j5502O654p5373
9706B238467m1196P4492J3079q3129p470o366M96L7648J7866K8609J10531p8343
9694B304684r2021p5478m7303L6495j0797o2392n7250k149J38656P2096m0179
9683B164362o4884J00126O6232l4868m5429o2989r8967m8111K1906J6470j7451
9672A996397M697p2722q0053M0391J02921J6227n1417n1205M9733j8005l2986
9661A903978k2016J3934J2096o9673n0954L6485Q223l0979q1864m1881j2639k923
$$ y = [2426676, 2409637, 2446727, 2574718, 2651100, 2607969, 2547728, 2578715, 2547456, 2562085, 2514200, 2437404, 2351051, 2374878, 2389616, 2351994, 2386941, 2370801, 2368462, 2486828, 2487958, 2437979, 2478100, 2519650, 2478362, 2464151, 2534005, 2459821, 2339889, 2351586, 2386478, 2322688, 2307186, 2313840, 2238467, 2197271, 2271763, 2284842, 2201713, 2194243, 2187877, 2188373, 2226021, 2243887, 2272496, 2383027, 2304684, 2212663, 2137185, 2089882, 2126377, 2115580, 2053188, 1995938, 1993789, 2132445, 2204541, 2164362, 2099478, 2199604, 2265836, 2230968, 2185539, 2122550, 2023583, 1975472, 1997378, 2013848, 1996397, 2001094, 1928372, 1848319, 1888710, 1991631, 2007858, 1956441, 1905236, 1954969, 1936964, 1903978, 1881962, 1895896, 1907992, 1838319, 1787365, 1823850, 1832073, 1801094, 1719230, 1677349, 1664710, 1661787]
9649A661787L4914m8728q1936O9372J08113J0880o8721K9552P1510J0938p4542
9638A723139l6159m7510K1598m9543j29571m0616l7071J02295L1591n4576N1364
9627A534941J3410p7243m4194r842K0112k1611n8172M1823j9004o6177J3333J27516
9615A454892j1355r3013o2256L7617J4477P445M6801j0683K125q7562M0884L9824
9603A379196r9532o0787j24886J4589M8476O9935k5591m0731K6677o3838Q157
9592A131665O8177N5076K8269m2732m269L067q9359j00887j0650j053R6931m1583
9580A092652J8605L6118J1732j01653k6512Q8451m3283m1936P0369N8899l9609
9569A123833j3466J3887q7675p1681K1291l2252o7170N441J14141J3946J8598
$$ y = [1661787, 1696701, 1647973, 1566037, 1635409, 1743522, 1754402, 1685681, 1715233, 1786743, 1797681, 1723139, 1686980, 1639470, 1661068, 1611525, 1481954, 1441338, 1404267, 1506562, 1538153, 1483577, 1534941, 1548351, 1471108, 1426914, 1417072, 1437184, 1415573, 1357401, 1399224, 1380220, 1314043, 1327376, 1454892, 1443537, 1350524, 1288268, 1325885, 1340362, 1347807, 1394608, 1383925, 1386050, 1298488, 1339372, 1379196, 1279664, 1218877, 1093991, 1108580, 1157056, 1226991, 1201400, 1160669, 1187346, 1123508, 1131665, 1199842, 1254918, 1283187, 1240455, 1236186, 1239253, 1149894, 1049007, 1038357, 1037304, 1134235, 1092652, 1111257, 1147375, 1159107, 1057454, 1030942, 1119393, 1076110, 1034174, 1104543, 1163442, 1123833, 1110367, 1124254, 1036579, 964898, 986189, 953937, 886767, 892208, 1006349, 1020295, 1038893]
9558A038893J0227N4379m2650j10050p621j870M214O0114k4331M7213K6091j6613
9546A037996N458L6176l9846n8277K457K3313k8336N1243J03994Q1524j6863m3378
9534A155461q4451j21458n7524j53302j0845J10235R676M3136J42603K5545j04934
9523I54142l9112j6437Q4325L8695l1413m477K8473J21692M3208l9332J3200O0178
9511A213142K6353P2975k164R5372k7284o7825k3692J08610J37931L1415k1898
9500A542935J6268L6031j71420q4557o5779m9730j22312j2893M3042k0543o7076
9489A043966l5318o0058M1335L7545K5134L2701L3815k7740k5993L3729N1095
9478A150211L6274K5282K5693L4462K118M3781P2651O3715L6283P7560j2123m381
$$ y = [1038893, 1049120, 1103499, 1060849, 950799, 943178, 941308, 945522, 1005636, 981305, 1028518, 1054609, 1037996, 1043454, 1079630, 1039784, 981507, 983964, 1007277, 978941, 1030184, 1134178, 1215702, 1198839, 1155461, 1071010, 949552, 892028, 738726, 727881, 838116, 847792, 890928, 1033531, 1059076, 954142, 915030, 898593, 982918, 1021613, 990200, 985723, 1014196, 1135888, 1179096, 1139764, 1152964, 1213142, 1239495, 1312470, 1310306, 1405678, 1378394, 1310569, 1286877, 1395487, 1533418, 1564833, 1542935, 1559203, 1595234, 1423814, 1339257, 1273478, 1223748, 1101436, 1088543, 1131585, 1111042, 1043966, 1008648, 948590, 989925, 1027470, 1052604, 1085305, 1119120, 1091380, 1065387, 1099116, 1150211, 1186485, 1211767, 1237460, 1271922, 1274040, 1317821, 1390472, 1454187, 1490470, 1568030, 1555907, 1551526]
9466A551526J6675n7769q936J0841j18152k5039m9679r5993Q211j26344j28181
9455I77160j36938p2211N6807K4827j9538J21492N3960O160q719o9315m5985O6726
9443I54426l6351m8822R3934j6413M3339J15318J52224J42573P3420l9510j62332
9432A271806j19334K1622K0018J9190P8993o8784r9268q4577O4699R247p4234
9421A039378p2749n7959M6106m2500R74j7882r0503q3204m9762q273p1138q0439
9409E12049L1022R572j4601L2931K9721L2618J4716J03413R1109k6674O7986N0043
9397I33905J6608k4523o3897p7456J5088N489M7967p6115p4207M0321L7109p7982
9385G02307j15226r8826L539J6665K8855j2912j1255M2190j23984j8537o8637
$$ y = [1551526, 1568201, 1510432, 1501496, 1512337, 1394185, 1369146, 1319467, 1223474, 1231685, 1105341, 977160, 840222, 768011, 824818, 849645, 830107, 951599, 1005559, 1011719, 1003000, 933685, 887700, 954426, 918075, 869253, 963187, 946774, 990113, 1105431, 1257655, 1400228, 1473648, 1434138, 1271806, 1152472, 1174094, 1194112, 1213302, 1292295, 1223511, 1124243, 1039666, 1104365, 1113612, 1039378, 966629, 908670, 954776, 912276, 913250, 895368, 804865, 721661, 671899, 663626, 592488, 512049, 543071, 552643, 538042, 570973, 600694, 633312, 648028, 751441, 842550, 815876, 883862, 933905, 950513, 925990, 862093, 784637, 799725, 805214, 853181, 777066, 702859, 743180, 780289, 702307, 587081, 488255, 491794, 508459, 537314, 524402, 513147, 555337, 431353, 412816, 344179]
9374C44179o0112J2777J13790K0639J7547M2457k0293J8832L2975J1243R185o0118
9362D83101j05927m8596o821j6916J09061Q6896L8821n710N3015m3860m1293J08334
9350F10105N204j425l3131M7115j0694K875j6297q9304j0675K2749M0207r763
9338E56966n2976k8784o256N8784O1364L3950J3840J8698J01164J44750l7597
9327H63903o3424m6092o3545P2855M84p853j8638K8528l7401j2453j0698p167
9315F98499j8182o557m5799l0890M1947O8546j0757M2524k4796P475J3563j6227
9303G19346j49429n724J4655O5244J37128O4452K6349K5277L7845K0654P3386
9292A029183O3057O4949j1000m5068j7303R544q8768j04883p0958Q993N3791Q779
$$ y = [344179, 284067, 296844, 410634, 431273, 448820, 491277, 470984, 489816, 522791, 534034, 543219, 483101, 377174, 328578, 321757, 304841, 413902, 500798, 539619, 533909, 586924, 543064, 501771, 610105, 615309, 613884, 580753, 627868, 617174, 620049, 603752, 514448, 503773, 526522, 566729, 556966, 503990, 475206, 468950, 527734, 589098, 623048, 636888, 655586, 756750, 901500, 863903, 800479, 754387, 690842, 763697, 764181, 756328, 737690, 766218, 728817, 716364, 705666, 698499, 680317, 673760, 627961, 597071, 639018, 707564, 696807, 739331, 714535, 722010, 735573, 719346, 569917, 564193, 578848, 644092, 781220, 845672, 872021, 897298, 935143, 955797, 1029183, 1092240, 1157189, 1146189, 1101121, 1083818, 1093362, 1004594, 899711, 828753, 837746, 891537, 900316]
9280I00316q1161K2378L5517k5602P9049K8790N9691j1133j483k6466M1926k2082
9268I99740j59488O6668J77640J5361M0908k2866m7606p974N2150l916J8875o1393
9256A068099N4973P7321q9138q1481J06339L5863n013N5151N2601l4668o6743
9245A173304j1014O989j6685J07326m7285r5305N026o5893k3558P0758O244R5635
9233A205542N2107J1682n4127o1989J05847J36891P4065J5340l4036o3395K5089
9222A413016L6709j1259j43519k6496Q4187J05869M6519P183j3866n3963L9969
9211A484349M1479m0174k3473m8897L060N7066L1784j034M5855K5368M2684L9513
9199A657580n648K9015M5757N4642L0404l1667N990l028P2285L1125m2892O8824
$$ y = [900316, 819155, 841533, 877050, 851448, 930497, 959287, 1018978, 1007845, 1006362, 979896, 1021822, 999740, 840252, 906920, 1084560, 1099921, 1140829, 1117963, 1070357, 1062383, 1114533, 1110617, 1129492, 1068099, 1123072, 1200393, 1111255, 1029774, 1136113, 1171976, 1166963, 1222114, 1274715, 1240047, 1173304, 1162290, 1169279, 1152594, 1259920, 1212635, 1117330, 1122356, 1056463, 1032905, 1103663, 1109907, 1205542, 1257649, 1269331, 1215204, 1153215, 1259062, 1395953, 1470018, 1485358, 1451322, 1387927, 1413016, 1449725, 1438466, 1294947, 1268451, 1352638, 1458507, 1505026, 1512209, 1498343, 1444380, 1484349, 1525828, 1485654, 1462181, 1413284, 1416344, 1473410, 1505194, 1504160, 1550015, 1575383, 1618067, 1657580, 1651932, 1680947, 1726704, 1781346, 1811750, 1780083, 1786073, 1783045, 1855330, 1886455, 1843563, 1912387]
9187A912387J07398M2630M7685L431N549J25129Q5092J5369l4130L0794R7615
9176B438949J22581R6380R4878Q0117J39373J44733J47504K28000J85973K42664
9166C921152J61194K46403M40045L88383L45305M33238N62016N67057P74657J001901
9156H841351J134483J373409J573219J830246K070490K266889K560837K832216
9148B4483140K966973L234178L310525L328662L094314K543327J566429K06749
9140D4734297j068194k198631k816618k931160k743273k397831j973101j533664
9132B7071825r30478m51305j7901N03518J139035J624164K014371K471890L017722
9123C6442841L474470L749216M175832M525057M946908N482479O054146O580758
$$ y = [1912387, 2019785, 2062415, 2110100, 2113531, 2119080, 2244209, 2329301, 2344670, 2310540, 2341334, 2438949, 2561530, 2657910, 2752788, 2832905, 2972278, 3117011, 3264515, 3492515, 3678488, 3921152, 4082346, 4328749, 4768794, 5157177, 5502482, 5935720, 6497736, 7064793, 7839450, 8841351, 9975834, 11349243, 12922462, 14752708, 16823198, 19090087, 21650924, 24483140, 27450113, 30684291, 33994816, 37323478, 40417792, 42961119, 44527548, 44734297, 43666103, 41467472, 38650854, 35719694, 32976421, 30578590, 28605489, 27071825, 26141347, 25690042, 25672141, 26175659, 27314694, 28938858, 30953229, 33425119, 36442841, 39917311, 43666527, 47842359, 52367416, 57314324, 62796803, 68850949, 75431707]
9115G5431707O832951O710750O248661N546468M688936L778894K973964K379455
9107A14591786K014813J486643Q54694j23428j100444k243155l291955l802058
9099A08386896m242882m255336m040686l761159l333508k694957j955296j086446
9091H3016626j32915O75697J705788K552858L362518M027666M685364N437950
9083A05331552N947368O592902P127685P669262Q170167Q476053Q336655P931137
9075A65582781P314660O711165O043886N202767L751110J734450q51472l749558
9067A91739789o210778q169584r378404j0087124j0271626r893857r045657p944870
9059A20737889o762045n520034m525676l594555k562661j536553o44375K72392
$$ y = [75431707, 82264658, 88975408, 95224069, 100770537, 105459473, 109238367, 112212331, 114591786, 116606599, 118093242, 118947936, 118824508, 117724064, 115480909, 112188954, 108386896, 104144014, 99888678, 95847992, 92086833, 88753325, 86058368, 84103072, 83016626, 82883711, 83559408, 85265196, 87818054, 91180572, 95208238, 99893602, 105331552, 111278920, 117871822, 124999507, 132668769, 140838936, 149314989, 157651644, 165582781, 172897441, 179608606, 185652492, 190855259, 194606369, 196340819, 195489347, 191739789, 185529011, 177359427, 167981023, 157893899, 147622273, 137728416, 128682759, 120737889, 113975844, 108455810, 103930134, 100335579, 97772918, 96236365, 95591990, 95864382]
9051I5864382J172012K004536K840578L628260M251045M962323N384414N947013
9043A26054563O317642O448326O155656N550982M707776L441729J756306j40646
9035A60292334k223087m360031o326377p610676q542516q955502q973517q468363
9027A04832265p934093p291245o563707n939270n330766m564027l958167l316711
9019E9934279k872903k433962j872568j491579r66646k75126M50187J090486J636947
9010E3199115K318908K718006K774927K674118K177089J546047P96321j38155
9002F8066376j018752k098315l084295l819596m339889m578686m473283l961104
8994D0692456l483427k985924k715724k255213j885506j851575j627724j451610
$$ y = [95864382, 97036394, 99040930, 101881508, 105509768, 109760813, 114723136, 120107550, 126054563, 132372205, 138820531, 144976187, 150527169, 155234945, 158676674, 160432980, 160292334, 158069247, 153709216, 147382839, 139772163, 131229647, 122274145, 113300628, 104832265, 96898172, 89606927, 83043220, 77103950, 71773184, 67209157, 63250990, 59934279, 57061376, 54627414, 52754846, 51263267, 50296621, 50021495, 50471682, 51562168, 53199115, 55518023, 58236029, 61010956, 63685074, 65862163, 67408210, 68204531, 68066376, 67047624, 64949309, 61865014, 58045418, 53705529, 49126843, 44653560, 40692456, 37209029, 34223105, 31507381, 29252168, 27366662, 25515087, 23887363, 22435753]
8986B2435753j383410j321349j293509j311787j154764r79419r57884r73075q51139
8977A2209417o87051o34815n82317n10006m37107k75383l04388k87125q3749j50254
8967H257222j73080j10398r1861j46166p1658k9145p3199j00011l5390n8066n7822
8956G310426J48075N7339o4207n8476j04573q2463L1902Q7566J21371J38005J16031
8945G700996J25645Q0859J30430K17250K52644P5338J26827J72058L88596L95025
8935I665668M74260M02872M58823N17586N48349N94967O17352O80121O99476Q39590
8925A5499064P60910P78478P51086Q61477Q55103R37665R51173R47142R40517
8916B3282615J058189J050158J109373J176017J147769J236693J368925J397568
$$ y = [22435753, 21052343, 19730994, 18437485, 17125698, 15970934, 14991515, 14033631, 13060556, 12209417, 11522366, 10887551, 10305234, 9795228, 9358121, 9082738, 8778350, 8491225, 8407476, 8257222, 8084142, 7973744, 7881883, 7735717, 7664059, 7634914, 7561715, 7461704, 7426314, 7368248, 7310426, 7458501, 7515840, 7451633, 7393157, 7288584, 7206121, 7238023, 7325589, 7446960, 7584965, 7700996, 7826641, 7907500, 8037930, 8255180, 8507824, 8583162, 8709989, 8882047, 9270643, 9665668, 10139928, 10542800, 11001623, 11519209, 12067558, 12662525, 13279877, 13959998, 14659474, 15499064, 16259974, 17038452, 17789538, 18651015, 19506118, 20443783, 21394956, 22342098, 23282615, 24340804, 25390962, 26500335, 27676352, 28824121, 30060814, 31429739, 32827307]
8908C2827307J549712J588414J704080J614754J168756O84280K57317j52546o59410
8899D0582664p38113o96750n82356l61558o4990K27429N95631Q82261J112112
8890D0956330J143757J178055J123071R65929O14886N97698O23775N78164O76465
8881D8458130R12174J114542J272597J568886J916019K194908K442432K651122
8873F2530810K846074K865497K867551K418832J694503N50537k40552o53258q42940
8864G4037054r70373j210645j208998j250908j540939j598317j651148j782194
8856F2823532j791057j809172j798834j680934j400667j061803p91948m38352
8848E2050765j26002L07168P50102J260426J708074K014621K442834K542411K565639
$$ y = [32827307, 34377019, 35965433, 37669513, 39284267, 40453023, 41137303, 41394620, 41242074, 40582664, 39844551, 39147801, 38565445, 38203887, 38138897, 38366326, 38961957, 39844218, 40956330, 42100087, 43278142, 44401213, 45367142, 45982028, 46579726, 47203501, 47781665, 48458130, 49370304, 50484846, 51757443, 53326329, 55242348, 57437256, 59879688, 62530810, 65376884, 68242381, 71109932, 73528764, 75223267, 75773804, 75533252, 74879994, 74037054, 73066681, 71856036, 70647038, 69396130, 67855191, 66256874, 64605726, 62823532, 61032475, 59223303, 57424469, 55743535, 54342868, 53281065, 52489117, 52050765, 51924763, 52231931, 52982033, 54242459, 55950533, 57965154, 60407988, 62950399, 65516038]
8839F5516038K504862K237189J853210J297825O56835N625p30105j248620j724623
8830G0368236k040432k090506k209374k223520k091905j950791j957585j868651
8822E3935472j776426j683596j474000j302229j095331r55082p36471o84724p83673
8813D3443940r25539r22293r76014r88339p17292o45083n73371l84869k27062
8804C7084078L558p508j0318p4311j76740k27852l29299l25054l48642l33070
8794C5254842m67021m78461l92381m55286m37040p49520j028643j191214j281566
8785B8773710j500409j610238j737199j646791j582108j420717j313792j151667
8777A6810789q61757o94560o36095m66034l34836l01134q2477J43200J73454j8656
$$ y = [65516038, 68020900, 70258089, 72111299, 73409124, 74065959, 74071584, 73341479, 72092859, 70368236, 68327804, 66237298, 64027924, 61804404, 59712499, 57761708, 55804123, 53935472, 52159046, 50475450, 49001450, 47699221, 46603890, 45648808, 44912337, 44227613, 43443940, 42518401, 41596108, 40620094, 39631755, 38914463, 38269380, 37696009, 37311140, 37084078, 37087636, 37080128, 37069810, 36995499, 36818759, 36590907, 36261608, 35936554, 35587912, 35254842, 34787821, 34309360, 33916979, 33461693, 33024653, 32275133, 31246490, 30055276, 28773710, 27273301, 25663063, 23925864, 22279073, 20696965, 19276248, 17962456, 16810789, 15949032, 15254472, 14618377, 14152343, 13817507, 13516373, 13433896, 13577096, 13750550, 13731894]
8767A3731894j35542j38570j35520k79987l89434k80276k53115k51692k09980
8758A1657778j83645k44464k83001m05551m11117m28462n75712n90143o35682
8749G900001n92806l74662l68625m78877m39917l59770k52933k19578k59003k08788
8739D345042j58447K571p2229j18821r7993J5547k2283k42320m2850j4352o2638
8728C531227q2022j42106r6570j16288j19082p7137o3952j7256n6412j60161o3041
8717B537200n009N4124J2530J0289q5136j1872L519N8941M2784Q280J01577L8345
8705B765572J34555L5246p8k8234j23603O3865J36447O9842R907J4038j20538
8694B957019l6061L5624p9453j05708K3792n6902o3153L4350M980k6810N543l5999
$$ y = [13731894, 13596352, 13457782, 13322262, 13042275, 12652841, 12372565, 12119450, 11867758, 11657778, 11474133, 11229669, 10946668, 10541117, 10130000, 9701538, 9125826, 8535683, 7900001, 7307195, 6932533, 6563908, 6085031, 5645114, 5285344, 5032411, 4812833, 4553830, 4345042, 4186595, 4189166, 4116937, 3998116, 3900123, 3915670, 3893387, 3651067, 3608217, 3593865, 3531227, 3449205, 3307099, 3210529, 3094241, 2975159, 2898022, 2834070, 2816814, 2760402, 2600241, 2537200, 2532191, 2586315, 2598845, 2609134, 2523998, 2512126, 2515645, 2574586, 2617370, 2625650, 2727227, 2765572, 2900127, 2935373, 2935295, 2907061, 2783458, 2847323, 2983770, 3053612, 3063519, 3077557, 2957019, 2920958, 2956582, 2877129, 2771421, 2795213, 2738311, 2675158, 2709508, 2714488, 2687678, 2693221, 2657222]
8682B657222j33889q0804j8876l3626r0688r457K175O8868j16710N0853O2723
8671B357791k2431O0463o6643O8968R8302J33379J17275J53426N6473j04654o5840
8660B786509j5745J8866P1527m8549r9788n1563J9647p0819M818k9653m2125j20467
8648B422658J3949K5235m5150L0253m4090q1944o5710J7365O0414K5590Q487n254
8636B361803M2880N8449O1325K04402K56251J22340P7620R4394J43556R0351J57954
8625C671325Q9792J13370O2010j0475l7349k0822J41030o8096r6536k4429m6200
8614C773620j98325k67587r4542n9482l4301j07196j70750q3934o2543l786K0963
8603B712137N1684J9478k9128q5454l9772m247r0059k01335r1549q8428j96693
$$ y = [2657222, 2523333, 2442529, 2423653, 2390027, 2299339, 2289882, 2292057, 2360925, 2244215, 2295068, 2357791, 2335360, 2395823, 2329180, 2398148, 2496450, 2629829, 2747104, 2900530, 2957003, 2852349, 2786509, 2770764, 2789630, 2861157, 2812608, 2712820, 2661257, 2680904, 2610085, 2614903, 2585250, 2543125, 2422658, 2436607, 2461842, 2416692, 2446945, 2402855, 2320911, 2255201, 2272566, 2332980, 2358570, 2367057, 2361803, 2404683, 2463132, 2524457, 2728859, 2985110, 3107450, 3185070, 3279464, 3423020, 3513371, 3671325, 3761117, 3874487, 3936497, 3926022, 3888673, 3867851, 4008881, 3940785, 3844249, 3819820, 3773620, 3575295, 3307708, 3213166, 3153684, 3119383, 3012187, 2841437, 2757503, 2694960, 2691174, 2712137, 2763821, 2783299, 2754171, 2668717, 2628945, 2624698, 2534639, 2333304, 2241755, 2153327, 1956634]
8592A956634j32582n8852j19767j08769p9476j12607R139q71l3383k6202q795
8581A284469l9542r9638J6787n197l3205j2461n3225l4579r2545K9112m935o213
8569I48828l5977J00638P7495k7873n6400j80625j09768M6888J55859M0998p1477
8558H88586l9834l6588k9476L141J36528j6555l2768K8931M6394L1121j29283
8547H50197j52938l8803p674K1168K0978L2447j7281r646N1273l5681Q1552l213
8535G92379l8073N0077K0054L552j13849K5862L7480J4850l6074j8999n6379M0763
8523G21643N9922J0453j26097L625l200k2136n3982K3911L0289Q1324L4176M082
8511G64010l1495n5964k6271m7611l0161m3112k6033N0648O3618l1513k8290k3625
$$ y = [1956634, 1824052, 1765200, 1645433, 1536664, 1457188, 1344581, 1353720, 1352849, 1319466, 1293264, 1284469, 1244927, 1145289, 1162076, 1156879, 1123674, 1111213, 1057988, 1023409, 930864, 959976, 955041, 948828, 912851, 1013489, 1090984, 1063111, 1006711, 826086, 716318, 763206, 919065, 960063, 888586, 848752, 812164, 782688, 785829, 922357, 905802, 873034, 901965, 948359, 979480, 850197, 697259, 658456, 650782, 671950, 692928, 725375, 708094, 698448, 749721, 714040, 795592, 792379, 754306, 804383, 824437, 827989, 714140, 740002, 777482, 792332, 756258, 737259, 680880, 721643, 781565, 792018, 665921, 669546, 666346, 644210, 590228, 614139, 644428, 725752, 759928, 764010, 732515, 676551, 650280, 602669, 572508, 529396, 503363, 554011, 617629, 586116, 557826, 534201]
8499E34201k16k1251L6696m1886K9922O3874J00274o1145m848M2341k317j8502
8487F57143O7771J74216L0475P8355J8559p2055j03775j05301n0644R3536J17900
8476I06180k1614k0824O8064N4833Q3652Q984j01549n9643k465J6201J2030n9149
8464H84700o0635O42L1919M3068k8317k8342O575q317k1897K4829J1202m4838
8452H10589p7913q6102L282L8395L3138p5142l8785L4007J9695R342Q6000N1217
8440H07723O1647K1026O1561M3154Q0702l4137K6825M2275o4797j43059j8038
8429H84882Q9887J07746l0477j00740j27208R913M4636N0874r3945r9683K1756
8418G57641n2021J0268J3080M3670n6445K6430K072n3464j4814l7022k0929j04111
$$ y = [534201, 533985, 512734, 549430, 507544, 537466, 601340, 701614, 640469, 635621, 677962, 675645, 657143, 724914, 899130, 929605, 1007960, 1026519, 954464, 850689, 745388, 694744, 788280, 906180, 884566, 863742, 931806, 986639, 1070291, 1079275, 977726, 918083, 915618, 931819, 943849, 884700, 824065, 824707, 856626, 899694, 871377, 843035, 849610, 841293, 819396, 844225, 855427, 810589, 732676, 646574, 649856, 688251, 721389, 646247, 607462, 641469, 661164, 670506, 756506, 807723, 869370, 890396, 951957, 995111, 1075813, 1041676, 1068501, 1110776, 1045979, 902920, 884882, 974769, 1082515, 1052038, 951298, 824090, 834003, 878639, 929513, 835568, 735885, 757641, 705620, 715888, 728968, 772638, 716193, 742623, 744695, 691231, 676417, 639395, 618466, 514355]
8406E14355p615M9361O2778N531J6497r99N1314J34212N0252m1782l3254M517
8394H05167K0398L2522l2816j7828P1717P7554j40864j42169r3283L0682J1313
8383F22393n041R9184j8113j42015L0902K6949l0883j9201P6445j6537N109P929
8371F37121J859k9657o8569k0006j5631J30874r342r7596J0138K6418m6413k0627
8359D98569L8823j3075n1275m1669J4832K4266K4010m1590m2662K0831J15493
8348E46553n5879j00623p850j8794k1342J19627R0897J0699p5427r7364j22399
8337B68098N8037M6009O9692R8149o9005o6567M293l1106l5293N695O6695J5239
8325D29936l1123Q983P3813l9478j56898K4709K5568L7285J7694N906m3479r7362
$$ y = [514355, 506740, 556101, 618879, 624410, 640907, 639908, 691222, 825434, 875686, 833904, 800650, 805167, 825565, 858087, 825271, 807443, 879160, 956714, 815850, 673681, 580398, 611080, 622393, 617352, 716536, 698423, 556408, 587310, 614259, 583376, 564175, 640620, 624083, 629192, 637121, 638980, 609323, 540754, 520748, 505117, 635991, 626649, 529053, 539191, 565609, 519196, 498569, 537392, 524317, 473042, 431373, 446205, 470471, 494481, 452891, 410229, 431060, 546553, 490674, 390051, 382201, 363407, 342065, 461692, 552589, 563288, 487861, 390497, 268098, 326135, 372144, 441836, 539985, 470980, 404413, 408706, 377600, 342307, 348002, 414697, 429936, 398813, 407796, 481609, 442131, 285233, 309942, 335510, 372795, 390489, 396395, 352916, 255554]
8313B55554J9828j2407o000L7923K6635K7315J8071k5705n6574O7195R2847P2161
8301E16843j33119M0213N2844p695p9486o2849L2869j036q8040J9932Q6028j9308
8289C57196k3365N4736p6475o4424q5481O5439J30376k529o9745r6174l8188K3023
8277A74389N2899L6366p490L8515M4048l7787l7639K1111M7977L6469K6401J6219
8265D11478N7397j1923m5383p7787J603k1345m3295J1493N7757Q826k1443k7575
8253B99803L9455r567J0233J5089l3401L2019m124L2986J7548O4556o270j10424
8241C47903L9028n5557j03040J00369j8752j3711R677k7448p2403r3559N0381
8230A62888K8571M0714j9210m2828n5060P9034k6830O0629R2107M4333o478o7902
$$ y = [255554, 275382, 262975, 256975, 294898, 321533, 348848, 366919, 341214, 284640, 351835, 444682, 516843, 383724, 423937, 476781, 469086, 389600, 326751, 359620, 358584, 270544, 290476, 376504, 357196, 333831, 388567, 312092, 247668, 162187, 227626, 358002, 355473, 285728, 189554, 151366, 174389, 227288, 263654, 256164, 294679, 338727, 300940, 263301, 284412, 332389, 368858, 395259, 411478, 468875, 456952, 411569, 333782, 335385, 314040, 270745, 282238, 339995, 348821, 327378, 299803, 339258, 329691, 339924, 355013, 321612, 353631, 349507, 382493, 400041, 464597, 458327, 347903, 386931, 331374, 228334, 328703, 309951, 296240, 305917, 278469, 206066, 112507, 162888, 191459, 232173, 212963, 170135, 115075, 194109, 167279, 227908, 320015, 364348, 357870, 289968]
8218B89968o5340k2733O2712J40749J5596o4953n4611K2237l1766J1909r7952
8207B05816L3030O0866p4815n0608k5338o667l997M7222L8911m7740n9422o6078
8195E1180O1933O5797O0009J6740N1455J12600K8154o4859r5059k7552j7590l4297
8183B08511K3783P7998K6954M1536P5254m8205n4805p9944J25594J28366m7959
8172D77083j75243j00814K3521M4322O4025J40227K76103K06444K65031L09443
8162A530142J78688p3728l80964k68382j49762j69778j44855l3028q5185p0857
8152C32291m9223m5210J1573p3510J2282N9803l83K3790L7679j04213K5221Q0162
8140C10262k9639j0657L4993Q8583l6106o0824n6301q076o145M2881k0714J33260
$$ y = [289968, 224628, 201895, 264607, 405356, 420952, 355999, 301388, 323625, 291859, 303768, 205816, 238846, 299712, 224897, 174289, 148951, 142284, 138287, 185509, 224420, 176680, 117258, 51180, 113113, 178910, 238919, 255659, 307114, 419714, 447868, 383009, 287950, 260398, 242808, 208511, 232294, 310292, 337246, 378782, 454036, 405831, 351026, 271082, 396676, 525042, 477083, 301840, 201026, 224547, 268869, 332894, 473121, 749224, 955668, 1220699, 1530142, 1708830, 1635102, 1254138, 985756, 835994, 666216, 521361, 488333, 403148, 332291, 283068, 237858, 249431, 175921, 188203, 248006, 247623, 271413, 309092, 204879, 230100, 310262, 280623, 269966, 304959, 393542, 357436, 296612, 240311, 232235, 226090, 268971, 248257, 381517]
8128C81517J72931p246k1695P4124M2414J26792L43927J41396O5386j14390k32649
8117I72507k42241j19786j70038j03827r6136j5353k2550l7307k0960L0127J6510
8106A90946L7653M2024l8643L5643P049j226R8070l3454k7826K7186o9258l4386
8094B33778p1147k0550K1430o216j5126j0147k8074L1963J18780K9684L650q4895
8082B03130k2084L2282o4509r304Q1984J6456O2969M6388L7219L2135M3748o2287
8070C98127r0847K5896k6540M1473J04143O5452m7166K043J89111J20814J6995
8059G99501r3040n9228J64400J19472Q2775P8285q1482j119J27479q956l1991
8048A096096J7518J96761K5458n2997m2724K7371J04451k7648p7172j18664l1067
$$ y = [381517, 554448, 547202, 525507, 599631, 642045, 768837, 1112764, 1254160, 1319546, 1205156, 972507, 730266, 610480, 440442, 336615, 240479, 225126, 202576, 165269, 144309, 174436, 190946, 228599, 270623, 231980, 267623, 274672, 273446, 371516, 338062, 310236, 337422, 268164, 233778, 162631, 142081, 163511, 157295, 142169, 132022, 103948, 135911, 254691, 284375, 288025, 203130, 181046, 213328, 148819, 139515, 221499, 237955, 300924, 347312, 384531, 416666, 460414, 398127, 307280, 333176, 306636, 348109, 452252, 517704, 470538, 472581, 661692, 782506, 799501, 706461, 647233, 811633, 931105, 1013880, 1092165, 1010683, 1009564, 1137043, 1128087, 1096096, 1113614, 1310375, 1335833, 1282836, 1240112, 1267483, 1371934, 1344286, 1267114, 1148450, 1117383]
8037A117383l4422L0467n9393o3071K37n3889n2754J6038k0597Q1078J31243N9932
8025A152252J3708k4841R453Q1290Q0668N3702n198J55356K06248K85395L99280
8014B407313K59994L41345N68034N60614J98486k01005n28860n48735l88233k61114
8004B407839j44194j32343M1949K68979M34772N11654L09170l4122m39787o00010
7994B623907o03682l63187k52132j83035q8793m2983l3189l4163j79481j33308
7984G09954J3837J62499J05722k443K1015k2659J66151R6557J30655R2390J5401
7973A489079j9731P8055J66235K66864L45120K83955K48877K63927O2775j67815
7963C017341k42338l09968o8853j60641j00315K83035M38858J52398k18976l44624
$$ y = [1117383, 1082961, 1113428, 1054035, 990964, 991201, 937312, 884558, 900596, 879999, 961077, 1092320, 1152252, 1165960, 1141119, 1150572, 1231862, 1312530, 1366232, 1361034, 1516390, 1722638, 2008033, 2407313, 2667307, 3008652, 3576686, 4137300, 4335786, 4134781, 3605921, 3057186, 2668953, 2407839, 2263645, 2131302, 2173251, 2442230, 2877002, 3388656, 3697826, 3663704, 3223917, 2623907, 2020225, 1657038, 1404906, 1221871, 1133078, 1090095, 1056906, 1022743, 843262, 709954, 723791, 886290, 992012, 989569, 1010584, 987925, 1154076, 1250633, 1381288, 1473678, 1489079, 1469348, 1547403, 1713638, 1980502, 2325622, 2609577, 2858454, 3122381, 3185156, 3017341, 2775003, 2465035, 2396182, 2235541, 2135226, 2418261, 2857119, 3009517, 2790541, 2445917]
7953B445917m66566m13286l51981j51301m9276j19059r9808j13531q4481r2559
7943E04069j4856J6678J06631N6095o5812m824j4875k3215j05466j9281O6041
7932E01185L4118L8479O5480J45668M2561M5946J72293Q0359O4953M3564m9770
7921A184836p0614j06321m3955j26893j58665n0336L8643N9743m4732n6547l1785
7910E93374m1715j35970n4287p0396j923J0946L3485o2931j72259j27416J33934
7899A04842M6657O8660r9334m5476J08261j399k041K1149N1387N1900j6983J1662
7887B99285m1465p9324n7447j5623O2048K3925j04476o7846M9003j655o01L9472
7875A05296M8310n5346r2773L6182l4684L952J5901J06812l4841L3108O6933M7616
$$ y = [2445917, 1979351, 1566065, 1214084, 1062783, 1013507, 894448, 794640, 681109, 596628, 504069, 489213, 505891, 612522, 668617, 602805, 597981, 583106, 559891, 454425, 435144, 501185, 535303, 573782, 639262, 784930, 827491, 873437, 1045730, 1126089, 1191042, 1234606, 1184836, 1114222, 1007901, 963946, 837053, 678388, 628052, 666695, 726438, 681706, 625159, 593374, 551659, 415689, 361402, 291006, 289083, 300029, 333514, 270583, 98324, -29092, 104842, 151499, 220159, 120825, 75349, 183610, 182211, 180170, 201319, 252706, 304606, 287623, 299285, 257820, 178496, 121049, 105426, 167474, 191399, 86923, 19077, 68080, 66425, 65824, 105296, 153606, 98260, 5487, 41669, 6985, 10937, 26838, 133650, 98809, 131917, 198850, 246466]
7863B46466L092L6380L3753l6605l919j23863j03496M0942K7879Q2188J683l5285
7851A69215o0879m1468k2129P6832N9605p5827K1770N9695n9683M0548j2909l3993
7839A20777k9670k8117K6118M7342l7439R3712r3397M8873J42186n0701j26345
7828A13339L7379k9945m0600K0007R9920j6150k7930o5300o3559k3410j4067K4828
7816A4512q094J4712L3227K5485M3184N8532l6648j6457Q849K2407m106J2221
7804A67824r608j22900p2106J4643j1856j525j8441L3257Q6624o4238R872N0671
7792F2217Q0792J2416n5091Q435K7176m5319n887l3187J0026Q629J02055J11026
7780B83288m8867q3173l650n1039n2299j8559o6685l5770M6696N2802K4657m6207
$$ y = [246466, 249558, 285938, 319691, 283086, 279167, 155304, 51808, 92750, 120629, 202817, 204500, 169215, 108336, 66868, 44739, 121571, 181176, 105349, 127119, 186814, 127131, 167679, 154770, 120777, 91107, 62990, 89108, 136450, 99011, 192723, 99326, 148199, 290385, 239684, 113339, 150718, 120773, 80173, 100180, 200100, 183950, 156020, 90720, 27161, 3751, -10316, 14512, 6418, 21130, 54357, 79842, 123026, 181558, 144910, 128453, 137302, 159709, 155603, 167824, 158216, 35316, -36790, -22147, -34003, -35528, -53969, -20712, 65912, 1674, 11546, 62217, 143009, 155425, 100334, 108769, 135945, 90626, 84739, 51552, 61578, 70207, 172262, 283288, 234421, 151248, 147598, 96559, 44260, 25701, -40984, -76754, -30058, 22744, 47401, 1194]
7768A194J06371N6677R9108O0752j03934q9545k3354P4967M9448Q2973j6593j7576
7756B80488q3869l4439p719p9091J527L3010Q906l1921n1208J3626P4676O3599
7744A87585R1205o6602q8650j08486n7223M9223N0536M4175K5490r808j07802
7733I643k6717P4037k0684n795R5150P6975L7779k2211p1425p827M3683l5870
7721A46738q5627J14L7631k5000J4623J3736m8771L6643k6323l1685m2673R7121
7709H6527k0625q4204N1943Q8565O4377O660k1721K3441P9963m6185j06343o351
7697A16047P0326J044n6387l9281N4096R4485l6590l593K7503l3948J696p6159
7685A19239p7584j17085n168R4553R0130j5305l6921K8638J4771l4122n6934L7042
$$ y = [1194, 107565, 164242, 263350, 324102, 220168, 130623, 107269, 182236, 231684, 314657, 298064, 280488, 196619, 162180, 154461, 75370, 76897, 109907, 118813, 86892, 35684, 49310, 123986, 187585, 278790, 212188, 123538, 15052, -42171, 7052, 57588, 101763, 127253, 117445, 9643, -17074, 56963, 36279, 30484, 125634, 202609, 240388, 218177, 146752, 138925, 182608, 146738, 61111, 61225, 98856, 73856, 88479, 102215, 53444, 90087, 63764, 32079, -10594, 86527, 65902, -18302, 33641, 122206, 186583, 193243, 171522, 194963, 274926, 228741, 122398, 116047, 186373, 187417, 131030, 91749, 145845, 240330, 203740, 200147, 227650, 193702, 195398, 119239, 41655, -75430, -80598, 13955, 104085, 88780, 51859, 80497, 95268, 61146, 4212, 41254]
7673D1254J84991k6894j50581p2442J16374j6177r4942j7397L3334K0475J8561
7662C6556k539K6507J1127o370q061P1408L9377j12858r0766k9432p2156k8203
7650a65410J54405Q4082l9597k2492P0063P0030o4855r629O4038r4146q8748M0508
7638a751P9813k616m773o0816P830K1835K3981N9615L0944J6166j37347j06935
7626g4054O5979k8290p7110n4692P8928M9749P6100J7195P7599N9992M9657O9366
7614C10419J969m4499j11569k7384m0320r5963J3524Q7497J11876p959r2702j09112
7602d223n6270o3161q1625j8876Q8340J21610J30742K5752K4217j06128l5340
7591B5038N3653j4155m8804L1968L7959J1707p1434l2182n71r962J02908J49774
$$ y = [41254, 226245, 199351, 48770, -23672, 92702, 76525, -18417, -35814, -2480, 17995, 36556, 34017, 60524, 71651, 65281, 57220, 128628, 168005, 55147, -35619, -65051, -137207, -165410, -11005, 73077, 33480, 10988, 81051, 151081, 86226, 76597, 140635, 46489, -42259, -1751, 78062, 75446, 70673, 9857, 17687, 39522, 63503, 123118, 154062, 170228, 32881, -74054, -8075, -36365, -113475, -168167, -89239, -39490, 36610, 53805, 131404, 191396, 241053, 310419, 312388, 267889, 156320, 128936, 88616, -7347, 6177, 93674, 205550, 197591, 104889, -4223, -60493, -123654, -205279, -224155, -135815, -14205, 116537, 142289, 166506, 60378, 25038, 78691, 64536, 15732, 47700, 85659, 97366, 25932, -6250, -6821, -16783, 86125, 235899]
7579B35899j39621r8305n7274L917K6052M0061L7347j1624O4722N38r0078M5093
7567E6727O2282l9001N6208J1052o6439P1556J3414M5869o76J4247J3713O064
7555B45016l9347n4346p5170o3437o6383J3094j133r3513p231M2838J16777R3291
7543A10456L3858r908n0940l4795j5806q696r5443l8368R385R7130l0951j77435
7531b11513J6475J32324o780J00183L1261M6150N7283n4403p0092Q3099l9567
7520H4420M6566O1494q8561l6541O389L2364P3635o1065N207j1834r8919j2020
7508A135O9615J01360M1939n913m3515r9143J122m0619r5721j1049N0898k3344
7496e3235l3530l5253J6598L2164L8681l5436k4349j04707J11992J6013L400n5369
$$ y = [235899, 96278, -2027, -59301, -55384, -29332, 10729, 48076, 36452, 101174, 101712, 11634, 56727, 119009, 80008, 136216, 147268, 80829, 152385, 165799, 211668, 210992, 225239, 238952, 245016, 205669, 151323, 76153, 12716, -53667, -40573, -41706, -135219, -142450, -99612, 17165, 110456, 144314, 134406, 83466, 48671, 32865, 24169, -71274, -109642, -100257, -3127, -34078, -211513, -195038, -62714, -69494, 30689, 61950, 108100, 165383, 110980, 40888, 123987, 84420, 130986, 192480, 103919, 67378, 73767, 106131, 179766, 118701, 123908, 112074, 13155, 1135, 70750, 172110, 214049, 208136, 164621, 65478, 66600, 25981, -69740, -80789, -29891, -53235, -86765, -122018, -105420, -73256, -34575, -70011, -94360, -199067, -87075, -71062, -67662, -123031]
7484a23031J7558L3688K8815J28594Q9571J3109M5677k8521l2823k3675q894j5874
7472A24194K029L4741N876M035k1295p4398m7988L6891Q8610M6564n1885J7664
7460A65038j5423j18864N7828N8767k2915l0612o0245o9455l7648O5210J1376
7449C057M468k6085K8014o1821K942K1326p0035O407L1135k0418j183K7631L0837
7436b3725K9004n4854N2579j8450j0699J4563N8785L0474J11774r3517k166m9949
7424D3819J5582O858P9097J12j02845j130r059p8270P691m8119p4704J12481J25168
7411G6681P3498o4244n4715j8684K6592J8118n351L1146m4275j0596k1051p442
7399c23P2804n1988l4048R5301L0094M2358o522o5851l9990N061O0673M34M1081
$$ y = [-123031, -105473, -71785, -42970, 85624, 175195, 188304, 233981, 205460, 172637, 148962, 140068, 124194, 126223, 160964, 166840, 170875, 149580, 75182, 27194, 64085, 152695, 199259, 147374, 165038, 149615, 30751, 88579, 147346, 124431, 93819, 33574, -35881, -73529, -8319, 3057, 7525, -18560, 9454, -52367, -49425, -28099, -98134, -91727, -60592, -81010, -82193, -54562, -23725, 5279, -49575, 3004, -15446, -26145, -11582, 47203, 77677, 189451, 95934, 93768, 43819, 59401, 66259, 145356, 145468, 42623, 41493, 32434, -45836, -38145, -86264, -160968, -48487, 76681, 150179, 85935, 31220, 12536, 39128, 57246, 51895, 83041, 38766, 28170, 7119, -323, 72481, 20493, -13555, 81746, 111840, 154198, 147676, 81825, 41835, 46896, 107569, 108003, 149084]
7386A49084J4377P023m5810p9572j0708P158n6110j62504L362n515K591O723N3414
7373a16487K7696K5565K4010l805L6618n4909p4749L3657K5647K1135L1674J4232
7361i716K4129o9711p3554k8821P0802J28499O0998J579j34733n3717J16867N0999
7349H3621j41757L6564L007p901K1456O6443R2831j8983J6824k8475J3249m8574
7337H8305n4693o3192l989O9263l7381O8854N8680k1183O6965j0052j07363L6808
7325I1022P5330n9731O9114P070l8756K7989o9941j20088m0433L7794K2126N7206
7313E8702n0216p3941N5856L2650M6143J4843o815M7370L3631L5706j6832o7096
7301A10001J1538n698n0509O188n4369j4371m2748m244M5516Q3641q7496k2578
$$ y = [149084, 163461, 170484, 124674, 45102, 34394, 41552, -14558, -177062, -173700, -179215, -176624, -169901, -116487, -88791, -63226, -39216, -43021, -6403, -61312, -136061, -102404, -76757, -55622, -23948, -9716, 14413, -55298, -128852, -157673, -86871, 41628, 102626, 104205, -30528, -84245, 32622, 83621, -58136, -21572, -18565, -26466, -5010, 61433, 154264, 135281, 152105, 123630, 136879, 88305, 33612, -29580, -33569, 35694, -1687, 67167, 125847, 104664, 171629, 161577, 54214, 91022, 166352, 106621, 175735, 182805, 144049, 172038, 102097, -17991, -58424, -20630, 1496, 58702, 8486, -65455, -9599, 23051, 69194, 84037, 77222, 124592, 158223, 193929, 177097, 110001, 121539, 115841, 65332, 71520, 17151, 2780, -39968, -44212, 1304, 84945, -2551, -25129]
7289b5129k5545J10531K0252o316l5125N8390R493n8904J3355j0236M854o8786
7277a3166m2713L3181l8996r6548p7923M3338K40024J19021p2950j20790m4169
7266g1691p898M3410k2598j9651m6192k2347o354L7820J24453O5063o0692J4432
7254B7755j41610N6244M1137n3643Q110k6842r053L2766Q9002L4285Q0413J595
7242A40159q9815n1227N9195P9541l4428m4340L0438q2023m0660R9414P1449L7388
7230A75091n4759p348k7862m5897m6683K1036r2810m095M3566n2676l794M8848
7218d7383M2816J5340l5195N8357N6999J8149J8361j6185l2016m9999m1582n8771
7206g1109K4654J13499r053M8186l8438n5248m6489J0633K1462M1696Q2766R085
$$ y = [-25129, -50674, 59857, 80109, 73793, 38668, 97058, 106551, 47647, 61002, 50766, 55620, -13166, -55879, -22698, -61694, -158242, -236165, -192827, 47197, 166218, 93268, -27522, -71691, -79589, -36179, -58777, -78428, -124620, -146967, -153321, -115501, 8952, 74015, 13323, 27755, -113855, -57611, -16474, -70117, -62007, -88849, -97902, -65136, 23866, 58151, 138564, 140159, 50344, -883, 58312, 137853, 103425, 59085, 89523, 7500, -33160, 66254, 137703, 175091, 120332, 112984, 85122, 39225, -7458, 13578, -79232, -83327, -39761, -92437, -96231, -47383, -4567, 10773, -24422, 33935, 90934, 109083, 127444, 111259, 79243, 29244, -12338, -71109, -46455, 67044, 57991, 106177, 67739, 12491, -33998, -23365, -1903, 39793, 122559, 131644]
7194A31644j08653r7249O0456j3391L3253l9901n7295K179j7184j570n0577o5179
7182b23467M5699L9466N1885J12806J5367n7748L2238N6349R692J4219l4299l8361
7170B3846j34154j1365R9033P8534J1141p061k7512q9409N9803P8993l6668j22460
7158g7279J18542J10690n5617o577O170n9512O9049O9379K27k7712K9255L2788
7146B09403J9059J0751q9590n2690K9752K6609r6283p1010m0620O7949k5626N904
7134f392J4989J04745N5978l1477k7841p6574J6368J7679j3166J3622M3255O683
7122A17869j7841n4823L0689m8775k9908j8808L432N5990P4821J5441K8035j5030
7110A41092L328j9730n3879l1930O7483n3823j1990J0783j8072l1856n5270J7642
$$ y = [131644, 22991, -74258, -13802, -27193, 6060, -33841, -91136, -88957, -106141, -107711, -158288, -223467, -177768, -138302, -86417, 26389, 41756, -15992, 16246, 72595, 82287, 96506, 62207, 23846, -110308, -121673, -22640, 55894, 67035, 59974, 32462, -56947, 2856, 81849, 45181, -77279, 41263, 151953, 96336, 89759, 95929, 36417, 105466, 174845, 175072, 147360, 176615, 209403, 228462, 239213, 149623, 96933, 126685, 153294, 57011, -13999, -54619, 13330, -12296, -6392, 8597, 113342, 169320, 137843, 110002, 33428, 49796, 67475, 54309, 67931, 111186, 117869, 100028, 45205, 75894, 27119, -2789, -21597, -18165, 37825, 112646, 128087, 156122, 141092, 144420, 124690, 70811, 38881, 106364, 52541, 40551, 51334, 33262, 1406, -53864, -36222]
7098c6222P9446N147Q0057J3728j0967m3983l1474M6191P1818K5406k2344j27952
7086D8851j18694N674J01224N7779J6337k2443n8765j9412M0592r0445l3011j7231
7074h9544m7059J3030J8201Q8374l2334l4362j12122l4614J89067k7659p4241
7063a43263k2577M286J34873p3562M9128P3812M1313j7107o6963n230q1556m8767
7051a55613J44946J21224L2666k3891j7880j9469M9322n788M1239n3000n4320
7040E9436N9904K3149k4823k3896j880N327m6701J9040J3602m9604n8889k0616
7028d5951K9695k9954o3507M8502P7860J3064M898o6520r5730J05244Q1884p5405
7016a5920m4879N4262L6538K0034k8438m8683o5292L0082R4522M578K1125L0745
$$ y = [-36222, 43224, 48371, 128428, 142156, 131189, 87206, 55732, 101923, 173741, 199147, 176803, 48851, -69843, -64169, 37055, 94834, 111171, 88728, 29963, 10551, 51143, -39302, -72313, -89544, -136603, -123573, -105372, -16998, -49332, -83694, -195816, -230430, -41363, -69022, -143263, -165840, -161554, -26681, -100243, -51115, 22697, 64010, 46903, -20060, -25290, -106846, -155613, -10667, 110557, 143223, 119332, 101452, 81983, 131305, 125517, 166756, 113756, 59436, 119340, 142489, 117666, 93770, 91890, 97217, 50516, 69556, 83158, 33554, -25335, -45951, -16256, -46210, -109717, -61215, 16645, 29709, 34607, -31913, -127643, -22399, 59485, -15920, -60799, -6537, 30001, 50035, 21597, -27086, -92378, -62296, 32226, 36804, 57929, 88674]
7004H8674j0064j14559k828O0338p11k0876J11272N5872N23o1822o3075r1310
6992d8566m6333N0955J13889O0065o5183q2448j8779k5823l1729N525m2055J11071
6980a9411O3938K7234o7797j04915M3313Q4116l4721m3092O2656p3444q1675L9538
6968a04260J67299M8190j0604j6866N3228K8307q56j10763O437l0685o2673j359
6956c4605K6607Q8829N2198l2885p3741o9455L8070M7269M1417j9967r1379n511
6944c3153J8509N1449P9354K5886o0022o1757l7818j15601l059J13803J20067
6933I7658J9331J07179j332j49241r5643P9376P6981r0468r508p0265o8251J08481
6921D298J20447J4027q804m1161o3041n9651j772l7611M2222K2523K580N2113
$$ y = [88674, 78610, -35949, -38777, 21561, 20850, -26, 111246, 167118, 167641, 105819, 42744, -48566, -94899, -43944, 69945, 130010, 64827, -17621, -36400, -62223, -93952, -88427, -130482, -19411, 44527, 71761, 3964, -100951, -57638, 26478, -8243, -51335, 11321, -62123, -143798, -104260, 63039, 111229, 100625, 83759, 136987, 165294, 164438, 53675, 60112, 29427, -33246, -34605, -7998, 80831, 133029, 100144, 26403, -43052, -4982, 42287, 83704, 63737, -27642, -33153, -14644, 36805, 116159, 142045, 82023, 20266, -17552, -133153, -136212, -22409, 97658, 116989, 224168, 222836, 73595, -22048, 57328, 134309, 43841, 34333, -35932, -104183, 4298, 124745, 138772, 129968, 88807, 25766, -33885, -35657, -73268, -31046, -8523, -5943, 46170]
6909D6170L6125n3612n0778P429J22564O4497m5647k2269M1158N3998k4156o0306
6897A15173m8354K9409n0459l1324J17351o363k9746J09067k2855j12641k1697
6886D7561J6075N5270l4077l2105l5752Q8986l0576r8620K9883J7062r0633j2415
6874g9341P0303Q339J9006p6241q652M8271K2729L2073N8154l2107L682l3333
6862C2883k3644N3104M8528K4474O1209j21361l7675j4708L5628K5120O4107p2577
6850G5088j35605p563K0284p7444O5387J20834J14256k1216o9821j75588p1592
6839a62980k3014M5427J09914q3274p7864K3146j3500J12161Q8040o9417j1634
6828f2995L2893K9879N7085N4764K8442k5480o2050L3404k490K4705o202q9966
$$ y = [46170, 82295, 28683, -22095, -14666, 107898, 172395, 126748, 104479, 145637, 199635, 175479, 115173, 66819, 96228, 45769, 14445, 131796, 125433, 95687, 204754, 181899, 69258, 47561, 63636, 118906, 84829, 52724, 16972, 105958, 75382, -23238, 6645, 23707, -66926, -79341, -9038, -699, 18307, -57934, -66586, -18315, 4414, 36487, 94641, 62534, 66216, 32883, 9239, 62343, 110871, 135345, 196554, 75193, 37518, 22810, 58438, 83558, 147665, 75088, -60517, -68080, -47796, -125240, -59853, 60981, 175237, 154021, 84200, -91388, -162980, -185994, -140567, -30653, -113927, -191791, -168645, -182145, -69984, 18056, -51361, -62995, -30102, -223, 56862, 111626, 140068, 114588, 52538, 85942, 83452, 108157, 101955, 11989]
6816A1989j02796J1399J20316J4006j934n337p4074J1735K2224K1674l6128J4648
6804G722k1739Q145M7527L823O7068J41429j4409l2464j03579j1698j516J2051
6792A02360m3996j2956K4970j8100J5625j0839J09877K4814n2033j29064j09099
6781i8441Q9960J00813N4986o0452o9434k4840p7770L1184k5263l8749j5285O3352
6769f9939L3189O1552P471n5855k4926j202r6584L1153J06186n2264p8314K2034
6757a17499M4176j41590k5767J36793Q0532K3042O8392N2325j8595j3899n2687
6746C5223k7826r3604M0998r875l2728N0941J21518K1606L979k3340K8325J4261
6734A29478k7975k1043o69J9366J0521Q573M8158L9482o3554J4180M5704k5112
$$ y = [11989, -90807, -79408, 40908, 54914, 52980, 47643, -26431, -14696, 7528, 29202, -6926, 7722, -14017, -5872, 41655, 45478, 112546, 253975, 239566, 207102, 103523, 91825, 90309, 102360, 58364, 45408, 70378, 52278, 67903, 57064, 166941, 191755, 139722, 10658, -98441, -8481, 92332, 147318, 86866, 17432, -7408, -85178, -53994, -79257, -118006, -133291, -69939, -36750, 24802, 32273, -23582, -48508, -49710, -146294, -115141, -8955, -61219, -139533, -117499, -73323, -214913, -240680, -103887, -23355, -313, 68079, 120404, 101809, 87910, 35223, 7397, -86207, -45209, -55084, -87812, -36871, 84647, 106253, 110232, 86892, 115217, 129478, 101503, 80460, 79791, 99157, 109678, 118251, 166409, 205891, 142337, 156517, 202221, 177109]
$$ [...]
##END NTUPLES=NMR SPECTRUM
##END=
