##TITLE=Analysis number 313196
Compound Code cc 45604
Book Reference 440/50
Project Code adrs
Chemist Name craigr
##JCAMPDX= 6.0         $$ Bruker NMR JCAMP-DX V2.0
##DATA TYPE= NMR SPECTRUM
##DATA CLASS= NTUPLES
##ORIGIN= Bruker BioSpin GmbH
##OWNER= NMR
$$ XWIN-NMR		Version 3.5
$$ Fri Aug 26 09:27:03 2005 GMT Daylight Time (UT+1h)  MAYBRIDGE\NMR@NMR_250MHZ
##.OBSERVE FREQUENCY= 250.131544655141
##.OBSERVE NUCLEUS= ^1H
##.ACQUISITION MODE= SIMULTANEOUS (DQD)
##.ACQUISITION SCHEME= undefined
##.AVERAGES= 16
##.DIGITISER RES= 18
##SPECTROMETER/DATA SYSTEM= dpx250
##.PULSE SEQUENCE= zg30
##.SOLVENT NAME= CDCl3
##.SHIFT REFERENCE= (INTERNAL, CDCl3, 0, 16.4816)
##AUDIT TRAIL= $$ (NUMBER, WHEN, WHO, WHERE, WHAT)
$$ ##TITLE= Audit trail, XWIN-NMR		Version 3.5
$$ ##JCAMPDX= 5.01
$$ ##ORIGIN= Bruker BioSpin GmbH
$$ ##OWNER= NMR
$$ C:\u/data/dgb/nmr/ADRS/8680/pdata/1/auditp.txt
$$ ##AUDIT TRAIL=  $$ (NUMBER, WHEN, WHO, WHERE, WHAT)
(   1,<2005-08-26 09:26:44.35 +100>,<MAYBRIDGE\NMR>,<NMR_250MHZ>,
      <created by zg, POWCHK disabled, PULCHK disabled
       configuration hash MD5:
       62 19 C7 07 E1 42 D1 B7 37 6C 3D D0 77 39 F9 E6
       data hash MD5: 64K
       9F F1 B8 E5 33 74 92 22 20 98 8D B2 A8 DE 5A 7A>)
(   2,<2005-08-26 09:26:55.88 +100>,<MAYBRIDGE\NMR>,<NMR_250MHZ>,
      <Start of raw data processing
       ef LB = 0.3 FT_mod = 6 PKNL = 1 SI = 32K 
       data hash MD5: 32K
       73 F0 03 68 15 7E 1C DD 11 B6 5E 67 A3 07 63 1C>)
(   3,<2005-08-26 09:26:57.61 +100>,<MAYBRIDGE\NMR>,<NMR_250MHZ>,
      <apk 
       data hash MD5: 32K
       FE FB F2 7F 00 29 67 5F 33 5B 41 B4 6D 9E 1A ED>)
(   4,<2005-08-26 09:26:58.33 +100>,<MAYBRIDGE\NMR>,<NMR_250MHZ>,
      <abs ABSG = 5 
       data hash MD5: 32K
       ED 9A 25 CB 64 37 C8 24 8F 34 25 10 F2 AD DE DE>)
$$ ##END=
$$ 
$$ hash MD5
$$ 4E F2 43 8F FE 39 0A 70 40 36 62 14 F6 B6 94 AD
##$RELAX= 
##$RELAX= 
##$RELAX= 
##$RELAX= 
##$RELAX= 
##$RELAX= 
##$RELAX= 
$$ Bruker specific parameters
$$ --------------------------
##$DU= <C:\u>
##$EXPNO= 8680
##$NAME= <ADRS>
##$PROCNO= 1
##$TYPE= <nmr>
##$USER= <dgb>
##$AMP= (0..31)
100 100 100 100 100 100 100 100 100 100 100 100 100 100 100 100 100 100 
100 100 100 100 100 100 100 100 100 100 100 100 100 100 
##$AQSEQ= 0
##$AQ_mod= 3
##$AUNM= <au_zg>
##$AUTOPOS= <5 >
##$BF1= 250.13
##$BF2= 250.13
##$BF3= 250.13
##$BF4= 250.13
##$BF5= 500.13
##$BF6= 500.13
##$BF7= 500.13
##$BF8= 500.13
##$BYTORDA= 1
##$CFDGTYP= 0
##$CFRGTYP= 5
##$CHEMSTR= <none>
##$CNST= (0..31)
1 1 145 1 1 1 1 1 1 1 1 1 1 1 1 1 1 1 1 1 1 1 1 1 1 1 1 1 1 1 1 1 
##$CPDPRG= <>
##$CPDPRG1= <>
##$CPDPRG2= <>
##$CPDPRG3= <>
##$CPDPRG4= <mlev>
##$CPDPRG5= <mlev>
##$CPDPRG6= <mlev>
##$CPDPRG7= <mlev>
##$CPDPRG8= <mlev>
##$CPDPRGB= <>
##$CPDPRGT= <>
##$D= (0..31)
0 1 0 0 0 0 0 0 0 0.06 0 0 0 0 0 0 0.0002 0 0 0 0 0 0 0 0 0 0 0 0 0 0 
0 
##$DATE= 1125044803
##$DBL= (0..7)
120 120 120 120 120 120 120 120 
##$DBP= (0..7)
150 150 150 150 150 150 150 150 
##$DBP07= 0
##$DBPNAM0= <>
##$DBPNAM1= <>
$$ [...]
##$SUBNAM7= <"">
##$SUBNAM8= <"">
##$SUBNAM9= <"">
##$SW= 20.6930455092707
##$SWIBOX= (0..15)
0 0 3 0 0 0 0 0 0 0 0 0 0 0 0 0 
##$SW_h= 5175.983436853
##$TD= 65536
##$TD0= 1
##$TE= 295.16
##$TE2= 300
##$TE3= 300
##$TEG= 300
##$TL= (0..7)
0 120 120 120 120 120 120 120 
##$TP= (0..7)
150 150 150 150 150 150 150 150 
##$TP07= 0
##$TPNAME0= <>
##$TPNAME1= <>
##$TPNAME2= <>
##$TPNAME3= <>
##$TPNAME4= <>
##$TPNAME5= <>
##$TPNAME6= <>
##$TPNAME7= <>
##$TPOAL= (0..7)
0.5 0.5 0.5 0.5 0.5 0.5 0.5 0.5 
##$TPOFFS= (0..7)
0 0 0 0 0 0 0 0 
##$TUNHIN= 0
##$TUNHOUT= 0
##$TUNXOUT= 0
##$USERA1= <user>
##$USERA2= <user>
##$USERA3= <user>
##$USERA4= <user>
##$USERA5= <user>
##$V9= 5
##$VALIST= <valist>
##$VCLIST= <CCCCCCCCCCCCCCC>
##$VD= 0
##$VDLIST= <DDDDDDDDDDDDDDD>
##$VPLIST= <PPPPPPPPPPPPPPP>
##$VTLIST= <TTTTTTTTTTTTTTT>
##$WBST= 1024
##$WBSW= 4
##$XGAIN= (0..3)
0 0 0 0 
##$XL= 0
##$YL= 0
##$YMAX_a= 517645
##$YMIN_a= -577744
##$ZGOPTNS= <>
##$ZL1= 120
##$ZL2= 120
##$ZL3= 120
##$ZL4= 120
##$ABSF1= 16.48158
##$ABSF2= -4.211592
##$ABSG= 5
##$ABSL= 3
##$ALPHA= 0
##$AQORDER= 0
##$ASSFAC= 0
##$ASSFACI= 0
##$ASSFACX= 0
##$ASSWID= 0
##$AUNMP= <proc_1d>
##$AZFE= 0.1
##$AZFW= 0.1
##$BCFW= 0
##$BC_mod= 0
##$BYTORDP= 0
##$COROFFS= 0
##$CY= 12.5
##$DATMOD= 1
##$DC= 0
##$DFILT= <>
##$DTYPP= 0
##$F1P= 14.0000005364418
##$F2P= -0.99999901652339
##$FCOR= 0.5
##$FTSIZE= 32768
##$FT_mod= 6
##$GAMMA= 0
##$GB= 0
##$INTBC= 1
##$INTSCL= 1
##$ISEN= 128
##$LB= 0.3
##$LEV0= 0
##$LPBIN= 0
##$MAXI= 10000
##$MC2= 0
##$MEAN= 0
##$ME_mod= 0
##$MI= 0
##$NCOEF= 0
##$NC_proc= -3
##$NLEV= 6
##$NOISF1= 0
##$NOISF2= 0
##$NSP= 0
##$NTH_PI= 0
##$NZP= 0
##$OFFSET= 16.48158
##$PC= 1
##$PHC0= 134.2406
##$PHC1= 1.736517
##$PH_mod= 1
##$PKNL= yes
##$PPARMOD= 0
##$PSCAL= 4
##$PSIGN= 0
##$REVERSE= no
##$SF= 250.130010109383
##$SI= 32768
##$SIGF1= 0
##$SIGF2= 0
##$SINO= 400
##$SIOLD= 32768
##$SREGLST= <1H.CDCl3>
##$SSB= 0
##$STSI= 32768
##$STSR= 0
##$SW_p= 5175.98343685301
##$SYMM= 0
##$S_DEV= 0
##$TDeff= 65536
##$TDoff= 0
##$TI= <Analysis number 999999
Compound Code 99
Book Reference 9
Project Code 9>
##$TILT= no
##$TM1= 0
##$TM2= 0
##$TOPLEV= 0
##$USERP1= <user>
##$USERP2= <user>
##$USERP3= <user>
##$USERP4= <user>
##$USERP5= <user>
##$WDW= 1
##$XDIM= 32768
##$YMAX_p= 404328726
##$YMIN_p= -206216
$$ End of Bruker specific parameters
$$ ---------------------------------
##NTUPLES= NMR SPECTRUM
##VAR_NAME=  FREQUENCY,     SPECTRUM/REAL,   SPECTRUM/IMAG
##SYMBOL=    X,             R,               I
##VAR_TYPE=  INDEPENDENT,   DEPENDENT,       DEPENDENT
##VAR_FORM=  AFFN,          ASDF,            ASDF
##VAR_DIM=   32768,         32768,           32768
##UNITS=     HZ,            ARBITRARY UNITS, ARBITRARY UNITS
##FACTOR=    0.157963299565203, 1,           1
##FIRST=     4122.5379556773, 0,             0
##LAST=      -1053.44548117571, 0,           0
##MIN=       -1053.44548117571, -206216,     0
##MAX=       4122.5379556773, 404328726,     0
$$ Real data points
##PAGE= N=1
##DATA TABLE= (X++(R..R)), XYDATA
$$ [...]
20745 1099 -4894 -6738 -4080 -3624 -5343 -5664 -10663 -14623 -7571 -6463 -6244 -5500 -5213 797 5544 6739
20729 6739 8864 7129 8195 10147 5836 -727 -2800 2149 4466 4693 4981 4904 -211 -2747 -4999 -1536
20713 -1536 -5179 -3004 5 2967 4038 5488 7783 7985 5503 7183 13411 11501 4805 3879 3111
20698 3111 4760 7017 8624 6424 1719 -768 -5419 -3177 2674 3450 517 -2341 -3976 -1854 4391
20683 4391 7802 5258 -4812 -5119 3700 1407 -6788 -5525 5383 6574 8426 9066 1321 -7123 -8141
20668 -8141 -9192 -8183 -1823 1049 2852 -1664 -3494 -3890 3057 3897 3996 -1739 -1097 -5362 -4337 1135
20652 1135 1255 -7171 -12958 -14103 -11579 -10606 -3112 275 3170 -2076 -736 1010 -3419 -2659 3243
20637 3243 2760 -11103 -17870 -13553 -16374 -19270 -16551 -5930 433 3088 -3002 -2041 -3334 -10013 -13197
20622 -13197 -7635 -5744 -5774 -13995 -16353 -17046 -10675 -9455 -9235 -8399 -11009 -9809 -1345 3046 2017 1385
20606 1385 -1080 1909 1257 2631 7390 5372 1044 4201 4160 -2536 -3826 359 -1680 -2265 -277 -150
20590 -150 -4176 -7766 -6954 -15983 -23754 -25650 -21148 -12451 -7768 -7780 -2299 7116 10094 6564 -1126 -2665
20574 -2665 -4572 -4618 -1594 4942 7592 1569 -3056 -2765 972 -730 -672 -431 1042 -2058 -2147 -8531 -6531
20557 -6531 -6607 -3164 -3236 -5413 -11538 -9016 -2033 -3296 -3607 -5164 -7668 -8761 -11538 -10306 -3248 -3611
20541 -3611 -8505 -4800 1814 -5705 -12997 -21043 -17058 -10464 -7611 -7014 -9911 -4992 -1200 -4474 -1119
20526 -1119 -6114 -3790 -4615 -10 327 -3338 341 2861 8389 10311 3787 2437 -4525 -7460 -361
20511 -361 314 389 -1508 -6074 -3270 -5673 -8203 -1794 1383 7108 10747 9499 5737 -34 -10966
20496 -10966 -17250 -15224 -6837 -7510 -5350 -3192 -3128 -5914 -8452 -7483 -1188 -509 -3966 -10940 -11915 -11933
20480 -11933 -7501 -2979 -4831 -5908 -8631 -7327 -8276 -7316 -9506 -11769 -17926 -23270 -16663 -10334 -12048
20465 -12048 -19459 -18758 -5981 5622 3502 -5300 -12189 -8764 1911 1786 961 459 3806 3423 1293
20450 1293 -1747 -1131 -6349 -3335 72 -788 -4150 -2199 -2366 -9195 -8445 -9693 -9167 -5237 -11929 -10466
20434 -10466 -54 -344 -10575 -13261 -11439 -14463 -16390 -17783 -15434 -6550 -11973 -11012 -10179 -15846 -16434
20419 -16434 -9595 -10625 -18532 -13389 -7703 -7460 -14466 -16874 -11497 -9362 -13757 -11708 -10957 -11976 -10413
20404 -10413 -14218 -17794 -15429 -8129 -5004 -2930 -8044 -13171 -15368 -10493 -7473 -9875 -15816 -13082
20390 -13082 -9971 -10448 -8886 -7896 -9869 -14566 -16034 -18485 -15212 -7829 -8668 -10050 -13286 -12749 -17284
20375 -17284 -16927 -18057 -19363 -15718 -9384 -5757 -8723 -9988 -8607 -6189 -6964 -4871 307 -149 -10063
20360 -10063 -19243 -13962 -5224 -8320 -11777 -6448 -5697 -6665 -5113 -4124 -2886 -2915 -11442 -12983 -14641 -10774
20344 -10774 -6993 -2950 1074 2397 -1930 -5153 2537 2394 -1739 -7455 -5065 1493 4491 5848 3866
20329 3866 406 -2640 2536 3830 5752 4584 281 3505 7160 -3167 -9863 -9002 -12972 -13347 -10335
20314 -10335 -10139 -12113 -16969 -16493 -13452 -10699 -9932 -8410 -8517 -1262 131 1381 -4393 -15133 -14064
20299 -14064 -7399 -776 -3152 -7155 -7284 -12017 -15160 -9129 -11343 -14341 -15458 -12149 -9863 -2317 -3409
20284 -3409 -251 -1054 -2424 -7888 -6115 -3669 -8970 -8131 -15732 -20223 -19435 -17823 -19025 -15095 -6214
20269 -6214 -8246 -18267 -16627 -13021 -12832 -20420 -22314 -17286 -11390 -14955 -9307 -4015 1411 4251 -1845
20254 -1845 -1990 -5952 -6917 -3483 -10666 -9159 -145 188 2748 -917 -8700 -4814 -921 -10017 -12254
20239 -12254 -13068 -13574 -15329 -17388 -15097 -6872 -1765 -4443 -3520 -5506 -8182 -327 -2925 -8143 -4219
20224 -4219 -1660 -6266 -5564 -189 6114 4435 -63 -3022 -8131 -13097 -13535 -9407 -15066 -12365 -11521
20209 -11521 -12791 -7187 -2819 2820 1628 -4352 -6612 -5655 -2015 9820 11660 11732 11209 -229 -11284
20194 -11284 -15766 -14319 -9934 -2725 -3077 -4604 -1271 2619 -3065 -9998 -13431 -11769 -7656 -3045 1148
20179 1148 4093 -6139 -12661 -7895 -9766 -10806 -6942 -4893 -3971 920 7892 5663 1833 721 -3704
20164 -3704 -7074 -2212 -3028 4375 4320 -3694 -7126 -8010 -8211 -6398 429 667 -5671 -11572 -12833 -8949
20148 -8949 -7839 -8956 -16012 -14323 -12120 -9043 -7209 -9919 -7145 -2000 -4675 -6521 -15727 -16022 -15291
20133 -15291 -20603 -20880 -21820 -15401 -12835 -20125 -18868 -17517 -13641 -9081 491 -252 -2832 -9190 -14811
20118 -14811 -12744 -9689 -10208 -10354 -9192 -10302 -17294 -14838 -13862 -11274 -16821 -18804 -16789 -15097 -11079
20103 -11079 -9244 -7963 -8696 -6891 -10054 -11431 -5830 -3536 -234 4349 -1074 -4342 -7061 -8628 -4991
20088 -4991 -4136 -7018 -3616 -5471 -7124 -12894 -16677 -14180 -17581 -20677 -16970 -21385 -19982 -19752 -20633
20073 -20633 -16335 -11773 -6043 -2148 4429 2556 10736 8898 2505 -1215 -2205 -3798 -6420 -11134 -12037
20058 -12037 -5632 -601 3649 -3176 -2551 -5610 -9930 -10412 -12488 -11475 -4576 -3904 -5311 -10780 -9510
20043 -9510 -9813 -3928 915 -3994 -4918 -3037 -3825 -6444 -15482 -15583 -18908 -13161 -10442 -20598 -16421
20028 -16421 -1290 -817 -9647 -9639 -9935 -11346 -15354 -14088 -7964 -4977 -10673 -12994 -9717 -10769 -9530
20013 -9530 -4047 -4255 -5525 -9743 -12429 -9320 -4403 -5950 -12694 -12388 -14480 -19988 -21384 -22343 -19085
19998 -19085 -20149 -15782 -20519 -9973 -4315 -953 1707 1644 4227 -2161 -7640 -5888 -5821 -6396 -7920
19983 -7920 -11655 -13385 -13592 -11467 -7786 -3760 -433 903 -9233 -12724 -9389 -7606 -8413 -13235 -19195
19968 -19195 -22458 -14156 -13376 -10756 -1982 -4546 -9544 -14578 -13638 -12908 -9318 -3746 2316 839 -5704
19953 -5704 -9570 -7837 -6754 -5454 -1948 -4659 -5387 -5200 -10659 -14818 -9640 -2952 -5341 -6655 -6361
19938 -6361 -10866 -11289 -11908 -10579 -16690 -15139 -18230 -17971 -13337 -16549 -24659 -21947 -20404 -16323 -10976
19923 -10976 -10394 -9331 -13277 -12068 -11190 -9355 -7044 -9870 -7039 -4931 -11915 -15124 -7880 -9248 -7778
19908 -7778 -8309 -10001 -14207 -12447 -5977 -9669 -13750 -8909 -6206 -11172 -16271 -9213 -2708 -11604 -16415
19893 -16415 -5636 -2807 -12783 -17740 -15206 -14543 -15366 -18130 -19368 -14218 -4198 -5492 -14058 -15559
19879 -15559 -10703 -3008 -1985 -3865 -6038 -12118 -18752 -18529 -14521 -19355 -16891 -16714 -16740 -18702 -19408 -14727
19863 -14727 -13003 -15295 -16461 -16358 -17560 -12330 -15579 -18964 -10789 -4588 -1879 -6058 -12342 -24645
19849 -24645 -22255 -19910 -19266 -13523 -8791 -1320 -3063 -12961 -12649 -8031 -7317 -13803 -20492 -25400 -20640
19834 -20640 -13004 -20506 -27469 -25600 -20844 -15902 -13205 -14182 -13386 -10285 -14063 -13994 -15528 -8250 -5524
19819 -5524 -10672 -12911 -18875 -17908 -16990 -13282 -15532 -12947 -10526 -10763 -10208 -13278 -16124 -19618 -16568 -20753
19803 -20753 -14247 -10483 -9308 -5024 -1237 -5446 -8104 -14413 -18844 -17162 -14915 -14535 -15500 -11185 -6921
19788 -6921 -9068 -8674 -5342 -4713 -10601 -10800 -7659 -12904 -18751 -28083 -22701 -16386 -6791 -10408 -9576 -10292
19772 -10292 -8391 -3017 -4183 -8485 -14437 -16858 -18934 -9695 -10234 -5816 -6331 -9607 -10999 -13039 -11759
19757 -11759 -14727 -13952 -7203 -15101 -16009 -13253 -13118 -12375 -9207 -5611 -8072 -7827 -5637 -1444 -2914 -1323
19741 -1323 -3344 -8022 -5364 -6321 -13521 -13109 -16842 -12701 -10888 -9788 -15055 -13939 -19782 -15257 -7927
19726 -7927 -6823 -6293 -6013 -6480 -13020 -17153 -13253 -7214 -7612 -9296 -10950 -9584 -13572 -14073 -12765 -12445
19710 -12445 -7134 -4331 -2739 -7549 -15235 -19154 -20944 -28055 -27593 -25951 -15290 -13600 -14497 -17291 -23760
19695 -23760 -26855 -23716 -19309 -22214 -17884 -15190 -12727 -11778 -4301 -6384 -11029 -12532 -8280 -3710 -7311
19680 -7311 -9832 -15429 -13043 -10437 -7461 -10116 -12933 -18213 -19296 -23171 -22426 -23937 -20584 -15858 -6555
19665 -6555 -7877 -5601 3144 5543 -3915 -9559 -7788 -8624 -12613 -14095 -11163 -13144 -14136 -16320 -17480
19650 -17480 -16165 -16699 -13978 -15350 -19765 -17822 -9710 -5614 -7850 -7689 -12823 -9474 -5515 -7169 -8823
19635 -8823 -7732 -13869 -9127 415 12412 7302 -3665 -4807 -5440 -9667 -8593 -5672 -7720 -9247
19621 -9247 -3211 -6339 -11548 -10867 -6060 -9675 -7631 -7705 -8289 -9201 -11401 -11260 -12189 -19552 -17963 -15493
19605 -15493 -14026 -18343 -19177 -21299 -23709 -23436 -21530 -22752 -25956 -25303 -19352 -15148 -18405 -22464 -23059
19590 -23059 -20605 -22456 -16335 -12375 -8984 -6889 -4592 -10480 -15618 -21149 -21110 -10985 -4696 -5281 -10690
19575 -10690 -13779 -15603 -15506 -12242 -10550 -11335 -10494 -12922 -14667 -15702 -17188 -19258 -16459 -14504 -16773
19560 -16773 -13294 -6486 -8977 -8930 -7880 -11795 -12800 -9390 -10653 -11591 -13107 -10744 -13915 -13902 -15140 -18933
19544 -18933 -13421 -12095 -17271 -13450 -5546 -9799 -17184 -22466 -16078 -8108 -8920 -15274 -15396 -19100 -28082
19529 -28082 -22982 -16589 -14890 -15868 -19987 -20341 -9038 -4286 -7937 -6547 -6224 -9542 -13082 -12191 -9383
19514 -9383 -9656 -5948 -6774 -12294 -17764 -11907 -9572 -16283 -14798 -10125 -6169 -7206 -10406 -14743 -14550
19499 -14550 -8237 8445 11848 13688 18258 23497 36737 49498 74949 111142 157413 203980 243010
19486 243010 264651 253100 221632 184607 156223 138271 125278 132764 163334 200604 235472 251207
19474 251207 254051 249658 239337 219310 208032 194156 163861 128408 91584 62765 37820 25584
19462 25584 24080 22366 19453 19554 17398 10997 9303 7472 8448 10425 14198 12120 22183 29029 31255
19447 31255 40535 50428 52694 52008 48777 45716 46021 52675 70907 98632 130456 174632 225265 282691
19433 282691 325172 334631 329363 313300 296183 287603 285823 274160 256028 248076 242909 242109 233296
19420 233296 202771 169636 141829 114925 94352 72786 61848 46988 29351 20136 18609 14366
19408 14366 12354 4420 -464 -3218 -5518 -7318 -12572 -12480 -6404 -12382 -16522 -11926 -9284 -8300 -7781
19393 -7781 -11529 -15181 -11231 -6690 -1411 4838 7188 9384 4574 2115 2120 3147 -1978 -2129 2188 -1668
19377 -1668 -6957 -10845 -7737 -5333 -3655 -110 -10035 -11128 -7573 -6594 -8017 -11111 -15484 -15689 -11013
19362 -11013 -14149 -22947 -20620 -13867 -7646 -9735 -11491 -12930 -15437 -14645 -11100 -7182 -10421 -12800 -9176
19347 -9176 -10684 -10563 -9452 -6937 -690 -360 -9396 -12889 -14023 -14787 -18027 -15636 -14916 -16113 -17353 -11615
19331 -11615 -8738 -10026 -10805 -11987 -15276 -16322 -17426 -17958 -12303 -12734 -18984 -19229 -7353 -2992 559
19316 559 7132 8352 9367 14291 16946 23410 43096 77392 126428 223147 363325 460126 423990
19303 423990 313062 207359 128682 79547 46930 39883 33790 26272 22409 19152 15833 3863
19291 3863 -6024 -10351 -16958 -24409 -30164 -25220 -22480 -14401 -11476 -10536 -8329 -4482 461 -2025 -6117
19276 -6117 -8619 -11526 -8183 -3828 -1388 -1735 3885 14374 20019 17936 16528 23547 30042 28671 18512
19261 18512 17273 15033 14005 8534 6116 7334 7685 14312 11024 2900 -699 -5941 -5127 -13590 -12849
19246 -12849 -13672 -14225 -16893 -9990 2791 2982 -5213 -9132 -4027 -1211 -2643 -4498 -2152 2672 13591
19231 13591 29661 36163 43975 49427 52328 48829 40875 37286 38174 33094 29063 30785 40567 55124
19217 55124 60810 60746 70326 79504 76977 70653 66713 59508 44904 33688 25540 23763 23163 21172 26148
19202 26148 24756 25022 29050 23671 16838 6911 5393 665 2745 13543 20420 23147 29485 22352
19188 22352 14229 20903 24440 26979 22295 23095 27545 40429 53515 60382 66776 68540 69807 68666
19174 68666 60729 54612 42979 35523 31564 20067 872 -21676 -39887 -46584 -40786 -30576 -16900
19161 -16900 -2522 8554 14601 9754 1458 -4529 -9202 -10952 -4992 5491 16485 21850 27872
19148 27872 28775 21555 15062 4461 -6433 -9670 -10866 -11451 -14747 -18832 -18773 -17829 -26348 -41401 -65973
19133 -65973 -93711 -114230 -122122 -126975 -127234 -117094 -107565 -94173 -83468 -78444 -71223 -68468 -67415
19120 -67415 -63400 -64390 -72941 -86753 -94482 -95536 -98748 -96048 -94921 -80267 -64183 -43112 -22869
19107 -22869 2004 30894 67564 105044 130084 148494 151746 135561 115125 100848 85458 65128
19095 65128 58216 57675 51603 40534 34283 26185 20309 18023 6079 -4980 -11471 -16444 -32363 -62380
19081 -62380 -92308 -113388 -124663 -135628 -126618 -102075 -77506 -53875 -41297 -29578 -23478 -16840
19069 -16840 -11603 -3003 1468 14020 34626 59532 77720 98203 114027 105066 105979 116440 133630
19056 133630 147191 164049 190789 220744 244637 267531 275343 268589 242529 203729 170384 144018
19044 144018 131417 127873 128131 120721 113097 119755 120567 114488 113086 108312 103596 100748 104543 104876 107684
19029 107684 114565 120019 124441 129320 135885 140503 145639 162934 188080 210372 221106 230579 244604
19016 244604 272000 300301 331218 371948 416160 460286 502731 540472 578176 617590 665536
19005 665536 728180 815144 935615 1070369 1216653 1366906 1505466 1625672 1762779 1944399
18995 1944399 2175749 2489750 2916605 3508102 4339159 5503334 7071356 8971134 10869246
18986 10869246 12249360 12859740 13066149 13611665 15309000 19060903 25889678 36487531
18978 36487531 50268153 64654881 75187170 78695725 76214829 70298146 62256182 52859427
18970 52859427 43463699 35642341 30505937 28303556 28355065 29226456 29156718 27048343 23239352
18961 23239352 18847645 14821742 11642305 9353523 7799643 6816324 6270947 6041739
18953 6041739 5955956 5844698 5693165 5583715 5562926 5625576 5721926 5781265 5836100 6006363
18943 6006363 6441556 7259286 8600026 10584063 13381774 17180162 21815737 26442765
18935 26442765 29653937 30479336 29387354 27938922 27837925 30468321 36690120 46581959
18927 46581959 59274441 73003097 85715634 95605756 99840449 95142071 82143330
18920 82143330 65462837 49583892 37130009 28741514 23849898 21467034 20438464 19556972
18912 19556972 17915626 15445347 12695741 10184521 8170950 6669481 5580836 4801992
18904 4801992 4251729 3846517 3532693 3282815 3076736 2877490 2654407 2409656 2161130
18895 2161130 1929553 1728507 1560161 1429601 1318206 1226042 1142025 1065731 986312 920076
18885 920076 861866 816705 781847 751392 720252 696996 675688 648232 630690 619730 610887 597555
18873 597555 586646 574637 557236 544743 536003 519611 506937 496504 484013 465469 453079 443540
18861 443540 431876 423078 420031 411721 401181 392425 385598 390007 395619 389704 385902 389592 393495 384843
18847 384843 372584 361663 348444 333514 329164 321440 315979 316184 311423 303324 299373 289014 282255
18834 282255 277403 275805 282158 278019 272248 263731 255264 251358 252009 260202 275111 288719 301104 312406
18820 312406 318787 314010 302357 282592 263049 253995 235135 222043 217093 214501 222338 227002 219429
18807 219429 216927 219683 216859 207149 205950 215260 224036 230089 240024 247820 249953 242186 244072 239641
18793 239641 227857 220903 221976 230361 243936 260463 276433 295535 323138 346382 369704 362803
18781 362803 329447 287658 252907 223063 198318 186889 185576 188015 199399 214203 227353 242298
18769 242298 270966 310217 328238 313201 269067 216808 178144 159823 146008 137171 129650 129130
18757 129130 133595 132805 121517 108398 108642 111809 113622 118661 116918 111918 111029 112286 119250 129541
18743 129541 128865 124317 120278 121516 130382 144433 153051 157657 164035 172173 177162 170954 149476 120785
18729 120785 103239 93753 85799 75853 73276 73916 79920 90809 95380 99297 99505 103058 112427 115621
18715 115621 113620 111385 115810 114672 107893 110257 104194 96472 93121 85525 86684 95556 95786 86746
18701 86746 78188 67082 62096 63952 58555 58784 59913 55490 57681 59710 60112 51757 51551 52721 53323
18686 53323 49788 49396 56469 63232 61743 58721 56564 62255 69053 72825 77375 80522 88151 91564 88935
18671 88935 88621 102219 100623 92117 94333 102868 109785 111147 112751 110108 103157 97705 93023 81444
18657 81444 70746 52160 35244 21690 789 -13981 -16335 -16456 -17718 -21447 -18380 -13006 -10087
18644 -10087 -10509 -7060 -1918 5184 5217 10716 12054 17203 19128 24965 28947 25606 21987 23488 25477
18629 25477 30906 30279 27923 25380 17392 7320 -2694 -15172 -30614 -43199 -55069 -65129 -75498
18616 -75498 -69378 -56755 -53531 -44203 -26845 -9297 1777 3840 11104 6605 4304 -3011 -11810
18603 -11810 -15358 -17530 -20521 -20033 -9390 1597 5163 11819 27212 51336 79745 111249 131159
18590 131159 147343 161124 168339 167295 158030 153882 142119 128527 115205 102246 89269 80359
18578 80359 68073 59548 58959 52159 48824 48680 42924 32759 20819 10374 -3973 -17739 -29099
18565 -29099 -35889 -36381 -27677 -9951 9930 27243 51938 71007 88048 98726 94271 86657 82184
18552 82184 79010 81259 86236 86657 85030 87497 97396 99767 113890 128496 137429 153292 168157 181224
18538 181224 195217 206806 211882 208030 196330 181565 168108 154333 139590 125894 114684 112977
18526 112977 118616 127041 132497 141487 153090 157563 156429 157258 162929 172335 175651 172532 173399 183919
18512 183919 196019 208265 222253 249042 268455 285167 297837 305887 325332 353226 379033 406325
18500 406325 434757 474780 516830 549489 586636 637643 702413 772046 862018 966162 1087298
18489 1087298 1231221 1390814 1573900 1765651 1973984 2222614 2489940 2811362 3245798
18480 3245798 3842580 4657420 5684548 6869389 8224052 9824331 11596529 13361772
18472 13361772 15256955 17694956 20936142 25295648 30857650 37382162 45195917 54316463
18464 54316463 63050756 69485767 74258262 77427922 76607652 72199231 66808399 60989114
18456 60989114 54131582 47122743 41329385 37073262 33856480 31105661 28610817 26371280
18448 26371280 23976650 21192418 18343214 15747119 13428229 11406353 9799010 8597169
18440 8597169 7663951 6941180 6426438 6107156 5974082 5993036 6065047 6114875 6172046 6364985
18430 6364985 6824297 7646357 8854775 10364573 12033782 13897927 16097470 18534813
18422 18534813 20838790 22942407 25182523 27518077 29834099 32680647 36857139 42248918
18414 42248918 47575329 52242302 57083037 61573911 63477904 62342822 59908736 55845928
18406 55845928 49461238 42274704 35764487 30016864 24862605 20665885 17505791 15108628
18398 15108628 13281407 11761175 10287218 8885540 7643894 6551045 5572626 4732380
18390 4732380 4063840 3561890 3174388 2866851 2619493 2409053 2206827 2020932 1856661
18381 1856661 1702435 1554808 1426869 1321908 1232571 1158209 1086647 1023216 971934 931491
18371 931491 891552 850989 809979 774769 735309 703952 683413 663903 641789 626061 608106
18360 608106 589764 571993 558219 547327 534343 525447 523881 519303 501292 481836 465714 457693
18348 457693 456453 445522 442196 437976 430351 420869 412615 416056 412911 412593 410786 415700 412145 412725
18334 412725 413049 406340 395318 384784 382381 377427 372200 363108 356231 354400 352482 351434 345971 344290
18320 344290 340264 335708 329354 328332 318510 317854 317269 316921 317025 320014 329167 339984 339156 335674 338230
18305 338230 338311 328588 315047 301097 291926 284298 272100 260082 257803 256062 259139 253553 250638 249130
18291 249130 250224 258859 262712 264659 265554 269878 269886 265756 262729 258420 258650 255489 254376 267465 273505
18276 273505 281725 281869 282621 277392 273086 265654 262430 262362 251016 239880 231565 217988 199253 192440
18262 192440 193607 203465 212290 219056 223186 230216 238549 235058 230565 223995 222444 217029 211701 207380
18248 207380 204993 200407 190235 182314 173033 162520 151733 148348 151076 156923 164898 171203 174473
18235 174473 179202 189370 190925 182263 180620 181999 187279 191532 191249 189316 189314 194044 196916 187891 186671
18220 186671 186248 177665 170916 160324 148109 138962 139564 137306 128886 121115 113626 113635 110906 114084 114488
18205 114488 110779 106189 103674 99469 102933 111778 111587 111825 118379 124199 123458 127009 125910 124009 120380
18190 120380 120269 115204 116928 125863 132368 135465 143703 158442 173287 186422 196278 194827 187123 180127
18176 180127 171842 167052 160581 149060 148828 148219 149580 148109 145973 146462 153131 153218 151949 147747 148300
18161 148300 153791 157443 157555 147011 144531 141783 142632 142517 149765 150710 154454 155998 165157 178695 185815
18146 185815 194894 200440 206230 213906 225291 237831 254904 269746 289568 317425 352608 404291
18134 404291 474795 568338 700192 890495 1154689 1521343 1981686 2521290 3117060 3716583
18124 3716583 4234851 4567740 4643060 4414473 3931546 3314901 2712828 2218153 1881705 1706168
18114 1706168 1696233 1899330 2433430 3603228 6003021 10120148 14055978 13631972 9974334
18105 9974334 6505140 4196215 2804980 1992183 1511671 1195178 965450 796925 662900
18096 662900 559495 482660 424900 381198 352689 326666 308575 301154 291410 281365 279542 271584
18084 271584 257989 238520 226781 220054 210583 200981 191208 186364 194984 199417 199066 201594 191295
18071 191295 183694 182644 183826 185597 187250 183540 174547 158392 140816 133181 133943 131210 124574 109386
18057 109386 97616 101318 103321 101042 95310 91229 98542 101184 106274 105199 99680 87909 85298 87489
18043 87489 93579 98479 99190 91830 98374 102452 108048 115192 130702 139205 134820 117539 103129 97961
18029 97961 90645 85965 89862 89579 87446 81754 77511 69972 66353 68544 64241 64185 67354 64374 65333
18014 65333 60359 57890 50573 43892 43717 40043 32299 33870 43019 51879 51027 46499 37823 35451 33290
17999 33290 39682 40794 36131 36898 36806 43442 51317 52116 53842 54470 58708 58994 64053 69908 67278 70670
17983 70670 67867 64917 65372 76464 78178 69999 65747 73498 72030 68904 78667 89066 93383 96461
17969 96461 97565 99268 100226 102998 109844 112277 128461 142109 152225 173273 193292 221106 244515
17956 244515 267194 285742 297289 318202 343913 354860 360167 360070 360479 353178 335953 324681 300544
17943 300544 269914 245933 222963 192707 170342 161503 144405 130162 121491 120687 131360 136464
17931 136464 129815 125604 118402 108862 99851 92834 89553 89561 94183 96492 96229 104852 110495 119292 126386
17916 126386 136604 144998 150714 165523 185893 204485 219829 237727 257808 271107 272537 273607
17904 273607 270580 264020 251314 249659 239168 231834 229736 231805 244305 254570 262696 267467 261851
17891 261851 248430 226570 202265 174542 153226 135746 116898 102112 84400 77840 77657 67852
17879 67852 52744 46427 44729 42649 42926 43997 42937 38166 39636 38593 36591 34280 36673 38388
17865 38388 38289 34096 38403 42748 43858 41755 40113 35828 37854 38327 41473 42131 40971 33060 32521 28980
17849 28980 23842 19442 15572 15337 25858 30003 28028 29067 29334 31671 33976 34691 29136 24695 25109
17834 25109 23940 27714 34996 34433 38096 37941 38285 34813 31303 30621 34857 34776 27861 27233 26614 27863
17818 27863 23347 26533 35892 34949 32428 36470 36491 35950 37464 33600 38557 37405 31415 30838 31898 29325
17802 29325 31620 34291 39105 38596 43517 42542 34418 30763 38559 35940 31268 26093 29658 35590 43224
17787 43224 42286 41413 37582 38158 35109 36593 38524 36269 36303 48890 54513 55057 51810 52638 53490 49073
17771 49073 38212 34410 30969 22457 17489 22583 25227 22744 25545 27854 25978 23715 20709 20758 19450
17756 19450 22303 26033 31154 32394 29246 24265 27247 27622 32793 38568 31519 27359 24454 19086 15805
17741 15805 11674 8851 10869 10366 13087 16793 13231 13845 18463 15367 14453 21672 19154 21547 23272
17726 23272 18757 26065 25268 25188 22141 21906 26126 27642 26490 24867 22415 23789 21347 23915 25023
17711 25023 25497 24249 25157 18983 15154 14959 12905 20227 26427 28187 30263 35679 38425 41069 40134
17696 40134 35188 30615 21284 21244 21990 20153 26148 27916 24939 19101 27236 28816 25018 24621 25883
17681 25883 24741 23796 24040 23244 22570 16719 10899 13126 15804 20081 20794 15048 10751 10687 17413 20843
17665 20843 22738 19673 18924 20975 19096 18896 23801 23635 18331 13710 16681 17687 20781 23309 21726
17650 21726 14065 14122 19634 23064 23645 29037 29576 29743 24791 18662 20127 19076 14501 14563 23940 25950
17634 25950 25852 29506 29401 24436 21149 19610 24114 28899 23923 26510 30527 28683 28951 28444 20494 19609
17618 19609 26333 26659 26052 25508 22010 15394 14679 17811 22396 25443 22944 21956 24491 21610 14767 18347
17602 18347 24505 25903 26528 22029 21105 22948 20619 19414 20824 21981 25741 26194 26334 24362 22066
17587 22066 20650 24085 28402 29306 23832 22771 19275 22476 32524 27233 20804 17872 22538 22281 14805
17572 14805 14659 11801 13964 18293 17691 13561 11754 10995 12262 12801 16239 13248 10759 12030 12659 14981
17556 14981 12047 15586 19265 16238 13866 13083 15285 18694 18301 16151 21792 30024 27364 26175 20886
17541 20886 17782 19936 14131 13642 15896 16175 16542 15282 15980 18128 16846 8550 3532 5817 7929
17526 7929 8736 11783 10937 18368 15901 5362 10933 24019 31212 27534 27134 16057 11982 14890 18424
17511 18424 16313 14650 12923 13539 11568 4984 6743 8907 7697 8688 13565 13672 19757 19650 21214
17496 21214 18000 12435 13201 10392 9971 -1333 -4718 -2709 -2571 2659 2456 -1019 1052 -3635 -5845
17481 -5845 570 4127 7961 2572 -62 1061 4997 10080 12768 9055 9146 8225 9002 12275 5629 1648
17465 1648 11103 15738 11780 6169 10063 5543 178 323 5830 9263 8006 3012 6262 9788 7165
17450 7165 8344 12694 17840 17978 16863 15854 21962 35956 58080 81333 87343 67502 50750 41759
17436 41759 36488 36671 31634 24049 18743 22486 22669 18180 14978 13788 10746 6383 6481 11595 14400
17421 14400 9061 8882 9231 11791 11285 14598 13951 9708 14246 17195 16792 12820 9381 6889 5454 11086
17405 11086 21284 28841 22731 11483 8726 9334 9543 4494 6616 7693 7791 11849 9773 14611 13187
17390 13187 11038 13844 15395 10673 1913 -3687 3968 10199 6077 3750 5633 10232 7076 7689 9081
17375 9081 9996 8315 973 -641 7700 13181 10693 7585 6946 10823 11030 11672 16513 21125 20152 11175
17359 11175 5088 9951 12902 6415 4190 6700 11321 15836 12481 10150 6968 3208 1203 6212
17345 6212 8779 5012 2187 1520 341 5717 6831 8341 11412 9576 10838 12009 13951 16428 5848
17330 5848 3892 4878 1505 2824 3165 1576 3219 6136 16428 19111 22733 23628 10106 7305 8863
17315 8863 10661 8651 4952 7823 12272 8583 10396 14274 10182 6279 12439 13820 18991 20183 15602
17300 15602 15414 17067 19403 16705 21916 22820 22532 23598 25019 24067 22757 23690 19847 16484 15760 21129
17284 21129 21973 24830 24051 16393 19746 21648 25286 23883 21028 19829 19281 17513 10714 1983 2930
17269 2930 6234 11729 6555 7759 5765 5230 11893 12513 5557 8846 11063 13065 7289 3376 834
17254 834 -321 -2623 2536 6447 9990 10367 11942 10660 10101 13105 11096 10252 9886 11578 10825 10485
17238 10485 4042 3669 3868 8267 9151 13033 12868 8128 8737 10734 9771 15928 17557 13012 7525 -3629
17222 -3629 -4014 -276 6079 7586 8784 13296 11015 7891 4272 4510 8154 5194 3500 4161 9736
17207 9736 14959 14639 12497 11300 10968 10376 1290 486 6187 17357 15872 14186 14938 12519 9114 5217
17191 5217 3370 7709 13050 19750 21516 20202 18701 15415 13628 15489 12322 12365 16052 18802 18027
17176 18027 18631 23163 23514 18077 13043 8472 8469 505 669 4404 2347 9758 13050 8689 6435 1839
17160 1839 2611 4882 8673 9857 12271 14346 15824 17250 17345 21877 17509 7816 3853 6245 7069 7396
17144 7396 1656 561 2406 2280 4519 10900 11697 19931 17306 11788 14195 14773 18516 19252 17788 12869
17128 12869 8071 608 7338 9662 7729 11916 11442 11704 10309 2048 3132 817 1439 4749 1684
17113 1684 -1326 -1243 -606 -4548 -6119 -7010 -2359 11868 10932 5733 6632 9048 6932 10306 9042 5651
17097 5651 4240 7902 12765 14122 16341 16472 14312 11941 8194 3774 -1598 -6756 -3055 2107 5601
17082 5601 4385 574 -332 -948 1266 -308 -3481 -4825 -3769 -961 5200 9386 9297 4583 2195 5301
17066 5301 10548 14458 12816 6528 -1099 8137 8689 10148 9929 7471 8553 8657 9277 5898 3454 10819
17050 10819 8592 5517 7383 2089 6600 4560 6672 5680 11728 10639 11335 8469 5738 1193 -1228
17035 -1228 -3222 1973 4601 6557 11092 2221 -6029 -5981 -500 781 -488 -1360 2968 11534 13077
17020 13077 9324 13477 11100 6170 4893 -2766 2550 6562 9860 11676 16115 23115 28073 25628
17006 25628 32909 56879 71804 70193 52051 36056 26830 22807 23697 21443 10546 4106 1827
16993 1827 2728 5196 6724 6916 10987 4743 1462 3567 2698 3349 1184 4982 7019 5188 6278 7701
16977 7701 9436 4126 -2106 4050 7326 8149 7961 1038 1191 -646 -1867 -2275 -1692 -1383 -2509 -6588
16961 -6588 -5853 -14641 -15011 -5705 -1500 4472 11872 6518 2789 6768 11607 11223 9077 8561 5949 6445
16945 6445 6922 4216 4801 -111 -4164 -225 1881 7667 11336 13724 12556 7968 5338 197 -1312
16930 -1312 -9137 -10802 -7616 -3996 -5068 -6171 -461 2466 -1059 -3981 -3188 -4044 -3373 -6963 -5667
16915 -5667 -5684 -5022 -440 1931 -63 -2926 245 -1483 -2032 -58 4269 6073 993 91 560 -1969
16899 -1969 -7621 -13011 -8101 1435 1708 -61 -3229 3230 11362 13686 11149 8314 8519 9957 2621
16884 2621 3804 4587 108 -370 -791 -836 3570 3035 349 4682 -1845 -4402 -4720 -6898 -7771 -7935 -2138
16867 -2138 337 5108 3212 2655 5341 5806 1988 3166 2305 6098 9652 11508 13869 13244 5550 5776
16851 5776 3622 6183 13114 26664 37225 35591 29012 29479 24917 22588 16024 11460 6539 -1321
16837 -1321 -1523 -424 2974 -477 -3417 -4130 -1879 2550 1914 406 2844 3579 1805 -814 -325 2074
16821 2074 6474 7700 4499 4688 5837 1789 400 3362 -3005 -6131 -2250 -2434 -1947 3488 7428
16806 7428 9817 7807 413 -3931 -2041 4713 11538 9775 7346 8702 6896 1691 -3972 2502 9201
16791 9201 12466 11115 9954 10597 8840 3055 1417 -470 1769 6530 1925 -3206 -3722 -8455 -8473 -4343
16775 -4343 -4494 -4813 -8517 -9281 -11597 -6821 -6162 -1404 4095 5910 2820 -144 6306 2514 -1200 -1546
16759 -1546 -3883 -1638 -167 3469 806 -1699 -356 489 1281 -317 1033 3176 7546 6110 -1095
16744 -1095 1191 8295 9365 11637 16405 13434 11426 7414 -32 -3930 -10376 -225 4265 -856
16730 -856 -3856 -3352 -5713 -3124 -2642 629 1521 1210 3656 5320 -305 -646 2607 227 -849 3075
16714 3075 4451 6622 10212 13518 14404 14956 17574 24348 22141 20344 11907 2576 -2230 -3261 2859
16699 2859 1197 7451 15051 19809 17407 8358 8436 14466 21279 15224 13293 16224 21035 19319 19502
16684 19502 13284 754 -10087 -10884 -7588 -5595 -5565 -6274 -6291 -4977 -3919 494 3043 -2362 -2889 -589
16668 -589 -2772 -1299 2708 973 -11040 -14532 -5256 2249 7717 5515 -3230 -3799 -1662 -4302 -4646
16653 -4646 -5766 -2563 -5939 -6659 -10102 -5194 -6666 -1097 1097 -1062 -2150 -5945 1080 2098 2127
16638 2127 2674 2973 7258 7689 -62 1393 3104 -1838 -10260 -9763 -9001 -4490 -2142 -15 3438 5548
16622 5548 4234 2510 4245 2775 2404 2888 2732 -655 -4419 -774 2813 3383 453 287 -1865 615
16606 615 -3782 -3934 -6261 -11733 -10254 -8235 -11668 -4361 -2550 614 348 -4366 -6724 -5697 -9044
16591 -9044 -14567 -11818 -1587 6854 2572 -2963 -2417 -3788 -5234 -5016 -1285 5609 6262 4549 -396
16576 -396 -4684 -3983 -2733 1240 6839 8884 2803 2810 12809 18697 15169 10162 4993 3670 3924 1429
16560 1429 6836 6182 1575 -3239 10 4490 11054 14071 14102 12260 7936 5630 -2747 -2026 266 -2625
16544 -2625 -1764 -2325 -6115 -13036 -11792 -7023 -5559 -6959 -8165 -3777 5628 6701 9049 4834 4392
16529 4392 3498 898 -2142 -5219 -6242 -10101 -8102 -8087 -9578 -12371 -6440 -5901 -3111 408 783 -2407
16513 -2407 1167 -543 -1701 -350 -983 322 712 4115 4344 2719 -2428 -2294 -2560 -7015 -10626 -7778
16497 -7778 1936 5050 5802 -7834 -11752 -5833 -3702 1770 1675 -3071 2319 3424 3048 1210 1162 -1230
16481 -1230 -7537 -8811 -7515 -4119 -2347 401 1261 -3756 -173 3766 -1073 -6289 -9810 -7308 -6164
16466 -6164 929 -2481 -5599 -5199 -313 3591 1196 2835 3563 5499 6180 5464 980 -3929 -1927 2382
16450 2382 2200 173 4940 3805 -3149 1772 4757 3165 682 2482 -418 3520 7563 3193 1982
16435 1982 888 -839 -283 2397 1143 -3494 -26 4411 7977 15359 10438 2390 565 -1323 152
16420 152 4117 3179 1860 -3512 -607 -5822 -6636 -4459 3904 11105 9724 6705 -824 -3718 -870
16405 -870 -1851 2008 1353 -7527 -17781 -13772 -13473 -16468 -23210 -23039 -14181 -7282 -9141 -11985 -8693 -14104
16389 -14104 -18345 -15135 -11023 -9547 -7352 -2947 -3024 -3163 -160 1417 -555 -1179 4179 5882 6163 8669
16373 8669 6549 7439 5901 8827 7825 6076 1751 -611 -7384 -14874 -12791 -11870 -9513 -11790 -16078
16358 -16078 -21052 -23288 -19788 -14613 -11770 -6729 -7662 -3727 -6033 -5719 -5912 -4803 -9598 -9907 -5382
16343 -5382 -6377 -8023 -8129 -7155 -2256 7418 4529 2551 1755 -2488 -5097 -12661 -14065 -10058 -5792 -5704
16327 -5704 -8221 -12203 -11893 -9549 -7237 -7195 -4119 -4221 1278 397 1174 6121 31 -721 3402 -3293
16311 -3293 -7684 -6467 -3473 -4914 -6279 -8935 -4322 -2676 -7814 -10651 -7848 -5153 -7974 -9511 -11969
16296 -11969 -13750 -11533 -5216 -8712 -11990 -19131 -16468 -11768 -3202 1440 1713 1094 1134 989 617 1989
16280 1989 5065 3841 4088 -2052 -7005 -8174 -10000 -7611 -3786 -2349 -8337 -5997 -5298 -4430 1802
16265 1802 976 -3841 -3098 368 -6176 -11935 -10175 -6062 -1498 1783 1440 3553 4916 1935 -692
16250 -692 816 5834 13005 6105 -1221 -817 3453 2674 6272 4318 1492 2008 -320 -4851 -3709 4431
16234 4431 5296 1475 -1957 -2656 -4058 -8116 -9041 -10539 -10705 -5655 1390 -3598 -3920 -4842 -1941 -4041
16218 -4041 -6612 -10162 -2122 249 -11564 -12763 -12785 -14064 -12636 -11294 -7471 -544 -4891 -10468 674
16203 674 1582 -943 -2082 762 -2043 -7412 -4842 -2639 -2216 -7561 -5161 -5422 -10677 -14525 -5077 7665
16187 7665 13346 11273 13154 10985 2818 4620 12039 8744 8265 7548 12464 12044 8499 3841 592
16172 592 3430 -1096 272 -70 -852 2640 -1588 -9535 -11894 -6943 -4215 -5052 -4311 -2661 2235 -677
16156 -677 -1406 -5 -2770 -3231 -1300 -4917 -7140 -7173 -7396 -4261 1566 3235 1195 4639 7803 5717
16140 5717 -1516 -8292 -9970 -6945 -2925 -5079 -3913 1184 8268 2266 -4516 -6783 -12399 -17884 -19652
16125 -19652 -12824 -8905 1197 4606 -5888 -5711 -3856 -2435 -3369 -1412 -4177 -4357 932 -152 -1030
16110 -1030 -3814 -8197 -10595 -3644 2144 1474 2598 5083 -76 -1699 -3072 -8632 -13469 -12906 -17545
16095 -17545 -14732 -15662 -13635 -11438 -12722 -6914 -10615 -17728 -16766 -17320 -13448 -10511 -8454 -6830 -2966
16080 -2966 -3637 -4362 -10021 -13896 -10822 -8926 -8375 -666 3633 4324 -1034 -1619 -1594 -4683 -7723 -2481
16064 -2481 -1524 -4531 -8148 -12009 -10207 -12665 -17805 -7140 1187 2505 3078 821 -6805 -8743 -7214
16049 -7214 -5821 -1122 -4843 -3233 -4845 -11849 -8370 -3692 -4835 -872 8979 11835 11950 8169 5926
16034 5926 8673 1225 -1269 619 4656 6497 1517 1963 872 1556 1386 5975 7199 -1546 -3820
16019 -3820 3996 11597 17333 13870 3520 763 3178 3270 -2892 -3994 1671 4304 -54 1480 4598
16004 4598 -2616 -5921 -5556 -6190 -9336 -18368 -16715 -15623 -14877 -11217 -11259 -10789 -5096 -7864 -1945 -1366
15988 -1366 -6648 -10466 -13625 -16371 -13333 -2170 -165 -321 3312 4108 3689 -887 -3833 -9040 -8079
15973 -8079 -11090 -15771 -13850 -8446 -2468 -4591 -6851 -6539 -1536 807 2444 5113 807 -30 1641
15958 1641 2194 1736 365 -4223 -3838 1336 828 170 1050 -2640 -2473 -3929 -8869 -7298 -4592 -4986 -6233
15941 -6233 -6788 -12059 -5039 -1021 4206 3442 2723 1372 -107 -1262 -9029 -6640 -3613 -2286 -1607 -2056
15925 -2056 -3902 -10716 -5951 -2992 -7411 -8021 -4589 -1213 3743 2877 4034 1784 -1936 -8730 -8622
15910 -8622 -8634 -10587 -5877 2008 -3929 -6840 -7610 -6652 -1094 1983 1680 2405 2638 5283 -3667 -10312
15894 -10312 -4568 -1910 218 -5636 -6995 6043 6637 2547 4790 -682 -5146 -1157 1879 5287
15880 5287 -960 -5245 -4175 -2625 -3185 104 5142 11411 8789 1461 -1881 -2990 -3975 -431 8031
15865 8031 8898 3045 -2684 -2992 -3321 2265 7161 5741 3092 5179 12112 17749 14447 8986 7138
15850 7138 -552 -1761 -445 334 6070 6037 1856 85 -1796 -2295 -3750 -7475 -4525 1602 1086 2226
15834 2226 4895 4704 4806 -1453 -1500 -520 4651 4719 2288 -2235 -2500 338 -2452 -2872 -2866 -6513 -6077 -6444
15816 -6444 -6163 -10622 -8436 -572 -2944 -4389 -6829 -8693 -7963 -7439 -11196 -11013 -3994 -5491 -5943 -6412
15800 -6412 -4014 -1385 -2975 -3895 -690 317 -5297 -9158 -8292 -6506 -7385 -14929 -13708 -15112 -12353
15785 -12353 -7793 -3809 -194 2037 3774 2725 9573 2747 -8904 -8711 -9319 -4695 -128 3459 1806
15770 1806 8112 5564 7264 8192 5625 2576 -5445 -7342 -4950 -7282 -8862 -5677 -11980 -4946 -1861
15755 -1861 -3624 -4036 -4562 -7162 -7415 -2802 -840 -511 -4715 -5726 -5241 -3844 -29 5796 -826 -6631
15739 -6631 -8805 -4021 -1936 -9733 -13995 -12585 -11604 -2112 7173 1465 -6590 -7325 -3747 -254 -3251
15724 -3251 -11948 -14640 -10831 -8758 -10727 -17436 -19194 -13840 -9538 -8462 -5307 -6103 -7215 -8017 -7746
15709 -7746 -11717 -11976 55 6071 3272 4783 1132 -1712 -7568 -14831 -9474 -1398 2684 1752 -5818
15694 -5818 -6811 -10854 -9293 -656 6778 4474 1458 -4302 -7559 -8747 -9492 -9788 -2219 2121 -7136
15679 -7136 -3406 208 -2115 -5173 -4396 1742 8777 7492 3085 6724 12249 16827 13023 9046 4439
15664 4439 963 149 -168 2269 5641 3302 -2373 -3593 -3506 -15412 -25408 -18777 -11865 -3768 -3394 -9039
15648 -9039 -7457 -2522 -9103 -9894 -11655 -7553 -8076 -7152 -7584 -7874 -6599 -5024 -7731 -10014 -3622 -5216
15632 -5216 -8024 -6589 -2607 -3223 -8944 -9639 -6138 -3685 -2532 7 5762 475 -6400 -11406 -9733
15617 -9733 -6072 -5653 -2714 3629 4136 6032 1949 5758 6337 1557 -279 -2882 -8713 -12117 -15403
15602 -15403 -15160 -13246 -7799 -2638 -3947 -11560 -7896 -5740 -8640 -5507 -8037 -8065 -3205 4108 6159
15587 6159 -794 -7738 -10473 -7086 -230 -4712 -5795 3563 4565 -5895 -13103 -10966 -3552 -5884
15573 -5884 -8818 -6651 -5374 -10565 -18415 -12222 -6906 -10695 -11298 -8477 -8484 -6876 -7991 -3549 1890 -1273
15557 -1273 2957 7332 4269 -3129 -1456 3541 9151 10190 9144 5444 1888 6774 2910 -8754
15543 -8754 -11482 -9703 -8242 -4557 -4405 -7413 -13070 -8382 499 332 -4200 -6956 -6959 -4274 -7848 -6473
15527 -6473 -5439 -9669 -16555 -15189 -3549 1284 -3867 -8798 -7464 -3770 -7428 -3477 -7341 -8433
15513 -8433 1519 1293 4261 9121 3929 1838 1071 -1550 -9486 -10821 -7065 -3886 417 -337 2455
15498 2455 -84 -1178 -3184 -1368 1606 3084 -4579 -2995 1950 -2152 -13229 -8894 2237 7250
15484 7250 4098 3246 4701 -8995 -13214 -11044 -6989 700 3288 -4078 -7640 -8286 -14553 -19593 -13787
15469 -13787 -9818 -10840 -6253 -13499 -18215 -15306 -9060 -7386 -3709 -4434 -8935 -14498 -8960 -1911 -2876
15454 -2876 -8270 -8783 -12988 -15526 -9682 -11131 -10408 -9191 -3451 -2985 -10254 -8810 -6556 -5136 -4812 -6299
15438 -6299 -7387 -8112 -5096 -2535 -1269 -9085 -6362 229 2287 4855 3709 6019 3386 358 1258
15423 1258 -2034 -3523 -7602 -9980 -13344 -13307 -12914 -7072 -4973 -2576 -7817 -7390 -3353 -2327 -1308 -3487
15407 -3487 -9521 -11874 -8887 -8343 444 -1600 -5643 -7412 -5198 -7816 -8913 -9340 -5367 -5484 -12368
15392 -12368 -15229 -8799 -7882 -13982 -11649 -12251 -9583 -8229 -5819 -9865 -7858 -6639 -3991 -2657 -3936
15377 -3936 -5281 -10252 -16231 -14998 -13585 -9165 1560 1722 -76 -2778 -2044 4265 8249 2727 276
15362 276 -2929 -1323 -644 -649 4118 8694 13092 6851 -1908 4754 12503 8584 6707 -3029 -7150 -11480
15346 -11480 -15459 -13194 -8254 -8965 -6175 -1766 -4657 -4337 -1616 -1538 -4595 -9670 -8273 -9333 -15245
15331 -15245 -14985 -11293 -6030 1747 2982 -874 -2559 -6438 -6241 -261 4127 5625 1460 -2379 -1036
15316 -1036 -8168 -9697 -13444 -17248 -15254 -14234 -9640 -6638 -10430 -8917 -7509 -6753 -10532 -9697 -7675
15301 -7675 -4744 -9163 -8988 -4326 -1298 -1438 -2400 -4897 -2664 -2460 -4421 -5336 -7763 -6957 -12342 -11520
15285 -11520 -11118 -8552 -4852 -7163 -5132 -3475 -2605 -2836 -2642 -6600 -2969 -730 -9342 -17636 -22658
15270 -22658 -19658 -8779 1478 6118 -47 80 5651 6393 -270 -2329 1651 3406 4236 9664 9967
15255 9967 1801 -3999 1396 -286 -4075 -734 -5339 -9367 -11581 -7436 -11576 -11157 -6573 -14552 -19228
15240 -19228 -19128 -14329 -12156 -10349 -4584 -8740 -7605 -3682 -81 168 -2777 -720 7941 8342 -258
15225 -258 -2250 3976 5633 6526 2811 -3324 -7079 -6484 -2068 1124 -2446 -3934 -7525 -8103 -11191 -17290
15209 -17290 -16239 -10832 -7452 -8667 -11008 -12706 -8964 -4556 -2338 4894 9327 6131 2513 891
15195 891 -2462 -2840 -2933 -7565 -16747 -11306 -12448 -16004 -11398 -9358 -6042 -9048 -12996 -5253 2436 431
15179 431 -857 -5520 -4830 -3069 703 4610 1670 -1254 -4695 -8239 -10747 -17384 -17249 -4806 -2782
15164 -2782 -5047 -2777 1797 -5989 -10999 -14501 -17138 -20977 -15668 -15252 -13008 -12531 -14195 -14024 -14206 -12298
15148 -12298 -8449 -5274 -2002 -8818 -17522 -12097 -9039 -8201 -7111 -6456 -1436 -1583 803 5382 5642
15133 5642 -932 -3060 -9247 -14185 -12207 -5703 -4228 -4426 -5221 -6956 -6795 -8936 -4906 -4592 -1829 -4878
15117 -4878 -12451 -12978 -9034 -8365 -11263 -12132 -11248 -6817 1816 -2452 -1693 7146 5922 1808 -3049 -5206
15101 -5206 -4455 -2189 -6043 -8363 -14786 -9504 -9292 -7307 -5498 -12892 -8695 -3403 -558 -3520 -5019
15086 -5019 -7702 -8028 -13478 -15430 -13296 -8947 -6926 -5294 -4510 -10327 -9072 -2501 575 -1252 1058
15071 1058 3466 1215 -1473 2028 438 -5652 -7559 -6739 -6766 -10095 -10573 -10951 -14863 -7882 -2755 -7178
15055 -7178 -1354 -70 -3076 -1430 -1826 6514 10588 4367 489 1026 -3285 -9295 -2158 6184 148
15040 148 -5830 -4886 -5801 -6178 -9184 -6157 -4925 -5259 -4787 -4251 -9560 -7774 -4204 -4001 -4525 2054 3519
15023 3519 5923 7690 2979 1212 -6279 -11241 -13054 -7781 -5542 -6051 -9633 -10016 -10782 -13088 -13474 -10528
15007 -10528 -6366 -7102 -3231 -818 -494 -2539 -6499 -4016 4007 2760 4336 -450 -10340 -13363 -12506
14992 -12506 -4901 -676 5169 318 -5530 -4420 -948 -2563 -4318 2004 8331 4759 477 4513
14978 4513 3747 4716 3775 538 -2994 -4289 -6868 -4771 2961 -39 -391 1994 -990 296 -488 -6111
14962 -6111 -8560 -11787 -11838 -8850 -8671 -2286 -1778 -532 -5769 -5829 -2491 -8920 -9850 -5138 -1920 -4081
14946 -4081 372 -2306 -6024 -9623 -6600 -4369 -3553 -5537 -12324 -15473 -11790 -3682 465 1532 2818
14931 2818 2546 -922 -1452 -6326 -13877 -16854 -10705 -10737 -13121 -11294 -12357 -9702 -5083 -5207 -3690 2320
14915 2320 4108 440 -5433 -10390 -9507 -2935 -1460 -562 -6714 -5035 -4519 -7746 -8971 -12250 -10751
14900 -10751 -15333 -16471 -16714 -18720 -9542 -6990 -5238 -3628 -4218 -3661 -5122 -6227 -7975 -8556 -6698
14885 -6698 -3081 158 -8818 -6395 -4254 -2902 -2232 -695 -1053 14 -1488 -2999 -2423 -3043 -4001 4045
14869 4045 9506 4938 5718 3695 3626 3530 -835 3459 4023 -5706 -12587 -18026 -23051 -11798 -2288 -671
14853 -671 382 -5840 -15571 -14319 -7935 -10411 -10446 -9284 -9345 -12204 -13681 -12689 -8971 -3240 -1163 596
14837 596 4360 9103 12320 8534 7620 14537 17786 20971 18370 12456 7920 5971 2472 -3429 -9218
14822 -9218 -11721 -11930 -2167 -2205 2557 9952 2716 -5956 -5979 590 2225 -923 -3883 -3332 -5287 -8698
14806 -8698 -12485 -7073 1142 10376 12114 11257 3258 -5554 -3338 -275 2933 360 -6178 -6567 -6689
14791 -6689 -16446 -19257 -14394 -13361 -8555 -8166 -2418 2053 6451 9527 4940 -4924 -6903 -2446 -4350
14776 -4350 -8121 -5876 -4230 -2763 739 5356 13795 13880 15161 20141 25904 29533 28944 34414 57178
14761 57178 85601 106946 112776 112013 118218 116132 100781 91841 85042 72661 57994 45536 34752
14748 34752 30286 25064 12863 5452 4426 7381 6234 -434 1580 -2103 -7122 -8061 -9624 -10039 -5255
14733 -5255 -68 -3671 -7257 -5642 -5243 -8625 -11115 -8444 -9203 -13074 -15666 -12758 -9416 -14053 -9428
14718 -9428 -13100 -11613 -9957 -9214 -4985 -3932 -1571 1735 4343 -1664 -6495 -4239 -1378 -2931 -7638
14703 -7638 -8133 -3634 -184 2426 4386 3171 -1007 -1108 2561 6356 921 -4328 2048 6401 2935
14688 2935 7576 51 -4070 -4885 -6473 -7326 -6165 -1033 3889 6074 5982 5864 5058 -809 -2212 -4958
14672 -4958 -1226 5287 3561 7767 4293 -2273 -4190 -5660 -5180 -3414 -2466 -2856 -1827 1271 5767
14657 5767 4279 -3470 -3197 4574 929 -1463 -8655 -10064 -5044 2322 7503 15634 9678 -622 -1014
14642 -1014 -7851 -8283 -13091 -15342 -19369 -13312 -9462 -5398 1838 -701 -6685 -1582 -2203 -3485 -5485
14627 -5485 -4013 1030 9208 11510 17124 18888 18685 16911 15958 20592 24908 23537 24054 21580 19493
14612 19493 21265 27793 28331 33020 40325 47956 48498 61084 77531 95924 126098 180611 253991
14599 253991 337893 452377 559827 636976 664131 634464 561833 467237 372220 283297 205422
14588 205422 143555 103025 76200 60082 51215 49633 43117 31818 30319 30963 23914 20857 13242
14575 13242 8039 3167 2145 3607 11852 14697 11358 3902 -1738 -1066 905 391 264 -1168 -1266 -1180
14559 -1180 -3205 -5740 -10290 -12953 -9689 -2968 -3436 -4917 -3180 686 -1695 -6837 -12663 -18393 -15328
14544 -15328 -6567 -10569 -13752 -5355 4638 2631 -2021 -2590 2769 1291 -6197 -5225 -6420 -5012 -1518
14529 -1518 5216 4815 -3642 -7767 -12059 -10793 -14006 -10211 -8447 -8163 -6685 -9586 -11297 -8073 -9212
14514 -9212 -14120 -11894 -10534 -5658 -4753 763 4166 -2797 -6326 -9186 -12017 -9859 -7111 1438 1681
14499 1681 -6675 -5168 -4551 -8648 -6764 -4410 2555 5795 3801 1536 2230 -7986 -10274 -6297 -195
14484 -195 -2761 -8652 -8203 -883 2882 1795 -366 -2036 -5548 -9295 -8254 -4988 3565 7246 7891
14469 7891 -2135 -13580 -4076 -1528 -2145 5307 2115 -1661 2779 1590 7296 4045 -1039 -7858
14455 -7858 -13928 -13106 -9763 -6515 -6056 -8657 -3403 -1542 -11650 -16846 -13618 -7168 -8302 -14751 -12314
14440 -12314 -4667 396 625 6941 14074 8994 3721 7395 5330 -1676 2762 11053 1571 -524 2779
14425 2779 5804 1965 -2791 -5140 -6291 -778 1730 -2615 -6324 -9004 -7445 -8483 -5993 -2996 -346
14410 -346 -839 676 7334 9254 9552 11121 7033 -910 -7390 -8630 -8209 -3538 -9122 -11648 -13214 -23584
14394 -23584 -22395 -10514 -3979 -6999 -5054 -7714 -11137 -10531 -8128 -6105 -971 -6498 -5161 -826
14380 -826 -4539 -1797 -381 -4890 -5524 -3611 -10798 -10284 -9606 -4121 2309 6314 3169 1901 516 560
14364 560 5877 4947 2199 -1545 1922 444 1375 -546 -4115 -1462 -5277 -8534 2726 8190 2447
14349 2447 -1706 -5439 -4728 -3652 -2119 -221 -2752 -300 1627 -794 1705 -806 1066 -4060 -2808
14334 -2808 -6186 -6768 -3154 -894 -7789 -11450 -12410 -8042 -8492 -14206 -9244 -2180 -3552 -10410 -4679
14319 -4679 -3824 -20 -2232 -5702 -5758 -4161 -9995 -14093 -13017 -13002 -13429 -10037 -9031 -9157 -6557 -3832
14303 -3832 -7309 -10828 -6276 -2406 -4833 -3692 -4420 -6501 -6190 -5090 -1589 1085 1186 -2537 -3570
14288 -3570 -4544 -2799 -3268 -5732 -2931 2317 2451 -174 -662 -1742 -613 -2337 -3695 -833 171 -2014
14272 -2014 -2930 759 6059 2480 -1275 28 -3166 -4827 -6386 -2014 5407 7387 5891 5490 4479
14257 4479 7792 11056 16158 11692 11168 19827 20106 12215 8453 1589 772 4865 1939 -1872 -1806 -3759
14241 -3759 -6713 -8324 -4755 -6126 -5927 -7945 -7685 -2859 312 4055 5585 11943 10258 4406 6556
14226 6556 12433 9082 4628 6507 5059 -1424 -2009 -3337 -2858 4376 5309 -598 -1365 880 -2980 -6518
14210 -6518 -8728 -9705 -10895 -10766 -11256 -15342 -17048 -15877 -14612 -11641 -12622 -10345 -2638 -5567 -8856 -14908
14194 -14908 -12689 -16087 -8372 -2800 -6219 -13334 -7556 -4905 -4602 1123 764 1061 2460 5743 5739 -1806
14178 -1806 -5518 46 313 4318 -1236 -3492 -881 -4460 -2221 -2495 -7036 -2445 713 -2214 -4487
14163 -4487 -542 -5915 -14138 -16683 -13036 -8870 -12735 -11611 -7707 -9495 -10554 -12738 -9856 -9980 -7387
14148 -7387 -6502 -5832 -8766 -2831 -5402 -6682 1024 5018 1322 -4460 -3513 -1023 1831 1161 203 840
14132 840 -233 1800 -866 -549 -2714 -6316 -3370 -3116 -4044 -2937 -3034 -4417 -8303 -9261 -1702 640
14116 640 -2901 -7518 -1381 8107 8738 1640 6312 9006 14705 22318 27354 37718 49311 59839
14102 59839 66008 68499 77155 84683 89886 80984 69901 64917 61169 52294 42245 31958 28009 25727
14088 25727 18631 11138 6391 9000 12486 12833 13329 19325 21316 20921 19507 13168 9014 9949 8501
14073 8501 1398 -594 -3261 2932 2350 683 225 -4501 -2057 -560 -8335 -9337 -10070 -6003 -5422 -12156
14057 -12156 -6384 -4001 -12075 -9419 -7497 -4910 -5723 -5339 -1434 -3246 -2312 2084 4180 504 -3408
14042 -3408 -2893 -7875 -4848 -7725 -13259 -14312 -4207 -814 -6649 -13547 -13195 -12466 -7699 -2097 812
14027 812 -865 -3659 3330 11926 15032 12955 4993 4340 8003 8947 6663 3289 4407 4866 961 1452
14011 1452 10236 9568 5301 -2618 -4606 -363 327 1618 4750 -516 -363 3321 -502 -4642 -1296
13996 -1296 1682 -2704 -835 3501 3782 -3405 -9503 -8034 -2435 -1153 2230 2560 5801 8329 8013
13981 8013 10230 12311 13268 15499 11700 8819 12960 16976 9590 12552 16283 16531 14717 12697 10961
13966 10961 13231 14541 18749 20239 19534 18012 13182 12652 17127 17395 15821 17582 24044 27640 28891
13951 28891 27537 32495 38542 42127 42485 44882 42894 46583 54707 63988 70906 84745 96484 106737
13937 106737 120349 138245 164270 187207 217970 277605 359062 472625 633020 845003 1091520
13926 1091520 1349606 1584741 1747603 1797270 1709847 1510996 1249977 991261 767163 577491
13916 577491 434718 337473 269483 220622 187555 164798 143431 123973 101463 86843 74388
13905 74388 61695 49965 42879 39438 42970 40332 34134 27205 23025 20659 25038 24536 17683 10850
13891 10850 10995 17203 12706 8411 12437 18440 16175 11144 11720 13606 15699 16686 15564 15839 17652
13876 17652 17229 20705 17149 18568 19294 16401 11912 10106 10152 6410 12145 11970 6247 8931 14369 13759
13860 13759 5116 2182 -2375 1239 2172 3210 1643 4029 8008 11539 10916 7772 13914 12953 7736
13845 7736 3341 1832 3442 3456 451 5481 14013 14032 13578 12335 16465 14843 7986 5932 8461 7579
13829 7579 11592 10273 9348 1405 331 3961 5791 134 -193 4121 5219 1092 826 -4782 -9166
13814 -9166 -9825 -662 4759 1959 1351 2062 122 4706 10833 10904 9148 8788 10260 6487 4302 383
13798 383 4976 7752 8091 8127 11871 16061 8141 1198 4982 9339 9686 8091 7975 5586 3440 654
13782 654 5550 4986 433 -7532 -1426 5222 4912 5830 2404 4663 7890 4664 7326 7292 5937 9223
13766 9223 11402 8721 905 -2811 -693 7 1719 -2045 -1346 6384 6512 3328 2214 4203 8379
13751 8379 13975 12914 7368 6001 7738 5472 4684 2004 4417 5504 3374 3488 -264 1420 4766
13736 4766 986 2558 4268 2266 3583 3121 1704 582 -216 -1339 324 -610 -1525 815 4906 2900
13720 2900 595 3787 3221 6542 4841 2005 -2254 -5563 -3158 -3382 -7590 -6382 1752 9986 12254
13705 12254 4237 -1994 -2023 5039 8633 15184 10906 2458 1357 -8571 -14183 -1821 4158 6368 10216
13690 10216 10538 1838 5040 657 -1839 -2331 -3916 -1611 -809 1443 5417 9033 988 -2949 2580
13675 2580 10572 8251 5292 12602 22179 20540 12898 8953 5626 6958 6891 9686 1715 195 5486
13660 5486 522 1361 6791 10516 2345 -885 -435 460 -4998 -142 81 -270 -117 4825 -2227 -6043
13644 -6043 -2528 -4292 940 4613 500 -2243 -187 -761 -3769 -7594 -2938 -3813 -7237 -5852 -4393
13629 -4393 3894 1542 -3248 -5575 253 7145 7359 6150 11964 17085 18719 10661 6624 7548 8293
13614 8293 6803 5490 8484 4057 5228 7080 856 -6271 -7325 -10197 -10058 -2637 3599 1398 -1363
13599 -1363 -1286 2615 5442 2751 4424 7669 8756 8794 6077 5759 5875 2483 -145 -3400 -5337 -5038
13583 -5038 -6181 -6248 -4302 -7158 -3366 1594 2365 2578 3437 14243 20972 24049 22942 14298 12385 13282
13567 13282 16736 17018 6749 -2880 -6051 -3048 -2762 -660 2452 3809 998 -6906 -5255 -6145 -9457
13552 -9457 83 6576 2405 -7579 -7024 -4852 403 1972 3166 445 2705 6497 6924 7478 -3061
13537 -3061 -4622 -1131 -200 5908 6549 4230 1005 -3948 -1944 2861 -2774 -4763 -884 3860 -1060
13522 -1060 -1433 936 295 3636 6020 424 -1274 1084 2610 3420 -1497 3530 8609 11465 17681
13507 17681 19207 10332 9585 9756 11306 12408 10852 12337 12772 13491 21478 20180 10976 12235 14185
13492 14185 11649 9089 8332 9397 10936 13072 12293 12223 17529 22643 27343 25593 16629 12036 8480
13477 8480 7787 14619 20803 28628 33820 27384 29514 28583 20511 12518 10419 10698 4953 -3309 -3049 -2191
13461 -2191 -5199 -2057 1016 -4833 -9044 -5315 -2839 -4859 816 3628 9172 9430 11310 21688 24673
13446 24673 15174 10781 6110 7568 13359 12373 9202 9738 12497 17767 19443 12125 8364 11973 9454
13431 9454 2617 1484 1353 4114 3853 4785 7816 7414 7400 10541 8627 4600 9534 11941 5824 11808
13415 11808 23468 17454 10212 9691 12695 8134 9048 12722 17011 17598 16593 14140 13828 13626 5495
13400 5495 -5620 -1656 6925 9816 10045 10344 7056 6355 9580 14117 20041 16949 13107 15843 17459
13385 17459 12836 11643 18769 16269 8995 7508 12340 12779 11866 7171 4371 4311 2145 1662 237 3517
13369 3517 3020 6587 15997 18657 18031 15760 10300 10075 10975 11491 17748 17550 7128 -1860 -906 3797
13353 3797 9511 16890 7474 3377 10460 15369 14116 11555 7634 3811 7973 17172 19070 15947 14469
13338 14469 14827 17152 14727 10621 3088 3724 20304 31807 25136 18065 14924 16722 16898 11224 7282
13323 7282 10606 12876 10681 3806 126 9394 12604 12859 7809 9330 11134 14828 15001 22096 21398
13308 21398 20821 17306 14722 10177 9643 16091 14217 12588 12897 11357 9146 12710 16176 16963 13393
13293 13393 9993 5712 6845 11959 8258 6213 7255 8066 11595 12724 10891 12621 14835 3055
13279 3055 1702 12655 18866 16111 12894 13092 9313 2532 8652 14872 18409 17259 16752 15745 13254
13264 13254 15474 10467 2702 1122 4847 7029 12463 15472 22236 21996 15854 13310 16635 22752 22713
13249 22713 18834 12040 6983 4870 5790 8782 6927 9136 10780 12636 17331 17950 14803 12789 9944
13234 9944 7776 9428 17030 23199 20715 8668 3836 6311 5601 3957 7701 14076 14071 12076 18760
13219 18760 23075 15867 11213 16847 27631 28760 20912 17488 16595 13563 8189 4594 4382 7754 9640
13204 9640 10685 14842 20702 23105 27868 19447 15914 18394 18476 17150 14431 11153 11146 12784 14479 16248
13188 16248 13014 10090 7823 6862 6784 10320 18122 15559 13394 8322 9124 10817 13368 7490 5450
13173 5450 6932 6210 5066 6838 10249 15939 18572 10268 4274 5542 10896 9568 14191 12125 7966
13158 7966 11417 14053 15662 15380 14529 13481 16454 17258 19727 15434 11904 14343 16841 17848 23390
13143 23390 30424 30163 30945 34763 29507 29777 37285 52188 73103 83574 84295 80119 63686 47018
13129 47018 35302 35801 31419 28743 29989 23119 22545 21955 23857 32156 35546 28085 25809 28267 30491
13114 30491 34447 35209 28885 20146 19067 20480 16694 20831 25231 29715 26540 24277 21702 16053 17898
13099 17898 21824 21484 25799 28342 29992 44643 62204 91039 126655 179939 224921 234074 203481
13086 203481 157270 117183 87750 64754 51044 41894 34029 31846 31297 36555 35731 36958 30156
13073 30156 18043 10763 13023 21281 24336 20223 14890 10766 15026 21333 20079 11700 16298 29731
13059 29731 37075 32580 35431 40023 38074 36205 32619 26071 35858 43375 49815 57893 75975 108618
13045 108618 165127 207726 225244 212866 171853 125703 85146 57599 51269 40000 34341 32845
13033 32845 30085 30902 28551 29255 27116 25919 18474 14960 15008 11842 19762 26473 28412 24882 24835 21273
13017 21273 19957 20745 27288 29850 39763 47446 68079 98632 125443 126890 107111 79227 59226
13004 59226 49614 50235 48458 48924 57820 76576 91337 85703 72343 62724 47865 31333 27074 25137
12990 25137 19921 16793 19726 21650 25355 22232 20369 21678 23083 29966 37290 38495 27573 25191
12976 25191 27215 26140 26913 28982 29266 29530 31569 32002 34105 25222 28464 20460 15840 23059 28991
12961 28991 25492 27499 31358 32147 34519 32750 31955 28068 21357 15070 10707 10160 17914 26773 24645
12946 24645 21482 18652 17808 22106 27725 28825 29446 22445 16327 17251 16459 15695 20342 23302 27083 28881
12930 28881 33386 33658 34757 31990 25272 25085 27065 26843 29689 33421 30459 35020 35066 33222 34000 33385
12914 33385 22129 17642 21467 29766 31757 35801 34724 34331 28907 22344 23417 24791 27257 26327 21392
12899 21392 17761 15384 13260 13451 14709 16937 18679 22365 26203 26774 23288 18903 19878 23184 26923
12884 26923 29717 34099 32101 28924 30819 30177 31449 28663 24250 27082 26217 24143 25266 23987 26531
12869 26531 27361 27249 26203 23035 25804 23130 22178 24446 22662 25192 21747 25225 32996 35088 32033
12854 32033 31938 30197 30084 29707 31839 32651 30376 27670 29160 19209 20671 24207 24203 23946 26822 34718 28871
12837 28871 19403 18221 25491 24913 22743 26111 25399 23050 26397 31646 27909 30443 30034 33218 30312
12822 30312 27472 28152 33978 29378 28773 19447 19867 25789 33991 26683 23034 24283 25819 30063 24042
12807 24042 24705 33725 36268 27834 22189 28381 33949 31099 26785 25081 27640 20966 24148 26087 24716
12792 24716 25032 20114 20351 28580 29628 23141 19371 24346 29754 29667 28140 27641 32119 28126 25802 33755
12776 33755 34130 30113 25569 30038 34853 29243 19638 12788 17140 27903 34160 35712 35188 44326 44788
12761 44788 41689 43513 42880 35985 34694 39598 47602 56589 54672 56937 59182 55062 50900 51705 53481
12746 53481 64379 67355 63837 64390 70874 85245 111764 164854 241087 347658 414294 367242
12734 367242 272749 203620 155117 125913 105408 96533 99307 92157 83777 84537 76569 68436 62892
12721 62892 53187 52909 57148 49628 45707 50082 48240 41691 42444 42394 39741 38573 39812 39142 33236 27713
12705 27713 32120 30177 34357 33921 35509 33898 37417 43443 36764 29899 24495 26526 38317 36287
12691 36287 33190 32351 25521 22987 25367 25979 31437 37687 32795 32689 44616 48271 59148 65368 66061
12676 66061 71740 70757 69534 75326 77676 69664 69058 75616 73614 68344 71739 78828 83548 86808 90118
12661 90118 102288 112954 139779 183384 223853 226975 192152 155142 128796 108502 106919 107285
12649 107285 102495 111786 125720 132994 139536 143471 151124 171177 190261 216122 250873 304894 369023
12636 369023 454506 560583 670109 761622 840243 898161 928702 925380 879051 808507 722774
12625 722774 631395 539202 448792 364615 298481 251564 212670 190416 181751 174105 174247 178395
12613 178395 177792 168453 151919 137203 123381 113957 104668 99605 98722 95511 91473 87094 75620 65617
12599 65617 67192 71807 74519 74897 77317 76033 75954 73896 74540 79990 81236 84081 85818 84558 76860
12584 76860 71598 72007 69207 67874 65360 66771 68978 72455 74732 66895 66733 75484 73134 70634 70145
12569 70145 72779 74340 73318 66109 65710 64765 61550 57462 58531 61803 55990 61985 68065 66906 67738
12554 67738 68069 70056 68822 61114 65356 63543 66802 70302 65445 62929 62865 62665 62583 59483 58599 63122
12538 63122 61939 54045 56428 54838 45034 43183 40881 39128 43212 42546 37591 36870 40870 45135 48223
12523 48223 50919 56202 58849 56958 62681 65703 64042 68231 75461 76707 80489 84215 87033 88208
12509 88208 91097 98800 97820 98269 105551 102178 96523 100503 105745 100056 103740 100601 97284 101191 104012
12494 104012 98830 96695 95023 100297 99670 99722 101326 98296 93334 86423 77774 82428 81780 84830 89992
12479 89992 91801 94808 103921 114470 122009 124461 131594 144374 161532 183564 202935 211453 207408
12466 207408 210626 210593 202793 192200 176926 158265 148594 142467 128013 121569 111412 113550 113719 115317
12452 115317 121869 124019 125711 122291 121396 115468 112756 111906 112073 115267 111534 112325 116225 116216 111137 113548
12436 113548 119242 120659 121546 117219 115764 116847 119481 120431 117314 122246 122823 115378 109835 105780 109222
12421 109222 110489 106586 113923 114463 110273 104141 102218 103244 101890 92454 87400 77712 54574 33925
12407 33925 11786 -16541 -39945 -52965 -57704 -65173 -67002 -58800 -42528 -27391 -15096 6804
12395 6804 31188 54076 65966 70026 81881 84605 88357 95432 93595 90534 90101 87783 93211 97302
12381 97302 92799 84905 77330 74836 59948 34881 13852 -8139 -33815 -68219 -98205 -124014
12369 -124014 -130635 -132785 -122766 -98924 -78952 -55272 -18028 15275 38209 62773 87173 105470
12357 105470 112305 116082 127587 139954 141680 146133 157149 174006 199172 223782 264771 316963
12345 316963 368552 422173 467970 505878 528668 530738 520206 498729 470321 440662 408666 370402
12333 370402 335248 307605 291073 286478 286915 282084 278555 276479 268990 262580 255646 254375 250321 242142
12319 242142 246822 242202 240613 240781 238496 233286 235126 238846 245570 258576 255057 256932 262293 259701
12305 259701 261858 267772 275836 284307 283762 287471 294969 302938 306204 309847 315506 318489 330946 342791
12291 342791 343894 347869 354538 359622 364949 364558 371754 384189 394673 394328 395872 397308 395899 404830
12277 404830 417530 433948 444923 462028 477899 490361 508312 537512 563051 585953 608212
12266 608212 634795 664654 698898 739498 775241 815880 865721 918112 974644 1031998 1087690
12255 1087690 1141147 1192121 1251456 1314155 1379878 1442922 1509137 1574031 1644963 1738131 1845075
12244 1845075 1966396 2097048 2243087 2424404 2661736 2937433 3271447 3686527 4208093
12235 4208093 4858427 5664530 6643020 7790039 9121965 10601152 12186570 13861171 15684396
12226 15684396 17842654 20628474 24485443 30123993 38555583 50744028 66782160 85574013
12218 85574013 105572807 125234689 143305855 158180032 167933304 170672677 165872711
12211 165872711 154846762 139462939 121500756 102201963 82894136 65011961 50080606
12204 50080606 38768145 30674017 24996265 20968916 18012228 15734643 13861950 12239439
12196 12239439 10791857 9473413 8279445 7216070 6279021 5481509 4817838 4270255 3828305
12187 3828305 3474869 3180982 2920099 2686070 2479401 2295672 2125681 1972335 1829546
12178 1829546 1704238 1593410 1494329 1412079 1347348 1294443 1249339 1219230 1195338 1174092 1160665
12167 1160665 1153469 1148481 1142000 1122198 1095406 1060480 1019943 974354 931249 889271 848974 814940
12155 814940 785110 761232 736332 710720 694527 675203 648767 626040 608652 589631 565880
12144 565880 550558 536342 525866 528177 532649 526765 532012 542390 549678 556464 552192 543580 523925
12131 523925 507041 493242 474787 458829 436399 422043 410333 396361 381966 375837 371917 363505
12119 363505 350605 346857 348599 337333 330260 324350 318747 315780 317405 314963 323617 327854 332071 341348
12105 341348 357491 375075 393537 409379 429854 462894 519121 602839 701667 816402 936044
12094 936044 1049551 1143761 1206082 1226962 1220357 1210636 1234804 1309836 1451153 1648139 1864367
12083 1864367 2060017 2174543 2174541 2056405 1851743 1597847 1343147 1111792 930190 789192
12073 789192 685516 611451 572488 552689 534933 510049 485623 464158 448925 452040 462095
12062 462095 477272 486010 490458 490660 486771 473728 450454 413994 381887 352740 320032 284005
12050 284005 254225 232638 216214 204302 193781 187752 181703 173838 169547 162221 163053 169835 173182
12037 173182 172386 177598 187036 203119 217723 231737 243280 262777 279796 300142 323358 338465
12025 338465 344924 343352 333516 321682 302859 277282 245291 215163 190782 167194 143976 131844
12013 131844 122619 116596 110481 106007 108069 108236 107168 103885 102889 97276 92322 92295 98259 101228 98647
11998 98647 97998 96381 97271 101230 104878 100885 92301 86364 88843 89035 90793 92212 96660 98105 97275
11983 97275 93776 86958 82566 78553 76016 81724 82766 87548 89336 88718 86230 86600 95106 97988 98135
11968 98135 99435 97798 105490 115988 113017 106847 105115 107200 115619 118425 114451 113385 109387 103152
11954 103152 104170 110765 114760 115471 112830 108655 105294 98719 94354 94855 102164 105644 105051 106584 114233
11939 114233 109473 105642 101945 103230 99970 92247 92900 92793 94878 94809 98410 96189 90771 84658 87353
11924 87353 85563 83762 79939 77193 83381 92107 95784 100700 110362 105075 96921 96461 95815 95896 98863
11909 98863 102042 102733 101188 101337 106996 114800 120118 123298 124863 125699 130964 128577 126222 126081 127234
11894 127234 121480 110473 105510 101217 95909 99163 107235 107342 106873 112097 108407 104244 102097 96699
11880 96699 94512 93240 94409 93950 96453 97298 98703 100737 105261 103574 95750 89492 84318 84910 91583
11865 91583 97249 97207 93167 97527 103000 103262 102593 101199 97509 99601 101810 103061 109683 110431 111712 106964
11849 106964 105232 103590 101170 101170 101312 105188 105709 100584 102830 110931 109903 106750 106619 107403 102318 97056
11833 97056 94320 99669 103474 106503 105802 101054 103795 103079 100170 105943 102568 106666 115073 119417 119234
11818 119234 123948 122928 121114 121426 120796 120492 125147 140526 143531 150287 161305 165663 180142 193053
11804 193053 204892 217819 232673 254536 289197 337205 403202 482436 571889 666433 760744
11793 760744 852088 930583 977781 985125 956215 901693 818090 722536 622933 527094 443626 380302
11781 380302 334040 289380 253809 233202 219029 208795 196549 185458 171038 158322 153570 141883
11769 141883 137044 134202 133457 130410 129305 128989 124879 121426 122720 120977 111438 106003 101290 94622 92210
11754 92210 97072 96980 89712 91078 92196 94965 95356 106829 117250 123255 126853 132617 141718 137822 136121
11739 136121 129006 131812 125318 124880 130147 130184 130380 136092 143023 143377 137907 138828 134335 134178 130722 129256
11723 129256 134922 139889 142173 138623 135982 139298 140642 143260 142384 141479 133745 133672 133111 133367 134806 141868
11707 141868 143296 142934 142662 135161 134275 138411 137064 134798 134780 135735 132605 136162 140349 139715 138288 134128
11691 134128 135402 139390 145079 141808 141141 138487 140835 137435 132484 133040 137558 139110 138406 139326 136645
11676 136645 132988 123945 133661 142466 145414 142666 140504 139082 134065 134039 139522 138677 136164 137875 134563
11661 134563 127112 126825 142245 150012 146939 148823 140705 136340 132405 129065 129462 129094 133646 130603 131011
11646 131011 131645 127828 133365 145403 157650 157509 154008 154071 153664 148947 142676 142422 141003 141793 139250
11631 139250 140207 144001 145242 150375 151428 150382 151837 149575 144727 142837 142283 143562 139759 134600 134004
11616 134004 140519 146882 148218 146761 151914 157044 152873 152824 158594 161293 162808 156500 152707 157226 165872
11601 165872 166318 167579 166564 164427 158612 156593 153171 153379 155221 154130 148040 145742 151372 158324 153985
11586 153985 152527 147118 149947 157089 161365 161529 154633 155339 156502 160164 158559 154521 158975 156214 153862
11571 153862 157963 160988 166256 166513 161469 157994 160123 162676 163851 165719 168713 167475 164981 165180 166805
11556 166805 168076 166473 169738 171757 163314 162581 169351 161588 157855 158830 165994 168941 160675 162930 167915
11541 167915 171292 172187 168819 173808 170426 165787 164177 167699 164829 163911 167836 168089 168148 170332 170672 175079
11525 175079 178891 181576 176632 174179 173738 178981 187944 189664 191759 192354 188809 188301 180254 181577 186851
11510 186851 190010 187146 181817 184536 189116 190957 190547 189814 190561 187327 188544 190594 185758 184248 179463
11495 179463 183957 182465 180702 186768 193361 193078 193103 192362 195092 192801 189791 186806 187495 186370 184816
11480 184816 181788 181255 184769 192063 195516 196462 203200 206469 201000 196291 198848 196665 195059 197093 198316
11465 198316 202524 202610 199891 199258 203725 208638 208420 204353 199199 193018 192529 197552 196641 192813 185600 187373
11449 187373 198909 211989 211801 206626 207364 208877 209375 207596 211936 223013 220320 208046 200900 202434
11435 202434 206291 208240 207518 205544 206802 212086 217214 212684 211739 213717 216683 210879 208819 206033 208598
11420 208598 218947 219949 220257 220803 216338 210408 217778 226217 230202 232290 231880 229053 227908 225998 228606
11405 228606 230475 237359 237328 236835 236048 238177 246384 254998 253899 247494 243090 238274 236172 235110 237902
11390 237902 240317 237598 240781 240209 240270 245100 244757 244777 249718 250343 244568 238013 237444 241441 247320 249949
11374 249949 244372 243546 248445 252393 251331 248463 243838 235754 232604 241603 246216 248621 248791 245611 247116
11359 247116 242574 239525 237028 243983 253522 262299 260085 259719 262227 260848 259327 263969 265774 262761
11345 262761 264389 260547 263485 269457 276898 279136 277101 275330 269648 266742 267971 266913 270939 273609
11331 273609 273986 276132 278116 278466 282200 277208 271411 265507 263163 265102 266373 268830 278917 282480
11317 282480 289485 296493 290315 281338 285064 283464 279550 283227 283182 277417 281662 288984 290324 290167 292281
11302 292281 292376 289562 289772 289230 289870 289855 288534 287749 293972 296315 291486 291825 294146 294843 304648 313092 313501
11285 313501 307312 303423 309903 311321 309457 305731 305437 303314 302610 292018 299178 304658 308455 308216 301973
11270 301973 303805 306449 312390 316357 318148 320636 316620 312390 313860 317337 315922 317866 318529 323534
11256 323534 324550 320318 319270 314784 311551 317624 322493 326415 332676 333596 328912 325746 324811 339245
11242 339245 340149 340872 345694 343281 341903 335105 335962 343417 347794 344989 344468 344396 343099 342128 350645 350499
11226 350499 343858 343041 342336 341765 349628 355727 352378 344920 338125 340342 348488 357971 354170 349138 353034
11211 353034 361482 371590 372549 374326 378446 373152 357752 356824 359481 362094 363112 358351 356525 363109
11197 363109 373983 372212 361328 360294 354891 358082 365994 371886 375581 369934 367346 370542 370002 374969
11183 374969 380851 382885 385783 390584 391068 390825 388882 391050 393522 395275 402289 404731 404259 403613 402345
11168 402345 394096 388003 388625 385381 382284 386262 389991 389245 386716 391720 396488 403435 406928 408200 406789
11153 406789 401976 399302 403819 401694 404123 406093 405442 405376 413568 415188 419248 420639 419735 424579 421771
11138 421771 419242 420058 423277 424519 424061 427491 429450 421781 426854 434862 438163 433962 426734 422742 425900
11123 425900 432632 431925 432002 430459 433967 437533 441777 444990 446868 447189 449630 455268 457883 469372 469821
11108 469821 467407 463691 464731 466432 466179 463981 457989 453164 456740 463060 465279 466904 470553 467213
11094 467213 469620 476108 471799 466955 466809 475410 478876 480528 475932 478505 487680 487370 485542 485707 483407
11079 483407 493100 500507 495908 488516 482044 485563 487064 487179 489852 488786 491937 496169 501717 505833
11065 505833 505700 505804 506321 509407 511747 512841 514060 513454 511471 518901 528974 535543 541326 540588 539036
11050 539036 533929 531040 532512 534875 532665 533559 536146 538460 542069 546591 552672 552242 554394 549892 549998
11035 549998 551668 560051 569165 567976 571339 574776 581564 579539 576431 575026 572777 578422 583796 593141
11021 593141 595114 595626 594353 596134 601221 604778 604558 607420 611436 606999 611230 614085 613127 616814 620212
11006 620212 620720 620953 626255 631138 639822 643103 644170 645642 649864 656994 663634 658594 654452 650994 651731
10991 651731 654293 663074 673961 677635 679423 682637 683833 693814 705486 704379 706205 711864 717753 720324
10977 720324 719777 731499 738648 745514 751041 756493 763953 766429 769428 770219 774003 780089 780287 787845 797347
10962 797347 803580 809392 809427 815057 820631 822975 826456 833037 837778 833436 835768 849502 859479 861523
10948 861523 870244 879702 892589 889688 889634 895314 900176 904211 914900 927478 931174 931313 934819 941011
10934 941011 949522 958052 963042 964902 972526 979395 981927 980424 981250 989688 994305 1003154 1013705 1018334
10920 1018334 1015401 1020162 1024782 1027388 1025314 1036836 1046527 1045201 1046544 1058840 1061151 1063819 1069018
10907 1069018 1073497 1078913 1080825 1086091 1092403 1101747 1101566 1103611 1105222 1108285 1110503 1117845 1121971 1128436
10893 1128436 1135025 1139088 1145220 1140098 1142340 1145781 1149698 1160231 1167226 1170656 1172121 1168365 1176095 1180440
10879 1180440 1180324 1183469 1181166 1181742 1187133 1195912 1203216 1207731 1208589 1210486 1209315 1214311 1222417 1233583
10865 1233583 1239924 1241545 1241352 1235574 1240463 1250026 1263293 1269091 1269708 1273056 1276040 1269091 1275323 1276812
10851 1276812 1280075 1280138 1285961 1291244 1298728 1305376 1314015 1314404 1316427 1320745 1324111 1329134 1333936 1337248 1329643
10836 1329643 1329522 1334047 1341951 1349721 1351907 1346786 1350826 1353530 1354374 1358902 1366336 1369734 1376454 1386292
10822 1386292 1388157 1393095 1389900 1392874 1398914 1401332 1404883 1414564 1423137 1425037 1420520 1433611 1446994
10809 1446994 1447967 1450027 1456613 1464248 1473825 1482800 1488509 1494156 1501362 1507739 1507134 1510951 1518281 1517121
10795 1517121 1519663 1534143 1542113 1544784 1548251 1556147 1557879 1561088 1571491 1578632 1588851 1597364 1609574
10782 1609574 1618779 1624541 1630487 1635906 1639384 1646132 1655720 1667806 1675878 1686239 1696453 1706099 1714814
10769 1714814 1723216 1732505 1736907 1743304 1758840 1770349 1782545 1788819 1802218 1806695 1808839 1814755 1824837
10756 1824837 1838358 1849517 1864548 1875557 1892056 1905315 1909615 1922873 1935147 1944801 1965952 1984695
10744 1984695 2001528 2017597 2029454 2037563 2044720 2060854 2078183 2090211 2103626 2113620 2117457 2131961
10732 2131961 2155070 2170950 2178265 2187053 2202987 2215664 2237262 2250760 2265228 2279522 2299534 2319783
10720 2319783 2338162 2354280 2366698 2384497 2398808 2412434 2427996 2446337 2462038 2480672 2503230
10709 2503230 2524050 2543554 2557362 2574836 2588925 2606305 2630725 2657718 2681187 2705450 2719452
10698 2719452 2733161 2747284 2773334 2800050 2822244 2840436 2866797 2894246 2910459 2932999 2958622
10687 2958622 2987323 3015054 3040868 3061838 3085740 3112647 3140853 3166551 3186636 3212689 3241777
10676 3241777 3272747 3307872 3335734 3357784 3380769 3408208 3437561 3468681 3500082 3523581 3555520
10665 3555520 3592527 3625219 3661931 3698178 3732655 3767599 3802429 3846456 3892291 3931504 3966622
10654 3966622 4002974 4051242 4096840 4147773 4192434 4235729 4277367 4321247 4367280 4413947 4465445
10643 4465445 4517969 4577523 4650327 4728948 4801936 4870410 4924705 4975455 5025236 5080718 5134597
10632 5134597 5193580 5252484 5322965 5389094 5450594 5515456 5579378 5642408 5713009 5786196 5864825
10621 5864825 5943929 6022359 6099673 6176962 6254887 6343708 6431093 6519339 6608648 6710490 6815864
10610 6815864 6917095 7028927 7147473 7262189 7377136 7493313 7617188 7738830 7872700
10601 7872700 8022206 8192675 8380076 8586502 8833493 9138080 9519753 10000968 10525309
10592 10525309 10933941 11077048 10974288 10782803 10621652 10539175 10520262 10554738 10631231 10743506
10582 10743506 10877429 11027295 11189660 11363364 11550251 11744673 11960666 12174127 12388773
10573 12388773 12610256 12842321 13081929 13332236 13590089 13846410 14110885 14381896 14667136
10564 14667136 14960465 15265840 15567993 15874713 16193650 16525130 16853352 17198040 17551167
10555 17551167 17915267 18285150 18664166 19054619 19456097 19859967 20261857 20670302 21089303
10546 21089303 21526718 21969900 22427474 22882708 23338482 23810591 24292749 24778222 25260073
10537 25260073 25758391 26261481 26764924 27288610 27819770 28341522 28873610 29411290 29943979
10528 29943979 30488276 31038295 31592735 32148254 32714126 33279278 33839284 34402577 34965638
10519 34965638 35534600 36113072 36694945 37265833 37833282 38407112 38990407 39574003 40148346
10510 40148346 40728351 41302139 41870922 42447154 43026031 43595611 44160027 44723836 45288524
10501 45288524 45846800 46399472 46967201 47532172 48080211 48616539 49157181 49694388 50227040
10492 50227040 50748598 51264409 51766461 52265324 52746833 53209956 53677430 54148032 54610056
10483 54610056 55059943 55491220 55902969 56296853 56669288 57015846 57343223 57651002 57925285
10474 57925285 58169886 58404774 58622557 58817778 58983876 59126779 59234756 59318573 59365568 59370141
10464 59370141 59348319 59302493 59226012 59115345 58980533 58821836 58636081 58422804 58185013 57924863
10454 57924863 57638675 57318743 56977751 56609635 56217490 55810214 55391962 54947099 54487584
10445 54487584 54012939 53521374 53009008 52492997 51970249 51439589 50897170 50343861 49794795
10436 49794795 49247152 48692226 48133680 47574275 47025078 46479875 45945378 45414720 44871140
10427 44871140 44297699 43689810 43076330 42460027 41836525 41225586 40629576 40039470 39466139
10418 39466139 38902442 38348672 37801099 37255273 36713051 36182083 35647379 35109643 34564227
10409 34564227 34018020 33481000 32957385 32435585 31920916 31414001 30909751 30409678 29922188
10400 29922188 29435784 28946945 28457563 27977774 27514313 27043333 26577759 26131444 25697094
10391 25697094 25259929 24834145 24419592 24006104 23593576 23175602 22771519 22376054 21982603
10382 21982603 21600460 21226392 20856573 20488717 20134892 19775165 19426005 19087604 18761673
10373 18761673 18438741 18111964 17785584 17454059 17113494 16770087 16406488 16011393 15633926
10364 15633926 15307072 15051197 14843846 14647225 14445538 14239585 14023078 13803984 13594059
10355 13594059 13386563 13176977 12974406 12777299 12573026 12369189 12172992 11976664 11779265
10346 11779265 11597288 11412764 11232840 11058648 10882953 10713762 10545451 10370552 10195389
10337 10195389 10023596 9858426 9684742 9495898 9280747 9039455 8779588 8544446 8404613
10328 8404613 8352042 8323953 8286922 8235613 8171424 8097086 8017873 7934087 7851204 7769001 7682554
10317 7682554 7591274 7494462 7396272 7307637 7222221 7137096 7056558 6978690 6909197 6858931 6826553
10306 6826553 6814673 6835846 6899148 6993628 7066414 7062017 6963491 6763794 6525098 6310271 6148316
10295 6148316 6028945 5929150 5844386 5770532 5697009 5623995 5555650 5492879 5430783 5378296 5322298
10284 5322298 5262163 5200217 5139434 5090381 5031435 4975150 4918033 4856444 4806047 4764375 4714607
10273 4714607 4668008 4621616 4572476 4518954 4465218 4421549 4385413 4360162 4335540 4303745 4280169
10262 4280169 4253611 4221633 4188485 4141527 4096165 4054942 4017011 3988107 3961322 3941722 3924919
10251 3924919 3909420 3888449 3869039 3848422 3827519 3806577 3780747 3745828 3718245 3690649 3665385
10240 3665385 3644317 3623227 3600369 3590562 3589290 3593318 3605318 3611752 3609040 3616088 3612048 3612416 3620904
10227 3620904 3642861 3683674 3732545 3779286 3828690 3864896 3897451 3933774 3982547 4056484 4141109
10216 4141109 4227673 4308872 4379149 4463048 4553495 4632843 4697514 4755868 4810993 4901421 5027331
10205 5027331 5186954 5363570 5555003 5766540 6010678 6320648 6709647 7197430 7843846
10196 7843846 8684298 9738734 11031166 12577790 14298721 15899502 17089929 18024835
10188 18024835 19112525 20660495 22926263 26161667 30652158 36805337 45351187 57567872
10180 57567872 75490507 102406283 143333806 204429248 286543840 368616126 404328726
10173 404328726 371151284 299091858 225649140 166461177 122932805 92168924 70682441
10166 70682441 55516315 44610952 36592804 30546139 25953820 22544008 20196785 18753124
10158 18753124 17940921 17309763 16424021 15183960 13774242 12441935 11374789 10644569 10262937
10149 10262937 10192180 10265417 10105179 9443996 8460085 7480858 6652603 5985766 5460003 5023949
10139 5023949 4641318 4331016 4069933 3844648 3654875 3493353 3365928 3271638 3196333 3121548
10129 3121548 3056859 2990244 2906800 2836598 2784942 2742082 2716422 2698630 2671275 2634242 2586624
10118 2586624 2530169 2473766 2428681 2385143 2355841 2334865 2310365 2283267 2246815 2199272 2149698
10107 2149698 2103233 2060299 2017375 1979836 1950444 1918142 1888317 1865940 1841843 1813999 1800572
10096 1800572 1795618 1789034 1783295 1772324 1759110 1735568 1709686 1674798 1647578 1626680 1611419 1600808
10084 1600808 1599520 1594364 1589931 1585226 1572981 1560967 1548599 1533633 1519096 1510516 1501074 1490558
10072 1490558 1479084 1461607 1441887 1422969 1408113 1390657 1375790 1360234 1361926 1349671 1341935 1345522
10060 1345522 1352341 1351482 1350815 1365222 1386981 1415020 1444697 1487847 1526703 1546283 1566460 1587103
10048 1587103 1595064 1585993 1542443 1478400 1419038 1373130 1337584 1316038 1303864 1292928 1279278 1263369
10036 1263369 1253465 1243130 1229120 1216162 1202367 1186280 1179579 1187076 1201891 1213048 1224581 1247028
10024 1247028 1275843 1319149 1386934 1477722 1595432 1683196 1673811 1562938 1426328 1311146 1220433
10013 1220433 1164549 1126996 1096665 1074113 1054463 1032210 1018043 1009570 999116 990824 978081 963853
10001 963853 956783 951112 943520 936352 941200 946902 955020 970326 982633 999120 1018056 1032720 1049881
9988 1049881 1076475 1128004 1196343 1267196 1292118 1235180 1117486 1001596 922886 863791 822403
9977 822403 797596 784657 772782 762830 759573 754042 739607 732794 730759 732318 727425 728375 724403 714875
9963 714875 712430 702514 691593 685193 679342 674226 668926 669679 667066 658433 653010 648405 647119 648662
9949 648662 655586 665620 688675 740368 814173 897930 937480 888944 797328 722918 673086 637034
9937 637034 616235 597371 585550 572791 570979 576758 578830 583898 578678 578852 586516 595252 600278 598452
9923 598452 591747 587273 574078 566272 558570 542851 533117 526233 525408 531056 534269 537148 537400 533728
9909 533728 525842 522481 517452 508159 497381 497271 498277 492248 487372 480565 468641 462103 456712 451471
9895 451471 447066 450646 450737 452189 446998 448487 453801 458799 454913 439750 423358 412468 405991 411514
9881 411514 424902 440995 457131 464582 471705 478951 486288 508638 531504 562623 623698 728837
9869 728837 918666 1237489 1642527 1935155 1872106 1558965 1226980 976342 803952 692993
9859 692993 621680 569344 525347 492110 470220 453817 438670 422782 414050 404940 394255 385723
9847 385723 391598 404873 404673 396978 393987 388969 378940 374349 370847 363364 356101 354452 355571 361531
9833 361531 359325 354396 356908 351865 348598 353315 358811 353699 348962 345552 352285 356819 353588 346989
9819 346989 336733 341163 343291 346433 346624 344281 335634 333013 328706 321343 319513 321573 327581 329684
9805 329684 332412 338924 339739 337295 327025 322620 316000 309086 312876 327714 333344 339364 343617 348109
9791 348109 350636 353218 348219 356453 366183 383731 415023 474562 578102 747015 994333 1220538
9779 1220538 1275928 1127354 896280 693220 557361 481870 438593 409278 387039 374085 373694
9768 373694 371788 372737 369614 373166 372992 371666 381731 398263 424839 462832 520591 589621 668273
9755 668273 794768 991950 1274013 1644743 2015719 2200134 2099761 1799935 1451132 1149597
9745 1149597 922394 755071 634148 548466 493737 459211 432966 411080 396594 383680 367817
9734 367817 369796 380937 391413 390576 365215 330821 302834 285122 275766 269557 261183 252451 247013
9721 247013 237280 227891 226129 221536 215217 206736 207798 201714 188967 177946 172143 174287 180870 196350
9707 196350 219965 237310 248434 248778 252934 249090 249788 254798 250384 245062 244361 241355 241059 245068 243628
9692 243628 238953 239345 242368 235841 230861 233094 235803 234725 229546 228640 227111 226510 226848 218293 212797
9677 212797 211998 212596 207403 205573 207987 210203 213536 212547 216398 208065 201325 201685 198567 189604 197645
9662 197645 203325 203291 204882 201174 197982 197118 198082 195189 188219 190265 191454 186963 182555 181267 180204
9647 180204 181241 180996 183412 178960 177565 181591 179149 169868 171775 171515 160858 163483 166096 168421 173498
9632 173498 177733 173428 166750 170692 166911 160493 169323 178285 178919 176197 175466 176543 172694 169555 169102
9617 169102 169110 164369 162272 162427 164748 169635 167056 163594 169750 174775 176003 178618 170559 165409 162198
9602 162198 165627 171349 163896 160063 162283 161497 163533 165539 163151 153663 147904 156334 162283 158114 154732
9587 154732 148986 142132 144355 151070 148408 144485 150351 150932 147793 151929 154945 147861 144027 140649 132848
9572 132848 136800 143239 146015 143373 141661 141923 148355 149959 153031 149814 145689 144399 142821 141019 142813
9557 142813 144498 139407 138997 140392 139401 133102 130272 132103 133377 135139 135896 132906 131261 134383 141482
9542 141482 144119 144068 138509 141028 139463 136044 135120 134791 131656 133111 127451 127535 128414 125761 124981 121922
9526 121922 128531 127601 128277 123997 121093 119679 131401 131916 126753 125609 126583 125585 122779 120501 118040
9511 118040 116007 107515 110975 116664 118440 120312 122734 115341 116777 119217 123297 120792 113683 114228 116356
9496 116356 113239 110428 109046 115086 116098 113723 116703 116168 114002 116401 120063 121217 119944 120799 115674
9481 115674 115991 115187 109662 109288 102036 102293 108861 112975 115347 113924 115585 114779 111609 111483 113536 117591
9465 117591 116359 106396 108767 111304 116244 113547 107439 101435 98183 97863 98529 100511 108247 109080 101762
9450 101762 91745 97738 103034 107210 109718 109012 101342 102952 104307 102205 102994 101972 99293 95122 98414
9435 98414 101824 106834 112993 102762 100650 107958 110719 105018 96337 95699 97199 95402 96922 101364 100451
9420 100451 93249 93224 94995 95205 97546 95111 93254 90360 93131 92224 85094 89182 97699 98680 98090 99632
9404 99632 93627 93498 97526 98124 99479 92427 91214 90783 92767 93232 92725 87689 78584 79373 90592 89988
9388 89988 80938 85869 92025 93237 92346 87479 85008 85997 89927 85281 91486 89896 88851 89313 89061 87954
9372 87954 89289 84596 85883 94218 105752 108200 109936 104902 96067 96929 98639 95343 90724 97059 98592
9357 98592 96374 95499 95914 92631 88479 83342 82661 84403 87146 88172 88367 90084 90232 92008 91463 90044
9341 90044 93760 93410 89864 86096 80272 77476 73457 73298 76635 74380 81369 80062 78825 80716 77452
9326 77452 78626 80337 85912 93084 89240 79186 75799 82203 86171 83484 77485 76724 72936 68359 75015
9311 75015 83199 81980 80530 80104 84198 83366 85091 90223 85562 79435 83125 77315 72649 69593 71293
9296 71293 74070 76230 75655 79283 82074 83839 92238 91744 84448 87191 84899 82002 83975 85956 87129
9281 87129 85886 83313 84220 87247 88629 88666 87076 81833 81564 83172 80086 82176 84555 83739 77686 73709
9265 73709 70395 72619 77111 76970 77283 71619 74734 82248 81515 74388 69246 68957 74903 74763 73420 73657
9249 73657 75740 76767 84657 90693 82994 73696 72923 77607 81767 80563 79643 74730 71136 70653 72623
9234 72623 73471 75990 78993 82632 78137 73923 73863 79766 82441 83758 85131 77639 78300 78528 79365 80824
9218 80824 82459 83150 80113 84926 91661 89717 88930 88194 94100 94596 92694 95873 93324 95053 97324 97377
9202 97377 90466 87749 89912 85609 82592 76873 78309 77811 75606 73263 67362 68473 71288 69837 72170
9187 72170 79558 80973 80769 82039 80812 73999 67377 68816 73064 73286 72261 78707 82492 80330 78492
9172 78492 78834 76554 70174 69297 71300 79453 77915 78572 75488 73604 78458 77255 78581 75623 76895
9157 76895 76884 73237 76226 72331 73285 77278 75040 70412 67430 66946 76749 78910 69476 58549 62104
9142 62104 68082 73651 75697 72643 76358 73618 63355 66788 75062 75726 74805 69409 66089 71352 68179
9127 68179 64368 69026 71743 67407 72011 77526 70275 70567 68231 62883 76767 81949 88881 83842 78821
9112 78821 72450 72454 71789 72674 72926 69235 73346 73400 69551 69582 72404 76075 76659 78766 89951 93563 86789
9095 86789 87929 85279 87606 98727 106743 112575 105903 99509 99927 99767 105616 104914 100233 97914 95619
9080 95619 102063 103370 106183 103332 103076 101176 96567 91770 91917 96684 108126 108748 107765 113084 117557
9065 117557 115963 116256 123770 121287 116320 116916 117809 112701 112406 117739 118815 122072 122359 125228 130489 130077
9049 130077 131764 137966 140490 143636 139324 133011 134014 129658 123544 122954 128898 125683 128617 133506 128262
9034 128262 124950 130246 133118 127829 131459 135802 139103 137334 142518 138974 136107 132787 136529 138036
9020 138036 134676 131076 125929 133852 136892 133712 135452 130539 126790 121742 125319 126169 124845 124397 122530
9005 122530 117739 117170 112115 107220 108753 111251 105086 106052 114854 123923 129677 129556 124399 116592 110089
8990 110089 111807 110208 105883 103296 105288 106499 101302 91585 90352 94025 98881 104152 101970 97543
8976 97543 88167 85821 83018 84740 92064 94353 95173 93279 86151 83148 84677 90075 89811 90662 93117
8961 93117 95066 89753 83616 80657 73476 70576 68960 68851 72988 70961 64393 65282 66259 72655 73979
8946 73979 69680 70170 70976 77231 77561 69272 65763 65947 60191 60438 68085 68037 71431 66437 63690 68832
8930 68832 61952 55038 55145 60520 58763 62216 62644 67602 69240 64565 60660 56730 55949 56122 61577 67696
8914 67696 68415 69678 73175 74530 79823 88487 87108 88400 96429 102085 96935 101041 117121 127312
8900 127312 137513 151630 156343 158304 160629 169356 178291 190414 216635 267027 349830 472400
8888 472400 664393 932230 1208351 1304214 1149672 890582 665028 496568 373648 299244
8878 299244 251674 212553 185204 164619 156268 158541 153207 137281 124816 120032 118171 107466 102731
8865 102731 104357 102519 108021 108217 104167 102352 104162 108136 109116 100636 95468 103999 106323 104721 101603
8850 101603 100394 95061 96401 98837 104161 104713 110685 117081 123491 123743 113757 113626 112264 111099 108197
8835 108197 103856 105594 100416 106459 116452 118447 113861 108320 108577 108658 111623 113997 122525 133587 144558
8820 144558 152753 163303 161108 157058 155586 150617 136994 129358 131105 132993 133996 131490 125184 116646
8806 116646 107523 100821 97796 96103 103203 99717 98092 93002 96623 97697 97954 93387 88242 81699 83628
8791 83628 81502 76895 84743 100426 102629 99838 100376 91975 85825 83110 86148 90054 95087 96962 94000
8776 94000 92243 97292 99600 99872 95755 97312 109424 119135 129863 138972 143623 141380 134272 122529
8762 122529 109993 101340 100052 98633 93979 89903 84356 89874 87460 81807 78607 75122 82068 82681
8748 82681 81845 82371 84572 88066 88323 98613 96410 90118 81618 77033 75931 69815 67210 68482 68606
8733 68606 73261 79117 78188 77336 81471 79312 76556 70417 70142 71827 67966 68104 76571 76163 79142 75954
8717 75954 72208 71428 74717 72160 74195 75957 73544 77799 82587 77603 66975 63057 61684 67089 68358
8702 68358 73375 76867 76697 80350 84145 85704 80210 74630 86930 98710 105938 113355 115361 109613
8688 109613 101388 95075 90040 86785 88468 87044 80031 75446 69091 70705 72563 78039 78989 75559 80336
8673 80336 85039 82527 76441 73501 78802 80199 79343 74155 76970 77656 82753 83857 81948 87626 90775
8658 90775 87054 88647 93387 91828 93993 100397 100598 98118 100229 95644 97475 98193 99459 98013 88428
8643 88428 82066 81861 87397 94653 92739 92668 97722 99280 100138 105294 107944 105787 101390 100467 99552 101064
8627 101064 101944 103557 106343 108781 108576 107535 109690 114676 113257 120358 123067 120339 124892 125168 126179
8612 126179 126738 129666 137088 138355 139129 150745 155957 161232 166304 163428 161170 154237 150034 154745 149994
8597 149994 150229 147042 148780 150886 156626 164518 163698 163648 168116 180331 190842 201437 212290 233623
8583 233623 271663 335989 413329 440056 401413 348303 313382 298622 308346 346780 401735 436907
8571 436907 417113 362935 315666 282815 254085 235298 225250 214416 217247 220692 223715 237657
8559 237657 246983 257962 267751 272485 274645 280633 289716 297823 312675 342196 363801 384808 406792
8546 406792 431281 457733 494893 540121 585757 648693 732924 833437 967317 1154484 1382784
8535 1382784 1533738 1508964 1423526 1350978 1278926 1209185 1141128 1062452 964696 853652 744297
8524 744297 656798 585742 522570 473190 438081 405218 373366 339720 308045 282081 264167 248617
8512 248617 234305 217752 206742 198985 198334 195600 192024 190703 192794 187825 175998 168777 164419 162127
8498 162127 163407 164354 162996 166513 180615 210735 265209 344410 396948 379050 322916 276398 239680
8485 239680 215525 216644 222583 231216 259359 292388 344125 425897 522162 587966 591772 536130
8473 536130 452465 367651 301738 249907 205317 168982 145598 133679 126955 124090 121496 125110
8461 125110 129894 128165 135217 133453 130866 132219 139869 140902 137999 129540 120488 112282 106808 100568
8447 100568 91141 78517 70432 67461 71284 74731 70882 70705 73628 76040 71523 66926 68077 63252
8433 63252 62798 62510 63361 55811 51885 59232 58950 57658 60785 59359 58872 59595 54370 53696 56325 56304 55514
8416 55514 55435 48036 52257 55253 52907 53543 50319 47267 48326 48126 47640 44587 49008 55066 61978 60899
8400 60899 63499 64540 60664 59131 61037 63693 64630 59481 53289 47924 51425 55714 53945 45581 44841
8385 44841 49508 49486 55340 58670 58620 61384 64641 59334 58678 58113 60025 57599 58578 60193 55609 49106
8369 49106 49339 52807 53400 56169 52206 47544 43775 41783 47777 49932 51018 50057 50063 52339 49385 50931
8353 50931 53761 50590 50608 53479 51779 60273 64438 68658 70663 70061 62520 54762 59515 54074 45992
8338 45992 38570 31871 39515 47668 50443 54953 63805 69578 65518 66153 63846 63978 58941 52200 48034
8323 48034 43777 37758 36293 33692 30234 29145 39389 42574 41742 46577 44260 42029 48397 47155 37880
8308 37880 39454 40162 38440 43376 44047 41102 41493 43799 47744 39546 38996 41090 38507 37115 37989 39941
8292 39941 38596 34027 30521 28578 33931 28806 21981 18926 16158 20839 23292 22855 22711 26129 31708
8277 31708 33986 33926 30400 26046 29503 35832 46830 42781 36142 37931 40598 39272 41316 37062 33052
8262 33052 26068 26304 33901 34215 29591 32974 36214 36824 29315 23904 22471 19284 20901 18650 24440
8247 24440 24337 27588 28853 25926 25110 28473 32231 26971 26849 35499 37241 32454 30277 26288 28131
8232 28131 34874 32720 33598 32103 30877 28918 24369 21729 21623 17460 18268 23536 30058 34510 27224
8217 27224 24824 25653 25221 26867 27717 27046 28468 31870 29667 25302 26431 23914 22461 21834 22038 24515
8201 24515 31620 36555 33497 31831 33071 28015 28976 29884 27875 27522 24565 21128 19515 8875 11825
8186 11825 17615 24609 31992 38110 41323 34575 23039 17177 21011 16343 11886 10132 14920 19283
8172 19283 15225 12644 16741 20665 25282 24914 24828 24733 18860 15629 21887 23758 21850 30624 26282 23400
8156 23400 19928 18761 17562 18216 17191 21718 20995 17715 10476 5398 7767 19050 26089 26124 21712
8141 21712 25238 33383 49818 65118 69406 67236 62128 62518 62144 52561 41907 32308 29092 20691
8127 20691 16909 17561 18785 13937 20803 25859 20498 20020 23168 24570 25517 28502 30587 27903 24862
8112 24862 21822 18571 19016 23583 25673 30766 33091 30455 29897 31069 27350 23844 21765 21521 29082
8097 29082 28351 25546 18240 12497 9257 21024 30468 32104 35942 37807 41142 41967 46305 45710 41304
8082 41304 41680 40848 36084 33974 34456 34584 32735 30427 32496 31878 34331 35923 36606 30338 26023 26785
8066 26785 38816 47677 53871 54157 46300 39604 41149 45905 42005 40827 41135 40073 44463 48875 46750
8051 46750 44997 42224 38785 33994 34112 32880 33205 36249 39554 41131 37827 37595 39640 43561 44383 46643
8035 46643 47498 45414 44124 45156 47772 46542 40618 39360 38559 38616 47514 53032 61503 56612 53495 54798
8019 54798 56802 56778 57166 52085 53074 57340 58705 58828 61915 65127 68310 67481 66660 69853 79942 82844
8003 82844 84905 86065 87299 89268 91502 97372 106963 102009 91785 82733 76496 76616 76901 84597 83853
7988 83853 79414 75999 82244 82365 93596 113507 122704 124247 127995 131333 134188 137795 143712 143652 144605
7973 144605 146006 142737 145193 149486 149483 149066 151193 151097 158477 160453 158960 153739 151696 148049 150856 150128
7957 150128 145733 139982 133889 136880 144923 147650 147187 146832 143519 142504 151461 159555 155365 158535 164139
7942 164139 180569 198416 215150 235546 260472 280646 309138 336498 355104 347940 332578 309657
7930 309657 287492 264465 246170 232797 229616 223238 206106 184715 170252 161514 150573 146749
7918 146749 145784 145645 148524 142429 140174 145098 148852 141700 133308 135450 136152 146089 153327 153396 158573 161000
7902 161000 158224 168279 176626 183539 188406 198251 202019 210232 221793 232442 243219 248597 251919
7889 251919 254092 248486 246639 246450 241565 232619 215321 191478 171276 158068 146669 126383 108762
7876 108762 105248 105383 102092 101517 103882 96315 89029 82730 82273 82155 85130 84199 91029 93063 90857 94401
7860 94401 96246 94515 91040 89069 83562 90677 98319 105874 110690 109936 109296 102995 108459 106358 97963
7845 97963 92407 90369 98015 96501 85556 75533 61636 55180 54783 48854 40639 43005 48080 49561
7831 49561 53815 48760 42678 36460 39144 45056 42917 39684 39944 37441 37057 38687 40444 42814 43397
7816 43397 44374 39002 37156 35887 32566 37859 41611 45297 37682 33815 31234 31992 31322 30793 34854 35091
7800 35091 30922 25282 20663 18233 19954 19726 23618 26086 24213 13213 5882 11950 22203 19574
7786 19574 15665 16343 20000 12120 8755 15404 18840 20432 22389 17947 16246 17217 23711 23854 19403
7771 19403 12342 9915 10908 5083 6571 9092 10618 8401 16272 18393 17844 8980 4212 8497 14233
7756 14233 11712 9894 13561 8647 2078 3017 9581 9271 10023 7464 9353 2662 3865 11197 8907
7741 8907 6117 9137 17276 17878 17528 14569 16399 18417 13683 20340 25845 19951 10569 8262 3900
7726 3900 11849 19686 10950 7169 3273 2876 7736 14924 15156 11381 16164 21089 15486 7568 5695
7711 5695 11863 17969 12019 6213 4147 2780 -1197 391 2514 -335 -7780 -6840 -1540 5872 9323
7696 9323 11462 5295 2839 1835 1135 2284 3630 2108 3248 4628 2903 1515 -285 -313 169 2625
7680 2625 4001 -4256 -9369 -9629 -1967 -2265 -5604 -2025 906 -3253 -8583 -3243 -2498 -3175 -867 -393
7664 -393 -3794 -7521 -13964 -11237 -1908 2521 2851 -481 -4152 -3653 -5837 -10602 -4798 -1686 3039 6267
7648 6267 768 -4001 13 261 -1563 1511 1715 1090 -5448 -4642 -124 -1641 -1237 -5547 -8472 -7682
7632 -7682 -7875 -6362 -3520 -2386 -5590 -10881 -9575 -3086 -1984 -6205 -4645 1070 4147 1841 -6156
7617 -6156 -5790 -3678 -3298 -1617 -7206 -12351 -9748 -6073 -281 5376 456 1514 -889 5948 5738 4443
7601 4443 1872 -2050 -1158 3804 4389 2313 1473 4356 5238 3811 -1061 358 1797 1396 3392 3182
7585 3182 6271 2824 -1477 1060 -341 -4048 -8354 -11124 -14304 -13530 -9148 -5117 -4900 -8470 -12267
7570 -12267 -15673 -8319 2775 6263 -2755 -16490 -15847 -8711 -691 -793 -4497 -2719 -3866 -4768 -3750
7555 -3750 1167 4592 4581 975 -5485 -12519 -11788 -593 537 -3247 3400 8756 5527 3258 5418
7540 5418 702 -6213 -7202 -7267 -6668 -6874 -9949 -12556 -9315 -1288 1406 2822 1084 5359 10148 4853
7524 4853 5452 4486 -4339 -3765 -1328 -3342 2550 -2208 -6495 -9981 -17515 -16098 -10348 -9987 -10250 -13815
7508 -13815 -10994 -8328 -6723 -5528 -2227 -5014 -1912 -2707 -6609 -9941 -9136 -4476 2741 6585 2200
7493 2200 8153 5028 -6093 -11552 -14562 -8820 -5356 -6470 -2894 -6865 -7971 -7026 -5590 -3842 -6945
7478 -6945 -8953 -4589 -1312 -5978 -7136 3023 7937 4977 -422 -5020 -1132 -475 -455 -3181 -2539 -2474
7462 -2474 -5274 -9331 -7196 -4870 -5806 -6087 -5929 -4811 -4256 -8630 -6860 -2536 -799 -9179 -15030 -9138
7446 -9138 -1294 5025 -3705 -9633 -7973 -12819 -12870 -10676 -12506 -9071 -3758 -4623 -2584 -7436 -12248 -9864
7430 -9864 -4424 -515 2626 892 -4796 -1796 -1989 -4406 -2754 -2151 -2289 -2897 -177 -4389 -10707 -9287
7414 -9287 -6534 -1327 -1745 -3236 -4695 -1780 -3209 -1208 5078 10217 7585 5897 5015 -826 -13995
7399 -13995 -16336 -8295 4178 9276 8937 5373 1860 -9304 -3657 610 2362 -4438 -8772 -8584 -14401
7384 -14401 -11189 -11713 -6176 -4649 -8454 -9366 -9593 -7181 -4925 888 -5580 -11075 -12745 -8589 -2472
7369 -2472 -2171 -4519 -3222 -1105 -4757 -4496 -4847 -8915 -7756 -12848 -16291 -18502 -11867 -12480 -9368 -7632
7353 -7632 -9281 -11146 -14129 -13392 -9976 -11151 -9511 -6655 -7005 -4560 -3336 -13259 -16951 -8179 -11544
7338 -11544 -12796 -13337 -18957 -14967 -8775 -12675 -11321 -9869 -5945 -5635 -2205 3263 6528 9689 8195
7323 8195 3766 -39 -4451 -2474 2964 189 -7015 -14393 -11874 -7795 832 4544 5580 1671 -3383
7308 -3383 -4711 -5013 -2645 -5183 -4044 -7538 -7303 -6807 -2913 -6434 -2132 1610 -815 -4463 -3049 -7453
7292 -7453 -5747 875 1573 -299 2941 -1911 -4259 -6734 -6930 -7192 -9739 -7842 -5537 -2482 -5230 -6827
7276 -6827 -4270 -5422 -8685 -5095 -5726 -1392 2984 -3129 -8983 -14498 -14193 -9513 -11362 -12224 -4848 -3127
7260 -3127 -6294 -9552 -6493 -6862 -6207 -6889 -6522 -5128 -5251 -1017 -106 -1170 1966 4177 4094 7121 8611
7243 8611 4512 -1609 -6490 -6800 -8487 -10597 -12077 -9439 -11276 -16506 -8584 -2712 362 3623 4196
7228 4196 2466 996 1361 6401 3878 1778 10057 10682 7644 8394 5641 9092 7817 9515 8703 3357
7212 3357 3343 -1139 3615 7172 11241 13258 6849 906 -4823 -2728 -1473 -2889 -9235 -4559 2445
7197 2445 -2630 -5695 -5086 -5176 -816 2128 7582 6612 -324 -7476 -12409 -12074 -10892 -12034 -12921 -9625
7181 -9625 -10053 -9453 -6345 -8064 -5367 -5288 -6646 -7669 -534 3258 -777 -2149 -4223 293 -2190 -1784
7165 -1784 -2743 -459 -2014 -5449 -7643 1244 -4273 -4814 592 9343 6078 -1427 -5802 -10201 -15288
7150 -15288 -17597 -16339 -8859 -263 4078 8277 4785 -2912 -3403 -307 -1291 -9333 -9941 -14092 -9852
7135 -9852 -7512 -8924 -6060 765 -187 -1164 -1042 -8117 -7323 -607 -4988 -9691 -8227 -9965 -3446 -4834
7119 -4834 -15751 -9074 964 5500 520 2534 -4485 -7380 2052 4722 -3524 -5190 -3418 4156
7105 4156 5803 2382 3497 -1686 2667 5071 263 -7078 -10120 -9124 973 7601 8770 7867 1965
7090 1965 -4621 -3305 -2593 -1694 -6478 -5721 -6180 -1298 495 6878 11452 11441 9611 6268 -172 -2348
7074 -2348 -7514 -10213 -8597 -9520 -7973 103 -725 -2440 -12699 -13753 -16293 -15414 -13116 -9569 -9584 -13995
7058 -13995 -16244 -14316 -7112 -6109 -4036 -5390 -1172 -333 -6624 -9717 -15412 -14619 -11185 -8429 -10156
7043 -10156 -10370 -4025 2320 1863 -5145 -11776 -12514 -15648 -16044 -4020 5235 5519 3872 -6136 -11202
7028 -11202 -15495 -10863 -2390 -3133 -3617 1473 -1112 -1956 -867 -2166 -5859 -5320 -4412 1226 7653 12863
7012 12863 7579 5321 1112 2541 3147 2090 4267 3418 949 -1846 -4338 -2966 2672 6247 5955
6997 5955 -498 -7798 -15195 -15517 -20748 -23916 -20074 -15596 -14555 -12656 -6641 268 909 -3317 -4504
6982 -4504 -7909 -10360 -10434 -7223 -10384 -17068 -14952 -13433 -9378 -12837 -9877 -6427 -4781 -3945 -4083 -4726
6966 -4726 -7225 -2829 -2562 -9053 -14007 -16406 -15147 -16502 -17293 -13576 -11467 -13692 -14355 -13230 -13881 -15927
6950 -15927 -13019 -6642 -13830 -17888 -19693 -17581 -18253 -19870 -14198 -8022 -10569 -7785 2638 3822 -712
6935 -712 1130 292 -1946 -903 -6334 -7672 -4883 -6168 -9196 -8405 -4255 4255 4980 2918 -122 -8625
6919 -8625 -6610 -4983 -2961 -8905 -14748 -11389 -3254 2811 6797 9015 5372 -5053 -7192 -7013 -10572
6904 -10572 -5478 -2983 -10799 -16688 -9923 -6359 -5864 -6208 -5733 -5386 -2153 -8950 -14835 -15947 -8227 90
6888 90 -4105 -12646 -10188 -5871 -6845 -8125 -2594 -336 952 8642 9826 4707 4136 2550 728 -5812
6872 -5812 -6468 -1441 -2977 -4604 -6791 -8157 -4300 -1864 -8254 -14729 -16519 -11127 -12980 -9237 -6080
6857 -6080 -8340 -11908 -9980 -1422 3153 799 4497 2324 -2168 -4007 -5070 -1359 3890 6296 10870
6842 10870 8473 3240 -2009 -6728 -10947 -8508 -8322 -14176 -20541 -23381 -19887 -21458 -22047 -13697 -2839
6827 -2839 -1718 -1628 -10889 -12256 -9524 -7767 -499 3341 -1074 -4564 -8195 -8725 -5582 -3799 -3614 953
6811 953 7314 9343 3946 -5343 -3412 -296 1267 -2634 -10767 -3251 1183 -2974 1948 3167 -2487
6796 -2487 -6597 -4715 0 6 -6819 -10636 -11478 -12984 -7535 -6600 -5930 -7492 -6489 1885 6686 -46
6780 -46 -4846 -5098 -1224 -1639 1952 -2123 40 3276 2725 -8160 -10003 3710 3699 -6694 -2789 -1842
6764 -1842 -1716 -8493 -9007 -5376 383 -1116 -5220 -10019 -15903 -9135 -2656 -991 -3480 -11831 -14590
6749 -14590 -14936 -15108 -18033 -14857 -8981 -7977 -5406 -371 2970 3573 119 -7331 -8695 -11283 -6424
6734 -6424 -2313 678 3561 353 -926 2053 6555 3632 27 -4478 -6723 -887 1362 2503 -635
6719 -635 -1722 -1593 3043 2425 -1338 -9604 -12050 -8759 -7491 -11830 -15542 -17835 -16775 -13404 -8710 -6156
6703 -6156 -2988 3405 6117 3240 528 2930 6835 6652 7949 11012 7360 9232 8802 3455 5751
6688 5751 9384 8778 9056 20525 23696 21093 24653 24801 31992 35095 37147 40188 55053 76054 103450
6673 103450 140677 190347 253014 314930 337627 298554 222136 151939 101876 66754 39016 22581
6661 22581 23062 17589 8201 3673 -3365 -2977 -4168 -9570 -10479 -7335 -640 5665 5341 2808 7471 11651
6645 11651 6331 -2720 -8344 -8371 -12622 -14567 -11568 -9712 -13732 -13241 -19505 -16818 -12784 -9655 -591
6630 -591 -3546 -12606 -12856 -10825 -6334 -5443 -6625 -6257 -5098 -8927 -10567 -8393 -5859 -7678 -9284 -11555
6614 -11555 -9619 -2157 458 -5180 -6532 -3641 2863 5963 3960 2952 2150 -5581 -6091 -7563 -14139
6599 -14139 -13882 -10082 -1936 -1459 -4486 -5030 -4259 -9374 -16795 -21700 -14824 -10120 -5297 5016 -1143
6584 -1143 -7406 -5508 3265 3895 -2774 -3085 -5290 -7332 -7213 -4560 -935 1472 408 1089 -3929 -3343
6568 -3343 -3877 54 -676 -4231 -15833 -12593 -5241 -1798 -5994 -11375 -10415 -4747 -5754 -6790 -15903
6553 -15903 -14766 -3799 -4828 -15035 -17515 -15598 -14279 -12746 -13502 -9731 -6304 -1485 806 -1313
6539 -1313 -5542 -9926 -8092 -9461 -9678 -6447 601 4603 1742 1085 4630 -616 -9266 -9371 -8304 -11916
6523 -11916 -13638 -12151 -6945 -6168 -10278 -2417 -266 1059 -18 326 -3061 -3539 -5508 -170 4897
6508 4897 5564 2624 -4657 -3168 -4157 -6458 -3367 -4241 -7255 -15252 -14822 -14788 -17413 -14614 -15599 -11838 -9841
6491 -9841 -16873 -15820 -16556 -16940 -8156 -2035 -8738 -9204 -11131 -16954 -10445 -4577 -3488 -2765 2878 -26
6475 -26 -1099 2183 -1581 -6211 -1577 5280 -1302 -2617 -2669 -10599 -14077 -18366 -20221 -20457 -14756 -13833
6459 -13833 -6470 -3715 -2870 -2385 -1853 -1476 -12837 -18012 -11180 -4461 -292 260 -2375 535 -8038 -13404
6443 -13404 -8539 -630 -4046 -1866 529 730 -1905 -2677 -2086 -3558 -7292 -8452 -7092 -5119 -6495
6428 -6495 -6363 -9166 -12543 -11699 -12826 -20390 -12566 -12027 -15868 -19795 -20496 -11173 -5611 -6948 -13237 -8316
6412 -8316 -3483 -5313 -12528 -11281 -11931 -14542 -15986 -10490 -16772 -24738 -21920 -18817 -16876 -11858 -10446
6397 -10446 -4905 -3889 -5326 -11109 -13395 -12373 -11262 -8295 -6060 -9236 -7086 -4670 -3937 50 -1361
6382 -1361 -5024 -1734 -8405 -16967 -17491 -16376 -14951 -14068 -12628 -10893 -6206 -1494 -4144 -6422 -8552
6367 -8552 -5820 -8565 -11095 -14291 -15664 -12367 -5361 -10502 -15834 -12921 -12459 -11393 -12699 -13931 -12858
6352 -12858 -9508 -9628 -10779 -3057 2664 2160 234 -3296 -2531 -128 -3867 -7222 -3245 -4841 -5479 -269
6336 -269 -358 -186 -1200 2819 3273 -124 3900 6047 3710 1287 -967 -822 -1670 -5331 -13880 -13679 -10672
6319 -10672 -12724 -15916 -19789 -22301 -18977 -17117 -11984 -9433 -13454 -17501 -17057 -18617 -16695 -8622 777
6304 777 -23 -8358 -16313 -14190 -10049 -9187 -17876 -17909 -14371 -14479 -8062 -8889 -8376 -8171 -6370 -1101 -1782
6287 -1782 -1467 -3838 -9094 -11341 -8602 -2150 -2945 -7078 -5401 -8431 -12317 -16560 -16149 -8666 -2381 756
6271 756 957 9108 8454 5351 1717 -6678 -10147 -10928 -14400 -10257 -3900 1843 -1446 -5371 -5160 -1846
6255 -1846 -1043 -881 1899 3758 414 -2553 -11880 -17458 -16908 -21165 -18101 -8479 1677 -362 -1976
6240 -1976 133 -2350 -2980 -2952 -6810 -2065 -915 -7662 -5735 1935 4070 196 -1999 -3589 -4907 -6230
6224 -6230 -2006 -1198 2987 5071 10036 6512 -1504 -1974 6061 -813 -4029 -6677 -14684 -15270 -8598 -10177
6208 -10177 -7078 -2160 -1612 504 -4719 -11441 -17204 -14324 -7908 -5081 -1734 2181 1466 -395 -8721
6193 -8721 -11550 -12602 -10886 -3014 5446 2073 -1806 -7988 -10808 -10045 -15552 -20913 -21442 -10188 -1969
6178 -1969 6094 1403 -5019 -6777 -4657 -4163 4096 7863 7321 707 -5273 -4200 -5059 -6487 -1417 -3146
6162 -3146 -7529 -8115 -7058 -9180 -7474 -7388 -5381 -2214 -933 1601 10033 13093 13380 9253 272 -1313
6146 -1313 3911 8120 2284 1263 891 -1650 1337 -2122 -906 -634 -8229 -6471 -2061 -2244 -8877 -11547
6130 -11547 -10276 -4485 -1842 -1488 1330 2504 -4093 -6496 -10433 -19419 -18249 -11640 -8821 -10648 -10740
6115 -10740 -6019 -6024 -5115 -4718 -7 1105 -3452 2413 4017 1080 -7102 -11045 -10302 -7757 -7013 -10619
6099 -10619 -12127 -20828 -24534 -18746 -13132 -10846 -6876 -7415 -5388 411 242 3851 6770 5968 6917 5081
6083 5081 12305 15204 11398 4164 550 -193 -369 -10596 -17683 -19049 -13070 -5574 -7788 -7306 -3481
6068 -3481 -1029 3144 1716 924 -2616 -7350 -7507 -12171 -11145 -6876 -7797 -7952 -2660 622 133 1166
6052 1166 2354 5302 7172 -1063 -8646 -11928 -7855 -5584 -1076 -531 -782 -4348 -2891 756 -1853
6037 -1853 -1950 -6878 -7528 -4529 -5236 -4987 356 -2917 -4467 -3437 -3564 -5857 -8984 -12922 -14173 -12919
6021 -12919 -5969 -2480 -1095 133 3302 2643 897 -1835 -4508 -6811 -7385 -5762 -4001 -3686 -4785
6006 -4785 -7103 -10820 -18476 -17714 -13266 -9484 -6295 -5700 -26 862 -9261 -19652 -23568 -19484 -18063
5991 -18063 -18145 -11651 -10328 -10131 -7145 -5458 -8785 -5140 -4115 -9322 -10899 -4007 6022 -890 -6111
5976 -6111 -12326 -7552 -6056 -10956 -10770 -11122 -10592 -4818 -9222 -10534 -6370 -11560 -14108 -14181 -11655 -2635
5960 -2635 3580 2492 102 4443 4033 1592 -2177 -172 3384 -1274 330 -1842 -9135 -8576 -8182 -8738
5944 -8738 -13019 -11827 -13107 -8993 -3097 154 3448 5082 1202 -441 2238 -5570 -13256 -4340 2933
5929 2933 252 -2845 2460 1452 997 -1362 -1309 1791 -4170 -4318 -5298 -6243 -788 2143 1575 1133 -3439
5912 -3439 -3146 1769 6519 2366 -2697 -1370 1752 -1802 -4790 3665 4615 -3426 -5914 -7318 -7897 -7613
5896 -7613 -8580 -15510 -19985 -11884 -9884 -7394 -5123 -1081 90 -2402 -1441 -6553 -6242 -3792 -3620 -1674
5880 -1674 -6504 -4102 -918 -4143 -3622 4973 7086 214 -2798 -3571 -292 425 -2619 1943 1242 979
5864 979 394 -2525 -10979 -13623 -8646 -9932 -9655 -4095 -11783 -10386 -9867 -10127 -13977 -13919 -14723 -12096 -8271
5847 -8271 -7255 -4703 -7479 -7780 -3461 -7083 -10352 -4308 -3653 -8462 -10170 -9459 -5691 -6362 -4351 -736
5831 -736 299 -2279 -3407 -3230 1874 7301 11735 6443 -1575 -1666 -1231 -3606 -299 1552 -3717 -11199
5815 -11199 -18092 -16781 -13731 -11475 -9385 -8632 -12309 -2541 1499 -1554 -4308 -6210 -4321 -425 -7686
5800 -7686 -6632 -4095 -5496 -1023 4903 223 894 6840 12176 7382 4033 351 -4869 -4390 1589
5785 1589 1758 -2475 -1616 -5356 -7699 -8198 -5845 -5370 -3460 292 -3173 -5075 -6840 -2104 -1436 -5309
5769 -5309 -5088 -1862 -3870 159 3930 2459 1631 123 -1553 -2737 -283 -2220 -3817 -5000 -4393 -10260
5753 -10260 -12061 -10024 -2629 -1409 -3269 -5409 -2682 -1964 -3536 5061 1678 -1434 2638 -387 -4973
5738 -4973 -8909 -12863 -15733 -16309 -13206 -4477 -9307 -11164 -7140 -9092 -10727 -9133 -11454 -9079 -10938
5723 -10938 -12017 -13344 -13629 -10280 -15124 -16928 -11240 -10182 -10092 -11591 -8891 -3028 -2978 -9338 -10782 -9910
5707 -9910 -8538 -8810 -5655 -2081 -3140 -3772 -5855 -5908 -7561 -5885 -4103 -4362 -5694 -8333 -8766 -6179
5691 -6179 -3976 -2568 -5993 -6938 -5073 -7723 -2696 -3369 2466 5672 3801 -2984 -5097 -8196 -11712
5676 -11712 -11509 -8399 -7983 -2646 1121 1968 1479 7047 9906 4567 342 180 924 -1975 -7508 -9859
5660 -9859 -12701 -11794 -7534 -5756 -6165 -9494 -13417 -8987 -2573 701 -3936 -5367 -8071 -8642 -6219 -7564
5644 -7564 -11060 -7840 -10685 -8095 -5751 -3013 226 3883 2944 -4724 -2060 -2423 -6198 -3965 -3837 -616
5628 -616 -482 3005 4977 9827 1804 -11255 -17146 -14300 -12098 -9342 -8523 -8452 -7306 -13036 -9439 -10151
5612 -10151 -7440 -5219 -6964 -10534 -2978 -1318 -540 -3570 -249 2611 -179 307 1227 -1113 -1557 -4888
5596 -4888 699 2002 4062 2703 5610 6727 -5642 -4604 78 4046 9200 5498 5611 926 -2677
5581 -2677 -6195 -6446 -6558 -1079 -2158 -9175 -9864 -9285 -7477 -6225 -767 3409 120 -165 1097 -3171
5565 -3171 3806 7399 6230 2000 -688 -6555 -3374 639 -843 -10435 -11994 -5084 -4255 -9614 -6967
5550 -6967 1135 3153 2248 -1457 -4048 -6754 -5975 -7654 -4221 5069 5575 409 -2280 -1711 165 6495
5534 6495 1124 -2706 2480 7533 2677 309 -3119 -7486 -5563 -3769 -4995 -6915 1696 7393 3747
5519 3747 5013 6399 3212 -674 -3407 -3389 461 1366 -5143 -9112 -9394 -2780 60 -4388 -9552 -14717
5503 -14717 -14151 -7028 -5057 -5741 -5781 -8922 -11921 -9870 -883 2196 -3529 -6792 4303 8263 1069
5488 1069 -5883 -8603 -4643 -2219 -3957 -1598 -545 -2350 147 494 -1287 -1597 -4234 -2886 -5605
5473 -5605 -7251 -6532 -10580 -10107 -8913 -2821 1372 -2415 1868 9518 5662 -2043 -7864 -5601 -532
5458 -532 -5693 -8975 -11124 -11439 -11656 -12468 -8720 -9387 -2780 4203 -465 -1882 1779 9590 13805 8995
5442 8995 3380 -3279 -2348 838 -2071 -5463 -4129 -4443 -4269 -4578 -3022 -6077 165 -5095 -13199 -9493
5426 -9493 -2790 -4475 -4917 -1930 -2601 -11819 -12679 -9513 -2138 -3891 -6548 -7535 -12171 -12733 -11051 -8197
5410 -8197 -15264 -16330 -10715 -5287 -2969 -4446 1203 4364 2912 -4253 -10472 -16385 -13479 -12119 -4045
5395 -4045 -5428 -4430 -3920 -11211 -10856 -11136 -5926 -2289 -1315 -4477 -9548 -7481 -5579 -11789 -14633 -11998
5379 -11998 -6671 -8307 -18040 -14988 -10915 -8875 -9300 -8030 -5459 -7930 -11751 -15232 -15246 -5335 -6082 -4657
5363 -4657 -4871 -2669 -4421 -410 1616 2298 -4932 -10512 -10339 -989 6418 2674 -1773 -186 2262 2614
5347 2614 -5434 -3456 -987 3405 3076 2361 -499 -2771 2378 1581 -4443 -4901 -8159 -6668 3337 1954
5331 1954 -1956 -42 3074 1411 2241 8945 9436 378 -1998 -3136 -12567 -14497 -12980 -9278 -2992
5316 -2992 2452 5891 8638 -423 -3997 5396 9450 5310 436 1612 1617 588 -2930 -10009 -6155 -4940
5300 -4940 -3813 -4816 -11054 -16805 -6991 -4119 -9417 -10297 -10427 -8463 -9034 -8390 -8631 -8405 804 3024
5284 3024 457 2457 1295 6149 4785 -1436 848 434 -5917 -8740 -12501 -13622 -15649 -11520 -12921
5269 -12921 -13907 -15357 -14439 -14383 -11044 -5672 -503 5377 6969 3574 2314 -1044 -2303 -897 -2589 -6782
5253 -6782 -6451 -768 -4838 -5822 -1271 -4795 2234 2877 -287 -400 -5029 -3687 422 1918 5919 3496
5237 3496 -2855 -11742 -12619 -7260 -3367 -188 -1111 4460 4131 2576 -3641 -2615 2853 -1565 -1723 -2892
5221 -2892 -7169 -6231 -11846 -15499 -9281 -2395 415 -868 6308 9893 10919 3101 -2688 -2263 142
5206 142 -3333 -9246 -9803 -9540 -7806 -7173 -4877 -1671 -1183 -1217 -1684 -5427 -3927 -1443 -3217 -9602 -6736
5189 -6736 -7821 -6101 2019 -1258 -8029 -13871 -11553 -11140 -8151 -4886 -7521 -10782 -8217 -5370 -3149
5174 -3149 304 -990 -4908 -5038 -3176 -8315 -7179 1693 9039 8670 5380 2120 2408 899 1427 -2228
5158 -2228 -6050 -6910 -5926 -2510 -1990 -3828 -9910 -9543 -6577 -285 -3353 29 6566 6540 4795 -6925
5142 -6925 -11160 -16648 -14881 -9679 183 6271 5357 -3292 -2094 2330 4140 -191 -6600 -11213 -3301
5127 -3301 -704 -7290 -6856 -3693 -6203 -3524 -3714 -3912 -860 -583 -2244 -957 -723 -1907 -4089 -2217
5111 -2217 -6128 -6893 -8703 -13187 -11273 -6429 -7672 -2852 -460 2097 758 2045 2498 407 -3559
5096 -3559 -6518 -5119 -9667 -10247 -10443 -15783 -11245 -7684 -9703 -11018 -8831 -2819 -5506 -10460 -8037
5081 -8037 -12201 -6513 -115 -5995 -10826 -9774 -8700 -5920 4518 6825 3211 4558 -1097 -7057 -10709
5066 -10709 -8388 -3646 4367 4034 -674 -2171 6093 7614 8864 14163 13290 4772 5875 7953 5690
5051 5690 9694 4253 7636 7097 6207 9717 9330 1170 -2961 -1511 -5715 -6522 -8895 -12617 -8923 -5895
5035 -5895 -5476 -2540 -5031 -5147 -1223 -2145 -3339 -894 1310 -1585 -7999 -11646 -7117 -8215 -1141 6304
5019 6304 5469 1834 -76 -2244 -1251 -4173 -6308 -8979 -6190 -556 -699 -2685 -3519 -4791 4465 7003
5003 7003 5458 1851 669 3760 5022 2694 2227 -1852 -6629 -5026 -4204 1412 6346 7332 9234 3734
4987 3734 -2183 -1292 -3029 -7892 -5515 -5600 -9338 -7778 -7381 -5686 -2067 322 -3581 -5406 -6228 -6659
4971 -6659 -5892 -4559 -6115 -4107 2534 1741 1369 5580 11143 11398 6967 -137 -1006 -4209 1827 1545
4955 1545 -1276 -4033 -10608 -6585 -4629 -1767 5691 3226 977 -466 -2012 -3167 -2215 -2223 -6557 -9597
4939 -9597 -3291 3311 288 -3007 -931 -1129 -3575 -2496 3389 2321 2509 1129 2700 191 4395
4924 4395 8990 4057 -2754 -2055 -266 1250 1783 1761 8497 4779 184 3503 7491 7210 5610 3055
4908 3055 2892 1054 2145 5412 7198 6060 1508 599 1107 457 2665 3159 1524 -2427 -3501 -8584
4892 -8584 -12408 -4133 4277 5794 5544 1656 2123 -7620 -10395 -7005 -2531 -5843 -13586 -16871 -10562
4877 -10562 -6601 -3318 235 -824 -4190 -478 2867 10224 12647 3028 -2800 -2101 3126 4809 11182
4862 11182 15315 12147 1563 -2550 -10926 -14274 -8813 -5955 -2268 2959 862 2337 3858 2037
4848 2037 -1632 -2755 -2785 2907 5171 9023 7592 8402 1890 -447 -2470 -7677 -15073 -14504 -9641 -4483
4832 -4483 -2044 -399 -2178 -2778 -4146 -4683 5539 6327 9217 8664 1257 -1839 858 -2793 -9161 -11405
4816 -11405 -4994 -2865 6215 5636 6989 4878 371 -5262 -6702 -11314 -10234 -7229 -5803 -1407 -3062
4801 -3062 -583 502 -1804 -12389 -15463 -10733 3119 7460 5299 10240 8883 5359 5386 9237 7567
4786 7567 3732 4534 3002 2193 -1713 -1528 2158 9373 15032 18000 8061 4539 5712 5663 4344 3062
4770 3062 -2720 -2121 -1698 2683 3834 4606 6542 4425 9787 6410 -1367 -6718 -4201 -1790 -5346 -5298
4754 -5298 -234 -188 1266 2206 2410 3082 2154 790 3071 6841 4815 2814 -1052 -6067 -8564 -12207
4738 -12207 -10567 -6397 -4013 2827 1486 -5209 -2234 -1264 -4017 -2289 -3192 -6998 -3646 -1188 -1402
4723 -1402 -2636 888 -5024 -4894 -4019 4872 13439 7260 5208 -207 -1196 2832 1581 -4151 -6812 -5887
4707 -5887 1076 -466 2912 7481 4660 796 327 -1430 896 6507 2986 19 5057 8139 -641
4692 -641 -4062 -4389 2558 3379 1149 -1016 -4266 -2614 -2480 -1200 1783 3323 -1236 -5452 -7616 -9501
4676 -9501 -4608 -3001 -2441 -735 2909 7897 6208 3503 3489 4744 3706 5697 1387 1646 5217 9183
4660 9183 8822 4857 -1325 -2302 -4602 -4362 -3754 -7002 -13452 -12397 -11381 -5262 2134 5297 8913 10521
4644 10521 14192 11829 10725 9737 9986 11610 11903 4944 -3798 14 744 -649 3017 3853 4118 1310
4628 1310 -1463 8778 15076 13408 11392 10441 5023 3203 3600 -233 663 -101 -6456 -3461 1493 7011
4612 7011 3162 -192 3546 3645 -930 -5353 -4106 -1979 -5591 -4447 1095 1146 881 -62 -5285 -11055
4596 -11055 -6515 -2311 -5586 -4874 -7946 -14470 -13244 -9549 -5250 2025 6898 1679 -774 -4686 -9971
4581 -9971 -5365 1405 5442 2419 1291 1631 5114 5434 3978 -361 3015 2688 590 -2598 1762 -2610
4565 -2610 -6888 -3422 1306 -1306 -2774 -3167 -3974 -10512 -14173 -11164 -30 1710 -6442 -5166 -5925
4550 -5925 -3330 -4643 -8272 -7710 -5728 -6208 -14082 -18718 -14979 -10477 -5617 -1251 -3639 -3683 -13106 -14402
4534 -14402 -10952 -8198 -4406 1417 7530 7842 -69 -6586 -12647 -11346 -3576 5781 2411 -6340 -6125
4519 -6125 -8650 -11952 -12063 -1775 12388 10826 11497 14848 10402 6040 5571 13250 14997 13530 9939
4504 9939 2336 -1555 -3265 -3309 -8768 -6612 -7715 -11257 -14203 -7006 -3181 -3452 6202 4970 3862 1244
4488 1244 -6067 -6987 -6843 -8685 -6848 1207 5656 -3748 736 6196 10023 11712 4230 930 -3130
4473 -3130 -6354 -5615 -3931 -3289 -7319 -3740 -6804 -1356 6669 8302 10401 5827 -1258 -3651 1008
4458 1008 8590 12267 8438 -2521 -7640 -10769 -5009 -1017 752 -3833 -4036 -5338 -8293 -12725 -13843
4443 -13843 -8854 -1493 504 1177 4870 4629 2389 5249 5993 1524 4563 -613 -1664 671 -2570
4428 -2570 -6590 -10640 -10805 -5954 4016 6749 -3134 -2204 1480 4958 6453 7997 4216 2768 773
4413 773 780 -1400 2163 6619 10016 4483 5076 2528 -362 -2280 -3657 2579 3652 9204 18341 14041
4397 14041 7354 11689 12585 450 -7677 -951 2603 -2764 -1322 4177 2501 -3592 604 1874 2591
4382 2591 8558 4794 1700 -415 -58 2867 2053 130 1721 5170 3593 401 -1576 3208 6863
4367 6863 742 -774 3612 7992 12730 8263 7168 1443 2300 4021 -1500 -2690 6682 7300 8099 9071
4351 9071 6841 6277 6596 5065 6049 12592 10375 4074 -3343 -10300 -8312 -3914 -6968 -5497 -2915 -3583
4335 -3583 -112 4134 3218 5822 5587 5105 4611 6379 4665 168 -3707 -5518 -7345 292 3250 3440
4319 3440 -2340 -8870 -5783 161 2238 -2067 1487 5327 6704 3190 -3208 -1612 2614 5524 3350
4304 3350 5635 -629 -2524 6325 7602 1497 -3118 -4834 -2733 -4487 -5917 -4443 -708 -4908 -7255
4289 -7255 -2742 160 5281 8369 5448 3862 796 4254 3734 -912 586 1141 -6084 -6242 -6199 -7705
4273 -7705 -3401 -4443 -1849 -1424 -6616 -2850 1515 4389 2158 7924 11063 8484 2757 -1858 -707
4258 -707 2446 -331 814 -60 -1441 -1288 -3774 -4922 -6712 -131 6407 4589 877 9297 14538 13407
4242 13407 10735 6322 719 188 3051 -783 -4979 -5868 -3148 -943 1540 2587 6026 183 -1845
4227 -1845 -3194 524 -2081 -2879 5706 8075 2226 -5673 -7431 -3266 3157 10282 5089 4878 9284
4212 9284 9727 2283 1618 7212 6394 1751 -2501 -166 -2709 -4156 -1797 930 3245 -2562 -5070 -3519
4196 -3519 2029 6983 7962 8532 6479 3701 2523 -3487 -1425 -1068 1215 3395 -1413 -2754 2244 1266
4180 1266 -5186 -9072 -3423 1070 5582 12759 9763 5194 3009 -91 -1442 -1483 1201 4082 3669 -1781
4164 -1781 -9430 -10287 -8399 -10117 -8865 -6063 -5547 -4997 -511 -4348 -3988 -3509 -4344 -2827 3332 7248
4148 7248 7721 2174 -2373 2402 2889 4574 3069 -2464 -3276 -5322 -6220 665 4034 5518 10464 7677
4132 7677 7273 9862 6760 4410 5201 1138 1330 -357 -5885 -11695 -6238 -6091 -13373 -9110 -3424 2704
4116 2704 2938 -1677 -35 -2865 -7515 -6295 -3154 -1144 -3973 -4610 -3335 1554 4909 3101 4652
4101 4652 4827 3130 1722 1055 7433 4259 -2271 1351 3988 -1299 1199 5054 8534 5025 1991
4086 1991 285 6402 6448 6251 6939 11731 15461 14358 5954 6600 -201 -1223 4464 5339 2146 -4741
4070 -4741 -1081 4345 3534 902 3204 1905 -3286 -189 5380 2004 1707 8316 15712 11155 7013
4055 7013 122 -1559 -2659 3117 4763 3374 715 3687 -1173 -11721 -10587 -6447 -6019 -4783 -1210
4040 -1210 1096 -148 -3980 -7956 -11031 -6397 7575 16858 12952 5415 3690 3287 763 2631 253
4025 253 -2122 -4579 -4780 -5136 -3965 -933 -890 -8383 -7073 -4636 -2961 -648 3557 7930 2147 -1626
4009 -1626 -173 3067 1142 -8351 -5308 4005 3572 -2523 -6454 -11284 -17177 -15973 -4305 -586 1961
3994 1961 -3223 -7133 -5770 -2603 -1395 -645 1375 10850 6716 -5143 -1991 3251 3333 10759 14030
3979 14030 12869 8734 11697 13243 10825 7830 4186 1128 -1439 1293 3210 1295 2129 10608 11068
3964 11068 3009 5347 5824 2007 -5635 -1883 9067 15511 14935 6198 -5600 -4154 -1664 516 -1000
3949 -1000 3277 10327 9522 7141 939 6854 9975 3892 1400 -193 1705 2462 -671 -1754 2511
3934 2511 6273 7366 14850 19708 14025 3537 3001 4589 480 963 5350 5909 2295 6545 4703
3919 4703 793 4837 12507 12603 5624 -3868 -8801 -5367 905 4443 4838 7831 6182 334 2467 5394
3903 5394 -3300 -5459 -1205 2459 4753 2014 -2128 1117 -546 3082 3528 4304 769 -6145 -5202 -4397
3887 -4397 -515 5076 3408 -6197 -5595 -5089 -2308 -1418 5221 697 -9572 -14539 -11600 -8853 -5343
3872 -5343 -3806 -1117 -1467 5163 6468 2104 -3448 -3708 -4098 -1645 -6247 -3386 2256 4194 2575 96
3856 96 -722 2892 619 954 6077 7337 1814 -2879 771 4840 -1347 662 4114 4416 2521 -928
3840 -928 3060 9618 8101 4590 3573 -4721 -3447 655 1249 -2435 -3314 -1919 4376 4208 5776 9161
3824 9161 3330 2876 5981 10143 10072 3894 8239 6927 10042 11702 2809 1777 -2665 -2284 -9361 -11204
3808 -11204 433 7830 11371 5532 990 255 3901 2920 7246 6325 3796 1966 1082 4077 7162
3793 7162 8614 11375 8797 5064 5123 4341 -797 -1731 -2904 -1916 -1005 829 6236 4210 5167 10405 8260
3776 8260 3537 4433 6920 4557 6588 5089 2632 4365 320 1934 2092 2874 7561 10459 15904 18299
3760 18299 18052 8472 7066 9152 5549 7035 5604 1951 3277 3201 -850 -1152 -1666 55 4328 13376
3744 13376 16505 11438 6525 5705 4607 5604 9222 11905 13149 11048 11849 13627 13327 8898 8727 4971
3728 4971 3453 922 -766 720 3085 4800 11092 6281 -1612 -9447 -7044 -1811 -1051 526 4628
3713 4628 -2670 -11564 -8274 -2318 -4995 -9078 -10257 -955 8366 5225 3814 3497 389 -4383 -12194
3698 -12194 -10229 -6932 -8756 -5899 -60 40 -2468 1551 7678 5568 10363 1834 1408 -4644 -12094
3683 -12094 -13841 -5941 739 -200 -3202 -6284 -7536 -8182 -4997 -4776 -991 -4443 -12948 -13124 -12611 -6550
3667 -6550 -5370 -2781 1421 -5606 -7177 -6292 -301 41 -2442 3801 2876 -2224 564 786 -2057 -3592
3651 -3592 -2855 -74 153 1390 4818 5938 7422 -1500 -3362 -1164 -466 -3206 -6565 -4626 -4078 -4017
3635 -4017 -10074 -12533 -11288 -12182 -12296 -10985 -4714 4645 8576 6342 4423 9667 6077 3751 -1450
3620 -1450 -7721 -1317 -3382 -5308 -3653 -6854 -7684 -3588 -2569 -119 5207 9253 12766 12333 8928
3605 8928 3789 4064 7051 8635 2236 1829 3698 6232 5692 471 10356 5812 3462 5538 7444 12102
3589 12102 5478 507 457 -1414 -6911 -7609 -7773 -8612 -7270 -4830 -6695 -7399 3699 7444 3895 1648
3573 1648 6711 7682 9448 14009 10980 -1329 704 6585 10358 10980 9002 4516 2348 2101 2083 3080
3557 3080 -461 -426 -537 -2173 -1794 -4085 -4541 -4539 -1016 2180 -3445 -6227 -2809 425 6898 6293 1393
3540 1393 1032 -793 939 1589 4069 4043 5044 146 613 -4421 -5080 -10567 -14605 -10096 -5118 3476
3524 3476 1743 -3529 -5242 -11367 -11515 -10526 -10538 -8243 -10171 -5110 3863 4161 2630 5111 7038 2426
3508 2426 -1259 7803 16644 16676 11966 5140 6239 3081 -3095 -6213 -3075 -1853 1186 965 -3859 -5911
3492 -5911 -6991 -7743 -6625 -2888 1861 7221 4051 -2047 -3621 -3934 -3436 4694 13231 9662 5977 9823
3476 9823 13305 11768 9392 9010 13842 17558 10910 7920 7838 10952 9788 10668 16748 22959 22581 22228
3460 22228 14905 14833 17427 11963 7238 5205 6129 8373 12254 8311 517 -340 -51 -2433 -9527 -5120
3444 -5120 1274 4010 4344 -3231 -1457 -2760 -4575 -2160 -2384 -5200 -1562 3151 3816 8820 7536 3715
3428 3715 7393 13870 14554 10420 2414 6713 10262 8313 4721 5897 7199 7740 9274 7372 14751
3413 14751 23493 16930 8080 7940 5028 2556 5785 8772 3744 4232 7667 3878 4839 14499 19999
3398 19999 12333 3091 4196 11990 11747 8758 4949 706 2568 2769 5711 4245 892 -933 -6566
3383 -6566 -6522 -6744 -2557 4659 5987 5143 1612 -5484 -3973 -1398 -3631 -2442 -7829 -11642 -14650 -13180
3367 -13180 -3618 6553 8795 7869 8619 3145 -543 -664 -676 -48 -2210 -4138 2343 6390 5976 1815
3351 1815 3081 6479 3907 5320 6645 5758 6408 7132 4617 442 -1658 -2294 -3226 -1420 -730 3444
3335 3444 4581 1318 4318 -5743 -10475 -7909 -1086 2544 2833 2194 3976 9532 13055 9876 6834
3320 6834 3839 9979 12955 11492 11350 7156 -129 2903 6509 9178 14274 6810 550 -851 2813
3305 2813 3888 4833 6861 3730 6349 3346 -1390 3348 7647 8451 7082 8203 7645 7759 2815 2259
3289 2259 2092 1216 2732 -5988 -5143 -4268 -1451 553 -2005 -6432 -12283 -1765 9001 8901 1636 -4605
3273 -4605 -5773 -6413 -4617 -73 -1239 -1696 -3446 -1182 -3957 -3669 -9741 -7309 1164 5775 4947 -2849
3257 -2849 -1581 651 3367 2502 -293 2342 1092 7683 5181 -1489 3757 7239 10467 4859 4125
3242 4125 8929 12390 15669 10652 3050 -1297 4159 4595 6881 7067 4292 9295 9193 10223 9762 8487
3226 8487 2148 -2886 2704 4755 1962 -1951 1787 7618 7387 12911 10095 7772 2215 141 3860
3211 3860 -610 -6523 -13494 -10665 -1722 -3328 -8742 -8585 -349 4483 2733 5220 4635 6401 10374
3196 10374 8455 9110 9456 8508 6703 2895 -1252 1748 180 2534 5123 4229 -863 1015 4311 2413
3180 2413 -1966 3575 2816 -2227 -1674 414 6345 10609 13776 10664 8566 10046 7602 5315 4468 4431
3164 4431 3218 -2920 -8255 -12559 -6383 -2691 865 -2232 -1593 -234 6018 13936 14128 9322 682
3149 682 -2402 3058 4059 7580 13404 13776 7712 -306 1594 2372 8150 7068 6177 8508 7680 2120
3133 2120 -1504 2972 -1182 -9540 -8212 -5387 -7489 -530 6512 1145 7712 6264 2606 -2048 -12262
3118 -12262 -7104 2286 3905 3040 1078 5206 6856 2642 7148 11797 16435 13569 8397 1949 2189
3103 2189 3384 7985 6391 -1050 -9115 -13349 -9360 -9811 -2430 5096 4000 -732 -57 -1475 7162
3088 7162 7501 11274 12541 14502 16452 14362 16654 14215 13232 10632 2845 140 2201 9786 13060
3073 13060 8964 -1589 -2445 -2154 1337 1751 2102 -3883 -3922 -261 3385 7834 9929 12903 16139 12597
3057 12597 8804 4646 -1298 1013 12200 10288 6752 7519 3630 2730 -1397 -1738 -1363 -4654 -12196
3042 -12196 -8874 -3810 1619 3285 5004 6744 5216 8691 16582 19703 20152 9082 1761 406 629
3027 629 2726 1802 2207 -4777 -7953 -7962 -4748 3781 5099 -2968 -1795 -762 -2466 2217 286 -6124
3011 -6124 -3805 -1781 431 5807 11119 7170 -2063 -11839 -10628 -12654 -7950 157 -2321 -7330 -2900
2996 -2900 2167 9284 5150 -228 -659 2445 2256 3065 -2053 -1095 -779 4454 6380 4401 3155 1664
2980 1664 -596 -22 6533 7954 1719 -465 999 3773 4547 6127 2799 4421 5713 5454 10412 13917
2964 13917 10733 567 5838 10139 5996 2621 -2390 -3013 424 11467 16696 8669 4180 5888
2950 5888 10482 11913 13116 14804 13001 7538 13465 11567 1505 -5194 -3325 -596 -3777 -3516 1239
2935 1239 3073 -2566 -461 -856 3902 7744 5890 498 5548 9415 7249 186 155 5118 7637 9601
2919 9601 5849 4229 12344 14175 10377 10911 8133 7746 13564 13106 1867 -2520 3692 10744 19037
2904 19037 14944 8205 1463 -3200 -3535 -7122 -2663 -551 4060 4811 4903 11072 13724 11368 6565 2534
2888 2534 4262 5758 3538 7045 9440 5833 533 -641 8223 9161 8460 6809 -2100 -2562 5271 15173
2872 15173 14521 7470 11800 7624 7287 7958 4772 4440 -1114 -7306 759 4694 1560 -1551 -1975 -188
2856 -188 2581 -1384 -854 1348 5069 4621 -5171 315 -3112 2427 2903 -6175 -4262 2503 569 -4195
2840 -4195 -4058 -1223 6041 -573 -8426 -2317 1837 4594 1102 2893 -914 -2009 -1599 -5889 -5139 576
2824 576 2679 4377 -1980 -3066 -844 941 -1175 -2031 -3478 -9521 -13328 -14426 -11957 -7917 -1836
2809 -1836 556 1056 3238 2396 2374 851 4948 14253 19190 17040 8067 485 -3612 -5560 -4079 -792
2793 -792 1019 -524 -887 -7176 -9930 -4638 325 -1215 -1525 1827 5321 4695 2634 -1619 -682 -4834
2777 -4834 -5826 495 4092 4169 3888 4931 4664 3793 1694 -133 -3073 -4688 -4412 -4627 507 5269 9216
2760 9216 6866 5596 3186 1358 7107 6352 -593 -547 3794 4335 1618 -401 -3711 -2843 4153 10929
2744 10929 7867 3049 9553 4950 -2589 -5577 -6248 286 9920 16656 24117 22325 18378 13269 14908
2729 14908 11940 9532 5466 5828 3001 1205 1345 -2627 -2632 -5772 -11090 -7430 -5966 -5742 -3320 -2613
2713 -2613 -3446 266 6539 13981 19241 16102 11410 7325 10224 17768 8297 -1956 -1441 7615 9652
2698 9652 202 -6368 -3164 604 4103 1206 -82 6867 11216 10412 8661 -110 -2708 -4363 1049
2683 1049 1910 939 7891 7195 11931 17472 18528 17305 20203 24057 22833 13432 7637 2456 702 -4006
2667 -4006 -2159 -6654 -6616 -4444 3259 9610 8690 7554 6629 2174 490 1705 258 -8299 -13280 -5464
2651 -5464 -622 1773 -1574 -2785 -383 -516 1087 1062 -3413 -2096 -2000 -2020 -2235 -3019 -2170 -1684 928 4179
2633 4179 124 -2066 -2952 -1431 -6133 -7451 -5704 5403 6907 5723 11544 15900 14413 6334 6209
2618 6209 1506 -6743 -2156 13611 12286 11013 11661 6784 -3878 -4281 1582 5084 6565 5799 6066
2603 6066 4173 7954 9927 7203 -607 -1154 40 354 -7828 -12046 -10024 -8794 -12 3312 4968
2588 4968 9481 7212 14532 15873 14521 15870 9602 3891 1739 6100 4654 -1195 -3572 -7341 -2968
2573 -2968 50 -216 -447 3911 5503 8205 2104 -52 7170 7657 2382 -1750 -3121 -5391 -5552 -4118
2557 -4118 -9927 -8803 -6320 -11559 -13282 -4836 -2587 -82 -3081 -10126 -9623 -9120 -15384 -7306 -2570
2542 -2570 -2542 -1043 7037 9398 5233 252 -6102 -6871 -2875 3190 9488 15510 15181 4064 2230 8272
2526 8272 13645 6614 3143 4780 11507 13401 13551 14450 15545 13055 6790 3153 7769 10210 10046 6260
2510 6260 5253 2418 1791 2842 3663 2105 7214 11515 5197 6348 6273 5237 7111 6080 -7494 -10239
2494 -10239 -11257 -14548 -13068 -8992 -2682 1027 -1675 -9661 -12939 -8683 6006 12623 10506 9528 6861
2479 6861 6419 4363 7028 5155 4868 10158 14124 4884 -225 -2344 258 2449 3409 1648 -836 11669
2463 11669 23496 23591 18150 19722 15598 10079 3063 1810 6408 -594 -1297 4558 7280 11705 10209
2448 10209 696 -5680 -4528 2624 5082 4055 4574 5389 10267 7030 4021 4879 3853 414 3872
2433 3872 -1026 -4084 461 9911 9237 8522 11911 5880 3808 11770 10017 5201 827 941 6686 6049
2417 6049 6167 5839 5220 4431 1671 3168 5815 5720 7418 5091 1241 -2712 -968 4310 4628 1551 7257
2400 7257 8603 5420 3043 -287 -3415 -1523 -11959 -17009 -8598 -7876 -9696 -6656 -3444 45 -3381
2385 -3381 -5936 -2677 3933 -368 -3325 -3940 -1701 -628 -4698 -9922 -9709 -4812 -1691 -3399 -6316
2370 -6316 -374 6099 4951 1349 3812 257 -2740 -4246 -10764 -12895 -2963 -2981 -2920 663 -1473 -2131
2354 -2131 926 -394 5644 7691 2825 -2067 1553 501 -1113 -3667 -2559 -2509 -6926 -8416 -2812
2339 -2812 4042 595 734 1160 -1857 -2959 -5259 -8921 -7145 -476 4382 7523 3387 7661 5301
2324 5301 2718 -5279 -5460 -4055 -6480 -6359 -3972 -302 -2010 -1528 -4048 2102 6682 9906 8962 7694
2308 7694 -2537 -8298 -2940 -2344 -505 4320 12201 10318 8414 12767 12269 7428 378 4978 7058
2293 7058 8921 8970 6796 3941 1177 3460 1932 1072 -968 -28 308 -1553 1811 2331 687 -4283
2277 -4283 -1391 2424 8299 6982 2498 -212 615 -11624 -12252 -11583 -10750 -9413 -2959 5970 12505 4874
2261 4874 -331 842 3214 1852 -1280 -994 -3309 -6855 -9269 -11647 -9773 2435 11648 12474 12683
2246 12683 12036 12650 15603 20010 17537 11498 16528 15383 5136 -4628 2434 14040 22602 23209 15793
2231 15793 2823 -460 1909 9270 12478 15208 12566 8700 16744 11446 5548 1486 -914 1024
2217 1024 5988 3391 3599 3622 6308 10846 6293 -687 294 4167 7549 12219 11891 9741 9477 7492
2201 7492 5516 462 5627 5134 3493 8107 1539 -7605 -10522 -4919 4356 11207 10010 6309 8765
2186 8765 10562 13056 12970 9937 13966 15807 11218 7804 9782 3206 -1282 465 -1073 -65 2188
2171 2188 5974 9378 14163 14860 10412 5949 6674 6383 -545 -919 6676 10417 6873 8963 12037 8903
2155 8903 12854 17921 20780 15559 4611 5133 4854 7822 7401 10421 8412 9477 906 -2418 3026
2140 3026 8043 3728 -1962 -1332 6382 7916 8547 10558 10404 13345 9144 2905 -4068 -12743 -10001 -5339
2124 -5339 -5073 -3678 -4356 656 167 -2690 -8422 -11906 -6326 -2880 -8516 -7095 50 1305 3668 1799
2108 1799 -2578 -4192 -9684 -8036 -8795 -6445 -8030 -3829 4457 8925 9700 6397 177 -949 -3455
2093 -3455 -5035 417 920 89 32 1148 9298 13356 9588 9691 8967 5807 1689 2685 -4392 -5990 -3518
2076 -3518 439 3212 1014 -741 -2119 781 -239 725 607 -360 -1735 96 779 2193 5601 207
2060 207 4890 4489 6312 10885 12615 13529 10549 10929 10908 9883 7796 10915 8150 13607 17748 14726
2044 14726 8796 -1585 -4728 2315 6329 6496 3167 7776 7645 8373 11844 5722 1751 3488 -3713
2029 -3713 -8609 -16610 -15384 -2460 -628 -3516 -3093 3822 10718 5784 -7036 -9145 -2127 4467 6848
2014 6848 5797 -2080 -936 -2178 2113 6923 5841 5751 3439 432 7080 7664 7823 8237 7273 1288
1998 1288 -263 1117 -801 -5400 -11068 -7444 -2985 -3350 -2546 -3300 -2899 -4133 -1225 2947 1642 -2222
1982 -2222 2549 2465 -3536 -4688 -9357 -845 1763 4154 -1239 -1225 208 -1620 2423 1661 2145 6066
1966 6066 -2421 -7498 -9546 -8972 -5412 -4813 -7935 -11481 -15724 -17849 -8703 -1146 6608 -3418 -2304
1951 -2304 4711 10269 8924 7287 12715 15762 10926 7589 5766 3697 6040 8338 8903 10675 19182
1936 19182 17498 15903 15175 18869 19831 12092 10441 3529 810 3093 6241 4503 -2041 -4385 2374
1921 2374 4508 8014 9089 4496 416 -3452 -4291 -5582 -7499 -13626 -12451 -10552 -7746 -3706 -7698
1906 -7698 -3026 -4694 -4798 -2689 -4930 -7883 528 2035 -3247 2019 12594 9447 6035 -282 1642
1891 1642 9967 10393 8989 14704 16226 16813 12941 6154 1720 2680 1456 3724 3706 1614 4721 6040
1875 6040 -1217 -5496 -5431 2893 6453 7325 3555 424 5072 4733 2945 3181 478 -221 -3292 -7150
1859 -7150 -12855 -10775 -5222 -1019 -1142 -2925 -1524 -1375 -2290 -1939 -3849 -6609 -318 4844 2829 -3692
1843 -3692 -7725 -5562 4573 10432 6021 391 2018 7104 1400 2258 1414 -5434 -7107 -11806 -13483
1828 -13483 -6623 -2818 1725 -1702 -565 3221 -170 563 5395 7975 2626 -2765 -5303 -2352 3297
1813 3297 5402 3743 505 6518 6880 7868 5692 5840 6558 6339 4918 2231 4042 510 -3231 -5616
1797 -5616 -4371 -6996 -9344 -8707 -2358 3767 -2829 -838 9865 12224 11929 8563 5700 5454 5487 3104
1781 3104 2434 3348 10053 9647 3753 3478 -968 -6049 -3235 2926 4192 4224 4171 -4 -464 -639 -1959
1764 -1959 -3187 -5511 -9132 -5443 -5644 -2978 294 4372 -186 -2689 -522 -5536 -4341 -471 2237
1749 2237 2443 1776 -319 5220 6971 6610 8129 10260 5287 2853 2630 51 2058 5036 5801 3136
1733 3136 6511 13224 13551 5533 4217 -735 -5540 -6328 -1290 5998 9961 2217 -7548 -10219 -6623
1718 -6623 -1409 -642 1662 2947 3809 3258 4843 6233 6279 7740 8267 809 -8759 -12080 -8027 -258
1702 -258 8339 6852 2006 -825 -2800 -2674 -3899 -2701 8292 11926 9932 13175 4361 4477 13281
1687 13281 7737 6597 7607 913 -2716 -4969 -6926 -8041 -4142 -2607 4032 1630 -4808 -4875 -1586
1672 -1586 -708 -5102 -8844 2569 10176 18033 18425 16911 13215 6401 7349 10399 7535 9242 7836
1657 7836 6565 2464 777 150 2317 -5828 -4679 -1371 3489 898 -1957 -4477 -4919 -1385 -603 -1063
1641 -1063 1674 6817 5872 4202 628 -6264 -5383 -3391 632 888 -1010 -1636 3878 3846 9043 6324
1625 6324 1712 7687 6986 2560 3575 -817 5532 6893 1 739 -959 -795 -600 2724 4317 4223
1609 4223 -1168 789 526 -2187 -3449 -5127 -3825 -4723 -7630 -2715 -1095 338 -8046 -9841 -873
1594 -873 -195 -3007 -4593 -2061 1220 5491 2239 -6773 -3709 -437 -1551 -2871 -2212 -4345 -2724 4822
1578 4822 6533 4614 1205 505 -5957 -10704 -14613 -14324 -7191 3564 8158 5400 130 2283 5350
1563 5350 9482 10987 10141 10933 7868 4902 6631 8245 6147 2121 1437 1315 2618 4521 5486 3088
1547 3088 6009 8624 8644 2828 -3819 -4282 -3472 -2605 -1921 433 3235 4033 -2659 1993 6911 5082 3386
1530 3386 5410 -744 -4004 -4279 -7497 -7416 -3815 -3066 -1292 -4127 -5094 -10005 -8523 -9107 -6894 -1483
1514 -1483 -3911 -1993 2031 2660 -1033 -4856 -467 2427 3892 3988 -1422 27 8193 4356 -2046 2104
1498 2104 2813 7287 7228 3912 -319 1348 3572 7594 10103 11075 9340 6961 7722 4664 1223 1653
1482 1653 3100 4731 -986 -1583 1164 1940 4025 6380 6162 7616 9587 7324 7169 8217 9618 12456
1466 12456 11608 12449 6307 6010 10407 289 -7226 -3251 236 3502 -2630 -766 1978 5844 5359
1451 5359 -2386 -7190 -10838 -9960 -1286 6733 5193 -5270 -16046 -17965 -12067 -9988 -13682 -8970 -2548
1436 -2548 4420 7023 1400 -1576 -10761 -15437 -10133 -1854 12909 23921 29078 38661 38403 31202 17740
1421 17740 6906 -3410 -6644 -8802 -6257 244 4617 2798 -1020 -5928 -6559 -9669 -1414 -1314 -2149
1406 -2149 -5343 -8532 -1482 -2914 -2900 -3911 -7760 -6998 -6473 -2650 -3 -4151 -9801 -6199 -3317 -3023
1390 -3023 1280 2071 1751 5230 7235 4199 3979 -85 -3580 -3437 -3931 -4130 -3129 3567 7996 14272
1374 14272 21023 19840 7695 3745 -4101 -9672 -14420 -13346 -3355 3383 949 -1911 -5064 -3636
1360 -3636 507 753 -2560 -4483 -8494 -4798 4372 9628 7211 3935 -2361 -9035 -1596 -148 4216
1345 4216 2384 122 -1885 608 1886 4459 2191 -4412 -5699 -2275 469 5304 5364 2581 -5138
1330 -5138 -7871 -1531 3130 10536 6848 -1057 -2690 -2507 -2225 3501 458 -4790 -2480 -2468 -6389 -8253
1314 -8253 -11685 -9482 -2086 7425 7034 2895 1627 3713 1059 3633 4457 -3634 -7298 -5954 925
1299 925 -603 -292 -815 -759 -2944 1856 -714 -5862 -4436 -1344 -333 -2384 -5803 -1325 -1547 -802 -2697
1282 -2697 -7702 -10800 -10890 -8569 -8335 -3555 1065 605 386 4341 6975 4235 5663 1490 -1307 -5105
1266 -5105 -6012 -11212 -4287 -2443 -4167 -1688 6280 11621 5470 -2647 -953 79 1400 9733 6126
1251 6126 3702 2147 -4275 -4715 -1862 -7569 -7844 -8053 -12270 -12694 -8002 -5015 -2346 -7369 -8821 -4483
1235 -4483 -2090 -5764 2208 3780 2029 -1499 -3298 -332 1106 472 -1494 -4309 -4806 -6322 -3347
1220 -3347 3701 5740 5179 7651 1978 -3757 -2122 4458 1384 2661 -1186 -6196 -2093 1836 -2466
1205 -2466 -7367 2477 2804 3428 6736 -13 -4013 -4546 -4285 -1120 -3228 -9471 -16344 -12247 -901 740
1189 740 690 -1940 -9445 -12447 -12631 -11512 -9693 -11035 -16746 -13840 -7737 -6611 -6516 -1516 -7435 -7021 -9960
1172 -9960 -11538 -6463 -9366 -4500 3008 7327 8531 7707 12518 7916 4178 4180 9287 13661 7743 -482
1156 -482 -3255 -2657 -5910 -2946 3835 1483 -3499 -9477 -6281 1214 4879 -1467 -7725 -15142 -18101
1141 -18101 -19415 -16974 -11572 -3233 -3792 -3785 -5097 -81 462 -9537 -3723 -4678 -3965 -4289 -9555 -5818 -6446
1124 -6446 -11867 -6467 -6553 -10175 -3375 -5537 -4816 -1349 3592 -984 -3234 -11234 -13229 -13954 -15870 -11998
1108 -11998 -8904 -4584 -8916 -8935 -4354 369 -477 987 -365 3927 526 -2301 -5723 -2814 3512
1093 3512 2682 -6398 -8086 -10088 -9368 -11155 -12496 -4425 2031 3360 4968 7551 8203 8128 4739 1353
1077 1353 -6829 -12862 -9914 -8449 -5760 5842 7796 30 -2994 -4475 -395 2889 1771 -461 -445
1062 -445 -4449 -3592 -6472 -5594 -3317 6542 8734 822 -4413 -2700 -384 6728 13916 8106 3076 -4443
1046 -4443 -7685 -8719 -7247 3927 12277 11855 2122 -5144 -7004 -8551 -12536 -7848 -1286 3943 3947 -1005
1030 -1005 -8709 -5137 3048 6867 5564 4472 10946 10136 12335 19029 10553 -863 -6422 -5771 -1488
1015 -1488 -707 -2732 -2723 509 4301 806 1711 2639 -3002 -2883 -4736 -9159 -5454 -7497 -3452 -643 1659
998 1659 1219 1474 5798 2781 -2384 -525 -3176 -3693 173 4202 5046 6744 4319 -2838 -1992 3997
982 3997 4157 4413 608 -6809 -9202 -1903 7736 2035 -3737 -8833 -12718 -7919 -3839 675 -2123 -11834
966 -11834 -3256 5029 1477 -2679 -4091 -2033 -4427 -7565 -14178 -11846 -9124 -8089 -2673 -2271 -2978
951 -2978 -5909 -6445 -5121 -5724 -9564 -8823 -4105 8 3278 -2 -2846 -1157 -6654 -9961 -3797 -6413
935 -6413 -11604 -13440 -11333 -14570 -15806 -12636 -13811 -12317 -11149 -13293 -11212 -6547 -6573 -6523 -5202 -8399
919 -8399 -8417 -5819 833 -191 -2567 -2486 -5106 -8336 -2899 3115 4748 202 -3854 -3805 -7059 -9741 -11803
902 -11803 -11245 -797 1238 -2232 -3365 -1087 -4807 -3853 -4624 -6587 -6965 -6862 108 7548 6757 4900
886 4900 3976 1782 -5596 -5129 -3852 -7230 -4716 -4036 -8381 -14047 -5740 69 -2862 -786 2296 2216
870 2216 -5142 -9479 -6050 -5161 -6065 -11258 -13608 -3680 1205 -6683 -11907 -13849 -10768 212 5097
855 5097 1036 -4676 -6169 -4254 1782 2095 4888 1157 -2681 -2860 -1260 -1434 961 336 1836 4858
839 4858 5568 15 -11131 -11676 -8988 -7426 -1806 -7017 -1250 -1077 -3527 -11254 -10905 -5334 -3771 -5839
823 -5839 -1476 -3928 -6383 -157 6685 4777 -7198 -12288 -8562 -7703 -6623 -2747 -6417 -13091 -25665
808 -25665 -26207 -17651 -12760 -6857 -8437 -8701 -8197 -6045 2099 -3309 -9702 -14153 -8327 -8455 -18341 -17896
792 -17896 -16708 -15887 -16914 -13607 737 7464 4849 3243 -150 -4097 -6993 -4637 -3149 -2436 3347
777 3347 3269 5701 11152 8643 2124 -4832 -4616 1003 5271 -959 -3082 -4197 -6644 -8988 -11649 -12322
761 -12322 -11170 -11196 -10461 -12568 -16648 -23798 -23043 -17379 -17562 -17066 -15821 -14141 -11933 -11262 -9864 -9223 -8750
744 -8750 -8029 -3139 -4887 -11951 -15983 -15923 -4885 396 2483 -8464 -12601 -9660 -6617 -12861 -9122
729 -9122 -5435 -7026 -8401 -10063 -5846 -3951 -9388 -7883 -9855 -10714 -9259 -5589 -212 -1974 -6583
714 -6583 -5908 -1209 -2927 -10096 -15260 -15278 -10455 -6446 -4948 -10897 -13144 -14406 -12324 -12127 -10281 -15528
698 -15528 -14070 -3525 -4736 -3735 -1914 -8794 -9960 -11164 -14621 -7144 -3358 -5732 -3130 -2797 -6354
683 -6354 -6824 -12843 -15639 -13836 -9430 -10158 -7492 -2936 1234 2103 -758 460 -1078 -8415 -4531 -1561
667 -1561 -2669 -3301 -1372 -3993 -10803 -10966 -7013 -8506 -9556 -12402 -11627 -8166 3290 -560 -2492 1244
651 1244 774 -3703 -9641 -9811 -8288 -1839 2088 -2902 -12488 -15211 -15798 -19553 -13480 -10479 -8255 -8953
635 -8953 -15488 -13105 -9266 -10481 -3280 3066 1821 1446 -3663 -6059 -6808 -9553 -9355 -11186 -14149 -9853
619 -9853 -4708 3504 4521 -4878 -14322 -13571 -15385 -10333 -14317 -13785 -11333 202 -31 -4982 -11735 -18477
603 -18477 -24774 -23728 -17499 -21975 -28616 -27327 -21846 -10731 -5555 -4027 -3493 -9109 -11268 -9365 -7796
588 -7796 -6315 -8273 -12296 -19009 -7099 -2209 -6955 -14652 -12439 296 4895 -1934 -7624 -7946 -4010
573 -4010 -10644 -12152 -9848 -8362 -7454 -13624 -14696 -5122 -387 -3202 -713 -2977 -5942 -7338 -7593 -4173
557 -4173 -2557 701 -3277 -7341 -6167 -13503 -16722 -15084 -12935 -10519 -4351 -5262 -9759 -9309 -7837 -11601
541 -11601 -9337 -8137 -5936 -2029 -953 -1448 -4189 -8013 -9553 -8404 -13531 -12003 -10293 -9808 -14668
526 -14668 -11496 -12319 -15428 -19278 -17240 -12067 -9742 -6579 -4465 -5265 -765 -4238 -10076 -8789 -3252
511 -3252 985 2872 96 -7912 -7393 -10669 -14039 -10445 -8741 -6894 -8753 -5955 -4996 -6085 -8144 -9700
495 -9700 -10236 -8245 -4889 -4968 -6647 -2560 -5597 -1697 5087 7073 5865 994 -3597 -10479 -10943 -5880
479 -5880 -6780 -6887 -11536 -8854 -11668 -13912 -11805 -16831 -22113 -23181 -21327 -14018 -10293 -12467 -19463 -24654
463 -24654 -24089 -16929 -13307 -9613 -10361 -7022 -2938 -4566 -10153 -15754 -13976 -7762 -4593 -5159 -8764 -5256
447 -5256 -9797 -16315 -10027 -8916 -11596 -17994 -17490 -18984 -23065 -20414 -16216 -18400 -13599 -9441 -9993 -8411
431 -8411 -8628 -10525 -13208 -12664 -16652 -15464 -14476 -18546 -18168 -17470 -17965 -14424 -13136 -13496 -13473 -17967 -21233
414 -21233 -18200 -13214 -8849 -12060 -11119 -5880 -10953 -7466 -4655 -5051 -11919 -12919 -4587 230 -1081
399 -1081 -4031 -12332 -16290 -18139 -16786 -10503 -7347 -12927 -14417 -15579 -21670 -18541 -14147 -14529 -8050
384 -8050 114 -4633 -11983 -10765 -9827 -11945 -10243 -2593 -4342 -5876 -3799 -4402 -2505 -2226 -1283 -4335
368 -4335 -4266 -6187 -11620 -9794 -4257 -7895 -11619 -9619 -6803 -7772 -8032 -7933 -15718 -18283 -15403 -18050 -14981
351 -14981 -17719 -17652 -16457 -19106 -12779 -6726 -11935 -10311 -5289 -5800 -10194 -7798 -3442 893 -737 -7607
335 -7607 -12338 -21015 -24532 -17726 -9992 -3169 -4794 -10796 -15827 -9681 -3339 -8539 -12183 -9763 -9943
320 -9943 -10721 -11358 -5056 -3957 -5445 -6108 -12118 -16229 -15695 -16379 -19553 -17942 -10246 -7860 -7493 -10061 -9716
303 -9716 -4221 -3997 -6613 -5246 -969 -2001 -2388 -11027 -17586 -13779 -14911 -15560 -10199 -9945 -5570 -5479 -2668
286 -2668 -5086 -6100 -2606 -3546 -2907 -4767 -8663 -14087 -11765 -15035 -13316 -7406 -2588 -8499 -11212 -5402
270 -5402 -2045 -8756 -9559 -8091 -3939 -5896 -11781 -13420 -13185 -9671 -10123 -14702 -15210 -18300 -18141 -14059
254 -14059 -6245 -4851 -8382 -12033 -8970 -6950 -10738 -18601 -18249 -17216 -15734 -13871 -9645 -5822 -2496
239 -2496 -2404 -5856 -7256 -5716 -7844 -7521 -3628 -4952 -7553 -9883 -10972 -7973 -8629 -8137 -8288 -10252 -11996
222 -11996 -6464 -6048 -12807 -18229 -17172 -8872 -9578 -5619 -7226 -8217 -7667 -4023 -7308 -8537 -4956 -9745
206 -9745 -8997 -9335 -8024 -10547 -11650 -11949 -13575 -13319 -13107 -8146 -3176 -2043 -2863 -4033 -10268 -9939 -6111
189 -6111 -6949 -12641 -15239 -15123 -12696 -10269 -11958 -17394 -14176 -9471 -12692 -9438 -7799 -12331 -13095 -8249
173 -8249 -3932 -5519 -8447 -10266 -14115 -20962 -22783 -16171 -8861 -9230 -8966 -1244 -275 -9608 -12512 -14167
157 -14167 -12768 -14378 -15220 -12474 -11269 -10118 -10645 -12355 -13810 -10551 -8885 -14484 -12474 -11076 -12556
142 -12556 -13704 -15308 -15963 -11645 -11842 -11769 -10610 -7501 -11593 -15620 -16777 -16058 -18373 -17794 -15561 -16947
126 -16947 -20058 -18034 -15702 -18833 -25257 -26382 -20775 -21535 -20349 -15841 -11462 -9243 -6811 -4163 -4235 -4177
110 -4177 -9629 -10515 -10918 -12076 -9479 -10420 -15238 -9246 -4047 -6575 -9114 -13198 -14765 -11209 -5970 -8891
94 -8891 -13848 -12132 -13012 -10622 -11409 -9885 -11646 -14430 -17836 -17113 -11571 -6609 -4899 -4771 -9265 -9005 -9934
77 -9934 -14848 -18109 -17007 -18367 -18096 -18257 -15229 -14712 -17506 -18869 -16137 -17167 -20732 -19865 -17263 -15392
61 -15392 -16556 -13704 -11130 -11616 -7974 -10248 -12745 -13651 -12221 -9631 -9234 -9816 -14508 -14675 -15202 -10392 -8443
44 -8443 -13433 -17208 -19507 -17987 -14372 -14101 -16118 -13613 -8596 -7320 -12982 -15256 -21102 -22272 -17855 -14935
28 -14935 -10858 -11483 -13934 -11707 -7860 -5578 -1981 -3806 -7994 -8570 -779 -1535 -1140 -5863 -7851 -11917
12 -11917 -15190 -14607 -15105 -11999 -9403 -7255 -2506 -7420 -9688 -10274 -12035 -15299
0 -15299
$$ Imaginary data points
##PAGE= N=2
##DATA TABLE= (X++(I..I)), XYDATA
32767 89989 90268 90994 90055 88954 89531 87423 88527 88970 93938 92854 90741 94636 98585 104291 104161 102061
32751 102061 104396 110033 109062 110485 110209 107040 102604 108056 111140 112992 117454 119019 119428 124279 126371
32736 126371 123784 121944 117387 118211 123146 126132 126570 123881 126587 127395 127069 125721 128751 129788 134582
32721 134582 141011 141881 143098 143521 147693 146184 144646 136878 136604 136212 137090 139173 142455 147011 149123
32706 149123 145884 147010 148037 147639 150579 154306 155475 151464 154508 155340 159350 160852 162311 165409 165453
32691 165453 163025 168715 168838 167304 165780 165754 169414 173861 175621 178131 178918 177470 176444 178594 178248
32676 178248 181588 180483 182858 183468 184686 185922 189077 190151 194154 199815 199300 201282 203212 201251 198991
32661 198991 197378 201266 200140 201547 204970 206082 207719 208701 212600 209402 205347 205102 202335 201509 204360
32646 204360 206002 212871 219898 223854 220325 218754 218805 216745 215583 219549 221119 220110 219250 223389 225552
32631 225552 227845 226667 230401 232041 231367 229331 232464 234328 233981 242677 242920 241610 239418 238650 240130
32616 240130 244295 251062 257272 256900 249697 250692 249338 250787 252702 252419 247743 250721 248951 246440 245212
32601 245212 244061 246810 249069 251435 253633 252634 256696 263265 263035 263943 269352 271684 272988 273529 275035
32586 275035 273587 272307 270282 264066 262832 272452 273962 273831 272366 269818 268998 268496 269446 272781 273421
32571 273421 276183 278988 277424 276107 279608 281002 279249 276144 280585 284306 282562 281849 282816 283277 287072
32556 287072 292610 292626 291119 293671 296307 298837 300133 300242 296508 297582 297405 303822 308550 302945 300540
32541 300540 304591 304675 304957 310970 312769 312130 311817 310483 315356 314647 312532 308813 307156 305131 304044 307558
32525 307558 312917 316856 318425 319613 317578 313902 313445 316741 317122 325335 330299 328392 326504 327095 327315
32510 327315 330625 333006 332054 326578 329514 334158 337495 341589 338866 335137 333798 333008 340222 341441 342078
32495 342078 346726 349077 353548 347909 338253 341938 344823 341845 339834 343493 351158 354307 350418 349545
32481 349545 351605 351006 347883 346328 348808 349315 350855 353224 355688 353874 345727 349167 352064 353411 351303
32466 351303 350185 348198 350557 351958 360848 362059 357866 354096 353467 358617 367159 372841 371311 367217
32452 367217 363311 357665 355571 359676 361598 360928 356443 354312 364929 364475 361588 366668 371548 366662
32438 366662 365957 366255 362594 359818 365497 367157 371107 378139 382797 380183 380319 378973 378906 377718 374774
32423 374774 372768 371977 372877 376983 379063 376306 379577 377976 378687 387189 393847 392724 389270 386854 384064
32408 384064 385183 387899 389448 391592 389490 383261 378831 380351 379568 379712 378714 382201 382190 384394 386256
32393 386256 383966 385745 387856 391206 391585 389976 393614 389582 383494 382544 380615 390227 397102 399493 395195
32378 395195 392355 393676 394076 390040 394940 400694 401835 405745 406040 396216 395779 396122 393038 395009 401992
32363 401992 406050 405133 402674 394684 401026 400858 395081 395952 401798 406034 405660 404547 403326 404273 402024
32348 402024 404404 404391 401814 402147 404125 405089 405876 410401 415270 416810 417578 416001 415413 414255 414685 412510
32332 412510 408578 403250 405353 411285 408895 408020 404966 404383 406044 408879 407860 403368 405073 402969 406782
32317 406782 413627 413715 414975 418230 416303 413251 416654 416456 408833 407192 414031 415188 418136 423594 422183
32302 422183 416860 413426 415547 415781 415218 419027 419455 420693 420047 409785 412177 419048 418178 419136 423019
32287 423019 423333 425003 428073 424646 428486 432568 432567 424093 422823 428668 425668 423292 423715 427461 428112 419953
32271 419953 418308 424319 427411 427389 431869 429125 427002 422035 422881 420809 415952 417484 417906 421827 427232
32256 427232 435049 438021 439964 431161 430928 433313 434734 437813 440602 437364 426040 417407 420838 418088
32242 418088 417705 418471 422324 433668 436953 443008 442013 435723 426280 423740 423229 426920 431087 430179 428409
32227 428409 429614 429627 427653 428196 433319 435874 432567 432984 436535 437579 438177 436904 432482 427889 428958
32212 428958 430989 429309 430865 435802 439597 435598 431343 433933 436424 440273 440149 438475 435883 434672
32198 434672 429976 429339 424079 423927 429697 436157 442077 436540 434184 435119 431846 432871 443669 452535 449652
32183 449652 443462 434785 439944 443610 441492 440593 436268 430124 425635 430050 433443 433229 436197 438832 439841
32168 439841 444790 442395 435476 433369 439924 436199 426557 427964 433763 433769 434934 438414 437022 429230 438107
32153 438107 443690 438205 433452 441428 448409 446233 446760 450973 449557 444563 439655 442040 440976 444253
32139 444253 447536 444179 443506 442623 438792 438012 439335 433403 437850 453049 453543 443009 438351 435966 439366
32124 439366 444036 447238 443656 437559 433920 435422 439998 448970 453793 446019 447987 453401 455379 456293
32110 456293 450103 446806 444029 444996 451311 450472 449154 449601 443751 444294 437118 436767 435682 432559 436659
32095 436659 436722 438726 442889 446410 443320 436843 438378 440828 437831 438881 439376 438242 435449 435323 436577
32080 436577 438018 438840 436641 436027 431602 430476 434872 432500 428246 430859 443634 444340 448781 447814 444990
32065 444990 440355 438985 432840 439751 441684 443927 443389 437846 434323 441064 441059 439858 438502 442071 440190
32050 440190 438133 433972 435209 440193 439861 438275 435030 436904 437643 442551 441988 448289 444627 443028 441362
32035 441362 442447 441273 438907 445413 445918 441237 434963 432771 441185 442293 445477 456282 459421 457202
32021 457202 454829 453954 450805 444012 442794 446602 443694 445394 445873 446810 444650 447239 449110 446351 445502
32006 445502 440996 435434 431604 427749 428113 432975 435574 441098 447408 452809 456034 455128 448826 442669 444841
31991 444841 441901 440497 432831 432338 436263 443337 449398 447656 442473 438081 450952 453698 448166 444644
31977 444644 444538 440434 446328 447127 438821 432673 431166 439113 443379 441271 438158 440393 439757 440543 440969
31962 440969 441619 438109 438711 443157 443847 441569 445790 451437 450812 444982 447161 442913 435548 435290 440609
31947 440609 444399 440461 440900 439758 439787 443646 448655 450908 447849 447223 446206 443514 443998 448266 450055
31932 450055 449992 446386 450327 454651 454514 449451 445213 445588 442850 443060 445375 444080 440574 438408 446151
31917 446151 458688 454537 450320 447953 447320 441989 438774 445851 446720 440959 437630 437776 435328 437535 446134
31902 446134 448388 443730 439120 441890 442785 441828 444715 444521 440969 443606 449772 447025 446263 446852 447539 451576
31886 451576 453680 452094 452745 459586 467363 465857 460079 453400 452449 452327 450420 444079 443599 443466 439784
31871 439784 443932 450457 444170 446330 451536 448073 450852 455057 454615 442714 437070 440079 451524 450869
31857 450869 446104 448673 451277 451964 451157 442119 440996 443207 445529 444668 448826 448218 445757 444944 449170
31842 449170 458584 460386 460421 461053 463130 455100 448913 448155 441845 437868 440244 439779 440950 449033 452548
31827 452548 456157 450706 444064 446419 446322 439288 436918 434222 434982 443683 446113 445954 445308 444561 443611 442159
31811 442159 444643 446698 453410 449057 447828 451496 449689 453148 450462 447416 450214 452173 455954 453223
31797 453223 451106 455191 454147 450607 451225 457028 452421 454392 455485 451006 451910 452017 456839 453887 443514
31782 443514 443693 451634 452780 451591 444303 445253 452669 456240 455513 452176 446948 446655 452643 450571 442750
31767 442750 441509 450677 450795 454376 453581 448190 442774 450860 454434 455415 454910 448024 447817 447704 452119 453858
31751 453858 449276 454214 461918 466959 465760 458639 459424 456953 456166 459559 463438 456054 447410 452169 454231
31736 454231 457368 456206 453114 453009 456097 461285 458608 456006 456083 449010 447908 443644 444025 449779 453027
31721 453027 451410 444301 442281 444749 450210 448071 446270 446582 453377 452270 459971 463452 459612 457705
31707 457705 459701 454160 453344 455235 455972 454279 455282 453437 453266 454736 453234 454225 457082 455289 449284
31692 449284 448900 448176 445524 447011 450595 456343 458551 456003 455670 444854 444558 446573 451119 452415 453061
31677 453061 455784 460372 455186 453090 453244 458848 461258 455466 453747 446720 440584 447637 455017 455502 453228
31662 453228 451916 443319 451924 452054 444479 440672 440579 446979 456525 459967 456893 451665 446244 450329 452532
31647 452532 450147 450374 455487 451657 463270 466787 464088 457604 450899 452582 450106 449072 452700 456745
31633 456745 451793 449163 445142 439325 442977 446798 447837 448109 451108 451527 450720 448265 452646 453109 455762
31618 455762 462169 455751 449962 455142 447562 445580 452721 451380 444858 449496 456908 457625 458365 456805 451755
31603 451755 454469 453797 457716 463383 460386 461508 466886 463132 456351 452076 462707 458595 445749 443580
31589 443580 442955 445025 449313 447951 449316 451681 455819 460287 462986 462210 464676 459274 451479 446485 444502
31574 444502 448207 454542 458312 464940 463321 450537 444371 445946 448867 450051 453191 455612 454191 451388
31560 451388 450247 446468 451223 456489 459763 463816 462206 457916 462887 463309 465542 463068 451761 446264
31546 446264 443374 450687 457103 461007 463714 460015 454379 454500 449180 454487 455629 457083 464552 459366
31532 459366 456933 464344 466702 470063 471573 464880 455740 452715 453666 462060 462557 460973 457083 460309 468676
$$ [...]
##END NTUPLES=NMR SPECTRUM
##END=
