##TITLE=Analysis number 313128
Compound Code cc 45651
Book Reference 440/48
Project Code adrs
Chemist Name craigr
##JCAMPDX= 6.0         $$ Bruker NMR JCAMP-DX V2.0
##DATA TYPE= NMR SPECTRUM
##DATA CLASS= NTUPLES
##ORIGIN= Bruker BioSpin GmbH
##OWNER= NMR
$$ XWIN-NMR		Version 3.5
$$ Thu Aug 25 10:23:29 2005 GMT Daylight Time (UT+1h)  MAYBRIDGE\NMR@NMR_250MHZ
##.OBSERVE FREQUENCY= 250.131544655141
##.OBSERVE NUCLEUS= ^1H
##.ACQUISITION MODE= SIMULTANEOUS (DQD)
##.ACQUISITION SCHEME= undefined
##.AVERAGES= 16
##.DIGITISER RES= 18
##SPECTROMETER/DATA SYSTEM= dpx250
##.PULSE SEQUENCE= zg30
##.SOLVENT NAME= DMSO
##.SHIFT REFERENCE= (INTERNAL, DMSO, 0, 16.522)
##AUDIT TRAIL= $$ (NUMBER, WHEN, WHO, WHERE, WHAT)
$$ ##TITLE= Audit trail, XWIN-NMR		Version 3.5
$$ ##JCAMPDX= 5.01
$$ ##ORIGIN= Bruker BioSpin GmbH
$$ ##OWNER= NMR
$$ C:\u/data/dgb/nmr/ADRS/8610/pdata/1/auditp.txt
$$ ##AUDIT TRAIL=  $$ (NUMBER, WHEN, WHO, WHERE, WHAT)
(   1,<2005-08-25 10:23:09.33 +100>,<MAYBRIDGE\NMR>,<NMR_250MHZ>,
      <created by zg, POWCHK disabled, PULCHK disabled
       configuration hash MD5:
       62 19 C7 07 E1 42 D1 B7 37 6C 3D D0 77 39 F9 E6
       data hash MD5: 64K
       9F 76 04 2F 0F 64 0A 7B 72 E8 4F C9 4F C5 10 9E>)
(   2,<2005-08-25 10:23:21.41 +100>,<MAYBRIDGE\NMR>,<NMR_250MHZ>,
      <Start of raw data processing
       ef LB = 0.3 FT_mod = 6 PKNL = 1 SI = 32K 
       data hash MD5: 32K
       F6 DC 6C 55 2B 61 67 63 7F A4 55 29 29 B1 41 4A>)
(   3,<2005-08-25 10:23:23.02 +100>,<MAYBRIDGE\NMR>,<NMR_250MHZ>,
      <apk 
       data hash MD5: 32K
       17 B4 78 43 8A 9A D5 38 24 2B 5F DA CB 9B 71 A2>)
(   4,<2005-08-25 10:23:23.74 +100>,<MAYBRIDGE\NMR>,<NMR_250MHZ>,
      <abs ABSG = 5 
       data hash MD5: 32K
       73 C3 D3 EC 31 0D 7E 84 EE 8D 22 7A D6 B8 68 A8>)
$$ ##END=
$$ 
$$ hash MD5
$$ 1F 5D 1B 83 2A 7B 97 05 4F AE 46 C9 E7 F8 78 1D
##$RELAX= 
##$RELAX= 
##$RELAX= 
##$RELAX= 
##$RELAX= 
##$RELAX= 
##$RELAX= 
$$ Bruker specific parameters
$$ --------------------------
##$DU= <C:\u>
##$EXPNO= 8610
##$NAME= <ADRS>
##$PROCNO= 1
##$TYPE= <nmr>
##$USER= <dgb>
##$AMP= (0..31)
100 100 100 100 100 100 100 100 100 100 100 100 100 100 100 100 100 100 
100 100 100 100 100 100 100 100 100 100 100 100 100 100 
##$AQSEQ= 0
##$AQ_mod= 3
##$AUNM= <au_zg>
##$AUTOPOS= <8 >
##$BF1= 250.13
##$BF2= 250.13
##$BF3= 250.13
##$BF4= 250.13
##$BF5= 500.13
##$BF6= 500.13
##$BF7= 500.13
##$BF8= 500.13
##$BYTORDA= 1
##$CFDGTYP= 0
##$CFRGTYP= 5
##$CHEMSTR= <none>
##$CNST= (0..31)
1 1 145 1 1 1 1 1 1 1 1 1 1 1 1 1 1 1 1 1 1 1 1 1 1 1 1 1 1 1 1 1 
##$CPDPRG= <>
##$CPDPRG1= <>
##$CPDPRG2= <>
##$CPDPRG3= <>
##$CPDPRG4= <mlev>
##$CPDPRG5= <mlev>
##$CPDPRG6= <mlev>
##$CPDPRG7= <mlev>
##$CPDPRG8= <mlev>
##$CPDPRGB= <>
##$CPDPRGT= <>
##$D= (0..31)
0 1 0 0 0 0 0 0 0 0.06 0 0 0 0 0 0 0.0002 0 0 0 0 0 0 0 0 0 0 0 0 0 0 
0 
##$DATE= 1124961788
##$DBL= (0..7)
120 120 120 120 120 120 120 120 
##$DBP= (0..7)
150 150 150 150 150 150 150 150 
##$DBP07= 0
##$DBPNAM0= <>
##$DBPNAM1= <>
$$ [...]
##$SUBNAM7= <"">
##$SUBNAM8= <"">
##$SUBNAM9= <"">
##$SW= 20.6930455092707
##$SWIBOX= (0..15)
0 0 3 0 0 0 0 0 0 0 0 0 0 0 0 0 
##$SW_h= 5175.983436853
##$TD= 65536
##$TD0= 1
##$TE= 294.16
##$TE2= 300
##$TE3= 300
##$TEG= 300
##$TL= (0..7)
0 120 120 120 120 120 120 120 
##$TP= (0..7)
150 150 150 150 150 150 150 150 
##$TP07= 0
##$TPNAME0= <>
##$TPNAME1= <>
##$TPNAME2= <>
##$TPNAME3= <>
##$TPNAME4= <>
##$TPNAME5= <>
##$TPNAME6= <>
##$TPNAME7= <>
##$TPOAL= (0..7)
0.5 0.5 0.5 0.5 0.5 0.5 0.5 0.5 
##$TPOFFS= (0..7)
0 0 0 0 0 0 0 0 
##$TUNHIN= 0
##$TUNHOUT= 0
##$TUNXOUT= 0
##$USERA1= <user>
##$USERA2= <user>
##$USERA3= <user>
##$USERA4= <user>
##$USERA5= <user>
##$V9= 5
##$VALIST= <valist>
##$VCLIST= <CCCCCCCCCCCCCCC>
##$VD= 0
##$VDLIST= <DDDDDDDDDDDDDDD>
##$VPLIST= <PPPPPPPPPPPPPPP>
##$VTLIST= <TTTTTTTTTTTTTTT>
##$WBST= 1024
##$WBSW= 4
##$XGAIN= (0..3)
0 0 0 0 
##$XL= 0
##$YL= 0
##$YMAX_a= 294128
##$YMIN_a= -375688
##$ZGOPTNS= <>
##$ZL1= 120
##$ZL2= 120
##$ZL3= 120
##$ZL4= 120
##$ABSF1= 16.522
##$ABSF2= -4.171173
##$ABSG= 5
##$ABSL= 3
##$ALPHA= 0
##$AQORDER= 0
##$ASSFAC= 0
##$ASSFACI= 0
##$ASSFACX= 0
##$ASSWID= 0
##$AUNMP= <proc_1d>
##$AZFE= 0.1
##$AZFW= 0.1
##$BCFW= 0
##$BC_mod= 0
##$BYTORDP= 0
##$COROFFS= 0
##$CY= 12.5
##$DATMOD= 1
##$DC= 0
##$DFILT= <>
##$DTYPP= 0
##$F1P= 14.0000005364418
##$F2P= -0.99999901652339
##$FCOR= 0.5
##$FTSIZE= 32768
##$FT_mod= 6
##$GAMMA= 0
##$GB= 0
##$INTBC= 1
##$INTSCL= 1
##$ISEN= 128
##$LB= 0.3
##$LEV0= 0
##$LPBIN= 0
##$MAXI= 10000
##$MC2= 0
##$MEAN= 0
##$ME_mod= 0
##$MI= 0
##$NCOEF= 0
##$NC_proc= -6
##$NLEV= 6
##$NOISF1= 0
##$NOISF2= 0
##$NSP= 0
##$NTH_PI= 0
##$NZP= 0
##$OFFSET= 16.522
##$PC= 1
##$PHC0= -89.21971
##$PHC1= 16.05611
##$PH_mod= 1
##$PKNL= yes
##$PPARMOD= 0
##$PSCAL= 4
##$PSIGN= 0
##$REVERSE= no
##$SF= 250.13
##$SI= 32768
##$SIGF1= 0
##$SIGF2= 0
##$SINO= 400
##$SIOLD= 32768
##$SREGLST= <1H.DMSO>
##$SSB= 0
##$STSI= 32768
##$STSR= 0
##$SW_p= 5175.98343685301
##$SYMM= 0
##$S_DEV= 0
##$TDeff= 65536
##$TDoff= 0
##$TI= <Analysis number 999999
Compound Code 99
Book Reference 9
Project Code 9>
##$TILT= no
##$TM1= 0
##$TM2= 0
##$TOPLEV= 0
##$USERP1= <user>
##$USERP2= <user>
##$USERP3= <user>
##$USERP4= <user>
##$USERP5= <user>
##$WDW= 1
##$XDIM= 32768
##$YMAX_p= 361688233
##$YMIN_p= -1104758
$$ End of Bruker specific parameters
$$ ---------------------------------
##NTUPLES= NMR SPECTRUM
##VAR_NAME=  FREQUENCY,     SPECTRUM/REAL,   SPECTRUM/IMAG
##SYMBOL=    X,             R,               I
##VAR_TYPE=  INDEPENDENT,   DEPENDENT,       DEPENDENT
##VAR_FORM=  AFFN,          ASDF,            ASDF
##VAR_DIM=   32768,         32768,           32768
##UNITS=     HZ,            ARBITRARY UNITS, ARBITRARY UNITS
##FACTOR=    0.157963299565203, 1,           1
##FIRST=     4132.6476996994, 0,             0
##LAST=      -1043.33573715361, 0,           0
##MIN=       -1043.33573715361, -1104758,    0
##MAX=       4132.6476996994, 361688233,     0
$$ Real data points
##PAGE= N=1
##DATA TABLE= (X++(R..R)), XYDATA
$$ [...]
19164 2574397 2399658 2586595 2735481 2821411 2735910 2724250 2650612 2421385 2395959 2419380
19154 2419380 2576134 2540199 2566199 2506951 2320063 2390764 2488734 2384534 2254523 2306813
19144 2306813 2454194 2203519 1953456 1790126 1682201 1768467 1701411 1956077 2218111 2150525
19134 2150525 1949169 1827070 1815193 1842737 1967877 1934064 1895589 1946119 1838598 1940188
19124 1940188 2053446 2040852 2307804 2283923 2025779 1874355 1847844 1882891 1968508 1970691 2083681
19113 2083681 2276721 2348683 2093068 1973941 1835773 1865481 1835333 1645811 1839973 1991481
19103 1991481 2160204 2229686 2161325 2025266 2158833 2094818 1952821 1955814 1994562 2068772 2108444
19092 2108444 2152036 2371300 2211631 2188864 2128722 2206589 2519510 2366997 2238246 2242065
19082 2242065 2142279 2066733 2432807 2602742 2607266 2624922 2609850 2736087 2878518 2913478 3029948
19071 3029948 2926671 2938690 2701153 2705710 2984164 2960192 3129344 3080347 3100546 2977970
19061 2977970 3061511 2956758 2808019 2805473 3190409 3194499 2918244 2886861 2982726 3038900 3068306
19050 3068306 3193226 3270247 3283790 3466458 3497530 3624837 3812797 3706046 4117013 4126295
19040 4126295 3932181 3894940 3949931 3997526 4072564 4115789 4271583 4235790 4345531 4472076
19030 4472076 4596368 4793481 4815288 4915653 4928218 4890294 4689737 4607636 4852575 5080950
19020 5080950 5175669 5265315 5553253 5665025 5725309 5804582 5898434 6124417 6146170 6426613
19010 6426613 6661540 6983716 7213207 7368585 7412777 7472256 7657165 8034390 8634698 9032803
19000 9032803 9448711 9737862 10174154 10551902 10628443 11007230 11329964 11696068 12299247 12758642
18990 12758642 13352349 13772771 14131224 14742598 15330349 16124633 17029397 17830858 18646426
18981 18646426 19601528 20664053 21623260 22690506 24059369 25381343 26644260 28044018
18973 28044018 29445113 31266930 33140821 35066014 37012186 39230512 41686896 44258389
18965 44258389 46917632 49831274 52779435 56040116 59402569 63189239 67143248 70894140
18957 70894140 74920437 79087355 83428645 88023323 92658676 97097537 101144136 105064178
18949 105064178 108552256 111692465 114306521 116387655 117867392 118524605 118627694 118162516
18941 118162516 116869944 115322865 113442578 110937664 108003443 104856532 101912952 98573159
18933 98573159 95355314 92386334 89210398 86151136 83101335 80401971 77884905 75612757
18925 75612757 73580732 71906240 70260535 68671227 67229708 66242705 65490509 64872724
18917 64872724 64531097 64438132 64640820 65174419 65943011 67086421 68469920 69934658 71555539
18908 71555539 73276664 75291008 77523873 79763518 82047767 84469110 86762011 88838547
18900 88838547 90756951 92375673 94173830 95703310 96757203 97526636 97648585 97390840
18892 97390840 96557457 95048067 93050859 90610816 87967429 85204110 82038629 78505455
18884 78505455 75076424 71802173 68128144 64662504 61811580 58880096 55803563 52894512
18876 52894512 50062182 47374190 44701361 42429983 40471448 38197474 36067885 34221149
18868 34221149 32471927 31052208 29683382 28358205 27052285 25771960 24502718 23428982
18860 23428982 22593548 21600639 20587859 19822503 18978172 18397064 18013347 17233030 16374239
18851 16374239 15810407 15551017 14932027 14305687 13839777 13390409 13044529 12640150 12331514
18842 12331514 11852547 11598773 11088894 10863734 10459686 10139884 9752611 9789801 9408923
18833 9408923 8979523 8905598 8654649 8422315 8356827 8407711 8221062 7765478 7494539 7344383
18823 7344383 7257716 7309569 7181272 7171954 6961615 6645172 6569953 6366130 6261792 6350370
18813 6350370 6347080 6167302 5839599 5575176 5388883 5143614 5186658 5366464 5437011 5322046
18803 5322046 5116372 4960877 4665352 4431726 4273641 4448681 4500951 4227457 4020221 3902213
18793 3902213 3697089 3871291 3845900 3892037 3717186 3517262 3602396 3754879 4011202 4081362
18783 4081362 4082758 3890489 3850240 4088254 4100370 3977643 4233654 4267706 4281695 4306002 4237492
18772 4237492 4112702 3805473 3587896 3490188 3641951 3872340 4068855 3732045 3752876 3721957
18762 3721957 3458543 3389715 3528565 3607248 3652373 3546330 3321404 2754495 2531312 2800165
18752 2800165 2863701 2931864 3059933 3131348 3005611 2957166 2737729 2555066 2473803 2322559
18742 2322559 2394031 2407558 2200173 2052791 2179322 2351646 2404410 2364093 2469690 2277112
18732 2277112 2212420 2348436 2298737 1985174 1928109 2006143 2238344 2497859 2212234 2062163
18722 2062163 1990218 1966653 1980928 2205568 2537165 2652015 2427643 2417842 2349395 2363328 2444578
18711 2444578 2255356 1958516 1782583 1668041 2008959 2494133 2286462 2041808 1839122
18702 1839122 1795142 1585803 1841767 1784713 1562734 1409118 1427213 1398370 1205891 1291897
18692 1291897 1271895 1286856 1354943 1522254 1552647 1511440 1255596 1014475 1141211 1147539 1222189
18681 1222189 1209437 1121196 1251866 1458424 1503591 1724794 1397781 1157840 1294493 1404027
18671 1404027 1219046 1138509 1380498 1394851 1383051 1196651 1008501 1092162 1150725 1272851
18661 1272851 1182326 970273 840056 885313 962738 1012056 1105294 1183135 1089423 840737 854861
18650 854861 981512 979350 970683 979128 1110000 952456 650790 548268 831313 785216 666412
18639 666412 517124 551053 924318 1284328 974361 613491 560783 484986 756062 1003546
18629 1003546 1137063 1049385 814032 1000551 1132216 1167332 1133218 1005302 930029 792524
18619 792524 828323 915328 1218484 1336910 1349907 1175714 1317049 1208380 903939 816797
18609 816797 751962 754396 925854 1122226 1250049 1372829 1206021 1168493 942610 639281
18599 639281 748537 684167 681546 593900 546637 609376 561212 522859 689213 607614 577458
18588 577458 638061 864120 945466 638825 616349 921753 1011272 1004110 851688 681752 712348
18577 712348 690355 501751 325182 374887 360271 264941 182722 214892 442133 392555 395405
18566 395405 326107 445269 388949 269068 197479 -5764 192434 490276 383012 364805
18556 364805 652782 932383 957044 936987 1077308 809873 769589 895531 835541 750363
18546 750363 462468 604661 839974 865314 506067 507318 421196 193949 373308 583433
18536 583433 892868 845079 785218 900206 885293 810347 851324 408523 344731 484580 656752
18525 656752 719815 778854 870934 931837 890865 745453 873998 1042082 1046376 1031545 1030930
18514 1030930 923029 794110 454537 467828 464855 416528 473259 585312 718362 635231
18504 635231 608292 525787 446677 497865 530567 729655 729764 560373 584674 743087 635165
18493 635165 613434 649501 705373 788163 705913 599055 464404 608965 510816 541289 414933
18482 414933 205838 191749 376487 473656 564203 472429 267434 263186 554065 712778 718713
18471 718713 698236 405395 290266 569714 572614 760951 658021 666833 687141 671102 720842
18460 720842 660357 845850 1119773 1054498 810813 435813 315657 569478 590904 564189
18450 564189 459033 435504 565061 750866 968384 887895 889466 889016 690270 640981 696017
18439 696017 726636 876388 958379 1047240 1099132 776256 641754 567901 515655 703113 821133
18428 821133 751702 886274 876015 919216 841861 729135 1066874 1186910 1011150 929844
18418 929844 1091457 922784 1069743 1107218 1013476 1090203 1103411 1061589 1035569 981297 819675
18407 819675 742671 742765 732845 609774 753916 1128615 1174953 932867 553440 506775 808659
18396 808659 1075323 1082573 1196524 1379740 1415735 1211735 1015152 1022944 990207 964124 797380
18385 797380 711144 813002 917084 1103117 1116388 856244 765650 639789 608310 739276
18375 739276 771352 702420 693413 598513 625635 876002 926158 833382 647743 509740 412950
18364 412950 583818 658719 457114 321867 414431 341100 492188 683082 834788 613276
18354 613276 792014 663158 479713 756922 882763 597978 485261 427474 332500 449954
18344 449954 498436 329455 255387 54356 95794 177728 255566 383494 516858 415687
18334 415687 250479 59157 281896 339045 370108 589744 763773 700304 525581 541964
18324 541964 612331 679831 820821 796222 746495 690638 561902 161639 -40397 -43389 156466
18313 156466 404955 371211 184031 285196 458672 500023 261818 259491 467378 484479
18303 484479 693425 708976 468652 272006 147697 130643 41225 123779 152108 249974 517102
18292 517102 389401 344734 154582 152496 343696 310268 85458 -145773 -237969 -237478 -179823
18281 -179823 -26878 -46878 80766 149152 285543 525306 589023 570906 502145 132587
18271 132587 -18512 41093 191521 322258 317063 38126 25820 104820 63205 146073 250239
18260 250239 186143 -27632 104179 259015 315284 236049 534531 692173 491408 667990
18250 667990 779194 478161 238333 224230 563824 530001 270856 279358 509145 202192
18240 202192 -146988 -293546 -74511 349659 315911 314886 334709 206246 -38940 -179182
18230 -179182 -260623 -108783 -10192 -71000 -74561 -23342 73562 345457 515332 386692 274439
18219 274439 221809 376522 479257 340524 359827 457952 544377 386777 89000 29888
18209 29888 -43566 -67998 -26262 23823 76047 121042 160629 219482 351900 487626 481392
18198 481392 455982 533455 335448 90900 -51286 -50303 46008 -96907 -137896 -72883 -51457
18187 -51457 148495 182312 167607 202840 168083 288865 256151 298477 103293 212149 468985
18176 468985 430028 207277 367273 414363 355689 259084 201384 334319 437803 680525
18166 680525 644679 514959 428790 311438 175625 76871 43491 27779 -16222 70665 64608
18155 64608 -88270 -70432 -15788 -102404 64233 129135 27386 -7509 -133518 -26708 251729
18144 251729 261383 184438 52449 -1798 56728 154296 201465 198187 214351 57822 -27086
18133 -27086 -78313 47744 -89 40846 190668 77329 -51241 -143864 -211660 -340230 -359569
18122 -359569 -139968 -217002 -353093 -363868 -413574 -463970 -448805 -202535 12292 251909
18112 251909 449644 453354 474830 561782 419414 133614 -64393 52913 -30300 -115504 38210
18101 38210 119751 121417 137930 46221 124492 174777 -34491 -33924 159533 286279 262956 170311
18089 170311 357521 251241 -102364 -249048 64049 132902 199985 -122046 -332618 -362817
18079 -362817 -460272 -123164 102270 92831 331025 281224 191123 390309 418292 176308 154570
18068 154570 181998 199716 -51460 -174941 52611 225135 -67957 -24317 190081 154235
18058 154235 29347 27212 53372 313410 379036 310894 384128 307820 337890 207312 27971
18047 27971 -63952 -55147 73291 -59088 114208 295204 356295 329965 95766 49395 92753
18036 92753 -223 -187771 -140211 25168 105196 320678 106684 -17145 61351 226449
18026 226449 161897 72805 -8957 180490 230816 103130 -12917 58067 326898 513138
18016 513138 437593 275031 9218 -121987 -120432 4619 -31205 16061 89422 31821 132062
18005 132062 92439 222650 317673 345505 256898 273269 134341 273400 185251 19008 21338
17994 21338 -380202 -367091 53171 387748 603809 608679 199743 230911 382377 146406
17984 146406 -11821 75360 -115375 -140329 -28630 110451 309110 332845 191161 365145
17974 365145 263361 175956 120770 130013 -72206 -282364 -529308 -561246 -298968 -211480 -57637
17963 -57637 241816 111406 -50659 -33391 -53068 -110665 -439927 -453622 -59816 337181
17953 337181 515411 562549 622407 498944 390958 469566 353689 169875 -68500 -97892
17943 -97892 -48738 -192964 -52286 103711 40601 99599 153669 87483 27884 -6823 -34135
17932 -34135 45914 6187 268899 448333 499500 513684 527250 450967 66908 59390 401038
17921 401038 348802 293798 238492 302938 362785 266142 103050 -13498 -11527 -108933 -55645
17910 -55645 82288 36208 48711 37249 62650 47942 -214147 -405513 -530358 -431619 -294734
17899 -294734 -48122 16015 -117277 -105454 168259 300504 359578 210715 434884 471309
17889 471309 406127 486824 292147 -38687 -329828 -318633 -179231 -69821 -36650 -74656
17879 -74656 -27685 43838 123510 272383 385821 70490 -295732 -411660 -221477 -202354
17869 -202354 -4825 194654 319642 407616 383944 338282 209347 172803 39972 -106951
17859 -106951 -221692 -49864 71196 28672 -56785 -153682 -232177 -237528 -134413 147082 302709
17848 302709 94440 -79321 155715 49771 -15078 -116811 -157413 -144665 65956 262461
17838 262461 277179 361443 375469 319916 325915 158214 279029 197511 261189 294500 176601
17827 176601 57963 -49817 -189564 -145920 -136502 -365143 -191625 230798 395531 511610
17817 511610 539484 221231 119577 -164648 -520805 -680898 -212215 -78933 -132396 -336469
17807 -336469 -364094 -81707 136454 -181899 -505893 -463136 -325173 -291247 -181502 9144
17797 9144 195438 88741 237333 155138 -189811 -167308 -194602 -69477 145553 221450 155883
17786 155883 113445 270724 221138 177443 117490 39916 37166 68544 -71507 -202776 -334704
17775 -334704 -286845 -287314 -188803 263640 123947 124598 366129 171330 -125787 -179964 -8672
17764 -8672 61176 -102673 -323150 -64483 100202 175628 271414 38443 -138607 -70833 159760
17753 159760 190407 143551 144055 2213 -94955 -205410 -174586 137959 75049 126436 52560
17742 52560 203726 319636 225231 19114 140467 295798 278108 52203 -114533 -356086
17732 -356086 -260469 -342139 -302891 -388203 -289233 -159218 -152354 -97931 68046 133546 159054
17721 159054 261512 35813 43476 402421 463249 269011 31981 -244328 -268710 -406303
17711 -406303 -405908 -270648 -31328 107381 223629 185914 131668 -61408 -143270 -91689 42784
17700 42784 -44197 -98151 -15512 -29397 -206977 -134511 32936 111424 111244 11417 77440 244468
17688 244468 373552 370503 132695 373947 717201 638843 405911 17166 109727 250965
17678 250965 226154 308926 439819 371622 310024 235006 113881 97902 229308 9686 5015
17667 5015 14563 123216 335004 149826 25657 -71225 -283559 -184935 -8857 -183888 -481023
17656 -481023 -501661 -215387 37370 180958 438566 531330 482094 502307 384820 142863
17646 142863 234090 133589 215746 307010 179921 127375 350289 243044 -6129 -220457
17636 -220457 -184595 -70258 67407 3566 -245461 -130467 10980 16093 -24476 -91374 -85625
17625 -85625 -79081 92686 71435 53389 -123992 116331 149534 57218 -11929 247553 284952
17614 284952 275986 21817 -162600 42844 150510 97530 190664 176202 356220 204791
17604 204791 58274 -11293 -203799 -123290 -26592 129282 97214 94007 184482 131092 -37484
17593 -37484 -359864 -331170 -175550 -17878 -7764 47556 74546 -56480 -110385 82559 208930
17582 208930 134146 -19612 139446 128811 19888 -219526 -218660 -13610 6034 208326 327269
17571 327269 166763 311780 271861 -123545 -212596 19186 273865 193049 395446 615228
17561 615228 484224 338510 345953 389248 516523 373982 86799 -57291 -4449 -43104
17551 -43104 10691 71566 -122028 -112989 -132378 -232853 -112486 28733 89656 38039 -3597
17540 -3597 116316 130703 166680 255905 48857 -279513 -459520 -337348 -167165 -85472 77268
17529 77268 173406 37119 -17274 51777 -103073 53385 10889 133659 108252 -36117 -42186
17518 -42186 -64133 -9130 -73663 -139046 -100030 -34082 103692 105595 103221 313525 415152
17507 415152 338010 -24288 -201120 -246889 -72782 -35881 199304 329454 259350 276951
17497 276951 -59659 -192054 -172657 -129263 -326741 -681491 -491065 -346017 -507202 -265253
17487 -265253 -61597 -57982 61613 45984 -25931 -27959 29090 239272 461160 260273 -61647
17476 -61647 212235 282904 482372 414942 306119 210142 143417 145856 -147868 -268897 -244879
17465 -244879 -488485 -461508 -255460 -365313 -330529 94991 190928 -153673 -504207 -388862
17455 -388862 -323826 -235991 -75595 -89405 -255528 -162938 -71497 -171748 31652 208231
17445 208231 -65305 -288999 -352496 -60552 274825 225685 112210 98183 23165 226520
17435 226520 186840 175490 -64281 -124095 -103912 -139043 -198244 -66730 -20472 -255624 -343761
17424 -343761 -279849 -288731 -147492 -17763 30239 281197 313024 333435 194715 44452 -116634
17413 -116634 -76996 -153984 -46462 181605 31764 -10352 320204 430626 357242 272160
17403 272160 486218 508799 335386 -56635 -295961 -254612 -141777 -4809 -65428 -60081
17393 -60081 75174 -38419 -245521 -328978 -74629 93719 168029 325229 492924 311977
17383 311977 90323 -101097 -110913 -42379 69632 233448 153551 148747 203607 288421 241881
17372 241881 170812 298916 168283 -63569 26413 27141 -145743 -280768 -481103 -660295
17362 -660295 -620824 -548792 -412353 -80559 -98943 -14812 -130652 -220830 -79706 185514
17352 185514 142558 -50988 -180596 -164148 -71861 -315781 -194433 -147998 -357678 -308720
17342 -308720 -140747 143435 78235 65219 2909 56279 -276715 -233546 -160647 46371 -12959
17331 -12959 -188720 -126541 -235608 -267826 -89101 -110199 -130943 132987 319571 231696 174337
17320 174337 -130364 -306162 -238008 -50282 159226 261563 -145 -152122 -84630 -35803
17310 -35803 108974 260503 106014 47584 -108009 -217339 -278458 -193229 102073 132821
17300 132821 -58560 -126854 -197936 -82214 -50413 -241050 -158994 105367 237918 185446
17290 185446 284836 215715 -481 -233118 -153286 147926 191753 126477 211377 218374 198266
17279 198266 246228 90542 -18117 -285668 -380437 -192709 251338 479632 25417 -206293
17269 -206293 -225860 -212616 -84810 -169019 -286549 -287327 -37112 183865 145356 60302 212010
17258 212010 109751 156003 -57803 -3845 -147791 -421726 -612298 -289137 -165774 26250
17248 26250 164346 213918 355695 158176 -164612 -267021 -279883 -107642 56650 146919
17238 146919 136219 192653 315829 152054 107073 261369 221427 342676 253324 79926
17228 79926 214695 226398 195471 312274 241539 29369 36169 184445 171120 241085 328478
17217 328478 120981 -81776 -61595 48595 80833 152376 137058 -22105 132409 -59471
17207 -59471 -305236 -251143 -187095 -204685 -125449 -71639 -22985 -216368 -202620 -51135 -126483
17196 -126483 13431 180941 85617 43474 150217 257154 -64021 -278522 -329392 -218152
17186 -218152 33663 39942 -58842 -25944 270409 250920 73631 223085 311835 -1862 -81284
17175 -81284 -304844 -269865 -210465 -145069 -64189 -76982 -204071 -101914 222258 341598 132561
17164 132561 -18172 69983 -54623 -117475 -133504 18302 -29057 81675 356040 35984
17154 35984 -309775 -294350 -175152 -165294 -169108 -331767 -261260 98007 212320 129345 -16473
17143 -16473 -31937 -144704 -91058 -103612 -16922 153532 116768 7303 -186471 -529105 -447646
17132 -447646 -331125 -253013 -131456 -40971 -248088 -372636 -151715 34265 -169569 -169041
17122 -169041 -104343 -354798 -399460 -329092 -147053 -100839 -184490 -205285 -50572 305927 452016
17111 452016 334405 344669 323939 212496 288767 315018 -47030 -290707 -564427 -335379
17101 -335379 -226399 -44088 28412 -31833 -358742 -159832 -59313 -34053 -5331 -89935
17091 -89935 113668 84113 26228 166744 307531 236236 246921 222135 -59013 -79992 -24738
17080 -24738 -33285 -173969 -412724 -432362 -151815 7949 137403 38242 33942 185498 225447
17069 225447 229563 29808 -52335 -29002 -202373 -344153 -366361 12521 59294 -109374 -23622
17058 -23622 -43979 -121546 -234493 -153269 4391 -120062 -197493 110326 117428 72285 -220456
17047 -220456 -392903 -205637 -94451 -264149 -473045 -634005 -491662 -513684 -559777 -494410
17037 -494410 -696430 -886135 -809003 -766922 -430867 -377399 -412357 -314928 -206964 -84453
17027 -84453 -5481 18604 107160 57060 187904 291321 184509 192528 206132 226078 148737
17016 148737 -20290 -226240 -340771 -363583 -337650 -60362 -466012 -550151 -343916 -275838
17006 -275838 -386031 -377680 -404013 -599054 -244102 -64505 -141811 -208957 -290651 -210645 -103890
16995 -103890 -32697 -208182 -309793 -147369 -33367 6932 76651 69781 -170661 -234375 -197346
16984 -197346 -205772 -255892 -151504 58228 20228 -155772 -49173 -96866 -204926 -95401
16974 -95401 -58605 150746 -434 -476071 -395800 -111212 -21852 192193 190547 68949 97241
16963 97241 270198 75052 -351354 -463058 -441404 -485636 -445799 -184253 104103 297141
16953 297141 313306 301573 145438 -4150 150674 84656 88274 8314 -273237 -192290 -174424
16942 -174424 -153687 13163 -100955 -125294 -66466 -190 273693 227026 -18586 -250794
16932 -250794 -587142 -746960 -489206 -74086 115909 54101 -94303 -323536 -432026 -259207
16922 -259207 95438 201895 138108 -122664 -203219 -182130 -360800 -401378 -281274 -256917
16912 -256917 -131926 179213 9037 -163552 -121545 -136430 -115020 99643 82382 -80522
16902 -80522 11363 123 -66917 -179019 -274266 -142575 128936 247343 32130 29355 86749
16891 86749 -119990 -347420 -312645 -182142 -102698 152077 172797 93566 39047 -15236 -42791
16880 -42791 54877 -104099 -93413 114843 -17349 -266589 -231474 -298864 -422159 -317585
16870 -317585 -356953 -312154 -252268 -72781 29491 -224061 -244285 -384184 -646958 -622741
16860 -622741 -459263 -503728 -586092 -418803 -264432 -250549 -384504 -454470 -467441 -411145 -309616
16849 -309616 -308597 -333033 -244303 -181426 -154420 -74804 36826 -37247 -77906 -106645 -257102
16838 -257102 -140674 -271956 -388634 -183094 -205130 -199211 -52463 -105637 5169 2862 -58653
16827 -58653 -75987 -181497 85086 119957 -107425 54786 123728 -246856 -413065 -403311 -349841
16816 -349841 -462512 -280777 93486 42750 -183176 -292378 -247570 -18620 -29900 -72335
16806 -72335 -171741 -214028 -155493 31148 120084 125369 38365 -64238 174974 413897 310224
16795 310224 148594 -33772 -97893 315278 475344 435947 175968 58885 235786 263507
16785 263507 115611 -136372 -393854 -317390 -148351 -183886 87613 351110 231628 -20950
16775 -20950 -203080 -283413 -226396 -206585 -378974 -331994 -184972 66230 160677 266165 165069
16764 165069 80195 -82826 -254801 -490380 -494833 -343665 -331829 -300178 -167581 -98456 -179121
16753 -179121 -449109 -388728 14793 116215 -31749 35384 167769 167195 -175102 -386374
16743 -386374 -185982 111572 98298 55207 122118 -143765 -247306 -140993 -123669 -213479
16733 -213479 -210276 -187313 -255918 -335448 -25702 -64612 137517 126171 117706 200209 149240
16722 149240 128136 122211 21183 102676 96908 -84922 -298167 -243786 -80048 172307 200972
16711 200972 -17210 173432 330042 307568 209135 222777 81204 -53263 -122978 -200986
16701 -200986 -43661 -95080 -127155 48384 59507 98793 -90814 -210905 -206119 -150750 -275555
16690 -275555 -363876 -222811 -56662 120531 202550 74928 -129073 -194508 -301441 -404938
16680 -404938 -587617 -400165 -391233 -364936 -163670 118527 -6606 196741 338926 211155
16670 211155 351613 306181 5083 -277394 -309545 -360538 -249436 -93036 -170100 -110200
16660 -110200 148855 155688 -126083 -89874 81673 76291 -196581 -69157 -167283 -280817 -293483
16649 -293483 -319741 -219034 -273079 -103107 30835 -232824 -278928 -138358 -305444 -447319
16639 -447319 -312489 -51049 -34670 -290970 -236882 -65739 17486 -89972 -315629 -165488
16629 -165488 -142857 -208182 -81169 114470 83752 185925 191955 128349 -43569 197145 201651
16618 201651 163668 227209 74772 -139744 -218755 -375771 -337438 -229712 -188056 -87267
16608 -87267 125432 147906 203305 164082 86237 173212 28925 -260674 -399820 -480363 -512333
16597 -512333 -386223 -75002 49082 72199 274728 168226 72375 76721 -22215 -6383 11114
16586 11114 -2496 -59428 44383 13012 -78767 -358803 -565950 -723915 -502965 -334869
16576 -334869 -197561 -68937 -92890 -47381 -26990 3387 190010 13827 -322460 -246480
16566 -246480 -204961 -259714 -266218 -155972 -279209 -645766 -785485 -611615 -189157 -44544
16556 -44544 -86567 -281989 -312076 27198 162741 107875 -53077 -59261 188063 174529 296706
16545 296706 532833 397440 192306 316554 218533 76450 116490 -240878 -366514 -137065
16535 -137065 -7660 29187 325749 270337 229371 101575 -132228 -114591 117124 118879 271312
16524 271312 226436 52304 -304129 -384208 -471489 -172938 -144295 -341813 -291800 -78894
16514 -78894 41261 -103218 -241780 -296062 -411532 -296884 -90457 -208393 -160126 -286844
16504 -286844 -63414 -106788 -176872 -46480 18822 23846 32804 -190463 -339896 -198410 -264568
16493 -264568 -192064 -378255 -290123 -167172 -167178 -308588 -263360 -100336 -148536 -144692 -64370 -134933
16481 -134933 210450 375452 419554 469303 197466 82229 -47996 -148675 -191075 16662
16471 16662 141269 28624 97645 280254 216112 -123392 -384726 -370955 -437607 -377840 -429029
16460 -429029 -418353 -285817 15866 -55329 14973 146598 247048 347525 59198 77743
16450 77743 117097 -14454 141575 289126 221380 97568 275916 526282 263703 -174525
16440 -174525 -202966 -137199 -49871 -69198 -361770 -575188 -344912 -247330 -346816 -404838 -340063
16429 -340063 -381114 -543431 -356239 -38280 20759 -7561 -229648 -281936 -309834 -117686
16419 -117686 75075 -11756 -50717 -284387 -406507 -324343 -212714 -91618 -86841 -74068 115779
16408 115779 -117511 -419329 -115742 -39652 -76107 -191586 -302492 -236739 12755 100074
16398 100074 -43578 9100 -35668 -138006 -198747 1603 30133 143793 -100055 -189191
16388 -189191 -7569 139912 -3414 64514 267408 260743 129004 74788 51851 89889 -716
16377 -716 -9023 -12951 11218 394430 692556 735248 725116 562973 449377 137380 65598
16366 65598 4467 48579 178973 3130 -156084 -151041 -144353 101277 -20170 -45645 107042
16355 107042 340692 318649 122154 176768 131362 -76535 87960 339500 279151 149679
16345 149679 119093 360402 291122 139865 238807 62331 -23046 -3954 261139 304947 194013
16334 194013 125089 140351 -55506 30651 137029 -70272 -147206 -288530 -245421 -154864 186704
16323 186704 340725 268641 -6986 -73721 4023 11108 232250 281062 -37205 -365462 -355924
16312 -355924 -137782 -69414 -294794 -310156 -161056 -172730 -165290 254267 216220 107546 223521
16301 223521 133341 -136753 -48548 -7011 -10374 226030 193790 -245111 -420475 -112925 -14174
16290 -14174 -6498 -53987 98507 118256 -24503 66756 -45247 -98479 -255609 -127812 -190585
16279 -190585 -259812 -51689 -37612 -68061 -35266 -3526 111036 306133 267313 169931 300346
16268 300346 288110 320585 173757 -99320 -229113 -202055 -236034 -233256 -126370 -132083 -310685
16257 -310685 -223823 77442 146559 -146202 -111349 -148006 -123127 21976 -2397 -33847 -194357
16246 -194357 -234083 -144870 -192250 45350 144922 232834 131115 68421 88400 73983 -115098
16235 -115098 -77939 5373 86650 15135 -19795 15467 -198634 -151461 -252983 -151494 -48851
16224 -48851 -51500 -205516 -311376 -445990 -363279 -59782 -13306 -29038 66224 101113 59947
16213 59947 186281 274082 103114 278808 612703 605565 382233 80404 -48253 144530
16203 144530 330198 176364 97266 -96310 18938 110113 253586 208741 -77516 -181782
16193 -181782 -90295 25999 -121726 -320680 -182424 -47400 180987 67410 -228871 -283573
16183 -283573 -251928 -150236 -2262 -38901 -46739 125477 12117 150494 227301 123671
16173 123671 142084 224462 122403 185497 207510 76486 -197027 -214449 15697 -20922 -101125
16162 -101125 -156772 -286877 -245243 -202487 -137693 -121882 14753 160559 79728 15660 54875
16151 54875 -111225 -136204 -107970 -17985 -75125 -136620 -88679 23541 -128413 -238459 -64715
16140 -64715 2829 -113823 -292596 -290410 -469173 -248610 -193646 53920 39458 24968 -15226
16129 -15226 -103437 -135997 17009 248294 328892 237947 119868 -110504 -178894 -61162 74189
16118 74189 86247 16437 -242692 -551938 -434938 -250190 -140685 -191733 -150199 129009
16108 129009 340357 127488 -5338 89979 289172 -47403 -172298 -155065 -91116 76547
16098 76547 103766 96611 247066 199658 -82459 -351381 -148861 1955 60715 146690 244208
16087 244208 -53786 -103587 -70245 -257711 -147001 17914 -26654 71219 122470 86789 281115
16076 281115 342380 147946 -54630 -185026 -199774 -252209 -183349 148775 171520 -89472
16066 -89472 -136412 -130391 -74784 180143 18110 -122088 -158423 -254785 -200262 81709 335397
16055 335397 313392 181177 55093 -87928 51046 109310 -26736 18315 -112099 -102858
16045 -102858 18544 3658 -161278 -136521 73737 136185 210818 -41386 -159969 -91902
16035 -91902 156233 204004 232350 -87591 -225226 -102522 -250420 -219060 -157837 -61955 49272
16024 49272 186390 33415 -249381 -293366 -471706 -380085 -194723 -12195 255851 83402
16014 83402 75371 282786 238844 -14872 3838 -80992 -53770 28201 108969 47665 7411
16003 7411 -35330 -113502 -266663 -163150 130744 46938 -53278 -57715 -52481 59335 157416
15992 157416 176898 276111 555274 640166 309849 134161 238122 126818 -102849 -189983
15982 -189983 -129339 -119671 -13707 33397 -43662 -167512 -51963 70228 -136324 21290
15972 21290 186030 282169 237929 1736 12248 -37968 9144 53717 2114 -60503 -230683
15961 -230683 -270761 -29942 -76763 -121603 -197748 -173310 -210236 -329791 -322314 -197667 -115910
15950 -115910 -11817 221363 21254 -210302 -475057 -390903 -199142 -199503 -154077 -81458 32473
15939 32473 -189475 -581514 -566589 -450378 -212072 -18817 -30054 -97326 -104751 -232918 -338785
15928 -338785 -210787 -4199 -31219 -237958 -70284 -126291 -364744 -464748 -354698 -316428
15918 -316428 -254035 91499 332304 277081 19811 -74802 123920 18277 -203430 -468689
15908 -468689 -367288 -84738 134399 37132 63528 185081 105230 -40616 -145953 -393729
15898 -393729 -131073 37672 -63482 -346803 -538006 -396378 -228449 -66901 241538 64479
15888 64479 -380687 -361135 -305809 -318147 -312934 -272640 -253126 -341812 -286772 -216907 -152618 -271260
15876 -271260 -160955 -167514 -312339 -281982 -268194 -385445 -223732 -112668 -371422 -363726 -265757
15865 -265757 -185754 52298 164150 239191 430945 592202 154424 -292917 -409485 1668
15855 1668 251966 270999 269782 -29066 -252351 -284780 -139698 164721 224975 45497 -189690
15844 -189690 -467534 -456126 -300213 -396638 -307535 -286205 -56429 30324 161947 228608 85447
15833 85447 -84870 -64140 110749 215258 60081 152134 26 -162190 -198852 -155352
15823 -155352 -179911 178510 234332 152258 -35440 -69638 79588 -60099 196513 296255
15813 296255 42418 40244 -27347 -30427 67642 141569 1 -306481 -396693 -287008 -129106
15802 -129106 29846 -98880 -108394 -182224 -12996 77095 169940 179554 161597 328543 366309
15791 366309 320266 328293 197852 206892 222349 53989 57998 -209 25709 123643 163268 34263
15779 34263 301579 338941 27776 -122730 -210068 -168190 40566 -219077 -410809 -217001
15769 -217001 40720 85361 95120 -10330 23779 -247634 -450616 -309443 99038 384008
15759 384008 78231 4798 54300 -188529 -280031 -257872 -234978 -217312 -140654 -420359 -450161
15748 -450161 -475838 -97016 75758 -60255 -246741 29570 314301 184289 -132637 -177982
15738 -177982 -42975 16830 -35738 -55009 -212195 -306859 28441 100629 65469 97050 91942
15727 91942 70498 63356 78487 169152 90897 183286 131800 -189049 76988 394714 499435
15716 499435 333746 51101 -249216 -377803 -541781 -303429 -143234 -262452 -376126 -136519
15706 -136519 177170 266507 73563 -31349 -156417 -414960 -497374 -241321 -27459 -23938
15696 -23938 292457 368990 -36779 -19408 161546 149292 -171062 -140883 -55601 -142719 114072
15685 114072 433890 308172 26223 -92635 -147016 -286733 -254340 -93976 78784 41285
15675 41285 70968 -120124 -276600 -242605 -294568 -238186 -157909 -15525 -64335 -174719 -82850
15664 -82850 197029 388495 406201 191406 75061 -91208 -191572 -328048 -556466 -536858
15654 -536858 -634881 -495455 -111980 -169733 -247469 -145242 -188452 -309635 -83277 21063
15644 21063 -105773 77022 -98915 -247133 -194964 -22321 -19958 -233711 -227143 -274584 -294798
15633 -294798 -149824 -399188 -632490 -526948 -184956 -55788 105568 117104 -216956 -370049
15623 -370049 -205497 -50860 111309 163886 26957 210126 127347 -27637 303974 433530
15613 433530 109898 -102076 56327 368456 239115 19522 -31993 -33100 -203441 -173953
15603 -173953 -26556 -271168 -555690 -334418 -264177 -29264 168991 343627 334970 110330
15593 110330 -15292 69482 41913 -49682 -236722 -3480 -54159 -25165 157428 75308 129312
15582 129312 50346 116440 77340 -85139 -31514 178855 365437 294649 243804 145776 -31087
15571 -31087 -185385 -380564 -385149 -321382 -169296 115311 37501 -92911 -48838 74590 160124
15560 160124 65617 -52202 8183 17127 -170219 -182246 -233111 -497302 -319596 9030 119818
15549 119818 237691 425568 426851 367351 302437 233840 491885 278913 -161634 -351453
15539 -351453 -432742 -221675 -28035 -21665 -11389 135738 111934 21037 50365 139598 8204
15528 8204 50166 71876 -13835 -105841 29459 70196 333724 179451 48176 19207 217578
15517 217578 219891 127383 121726 65012 -128182 -225067 183030 288107 -12330 -88875 -101576
15506 -101576 -131710 -218624 78803 297692 315466 99135 165059 371581 433478 506642 463828
15495 463828 363745 25046 -316744 -315354 -190037 69563 298463 395179 245921 -113244
15485 -113244 -172406 121188 335959 337167 289967 110083 -173033 -291952 -54852 -202838
15475 -202838 -313495 -165272 -189879 -153755 -263955 -207580 -9848 15189 -7590 -85398 -396203
15464 -396203 -284453 75440 165146 153066 138043 -15943 15925 33483 14912 -86086 129058
15453 129058 375765 381914 259470 301302 156964 192688 138998 -48184 -126577 -162824 -289426
15442 -289426 -69148 -67841 -43731 30446 259420 197519 126237 -245575 -91502 155211 120295
15431 120295 46704 73541 -147447 -258181 -274093 -52339 -49668 -152855 -327939 -332523 -244908
15420 -244908 -282446 -246143 -221952 -255954 -540267 -563027 -535124 -463322 -414290 -314047 -412106
15409 -412106 -329496 -67891 -66785 192187 49887 -199349 -101067 115533 195099 544460
15399 544460 490150 371369 116594 108308 195736 269716 186060 130968 -340 156664 418858
15388 418858 411770 282700 376279 361765 226815 235585 269855 169782 109315 69393 340613
15377 340613 494597 435542 324113 272827 34460 47392 94335 139634 -111747 -420485
15367 -420485 -485917 -249540 -120380 84544 14802 124702 -48725 -181978 -253918 -57271
15357 -57271 -45791 -161420 -335089 -200462 -17342 163730 -86392 -195207 -128723 -171289
15347 -171289 -203506 -248 24785 -149167 -220984 68357 280163 215034 169129 107967 47763
15336 47763 115676 118494 17111 -132793 3466 249804 360105 141845 122719 -36958
15326 -36958 -236762 50453 409723 428860 276374 142974 105559 184931 69130 -60608
15316 -60608 -143558 -120944 -137357 -125244 -133153 -93556 -3180 141939 419577 516431 375508
15305 375508 180597 53209 51110 21955 -123392 -162438 -40416 -156211 -335225 -263648
15295 -263648 -174431 -234590 -204559 14685 345522 541456 463505 346793 166392 130261
15285 130261 -82639 88507 148206 22305 -69635 -121656 66811 89932 -17006 -205956
15275 -205956 -249883 -112167 161166 278981 203296 40306 163608 307105 496592 537723
15265 537723 135715 -132705 -121254 -113036 -2613 -67809 -127683 -47223 28982 10151 128798
15254 128798 290890 292058 288843 330260 450165 358083 423827 439608 225287 -96041 -52117
15243 -52117 168690 376149 439388 297897 254147 166715 179647 164821 51375 -284317 -129785
15232 -129785 -14766 2079 -186317 -257022 -187626 -30683 138948 212054 26404 -156107
15222 -156107 81985 223463 -19717 221334 291604 135019 -33403 -60286 221155 124529
15212 124529 100474 118010 247793 347322 459508 406179 380467 316079 293489 201282 126433
15201 126433 107828 75051 261232 293003 214835 201741 265639 268792 271695 102786 -179626
15190 -179626 -8158 227238 178502 130865 128033 278067 132850 30134 101235 86836 253023
15179 253023 165223 122683 121841 124556 19857 118902 13484 -126194 -129692 41322 287866
15168 287866 330481 240666 441189 509147 188250 10297 -225661 -533989 -282648 156491
15158 156491 370681 163554 -23315 -61697 -162344 -149283 -44475 233899 280088 449633
15148 449633 577860 266909 63769 348982 525927 380276 432882 413961 288559 291828
15138 291828 341159 251374 345956 289070 -7780 -119735 -103524 -309757 -87477 50700
15128 50700 352793 464223 435142 466887 320712 92439 148151 170790 158540 203498 166398
15117 166398 235952 283994 121838 18558 49885 7431 -45975 -153067 -12331 61624 286733
15106 286733 315597 160838 361295 445092 297833 -142113 -440957 -372222 -315757 -123696
15096 -123696 -57714 -212554 -303128 -309185 -481861 -437941 -370482 -320187 -221225 -107661 -78567
15085 -78567 -12710 149505 259893 139429 -22802 -130412 -130320 -173884 -169794 206430 250589
15074 250589 -101772 -115363 -310111 -362334 -147815 -96473 -90440 -88091 15987 -236206 -428235
15063 -428235 -249491 -132342 -119591 145852 235397 424289 99137 6966 162996 380616
15053 380616 552620 338962 201582 434192 421389 318483 17201 -127608 -270677 -275526
15043 -275526 -199064 -47702 189222 110474 154783 42789 24275 299846 217256 250546 432674
15032 432674 406077 295978 349095 239112 128430 325482 396393 408594 320978 93874
15022 93874 -32877 -201489 -119046 -40484 -89733 -269918 -14587 -11510 -169118 -182277 -18948
15011 -18948 210266 305816 282366 297878 196880 165529 274765 301332 250025 171846 71088
15000 71088 191742 191878 11282 -118272 -138933 64536 -36127 -234510 -231168 -176776 -213230
14989 -213230 -116835 -84497 104850 -19267 -59216 -25598 175961 25409 101454 -38804
14979 -38804 -4372 102914 216107 205048 124244 -49015 -130312 -117051 138481 203132 109936
14968 109936 205110 264663 354940 566696 516187 416343 165874 -54950 56775 266463
14958 266463 160140 283491 245054 264573 -80223 -75141 82777 167891 107559 224930 359347
14947 359347 372738 181178 170932 200708 126170 89789 -54629 23765 148894 136335 36142
14936 36142 -112946 229305 368708 371024 231083 299195 339681 344023 391957 522844 401433
14925 401433 623418 854572 843452 490660 346579 107822 183082 315411 402761 201041
14915 201041 52669 200402 210438 94199 22732 194312 172036 162523 149726 65504 -56915
14904 -56915 312666 610371 562573 385283 162429 77817 24215 136515 218764 165997 185936
14893 185936 98688 62437 68984 153935 137490 169234 245117 222084 137233 267028 189949
14882 189949 122330 241816 258107 427269 441928 357053 176727 85874 1062 -136 405997
14871 405997 488789 479596 561414 354658 176704 206065 258568 366205 504298 217806 269203
14860 269203 407751 242154 191699 329028 435769 495882 622316 660326 401571 419434
14850 419434 494576 505868 195191 -143257 39251 427747 439437 313386 253288 54166
14840 54166 -166296 5985 171019 224763 102765 163671 370252 285752 128876 61396
14830 61396 157133 289728 223027 237620 314019 130059 333855 656467 682274 590647 496719
14819 496719 343768 445194 440358 254906 152438 -10978 -105769 157764 39364 84811
14809 84811 319292 281139 256170 233735 196861 440008 566856 529064 436843 279208 450940
14798 450940 638339 569619 456510 425061 373007 480611 601789 250791 210654 382513
14788 382513 343349 365138 493539 533954 429581 215379 327337 322895 290734 153982 51627
14777 51627 152379 118372 39920 274888 203921 166701 168267 500053 622571 520015 433404
14766 433404 304249 606500 637129 426928 388196 459541 452980 574497 315077 219431 317114
14755 317114 306749 68111 -15444 39984 46493 77330 177313 203548 48167 205676 265780
14744 265780 117071 242521 376446 325811 212128 381610 375166 529384 587617 579936 512590
14733 512590 337371 178390 168587 235387 283494 231523 542884 710014 485066 408655 420213
14722 420213 519963 557094 373720 386067 584509 421041 261831 355834 522151 512368 351894
14711 351894 366674 360030 390907 258859 237305 384867 552418 383873 241674 502529
14701 502529 515385 499512 493398 312239 337226 398742 217996 149822 136015 153059 384178
14690 384178 359800 363385 383703 495334 589494 526920 432672 667019 492201 426574 509177
14679 509177 526617 558270 456533 377708 226747 391081 471837 563134 622747 753821 615859
14668 615859 546751 583718 587846 712838 595870 420463 207398 321767 450859 364696
14658 364696 325676 367647 678348 676433 636186 719818 638710 692014 623518 389776 254660
14647 254660 118846 263931 492392 666142 679512 383530 286661 298671 498198 729419
14637 729419 802360 945597 897078 706363 446740 315084 360678 207060 179790 286002
14627 286002 351775 324149 387507 474854 455264 178650 103535 417461 773640 820700 716062
14616 716062 698434 423116 362376 505350 501398 419490 495170 662702 772035 677333 407534
14605 407534 333476 341610 403823 707017 911886 611963 497124 628938 532490 459312 406310
14594 406310 659769 754757 532986 478448 498884 451638 309442 493207 628717 642588
14584 642588 542007 394594 377421 480492 502389 437979 458791 582886 750126 792715
14574 792715 647236 618934 792182 765727 380330 374347 419755 575783 615383 452898 534397
14563 534397 443185 426362 517222 764369 933445 811678 651595 796418 952625 679011
14553 679011 499896 422792 469565 538512 485510 361471 563243 350421 348353 500209 376173
14542 376173 286712 55437 -57182 8628 269344 505298 488164 527280 386901 389618 591881
14531 591881 708781 771075 785142 858819 673362 451282 458905 607186 391624 423536 462525
14520 462525 506131 635806 569712 435102 717322 936723 1003176 1037167 824015 426713
14510 426713 251302 257076 368919 392658 661022 861486 701734 656887 723763 696830 662119
14499 662119 565631 542410 437298 465940 679768 766868 705434 498196 515897 624505 837657
14488 837657 906073 902625 849743 683327 629185 824170 947752 756835 621629 595779 775117
14477 775117 828487 778107 879280 694733 619271 684623 904741 840735 670840 654718 501604
14466 501604 544319 626402 623163 474238 355465 560341 636534 467556 475011 451161 695929
14455 695929 985141 837231 669913 774829 808656 866134 987852 854074 890005 935485
14445 935485 815951 666910 738649 1028222 899492 558966 531787 581687 476368 488090
14435 488090 394348 549033 600973 533377 420098 407851 789392 954852 734105 603934
14425 603934 686220 966293 1111430 1228151 1082573 1027388 934986 737110 748013 853193
14415 853193 697423 733068 457008 248452 483055 752674 942781 956821 905466 925629
14405 925629 747029 773283 675236 580882 428180 493397 380485 407421 474031 559569 376221
14394 376221 400766 401040 354190 338268 459151 830698 1054029 1038177 1013011 1031845 1109843
14383 1109843 1207722 1205075 1093745 1195294 1222932 1296656 1302679 1235572 1214313 1272496 976769
14372 976769 716470 829308 928333 769089 752604 757159 756900 829153 683606 658167 782512
14361 782512 902683 827428 679960 800328 957957 1005073 926062 1051320 1011559 883007
14351 883007 665517 616821 497088 352868 542808 707013 922466 1027454 1042676 865422
14341 865422 1090516 1397876 1302227 1016694 866710 710340 552124 520511 483872 626980
14331 626980 821672 738245 881671 1186011 1318391 1340966 1125471 776720 920759 850660
14321 850660 850675 928269 997916 1226009 1015731 1175526 1330764 1511249 1429928 1254360 1283290
14310 1283290 1093391 1061733 1118334 929574 937702 1117269 1049703 934544 853180 904570 901321
14299 901321 1019192 1034215 996945 1014841 1059399 1031430 862831 948160 1100523 847392 695869
14288 695869 795248 958781 886738 814075 893544 903494 1088928 1174001 1114923 913756 853894
14277 853894 1113752 1518536 1456606 1290050 1246974 1053380 919869 1122620 1133873 994075
14267 994075 1082144 1177064 1201036 1272794 1313900 1228746 1304617 1272742 1273610 1300102 1363023 1301277
14255 1301277 1316029 1386011 1423296 1078172 1027217 1163184 1157818 1101992 1216215 1256191 1205987
14244 1205987 1335640 1215058 1178853 1220314 961919 918630 1032911 1132652 1039274 1203980
14234 1203980 1186144 1196128 1535375 1662116 1859858 1626035 1614015 1541968 1330046 1494024
14224 1494024 1454041 1492873 1478479 1581625 1310813 1495060 1623240 1575117 1652580 1492102
14214 1492102 1479078 1334651 1455554 1579398 1801211 1828208 1781077 1675029 1595996 1704337
14204 1704337 1612423 1572008 1725583 1491778 1575446 1727560 1615068 1214787 1055665 1445310
14194 1445310 1671791 1495330 1269290 1447922 1658357 1880171 1838197 1838884 1752309 1752411 1681787
14183 1681787 1685140 1690033 1903598 2004811 2050232 1995364 1868874 1794128 1802307 1910148 1862320
14172 1862320 1556012 1576123 1930209 2022919 1828315 1733327 1720830 1674198 1995276 2295232
14162 2295232 2423097 2460593 2341170 2121503 1892763 1989366 2069297 2040481 1693031 1524649
14152 1524649 1741598 2113029 2067799 1876827 2027903 2292744 2391879 1987220 1749675 1883528
14142 1883528 2003819 1953226 2052305 2062125 2038205 2227809 2220076 2135260 1987732 2100663 2046786
14131 2046786 1789552 1494307 1505655 1778904 2008744 2085402 2164537 2050341 2029341 2168265
14121 2168265 2411119 2516995 2348213 2051947 1806709 2004738 2077629 2183668 2071188 2070048
14111 2070048 2368940 2408132 2224048 2258894 2101495 2107389 2060548 2151539 2262168 2532666
14101 2532666 2475250 2386565 2317003 2214976 2329361 2278881 2245036 2362388 2383793 2398713 2239509
14090 2239509 2306039 2477542 2384858 2510416 2760864 2635815 2415094 2530308 2508227 2556610
14080 2556610 2393037 2491300 2595415 2821428 2838957 2810778 2704527 2823077 2682748 2674060
14070 2674060 2680508 2565762 2647006 2486838 2548134 2538992 2468161 2431819 2563300 2483781 2597338
14059 2597338 2742590 2766516 2806646 2850163 2883823 2925893 2813274 2771125 2919828 2966900 3174497
14048 3174497 3221505 3228862 3242116 3166430 3120043 2998929 3018279 2947671 2910779 2888368 2839381
14037 2839381 2809927 2950228 3023746 3089185 3096068 3203174 3246250 3285384 3177090 3209304 3081073
14026 3081073 3122429 3116976 3311872 3344882 2969715 2929827 2881922 2843343 2917244 3087272 3286763
14015 3286763 3551199 3420488 3305601 3312174 3357426 3145399 3089770 3073233 3243779 3377078
14005 3377078 3254992 3082132 3184492 3328802 3355965 3124649 3345916 3471508 3482435 3609205
13995 3609205 3559370 3548916 3615759 3666482 3474566 3333788 3492076 3672835 3906642 3921525
13985 3921525 3840614 3667880 3735663 3923531 3711753 3594617 3770663 3868726 3864716 3691662
13975 3691662 3651728 3701784 3789284 4027081 4035628 4042999 4115236 4293352 4477230 4459241 4113649
13964 4113649 4268518 4169638 4238061 4254893 4195391 4187893 4243980 4131657 4063919 3925120 3816430
13953 3816430 3838759 3835183 4132738 4345436 4270585 4105217 4173276 4098749 4128985 4128189 4106241
13942 4106241 3994401 3956696 4018701 4007916 4130255 4148132 4262342 4230840 4172360 4068010
13932 4068010 4255383 4495883 4507099 4443571 4419057 4530988 4561708 4447836 4617848 4570539
13922 4570539 4481865 4424915 4324805 4718390 4876405 4747977 4754357 4761498 4597786 4488774
13912 4488774 4713821 4850475 4678172 4604272 4632051 4600966 4625012 4538725 4638182 4469756
13902 4469756 4565011 4641942 4753760 4866066 4854966 4739028 4820404 4984849 5041950 4895949
13892 4895949 4811761 4953595 5193041 5301095 5315190 5436056 5464297 5270556 5389940 5399374
13882 5399374 5352377 5012645 4988128 5187359 5181895 5053487 5123965 5292785 5142061 5247863
13872 5247863 5266181 5281583 5313463 5447276 5660222 5547501 5436809 5647519 5906816 6000855
13862 6000855 5782973 5339290 5487444 5757953 5724314 5803342 6024040 6050579 5881579 5951625
13852 5951625 6231254 6513456 6489568 6361232 6204209 6052926 5986922 6146941 6160112 6225473
13842 6225473 6369093 6127494 6106692 6154595 6328688 6369714 6293150 6550701 6848544 7020433
13832 7020433 6810568 6707309 6842613 6924575 6945613 6923609 6821845 7067256 7094116 6741154
13822 6741154 6721880 6874037 7037395 7208684 7280905 7145225 6975411 6937629 6897021 6800977
13812 6800977 6992115 7084237 6907982 6983561 7113746 7072646 7196617 7374298 7697094 7884447
13802 7884447 7858742 7869885 7876364 7866671 7980070 7998907 7752757 7753613 7873371 7920149 8057574
13791 8057574 8029521 8001751 8185886 8149868 8056013 7973272 8064087 8146181 8513267 8891195 8988566
13780 8988566 8874174 8680810 8671330 8827802 8864112 8867191 8878392 8900834 8970453 9096145 9094139
13769 9094139 9338825 9502745 9610523 9612272 9696290 9605062 9600586 9642050 9450583 9597728 9732307
13758 9732307 9905905 9838715 9850991 9898793 9849762 9954177 10194665 10264592 10211714 10249854 10465802
13747 10465802 10459166 10414530 10362103 10339475 10342689 10418991 10504698 10724639 10671800 10860757 11010853
13736 11010853 11286252 11383251 11385109 11406305 11588724 11871959 11846866 12005754 12379583 12444658
13726 12444658 12182731 12144006 12177844 12306318 12397119 12544570 12645577 12670687 12855431 12965340
13716 12965340 13096981 13224486 13246702 13395416 13559575 13598368 13650215 13764981 13975012 13950025
13706 13950025 13961104 13953626 14059347 14075153 14204634 14364044 14531177 14680120 14739207 14710046
13696 14710046 14704290 14851277 14970274 15062808 15376258 15640975 15980970 16073653 16241345 16316014
13686 16316014 16376253 16471617 16711590 16870279 16805122 16970585 17037908 17098519 17135978 17485812
13676 17485812 17892649 18106981 18488126 18462648 18657206 18920500 19249589 19380807 19532769
13667 19532769 19473146 19774639 20021900 20040882 20075644 19997466 20016225 20319001 20548475 20792686
13657 20792686 21139762 21311144 21452920 21455339 21584364 21672592 21737242 21988587 22154009 22386061
13647 22386061 22749141 23268474 23408871 23489404 23722970 23917254 24132161 24157932 24339362 24650799
13637 24650799 24846342 25300492 25666925 25915431 26038777 26205910 26279429 26452938 26604837
13628 26604837 27083597 27358868 27587974 27578882 27772298 28086445 28324630 28440912 28791684 28945651
13618 28945651 29200993 29469408 29713383 29723270 29860357 29946460 30023464 30340679 30689531 30886235
13608 30886235 31088260 31198723 31488938 31642500 31683935 31928093 32169541 32497541 32742202
13599 32742202 32884985 33196266 33375131 33425909 33652626 33835415 33848374 33891356 34181628 34175000
13589 34175000 34161338 34454621 34487217 34617071 34742499 34802682 34747491 34860919 35178942 35508735
13579 35508735 35643439 35600651 35442758 35583914 35446168 35334924 35253260 35285907 35513804 35900528
13569 35900528 36143306 36185842 36053990 36009428 36166978 36205849 35888886 35679060 35597202 35724144
13559 35724144 35675776 35850952 35931441 35717889 35517926 35314030 35208799 35025228 34926256 34669334
13549 34669334 34472405 34256712 33957800 33963349 33841905 33770144 33714236 33614113 33506248 33478774
13539 33478774 33140319 32864852 32553293 32443976 32203430 31997141 32041070 31953035 31463928 31266396
13529 31266396 31241805 30976704 30739786 30408334 30246595 30264979 30339197 29908244 29210178 28825270
13519 28825270 28971358 28834290 28482180 28317603 28170057 27897718 27785261 27618750 27241509
13510 27241509 26780831 26331261 26123387 26005415 25784974 25625813 25256931 24999687 24884097
13501 24884097 24928242 24635632 24406224 24209400 23792245 23391159 23274098 23268618 23070121 22562383
13491 22562383 22369052 22356560 22118334 21898591 21600888 21473011 21317516 20841510 20506964
13482 20506964 20355109 20215938 20324910 20250347 19935202 19735884 19753527 19576366 19086664 18909816
13472 18909816 18793294 18769584 18524348 18275276 18467721 18452099 18138932 17795486 17535421 17408981
13462 17408981 17304634 17210209 17008148 16620453 16511624 16406602 16363337 16094879 15864781 15742175
13452 15742175 15541889 15541347 15629224 15533373 15271860 15016752 14790208 15098294 15017959 14968336
13442 14968336 14566536 14376599 14432849 14348783 14171948 13921158 13744331 13691859 13652861 13569786
13432 13569786 13443246 13462410 13420803 13022649 12935472 12984577 13028209 12821849 12671468 12745198
13422 12745198 12634335 12392841 12224599 12187594 12017463 11873652 11806792 11750618 11682809 11377117
13412 11377117 11104222 10918239 10873377 10995512 11033106 10930429 10662283 10514576 10705708 10594849
13402 10594849 10421377 10488948 10362580 10274203 10434475 10521160 10136490 9988628 10152392 10182577
13392 10182577 10101738 9932777 9950429 10055559 9664527 9374203 9466511 9526639 9435355 9147306
13382 9147306 9041326 9151206 9178407 9025088 8926977 9213118 9090869 8821516 8552579 8519749
13372 8519749 8625757 8766067 8655643 8333863 8191984 8269542 8287166 8282127 8287368 8334513 8310844
13361 8310844 8383524 8675146 8621523 8523668 8288940 8233027 8196336 8165911 8161551 8098453 8100667
13350 8100667 8107490 8140191 8308915 8169417 7772217 7689955 7567155 7561193 7437427 7448069 7604918
13339 7604918 7783453 7778863 7566025 7588450 7464148 7311706 7199754 6981589 7119161 7236439
13329 7236439 7160364 7204688 7401402 7469443 7241769 6971173 7026330 7189865 7254698 7138109
13319 7138109 6890038 6867865 6885352 6739584 6422324 6437639 6724015 6780634 6689807 6779980
13309 6779980 6829275 6627152 6529439 6435870 6396347 6591068 6322069 6080710 6022026 5876501
13299 5876501 6030597 6232281 6161734 6163193 5922286 5761407 6092758 6384991 6348646 6018134
13289 6018134 5958407 5838451 5791677 5884917 6099190 6088858 6152749 6140447 6134771 6018877 5834264
13278 5834264 5740312 5811319 5825072 5689444 5769171 6080302 6358720 6219283 6106357 6077798
13268 6077798 6022620 5862570 5687564 5456055 5492759 5595750 5773508 5759933 5649945 5715739
13258 5715739 5456437 5438739 5524505 5577558 5639415 5468902 5366894 5246517 5382399 5316299
13248 5316299 5162008 5023536 5090918 5041923 5229429 5343677 5332987 5456555 5358022 5167910
13238 5167910 5344935 5500346 5257146 5177969 5330397 5272782 5108869 4992454 4928428 5226269
13228 5226269 5352738 5253727 5036202 5036722 5032173 5113874 5004550 4929088 4902952 4917448 5121403
13217 5121403 5213750 5178297 5116039 5025733 4911786 4750373 4778481 4559202 4768713 4979879
13207 4979879 4681887 4582027 4597138 4643454 4838250 4872244 5046156 5015155 5131600 4984463
13197 4984463 4612170 4373366 4365421 4395707 4706958 4903274 4624717 4591362 4542563 4431338
13187 4431338 4179910 4222795 4262297 4194682 4233097 4380393 4426870 4203677 4029084 4115733
13177 4115733 4294865 4369235 4357897 4381803 4431747 4443561 4490269 4601537 4472526 4495137 4632009
13166 4632009 4563842 4610890 4425337 4321156 4277259 4415275 4648305 4660886 4569036 4370518
13156 4370518 4359016 4584716 4637064 4606042 4374435 4350899 4367608 4295069 4236680 4320255 4578476
13145 4578476 4537688 4218812 4261855 4222707 4144601 4147320 4315206 4412044 4319684 4310218 4361630
13134 4361630 4548699 4617419 4550387 4471302 4380202 4593143 4521203 4539969 4341815 4334106 4311436
13123 4311436 4228215 4014858 3761606 3634426 3543909 3823411 3878674 3927245 4162526 4344200
13113 4344200 4295534 4074242 4134663 4251872 4109886 3976958 4125058 4129446 4203859 3939116
13103 3939116 3844555 3792047 3645430 3643834 3886662 3889136 3757779 3752940 3880217 3881557 3948112
13092 3948112 4232215 4392110 4380777 4188592 4018291 3977374 4041002 3950441 3842289 3893669
13082 3893669 3913326 3981843 3874025 3935161 3863902 3890145 3962990 4020241 4018863 3939500 3924018
13071 3924018 3836641 3502903 3440419 3725226 3766031 3973674 4091294 4153967 3946225 3820807
13061 3820807 3725680 3890307 4059787 3924298 3877722 3896006 3884919 3969481 3997838 3955374 3800172
13050 3800172 3776685 3593926 3773736 4063147 4038436 3937030 4079159 4160110 4150600 4250043
13040 4250043 4276687 4165974 4102103 4271381 4202252 4150010 3967546 3622993 3494926 3592217
13030 3592217 3313048 3598489 3734160 3965960 4064233 3886646 3501628 3353461 3357306 3596948
13020 3596948 3735827 3680318 3459711 3380025 3213695 3100266 3339899 3494130 3350984 3146726
13010 3146726 3115094 3012392 3016462 3307887 3503948 3626477 3688728 3398557 3326345 3223287
13000 3223287 3130959 3440126 3633224 3714774 3805688 3763890 3708911 3716209 3619544 3556337 3595245
12989 3595245 3478275 3194177 3116544 3278116 3380009 3445639 3436484 3542162 3581534 3436997
12979 3436997 3440946 3517563 3313805 3001410 3070217 3279059 3231330 3392568 3495040 3555573
12969 3555573 3509366 3266746 3345382 3543277 3400932 3275219 3280984 3199907 3098769 2919778
12959 2919778 2882375 2886225 2978450 3094176 3087276 3081367 3302079 3441459 3311826 3145528 3339916
12948 3339916 3418084 3374732 3254293 3266924 3287367 3368158 3451456 3216081 3113042 3161741 3045925
12937 3045925 2806435 2879985 3033760 3092334 3173951 3254259 3052239 3014804 2955410 3043127 2953996
12926 2953996 2855244 2890228 2803791 3000477 3230489 3275123 3394502 3518805 3586454 3553860
12916 3553860 3406705 3250342 3023498 3205544 3207158 3076105 2917863 2984029 3109038 3021565
12906 3021565 3074120 3032243 3146948 3295253 3466511 3473088 3139794 2946788 3058955 2994305
12896 2994305 2865319 2789099 2881459 3155753 3085138 2964192 2949373 2883454 2898103 3044479
12886 3044479 3212620 2980870 2757540 2648819 2777063 2804393 2678910 2712366 2660957 2635823
12876 2635823 2602641 2747811 2883965 2863467 2636351 2613553 2720456 2734915 2889919 2995004
12866 2995004 2909738 2904597 2881222 2852802 2970208 2976371 2686834 2627173 2647434 2824234 2898960
12855 2898960 3058630 3023551 3308010 3321563 3087520 2899971 2884504 3105148 3210363 3181236
12845 3181236 3067700 3107345 3161016 3386859 3534405 3395929 3140522 3351914 3191999 2886221
12835 2886221 2952722 3120493 3122588 3049092 2966807 2995264 2992036 3088250 3089630 2979633 3156600
12824 3156600 3386858 3252222 3017343 2967679 3042230 3282528 3300344 3234490 3244508 3246074 3333726
12813 3333726 3137973 2737487 2691533 2859525 3159609 2930440 2997177 3145641 2981085 2868418
12803 2868418 2780547 2924694 3013627 2781328 2626711 2610723 2688434 3003757 3279110 3341565
12793 3341565 3273863 3096506 2895879 3053788 3419834 3389476 3117915 2923286 2815775 2699170
12783 2699170 2628734 2814498 3051511 3006222 2951440 3196922 3330061 3075951 3080697 2936092
12773 2936092 2810060 2764846 2808172 2746264 2578689 2697433 2691200 2789021 2895092 2979547 2877771
12762 2877771 2936211 2909859 2831737 2810369 2923494 2847854 2824557 2782665 2760421 2853204 2870518
12751 2870518 2976789 3043881 3061477 3186024 3201963 3040322 2868038 2837459 2942024 2947772
12741 2947772 3129723 3023128 3127939 3168984 3050860 2796673 2716334 2714291 2637670 2765202
12731 2765202 2857761 2775319 2520288 2611661 2904764 3168875 2997713 3036039 3020765 2905134
12721 2905134 2784132 2805391 2846586 2926513 2900322 2894566 2949538 3005404 2882210 3043397 3098489
12710 3098489 2838682 2615159 2514994 2501221 2906013 3067568 3235486 3357386 3369944 3176969
12700 3176969 3160217 3120718 2829419 2483209 2458969 2734343 2817316 2796360 2770654 2726454 2904358
12689 2904358 3067011 2795777 2636178 2456271 2644677 2760359 2959940 3036962 2858809 2719216
12679 2719216 2558280 2800243 2942892 2904510 2757988 2552240 2509543 2668255 2665961 2587644
12669 2587644 2609214 2756257 2839816 2943389 3152903 3061858 2832738 2693642 2869536 3017227
12659 3017227 3213242 3194183 2986238 3077958 3138506 2984220 2729955 2560416 2703095 2488465
12649 2488465 2476633 2615377 2841486 3202090 3281273 3064022 3013706 2833494 2582477 2909556
12639 2909556 3011832 2678716 2676881 2721989 2823626 2834959 2889926 2964325 2756648 2732161 2809928
12628 2809928 3162859 3284003 3064797 3027438 3006870 3266164 3382611 3339703 3238876 3093239
12618 3093239 2972281 3213625 3556717 3631411 3514680 3489058 3210936 2968177 3193594 3382951
12608 3382951 3103922 3051348 3040027 2946470 2961262 3125220 3209465 3151831 2999221 3166762
12598 3166762 3036068 2944944 2924336 2934362 2828180 3033381 3010559 2942232 3259543 3468226
12588 3468226 3497328 3497375 3393451 3398764 3313926 3077524 3170902 3092620 3243700 3437075 3354948
12577 3354948 3330120 3359010 3348380 3460061 3311548 3287600 3310867 3389379 3494073 3466152 3187420
12566 3187420 3201126 3400019 3577707 3831954 3721206 3587284 3548617 3405736 3378244 3255189
12556 3255189 3363211 3302040 3095429 3032953 3160147 3354081 3447881 3676780 3687885 3533618
12546 3533618 3460480 3359402 3652454 3741026 3799051 3734747 3766492 3793112 3743489 3861074 3982303
12535 3982303 4174274 4064944 4051334 4034511 4026650 3922671 4095581 4326131 4241392 4204536
12525 4204536 4378417 4332407 4249958 4198657 4275078 4382426 4532047 4345677 4280926 4114997
12515 4114997 4039359 4024498 3905184 3925273 3998417 4102925 4201681 4321164 4426570 4411010
12505 4411010 4625040 4830003 5037859 5014167 4748157 4598639 4671947 4996141 5118052 5195866
12495 5195866 5186571 5168254 5076817 4923563 4991182 4995737 4979424 5038901 4884877 5041125 5045803
12484 5045803 5018654 5225693 5219772 5397959 5507249 5614565 5649678 5514925 5335785 5459945
12474 5459945 5592271 5634832 5728154 5875031 5956548 5929439 5903434 5973229 6176059 6217720 6241079
12463 6241079 6227017 6205074 6124393 5815725 6118438 6473556 6377674 6210288 6372370 6629209
12453 6629209 6801864 7156888 7389984 7500496 7739175 7887573 7866031 8004175 8094007 8338572
12443 8338572 8340460 8113170 8270143 8247885 8590999 8925171 9097363 9193854 9423031 9401817
12433 9401817 9588755 9857657 9921868 10151860 10354529 10432123 10821295 11144735 11317305 11562694
12423 11562694 11755451 11805225 11962061 12268840 12695518 12949602 13138356 13615138 13898624
12414 13898624 14113994 14393969 15018955 15459316 15629857 15854091 16183247 16769504 17167383
12405 17167383 17605016 18063957 18554147 19070550 19523847 20006935 20327729 20916221 21422677
12396 21422677 21805586 22194967 22906478 23340999 23943217 24659159 25175311 25741775 26495472
12387 26495472 27121978 27636040 28348596 28828506 29482629 30354402 30973255 31375535 32009976
12378 32009976 32890203 33948496 34714236 35345054 35863736 36190862 37047378 37862300 38544109
12369 38544109 39247017 39956582 40658514 41178057 41953692 42842184 43422586 43927962 44137996
12360 44137996 44766116 45330163 45603722 46052415 46610360 47183995 47679934 48178902 48692247
12351 48692247 49110031 49578456 50201041 50724833 50643656 50688304 50940243 51219936 51569915 51899067
12341 51899067 52117823 52087040 52331720 52566521 53028376 53338536 53508767 53636141 53817885
12332 53817885 54399762 54860283 55089024 55556762 56048388 56646499 57205549 57655632 58202833
12323 58202833 58735560 59251840 59835618 60663423 61568334 62264587 63398269 64388809 65331059
12314 65331059 66155221 66984044 67791193 68847136 69804748 70805325 71771336 72902242 74141276
12305 74141276 75393509 76407381 77233241 78324710 79282724 80055941 80817718 81743849 82690478
12296 82690478 83729179 84597532 85377531 86134888 86941139 87946532 88977015 89613486 89993553
12287 89993553 90439949 90651204 90973676 91193325 91496164 91631036 91794664 91827857 91664934
12278 91664934 91385687 90911366 90507849 90105529 89763257 89209397 88313167 87352893 86608061
12269 86608061 85976903 85172975 84233828 83256535 82200255 81203645 80290653 79170059 78193989
12260 78193989 76880581 75621772 74566224 73664384 72584041 71588982 70743386 69759757 68799927
12251 68799927 67933615 66993215 65997662 64987983 64092017 63268133 62501059 61614593 60924446
12242 60924446 60453402 59795453 59268296 58780455 58093574 57610418 57272420 56846374 56721291
12233 56721291 56252256 55799620 55397695 55254096 55084281 54786937 54759455 54585961 54344567
12224 54344567 54258470 53962295 53706843 53834539 53948546 54072108 54149260 54202025 54345264 54569718
12214 54569718 54432910 54504692 54797431 55285753 55446960 55628059 55496826 55454901 55756967 56021730
12204 56021730 56380158 56734395 57102244 57422752 57620726 57879770 58346539 58803793 59076390
12195 59076390 59403196 59729093 60117120 60392404 60919551 61283922 61542876 61995019 62277318
12186 62277318 62580810 63057127 63366411 63552916 63972818 64502224 65059782 65514609 65972059
12177 65972059 66494635 66997614 67541251 68038171 68511965 68774322 69261844 69589306 69691573
12168 69691573 70142031 70624165 71053181 71314947 71428405 71937863 72432304 72837304 73342460
12159 73342460 73808199 74126608 74515605 74896902 75088620 75633745 76200127 76673970 77214789
12150 77214789 78029835 78475437 78627024 78923349 79280115 79562780 79908400 80345308 80657310
12141 80657310 81165782 81365894 81832673 82132121 82783821 83206424 83686249 84037700 84361642
12132 84361642 84568435 84777106 85249484 85468276 85951663 86383041 86824527 87158650 87569521
12123 87569521 87867298 88254610 88457605 88519601 88884271 89021959 89373092 89567348 89782329
12114 89782329 89868180 90123969 90561883 90848066 90927907 91008493 91227861 91137909 90873916 90910108
12104 90910108 91099000 91207677 91166774 91216627 91315058 91269774 91111989 90959622 90994342 90909798
12094 90909798 90749068 90374874 90171967 90011811 89936899 89736891 89695647 89510598 89227762 88895887
12084 88895887 88577549 88465611 87952208 87333971 86905275 86841946 86558369 86316100 85781839
12075 85781839 85152367 84415942 83980324 83674782 83357939 82856630 82469486 82075533 81811155
12066 81811155 81500334 80859750 80354937 79950472 79657350 79182001 78464035 77723690 77013278
12057 77013278 76570292 75946161 75516648 75092503 74646216 74288337 73789963 73318217 72619334
12048 72619334 72158518 71894665 71403483 70573054 69992823 69698006 69122950 68783907 68564659
12039 68564659 67791655 67472440 67158968 66783511 66232477 65503659 64948834 64547391 64117459
12030 64117459 63990678 63729815 63053592 62533980 62353908 62284086 61935701 61316213 60875815
12021 60875815 60538909 60151312 59888288 59584314 59006632 58769838 58483800 57832582 57393175
12012 57393175 57233645 57109003 56707581 56319074 56181410 55966809 55852533 55551107 55374504
12003 55374504 55120010 54908207 54589107 54491556 54223292 53917599 53562387 53220494 53203469 53182845
11993 53182845 52923976 52577014 52459652 52199461 51823714 51634300 51511575 51517851 51179434 50961820
11983 50961820 50733660 50407679 49895849 49578325 49495932 49441132 49337813 49286379 49063624 48830274
11973 48830274 48588674 48167881 48014856 47881357 47753135 47348741 47099902 47083203 47148198 47259490
11963 47259490 46850107 46406785 46162470 46087309 46115226 45842806 45646817 45546467 45410156 45276366
11953 45276366 45081271 45094132 44884917 44652058 44337174 44366172 44218937 43886209 43624665 43402349
11943 43402349 43369649 43340232 43389550 43294377 43413519 43353320 43331957 43101800 42984716 42639771
11933 42639771 42476292 42615435 42709709 42597656 42433231 42458136 42478782 42289698 42151391 42207713
11923 42207713 42061471 41635113 41616802 41751083 41672750 41512089 41467151 41243459 41093832 41140637
11913 41140637 41328956 41108269 41004380 41113085 41005200 40801607 40490758 40477247 40641040
11904 40641040 40505078 40372121 40280709 40266394 40330099 40364096 40295187 40097970 39910841 39894173
11894 39894173 39981583 39711750 39464536 39608921 39653352 39672093 39704061 39583151 39481859 39451243
11884 39451243 39647783 39289998 38977266 38943654 38962582 38784979 38830463 38629888 38759341 38797186
11874 38797186 38557153 38522308 38600392 38760470 38651590 38406838 38426957 38329895 38381215 38235735
11864 38235735 38014795 37892009 37655941 37167399 37069615 37153841 37188509 37149351 37200241 37127951
11854 37127951 37146136 37124505 36792949 36552254 36440028 36492801 36463182 36287594 36146358 36130915
11844 36130915 36209650 36007082 35732525 35584532 35932539 35921491 35799084 35668060 35467272 35222549
11834 35222549 35259845 35392267 35341008 35130734 35101124 35121727 34987632 34856360 34841189 34761326
11824 34761326 34527909 34323242 34108359 33821846 33600877 33634365 33732282 33692955 33620849 33161606
11814 33161606 32823533 32618274 32618430 32774782 32653643 32382648 32330099 32035037 31917573 31970092
11804 31970092 31802383 31680738 31404105 31121348 31147420 30912568 30846033 30880301 30823078 30740638
11794 30740638 30590986 30399097 29981955 29827776 29591403 29460664 29451797 29361489 29434842 29104058
11784 29104058 28685957 28394199 28369000 28365339 28097851 27676247 27320542 27158300 27437616 27695759
11774 27695759 27392818 26993229 26628531 26510872 26400410 26149822 26205424 26202934 26261481 26205447
11764 26205447 25928965 25822451 25981004 25836013 25473307 25027887 24728900 24720109 24550809 24319994
11754 24319994 24184152 24227644 24036840 24055564 23717991 23247354 23013643 23141626 23191238 22882497
11744 22882497 22537803 22462960 22306097 22202058 22082614 21744383 21648832 21419257 21411556 21322728
11734 21322728 21318553 21014186 20666670 20606020 20623571 20336613 20398248 20174894 19821419 19671979
11724 19671979 19661928 19327959 19149234 19000672 18813955 18585972 18426961 18488774 18369178 18126493
11714 18126493 18083093 18154672 18051482 17748894 17445833 17224719 17236671 17152686 17044322 16797858
11704 16797858 16808331 16770844 16714507 16705785 16621777 16443291 16233544 16194232 16155590 16016589 16000851
11693 16000851 15843584 15562257 15519664 15349111 15233920 15161991 14797413 14505085 14336453 14247735
11683 14247735 14491266 14544775 14243284 14019908 13915909 13771214 13606676 13359772 13205722
11674 13205722 13347341 13271952 13178904 13355179 13070917 12868222 12749522 12764761 12754819 12646407
11664 12646407 12482326 12476750 12465027 12511681 12609940 12540672 12291710 12134803 12096840 11688644
11654 11688644 11476424 11313173 11212239 11240285 11080849 11266858 11375777 11124639 10808860
11645 10808860 10739399 10709151 10598551 10639253 10503005 10427678 10416020 10140785 9947872 10065812
11635 10065812 10251483 10161862 9804152 9614608 9628699 9786786 9730040 9757899 10005467 9794781
11625 9794781 9445293 9439704 9467057 9355762 9185562 9129915 9235565 9281739 9123768 9117024 9127619
11614 9127619 8910605 8715603 8484781 8524386 8608822 8814283 8706743 8622435 8891940 8748577
11604 8748577 8352097 8349827 8428523 8340782 8277026 8308858 8494921 8473522 8324597 8130470 7997070
11593 7997070 8005218 7902705 7736707 7585823 7681777 7778778 7688968 7491677 7238447 7222112
11583 7222112 7314098 7445190 7420009 7317747 7447696 7493829 7422180 7181690 7071836 6790813
11573 6790813 6852741 6977202 6972656 6827833 6873122 6856186 6912530 6807793 6807623 6746716 6553741
11562 6553741 6579201 6610101 6573452 6698655 6700348 6482620 6469149 6630591 6595302 6387034 6285340
11551 6285340 6251506 6465441 6568069 6401248 6262070 6314714 6391566 6296650 6076612 6109863
11541 6109863 6033170 6133871 6256714 6348958 6302049 6067896 6144185 6221527 6273978 6244351 6080292
11530 6080292 5657457 5514800 5604109 5695615 5799110 5901904 5936879 6130654 6325177 6360132
11520 6360132 6257876 6022189 5961229 6109410 6222717 6220138 6241893 5970285 5821808 5871106
11510 5871106 6193989 6253401 6132515 5878478 5574194 5653331 5873247 6023936 6013628 5897398
11500 5897398 5755801 5660830 5545354 5563581 5456378 5517991 5497434 5397337 5701188 5732539
11490 5732539 5622163 5452541 5488352 5448543 5597369 5632318 5652303 5684041 5558034 5535336
11480 5535336 5597786 5621711 5571541 5358829 5184591 5175260 5290746 5197887 5240535 5341515 5380712
11469 5380712 5193010 5145770 5280628 5164427 5095930 5353990 5252657 5093146 4900309 4956970
11459 4956970 5133712 5089846 4885313 4628285 4477304 4426319 4474880 4520135 4430055 4508364
11449 4508364 4763189 4625952 4715808 4606554 4477602 4493467 4357982 4350246 4549296 4649717
11439 4649717 4495241 4127613 4100448 4558716 4707439 4642795 4439530 4217875 4197621 4351274
11429 4351274 4423981 4254552 4297478 4117681 4036086 3896560 3826444 3826043 3818323 3831158 3597895
11418 3597895 3692438 3874858 3711517 3824663 3830188 3799494 3653319 3611934 3837154 3963817
11408 3963817 3873178 3751527 3772080 3729782 3669908 3920763 4133374 4146669 4157357 4138020 3789077
11397 3789077 3625911 3376002 3390625 3468418 3424735 3619879 3705239 3452580 3669187 3738854
11387 3738854 3762568 3649418 3697625 3780951 3653021 3501595 3393719 3673235 3751140 3705634
11377 3705634 3563793 3723257 3911794 3748114 3563191 3604905 3746947 3822245 3843234 3665401
11367 3665401 3416575 3268022 3324761 3588293 3821874 3826916 3688309 3485174 3578976 3745283
11357 3745283 3461894 3265490 3529552 3646723 3524269 3373164 3364375 3261540 3370824 3461858
11347 3461858 3530857 3658661 3715627 3602236 3434241 3276568 3387296 3573921 3764396 3763635
11337 3763635 3422418 3169633 3362965 3317944 3355414 3222734 3114594 3386299 3796064 4042512
11327 4042512 3817490 3495019 3346684 3633089 3912164 3881064 4017741 4021746 4153876 3879656
11317 3879656 3706365 3666510 3663819 3648619 3611667 3790342 3954326 4002441 3971324 4126939 4270574
11306 4270574 4199922 4031146 3936635 3721844 3652954 3745884 3928756 3933120 3896083 3807029 3855220
11295 3855220 3764852 3735895 3730629 3677045 3430794 3506959 3652329 3624508 3743432 3936508 4063282
11284 4063282 4018005 3969726 3953898 3945089 3891397 3887135 3752366 3908420 4153451 4318957 4215580
11273 4215580 4082585 4051238 4034960 4176189 4396825 4419319 4259729 4208490 4315896 4524036
11263 4524036 4553639 4456065 4491980 4522146 4677090 4562590 4365914 4231261 4296835 4567075
11253 4567075 4894349 4653600 4500430 4649547 4607759 4447392 4511855 4486930 4557214 4703606
11243 4703606 4796744 4942154 4835062 4615407 4771604 5023497 4887848 4791614 4747809 4947647
11233 4947647 5051894 5056055 4997675 5192808 5144527 5165604 5164581 5235744 5278105 5497795 5658791
11222 5658791 5510760 5543335 5461968 5546999 5747032 5791392 5821740 5755577 5739859 5897582 6118608
11211 6118608 6210844 6021135 5928557 6032240 6103660 6340186 6382014 6370613 6482436 6464394
11201 6464394 6297753 6147647 6365558 6577114 6763036 7039710 7178206 7149173 7317008 7410573
11191 7410573 7467614 7765730 8258645 8257811 8177157 8232125 8168963 8367764 8275930 8386936 8568012
11180 8568012 8597735 8780695 8938557 9019233 9076771 9273485 9245173 9180670 9271635 9625554
11170 9625554 10069283 10434277 10512936 10520921 10382947 10376256 10577853 10754124 10969596 11274529
11160 11274529 11404381 11398488 11250128 11265755 11526829 11559829 11696402 11924804 12187070 12339914
11150 12339914 12558629 12926670 13282286 13318861 13406589 13735312 14092646 14272781 14413795 14584508
11140 14584508 14778299 14922729 15175358 15386898 15718812 15956157 16167378 16290704 16794485
11131 16794485 17478637 17873790 18240801 18568976 18948789 19432270 19723135 20058485 20587978
11122 20587978 21066847 21348961 21605525 22178919 22812453 23224504 23614944 24400057 25086003
11113 25086003 25970557 26564571 26951034 27455341 28303457 29272773 30189540 30761956 31501945
11104 31501945 32064894 32800470 33892934 35071859 36232629 37100670 37955665 39104584 40061650
11095 40061650 41233542 42577205 44024829 45384679 46753935 48333821 49748460 51074904
11087 51074904 52885083 54755600 56625291 58398680 60108830 61788751 63846731 66260768
11079 66260768 68787008 71169866 73177515 75793668 78641711 81522420 84386022 87252570
11071 87252570 90283823 93610064 96887949 100293892 103622270 107185385 111012883 114740557
11063 114740557 118335840 121931519 125688065 129623655 133622509 137685949 141446339 145117654
11055 145117654 148944485 152525814 155767606 158953588 161885078 164716236 167616325 169762102
11047 169762102 171462626 172824690 174049981 174721533 175171726 175538908 175157859 174296406 173160669
11038 173160669 171927101 170074462 167950536 165333763 162348320 159545282 156633285 153301802
11030 153301802 149710438 146249813 142628477 138777844 134886696 131298564 127512715 123909795
11022 123909795 120321776 116811786 113332185 109999034 106736341 103052467 99280578 95847028
11014 95847028 92864562 89944472 87194695 84680244 81910381 78833129 76347136 74165404
11006 74165404 72148354 69916923 67235778 64934298 62846037 61146475 59097670 57226864
10998 57226864 55575103 54002446 52442462 50950076 49604937 47868914 46455014 45094243
10990 45094243 43435397 42072120 41139328 40146509 38998491 37867847 36902439 36034533 34827250
10981 34827250 33877776 33302254 32544014 31859281 31158798 30252842 29467625 28787319 28077362
10972 28077362 27719849 27305458 26578600 25840984 25342277 24852734 24393214 23955622 23360839
10963 23360839 23073553 22503074 21691727 21117858 20723725 20420103 20093637 19790993 19416229
10954 19416229 19029357 18552620 18328231 17989892 17529935 17035838 17055134 16927432 16506710
10945 16506710 15852747 15301164 15031497 14677811 14402110 14526186 14595494 14343919 14050138
10936 14050138 13814546 13599279 13330433 13231950 12830556 12529995 12313212 12069823 11864976
10927 11864976 11995457 11762144 11300123 10863978 10688391 10780547 10852423 10535960 10248960 10303868
10917 10303868 10333802 10243451 10191118 9813298 9656107 9656505 9510205 9373134 9164073 8892495
10907 8892495 8752230 8619561 8573451 8587925 8471667 8169924 8252222 8078937 7983129 7828547
10897 7828547 7669522 7648460 7559338 7499562 7516629 7586972 7415918 7197017 7170294 7341790
10887 7341790 7239418 7027736 6923814 6963274 6812751 6629263 6482465 6135750 6077457 6155192
10877 6155192 6346153 6295901 6402208 6396241 6466276 6311248 6204603 6039165 5854027 5884152
10867 5884152 5799746 5585971 5563767 5556652 5450448 5274533 5218012 5367757 5429808 5417008 5378394
10856 5378394 5217180 5214068 5253091 5300071 5259217 5127608 5004991 4835563 4900471 4916733 4975153
10845 4975153 4954779 4613887 4777257 4778386 4784832 4573698 4378328 4297281 4398450 4396255 4298406
10834 4298406 4040365 3982675 4290685 4280627 4119048 4089534 4021500 3827165 3946756 4143472
10824 4143472 3985952 4165679 4325381 4346096 4077314 3942649 3795978 3516166 3266210 3268103
10814 3268103 3386971 3334003 3307302 3049365 2865161 2901598 2967968 3011249 3019673 3045625 3181631
10803 3181631 3354537 3176758 2969382 2909642 2833902 2891218 2902010 2693180 2776479 2849931
10793 2849931 2730910 2626619 2511910 2571881 2571121 2427045 2341552 2438848 2576192 2602955 2496872
10782 2496872 2238187 2087522 2176550 2172778 2322742 2383942 2133438 2371749 2407905 2104914
10772 2104914 2027014 2033065 1966756 1944713 1793416 1879807 1912083 1792542 1716736 1836586 2033661
10761 2033661 2088725 2003456 1918904 2025642 1841832 1841708 2196609 2108557 2010858 2016398 1949998
10750 1949998 1644321 1505765 1622055 1979383 2005834 1898830 1697373 1910951 2036414 2124557
10740 2124557 1979501 2022649 2149290 2050351 2008766 2286332 2346241 2270992 2408028 2553017
10730 2553017 2675632 2723300 2661997 2754766 2633762 2496104 2318304 2230793 2211548 2164657
10720 2164657 2122670 2161028 2215151 2269179 2166921 2072224 2189987 2012947 1688422 1771801
10710 1771801 1812799 1737855 1912055 2037671 2112621 2116421 1909339 1634339 1399864 1543997
10700 1543997 1392461 1181189 1089282 1282971 1325362 1153949 1068258 871837 669416 778689
10690 778689 932728 886374 708685 681711 953821 810286 549012 431667 303310 189006
10680 189006 134185 258904 290431 289846 469420 515458 203097 147013 110169 139172 -63275
10669 -63275 -294505 -152527 -60630 -101576 -147551 -249688 -100378 -10717 -153260 -175483 -156434
10658 -156434 -359322 -350886 -285480 -450524 -530734 -507989 -277600 -163306 -547837 -838838
10648 -838838 -630373 -466765 -520574 -640358 -598586 -679753 -908092 -1104758 -857640 -682095
10638 -682095 -588111 -284393 -362268 -258576 -117152 127888 295947 604787 1163882 1600013
10628 1600013 1806237 2286874 2805418 3503033 4529971 5598290 7364694 9957040 13715432
10619 13715432 18842797 26196955 36718149 50694506 67420986 85061574 99681911
10612 99681911 107727898 108124962 103487788 98076533 95450620 97467469 105908583 122946163
10604 122946163 149605392 184032624 219639894 245539775 253464431 243533664 223023746
10597 223023746 202225937 188172249 183892472 191997546 213320451 248079868 292216143
10590 292216143 335409813 361688233 359691618 331883394 291624316 252156428 221671258
10583 221671258 203089354 197149723 203092666 219685252 242412607 263212974 271394608
10576 271394608 260217810 233042744 199147493 168026332 144191338 128509596 120430438
10569 120430438 119040385 122309757 127645208 131342706 129511884 120484861 105421568 87901190
10561 87901190 71947367 58774112 48465343 40548237 34637719 30308495 26937522 24051426
10553 24051426 21965278 20310221 18887642 17896762 16838513 15764906 14973637 14426754
10545 14426754 13652549 12810961 12310658 12191332 11936842 11462611 11024140 10936284 10765043
10536 10765043 10184852 9831136 9283668 9173109 9127054 8902270 8554735 8402337 8243806
10527 8243806 7980849 7703933 7778608 7746910 7436230 7246222 7212723 7196273 7011985 6695964
10517 6695964 6417930 6440346 6409823 6270946 5919462 5924404 6153310 6115522 5834319 5688473
10507 5688473 5779163 5933621 5708483 5371756 5225504 5304477 5445906 5308318 5157551 5221440
10497 5221440 5180866 5100570 4986811 5106784 5262897 5152840 4852098 4731204 4794007 4877095
10487 4877095 4710416 4659127 4524325 4804993 4884623 4547140 4441900 4404358 4495225 4609083
10477 4609083 4651903 4455416 4186890 4264228 4270716 4037360 4261599 4153743 4150470 4141607 4041596
10466 4041596 4100566 4306734 4472346 4323106 4249496 4265811 3890017 3674545 3691509 3790482
10456 3790482 3988027 3919643 3626523 3445667 3339729 3424966 3762658 3682659 3425649 3345575
10446 3345575 3443345 3661121 3448595 2967129 2899820 3117638 3197852 3078534 2920660 2889634
10436 2889634 2978388 2994333 3037936 2844508 2964998 3089980 2982165 2861495 2877767 2889302
10426 2889302 2850348 3155233 3114778 2982683 2991026 2921234 2947571 2812705 2885236 2970959 3332687
10415 3332687 3489423 3514508 3569667 3271514 3105427 2932853 2826723 2687649 2668840 2647629
10405 2647629 2906249 3081365 3230564 3141313 3364297 3378708 3437252 3479934 3390525 2993387
10395 2993387 2737630 2669488 2720737 2638268 2733733 3110169 3144122 3022119 2864835 2870953 2710575
10384 2710575 2806490 2902708 2688032 2566054 2628601 2458543 2512069 2472246 2345874 2516161
10374 2516161 2408721 2474573 2476139 2254666 2239885 2452442 2527446 2293212 2087630 2078722 2144491
10363 2144491 2304549 2295293 2383502 2264185 2101784 2260371 2286390 2095659 2277649 2022981
10353 2022981 2159274 2528357 2270614 1908301 2021104 2217744 2218366 2357872 2334277 2239083
10343 2239083 2133580 2117200 1998312 2308407 2717171 2670040 2314441 2061269 2164983 2235297
10333 2235297 2253583 2415828 2290826 2380486 2103354 2000754 2051991 2084783 2092671 2141165 2397510
10322 2397510 2464787 2362431 2343730 2214541 2177475 2164832 2374009 2301818 2317378 2314847 2343571
10311 2343571 2242106 2085229 2190173 2335521 2175914 1967132 2012076 2091298 2081330 2400430
10301 2400430 2603612 2341566 1997599 2018783 1975784 2094758 2206346 2308282 2336368 2332139
10291 2332139 2191039 2194881 2284277 2180753 2193378 2075232 1958141 2046693 2036453 1859045
10281 1859045 1891821 1952242 2027886 2263329 2318951 2219216 2232669 2260328 2007822 1557537 1283461
10270 1283461 1428254 1563979 1766306 1823657 1885232 1939855 2051284 2089503 2093875 1869427
10260 1869427 1782674 1978651 1943447 1756048 1678117 1580677 1585838 1546706 1622779 1559839 1515885
10249 1515885 1423374 1442535 1532919 1555757 1684133 1839373 1932921 2042690 1905843 1867659
10239 1867659 1930307 2105634 2086424 1705552 1526257 1376490 1514618 1610182 1477167 1311754
10229 1311754 1569270 1326011 1411563 1635203 1879311 1694965 1544413 1305981 1302676 1572057
10219 1572057 1725287 1749358 2016766 1978175 1781155 1637968 1418898 1393013 1700056 1575897
10209 1575897 1486563 1555733 1310416 1326433 1469699 1678273 1748342 1931950 2038682 1852850
10199 1852850 1914612 1827241 1849805 1829241 1808633 1830852 1618804 1761738 1665508 1499997 1672587
10188 1672587 2056573 2154985 1947009 1828092 1728250 1617245 1696863 1552423 1560698 1815622
10178 1815622 1902958 1767419 1583682 1609345 1848917 1828363 2082370 2417525 2414499 2282035
10168 2282035 2350833 2387045 2669548 3050620 3163352 3130833 3116365 2833999 2621958 2646393
10158 2646393 2551661 2679180 2674228 2734810 3126195 3541209 3681296 3753295 3599967 3247562
10148 3247562 2950079 2796308 2684546 2873957 2832908 2949000 2941005 3161648 3319684 3177558
10138 3177558 2888991 2409275 2159091 2063629 2025207 1872012 1946327 2088305 2216993 2230276
10128 2230276 2341122 2261828 2173776 2147283 2119475 1911075 1612675 1416750 1474069 1485365
10118 1485365 1262033 1218982 1348314 1550827 1594447 1450080 1462132 1534542 1504618 1592252
10108 1592252 1658759 1539478 1301101 1212094 1509339 1755650 1545999 1532220 1322548 1124897
10098 1124897 1147640 1318537 1526878 1622714 1724035 1705895 1685830 1804331 1759409 1626636
10088 1626636 1511946 1606548 1680909 1634493 1504297 1295896 1289533 1523912 1327038 1086364
10078 1086364 1144153 1150287 1219953 1524995 1654519 1593756 1637382 1617591 1598470 1512198 1451693
10067 1451693 1482691 1395382 1353828 1413102 1361072 1379613 1523529 1358973 1105637 1030359 1152686
10056 1152686 1121483 1228029 1067478 963820 1235535 1235733 1147934 1137504 1356929 1514881
10046 1514881 1619896 1455984 1393703 1305050 1247124 1376157 1227691 1149085 1206105 1386286
10036 1386286 1662914 1733820 1728879 1423640 1184633 1237640 1543883 1551233 1475620 1378840 1234478
10025 1234478 1158330 1287041 1474327 1348643 1495944 1477339 1471355 1459480 1310284 1381375
10015 1381375 1298467 1094423 816822 805542 740532 798630 889039 1024838 789683 752820
10005 752820 814738 1070481 1047170 1175741 1109826 1096086 1074610 1139253 1086498 943052 827436
9994 827436 914828 753852 809900 854428 785322 792291 763467 803840 1009641 1099415 951777
9983 951777 920213 970615 1016274 1195777 1198145 1297383 1478339 1495325 1366415 1182120 1169318
9972 1169318 1124907 1058672 1033384 1311765 1276990 1284342 1436737 1518579 1463373 1400119 1222046
9961 1222046 1298795 1458518 1418886 1226432 1221849 1365734 1370922 1286553 1348621 1220745 1244172
9950 1244172 1161303 994534 831775 982075 1097549 1132947 1145742 1103556 1190756 1480927
9940 1480927 1601955 1547761 1446930 1428479 1275345 1175096 1230273 1327576 1368349 1153454
9930 1153454 1217124 1566438 1740442 2152816 2674927 2726126 2613802 2373937 1993120 1557782
9920 1557782 1252034 1224719 1123189 1058453 882995 589396 531914 554481 589696 587775 862850
9909 862850 1012160 916706 894227 876844 1030165 1217033 1232778 1180867 1024435 735582 757616
9898 757616 723076 968692 958444 1099045 1029317 971825 1037789 986014 1080837 1242892 1044941
9887 1044941 1009386 1016276 1052116 1133696 1204232 1059771 821598 821408 1026365 1006030 1029196
9876 1029196 995024 908459 879763 953405 1115581 1090656 1061281 1120890 1120389 1105529 1031128 1093128
9864 1093128 1096065 920751 822327 672745 626606 720183 811568 889342 801289 632256 768140
9853 768140 776625 646857 721188 625186 580505 957625 1114777 1115174 1032913 1091109 1092051 1040357
9841 1040357 1081857 1134952 1108634 1142464 1045993 739101 790880 1020250 944161 1001426 1138166
9830 1138166 936579 886501 757798 670262 627164 636957 639517 782670 1081287 983248 966556
9819 966556 1099545 1162008 1092550 942516 867897 965957 1085267 1114551 1077348 1015616 833806
9808 833806 923526 1067900 1055960 717455 509553 427640 601426 757657 798283 1163575
9798 1163575 1272934 1230974 824172 861026 1145281 1269740 1431820 1759174 1710155 1425943
9788 1425943 1120228 1048421 955180 1027846 968297 964532 936434 790713 899661 1179335 1161369
9777 1161369 1182750 1205564 1116141 1075784 1046921 904563 924665 1058374 991442 868227 898541
9766 898541 952115 739166 872054 942766 858263 937693 953794 859036 897129 897153 945417 914989
9754 914989 860890 691387 491822 483782 762991 732461 846274 1090038 992774 684468 589127
9743 589127 694681 901491 921647 1115429 1223122 1066462 687702 509427 561355 537314
9733 537314 589448 596609 736157 858704 663207 663902 676490 632145 561451 659315 649598 754372
9721 754372 927511 858592 898289 1271314 1238314 1093514 947779 751227 828154 953932
9711 953932 959879 992576 926534 907688 930032 874776 774240 564900 492372 711618 933418
9700 933418 816135 775490 635646 711120 937257 961146 973508 1104140 1009717 1022498 1171331
9689 1171331 907610 1075181 1129224 1031124 997355 991325 930206 901312 710138 727967 680738
9678 680738 497135 512387 489687 407588 717912 881202 844528 782699 690348 723790 868414
9667 868414 1003736 956386 814678 716615 878971 1196289 1303127 1194371 976113 1140453
9657 1140453 1422704 1606236 1395146 1080513 1014588 961732 1371337 2210094 2954887 3592784
9647 3592784 3734463 3183382 2300400 1744042 1533387 1490113 1539570 1506965 1474689 1314874
9637 1314874 999620 826420 823036 880859 846550 809864 800030 657363 791417 653966 713102
9626 713102 671801 624930 620663 496357 518073 605981 760865 890993 1064550 949217 914683
9615 914683 1005243 1037760 777576 626701 673686 632325 536410 435949 469971 783233 801686
9604 801686 640787 831051 985353 1054197 1111585 1011805 1042839 879526 750158 858421
9594 858421 823047 915164 1111747 1004839 733590 569553 545182 526228 515573 456317 446319
9583 446319 384240 211566 239687 368670 361776 384769 427348 337678 296619 429698 699265
9572 699265 791402 605871 467983 456404 416118 538722 566813 559615 807205 791696 537273
9561 537273 308678 -19016 -103464 185283 554712 639366 611050 767142 724021 885380
9551 885380 907201 864740 723224 850754 821974 813419 875718 872212 975030 968560 977801 1040257
9539 1040257 956529 1197850 996838 787468 992880 997989 926794 727975 405869 406507 472081
9528 472081 670479 697336 800326 813030 857009 1033535 879396 596107 536620 372060
9518 372060 366606 433260 532418 669962 859862 917606 1078827 995671 915147 1052882 1006536
9507 1006536 551662 223195 446479 591073 700710 765182 735427 731461 759455 753255 746191
9496 746191 514570 333699 325958 459833 543837 424982 566461 691221 818004 774138
9486 774138 864732 674188 639118 795621 666138 688547 756171 700800 485315 285788 624159
9475 624159 824971 817032 609470 479588 649856 757403 619249 655872 728530 633328 950820
9464 950820 867923 886109 880663 638274 537802 708332 765439 853140 676484 445997 559810
9453 559810 552982 348882 446448 457147 505225 604341 612667 325474 439791 447126 601234
9442 601234 510132 337147 622804 733970 581535 530850 523596 404959 446459 447631 424724
9431 424724 318969 484399 609246 540336 468520 663828 579286 172857 9392 44031
9421 44031 198309 150082 238257 401505 550895 568961 892873 882898 613029 600081 818203
9410 818203 935878 918045 773781 666264 669103 820759 798138 600115 392114 404502 570106
9399 570106 344164 381797 311220 288577 262725 383740 327969 120416 89629 139593 345869
9388 345869 627141 578101 310790 100736 10552 271689 438695 590153 495331 523103
9378 523103 453241 500197 361029 290713 375544 592417 654875 279827 163693 453522 377905
9367 377905 275656 268699 446720 337092 431282 658187 877477 952593 822791 798179 859822
9356 859822 1088493 1228751 912371 554453 596262 632379 437156 387866 295714 413479
9346 413479 284510 91551 178558 286114 272206 70632 49500 229902 324501 548201
9336 548201 631166 725456 731668 640808 654683 687563 766585 872053 1018307 1074551 871445
9325 871445 676460 703874 538919 588120 739732 539443 642105 675576 653090 513823
9315 513823 333099 323573 206298 348534 312083 254754 539854 400238 451516 720467 703789
9304 703789 738781 808739 821253 564449 471256 435417 467840 481994 415722 422886 731144
9293 731144 740233 503370 342639 370766 353673 428104 426548 289722 421006 719993 599802
9282 599802 232803 273191 405266 206975 100099 196163 236177 319851 464640 305892
9272 305892 320612 566452 597453 640348 699022 452449 492384 384277 601274 800170 696542
9261 696542 423609 289340 160550 248163 204879 324939 202823 113236 51306 123830 488375
9250 488375 457297 433530 572067 686854 577551 654298 653269 407042 430968 511277 443517
9239 443517 385701 312831 364030 351277 488031 672144 457837 599936 896036 949351 1024882
9228 1024882 1064911 924685 646140 207612 158889 395387 606365 638172 585228 401531
9218 401531 214892 170990 227930 111851 102566 425651 597796 621656 738483 736317 857737
9207 857737 743685 644219 723354 645760 539157 435662 605552 761266 700542 638511 774621
9196 774621 611949 456812 589093 635108 648191 653102 745148 735242 601078 530281 437364
9185 437364 573353 509028 480243 539735 630149 624190 574377 355786 397972 432079 414220
9174 414220 390111 494785 436540 657275 847187 677554 464565 388370 580649 559816
9164 559816 308749 125019 302986 406068 597887 839286 587256 369685 319733 444505
9154 444505 421737 387135 385318 328360 417543 602927 546585 379775 293759 137661 310916
9143 310916 387552 510272 456197 332729 663468 739302 545765 525603 463058 392642 270862
9132 270862 224660 535084 665405 363961 61891 47584 583934 899721 822715 577063
9122 577063 352745 317220 440284 575538 360779 466929 724632 699101 883681 949414
9112 949414 889355 814054 645645 724756 975214 874546 659065 682020 537282 443987 567918
9101 567918 655373 578849 569395 395590 444916 676504 778182 720014 689335 679752 467647
9090 467647 329575 431872 388940 400661 184865 123936 334226 533467 606364 699009 812493
9079 812493 719264 588124 398637 559039 652156 585015 466355 569713 441893 328172
9069 328172 350736 325550 407968 516554 341061 394716 566556 537360 434170 505786 714481
9058 714481 822838 618322 621728 638556 550619 639590 627779 621524 528551 502135 708602
9047 708602 785177 971476 823540 714550 675790 505511 474127 296156 97899 176512
9037 176512 278686 283345 296363 406380 446374 229698 79637 -31160 31263 342621 501074
9026 501074 428203 551520 645440 581387 497150 249569 -79568 -99535 60008 368864 382936
9015 382936 392718 332050 324024 299734 410862 415343 505653 431343 497141 762645 802579 473783
9003 473783 369638 351752 323500 315542 186977 327283 639534 591875 388143 81587 -46633
8992 -46633 266233 551558 505695 453796 469326 444750 428242 211902 -174355 -94017 187771
8981 187771 301126 180885 186981 403635 710494 789218 688003 511872 315342 273273
8971 273273 388514 432624 478881 358464 219271 324898 74515 140561 195490 234910 274323
8960 274323 234705 199731 17942 208293 559918 535942 427305 359709 490850 588113 533674
8949 533674 438116 498767 695841 697898 688077 555539 543552 393453 148318 211265 285889
8938 285889 237950 358504 533750 548900 368105 410234 330785 208733 308684 216398 -81638
8927 -81638 -136037 -266689 -146846 369468 382226 282781 221501 276234 366963 378392 458761
8916 458761 502185 496636 585197 614405 639334 751119 801086 676905 401880 521143 569025
8905 569025 666473 656683 676332 598099 443597 366036 462211 686263 896782 726129 512729
8894 512729 633363 724179 610172 464841 409206 477421 640049 615467 554084 658741 684061
8883 684061 402840 328850 276022 404863 287677 341758 308507 332721 375449 412990 316374
8872 316374 195614 190636 -13414 35258 212263 95755 130640 107918 17074 81703 167226
8861 167226 157689 286911 547662 290935 -13262 130697 244829 223689 70810 161689
8851 161689 304906 76801 -89383 62810 351079 377123 437253 455460 378087 310260 312670
8840 312670 325090 386240 208836 196859 240112 443172 541810 460921 215986 137283 29346
8829 29346 107342 45771 91989 223957 260644 327687 497199 483708 306685 338228 288937
8818 288937 203115 198843 289128 234143 312069 423591 469451 176381 187456 337569 464344
8807 464344 540801 661928 489488 400093 336756 150681 417259 445202 386280 433233 400054
8796 400054 367893 480390 491315 431572 442523 628566 484175 484716 440814 469878 509490
8785 509490 637469 551505 262655 -62329 -79224 192364 355890 315706 310059 355219 464976
8774 464976 544737 609049 559496 541433 394057 361361 328839 331922 26626 84267 206360
8763 206360 426669 575011 675530 716477 829938 895119 890357 584230 142229 95037 302929
8752 302929 344896 355956 271114 286109 259578 44201 -50456 9779 -46370 -84162 -19765
8741 -19765 442544 754227 546294 410991 559763 592473 591865 535834 676646 650132 645670
8730 645670 372490 8914 63464 253941 208433 11462 -51145 32835 -109228 7214
8720 7214 240067 318173 431715 413369 240284 -8970 27579 265435 246477 140820 138366
8709 138366 250070 284822 291008 297766 99222 -101970 45241 -64331 -127594 -97197 12062
8698 12062 201765 321939 517153 637079 545737 709459 949007 659286 695516 725490
8688 725490 741312 731460 500344 515927 443156 408349 443529 388474 367243 274577 269044 421701
8676 421701 519335 449327 254186 449167 708868 731890 711449 429594 302439 9777
8666 9777 50587 159860 339963 525188 372785 161588 158157 335419 446456 468522 575339
8655 575339 592936 503596 368127 207668 260794 282250 261223 434049 403445 131662 203861
8644 203861 369498 359249 258777 175946 245302 223737 317956 237590 93095 389255 560904
8633 560904 529668 573274 419044 374743 357142 154161 105704 139457 317403 509963 585716
8622 585716 442136 201915 319367 316794 112510 38103 23687 -46522 30058 317914 300652
8611 300652 289745 196445 42736 -71512 -14768 102605 51176 -225046 -192277 -41790 128225
8600 128225 71453 108175 110949 134363 46388 -7461 384491 507483 488111 555835 496812
8589 496812 107478 -44626 -103674 -65004 -78881 100387 378088 590604 712780 788251
8579 788251 819144 597598 524292 802670 787922 759072 582793 589185 420938 304199 216018
8568 216018 234511 362270 451831 353875 475240 744143 887408 731004 621547 781878
8558 781878 641093 443162 188482 129636 349129 224023 -48028 -61085 262996 425603
8548 425603 547212 280149 404467 452377 286171 214172 251065 205375 435343 439498 242614
8537 242614 461141 576676 391371 409072 372201 374849 177884 14606 74468 -2726 50657
8526 50657 225763 150783 68095 200888 104570 72913 45164 -67368 -1738 148137 595289
8515 595289 478444 431768 436231 399035 306651 108938 36180 -23347 123402 278428 -24320
8504 -24320 -309374 -134309 106738 144860 62229 -44721 62332 212355 475127 693257
8494 693257 509377 253293 409680 529959 463825 321259 459890 539382 446723 405814
8484 405814 351245 383331 388271 399568 408169 479382 253524 120623 127956 139587 224044 145108
8472 145108 -69065 -78484 155896 255694 329195 450613 527474 501816 307264 200027 51495
8461 51495 54878 300817 409584 87697 -37475 64656 322072 430633 541474 494386
8451 494386 414940 520284 576609 620556 691055 771762 667819 591105 378091 185743 456270
8440 456270 498718 706775 860890 847417 579699 552501 584757 738533 672545 604222 656503
8429 656503 585273 699652 894980 863672 731450 760182 516199 -62014 -305670 -20889
8419 -20889 253943 317722 345199 217527 182937 255004 272123 159215 199963 313202 294673
8408 294673 312568 478055 343602 190100 357635 574047 604830 566822 582211 665470 677429
8397 677429 594756 326894 205948 232884 219166 367637 399285 487572 605068 473089 220324
8386 220324 79136 83778 76096 195487 229206 255393 301312 282955 455026 364080 25513
8375 25513 50490 101345 -63319 -153508 -188765 -59393 33990 136429 139799 56024 -242851
8364 -242851 -52718 267865 4872 -89035 -124072 -27194 95090 -228206 -320915 -226150 -141072
8353 -141072 -220127 -117239 -240029 -44013 57820 -16065 -65118 -41004 71678 170284 223752
8342 223752 297943 445311 499415 444187 255370 132721 56704 187287 200391 191239 155714
8331 155714 300458 261608 13237 -220481 -292724 -32274 131774 121684 161550 48203
8321 48203 4362 -90436 -17445 54878 1276 -29484 128753 341329 277493 270944 238550 173378
8309 173378 157057 90361 193644 283906 197565 169520 336130 144832 59819 101722 375617
8298 375617 370809 180934 -15466 41626 25240 31241 245917 533373 815035 766254 467006
8287 467006 179570 64993 65920 228590 390911 619037 540319 308260 210803 115967 183007
8276 183007 181496 51858 26980 -89526 -17080 115974 266776 465553 279423 20953
8266 20953 -35085 187668 290475 318040 170466 115442 167298 106686 297304 393265 289720
8255 289720 367815 308391 224605 284605 205601 307381 544592 479081 474151 570081 487558
8244 487558 160382 3913 -18235 239165 245037 257956 388213 261347 86043 159693 206128
8233 206128 115452 -88496 -73806 102944 197878 107577 63093 141251 148587 171332 273910
8222 273910 185185 -3391 -4283 185168 381752 336394 280985 172138 -81815 -110010 -40998
8211 -40998 334213 526804 692610 611325 297295 248355 216610 -77129 -71 -24102 -100536
8200 -100536 52370 57405 -81307 -92182 -79587 -16465 79983 182092 424099 374830 -48213
8189 -48213 -79854 137259 -8131 -132197 -287215 -128333 216597 268944 538152 660567
8179 660567 644279 490151 246449 275161 277608 49657 -81989 7377 101959 247080 477230
8168 477230 587540 370942 234340 265552 136931 -53128 -97633 41023 186913 405261
8158 405261 367268 438507 426813 508575 439242 431317 211133 143014 413605 289819 164866
8147 164866 303500 258022 137099 145983 123603 244653 493768 506993 331642 221186 246710
8136 246710 435765 247591 -135401 -292830 -282477 -91971 43555 -137833 -33748 228752
8126 228752 636570 577678 603995 766908 838605 712982 792901 450791 352168 502844 507689
8115 507689 347762 214011 112159 67420 307897 346350 234822 17469 -38671 -96007
8105 -96007 -142011 69299 144399 139833 203060 235738 304314 254255 174439 154998 -87254 118622
8093 118622 368145 91489 -195344 -85145 -23174 160979 115203 -86783 -71180 46978
8083 46978 -96600 -32468 -114737 -152493 -5425 51254 -39150 89052 297237 436110 328345
8072 328345 218928 153161 115147 -31603 -72003 123721 210330 131779 46291 -2100 35662
8061 35662 248133 202615 -235376 -173052 -37339 31647 14183 273300 503466 589682 352452
8050 352452 250514 156966 -82435 -7035 -65818 111040 48719 3976 242447 234747 229556
8039 229556 500080 458542 378115 495429 601947 287957 84414 126856 165642 -10930
8029 -10930 169031 281993 79963 -47951 139516 232995 121041 -24612 -226573 -310012
8019 -310012 52056 429957 390248 273990 146693 -21686 12332 100009 -65049 -9825
8009 -9825 172262 277855 186590 84927 -39738 -71463 -148328 -145056 -115413 -125955 -132159 154864
7997 154864 129774 -7302 99253 377240 492797 324399 67151 -29823 141505 75828
7987 75828 54941 120344 38688 167322 242417 135507 99483 301004 318708 278652 299198
7976 299198 382423 162250 303412 401991 473438 571632 568400 642053 403180 328060 167443
7965 167443 392548 232430 157479 418511 553836 573226 697999 710476 494363 274469
7955 274469 329910 239163 178849 -50352 -103209 -298873 -181287 246111 260324 39435 -57482
7944 -57482 -108331 -26259 301705 112794 -56931 82788 275633 444049 532524 529277 400816
7933 400816 143204 42711 318234 431877 347958 91844 -21 -175484 -34853 150754
7923 150754 219776 227430 328799 334872 201448 249349 56199 161228 292922 351283 315296
7912 315296 253043 506046 342749 85777 19116 1248 8226 35932 128536 335826 349887
7901 349887 302409 333721 377117 191257 137887 134562 -12017 -109169 35854 350446 181980
7890 181980 76596 119066 267067 308817 361638 270279 163578 110820 -142686 35811 -125669
7879 -125669 -234102 -110408 -209470 -464938 -468229 -330578 -78993 118399 268258 366414
7869 366414 292284 -71003 -89433 -39491 -168720 -209639 -84569 215525 269581 1429 -28713
7858 -28713 -34291 -70619 31589 376240 236442 215612 5225 -218484 -250625 265907 789412
7847 789412 716592 457362 469669 617157 513041 265680 183973 209499 258400 217358 33624
7836 33624 217218 344492 215757 164401 310748 318291 438841 316678 284095 418021 251681
7825 251681 -49542 -214277 -346210 -262783 -90535 -24827 160639 219265 93208 -49491
7815 -49491 -325885 -309812 -225601 -257259 -355444 -206728 -143486 -107409 50061 329712 236894
7804 236894 131305 64833 137216 365797 299658 32761 -249225 -322830 -463095 -304778
7794 -304778 -72014 155623 207798 262414 274612 114184 129965 95500 -29035 -86814 -107339
7783 -107339 54048 23554 -114378 -180809 -267088 -71451 135877 409792 551571 345877
7773 345877 212525 206652 277222 17049 -115866 -47886 -138557 -173640 -136129 -91384 -13153
7762 -13153 110294 25848 -199868 -210201 -222687 -164116 -42824 -281739 -290909 -120909 89844
7751 89844 20254 20311 308138 426456 310363 243354 13629 49705 255807 326897 451494
7740 451494 366450 73283 42171 18368 117685 236080 46690 -216831 -504631 -450409 -201349
7729 -201349 -11671 10924 -73721 -177833 -173091 -232867 -276026 -342527 -421623 -418723 -471205 -417540
7717 -417540 -344307 -257868 -105610 -61897 -273288 -121777 74894 163134 142802 -13064 -145791
7706 -145791 31142 16912 -99464 -47557 286197 279802 193944 450663 495298 331077 159492
7695 159492 93381 -8610 48499 28071 30868 -127533 -271123 -46733 119921 104177 56575
7684 56575 204159 133743 -130618 -130347 -50012 -48092 -56090 40529 46654 -46906 -207627 -129815
7672 -129815 -12423 67403 141904 109328 256914 300934 337489 292973 298852 257566 109761
7661 109761 67607 80845 348147 306833 234212 57894 -91919 11464 -20982 47540 44454
7650 44454 218234 317055 261248 227878 -159578 -265251 -87751 -109642 92487 11629 64097
7639 64097 5306 -34364 -27934 -102041 -20957 -16688 -130147 -148685 -28290 9361 18213 -91954
7627 -91954 -364235 -385224 -119530 -70758 -76921 151179 109347 -22969 -63402 62762 -95220
7616 -95220 -146587 203576 294500 189243 -43312 -107785 -64115 -61836 52553 193804 275208
7605 275208 271402 147365 95528 66460 -82051 -34027 -11108 7222 -87136 -252599 -418957
7594 -418957 -207176 197120 253332 276330 210705 190987 14834 -62080 132751 220150 190624
7583 190624 302098 264585 396943 183187 122684 269060 35820 -55299 149891 184883
7573 184883 209447 259238 329322 197473 192716 288691 255202 85721 -195286 -277290 -190830
7562 -190830 -217425 -195850 -238956 -116883 -124601 -67320 124701 335566 424491 170570 -252493
7551 -252493 -262156 -16702 -253690 -230580 -230112 -109069 -31867 -210207 -163555 -218051 -330133
7540 -330133 -266211 -55987 -179505 -178671 -242353 -148625 -86710 -33020 54851 51787 -90206 -175376
7528 -175376 -103098 97022 227696 300335 205840 105245 -17321 -1547 46565 -69010 -14374
7517 -14374 2750 -49610 -112972 -218429 -132072 -126538 -181890 -23920 -197138 -183809 -7130
7506 -7130 90443 118546 44550 103910 26182 15582 185494 -91477 -193530 -168360 -225535
7495 -225535 -226951 -217973 -223628 -296183 -133370 60704 167841 385491 523902 462451 445600
7484 445600 379118 270661 285965 243571 204427 59281 -159699 -279378 -37422 55966 60065
7473 60065 -10561 5809 112441 174073 33338 94200 102835 65926 -5495 -96651 -53508 -755
7461 -755 -11091 184228 124087 71804 63616 -68380 123205 161487 253276 241734 353029 32472
7449 32472 -108911 122772 341336 550585 513995 490486 470013 523042 521029 471471 573784
7438 573784 392712 232486 277222 80053 -46148 214199 279769 170921 104209 109055 -40
7427 -40 -272738 -273049 -119474 -89914 130398 108236 169 12818 -187405 -280518 -105348 113045
7415 113045 68741 -169590 -324555 -138755 -123125 -84950 161399 6937 -141792 -207835
7405 -207835 40355 232490 239777 127265 -87026 4557 171941 90966 88685 -100974 -51040
7394 -51040 37607 -80723 45949 287751 399954 376445 245996 116490 75103 123173 178919
7383 178919 320563 116253 118172 250359 217653 123667 148999 146258 37523 -122121 -224199
7372 -224199 -143706 53476 255563 296060 159921 -296204 -374945 -133347 -105446 -79941 -185753
7361 -185753 -77121 17245 -49628 -67120 -210702 -287448 -118172 204605 32381 -304103
7351 -304103 -491670 -573461 -399760 -249346 -366832 -97386 -82453 -188411 -94260 86097
7341 86097 60898 -176599 -314943 -454971 -342725 45977 253036 163823 -89642 89863
7331 89863 255368 359176 -75437 -210128 -235089 -104564 -67006 119191 302851 344325
7321 344325 121568 147995 44138 -164076 -173707 78164 293406 216477 -26137 58534 261742
7310 261742 395428 238915 200081 45825 -30678 -101272 -58885 59164 24560 120075 80797
7299 80797 103531 103880 226266 -30834 -91205 -12955 3144 11803 146795 30254 -2755 -57605
7287 -57605 -164137 -52558 -168533 -203849 -109264 113494 168493 206041 353398 15259 31136
7276 31136 36252 -70538 -129837 -184675 -188135 -20036 22137 -211090 -213454 -13296 -179084
7265 -179084 -314300 -192069 -22164 -127898 -92394 15954 -149553 -488203 -486485 -231828
7255 -231828 -280465 -329076 -373304 -310572 -53820 -39838 -176798 -39160 151494 -21539 -208444
7244 -208444 -150555 -9049 -26652 38611 -56231 -116593 -301638 -373245 -282855 -439094 -308299
7233 -308299 -45423 1138 7568 167604 141454 51201 48619 -170022 -52944 201656 240333
7222 240333 10555 87728 232983 126927 65330 -204836 -486748 -555376 -264272 -77643
7212 -77643 116730 66052 -196966 -341901 -153872 -103445 -279621 -406246 -84862 192950
7202 192950 43297 110351 360826 428536 248848 -72937 -144792 16883 -148929 -123421
7192 -123421 -179916 10746 195557 353837 588439 384144 256306 -1008 -120202 -117709
7182 -117709 -22238 -86104 -372199 -591607 -524558 -545816 -339225 -145901 128678 125317 77917
7171 77917 182254 203726 -61024 -81643 -153718 -396980 -122584 326675 468158 31463
7161 31463 -243309 -263694 -242333 -230132 -326229 -413981 -409739 -369292 -379745 -363058 -240184 -280467
7149 -280467 -332311 -148327 63110 -97000 -22081 47289 -56189 77670 -11670 -56719 23458
7138 23458 66707 16380 -248248 -363368 71696 97232 -56187 32099 -60731 -68573 -205846
7127 -205846 -382554 -412062 -160634 -171712 -255529 -290416 -343931 -242145 -342752 -205975 39547
7116 39547 74221 -13412 -440312 -483992 -549304 -618482 -418151 -278892 -344304 -345819 -325404
7105 -325404 -258826 -153732 -84111 3123 -82947 15059 137397 234954 171935 63370 70670
7094 70670 85571 3446 -107497 -144891 -122533 -14713 26935 282263 232822 197971 237646
7083 237646 216872 279655 315214 151298 310632 584132 516464 92697 124459 190622 90056
7072 90056 47250 172005 143295 -50202 -189157 179993 507160 506471 425248 374083 40832
7061 40832 -233747 -230451 -221628 -121314 -9376 50457 -37141 49693 -37430 -76818 -240908
7050 -240908 -98095 89293 211161 387444 315042 203540 161821 17155 30240 156144
7040 156144 -5145 -111619 -126017 -114961 -98425 -216328 -70575 90706 15163 -174094
7030 -174094 -331857 -240648 -57669 -146707 -29573 242756 187296 122942 95341 146290 181167
7019 181167 60865 105276 346781 341441 80952 228782 10496 -187387 -304979 -218546
7009 -218546 -190435 64653 233864 59936 38700 211364 381625 125723 181524 -104873
6999 -104873 -184749 -117537 -227822 -206653 -305416 -421479 -324871 -134990 10948 196643 396017
6988 396017 263816 -69511 -109439 -185729 -198789 -300040 -300700 -134614 -163132 -170790 -273038
6977 -273038 -136061 -163197 -387345 -213948 -92251 -103074 32998 113354 170957 275015
6967 275015 124772 69634 -67779 18674 7498 -181056 -349303 -357048 -345070 -237810 -221683
6956 -221683 -166274 -48580 169250 408204 245175 20954 -6022 35978 41768 -214606 -474223
6945 -474223 -394283 -500028 -290308 -107200 -396945 -375652 -420141 -267563 -170916 -47388
6935 -47388 87659 -18386 -51158 -93270 -103622 -295184 -203805 -138572 -188397 -81333 -58484
6924 -58484 121474 71325 -45435 -90542 -421744 -708589 -556872 -213274 -68111 -96056
6914 -96056 -27321 85520 -95469 -286586 -375949 -342915 -234759 -276450 -307242 -133574 11613
6903 11613 15264 -98514 -213750 -405142 -463605 -190772 204100 175949 15954 -50455 106141
6892 106141 339426 236955 -32967 -165891 -22230 -42738 -40235 -263124 -284384 -286665 -244957
6881 -244957 -234210 -92110 69958 -172374 -47904 -72304 -144397 32790 47907 -13752 -26498
6870 -26498 79143 -2036 -318622 -322116 -158740 237745 357064 269354 200251 246843 136709
6859 136709 80015 220223 232859 9717 -72443 -116090 -90649 261134 522154 746767 490996
6848 490996 243240 97792 80140 -6548 -232513 -360097 -293845 -189967 -622 176626
6838 176626 213342 401803 209211 -1492 -45950 42469 154485 183791 358574 214663
6828 214663 328767 474647 626059 526368 285155 -12280 -48871 -169647 -178690 -291494
6818 -291494 -280902 -166920 -169096 -222989 -189557 153952 156296 167803 209364 282119 268127 9274
6806 9274 53241 84841 160693 268660 469921 193455 -76187 -107804 -79276 -92915 -182547
6795 -182547 -293486 -298750 -345198 32014 144501 -14241 14831 50990 -108133 -207585 -223979
6784 -223979 -389045 -254320 -405491 -366085 -223071 -80743 90221 -23396 -145498 -172883
6774 -172883 -122571 161919 48775 -220895 -241487 -233904 -171041 -277337 -354036 -131756 -100439
6763 -100439 -77336 15726 -20427 5159 -29514 -19846 182512 219146 15574 -97201 -98535
6752 -98535 112665 70180 129740 121909 36147 -75036 -210081 -247267 -51096 -187046 -28962
6741 -28962 35341 112197 177711 125358 -28679 -102111 177880 185153 68251 -142392 -196677
6730 -196677 -349231 -249920 -227657 -225724 -116873 -196404 -271114 -338876 -265551 -261900 -211788 -153744
6718 -153744 -100773 -157878 -107270 -376370 -428968 -316350 -221528 -402177 -240943 12869 36351
6707 36351 206855 228002 214332 111173 201814 -18886 -137265 125379 -90346 -210227
6697 -210227 -87844 -151762 -245917 -154707 -51159 35800 -41983 -18652 71908 95409 132384
6686 132384 236093 385304 311568 455621 331421 216648 195439 408679 508284 484121
6676 484121 460390 162374 91672 69187 -72007 -311025 -334651 -375192 -422871 -250038 -56816
6665 -56816 80518 239758 165970 180831 156785 142237 1917 21270 148134 35083 -13304
6654 -13304 19735 123949 57996 66866 270285 216336 97957 114270 -58450 -282846 -224373
6643 -224373 -277986 -343062 -503165 -407434 -351577 -111967 96362 51244 -98162 -281979 -328375
6632 -328375 126433 341250 432275 318391 154279 -77521 -107252 -177212 -140354 -128793 -24277
6621 -24277 39784 -196931 -239947 3664 144494 235059 228660 106204 46341 90910 151607
6610 151607 18277 49172 72588 -30448 -164784 -54147 -77329 137434 174737 157771 137702
6599 137702 -58186 -132432 131595 166847 209319 284773 56390 -111784 -297914 -23777
6589 -23777 139944 150726 194481 274229 1090 -130947 19826 55341 -10675 -159286 -206986
6578 -206986 -208014 -86029 64782 112999 -85910 -234710 -80597 -196557 -61774 11938
6568 11938 -79328 -6534 -84943 12333 85380 141499 149325 165574 168384 -3727 -135872 -443816
6556 -443816 -426671 -325051 -272339 -191732 -92284 -265432 -177297 -59440 -131920 135490 384938
6545 384938 281349 -112395 -68259 23687 -205204 -461047 -519696 -203634 10444 153151
6535 153151 101579 -122405 -261140 -272575 -448985 -351972 -129169 -2813 138761 178234
6525 178234 -73078 -226258 -95129 77667 143098 81869 -158413 -195111 2615 119997
6515 119997 12865 -62578 -182809 -29654 -47905 -265488 -214379 27864 129565 48161
6505 48161 267230 375440 301137 66154 -160502 -262255 -172397 -175106 14257 -7781 -250065
6494 -250065 -262815 -305609 -423911 -225181 20944 74089 7993 264986 379941 369414 380046
6483 380046 105479 84644 115299 -105751 -191074 -226245 -248074 30823 -70159 -206910 -243469
6472 -243469 -102413 -143255 -176931 -384740 -428346 -205488 -192875 -312892 -179886 -199102 40685
6461 40685 237739 21057 -404602 -343140 -345345 -223737 -81971 -123614 -110813 6481 -148822
6450 -148822 -82559 -124640 -65099 59062 14913 237051 335135 179586 181937 397867 428081
6439 428081 212224 109884 -96683 -163316 -225239 -150547 -234902 -146841 -25129 -76034 -92582
6428 -92582 -155170 -208028 -250658 -248889 -181334 -293181 -202178 -284279 -387479 -441073 -300178
6417 -300178 -261032 -303463 -210466 -166499 -293298 -253686 -312135 -251887 -98219 -18372 88990
6406 88990 33748 -76044 -59116 -286306 -418207 -297467 -193172 6051 -7582 -104244 -540418
6395 -540418 -773143 -464439 -377180 -424496 -246328 -248022 -224171 -10290 -97400 -233103 -103017
6384 -103017 41083 -44342 -290485 -284286 -287961 -435900 -543407 -505276 -388361 -426999 -477070
6373 -477070 -550303 -390295 -137443 -35574 -101442 -76858 -42656 -95362 -180118 -224374 -234286
6362 -234286 -331882 -282762 -142311 -231763 -367575 -259098 -353746 -402408 -371669 -165836 -13582
6351 -13582 -67327 -159078 -284230 -213535 41754 70072 77949 77505 -11677 71172 209039 -8111
6339 -8111 -12177 -111058 -315126 -158125 -121030 -367507 -338721 -142275 51941 25301 33991
6328 33991 -52062 -239206 -219634 -85586 -52182 71756 -59803 -69013 -109750 -168263 -240817
6317 -240817 -234087 -155353 -142755 40669 199319 253995 167669 -47753 -300555 -314931 -411556
6306 -411556 -639156 -521104 -342179 -373875 -431417 -390002 -383238 -361324 -339105 -68358 187631
6295 187631 -187380 -559563 -616466 -355099 -120588 -45214 -153849 -65772 162524 137020
6285 137020 38094 -77672 -172747 -13150 79838 -13734 -28524 52695 163716 -74074 -40025
6274 -40025 100239 -110979 -225697 -191689 -181915 -182843 -185509 -68318 44207 236840 208284
6263 208284 52267 -77408 -379305 -201241 -258015 -311641 -177866 -20748 210565 239838
6253 239838 -50427 -39020 -114897 -114960 -145464 -373369 -692562 -626274 -285999 -180044 -43301
6242 -43301 -8177 -338091 -480603 -357614 -39771 -64649 -165580 -144957 -304793 -409107
6232 -409107 -281301 -175131 -574 26627 161742 156203 194152 303985 141529 -15055
6222 -15055 -128207 -172169 -159477 -388042 -227497 38549 -130198 -176272 85342 101835 -15225
6211 -15225 78985 157817 226464 -74104 -267299 -231445 -214463 -244919 -104672 -249736 -101143
6200 -101143 -104223 -457291 -395494 -248893 -246210 -170619 -214408 -218329 -223237 -332219 -363315 -231691
6188 -231691 -115393 -61275 45165 -101009 -46945 -135120 -106524 56502 -32441 90361 5673
6177 5673 -173127 -99387 11071 -101633 -12640 164824 152804 57734 3002 -38841 -113898
6166 -113898 -110051 120170 343607 366420 107546 37889 165891 233084 434242 276505 -156712
6155 -156712 -439672 -433899 -98960 -246935 -199015 -247505 -327326 -271048 -89199 -233574 -243691
6144 -243691 -152804 -70522 2547 112942 351221 355118 343996 290756 34549 -35979 99727
6133 99727 222078 63726 95428 222103 321424 161125 20541 121297 180900 2857
6123 2857 -158406 -86752 -80452 -131034 -464158 -489746 -205988 -281887 -297289 -370270 -257389
6112 -257389 51684 15222 5149 140739 453352 565169 373881 85134 -79631 -87202
6102 -87202 -156690 -92738 -270993 -315101 -280801 -477549 -515275 -382207 -299171 -189582 39438
6091 39438 107256 -75430 -200916 -64940 -50475 28897 34931 -145100 -142670 -39772 -138237
6080 -138237 -57690 -25137 -212995 -455635 -550513 -524673 -702111 -525125 5751 260387
6070 260387 241492 45476 -41218 -19675 83110 121590 260923 172873 -125562 -352492 -324881
6059 -324881 -404573 -442457 -253090 -288453 -170977 -15014 -49136 -32674 -30372 -116454 -51141
6048 -51141 148750 176920 186160 333621 126333 73597 159036 282715 151690 98855 18627
6037 18627 49169 120909 149125 223827 173919 86699 75683 -40509 -55758 -59514 -78088 49954
6025 49954 290626 115201 -21072 -58812 59800 345349 449414 217608 234247 406674
6015 406674 376516 312892 492535 591242 422543 -75694 -167525 -236493 -113169 -75960 -4861
6004 -4861 18689 -55591 -13897 36399 164738 -154838 -219221 -77910 -27782 -191827 -271497
5993 -271497 -81413 -147910 -50379 -82137 -184695 -225318 -75826 -73560 -140471 -115402 -76955
5982 -76955 -49903 -30402 -111949 -149134 -183841 -183383 42608 128812 120715 237144 -11728 -178488
5970 -178488 -344540 -169677 -240140 -258633 -113500 -117940 -211292 -184564 -59579 -122403 -88186
5959 -88186 36569 -156351 -168001 -179697 -165247 -343603 -306969 -276267 -355425 -443423 -297813
5948 -297813 -75211 -143195 -216257 -127299 -109343 27435 81572 -71516 -175033 102 292748
5937 292748 158581 -33741 -225681 -269705 -348177 -288903 -237351 -200231 -395579 -478014 -225141
5926 -225141 57310 121140 25692 14135 -89949 -277029 -437925 -464931 -396376 -121554 202021
5915 202021 230176 -2061 20484 3305 -36986 -216696 -269259 -387652 -282307 -312252 -381818
5904 -381818 -256231 -140452 -97530 -168606 -175737 -281865 -184379 -139593 -195370 -369862 -453572
5893 -453572 -389378 -345629 -232027 -402243 -430878 -351112 -362631 -276629 -140489 -62767 -208854
5882 -208854 -309339 -258228 -296873 -499226 -615028 -265426 140430 478 -173830 -447498
5872 -447498 -422058 -23319 201669 -113951 -268963 14945 240509 184374 -12532 -199186
5862 -199186 -386884 -375785 -539619 -550102 -331709 -53001 -74567 -5149 -54100 -114128 1427
5851 1427 -112271 -185150 -128001 157807 274799 -6253 -202455 -69937 -2081 56355 -45047
5840 -45047 -21756 76871 173375 223256 73818 151849 79083 -75396 -115528 -115730 -270317 -308800
5828 -308800 -383335 -142412 182716 130511 40258 -20260 -183791 -136135 -19886 -96940 -185092
5817 -185092 -308826 -521770 -383239 -252564 -151313 -318404 -499060 -509539 -345753 -301545
5807 -301545 -130121 85634 3127 69500 -80245 -49386 -104342 -208010 -5740 -302362
5797 -302362 -348928 -206981 -240848 -119881 32271 -165853 -124420 65643 150916 138464 -4617
5786 -4617 -7854 -96419 -191656 -160921 -145133 -167574 -87751 -147456 -136328 -156721 -344332 -253139
5774 -253139 -355763 -168684 -25561 -77501 -383343 -337059 -277369 -328949 -385460 -485364 -231916
5763 -231916 2367 -241439 -403349 -401904 -260585 -171825 -453465 -489763 -347394 -201945
5753 -201945 -12451 -162468 -115567 -139023 -341530 -148696 1483 -57076 -2448 122734
5743 122734 -75391 -159809 11891 233336 249027 134695 26513 -46998 179760 156306
5733 156306 32877 14261 -41502 -157870 -86907 -198545 -439192 -391907 -231015 -252728 -432900
5722 -432900 -497883 -614422 -482045 -257152 -274429 -45846 -84040 -141816 -319726 -299302 -255096
5711 -255096 -210491 -433154 -524612 -576065 -417199 -25730 -56258 -132367 -141668 -286395 -306275
5700 -306275 -241273 -160694 -125002 -3916 67864 -28704 -141347 -453480 -387695 -201250 -36764
5689 -36764 -255460 -354128 -406832 -380922 -222597 148066 134049 -75181 -209991 -423366 -452889
5678 -452889 -483340 -328620 -198351 -261643 -90284 202764 364466 381424 212715 183487
5668 183487 113969 214394 3450 -102030 158120 136190 -102449 33429 62938 98064
5658 98064 -105041 -401294 -678399 -822908 -690381 -302919 -179685 -121739 -109402 -285128
5648 -285128 -82648 27261 209653 114981 3697 -119438 -206198 -186323 -31290 -150851
5638 -150851 -442342 -398883 -189604 -32609 -159804 -184572 18293 -29937 -185825 -177433 -154685
5627 -154685 -66489 48332 -121582 -349174 -288816 -199077 -194875 -325279 -227302 -80723 -42276
5616 -42276 -262533 -186231 -153109 -29067 118264 13404 115815 153441 30615 -32593 105477
5605 105477 75517 79098 41347 96519 89778 135298 131246 -204030 4566 1190 -80156 -76052
5593 -76052 -119182 -284180 -377544 -271952 -3320 211596 352296 188196 164525 78293 61567
5582 61567 -59615 -89722 -65023 -47428 74792 323984 338246 202353 96425 -94619 181958
5571 181958 494433 480262 169635 -87830 -117241 -170358 101950 291389 111559 93083
5561 93083 -119512 -206397 -318649 -306364 -22723 291617 206698 163233 65976 77990 -395
5550 -395 1863 -86084 -165458 -89975 -125886 -372869 -241619 -13526 43650 69995 20127 28675
5538 28675 136123 -59001 -88755 -110664 -44397 -46849 31817 30882 176703 104210 18182 80476
5526 80476 115946 256059 307473 136465 315244 405387 159651 -13625 -170862 -306681
5516 -306681 -376530 -227217 48327 -109958 -216127 -165128 -128746 -267371 -62103 -131826
5506 -131826 -321259 -360817 -380988 -427225 -87110 -14477 132110 -4747 -275419 -260843 406
5495 406 64622 40055 1334 -10825 113146 31412 -179681 -46794 -126850 -342864 -292511
5484 -292511 -218926 -167931 -14811 103656 169935 189518 -286816 -410742 -58372 87970
5474 87970 233940 306981 155814 169642 264283 44383 105748 143088 85445 312919 420110
5463 420110 460014 628763 325851 141668 -51785 -316444 -307817 -444758 -616857 -429678
5453 -429678 -137901 22049 181350 202789 66846 123812 208638 134299 -118562 -360648
5443 -360648 -315777 -466215 -344463 -235836 -132209 4293 -283407 -329953 -601433 -639903
5433 -639903 -284699 -260026 -252599 -209515 -300612 -414813 -549577 -508883 -404025 -131338 74203
5422 74203 22891 57121 216348 245503 -16369 -238316 -307619 -133386 21692 207149 86982
5411 86982 -127074 41783 -30752 -135420 -97660 -174383 -82537 -86511 -238488 -254882 -284397
5400 -284397 -364707 -333256 -306080 -230630 -230301 -155023 5292 335661 368114 75809 -165420
5389 -165420 -240688 -475153 -378118 -162992 -171680 -301404 -143878 137309 166115 -27608 -61643
5378 -61643 -234050 -319611 -245371 -343193 -332880 -293548 -207027 216021 405579 -27366 -318846
5367 -318846 -446869 -239230 -181297 -186879 -210589 -129520 2786 -76368 -179656 -266035 -274743
5356 -274743 -316052 -253056 -307493 -292746 -78931 67572 9787 112871 237537 322456 241617
5345 241617 194112 107099 -196230 -223112 -239248 -548914 -435885 -534433 -469445 -218301 -310806
5334 -310806 -267196 -117810 -4263 -14339 -105167 43480 303458 205027 -64514 -179027
5324 -179027 -66359 169581 273334 239022 44484 1638 -87572 -369 16687 76986 -44242
5313 -44242 -130542 -143590 -19319 5072 -135904 -129868 139269 95890 -60332 -303645 -215109
5302 -215109 -22989 -225041 -363830 -71777 167476 80272 148548 36931 137209 194613
5292 194613 136338 276947 57083 -18519 -51956 88274 156177 26610 -49764 -172772 2603
5281 2603 81595 -40974 32183 69251 -12456 -37098 147457 196740 70333 -81507 -73155
5270 -73155 -110546 -196211 -138501 133413 189446 211284 271543 177364 124287 -14483 -210261
5259 -210261 -252811 -206724 -55178 -212752 -316277 -310026 -268501 -155705 103426 264961 215558
5248 215558 205651 139495 197369 423760 390245 406642 308458 80031 58692 -82607 -216118
5237 -216118 -119141 86958 234598 166981 -14952 -25775 -173080 -95504 37466 174445
5227 174445 -15099 -130590 -37546 -63404 -316396 -442703 -434275 -491420 -411190 -1352 223062
5216 223062 -87018 -209023 -161093 -178542 -192818 51964 138134 181121 79332 -231957 -310499
5205 -310499 -485715 -395506 -198509 23500 -85986 -288964 -31606 189993 20259 -45110
5195 -45110 -196652 -165899 -109061 132406 191553 231906 321602 197310 47142 62886 84014
5184 84014 113919 139946 128877 -43484 -186810 -247532 -273860 -282538 -350678 -591029 -708172
5173 -708172 -417671 -286517 -505519 -665152 -819497 -711416 -669356 -598611 -243344 -103656
5163 -103656 -210012 -446047 -420047 -351555 -586989 -618599 -511593 -369389 -360140 -338317 -241878
5152 -241878 -379983 -440039 -359838 -331521 -252227 -140475 -140990 -166130 -335100 -227572 -340663
5141 -340663 -302130 -168929 -177318 -379284 -478983 -266392 -250321 17096 6476 -193593 -199557
5130 -199557 -194160 -163711 -171899 -152990 -97061 -34384 13061 -96337 -49368 -175175 -237522 -76509
5118 -76509 -35933 7241 245532 63112 -177931 -257344 -52629 37978 45744 -182738 -278711
5107 -278711 -126037 -126515 21738 103083 39818 -1582 4056 -139355 -66928 -106870 -144056 -89054
5095 -89054 -327460 -278575 -187192 -269239 -365583 -188622 -151477 -150240 -417860 -634496 -792501
5084 -792501 -628577 -402131 -179320 -115471 -204969 -101802 -173259 -177043 -168608 -41913 -57964
5073 -57964 -24936 190490 -59268 -190251 -150900 -121435 -97878 -184376 -252562 -36423 70074
5062 70074 18937 -131416 -272507 -168184 -207907 -228388 -387505 -568960 -330446 -133395
5052 -133395 -130440 -144248 -143270 42820 125536 -129062 -114408 -115497 -92728 -168505 -263861 -420944
5040 -420944 -360991 35368 -117579 -347418 -471709 -407214 -308411 -362959 -179575 210805
5030 210805 324248 250909 116989 -298096 -180279 2768 4349 -85269 -223447 -374015
5020 -374015 -459500 -368365 -410284 -450130 -369894 -350646 -147404 52423 40467 -51472 -263152
5009 -263152 -241948 -332616 -210598 -437592 -529300 -527799 -455739 -429921 -585450 -648741 -662886
4998 -662886 -662387 -661206 -521822 -520666 -275105 -151589 -119788 -335501 -600262 -504355 -461668
4987 -461668 -314237 -138721 -158014 -282172 -403186 -296948 -232704 -274420 -321148 -143307
4977 -143307 264048 412599 255792 46500 121398 142653 56274 -22250 -127205 -102145 -134962
4966 -134962 -26021 63816 15974 -361883 -439784 -42458 94300 152133 -8368 79936 253033
4955 253033 217087 187209 220500 -22097 -144165 -159134 -113800 -94237 -202904 -35455 -6589
4944 -6589 -66320 -91203 -44962 -141335 -185478 -110588 104671 216874 178823 73864 160269
4933 160269 259877 -60432 -276699 -363285 -269396 -205023 -359061 -373980 -85076 27251 -61166
4922 -61166 42848 74125 43175 -73401 -139218 -159802 -128849 -124187 -84179 69071 -23529
4911 -23529 -271037 -357225 -344252 -439600 -607658 -645964 -593356 -365444 -59773 -72295 -299340
4900 -299340 -329561 -210028 583 -20317 -85301 4569 184810 124029 -87121 -160600 -310687
4889 -310687 -451397 -100598 26937 -154422 -98066 -137200 -268853 -307493 -357400 -286940 -297508
4878 -297508 -365654 -253344 -109850 -273353 -325442 -398852 -623067 -668599 -290994 -151167
4868 -151167 -210717 -299216 -78884 175539 78871 -118964 -245245 -362087 -323664 -158924
4858 -158924 -203854 -369869 -355740 -313108 -290361 -355260 -397361 -190634 -136989 -201202 -148311
4847 -148311 114318 236809 78767 -62424 117004 175051 194435 153436 74343 63020 99630
4836 99630 162264 74451 156091 221737 452360 414866 421237 530903 579008 511493 357788
4825 357788 321800 345617 306423 181695 45245 -94375 -140631 -161155 8786 144158 363365
4814 363365 42964 -328052 -362678 -295010 -241911 -126051 153037 274903 156823 19573
4804 19573 105769 121882 76643 -21221 -121376 -278157 -414078 -364496 -218461 -128155 -152379
4793 -152379 -132626 -41859 -61965 -210736 -381239 -380474 -261556 -145506 -144812 -126375 -316163
4782 -316163 -431878 -374357 -247901 -101485 63905 128818 -233212 -429880 -251735 -91334
4772 -91334 -234781 -226241 -11960 125176 -553 -166303 -58589 153005 -52629 -94782
4762 -94782 -169492 -344922 -511928 -581823 -496085 -341331 -109376 18456 46683 -89734 -59736
4751 -59736 200835 62751 -92198 -123113 -230918 -208030 -396324 -456484 -385243 -315658 -264624
4740 -264624 -133777 -164984 -180137 87231 182911 202914 187875 -128157 -238322 -266852 -194829
4729 -194829 -171474 -145994 -199845 -366878 -421182 -378718 -446364 -369666 -350572 -160269 6811
4718 6811 -37824 154143 26153 -109266 -133060 -289797 -363757 -274691 -190162 -314371 -99648
4707 -99648 -6010 -168419 -237855 -131313 209344 245786 124264 79759 94459 32749 145203
4696 145203 116753 265917 458987 514396 355423 343171 345053 267889 222844 196267 19496
4685 19496 -70133 -74032 -145056 -88337 49244 104070 175361 196060 137895 193800 55752 -150345
4673 -150345 -213020 -195951 -180766 -252411 -212319 -255412 -16148 27610 -199170 -56899 61727
4662 61727 155025 87366 -33881 -40560 -44663 -106364 -99462 145462 78019 -160053 -140633 -51769
4650 -51769 29245 35160 -128304 -153915 -109991 14933 272782 352532 62122 26140 109367
4639 109367 59967 -155093 -278537 -78211 281850 198573 -56478 -77504 71424 -6887
4629 -6887 -79620 176657 260292 -21763 -82596 54859 -2908 -11152 -39340 3730 -134479
4618 -134479 -379328 -515054 -514711 -437555 -291131 -402692 -354107 -430011 -286112 -40260 -23453
4607 -23453 -13851 -135537 -146669 -166993 -246284 -114866 -113609 -297944 -384933 -322205 -202825
4596 -202825 -209920 -128430 -144080 -216611 -129298 63013 298274 349878 154160 -82815 36422
4585 36422 -194171 -313329 -433848 -297539 -333734 -375861 -431138 -415695 -263454 -151616 -84667
4574 -84667 -147312 -119520 -46389 8971 42395 -107836 -164062 -120441 60580 219220 158665
4563 158665 -9575 -20570 182361 26738 -4039 -143925 -136376 -51894 -70236 -3719 -306152
4552 -306152 -477873 -313204 32684 -44480 -115646 -132127 -183476 -136326 -102966 6844 140268
4541 140268 109470 -49266 -142319 -37203 -168106 -305092 -428845 -465127 -427014 -308616
4531 -308616 -126681 -144018 -241757 -509554 -288080 -264284 -230877 -230569 -237119 -437440 -557565
4520 -557565 -551049 -313756 -163203 -94403 -156445 -189067 -218420 -66815 -81775 -176320 -219293
4509 -219293 -290349 -219732 -129594 -50185 -70732 -13452 100164 224877 190740 5195 -15284
4498 -15284 45919 -224010 -480993 -249943 -245877 -197967 -68494 -18629 -34950 -114777 -252562
4487 -252562 -137400 -191157 -45198 86379 -74234 -338285 -308911 -20501 123216 113744
4477 113744 -27752 -8098 -124506 -197207 -232238 -242204 -121964 15129 102110 26512 -156458
4466 -156458 -76901 -19169 -135896 -141128 -140031 -122225 -15642 125559 109644 22020 41952
4455 41952 56072 -7684 36813 -70546 -131711 -154595 -236100 -188839 -74841 202891 -32182
4444 -32182 -328376 -288905 -443679 -409801 -292666 -284648 -311895 -96433 -51955 65520 -93908
4433 -93908 -272004 -204574 -79918 56819 -57147 -74630 46589 -231654 -294640 -233064 -48357
4422 -48357 -167331 -446668 -558912 -354788 991 -32327 -157531 -122852 -377112 -407658
4412 -407658 -181772 -233242 -43533 87119 80539 -109605 -217357 -245414 -125566 -145500 3328
4401 3328 76235 -130060 -237323 -430741 -357352 -272140 -355832 -390761 -110980 100110 97095
4390 97095 -162028 -44341 209433 240137 83128 -19349 -135992 -268321 -376963 -264500
4380 -264500 -302248 -228988 -164541 -93190 -223299 -173627 33347 50945 86449 210059 -147573
4369 -147573 -372297 -374820 -349084 -351149 -243767 -239445 -317618 -247610 -441579 -444603 -331641 -216250
4357 -216250 -194473 -102234 -273934 -91503 -37692 -282175 -341576 -333209 -302145 -144906 -132811
4346 -132811 -143223 -123148 -174909 3734 -136894 -410766 -422908 -312962 -102039 45032
4336 45032 -37021 52171 -75899 -131551 -289128 -306192 -318014 -367856 -174803 -73765 -210098
4325 -210098 -494306 -414396 -286565 -245072 -281037 -266651 -251518 -287682 -45564 -43097 -135396
4314 -135396 -179537 -69110 -70892 -5201 132909 -7561 -217098 -158674 -189742 -49914 156460
4303 156460 -39256 36293 -178790 -339160 -481398 -546522 -592969 -625569 -654843 -579658 -350661
4292 -350661 -72556 -53013 -132999 -27462 -5573 68480 -36542 -159212 -88158 -149391 -331032
4281 -331032 -410209 -203769 -201853 -138051 39455 70276 -9291 -187024 -215183 -179802 -129062
4270 -129062 -55347 -113523 -110396 7288 91729 -15023 115547 241907 -27722 12671 -62536
4259 -62536 -348170 -188516 -353167 -382130 -218777 35360 204385 58790 -26874 77868
4249 77868 65552 -76612 -252407 -213037 -331145 -275038 -189825 -253159 -84762 30352 3466
4238 3466 207301 438959 354228 88801 30002 -68773 -71030 -124320 -116418 58493 155719 157448
4226 157448 -96307 -78119 77199 231752 111048 141361 -126414 -298143 -349937 -128897
4216 -128897 119273 189516 27503 -343029 -507977 -474186 -468990 -505871 -548561 -276073 -51949
4205 -51949 -89191 -238007 -252177 -393238 -367674 -150559 -348678 -252659 147898 397787 577254
4194 577254 508516 143427 -41681 -201056 -453453 -430151 -299405 -263433 -327463 -246980 -34653
4183 -34653 -193712 -221084 -44917 71181 71935 151191 118374 68366 -108044 -144907 -156076
4172 -156076 59533 111973 403398 378829 81970 -171602 -109753 108092 335852 41355
4162 41355 109260 153455 280863 219404 1553 -5727 129462 181184 238691 240889 87550
4151 87550 95360 332724 -16470 65082 304245 265370 -149962 -343932 -474689 -661466 -588592
4140 -588592 -248061 22473 12959 -134921 -492729 -547056 -327493 -270357 -188639 -425661 -505835
4129 -505835 -415261 -130675 -91240 -310012 -351348 -185921 -44179 -11266 -13400 82995 2574
4118 2574 -181628 -329303 -389318 -369794 -220393 -125214 -125625 -231927 -202839 -35878 50406
4107 50406 152679 -39220 -70993 247982 542543 531040 273726 108613 172665 99565 -76127
4096 -76127 -214293 -168110 -290166 -371086 -419796 -352229 -306038 -410858 -221918 -256551 -246943
4085 -246943 -242873 -199604 -250610 -279991 -222014 -250791 -317036 -234641 -78173 -46660 142493
4074 142493 131386 150348 62724 1089 -95098 -253046 -298145 -450608 -447418 -228187 -176446
4063 -176446 -78953 -144424 -307986 -310564 -379907 -465052 -413214 -326352 -161515 -270449 -318770
4052 -318770 -250981 -177863 -208278 -80088 54390 -83543 -340489 -293199 -21183 149221
4042 149221 134955 -136314 -384282 -309295 -320465 -305760 -267245 -460214 -355248 -249558 -307825
4031 -307825 -352120 -173676 -236128 -242969 -83114 254512 256432 367073 190952 55622 -57978
4020 -57978 -15961 117219 35825 -236191 -104184 -54248 -192534 -257565 -348688 -149141 -16196
4009 -16196 -243610 -168006 -175844 -115315 -227813 -341687 -637709 -585961 -402534 -339126 -224462
3998 -224462 -221306 -440594 -427669 -631440 -615118 -468496 -345109 -73172 -250108 -334293 -186267
3987 -186267 -192431 -322984 -411335 -413589 -338613 -214359 -253448 -290175 -207480 -178599 -236106 -249461
3975 -249461 -246818 -13126 119846 218080 276309 223607 327588 284262 193936 -44593 -236604
3964 -236604 -105604 -204286 -319896 -246387 -103962 -75950 121386 180330 -74641 -7296 -137452
3953 -137452 -74457 252599 440023 243068 142077 -16549 -33488 -24986 -183132 -85473 -61352
3942 -61352 -150157 69607 128034 -42667 24817 240445 379003 403142 196230 153791 161089
3931 161089 295023 433566 554120 371119 366850 159470 109186 131007 8341 -138569
3921 -138569 -460976 -453901 -445031 -257894 -105999 -92736 -271810 -361143 -227706 -300966 -78886
3910 -78886 133674 201113 124523 -26968 -94712 -42378 -331525 -217792 -200443 -172146 -3679
3899 -3679 -34719 -61744 -173929 -176996 -246463 -175211 171463 287916 384254 192322 3002
3888 3002 -185727 -381665 -541438 -401304 -109086 -78834 -41218 -5680 -86003 -156030 22650
3877 22650 -2367 66861 77636 136719 63090 -33365 -165987 -206292 -384449 -402633 -218149
3866 -218149 -43804 80945 -74314 -299636 -398018 -354246 -376662 -346607 -468845 -437472 -369151
3855 -369151 -322357 -234842 -159711 -235205 -238607 -175480 69835 264603 16326 -123042 -8233
3844 -8233 -25338 -45624 -53091 -117236 -338150 -125145 131447 13984 -96392 -104098 -248394
3833 -248394 -382811 -96603 -28441 52000 170216 295621 195215 -52112 -85990 -52685
3823 -52685 -231475 -176922 17122 -93149 -357842 -340289 -274376 -278212 -246080 -383953 -244158
3812 -244158 -262845 -234202 -45090 -202373 -25095 -27882 -78370 -220537 -301136 -502610 -403840
3801 -403840 -276978 -303524 -238018 -182285 -55502 -54740 -134872 -63110 24547 6855 -150956
3790 -150956 -323111 -133626 -143222 -289101 -460672 -529194 -611109 -574278 -249356 80177 194403
3779 194403 123036 -32031 -66591 -104817 -72299 -45037 194182 360873 217351 83764 80541
3768 80541 -4310 -100886 -187397 -68205 142912 362827 236425 86473 71766 113654 923
3757 923 -162323 -116820 -30344 -49020 -257033 -220294 -86302 40367 -50425 -215340 -364670
3746 -364670 -613430 -255899 -105143 -130845 -103259 -171204 -337170 -312096 -215623 -143029 -274969
3735 -274969 -251573 -298544 -182461 -400227 -361160 -264899 -208373 -59715 71881 11420 -1447
3724 -1447 -263604 -181832 10484 -65224 -248131 -369866 -346688 -122294 -66066 67289 304342
3713 304342 474239 441330 313884 245568 100203 22505 123231 -99595 -260507 -194433
3703 -194433 56775 6184 -122149 -139899 -193022 -142015 -56215 -119414 -286930 -308630 -324773
3692 -324773 -445089 -733254 -702410 -475057 -359680 -123146 33717 -59032 -17057 -52748
3682 -52748 -110129 9077 -25573 -71010 92398 182997 22633 17717 -149131 -76211 166157
3671 166157 -68510 -357188 -244368 -161672 -154757 -8334 -69475 -109112 -197620 -187044 53498
3660 53498 53699 126652 70659 27714 33518 186489 40241 -48387 -38950 82314 116503 114880
3648 114880 223531 421603 270686 138714 -50734 -73656 34455 -4758 -164626 92482
3638 92482 439828 365893 207502 187439 191540 111910 189638 105807 -67586 142357 307970
3627 307970 -63316 -259320 -335846 -208809 -142015 -41036 -376893 -267179 -143203 -180166
3617 -180166 -250755 -267880 -147635 -30029 -43102 -420313 -653619 -522896 -291325 -246141
3607 -246141 -185496 -321952 -446743 -306875 -407083 -321086 -169362 -252219 -256963 -267108 -402349
3596 -402349 -708018 -514202 -606600 -543640 -438166 -238352 -407041 -572269 -414696 -123538
3586 -123538 78496 183462 126335 84837 -50365 -148289 39849 112674 10162 -91439
3576 -91439 -218233 -170162 -16709 261455 396921 326904 395036 420197 378008 -81902 -476656
3565 -476656 -380804 -346820 -251073 -149212 -96376 58579 -90538 -316896 -146526 -160593 -114698
3554 -114698 -21808 1386 182398 114851 -10637 127703 178312 46148 -8410 -254767 -377834
3543 -377834 -237125 -94519 -192757 -27845 -4276 -49930 -169783 -245770 -450396 -569476
3533 -569476 -356505 -112458 -172631 -128719 -80769 -10340 164194 -20359 -36592 5002 -100673
3522 -100673 -314372 -545455 -449254 -228729 -263006 22735 71165 48758 -8548 86353 20909
3511 20909 -49634 126827 235704 58171 -33348 -121929 -97833 -293022 -176757 150660 302087
3500 302087 117318 -144949 -128535 30128 235513 167262 91685 72979 137348 -144313 -252244
3489 -252244 -149821 -138929 32603 134897 277543 274924 218757 54938 -91941 17486
3479 17486 106598 209272 126568 -46175 -121508 -146541 49880 134191 147208 -111867 5737
3468 5737 -40294 -202094 -397583 -259100 -152127 -222838 -369516 -303935 -259058 -131125 181596
3457 181596 341945 194003 192596 100783 -86987 -7508 -130211 -264170 -226704 -97389 -99476
3446 -99476 -135616 -198461 -373315 -445477 -126624 188261 170794 114554 101854 123358 -120840
3435 -120840 -171136 124414 -85550 -163671 -127921 -225665 -302152 -54739 -86518 -153979 -199234
3424 -199234 -165626 -291201 -122791 -60961 -154815 -255921 -131626 -196989 -183946 -102083 -137608
3413 -137608 72171 154133 158783 145685 40327 46306 163588 278357 63725 118424 15140
3402 15140 -116781 -281810 -483951 -245148 -90303 -43092 -180952 -340758 -629081 -572832
3392 -572832 -435682 -241656 -92078 -153443 -43743 6192 100765 34053 91663 14572 -60108
3381 -60108 -42620 102201 131563 14475 -27379 -56809 -264989 -267952 -139816 -150971 -220482
3370 -220482 -363064 -312037 -33861 -150622 -525376 -429031 -4596 90860 115609 300600
3360 300600 195874 -98840 -147790 -204562 -158864 -213567 -91242 -107961 -212612 -286990 -21823
3349 -21823 91149 -35454 -206228 -291353 -311163 -278743 -144592 -115878 -53019 -126686 -150249
3338 -150249 -633 200919 76582 -77878 38831 183715 223657 89222 -146414 -105508
3328 -105508 28914 -27700 -99490 -145452 -229176 -103120 -264900 -298923 -56308 -131358 -217185
3317 -217185 -83050 -51574 -20323 -207745 -315122 -117939 80083 130016 33510 -177109
3307 -177109 -237012 -152610 67563 172196 270305 377563 525387 535951 331192 146409
3297 146409 102949 78800 -38898 -85091 -248066 -362014 -512895 -566959 -317206 -84515
3287 -84515 -167283 -231970 -157146 -337699 -466796 -287769 -135838 -126404 288856 470394 521770
3276 521770 373147 32219 -125884 -140850 103509 228978 249781 326443 204055 171098
3266 171098 295551 400201 336641 67314 -45358 -69236 -116496 -129213 -8272 183326
3256 183326 147478 24639 98876 229748 249951 152611 58449 -15171 -53811 -87208 -63139
3245 -63139 -6915 -174808 -91537 -31972 -175125 -613044 -551313 -336063 -260544 -69841 -17644
3234 -17644 -126622 -17576 -61559 -377993 -497707 -553501 -610637 -381373 -354630 -275074 -116557
3223 -116557 -214352 -221288 -195842 -61106 -51866 -160334 -141879 64032 201519 179134 224416
3212 224416 132486 -50522 -151690 -228105 -181776 -230866 -249628 -252427 -377703 -456579 -522191
3201 -522191 -419569 -550739 -521685 -77081 -163059 -320806 -290511 -243377 -258410 -190206 -67767
3190 -67767 66942 -138844 -262116 -165989 -55923 99009 -212358 -227429 -58942 -236333
3180 -236333 -286969 -182644 -180573 -149954 -405856 -361848 -358550 -224906 -59231 -62194 -150980
3169 -150980 -285397 -27447 140371 172781 102163 192993 269650 116441 -215540 -152908 -161372
3158 -161372 -69939 -152994 -114781 224404 256400 247993 146518 174845 128258 -126068 -154817
3147 -154817 -61286 104359 115776 60398 -10908 -42420 -190156 -177127 63546 213499 119316
3136 119316 -153695 -160720 -21101 -7742 -44174 -116354 8815 2899 146355 292013 250066
3125 250066 82934 -20749 135526 148063 -306944 -417459 -340902 -360614 -343376 -369105 -258475
3114 -258475 -169787 -5286 65517 -275757 -470019 -318496 -195647 -363201 -323085 -122774
3104 -122774 -136917 -158778 -213510 -230594 -369388 -32240 149541 -107904 -207068 -253603 -336491
3093 -336491 -138991 -206221 -269470 -207906 47731 159330 -134803 -330471 -304299 -197295
3083 -197295 -452439 -708415 -557097 -140030 134102 61807 102813 84544 -108929 -255919
3073 -255919 111711 207917 120254 -63246 -211610 -140807 -209098 -225350 -212241 -226384 -184848
3062 -184848 -193907 -150432 -232930 -115611 -310340 -274807 -111946 34560 151570 212245 57687
3051 57687 148913 269128 -12512 -171675 -63261 205695 284528 115626 -218230 -287751
3041 -287751 -315422 -316634 -335406 -253358 -419798 -661185 -692539 -534029 -334726 -156430 -70218
3030 -70218 -86541 -417838 -545193 -377714 -191917 -45532 159984 34375 -174713 -397520
3020 -397520 -523731 -320165 -36146 -16998 144205 337601 264759 175730 352291 319096
3010 319096 218191 238015 180933 84679 -29574 -41165 116153 194341 191380 211661 244023
2999 244023 27270 9785 76840 -234435 -374996 -351977 -340320 -378230 -326057 -133818 -169753
2988 -169753 46349 170623 -96065 -106732 148643 160164 -41030 -93113 -211532 -233361
2978 -233361 -330511 -371511 -275955 -236825 -289038 -514814 -581633 -444225 -313728 -202317 -85622
2967 -85622 -72347 -283617 -369193 -224622 111612 57915 -265319 -248393 -135368 235615 527972
2956 527972 433339 152778 -87429 -408695 -527745 -360599 -139602 47692 78929 -137274
2946 -137274 -125857 -74235 -169021 82598 -63733 22681 256462 355090 390358 288055 -6699
2935 -6699 -207931 -311740 -481971 -251665 -209440 -247356 -142640 -116084 -294046 -217014 -71455
2924 -71455 21625 -21678 -345089 -485555 -447782 -224881 -279534 -446534 -332517 -132181 -315432
2913 -315432 -490079 -328608 -291455 -478368 -318308 -224016 -234976 -109124 -60563 -157140 -260569
2902 -260569 -186729 -36196 -62323 -147430 -32988 68264 45898 -34912 -17787 -177382 -435893
2891 -435893 -511605 -297387 -38098 56339 6471 31645 43814 20089 44097 82838 -47839
2880 -47839 -183382 -253830 -492265 -613485 -551790 -294704 -404816 -383596 -159193 -78361 12308
2869 12308 14986 213196 138762 -221852 -370449 89952 317104 337697 249379 151433 114618
2858 114618 167346 8092 194990 225957 15093 -24769 26360 26468 192015 326905 39490
2847 39490 291651 330766 22762 -252582 -283837 -409176 -416151 -299849 -96751 89768 -182798
2836 -182798 -210914 -132518 91418 292965 101472 -236297 -403666 -333288 -158214 -231411
2826 -231411 -125851 165535 231024 4993 -240304 -190941 -221920 -367875 -9170 382879
2816 382879 152754 -129308 -339309 -480624 -300591 -263194 -279159 -95778 71005 86657
2806 86657 161722 -26495 -206661 -168853 -122249 -208801 -274250 -300583 -197809 -110927 -18070
2795 -18070 -4125 145872 288372 365135 335703 476425 504355 380088 234547 -161009 -106797
2784 -106797 -31695 -7888 -203060 -274667 -324840 -132766 62593 274630 388884 351333 229713
2773 229713 175254 258723 257479 346762 252897 141144 245247 125518 145067 308267 81508
2762 81508 9574 75713 59226 90169 186185 34 -9918 -55160 -30884 -192476 -185654 -103817
2750 -103817 59066 140539 -12616 -20223 324642 490496 534925 247520 9755 -128327
2740 -128327 15635 102245 253161 163264 -115346 -220534 -82782 -10635 48479 189015
2730 189015 242549 -94806 -456958 -349311 -179670 82848 84832 157365 27530 -33076 -167901
2719 -167901 14036 -100136 -6555 282070 335927 54170 -348635 -49867 374786 490082
2709 490082 343830 228614 126053 75192 168264 233065 -1693 -278831 -157831 32948
2699 32948 -110497 -42521 61983 -66574 -223604 -103506 -106583 57181 -68517 -181680
2689 -181680 -115049 -170376 -376999 -118876 -34130 -37985 -295466 -207885 -41377 -111721 -168709
2678 -168709 37233 -65481 -9838 161106 184430 -63595 -111159 5415 221302 36395
2668 36395 -287786 -55128 263464 245759 270035 186314 8570 -134350 -168255 -308823 -298386
2657 -298386 -270221 80133 262245 265925 75160 9045 -19086 -134444 -417602 -516925 -93125
2646 -93125 307818 122447 -58679 -80872 40154 98120 51413 -166466 -146801 -145668 -107926
2635 -107926 -123177 -147251 142700 264115 212536 336235 231585 143723 91322 110160 10478
2624 10478 -111823 -130317 130265 148222 27227 -16169 75500 106646 33156 -7709 -157905
2613 -157905 -23183 143647 192135 -13046 -155602 -196321 33924 193732 296394 198397
2603 198397 -25800 -275611 -148277 35616 24883 -29767 10337 49643 53844 81768 -34514
2592 -34514 96611 220380 141657 -128616 -168475 -127634 23509 207454 200772 148946 133847
2581 133847 304286 235944 241984 213558 131548 -1337 -177105 -167145 -185853 -459143 -560940
2570 -560940 -420371 -263920 -356965 -124527 26942 80857 112366 165628 -59827 -267174
2560 -267174 -58382 -10594 -125023 -229873 134487 376193 251419 73578 76350 63238
2550 63238 -125599 -178484 -276793 -197335 -52343 -1400 -110875 -29036 58093 -35683 -202883
2539 -202883 -350051 -287530 -8495 192073 263309 253923 194138 78853 -93193 15370 281989
2528 281989 110567 -11046 -72777 -147354 13117 191954 226616 307552 107335 -139823
2518 -139823 -257929 -196154 -318811 -351074 -249580 -165195 -177520 -160869 -456252 -556245 -435075
2507 -435075 -479822 -683435 -646562 -519025 -272404 -34199 -158061 -338504 -302365 -188694
2497 -188694 -27962 210338 83480 -282991 -427926 -221060 -139300 44382 9687 -52
2487 -52 -49802 -117762 -150285 71458 54927 85858 98684 141877 261655 273239 246581 568198
2475 568198 686954 623859 219524 -146551 -150292 -76728 -17483 -312188 -371511 -166144 38326
2464 38326 136313 164706 270145 87184 -391625 -492656 -313344 -181997 -401292 -516408
2454 -516408 -410145 -443326 -395389 -25006 -139148 -229284 -293033 -382270 -291534 -153937 -1533
2443 -1533 -73681 -104635 11502 262974 289586 256617 237822 150258 -31074 -123062 -46633
2432 -46633 152656 118053 33860 93136 34501 -157233 -251645 -115981 113656 47441 5384
2421 5384 -139763 -227068 -291233 -346180 -430250 -554699 -498633 -394807 -276526 -152939 -122380
2410 -122380 59138 145072 87617 58934 48320 82746 205246 309225 204294 275037 234635
2399 234635 101844 44236 -43769 14676 65360 117686 139947 116642 2366 -66781 102084
2388 102084 126497 184722 197663 111792 129710 112491 -67072 -202073 -46065 -67562 -264674
2377 -264674 -236971 -345293 -680278 -590673 -537998 -318937 -144330 -77358 -282601 -158897
2367 -158897 161440 209219 102369 55480 65971 -907 103200 190247 -135743 -261391 -168845
2356 -168845 -95189 -86444 26999 -70309 -151754 -113433 55171 98647 111297 189436 167652
2345 167652 112948 192865 -91588 -144350 56572 -42458 -97374 5987 204246 112647 29006
2334 29006 114991 103420 -76757 -153653 -346260 -289758 -295615 -120664 212962 349580 445567
2323 445567 449957 327531 312417 202190 -101690 -283265 -327571 -124757 79838 -23722
2313 -23722 -259251 -7070 200245 291466 355626 339572 151317 59104 19153 -37702 78546
2302 78546 1201 205971 266265 133120 159872 149081 -41376 -222931 -43183 -166457 -476098
2291 -476098 -492605 -562341 -333769 -191641 -198874 17211 -97740 -110056 -217658 -469656 -598992
2280 -598992 -321484 -84004 -22331 -7751 159235 -184725 -274411 -274063 -153039 2213 185250
2269 185250 356912 256050 123015 -127458 -270116 -125390 -183062 -190101 42421 42193 109265
2258 109265 80058 207009 300954 325319 450009 458527 500692 397328 105740 -60055 -141222
2247 -141222 -201774 -128603 -69400 -39046 -216232 -60481 -33553 46847 84731 135921 -7687
2236 -7687 2649 90514 160344 211638 412548 428557 243432 118328 76480 137997 144233 137796
2224 137796 66722 -103034 -370062 -275967 -15985 65522 212190 308066 357374 305505 155823
2213 155823 76478 -33426 155249 260103 436754 270811 229965 113665 47169 -217589
2203 -217589 -232348 226312 331687 141403 -18429 -1844 -21052 -99287 -60091 -103794 -223268
2192 -223268 -326008 -187674 -118116 -166206 -109833 40018 -57534 -72297 -1010 -75424 -47982
2181 -47982 -111757 -464719 -219695 -56933 40137 159324 80697 12123 86233 -34721 -53390
2170 -53390 23450 217687 123585 -146801 -29103 116251 231286 -17415 -62249 37260 248369
2159 248369 426818 546884 516940 485995 479150 424614 231220 4083 -37837 -8707 -37549
2148 -37549 -203390 -92515 168947 214722 151552 20867 133231 267995 369614 266188
2138 266188 6802 -7395 16509 174147 -45807 4810 -112347 -55408 -41037 95595 63142
2127 63142 30161 126058 204529 136918 275852 305023 269849 232605 179532 211833 -32289
2116 -32289 -223345 166990 337427 66781 -156296 122237 431943 288551 445433 767729
2106 767729 767784 702479 611024 445422 264635 35802 -137114 -109143 -266530 -67335 112867
2095 112867 132794 177381 254895 44871 -106774 -80004 -103590 43721 95908 44196 178093
2084 178093 381371 297161 209936 238998 371248 249977 27161 -146187 88519 314825
2074 314825 28346 -211988 54571 145620 120644 23850 -283703 -134886 -101194 -212672
2064 -212672 -196979 -26163 24138 12088 -141370 -279765 -527408 -591628 -389095 -379113 -388978
2053 -388978 -533498 -487807 -339692 -260138 -286229 -90069 57639 11846 84571 -19777 -17542
2042 -17542 112867 101334 35300 -36283 222861 184213 139101 58769 26724 159620 419663
2031 419663 376757 162658 138119 378645 332891 -54317 -378325 -475860 -261149 -184107 -285484
2020 -285484 -373239 -379112 -383681 -213441 -212974 -222291 -284658 -42597 203398 66916 74600 19985
2008 19985 -52118 20787 191587 263236 41072 -72891 40618 87330 148566 105260 98054
1997 98054 261296 455769 518768 326840 184319 265955 172519 -152870 -30157 51367 83363
1986 83363 228229 184491 -176661 -269450 -130989 -108564 36064 -299161 -318718 -180678 -178438
1975 -178438 -131527 -185144 -111298 73674 299077 493119 223788 93486 105769 333239
1965 333239 563651 503746 191338 -170774 -135749 13372 224119 335408 250680 17193
1955 17193 -44526 -128495 -220940 -379136 -204309 182182 428056 320324 69463 79769 171014
1944 171014 219661 350636 337741 54638 -106262 -94710 60770 161135 189406 246479 71239
1933 71239 31241 96755 237489 423971 186173 -314505 -182424 -43950 -109560 -66574 -150483
1922 -150483 -144263 121275 397847 507654 301045 318272 207272 59651 -103008 -231656
1912 -231656 122004 275256 -85354 -77189 113693 157447 88582 53574 22446 81630 119002
1901 119002 70713 59175 83278 178043 312366 455269 392570 84012 71545 80050 -55538
1890 -55538 25551 -1945 107643 88130 -130931 -186360 -246246 -106245 -116740 -221752 -342223
1879 -342223 -307206 -28412 273656 408093 546264 365358 275527 163642 52887 220547
1869 220547 208164 212594 307085 92826 -19132 106323 -26511 28882 121422 149686 291613
1858 291613 350717 141762 106065 61926 -27933 14979 144635 168784 241273 135240 -102489
1847 -102489 -554122 -701975 -479263 -352988 -453178 -454525 -345678 -222986 -86867 -66150
1837 -66150 195173 262684 319930 196435 19755 16797 -67115 113589 163793 104082 302247
1826 302247 356991 224642 -115594 -197478 78929 157147 -80862 -137857 -80799 77923 152554
1815 152554 113464 255136 215463 285597 158223 236476 286191 -53439 -304337 -203911 -40971
1804 -40971 112756 -194997 -266185 108411 285320 265218 253207 181826 -8974 62679 -34958
1793 -34958 -129108 -111966 -23456 232678 152083 -160322 -375510 -234267 -131711 -271823 -67227
1782 -67227 89218 21766 100341 25584 296648 493190 316543 339846 393749 234258 -169995
1771 -169995 -284519 -163348 -116235 172094 389561 300210 68636 -71622 153428 77472
1761 77472 -312930 -505640 -419005 -181949 76979 131397 121496 27168 -51442 -153189 -18238
1750 -18238 261805 272600 123320 173100 520320 652183 488592 288150 345750 449249
1740 449249 208232 5129 -18690 53991 200386 273011 -10447 -19357 258750 -7329 7044
1729 7044 84017 -102577 -171752 17139 188771 470702 450537 436063 263559 25515 -10857
1718 -10857 175735 62038 96142 66389 43720 -69644 -275874 -369940 -397910 99264 215553
1707 215553 92071 240934 148340 41386 183324 115215 -154255 -396424 -228019 154268
1697 154268 105606 -293466 -283881 -27139 63378 366214 456866 380654 311015 93242 -171154
1686 -171154 -40394 -80053 -141010 -152764 -90380 -26312 84080 105755 -88060 -337592 -280092
1675 -280092 -236896 -183994 -200298 -444571 -424226 -300998 -276941 -351635 -252617 -286340 -299127
1664 -299127 -176242 -41628 218733 402152 240977 -67738 -112698 133275 221862 539137
1654 539137 663046 385011 -43740 -106420 -26530 -99087 -52305 103911 294968 375491 401248
1643 401248 273249 301229 410745 435072 529873 666979 619981 405083 243941 115264
1633 115264 -191569 -277143 -81058 18727 22369 150203 228993 409912 273377 -127932 -173267
1622 -173267 52375 281476 141788 168150 194452 196885 32247 193924 128467 -77012 -250093
1611 -250093 -159013 -52755 26819 34494 -141769 -107303 -157595 -111580 106592 134173 208205
1600 208205 92855 9822 66059 317253 408272 266970 132118 82102 112846 164850 200581
1589 200581 192181 127944 -77894 -310972 -74438 35880 251681 188068 -10711 -10159 75203
1578 75203 156178 165770 216822 280042 198729 170691 7648 -61919 -124512 -138844 -110639 -39535
1566 -39535 97441 318332 235368 248967 329636 260829 6536 -138338 36968 165387 139021
$$ [...]
##END NTUPLES=NMR SPECTRUM
##END=
