##TITLE=Analysis number 313428
Compound Code cc 47801
Book Reference 458/8
Project Code adrs
Chemist Name stevem
##JCAMPDX= 6.0         $$ Bruker NMR JCAMP-DX V2.0
##DATA TYPE= NMR SPECTRUM
##DATA CLASS= NTUPLES
##ORIGIN= Bruker BioSpin GmbH
##OWNER= NMR
$$ XWIN-NMR		Version 3.5
$$ Wed Sep  7 13:49:08 2005 GMT Daylight Time (UT+1h)  MAYBRIDGE\NMR@NMR_250MHZ
##.OBSERVE FREQUENCY= 250.131544655141
##.OBSERVE NUCLEUS= ^1H
##.ACQUISITION MODE= SIMULTANEOUS (DQD)
##.ACQUISITION SCHEME= undefined
##.AVERAGES= 16
##.DIGITISER RES= 18
##SPECTROMETER/DATA SYSTEM= dpx250
##.PULSE SEQUENCE= zg30
##.SOLVENT NAME= DMSO
##.SHIFT REFERENCE= (INTERNAL, DMSO, 0, 16.522)
##AUDIT TRAIL= $$ (NUMBER, WHEN, WHO, WHERE, WHAT)
$$ ##TITLE= Audit trail, XWIN-NMR		Version 3.5
$$ ##JCAMPDX= 5.01
$$ ##ORIGIN= Bruker BioSpin GmbH
$$ ##OWNER= NMR
$$ C:\u/data/dgb/nmr/ADRS/9070/pdata/1/auditp.txt
$$ ##AUDIT TRAIL=  $$ (NUMBER, WHEN, WHO, WHERE, WHAT)
(   1,<2005-09-07 13:48:29.99 +100>,<MAYBRIDGE\NMR>,<NMR_250MHZ>,
      <created by zg, POWCHK disabled, PULCHK disabled
       configuration hash MD5:
       62 19 C7 07 E1 42 D1 B7 37 6C 3D D0 77 39 F9 E6
       data hash MD5: 64K
       51 60 DE 8D 0B 26 A1 54 FD 09 73 E0 E4 E6 F5 BC>)
(   2,<2005-09-07 13:48:47.33 +100>,<MAYBRIDGE\NMR>,<NMR_250MHZ>,
      <Start of raw data processing
       ef LB = 0.3 FT_mod = 6 PKNL = 1 SI = 32K 
       data hash MD5: 32K
       6A 1D A8 A6 9F 6A 0B A7 96 31 38 DE D5 88 17 3C>)
(   3,<2005-09-07 13:48:51.88 +100>,<MAYBRIDGE\NMR>,<NMR_250MHZ>,
      <apk 
       data hash MD5: 32K
       5A 27 C5 AA E8 B8 AB 2E EE 18 39 E7 BC B2 F7 06>)
(   4,<2005-09-07 13:48:53.33 +100>,<MAYBRIDGE\NMR>,<NMR_250MHZ>,
      <abs ABSG = 5 
       data hash MD5: 32K
       11 4D 94 82 50 89 EC 34 47 D3 DA 9C 20 81 F3 11>)
$$ ##END=
$$ 
$$ hash MD5
$$ 20 8A 1F 20 7F E0 E6 94 0E 60 27 87 68 76 E2 A9
##$RELAX= 
##$RELAX= 
##$RELAX= 
##$RELAX= 
##$RELAX= 
##$RELAX= 
##$RELAX= 
$$ Bruker specific parameters
$$ --------------------------
##$DU= <C:\u>
##$EXPNO= 9070
##$NAME= <ADRS>
##$PROCNO= 1
##$TYPE= <nmr>
##$USER= <dgb>
##$AMP= (0..31)
100 100 100 100 100 100 100 100 100 100 100 100 100 100 100 100 100 100 
100 100 100 100 100 100 100 100 100 100 100 100 100 100 
##$AQSEQ= 0
##$AQ_mod= 3
##$AUNM= <au_zg>
##$AUTOPOS= <24 >
##$BF1= 250.13
##$BF2= 250.13
##$BF3= 250.13
##$BF4= 250.13
##$BF5= 500.13
##$BF6= 500.13
##$BF7= 500.13
##$BF8= 500.13
##$BYTORDA= 1
##$CFDGTYP= 0
##$CFRGTYP= 5
##$CHEMSTR= <none>
##$CNST= (0..31)
1 1 145 1 1 1 1 1 1 1 1 1 1 1 1 1 1 1 1 1 1 1 1 1 1 1 1 1 1 1 1 1 
##$CPDPRG= <>
##$CPDPRG1= <>
##$CPDPRG2= <>
##$CPDPRG3= <>
##$CPDPRG4= <mlev>
##$CPDPRG5= <mlev>
##$CPDPRG6= <mlev>
##$CPDPRG7= <mlev>
##$CPDPRG8= <mlev>
##$CPDPRGB= <>
##$CPDPRGT= <>
##$D= (0..31)
0 1 0 0 0 0 0 0 0 0.06 0 0 0 0 0 0 0.0002 0 0 0 0 0 0 0 0 0 0 0 0 0 0 
0 
##$DATE= 1126097308
##$DBL= (0..7)
120 120 120 120 120 120 120 120 
##$DBP= (0..7)
150 150 150 150 150 150 150 150 
##$DBP07= 0
##$DBPNAM0= <>
##$DBPNAM1= <>
$$ [...]
##$SUBNAM7= <"">
##$SUBNAM8= <"">
##$SUBNAM9= <"">
##$SW= 20.6930455092707
##$SWIBOX= (0..15)
0 0 3 0 0 0 0 0 0 0 0 0 0 0 0 0 
##$SW_h= 5175.983436853
##$TD= 65536
##$TD0= 1
##$TE= 295.16
##$TE2= 300
##$TE3= 300
##$TEG= 300
##$TL= (0..7)
0 120 120 120 120 120 120 120 
##$TP= (0..7)
150 150 150 150 150 150 150 150 
##$TP07= 0
##$TPNAME0= <>
##$TPNAME1= <>
##$TPNAME2= <>
##$TPNAME3= <>
##$TPNAME4= <>
##$TPNAME5= <>
##$TPNAME6= <>
##$TPNAME7= <>
##$TPOAL= (0..7)
0.5 0.5 0.5 0.5 0.5 0.5 0.5 0.5 
##$TPOFFS= (0..7)
0 0 0 0 0 0 0 0 
##$TUNHIN= 0
##$TUNHOUT= 0
##$TUNXOUT= 0
##$USERA1= <user>
##$USERA2= <user>
##$USERA3= <user>
##$USERA4= <user>
##$USERA5= <user>
##$V9= 5
##$VALIST= <valist>
##$VCLIST= <CCCCCCCCCCCCCCC>
##$VD= 0
##$VDLIST= <DDDDDDDDDDDDDDD>
##$VPLIST= <PPPPPPPPPPPPPPP>
##$VTLIST= <TTTTTTTTTTTTTTT>
##$WBST= 1024
##$WBSW= 4
##$XGAIN= (0..3)
0 0 0 0 
##$XL= 0
##$YL= 0
##$YMAX_a= 244428
##$YMIN_a= -385400
##$ZGOPTNS= <>
##$ZL1= 120
##$ZL2= 120
##$ZL3= 120
##$ZL4= 120
##$ABSF1= 16.522
##$ABSF2= -4.171173
##$ABSG= 5
##$ABSL= 3
##$ALPHA= 0
##$AQORDER= 0
##$ASSFAC= 0
##$ASSFACI= 0
##$ASSFACX= 0
##$ASSWID= 0
##$AUNMP= <proc_1d>
##$AZFE= 0.1
##$AZFW= 0.1
##$BCFW= 0
##$BC_mod= 0
##$BYTORDP= 0
##$COROFFS= 0
##$CY= 12.5
##$DATMOD= 1
##$DC= 0
##$DFILT= <>
##$DTYPP= 0
##$F1P= 14.0000005364418
##$F2P= -0.99999901652339
##$FCOR= 0.5
##$FTSIZE= 32768
##$FT_mod= 6
##$GAMMA= 0
##$GB= 0
##$INTBC= 1
##$INTSCL= 1
##$ISEN= 128
##$LB= 0.3
##$LEV0= 0
##$LPBIN= 0
##$MAXI= 10000
##$MC2= 0
##$MEAN= 0
##$ME_mod= 0
##$MI= 0
##$NCOEF= 0
##$NC_proc= -4
##$NLEV= 6
##$NOISF1= 0
##$NOISF2= 0
##$NSP= 0
##$NTH_PI= 0
##$NZP= 0
##$OFFSET= 16.522
##$PC= 1
##$PHC0= -87.44774
##$PHC1= 8.456561
##$PH_mod= 1
##$PKNL= yes
##$PPARMOD= 0
##$PSCAL= 4
##$PSIGN= 0
##$REVERSE= no
##$SF= 250.13
##$SI= 32768
##$SIGF1= 0
##$SIGF2= 0
##$SINO= 400
##$SIOLD= 32768
##$SREGLST= <1H.DMSO>
##$SSB= 0
##$STSI= 32768
##$STSR= 0
##$SW_p= 5175.98343685301
##$SYMM= 0
##$S_DEV= 0
##$TDeff= 65536
##$TDoff= 0
##$TI= <Analysis number 999999
Compound Code 99
Book Reference 9
Project Code 9>
##$TILT= no
##$TM1= 0
##$TM2= 0
##$TOPLEV= 0
##$USERP1= <user>
##$USERP2= <user>
##$USERP3= <user>
##$USERP4= <user>
##$USERP5= <user>
##$WDW= 1
##$XDIM= 32768
##$YMAX_p= 494777925
##$YMIN_p= -469023
$$ End of Bruker specific parameters
$$ ---------------------------------
##NTUPLES= NMR SPECTRUM
##VAR_NAME=  FREQUENCY,     SPECTRUM/REAL,   SPECTRUM/IMAG
##SYMBOL=    X,             R,               I
##VAR_TYPE=  INDEPENDENT,   DEPENDENT,       DEPENDENT
##VAR_FORM=  AFFN,          ASDF,            ASDF
##VAR_DIM=   32768,         32768,           32768
##UNITS=     HZ,            ARBITRARY UNITS, ARBITRARY UNITS
##FACTOR=    0.157963299565203, 1,           1
##FIRST=     4132.6476996994, 0,             0
##LAST=      -1043.33573715361, 0,           0
##MIN=       -1043.33573715361, -469023,     0
##MAX=       4132.6476996994, 494777925,     0
$$ Real data points
##PAGE= N=1
##DATA TABLE= (X++(R..R)), XYDATA
$$ [...]
27257 669619 655333 606798 572855 516159 503225 526084 532743 616722 639876 712190 666208 583584
27245 583584 632359 563515 457376 423072 446601 478081 446038 563994 667081 768658 765135
27234 765135 652878 630128 670934 663331 642825 650401 686224 661490 686244 660989 741933 731120
27222 731120 668485 603075 560241 499038 471119 472021 528664 530077 580009 678587 678257 682613 685362
27209 685362 645749 662412 690829 597660 615871 558460 512659 574751 526378 489511 433811
27198 433811 512069 503709 533927 539275 600100 584467 671684 683974 744013 711173 660688 634062
27186 634062 564359 559102 692398 843536 833094 753677 693214 746731 744839 775627 809605
27175 809605 726664 653744 764128 835952 872853 802619 828165 739019 642596 695240 767193
27164 767193 762026 747537 781637 768368 792236 749615 790551 822158 815669 784082 783906 796744
27152 796744 756738 843619 881583 820176 798005 753482 719135 728056 812333 833875 857753 819222
27140 819222 827472 786714 765900 785041 814749 841447 848143 885512 941959 944294 931484 906903
27128 906903 900853 838296 766687 751440 754528 770466 727779 738020 850638 940925 990908 980633
27116 980633 988513 1071194 1086486 1153378 1172893 1085157 1082949 1044939 974160 989112 903352 943702
27104 943702 990878 976829 1013869 1100040 1100164 1013296 901557 938868 1100833 1237813 1219809
27093 1219809 1159681 1153014 1157126 1059449 1037696 1146255 1128451 1104167 1032528 972831 997799
27082 997799 1025713 1102922 1143052 1112472 1108615 1178731 1236578 1239384 1289510 1301048 1249557 1245983
27070 1245983 1228972 1221810 1289989 1364256 1393480 1399331 1318875 1349520 1458026 1414885 1208742
27059 1208742 1164248 1155860 1205054 1275765 1294719 1366532 1365628 1301003 1281644 1286168 1330598 1446940
27047 1446940 1415691 1418776 1428777 1406208 1378015 1386514 1389861 1406896 1455569 1435444 1458683 1406590
27035 1406590 1448845 1479373 1460138 1427834 1449758 1487900 1476860 1355922 1313706 1398680 1560508
27024 1560508 1480238 1524354 1477004 1432824 1522354 1555199 1537128 1526338 1618755 1593443 1582987
27013 1582987 1513648 1484593 1586975 1644310 1666681 1697028 1686844 1739428 1818009 1807607 1732168
27002 1732168 1685226 1739089 1776073 1747669 1652666 1674504 1727906 1787994 1794820 1822164 1791379
26991 1791379 1751525 1670934 1558916 1623254 1732036 1706667 1694875 1816015 1869370 1832063 1793291
26980 1793291 1873885 2018040 2023853 2043603 1990984 1948534 1955305 1884573 1806063 1827937 1877487
26969 1877487 1972307 2024936 2102585 2096494 2090012 2014797 2005377 2070748 2195417 2180453 2089524 1988446
26957 1988446 2070117 2267167 2386777 2383997 2365485 2317007 2232164 2230626 2294891 2312655 2328940
26946 2328940 2277878 2259702 2297272 2316773 2276182 2254556 2260540 2287216 2381929 2424390 2465171
26935 2465171 2546721 2587540 2565525 2567778 2646610 2565698 2570603 2666653 2682396 2682874 2596356 2573840
26923 2573840 2575461 2592809 2621025 2583897 2548604 2543632 2648517 2642490 2587971 2602451 2774214
26912 2774214 2887506 2857665 2873389 2984768 3003483 2955449 2979845 2980799 2976771 2930082 2971121
26901 2971121 3007639 2977314 2968177 3029497 3053385 3122991 3163193 3197450 3188841 3212634 3247463 3232785
26889 3232785 3232754 3217325 3205713 3356156 3405129 3452389 3426496 3378320 3346643 3445957 3482414 3454876
26877 3454876 3403787 3436290 3454536 3496176 3509198 3456031 3461043 3443666 3584320 3610085 3596391
26866 3596391 3630091 3712334 3673514 3702321 3829999 3895291 3885070 3865191 3854209 3868185 3924370
26855 3924370 3855014 3882777 3877251 3786958 3867214 3941061 4035936 4052374 4034690 4056021 4104371
26844 4104371 4189934 4225293 4236105 4221197 4301452 4367154 4355441 4334518 4272278 4371230 4492454
26833 4492454 4460024 4413870 4511980 4587984 4564282 4567460 4684396 4629639 4595639 4655629 4675722
26822 4675722 4633880 4621530 4680977 4743534 4821638 4856415 4892860 4996319 5049873 5142390 5181186
26811 5181186 5102430 5066006 5027841 5093503 5161686 5161290 5173841 5162466 5198129 5248573 5211833 5194275
26799 5194275 5215350 5320471 5380827 5502648 5482592 5371240 5358988 5420106 5422363 5482333 5548456
26788 5548456 5621827 5602642 5539113 5552046 5658902 5694198 5647800 5629072 5711099 5897877 5879410
26777 5879410 5890405 5916257 5937069 5963379 5916831 5864152 5911822 5972634 5937922 5939916 5949303 5988249
26765 5988249 5960230 6009922 6038998 6097986 6100578 6095871 6053421 6066990 6038080 6139637 6116676
26754 6116676 6079308 6109228 6174053 6217924 6197321 6165431 6224655 6195000 6174424 6208855 6237947
26743 6237947 6247284 6152683 6177719 6249563 6255948 6263309 6259759 6312509 6374948 6357090 6276675 6282602
26731 6282602 6344692 6446193 6428332 6271210 6274361 6352125 6483267 6410210 6357882 6381679 6395717
26720 6395717 6419977 6452037 6489770 6499687 6510358 6576966 6541290 6516054 6518889 6498476 6433530 6355765
26708 6355765 6263906 6312270 6370814 6407848 6326736 6284575 6225022 6134734 6097583 6201267 6220313
26697 6220313 6219725 6229159 6191800 6262828 6235360 6196028 6134906 6153915 6077717 6041015 5996027 6106422
26685 6106422 6126564 6197418 6223604 6199014 6129506 6106490 6049648 6049390 5982748 5929624 6016755 5928045
26673 5928045 5902558 5875342 5869575 5886500 5925096 5859353 5722775 5740851 5801594 5746579 5792515
26662 5792515 5858021 5791207 5649807 5596357 5547558 5695597 5782299 5638745 5475532 5396757
26652 5396757 5361314 5314428 5334373 5263261 5327717 5373351 5279951 5300868 5289108 5287561 5288196 5225301
26640 5225301 5234927 5239328 5106737 5040860 5080862 5162172 5147773 5069163 5081229 4974164 4918607
26629 4918607 4858032 4822000 4855720 4823912 4768434 4740873 4715177 4676549 4645636 4623818 4646446
26618 4646446 4745332 4793810 4742303 4691109 4599010 4486962 4462275 4459425 4408508 4373940 4287535
26607 4287535 4261809 4148109 4146175 4182613 4251358 4263716 4230864 4149168 4109489 4134723 4153685
26596 4153685 4132706 4121843 4081567 4036987 4004485 3997062 4039634 3990099 3899203 3761686 3773410
26585 3773410 3814788 3835216 3786982 3736626 3700598 3770863 3851132 3783664 3645311 3617417 3622780
26574 3622780 3596154 3572266 3418962 3356313 3397915 3392017 3354177 3276004 3244078 3272401 3316087
26563 3316087 3300539 3220756 3369766 3393596 3379105 3392307 3337716 3200757 3139433 3078271 3155311
26552 3155311 3199584 3147581 3094492 3019750 3000773 3014784 2958408 2919920 2899799 2901472 2999458
26541 2999458 3013771 2917222 2875596 2842931 2820533 2806268 2833480 2896209 2872354 2764694 2720154
26530 2720154 2688949 2709182 2679616 2652875 2745828 2809548 2734055 2694192 2601756 2556898 2524242
26519 2524242 2497787 2480867 2527351 2490267 2597927 2648569 2612829 2560676 2566997 2557120 2409946
26508 2409946 2367239 2402257 2380569 2331549 2342461 2334039 2365564 2462814 2480445 2379056 2164857
26497 2164857 2122241 2193852 2225608 2252524 2230764 2186338 2233532 2228895 2131632 2077504 2085372 2092230
26485 2092230 2116546 2214295 2250845 2234245 2244189 2165045 2036783 2032890 2093860 2070511 1959111
26474 1959111 1844092 1767990 1779380 1917090 1968232 1903064 1782453 1800856 1888933 1947953 1873517
26463 1873517 1867629 1836197 1808725 1895985 1883974 1831213 1840265 1789852 1753771 1814118 1756840 1697301
26451 1697301 1717962 1638306 1678168 1675384 1635445 1648591 1608990 1599390 1620230 1674123 1689377 1648802
26439 1648802 1594907 1632214 1547856 1509615 1497522 1516874 1455177 1479711 1410571 1395334 1464223
26428 1464223 1531270 1585464 1583679 1454031 1421701 1450293 1432343 1392613 1299303 1420112 1498275
26417 1498275 1506716 1450349 1419573 1378893 1433970 1456259 1413702 1440379 1429076 1405028 1316493
26406 1316493 1318766 1337869 1328424 1372268 1351761 1306877 1285252 1315768 1321734 1302472 1414044 1462114
26394 1462114 1422800 1349857 1228469 1156662 1166340 1145326 1088737 1172110 1230129 1192723 1127506
26383 1127506 1117372 1155184 1196143 1183840 1118168 1087619 1058159 1064529 1094460 1020083 983413
26372 983413 1063326 1241556 1270085 1241106 1261316 1269665 1274305 1242874 1149585 1109923 1134243 1091657
26360 1091657 1067306 1092994 1097250 1037842 1030250 1029157 1044564 1054969 1039994 1130727 1166963 1139238
26348 1139238 1093793 994348 978554 1009441 1003102 993686 962698 999435 1116861 1099744 1028407
26337 1028407 980398 981744 992434 1015818 973431 989154 971753 954905 1044943 1093565 1053208
26326 1053208 985137 949708 955634 916510 833111 826051 879414 944049 895595 833364 870562 772075
26314 772075 722808 799931 780564 808709 965776 1077150 1017584 1017751 1035328 971157 980802 889351
26302 889351 811275 813473 863720 905500 846176 834017 775137 746584 818512 856706 771212 776527
26290 776527 867724 835545 777373 762084 847657 848549 819839 780661 754018 717560 598485 606009
26278 606009 656302 692380 822649 869042 821595 765066 713283 785367 866241 800022 778590
26267 778590 796592 769615 702677 771604 806259 754861 726534 902974 948633 858871 785137
26256 785137 659618 661811 823382 858918 724429 600475 630808 726546 717202 680020 711162
26245 711162 798617 785840 694267 674135 741867 688902 618723 603392 662873 538162 499348
26234 499348 576330 624195 626725 586457 660054 727149 742779 719618 664856 618002 617128 626732
26222 626732 655705 570491 598666 576765 557700 595523 687870 687320 595314 609704 632896 643735
26210 643735 750059 735358 602215 515089 457230 419919 394230 440516 510473 545712 493983
26199 493983 470859 447558 452537 533115 517031 474441 470455 426556 507212 530023 530660 528308
26187 528308 469589 396929 429950 525144 589045 601287 550074 518947 568072 620142 613521 533119
26175 533119 442904 356779 399091 447305 519939 532205 464713 363699 340461 364269 365691
26164 365691 328009 367430 290270 235468 247888 365123 446312 504344 574952 541906 510977
26153 510977 582220 559332 511671 451582 384985 340619 392232 448572 483975 473910 431866
26142 431866 495245 424688 419480 491369 501891 489930 448233 442551 433002 394434 300519 356310
26130 356310 385423 463767 490114 456272 396905 343454 202706 124240 234489 257013 300360
26119 300360 384278 365354 449737 509350 500796 407954 280034 272621 353608 409351 399185 435699
26107 435699 491820 382559 315625 329620 326214 205494 167820 287908 435777 541087 471200
26096 471200 362765 362691 271547 225474 254081 295308 200190 183940 313389 336323 371173 406667
26084 406667 359020 292264 240471 249355 287089 352526 289242 256213 298138 296274 333374 330404
26072 330404 242442 171727 121666 137194 256296 285218 272564 387460 441157 447893 423410
26061 423410 490221 497547 444754 421160 449991 538567 454349 243812 194780 301098 350469
26050 350469 335596 286234 236811 363494 435481 467719 481444 443320 373858 433313 453441
26039 453441 396214 438671 369096 340008 253575 236616 277424 272276 174336 198024 265551 322890
26027 322890 320581 357168 331068 362043 362600 421012 385449 315877 250903 314126 416758 373820
26015 373820 356007 374752 363516 345260 280106 265020 283239 288068 315559 364859 320905 318654
26003 318654 426100 393100 258313 234762 187177 241849 300343 361364 363802 320363 256676
25992 256676 282636 293022 258976 223967 161189 208866 228801 195183 154783 192758 280382
25981 280382 303689 148666 105858 89442 141052 106823 118931 214594 293658 346594 266838
25970 266838 253675 227238 245594 264062 204492 212196 184835 136352 135085 141898 197779 239890
25958 239890 261832 236735 282010 367056 387870 289559 221814 253594 196751 344262 423801
25947 423801 358801 309746 247230 211748 300349 289914 236070 262203 311009 303004 322206 318528
25935 318528 258993 208054 116371 196863 245960 137184 158747 190666 211906 320482 406591
25924 406591 366560 214858 164000 167364 211886 217624 216003 124596 26714 59495 183486 235260
25912 235260 212485 188470 143185 223006 287688 317851 325196 427613 396873 322635 252885
25901 252885 343293 379331 318027 225171 351011 512097 505299 367731 306924 290413 153922
25890 153922 128617 116450 182897 218394 216555 211038 264604 412182 396573 259413 126324
25879 126324 39507 198313 291578 235906 187206 148727 88855 154839 259913 256293 296375
25868 296375 294956 258657 192828 192580 181135 125215 20459 -2525 40899 -11426 -30093 22897
25856 22897 47470 102694 108638 35290 14276 103620 57274 3924 77713 87438 65683 126063
25844 126063 181856 202330 166469 108482 185552 320611 235835 180856 128717 174521 174906 158100
25832 158100 56625 22078 27483 56537 98184 117317 119728 181711 188155 238602 270072 221244
25820 221244 257957 219353 93047 49898 104453 236207 248226 262922 332428 277680 131896
25809 131896 124427 228508 223403 155881 122456 136032 169385 156215 148518 173712 211580 224334
25797 224334 228089 267698 260295 195917 143832 181119 96102 8964 36217 85841 165081 149726
25785 149726 -20472 -100275 34582 130354 137261 190013 263830 187986 184263 250970 210570
25774 210570 234055 195997 137362 80463 144664 135944 165094 215353 236759 226671 54581
25763 54581 30364 122999 133901 169072 157651 171842 197803 209151 107109 45287 30862
25752 30862 14962 14388 94317 109547 138195 139225 123885 138644 100444 134652 121572 75841
25740 75841 134990 137819 127556 92432 64413 122642 160839 127286 82136 27154 -1609 9301
25728 9301 161042 230976 235453 220554 159698 112174 145163 75349 -57605 -30424 70265
25717 70265 54416 63174 91653 120630 13512 -17769 94804 118735 83298 165731 177776
25706 177776 170947 107349 118503 167402 189711 109913 87185 152993 196536 220729 180816 135762
25694 135762 125903 99538 92175 160433 169416 99989 83703 67524 114400 199511 176294 143772
25682 143772 137226 55822 117637 161849 188200 112240 93728 135364 146987 67768 56398 132820
25670 132820 195965 198599 175939 115683 18068 59470 12663 9376 105071 160650 117923 114489
25658 114489 121644 233778 293350 366986 389441 297534 153868 103052 145823 185116 220446
25647 220446 253815 236935 104873 175711 240955 395009 447755 289001 277067 282111 268265
25636 268265 200197 44663 56412 176674 117805 103439 26798 117314 140578 204839 228608
25625 228608 229437 137195 93245 46983 55517 112696 103196 180646 208917 191618 139701 1979
25613 1979 9332 43471 8338 -4500 17806 21503 26719 20520 -19107 -26363 84322 155778 191715
25600 191715 153622 152531 171494 120063 193430 155234 208714 195815 190211 196932 125421 87256
25588 87256 84346 71790 83357 76904 106387 117238 95959 152900 122698 67009 50966 -14306
25576 -14306 19438 59371 49089 11278 -64149 -83835 -149634 -31700 73836 98438 15099
25565 15099 -9973 -41100 -700 48996 81057 -23093 -91787 -89262 -116575 -27836 94169
25554 94169 100462 12222 -3060 55396 54155 71718 112300 199744 210509 159442 74016 32382
25542 32382 58906 87969 131098 92841 7225 27818 7820 162159 269385 299368 282119
25531 282119 294378 157212 113848 59647 118408 20579 30292 44746 4340 22895 76864
25520 76864 112362 140348 127352 135499 146662 241192 314198 195084 47749 7015 -17172
25509 -17172 -3725 21217 13742 61578 159198 109265 -6160 -66551 33013 182864 103985
25498 103985 42137 76049 98967 2765 54057 201962 149548 -37132 39978 182335 207823
25487 207823 126218 145611 184678 184440 189623 17653 -45972 -36545 -18708 -801 38767 101784
25475 101784 141919 175995 157390 134699 164007 222498 190017 138089 169570 122586 92937
25464 92937 9042 -92008 -80961 30053 105322 209676 146066 99306 126272 125203 71942
25453 71942 42058 49784 50223 6555 -139229 -172476 -155901 -120589 -43679 -58738 -117488 -9813
25441 -9813 108798 149230 144975 215769 175129 117698 159462 162118 176211 143959 167439 69012
25429 69012 33756 2913 15349 -3456 -3517 22470 -5477 40306 93365 75597 20739 47363
25417 47363 9756 -39082 75766 156510 193863 132511 38989 48385 74913 103300 157488 121409
25405 121409 54373 -38107 -22621 10977 68063 42187 93371 132298 110100 40294 20557
25394 20557 69386 86560 87786 779 -103520 -52585 -4498 81856 124677 122108 61792 21491
25382 21491 -27580 29131 36744 64408 82544 58389 92791 88807 156881 157756 163508 165148 179844
25369 179844 210806 188430 62780 23666 13450 -96716 -86669 -83031 -49681 -61931 -37166
25358 -37166 -5814 1103 -26811 24935 -55040 -100890 -76280 -20856 21303 8578 31614 36130
25346 36130 -4788 20480 -80343 -135044 -145910 -85067 -88921 -97961 -67122 -5692 70969 185419
25334 185419 152598 100661 47371 13039 57623 84693 52208 32815 3744 108373 138787
25323 138787 169986 193940 143940 122102 67416 127680 157394 179261 156833 75239 74685 108024
25311 108024 59804 38223 103770 70658 -13586 -96759 -165529 -100287 -64822 16827 154052
25300 154052 188777 207914 198151 146437 94343 153177 169608 156091 110782 53470 39758 61811
25288 61811 25512 43279 124317 129795 114162 95363 131060 44110 -18329 6228 24276 -34329
25276 -34329 -82082 -60980 -73683 -53505 20617 -7116 -72936 -103081 -46041 80716 35750
25265 35750 -91501 -83406 -58182 -167953 -128300 -87675 -100012 -24842 -21143 -66656 -63980 -8683
25253 -8683 9137 28821 28814 60154 -39869 -30363 -1596 87118 93045 91229 12255 -28455 -88488
25240 -88488 28235 43145 -14811 8464 -25964 -73534 -98548 -53217 40824 91390 99431 124590
25228 124590 107607 53101 83632 47807 -13399 7863 47535 27006 7588 36177 19632
25217 19632 -60433 -146208 -160934 -138057 -137636 -190101 -65468 -30558 -110550 -71874 14574 81148
25205 81148 100769 100267 51182 84269 139738 104081 18726 60808 105334 77546 98865 129959
25193 129959 200115 178552 113430 138592 128695 104672 83659 110604 62788 -16774 5110 -32257
25181 -32257 4100 -13467 -20671 -42183 -16089 -119011 -143970 -152553 -187419 -120746 -83517 -56193
25169 -56193 67308 141086 129922 -20842 -153422 -55564 3597 2935 46439 108016 78272
25158 78272 53880 72094 24646 -58391 -53706 -42678 -16052 13720 51276 13768 -83101 -19229
25146 -19229 66195 96875 133472 118705 25835 83914 116407 189763 171846 71825 104319
25135 104319 8460 31007 41650 10497 -59374 -65271 -87215 -104432 -171860 -147535 -51202 -58183
25123 -58183 -142885 -219406 -174031 -52097 4156 11780 -57483 -86332 -133411 -142177 3491 -52518
25111 -52518 -113791 -75365 17930 76175 76893 143597 19939 -73698 -113442 -70037 -151269 -164422
25099 -164422 -143235 -96904 -75819 4433 -9220 -19222 -65432 -102210 10688 -19303 72132
25088 72132 64016 106235 163239 221357 175457 18611 -53210 87532 57634 -44232 36720
25077 36720 95894 111687 145962 246138 190118 -2983 -80488 -11760 -29076 -79958 -124498
25066 -124498 -94441 -49166 29094 16030 25118 36692 47594 -3531 37458 125791 225796
25055 225796 136417 127110 126795 189038 126966 -68119 -105543 -141364 -34866 -53994 33891 67586
25043 67586 548 15321 -10432 -43963 -52670 -78032 20875 18636 16972 -48281 -92607 -18023
25031 -18023 -39891 -108262 -159772 -48927 4101 7709 46042 -10883 -99474 -17790 -41890 56057
25019 56057 41397 -22530 -103871 -85444 -62768 -40157 23500 88589 204672 160034 16342
25008 16342 -51855 -20438 -57033 -51307 -46845 39856 130801 94305 -61354 -118832 -69747 -3448
24996 -3448 -51033 41566 65166 152416 237384 116029 -4383 -18619 19502 -52550 -123631
24985 -123631 -147294 -47084 35499 33463 -33101 -61554 -24695 -84036 -34850 49492 163436
24974 163436 118665 38759 12096 57537 104798 78633 -5513 -14522 39740 99124 146544 154802
24962 154802 137832 66355 17192 -97113 -31917 -14056 10558 -83322 -82225 -129620 -159839
24951 -159839 -106904 -61431 48987 98020 58451 55836 103288 43452 -52193 -96182 -164019
24940 -164019 -106146 1325 -15872 2202 -43564 -67811 -81712 -14329 -30649 -1204 -78776
24929 -78776 -161082 -117234 -9188 -29894 49484 87194 40100 51310 44128 26721 68216 35553
24917 35553 10094 -41203 -70976 -95132 -77697 -65589 -10004 -8378 70155 135038 160888 94110
24905 94110 51282 52522 27591 -16558 -60571 -81731 -59827 -7138 -7984 9582 70574 75701
24893 75701 98380 122485 124716 76219 10040 -32846 9554 77856 77267 40058 25323 44308
24881 44308 31353 -75334 -123534 -108785 -63165 -61301 -50553 -14502 -103877 -44326 50495 15622
24869 15622 49595 -6679 -56411 -90052 -201869 -209526 -175000 -156971 -86758 25905 82100
24858 82100 73960 87967 109687 56294 -44895 -38516 16999 -17421 -34791 -48786 -104204 -100149
24846 -100149 -61327 -22247 -50862 28856 95324 27233 -42412 -60972 -56687 -26599 20676 57458
24834 57458 -56703 -104123 -37406 57403 175378 265951 216095 92513 16976 8471 -51886
24823 -51886 -43250 -14347 -79977 -33966 -92251 -179378 -176143 -144316 -123270 -90912 -86730 -75181
24811 -75181 -54002 -106462 -114948 -26241 6689 -43042 -75863 -44419 -44545 -21868 23587 51180
24799 51180 1694 -1462 9782 -14901 14095 53557 29741 50106 88423 130902 32601 12528
24787 12528 -27861 -99053 -140240 -28294 59317 21709 17911 38675 37481 65740 -13881 -32680
24775 -32680 -102927 -24911 44236 26908 -83503 -150780 -143026 -152158 -185216 -158100 -234660 -240382
24763 -240382 -89066 17561 -36606 -106675 -56611 -103597 -55536 -73919 -201942 -144436 -91846
24752 -91846 17513 30110 52065 11250 56881 20000 36646 48633 -30543 -115659 -175440
24741 -175440 -36472 -1866 -60883 -102595 -100191 -153828 -132898 -90966 -85420 -6445 100129
24730 100129 53226 18900 43709 82453 96056 17732 -19871 -1376 3872 -76420 -80014 -95271
24718 -95271 -49968 15846 67619 54209 61344 41263 110605 198670 199529 212658 232422 131325
24706 131325 55081 2545 -22016 -44275 -81533 -58941 -15878 39155 90889 149463 92709
24695 92709 41709 59774 39582 -89220 -134794 -117065 -164194 -158141 -128061 -109243 -35438 46267
24683 46267 -10847 28386 33310 -25955 -57449 -53325 -27704 71397 101310 70007 7457 -37480
24671 -37480 -9616 -24108 -71843 -125620 -166931 -228419 -250749 -207322 -74547 47739 139874
24660 139874 96171 27604 -86724 -82243 -42000 -153631 -177352 -64201 -71667 -75164 9700
24649 9700 49222 125385 128147 96781 26150 -71862 -39015 6010 142432 156362 143179 107844
24637 107844 -19673 -63638 -56135 -38702 24834 -7180 -70938 -52122 -49236 -31424 12750 -637
24625 -637 -12283 13491 27361 28749 33749 48672 9819 -39463 3178 -57554 50441 51625
24613 51625 16200 34657 21385 17036 -95999 -103678 -62322 50099 142540 200735 206698 50963
24601 50963 -94876 -79748 27315 23682 -9428 60795 43236 -31035 -17269 31295 -49685
24590 -49685 -127107 -32073 81757 73076 74015 -46032 -68405 -50312 -53171 39556 140363 87789
24578 87789 9385 55712 -35069 -72696 -15230 214 -6995 78230 151304 54734 -16273 -2547
24566 -2547 -47755 -37845 12348 -68257 -150955 -67221 -16286 30094 -10681 -16825 837 44416
24554 44416 -19034 -49267 -80390 -16458 12024 -74399 -78398 -15751 47321 40668 -32126 -2501
24542 -2501 67127 119317 116596 111303 81931 36801 -1730 -10709 4386 126703 241090 253018
24530 253018 169328 104470 94558 -5181 -44143 59945 64017 -100356 -177751 -155842 -118196
24519 -118196 -123177 -50372 92979 127948 105172 48953 -21775 -79592 -176809 -159326 -26457
24508 -26457 -38556 -36923 -91130 -80003 -43404 21721 53849 115317 85958 22492 -2771 -22231
24496 -22231 -71595 -103935 -36066 -7010 20477 -85113 -168414 -187933 -202679 -195537 -154247 -67213
24484 -67213 45716 49154 4957 -27383 -183 3865 -6339 -47145 -112871 -98793 20974 144249
24472 144249 42092 -53526 -1888 40919 -17763 -12762 -72112 -88294 -76333 -89374 -54262
24461 -54262 -94444 -130710 -67367 56042 16045 6898 7364 -26915 -9658 29241 33240 -18920
24449 -18920 -87455 -40176 -63073 -55248 -3605 23134 49105 -25284 -84868 6332 75432 73518
24437 73518 -73827 -182195 -228830 -188057 -109349 -65848 -27789 -118359 -103462 -117972 -127195
24426 -127195 -134076 -83412 -190779 -256057 -187787 -135761 -135680 -95031 -191129 -162414 -17201 33947
24414 33947 76026 112476 72543 100511 129551 23588 18113 -16235 -12569 -24640 -130404 -71721
24402 -71721 -78 -3480 -11062 3483 -3988 -93979 -157034 -144717 -150705 -160600 -189692 -155937 -115679
24389 -115679 -46941 -21410 33901 64126 34494 39994 63911 26073 -44684 -72455 -68512 -25670
24377 -25670 79467 66667 66762 81809 130134 18123 -35364 14869 -39817 -45509 37441 65724
24365 65724 -17747 -30699 -75782 -127891 -226950 -224287 -141715 -61884 48718 -4630 -47039 -78031
24353 -78031 -101372 -8042 27272 6166 60438 114890 69569 -20843 -68576 -91292 -110992 -37991
24341 -37991 -16 81655 80655 27805 -92037 -86583 -101235 -124575 -103831 39768 42866 14070
24329 14070 -19040 -129181 -29876 31750 15737 -124200 -62638 7186 67642 41566 -98972
24318 -98972 -157549 -190433 -97990 -14642 33793 23083 -13874 -44578 8629 -28986 -61921 3506
24306 3506 67513 -48996 -101899 -57524 30700 75469 90048 31071 66063 70649 100686 72285
24294 72285 20502 -83907 -123736 -16875 46963 128388 58577 58652 113954 8277 -61022 -45755
24282 -45755 16848 3620 -81783 -165747 -134803 -97661 -21184 33488 -1089 -20285 -5153 1064
24270 1064 31448 53404 39227 10401 -22306 -44208 18309 43520 59230 -4583 -33164 59644
24258 59644 67780 -23072 -10356 45091 122194 204198 216282 160081 111306 103661 200972 230412
24246 230412 83086 78601 139247 149941 139626 146659 129087 56906 -28515 16282 19040 -47977
24234 -47977 -60532 -165 53609 43516 -91597 -173918 -166960 -161997 -87271 -77139 -49681 -35174
24222 -35174 -68835 -85164 -58179 -37085 -112345 -130006 -51201 -48868 -27877 -99597 -192681 -194942
24210 -194942 -28083 -22971 -73808 -150883 -209951 -278077 -307907 -282260 -228369 -227928 -117603 111366
24198 111366 59686 53886 79812 -32611 -83186 -50726 47372 60592 -30043 -14396 -143280
24187 -143280 -111598 11900 67426 -6305 -32326 -90680 -24665 -11522 100142 113953 -8846
24176 -8846 -90888 -62460 -107317 -26659 43353 17791 -502 -8705 11270 43472 55023 116081
24164 116081 93599 150981 162178 93208 107912 197979 201693 176755 142047 105060 63710 23344
24152 23344 21753 -33588 -50623 30765 -11187 -151375 -219588 -214067 -138341 -143699 -114164 45036
24140 45036 73780 -10888 -15303 36583 90130 67172 65193 81055 70123 19348 -42088 -142685
24128 -142685 -216975 -184338 -97895 11885 60607 56776 -2428 -5717 57991 21663 73991 136900
24116 136900 99128 41353 -43630 -26040 -61598 -128721 -139873 -55232 -30128 8028 -10541
24105 -10541 -26072 14340 53431 57347 -49841 -160608 -156085 -151067 23486 131143 103752
24094 103752 31900 12496 -56636 -62061 -17902 8980 -9878 -10017 30979 -27783 -101192 -87519
24082 -87519 -118246 -211695 -196727 -131656 -21300 76835 149489 170017 112370 75684 15035
24071 15035 -41162 -78843 -51527 27898 52771 40189 59947 -34570 -62336 -28430 -50632 -112923
24059 -112923 -91389 -135875 -158037 -18483 29734 -13036 -21773 -41476 -154752 -137114 -103325
24048 -103325 -29331 40105 83094 72629 49330 7784 15850 49385 14241 -30198 -37739 -54805
24036 -54805 9042 -5066 -23066 -13723 -11525 -35207 -35585 -75470 -103618 -135345 -81199 -118726
24024 -118726 -135750 -147187 -123553 -97722 -40882 -12732 -114986 -129322 -77094 -81412 -55983
24013 -55983 22981 54725 8016 -61492 -176422 -100905 -40536 -38378 21124 112676 120201 101815
24001 101815 88836 128932 61208 -62508 -119656 -126318 -95622 -66736 -33326 39768 51702
23990 51702 178275 223767 151437 32125 -48785 -21729 -42679 -19444 10994 -48583 -79318
23979 -79318 -106385 -167417 -183057 -137232 -147077 -112824 -44146 63035 100845 166155 133713 -22547
23967 -22547 -74725 -25149 14850 -50186 -94528 -13165 44204 82253 1387 5756 29682 21043
23955 21043 61683 -31621 -79565 -177100 -68350 15752 47340 17491 -115595 -180481 -153268
23944 -153268 -95167 -43446 -40127 -52887 3945 -31964 5571 -45838 4669 -37402 -116112 -67361
23932 -67361 -40361 -1260 74352 47375 -94151 -100826 -10944 -9521 -50600 -33818 -36794 -23454
23920 -23454 27427 49155 -41576 -6223 99924 30607 -31753 -31195 -10875 12261 -19259 7747
23908 7747 77272 25240 3278 63592 -12299 -65289 -52103 -51284 -34628 -94260 -132007 2424
23896 2424 125538 69127 -23563 -83832 33191 69888 -35964 -22573 26842 20468 -24959
23885 -24959 -28575 -45139 1143 18779 35489 -44637 -88707 -96390 -80661 -33494 -17908 21738
23873 21738 170703 104915 75113 79244 117021 153453 179934 192749 166271 18133 -35683
23862 -35683 -30031 -56806 -19426 -78212 -86995 -16209 117832 206350 140006 116238 92731 83608
23850 83608 84557 50712 39074 11034 31641 45451 12786 -40319 -56154 -150374 -103777 -58014
23838 -58014 -11974 89415 199846 102423 -69336 -106008 -25614 -61617 -47170 -68412 -31175
23827 -31175 -9139 -108999 -117410 -122380 -87892 -65137 -62721 -27401 49731 83764 92701 17434
23815 17434 32993 43727 -827 -130722 -217179 -158183 -61085 -47214 -32209 6481 -6647
23804 -6647 35936 29570 26638 18636 -3914 -8664 -8233 -10967 -9476 -55020 -45776 -30698 -61279 86543
23790 86543 50532 -29976 -71694 -36503 -89786 -131667 -82479 -70517 -116508 -68679 -5534 -862
23778 -862 -1403 53259 153883 51632 -79077 -151081 -196445 -143416 -85056 -74893 -123647 -142763
23766 -142763 -64246 21817 93656 108225 104889 135493 121407 9761 -7192 -808 18915 38494
23754 38494 64042 137829 233508 240586 101885 -3095 -15941 -47865 259 24572 -17443
23743 -17443 -3521 -35960 -109849 -104569 -118724 -58497 -34091 -45049 -15693 12259 -22153 -112385
23731 -112385 -224413 -190382 -84958 -56872 -31373 10596 93596 36828 -60683 -22574 53609
23720 53609 32890 31203 -13232 -37551 -42235 -117969 -195420 -209514 -140039 -29572 89605 -5865
23708 -5865 -28364 43046 27367 -69008 -112063 -143914 -177861 -201065 -98488 -2784 -100005 -202606
23696 -202606 -90851 -13348 82795 66588 81163 126184 77405 97670 67533 -32610 36482
23685 36482 68997 10405 -103941 -39221 13956 -82659 -87467 -71689 -82327 -64730 -23923 -7587
23673 -7587 -22649 -20000 5887 -116054 -170863 -51150 -49070 6774 24268 -66274 -86077 -106440
23661 -106440 -79012 -47710 -58901 -136332 -194980 -254034 -155941 -148925 -220220 -150606 -57057 11198
23649 11198 27269 -48702 -73457 -178455 -142351 -54104 -8434 103351 99498 87985 48572
23638 48572 -13903 -13388 3389 -55240 -22182 -11872 -73866 -72106 -99341 -42965 92776 134585
23626 134585 94815 58525 -41936 -55642 -42569 12851 31575 37260 53484 -3283 -66230
23615 -66230 -98914 -96584 -135054 -104891 -45765 11886 43721 5884 -100078 -74908 3211 -76362
23603 -76362 -99196 50372 62123 -1515 -23658 -98174 -185701 -194473 -160105 -137967 -138197 -86987
23591 -86987 -27326 36365 -40667 -26967 19915 -21426 46423 130108 143176 171523 182036 65239
23579 65239 38773 -2522 -58727 -35308 -82734 -71496 -53805 -121505 -76649 14553 -32191 -54096
23567 -54096 -38899 -170640 -192018 -110106 -72295 -61828 -47503 -38877 24614 34498 -14630 18280
23555 18280 -27737 -80402 30836 61087 -99500 -228364 -188920 -153643 -179568 -154882 -158836
23544 -158836 -81819 -30266 -40176 -33335 37067 17393 -47688 -62123 -30515 -54009 -70579 -145557
23532 -145557 -99279 -63881 -102006 -27824 -51239 -100116 -52667 -56509 -117780 -101106 -19895 -47304
23520 -47304 -55486 -5911 3993 -2679 59812 109789 28784 -5602 12818 41456 41776 -29033 -52262
23507 -52262 -19181 -44214 -87479 -77203 4329 -1862 -51315 -55414 39186 -21448 -66925 -16099
23495 -16099 -56402 -116336 -28424 -30792 -12462 -76373 -134433 -134506 -140967 -85500 -89889 -43297 -56536
23482 -56536 -59620 -108561 -86851 -94527 -29445 124943 210836 149456 23232 8637 38281 20443
23470 20443 13942 -68089 -86735 -39466 -17441 -13896 -6426 65578 59752 -27463 -106563 -94107
23458 -94107 -84760 -47345 -35395 67872 39752 24459 21747 75746 53954 102210 138231 44217
23446 44217 -29557 73516 119868 134509 83502 61165 89688 154925 151705 123767 59911 73266
23434 73266 74964 36068 -132279 -115526 -27485 27597 -31862 14075 730 12664 19142 -17305
23422 -17305 -49835 -85582 -172053 -217281 -45295 31319 28001 -3372 -68160 -158616 -184840 -94017
23410 -94017 -112583 -147079 -86848 -49344 -115392 -113187 9761 55816 80390 37349 18601 -86298
23398 -86298 -148216 -76850 -151169 -191073 -102680 -23551 -54474 -111768 -124345 -101638 -62745 -148068
23386 -148068 -87795 -45379 -68004 -90269 -113812 -15293 -5006 -55825 5423 89650 -95613
23375 -95613 -154209 -94489 -117811 -132228 -10667 20590 -77581 -30226 -59218 -57743 -139287 -128264
23363 -128264 -100191 18264 89441 16661 74626 46790 13252 32614 88094 48300 12667
23352 12667 101333 57631 -7064 -79739 -24338 -4423 -46493 36197 17179 -34954 -27759 -42112
23340 -42112 -18476 -71267 -139091 -83960 -60572 -73056 -48721 -78230 -89054 -162997 -173952 -162169
23328 -162169 -183583 -83020 -43304 -111298 -47159 4275 124421 176961 122630 95189 119287
23317 119287 70358 -65210 -81741 -7027 -25828 -62539 42364 53043 -8704 -70020 -127285
23306 -127285 -147320 -120306 -66309 -45518 11996 49618 -25556 -95518 -38138 -13380 -119165
23295 -119165 -153859 -146849 -130379 -44601 -55528 -56790 2818 85682 -24305 -125144 -100647
23284 -100647 -193042 -213223 -156960 -78263 -14807 -36314 -6350 74850 -1422 -74989 -67591 27014
23272 27014 13687 -4903 -47790 -76049 -43786 -19899 32476 75792 124548 97964 -59963
23261 -59963 -218016 -210723 -129303 -35123 -5277 -25609 48023 106875 -13250 -69770 -15690
23250 -15690 -94175 -131287 -28787 -43752 -88748 -42787 -62813 -160509 -44332 -12425 -80921
23239 -80921 -97761 -103194 -16093 -26331 -216233 -202415 -128245 -52227 -52868 10488 49103 87275
23227 87275 8357 84073 165611 89331 53308 -11984 17750 105647 91761 72088 143894 121878
23215 121878 46667 41921 -9764 -196927 -205959 -137710 -47257 -121368 -183716 -140457 -133984 -136821
23203 -136821 -123091 -180439 -134345 -30805 52340 -54181 -90166 -76823 -126370 -232850 -161603
23192 -161603 -76830 -100131 -233977 -158446 -101426 -78605 -48409 -34665 -2605 -35934 -5076
23181 -5076 -35333 -131437 -105163 -123439 -64503 18193 86341 22372 -53525 -7289 20294 -74609
23169 -74609 -141871 -101563 -45194 -46702 -68218 -23804 -7828 -6031 24002 -20966 27289 -21509
23157 -21509 -92421 -156165 -60781 40072 54728 101119 83550 16706 -16032 -59128 -87736
23146 -87736 -52977 -46534 37559 116942 66758 11411 -31429 82372 14276 -66771 -130955 -114291
23134 -114291 -82421 -66566 -152358 -165887 -25938 -18946 -42331 -91004 -101315 -69440 -74106 -123508
23122 -123508 -158801 -102509 -51879 69109 39793 -48557 -136282 -159518 -122224 -119476 -94578
23111 -94578 -38762 -7181 14687 59058 118032 156453 136051 20031 -48027 -102531 -78219
23100 -78219 -29644 48820 421 34656 98436 148933 194413 153730 26976 53555 81089
23089 81089 117621 118498 138269 48349 12165 151278 52390 -58927 -77842 -82490 -109702 -84341
23077 -84341 -53853 -52953 -32499 -55280 -72263 -159861 -50674 81312 93514 50910 104579 64400
23065 64400 -19005 -27401 12635 -79148 -148772 -105042 -88820 -123549 -100209 -42003 -44183 26477
23053 26477 73744 -10430 -134620 -217307 -144071 -88820 -40348 -70959 -95944 -48936 -19658
23042 -19658 2122 -54210 -135349 -108931 -89626 -180660 -77787 61415 175754 35564 -40946
23031 -40946 -77085 -26958 -39902 -20809 12655 52286 -37783 -151073 -59692 25057 51621
23020 51621 107603 78159 -322 33398 42242 22540 -87865 -111913 23640 72995 48462
23009 48462 48422 -26752 -49404 -53252 77328 136887 89125 38192 -5755 -8202 22202 12866 -36777
22996 -36777 -43477 35930 195542 174971 122452 102423 -2937 -57643 -20254 53 -34779
22985 -34779 -79118 -71358 -11231 51073 -9389 -42271 -79845 -53213 -105249 -113669 -94224 -122419
22973 -122419 -189315 -168559 -94440 -110021 -143430 -105598 -3001 -97552 -152598 -66628 -71935
22962 -71935 -121469 -65379 -8570 35971 -3246 -28007 19898 75821 83996 18365 17764 15004
22950 15004 -88319 -33716 1828 -70520 -50812 -54275 -3570 10996 46215 17783 -76899 -187494
22938 -187494 -162202 -65033 -66931 -11431 43185 100756 134714 82858 -39108 -28235 295
22927 295 -12401 -48271 -90212 -30562 64402 122070 134080 156513 72014 -2809 32701 114194
22915 114194 73192 139892 174381 77133 21472 -108172 -142323 -176983 -82079 22414 -30463
22904 -30463 -21406 109476 139049 136933 58070 34793 -30292 -7248 -56117 -58254 -50114 -88612
22892 -88612 -99099 -94624 -14109 -3367 79435 107720 81925 40795 -39798 -76470 -36450 -16474
22880 -16474 20205 3002 -46083 -4380 19990 30749 97938 70506 -77488 -159740 -128970
22869 -128970 -264 -19370 -8083 11972 -6394 -59957 35844 96784 -11771 -32652 23642
22858 23642 20034 -68710 -118410 -135207 -65920 -22748 -22792 -23806 -68972 -101190 -105510 -101805 6724
22845 6724 81687 -2898 -123770 -172525 -63970 86152 106790 50947 -78901 -166768 -147388
22834 -147388 -81935 4460 95036 89253 -34566 -96328 -60360 -64710 13713 70302 54389 58487
22822 58487 37183 99065 157258 256701 166866 80880 31524 -26538 -18457 -6596 -55311 -37787
22810 -37787 -20360 -62345 -79628 -120618 -126217 -90971 -108737 -1054 34559 -29474 -4204 -99404
22798 -99404 -106190 -15987 25596 10916 -45975 -30077 -35487 -47858 -28419 28295 52969 -25706
22786 -25706 -40067 -33641 -7873 31077 91795 12168 -112516 -273468 -228202 -94642 -88132
22775 -88132 -220308 -211874 -165110 -89916 -26160 -27921 3154 53093 110815 66572 72513 113158
22763 113158 183730 60643 -3212 -71165 -94311 -112637 -143382 -125408 28700 11949 -3252
22752 -3252 69654 100587 105598 -51594 -48075 -44719 -17655 -24490 26834 -12394 -3110 17041 -55826
22739 -55826 -6961 7641 -23289 -13916 42531 8106 -46929 -133803 -82491 31224 80078 19819
22727 19819 -65786 -59418 -12191 -26245 -52495 -100747 -4948 29383 40353 -51204 -98467 -132665
22715 -132665 -189045 -180394 -54069 20683 107810 50241 24478 17806 -4032 26099 -53883 -92292
22703 -92292 -40236 -75731 -188238 -205146 -234007 -247237 -120340 -104586 -88704 -12032 -96304
22692 -96304 -143882 -148942 -114459 -49510 -22977 -9495 -23151 -26710 -46696 -27908 127866 96041
22680 96041 44862 98356 103800 44316 -1733 -8592 -15928 45145 117373 26355 -44873 -19898
22668 -19898 10725 18292 -14150 -70714 -518 -37769 -130632 -89865 -46133 -88508 -128486 -182348
22656 -182348 -178966 -140200 -158941 -198983 -240217 -171958 -87229 27669 81906 27657 34856 64060
22644 64060 31542 37093 602 6823 -28827 -66049 -51485 -62014 -113427 -104252 -72869 -60696
22632 -60696 -45330 -49124 -28628 -7376 -68626 -103581 -57365 -9649 14127 23960 49157 65468
22620 65468 23792 -70332 -145722 -215168 -138597 -98309 -61152 -84426 -58364 -83192 -75646 -125176
22608 -125176 7319 31030 34497 4811 -110051 -31350 52374 19282 -28441 -114773 -128831
22597 -128831 -56602 -65496 -87870 -97212 -51278 61979 97755 24385 -89630 -84089 -51365 23526
22585 23526 26650 -57446 -8185 87518 247557 263875 177693 107932 100709 93039 4403 -36576
22573 -36576 40643 80815 12623 -96366 -185522 -199016 -117266 2108 27461 22445 -21593
22562 -21593 -51162 -18758 41372 -13841 14732 -79241 -100894 -135191 -53769 22439 -36900 -80469
22550 -80469 -82245 -45855 21540 162154 193752 97920 2091 -51832 -162791 -132062 -61871
22539 -61871 -70220 -83011 -105001 -206898 -166510 -85392 -119242 -119109 -20651 66648 57744 -65725
22527 -65725 -177015 -158383 -90281 -76647 -59842 -25875 -48869 -76401 -78792 30001 16044
22516 16044 19474 -4205 -12329 56245 86905 95693 80235 -28196 2568 -24415 -89027 -109235
22504 -109235 -168458 -197565 -200176 -151091 -92005 -85633 -106231 -61692 -72902 -44455 -19741 48617
22492 48617 124124 88710 4556 -11267 58881 163821 80293 -19670 42829 92189 88745 69046
22480 69046 -22761 -69686 -104738 -97324 -105655 -92929 -78525 -98039 -109802 -150584 -156952 -302358
22468 -302358 -358876 -227656 -220712 -198084 -35472 7371 77596 100348 63553 61087 -1978
22457 -1978 -42932 60226 134787 162806 82807 46888 59497 62884 -30122 -117882 -141463 -55412
22445 -55412 -70397 -170183 -103264 -85737 -108696 -6003 51288 -153 19034 -25515 -79845
22434 -79845 -124230 -92395 -68409 -50519 -46883 -6188 42809 -39271 -68452 11320 73735 77425
22422 77425 -14420 -96401 -152942 -76841 118382 129946 69224 72909 31505 -37147 -57725 -49499
22410 -49499 -65286 37017 101044 129047 143202 87676 16082 -88567 -129533 -195648 -213435
22399 -213435 -144088 -26953 30802 46589 14312 -37804 -91281 -162495 -36012 -37416 -23489
22388 -23489 4640 13623 29929 -31898 -36183 -1002 56259 -17131 -60574 -29073 -139 -27288
22376 -27288 31010 29066 -6288 13026 63166 135561 91462 30717 496 -51365 -61141 -84491
22364 -84491 -29082 61225 166802 255240 185449 103653 149735 37688 -70514 -53528 37107
22353 37107 -13214 -65232 -45560 -50648 42449 115266 24039 -4749 -55622 -59119 -28381 13908
22341 13908 -25271 -29716 39609 42637 9658 14696 33202 39489 8122 -57862 -50091 -115443 -151108
22328 -151108 -125675 -75139 -9559 27778 92413 21644 52029 24467 -36253 -116516 -124628 -106673
22316 -106673 -96111 -67493 -21755 40787 142359 94154 21035 -34616 11207 145738 146106
22305 146106 134955 64829 15362 -9635 -48084 -105837 -146181 -12789 12995 63816 197409
22294 197409 93779 64020 97157 97419 76630 49672 43682 -22978 -58792 -100740 -106872 -97609
22282 -97609 -35202 -54425 -74117 -143657 -76670 -61560 -89184 -11754 54144 48818 21156 23692
22270 23692 27862 6060 -37516 13214 -15808 5907 17963 104142 39311 -24966 -1292 16106
22258 16106 38688 109394 -683 -55212 9064 82162 63625 -1654 -4027 29081 81722 94324
22246 94324 81024 86762 68567 -44823 -171915 -138905 -160551 -104854 -29232 -116405 -192031
22235 -192031 -156176 -188831 -164047 -88022 -80146 -61914 -80816 -14475 29478 -20210 -44883 -77252
22223 -77252 -140955 -90560 -52922 39430 77139 77984 82702 36336 -24046 -34163 -51477 15066
22211 15066 78293 121346 141478 71164 98392 169978 160393 42910 -28490 8341 -17422 61189
22199 61189 53610 -89330 -201613 -182922 -48829 61067 120777 32724 18848 -13416 20181
22188 20181 -27633 -46232 -55099 27420 46880 -27026 -121952 -83483 -7154 29282 -26614 -51160
22176 -51160 -8558 -132018 -63743 57982 87120 90857 -8816 -124319 -182983 -89015 -33635
22165 -33635 -64089 -72144 -53112 21331 -2947 -876 88839 76490 5314 -20035 -16841 -88835
22153 -88835 -78108 -299 -60685 -115539 -99878 -56153 -8419 -8666 -60718 -128229 -112844 -175197
22141 -175197 -190559 -179344 -171804 -159169 -212973 -162943 -45726 -63679 -24810 -19062 -31310 -67930
22129 -67930 -148554 -241436 -280616 -239018 -119842 -101252 -69855 -75390 -108915 -134761 -138938 -139110
22117 -139110 -115454 -86208 -102897 -35607 -28481 -54507 27375 132260 132121 37000 3406 84884
22105 84884 115458 36294 -119123 -177816 -158779 -178556 -156988 -163717 -148056 -203599 -73499
22094 -73499 46691 -22374 -61757 -74063 -63936 -53165 -111600 -10186 -2388 55121 56328 -17160
22082 -17160 -27228 -77489 -111153 -70772 -100931 -73851 -80364 -155324 -217144 -278579 -285967 -187394
22070 -187394 -40284 -41460 70767 103043 62980 -492 66563 103822 55165 10429 -57200
22059 -57200 -70420 -6802 -35187 -92815 -132532 -105003 -175341 -182399 -85723 -89017 -79673 -62241
22047 -62241 -18798 -54454 -114475 -28115 42539 27547 -22382 -69137 -94682 -106778 -127016 34306
22035 34306 201495 100561 76515 -5198 -77981 50072 90143 104245 198268 166256 70218
22024 70218 89075 155233 73814 72075 76821 91210 -39132 -84107 18659 61154 51108 60915
22012 60915 108227 77933 60521 144183 241960 214530 125555 10552 26578 41113 -61936
22001 -61936 -63115 -39524 -88999 -99421 -29030 -134 -53842 -49656 -97136 -77508 -85571 -2750
21989 -2750 11389 1228 90960 101012 -8386 -88972 -139296 -134156 -127643 -96550 -31271 -70975
21977 -70975 -63857 -45844 -99194 -120016 -24735 14575 -40777 -56753 -26049 91896 54372 -730
21965 -730 -54094 -22770 -9231 -85324 -171256 -157708 -106127 -84017 -82920 -115487 -60451 -58001
21953 -58001 -74350 24954 1450 -98004 -70937 -26004 -38979 -92765 -97019 -106811 -121949 -28338
21941 -28338 42286 77828 68116 13897 43136 70652 82624 26799 -50817 3298 83590 66672
21929 66672 14843 95900 97000 14084 -70919 111157 99751 -19084 -35099 -45131 -4626
21918 -4626 15243 -56520 -123038 -59561 74003 136362 127475 56140 -95964 -185747 -205401 -216640
21906 -216640 -185641 -165166 -137613 -113634 -93896 -32976 -53836 -39551 46859 40278 -47030 -118300
21894 -118300 -155978 -148181 -62870 -62924 -93398 -97730 -56482 -70484 -6658 11746 79383 218180
21882 218180 169170 34640 -79403 -10465 7759 -50478 -19495 9307 68990 199564 80674
21871 80674 -19002 -27093 -28210 38928 12893 -55729 -102383 -111677 -140432 -136725 -78274 4043
21859 4043 60971 59433 -8798 -25959 27477 45452 85874 152371 49865 25751 50305 78379
21847 78379 72941 -4645 -102069 -58229 23825 38417 -7875 -99397 -87468 -131749 -102338 89650
21835 89650 165484 112306 15154 51443 48487 -24789 -86479 -65485 -25705 72404 111994 89963
21823 89963 127682 96157 11098 -35637 -81107 -65051 -53036 -56975 -12635 20749 -30992 -70598
21811 -70598 687 50272 75902 8895 -104402 -127750 10551 91117 108996 32913 -1422
21800 -1422 9513 29376 5597 49583 76613 86255 59148 67913 77163 13211 46156 48559 47773
21787 47773 -2290 -63582 -123543 -112445 -117358 -99322 -86423 -141579 -127797 -136119 -121999 -43056
21775 -43056 -14426 -5894 -65779 -47642 -65933 -101053 -117314 -28215 -41376 -85137 -78284 -111564
21763 -111564 -174669 -89754 -107038 -154444 -104279 -118088 -177612 -112216 -84632 -47047 -100195
21752 -100195 -28226 32620 97527 66424 4372 -56752 -181619 -167728 -175156 -110374 2776
21741 2776 34054 73480 49227 64395 107990 30333 -16188 -87899 -144842 -168043 -184012 -185252
21729 -185252 -158685 -181235 -172541 -121685 -17876 -12919 -82563 -34969 85115 137219 149766
21718 149766 83800 56332 -27517 -107859 -181394 -72599 55372 15267 -58452 -81703 -123483
21707 -123483 -142607 -65210 116898 119535 115563 131056 141383 127606 99529 88214 58339 -30946
21695 -30946 -69120 -46730 30807 19074 -31621 -77026 -41566 2976 64796 -3014 -43136 -57706
21683 -57706 422 -59029 -118403 -64638 8380 71303 76091 870 -73464 -153158 -132650 -113869
21671 -113869 -23216 -44581 -134526 -43309 -25706 31659 96691 34105 -52840 56351 122307
21660 122307 51757 -44599 -124887 -123948 -16224 10105 -14739 -76942 -143166 -217236 -201287 -115934
21648 -115934 776 -66094 -73798 -38478 -55405 -75382 -157301 -98444 -27306 -10407 55741
21637 55741 12963 -113670 -30372 71037 105504 47496 -5243 111019 146961 118554 68924
21626 68924 2046 -48867 -91014 -100270 -100226 -15321 15325 -8718 31332 41653 54840 15278
21614 15278 -8076 26340 -51947 -142012 -96424 -79842 -151880 -142439 -39348 13567 4285 -4475
21602 -4475 -82679 -75337 -142724 -201488 -186227 -71209 -33172 49146 161753 219707 147578 1284
21590 1284 -82328 -151036 -129598 -125543 -119391 -113701 -164253 -180427 -55718 -43285 -102686 -28496
21578 -28496 28840 71267 92179 56697 4123 -87393 -138883 -69443 36 27581 -353 -88052
21566 -88052 -36775 33289 5507 7950 -66002 -123556 -29953 -94255 -160923 -79833 -45452 60000
21554 60000 154828 93547 71822 83780 37056 37417 105126 102538 43431 -1119 -74369 -10053
21542 -10053 75574 -6442 -12726 -47220 -24483 -32195 -51818 -61157 -27623 -32339 45081 30185
21530 30185 5067 10056 -29567 -115366 -95824 -605 19887 19711 -66117 -80385 -53617 -2477
21518 -2477 87738 22455 -5822 56682 93834 102191 52436 344 31105 67881 13982 -132315
21506 -132315 -156167 -144825 -82425 -17543 -39415 -36585 -48203 -59388 -52256 21487 18293 -38663
21494 -38663 -17769 -30510 -81069 -27171 -34668 -86433 -58439 -99934 -87895 -55564 -37323 -55683
21482 -55683 -39050 -116038 -175448 -157579 -168310 -185284 -131833 -98913 -42609 25715 28084 -69448
21470 -69448 -154908 -115658 -51218 -80119 5248 53299 -130577 -240385 -118316 -47474 -43996
21459 -43996 -57546 -95241 -134316 -37240 -74856 -29178 -24583 -115051 -102665 -93623 -86265 -100081
21447 -100081 -35538 11690 118878 136772 107225 39876 -44399 -74944 -89867 -131132 -94517
21436 -94517 -130480 -145019 -163755 -184706 -47679 -10614 -77581 -19191 84051 115692 136111
21425 136111 137203 -9790 -135178 -145315 -102095 -74066 -94783 -64 306 9124 73630 12994
21413 12994 -24124 -37951 -80948 -105304 -41778 -9510 52611 -10045 -115821 -113457 -63996 -5381
21401 -5381 -3002 -57709 -76568 -139718 -60601 -86386 -55964 5451 49602 -32633 -77406 -20765
21389 -20765 -96870 -75876 -10539 67731 65740 92982 60949 27801 149487 122204 32633 5012
21377 5012 -10744 -15230 6924 -85779 -155025 -122059 -50719 -14947 3622 -44243 -68275 -66056
21365 -66056 -90956 -79269 -60134 18731 45326 -69609 -117268 -92419 -90214 -106446 -124460 -55237
21353 -55237 389 -23636 -7053 -56146 -123439 -148558 -12305 139057 242439 160364 27051
21342 27051 1615 98261 73234 -26165 -120504 -107213 -80502 -153421 -188120 -63802 -3223
21331 -3223 -90387 -54048 34574 65035 115556 174227 119922 58052 41046 72249 12356 -12144
21319 -12144 -38740 -77898 -203970 -218514 -175209 -100785 15273 -67578 -163980 -211309 -218023
21308 -218023 -133669 -72375 -117261 -162544 -148784 -76223 22070 10804 -4092 65971 110850
21297 110850 135386 109500 90660 43306 46493 2300 -14409 -26939 27005 78901 112469 102051
21285 102051 -9492 -11592 -64273 -86366 -19398 17982 -578 -14465 -40457 32037 86984
21274 86984 51173 -72921 -183066 -106423 13161 6629 -95833 -85742 -17859 -10141 -93349
21263 -93349 -83140 -139951 -167141 -16714 -14936 58220 12965 -54574 17959 -33195 -9386 -41737
21251 -41737 -99475 39660 88094 24048 -112563 -31419 -5357 44477 21088 -76606 -74644
21240 -74644 72511 117475 16963 28601 -39818 40005 -25888 -146030 -123288 -171298 -129667
21229 -129667 -42095 2095 -49439 -166095 -185859 -49793 80197 58539 916 -2921 -37472
21218 -37472 -36036 64242 37719 56071 77781 147880 153120 70830 1641 -39409 -12747 20739
21206 20739 -10797 -58814 -60654 -108227 -6309 -38079 21955 140615 163935 147697 92417
21195 92417 104997 27380 -33556 -27176 30738 33658 -8453 -73207 -49525 -138766 -144896 -50248
21183 -50248 -89114 -95881 -25111 -23951 652 -21158 17687 11802 10886 -75170 -101351 -53583 -118194
21170 -118194 -172024 -166007 -152339 -93377 -68855 -147390 -209692 -161539 -82169 -71350 -116639 -169816
21158 -169816 -134286 -50294 -53806 -120064 -110744 -124791 -78355 -117452 -85033 -32508 3382 26448
21146 26448 2108 -37 -17424 -10115 25513 -30996 77713 3919 -168951 -137504 -26128
21135 -26128 11386 -2674 32715 -12769 -55344 -93749 -153414 -180298 -174138 -161598 -101668 -100411
21123 -100411 -101422 -77064 17809 132981 204274 155614 73444 9432 24449 38415 67381
21112 67381 196366 191326 17146 -124845 -101814 7551 98325 89444 84475 -49592 -184017
21101 -184017 -53498 30042 41627 -66773 -29857 -40105 -34059 -79102 -142207 -155958 -75008
21090 -75008 -13579 -6042 31332 -101423 -74753 -97928 -61202 -74063 -61087 -5272 -65966 -128523
21078 -128523 -100647 -41881 -93572 -154054 -114418 -138314 -82929 -43515 -7219 -47578 -89169
21067 -89169 -59885 -43992 -18434 36175 120960 47061 -145807 -142259 -135303 -133870 -168019 -119471
21055 -119471 -84663 -79418 -36650 -59836 -94884 -126460 -189872 -108623 -70798 -38207 -59834 -9319
21043 -9319 31923 -66789 -2240 80128 134801 97255 -33117 -56228 3150 -29042 2136 -61627
21031 -61627 -206903 -182551 -94649 -103413 -90341 -53163 -67573 -38493 -23123 -17631 -72636 -47211
21019 -47211 73266 40178 -93448 -65245 -65247 11804 278 41365 70794 137627 39459 -21427
21007 -21427 -76711 -111768 -17888 -18460 -16401 -37897 -20627 46561 40425 -21289 47535 108126
20995 108126 100633 84856 77351 27043 -41744 -90704 -60448 -87481 -80466 -170619 -208613 -162656
20983 -162656 -167509 -104485 -142183 -177415 -177701 -209066 -195624 -152592 -82572 -28062 19213 87143
20971 87143 81505 -21554 -10230 52345 105344 52343 -17284 13270 72130 23542 31950 35082
20959 35082 65535 61506 -44218 -98497 -107500 -175699 -112449 -19605 -20219 -47165 -77460 -76595 -106559
20946 -106559 -132861 -97099 -150412 -127990 -70188 -19784 -20493 27509 90587 68837 54344 42248
20934 42248 19433 21678 -50813 -128397 -60726 68377 61806 9989 -52423 -205586 -273912 -249598
20922 -249598 -236252 -141090 -24476 -108530 -182693 -169949 -77467 -27279 -13094 33431 88599
20911 88599 123602 241098 291783 198367 112093 -15051 -70084 -226896 -183106 -70590 -71772
20900 -71772 -98329 -65147 -66192 -146217 -162837 -182146 -102893 -41243 -64065 -114126 -78582 -94528
20888 -94528 -128840 -48180 29440 32317 -11330 34236 119517 101249 89807 -8910 -126859 -63112
20876 -63112 -92454 -132861 -67105 -91593 -102993 8272 -18709 -31152 -66137 8463 56823
20865 56823 7843 54114 -5395 -20579 -19184 7318 11442 10719 -33590 -13314 -15846 -60372 -49270
20852 -49270 5459 -22237 -63384 -107225 -13516 131856 146496 152497 102701 112889 98329 91393
20840 91393 70490 25107 -21575 -9306 -59214 -17527 -97050 -92325 -68280 -94415 -61928 -55492
20828 -55492 -76513 -34933 -16510 -12203 -57984 -96620 -82770 -33926 24153 -126324 -214427 -184485
20816 -184485 -81325 40600 98401 78900 -37250 -90601 -65632 -655 18441 42961 -32106
20805 -32106 -89280 -135873 -125543 -92010 -103988 -131417 -74304 -93054 -106239 -82379 -41198 -77877
20793 -77877 -17225 -72857 -200644 -245087 -205304 -112011 -65443 -96496 -146424 -123611 -194156
20782 -194156 -83931 -25612 -78602 -139837 -241386 -263338 -115401 -86513 -41989 26256 -35957
20771 -35957 22080 60281 31798 4145 -71070 -97537 -84407 -72824 -67316 -45809 -70587 -88619
20759 -88619 -70580 -49478 -55973 25140 -5436 10294 38185 75964 118764 78280 -29166 -18238
20747 -18238 -31119 25767 -14090 -7678 -48343 8743 101181 36195 -102706 -171911 -139141 -113901
20735 -113901 -124665 -14158 64939 123127 152265 101117 -40515 -106097 -68114 -127691 -107674
20724 -107674 -31847 -15935 -95278 -142846 -103685 -22610 37149 66487 193284 60888 1553
20713 1553 7165 17647 88268 143999 160638 214333 165370 159541 172268 199343 124564 68410
20701 68410 78872 71139 101628 24451 -87132 -88614 -56308 -88632 -104714 -34132 54956 109271
20689 109271 112352 39022 -40186 -403 7117 -13244 -37410 -59544 -49201 -46632 -50455 -57138
20677 -57138 -21441 -37602 -14427 -15691 -47185 -86474 -91101 38569 217095 181739 194118 172789
20665 172789 64785 13006 -48338 -126165 -75063 -100171 -189197 -175889 -144650 -51716 -13627
20654 -13627 23178 55222 100627 95899 42516 -8679 -56273 -41883 -10525 -42763 -100794 -230596
20642 -230596 -208127 -100348 32619 79349 105765 121569 201443 201625 127096 15574 -135825
20631 -135825 -165449 -105274 34416 79379 95025 110178 -12421 473 26711 128036 137674
20620 137674 120497 -28634 -38702 22484 -10404 43120 61839 -19838 -61005 -48583 14074
20609 14074 59846 -58442 -135575 -137801 -157767 -153110 -121103 -195807 -91654 74616 69112 -18309
20597 -18309 -39112 -100770 -85278 41102 163967 216816 74442 -40707 -91958 -71096 -42948
20586 -42948 -76435 -136841 -136194 42859 149938 85626 -38802 -26710 -7049 85707 100104
20575 100104 -49297 -103000 335 72303 151075 157687 70646 71969 -57289 -124733 -101097
20564 -101097 -158939 -120176 -109632 -60685 12762 94648 13760 -15385 -2890 -15839 -57994
20553 -57994 -60728 -75810 -93864 -10627 8466 65661 140591 52268 -57796 -109066 -100435 -31786
20541 -31786 -22510 42406 65865 27596 -36326 -107090 -74754 -38098 842 -11120 -106831 -187633
20529 -187633 -143177 -11537 45780 83822 23171 -93337 -77189 -56295 -89896 -140970 -115516
20518 -115516 -25785 10904 87667 89290 74292 65736 -58 49400 164348 198771 211844 127339
20506 127339 -38983 -107284 -153368 -186650 -33968 114701 116676 -453 11190 25774 -35489
20495 -35489 -90043 -64220 21838 35919 -8378 -72116 -52018 -78274 -45849 -7971 -22293 -9830
20483 -9830 -69550 -133519 -97889 10564 -17876 -65719 -96445 -71690 51623 128842 43749
20472 43749 -76728 -220303 -223963 -160458 -95661 50296 165319 137675 107244 19320 29508
20461 29508 36252 38587 -23227 -204427 -253789 -182505 -52792 -13798 -32874 103499 141050
20450 141050 79888 72450 117749 136581 94545 -5958 12689 49686 48133 39156 -804 37521
20438 37521 -35027 -73536 -90984 -68925 -118222 -111866 -42395 -8077 10851 30176 -18800 86957
20426 86957 20829 -77224 -70584 -41905 -25454 -23718 -93916 -177526 -89104 -31005 -74007 41287
20414 41287 165927 164588 228741 210357 99502 12346 -47014 -69053 -113411 -242899 -198894
20403 -198894 -80840 -13150 25399 -124626 -156747 -144309 -166462 -136808 -113697 -92639 -95659
20392 -95659 -105903 -192203 -268885 -224157 -202489 -37793 50849 43321 -29396 -3992 79266 147243
20380 147243 179898 64541 -66338 -53333 4399 -116559 -134424 -115342 -17766 69565 20843
20369 20843 -89578 -109041 -112549 -162652 -142860 -152712 -161157 -81667 -62833 -25330 -19513 -49107
20357 -49107 -22578 -50834 -79966 -74020 9381 65641 106845 148579 61875 -52071 -72037 -129831
20345 -129831 -89877 -38025 18447 124397 127584 105478 40211 -75503 -27685 85747 107095
20334 107095 97804 -1824 -14507 -48697 4042 70695 -4221 -2359 15 931 5939 30170 4459
20321 4459 -72992 -80368 -81910 72255 67355 2286 -60844 -64364 -110183 -165131 -173901 -219001 -147863
20308 -147863 -76065 -81018 -40129 -6170 67368 33261 -24328 -86355 -45748 -14477 99595
20297 99595 73098 26689 -4769 51591 59390 101659 74280 -13025 -114807 -146500 -145425 -156196
20285 -156196 -101034 -142843 -120801 -19411 -10577 -51026 -70762 11573 -1188 26718 -36000
20274 -36000 -82005 -71682 -96338 -53244 21752 91541 113013 60922 -78864 -98738 17951
20263 17951 74940 93155 42813 -21744 12784 -51784 -48485 -31508 -64128 17403 62542 14396
20251 14396 -56382 -77133 -95958 -69781 47746 80897 108868 133512 40993 -83803 -95066
20240 -95066 59690 19322 -11498 -52222 -118737 -97427 -121310 -84245 -12998 42626 114587
20229 114587 17744 -154283 -118624 -59159 -16960 -108909 -75018 -180664 -97045 80688 149689
20218 149689 79013 5301 39052 -21652 -138383 -161723 -109864 33431 110355 127381 163707
20207 163707 136386 86275 88836 123478 108359 133314 59990 25658 53232 35524 -131752
20196 -131752 -233005 -157060 -93833 -118464 -208943 -173188 -55879 -43693 -12642 -10013 36673
20185 36673 39078 -55423 -22966 29258 113877 93039 76195 -47524 3640 71188 53814 -22772
20173 -22772 -110076 -78431 -11373 -6137 20655 84780 53788 -42980 -134235 -95490 -54334 6314
20161 6314 18002 -13805 -15282 -71153 -131416 -122379 -86396 -85656 -105817 -150782 -154839 -136417 -122812
20148 -122812 -91645 -67176 -64790 -72953 -184293 -154128 -140149 -87508 48483 42685 43008 112698
20136 112698 117106 44598 -26208 -33886 3975 -20506 -28501 -5980 -33886 -152626 -181120 -171374
20124 -171374 -90019 11750 -96850 -15520 -102668 -81099 -25058 -103900 -167791 25017 92398
20113 92398 85883 4879 -106156 -156201 -166052 -168281 12633 104842 8722 -61774 -27695 48409
20101 48409 92525 119614 107396 64548 -23817 -90434 -59771 -17080 -2268 -95042 -132879 -160297
20089 -160297 -161826 -148872 -71588 8206 29112 501 -47401 -65015 33827 134242 104902
20078 104902 8170 -29300 80633 53884 65082 91113 10069 -32654 -15635 38217 25527
20067 25527 -91534 -98681 -31007 35916 95022 50292 33359 59849 58923 -48599 -151102 -244643
20055 -244643 -303277 -252476 -200538 -213523 -151326 -158875 -143096 -62842 -38197 57114 152313 187962
20043 187962 119679 50207 -91354 -192446 -174210 -192542 -209832 -186272 -147165 -102804 -74748
20032 -74748 -34827 18506 81705 -7466 -53967 -6804 85435 91074 44570 48026 7202 -73900
20020 -73900 -122946 -141106 -69000 36095 115144 145979 160354 203138 216161 78408 -45280
20009 -45280 -82253 -18702 -73377 -17455 40378 55168 47209 57475 164461 165624 147111 88720
19997 88720 199120 195199 145514 189558 222912 243816 253609 119965 -11279 -33416 -85230
19986 -85230 -26123 24889 105492 151928 115883 13516 -15843 -20851 -73981 -158088 -147028 -61544
19974 -61544 38881 34775 -27928 -36679 43114 42023 -2439 13274 122349 140661 42960 31490
19962 31490 20238 -64742 -17448 12985 29722 59675 -15435 19848 12455 31086 -145440 -221956
19950 -221956 -236796 -169682 -104461 -136640 -157781 -44319 23250 15647 -28104 3685 90325
19939 90325 90686 30190 -9282 83758 -22946 -29682 -17767 54092 12714 -44058 -106018 -157057
19927 -157057 -244195 -100727 -74600 -99687 -100944 -43220 -9874 -117036 -185596 -194298 -131074
19916 -131074 -98106 -22429 -64992 -151179 -182577 -192068 -103126 -53322 -98847 -144252 -204781 -249842
19904 -249842 -221675 -112666 -86370 -56362 -115195 -94032 -24534 -6494 -9285 -9060 18046 103685
19892 103685 29316 -32120 -13442 -30500 -144712 -122914 -84238 -39225 -17153 -27536 -72664
19881 -72664 -160926 -202979 -144132 -64284 -7269 -88716 -116578 -73022 -61769 -42746 -54274 -49160
19869 -49160 28248 -2513 -49113 2900 90144 49959 -29478 -91776 -203975 -201711 -133677 -178423
19857 -178423 -105292 18115 87667 45374 36798 -22751 -129602 -138253 -49000 17816 -10239
19846 -10239 -64768 -122161 -142020 -77388 -124112 -109667 18368 -11002 -17755 58795 73719 -16481
19834 -16481 -127970 -94746 -121664 -79741 -56826 -25475 -479 76760 24966 5182 -2633 57014
19822 57014 46208 -94758 -139611 14241 151182 91787 2636 -8868 17358 69270 142010
19811 142010 106171 135919 241720 246084 226359 139867 90354 98030 67173 -8202 -14091 -60734
19799 -60734 -88130 -48634 52381 58945 70906 -19332 -149852 -90297 97284 141184 56579
19788 56579 -118137 -122894 -97564 -77139 73196 128701 68825 23510 2617 24004 -42701
19777 -42701 -16353 20863 87078 29041 -26832 -58044 -21242 -32053 -58570 9820 127371
19766 127371 63382 12416 -50993 -69861 -55739 -64833 -121126 -198711 -203688 -140586 -61209 31133
19754 31133 38191 -41751 -78001 -77544 -59999 -115801 5486 119340 56109 -34864 57657 94179
19742 94179 123087 124143 112675 53859 -32854 -44301 -33834 -45379 5075 -16783 -136544 -187557
19730 -187557 -127464 -111936 -64571 -84953 -139206 -85386 -155 42958 97034 115324 7099
19719 7099 -52415 -76315 -102801 -171960 -199544 -95110 -37552 -40519 -33268 44379 -11013 -29645
19707 -29645 -66083 -68009 29329 61359 32885 33864 71604 -385 60230 1325 -75722 -115364
19695 -115364 -105644 -58849 17643 26413 40795 63563 -7775 -93920 -84606 -19241 -15751 -152173
19683 -152173 -147790 -79801 56808 72475 84770 24908 -72890 -126415 -143316 -137520 -151930 -5484
19671 -5484 32305 -33787 -133195 -117299 -112362 -68304 26807 -1411 4910 9341 -29145 -91057
19659 -91057 -53171 -167071 -121125 -108215 -45686 -19623 -42799 -40924 -76672 -68129 57272 27244
19647 27244 11001 6627 -68099 -78276 -35393 -44540 -74694 -94902 -92273 -78791 -185967 -183510
19635 -183510 -50247 61258 70474 76602 29731 22110 -39528 -142024 -244013 -139643 -38357
19624 -38357 35538 1527 43692 17939 -72575 -44327 -33816 11362 111025 158078 113082 59098
19612 59098 45636 -66063 -105186 -237168 -280303 -117099 -108050 -117942 -150616 -191743 -130124
19601 -130124 -37773 -39973 -113193 -189914 -186043 -102262 -88280 -31040 100589 191100 134837 -6194
19589 -6194 -111438 -55406 -30301 -129178 -116070 -107935 -9192 11481 83178 124810 93237 -13098
19577 -13098 -8890 27616 69060 53642 60168 103338 70269 -74588 -130923 -31619 93731 165265
19565 165265 46690 59216 92869 -3846 -15654 -43817 -72903 -50588 -25426 -60639 -128947
19554 -128947 -132366 -21969 24832 21167 17351 -73693 -106555 -21275 26709 15981 -66747 -97954
19542 -97954 -517 89000 129363 137503 103690 74222 40238 39127 -5657 -63144 -102242 -58874
19530 -58874 54842 27746 64548 32846 67929 -14755 -68075 -144592 -185335 -157800 -80688
19519 -80688 -61259 -16499 -33979 -79331 -82494 -53045 -59734 -9389 -75248 -107454 -16259 -19248
19507 -19248 -58034 4107 38230 64163 119602 56218 -49074 -119843 -28447 44706 1524
19496 1524 73723 83565 29980 5225 48945 58529 84335 106234 1157 -43869 -13571 -26704
19484 -26704 -20435 9121 -6107 -64753 -73597 -117567 -175172 -86201 14272 -48145 -97828 -98255
19472 -98255 -122757 -204432 -178610 -38101 17513 13944 11392 -41578 20570 113392 130303 -17775
19460 -17775 -116012 -45359 -75998 -48722 63278 52031 -47854 -90021 -150558 -168588 -156135
19449 -156135 -200439 -97278 37583 17114 -6289 -82587 15310 75136 -20253 -106659 -3717
19438 -3717 45165 -50457 -105139 -90775 -98057 -62763 -84106 -55494 -89730 -20072 48199 42917
19426 42917 -38794 -77373 -54 60616 -90685 -161154 -106899 -42317 -52664 -37126 -83100
19415 -83100 -85290 28232 65048 123904 49701 -17852 58649 79027 37395 -96305 -86897 -49897
19403 -49897 -5175 29994 36652 42846 44168 68231 69074 -13251 -22673 -6047 -34512 2177 -22430
19390 -22430 -117679 -81186 -4181 -50084 -11092 37234 82661 35585 85287 105383 82475 -74661
19378 -74661 -111011 -40875 12205 -30288 -109950 -95697 -93495 -92975 -68198 -26120 -4240 8637
19366 8637 51708 93539 124046 43264 35775 -15758 -117707 -51114 -23839 -153125 -137516 9502
19354 9502 64412 76426 111409 110154 188032 122968 37675 -33530 -71469 -25454 -26928 -94303
19342 -94303 -77183 15672 6752 -134401 -178870 -132947 -86246 -48531 17674 63975 -18046 14192
19330 14192 83931 135870 97494 -34961 -84368 -44756 8398 8580 -2068 54605 59426 72964
19318 72964 17617 -98130 -60976 44430 44163 -6961 -66871 -116738 -118665 -1874 68429 70661
19306 70661 54367 54927 42558 25733 19631 52908 136328 85252 -88 -84659 -98571 -78445
19294 -78445 -68187 -81626 -12929 -30098 -108116 -104663 -16898 -2503 32188 60955 96705 7880
19282 7880 -4656 -50217 8792 1224 -40820 -17059 -53103 -69668 -3511 42661 113370 71165
19270 71165 21720 -127441 -196007 -148914 -141740 -79150 -70977 -45357 -1676 27595 83061 -49302
19258 -49302 -92655 -129399 -113516 -113999 -102295 1060 18685 36441 -10422 -97977 -166480 -162086
19246 -162086 -112044 5609 81781 68343 -46868 -44680 20020 -68990 -126762 -42062 -83099
19235 -83099 -132697 -169338 -77716 38253 -42897 -68109 -43025 -10438 -30911 52155 81722
19224 81722 52809 34711 52519 87614 37708 15200 11680 2289 -27932 -54527 54773 23279
19212 23279 4776 96689 61281 29602 19341 -12903 -62785 -22723 -93525 -183915 -211952 -169168
19200 -169168 -182087 -45229 -14173 12995 -63989 -68003 -37971 -42146 15441 4830 -8806 16323
19188 16323 6172 -50469 -23823 -8622 -39618 -189020 -186201 -84801 -129892 -119422 -127389 -17794
19176 -17794 103652 137843 140854 115742 15993 -81539 -64810 3818 66805 152612 89147 -23841
19164 -23841 -83267 -68081 5383 46297 38985 -39938 -66044 -4574 38745 9502 -83478 -25890
19152 -25890 61556 85274 135570 97761 53170 -6112 -74258 -51290 -20592 18904 -43724 -128856
19140 -128856 -60269 -92939 -67318 -37985 -86646 -4550 80425 93963 13473 -17991 -134957
19129 -134957 -190945 -138120 -102348 -57797 -63144 9627 7295 -69681 -105498 -126589 -141548 -145608
19117 -145608 -28358 -33363 -160214 -175797 -205271 -116500 -84057 -146349 -91349 -15383 -11286
19106 -11286 13484 -11890 -41222 -62844 -56400 -12764 -6340 47124 -863 -33268 34186 53548
19094 53548 111316 43306 -385 -160686 -230741 -255535 -106425 30851 83868 85763 70930
19083 70930 39367 76533 59 -141691 -101758 -135252 -86272 -15325 -86865 -185927 -61304
19072 -61304 9292 52364 47705 60280 33706 69360 24820 -41903 -70526 -63843 19069 47104
19060 47104 2805 49281 9838 -87590 -113771 -66038 -31368 20466 47781 11045 71334 35813
19048 35813 -17258 -24995 -21543 -68582 -115348 -5718 52245 -35242 -66515 2331 2829 -28806
19036 -28806 9713 47300 9462 -104778 -192795 -207074 -135494 -39553 17472 61832 -1258
19025 -1258 26606 44766 -9325 -29865 -67036 -75206 -45788 -32445 -103766 -73110 -6158 65461
19013 65461 76542 -21426 -126474 -201966 -164042 -26 93663 64524 53214 146131 93205
19002 93205 10486 62507 29989 -19804 -157159 -163198 -86748 -22244 -21624 -26596 1114 -55561
18990 -55561 -76292 -100789 -80824 -138500 -136242 -66390 76750 49054 -22201 -98801 -80184 -75867
18978 -75867 -128225 -108500 -90859 -63929 3045 31842 166 -20794 -2291 129929 134489 90377
18966 90377 73312 17991 6997 59723 -38992 -9563 11243 36030 32821 34155 70052 92045
18954 92045 198325 182439 144910 141231 211856 208741 131855 112577 111675 29561 -134482 -107851
18942 -107851 -102555 -148701 -191783 -220155 -176337 -163404 -97713 -102289 -194950 -183311 -197137 -172032
18930 -172032 -204574 -182739 -135774 -100774 -40301 -10774 -13464 -53860 11980 -32239 -74246 -70631
18918 -70631 -126325 -209858 -186101 -205798 -251080 -235910 -130281 -88519 -6382 -1063 -16340 38530
18906 38530 65426 44924 80006 35117 50946 36718 -46557 -94656 -39230 -4936 -37624 -11519
18894 -11519 -109040 -122061 -61470 -67180 -40160 -34087 -121480 -141298 -49335 13390 82914 133154
18882 133154 108902 -39977 -96494 28097 -26651 -53627 -63364 47855 53793 31807 53810
18871 53810 -84971 -175689 -136163 -78440 -98073 -116839 -124856 -111659 -114364 -103319 -428 65897
18859 65897 66587 23784 -70733 -115739 -101531 -108927 -126374 -117277 -848 17917 88314 134979
18847 134979 110901 55050 42365 40650 3325 -4395 1007 -39275 -84878 -145474 -38432 59351
18835 59351 39922 16917 80634 176984 181358 135327 67914 54531 -9996 1886 -58293 -149135
18823 -149135 -145164 -65455 -96714 -115579 -68162 6507 82584 137659 -14272 -65453 -116886
18812 -116886 -200373 -148325 -58102 -24603 -29051 28460 -67876 -114555 -7483 72869 53733
18801 53733 -579 -74424 100260 177370 181786 105508 97177 77003 36836 9579 802 -4158
18789 -4158 57985 106835 149682 44493 36563 67552 72618 46621 -6582 -16048 22141 74846
18777 74846 -29488 -98737 -69002 -41049 -38316 33505 70523 118001 56201 -18611 -158523
18766 -158523 -162768 -65826 143795 145487 107466 109516 109708 46675 128678 90897 36427 -23526
18754 -23526 -9068 78744 52176 -30680 -10173 -78392 -110393 -109972 -113405 14796 123496 132302
18742 132302 72963 23821 -40158 -46475 75212 92187 81347 99963 53044 -2726 24128
18731 24128 -97403 -168589 -84673 -20776 1270 23710 56607 118143 42681 -60144 -70271
18720 -70271 79105 70812 -29343 -111493 -104330 -34266 -103649 -95411 -157639 -161245 -67904 -62037
18708 -62037 -23126 109630 73186 -68432 -140420 -119836 -30895 71815 34260 -53988 -96447
18697 -96447 -16760 27661 7047 33846 65017 79879 116021 144332 143128 132122 37430 -87452
18685 -87452 -105827 -54092 5752 57583 90033 166778 92997 19916 14871 35721 78791 184321
18673 184321 203700 129282 65528 9013 14130 154852 180342 117372 47312 104755 106567 96066
18661 96066 30230 -1630 -7035 -22448 -63643 -72083 -68509 -149291 -211256 -140336 -52491 27600
18649 27600 56780 12885 91550 129057 65019 -81939 -170758 -177107 -152705 -19843 77971
18638 77971 34830 -53455 -48154 1223 9496 57233 88278 16824 16911 20128 66004 92353 119760
18625 119760 73085 14961 -51213 51071 150318 92731 23711 -17688 -12191 -65529 -3731
18614 -3731 12235 -9362 -65371 -181785 -145533 -58620 3941 61320 106412 70650 43929 125233
18602 125233 194886 107515 79525 49879 141121 152125 57307 2495 -36166 -79949 -37424
18591 -37424 49801 57705 -1640 -102723 -122155 -109040 -108297 -100110 -87277 -80912 8507 115298
18579 115298 91196 -17244 -34255 -43007 -112162 -116644 -18254 26433 8925 -59704 -60835 26554
18567 26554 -39324 -36271 -78945 -68239 -7110 -40618 14879 65038 65999 -19921 -51887 -87368
18555 -87368 -106315 -106785 -13833 5064 37953 47840 69341 41470 81993 81603 35057 -71374
18543 -71374 -190416 -248990 -168961 -65508 -23847 4230 27152 -49103 -7026 -23695 -83351
18532 -83351 -68077 -1588 34983 42242 52060 -15422 -7560 80076 6129 -49664 24348 114106
18520 114106 89550 -30791 -134365 -153957 -23538 -55531 -55279 -29481 23411 47215 13233
18509 13233 -26041 -5503 -44519 -84556 -7834 120693 142654 121330 203371 156757 -23430
18498 -23430 -74434 823 99084 91472 6868 24482 19741 40568 36353 -14775 -35497 12411
18486 12411 60900 118392 114119 82821 33813 -12420 -51626 -119804 -130011 -92647 -58063 -1419
18474 -1419 69811 194592 92098 -14959 2765 38396 83410 85344 33 -36455 -78205
18463 -78205 -119409 -73313 -28731 -64867 26199 -27271 -74707 -173452 -217449 -214820 -184960 -180441
18451 -180441 -181520 -214649 -179652 -129199 -46564 -87170 -101874 -38021 4935 -4780 -48531 43832
18439 43832 83542 56539 96049 63870 1964 188065 207776 59847 66712 73011 17288 18454
18427 18454 -2700 -25559 -57428 32099 13108 -70735 -43112 25875 61162 64350 -2959 -27429
18415 -27429 -25388 66633 66611 1455 35821 5926 -8463 -4633 -6025 -7267 -44264 -52391 -121319
18402 -121319 -184273 -192119 -89603 44356 57641 -37036 -5027 29763 81573 95076 34380
18391 34380 -11454 -5012 16604 72762 161917 219118 199416 139896 70195 -9190 -131829 -100420
18379 -100420 52407 163869 139171 166882 160762 77750 -10700 -9290 15401 93211 94608 50344
18367 50344 30259 16944 84034 193703 164801 140542 167016 207174 44801 -33382 68194
18356 68194 161572 176804 100469 122397 131876 93751 23651 69560 -36036 -109311 -108022 -147541
18344 -147541 -95118 30548 47729 24259 83472 124765 31984 -14941 -101001 -164214 -135249
18333 -135249 -28883 71358 17156 -56231 -154234 -64362 94700 112750 -11991 -53018 -54073
18322 -54073 -8891 86364 81736 78793 19361 64474 62648 55605 -41713 -68007 -80095 -80336 22144
18309 22144 43316 131583 126643 64281 2068 45928 109181 -30822 -82129 -52068 19384 41652
18297 41652 -3775 -17756 -33622 3335 84123 63068 8923 7479 92568 52983 11344 36767
18285 36767 58505 17735 -5691 12481 -5823 80822 137451 118935 167137 120966 189210 266890
18273 266890 186384 120120 193711 185899 40774 -123507 -131804 -77588 -67043 52671 32807
18262 32807 27236 130306 164398 223051 136033 125507 40417 -14326 63685 69917 8640 -60820
18250 -60820 -80031 -73485 -2125 12080 -33376 -177795 -209456 -163220 -159927 -197266 -164438 -116318
18238 -116318 -108081 -106449 -85774 -27955 -16379 49459 179593 125522 125549 118517 137337 151001
18226 151001 134082 98694 182399 217733 203162 203692 272860 345219 421363 619320 867565
18215 867565 1172535 1564016 1855399 1868934 1631228 1274997 1013788 827009 636578 380819
18205 380819 231880 127954 190715 249134 231430 113874 62975 65889 66310 119864 194002
18194 194002 220574 106850 29567 80549 74808 63407 18390 22557 30552 18999 -17605 4538
18182 4538 69219 65692 146751 176226 84630 73230 4245 -15964 -88198 -32203 -1289 31611
18170 31611 125505 46342 -3225 33022 -2783 -7415 -31487 85561 53424 -73803 -50928
18159 -50928 31595 87351 -16264 -66650 -65749 -43977 -38509 -8541 57570 142661 165035 147275
18147 147275 150513 178490 207567 201057 129636 85399 162339 179987 149722 35802 18114 97876
18135 97876 96619 38852 -48708 -36335 35090 34466 19 91985 140470 169705 135965 43195
18123 43195 -61026 -83358 -89509 -46831 -1581 -1733 61562 80638 92851 70671 26254 -35767
18111 -35767 11655 28354 86438 7033 -43339 30106 53957 97720 163351 130181 77884 188720
18099 188720 216817 253904 232306 139331 52668 98667 218236 162730 119304 44999 62188
18088 62188 34717 11135 -59376 -58472 41972 106066 159666 125695 75462 57161 52258 109593
18076 109593 179994 215565 124740 55747 40658 69370 45475 37338 26231 24745 33141 76163
18064 76163 31326 -524 -31285 41192 64997 -44852 -76651 -75888 -83085 25924 182072 315378
18052 315378 151085 100042 54536 3779 15670 -12427 33300 -35217 -46503 -112453 -120999
18041 -120999 -40847 -15003 30647 -16138 -18806 64273 109852 9020 8142 34964 24089 82156
18029 82156 45267 -89362 -172513 -73664 -39255 -7965 39719 12274 -80837 -110073 -71409
18018 -71409 -40839 -75162 15837 88360 3964 6603 -28427 -65873 19555 117515 79261 65992
18006 65992 -27247 -47450 -20717 84410 113216 58723 182118 230659 185510 202454 73529
17995 73529 801 29650 -21427 -19305 42806 129838 152098 132337 108555 76329 -19684 -63368
17983 -63368 -27334 11100 56095 82040 142320 208154 172922 198391 244153 231611 183145 97314
17971 97314 36800 307 27568 -37803 -179855 -105389 -38701 -16135 -62280 -72010 -17637 38122
17959 38122 109570 30680 -180280 -69622 104934 197830 175989 66186 -1686 118937 166879
17948 166879 165012 92675 -14567 40414 53994 134210 128694 173447 184375 112092 -38793
17937 -38793 -76442 -70869 -24005 117311 225715 206797 137821 105055 86003 170539 246799
17926 246799 133084 40618 80806 22342 -35126 -3973 -79200 -115786 -107406 -81795 -22199
17915 -22199 -24854 25661 -22225 -156726 -137273 -105460 -22229 12328 -66646 -37854 87004
17904 87004 158661 60549 -16899 -42953 -94058 -69207 -41173 -88665 -72690 14083 54443 80062
17892 80062 28181 -12104 10866 -13695 58266 111857 64000 48247 105759 94612 22292 56652
17880 56652 -4688 -46306 65307 159386 106617 133397 303212 375351 423968 434802 355253
17869 355253 252723 125390 138604 195157 262362 272972 165170 175193 155165 204694 281443
17858 281443 268546 192791 187213 144295 64765 -58793 -73610 -70358 27126 186196 301524
17847 301524 334219 400583 414489 342282 233409 249619 217947 177805 168700 83552 -50999
17836 -50999 2889 69660 115214 113695 109173 125384 159953 83385 56104 40289 50150 135128
17824 135128 108380 36815 -74614 -43700 11724 128665 127483 9192 -3469 75113 133691
17813 133691 121932 161657 115172 122260 44955 151420 171163 161041 130527 123335 216376 274149
17801 274149 298728 254745 162994 73348 120060 209039 302687 177650 174587 213035 203905 92341
17789 92341 64353 174881 167982 100330 156196 122876 95345 147693 174158 218101 240754 180757
17777 180757 217308 166672 35253 11833 72290 224027 246307 243876 271468 278315 220306
17766 220306 247922 245074 255874 261435 224724 168196 251196 326373 378679 435017 380689 321127
17754 321127 312942 451123 502532 568162 581246 606049 633348 739919 899180 735845 191036
17743 191036 -79685 -202671 -206646 -165196 -108184 -59954 29426 35404 35744 74377 96218 108494
17731 108494 200775 196283 113581 72940 50090 8066 40487 180339 167782 156525 104382
17720 104382 104773 64579 77500 107978 174360 210785 243890 182137 123819 183796 295841 299646
17708 299646 274070 214157 152622 137187 232331 280797 235602 297727 316013 296554 267908
17697 267908 249044 212916 223168 212437 346425 275758 189828 241002 258180 146052 170123
17686 170123 299300 330196 294483 376794 396920 390954 377508 380416 524438 622525 636819
17675 636819 633311 593279 538979 610973 582669 548348 520909 632561 670487 769874 815352
17664 815352 769854 852674 973879 973939 933629 992744 1029371 1068399 1186132 1308030 1455689
17653 1455689 1539995 1673506 1876431 2093229 2324291 2757386 3696250 4617431 4764303 4212220
17643 4212220 3586134 3413936 3494194 3604104 3861228 4341259 4945498 5704113 6934780
17634 6934780 8227584 9048618 9315509 9778474 10761428 12381149 14750489 18300549 23481717
17625 23481717 31125721 42112654 59895623 92877305 158301163 285231854 442536964
17618 442536964 494777925 393020682 246171158 152245873 98402967 66675370 47399511
17611 47399511 34804835 25934596 19751312 15354321 12299451 10167888 8805045 8141678
17603 8141678 7981781 7548099 6410105 5166772 4340619 3741325 3237247 2883228 2846482
17594 2846482 2958999 3339004 3917964 4170037 3653827 2737241 2130526 1785908 1503831
17585 1503831 1265027 1137894 1116189 1052008 1064247 1147718 1129081 979201 823725 739722
17575 739722 663658 709207 755512 651638 519459 514813 500142 469350 452774 388658 284422
17564 284422 233839 162944 231089 216200 118769 -40570 -18643 -992 59285 -12133 -39003
17553 -39003 66679 177209 266361 201791 118763 164080 111057 18851 34425 35754 -2181
17542 -2181 22056 62634 17120 -21479 7669 76532 137465 87308 2463 72610 58243 37016
17530 37016 8172 55136 70949 70118 39361 76661 73900 145339 36453 -33857 -99527 -109463
17518 -109463 -65763 -109636 -102616 -159565 -207831 -248300 -157026 -51101 -55123 13893 119454
17507 119454 119566 92745 169581 184270 141439 147684 172856 192675 155178 165628 237990 313471
17495 313471 481438 664561 816883 708912 259619 -122936 -182173 -46335 -55786 -113008
17485 -113008 -93028 -83411 -162144 -185056 -94474 -64266 -62926 54409 52941 -115898 -134913 -163270
17473 -163270 -197513 -230984 -211708 -191871 -180706 -145317 -140946 -102678 -160300 -135860 -61477 -107016
17461 -107016 -114620 -110572 18580 40115 24796 -40150 -106627 -94236 -151731 -177191 -191087 -201145
17449 -201145 -155863 -42509 -75521 -153675 -200260 -191561 -172279 -73314 108837 75397 -31190
17438 -31190 2628 36915 -78149 -98380 27284 96804 102191 49066 -12405 -118241 -119647
17427 -119647 -102418 43159 50637 -7740 -16232 -55523 -131887 -196185 -113302 -28984 40184 109723
17415 109723 142896 131290 146010 133878 34010 -36994 8395 -19676 -80962 -169336 -142422
17404 -142422 -80285 -106195 -104339 -175992 -221562 -62339 58496 64666 7493 -42164 -112238
17393 -112238 -130056 -139651 -99996 -172714 -161982 -110157 -134629 -120891 -77280 -53069 -83294 -19389
17381 -19389 -62612 -50726 -46574 -69136 -149038 -84240 -26320 -83577 -94150 -153489 -174011 -111979
17369 -111979 27370 39705 16646 -2594 62837 51138 -432 -106769 -43266 -98034 -68404
17358 -68404 -61228 -32012 -110743 -92333 -30168 -42744 -157603 -190695 -98968 -41026 -22502 -66888
17346 -66888 -195819 -239975 -164397 -135660 -130612 -108209 -115110 -160541 -272439 -244496 -95216
17335 -95216 9392 -26662 -25337 16993 -40318 -105488 -150907 -131285 -118066 -51225 24814 -41748
17323 -41748 -66321 -53043 -64636 -160180 -187889 -126242 -107853 -85866 -157502 -172324 -102412 -72700
17311 -72700 -19916 -1383 -48189 -187935 -240122 -162202 -115370 -61897 3475 -43540 -71265
17300 -71265 -96827 -127223 -39917 10208 -49648 -20924 1227 -47448 -55369 -17601 11768 -66
17288 -66 -32900 -65164 -24657 28446 37398 39514 -17445 -25282 -45209 -61998 30760 13962 -126110
17275 -126110 -182730 -8921 89943 69229 88966 105466 56100 -37302 -64639 -146097 -202975
17264 -202975 -137861 -84091 -128211 -126280 15024 63497 -22862 -66281 -27416 -15677 -79823
17253 -79823 -126387 -97197 -56269 -74014 -118408 -180454 -102137 31082 6072 -80252 -193562
17242 -193562 -146242 -109713 -122253 -138626 -206474 -205602 -255254 -226652 -233188 -153176 -109359 -85936
17230 -85936 -111084 -153784 -79728 -56122 -160999 -127942 -37382 -14704 965 -78201 -167475
17219 -167475 -177109 -156238 -126474 -19587 45715 142817 34332 48825 72142 2883 8192
17208 8192 61991 51235 24170 -8587 -52664 -7627 -71359 -124328 4978 86502 -14729
17197 -14729 -19989 25808 36854 -18237 -99607 -112828 1706 9622 -1560 42222 110606 31250
17185 31250 -70284 -104118 4966 125059 67042 15997 -9571 16314 85769 128861 48104
17174 48104 -32195 -121466 -123184 -95569 -33001 24729 -61177 -97049 -143482 -156790 -163010 -42476
17162 -42476 -52847 -5660 10655 -5989 -40687 -48361 -25844 20818 100412 150449 68495 -87319
17150 -87319 -123086 -60268 -54134 -39432 -107803 -84018 -69860 -118355 -136023 -56029 -46344 -101647
17138 -101647 -168248 -155456 -114356 -116765 -91720 -144279 -174620 -210386 -168603 -75317 -61705 16179
17126 16179 88099 90013 73554 -20006 -69025 -96373 -140930 -38240 3760 -45481 -50135 -52970
17114 -52970 -84153 -110275 -25467 -33906 -23139 118694 124541 63286 75140 73498 76922 51159
17102 51159 7942 27033 11523 126330 65059 -64137 -9520 8863 127800 139674 99369
17091 99369 -2315 11869 33747 25933 51531 -56330 -139880 -179417 -142502 -79922 -30400
17080 -30400 12753 10063 -74198 -34541 30968 39150 28833 17097 -43260 -129034 -98794 -98129
17068 -98129 -27710 44303 -25846 -55361 -18599 -28366 -36448 -55663 -84793 -5714 7791 188
17056 188 1999 -14481 -24517 25216 -36380 40186 76334 -6742 -103583 -84165 -92405 -70261
17044 -70261 5344 60664 19698 -61668 -120443 -83911 -19459 1276 -98648 -165505 -159752 -33257
17032 -33257 10651 18656 2359 78475 135357 136436 126077 146213 266671 318480 488076 554402
17020 554402 800350 1195839 1540136 1740703 1561826 1200471 776090 595166 501683 440936
17010 440936 364574 337635 210761 161242 260935 378919 580686 699643 621305 467728
17000 467728 327819 134597 -37319 -25814 -55603 -70362 -48731 9441 141224 90947 27250
16989 27250 -18469 15463 27795 42655 22041 6169 -42308 -54752 -19364 -23763 11432 -66279
16977 -66279 -33490 27191 3415 20347 169615 200090 148869 90679 43412 11315 -43650
16966 -43650 -28030 100950 104448 -3968 3181 43477 100963 160577 120535 131282 146864 -13396
16954 -13396 -167148 -203852 -167043 -120173 -34340 33523 121862 79976 -3069 41585 81350
16943 81350 25869 35979 48554 69563 75502 3100 -39563 -4914 -9797 117422 180222 215476
16931 215476 162384 138524 81061 -856 -1477 21425 62270 -13638 -60859 -139705 -101943 17006
16919 17006 115932 183633 104812 -6560 62597 102326 -32933 -23272 -70685 -59875 -1723
16908 -1723 -7845 -29027 -23988 23994 28247 25853 37486 84300 70927 -7731 -16575 99855 113923
16895 113923 107127 52615 -78470 -53885 54391 72106 18589 9668 -18513 28698 49691
16884 49691 -27784 -74312 -28971 -27642 -4086 -47752 -118768 -80922 -11089 21260 46583 12472
16872 12472 -12229 -114383 -152017 -103230 -125381 -93672 -126277 -197334 -179595 -276529 -274185 -228242
16860 -228242 -170137 3137 85738 -33800 -99948 -158823 -173052 -86868 -39064 -8081 50118
16849 50118 74447 28501 76587 129697 1459 -39072 127545 135777 76132 84033 9782 -6667
16837 -6667 25294 -13187 -29839 56513 83008 93826 99195 87198 68559 47075 24677 13196
16825 13196 -3005 13076 34630 -12911 -11838 -12341 62838 50630 -75623 -105887 -82082 -94987
16813 -94987 -54611 40366 133763 181118 274316 179056 116207 186947 169862 45402 65579
16802 65579 23664 24912 55237 46627 69608 45522 -79255 -36969 30340 82508 -8626 -13791
16790 -13791 -105878 -106840 -49471 -93149 -94777 -111372 -145521 -143572 -168776 -196780 -233541 -128340
16778 -128340 -62247 -142214 -78064 -59574 -25325 -20664 -84693 -42667 -94906 -72635 -14569 -75152
16766 -75152 -44109 -29407 73788 114212 42962 37228 44809 33083 44313 17672 -147940 -227486
16754 -227486 -179926 -164440 -144194 -154287 -116941 -47419 -58619 -95505 -88552 -89664 -95507 -144819
16742 -144819 -82206 -76483 -112112 -44090 18710 30500 1795 -68583 -13772 -53343 -48058 52445
16730 52445 83820 58002 37990 84252 130315 73184 52204 59234 62744 112124 71445 94457
16718 94457 72388 3515 -36658 -23301 -133057 -80151 -44822 -50875 -6177 19312 55922 -28900
16706 -28900 -221203 -224319 -184265 -161816 -151518 -118121 -129354 -100738 -94952 -112975 -39802 -17629
16694 -17629 -60007 31597 75304 61980 15119 5944 -25088 -74426 655 -51356 -134747 -132546
16682 -132546 -51685 106709 4503 -53586 -49467 -35516 48566 53414 98149 141591 61065
16671 61065 -31064 -39772 55763 -24314 -102382 -134828 -216970 -155077 -31701 -9932 17993 -51216
16659 -51216 -43543 -85541 -164261 -168425 -128783 -143654 -99471 -982 -48653 -51175 -100206 -53755
16647 -53755 12822 -7035 -60076 -105279 -89430 -27373 -90825 -42018 -52000 -96459 -8229 81634
16635 81634 114339 138024 8695 -104353 -172757 -162021 -128241 -121634 -79019 37527 47206
16624 47206 73012 57679 138405 210473 118842 2352 81345 124567 67029 74718 67887 56256
16612 56256 -56999 -129942 -124013 -19872 -58117 -21539 99169 -7520 -48471 -122155 -137501
16601 -137501 -87661 -16154 78864 44108 -42891 4334 -55265 -114343 -188229 -196071 -216924 -93968
16589 -93968 -95633 -72133 -20048 -4560 8254 3200 -18994 82185 45223 -73860 -94540 -29373
16577 -29373 116050 91736 83895 151683 108248 77215 52581 67458 51088 28047 -60870 -22048
16565 -22048 -51334 23484 -16744 -47670 -13519 32788 38552 96681 130228 88753 38363 -35245
16553 -35245 -28162 8197 -31554 -63176 22518 26677 -40957 -71373 -57162 44060 142071 234676
16541 234676 282701 129955 -11941 -98545 -49629 2496 21669 -13946 20845 -10873 -17819
16530 -17819 -8438 21684 -51453 -134016 -86076 -23798 31925 43384 81196 70176 5822 -32499
16518 -32499 13689 60837 19236 3421 54341 53400 125423 156382 104500 92871 16757 -18637
16506 -18637 32956 84921 82829 126929 83098 -64894 -150515 -114479 -80686 -26546 -77768 -73872
16494 -73872 -2802 39472 -23278 -81548 -97674 -147679 -103829 -164057 -90371 -100835 -110875 -99044
16482 -99044 -79528 -76715 -133123 -136462 -149802 -151453 -116354 -78926 -80641 -54465 -110474 -66432
16470 -66432 38778 114763 126866 53621 -82586 -140753 -88801 -61380 -31441 31244 5740
16459 5740 494 -48406 -120574 -139433 -81167 -90665 -50310 -38766 -48559 -60122 10508 117268
16447 117268 126034 -71521 -191953 -209545 -167607 -165639 -181705 -141946 -35111 -24236 -12324
16436 -12324 22474 43552 49703 60593 140376 149391 152807 88838 94570 7547 50699 29182
16424 29182 32760 93241 126280 76179 102014 55549 27997 33758 90622 65876 -8761 -44313
16412 -44313 -48629 -28246 -89667 -87725 -123962 -122704 -120849 -161453 -142890 -198586 -206965 -75180
16400 -75180 -36021 -138588 -166589 -78859 -43121 -53263 15417 77565 -12432 -88990 -167818
16389 -167818 -217291 -137303 -24336 21841 22826 -14822 1251 -42720 -104233 -163105 -144990 -90066
16377 -90066 54601 23469 -13461 4836 6747 -12565 -72408 -190148 -185049 -91831 6229 -16009
16365 -16009 -64837 -82390 -17827 962 -11843 -6282 -107706 -116912 -156932 -39966 38252 -697
16353 -697 92487 105112 -33286 15410 63691 -36766 -61644 -110457 -149865 -137415 -46680 -75452
16341 -75452 -166222 -151863 -6708 62719 54871 31942 95161 67924 69617 -23653 -114297 -36861
16329 -36861 109257 136559 32144 102207 171499 91061 -81382 -68993 47486 26822 -119901
16318 -119901 -82201 -68390 -4521 80028 109622 25256 6685 -13076 27339 78318 -32698
16307 -32698 -59374 -63329 -40559 111848 106672 56890 33525 6212 -1930 -62606 -135109 -101535
16295 -101535 -34361 24957 31862 -31725 -30760 -42137 45028 122612 43812 -35891 -17970 38494
16283 38494 96270 205963 115392 71961 14214 -38724 -74683 -142805 -95932 -21860 -16280 -20392
16271 -20392 70221 36565 -44384 -148325 -187206 -149560 -153294 -75236 -8980 -66080 -95767 -127168
16259 -127168 -162235 -145470 -61678 -43006 -115868 -48601 -27079 6792 19748 -22265 -59675
16248 -59675 -110127 -79131 -32117 -75125 -130623 -78963 44650 62934 65034 67471 113771 122376
16236 122376 142881 133783 93924 30533 -14014 68599 73388 27947 -19029 -25116 -21790 11489
16224 11489 -27453 -67445 5810 25830 -88676 -109273 -126485 -112103 -72211 7352 18586
16213 18586 -42818 -159347 -101880 2629 6174 109992 165151 41874 20679 -21255 10564
16202 10564 43263 -59231 -119428 -87450 2147 -24274 -66163 -50698 -25884 33578 67555
16191 67555 74987 38992 4494 61645 129441 206824 166504 43273 -41616 30758 109003 86729
16179 86729 95496 91522 -5267 -101395 -49750 33430 112315 147709 126257 51595 -17408 -158872
16167 -158872 -186585 -120535 -110301 -51622 -76388 -36887 -9320 6734 80910 122377 101261
16156 101261 165443 213557 175545 51794 56400 46315 44140 55196 25609 -40098 -102620 -94817
16144 -94817 7539 -88496 -106399 -82348 -49165 -3937 76719 43964 1822 -39415 -24853
16133 -24853 9293 28192 -26136 -77112 -42864 25895 37306 90250 83960 -15376 10700 -69518
16121 -69518 -48994 132629 97776 105939 40569 24914 -28629 -4279 49777 5667 -65303 -151398
16109 -151398 -102033 -61159 -10741 -126690 -6654 174520 182812 129562 132225 70086 75018
16098 75018 37733 18490 8843 49047 113923 59111 70337 1546 -15381 12501 -76017 -8382
16086 -8382 97468 37448 -33301 -33956 -34167 -16620 31184 55285 56966 58121 59844 90543 96605
16073 96605 5698 7488 62419 88090 16721 -47045 -72667 -99499 -15261 45846 98120 86144
16061 86144 102490 117598 75694 6830 55178 39539 -87775 -45339 7466 -44403 48440
16050 48440 107450 21999 -115750 -119567 -115652 -140747 -191717 -54561 67559 18270 -31064
16039 -31064 -86299 -118284 -77839 -32942 -18987 -28477 -2932 -79265 -86520 -104283 -113142 -86410
16027 -86410 12957 -47216 -38250 31640 -68341 -47271 -66593 -21453 -62796 -68834 27058 -8977
16015 -8977 -26780 2573 84838 160955 91299 20577 13244 105239 152584 148974 149202 89637 -17667
16002 -17667 36439 68137 90642 139473 87710 33736 8794 -29474 -81779 45870 39505 37860
15990 37860 21699 68359 101771 76906 138798 151840 159009 193654 123848 32364 -5936 -34271
15978 -34271 -57121 -21521 84733 113646 108108 148877 146628 161472 128750 99433 76383 26327
15966 26327 64222 91389 5379 -89005 -94128 -123875 -102991 -132412 -140045 -107532 -29971 -12534
15954 -12534 -83640 -4231 -20870 -11149 -44891 -30158 -63509 -34775 -36306 31965 50593 87448
15942 87448 114713 44081 -17422 -52388 -23143 -47663 -53096 -61796 -97938 -136598 -172448 -132171
15930 -132171 -135211 -149986 -155176 -124511 -68889 25453 87428 -5721 -118399 -191936 -166462 -120294
15918 -120294 -102138 -122538 -92078 11906 44237 -33227 -6289 55474 9502 -52558 -35755
15907 -35755 -14484 8212 -14489 40995 102074 62968 89958 1959 10697 44390 76571 44165
15895 44165 -78211 -71252 -26691 19386 -74312 -100481 -11571 -5529 -10337 72454 153236 109223
15883 109223 -2871 -50203 -15114 -60577 -38119 -23324 70957 199537 163282 121794 49952
15872 49952 6760 -76700 -49294 -5394 50141 86345 -79486 -94880 -169464 -100318 24953
15861 24953 142037 160702 136758 95636 99722 142201 171322 129283 15151 -16215 -11998 -18466
15849 -18466 -55769 -70607 -56369 -6562 -63849 -108473 -28029 42033 67544 98855 84110 -31380
15837 -31380 -29803 -19565 38603 17145 -21629 -57385 -46413 -31759 -64552 -59217 41387 42953
15825 42953 -38505 -108576 -104894 -102235 -95285 -103973 -73903 -34377 -51253 -74650 988 50899
15813 50899 3912 -14900 71823 175638 123757 49380 129367 222056 293009 231705 81775
15802 81775 60374 16709 -14132 11 -38698 3166 5690 118438 152709 162265 76584 105482
15790 105482 159648 145545 56119 -22268 10468 76037 102925 -21485 25194 110746 146711
15779 146711 108223 -15180 -26767 -15950 66529 137361 150841 182401 164112 51135 15406
15768 15406 9030 -84696 -84922 -210048 -276022 -227361 -110757 -29500 -113763 -109142 -17334 39270
15756 39270 41843 -2788 -40731 -63164 -73268 -26243 17367 -38894 11263 66633 87146 75792
15744 75792 61626 -1322 -79977 -70083 -20968 -87562 -48856 -73989 -140419 -124080 -45829 -10576
15732 -10576 84389 154282 121392 -53185 -179456 -94621 -22741 35489 107373 53767 9876
15721 9876 37514 5427 -35486 39519 126999 44031 118015 118003 -28943 -44476 -89571 -88684 -39005
15708 -39005 12700 15123 -41207 -31210 -12429 -65590 -127478 -127301 -176533 -113261 -57748 39331
15696 39331 102927 44809 66139 108451 138933 205827 117983 -29289 -43330 -100277 -77497
15685 -77497 -153602 -146655 -30215 12650 -59654 -13201 41087 49266 94167 91938 30165 41234
15673 41234 86690 90448 85112 -44193 -166718 12338 148972 164838 129476 52372 77134
15662 77134 143842 88680 50954 4059 -5351 53214 95637 60813 27832 56554 11583 -108003
15650 -108003 -104875 -37579 4276 71569 46505 41335 36419 40939 76089 126552 165196 163322
15638 163322 161475 106796 7874 -34866 -39372 -67060 -37292 -35526 56 -22730 -7255 -95961
15626 -95961 -73372 -67532 -12321 -38539 -62977 -47343 -24719 -101306 -30606 -62398 -96095 -23801
15614 -23801 65166 60572 8190 49785 72665 68458 52002 -48875 11037 89990 113687 114847
15602 114847 83754 44146 44128 -39483 36870 81629 68022 42143 755 42697 88884 4728
15590 4728 -21272 -55293 -122012 -106371 -34977 1721 57781 184980 168568 185015 94859 55955
15578 55955 -29868 -52979 6737 4664 64363 57846 48112 45926 -25348 -27449 -64524 -15845 -100357
15565 -100357 -15069 -53637 -119493 -143053 -101716 -69031 6501 40176 44171 11150 3571 70963
15553 70963 60420 -2019 -33862 13333 19812 737 -31424 -94908 -106570 -127912 -93671 18724
15541 18724 -8470 -16121 47002 -75297 -91497 -4230 57963 81644 82397 136441 145318 49150
15529 49150 -8909 22613 -13355 40605 52426 54591 -46419 -89332 -100561 -33338 70910
15518 70910 85930 28433 23035 41193 84944 66318 78502 78979 39685 121415 124006 64689
15506 64689 34469 14205 -110226 -148395 -125718 -134383 -68532 -20834 -57201 -54335 -6850 98891
15494 98891 25220 -83220 -50625 -91814 -108852 -47039 -80182 -76474 -51164 61632 121436
15483 121436 164382 113814 27851 31460 31157 58363 72628 -8263 -32803 -3514 31887 13637
15471 13637 -16233 8034 70197 46141 31601 -12337 45428 89830 46889 -32175 -108268 -107738
15459 -107738 21719 86455 74484 101534 133340 56222 -1299 -24641 68826 1782 -112111
15448 -112111 -43694 44282 91687 129916 13256 12675 9631 5922 72238 43556 72310 118019
15436 118019 120458 85356 93618 139593 134524 142174 100649 122134 120318 -29055 -77509 -2839
15424 -2839 -41228 -58190 -25186 43943 33227 25273 4404 38810 58828 85413 85354 93123 99046
15411 99046 107812 101018 104783 42974 6150 -53543 -5162 152222 173445 135855 90773 -28283
15399 -28283 -109226 -110307 38292 111954 151829 168941 136106 167151 226400 124377 92155
15388 92155 75930 5817 -5993 21241 15628 2132 -72727 -92900 -55452 -22855 6703 162976
15376 162976 191717 100848 79620 -3417 -72724 -87385 -103581 -95943 -93347 -68477 -102465 -64085
15364 -64085 -1676 -59463 -44143 8327 19087 62062 99207 147079 134369 157321 85046 36332
15352 36332 47982 34990 34683 54739 -14771 -30279 12951 -19178 -132264 -127034 -75893 -31559
15340 -31559 -15646 -62983 -6765 64461 157894 169210 156986 118633 112867 77981 36927 993
15328 993 -23271 -16255 -54175 -89774 44043 64017 16630 19839 28529 39255 -23660 -6429
15316 -6429 8709 -20073 52028 182547 143863 114691 80680 120722 84171 58702 88203 105697
15304 105697 67510 40261 71689 95549 -53059 -171774 -81462 -64373 -154730 -97499 -70028
15293 -70028 -46039 -45578 11768 52627 110510 78162 -48185 -62742 -97583 -43848 47206 135917
15281 135917 121080 109513 97637 94390 3830 -41271 14681 71183 181491 216053 150888
15270 150888 44154 -31971 -39800 30745 126522 109274 11392 -9501 43034 20080 66202
15259 66202 112597 179789 125738 -13625 12865 52329 4237 -32824 -48698 24970 88161
15248 88161 56759 34946 69203 79918 33595 54022 57756 17467 -22852 97390 156910 72120
15236 72120 60653 93281 56788 58891 103432 149943 105896 53828 -17254 -73981 -18077 2302
15224 2302 45077 69439 47676 15119 -1930 79665 116780 158477 64788 -24498 -92333 -107304
15212 -107304 -101300 -30451 -3451 29716 30007 35571 83372 29153 84531 -34281 -153481 -168001
15200 -168001 -227210 -173768 28147 73506 104663 48032 -15211 4660 106411 38184 46875
15189 46875 12904 -15133 -41160 -59124 -89268 -73817 -60388 46027 70709 131053 152436
15178 152436 143501 130000 39782 95415 35422 -15185 2085 22016 -7237 59400 -27119 -145690
15166 -145690 -128112 -63339 -17464 7960 40812 17490 -37348 -29770 -14985 -55658 10207 88477
15154 88477 69446 39511 49750 92659 179604 149801 156673 70808 -92700 -95554 -25930 -49514
15142 -49514 -67950 -11153 59453 101634 47385 24177 68888 -3552 31975 125367 196483 108034
15130 108034 -22722 -19485 26341 15409 4354 39131 112195 190905 230753 145902 55122
15119 55122 90538 48510 -25894 102747 132117 162781 216310 224798 220628 142176 83286 63296
15107 63296 182029 259370 242252 205784 238563 274546 202464 125527 84461 83007 -27067
15096 -27067 -36725 31408 63439 -67967 -148843 -82309 -9961 18073 -19295 75216 30312 -7017
15084 -7017 -42771 -68350 -35924 -58182 -30920 98263 43521 9331 -24673 -61420 -73190 -84606
15072 -84606 -49374 9883 113602 44145 90218 22770 -104044 -79988 -64989 -92800 -110795
15061 -110795 -24072 118542 173630 191375 98327 85609 135449 144744 144554 151431 147675 94148
15049 94148 82422 6385 -19515 4775 41144 7225 67013 108567 77455 33708 -37181 -40608
15037 -40608 -9847 -41320 17098 3631 72476 180072 211756 125420 110747 192126 238876
15026 238876 140046 80455 27412 10319 53853 -32864 -38203 71835 6543 -9114 40793
15015 40793 53946 36752 -44942 -46858 -2450 -59162 -50807 23276 52195 50452 211171 193499
15003 193499 79509 93421 97804 18054 52098 95076 71196 48426 30374 62135 57127 -29978
14991 -29978 -90481 -21561 126565 157214 135586 169617 160562 80996 93965 100570 116938 50194
14979 50194 78344 90823 112874 20369 -83936 -9821 128792 153915 73268 -19245 -7776
14968 -7776 1708 35644 33797 433 -8785 -113068 -114616 43903 187182 113292 124930 194997
14956 194997 164411 208457 199488 144850 25977 41175 -39109 -27604 24249 52831 13353
14945 13353 -95508 -67555 26142 82475 122365 207051 240833 233715 213052 129569 111407 67197
14933 67197 89510 42958 85683 89976 126878 149066 89909 53445 30404 13822 -25444 -16273
14921 -16273 76982 122711 83930 -25488 -17739 53885 66771 71396 47549 111098 107884 124663
14909 124663 177029 134852 45894 -79949 -59589 1818 16390 -33260 29158 71480 48438
14898 48438 69201 150191 197988 197191 189411 110484 80458 138031 239409 163128 70430 46728
14886 46728 39138 29222 -18246 -46241 -44407 38694 130398 119520 104875 49968 -80730 -165261
14874 -165261 -160230 -99212 -47212 17807 21425 48267 71638 7117 16742 77739 91913 34310
14862 34310 -38581 -38679 -69959 -138501 -120347 -51953 37274 106377 145630 137896 79826 111583
14850 111583 85854 94040 122573 40012 74196 136211 219081 156377 152879 111429 86126 137774
14838 137774 101073 164144 251472 291351 187041 70093 20913 8740 70358 61633 -13790
14827 -13790 -131453 -147329 -34022 32690 26176 878 40478 14644 42009 56280 71689
14816 71689 61925 133305 199266 321602 256281 132230 72276 47679 -23504 -18593 92320
14805 92320 110969 105747 113480 82131 34501 33210 -10529 25757 2520 18916 27128 27544 87361
14792 87361 129550 59243 31498 -7395 40025 6352 1231 15762 -53564 14042 120969 144691
14780 144691 87939 69903 93299 89260 64799 62975 -37517 -55616 -72497 19439 20329 83586
14768 83586 253219 189420 156935 108914 -9536 -31670 22179 114547 134824 75433 23575
14757 23575 31983 -25788 -10553 75757 76651 98874 76441 -40408 -18291 -24054 7664 69262
14745 69262 28898 11088 -1066 72368 87763 135639 106036 52049 65212 140618 165317 88175
14733 88175 31653 35403 128059 268851 346905 331890 202325 117476 126824 130626 23725 -73561
14721 -73561 -28748 -28667 47413 106201 41811 -50829 -45904 -14746 79700 53100 23375 31278 35991
14708 35991 20224 39176 64126 30007 55753 46590 45650 73202 93779 56540 53423 59204 -2990
14695 -2990 32825 32045 99701 167890 57381 -31611 -3998 -2484 39463 150303 260457 171768
14683 171768 102593 111326 76725 76110 58511 53470 130511 275821 207497 96577 115858 123408
14671 123408 83362 126396 110798 61093 53749 102342 74359 4476 12596 -10946 -512 27650
14659 27650 72345 108516 111981 -2623 80824 98469 97585 34109 29335 23440 -15539 -16704 -29390
14646 -29390 -31488 -39353 -14868 63272 118710 83802 23746 -8982 -60571 -39263 -39978 -132810
14634 -132810 -117590 -45960 56765 -12040 20103 8494 -49059 48728 57029 20307 142698
14623 142698 223885 190250 106425 97824 174994 291221 272569 165740 110381 36576 21455
14612 21455 -55605 -61732 33473 56708 26065 -46652 -78808 -6618 22135 64990 118043 109637
14600 109637 140525 136550 128875 156377 133350 136353 178460 93252 50265 79520 108533 128671
14588 128671 99177 57844 -51817 -131310 -106817 70288 141662 110072 98785 90170 92098
14577 92098 139957 81416 29123 151862 256336 250150 89543 25908 56107 51406 31093
14566 31093 3532 10595 36919 153516 291718 177631 116882 -11690 -90933 46523 99274
14555 99274 104049 136250 110222 51502 54075 118104 50490 -13782 -10244 3772 -53181 -82857
14543 -82857 -50703 11271 47629 8721 -63095 13289 88078 120592 224010 196293 104709
14532 104709 79232 54589 4307 -31180 15454 79702 124605 157335 154381 158238 174929 137096
14520 137096 204933 203721 200950 118100 91608 113539 99145 92862 196004 144558 38871 116202
14508 116202 155353 199525 140971 77175 69417 162222 82690 68449 110233 79572 41008 -71626
14496 -71626 -119499 51438 189139 162945 79340 93024 22276 79984 62587 66417 147670
14485 147670 197842 197696 163706 202965 157219 142427 106253 147905 158847 112292 115657 82521
14473 82521 109297 75252 18875 25334 -37873 -147201 -203889 -272151 -230657 -136558 -51312 -74614
14461 -74614 -112614 -105155 -39733 -79881 -125845 -5058 64014 57768 101428 77996 127895 199043
14449 199043 188149 299048 312138 170648 71629 45638 104129 88506 40923 20612 79147
14438 79147 117865 72961 42530 70509 97807 98059 148746 114704 72830 70357 132104 168323
14426 168323 220374 133484 68404 30078 56149 59961 150970 178361 73801 -5128 22577
14415 22577 -35821 22651 61849 111420 142374 141314 119785 108590 69396 72010 105697 124096
14403 124096 87102 19485 -22669 -38320 -23040 -9189 -39539 -50360 1289 75120 121735
14392 121735 64795 44180 44340 44224 115293 115302 86831 -24201 1651 71939 120889 132830 114884
14379 114884 117116 202129 258135 216794 206100 174740 148792 111744 57944 -54172 -110698
14368 -110698 -203296 -79254 -20848 68591 92917 27854 -122975 -12549 59205 30118 -28089
14357 -28089 -13394 15472 39890 161933 246963 375335 351649 233741 151513 151039 163138
14346 163138 177056 167677 258797 297446 241965 95094 55755 72551 146868 129826 53338
14335 53338 104620 41808 -3967 -17447 14084 25600 -21739 -161009 -171512 -115839 -66000
14324 -66000 46033 117308 158703 129879 76137 127010 143575 60783 -27276 -143016 -84537
14313 -84537 73504 278641 239930 151002 154190 172897 154665 -28139 -135349 37343 59647
14302 59647 123079 104453 108040 45945 105329 138889 166030 98036 88823 9336 7143 36945
14290 36945 46180 118521 160906 34767 27908 28763 24030 71544 835 -57028 16424 -5521
14278 -5521 42098 164772 206814 257300 358846 381514 173592 34406 21207 91854 208915
14267 208915 190609 126772 157892 201804 139474 148254 186018 173494 230790 256150 221260 159808
14255 159808 103475 112133 141777 222640 292299 238285 266761 258356 339222 268902 155434 112653
14243 112653 115542 12637 -4103 105598 157228 114037 23880 114669 174129 194324 245583
14232 245583 290962 278531 229579 265236 260862 195811 65865 57946 100188 109290 22476 -29702
14220 -29702 7592 -7247 115985 268948 314587 271540 332038 331636 263554 203807 200794 181939
14208 181939 214419 205676 150489 126819 110883 91265 75851 134430 112626 70696 56151 44396
14196 44396 123309 103479 121709 81194 55246 95393 183279 261961 300745 288587 327709 315843
14184 315843 265337 256235 172954 42261 108272 234725 274701 243997 215504 43454 -30982
14173 -30982 64716 147383 188807 204846 271590 248635 168663 128744 184041 228379 252567 227973
14161 227973 225461 216065 268727 207698 147376 133656 149060 204388 184922 149748 150370 154037
14149 154037 161892 137854 104742 152791 211117 169720 193937 166112 55521 59605 156167 300951
14137 300951 314338 254567 255044 231898 165901 145970 98583 129052 128470 108673 140361 131387
14125 131387 172717 214031 159893 156699 136958 82679 85622 181744 180816 213796 212536 136038
14113 136038 103005 106911 34537 78122 136808 163571 92946 49811 -3258 2753 25377 58920
14101 58920 107929 60822 -20981 -6865 191345 305139 221469 41543 17221 42773 126318
14090 126318 199134 219027 296829 266566 162723 100149 67017 72097 90517 181928 220317
14079 220317 176062 52211 -30528 -30368 24291 95772 31164 -21457 -55704 -35322 -15086 -26923
14067 -26923 -82341 -43648 -66919 -63684 -29740 36613 -7792 115777 169273 182642 215438 193108
14055 193108 175201 186874 147143 157091 209124 206058 138864 152875 86650 20999 -14306 7290
14043 7290 132400 205987 189183 152938 67938 23964 -37765 -70377 -43324 35834 116971 107093
14031 107093 172283 296220 384011 313894 224049 181054 192701 243243 257539 214965 222253
14020 222253 224326 189640 168715 158364 190003 241462 252165 237310 183295 188758 199505 176625
14008 176625 224583 298246 349366 306229 256110 171063 40151 -32114 120484 162045 147128
13997 147128 61709 109398 181211 220320 298832 238251 110849 66932 24200 86334 193445
13986 193445 137339 105547 135383 160532 208982 248601 270320 275336 318763 345409 368038 314635
13974 314635 172795 22956 141059 246894 210337 244590 182992 175259 164829 181287 163738
13963 163738 191901 285754 303012 267059 181431 152462 121405 136230 193146 287048 253275
13952 253275 215211 378409 449561 461225 493303 515724 464716 366529 468689 452040 348013
13941 348013 429465 477115 505752 508254 527684 625899 630465 621273 612229 634576 576522 508452
13929 508452 553546 643459 645824 702090 798073 831538 819870 661628 677508 711570 740214
13918 740214 802080 776134 774534 719985 703166 752137 731619 685584 676799 722784 731908 869294
13906 869294 822345 782211 766114 771021 783984 721716 712568 762537 728032 710799 628784 633956
13894 633956 729742 665299 598493 556634 594419 639412 663945 629264 614793 604453 663421
13883 663421 773215 823242 828518 852910 770896 717596 665878 582546 513719 574489 629825
13872 629825 603467 496908 440494 461331 456800 453898 414688 433776 377610 378140 392436 379486
13860 379486 394707 455175 473205 444948 426265 426725 464112 446159 439602 465927 469117 427579
13848 427579 405339 307025 288798 298404 263745 233538 234727 263859 283497 243182 224422 240695
13836 240695 242350 306257 321431 362812 459424 371293 332505 316031 344373 338664 242916 244577
13824 244577 208755 224780 296265 311021 248061 191033 259992 341962 312353 310247 320494 393070
13812 393070 402033 369601 373338 418752 498883 506215 469070 464409 433277 483932 421314 391435
13800 391435 472825 517108 519978 563698 573948 507019 434296 491130 685584 786966 778506
13789 778506 804002 635932 516210 626296 720183 755120 838995 804937 700966 789114 944894
13778 944894 1029241 930325 894118 886678 791952 732874 811679 869276 906358 936428 954633 886969
13766 886969 861938 752410 722016 670014 666750 606923 653150 725724 818439 864175 887514
13755 887514 883029 815296 677633 545549 528475 644250 670687 596680 706409 801298 851488
13744 851488 1002780 1092169 1094301 950292 886933 785818 650580 729096 679434 538368 508528
13733 508528 495893 452046 409256 345247 378736 372665 359687 388003 410473 415018 462618 523388
13721 523388 555079 517996 408585 400204 519184 648033 711349 660238 593570 551502 524310
13710 524310 611519 551971 517613 553995 578864 591238 530900 451802 486983 562522 478680
13699 478680 435061 470643 477353 435677 447043 512210 429601 426576 534625 540772 545242 588673
13687 588673 546172 498254 529403 488944 480408 587791 552657 510232 626340 703780 627367
13676 627367 643450 706441 718034 717875 642932 461559 390914 442838 538802 544526 553147 640554
13664 640554 717488 636105 580234 570450 602899 548601 577338 541662 523778 596732 622879 675212
13652 675212 619689 592396 617609 536104 483326 522937 580708 572086 605361 581564 496563 539853
13640 539853 533050 562205 626015 625652 634863 609649 704674 644104 630577 597031 599135 596092 639242
13627 639242 736727 756561 748253 722577 611348 635509 731318 800236 657322 575108 568371
13616 568371 645969 726202 707113 691291 696724 687770 711748 704165 655785 693744 655704 655777 710910
13603 710910 779786 868367 887102 874324 843058 877712 839087 857096 806903 797347 862572 871253
13591 871253 842692 1000461 983928 811751 757704 821715 940955 982105 985713 878927 678201
13580 678201 729263 837691 940725 1012921 1103103 1167450 1225570 1262764 1129079 1023987 966257
13569 966257 971194 1000150 1089764 1140503 1177216 1209806 1181633 1143561 1147125 1146161 1021917 947843
13557 947843 877653 890816 953911 1024726 1205531 1272093 1305101 1331650 1298989 1238209 1148870
13546 1148870 1012356 1018238 1153312 1158647 1088572 1068347 1148330 1358830 1393830 1388373 1374104
13535 1374104 1334425 1307611 1356962 1236398 1224156 1177217 1209207 1315586 1298878 1249023 1270463
13524 1270463 1417047 1426621 1406674 1436964 1516328 1622137 1641311 1649616 1665686 1692813 1751398
13513 1751398 1852979 1973896 2008658 2097140 2138099 2165432 2178799 2186264 2227563 2247490 2300106
13502 2300106 2378668 2458921 2607322 2699115 2798355 2954655 3022825 3154651 3297777 3446832
13492 3446832 3640794 3870513 4129399 4396996 4701437 5097128 5568372 5968994 6460381
13483 6460381 7050603 7893460 8794399 9675189 10595634 11559540 12581847 13438892 14375178
13474 14375178 15601102 17045010 19018785 21620747 25243131 30167128 36585104 44522199
13466 44522199 53179712 60908312 66156465 68741959 69857441 70475746 70605729 69154067
13458 69154067 65627417 60788491 55825239 51689038 49021579 48205537 49581044 53429729
13450 53429729 60352904 70882421 84886979 99963485 111488200 115763279 113998258
13443 113998258 111060884 109521269 108373218 106125045 103234932 101199235 100781261 100746120
13435 100746120 98611002 92660251 83842617 74370958 66405385 60863170 58101526 58506070
13427 58506070 62615682 71052517 84566190 102032416 118220548 125355785 120163594 107410279
13419 107410279 94847425 86682448 83902339 86381341 93885966 105560688 119167352
13412 119167352 130769175 137049256 137487609 135172441 133487199 132415504 129199613 121046598
13404 121046598 107754691 91757874 76096457 62494758 51400052 42531896 35598538
13397 35598538 30198152 25865300 22371904 19515043 17258842 15345742 13748833 12500486
13389 12500486 11411030 10451102 9694512 8959508 8223049 7739922 7340774 7000493 6672140
13380 6672140 6418751 6031098 5837343 5649818 5476433 5381338 5274234 5102166 4935846 4902387
13370 4902387 4913811 4932988 4843678 4702336 4582325 4609585 4662967 4740070 4758714 4750615 4865369
13359 4865369 5006181 4976523 5059455 5215901 5369917 5546426 5749978 5921306 6065308 6310968
13349 6310968 6649258 6965383 7352773 7838009 8305406 8838385 9451507 10222602 11136984
13340 11136984 12189070 13332814 14681001 16308727 18273198 20690381 23572501 27209076
13332 27209076 31869691 37826048 45565012 55422071 67735212 82367800 98067850 112036095
13324 112036095 121809516 126699235 128863209 131520837 135513117 138079988 135331249 126120541
13316 126120541 113009589 100021024 90156137 84818870 84823001 90707027 102100583 115756792
13308 115756792 124512117 121930818 108816805 92098389 77598483 67302006 61318501
13301 61318501 58802414 59501593 63423756 70252204 78956394 87838935 94359458 97319314
13293 97319314 97571778 97670663 99326806 102296917 105001945 106596121 108288070 111531633
13285 111531633 115120045 114483625 106423973 92725146 78271110 66306611 57717347 52151493
13277 52151493 49183041 48534511 49891824 53022801 57384595 61991051 65719124 67627424
13269 67627424 68026333 67866017 67612653 66644920 63443937 57221041 49202288 41040195 33838614
13260 33838614 27865726 23034703 19327791 16457799 14261704 12510319 11107546 9923610
13252 9923610 8813363 7958314 7239461 6687188 6190708 5727565 5287150 4890987 4621401
13243 4621401 4453744 4167923 3955849 3787336 3567245 3412071 3335723 3181613 3000997 2889500
13233 2889500 2765912 2620812 2563114 2586357 2494271 2363665 2193826 2085765 1996778 1957864
13223 1957864 1994751 1939182 1899960 2001048 2242127 2511965 2598211 2512528 2240275 1950645
13213 1950645 1772899 1619066 1611203 1638128 1530916 1401123 1366889 1391723 1372289 1288010 1269385
13202 1269385 1238005 1350825 1446024 1468055 1442532 1451109 1446114 1496355 1392360 1296052 1220296
13191 1220296 1144215 1052783 996489 997879 1097162 1049316 1026436 1085317 1036428 1029145 1061983 1021375
13179 1021375 905202 877282 939704 911543 810237 781599 815044 875042 955009 904074 861967
13168 861967 858914 791121 758686 764238 774844 840471 880055 760203 739648 686376 642876 664331
13156 664331 582561 536487 562081 651509 606147 514862 458165 483487 493688 481128 469417
13145 469417 436762 322052 338015 441117 507091 520355 473057 494864 550397 431704 377263
13134 377263 429441 424032 591511 599411 541944 560312 618564 533303 485549 487164 438190 409496
13122 409496 397880 380527 371512 378481 326148 291310 304518 404771 438725 491157 446380 347876
13110 347876 418228 409050 355586 338850 284965 304107 376996 424335 436657 335583 241864
13099 241864 185853 191514 291406 368600 488364 496016 343780 226630 180604 184484 181156 140706
13087 140706 97077 198253 302160 343790 221458 135026 186521 242773 307174 344009 243572
13076 243572 182091 211504 312215 210050 123625 183209 227319 204819 240355 254262 226945
13065 226945 147506 198158 272728 373749 322760 266861 273856 409985 319216 184580 123398
13054 123398 255718 332182 247439 138912 151569 176772 146930 101002 112768 121902 169474
13043 169474 112548 92418 139601 164820 180697 208793 188091 174759 208870 175223 203870
13032 203870 291688 314652 305580 330019 324988 287225 361992 367621 183772 74664 283932
13021 283932 406529 399824 323163 292094 246425 208875 187363 267912 409960 449561 339009
13010 339009 215630 225526 239089 250352 250670 192553 132126 126626 213565 259358 249739 175307
12998 175307 148501 189846 280658 374130 419557 352727 262947 374919 391343 308827 360152
12987 360152 550656 687168 704718 808960 801214 664255 641387 752910 789331 757512 836807
12976 836807 826414 676728 550288 560537 531268 571194 475405 482744 581726 645627 734492
12965 734492 808463 842038 740251 634510 563832 564757 488313 440910 562504 592949 584507
12954 584507 534820 644621 769052 866171 866938 756487 695714 704448 718219 760918 807429
12943 807429 826645 841392 794681 696364 659283 584985 527316 438688 353101 370391 423183
12932 423183 469631 446822 458210 472915 467998 538972 607177 641721 619913 536338 569079 522867
12920 522867 518554 529899 528181 443928 429123 394571 291188 203176 6427 86158 186107
12909 186107 202525 237690 176456 289922 371829 428613 412319 236220 157745 264104 249822
12898 249822 242971 312410 352610 440868 420715 309595 269208 358265 387803 396863 371455 291138
12886 291138 165140 256282 320187 267184 245178 246522 251708 266519 220760 154746 209054 271856
12874 271856 221754 230823 207545 222211 206792 211173 229027 187109 160270 194788 220078 212546
12862 212546 272510 270635 346611 383775 449436 542479 560016 494537 480422 502459 541548 519903
12850 519903 530207 627971 657138 710492 795077 833923 918355 976428 954203 793480 761489
12839 761489 854639 835987 779206 766032 753988 717590 691507 713889 688243 719403 660349
12828 660349 553978 493524 528454 434026 466314 561299 654761 778654 743622 777427 752821
12817 752821 714188 741596 735655 785127 759025 773772 749848 768221 751798 714499 678690 647088
12805 647088 636680 617979 610368 613533 547585 619741 676391 612032 645333 774613 796635 856412
12793 856412 756110 642872 653928 639777 647676 629722 582963 480146 452308 450635 483073
12782 483073 510304 437876 294860 155711 130119 120882 207723 273485 315046 241409 203183
12771 203183 235586 261652 281561 280449 260769 257638 245515 251779 248559 261084 296458 302528
12759 302528 320778 337042 254373 124910 82385 173043 201856 152957 243224 278593 272350
12748 272350 346707 293741 261346 196682 294447 381657 389703 405423 526996 472977 368331
12737 368331 319429 225996 294248 272593 190432 240059 235844 185790 278069 275306 236500 187523
12725 187523 190838 285942 434753 369620 305716 281728 256973 173931 230371 303020 262951
12714 262951 257237 266445 264341 247428 246730 297696 355426 426340 369105 305568 319862 381871
12702 381871 526159 753635 1106832 1498707 1664218 1465238 1085524 834605 660816 571024
12692 571024 477873 357870 244878 168099 157236 90850 210923 290481 270563 273832 382303
12681 382303 416902 415059 357851 364627 411647 402601 344952 391050 449314 472410 454325 391892
12669 391892 412670 452369 495573 497380 454593 432729 395004 380282 343070 277362 276698 337920
12657 337920 402806 411120 366748 256604 220082 336712 356797 377349 391262 399697 388043
12646 388043 420832 441990 415362 406085 344670 360954 434870 429028 366572 372164 448367 448687
12634 448687 383678 433510 359228 449150 691805 721482 633883 599263 570620 622461 647996
12623 647996 594475 543238 656659 759328 887042 1106222 1331800 1523825 1423119 1160099
12613 1160099 967227 820240 674816 553888 442812 485262 426994 363307 299171 260124
12603 260124 283562 351575 447407 507041 467117 338758 252817 337390 440546 482892 536760
12592 536760 575212 584084 495071 327450 269293 280548 206132 235301 264473 321014 377199
12581 377199 316113 274210 316748 355857 305140 331504 472502 518333 500376 491191 520176
12570 520176 434165 385356 421959 416546 345587 323988 431472 569267 606174 498568 493759
12559 493759 612789 543719 456562 407538 366780 499166 477293 364853 403872 459831 481049
12548 481049 429418 357596 517231 639197 611837 636100 686462 658103 582095 618993 708192
12537 708192 725855 557700 447967 506496 499449 491550 497071 437217 405530 391054 535604
12526 535604 528537 450817 474880 500211 519151 500137 484632 420786 440483 577684 587814
12515 587814 524761 403999 336163 331147 390086 404341 453757 452390 453004 486571 553336 564219
12503 564219 473306 470527 504446 563046 547695 504143 508683 465409 428322 443414 410391 407251
12491 407251 406128 388885 444382 520709 557612 654362 632571 568374 505681 573221 505293 465718
12479 465718 466990 552739 606146 685596 744606 652384 553136 619414 725404 693408 608908
12468 608908 627361 706106 740074 770356 765287 682497 539281 505273 607500 616308 705201
12457 705201 708124 676603 636003 634558 667504 678476 620869 522999 469984 533468 596047 678393
12445 678393 670229 649313 568886 481983 520179 598126 634965 656472 688999 713752 840071
12434 840071 827501 714930 674230 751971 723703 740216 759519 791963 770450 710798 719863
12423 719863 779551 713490 725009 774155 786038 808009 729220 645659 738633 829153 785537
12412 785537 744893 792873 824066 833946 834267 821537 793774 687713 738680 728989 730991 704300
12400 704300 741830 825175 836165 796406 764364 885568 810336 862323 975824 1039691 1006677
12389 1006677 967863 875709 873759 932635 774145 743985 803852 938257 1039418 1129614 1218267
12378 1218267 1230783 1184933 1128665 1149083 1276164 1405371 1532277 1830091 2368591 2763524
12368 2763524 2663850 2267477 2023538 2040737 2224678 2346730 2246439 1991824 1780264 1707359
12358 1707359 1807921 1847297 1814321 1929758 2137541 2253784 2115101 1964724 1882131 1969720
12348 1969720 2161139 2199423 2260947 2418888 2621212 2713234 2549931 2403775 2393731 2370443
12338 2370443 2385994 2420761 2501874 2701540 2866709 2948699 3117675 3393604 3758139 4323377
12328 4323377 5292691 6060914 6095887 5394268 4531426 3989988 3747962 3562311 3404562 3169471
12318 3169471 2810449 2695781 2640003 2561915 2526434 2659163 2857872 2814255 2620362 2423630
12308 2423630 2328416 2286048 2307703 2255035 2215806 2193446 2257379 2468378 2506657 2423141 2144489
12297 2144489 2023911 2033359 2026135 2111467 2240006 2410688 2549450 2612655 2621522 2606019 2724619
12286 2724619 3146614 3418683 3372084 2991643 2532481 2167352 1940713 1857682 1737911 1700113
12276 1700113 1680088 1630498 1633653 1595098 1509532 1454068 1398331 1421418 1449199 1434959 1356788
12265 1356788 1312509 1420465 1520397 1489464 1458465 1521386 1623023 1540459 1562021 1555759 1574481
12254 1574481 1561235 1551641 1576165 1633359 1560921 1424604 1369957 1338352 1339332 1456928 1559624
12243 1559624 1473652 1446037 1396805 1428930 1493021 1602377 1651713 1541335 1500413 1483668 1454177
12232 1454177 1562117 1656400 1650539 1578688 1609406 1681745 1760031 1768463 1755954 1731550 1764192
12221 1764192 1826988 1704995 1714775 1729788 1789970 1844138 1805031 1789731 1886332 1955658 1991364
12210 1991364 1975362 1930031 1863367 1854393 1851121 1820591 1866715 1855647 1811383 1834034 1814468 1791312
12198 1791312 1858525 1993435 2091856 2008204 2051698 2031568 1998303 2000935 2022272 2034764 2031957
12187 2031957 2062669 2040138 2038543 2046835 2045562 2017513 1969413 1969335 2069166 2195027 2184699 2161394
12175 2161394 2218464 2155378 2191213 2167533 2205070 2261196 2245103 2219518 2208149 2211275 2277038
12164 2277038 2262656 2278582 2282323 2335575 2392448 2522198 2562649 2465958 2445540 2470811 2453810
12153 2453810 2510463 2528749 2587311 2559749 2612788 2566160 2556960 2588938 2589463 2610024 2664631 2588249
12141 2588249 2640984 2686802 2756562 2822775 2793366 2732881 2613259 2647284 2656965 2652170 2650000 2694748
12129 2694748 2777075 2825468 2866918 2960532 3001211 2890739 2865844 2856151 2844446 2944064 3064214
12118 3064214 3123047 3077317 3128742 3234073 3240466 3160784 3070030 3088494 3107106 3154577 3207453
12107 3207453 3083076 3032108 3027417 3120267 3272123 3361209 3371322 3333241 3317614 3347964 3319934
12096 3319934 3338504 3434846 3416539 3455594 3552442 3521902 3527530 3581839 3539953 3557454 3592232
12085 3592232 3701746 3752623 3787258 3827947 3861014 3841732 3874676 3941897 4066642 4169872 4163486
12074 4163486 4055973 3979776 4032453 4039967 4066221 4111440 4211313 4148271 4155817 4172299 4164128 4133566
12062 4133566 4157243 4289261 4328887 4382965 4432137 4409583 4420887 4400864 4446653 4466761 4342964
12051 4342964 4367174 4445628 4464819 4483584 4581735 4689501 4778286 4803806 4778597 4871919 4975184
12040 4975184 4945691 4947700 5003622 5075339 5100101 5026570 5039118 5167939 5150516 5144813 5185623
12029 5185623 5159895 5177894 5332284 5483573 5502505 5483114 5458181 5508255 5556820 5627332 5675889
12018 5675889 5605720 5530092 5627993 5652998 5683689 5747178 5851792 5907862 5831609 5754584 5864394
12007 5864394 5950061 5973964 6026463 6043057 6006236 6053981 6157279 6252212 6258744 6199020 6288515
11996 6288515 6385865 6359868 6322507 6297235 6341695 6543842 6669751 6582168 6564617 6596694 6564972
11985 6564972 6553599 6596024 6642813 6687759 6680333 6826730 6921350 6901373 6868851 6822616 6835502
11974 6835502 6946080 7074818 7127823 7245537 7288104 7272537 7266418 7250599 7203185 7203021 7292250
11963 7292250 7428762 7462713 7427850 7458891 7496063 7445718 7549514 7625214 7621289 7556410 7554919
11952 7554919 7599254 7692558 7714439 7691820 7567879 7604472 7737049 7779332 7765708 7809822 7849226
11941 7849226 7883404 7756300 7662938 7654470 7699405 7752882 7758855 7773123 7781620 7780384 7841809 7891381
11929 7891381 7873516 7866363 7909117 8028854 8024041 7928368 7836380 7809648 7825817 7849350 7884481
11918 7884481 7950692 7879083 7791684 7731415 7712303 7748233 7784553 7794079 7918103 7994985 7909110
11907 7909110 7818338 7833605 7849437 7786797 7781944 7791425 7821733 7748006 7615886 7582827 7627845
11896 7627845 7606667 7693157 7738876 7622316 7521259 7438303 7461565 7513202 7546844 7572002 7491128
11885 7491128 7477779 7457178 7370414 7343884 7400922 7355627 7267772 7287273 7268961 7221844 7137589
11874 7137589 7099556 7097439 7110419 7064518 7056310 7033191 6953187 6955576 6897549 6877276 6886865 6846040
11862 6846040 6669637 6671496 6748532 6691515 6682274 6622341 6629162 6589070 6391264 6321857 6345510
11851 6345510 6376585 6348908 6237149 6270382 6352902 6368283 6295345 6165476 6098254 6133609 6088655
11840 6088655 6026051 5924547 5850367 5842760 5939303 5940331 5909034 5850604 5846650 5868496 5845241 5882031
11828 5882031 5742175 5595933 5506224 5454367 5352853 5370631 5414847 5365386 5392314 5246123
11818 5246123 5302960 5411876 5374874 5339386 5326409 5300306 5266076 5237169 5143404 5050299 4999195
11807 4999195 4973646 4930919 4840461 4819132 4717971 4592637 4614706 4671019 4657190 4687201 4632591
11796 4632591 4481365 4494393 4500453 4420277 4337972 4308407 4308039 4311023 4389759 4344734 4229835 4191900
11784 4191900 4208912 4136173 4158166 4108305 3992557 3961669 3944153 3906519 3885758 3812040 3804848
11773 3804848 3794500 3811915 3821301 3778522 3762212 3809640 3728536 3687416 3653085 3599257 3677909
11762 3677909 3740598 3752957 3599094 3479514 3482131 3508692 3472179 3463120 3411434 3360745 3298639
11751 3298639 3278292 3291248 3281021 3239783 3175812 3156254 3120884 3055990 3140881 3193987 3253842
11740 3253842 3316760 3331687 3329452 3318517 3179507 3121666 3047319 3004915 2909433 2804808 2777391
11729 2777391 2779151 2929740 2932196 2882664 2761702 2714339 2720089 2734726 2718643 2736722 2687840
11718 2687840 2557455 2539685 2484235 2515649 2576478 2543945 2432115 2419787 2465480 2467733 2544206
11707 2544206 2627544 2633551 2590798 2555289 2541950 2522369 2504090 2441198 2358577 2333208 2342271 2286256
11695 2286256 2243428 2303841 2322160 2332618 2266139 2224828 2284337 2162835 2077539 2250694 2318838
11684 2318838 2389375 2327380 2190921 2148977 2056904 1990877 2016260 2016091 1998864 1930539 1949714
11673 1949714 1932109 1946132 1992859 2088724 2124979 2148424 2040141 1869573 1791555 1868511 1940217
11662 1940217 1828098 1766905 1890311 2011831 2048324 2056225 1939023 1802765 1795995 1652104
11652 1652104 1535123 1667527 1691448 1598193 1573218 1709919 1738029 1693218 1744904 1696624 1593580
11641 1593580 1585539 1621309 1702304 1710661 1745520 1746267 1766425 1775374 1686184 1614253 1582142 1610296
11629 1610296 1650133 1676172 1672917 1683496 1663826 1604132 1577508 1587126 1540943 1549471 1556581 1594404
11617 1594404 1601526 1619767 1568843 1566386 1538012 1531890 1544973 1512624 1534115 1464123 1403467 1359508
11605 1359508 1310112 1327752 1385806 1379504 1430110 1438089 1403489 1408678 1338256 1339696 1286333 1235287
11593 1235287 1164291 1161040 1197062 1269468 1238716 1199914 1166779 1154494 1246599 1345264 1404031
11582 1404031 1354461 1236668 1226220 1199805 1130725 1162357 1278760 1289233 1214019 1189377 1264296
11571 1264296 1239613 1126806 1209799 1182238 1093595 1075952 1076727 1153598 1213512 1163083 1114665
11560 1114665 1043130 875026 857822 1039658 1090504 1090077 993425 992061 981695 1034909 1088023
11549 1088023 1048091 1001285 1008523 1083521 1053666 1109056 1171926 1099625 1026769 983802 984750 915830
11537 915830 911322 858242 794762 920688 956704 975454 893876 859861 870685 985518 935469
11526 935469 859617 905356 948439 946998 894337 868715 952018 1026625 887235 883038 901189 865250
11514 865250 824445 793813 841942 905237 950507 934379 927165 963369 997267 883858 848893
11503 848893 756271 735821 742276 821748 863479 924485 970926 975128 984314 912996 915939 823118
11491 823118 703356 862028 907525 824890 696563 666496 699086 763581 757052 772705 852553
11480 852553 890391 873359 737086 738853 770629 741572 722116 633273 585916 632750 796838
11469 796838 806269 657555 618102 629141 671332 684405 689961 659673 630574 612397 597706 668456
11457 668456 731694 651905 547464 525806 590221 638774 626377 539017 586679 683395 732704
11446 732704 695904 716610 695185 735380 836022 730278 611899 670008 659148 670493 722620
11435 722620 796136 779786 750951 742916 802772 763421 714144 724373 631956 638817 652208 658120
11423 658120 562094 433633 384442 514546 517338 581184 558367 510242 442540 492743 507784
11412 507784 440843 442373 416841 430555 419722 497252 574756 591496 538478 560315 604005 508714
11400 508714 524972 535142 572938 438108 315043 329281 399621 475956 457647 470393 468196
11389 468196 484187 486546 447753 502917 440543 443245 461846 490907 413429 444294 542121 585646
11377 585646 643223 639765 550525 499122 534485 493747 475008 443178 496161 539841 525431 525404
11365 525404 570004 509048 528970 477118 459301 484527 575985 562399 405232 405898 312823 273499
11353 273499 395431 521126 544345 486361 451856 436651 492319 439184 339238 324583 315542
11342 315542 398166 419098 443066 489446 543723 584342 576259 505234 523903 496384 480315 440027
11330 440027 433642 370866 389293 472577 452945 423731 456298 456300 422332 357033 389237 379548 406792
11317 406792 429382 498475 497416 425058 323287 306071 332396 444849 499512 486072 529274
11306 529274 465787 314993 363624 418338 530482 575438 550445 528065 449683 402972 362215
11295 362215 349998 350328 330482 359546 387099 390791 283533 255385 300206 380120 411274 345417
11283 345417 276383 244535 331248 388460 357320 286553 311323 280406 353998 371788 355300
11272 355300 289576 250627 336054 312716 361677 397682 343274 309451 260408 223135 330661
11261 330661 330255 241581 269139 347748 266616 270917 403709 543363 549084 416520 331487 334333
11249 334333 315716 328553 398528 347786 331850 373456 380135 450469 396021 252078 231207
11238 231207 357216 425901 390345 398925 536340 476550 358769 248416 262533 273068 233026
11227 233026 166857 183856 239310 206513 111469 116721 156116 160106 251339 325400 286079 236016
11215 236016 207698 264869 301991 312213 306762 402623 526635 585451 555251 567273 625132
11204 625132 745091 859631 855681 868890 848501 769486 602329 439810 390135 336622 370644
11193 370644 304753 208775 207845 221368 245288 273992 280630 213876 130344 36870 66333 87590
11181 87590 68957 152043 245547 300386 171041 58170 38891 34179 91977 139105 94407
11170 94407 108849 107439 128298 178274 207285 189741 237971 308648 350378 331725 426187 398118
11158 398118 389477 423471 392121 327842 358758 332108 297716 249669 234684 241970 384092 406361
11146 406361 332712 289590 353168 411630 418021 431857 332635 252038 338918 298499 240343 228910
11134 228910 243707 258449 303994 235705 150947 172689 83503 57094 137722 177790 221965
11123 221965 257586 273529 303638 369112 371253 307018 223516 217545 226931 232206 195656 176439
11111 176439 272111 368974 427058 365213 311511 307837 271683 207790 324317 353075 353225 242402
11099 242402 255951 261221 182894 232437 212961 190907 277500 262781 243425 127018 167958
11088 167958 124725 20540 12962 98578 134601 213515 229583 226518 172847 262068 278319 219096
11076 219096 152009 172019 266851 304173 268972 228301 224383 267708 279467 195152 207302 206173
11064 206173 124046 123226 129837 215606 250225 203647 227685 219890 192929 192681 224908 207341 163887
11051 163887 70285 69511 69529 141080 227570 288649 283866 371304 413131 379899 349344 286805 392692
11038 392692 467212 319095 355886 503907 637964 785663 884026 843076 748064 708578 685878
11027 685878 664397 616363 615142 621875 736550 815943 1000236 1030018 951341 982982 1017374
11016 1017374 954062 813419 749274 584253 500661 647119 763987 784283 869726 823017
11006 823017 714884 672069 507285 438717 426013 308816 260233 243506 286544 315908 275867
10995 275867 243712 362747 412877 357789 298632 346406 352366 332823 298748 315598 274509
10984 274509 204019 240141 259006 240952 236704 220589 160612 86436 167974 335719 293145
10973 293145 90878 100596 142963 228394 204234 158641 215966 240092 282518 379137 462533
10962 462533 409348 236660 260588 276304 245826 117527 141974 180617 307592 514750 720488
10951 720488 713925 586497 529183 519908 555794 499740 398030 373617 387039 310261 380155
10940 380155 311331 202924 222793 112908 19263 -16383 -26240 -47854 812 130119 188310
10929 188310 127405 105989 133201 62817 168586 288554 289567 342265 221402 183615 238013
10918 238013 303099 345707 359899 271803 234669 177387 175406 83869 73417 132093 127737 182101
10906 182101 194387 249537 154406 163359 258335 259654 215776 118326 64454 71422 149709 207974
10894 207974 217479 201311 295938 259029 137600 63773 14057 7729 96949 241537 182206
10883 182206 160668 145300 282721 311097 257345 170307 149806 175332 158744 250086 399625
10872 399625 523097 611728 471324 339058 366787 356959 292929 354603 346946 255053 215043
10861 215043 177731 165096 300292 340008 332322 331014 339246 318336 229148 252690 261997 275238
10849 275238 208081 250967 307854 366985 292594 180530 184289 173318 227762 255883 294713
10838 294713 293979 374660 330017 339530 360891 274857 184157 145313 177067 165759 126338 139531
10826 139531 65238 57477 111130 210961 277025 247680 187496 139169 186869 179313 169455 196753
10814 196753 205834 238911 185921 183138 182725 143166 117566 65768 86635 25001 -44295 -93734
10802 -93734 -158493 -78598 124237 160452 182305 198066 196787 213975 243910 144408 69343 101853
10790 101853 175433 155143 143928 211955 192567 92624 129541 164402 130913 114219 119751 210584
10778 210584 258610 297732 232878 185600 150776 44655 66140 136555 179404 214778 163626
10767 163626 224322 283689 273628 236587 319631 322840 225901 194723 154848 180450 175939 194591
10755 194591 336222 310030 255027 144806 161024 228555 244276 254537 294441 304142 361530
10744 361530 387016 414799 408248 356135 378775 333275 294499 338049 359606 308583 319096 373488
10732 373488 432830 438071 485094 510898 506129 379861 282832 247508 264179 278083 333678 285582
10720 285582 223715 223705 319538 288935 292009 249987 209529 214299 186665 214519 218631 221403 218970
10707 218970 258676 284674 333567 353447 208275 143357 70284 87107 209904 274443 270200
10696 270200 271909 205482 183084 201580 145215 94523 126844 83305 85904 85535 165433 163602
10684 163602 234859 257906 390863 418490 272956 175714 244871 308931 341222 336770 332396
10673 332396 238219 244007 347372 310683 220320 290986 336056 349962 388219 488326 551998
10662 551998 456414 459900 514087 486498 535857 623333 616919 570469 510551 516874 583357 673433
10650 673433 734917 662924 712736 731101 800582 806905 826937 938605 1018422 1028536 1137265
10639 1137265 1139745 1100733 1171708 1282127 1473934 1661924 1681604 1735354 2037000 2420955
10629 2420955 2905937 3204427 3453507 3721732 4155437 4759149 5416226 6225926 7388121
10620 7388121 9160735 11530537 14934870 19539151 25588997 33020176 40704730 46725775
10612 46725775 49349139 48569508 45872169 43265563 42070256 43208642 47224638 54755996
10604 54755996 66293376 81361468 96994345 107609287 108888447 101793612 91391319
10597 91391319 82255714 76673362 75509941 79435675 88984324 104229576 123833799 142817457
10589 142817457 153014202 148868982 133108540 113682561 96739544 84741685 77988315
10582 77988315 76299957 79520090 87242178 97792602 107249670 110085907 103248011 89389285
10574 89389285 73945059 60968952 51643169 45859845 43123902 43052696 45069124 47930009
10566 47930009 49859169 48908787 44345082 37161875 29555731 22956724 17779144 13889496
10558 13889496 11024612 8932327 7349143 6112874 5092944 4482877 4032639 3567874
10550 3567874 3138120 2723212 2380093 2223380 1986818 1777991 1680412 1487423 1469937 1391302
10540 1391302 1356609 1222616 1208037 1225834 1223601 1117387 1068399 1036844 950191 896238 858233
10529 858233 836068 874779 845775 768794 754145 736791 674850 563959 517247 600623 668690
10518 668690 655542 630501 575162 579334 427333 403000 376972 388969 519349 512640 389535
10507 389535 347988 381686 472053 516809 373228 289083 273810 309357 268943 261527 271306 316391
10495 316391 386780 359055 334232 316625 410864 391972 345101 367943 373190 400178 374758 346342
10483 346342 434998 441830 409056 316597 305763 289588 319242 432361 415499 334871 239438
10472 239438 171164 220620 214858 254597 251784 267258 299637 223380 179642 231722 229408 250994
10460 250994 231393 136603 198918 263393 194450 116683 98146 134016 201190 212633 220536 201724
10448 201724 189941 92460 427 55878 119221 134826 103979 135693 225793 186595 137560
10437 137560 7075 -29821 48391 28758 66548 84837 25506 69490 101396 123678 86836
10426 86836 -2509 -46159 -19773 24647 110787 161355 157802 56618 -14616 28745 77864 132540
10414 132540 121752 74160 8467 44677 20020 -19927 -12430 -24132 -32301 -15541 -10420 -12919
10402 -12919 -19841 -8120 295 32725 85633 81539 19117 55717 57012 26423 -32451 -103208
10390 -103208 -67847 18478 95316 33959 11721 -46872 -50739 -150663 -156306 -64684 -33711 10297
10378 10297 -6175 -18870 66697 49616 -29756 -86934 -34515 5070 2470 48534 61832 15479
10366 15479 -59158 -84155 4833 34083 23374 -103492 -89371 -118079 -137695 -111504 -106933 -118443
10354 -118443 -87522 -102859 -112670 -199860 -198840 -114810 -38385 43453 -17638 -58597 -99662 -216146
10342 -216146 -167623 -106939 288 45219 66702 -21799 -34075 -70525 -67740 -36996 -2849
10331 -2849 6950 25272 66877 26295 -63618 -15986 10274 -17315 19783 68463 86552 36628
10319 36628 12485 6083 57802 31400 -28834 -1853 -11785 -62849 -132054 -124560 -142117 -130587
10307 -130587 -120569 -154451 -198628 -187237 -77952 -69231 -67224 -65026 -85809 -150058 -180972 -79604
10295 -79604 -30890 28015 106597 103834 27701 -10312 -50458 -66724 -37973 -24511 -50617 64648
10283 64648 58170 -25434 27679 15014 -83601 -140014 -67438 -39285 27782 44632 18360 132785
10271 132785 65063 -4015 5746 59585 146835 68356 53171 49662 56977 5340 -35087 -28110
10259 -28110 -4523 56866 -43408 -113001 -49404 -13844 -26599 50104 165461 230120 111621
10248 111621 34853 122686 160250 121715 57471 -29256 -207229 -290403 -212878 -198925 -208654
10237 -208654 -129416 -24899 -9948 12890 16274 53046 44587 41979 -52640 -51122 -79007 -112341
10225 -112341 -113237 -31825 1386 -23864 -97948 -126132 -85693 -21473 -22516 -68269 -289 28160
10213 28160 -10266 115349 127336 84320 57724 190051 189171 115082 91499 12735 55676 179662
10201 179662 201173 173419 127452 96412 95460 109253 99014 64241 -7002 -26861 47540 149895
10189 149895 154753 93869 103033 139910 100154 -6776 35260 119668 158192 152073 206789 184532
10177 184532 269941 333233 338102 245835 242023 234602 219809 284194 295981 346716 440088 553545
10165 553545 637871 683057 658182 563672 513276 424443 389346 373319 384547 509595 665895
10154 665895 742150 914570 922499 900982 777006 657608 617789 582511 483116 485139 442910
10143 442910 471233 566413 623668 605672 607368 595053 587917 548649 465455 432700 370974 262662
10131 262662 200482 206530 267719 243908 216477 164600 171695 117715 71631 81033 138944 117459
10119 117459 17189 -27641 4146 47794 47036 146977 173034 162788 143775 56503 55832 102496
10107 102496 44443 21795 70244 28073 77166 71326 -27159 -92946 -175197 -128791 -7900
10096 -7900 29058 124587 227449 119368 6133 40035 13951 -65069 -98130 -71973 -77941
10085 -77941 -37621 37846 87142 19798 16207 49710 41122 91914 52359 -36231 60447 136109
10073 136109 26762 44226 -6806 7887 44931 56923 44186 77003 58229 -38160 -50697
10062 -50697 -93660 -127802 -128183 -69385 -58293 25893 64348 66907 74498 24671 -11410 46785
10050 46785 43010 94415 148205 118308 32689 -34267 -9123 -44000 -33845 -48862 13985 25905
10038 25905 -36949 -95075 -28743 32138 -82936 -94939 -82586 -91010 -50649 -114047 -101679 -60731
10026 -60731 -40775 -95104 -69141 -27487 53947 61005 -87101 -69964 -8513 -40585 -3767 92596
10014 92596 66198 -18660 -28342 -46513 -93517 -39958 2681 -38137 -107075 -82356 -54831 -136719
10002 -136719 -171426 -97032 75752 -7425 -45172 33256 -83103 -92337 -126195 -101545 51628
9991 51628 45061 66966 64982 1444 7545 80501 108327 127724 -39335 -117853 -120663 -108975
9979 -108975 -107203 -140643 -136290 -124332 -26914 -24836 -39454 -134485 -198665 -216107 -222500 -91701
9967 -91701 -40236 -99560 -111199 -21451 -48378 -22561 3878 -3215 18707 23292 28329 106362
9955 106362 106663 63041 70353 12705 -51145 -73922 29922 153676 196065 155592 117729 7186
9943 7186 20113 75988 100859 62715 87039 120580 140020 92432 32988 15847 51847 103205
9931 103205 143075 162267 52644 35411 -17754 -1573 28937 62575 83043 38848 40078 91842
9919 91842 144734 53196 -57329 -90725 -84255 -112750 -105239 -2130 1782 -72941 -91215 -33255
9907 -33255 19964 84256 158059 151842 128107 124272 59661 -27575 -41028 -12666 -45713 -112724
9895 -112724 -135344 -111757 -62452 -82875 -21496 45348 93936 -18017 -111550 -62942 46842
9884 46842 146284 86731 1799 11878 -26239 -96797 -160905 -119978 -77438 -28857 15322 105984
9872 105984 98676 62185 40151 -26246 -29206 38190 24472 27066 31291 68522 163004 115048
9860 115048 76005 77634 -2998 -74281 -70584 -48143 -54724 -111934 -24520 57416 90706 -1126
9848 -1126 -58278 -70295 -30928 31622 48732 -10740 34622 -13555 -100478 -175300 -84487 41010
9836 41010 109331 60903 59115 112678 113026 80370 40397 59415 21339 -60833 -86854 -22074
9824 -22074 -22173 41482 70027 64176 71799 43859 -7994 19849 31042 11872 -1977 -36332 -83311
9811 -83311 37672 143198 87942 -9368 3764 8346 20354 140181 172718 182959 105612
9800 105612 187666 193326 96848 31899 -37374 -80857 -101334 -168252 -145255 -25411 32069 -44738
9788 -44738 -24830 -76923 -52024 -2681 -13081 -1612 85834 -18646 -40177 39631 67668 13325
9776 13325 -39213 -32211 18852 65081 159487 14095 -93543 -65815 -21625 -115494 -67278 7274
9764 7274 42657 82441 4858 -69778 -85862 -31676 -52678 71831 120585 13517 -145688
9753 -145688 -143337 -88002 54495 44719 63683 60519 -64125 -107992 -159858 -228241 -244952 -103651
9741 -103651 -75727 -91130 -115563 -146848 -124778 -73184 -85809 -77405 -37256 -43652 18943 43039
9729 43039 32154 -13639 -32959 40698 -2885 -51368 -1144 -29066 -31815 79968 102221 54936
9717 54936 98471 130555 41119 13722 65143 -8536 -113338 -140958 -132568 -87357 -41986 66514
9705 66514 110634 137593 135093 21000 -110980 -80372 10326 98644 58820 30758 92844 48723
9693 48723 77647 -19015 -53940 -51775 54329 77180 44056 94998 150846 153120 93292 73673
9681 73673 -1133 -51249 -31875 -89867 -124456 -116441 -50316 -97063 -112615 -75690 -183397 -158613
9669 -158613 -177124 -143873 -75331 -12889 113263 215954 263405 216112 169897 174763 167538 170615
9657 170615 146492 176478 207156 268246 342633 431418 625091 903496 911731 738847 449717
9646 449717 162064 63136 -32649 -22815 -41615 89151 137045 59204 -11488 -10307 35010 -15227
9634 -15227 9241 36181 135482 144451 107945 101683 7377 -97786 -119881 -138103 -117726 -102013
9622 -102013 -9047 -1004 27398 2814 -35986 3897 17369 21191 8609 -20927 -25866 6550
9610 6550 13276 63294 55688 52724 82759 -2103 84095 119387 27632 -2466 9250 28280 94134
9597 94134 140744 84053 78254 84807 56227 23948 64394 50977 -24239 -129258 -109730 -68113
9585 -68113 -44548 -24840 -122913 -54541 756 -42219 79466 154803 108251 54294 102880 184822
9573 184822 144118 15151 -19294 -903 -37901 -28937 70913 51519 80996 130555 99107 -41267
9561 -41267 -86596 -66610 -83716 -81497 48206 106423 3498 -62272 10561 -1954 -75380 -141054
9549 -141054 -154070 -200044 -227108 -137970 -25401 20808 53008 50374 67465 81383 122754 40224
9537 40224 17718 97207 69197 -1912 94808 83285 92255 114381 47828 34289 11815 88173
9525 88173 149836 189518 155027 148786 183625 193043 168587 130724 29914 21723 54534 59231
9513 59231 124534 73824 1157 -84166 -104791 -103894 -111474 -35540 -33793 -51078 -13924 -98825 -41076
9500 -41076 32235 178802 255652 226124 210390 141473 100169 90419 -61080 -112465 -97606 -37371
9488 -37371 -14189 -13943 -7912 84768 149115 179917 107824 70179 112840 128452 93766 98930 131572
9475 131572 134724 98871 158984 169638 200845 190433 190512 177800 268208 381712 334460 285971
9463 285971 267419 347367 363960 379257 416323 469105 571899 588785 709097 1010453 1550832
9452 1550832 1952354 2095346 1836106 1612051 1509146 1333711 1139396 917327 679028 462303
9442 462303 316119 372503 483135 606331 810089 1069059 1261113 1385664 1656200 1937553
9432 1937553 2045162 2081126 1974891 1904259 1777772 1647785 1530314 1464593 1479835 1485025 1448042
9421 1448042 1371593 1290316 1205945 1189857 1221833 1416173 1768374 2207547 2867561 3883432
9411 3883432 5150787 6048748 6121546 5066348 3720506 2777036 2213707 1761699 1483066
9402 1483066 1315962 1154176 1241122 1360294 1439821 1507160 1448607 1349205 1421335 1540651 1653955
9391 1653955 1751582 1706677 1904500 1979212 2010401 1889368 1680365 1468828 1174827 849755
9381 849755 617906 535882 457855 349869 460558 511126 625475 772872 927883 1082580
9371 1082580 1291039 1522148 1807153 2026142 1886164 1504748 993768 673990 568325 539266
9361 539266 475764 329302 297783 415608 475239 511341 473450 294036 163068 112665 126300
9350 126300 64966 25428 112408 121014 80290 103433 164921 65152 -4019 -44217 -121513 -196253
9338 -196253 -165005 -106792 -105310 -74025 8886 80137 134953 145393 122295 190197 130434 162473
9326 162473 154955 58826 143582 171711 80596 108076 11630 -48641 -48539 -66835 -56205 -31674
9314 -31674 -75669 -151376 -197482 -168675 -107543 -87187 -23822 47882 66106 112745 108964 58435
9302 58435 61408 46827 -33699 -51155 40769 52124 29192 25564 61838 36674 20117 81383
9290 81383 58292 78020 33782 57136 45265 691 26044 22786 -73931 -6870 -18151 -1393
9278 -1393 129648 149574 101061 -42875 -168725 -196756 -166571 17656 82806 70376 80650
9267 80650 105836 119722 65254 -38957 -89464 -73164 619 48978 49262 108100 178809 155271
9255 155271 82569 -28084 44898 207421 132811 172217 250295 205044 122633 106395 41486
9244 41486 -57542 31460 68230 12327 -16810 13742 17735 -21115 -13582 48462 43837 33034
9232 33034 82974 92495 -2492 -101031 -165186 -159323 -112364 -27621 -48970 -72135 -97857 -166660
9220 -166660 -158484 -39749 -4291 34597 -35379 -112265 -152729 -91819 -76532 -101259 -106277 -29655
9208 -29655 76213 -22863 -68025 -83881 -66503 -22576 20243 43668 60514 23140 55654 97397
9196 97397 68672 -22707 -118090 -116896 -86237 -73881 -38951 -52965 -46085 -3393 -33847 -41413
9184 -41413 -31837 -20325 -25579 -35812 -127453 -86667 -27195 -53957 -60401 -50748 -73081 -111454 -106588
9171 -106588 -81171 -39443 -19313 4817 34506 116899 106826 114544 57134 -73097 -123052 -122917
9159 -122917 -134161 -102779 644 32114 22653 -21151 19969 54302 98960 61933 -45076
9148 -45076 -104506 -44714 -23693 22695 60295 41527 119245 138790 80920 19085 22904 1693
9136 1693 59988 129107 53602 -44725 -79090 -106134 -78819 -29865 1081 27998 38672 98652
9124 98652 54453 -87731 -96879 -33107 38194 206741 189307 130415 79127 52998 36862 6422
9112 6422 30811 46414 143025 169006 132544 8526 -80268 -151238 -149033 -179947 -125896 47263
9100 47263 75695 -86608 -101706 -117973 -135886 -169899 -179809 -170002 -105829 -69596 -52211 -85778
9088 -85778 -155955 -98763 -141706 -110570 -29640 48464 125051 129703 138793 121956 157274 103775
9076 103775 42664 -29696 -71194 -76282 -89440 -15722 -14073 -23650 -52197 -62088 -54525 -53226 -154069
9063 -154069 -243240 -164872 -123040 -78084 4013 90259 114236 74051 -54031 -29291 -58836
9052 -58836 -86536 -103551 -1826 37905 -75664 -67141 -48987 -58139 -111547 -123459 -98934 -90338
9040 -90338 22419 39145 30493 35287 -27986 -119971 -194995 -215365 -194918 -142636 -96895 -98462
9028 -98462 -82189 -77828 -58226 -19393 44363 16228 -59416 -219327 -206767 -220762 -141600 -43840
9016 -43840 -95062 -191211 -132484 -57745 -13590 67530 -5418 -66943 -39476 24276 26291 49835
9004 49835 -20019 45698 60092 18729 51157 70273 82567 50244 65375 181956 181465 285285
8992 285285 301407 227921 266855 224689 192150 121545 41921 -21263 22834 8826 44166 110545
8980 110545 155716 118003 -14006 -102885 -9570 88788 -33660 -155433 -143662 -142113 -66433
8969 -66433 -92075 -109211 -56537 43916 79578 7763 -124881 -240785 -272736 -194701 -246608
8958 -246608 -180546 -81637 20948 74483 63853 26995 6135 -12977 52313 132132 104653
8947 104653 20934 -64674 -59199 -80608 -55933 -9822 13496 -60612 -89054 -19744 -92691 -232387
8935 -232387 -208484 -188365 -146374 -77837 -128813 -136536 -96235 -88779 -65354 -101198 -65348 -20433
8923 -20433 -41737 37706 11422 -52040 -33668 20658 -4987 -23269 8941 14020 2707 -6254
8911 -6254 37115 67328 44055 160147 141156 51120 -29061 -26954 -29026 37554 14669 -23505
8899 -23505 -28059 -83078 -84235 -108008 -63841 -95051 -61540 3799 -57908 -87566 -101192 -94507
8887 -94507 -19151 39872 -8742 45230 16364 -53436 47585 104262 80879 64437 76444 56979
8875 56979 -9916 -72801 -69021 31470 137352 75718 23230 -942 33523 139487 113214
8864 113214 2104 28882 86377 27522 -106948 -154897 -86242 -11673 82628 30618 -54801
8853 -54801 -76432 -79349 -51324 -92667 -122907 -144723 -70572 -12501 -734 22029 4730 -84992
8841 -84992 -19864 36616 17156 -7200 -18464 42132 111448 165127 192562 139210 3346 -1809
8829 -1809 17210 23864 166655 181840 130881 133018 128661 112996 98942 50423 17560 -17102
8817 -17102 34934 29350 -16479 -82562 -118181 -119019 -111128 -133500 -70863 65163 106815 176599
8805 176599 125418 45507 54367 99568 71078 -13318 31428 77242 -18273 21825 106597 41143
8793 41143 60191 53313 75680 110347 126340 122551 83993 56595 81556 70696 -22140 -90181
8781 -90181 -83201 -25111 -39785 -9419 27737 95835 30354 -39354 -29593 46748 73231 99627
8769 99627 87850 193819 207085 124285 74239 4830 63222 175954 136979 67617 112088
8758 112088 136971 227554 230701 74263 -2361 -71959 48030 212890 157652 171039 231177
8747 231177 196904 152624 160358 52099 -52878 -73243 -50813 -59555 -70439 -208298 -179041
8736 -179041 -13697 70524 121622 24659 -9121 -12852 15628 53271 102826 116749 57011 -40034
8724 -40034 -118750 -90595 -23206 61964 45459 105180 194990 114333 17805 -2749 116367 154609
8712 154609 138991 67712 76991 99289 56943 9195 -25251 3148 10718 -49619 -89545 -38414
8700 -38414 -31513 -14271 34313 67984 48281 70688 100398 24593 3289 138816 186530 148783
8688 148783 92281 139027 187989 170451 44793 -14669 -34904 -45282 -100255 -54770 -29314
8677 -29314 -93105 -68518 6292 -35959 -32672 840 -47518 -8739 -37039 -31089 -3683 -38405
8665 -38405 -23473 36495 -34997 -47336 -71503 -85798 -20279 -25616 -46048 27656 60583 130822
8653 130822 136748 17865 8482 27233 17490 36720 34583 70745 116189 789 -18982 -11935
8641 -11935 43720 55122 8216 -63659 -34032 37656 75265 114953 66690 62719 106017 39127
8629 39127 -34952 -70610 -47547 -45119 -115171 -59257 69686 88484 72706 75239 19468 77003
8617 77003 105471 112513 152580 154492 109343 103961 39157 24719 138454 229549 191964 70265
8605 70265 28341 70318 38785 92731 155613 155745 187417 121862 38798 111656 115422 65415
8593 65415 98697 43508 124946 216896 242166 227939 244759 280572 248163 170488 174014 258775
8581 258775 122628 139086 97735 -1445 -49880 -39543 29723 111709 63894 29019 36788 -13797
8569 -13797 17266 41037 14818 -2580 2392 128345 217850 121013 84110 122354 174008 88410
8557 88410 -26099 -3612 -11223 -24839 -6631 -33446 -87354 -106127 -48700 -80440 -68665 -49877
8545 -49877 -39788 33363 21988 14352 87872 114319 48653 -65877 -107542 -51200 -55761 -91444
8533 -91444 -161648 -237040 -194725 -142041 -115531 -90200 -83734 -83492 -118051 -121252 -93056 66313
8521 66313 199192 152632 36298 -39472 -135395 -135607 -128916 -138023 -83494 -35876 -59218 -107352
8509 -107352 -96360 -164479 -157568 -84064 -15218 -99649 -40507 7936 -30226 -100912 -150056 -113660
8497 -113660 -100685 -38506 -23097 -50423 -67598 -124339 -110243 -53539 87687 185457 204756
8486 204756 222825 145256 81200 92382 -4581 -37539 -10239 42021 97500 87932 95967 81701
8474 81701 73112 -60525 -59043 9943 19842 2770 -137395 -143168 -99561 -160664 -200708 -119386
8462 -119386 5178 691 34983 34369 -32334 -131711 -101680 -11596 45933 88763 55906 102617
8450 102617 120391 111770 193640 228268 173459 174668 155501 189004 187897 175686 193498 144231
8438 144231 70044 10339 -67173 -21853 49890 42249 105883 204667 134264 19826 -62254 -72676
8426 -72676 -63314 4194 -45007 -60690 -25615 30895 -47812 -118461 -91309 -58279 -32642 28165
8414 28165 59706 51005 106037 164371 99613 -35800 -40777 -27554 -8520 -96389 -177330 -182035
8402 -182035 -222310 -185817 -105367 -62507 14595 42991 25204 -8048 -151827 -233008 -141695
8391 -141695 -152532 -196971 -113850 -119306 -159330 -70832 -25103 -91119 -63290 -89212 -96450 -108425
8379 -108425 -139631 -103904 -139167 -21459 42759 -15935 -9953 -104837 -36892 22954 -48013 -63294
8367 -63294 -12686 -21500 -56470 -75375 -75298 -70376 -81809 -65717 43131 19155 8502 108824
8355 108824 86414 29778 91063 31444 34492 41933 73841 15366 3567 -69105 -147004 -148373
8343 -148373 -100517 -129285 -171536 -115613 -104270 -111708 -156950 -148998 -127577 -18992 -17657 -115161
8331 -115161 -148714 -165122 -77591 -35576 -114338 -257389 -203968 -72523 -53832 -43652 -32760
8320 -32760 -78244 -134966 -12185 92568 60011 -49316 -178394 -225020 -198919 -175949 -185541
8309 -185541 -164894 -81254 -27085 12112 87298 110933 42183 99879 78974 35952 9575 51002
8297 51002 -43262 -125145 -110740 -17220 -5829 16608 -13353 -30717 -42787 -39585 4648 -80531
8285 -80531 -26930 -27212 -48859 35821 19083 -26791 80308 21666 -7350 -71256 -29098 105472
8273 105472 85591 87936 167856 87872 62221 52386 39572 -49944 -111152 -135683 -126417 -94999
8261 -94999 -47489 -64908 -125054 -110301 -78004 11357 39073 614 -113972 -139144 11607
8250 11607 -8993 -124855 -81110 -69966 -89348 15799 40230 -9062 -12058 -25080 4276 2544
8238 2544 -79651 -38328 -34033 -47472 -15921 -14777 45742 51738 -42811 -226 58667 21083 -67574
8225 -67574 -99697 -137780 -102489 -60780 -11079 -44584 -31056 -59023 -148790 -162103 -88659 -25515
8213 -25515 -55047 -77760 -60589 42628 71859 27319 39 -32249 -72265 -109746 -20116 28688
8201 28688 8663 -116032 -108488 -87982 -70261 -26072 23799 -1633 -95850 -17909 4493 -62492
8189 -62492 -41217 -54757 -46175 19626 30225 -27100 -77156 -106977 -35441 -39207 -107923 -68680
8177 -68680 -67719 -100263 -64640 -69084 -163678 -205545 -196660 -186461 -106799 -115106 -80476 -41396 -24758
8164 -24758 -45561 -106313 -19458 62294 -95941 -98581 6969 -4262 -56674 -20354 58589 46445
$$ [...]
##END NTUPLES=NMR SPECTRUM
##END=
