##TITLE=Analysis number 311099
Compound Code km 08202
Project Code adrs
Chemist Name prosynth
##JCAMPDX= 6.0         $$ Bruker NMR JCAMP-DX V2.0
##DATA TYPE= NMR SPECTRUM
##DATA CLASS= NTUPLES
##ORIGIN= Bruker BioSpin GmbH
##OWNER= NMR
$$ XWIN-NMR		Version 3.5
$$ Thu Jun 30 14:29:17 2005 GMT Daylight Time (UT+1h)  MAYBRIDGE\NMR@NMR_250MHZ
##.OBSERVE FREQUENCY= 250.131544655141
##.OBSERVE NUCLEUS= ^1H
##.ACQUISITION MODE= SIMULTANEOUS (DQD)
##.ACQUISITION SCHEME= undefined
##.AVERAGES= 16
##.DIGITISER RES= 18
##SPECTROMETER/DATA SYSTEM= dpx250
##.PULSE SEQUENCE= zg30
##.SOLVENT NAME= CDCl3
##.SHIFT REFERENCE= (INTERNAL, CDCl3, 0, 16.522)
##AUDIT TRAIL= $$ (NUMBER, WHEN, WHO, WHERE, WHAT)
$$ ##TITLE= Audit trail, XWIN-NMR		Version 3.5
$$ ##JCAMPDX= 5.01
$$ ##ORIGIN= Bruker BioSpin GmbH
$$ ##OWNER= NMR
$$ C:\u/data/dgb/nmr/ADRS/5140/pdata/1/auditp.txt
$$ ##AUDIT TRAIL=  $$ (NUMBER, WHEN, WHO, WHERE, WHAT)
(   1,<2005-06-30 14:28:56.43 +100>,<MAYBRIDGE\NMR>,<NMR_250MHZ>,
      <created by zg, POWCHK disabled, PULCHK disabled
       configuration hash MD5:
       62 19 C7 07 E1 42 D1 B7 37 6C 3D D0 77 39 F9 E6
       data hash MD5: 64K
       8A BB B4 D0 5C 43 06 80 FF 31 CB E6 8F 9F 3E 31>)
(   2,<2005-06-30 14:29:08.46 +100>,<MAYBRIDGE\NMR>,<NMR_250MHZ>,
      <Start of raw data processing
       ef LB = 0.3 FT_mod = 6 PKNL = 1 SI = 32K 
       data hash MD5: 32K
       98 AC C3 8E 25 A4 2C 02 FE BB 5D F0 B5 EB 73 69>)
(   3,<2005-06-30 14:29:11.19 +100>,<MAYBRIDGE\NMR>,<NMR_250MHZ>,
      <apk 
       data hash MD5: 32K
       B4 D1 AE B8 56 BE 8B 36 C6 57 D6 1F 7D 0E 81 5B>)
(   4,<2005-06-30 14:29:11.93 +100>,<MAYBRIDGE\NMR>,<NMR_250MHZ>,
      <abs ABSG = 5 
       data hash MD5: 32K
       79 8C 18 F5 EF 23 42 D2 98 D5 CF A9 ED 65 AE 1A>)
$$ ##END=
$$ 
$$ hash MD5
$$ 90 5C DF 53 CE D2 02 B2 5B 3F F9 64 28 1E 87 23
##$RELAX= 
##$RELAX= 
##$RELAX= 
##$RELAX= 
##$RELAX= 
##$RELAX= 
##$RELAX= 
$$ Bruker specific parameters
$$ --------------------------
##$DU= <C:\u>
##$EXPNO= 5140
##$NAME= <ADRS>
##$PROCNO= 1
##$TYPE= <nmr>
##$USER= <dgb>
##$AMP= (0..31)
100 100 100 100 100 100 100 100 100 100 100 100 100 100 100 100 100 100 
100 100 100 100 100 100 100 100 100 100 100 100 100 100 
##$AQSEQ= 0
##$AQ_mod= 3
##$AUNM= <au_zg>
##$AUTOPOS= <50 >
##$BF1= 250.13
##$BF2= 250.13
##$BF3= 250.13
##$BF4= 250.13
##$BF5= 500.13
##$BF6= 500.13
##$BF7= 500.13
##$BF8= 500.13
##$BYTORDA= 1
##$CFDGTYP= 0
##$CFRGTYP= 5
##$CHEMSTR= <none>
##$CNST= (0..31)
1 1 145 1 1 1 1 1 1 1 1 1 1 1 1 1 1 1 1 1 1 1 1 1 1 1 1 1 1 1 1 1 
##$CPDPRG= <>
##$CPDPRG1= <>
##$CPDPRG2= <>
##$CPDPRG3= <>
##$CPDPRG4= <mlev>
##$CPDPRG5= <mlev>
##$CPDPRG6= <mlev>
##$CPDPRG7= <mlev>
##$CPDPRG8= <mlev>
##$CPDPRGB= <>
##$CPDPRGT= <>
##$D= (0..31)
0 1 0 0 0 0 0 0 0 0.06 0 0 0 0 0 0 0.0002 0 0 0 0 0 0 0 0 0 0 0 0 0 0 
0 
##$DATE= 1120138135
##$DBL= (0..7)
120 120 120 120 120 120 120 120 
##$DBP= (0..7)
150 150 150 150 150 150 150 150 
##$DBP07= 0
##$DBPNAM0= <>
##$DBPNAM1= <>
##$DBPNAM2= <>
$$ [...]
##$SUBNAM7= <"">
##$SUBNAM8= <"">
##$SUBNAM9= <"">
##$SW= 20.6930455092707
##$SWIBOX= (0..15)
0 0 3 0 0 0 0 0 0 0 0 0 0 0 0 0 
##$SW_h= 5175.983436853
##$TD= 65536
##$TD0= 1
##$TE= 295.16
##$TE2= 300
##$TE3= 300
##$TEG= 300
##$TL= (0..7)
0 120 120 120 120 120 120 120 
##$TP= (0..7)
150 150 150 150 150 150 150 150 
##$TP07= 0
##$TPNAME0= <>
##$TPNAME1= <>
##$TPNAME2= <>
##$TPNAME3= <>
##$TPNAME4= <>
##$TPNAME5= <>
##$TPNAME6= <>
##$TPNAME7= <>
##$TPOAL= (0..7)
0.5 0.5 0.5 0.5 0.5 0.5 0.5 0.5 
##$TPOFFS= (0..7)
0 0 0 0 0 0 0 0 
##$TUNHIN= 0
##$TUNHOUT= 0
##$TUNXOUT= 0
##$USERA1= <user>
##$USERA2= <user>
##$USERA3= <user>
##$USERA4= <user>
##$USERA5= <user>
##$V9= 5
##$VALIST= <valist>
##$VCLIST= <CCCCCCCCCCCCCCC>
##$VD= 0
##$VDLIST= <DDDDDDDDDDDDDDD>
##$VPLIST= <PPPPPPPPPPPPPPP>
##$VTLIST= <TTTTTTTTTTTTTTT>
##$WBST= 1024
##$WBSW= 4
##$XGAIN= (0..3)
0 0 0 0 
##$XL= 0
##$YL= 0
##$YMAX_a= 459681
##$YMIN_a= -394214
##$ZGOPTNS= <>
##$ZL1= 120
##$ZL2= 120
##$ZL3= 120
##$ZL4= 120
##$ABSF1= 16.522
##$ABSF2= -4.171173
##$ABSG= 5
##$ABSL= 3
##$ALPHA= 0
##$AQORDER= 0
##$ASSFAC= 0
##$ASSFACI= 0
##$ASSFACX= 0
##$ASSWID= 0
##$AUNMP= <proc_1d>
##$AZFE= 0.1
##$AZFW= 0.1
##$BCFW= 0
##$BC_mod= 0
##$BYTORDP= 0
##$COROFFS= 0
##$CY= 12.5
##$DATMOD= 1
##$DC= 0
##$DFILT= <>
##$DTYPP= 0
##$F1P= 14.0000005364418
##$F2P= -0.99999901652339
##$FCOR= 0.5
##$FTSIZE= 32768
##$FT_mod= 6
##$GAMMA= 0
##$GB= 0
##$INTBC= 1
##$INTSCL= 1
##$ISEN= 128
##$LB= 0.3
##$LEV0= 0
##$LPBIN= 0
##$MAXI= 10000
##$MC2= 0
##$MEAN= 0
##$ME_mod= 0
##$MI= 0
##$NCOEF= 0
##$NC_proc= -4
##$NLEV= 6
##$NOISF1= 0
##$NOISF2= 0
##$NSP= 0
##$NTH_PI= 0
##$NZP= 0
##$OFFSET= 16.522
##$PC= 1
##$PHC0= 126.8313
##$PHC1= 10.18369
##$PH_mod= 1
##$PKNL= yes
##$PPARMOD= 0
##$PSCAL= 4
##$PSIGN= 0
##$REVERSE= no
##$SF= 250.13
##$SI= 32768
##$SIGF1= 0
##$SIGF2= 0
##$SINO= 400
##$SIOLD= 32768
##$SREGLST= <1H.CDCl3>
##$SSB= 0
##$STSI= 32768
##$STSR= 0
##$SW_p= 5175.98343685301
##$SYMM= 0
##$S_DEV= 0
##$TDeff= 65536
##$TDoff= 0
##$TI= <Analysis number 999999
Compound Code 99
Book Reference 9
Project Code 9>
##$TILT= no
##$TM1= 0
##$TM2= 0
##$TOPLEV= 0
##$USERP1= <user>
##$USERP2= <user>
##$USERP3= <user>
##$USERP4= <user>
##$USERP5= <user>
##$WDW= 1
##$XDIM= 32768
##$YMAX_p= 526982134
##$YMIN_p= -80629
$$ End of Bruker specific parameters
$$ ---------------------------------
##NTUPLES= NMR SPECTRUM
##VAR_NAME=  FREQUENCY,     SPECTRUM/REAL,   SPECTRUM/IMAG
##SYMBOL=    X,             R,               I
##VAR_TYPE=  INDEPENDENT,   DEPENDENT,       DEPENDENT
##VAR_FORM=  AFFN,          ASDF,            ASDF
##VAR_DIM=   32768,         32768,           32768
##UNITS=     HZ,            ARBITRARY UNITS, ARBITRARY UNITS
##FACTOR=    0.157963299565203, 1,           1
##FIRST=     4132.6476996994, 0,             0
##LAST=      -1043.33573715361, 0,           0
##MIN=       -1043.33573715361, -80629,      0
##MAX=       4132.6476996994, 526982134,     0
$$ Real data points
##PAGE= N=1
##DATA TABLE= (X++(R..R)), XYDATA
$$ [...]
15349D0310684N56386N59243N54885N50249N51019N44827N52032N44032N41100
15340D5264457N21367N18766N04430M97024N00100M90206M76317M56973M37338
15331D9666978M27783M23476M14150L83856L64956L46388L36671L10360K93588
15322E2968206K67642K46494K29317K07877J81834J62508J51842J21474Q1931
15313E4619125O5382N3292M0111k466k2873m3782o1842q7691j10149j35482j51014
15302E4162611j54304j73431j91372k16567k47692k58450k74887k90217l06921
15293E2048770l25873l31618l30488l55930l69230l71773l95091m05724m08175
15284D8754868m20774m19865m27598m45617m52581m59244m67622m58721m61645
$$ y = [40310684, 40867070, 41426313, 41981198, 42531447, 43082466, 43627293, 44179325, 44723357, 45264457, 45785824, 46304590, 46809020, 47306044, 47806144, 48296350, 48772667, 49229640, 49666978, 50094761, 50518237, 50932387, 51316243, 51681199, 52027587, 52364258, 52674618, 52968206, 53235848, 53482342, 53711659, 53919536, 54101370, 54263878, 54415720, 54537194, 54619125, 54684507, 54737799, 54777910, 54775444, 54752571, 54708789, 54646947, 54559256, 54449107, 54313625, 54162611, 54008307, 53834876, 53643504, 53426937, 53179245, 52920795, 52645908, 52355691, 52048770, 51722897, 51391279, 51060791, 50704861, 50335631, 49963858, 49568767, 49163043, 48754868, 48334094, 47914229, 47486631, 47041014, 46588433, 46129189, 45661567, 45202846, 44741201]
15275D4741201m71247m73415m75924m67868m69797m78860m87012m82242m83869
15266D0450967m85448m87293m90121m80534m71422m79129m74305m80612m83537
15257C6118566m75427m70535m62002m64303m63603m59412m46683m42979m37832
15248C1995790m39669m44888m26382m27881m22258m18380m09363m03843m06163
15239B8196963l97163l87089l88299l94145l76455l68787l74235l70526l64662
15230B4775602l50577l51524l44994l38772l31770l23284l23686l27954l15219
15221B1767822l07683l11997k95089k85635k92225k84352k75584k65611k67513
15212A9182133k66935k65856k56916k57057k42873k47728k41479k38632k39652
$$ y = [44741201, 44269954, 43796539, 43320615, 42852747, 42382950, 41904090, 41417078, 40934836, 40450967, 39965519, 39478226, 38988105, 38507571, 38036149, 37557020, 37082715, 36602103, 36118566, 35643139, 35172604, 34710602, 34246299, 33782696, 33323284, 32876601, 32433622, 31995790, 31556121, 31111233, 30684851, 30256970, 29834712, 29416332, 29006969, 28603126, 28196963, 27799800, 27412711, 27024412, 26630267, 26253812, 25885025, 25510790, 25140264, 24775602, 24425025, 24073501, 23728507, 23389735, 23057965, 22734681, 22410995, 22083041, 21767822, 21460139, 21148142, 20853053, 20567418, 20275193, 19990841, 19715257, 19449646, 19182133, 18915198, 18649342, 18392426, 18135369, 17892496, 17644768, 17403289, 17164657, 16925005]
15203A6925005k34687k17278k18791k18297k09111k01129j95263k05479j97605
15194A5027365j86418j90962j90642j90353j81875j76481j62954j71884j70840
15185A3404956j72770j57285j60222j52111j58345j50835j58243j40536j30400
15176A2024209j39374j50639j37512j20693j29007j26879j29075j26687j28983
15167A0835360j16976j06405j09439j17661j27371j12892j08887j04629j06323
15158I824777j03657j04485r4489q9705q6396r0019q7369q4665q8773q7696r3336
15147H814187p8917p7185q2999q3099q0184q6413p8268r3872q7373o2157p4295
15136G929425p8395p6125p4407n6715o1689q1543o7041o2760o7477p3709n7946
$$ y = [16925005, 16690318, 16473040, 16254249, 16035952, 15826841, 15625712, 15430449, 15224970, 15027365, 14840947, 14649985, 14459343, 14268990, 14087115, 13910634, 13747680, 13575796, 13404956, 13232186, 13074901, 12914679, 12762568, 12604223, 12453388, 12295145, 12154609, 12024209, 11884835, 11734196, 11596684, 11475991, 11346984, 11220105, 11091030, 10964343, 10835360, 10718384, 10611979, 10502540, 10384879, 10257508, 10144616, 10035729, 9931100, 9824777, 9721120, 9616635, 9522146, 9432441, 9346045, 9256026, 9168657, 9083992, 8995219, 8907523, 8814187, 8735270, 8658085, 8575086, 8491987, 8411803, 8325390, 8247122, 8153250, 8065877, 8003720, 7929425, 7851030, 7774905, 7700498, 7643783, 7582094, 7500551, 7433510, 7370750, 7303273, 7229564, 7171618]
15125G171618n9874o3467p1134o6278n3453n5344n4487o8493o2463n5729m7987
15114F512909o4645n2700m4427m9422m6294m4199m5320o5873n8484n2679m3540
15103E945326m8723m8474o1711o6154m5078l3770l5209m1754l8212l7236l9111
15092E449894m5725m6651m0302m6047m3312l6256m4004m3267l9789m3743m0101
15081D980697m2279l6354k9523l9109l9528m5325l2976l4656l3799l0790l7935
15070D578423k7926m2129m0380l1571l3456k7460k9662k3722j6702k1312l3587
15059D250516l6172k1398k9607k9532k2810l8807l2912l0304l0096k3604k9676
15048C925598k3782k6510k8119l0705k6028l6460j8522j7579k5574k0646j9793
$$ y = [7171618, 7111744, 7048277, 6977143, 6910865, 6857412, 6802068, 6747581, 6679088, 6616625, 6560896, 6512909, 6448264, 6395564, 6351137, 6301715, 6255421, 6211222, 6165902, 6100029, 6041545, 5988866, 5945326, 5896603, 5848129, 5786418, 5720264, 5675186, 5641416, 5606207, 5564453, 5526241, 5489005, 5449894, 5404169, 5357518, 5317216, 5271169, 5227857, 5191601, 5147597, 5104330, 5064541, 5020798, 4980697, 4938418, 4902064, 4872541, 4833432, 4793904, 4748579, 4715603, 4680947, 4647148, 4616358, 4578423, 4550497, 4508368, 4467988, 4436417, 4402961, 4375501, 4345839, 4322117, 4305415, 4284103, 4250516, 4214344, 4192946, 4163339, 4133807, 4110997, 4072190, 4039278, 4008974, 3978878, 3955274, 3925598, 3901816, 3875306, 3847187, 3816482, 3790454, 3753994, 3735472, 3717893, 3692319, 3671673, 3651880]
15037C651880j8999k0200k5920j8426k3386k1621k0211k9247j7326j5503k7039
15026C414002k3711j9227k1813k4097j9741k3128j5077j6214j5232k5743k4886
15015C185133k4591k0448j3121k4868j3283p314k9087k6978k1707k0826j1043
15004B971867n282j6609k5109k6071o619j991q085k2607k0457j1964j0642j2337
14992B804094j3525j5883j9803j3877j0721k2707j5866n807j4207j6102k0490
14981B635106j4684j3215r418r184j4402k1961j6682j5936j5669j5520l614j8548
14969B466273j4277j6221n489j8957r750L334j1566j9651j5129j1254j5927j1812
14957B319574k843n760o274j6259j1105n966j6459j3349j6619p878l169p065q251
$$ y = [3651880, 3632881, 3612681, 3586761, 3568335, 3544949, 3523328, 3503117, 3473870, 3456544, 3441041, 3414002, 3390291, 3371064, 3349251, 3325154, 3305413, 3282285, 3267208, 3250994, 3235762, 3210019, 3185133, 3160542, 3140094, 3126973, 3102105, 3088822, 3081508, 3052421, 3025443, 3003736, 2982910, 2971867, 2966585, 2949976, 2924867, 2898796, 2892177, 2890186, 2882101, 2859494, 2839037, 2827073, 2816431, 2804094, 2790569, 2774686, 2754883, 2741006, 2730285, 2707578, 2691712, 2685905, 2671698, 2655596, 2635106, 2620422, 2607207, 2597789, 2588605, 2574203, 2552242, 2535560, 2519624, 2503955, 2488435, 2484821, 2466273, 2451996, 2435775, 2430286, 2411329, 2401579, 2404913, 2393347, 2373696, 2358567, 2347313, 2331386, 2319574, 2316731, 2310971, 2304697, 2288438, 2277333, 2271367, 2254908, 2241559, 2224940, 2217062, 2213893, 2206828, 2198577]
14944B198577o930j6893j3555j1736o609k0421k0445j4050R60n046m349m914k140
14931B072449j4221j9980j5284j712J458j3820j1684j3015m689l291j1212q301
14919A956698o481r948j572o323j5895j1143k442j6556j1496m862m849j1776n909
14906A847446q481r323N195p531j5629q274o255p217k638r634q693j2737m075
14893A752154N778M937j1011j5532q765j2735p950r968n218j2712k949N022k367
14880A678684p957r057j7113j346j157j6501r588L899p32m107l599o530j565m018
14866A599313j3726j752j0720j0840l792N94O832r214j5339j6712j0003K934m30
14853A517145j091m524O90j0520j7948p249O425K294L214r905j6620o931j2011
$$ y = [2198577, 2191647, 2174754, 2161199, 2149463, 2142854, 2122433, 2101988, 2087938, 2088898, 2083852, 2079503, 2074589, 2072449, 2058228, 2038248, 2022964, 2021252, 2022710, 2008890, 1997206, 1984191, 1979502, 1976211, 1964999, 1956698, 1950217, 1940269, 1938697, 1932374, 1916479, 1905336, 1902894, 1886338, 1874842, 1869980, 1865131, 1853355, 1847446, 1838965, 1829642, 1834837, 1827306, 1811677, 1803403, 1797148, 1789931, 1787293, 1777659, 1768966, 1756229, 1752154, 1757932, 1762869, 1751858, 1736326, 1727561, 1714826, 1706876, 1696908, 1691690, 1678978, 1676029, 1681051, 1678684, 1670727, 1661670, 1644557, 1643211, 1642054, 1625553, 1615965, 1619864, 1619132, 1615025, 1611426, 1604896, 1603331, 1599313, 1585587, 1583835, 1573115, 1562275, 1558483, 1559077, 1565909, 1556695, 1541356, 1524644, 1514641, 1517575, 1517145, 1516054, 1511530, 1512220, 1501700, 1483752, 1476503, 1482928, 1485222, 1488436, 1478531, 1461911, 1454980, 1442969]
14840A442969m401l173k710q471j375m574j465r946j3365L950k934j2461j783
14827A380261L23p374r358l069l961j1373q36l150l214m639n73q112k469P950
14813A330406r15n110l246o374J592l333r30q901j2179q855k445L452j2163m528
14799A266471j1409j0800o766N786k739o932n301l855K474n620j420j3987j326
14786A204576N260O393j805P50j0973j0024m04l952p253n710J836N871J601l729
14772A182437M108j71N046R909k878o107m049o787q337m398K055K02R24r550n919
14757A156485k640p607o183p229o308q432p801M703K950P050k09J714k223k744
14743A121526M886K281r852m390J5211L826l606j2908j3974j0122p653j2009j920
$$ y = [1442969, 1438568, 1435395, 1432685, 1424214, 1422839, 1418265, 1416800, 1406854, 1393489, 1397439, 1394505, 1382044, 1380261, 1380584, 1373210, 1363852, 1360783, 1356822, 1345449, 1344613, 1341463, 1338249, 1333610, 1333037, 1324925, 1322456, 1330406, 1329491, 1324381, 1321135, 1314761, 1316353, 1313020, 1312090, 1303189, 1291010, 1282155, 1279710, 1283162, 1270999, 1266471, 1255062, 1244262, 1237496, 1243282, 1240543, 1233611, 1228310, 1224455, 1226929, 1221309, 1219889, 1205902, 1204576, 1209836, 1216229, 1214424, 1215174, 1204201, 1194177, 1193773, 1189821, 1182568, 1176858, 1178694, 1184565, 1186166, 1182437, 1186545, 1186374, 1191420, 1201329, 1198451, 1192344, 1188295, 1181508, 1173171, 1168773, 1170828, 1171030, 1171954, 1162404, 1156485, 1153845, 1146238, 1140055, 1132826, 1126518, 1118086, 1110285, 1114988, 1117938, 1124988, 1124779, 1126493, 1124270, 1121526, 1126412, 1128693, 1118841, 1114451, 1129662, 1133488, 1129882, 1116974, 1103000, 1092878, 1085225, 1073216, 1071296]
14730A071296j043K741n451j3682r800O194m44j0418R17P75o8j0827N02m011p200
14715A019481o279l546r06M631m16O16m299o517o802p887K182p359m100m066k744
14700I71989J969j965K35M71m830p015L805l142K068r58o438j0796J347l25p548
14685I38867K744m07M201M277j6240j3208l671m195m884j496k167j585M101P017
14671I13354R72k405q45l975r800o310P335k746j1314l874K242o852N079K2731
14657I03592l950j1296q040n599J1929M533N177o218o453k111p096o337J1719
14644H79850j483j036m086j712J490n214o737l285r222o090k50M354M40P517L369
14629H57905M14k178J626J1708l033j5725r892M909N869j0540J538L43N143O769
$$ y = [1071296, 1070253, 1072994, 1067543, 1053861, 1044061, 1050255, 1049811, 1039393, 1040310, 1041085, 1041017, 1030190, 1030692, 1026681, 1019481, 1013202, 1009656, 1008750, 1013381, 1012965, 1013581, 1009282, 1002765, 995963, 988076, 990258, 982899, 978799, 974733, 971989, 973958, 971993, 972228, 972699, 967869, 960854, 964659, 961517, 963585, 962627, 956189, 945393, 946740, 946415, 938867, 941611, 941204, 945405, 949682, 933442, 920234, 916563, 912368, 907484, 905988, 903821, 902236, 906337, 913354, 914326, 911921, 911076, 907101, 897301, 890991, 898326, 895580, 884266, 880392, 882634, 875782, 880861, 903592, 899642, 888346, 880306, 874707, 886636, 891169, 896346, 890128, 883675, 881564, 874468, 868131, 879850, 878367, 877331, 873245, 871533, 873023, 867809, 861072, 857787, 848565, 842475, 842225, 846579, 847019, 854536, 857905, 858319, 856141, 857767, 869475, 866442, 850717, 840825, 845734, 851603, 841063, 842601, 842944, 848087, 854856]
14615H54856N530J318m122m480j0158j838r46q769L19j901o54O082j521p241m128
14600H22347L034m685L041J600q353l562K515l97p803n832L165N36L285O949P541
14585H23381J840o415o792p794K397p308o148L169p176Q158J0052O335L318L523
14571H20540k494M629M091n982m326K827n227M070L173l058M571j3557n773j221
14557H02263k699q198j683M430J380n587q11Q302N067l778J268k561r902n16L993
14542G90968K60N139O065q48p018l211P605L579j0066K309O314M142o179n034
14528G94025q140j605K352J281L226R156m72k886k656l863r269n134J115N334
14514G82464K654k298O172Q859J800q536q540q310L880N423o13k392j252m37l447
$$ y = [854856, 860386, 861704, 857582, 853102, 842944, 841106, 840160, 831391, 831710, 829809, 829155, 835237, 833716, 826475, 822347, 825381, 820696, 823737, 825337, 816984, 813422, 815937, 815540, 807737, 801905, 805070, 805606, 808891, 815840, 823381, 825221, 818806, 812014, 804220, 806617, 799309, 793161, 796330, 789154, 797312, 807364, 813699, 817017, 820540, 818046, 822675, 826766, 820784, 816458, 819285, 814058, 818128, 821301, 818243, 822814, 809257, 803484, 802263, 799564, 791366, 789683, 794113, 795493, 789906, 789095, 797397, 802464, 798686, 799954, 797393, 787491, 786975, 790968, 791228, 796367, 802432, 801584, 794566, 791355, 798960, 802539, 792473, 794782, 801096, 805238, 799059, 794025, 785885, 784280, 786632, 787913, 791139, 800295, 799823, 796937, 794281, 790418, 781149, 776015, 777130, 782464, 785118, 782820, 788992, 797851, 799651, 791115, 782575, 774265, 778145, 783568, 782955, 780563, 779311, 778874, 775427]
14499G75427m300l540K682Q579L451j471Q973K314p882L946J521k554p72R15J208
14484G88497K531L940N834j601M643l824q137l746m429M041Q615l315l625L934
14470G93358J745M677J910R35l701o924m421K832Q185M317P770M738K959j1858
14456H06522p147J1956m704r625l607L723L641M264L592k393R521J0649K590r844
14442H19138l453m352L09M627R41M826L752n642N605O21k287p023O475L211L926
14427H30674J1585N31P540l362j5244j806J931P843O598P758J86n378k121L625
14413H50360K079R0p86q066K975J0118M312o699j247P887L48n083J0217J0455
14399H76960M22k708O43R77k845L234M534OK825K960J1298Q698K924J338J602
$$ y = [775427, 771127, 767587, 770269, 778848, 782299, 780828, 789801, 792115, 784233, 788179, 789700, 787146, 786374, 787289, 788497, 791028, 794968, 800802, 799201, 803844, 800020, 791883, 788137, 783708, 787749, 796364, 793049, 789424, 793358, 795103, 799780, 801690, 802625, 798924, 792000, 787579, 790411, 798596, 802913, 810683, 815421, 818380, 806522, 799375, 811331, 806627, 797002, 793395, 797118, 800759, 805023, 808615, 806222, 815743, 826392, 828982, 819138, 815685, 811333, 811642, 816269, 817210, 822036, 825788, 820146, 825751, 826372, 824085, 817062, 823537, 826748, 830674, 842259, 842790, 850330, 846968, 831724, 829918, 831849, 839692, 846290, 854048, 854234, 848856, 846735, 850360, 852439, 852529, 851743, 843677, 846652, 856770, 861082, 854383, 853136, 861023, 861371, 856288, 866505, 876960, 877382, 874674, 875317, 876294, 873449, 876683, 881217, 881223, 884048, 887008, 898306, 907004, 909928, 911266, 912868]
14384I12868l856P695P78J832J39O69P729M637l212M454N785O291J1712P070Q927
14369I73518K109n094j770j850N372P147M462J2074J455l603r254O422M687J2539
14355A008214J3458k921j301K449l518Q909J504L303M006L624O925J8402O791
14342A069845o531Q840J1960m674M92P067p883p35L991N323p13J1171J0147R03
14328A109203P411Q111P40k03K85j516R925M946l32Q988L602R133J2651J889k119
14313A172714J0555Q296J7040P742j686O51J508L590R494K9J5237R326P334p05
14299A261125Q463J5517O668J3054J3427J049J352J9682O189J0855M454R656Q825
14286A380316J4104Q45P759J6396O881Q91k627K422J7181J9914P325J4152N67
$$ y = [912868, 909012, 916707, 917485, 919317, 919456, 920125, 927854, 932491, 929279, 933733, 939518, 945809, 957521, 964591, 973518, 975627, 970533, 968763, 966913, 972285, 979432, 983894, 995968, 997423, 993820, 984566, 990988, 995675, 1008214, 1021672, 1018751, 1017450, 1019899, 1016381, 1025290, 1026794, 1030097, 1034103, 1037727, 1044652, 1063054, 1069845, 1063314, 1072154, 1084114, 1079440, 1079932, 1086999, 1079116, 1078381, 1082372, 1087695, 1086982, 1098153, 1108300, 1109203, 1116614, 1124725, 1125465, 1125262, 1125547, 1124031, 1133956, 1138902, 1138570, 1147558, 1151160, 1160293, 1172944, 1174833, 1172714, 1183269, 1191565, 1208605, 1216347, 1214661, 1215312, 1216820, 1220410, 1229904, 1229933, 1245170, 1254496, 1261830, 1261125, 1269588, 1285105, 1291773, 1304827, 1318254, 1319303, 1320655, 1340337, 1346526, 1357381, 1361835, 1371491, 1380316, 1394420, 1395265, 1403024, 1419420, 1426301, 1427192, 1424565, 1426987, 1444168, 1464082, 1471407, 1485559, 1486126]
14273A486126o163l46O247J2481R064J2027O079J0849P486J1833R293J0361R140
14260A584477P593P8J6585N099N78M003K208J6580Q563l099J1620J4078Q912P104
14246A684379O570J0995J0793J1155o77P580J2544R613L036p99J0712J4130J2442
14233A792473k519j33J0816J1931R099N110l414L6R386M357j248P317J3623O649
14219A863483n297Q960M593Q80M21o318j331O467R940J59j501L458O257L28q045
14204A882454k217k669m096J133J2471K083q445o834k441k576l947m897j2599
14191A847420l44J59J26N503l375j0646j1643K003K59k376j0915j2883j1031j1852
14177A780405m563r744j1401J057j214j3398j5149l814o989o57n849n305L470
$$ y = [1486126, 1479963, 1479617, 1485864, 1498345, 1507409, 1519436, 1525515, 1536364, 1543850, 1555683, 1564976, 1575337, 1584477, 1592070, 1592148, 1608733, 1613832, 1614410, 1618413, 1620621, 1637201, 1645764, 1642665, 1654285, 1668363, 1677275, 1684379, 1690949, 1701944, 1712737, 1723892, 1723215, 1730795, 1743339, 1752952, 1755988, 1755189, 1765901, 1780031, 1792473, 1789954, 1789821, 1800637, 1812568, 1821667, 1826777, 1823363, 1823399, 1832785, 1837142, 1835894, 1843211, 1856834, 1863483, 1858186, 1867146, 1871739, 1872619, 1873040, 1866722, 1865391, 1871858, 1881798, 1881957, 1880456, 1883914, 1890171, 1890499, 1882454, 1880237, 1877568, 1873472, 1874605, 1887076, 1889159, 1880714, 1873880, 1871439, 1868863, 1864916, 1860019, 1847420, 1847076, 1847235, 1847361, 1852864, 1849489, 1838843, 1827200, 1829203, 1829462, 1827086, 1816171, 1803288, 1792257, 1780405, 1775842, 1766098, 1754697, 1755754, 1754540, 1741142, 1725993, 1722179, 1715190, 1714533, 1708684, 1703379, 1706849]
14164A706849k056r597r006j4034q777r49J608l30o620j7987o126K957j5334k2918
14150A597680q183j2425j1263r906m901K926l634p404j3796j1191r07P827m660
14137A520163j3194j6467j1202q349l28J468j7058r063p189o043j2358n278k544
14124A412558m846j7552r356r651l508k058L184n598l336o632m641j0333j5790
14111A322441r995j2832O589P249k385r359j444j3317k0063r616m230j33J1900
14098A264805m630j8710j5299k898L467k797K89j2705j5005O52m107j2439m702
14085A175921n190j0741j1598k195L362P290p321j2433r122j2375o663j580k289
14072A105066k301o228n385l774m94K879r790j1041J262q067j6422J037L398m412
$$ y = [1706849, 1704793, 1695196, 1686190, 1672156, 1663379, 1662430, 1664038, 1663708, 1657088, 1639101, 1632975, 1635932, 1620598, 1597680, 1589497, 1577072, 1565809, 1555903, 1551002, 1553928, 1550294, 1542890, 1529094, 1517903, 1516996, 1524823, 1520163, 1506969, 1490502, 1479300, 1470951, 1470623, 1472091, 1455033, 1445970, 1438781, 1432738, 1420380, 1415102, 1412558, 1407712, 1390160, 1380804, 1371153, 1367645, 1365587, 1368771, 1363173, 1359837, 1353205, 1348564, 1338231, 1322441, 1312446, 1299614, 1306203, 1313452, 1311067, 1301708, 1300264, 1286947, 1266884, 1257268, 1253038, 1252905, 1264805, 1260175, 1241465, 1226166, 1223268, 1226735, 1223938, 1224227, 1211522, 1196517, 1197169, 1193062, 1180623, 1175921, 1170731, 1159990, 1148392, 1146197, 1149559, 1156849, 1149528, 1137095, 1127973, 1115598, 1108935, 1107355, 1105066, 1102765, 1096537, 1091152, 1087378, 1086884, 1089763, 1079973, 1068932, 1070194, 1062127, 1045705, 1046742, 1050140, 1045728]
14058A045728o582j4806j5285J326J267j0483m342K24R853M774l446r436q951
14045I89841q919l090k968k429MK136m487P05j4022j5117J03N607n115j3424L13
14030I29138l63m001j740r727j0150k155J86j10l206j5709l640Q422k182m272
14016H80491J485j0038j0975P049N985m938l596j790m610k744j0904m708N364
14003H46071M79o188j988J801r852p9o532o40l367l550j0082P89k561J854p802
13988G98353q957j950P298j437o614j1967r241k495M55N278L951r801m995k821
13974G55057n062J283l365J256L000j221l468n636l633m063o943k706M932l041
13960G26390Qk076K79M583J0017L682q037j8492r601k491k299j942k402m985k50
$$ y = [1045728, 1039146, 1024340, 1009055, 1010381, 1011648, 1001165, 996823, 997047, 1006900, 1011674, 1008228, 998792, 989841, 980922, 977832, 974864, 972435, 972439, 974575, 970088, 970793, 956771, 941654, 941757, 947364, 942249, 928825, 929138, 928775, 924774, 923034, 913307, 903157, 901002, 901188, 901078, 897872, 882163, 878523, 886945, 884763, 880491, 881976, 871938, 860963, 868012, 873997, 869059, 865463, 863673, 859063, 856319, 845415, 840707, 846071, 846550, 840362, 838374, 840175, 830323, 830244, 823712, 823072, 819705, 816155, 806073, 806862, 804301, 806155, 798353, 789396, 787446, 794744, 793307, 786693, 774726, 765485, 762990, 763445, 768723, 772674, 762873, 757878, 755057, 749995, 751278, 747913, 749169, 752169, 750948, 747480, 741844, 738211, 734148, 727205, 724499, 729431, 726390, 726398, 724322, 724601, 729184, 739201, 742883, 734846, 716354, 706753, 704262, 701963, 700021, 697619, 692634, 692384]
13945F92384R01Q999n906J573M828j1557o739M131o532r103Q734J157j259K276
13931F83887k138p87j905j0752l535J706k273l632r953L296P564Q96J363q730
13917F55007k253k42M090m440r143M602J2886L461q275r062lq153n284J914k199
13902F32906j2097P301J1716j575P129Q272r546j4765K101P035M551n666j2423
13889F24939k513N558J3052L347o639q31o262m779L517l11r688n053j230M147
13875F17254O38M702K522j083R75q510n505L232J1923N546N601N330N234N652
13861F53511j637J467k795L008J5608K0762K5123K8139K0949L7548L9560M4276
13849H85519P1170Q8699R9154J03138R7324Q1784K8990j2892l9798o9585q6152
$$ y = [692384, 693285, 702284, 696378, 697951, 702779, 691222, 684483, 688614, 682082, 672979, 681713, 682870, 681611, 683887, 681749, 680962, 679057, 668305, 664770, 666476, 664203, 660571, 650618, 653914, 661478, 662374, 663737, 655007, 652754, 652512, 656602, 652162, 643019, 647621, 660507, 663968, 655693, 646631, 646628, 638475, 633191, 635105, 632906, 620809, 628110, 639826, 638251, 645380, 653652, 644106, 629341, 631442, 638477, 643028, 637362, 624939, 622426, 627984, 641036, 644383, 637744, 636913, 630651, 625872, 629389, 629078, 619390, 614337, 613107, 617254, 617892, 622594, 625116, 624033, 625008, 616498, 610993, 614225, 626148, 631694, 637295, 642625, 647859, 653511, 651874, 653341, 650546, 653554, 669162, 689924, 715047, 743186, 764135, 801683, 841243, 885519, 956689, 1045388, 1144542, 1247680, 1345004, 1426788, 1455778, 1442886, 1403088, 1333503, 1247351]
13838A247351q2032q0141o8959n2607l3569k7394k9273k2508j7033k2343j0508
13827H00984o995j7973j8058j0652r058r040K476m705p626l87K544L938j1677
13814G13771j1128N428k275k876O824M899l738K339R309M241m169J73J2298K021
13800G37117n50J9002L3243L3813L7052N5190O3856P7844Q8553R8070J07661R5306
13788A446157P1829M4869n731n3852r8921j00518q7464q8447p6593n3731n0282
13777I47316m0702l1109l1071k7111j3112j2778l837j7072j9115k0669j2461K162
13765G20441j783j1538o713q57m445p538K999J943p449j0656k859J0513k130j1890
13751F68038q131m533O555o568r910J531l167j4005j4473l392m707k639L476j0303
$$ y = [1247351, 1165319, 1085178, 1016219, 963612, 930043, 902649, 873376, 850868, 833835, 811492, 800984, 793989, 776016, 757958, 747306, 738248, 729208, 731684, 726979, 719353, 718966, 721510, 725448, 713771, 702643, 708071, 705796, 702920, 709744, 714643, 710905, 713244, 722553, 726794, 722625, 722798, 735096, 737117, 736567, 755569, 788812, 822625, 859677, 914867, 978723, 1056567, 1145120, 1243190, 1350851, 1446157, 1517986, 1562855, 1557124, 1503272, 1404351, 1303833, 1216369, 1127922, 1051329, 997598, 947316, 906614, 875505, 844434, 817323, 804211, 791433, 787596, 770524, 751409, 730740, 718279, 720441, 718658, 707120, 700407, 699550, 695105, 687567, 690566, 692509, 685060, 674404, 671545, 682058, 679928, 668038, 659907, 655374, 661929, 655361, 645451, 646982, 643815, 629810, 615337, 611945, 607238, 604599, 608075, 597772]
13737E97772o064K13j4312o700L772r377l743N09N96L229j4297q959j963k377
13723E38299k106K499l506p566j923l81L680j1190p608l328J1072J1085j1950
13710E17077j3321O167J2573l226m461M141p300j0485p901L671L442l634O376
13697E03119O483L826n050n529k401k21P405n604M027j301M108J024M523l450
13683E10959m605Q592O321o173m739k851L264J839o499Q54K533Q90N38k300m476
13668E04147R5O080m64n742P674M580q6j208m36n009m531J936J878l343m421j0107
13652D91043p28N175N321N5P31m454r193N332L819J4638M28j4271k553Q227n138
13637D98432J263o428m047J0590O077m79q311K554K779n53m772n420J8j07l457
$$ y = [597772, 591708, 591921, 577609, 570909, 574681, 565304, 561561, 562070, 562666, 565895, 551598, 542639, 540676, 538299, 536193, 538692, 535186, 527620, 525697, 525316, 528996, 517806, 510198, 506870, 517942, 529027, 517077, 503756, 509923, 522496, 519270, 514809, 518950, 511650, 501165, 493264, 496935, 500377, 496743, 503119, 509602, 513428, 508378, 502849, 500448, 500227, 507632, 502028, 506055, 504754, 508862, 509886, 514409, 510959, 506354, 514946, 521267, 515094, 510355, 507504, 510768, 512607, 506108, 506962, 509495, 510385, 510923, 508623, 504147, 504242, 510322, 509858, 504116, 511790, 516370, 516284, 515076, 514640, 509631, 505100, 507036, 508914, 505571, 501150, 491043, 490315, 495490, 500811, 500866, 501597, 497143, 487950, 493282, 497101, 511739, 512167, 497896, 495343, 503570, 498432, 499695, 493267, 489220, 499810, 505887, 505408, 497097, 499651, 502430, 501877, 497105, 491685, 491703, 491596, 488139]
13622D88139l434o017M373K573k14q58o05P381N940P646O429L814r827l980L020
13607E04380O204P839N285N278O63q88r26n763l410j251K499P605K807n07j1729
13592E18086j5618o470n112P204J134J371n330m186K313K097N835K655n372k598
13578D96009o800N298J4250M748K593p503k050K080J556J2447J1298M47k252K659
13564E34780n593j7155j5957n078N183N863m644O455J1811J6510p89R01l028j333
13550E27926M543N59l15L940P08R88p947j1965q550m799P674Q127l095j364M289
13535E20719O947j747J648Q600L184Q529k065q219K682K108N184o468k137j0339
13521E28626K629j37r84l549J375O875p444q022m238Q666m266k390J564k271J117
$$ y = [488139, 484705, 478688, 483061, 485634, 485420, 484562, 483957, 491338, 497278, 504924, 511353, 515167, 505340, 501360, 504380, 510584, 518423, 523708, 528986, 529649, 528761, 527835, 522072, 518662, 517411, 519910, 527515, 530322, 529815, 518086, 502468, 495998, 490886, 498090, 499224, 500595, 495265, 491079, 493392, 495489, 501324, 503979, 498607, 496009, 489209, 494507, 508757, 513505, 516098, 508595, 506545, 508625, 510181, 522628, 533926, 534373, 532121, 534780, 529187, 512032, 496075, 490997, 496180, 502043, 497399, 503854, 515665, 532175, 531386, 532287, 529259, 527926, 532469, 533028, 532713, 536653, 537361, 538349, 530402, 518437, 509887, 505088, 512762, 520889, 517794, 516430, 520719, 527666, 525919, 527567, 536167, 539351, 547880, 545815, 537596, 540278, 542386, 547570, 541102, 538965, 528626, 531255, 531118, 530134, 526585, 527960, 534835, 527391, 519369, 515131, 523797, 519531, 517141, 518705, 516434, 517551]
13506E17551L278Q61O089l2j726q480l85k587O152l126J7R045j60m539J423j484
13490E21897M491J895R060K588p794k124p606j993M519P331l36K60N341n59K439
13475E39409k586l180q482j3215o045N804P468J2452L725qm282P962O759n162
13461E40619J633m534l170J4927J5916J6586p413j5425N548N711J0837J4815M283
13448F00333P169J4606J2014J2533P797P605R978Q537l343o462N617J9090Q876
13435G04350P171N681K3637J7224K0776L3361L9234L5072N2463O4005P6847Q6295
13423A166116J04457J37407J88974K36566K92296L67426M35035M87759M91613
13414C907649L94854K00680l9839k42591l54212l90836l73027l24590k53622k01756
$$ y = [517551, 520829, 521690, 527779, 527747, 526021, 517541, 517156, 514569, 520721, 517595, 517612, 526657, 526497, 521958, 523381, 521897, 526388, 528283, 537343, 539931, 532137, 530013, 522407, 520414, 524933, 532264, 531928, 532188, 537529, 536970, 539409, 536823, 533643, 525161, 511946, 505901, 511705, 519173, 531625, 535350, 535342, 531060, 539022, 545781, 540619, 542252, 537718, 534548, 549475, 565391, 581977, 574564, 559139, 564687, 570398, 581235, 596050, 600333, 607502, 622108, 634122, 646655, 654452, 662057, 672035, 680572, 677229, 670767, 676384, 695474, 704350, 711521, 717202, 740839, 758063, 778839, 812200, 851434, 886506, 938969, 1002974, 1079821, 1166116, 1270573, 1407980, 1596954, 1833520, 2125816, 2493242, 2928277, 3416036, 3907649, 4302503, 4503183, 4463344, 4220753, 3866541, 3475705, 3102678, 2778088, 2524466, 2322710]
13404B322710j57496j28279j01148q1673p3053p0120o0425m0078l6545l3330l1174
13393A509389k3131k0107k5408k5225j3642j5299j7283r204L456J0222K0278J7437
13381A411483K7739L8894M3752M3728N2319O2169P5942Q7032J20850J54958K06525
13370B325391K76842L58837M47461N14743N72669N58094M28112J80649j06075
13361E556723l27834m56700m93702m56847l86539l19675k62056k09232j70468
13352B473670j52042j25368r9260q1838q3581p9515o4991n4240m9370m5201m0985
13341A597279m2929l0850l4897k6579j8677j8820j4406j3896p137j4633k2488
13330A351967j3623o531j2726j7931j5723k1825j8208l4617k0859k1628k5269
$$ y = [2322710, 2165214, 2036935, 1935787, 1854114, 1781061, 1710941, 1650516, 1610438, 1573893, 1540563, 1509389, 1486258, 1466151, 1440743, 1415518, 1401876, 1386577, 1369294, 1360090, 1363546, 1373768, 1394046, 1411483, 1439222, 1478116, 1521868, 1565596, 1617915, 1680084, 1756026, 1843058, 1963908, 2118866, 2325391, 2602233, 2961070, 3408531, 3923274, 4495943, 5054037, 5482149, 5662798, 5556723, 5228889, 4772189, 4278487, 3821640, 3435101, 3115426, 2853370, 2644138, 2473670, 2321628, 2196260, 2097000, 2015162, 1931581, 1852066, 1787075, 1732835, 1683465, 1638264, 1597279, 1554350, 1523500, 1488603, 1462024, 1443347, 1424527, 1410121, 1396225, 1389088, 1374455, 1351967, 1338344, 1331813, 1319087, 1301156, 1285433, 1263608, 1245400, 1210783, 1189924, 1168296, 1143027]
13319A143027k7331k8311k0663j6257j6843k8272k5700j5459j0419j6795o708
13308I30269j3646j7637j9255j9230j0594j1809j4756j2293n880o580o687l710
13296G88192j0814j3555j3055o181m528j5999j0909L184p65k917j0864m907L756
13283G00638m398N200r570k1932o721L136m530l043P29R564k855L13R938J0603
13269F87072P995p779p612l913j253P16m230N609o081p01M320j469k1N350p022
13254F70981q578J021k923l535k972n918N12Q071J2988p420o302l006J385J0193
13240F64497l45m678J485q77j0385K689J193p112R550J6399L303O163n514j0665
13226F65703p20N242P696L805k093M34O288O694J0017Q550k014k965J1887J0848
$$ y = [1143027, 1115696, 1087385, 1066722, 1050465, 1033622, 1005350, 979650, 964191, 953772, 936977, 930269, 916623, 898986, 879731, 860501, 849907, 838098, 823342, 811049, 805169, 798589, 791902, 788192, 777378, 763823, 750768, 744587, 740059, 724060, 713151, 716335, 715570, 712653, 701789, 696882, 700638, 696240, 701440, 691870, 669938, 663217, 666353, 661823, 658780, 659509, 669073, 666218, 666531, 676469, 687072, 695067, 687288, 679676, 675763, 674510, 675226, 670996, 676605, 670524, 669823, 674143, 672674, 672653, 678003, 670981, 662403, 663424, 660501, 656966, 653994, 648076, 648588, 656659, 669647, 662227, 655925, 652919, 654304, 664497, 664152, 659474, 660959, 660082, 649697, 652386, 653579, 646467, 656017, 672416, 675719, 681882, 676368, 665703, 664983, 670225, 677921, 681726, 679633, 680067, 686355, 693049, 703066, 711616, 709602, 706637, 718524, 729372]
13212G29372J0208J2477m660k166N034J340O18j341l575j729l272K694K93n672
13198G39621q970n093k878L985j969m105o078r784N21n09q50j351M998M444O300
13183G18282P41p369M360N548M410j291r5M413q33k220L665O750l578o665N71
13168G26689P19K281o568o934N333J231J1075J4008k142M660K833K361L28Q99
13154G56773k003P168N388M441n379p472J2727M750K485J5038J0785J0827J7266
13141H32794J7655K2260L5090N4405O4716O4102O7759O8864M7545K1272J8492
13130A314954J2954Q208j506J5578N238k4764m4562m4622m2821m9468l6745l1489
13118A080955k6335j9330j9170j1458q50j4774j0254J641O197r72m205m252k39
$$ y = [729372, 739580, 752057, 747397, 745231, 750265, 751605, 752223, 750882, 747307, 745578, 742306, 745000, 745293, 739621, 730651, 725558, 722680, 726665, 724696, 720591, 714513, 704729, 705250, 704741, 703891, 702540, 707538, 711982, 718282, 719023, 711654, 716014, 721562, 725972, 724681, 724586, 728999, 728166, 725946, 729611, 736361, 732783, 726118, 726689, 727408, 729689, 723121, 716187, 721520, 722751, 733826, 747834, 745692, 750352, 753185, 755546, 755874, 756773, 754770, 761938, 767326, 771767, 766388, 758916, 771643, 776393, 778878, 793916, 804701, 815528, 832794, 850449, 872709, 907799, 962204, 1026920, 1091022, 1158781, 1227645, 1275190, 1296462, 1314954, 1327908, 1336116, 1334610, 1350188, 1355426, 1330662, 1286100, 1241478, 1198657, 1149189, 1112444, 1080955, 1054620, 1035290, 1016120, 1004662, 1003812, 989038, 978784, 980425, 986622, 985650, 981445, 977193, 976954]
13105I76954L445l042J311j749n803q801j436j1185j3220k876O39q153o59q200
13091I17225j2140P707Q438O707N44k175N334K174N581j86J2964O269m556J4990
13077I68876K4391K5381K2673M5124N1588O4067Q0990R3624J21698J65973J69048
13066A833433J24675M9467k9356j14895j52622j33466j07615q3637o3957m1286
13056A280741k8631k8068j6233j3298q093l899o612k0169k4346p547r478r175
13044A105192l0M350k823o753q262k934Q4M71J561J2861n87K408Q67j045l324
13029A102036q012q5k96J2200j966J061J0422J3787M210J3836L3032L4795N6553
13016A271573O6766P8606R3172J17078J39884J39753R3047J7906o3229j08714
$$ y = [976954, 980399, 977357, 978668, 976919, 971116, 962315, 960879, 949694, 936474, 933598, 934237, 926084, 925425, 917225, 905085, 912792, 921230, 927937, 928481, 926306, 931640, 933814, 939395, 939209, 952173, 958442, 953886, 968876, 993267, 1018648, 1041321, 1086445, 1138033, 1202100, 1283090, 1376714, 1498412, 1664385, 1833433, 1958108, 2007575, 1978219, 1863324, 1710702, 1577236, 1469621, 1385984, 1322027, 1280741, 1252110, 1224042, 1207809, 1194511, 1186418, 1182519, 1175907, 1155738, 1131392, 1123845, 1114367, 1105192, 1105162, 1109512, 1106689, 1099936, 1091674, 1088740, 1088824, 1089295, 1090856, 1103717, 1103130, 1105538, 1106405, 1105360, 1102036, 1094024, 1093939, 1093643, 1105843, 1103877, 1104938, 1115360, 1129147, 1133357, 1147193, 1180225, 1215020, 1271573, 1338339, 1416945, 1510117, 1627195, 1767079, 1906832, 1999879, 2017785, 1954556, 1845842]
13006A845842j13208j08783r9006o6996n1614m5682m2156k9569l574L02j3156
12995A272400j4637k1582q694J875j438K156Q906o39J507O372o943J0037R748
12982A259068J3835K0707R430J4992J2015L702P777O471N816m930j9384j1369
12970A318130j3743j9084j2294l655K920M338o2j0803r518j905m24O358J2114
12957A272372J2130J0437P807M413J3739J8946L0398L3387K3282J9337L4334L5346
12945A515928M3200O3652Q6093Q9696J10683J32670J70625K22665K84352L66066
12935C085630M66598N82825O85290P26913N98467K75146j23985m13911n40940
12926E342033n48645m85550l92653l04442k31144j79087j44857j22582j03448
$$ y = [1845842, 1732634, 1623851, 1524845, 1457849, 1406235, 1360553, 1318397, 1288828, 1285254, 1285556, 1272400, 1257763, 1236181, 1227487, 1229362, 1227924, 1230080, 1238986, 1238347, 1239854, 1246226, 1239283, 1249320, 1259068, 1272903, 1293610, 1303040, 1318032, 1330047, 1333749, 1341526, 1347997, 1353813, 1348883, 1329499, 1318130, 1304387, 1285303, 1273009, 1269354, 1272274, 1276612, 1276550, 1265747, 1256229, 1254324, 1253900, 1260258, 1272372, 1284502, 1294939, 1302746, 1307159, 1320898, 1339844, 1370242, 1403629, 1426911, 1446248, 1480582, 1515928, 1559128, 1622780, 1708873, 1798569, 1909252, 2041922, 2212547, 2435212, 2719564, 3085630, 3552228, 4135053, 4820343, 5547256, 6145723, 6420869, 6296884, 5882973, 5342033, 4793388, 4307838, 3915185, 3610743, 3379599, 3200512, 3055655, 2933073, 2829625]
12917B829625r0773q5121q3189p2329m6512n1257m5286l7054k4587l2641k8213
12906B232663j3967o270l942m309n08M214O571K9018K5404K4861J4856K7378L1292
12893B367261N0336N6054O3976Q9171J26336J67739K07892K68078L68957M76996
12883D242796N66467N86871M56458J43553j86213m01795m76996m68496m15299
12874D047346l44092k59741j97550j54572j34431j07917r1230p6768o4204p1105
12864B545736n5172n3377m7540l4298k5156l7539l0368k4013l0680j8168j6028
12853B173397j6351j6516p294m993p938k717P43J720o200j1916j2469j4889j3341
12840B061236j5906k6685k4721k2777j8070k4066j7413j5833j8341n296j1937
$$ y = [2829625, 2738852, 2653731, 2570542, 2498213, 2451701, 2400444, 2355158, 2318104, 2293517, 2260876, 2232663, 2218696, 2212426, 2208484, 2204175, 2203667, 2207881, 2214452, 2243470, 2268874, 2293735, 2308591, 2335969, 2367261, 2417597, 2473651, 2537627, 2626798, 2753134, 2920873, 3128765, 3396843, 3765800, 4242796, 4809263, 5396134, 5852592, 5996145, 5809932, 5408137, 4931141, 4462645, 4047346, 3703254, 3443513, 3245963, 3091391, 2956960, 2849043, 2757813, 2681045, 2616841, 2545736, 2490564, 2437187, 2389647, 2355349, 2330193, 2292654, 2262286, 2238273, 2207593, 2189425, 2173397, 2157046, 2140530, 2133236, 2128243, 2120305, 2117588, 2118331, 2120051, 2113851, 2101935, 2089466, 2074577, 2061236, 2045330, 2018645, 1993924, 1971147, 1953077, 1929011, 1911598, 1895765, 1877424, 1872128, 1860191]
12829A860191o221q027j3078j4557j1033L032j6953k0452n930n391r432j657m648
12816A745844L074r30j003j443O913O248p93q850J394J1209Q862J7042J2859P952
12802A808378J6623J6968J9604K2675J4377J4901J4126j009j3551j0234r488k0054
12790A873316k0983p26P317k469K569j238j077l368o078P170J4992J168l289n306
12776A861998O694L783Q740J1713J9642L786j910J0729J3471J1941P429R265N779
12763A973060L021l492Q159J5116J9612J7787J6110J3110J4352J1020J3310J4374
12751B115539J5060J2351J0904l98R893N581j126M727J7025O933M28J0735J2927
12738B220579K0654L2562K6690K8371L8401N1651L7082K3806N963j3445j5322
$$ y = [1860191, 1853970, 1845943, 1832865, 1818308, 1807275, 1810307, 1793354, 1772902, 1766972, 1761581, 1752149, 1750492, 1745844, 1748918, 1747988, 1746985, 1745542, 1752455, 1758703, 1757910, 1749060, 1750454, 1761663, 1770525, 1787567, 1800426, 1808378, 1825001, 1841969, 1861573, 1884248, 1898625, 1913526, 1927652, 1926643, 1913092, 1902858, 1893370, 1873316, 1852333, 1851607, 1858924, 1856455, 1859024, 1857786, 1856709, 1853341, 1847263, 1854433, 1869425, 1870593, 1867304, 1861998, 1868692, 1872475, 1881215, 1892928, 1912570, 1916356, 1914446, 1925175, 1938646, 1950587, 1958016, 1967281, 1973060, 1976081, 1972589, 1980748, 1995864, 2015476, 2033263, 2049373, 2062483, 2076835, 2087855, 2101165, 2115539, 2130599, 2142950, 2153854, 2153456, 2163349, 2168930, 2167804, 2172531, 2189556, 2196489, 2196917, 2207652, 2220579, 2241233, 2273795, 2300485, 2328856, 2367257, 2418908, 2455990, 2479796, 2485759, 2472314, 2456992]
12727B456992j4453j6435o489l66R345M871J099R470J7816L000J3003R938J5551
12714B503342R988J6171K3898Q571J7986J5275J5062P902J0256J2267P896Q302
12702B656916J8859J1460J3681K4395L3432L5279L3275L3722K2018L7193L8755
12691B958985L1181M6353L3283J0347m104k7579l1752j8658o576N933Q081J2459
12679C017953J4760J8903O300M448K4581K4366J7539J4502O591P612M066O770
12667C168391J2175J8733K1115J3529J4422J7417K4315J9908J1219J6595J2102
12656C349921N168R716Q487J1113Q770K7212L4630L0940J7238J3683K2123K0034
12644C559035J0094Q973L195O856j050M736R687L674P91J4822Q537J0252R574
$$ y = [2456992, 2442539, 2426104, 2419615, 2419249, 2428594, 2433465, 2434564, 2444034, 2461850, 2464850, 2477853, 2487791, 2503342, 2513330, 2529501, 2553399, 2561970, 2579956, 2595231, 2610293, 2618195, 2628451, 2640718, 2648614, 2656916, 2675775, 2687235, 2700916, 2725311, 2758743, 2794022, 2827297, 2861019, 2883037, 2920230, 2958985, 2990166, 3036519, 3069802, 3080149, 3076045, 3048466, 3016714, 2998056, 2991480, 2997413, 3005494, 3017953, 3032713, 3051616, 3057916, 3062364, 3086945, 3111311, 3128850, 3143352, 3149943, 3157555, 3161621, 3168391, 3180566, 3199299, 3220414, 3233943, 3248365, 3265782, 3290097, 3310005, 3321224, 3337819, 3349921, 3355089, 3364805, 3373292, 3384405, 3393175, 3420387, 3455017, 3485957, 3503195, 3516878, 3539001, 3559035, 3569129, 3578102, 3581297, 3588153, 3587103, 3591839, 3601526, 3605200, 3605991, 3620813, 3629350, 3639602, 3649176]
12631C649176J6113K8798K8972J3693J7337K3616J2921P160J4669J6027J3645
12620C842127K0177K3322K6998K0256J8308K9187J8720K4958L0940K0196K1941
12609D097130J3838P266J7631J3823J3212L1967K4574K4784K0624K0741L8724
12598D324314L0528K2944L1001K8684J9046L5494M1572N2001N2141M5034N5122
12587D737881N9615M0182N1636M2286K9807K0967K2614L2540L8098L9344K4416
12576E139386K3766L4295K4414J3276J4349J3289Q276R862K688K773J1121J9512
12564E317007K3277J4986L3334M5355M2713L8859L7354L5256L0136K8608K1252
12553E668137J4180K2917J8538L1890L1183K8927K4927K6452L3260L0438L0074
$$ y = [3649176, 3665289, 3694087, 3723059, 3736752, 3754089, 3777705, 3790626, 3797786, 3812455, 3828482, 3842127, 3862304, 3885626, 3912624, 3932880, 3951188, 3980375, 3999095, 4024053, 4054993, 4075189, 4097130, 4110968, 4118234, 4135865, 4149688, 4162900, 4194867, 4219441, 4244225, 4264849, 4285590, 4324314, 4354842, 4377786, 4408787, 4437471, 4456517, 4492011, 4533583, 4585584, 4637725, 4682759, 4737881, 4797496, 4837678, 4889314, 4931600, 4961407, 4982374, 5004988, 5037528, 5075626, 5114970, 5139386, 5163152, 5197447, 5221861, 5235137, 5249486, 5262775, 5271051, 5280913, 5283601, 5286374, 5297495, 5317007, 5340284, 5355270, 5388604, 5433959, 5476672, 5515531, 5552885, 5588141, 5618277, 5646885, 5668137, 5682317, 5705234, 5723772, 5755662, 5786845, 5815772, 5840699, 5867151, 5900411, 5930849, 5960923]
12542E960923M4104L1746L1687M1888K6223L2149M0805K6864K1218K5852L4043
12531F317502M6895M1463M6370M3968M6961N7192N2957N4430O2860N9282N8414
12520F888294N8692N2951M6871M1187M2000M5768L1493L5256M7774K9372J8544
12509G338202J1932j852J8125L3850K3686K9509K8459L5767L3721K8836L0933
12498G611168K3883K3084K9497K6437J7807K5372L0557L8226M6073L6856L2847
12487G941807L4702M8951L0943K0331L1781L5548M5785M1723L3594K4801K6275
12476H316241L3424K6326L7566L5593L8729L2191K5388K9023L3493K0249K3023
12465H651246L1031L7233L4945L4353L7007L5168L3249L7200L4058J8831J0992
$$ y = [5960923, 6005027, 6036773, 6068460, 6110348, 6136571, 6168720, 6209525, 6236389, 6257607, 6283459, 6317502, 6364397, 6405860, 6452230, 6496198, 6543159, 6600351, 6653308, 6707738, 6770598, 6829880, 6888294, 6946986, 6999937, 7046808, 7087995, 7129995, 7175763, 7207256, 7242512, 7290286, 7319658, 7338202, 7350134, 7348282, 7366407, 7400257, 7423943, 7453452, 7481911, 7517678, 7551399, 7580235, 7611168, 7635051, 7658135, 7687632, 7714069, 7731876, 7757248, 7787805, 7826031, 7872104, 7908960, 7941807, 7976509, 8025460, 8056403, 8076734, 8108515, 8144063, 8189848, 8231571, 8265165, 8289966, 8316241, 8349665, 8375991, 8413557, 8449150, 8487879, 8520070, 8545458, 8574481, 8607974, 8628223, 8651246, 8682277, 8719510, 8754455, 8788808, 8825815, 8860983, 8894232, 8931432, 8965490, 8984321, 8995313]
12454H995313J3374J1530K4896K9866K5784J5466K2871J1554M938K3639J8816
12443I198047R840J5515K6636J3390N211J1474J0741J5362J7222O714R556J4662
12431I354370J9979J3434J2963N483J0245J5361J164J2965N454J8347J2467O65
12419I482897J081R70M752K438K623o752j3348r444j4929j9555p883Q684k036
12406I429498r078j4347q289o626j3286L47K104n461j3818j5826k3286q153J052
12393I314831j4548j5566j9328k6272k9366j3930j9548l2701l3692j8268k7748
12382I063864k3197k0710j0673j7619k6685j6300k3232k4295j7863k7533l2126
12371H823631l5141l3380l3624l1905k7822k4560l0817l8789l2762l1087l8725
$$ y = [8995313, 9008687, 9020217, 9045113, 9074979, 9100763, 9116229, 9139100, 9150654, 9155592, 9179231, 9198047, 9207887, 9223402, 9250038, 9263428, 9268639, 9280113, 9290854, 9306216, 9323438, 9330152, 9339708, 9354370, 9374349, 9387783, 9400746, 9406229, 9416474, 9431835, 9432999, 9445964, 9451418, 9469765, 9482232, 9482897, 9483978, 9484948, 9489700, 9492138, 9494761, 9488009, 9474661, 9465217, 9450288, 9430733, 9422850, 9431534, 9429498, 9420420, 9406073, 9397784, 9391158, 9377872, 9378219, 9380323, 9374862, 9361044, 9345218, 9321932, 9313779, 9314831, 9300283, 9284717, 9265389, 9239117, 9209751, 9195821, 9176273, 9143572, 9109880, 9091612, 9063864, 9040667, 9019957, 9009284, 8991665, 8964980, 8948680, 8925448, 8901153, 8883290, 8855757, 8823631, 8788490, 8755110, 8721486, 8689581, 8661759, 8637199, 8606382, 8567593, 8534831, 8503744, 8465019]
12360H465019l5078l2395k3906k5316k8259k1763j8653j7075k0941l3390k6930
12349H181313k1458j9184k0800l3648l9188m8869n0570n1167n1626m6082n4382
12338G744339n1916m9209m7615m1328m0412l2204m6365m1527l8754m0480m1500
12327G273029l4749l6157l6659m2428m4719l2072k4045l2551l4450m1129m7314
12316F866756n5276m8397l6215l2990l9997m8506l7897m7606m7200m3330k7342
12305F402000m1239l6994l5215k8570l6935m7439l7072k5383l6314l6177l5158
12294F005504l7595l5827l8239l3007l4968m1010m0552k4891l5284l8928m2414
12283E602789m0787l5623l0785l3191l4446k9497l5399l5038l1266l0704k2289
$$ y = [8465019, 8429941, 8397546, 8373640, 8348324, 8320065, 8298302, 8279649, 8262574, 8241633, 8208243, 8181313, 8159855, 8140671, 8119871, 8086223, 8047035, 7998166, 7947596, 7896429, 7844803, 7798721, 7744339, 7692423, 7643214, 7595599, 7554271, 7513859, 7481655, 7435290, 7393763, 7355009, 7314529, 7273029, 7238280, 7202123, 7165464, 7123036, 7078317, 7046245, 7022200, 6989649, 6955199, 6914070, 6866756, 6811480, 6763083, 6726868, 6693878, 6653881, 6605375, 6567478, 6519872, 6472672, 6429342, 6402000, 6360761, 6323767, 6288552, 6259982, 6223047, 6175608, 6138536, 6113153, 6076839, 6040662, 6005504, 5967909, 5932082, 5893843, 5860836, 5825868, 5784858, 5744306, 5719415, 5684131, 5645203, 5602789, 5562002, 5526379, 5495594, 5462403, 5427957, 5398460, 5363061, 5328023, 5296757, 5266053, 5243764]
12272E243764k1063k0872j9842j892J1901O483N133n835m3320p5336o7919o7587
12260D943615o3215n6034m3744l6644l9121l6749m2329m0151m0055l5557l0995
12249D479021k1392l0863k6326l3178l3882k5638k7965k6758l3182m5091l9598
12238D135148k9242k2863q001j5253k9609j7395j3625j2694j0861q083j6791j0189
12226C940542J019J9719K9827J1754j8380m4003o1666n1718m2587m3925l9554
12215C701028k6431j5016j7167l5657k7432k3442j0989k6426j7923k0438j5957
12204C464150k1236l060O686j5839p443J928j9731j5674k1264j8330k2121k0137
12192C307929k7295l4675k8680k2108p755r811l4668l0346k5981l0955k6509k8065
$$ y = [5243764, 5222701, 5201829, 5181987, 5180095, 5191996, 5198479, 5203612, 5197777, 5154457, 5079121, 5011202, 4943615, 4880400, 4824366, 4780622, 4743978, 4704857, 4668108, 4625779, 4585628, 4545573, 4510016, 4479021, 4457629, 4426766, 4400440, 4367262, 4333380, 4307742, 4279777, 4253019, 4219837, 4174746, 4135148, 4105906, 4083043, 4075042, 4059789, 4030180, 4012785, 3999160, 3986466, 3975605, 3967522, 3950731, 3940542, 3941561, 3961280, 3991107, 4002861, 3984481, 3940478, 3878812, 3827094, 3784507, 3740582, 3701028, 3674597, 3659581, 3642414, 3606757, 3579325, 3555883, 3544894, 3518468, 3500545, 3480107, 3464150, 3442914, 3439854, 3446540, 3430701, 3423258, 3425186, 3405455, 3389781, 3368517, 3350187, 3328066, 3307929, 3280634, 3245959, 3217279, 3195171, 3187416, 3177605, 3142937, 3112591, 3086610, 3055655, 3029146, 3001081]
12180C001081l0539k5095j9369k1806k2720j8985k9423k7864k2153k0394j7317
12169B745416p866j1152j4784j4604j2764k5664j3496k2543k8543k5274j9616
12158B549110k0999j9468r597q459r144j6271j4291j2001j6286k092q862j1079
12146B400561r542p135p518l103j747r058M926P852j4801j9934k0084k2944k2218
12133B275255j8440k6730k3076l198j5715j2069k0028j8446r374n270J833Q133
12121B132875K2266K0934L1634L7587M1386P0067R0266J33246J85346K58423L44765
12110C368795M61781N47103M66277J72168k18515m75551m87998m01923k91663
12101C140474k03820j47443j15092p9305p3647n8364l4600l1675l2308k8878k4681
$$ y = [3001081, 2970542, 2945447, 2926078, 2904272, 2881552, 2862567, 2833144, 2805280, 2783127, 2762733, 2745416, 2737550, 2726398, 2711614, 2697010, 2684246, 2658582, 2645086, 2622543, 2594000, 2568726, 2549110, 2528111, 2508643, 2499046, 2490587, 2481443, 2465172, 2450881, 2438880, 2422594, 2420502, 2411640, 2400561, 2391019, 2383884, 2376366, 2373263, 2371516, 2362458, 2367384, 2375236, 2360435, 2340501, 2320417, 2297473, 2275255, 2256815, 2230085, 2207009, 2203811, 2188096, 2176027, 2155999, 2137553, 2128179, 2122909, 2124742, 2132875, 2155141, 2176075, 2207709, 2245296, 2286682, 2356749, 2447015, 2580261, 2765607, 3024030, 3368795, 3830576, 4377679, 4843956, 5016124, 4797609, 4322058, 3834060, 3432137, 3140474, 2936654, 2789211, 2674119, 2594814, 2521167, 2462803, 2428203, 2396528, 2364220, 2335342, 2310661]
12090B310661k0518k4371j4960r319l26K218l045J6862K2584K0239K8912L3391
12078B362328M9203P2791P9792R0784J12028J54426K06164K57609L35477M64324
12068D184926O36837R02479J226152J567259J668906J153777k8418j235809j653546
12059H422563j415342j040932p03140m76628l28359k39409j99330j69161j41546
12050C708716j23104j03150j05280q5507o1130o4020o3403n5577k4052k0304k6756
12039B976433k5228k0720J729J375J3808L6986N7698R8080J18851J22325J58418
12028C539755K01769K50783L09079L80484N17629P36241J038413J398027J657215
12019A0029395J446912N16637q08528j661413j631072j291952r18156o14204m33896
$$ y = [2310661, 2290143, 2265772, 2250812, 2241493, 2241167, 2243385, 2240340, 2257202, 2279786, 2300025, 2328937, 2362328, 2411531, 2484322, 2564114, 2654898, 2766926, 2921352, 3127516, 3385125, 3720602, 4184926, 4821763, 5724242, 6950394, 8517653, 10186559, 11340336, 11311918, 10076109, 8422563, 7007221, 5966289, 5263149, 4786521, 4458162, 4218753, 4019423, 3850262, 3708716, 3585612, 3482462, 3377182, 3291675, 3230545, 3166525, 3103122, 3047545, 3023493, 3003189, 2976433, 2951205, 2930485, 2932214, 2933589, 2947397, 2984383, 3042081, 3140161, 3259012, 3381337, 3539755, 3741524, 3992307, 4301386, 4681870, 5199499, 5935740, 6974153, 8372180, 10029395, 11476307, 11992944, 11184416, 9523003, 7891931, 6599979, 5681823, 5067619, 4633723]
12010D633723l22601k60868k25789j81022j51286j39279j32294j15320q5369q4062
12000B935833q3424o3043m9018m4866l1115l0250l4009l1847k8297j5397j5442
11989B509125j046J1888K3988J5599J6824K9426L9398N8648R0559J49446K07252
11978C151107K74797L93120N01559N00837K91752j11072m69803n77548m93826
11969C460923l76765k56896j70737j20645q0022n2007l7793m9076o8922p9465
11959B168595p9212q4353q3336p0613n0500m3126m4142m2266m0136l9350l5071
11948A556490j7417j7533k3072q696n966N927Q805q506j9498k7765j8884k3980
11936A399905k9767m1422k7186l0543l9516l3810k3811k0281j6691j0589p916
$$ y = [4633723, 4311122, 4050254, 3824465, 3643443, 3492157, 3352878, 3220584, 3105264, 3019895, 2935833, 2852409, 2789366, 2740348, 2695482, 2664367, 2634117, 2600108, 2568261, 2539964, 2524567, 2509125, 2508079, 2519967, 2543955, 2559554, 2576378, 2605804, 2645202, 2703850, 2794409, 2943855, 3151107, 3425904, 3819024, 4320583, 4821420, 5113172, 5002100, 4532297, 3954749, 3460923, 3084158, 2827262, 2656525, 2535880, 2455858, 2403851, 2366058, 2316982, 2248060, 2168595, 2089383, 2005030, 1921694, 1851081, 1800581, 1757455, 1713313, 1671047, 1630911, 1591561, 1556490, 1539073, 1521540, 1498468, 1489772, 1483806, 1489733, 1498538, 1490032, 1470534, 1442769, 1423885, 1399905, 1370138, 1328716, 1301530, 1270987, 1231471, 1197661, 1173850, 1153569, 1136878, 1126289, 1118373]
11925A118373j5017l0012l1093k0680r890j3201j5422j1009j3805j2614j8672
11914I26958k4115j4929k224p473j7726n029o210j7345j9499j0933n86m577r671
11901G86641l286K507O716R6j21j8412j1074j5912q539j322K070j3672j3783r976
11887G01933j4027j1272r601J340r34q789M087o056J199Q33r395j3934q306n022
11873F22056k533k41k498l961k648J161q397n89R377m875p528j299j3859n857
11859E78309p05P009j061k965m068j2760j321K697K967j0326r268K523J444K95
11845E52770n4k672L74j0458m528J373m356n831l998L54m330q320j955k232Q18
11830E06955K115m135m985L583n979m771j0636p341j1600J071J011N125n274O612
$$ y = [1118373, 1103356, 1073344, 1042251, 1021571, 1011681, 998480, 983058, 972049, 958244, 945630, 926958, 902843, 887914, 885690, 878217, 860491, 855462, 849252, 831907, 812408, 801475, 800889, 796312, 786641, 783355, 785862, 792578, 792674, 792553, 774141, 763067, 747155, 738616, 737294, 739364, 725692, 711909, 701933, 687906, 676634, 667033, 668373, 667439, 658650, 662737, 656681, 657880, 658713, 649318, 635384, 627078, 622056, 619523, 619282, 616784, 612823, 610175, 611336, 602939, 602350, 611727, 606852, 599324, 598025, 584166, 578309, 577604, 584613, 583552, 580587, 576519, 563759, 562438, 565135, 568102, 557776, 548508, 551031, 552475, 552770, 552716, 550044, 550418, 539960, 535432, 536805, 532449, 526618, 522620, 522974, 518644, 510324, 508369, 506137, 506955, 509070, 504935, 499950, 503533, 497554, 492783, 482147, 474806, 463206, 464277, 465288, 470413, 465139, 471751]
11816D71751p127j4741m919J1361Q730M403n356j4778j1887k790M601K288J057
11803D42593k771j85p368k06M676j3640l791L888M468q245K075R59K087k368n739
11788D16433L908j55q437J3983M7o016l364o384m312J847J722m372l730R16K479
11773D04565O20j699r897j4073q767Q12j947m765m076l275q08M309N811j0840
11759C55970o88l859p02k9O975p471L595n10r859j4366j886Q794P275o614j828
11744C34797J985K05p931n195K931m913l912N257R536r34n831p791J154Q803l006
11729C25155K513n360p174p37K13N057J826p04j2431L299j0497k865l93j566q68
11714B95468p744j37J940P726N469p90P114k563j1333n666q516M690J3510j3316
$$ y = [471751, 464624, 449883, 444964, 456325, 465055, 469458, 464102, 449324, 437437, 434647, 439248, 441536, 442593, 439822, 439637, 432269, 432063, 436739, 423099, 419308, 423196, 427664, 419419, 421494, 422453, 424540, 422172, 416433, 420341, 420186, 411749, 425732, 425779, 419763, 416399, 410015, 405703, 407550, 409272, 404900, 401170, 402086, 404565, 405185, 403486, 393589, 379516, 370749, 371561, 369614, 364849, 360773, 357498, 356690, 360999, 366810, 355970, 355282, 351423, 350721, 350692, 357667, 350196, 353791, 353281, 343422, 329056, 327170, 335964, 343239, 336625, 334797, 336782, 336987, 329056, 323861, 326792, 321879, 317967, 323224, 332760, 331826, 325995, 318204, 319358, 328161, 325155, 327668, 322308, 315134, 314397, 314610, 319667, 321493, 320789, 308358, 311657, 301160, 298295, 297902, 296336, 295468, 287724, 287587, 289527, 297253, 302722, 301932, 309046, 306483, 295150, 289484, 280968, 285658, 299168, 285852]
11700B85852q308N937k805r56p765j0260O039M326P42m056K39l525N100P460p821
11685B70199j1562l365j4453J834O530o546K182Q659K215o453r872K750m36K257
11671B43939r855o193R95J2073q883q424l4M180O504O318J014l10k063q050n595
11656B25616m047M379O822O939p825j0654J3709K204l156r264K164J0245j230
11643B35902M28N38j6489j1630O399J1552r758r297o674m17R354K093M542J831
11629B18374l665r484K485O172q001M854J0614O560J064p435O975R883M029N320
11615B47745J100r370r994n945R11l535j4509o182o376k817R200K139j3081k753
11601A86533O249m568J440r85J029M480n281l661m430L749j06j866l031K113J0177
$$ y = [285852, 277544, 283481, 280676, 279720, 271955, 261695, 267734, 272060, 272802, 268746, 268985, 265460, 270560, 278020, 270199, 258637, 255272, 240819, 242653, 249183, 242637, 244819, 253478, 255693, 249240, 239368, 242118, 241682, 243939, 234084, 227891, 228886, 240959, 232076, 223652, 223618, 227798, 234302, 240620, 241634, 241324, 239261, 231211, 225616, 221569, 225948, 232770, 239709, 231884, 221230, 234939, 237143, 233987, 224723, 226887, 237132, 235902, 236330, 236868, 220379, 208749, 215148, 226700, 216942, 207645, 200971, 200554, 209908, 212001, 216543, 218374, 214709, 205225, 207710, 213882, 205881, 210735, 221349, 227909, 228973, 221538, 228513, 238396, 242425, 247745, 248845, 239475, 229481, 223536, 224447, 220912, 206403, 200221, 193845, 191028, 200228, 202367, 189286, 186533, 192782, 188214, 189654, 188669, 189698, 194178, 188897, 185236, 180806, 184555, 184449, 182583, 179552, 181665, 191842]
11586A91842J2789k099k835k366o9k696o067q046n809m117K475J0831P696j581
11572A89948J7352J0003K06j2219q911p208j3629p366n15M785m535R83J0154L906
11558A82954q74j0065j806O84n791n027n243m655K248k556n89O131N189j654p823
11543A51123l063P387J175M671k999j0691J111m25J387P58r11k691j99n678L288
11528A44243R089j1197l804J1908K064n390o894m566n71K755P56O14p918N90N038
11513A36717q708k5K669l963k203O10m208K268K594J699o364m49L757q10k304
11498A21280L672j46o294m893O56M122q736p549O079P931R902K460l531k824J377
11483A23506p47L106q006k887r710O071O546j311n615l395J879j447o940M353
$$ y = [191842, 204631, 202532, 199697, 197331, 197262, 194566, 188499, 180453, 174644, 170527, 173002, 183833, 191529, 189948, 207300, 217303, 217509, 205290, 196379, 189171, 175542, 168176, 167661, 172446, 167911, 168894, 179048, 182954, 182080, 172015, 170209, 170893, 165102, 160075, 154832, 150177, 152425, 149869, 149280, 155411, 160600, 158946, 151123, 148060, 155447, 156622, 161293, 158294, 147603, 148714, 148289, 149676, 150434, 149523, 146832, 146633, 140955, 144243, 153332, 142135, 138331, 150239, 152303, 146913, 140019, 135453, 134882, 137637, 138393, 139007, 131089, 131679, 136717, 128009, 127984, 130653, 126690, 124487, 125097, 120889, 123157, 125751, 127450, 121086, 120637, 124394, 123584, 121280, 124952, 124806, 118512, 113619, 114275, 118397, 109661, 102112, 108191, 116122, 126024, 128484, 124953, 122129, 123506, 122759, 125865, 117859, 114972, 105262, 111333, 117879, 116568, 110953, 107558, 109437, 107990, 101050, 105403]
11469A05403J091k711L636M018m860j2385J026R521N602o385j4491o831p783M26
11455G5277J6776R354j32m075l798p360l395O710J402R181q04l763j6868o143
11441G2362N224J2777p243o840N282L209K451Q089N329K22O160n635n516l512
11427I2359J027K364j787l479l949j402M867o692k504M953P92l019j2091n111
11413F6328l685J0629P844m62j553l223l0L748J888J989j3675j5129K652J1893
11399F9214M244k011O783p55M48j2l858n434K839J571j552q325O675J7565N12
11384H7904n110l380m910m501m808j2611K683J775N082N809o69L678p740r001
11370E4201K539J168L186N501k276L97L398k565N830m554j742J1077n900l907
$$ y = [105403, 106494, 103783, 107419, 111437, 106577, 94192, 95218, 104739, 110341, 103956, 89465, 82634, 74851, 75277, 92053, 101407, 101275, 97200, 93402, 86042, 82647, 89357, 90759, 99940, 99136, 95373, 78505, 72362, 77586, 90363, 83120, 76280, 81562, 84771, 87222, 95311, 100640, 100862, 107022, 101387, 95871, 92359, 93386, 95750, 93963, 90484, 86535, 85133, 90000, 83308, 80804, 85757, 86549, 83530, 71439, 66328, 62643, 73272, 81116, 80654, 79101, 75878, 75848, 79596, 81484, 83473, 69798, 54669, 57321, 69214, 73458, 71447, 78230, 77475, 77923, 77911, 74053, 68619, 71458, 73029, 71477, 63152, 69827, 87392, 87904, 82794, 79414, 74504, 70003, 65195, 52584, 55267, 57042, 62124, 67933, 67264, 70942, 63202, 54201, 56740, 57908, 61094, 66595, 64319, 64716, 68114, 65549, 71379, 66825, 65083, 76160, 70260, 66353]
11356F6353K920P44R598p475q050K012M881Q184j490j2373n701M079K245l586
11342F2341m425n651M626O618j273K244l007m510R524l078k112m022J4507L640
11328G5422n506j2270n171j70O996q198m787L352Q778N886p293j059j330l066
11314E1584M662M328N447n685n788Q414K345m664J262L303N4j784j2556j3383
11300C7539o847J1369M665N126m667r823L722K907l562n268K080l577j3783m58
11286A9423Q640M560J5137P19k082Q619R552J369j818j733K05l248j2326qL43
11271D7352m814J6498J2714K374j5343n607j105l23o301O617K423n077N056o58
11257E3806q26n377n665l520N777L029o818l84m741m416n387K827K572J44m32
$$ y = [66353, 69273, 70017, 79615, 72140, 64090, 66102, 70983, 79167, 77677, 65304, 59603, 63682, 65927, 62341, 57916, 52265, 56891, 63509, 62236, 64480, 61473, 56963, 66487, 63409, 61297, 57275, 71782, 75422, 69916, 57646, 52475, 52305, 59301, 51103, 46316, 49668, 58446, 64332, 57039, 55980, 54650, 51584, 56246, 60574, 66021, 60336, 54548, 62962, 65307, 60643, 61905, 65208, 65262, 63478, 50922, 37539, 30692, 42061, 46726, 51852, 47185, 37362, 41084, 43991, 40429, 35161, 37241, 33664, 19881, 19423, 28063, 32623, 47760, 48479, 46397, 55016, 64568, 65937, 64119, 62386, 62591, 59343, 47017, 47009, 47352, 42538, 59036, 71750, 74124, 58781, 53174, 52069, 51746, 45445, 52062, 54485, 49408, 54464, 53806, 52980, 47603, 41938, 38418, 44195, 47224, 40406, 40022, 35281, 30865, 25478, 28305, 30877, 31021, 30589]
11242C0589j3572l094M527N697J185P033R296q113j3347R475J2492L491l617p063
11228C4979j499j918n254M021R842n67j2307m398l609k287k882O827R406k428
11214B7926P192R953k034n296j3335n210J688p017o3p84j62N826p660l591n470
11199A963J0145j724q238L401J079M166J039l053J4778o808n257R711J2336k919
11185C0619n330J042o345n925p757P04k228L516J1043R163o298j195N539j935
11171B4613q653L648K921J889j235K202r227J770N850K664j188Q881K398j0895
11157B5638m631o881j1700j139Q376K014j0889Q33N747M811k828N45M185m937
11143I144m489N196O793k706l915K007P18m730n391n694o330L050N3q41N769N218
$$ y = [30589, 17017, 13923, 18450, 24147, 25332, 32365, 41661, 33548, 20201, 29676, 42168, 45659, 42042, 34979, 33480, 31562, 26308, 30329, 40171, 39604, 27297, 22899, 19290, 17003, 14121, 20948, 30354, 27926, 35118, 45071, 43037, 37741, 24406, 19196, 20884, 13867, 13804, 13020, 12858, 18684, 11024, 7433, 1963, 12108, 10384, 2146, 5547, 6626, 10792, 11831, 8778, 23556, 16748, 11491, 21202, 33538, 30619, 25289, 26331, 19986, 14061, 6304, 7008, 4780, 8296, 19339, 28502, 22204, 21009, 26548, 24613, 15960, 19608, 22529, 24418, 23183, 25385, 16158, 17928, 23778, 26442, 25254, 34135, 36533, 25638, 21007, 14126, 2426, 1287, 9663, 11677, 788, 1621, 7368, 12179, 9351, 9896, 14081, 9144, 4655, 9851, 16644, 13938, 10023, 12030, 12748, 8018, 2627, -3067, -9397, -6347, -6294, -7135, -1366, 3852]
11127C852J057L543n25j57M639J89M797j114r544p94N732K288j0650j6457o104
11112a9248J0013J8558m089n545j139m885P006K238q66j086q748l519O435J296
11098c579j528M032K936K122J135R081p869n924k549n337J892O263P033l038M12
11083E082m811p652j172Q72o027J0752M467L071K093M20o499k993N915k232m654
11068c368j0229J194J1465N330m641j0333m386k541M083L205K665O721l775K569
11054b041n87q56j1242K160J2356Q208k19k783j856K272k339p525j764Q339J883
11039D006M190k146r671q71m61m612J98O333J2179J0706n761r439k995L167k062
11024B761K774k455q903l496J498n911p438j784J5335N997R895N358j1313r431
$$ y = [3852, 4909, 8452, 7927, 7770, 12409, 12598, 17395, 16281, 6737, 5943, 11675, 13963, 3313, -13144, -19248, -9235, 9323, 5234, -311, -1450, -6335, 671, 2909, 2043, 957, -7791, -11310, -4875, -3579, -5107, -1075, 1861, 3983, 5118, 14199, 6330, 406, -2143, -7480, -5588, 675, 7708, 4670, 5082, 271, -7381, -8553, -7681, -13708, -2956, 1511, 4582, 6675, 7095, 596, -2397, 3518, 1286, -3368, -13597, -12403, -938, 4392, -249, -10582, -14968, -17509, -13426, -10221, -7556, -835, -4610, -2041, -2628, -3484, -14726, -12566, -210, 7998, 7779, 4996, 3140, 5412, 3073, -4452, -6216, 2123, 4006, 8196, 6050, -3621, -4492, -4953, -9565, -9367, -3034, 9145, 19851, 14090, 4651, 1656, 4823, 2761, 5535, 3080, -5823, -9319, -7821, -13732, -21170, -22954, -7619, -1622, 8273, 13631, 2318, -7113]
11010g113J859N756q816n23P671n319j5149n122p026j459M888J057L228J4511
10996a1557J1351L301o478q457J27O290q38j106J274n9q09l87j0380l904J2079
10981i553O839m362r361p406m548M01J486L005Q738K816J871L52R169j194j876
10966c623j0718j4622k5K236K106j5575j3630Q19M871N168N629N556P084J0268
10952a4456l858k640O269j136p735r81J2169q383m160O485K062r439q133Q011
10938b5925N484J4941m971p874l145m718k005m327j0382O120Q452L701N828P115
10924a1706k310j0375n38n47M3N466K556m228P185P42j097k516L113n114j486
10909b0812L13P616J729j249M793J256L996L901j8239o456n157K454N104Q634
$$ y = [-7113, -5254, 502, -8314, -8837, -1166, -6485, -21634, -26756, -33782, -35241, -30353, -29296, -26068, -11557, -206, 3095, -3383, -11840, -11713, -5423, -6261, -7367, -6093, -6152, -6961, -7348, -17728, -21632, -9553, -2714, -7076, -16437, -23843, -28391, -27990, -26504, -23499, -14761, -11945, -10074, -9722, -553, -1747, -3623, -14341, -28963, -28988, -26752, -24646, -40221, -53851, -53032, -48161, -42993, -37364, -31808, -24724, -14456, -18314, -20954, -14685, -15821, -23556, -24537, -12368, -20751, -24911, -18426, -16364, -25803, -33936, -25925, -20441, -5500, -10471, -18345, -21490, -26208, -28213, -32540, -42922, -36802, -28350, -24649, -18821, -11706, -14016, -24391, -24929, -25476, -25433, -19967, -17411, -21639, -14454, -13712, -14809, -17325, -14212, -19326, -20812, -20499, -12883, -11154, -12403, -7610, -6354, -2358, 1543, -16696, -23152, -28309, -25855, -20751, -12117]
10895a2117O72n930r509r804k79N901Q172R277P311k225j398K97n902N056O290
10880d188j7647n778o015K695p453l686N965R267J235N284l150m855l953K664
10866b9615r25m311l586m278m75Q253N593K746M988P968l381K517O625j585l288
10851a2754n194j424o873p90n688L333Q128j952n684n550L700P709k34J648M713
10836a6912r5m357j495O593p342r331L708R871J407n722l251K957P751P52n985
10821b1451j2678O039O232J055q4m626K645o92l302M485N393J205q700r74O477
10806a8976m97m066O111L638p715r877k016K00o034p847m503R600N57P300K395
10791c1730o334M474r60o25k723K169j61j468o072q096K844L947n536M64k768
$$ y = [-12117, -11445, -17375, -26884, -36688, -36967, -31066, -22894, -13617, -6306, -8531, -9929, -9632, -15534, -10478, -4188, -21835, -27613, -33628, -30933, -38386, -42072, -36107, -26840, -25605, -20321, -23471, -28326, -32279, -29615, -30540, -34851, -38437, -42715, -43190, -34937, -29344, -26598, -21610, -13642, -17023, -14506, -7881, -9466, -12754, -17948, -19372, -26245, -27035, -32723, -29390, -21262, -23214, -28898, -34448, -30748, -23039, -23273, -21625, -16912, -17007, -21364, -22859, -16266, -23608, -32939, -29231, -19360, -17953, -23675, -26926, -23969, -16218, -15466, -21451, -34129, -28090, -21858, -20803, -20887, -25513, -22868, -23560, -26862, -22377, -16984, -15779, -24479, -25453, -18976, -19473, -23539, -17428, -13790, -21505, -31382, -33398, -33198, -39232, -47079, -51582, -41982, -41425, -34125, -31730, -38064, -33590, -34550, -35175, -37898, -35729, -35890, -37358, -43430, -51526, -48682, -44735, -50271, -49807, -52575]
10776e2575J7155L992n225k430r757P796K137K901M991q362o911K803j660j879
10762d7024M02R061P134j0229q824j421K803j647J0405J0345M072j751o120n321
10748c8115j962j299l407n19l978k81J032k408R166M581j704k072n041O20M532
10733d0855J34j0261N243Q996N441k818o649n536k887J840J2153L986j1429Rj799
10718d4432q626K001l32L593J1123J5693M105r871j0672m587N66q715k419o308
10704e8881O151P02j926n93J311R374K302o249l350M71Q038J328L803o417J083
10689d2853n129k136q80N318J251q90L643R013Q976l727q137m001r600l643O796
10674d5999J1705p394j428n675j203j074j0845K158R851L648j0923m650M178K552
$$ y = [-52575, -35420, -31428, -36653, -39083, -48840, -41044, -38907, -36006, -31015, -39377, -46288, -43485, -45145, -47024, -46622, -37561, -30427, -40656, -49480, -50901, -48098, -49745, -39340, -28995, -24923, -26674, -32794, -38115, -40077, -41376, -44783, -45302, -49280, -49561, -48529, -50937, -41771, -37190, -38894, -40966, -46007, -45387, -40855, -40721, -50982, -45739, -36743, -31302, -34120, -40769, -46305, -49192, -47352, -35199, -31213, -42642, -42633, -44432, -53058, -51057, -51389, -47796, -36673, -20980, -16875, -26746, -37418, -42005, -41439, -50154, -52573, -58881, -52730, -52028, -53954, -54547, -53236, -43862, -41560, -47809, -51159, -50688, -42650, -41322, -37519, -43936, -42853, -47982, -50118, -50998, -45680, -44429, -45319, -41676, -32663, -23687, -27414, -35551, -39552, -49152, -52795, -45999, -34294, -41688, -43116, -48791, -49994, -51068, -61913, -59755, -49904, -46256, -57179, -61829, -57651, -55099]
10660e5099p81j578J1136N136M546o603M19K395J014k552l567P00R099l54m531
10645d0620p11J411m344l822L868j244l155N751J774o368j0253q610l574K0267
10631d9630L357q847L390m640m155q293n925J818k83j336O834J2083R090R378
10617c7159L942L780j1813M763L905j3424q462j1722l567M840P70P191k47m769
10603f1972j5565l092K272J0916P459L788k352K986O333o79n823k206L82J424
10589e6129j1952j1986Q862P805K979o939n122O210O864k54L933O099j273L828
10575d7075P939j878m132r165j793J2894O038M390J369q36J305L388j761k273
10561c1590O78l039N250R22k648k321n514J217m774N75L927n921r75O825j1146
$$ y = [-55099, -55880, -57458, -46322, -41186, -36640, -43243, -42824, -40429, -39415, -41967, -45534, -44834, -35735, -36089, -40620, -41331, -39920, -44264, -48086, -44218, -45462, -48617, -42866, -41092, -47460, -57713, -66323, -69897, -49630, -46273, -55120, -51730, -56370, -60525, -68818, -74743, -72925, -73208, -74544, -67710, -55627, -46537, -37159, -33217, -29437, -41250, -36487, -32582, -46006, -54468, -66190, -69757, -64917, -64147, -56956, -57203, -61972, -77537, -80629, -78357, -67441, -59982, -56194, -58546, -55560, -49227, -49906, -55729, -57935, -57553, -56129, -68081, -80067, -71205, -63400, -60421, -67360, -72482, -66272, -59408, -59662, -55729, -49630, -50903, -47075, -39136, -41014, -45146, -54311, -56104, -43210, -37172, -32782, -31413, -32249, -30944, -27556, -29317, -31590, -30912, -33951, -28701, -27779, -30427, -32748, -38262, -37045, -41819, -41244, -37317, -43238, -44213, -37388, -48534]
10546d8534j701J2696n086r508j0613j1589L703R339k372R022Q471n559J86M62
10532e1083j213o971j570N982Q53J0700L120k916M200M751l217J739o17P718k73
10517b8797J616J342m069k001k365j1638m711L13N820M071L446K508k703O023
10503c1145j470m020O82n166k298j0249k956N921M20M131P673k864q421J140Q678
10488c9944J0432R94M522O030k845l028r687J521K057r395m330j05Q085M60k271
10473c7504o507n931k433J139k838n272k237k750M5l929m407l559j202R614L525
10458f4246M789J1692k614M86l726j253Q882O187j6757k905K701%l247j566n534
10443f7111o98J5765J7856J2299K008m933O713M732O247J2766J278l366n826o581
$$ y = [-48534, -50235, -37539, -42625, -52133, -62746, -74335, -70632, -61293, -63665, -54643, -46172, -51731, -51545, -51083, -52296, -59267, -60837, -54855, -54002, -43302, -40182, -43098, -38898, -34147, -37364, -35625, -36242, -28524, -28797, -27181, -25839, -29908, -31909, -34274, -45912, -50623, -50310, -44490, -40419, -36973, -34465, -37168, -31145, -32615, -36635, -35953, -41119, -43417, -53666, -56622, -50701, -50281, -46150, -38477, -41341, -49762, -48622, -39944, -29512, -28518, -23996, -17966, -20811, -23839, -33526, -32005, -29948, -39343, -43673, -43778, -35693, -35233, -37504, -44011, -49942, -52375, -51236, -54074, -59346, -61583, -64333, -64288, -68217, -72624, -76183, -77385, -67771, -64246, -59457, -47765, -50379, -49893, -53619, -54872, -45990, -39803, -56560, -59465, -56764, -56764, -60011, -61577, -67111, -67809, -52044, -34188, -21889, -19881, -24814, -18101, -13369, -7122, 5644, 6922, 3556, -2270, -8851]
10429h851O784M70j5633r489N588k724l032j2804J1716r748j4070L252n82K012
10415d7111R127M146N470L487j3246j1451j657J633P997k301j49J782j0135r780
10401f2188j310P289j212p020L122Q682j622k988N342J152J110P686J7871J5407
10387h679J2661J462p691l020j481o112R926J0599n261j0534q322j052j1339J369
10373b7474Q395O082l297L631L949l02k862n930O686n331l826N598k795j4884
10359c2360p86O379O822J2732m895j0003j0045l861L753J0139M364q755j2862
10346c9378p000M107k743k427Q777N917O593n35k616j372l121K534K701l790P688
10331b4665P683N010m220n598L036O056k520L522N054K626p366k773J482O039
$$ y = [-8851, -2067, -1597, -17230, -26719, -21131, -23855, -26887, -39691, -27975, -37723, -51793, -48541, -49123, -47111, -37984, -33838, -28368, -24881, -38127, -49578, -51235, -49602, -41605, -43906, -44055, -42273, -52408, -62188, -63498, -56209, -57421, -64441, -61319, -52637, -54259, -57247, -51905, -50753, -49643, -41957, -24086, -8679, 3982, 5444, -2247, -5267, -6748, -12860, -2934, 7665, 2404, -8130, -16452, -17504, -28843, -27474, -19079, -12997, -16294, -12663, -8714, -9016, -11878, -17808, -11122, -16453, -20279, -14681, -17476, -32360, -33146, -26767, -19945, -7213, -12108, -22111, -32156, -36017, -32264, -22125, -17761, -26516, -39378, -46378, -42271, -45014, -47441, -38664, -32747, -26154, -26689, -29305, -30677, -33798, -31264, -28563, -32353, -24665, -16982, -11972, -16192, -21790, -18754, -12698, -15218, -11696, -6642, -4016, -11382, -14155, -12673, -6634]
10317f634P56R906Q846Q040J0462J0993n544n510L668m169j7459o158J576K173
10303A0946J838m515k438j4788p377M775K814L58j1450p346L536k000k556O654
10289b1549m929j1112j775K902N472N896r545n153n81n83O209k577M212J3742
10275a9371n33O773k414p24N243j52J6475J4881P546l019m098j0066m993R622
10261A5170M308Q196P160p048J309K072q962k718R513N501M95Q950R237P07O701
10246F0591L035k127R448l331o125p464p240j4505j4699p834q632l920q35m474
10232h112O923r56j3600j644N195O21j850J595M26n873j2664R241L2651J5273
10218B7226R68N048L099L262r084p924k83N854l745j510r67j104n073j7964m831
$$ y = [-6634, -5878, 4028, 12874, 20914, 31376, 42369, 36825, 31315, 34983, 30814, 13355, 7197, 8773, 10946, 12784, 8269, 5831, -8957, -16334, -11559, -8745, -8387, -19837, -27183, -23647, -25647, -28203, -21549, -26478, -37590, -39365, -36463, -30991, -25095, -34640, -39793, -40374, -40957, -34748, -37325, -33113, -19371, -19904, -13131, -15545, -16269, -11026, -11178, 5297, 20178, 27724, 24705, 20607, 10541, 5548, 15170, 19478, 27674, 34834, 27786, 29095, 31167, 22205, 19487, 29000, 34501, 34996, 43946, 53183, 53890, 60591, 63626, 61499, 70947, 67616, 61491, 54027, 46787, 32282, 17583, 9749, 1117, -2803, -3638, -8112, -1189, -2145, -15745, -17389, -12194, -11573, -13423, -11828, -11402, -17275, -29939, -20698, 11953, 27226, 28194, 33242, 36341, 39603, 30519, 22595, 22312, 28166, 24421, 22911, 21944, 20840, 15767, -2197, -7028]
10203g028M569M230l467O84R935p387n004M19J1103Q690j871J870k317m783n643
10188D000q140O84J4582Q139k328K470j598o765l326m466p876l945J193J2688
10174E312K985P50P539p954m145k180J1246J6935J1917Q103J6666K1368K8541
10161A17083J8445M248M940j2905k0918n515j0601j2856j5223j1910j5863j3191
10149B5734j5350j2483j407m82q597M419K580N065N025k047m007j751N01r765
10135a2565j185l674j2471l49K444R761K611P594p796j1634M711K1345j711j1675
10121a4594l055m863n616m541p79J0292L655Q056J1961J2168N859M578R873K658
10107C5652l9R47Q266K0249J4256R630P945L396J8749K1148L1318L9501M0121
$$ y = [-7028, -2459, 1771, -1696, -1012, 8923, 1536, -3468, -3049, 8054, 16744, 14873, 16743, 14426, 9643, 4000, -4140, -3456, 11126, 19265, 16937, 19407, 17809, 11044, 7718, 3252, -4624, -8569, -7376, 5312, 8297, 9047, 16586, 8632, 4487, 2307, 13553, 30488, 42405, 50508, 67174, 88542, 117083, 135528, 139776, 144716, 131811, 110893, 105378, 94777, 81921, 66698, 54788, 38925, 25734, 10384, -2099, -3506, -3988, -12585, -8166, -5586, -521, 4504, 2457, -1550, -3301, -2800, -12565, -13750, -17424, -29895, -30244, -27800, -18039, -15428, -7834, -15630, -27264, -22553, -1208, -2919, -14594, -17649, -22512, -28128, -32669, -33448, -23156, -19501, -11445, 516, 12684, 18543, 23121, 32994, 35652, 35613, 36560, 44826, 65075, 79331, 88961, 96906, 100302, 119051, 140199, 171517, 211018, 251139]
10094B51139N1172R0944J09293J35637J76318K26015L01815L97169M32597L45835
10084B517934J41487p3529j83559j52039n1885R0485K27111K64152J42419p2317
10074B850259k72750l67742l49379k88699k09710j38881j07223q8171n8156m3999
10064I25549m8303m3233m0362l6996k3119k2861k0975k0282j8727k0911j4969
10053F14811j9506k0710l557J225j5102r089j5017k7447j7032m021K325o54n650
10040D80576P937J5252P077j2069j6969k8394m0725l7455m0207l5702k8332k2141
10028B48848k0031k2294j3944k0082j7772j0769n703R503L893k455K345P597L98
10015A59534L467J0854J9780J8711R653l432p471j3703k395k847r106j1638j5815
$$ y = [251139, 302311, 393255, 502548, 638185, 814503, 1040518, 1342333, 1739502, 2172099, 2517934, 2659421, 2585892, 2402333, 2250294, 2198409, 2288894, 2516005, 2780157, 2922576, 2850259, 2577509, 2209767, 1860388, 1571689, 1361979, 1223098, 1115875, 1027704, 969548, 925549, 877246, 834013, 793651, 756655, 733536, 710675, 689700, 669418, 650691, 629780, 614811, 595305, 574595, 571038, 572263, 557161, 548072, 533055, 505608, 488576, 484555, 486880, 486226, 480576, 488513, 503765, 510842, 498773, 481804, 453410, 412685, 375230, 335023, 299321, 270989, 248848, 228817, 206523, 192579, 172497, 154725, 143956, 138253, 147756, 151649, 149194, 151539, 159136, 159534, 163001, 173855, 193635, 212346, 221999, 218567, 211096, 197393, 194998, 192151, 183045, 171407, 155592]
10002A55592o384j1370r275p302j628J453j2690j5328j310P397K815k308n277
9989I4385p661j6040j0373r88J083J4639J8507O752j835r606j1517n830j196O194
9975G6514K400Q298R740R793J9396J8222J7247L0957K5653L6767O7040R4513J27499
9962E44039J70278K40222L09381L14932J56784j19606l06725k68953k02310j25061
9952G12981p9112m4546k3440j4278L986J6925K3561M3017N3490P0191N1471O9420
9940H83666J02760J18725R4281N1295P1918Q8113P3969Q482j7966M5772Q2617
9929A603632N9313J8301N739l3093j01020j72012j74219j51831j29299j12400
9919H13111q8251o3429n8065l5521l2186k9938k1038q905j2051j1298k3328q328
$$ y = [155592, 149208, 137838, 128563, 121261, 119633, 121086, 108396, 93068, 91758, 99155, 101970, 99662, 94385, 86724, 70684, 60311, 59323, 60406, 75045, 93552, 100304, 98469, 88863, 77346, 71516, 70320, 76514, 78914, 87212, 96952, 106745, 126141, 144363, 161610, 192567, 218220, 254987, 322027, 416540, 544039, 714317, 954539, 1263920, 1578852, 1735636, 1616030, 1309305, 1040352, 838042, 712981, 633869, 589323, 565883, 551605, 555591, 572516, 596077, 639094, 692584, 762775, 814246, 883666, 986426, 1105151, 1199432, 1250727, 1322645, 1410758, 1484727, 1493209, 1475243, 1521015, 1603632, 1662945, 1681246, 1686985, 1653892, 1552872, 1380860, 1206641, 1054810, 925511, 813111, 724860, 661431, 603366, 567845, 535659, 505721, 484683, 475778, 463727, 452429, 429101, 420773]
9907D20773J216q970j4956o830m69J075r303j7109k0953k3844j9532j6334j9510
9894B65254k0749p285p37R669J0343J1177L598j2235k5868L73J966L534O902m699
9880B41243j5823j9691Q850J7480J825Q713J8702J1631M671J5200R745J9330O426
9867C28302J0825R585l596J383K0445J7843p225j6591j7566j1145Q072N074Q420
9854C53826K5379K9271J3452k147j081j162J7761K5061M2327L4610M2735M5678
9842F25710K8869L2380L2304M6545O7055P8133P3434P5971O3213M7276L5337L9323
9830A245550N7162O7352Q7282J12511R6956J05847R5707Q8610O9123N0946P4892
9819B151938J33260J94449K21025J84961J44360J11378J06687J48550J93488J74796
$$ y = [420773, 421989, 413019, 398063, 391233, 390764, 391839, 382536, 365427, 344474, 320630, 301098, 284764, 265254, 244505, 237220, 236483, 246152, 256495, 267672, 271270, 259035, 233167, 233540, 235506, 239040, 245942, 241243, 225420, 205729, 214579, 232059, 233884, 242597, 261299, 272930, 277601, 292801, 302546, 321876, 328302, 339127, 348712, 345116, 346499, 366944, 384787, 377562, 360971, 343405, 332260, 340332, 345406, 353826, 379205, 408476, 421928, 419781, 418700, 417538, 435299, 460360, 502687, 537297, 580032, 625710, 654579, 686959, 719263, 765808, 832863, 910996, 984430, 1060401, 1123614, 1170890, 1206227, 1245550, 1302712, 1370064, 1457346, 1569857, 1666813, 1772660, 1868367, 1956977, 2026100, 2077046, 2151938, 2285198, 2479647, 2700672, 2885633, 3029993, 3141371, 3248058, 3396608, 3590096, 3764892]
9809C764892J29583O5996j2250o3890j34802k11523k18620k03624j87943j39460
9799B788359j17131j08846o8285o2569o4624m6921j9895J3650K5711K8529M8765
9788B416743N0302N3655P3904Q6360J09643J43188J59707J52234J57908J66179
9778C569823J96404K29326K55361K82811L18676L60571M31891N14998O38442P61509
9768G559812R18147J125604J429255J815724K301475K910961L644178M267226
9760B5972382M195267K794637L61361j856393l086995l366697l039040k469301
9752A9505221j868365j382516j025533p90642o30372n48306m79990m08987l38472
9743A2032038k79482k22975j84450j39275r8946p1534o7727n2694m9079o2698
$$ y = [3764892, 3894475, 3960471, 3948221, 3884331, 3749529, 3538006, 3319386, 3115762, 2927819, 2788359, 2671228, 2562382, 2494097, 2431528, 2366904, 2319983, 2300088, 2313738, 2339449, 2367978, 2416743, 2467045, 2520700, 2594604, 2680964, 2790607, 2933795, 3093502, 3245736, 3403644, 3569823, 3766227, 3995553, 4250914, 4533725, 4852401, 5212972, 5644863, 6159861, 6798303, 7559812, 8477959, 9603563, 11032818, 12848542, 15150017, 18060978, 21705156, 25972382, 30167649, 32962286, 33323647, 31467254, 28380259, 25013562, 21974522, 19505221, 17636856, 16254340, 15228807, 14438165, 13807793, 13259487, 12779497, 12370510, 12032038, 11752556, 11529581, 11345131, 11205856, 11106910, 11035376, 10967649, 10914955, 10865876, 10803178]
9733A0803178o2274k6251J9721O8516J02092J25029J30699J03546N5587L3956
9723A1353799N3528R2952J38021J58959J80676K15779K47193K78910L47290M19518
9713A3486625M82054N43972N89213P03706Q77795J119022J356377J452128J441208
9704B2052100J426335J516352J759472K053241K379290K838804L433895M196346
9696D1655835N164702O507669Q432647J0961703J4322018J8826569K4602222L2024552
9688A62497917M1817586N4640591O9383312P7291373O2741145K6024604j3407223
9681D80989305l6317363l3252676j4467049J0989890L6259459M8583583L4196985
9674E26982134k536599m1402843o4390143o4713818n4342978m0869113k9315545
$$ y = [10803178, 10740904, 10714653, 10734374, 10802890, 10904982, 11030011, 11160710, 11264256, 11319843, 11353799, 11407327, 11500279, 11638300, 11797259, 11977935, 12193714, 12440907, 12719817, 13067107, 13486625, 13968679, 14512651, 15101864, 15805570, 16683365, 17802387, 19158764, 20610892, 22052100, 23478435, 24994787, 26754259, 28807500, 31186790, 34025594, 37459489, 41655835, 46820537, 53328206, 61760853, 72722556, 87044574, 105871143, 130473365, 162497917, 204315503, 258956094, 328339406, 405630779, 468371924, 494396528, 480989305, 444671942, 411419266, 396952217, 407942107, 444201566, 492785149, 526982134, 524445535, 483042692, 418652549, 353938731, 299595753, 258726640, 229411095]
9667B29411095k1628168j6747980j3540144j1138603r136152p466638o180705
9660A43572705n279207m675581m250389l904631l519268l003186k320483j672626
9652A14947334j370837j495783j864058k167566k247487k121419j919498j800080
9644I9960606j831252k038949k406841k737591k934882k980467k959218k993255
9636G9078151l158405l380228l529205l546925l447736l258699l022842k814530
9628E2919581k654909k533961k419666k297010k174597k065787j949842j824900
9620C4998909j710607j612160j522937j414315j329004j275170j215793j164004
9612B3754919j131518j070943r99258r04082q11843p55512p12213o83600o71338
$$ y = [229411095, 207782927, 191034947, 177494803, 166356200, 157220048, 149753410, 143572705, 138293498, 133617917, 129367528, 125462897, 121943629, 118940443, 116619960, 114947334, 113576497, 112080714, 110216656, 108049090, 105801603, 103680184, 101760686, 99960606, 98129354, 96090405, 93683564, 90945973, 88011091, 85030624, 82071406, 79078151, 75919746, 72539518, 69010313, 65463388, 62015652, 58756953, 55734111, 52919581, 50264672, 47730711, 45311045, 43014035, 40839438, 38773651, 36823809, 34998909, 33288302, 31676142, 30153205, 28738890, 27409886, 26134716, 24918923, 23754919, 22623401, 21552458, 20553200, 19649118, 18837275, 18081763, 17369550, 16685950, 16014612]
9603A6014612o77583o69911o43401o07407n59523n23264m97312m70100m34464
9594A0931647m14515m20227m06380l78955l75725l75435l60161l37202l30432
9585G532615k98732k80431k72778k66963k49563k29973k09601j91652j79494j65039
9575E188389j44785j23264j26301j26989j00906r7625q4969o3588n6734k5238
9565D237990k3315l5192p1451r2007q0461m4131P003L9202R157m2065r2350j07784
9553C704596p4400m9691l9554J5741O8606M1901j5751r5550j40365j42204j17233
9542C156096n6413j0434k2076o9287j16909j39513j24909r1509m8309k8134k8604
9531B419999m2096k8248k0896j7991k1576j9275p354J3594M4222N2199P8781Q7466
$$ y = [16014612, 15337029, 14667118, 14023717, 13416310, 12856787, 12333523, 11836211, 11366111, 10931647, 10517132, 10096905, 9690525, 9311570, 8935845, 8560410, 8200249, 7863047, 7532615, 7233883, 6953452, 6680674, 6413711, 6164148, 5934175, 5724574, 5532922, 5353428, 5188389, 5043604, 4920340, 4794039, 4667050, 4566144, 4468519, 4383550, 4319962, 4263228, 4237990, 4214675, 4179483, 4108032, 4016025, 3935564, 3891433, 3898436, 3937638, 3946795, 3904730, 3812380, 3704596, 3630196, 3580505, 3540951, 3556692, 3625298, 3667199, 3651448, 3555898, 3415533, 3273329, 3156096, 3099683, 3089249, 3067173, 2997886, 2880977, 2741464, 2616555, 2525046, 2476737, 2448603, 2419999, 2377903, 2349655, 2328759, 2310768, 2289192, 2269917, 2262563, 2276157, 2320379, 2372578, 2451359, 2538825]
9519B538825P6049P2604M5204M0310M6683O8214Q7233J03110Q5162O1044N5692
9508C280130L4949J6999K1954K2367J9850O869m785k2809k4379l3558l5398m0490
9496C241699k9580k1299j1254l1675l3683l0927k8538q764j153j407nr522p016
9483C026876K507L70k2504l1013n0837n9038n1029n0925o0319n5306m1589m7835
9471B559358n6310n1128m8246n4055n0461m2128l9200m2980m8730n1621m8835
9460B025664m8220n1794n1717m4755k9483l4813j7403r232k5991l9980l4737l9719
9448A597820l1414k2212j4626j5846l544m996o230J437n049j4827m812Q546L5390
9435A519637L0562n55j9638r496o947l0481n5123j8172J7354j1481m6006m3464
$$ y = [2538825, 2614874, 2687478, 2732682, 2772992, 2819675, 2887889, 2975122, 3078232, 3163394, 3224438, 3280130, 3315079, 3332078, 3354032, 3376399, 3396249, 3403118, 3398333, 3375524, 3351145, 3317587, 3282189, 3241699, 3212119, 3190820, 3179566, 3147891, 3114208, 3083281, 3054743, 3045979, 3044826, 3043419, 3043414, 3033892, 3026876, 3029383, 3029753, 3007249, 2976236, 2925399, 2866361, 2815332, 2764407, 2704088, 2648782, 2607193, 2559358, 2503048, 2451920, 2403674, 2349619, 2299158, 2257030, 2217830, 2174850, 2126120, 2074499, 2025664, 1977444, 1925650, 1873933, 1829178, 1799695, 1764882, 1747479, 1738247, 1712256, 1672276, 1637539, 1597820, 1566406, 1544194, 1529568, 1513722, 1510178, 1505182, 1498952, 1500389, 1495340, 1480513, 1475701, 1484247, 1519637, 1550199, 1549644, 1530006, 1520510, 1513563, 1483082, 1427959, 1409787, 1427141, 1415660, 1369654, 1326190]
9423A326190j6858l3212o6355o7454m6861m3752n0596l4002k4278k5276k4866
9412H92680j6619k1211k0306k2333k0931j5257o837Q68j732r922p25N542J061
9399G64278j1040q389k3764p067Q937J6611J8641N565k215N305K928J4607K0051
9386H04448K6001L5128K0691K2867L1890K2926J4986K2684L3784J9239J5759J7265
9374A087668K7260K4427J8693K5370O173O653P931N943j10j2853k580q777j5348
9361A170450p895q853O122j977M683K819M703J3241Q422J3179P772n896k0168
9348A186602k2239k0170j3616q707j6929j3429k0019k9880j9819n740k037j2203
9336A001814j3941j3262m072j7963k6678j8452m316j3653k2538j7976k1581m531
$$ y = [1326190, 1309332, 1276120, 1209765, 1142311, 1095450, 1051698, 1001102, 967100, 942822, 917546, 892680, 876061, 854850, 834544, 812211, 791280, 776023, 769186, 770054, 768322, 758400, 757675, 763217, 764278, 753238, 744849, 721085, 714018, 722955, 739566, 758207, 763772, 761557, 766862, 769790, 784397, 804448, 830449, 865577, 886268, 909135, 941025, 963951, 978937, 1001621, 1035405, 1054644, 1070403, 1087668, 1114928, 1139355, 1158048, 1183418, 1189591, 1196244, 1204175, 1210118, 1210008, 1197155, 1194575, 1185798, 1170450, 1162555, 1153702, 1159824, 1157847, 1162530, 1165349, 1170052, 1183293, 1191715, 1204894, 1212666, 1206770, 1186602, 1164363, 1144193, 1130577, 1121870, 1104941, 1091512, 1071493, 1041613, 1021794, 1016054, 1014017, 1001814, 987873, 974611, 970539, 952576, 925898, 907446, 903130, 889477, 866939, 848963, 827382, 822851]
9324H22851j300L126q445j4970j2455j6184l264o771j4342l736r40K518L111j628
9310G47571k734N44J775n648n197j120j221l681j0346k152K823K484O881l057
9296G26922j1978j1743o601n151M46K1216J9464K7227L3946M1529N4844P1359
9284I61480R7392J20748J67118K18875K88148L86015M26956L49310J57521n3229
9274C120334j83310j66250m6615R6953K23069K69929J84455l2858k59737l77849
9264B828121l66748k99890k41434j72177j26236j00643p9135o9699n3909l7612
9254A280638j6767j8701k6980k5085r017j0836r084j0169p039J1800L85j2507
9242A146638o700l641m865j2764j6773j5347j7264k2176k5364j0765M638q463
$$ y = [822851, 821551, 824677, 816232, 801262, 788807, 772623, 769359, 762588, 748246, 744510, 743570, 746088, 749199, 747571, 744837, 745381, 747156, 741508, 736311, 735191, 733970, 730289, 719943, 717791, 720614, 723098, 729979, 726922, 714944, 703201, 696600, 691449, 691895, 713111, 732575, 759802, 793748, 835277, 890121, 961480, 1058872, 1179620, 1346738, 1565613, 1853761, 2239776, 2666732, 3016042, 3173563, 3120334, 2937024, 2770774, 2724159, 2821112, 3044181, 3314110, 3498565, 3465707, 3205970, 2828121, 2461373, 2161483, 1920049, 1747872, 1621636, 1520993, 1441858, 1372159, 1318250, 1280638, 1263871, 1245170, 1218190, 1193105, 1184088, 1173252, 1164168, 1153999, 1146960, 1158760, 1159145, 1146638, 1139938, 1136297, 1131432, 1118668, 1101895, 1086548, 1069284, 1047108, 1021744, 1010979, 1015617, 1007154]
9230A007154k031p452k3961k5768k4517j7951j5659k1849j6244m353m461k211
9218H40697N085n451p91L922J0258J4220J7763R351P621m765j2188j8450l0746
9205H36526l1485k0494j8155j3042n811j3550j4138j0068L853q342m690m727O931
9192G02808J0689K3225K6942L1806M1612N4076O2451J10755J60007K06024K74666
9181A705061K92257J67263l7918k14873k69768k27844j69041j12963p8009o8299
9171I85866n3831m2407k1546p052j7304k2036j3870j4360M874J2215M430n003
9159H09976j0755k2821k6495j7849k0461j7819K195j0037J712J2969J1000Q83
9147G12498q281n877O884J0182J2312J9051J2697R608K395P406N71j0170l239
$$ y = [1007154, 1005123, 997671, 973710, 947942, 923425, 905474, 889815, 867966, 851722, 847369, 842908, 840697, 845782, 840331, 839540, 843462, 853720, 867940, 885703, 895054, 902675, 897910, 885722, 867272, 836526, 805041, 784547, 766392, 753350, 747539, 733989, 719851, 709783, 713636, 705294, 700604, 695877, 702808, 713497, 736722, 763664, 795470, 837082, 891158, 953609, 1064364, 1224371, 1430395, 1705061, 1997318, 2164581, 2126663, 1911790, 1642022, 1414178, 1245137, 1132174, 1054165, 985866, 932035, 889628, 868082, 861030, 843726, 821690, 807820, 793460, 798334, 810549, 814979, 809976, 799221, 776400, 749905, 732056, 711595, 693776, 695971, 685934, 687646, 700615, 711615, 712498, 704217, 698340, 705224, 715406, 727718, 746769, 759466, 769074, 771469, 778875, 779446, 769276, 766037]
9134G66037Q679R232Q454K7317K4417J7694L8637L8038M5623N5680P1397R8435
9122A209640J13185J42729J76806K13994K41667K48507K49675J93440R9662m382
9112B884923q5458j12570j11247r7359o4133k2496L4040O2387J12708J71766K27062
9101B999623L07115L76157M50533N21089N48176M82449L45102J36548r9655k97904
9091E769233m25850m63413m53893m15710l36497k68104k27425j81026j46400j17859
9081B733056q9639q1246n9451p7610q4319o7011n2979n4216o0919n4352n4899
9070A996415n8017o4331n4906m7279m0872k0076l1662k7921k8818k2372k5990
9059A574171l3292l1218k5680k4461k9906l4632k5870j9056k9004l3588l6339
$$ y = [766037, 774716, 783948, 792402, 819719, 844136, 861830, 900467, 938505, 984128, 1039808, 1111205, 1209640, 1322825, 1465554, 1642360, 1856354, 2098021, 2346528, 2596203, 2789643, 2889305, 2884923, 2799465, 2686895, 2575648, 2478289, 2414156, 2391660, 2425700, 2488087, 2600795, 2772561, 2999623, 3306738, 3682895, 4133428, 4654517, 5202693, 5685142, 6030244, 6166792, 6067137, 5769233, 5343383, 4879970, 4426077, 4010367, 3673870, 3405766, 3178341, 2997315, 2850915, 2733056, 2643417, 2562171, 2502720, 2425110, 2340791, 2273780, 2220801, 2166585, 2105666, 2051314, 1996415, 1938398, 1874067, 1819161, 1771882, 1731010, 1710934, 1679272, 1651351, 1622533, 1600161, 1574171, 1540879, 1509661, 1483981, 1459520, 1429614, 1394982, 1369112, 1350056, 1321052, 1287464, 1251125]
9048A251125l6611k3435k2759k1639j9561p573j0802k6283j4685q350j5424j5239
9036A028764j0329o594p826o869k04j0514o627J931J3369J3212P347J8144J6430
9023A050234l671j286l307J143n586j7622j2736j595j1567j3378k0454l1017j4510
9010I14648L627l663m035q073m980J3975J4118J3321P72K849J1312K040L410k954
8996I56367Q940J9706K3777J8179J7101J3759J4044J8659L0350M1774L1881K0003
8984A214540K7042K8601L6610M8588N1272N8729P3761Q7724R7544J02626J24865
8973A951902J31310J64865J98561K36728K78928L43789M05849M57677M98814N08190
8963E176613M41293L54754K97726K90336L30372M18766N89660Q16228J061244
$$ y = [1251125, 1214514, 1191079, 1168320, 1146681, 1127120, 1119547, 1108745, 1082462, 1067777, 1059427, 1044003, 1028764, 1018435, 1011841, 1004015, 997146, 996942, 986428, 979801, 981732, 995101, 1008313, 1015660, 1033804, 1050234, 1046563, 1045277, 1041970, 1043113, 1037527, 1019905, 1007169, 1005574, 994007, 980629, 960175, 929158, 914648, 918275, 914612, 910577, 902504, 897524, 911499, 925617, 938938, 939710, 942559, 953871, 955911, 959321, 956367, 965307, 985013, 1008790, 1026969, 1044070, 1057829, 1071873, 1090532, 1120882, 1162656, 1194537, 1214540, 1241582, 1270183, 1306793, 1355381, 1406653, 1465382, 1539143, 1626867, 1724411, 1827037, 1951902, 2083212, 2248077, 2446638, 2683366, 2962294, 3306083, 3711932, 4169609, 4668423, 5176613, 5617906, 5972660, 6270386, 6560722, 6891094, 7309860, 7899520, 8715748, 9776992]
8954I776992J323963J637303J939786K177684K258745K062181J506517O83467
8946B3366638k39301j016438j520551j731892j733460j592924j386389j179094
8938A2966589r81934q15927o79541n62345m71404m23979l76021l36828l19972
8929G998638k94522k67325k42694k06456j78493j54898j55412j58242j54899j48496
8919F037201j29934j13785j12351j02172r3981p2985p2314p8620o9163o4355n2272
8908E075269n9933o5880o8793p0089o7683o9992q3848j11387j44400j65759j65702
8897D001803j60014j52778j47683j40625j31156j18491j19774j08605r6107r0368
8887B736202r1579p2968n9406n7332n0821l9360l2751k2253j5326k1965k5798
$$ y = [9776992, 11100955, 12738258, 14678044, 16855728, 19114473, 21176654, 22683171, 23366638, 23127337, 22110899, 20590348, 18858456, 17124996, 15532072, 14145683, 12966589, 11984655, 11168728, 10489187, 9926842, 9455438, 9031459, 8655438, 8318610, 7998638, 7704116, 7436791, 7194097, 6987641, 6809148, 6654250, 6498838, 6340596, 6185697, 6037201, 5907267, 5793482, 5681131, 5578959, 5484978, 5411993, 5339679, 5261059, 5191896, 5127541, 5075269, 5015336, 4949456, 4880663, 4810574, 4742891, 4672899, 4589051, 4477664, 4333264, 4167505, 4001803, 3841789, 3689011, 3541328, 3400703, 3269547, 3151056, 3031282, 2922677, 2826570, 2736202, 2644623, 2571655, 2512249, 2454917, 2404096, 2364736, 2331985, 2309732, 2294406, 2272441, 2246643]
8876B246643k7122j4571q882j833m653k7757m9927o0676o6245o5831p3835p8429
8864A766882n9818n3307n3271m8727m5259l9094l8480l6555k7897k5380k0032
8853A319062k5437l2383k9725p769j9449k4108k3425r665J280l173j247R100J3154
8840A166215J1036l78O725J5091J383J050Q661J1538K2841N0630N4485N7651N9653
8827A466581M9606K8210J7345K829p545j9262l3031l7535l1369k3496j2764Q455
8815A408024J4054Q053J0772j834j4810l5454n0746m3285l9384n3207m0804k6615
8803A134764j8703j4984p499P461M447J1635K9698M5112M5549O3337Q4337Q6617
8791A471771P1363L2980j538k7929l7789m1052m7241l8753k9748l0530j5251j5480
$$ y = [2246643, 2219521, 2204950, 2196068, 2194235, 2189582, 2161825, 2111898, 2051222, 1984977, 1919146, 1845311, 1766882, 1707064, 1653757, 1600486, 1551759, 1506500, 1467406, 1428926, 1392371, 1364474, 1339094, 1319062, 1293625, 1261242, 1231517, 1223748, 1204299, 1180191, 1156766, 1147101, 1148381, 1145208, 1143961, 1153061, 1166215, 1177251, 1176873, 1183598, 1198689, 1200072, 1201122, 1209783, 1221321, 1244162, 1294792, 1349277, 1406928, 1466581, 1516187, 1544397, 1561742, 1564571, 1557026, 1537764, 1504733, 1467198, 1435829, 1412333, 1399569, 1408024, 1422078, 1430131, 1440903, 1439069, 1424259, 1388805, 1338059, 1294774, 1255390, 1202183, 1161379, 1134764, 1116061, 1101077, 1093578, 1101039, 1105486, 1117121, 1146819, 1191931, 1237480, 1300817, 1385154, 1471771, 1543134, 1576114, 1574576, 1546647, 1508858, 1467806, 1420565, 1381812, 1352064, 1321534, 1306283, 1290803]
8779A290803j2664K350L665L065q127j5980k9092l9592m2587m3298l1008k8047
8767A049488j0151j2272r858j4289j6746j0935p41N707Q778j684O643O113J359
8754A001412l90j2608j9879j4005p105j3612m811o111j8284m597P081J8480K2613
8741I48184K9336L4999L8122M1306N0761N5965M3082J2460j2280l6856m6009n2399
8729A106671m4246m1421m1391l9236k9647j8915j4143o222K199p42J6093P952
8717H96952J8834K7282K9494K1919K0889J0526q49r914o093p20r269j0987M04
8704I88468P631J1510J3078L846N720J8127J3064J0127J4408R001N753O011K1644
8691A128388K6393J5121K4383J7087J890q005k8138k4932k7009l6446l8974m1519
$$ y = [1290803, 1278139, 1280489, 1284154, 1287219, 1279092, 1263112, 1234020, 1194428, 1151841, 1108543, 1077535, 1049488, 1039337, 1027065, 1017207, 1002918, 986172, 975237, 974496, 980203, 988981, 987297, 993940, 1000053, 1001412, 1001022, 988414, 968535, 954530, 947425, 933813, 929002, 922891, 904607, 900010, 907091, 925571, 948184, 977520, 1012519, 1050641, 1091947, 1142708, 1198673, 1241755, 1254215, 1241935, 1205079, 1159070, 1106671, 1062425, 1021004, 979613, 940377, 910730, 891815, 877672, 871450, 873649, 872907, 889000, 896952, 915786, 943068, 972562, 994481, 1015370, 1025896, 1025047, 1015133, 1009040, 1008320, 999051, 988064, 988468, 996099, 1007609, 1020687, 1024533, 1030253, 1048380, 1061444, 1071571, 1085979, 1094980, 1100733, 1106744, 1128388, 1154781, 1169902, 1194285, 1211372, 1213262, 1205257, 1177119, 1152187, 1125178, 1088732, 1049758, 1008239]
8679A008239l8583k8635k6086k2299k2279k2486n040J962K32m922j8566o885j4528
8666H00124k6358n819j1853l921j0887r517J677n151O455N3n6l994M532K1715
8652G57000L0024L0732N2297N6361M6638M5720L9105L0625J1551j2610j8548j6681
8640A052214N257l177q935q177j049R687M419n370j3924N98K467r068o068o906
8626A011968j7728j4911j4090j0042J243Q51k487P559J1101J0782J6158L0762
8614A031166L1429R531j3093j7886l3433k7609k1362k8407k1558l691J9156K2899
8602I47142J7676K9798K8998K7567M3262N1662O8931R1067J10711J34174J73260
8591A724248K16366K53984K52219K14688J32312M957j08904j78395k07560k16399
$$ y = [1008239, 969656, 941021, 914935, 892636, 870357, 847871, 842831, 844793, 845025, 840103, 821537, 814652, 800124, 773766, 767947, 756094, 752173, 741286, 731769, 733446, 728295, 734750, 734803, 734747, 730753, 735285, 757000, 787024, 817756, 870053, 926414, 973052, 1018772, 1057877, 1088502, 1100053, 1087443, 1068895, 1052214, 1057471, 1054294, 1045359, 1037182, 1036133, 1045820, 1050239, 1044869, 1030945, 1031543, 1034010, 1024942, 1018874, 1011968, 994240, 979329, 965239, 955197, 956440, 957291, 954804, 962363, 973464, 984246, 1000404, 1031166, 1062595, 1072126, 1059033, 1041147, 1007714, 980105, 958743, 930336, 908778, 905087, 924243, 947142, 964818, 994616, 1023614, 1051181, 1094443, 1146105, 1215036, 1306103, 1416814, 1550988, 1724248, 1940614, 2194598, 2446817, 2661505, 2793817, 2798774, 2689870, 2511475, 2303915, 2087516]
8581B087516j93103j63530j30145r9140q5600p1321o2141m0580m5731l4177l4822
8570A127226k8032k1904k2262j8575l489m507O025J3708J1118J2242N621k220
8558A074951n976k802p002q549m633k6469k8552k5059j7479k0569k6440j7014
8546H84407k2752j6094p734m078m493J761M505r447j9523k1022k4109j7011j5951
8533G28459j7731j5980m758r016j5962j7203j4000j1218j1619K625Q041O603N554
8520F33795N772p012k586J240l306l960l64r781j8196j4844J460k9M554O193P24
8505E93660n137J160n42J1789J8243J7295p133O758K6508L0743K8818M0738N6795
8492H19695P7599Q3831R6342J11551J44903J72984K08124K67915L95518N47155
$$ y = [2087516, 1894413, 1730883, 1600738, 1501598, 1415998, 1344677, 1282536, 1241956, 1196225, 1162048, 1127226, 1099194, 1077290, 1055028, 1036453, 1032964, 1028457, 1034482, 1048190, 1059308, 1071550, 1077171, 1074951, 1068975, 1066173, 1059171, 1050622, 1045989, 1019520, 990968, 965909, 948430, 927861, 901421, 884407, 861655, 845561, 837827, 833749, 829256, 831017, 835522, 826075, 806552, 785530, 761421, 744410, 728459, 710728, 694748, 689990, 680974, 665012, 647809, 633809, 622591, 610972, 613597, 621638, 628241, 633795, 639567, 632555, 629969, 631209, 627903, 623943, 623579, 613798, 595602, 580758, 582218, 582189, 586743, 592936, 593660, 588523, 589683, 589141, 600930, 619173, 636468, 629335, 636093, 662601, 693344, 722162, 762900, 819695, 897294, 981125, 1077467, 1189018, 1333921, 1506905, 1715029, 1982944, 2378462, 2925617]
8482B925617P86842J109053J539051J868071J735467Q11916o24571j607792j688270
8473F855384j346858r62449o52376m42394l31087k52676j99016j46196j13413
8464B408919r1560p7809n1933m7041o2658n5852m0320k9974k7332k4332q388L498
8452A895218K5058L5572M1430P7836J07292J17710J32133J48186J79645K39087
8442B999167L31970M70431O79801R44214J306493J833621K572340L445020L808727
8433A8391784K664315n1783k793104l557232l005041k209650j518461j042120
8425F878708p47465n63956m42485l58059k91201k27360j85534j48705j42421j51911
8415C619611j53379j42923j06070p2380p1893o2036m6428l4568k2607k571Q243
$$ y = [2925617, 3712459, 4821512, 6360563, 8228634, 9964101, 10776017, 10151446, 8543654, 6855384, 5508526, 4546077, 3893701, 3451307, 3120220, 2867544, 2668528, 2522332, 2408919, 2317359, 2239550, 2187617, 2140576, 2077918, 2022066, 1981746, 1951772, 1924440, 1900108, 1891720, 1895218, 1920276, 1955848, 1997278, 2075114, 2182406, 2300116, 2432249, 2580435, 2760080, 2999167, 3331137, 3801568, 4481369, 5425583, 6732076, 8565697, 11138037, 14583057, 18391784, 21056099, 21004316, 18211212, 14653980, 11648939, 9439289, 7920828, 6878708, 6131243, 5567287, 5124802, 4766743, 4475542, 4248182, 4062648, 3913943, 3771522, 3619611, 3466232, 3323309, 3217239, 3144859, 3072966, 3010930, 2964502, 2929934, 2907327, 2904756, 2912999]
8404B912999K9808O5923Q4172N7554M0514O5239J06114J63888K53347L76344N06456
8393D662358P03954J003079J388406J697037J512209N61675q11669j661072j648558
8384G407419j312609r50469o44642m45180l33829k53490k10962j66047j41188
8375B949003j19617j27502j32055j29678j12674j03624r3530o2321o2191n4984
8365A950827m2706l9151l7015l1018l2593k7428k0713m056q057k0029j5511j3584
8353A658966l0811j9821j9643m4656m8851n3973o9768o7718o2541n3046n9116
8342A129022m4860m5073m2622n3228l7585l6861k7835j0364J212Q118J2514J4159
8330H66597L4277L6669J7687k1167m3213n8906n5993l0260k8115l3203l7338l0288
$$ y = [2912999, 2942807, 3008730, 3092902, 3150456, 3190970, 3256209, 3362323, 3526211, 3779558, 4155902, 4662358, 5366312, 6369391, 7757797, 9454834, 10967043, 11528718, 10717049, 9055977, 7407419, 6094810, 5144341, 4499699, 4054519, 3720690, 3467200, 3256238, 3090191, 2949003, 2829386, 2701884, 2569829, 2440151, 2327477, 2223853, 2130323, 2068002, 2005811, 1950827, 1908121, 1868970, 1831955, 1800937, 1768344, 1740916, 1720203, 1716147, 1708090, 1688061, 1672550, 1658966, 1628155, 1608334, 1588691, 1544035, 1495184, 1441211, 1371443, 1303725, 1241184, 1188138, 1129022, 1084162, 1039089, 996467, 943239, 905654, 868793, 840958, 830594, 831806, 839924, 852438, 866597, 900874, 937543, 955230, 934063, 890850, 831944, 775951, 745691, 717576, 684373, 647035, 616747]
8318F16747k3356j8250j1010m444j2748j2379q74n57p598R253K0851J9032K2601
8305E97268J6270m336k2484k8417m3382l9052k6882j0370p076p462r889o24n431
8292D08133q614j1549l533M602k852k371r83K1874K8289K0449K3699K9086J1366
8279E17596l353k2680k8274k8453l9421l1988j3362j0071j2964n948j810O738
8267C26010J725L04J3021K181m892k608Q02J4253J8343L458m730l560j0220j4975
8253C39112j8355q184j6940j7182r921K659k173r72m016K67L011J0704J5222L430
8239B96662Q527J2838O857K613k86j2817j1924p413l315m503m232q960j0053N567
8225B69561M008m543m366p866j2904j2760j4112k833k646o849N624K416j910o20
$$ y = [616747, 593391, 575141, 564131, 559687, 546939, 534560, 533686, 533129, 525531, 534784, 555635, 574667, 597268, 613538, 609202, 586718, 558301, 514919, 475867, 448985, 438615, 431539, 424077, 414188, 413564, 408133, 399519, 387970, 384437, 389039, 386187, 383816, 382833, 404707, 432996, 453445, 477144, 506230, 517596, 514243, 491563, 463289, 434836, 395415, 363427, 350065, 339994, 327030, 321082, 319272, 326010, 327735, 328039, 341060, 343241, 338349, 335741, 336543, 350796, 369139, 372597, 367867, 364307, 354087, 339112, 320757, 312573, 295633, 278451, 268530, 271189, 269016, 268044, 264028, 264295, 267306, 278010, 293232, 296662, 305189, 318027, 324884, 327497, 327211, 314394, 302470, 295057, 291742, 287239, 283007, 274047, 263994, 269561, 273569, 269026, 264660, 256794, 243890, 231130, 217018, 214185, 211539, 204690, 210314, 212730, 210820, 210200]
8211B10200Q759M759K538j0707k445n5K01l521J261J7255P633N991J3099J538
8197B56506P042Q239n694k2106j9967j5826j0455k242O059O374k026j4709j3954
8184A77241M710Q526M311J2711l724q616j662q470p838q748n537l140K134Q472
8170A70370M126n445j7232r618M84J781m009l843k134J4961L996j0925K369O435
8156A51316J418o647J900K547j2078o521n537O515L487j2090n47R575j854K10
8142A31694k229N685k250M434M729P542L953o591r245o347m770k549j379k6J0997
8127A33648J556p029q936J14L55J0652J965P162o648j993k88J1290J469r854k771
8112A30692p753n852O37P079K603j759J925r04j715j2049o114J3599J375K675
$$ y = [210200, 218959, 223718, 226256, 215549, 213104, 213049, 213250, 209729, 210990, 228245, 235878, 241869, 254968, 256506, 263548, 271787, 266093, 243987, 224020, 208194, 197739, 195497, 201556, 207930, 205904, 191195, 177241, 181951, 190477, 194788, 207499, 203775, 195159, 193497, 185027, 177189, 168441, 162904, 159764, 161898, 170370, 174496, 169051, 151819, 142201, 142685, 144466, 140457, 136614, 134480, 149441, 153437, 142512, 144881, 151316, 152734, 146087, 147987, 150534, 138456, 131935, 126398, 132913, 136400, 124310, 123763, 133338, 131484, 131694, 129465, 135150, 132900, 137334, 142063, 149605, 153558, 146967, 137722, 131375, 126605, 124056, 122677, 122651, 133648, 135204, 128175, 119239, 119353, 119708, 130360, 132325, 139487, 132839, 130846, 130558, 141848, 143317, 133463, 130692, 122939, 117087, 117724, 124803, 127406, 125647, 127572, 126668, 124953, 112904, 106790, 120389, 121764, 124439]
8098A24439p721o83J2394j6058p569J2009O045J940j327j2331k540P629J588l520
8084A14295n68P259J507M703N303J0796J3370J0035J2279k472j0559j8525j5156
8071A32267j0302Q80M460P59k273n968j390k98L249R069O497N093m427n502Q14
8056A32928j608k133N867Q258J6161J1432Q94l200J756n138n088L923O369k595
8042A67826m274N59l466o416k832J3437J4955L990J1460K0838J4973J3001j3450
8029B30601k6247j8803m587j5588j3614j707N396J702n992j608l201J0860Q185
8016A65397O956O222L129L856L23M14M833j1764j8130q210r516k029M129k703
8002A42907k866m950L662N552k337O947m498l958n244j039O841J1467N681P606
$$ y = [124439, 116718, 116035, 128429, 112371, 104802, 116811, 122856, 124796, 123469, 111138, 108598, 116227, 117815, 114295, 113727, 120986, 122493, 127196, 132499, 143295, 156665, 166700, 178979, 176507, 165948, 147423, 132267, 121965, 122845, 127305, 128064, 125791, 119823, 118433, 118135, 121384, 130453, 136950, 142043, 137616, 132114, 132928, 131320, 129187, 135054, 143312, 159473, 170905, 171799, 168599, 170355, 165217, 160129, 164052, 170421, 167826, 163552, 164111, 160645, 154229, 151397, 164834, 179789, 183779, 195239, 216077, 231050, 244051, 230601, 204354, 185551, 180964, 165376, 151762, 150055, 155451, 157153, 151161, 149553, 146352, 157212, 165397, 172353, 178575, 181704, 185560, 185883, 186297, 191130, 179366, 161236, 153026, 143510, 141481, 145610, 142907, 140041, 135091, 138753, 144305, 141968, 148915, 144417, 140459, 135215, 134176, 141017, 152484, 158165, 165771]
7988A65771R928j260j7797j0307p685j0503L310Q27n872m981j2071J1465Q413
7975A29238P232p395p808J6857J5075N473l985m359K005J0680n455p879m880o841
7961A37958n148k106p994J988j1238n323j488n882P836J3490q85n445N535P499
7947A28797K325o517m829K881m732J909m0k958n573m928L311N81j100P244L262
7932A19633n353M104J268R97k253K806m057m747J661J4885N733P689P267p028
7918A42605r822m61n356M192J742r707l245n341j525j868J045r091l279K872N770
7903A08531K10J76m612j621M994J949r357O28K749J568l000r583n895R005K3977
7888A19719Q444M710j3475r995q177n355l774N770P437K709J563o906r799K897
$$ y = [165771, 175699, 174439, 156642, 146335, 138650, 128147, 131457, 132284, 126412, 121431, 109360, 120825, 129238, 136470, 129075, 121267, 138124, 153199, 158672, 154687, 150328, 152333, 163013, 157558, 149679, 144799, 137958, 132810, 130704, 122710, 124698, 113460, 108137, 106649, 100767, 108603, 122093, 121208, 115763, 121298, 128797, 131122, 124605, 119776, 122657, 117925, 119834, 119794, 116836, 111263, 106335, 109646, 110227, 109127, 116371, 119633, 114280, 118384, 119652, 120649, 118396, 121202, 117145, 112398, 114059, 128944, 134677, 142366, 149633, 142605, 132783, 132322, 126966, 131158, 132900, 123193, 119948, 114607, 113082, 111214, 112259, 103168, 99889, 102761, 108531, 108741, 108917, 104305, 102684, 107678, 109627, 100270, 100898, 103647, 105215, 102215, 92632, 86737, 95742, 119719, 128163, 132873, 119398, 109403, 101226, 95871, 92097, 97867, 105304, 108013, 109576, 102670, 92871, 95768]
7874I5768N977j985O37Q609k324k310R266K240K837j835k652j6122j3492N986
7860I0600J0572Q565q76j0628P10l104n976q089o794L604Q85j474O854p690r808
7845F7351O781N554m252k984j154J671R509P477k089l161k49N963m639j2341k284
7830G1153J2071P595l879n133J285p3n55k638m683Q802M054j0101j0620j0077
7816E7201J446L592M826o3m533n884O929P952K66k25m208J719N086K697l363j2106
7800F1332l25k57j229Q211J270J558P691q927q836M983l394K621O129M705q52
7785G4680j0313m495q031N705K267l149M077L951N001j2657j0414j1Q99m62m433
7770D2615M690m60J399J357p248r69l418q66J827Q332N834J644n453j0164J152
$$ y = [95768, 101745, 99760, 100397, 109006, 106682, 104372, 113638, 115878, 118715, 116880, 114228, 98106, 84614, 90600, 101172, 109737, 108861, 98233, 98943, 95839, 89863, 81774, 74980, 78584, 79469, 77995, 84849, 77159, 67351, 74132, 79686, 75434, 72450, 71296, 72967, 82476, 89953, 87864, 84703, 84454, 90417, 85778, 73437, 71153, 83224, 90819, 86940, 81807, 83092, 83019, 82464, 79826, 75143, 83945, 87999, 77898, 67278, 57201, 58647, 62239, 67065, 67002, 62469, 56585, 63514, 71466, 71732, 71507, 67299, 69018, 74104, 76801, 73438, 61332, 61007, 60750, 59521, 67732, 69002, 70560, 78251, 69324, 60488, 65471, 62077, 64698, 70827, 75532, 74680, 64367, 59872, 51841, 57546, 59813, 56664, 60741, 64692, 69693, 57036, 46622, 46611, 47510, 47048, 42615, 47305, 46845, 48244, 49601, 42353, 41384, 37966, 37100, 38927, 47259, 53093, 54737, 49284, 39120, 40272]
7755D0272N715j007M132m540n159P741P965n161j1592l227R239R785R82q530n694
7740D0921k703O656l650j400J3444o331q554P98R41M604N403j981o96m586q19
7725D2047l32n495l39J3275n274l587K046O358q074l079J795n666n182J4528P281
7710E0302j285n550l902J013J358K655J349o985n667O978K513r711m387n94J609
7695B9696J969L897K433m053j069m717O620L666l638k383q789P296J5366o948
7681C9346k156P80m08O525n1j846O894p175j0573o78N377L115k821m049N336o018
7665C1598k698R562J0154k621m296k389o613K141N396O494n541O894Q194K371
7651E8646m041n130q75j4459j0518j205P137J0172n420l232N990P491K772j235
$$ y = [40272, 45987, 44980, 49112, 44572, 39413, 47154, 55119, 49958, 38366, 35139, 44378, 54163, 55145, 46615, 40921, 38218, 44874, 41224, 39824, 53268, 46937, 38383, 39181, 40122, 44726, 50129, 48148, 47452, 42866, 42047, 41715, 36220, 35881, 49156, 43882, 40295, 42341, 48699, 40625, 37546, 39341, 33675, 28493, 43021, 50302, 49017, 43467, 39565, 40578, 41936, 44591, 45940, 38955, 33288, 40266, 42779, 33068, 28681, 28087, 29696, 31665, 35562, 37995, 33942, 32873, 28156, 34776, 38442, 34804, 32421, 23632, 30928, 46294, 39346, 37190, 37970, 37562, 44087, 44036, 42190, 49084, 41909, 31336, 30658, 36035, 39150, 36329, 32280, 37616, 31598, 28900, 38462, 48616, 45995, 41699, 39310, 32697, 34838, 40234, 46728, 41187, 48081, 56275, 58646, 54605, 49475, 48600, 34141, 23623, 22418, 29555, 39727, 34307, 31075, 37065, 44556, 47328, 46093]
7637D6093q76K680r621n691Q36M522o52m533l445J435O09k00j2243k394Q327R740
7621C4587k702J61L440m651k230P365Q701N95j1066q390l624L041J98m318l786
7606A7321O98O713L600j022j763P518Q956k520r249n664Q546P947q584n816j726
7591B4955J326n487l513M894K884O179k372m357J1870K381o142p53L72j505K790
7576C3522K687L706k856q340L606J7159K552m870j0520l279l463M814L019j979
7562C5758p480p315L530K690k079p159J1059R306k918p231q222J1761J2852o491
7548C8061q630R66O358Q538j437n915K909M539n638j1475p095q304m909J1103
7534A9071J5974m810n505P758k115q825m203N924J0326P070O46q099N12L518q78
$$ y = [46093, 45217, 47897, 38276, 32585, 33421, 37943, 37291, 32758, 29313, 30748, 31357, 31157, 18914, 16520, 24847, 34587, 31885, 32046, 35486, 30835, 28605, 35970, 44671, 45266, 34200, 25810, 22186, 25227, 25425, 21107, 17321, 18019, 24732, 28332, 27310, 25547, 33065, 42021, 39501, 30252, 24588, 33134, 41081, 32497, 26681, 24955, 26281, 20794, 17281, 22175, 25059, 31238, 28866, 24509, 36379, 38760, 32618, 31865, 32237, 30732, 33522, 36209, 39915, 37059, 28719, 32325, 49484, 52036, 47166, 36646, 33367, 29904, 34718, 37737, 35758, 28278, 20963, 24493, 27183, 25104, 17945, 29004, 38310, 35392, 28161, 19939, 31700, 44552, 38061, 29431, 30397, 36755, 45293, 43856, 37941, 40850, 45389, 39751, 28276, 21181, 12877, 7968, 19071, 35045, 30235, 24730, 32488, 30373, 21548, 17345, 23269, 33595, 40665, 41311, 33212, 33724, 37242, 36364]
7519C6364j074o667j814M498j974q138j1120o833O446N561N184P34l50n857L984
7504A8944k934P486j0561k409l618J2292J7218p244n818m755l96k460J303N873
7490B2921M799N667o228N62J1598m612m207k693L173q993n843Q161Q454k907l548
7475B6304K192J529m393M37l150j975O815J708n463m206J409J0888Q741K12n74
7460D0474o022j985Q299k860r316n057R42Q45r562j463N397m79R822k478n049
7445B1508l878K481K263R95n132M055L213m978q605O879P006j529p413l820N907
7430A8952R220J556n808M332R377o377m267j209J828p109n058M061O675J225p146
7415B0252O635M175p8j345L95k562J340K92o185j02r546j2377l939J337O444K2191
$$ y = [36364, 35290, 28623, 26809, 31307, 29333, 21195, 10075, 3242, 9688, 15249, 20433, 21167, 20817, 14960, 18944, 16010, 23496, 12935, 10526, 6908, 19200, 36418, 29174, 23356, 18601, 18205, 15745, 17048, 22921, 27720, 33387, 27159, 27721, 39319, 34707, 30500, 27807, 30980, 21987, 16144, 24305, 32759, 29852, 26304, 28496, 30025, 25632, 26069, 22919, 20944, 27759, 29467, 24004, 19798, 21207, 32095, 40836, 41048, 40474, 34452, 32467, 40766, 37906, 28590, 23533, 24475, 25320, 15758, 14295, 19692, 19213, 29035, 26557, 21508, 17630, 20111, 22374, 23369, 18237, 22292, 25505, 20527, 11922, 18801, 25807, 24278, 16865, 13045, 18952, 28172, 29728, 23920, 28252, 37629, 31252, 26985, 25776, 27604, 20495, 15437, 19498, 26173, 27398, 20252, 26887, 31062, 30984, 29639, 30034, 27472, 28812, 29104, 22919, 22817, 13271, 894, -3045, -1708, 4736, 26927]
7399B6927Q359L087j620p173j0900j2918p689qo24Q916Q357O215j553K801M381
7384B6558m784l851l461j1581M821O813K14O202p796o626K126L507M043M280J0007
7369C0472Q648N226j262m504o065K47j136j0558J44j10J715O484r975Q99Q028
7354B8253k233r162m814j529J071k429J356L731o19j083P924R5l982M320J769
7339B2668N51k033j613j5238o976Q918P983O294k340l302j658k025L001n80L521
7324A7171N96k251m573M850O438K559l675q845m776l905K239J3430J2428J571
7310C3257p604Q17J071L155N234r91r010j566l062o175l165P536J685P584J394
7295C0160j913j411p275l151P932k477M319k858j821O921M963l06k682l980k453
$$ y = [26927, 35286, 38373, 36753, 29580, 18680, 5762, -1927, -1935, -2559, 6357, 14714, 20929, 19376, 22177, 26558, 21774, 17923, 14462, 2881, 7702, 14515, 14729, 20931, 13135, 6509, 8635, 12142, 16185, 20465, 30472, 39120, 44346, 43084, 38580, 32515, 32762, 31626, 21068, 21212, 21102, 22817, 29301, 19326, 20225, 28253, 26020, 16858, 12044, 10515, 11586, 9157, 10513, 14244, 13625, 12542, 20466, 20561, 16579, 20899, 22668, 23219, 21186, 19573, 4335, -2641, 6277, 14260, 20554, 18214, 14912, 13254, 11229, 14230, 13650, 17171, 17767, 15516, 10943, 15793, 22231, 24790, 21115, 12270, 7494, 3589, 5828, 19258, 31686, 33257, 25653, 26470, 27541, 30696, 35930, 34939, 25929, 24363, 21301, 15126, 11961, 19497, 21182, 28766, 30160, 28247, 26836, 19561, 16410, 24342, 21865, 26184, 23326, 21505, 28426, 33389, 33083, 30401, 26421, 23968]
7280B3968r769j0481L684O205J669O020j562o37Q87o549n722K786Q636M440k143
7265B1432k802R67P81r445l967L91J685O523P339k206m122M248K419K245L045
7250B8533m056r078L262j388j1873J0605O121k721L786q45O433q81k865L938o414
7235B2557K114J797N59j0520K368Q111k125L814j526J401L431m053J469q781M189
7220B4805n419r844r693n03N865R42L939j550L482L290K934n757r749p141L924
7205d75J3350Q626j406l036j0914p103J0262L713m826r615K533M525L021P750
7191A6405N873L020M629l783q468q927J906L364J904m721j899j889j0172l29Q607
7176E520J2309N232k738k826l66p6q01N085q093l586n401j044r56j665j090Q204
$$ y = [23968, 14199, 3718, 7402, 13607, 15276, 21296, 19734, 19097, 19984, 13435, 7713, 10499, 19135, 23575, 21432, 18630, 19597, 20378, 10933, 6966, 7357, 9042, 15565, 22904, 20698, 16576, 20824, 23243, 25488, 28533, 24477, 15399, 18661, 17273, 5400, 16005, 22126, 19405, 23191, 22346, 28779, 27898, 25033, 28971, 22557, 24671, 26468, 27027, 16507, 18875, 26986, 24861, 28675, 27149, 28550, 31981, 27928, 29397, 20616, 24805, 19386, 9542, -151, -654, 5211, 6153, 10092, 8542, 12024, 15314, 18248, 12491, 2742, -4399, -475, 12875, 21501, 20095, 17059, 6145, -958, 9304, 13017, 8191, -1424, 1109, 5634, 8655, 16405, 22278, 25298, 29927, 26144, 17676, 8749, 10655, 14019, 15923, 11202, 9303, 7414, -2758, -3087, 5520, 17829, 23061, 20323, 17497, 17131, 17055, 16254, 21339, 13246, 9660, 4259, 3215, 2259, 594, -496, 7708]
7160G708M537R80K905J340k168K440q34J683q238l729N587N796o18L103m214j213
7144A5065P906l085r39K869K185q255q808o352n762J333J4496P952M71m09m767
7129A3900o751J264N816m695o504P31N108K747L641K547m414p445j4195O217J748
7114b85J816O424J3689J223j1885j3196J1184Q339L744K669J693l231q299j1540
7100B345m608J1120J0055j456n246j1026l750M557J0475K234K42K229p449l455
7086F267L502L058J149J207r511Q04N211k393P041p364j890j0078l947J0445J2762
7071A6263j459m488o60j482N80J2883j241j7716j0782M38R49Q964J3161L197r40
7056A7667q83l34n066k185J3168o67o379n739j212O048O838m635K991K492j634
$$ y = [7708, 12245, 13225, 16130, 17470, 15302, 17742, 16908, 18591, 10353, 6624, 12211, 18007, 17389, 20492, 16278, 15065, 22971, 19886, 18947, 21816, 24001, 15746, 6938, 586, -5176, -3843, 10653, 18605, 19076, 18667, 13900, 7149, 8413, 14229, 9534, 3030, 3761, 8869, 11616, 15257, 17804, 13390, 5945, -8250, -2033, -285, 1531, 7955, 21644, 22867, 10982, -2214, 8970, 17309, 21053, 23722, 25415, 22184, 13885, 2345, -2263, 8857, 18912, 17456, 12210, 1184, -2566, 1991, 12466, 14700, 14942, 17171, 9722, 6267, 9769, 12827, 13976, 15183, 5672, 6476, 11687, 9294, 16335, 8971, 7081, -2997, -6944, 3501, 16263, 14804, 10316, 9656, 8174, 8754, 21637, 20396, 2680, -8102, -7664, -6715, 2249, 15410, 18607, 17667, 16784, 16450, 11384, 9199, 22367, 21700, 15321, 9582, 8370, 14418, 21256, 16621, 19612, 22104, 20470]
7041B0470p498j1211l762L180P313l959j766l542K646K816j318P91L887M020N964
7026A8031l331n019k327m647K151q206j42m388L079J5290Q804j97n75o534q015
7011C974o408l977O511J0252j428K353Q469j371j859L728m413p202m484Q354k071
6996A0428j0442M05J892N48R708j61k328Q237L967M835q603m673k893l3n847J0589
6980A5629P933n025m133l629m762j289K615Q927l018p764K561j427n586K947J1459
6965A5438k8J0118n771l510K854o181o470R52R345L262N840R96n828k409K27L471
6949B2306l838k696r473r8o407m319J1891O038O956L343p073k3853P0P508j361
6934a006j0577l370L840J470Q920L88N979P130J458P576n020n262m00L422k580
$$ y = [20470, 12972, 1761, -2001, 1179, 8492, 4533, 2767, -775, 1871, 4687, 3369, 4160, 8047, 12067, 18031, 14700, 9681, 7354, 2707, 4858, -3348, -3490, -7878, -4799, 10491, 19295, 19098, 18523, 11989, 3974, -2434, -6411, 100, 10352, 8924, 11277, 19746, 18375, 16516, 20244, 15831, 8629, 4145, 12499, 10428, -14, 391, 2283, 2831, 12539, 12378, 10050, 18287, 22254, 27089, 18486, 13813, 10920, 10887, 5040, 15629, 23562, 18537, 14404, 10775, 6013, 4724, 7339, 16266, 13248, 5484, 8045, 6618, 1032, 3979, 15438, 15410, 25528, 19757, 16247, 19101, 12920, 6450, 7402, 16747, 20009, 25849, 26845, 21017, 18608, 18835, 22306, 18468, 15772, 6299, 6201, -206, -4525, 7366, 13404, 20360, 23703, 16630, -7223, -7153, 355, -1006, -11583, -14953, -11113, -9643, -723, -335, 5644, 12774, 14232, 21808, 16788, 11526, 11126, 14548, 11968]
6919A1968R03L878n93P91n090J419k714Q276R208L092j0050l587o407q245L672
6904F521R904K153k57L42M055K959m744L233L191K017j901j0119j1335n787O007
6889F239J922j462N140m501p229J612J1249P529n551j0279p833J951J1103k141
6875G749j729l538j638Q316J0826n545o036L443K898m697R70J02O423L6l578k093
6859A1909m969p134L455N605J124M103M216k160l588n759o266R326q47M025m885
6844H155n030k486J470L636l385j269m647J0478Q041M18j795j63q972m109J4236
6829A4578k255j6052L509J1986j5n098K39k790n588l067K303K182k177N337K399
6814E491J082p92L856j646r779j1266L569l628R38L218M124L030j312K039M531
$$ y = [11968, 12871, 16749, 16156, 16947, 11857, 13276, 10562, 18838, 28046, 31138, 21088, 17501, 11094, 2849, 6521, 16425, 18578, 18321, 18663, 22718, 25677, 20933, 24166, 27357, 29374, 27473, 17354, 6019, 232, 6239, 8161, 6699, 11839, 7338, 109, 1721, 12970, 20499, 14948, 4669, -3164, -1213, 9890, 7749, 6020, 2482, 844, 9160, 19986, 14441, 8405, 11848, 14746, 10049, 11019, 11121, 17544, 17580, 14002, 11909, 6940, -194, 3261, 8866, 9990, 14093, 18309, 16149, 12561, 6802, 536, 9862, 9015, 13040, 8155, 3125, 639, 2109, 5745, 2360, 1091, -3556, 6922, 14963, 15381, 13586, 13423, 4451, 342, 14578, 12323, -3729, -220, 11766, 11751, 6653, 6892, 4102, -1486, -4553, -2250, -68, -2245, 3092, 5491, 6573, 5781, 9637, 7991, -1788, -13054, -9485, -13113, -12175, -8957, -4833, -1803, -3115, -1076, 3455]
6799C455p698j283j49k65K632P635R979K071n817p306j789L553L750m904l183
6784F81l366n856n337L22L749j247O652N078J4041m782q440m831m145J0270L330
6769F119Q357p844m940K108K723O957L010J0136o500o003m372l834M40l725n065
6754b433l228j04P14J892j694L795K208j544M010J0323K734k576p202N500N050
6739A7445r958J274L995j85m779n874l287J220Q393R387j737k428J3297J0721
6725C7484n660j0602ml497m402k106r790M575l91r87n10k553k973N812p79L251
6709F868J2477m857o860n984k078Q1J119n619k137L086J6973Q571n052r786k563
6694D239n205p236j025P822R521J310k434j76R602J5311m304p829n86r901o968
$$ y = [3455, -4243, -5526, -5675, -5940, -3308, 4327, 14306, 16377, 10560, 3254, 1465, 5018, 8768, 3864, 681, -2685, -8541, -13878, -13556, -9807, -11054, -4402, 676, 14717, 9935, 1495, -3336, -7481, 2789, 6119, 14476, 6632, 1692, 3800, 6523, 13480, 16490, 26626, 20126, 14123, 9751, 5917, 6357, 2632, -2433, -5661, -5765, -5051, -3159, -4853, -1058, 1150, -394, 3616, 13939, 16673, 14097, 6895, 12395, 17445, 7487, 8761, 12756, 12571, 7792, 1918, -1369, -149, 8244, 17631, 15894, 13466, 26763, 37484, 31824, 21222, 21218, 17721, 13319, 11213, 1423, 5998, 5607, 4620, 4110, 1557, -1416, 4396, 3617, 6868, 19345, 14488, 7628, 1644, -434, -353, 766, -4853, -6990, -3904, 13069, 21640, 16588, 6802, 4239, -966, -8202, -9227, -1405, 8116, 9426, 6992, 6816, 16418, 31729, 27425, 19596, 19010, 9109, 2141]
6679B141J464J32K555m40R66K141k663J277N870r47P618n259N164J0119p371q611
6663A4156O64p353M176P092j5711J375J5459O947j565p853j787R262k541m10l067
6648A8844p93m951p566m304J386N910l18m602N23p13M909J066Q14o322j094P444
6632A0233P270P70k711M884l953n19o98j418j403J852r761Q6j638k924l412Q308
6616D966k166l281L648r82j833j532Q591r138l636O49O580O699l02N156J507n334
6600I592J158L905j508N458n70m460m755n428J535K384j979L729K113N197N36
6585A6907r810p83L73r26Q611J429p720o294R959j429j3977M508K051R430J4971
6570B7300l910j2514o560N268M012K068j704N569M106l148p032J722o697m155
$$ y = [2141, 3605, 3737, 6292, 5852, 6818, 8959, 6296, 7573, 13443, 12496, 20114, 14855, 20019, 30138, 22767, 14156, 14820, 7467, 11643, 18735, 3024, 4399, 19858, 26805, 25240, 17387, 15600, 24862, 22321, 21911, 18844, 18051, 13100, 5534, 1230, 2616, 8526, 8208, 3606, 4129, 3416, 8325, 9391, 10205, 3883, 2789, 10233, 17503, 18273, 15562, 20446, 16493, 15974, 15276, 13858, 12455, 14307, 4546, 4632, 2994, 70, -3342, 4966, 2800, -481, 3167, 2185, 352, -1180, 7411, -1727, -5363, -4714, 1866, 8565, 8263, 13419, 14926, 9592, 10750, 14655, 13147, 18605, 18035, 13575, 8820, 3392, 4927, 7311, 5332, 9061, 11174, 16371, 16907, 7097, 6314, 6687, 5761, 14372, 15801, 8081, 1787, 11746, 10317, -3660, 848, 2899, 12329, 27300, 23390, 10876, 4316, 9584, 13596, 15664, 13960, 19529, 23635, 20487, 13455, 15177, 8480, 4325]
6556D325J0302P412k183m556M28r887j3766k18Q303L595m180M465l974r407J341
6541h000J0359m592r520J1924O079m45n687l889L396p488n177N956Q454P111o041
6526B440l632P519N737j605M862K007k142o74l022L733O479l882P54k458j2063
6511D053m779J2399L287l52n550l701K885j1379p63M096Q949P219m650n586j260
6496D868Q83k079r200m848m729J571N744n990K817J0836K560o86N100l121K093
6481E819j4420J330j471l014P908L251n944m132o234N329Q507J454K342r71j72
6466d18R475P168j1573j5079M576J3085N07J821N659r325m576R93O057m396M952
6451H926O20j0690m033J41N184l801j701N016J299J0370L508r523j975j492m978
$$ y = [4325, 14627, 22039, 19856, 15300, 15728, 5841, -7925, -8143, 160, 3755, -425, 4040, 66, -9341, -8000, 2359, -2233, -11753, 171, 6250, 5805, 118, -3771, -375, -7863, -13040, -7084, 1370, 8481, 2440, -1192, 6327, 12064, 10459, 15321, 17328, 15186, 14512, 11490, 15223, 21702, 17820, 18574, 16116, 4053, -726, 11673, 14960, 14608, 9058, 5357, 8242, -3137, -3900, 196, 9145, 16364, 11714, 6128, 4868, 5751, 3672, -5528, -10376, -15105, -13534, -7790, -13780, -10963, -127, 2433, 1747, 6847, 3726, 5819, -8601, -7271, -8742, -11756, -3848, -597, -6541, -10673, -16907, -11578, -3071, -1617, 725, -246, -418, 9057, 16225, 4652, -10427, -5851, 7234, 7741, 9562, 15221, 5896, 1320, 2313, 8370, 3974, 8926, 9546, -1144, -5177, -5036, 148, -3653, -5354, -338, 961, 11331, 14839, 5316, 3341, 1849, -3129]
6436c129J998O188k061N958j130o793L976J616n247k685j800J971N054r26p156
6421d166R86k655l250N12k341P631K823o842o374N500P011N971R855Q041j337
6406B1365k89o17j0958j3033j1814n30Q00J7925J2252m44j3273J794m917Q77P99
6391f3L544K286n15n916P487o192l719L363j3407J427N267L075P06J0152R31n096
6375C330R82M674L695o204p010l825j3348J0798Q909l041k099R60N568m05l317
6360c33l208L299J744L630m38k463K15K38n585q297L626M884Q08k416O517j785
6344D36o687K375J0662p65n206j1595n045P784O913r83K471o80m028n933N359
6329d922N506K358m15p069m393M43N010K735P53l118M903l287r040P6J0508m736
$$ y = [-3129, -1131, 5057, 2996, 8954, 7824, 1031, 5007, 6623, 1376, -1309, -3109, -1138, 3916, 2990, -4166, -3180, -5835, -9085, -8573, -10914, -3283, -460, -7302, -13676, -8176, -1165, 4806, 14661, 22702, 21365, 21076, 20459, 9501, -3532, -15346, -15876, -15076, 2849, 15101, 14657, 1384, 3178, -1739, -862, -63, 3481, 5767, 5252, -664, 6823, 631, -3088, 275, -13132, -11705, -6438, -3363, -2657, 7495, 8426, 3330, 4312, 8986, 12681, 6477, -533, -4358, -17706, -6908, 2001, -1040, -3139, -2179, 3389, 2984, -333, -3541, -242, 1502, 5132, 4694, 2231, 2446, 2684, -2901, -11198, -7572, -2688, -1880, -4296, 2221, 436, -6251, -3876, 6786, 6021, 815, -10780, -15825, -8041, -1128, -2111, 360, -320, -4348, -10281, -4922, 584, 2942, 2527, -4542, -8935, -8492, -3482, -747, 6, -3112, 1791, -1496, -10536, -10460, 48, -4688]
6313d688q586L17M944n44k98q193K779M472K493N161n917j392k776R815J4496
6298A2083J962q76O288M50j3868o347Q032J00l433Q661J24n655m232L511l462
6283C338J025J467m687L284P939m901j0895O070J2992p759m484L503k179q493
6269c780n098n7N208M008p059m581Q261J451j835R45N342j881n115Q021J2043
6254A5873Q71q641n449q007p958P440K838L880n511l497N255J482O766J082N823
6239A2247k776j2151k800M774L73j196M584l78j528k559N320M489n365J0598R481
6224B3113J176p699r036m569j911Q365l102n16o972m685R730k284l255j4059l027
6209a8731P779n936Q584J0399j551P54j317n058k244j096M183J4101o08l980P179
$$ y = [-4688, -13274, -12957, -8013, -8557, -8855, -17048, -14269, -9797, -7304, -2143, -8060, -9452, -12228, -2413, 12083, 14045, 13169, 19457, 19907, 6039, -308, 7724, 7824, 4391, 13052, 13176, 7521, 3289, 6800, 3338, 4363, 5830, 1143, 4427, 12366, 7465, -3430, 2640, 15632, 7873, 3389, 6892, 4713, -3780, -8878, -8935, -3727, 281, -6778, -11359, -3098, -1647, -3482, -2537, 2805, 924, -4191, 3830, 15873, 16744, 8103, 2654, -5353, -13311, -5871, -3033, 847, -4664, -8161, -2906, -1424, 5342, 6424, 12247, 9471, -2680, -5480, -706, -333, -1529, 3055, 2677, 1149, -1410, 3910, 8399, 3034, 13632, 23113, 24289, 16590, 7554, 2985, 1074, 9439, 6337, 5821, -1151, -5836, 3894, 1610, -1645, -15704, -18731, -10952, -16888, -8304, 2095, 544, 1298, -19, -5077, -7321, -8417, -4234, 9867, 9259, 5279, 12458]
6194A2458Q705k689o991r746p666O146M109R118l288k027j689Q474n865q663N138
6179E524K507P008n239m737j2417J720N474j204J660M578j221p583R812J1941
6165A7823K455o203O21l85q086o460p96R07j926l568K279l11J647L798L622O127
6149A1544J374J460P2p494r975J511k818P56l039M480Q270n282n995r860r34J147
6133a4783l189L715L972r286M109J3072l05j969j188Q77R146J710m314r082j846
6118i361l619m865J0984J4588K581o531l087k288M192n77l81O692L579J937m363
6103I481l664p012n948L257M07P212k25j543M22k281M531K720p534r2l16p121
6087g706L709J4804J517N97n138n727L608M046n682m436k01J188K894Q830K595
$$ y = [12458, 21163, 18474, 11483, 1737, -5929, 217, 4326, 13444, 10156, 8129, 6440, 14914, 9049, 386, 5524, 8031, 15039, 9800, 5063, -7354, -5634, -160, -1364, 296, 4874, 3653, -3930, 5882, 17823, 20278, 14075, 14696, 14311, 6225, -235, -1031, -124, -2050, -5618, -3339, -3650, -2003, 1795, 5417, 11544, 12918, 14378, 14450, 6956, -3019, -1508, -4326, -3570, -6609, -2129, 6141, 859, -5136, -14996, -15930, -14783, -17972, -14257, -10285, -19571, -15462, -2390, -2695, -4664, -5852, -4975, 4171, 5881, 1567, -7515, -9361, -12980, -17845, -6861, 7727, 10308, 3777, 690, -1598, 2594, 2017, 1636, 8328, 11907, 13844, 9481, 5817, -1195, -7143, -3886, -3479, 3733, 3508, 1965, 2387, 106, 4637, 7357, -177, -269, -585, -7706, -3997, 10807, 12324, 12921, 7783, 2056, 5664, 9710, 4028, -408, -609, 579, 3473, 12303, 14898]
6072A4898l191j5609O75J3136M55q998m720m022k009J350k073k984P39N853L269
6057c231j52L040L031J734L250j2m872m622m283K500J127J868n977j1074J0280
6042g393J0038Q205M527k434p330m178p238Q151L012p325j0436q502M164J7408
6028F69K870L519M049J727j6909p663P248l27j100L833J2284j001j0032j5856
6014a6689n262N03j135N747M873O147m471k421l650M402R34n704P910J780l864
5999a0900M735q112L637J686N645l301j3208J656Q472l309P21J0019P05j231j1254
5984a4039l31P342N935P636O777j397k682p369O13o195R61m912K860J566J854
5969a381m905j183M027N861Q763m752j1844L054M111j870l426m915N355k368J35
$$ y = [14898, 11707, -3902, -3227, 9909, 10364, 1366, -3354, -7376, -9385, -8035, -10108, -13092, -12353, -6500, -3231, -3383, -343, 2688, 4422, 7672, 7660, 2788, -1834, -6117, -3617, -2490, -622, -6599, -17673, -7393, 2645, 10850, 15377, 12943, 5613, 1435, -5803, 2348, 5360, -1965, -12401, -20903, -16739, 669, 3539, 7058, 11107, 12834, -4075, -11738, -4490, -4817, -5917, -2084, 10200, 9199, -833, -16689, -21951, -21448, -22583, -16836, -11963, -5816, -10287, -12708, -16358, -11956, -11022, -16726, -8816, -7036, -10900, -6165, -14277, -10640, -8954, -3309, -6610, -19818, -18162, -9690, -12999, -12278, -2259, -1554, -2785, -14039, -14370, -7028, -1093, 6543, 13320, 11923, 9241, 1872, 2485, -3710, -2749, -7661, -4801, -3235, -1381, -6286, -7469, -3442, 2419, 11182, 6430, -5414, -2360, 1751, -119, -3545, -8460, -3105, -5473, -5338]
5954e338N807m222R60K668n657k853M501Q86N587k700o813N700Q848j495o514
5939f35j706N198K95p956j1657M395J4070L008n026j2984j1396J749J2630k931
5925a2946K136J1799j565j3339j431J4120M015l713n27L902J267j050q027n044
5911a0403j781p86J063J101K620m580O736J7950R153m069k293j0145r389n59L313
5896b069O70j419N836n06r54L861o90k012j430r465j1027O217J7540Q014J764
5881A4330p161m823r848j787N230Q237k387k164K678J610K385r203j0186M966
5867h123M456J075L102n258l350J487O7L017J0088P141o163L64O229p499n977
5852F56m823o35Q650Q066o271p409P14l20m540j0487P661K1361k365j3593q674
$$ y = [-5338, 469, -3753, -2793, -125, -5782, -8635, -4134, -3248, 2339, -361, -7174, -1474, 7374, 5879, -635, -2341, 2857, 3152, -4804, -16461, -12066, 2004, 5012, -14, -12998, -24394, -22645, -10015, -12946, -10810, 989, -576, -13915, -15346, -1226, 2789, -924, -1451, 2451, 3718, 2668, -5359, -10403, -12184, -12970, -11907, -10806, -8186, -12766, -6030, 11920, 21073, 17004, 14711, 4566, -4823, -5382, -2069, -1399, -2818, 3018, 2512, 1558, 5419, 4729, 2717, 1287, -8178, -19205, -12988, 4552, 12566, 14330, 7169, 2346, -7502, -9289, -4059, 4178, 1791, -373, 2305, 3915, 6300, -2903, -13089, -8123, -3667, -2592, 510, -4748, -8098, -6611, -6544, -3527, 6561, 13702, 7539, 7903, 14132, 6633, 656, -4167, -4802, 3848, 11914, 5643, -1766, -1052, -1372, -5912, -16399, -8738, 12623, 10258, -3335, -12009]
5837a2009P94L929O001j257m06o920L415m762L493R33Q546J839L914q947j0083
5822a1520K240k346n67L298P67n892Q300K657l502J797J994O13o71j592n61k875
5806g860L763K250r22J0813m166q792m583M991L88l147R641Q653j52q350n011
5791b484m840j2000J0139P128J825n54p608m793l034k15O836K840J819J1140j765
5776D434M137r92l459L389M019q527o016J437n345j723k311R88M85n520p07o446
5760b2157L466Q012K609r042M124M128l764j341l193Q576R820N099L194R28p00
5745I759J640m803m805P02O849K490q97j1620L669J30m376N867n058j3627r552
5730b3632N925J4679M815l24J212o15n885k654k208m417J186K048j2935M620O666
$$ y = [-12009, -11215, -7286, -1285, -2542, -2948, -9868, -6453, -11215, -7722, -6789, 1757, 3596, 7510, -1437, -11520, -9280, -11626, -12193, -8895, -8128, -14020, -5720, -3063, -6565, -4768, -2774, -2161, -2832, -4424, -4985, -7860, -4097, -1847, -2769, 8044, 3878, -4914, -9497, -4506, -4118, -7265, 2376, 11029, 10877, 2527, -2484, -7324, -19324, -9185, -2057, -232, -786, -8394, -13187, -16221, -16436, -9600, -6760, -4941, 6199, 4434, 8571, 7579, 4120, 7509, 11528, 3001, -3015, -1578, -6923, -8646, -10957, -9969, -9484, -15004, -15711, -22157, -18691, -10679, -8070, -17112, -12988, -8860, -12624, -13965, -17158, -8582, 1238, 6337, 9531, 10459, 9759, 11399, 6596, 1791, 2493, 9342, 11832, 10935, -685, 2984, 3114, -1262, 4605, -453, -14080, -23632, -17707, -3028, 1787, 1463, 2675, 2060, -3825, -6479, -8687, -13104, -11918, -9870, -22805, -18185, -11519]
5715a1519O579Q864m885R78L948N436q258n072J30j013K895l992p410M827O622
5700a870J597K389k571J590P092k359p844J991J538k935R309J0779o535j3348
5686a177J870j1784J955P101n974o957k354n829O07Q775k485L640J018l28o707
5671a8629j316n482J334O625M798j332Q19n999O031J207n017M477K702j42M426
5656e498P926m326k462K606N773n378r835l818Q059J128Q912K190k619M467m907
5641B218O13J4216k935j0533q761r050J657M981J1845J084J921J736p444j1755
5627a0207O505J0929N918p398L484M032j1253l013J173K364O333p818m759n012
5613h722K42Q035P34m693p970J879r75m029m005J901J2087R15N531K042P361m628
$$ y = [-11519, -4940, 3924, -961, 17, 3965, 9401, 1143, -3929, -3799, -4812, -1917, -5909, -13319, -8492, -1870, -273, 2116, -455, 1135, 8227, 5868, -1976, 15, 1553, -1382, 7927, 18706, 12171, -1177, 693, -11091, -9136, -2035, -8009, -14966, -17320, -23149, -22542, -13767, -16252, -12612, -11594, -11922, -18629, -19945, -25427, -24093, -17468, -12670, -14002, -13183, -19182, -13151, -11944, -16961, -12484, -9782, -9924, -5498, 2428, -1898, -4360, -1754, 4019, -1359, -11194, -15012, -6953, -5825, 3087, 5277, 2658, 7125, 2218, 2831, 17047, 14112, 3579, -5182, -14232, -12575, -7594, 4251, 5335, 7256, 8992, 1548, -10207, -3702, 7227, 13145, 5747, 9231, 13263, 2010, -1003, 170, 2534, 8867, 1049, -3710, -8722, -8480, -445, 289, -4404, -12374, -10495, -11470, -15499, -19504, -17603, -5516, -4601, 930, 2972, 10333, 5705]
5597E705j5003J05k340K772o868Q803qM421j357m968r076k947q433j273K0770
5582i697J6068m589o504k377m603O75n160j299Q934L56r36N711P877n757J697
5567C96m309l160K348R04P187M743r321r246m998P215L231L124R05M17j435q846
5551a0845n617J945M100K123p363O15J3636O947p744p437L721j52L289L499j354
5536f37J806M560q093j2661K756J7427m058L064P221l342p99J916n402k448L836
5521E146p004M476r533j830N776o65l943k534o985M942M197N397o32L963q555
5506g784l425j922j1085J0645J7039K238k243l516j1614j2077R147K764Q338O423
5492B928R46k193P391N20l318p36K742n62J485M721n035j3634O909L223j3901
$$ y = [5705, -9298, -9193, -11533, -8761, -15629, -6826, -6834, -2413, -3770, -8738, -17814, -20761, -29194, -30467, -9697, 6371, 1782, -4722, -7099, -11702, -11027, -16187, -17486, -8552, -8196, -9132, -3421, 4456, -1301, 396, -3913, -7073, -4725, -3821, 3366, 8109, -1212, -10458, -15456, -8241, -5010, -1886, -981, -564, -1999, -10845, -16462, -14517, -10417, -8294, -15657, -15042, -1406, 5541, -2203, -9640, -5919, -6071, -2782, 717, -637, 1169, 5729, -2364, -15025, -12269, 5158, 1100, 4164, 11385, 8043, 7244, 9160, 3758, 1310, 5146, -1858, 2618, -6915, -8745, -2969, -3634, -7577, -10111, -17096, -12154, -7957, -2560, -3192, 771, -7784, -11209, -13131, -24216, -13571, 3468, 5706, 3463, -53, -11667, -23744, -14597, -11833, -3495, 2928, 3874, 1681, 9072, 9592, 6274, 5538, 8280, 7718, 9203, 13924, 8889, -4745, 2164, 5387, -8514]
5477h514q436k979J916K803P676O287k954n127Q668Q066m085q624K131Q840n053
5462F15r740L6J33R337l262J329J584k26o486Q74k07l553K433O690m225n707R211
5445a164N681J404Q84m073L282N839k848j1287n329n342O158o91O468p057r697
5430a7772n130O028Q799J293l474k343K087L648n896o83J0214M247R5l423l314
5415e624k009k073j332o248P892L970j214M484P676M112l19r243n65n803N594
5400g02J549n580o208N022l485q23P272k982o565N029l412J2156Q615l037p702
5385h53n253J711M33O080J236L47K217q314L492R392J305M130O70m879m627q843
5369a756r622J0774l86o334n786R975M113J928o818p791n126J616J6908K854j513
$$ y = [-8514, -16950, -19929, -18013, -15210, -7534, -1247, -4201, -9328, -660, 7406, 3321, -5303, -3172, 5668, 615, -9125, -9089, -8956, 381, -2881, -1552, 32, -194, -6680, -5806, -6013, -9566, -7133, -443, -4668, -10375, -1164, 4517, 5921, 6805, 2732, 6014, 11853, 9005, -2282, -7611, -12953, -6795, -7486, -1018, -8075, -17772, -22902, -16874, -8075, -6782, -10256, -12599, -10512, -6864, -12760, -13443, -3229, 1018, 1113, -2310, -5624, -7633, -9706, -11038, -17286, -9394, -5424, -6638, -2154, 5522, 9634, 9315, 72, -493, -6296, -702, 847, -4733, -10941, -5919, -9404, -10227, -2955, -5937, -12502, -7473, -10885, 1271, 9886, 6849, -853, -6106, -4395, -3962, 2118, 3354, 3701, 5918, -2396, 1096, 10488, 11793, 15923, 16593, 11714, 7087, -1756, -11378, -604, -990, -7324, -13110, -3135, 978, 2906, -3912, -11703, -16829, -15213, 1695, 4549, 3036]
5354C036k846O61J857R318J980n425n725j0316o6j0217P130K021J390N700K670
5339A168q44j2008o618Q777P713l409N307k453p943K586j529m380P853R83k279
5324g076N256L283j0418m114m426N024J6208o518j7979k823L403k427O055J4168
5310b384P489L70Q07j622j201o49P945L924o705j970j482o939L344K537K722m792
5294A394L889O572L946o799l104K120m764r730j0058k805J0702P433Q064M929
5280A1789p362r562N129L293L815o485M806M310J4m520j704M667m896q198L416
5265a488P01j2110l536O414P724k255k27p73K627l002K6M20M996O10n812L484
5249b201O209N114J980o254O959q437q47K530j1752n243j229N930M572n162o550
$$ y = [3036, 190, 851, 2708, 12026, 14006, 8581, 2856, -7460, -7526, -17743, -10613, -8592, -7202, -1502, 1168, 324, -11684, -18302, -9525, -1812, -5221, 86, -2367, -10310, -7724, -9253, -13633, -5780, -4797, -7076, -1820, 1463, -8955, -13069, -17495, -12471, 3737, -2781, -20760, -23583, -20180, -22607, -16552, -2384, 5105, 5475, 6282, 4660, 3459, 2810, 10755, 14679, 7974, 6004, 4522, -2417, 927, 3464, 6186, 1394, 5283, 11855, 15801, 9002, 5898, 8018, 3254, -6476, -16534, -19339, -8637, -1204, 6860, 11789, 4427, -5135, -6, 3287, 7102, 617, 5423, 9733, 9747, 5227, 3523, 8190, 3294, -4904, -1488, -787, -12897, -16433, -10019, -2295, -4550, -4777, -5550, -2923, -5925, -5899, -5479, -483, 127, -5685, -2201, 4008, 9122, 11102, 4848, 11807, 3370, 2523, 5053, -6699, -11942, -13171, -7241, -2669, -7831, -14381]
5234a4381j232Q568L6N132K337j0175j167L904N20K165n644p444L320O244J750
5219f067m924k433J248J1453L685J107q59n90J316j263m701P7J1398J708j2357
5204a202l027P620M300k882l110j2526O945Q686j3616o017L507J1380L449J27
5190C634k614j4279m163K249P405J223l070k269m521O0m706r19P822J3609p779
5175h318L854L654J862m104l972k513r209n464l165N758O25P266K670K885n30
5160h701L411o04J131j139N577m679K878o564k386m484J462M038l753O383j962
5145i392J052M011o27m026O609J1751j49p227P114k827K1L332j0636j6027l563
5130b0584J1947P208j764P210Q388o368r983k909J397K817j836o903N675R850
$$ y = [-14381, -15613, -7045, -7009, -1877, 460, -9715, -10882, -6978, -6458, -4293, -9937, -17381, -14061, -7817, -6067, -10991, -13424, -12176, -723, 2962, 4069, 3210, 2620, 3936, 2673, -2028, -1951, 9447, 11155, -1202, -4229, 3391, 7691, 4809, 1699, -10827, -3882, 4804, -8812, -14829, -11322, 58, 3507, 3634, 1020, -13259, -17422, -15173, -7768, -6545, -9615, -11884, -16405, -16345, -21051, -21970, -14148, -539, -8318, -4464, -810, 1052, -3052, -7024, -9537, -18746, -24210, -27375, -21617, -20992, -13726, -11056, -8171, -8701, -5290, -5894, -4763, -5902, -325, -5004, -2126, -8690, -11076, -15560, -14098, -10060, -13813, -7430, -9392, -8340, -4329, -4956, -8982, -2373, 9378, 9229, 2002, 9116, 6289, 6310, 9642, -994, -17021, -20584, -8637, -1429, -3193, 4017, 12405, 6037, -3946, -6855, -5458, -2641, -4477, -11380, -5705, 4145]
5116D145K592j3574o970L232r08q865J0J1606O928O735N634m799l134K05L775
5101F612m936j0506l56k380K385R327Q277J895n109j9045Q26J2350l31p112k97
5086h400M410P459j234j933n46r786r29l203n076J2707O854o317K233l943j0397
5071a8101M581L283P813J409n58K016l373q420k548k357k378P70L282L506K595
5056h480o720R025m4p246J569M012L922N128m266j480j0045l393l650O332J1896
5041c440N106J7897j53o276m469J142k480n442J7l398m357l677q841R22L242k814
5025a7021j1846k459J1216N273M71p42o856o294J2250J4111M781m325j2137o93
5011a4271j126k356j996O907Q987m7n15p221N072M365j1024L76k051l287k013
$$ y = [4145, 6737, -6837, -13807, -10575, -11483, -20348, -20338, -8732, -1804, 4931, 10565, 5766, 2632, 2837, 6612, 1676, -8830, -9186, -11566, -9181, 146, 8423, 10318, 5209, -13836, -13010, -660, -991, -8103, -8400, -3990, 3469, 2235, 302, -244, -10030, -10959, -14162, -19238, -6531, 323, -5994, -3761, -7704, -18101, -13520, -10237, -2424, -1015, -1573, 443, -2930, -11350, -13898, -16255, -18633, -17863, -14581, -11075, -8480, -15200, -6175, -6219, -13465, -11896, -7884, -3962, 1166, -3100, -4580, -14625, -18018, -21668, -15336, -3440, 1666, 19563, 19410, 13134, 8665, 9807, 7327, 1885, 1902, -1496, -5853, -9530, -18371, -17449, -14207, -17021, -28867, -31326, -20110, -14837, -14366, -15108, -21964, -28258, -16008, -1897, 2884, -1441, -13578, -14271, -15397, -17753, -19749, -12842, -3855, -3902, -4417, -11638, -6566, -2201, -13225, -12849, -14900, -18187, -20200]
4996b0200M966J0258j41L271j631o781K59N991l89j443n459j89P099M259j877
4981b007m09L740j0990l993M930J634j873J159k301J3621J500j804r299l906o708
4966a6706q5Q318m46k259k403l665K095R164L767R75n862N435L327j0336L02m635
4950a3014j367N052o364k59J124j3795q360Q488R253N061k062R64O496R532K732
4935C481j1720m878j114M484K733N302l143L412Q424M130j8385r890l20q492P251
4920a8725L952J91K076n731k327M248M578O269l59N941q646p874M332P379O054
4905A358p575l475K571o075p009L691O716J0743M347j818K416j795j1910M057
4891c758R792k557j0610j80M746p78L913P440Q97o980m853q752r675K147k965
$$ y = [-20200, -15234, -4976, -5117, -1846, -3477, -10258, -9999, -4008, -4397, -5840, -11299, -11488, -4389, -130, -2007, -2416, 1324, -9666, -13659, -8729, -7095, -8968, -7809, -10110, 3511, 5011, 3207, -6092, -9998, -16706, -16791, -8473, -8919, -11178, -13581, -17246, -15151, -5987, -2220, -1245, -7107, -1672, 1655, -8681, -8379, -13014, -14381, -9329, -15693, -15952, -14828, -28623, -36983, -28495, -19242, -14181, -16243, -15279, -8783, 749, 3481, -8239, -13117, -14231, -9747, -7014, -1712, -4855, -1443, 6981, 11111, -7274, -17164, -17484, -25976, -18725, -14773, -14582, -12506, -18237, -20564, -16316, -11738, -5469, -5828, 113, -8533, -16407, -12075, -4696, 1358, -6217, -9692, -7121, -13196, -20205, -16514, -9798, 945, 5292, 3474, 5890, 4095, -7815, -3758, 6034, 3477, -7133, -7313, -2567, -3345, 568, 8008, 8905, 1925, -2928, -11680, -21355, -19208, -22173]
4876b2173J2294P190m495k386L877O989o822r737N02J7191J5611l458r927l113
4862A543k142j009L264m161Q693M106j825n485L197j498n686L389r2j807o826
4847f339L446j698o213r73P154m644q223L679k300l540m11Q170L33o00j4718K103
4831b4774O259P364L617l012j209Q65Q070j49j0243q918K186L869J94N467l511
4816a3925m715K36k998j320J1017Q440j0333j0038k395N929P429K045j439m853
4802a6920L276l3p855R03j977J08n63K910j325N219p90N873p467k629J1902J4161
4786D793L905j1897j1121p430n306k788j027M198J6682O641L246J370q329j1147
4772a8210N046Q992l686k932J637J863K565L431K964K997N902K120j2330j2932
$$ y = [-22173, -9879, -2689, -7184, -9570, -5693, 1296, -5526, -15263, -14761, 2430, 18041, 14583, 4656, 1543, -599, -1608, 1656, -2505, 6188, 10294, 8469, 2984, 6181, 4683, -1003, 2386, 2294, 487, -6339, -2893, -4591, -10804, -11777, -4623, -9267, -17490, -13811, -16111, -19651, -20062, -11892, -11559, -12159, -26877, -24774, -18515, -11151, -7534, -10546, -11755, -10890, -2820, -2969, -13212, -22130, -19944, -16075, -15881, -10414, -13925, -18640, -18404, -21402, -22722, -11705, -3265, -13598, -23636, -26031, -20102, -12673, -10628, -12067, -16920, -13644, -13677, -21532, -20629, -22606, -22498, -23061, -20151, -21476, -16257, -17047, -11174, -18641, -21270, -9368, 4793, 8698, -3199, -14320, -21750, -27056, -29844, -30871, -26673, -9991, -3350, -104, 1266, -7063, -18210, -13164, -4172, -7858, -10790, -9153, -7290, -4725, -1294, 1670, 4667, 10569, 12689, 359, -12573]
4758a2573r33M914J0606K650K395L680n096r468l036p319N75N286O286Q227k518
4743C676j552j564j2464P83J0152p850L863O416P35j2818q208J576K515R603P626
4728B489l292l453r626O60p07j187P461N804Q94n077l930P162J0856m305q33O131
4712I047k053j4640K278P106k610k862M87K875J781K479j066q788K236P339J769
4697E378j669m21P90L076J1616p21r772n027m052j449n535j455L138M263l993
4682e833m337O120K929m233m912n618J507k701J424J389j150j963K793N878q641
4667a7348l325O973J533M021m442Q29O57K969Q96l80n638k838L678j029m9J1282
4651b211P784j968m457Q95J941Q213Q669o429o507k890o470K558J403o766p562
$$ y = [-12573, -13506, -8592, 2014, 4664, 7059, 10739, 5643, -3825, -6861, -14180, -13605, -8319, -2033, 6194, 3676, 2124, 560, -11904, -11121, -969, -8819, -4956, 1460, 2195, -10623, -18831, -17255, -14740, -5137, 2489, -803, -4256, -13882, -13222, -13929, -15116, -7655, -1851, -957, -6034, -9964, -2802, 8054, 3749, 2916, 9047, 6994, -7646, -5368, 1738, -872, -3734, -3247, -372, 1409, 3888, 2822, -5966, -3730, 3609, 5378, 3709, 3288, 4078, 7154, 18770, 18049, 8277, 3250, -802, -2251, -7786, -9241, -6103, -1840, -5833, -10170, -4050, -1121, -5354, -10266, -15884, -14377, -17078, -15654, -14265, -15415, -17378, -14585, -8707, -17348, -20673, -13700, -12167, -8146, -12588, -11759, -11102, -8133, -7237, -7617, -13255, -16093, -12415, -13444, -13493, -2211, 5573, 3605, -852, 43, 1984, 10197, 18866, 12437, 5930, 3040, -3430, -872, 531, -6235, -13797]
4636a3797M263R516k251K525l844j839k344N760Q83j041M131J248L153Q150j2430
4621B083q977Q097M117p772k120P075K196j33p551j733K074j265j376N569J1046
4606A1330n855o900M188J162M300R14k837r025j4787k24R434O076K867J232L790
4591E665J77K317N915r426k3067k083J1290j678R81O466m579K220K670K579j578
4576b131J647Q29o033M907O796K938j956o166p528Q620l013l579P827l57k995
4561a94j909p107j1631J2722J2754O2o118l810Q521P508n282j565m852p826k479
4546a1206n13N30M323K72J355K81n211m377K332N588M437k026N987O836l363k258
4530B987q548M395K344L013k191m692J466J881o229j448j295p702n632Q48O864
$$ y = [-13797, -9534, -18, -2269, 256, -3588, -5427, -7771, -2011, -1128, -2169, 1962, 3210, 6363, 14513, 2083, -6894, 1203, 5320, -2452, -4572, 2503, 4699, 4566, -2985, -4718, -2644, -3909, -5285, 284, 11330, 5475, -1425, 2763, 3925, 8225, 9139, 6302, -2723, -17510, -17734, -8300, -2224, 643, 1875, 5665, 5842, 8159, 14074, 4648, -18419, -20502, -9212, -10890, -9909, -3443, -8022, -5802, -3132, -553, -2131, -484, 345, -5688, -781, 6015, 8953, 6997, 831, -6697, 1923, -1090, -4669, 3158, 2801, -194, -2103, -9210, -20841, -8119, 4635, 4697, -1421, -5231, 3290, 10798, 5516, 3951, -901, -8727, -11206, -11719, -11189, -6866, -6594, -5239, -4958, -10169, -14546, -12214, -6626, -2189, -4215, 1772, 8608, 5245, 2987, -5561, -1166, 1178, 4191, 2000, -2692, -1226, 655, -5574, -7022, -8317, -16019, -21651, -20803, -13939]
4515a3939O544L651M43k299p692p079R173Q713k006K95R015j181o212J3065K887
4500A3378m70J702q212j2060o597J0394J85j741n360L084O406q617k831R731k312
4485c320K545L464q355k171j344n237J007O699L972J4979m756j997P256r62Q14
4470A2594k855j1765o322j533P312j01l122o066q088Q81R097J3105K539j442O733
4455A0967l570m348j0026Q26Q547k424j466K647M086k714j0908K206o131k389
4441a4697J3415L763q110n4M521l531M290m214P487p43p450k704r367k084O850
4426a2628K985J143l42P658J806k407p480N016K462L548K81K631n990p658L032
4411e943J09q6m135K853P706O924J3817M125o973k147j030q804p314l455p296
$$ y = [-13939, -7395, -3744, -3301, -5600, -13292, -20371, -11198, -2485, -4491, -4196, 4819, 3638, -2574, 10491, 13378, 12908, 14610, 6398, -5662, -12259, -1865, -1680, -3421, -8781, -5697, 709, -7908, -10739, -1008, -3320, -775, 2689, -5666, -7837, -9181, -14418, -13411, -6712, -2740, 12239, 7483, 5486, 12742, 11780, 12594, 9739, -2026, -8348, -9881, -2569, -2670, -5792, -11858, -19946, -19065, -9968, 3137, 5676, 4234, 10967, 7397, 3049, -6977, -6151, 2396, -28, -1494, 1153, 5239, 2525, -8383, -6177, -12308, -14697, -1282, 2481, -5629, -5683, -1162, -4693, -403, -4617, 2870, 2127, -5323, -8027, -17394, -19478, -12628, -9643, -8500, -8842, -1184, 622, -1785, -9265, -4249, -1787, 1761, 2042, 4673, -1317, -8975, -5943, -5834, -5920, -10055, -7202, 504, 7428, 21245, 25370, 18397, 16250, 15220, 6416, -898, -4353, -11649]
4396a1649L964N520L44l687k549N844M603K266k756n242o0P05o23Q3r202k77N500
4379g216M640P542k467l636r38k568l024L70j276j1154P643K454L757J0759N36
4364E422m348j367k796q885K887j05J0188l928m835r72l625J850K334l374j628
4349a3182l540p167p308N518N198P414Q690j322p833l633P342j02O626j469O149
4334A381n197l125k696K79j130n950j0420m01k087O136J2423N2m340Q06l755k997
4318b1021J2566J0226L936p486r513l111L277k14R92L761J080l645n629K757l135
4303a5159K693P377Q397J2398K32j0770k565N967K290P47l792Q21M736o309p907
4288h44m115p588l198J764K515j114j0345o120O637J2038J3696K860K513q436
$$ y = [-11649, -7685, -2165, -1821, -5508, -8057, -2213, 2390, 4656, 1900, -3342, -3402, -2697, -3320, -3237, -12439, -12716, -7216, -2576, 4966, 2499, -1137, -2075, -4643, -7667, -7297, -8573, -19727, -12084, -9630, -5873, 4886, 5422, 1074, -293, -3089, -11974, -9087, -9192, 996, -2932, -7767, -8739, -12364, -10514, -8180, -11554, -13182, -16722, -23889, -31197, -25679, -20481, -13067, -4377, -5699, -13532, -17165, -9823, -9925, -3299, -4768, 1381, -3816, -6941, -9637, -9358, -10488, -16438, -26858, -27259, -29346, -23210, -10787, -10735, -15075, -14269, -18024, -21021, -8455, 1771, 5707, -1779, -11292, -14403, -11126, -11340, -10348, -6587, -5507, -9152, -14781, -12024, -15159, -12466, -5089, 3308, 15706, 15938, 5168, 2603, 8570, 10860, 11607, 7815, 8636, 13372, 7063, -844, -4959, -12547, -15745, -13981, -11466, -12580, -22925, -29045, -22408, -10370, 3326, 6186, 8699, 263]
4274B63k977n340J417J1442R078n056m384J956m53q10N842l303l985n068k640
4259d018j2774j786N824L336J740o775k792m05o755O436J1114j446j742q473K153
4244a6363J1974m109l582p204N907M38M07k36M030o50q51M750n138k713l11J1380
4228b271r698l931M103j535k883K412M983k636k344q455p693K0974P855q529J96
4213i452p321j95J1185R541J900k418j3077p335j748k037J2904O144n629q825
4199a6363j3880l317J3016P752N238j1514j8360Q400J8731O958o775L309O916
4186A11Q088N424o075p848n024k838p421l051P385J0785J2968q268q467N101j468
4171e98j266j420K34J105J110l283l238J62j155m097j921J108j248J910q528j5470
$$ y = [263, -2714, -8054, -6637, 4805, 13883, 8827, 4443, 6399, 5946, 5136, 10978, 7675, 3690, -1378, -4018, -16792, -18578, -12754, -9418, -7678, -14453, -17245, -17650, -24405, -17969, -6855, -8301, -10043, -18516, -16363, -4389, -8498, -12080, -19284, -13377, -12939, -12532, -12768, -8738, -9388, -10239, -5489, -10627, -13340, -13651, -2271, -11969, -15900, -11797, -13332, -16215, -13803, -8820, -11456, -13800, -22255, -29948, -8974, -1119, -9648, -9452, -16773, -16968, -5783, 3758, 5658, 3240, -9837, -17172, -18920, -20957, -8053, -1909, -7538, -16363, -30243, -33560, -20544, -12792, -7554, -19068, -37428, -29028, -10297, -3339, -10114, -6805, 111, 8199, 13623, 7548, -300, -5324, -8162, -15583, -18634, -11249, -464, 12504, 4236, -4231, 870, -598, -1864, -3284, -3050, -1945, -835, -4118, -7356, -7194, -8349, -12446, -14367, -13259, -14507, -12597, -21125, -36595]
4155c6595J1408L471j885l662K242J0418P481L745Q04o943J152J1675j642j861
4141a92J666k726r515n900Q499Q706k838N973K04l52l781r00N021o620r669O3
4125a2361J3463J5953r443j1051n543p346N669M368K41o580p215Q812J2339P786
4111I092n763j4341p461l902K947K650j451n06N645L445J5014J364k93j5311Q60
4096h011J860l323j455L49N774L522n906n262J8637Q521j658K902m785l791q907
4081a533o836M039M773O33n949n99n176k446J0452O049K515J2923L632j440j1410
4066I627r614m853k191j008o693M529J1005R335L449j661j950j3109q258L862
4052g530M482K899P8k710N98M564n840r1O09k025N019K576j085m489q15R026N884
$$ y = [-36595, -25187, -21716, -23601, -27263, -25021, -14603, -7122, -3377, -2573, -9516, -8364, 3311, 1669, -192, 1474, -1252, -10767, -16667, -8168, 538, -2300, 3673, 3877, 3525, -256, -1156, 3865, -2755, -12424, -12361, 1102, 17055, 7612, -3439, -8982, -16328, -10659, -6291, -6050, -12630, -19845, -11033, 1306, 9092, 3329, -11012, -18473, -22375, -19428, -16778, -18229, -18735, -13090, -9645, 5369, 6733, 6440, -8871, -8011, -6151, -9474, -10929, -10580, -4806, -1284, -7190, -12452, 6185, 14706, 13048, 15950, 11165, 7374, -1533, -8369, -4330, 443, 1076, -4873, -5472, -10648, -13094, -2642, 3407, 5922, 18845, 22477, 21037, 9627, 13, -4840, -7031, -8039, -14732, -10203, 802, 10137, 13586, 11925, 9975, -3134, -11392, -7530, -3048, -149, -71, -2781, -2183, 2381, -3459, -3550, -2941, -4966, 53, 2629, 1544, -2945, -3760, 5266, 11150]
4035A1150K636o203q632N892J263J633M713P54n085l989l950l601m208J855O247
4020D75j1824r250J827J938R879R870L508r386j0115o682k821j138k802N216M261
4005a7044o485J2329R549O087l397j2606j185J3410O333K984r75k783m707J096
3991B606m264K217j663l515j179k423n530l926R50m243O507K358M24J0801J046
3976A66m020o0m72r555o714k624J2343P189K870p093Q11N665m248o284O078j611
3960g559m158R333J3623Q307n175l765l631n037o850k923O927j205L189k050K456
3945A482J66n917Q30r910j848P317M730K752j437%l471m202M880l183o887J597
3929a3101J12J5239j910j0597m533n045M609j236m62K567j371p69K431R949L403
$$ y = [11150, 13786, 7583, -1049, 4843, 6106, 7739, 12452, 13206, 8121, 4132, 182, -3419, -7627, -5772, 475, -11349, -20599, -18772, -16834, -6955, 2915, 6423, -2963, -13078, -19760, -22581, -23719, -26521, -21305, -17044, -23529, -11200, -1651, 4436, 1039, -11567, -12752, 658, 6991, 9975, 9000, 6217, 1510, 2606, -1658, 559, -1104, -4619, -5798, -8221, -13751, -17677, -16727, -20970, -14463, -12105, -11681, -880, 166, -3854, -3914, -4386, -13941, -20655, -23279, -10936, -3747, -877, -7970, -7159, -1494, -5742, -12026, -5948, -7559, -11717, -2384, 11239, 19546, 14371, 10606, 6975, 1938, -4912, -7835, -908, -2113, 1076, -974, 1482, 1648, -4269, -3439, -13349, -15197, -7880, -3150, -398, -1835, -1835, -5306, -9508, -4628, -7811, -14698, -13101, -12989, 2250, 340, -10257, -14790, -19835, -15226, -16462, -16924, -14357, -15728, -16497, -14066, -4117, -714]
3914g14P641l935Q98Q967k793j1666J666K551L23p745j235l187j50Q878R316j0254
3898a439q667K921j494K019p374J630M777J3086L197o665J264R00m545k223n81
3883c194J508J107n910P34L475J999K156n601L276N195M274j904m108j646K783
3868D144R48j824m359m007o028o586m262J759l334J1415J1477J508l226K394R662
3853I681j6381p273M90L912m293M860L649n034J021k830J840L898o62J262R430
3838C570J0294n143k433p908J937M485p46J433p787o005O117l902j5136j165R650
3823a2739O150q40N561o555l016P830J470m453k515j774p582L636N255N320J736
3808b516O410L638l471j969m097l265k303k980O190M823k811k310J556j462r26
$$ y = [-714, 6927, 2992, 3890, 12857, 10064, -1602, 64, 2615, 2938, -4807, -6042, -9229, -9379, -501, 8815, -1439, -10106, -7185, -8679, -6660, -14034, -12404, -7627, 5459, 8656, 1991, 3255, 4155, -390, -2613, -3194, -1686, -579, -6489, -5755, -2280, -281, 1875, -3726, -450, 4745, 9019, 7115, 3007, 1361, 4144, 5092, 3268, -1091, -5098, -11126, -17712, -21974, -20215, -23549, -12134, -657, 851, -2375, 19, 9681, -6700, -13973, -13483, -9571, -13864, -9004, -5355, -10389, -9368, -12198, -10358, -6460, -7122, -5860, 3570, 13864, 8721, 6288, -1620, 317, 4802, 4056, 5489, -2298, -8303, -2186, -6088, -21224, -22389, -12739, -6589, -7429, -1868, -8423, -11439, -3609, -2139, -6592, -9107, -10881, -18463, -14827, -9572, -4252, -2516, 3894, 7532, 4061, 2092, -2005, -5270, -7573, -10553, -4363, 460, -2351, -4661, -3105, -4567, -5493]
3793e493Q110L949j1451L598Q595O145L616l993p437l932P29n005p084Q214O548
3778E109m641l841j1260p74j817M571Q88N739P239l696m268j947q137j915K43
3763a8507M961L470L209J876K612N933q226J546m116J211K091k976Q624r112j3201
3748b0605Q33R587Q175J55q58p956k006O494N514Q902j4407j1537N78O797L850
3733f484l400k489q834k684o838J0899Q334j10M60N650k941k661N744m503j08
3718i965Q0n29n789k207J191k80k63K638M114J128J122M357j101J0454M434q347
3702A037n776l526l546K787n192n600P209K707k406m532M307O225m260j0735M08
3687b0893M830J6894K646q520m214o722n057P212Q119N97q86J550n691N392J1612
$$ y = [-5493, 2617, 6566, -4885, -1287, 7308, 13453, 17069, 13076, 5639, 1707, 2436, -2569, -9653, -1439, 5109, 468, -3373, -14633, -15407, -17224, -12653, -11765, -6026, 1213, -2483, -6751, -8698, -16835, -18750, -18507, -13546, -10076, -6867, -4991, -2379, 3554, -4672, -3126, -7242, -6031, -3940, -6916, 1708, -7404, -20605, -19772, -10185, -2010, -1855, -2713, -10669, -12675, -6181, -667, 8235, -6172, -17709, -17131, -10334, -6484, -9884, -12373, -21207, -23891, -30729, -19830, -11496, -11606, -11146, -5496, -8437, -11098, -5354, -9857, -9965, -9885, -10414, -16203, -18410, -17219, -17499, -17762, -15124, -11010, -9882, -8760, -4403, -5504, 4950, 9384, 1037, -4739, -8265, -11811, -9024, -14216, -19816, -12607, -9900, -12306, -16838, -12531, -6306, -10566, -21301, -20893, -16063, 831, 3477, -5043, -9257, -15979, -21036, -13824, -5705, -5108, -5994, -4444, -10135, -4743, 6869]
3672F869o351K202j0226j580J832l754M039K89k940k609o89O683J0091O261j740
3657H377q828l016J236L745l32o706K271Q80j0360K185J0818R65p674Q111O575
3642H247J330q204r178L88J019O907L976j2386JM740m740n032l511L060J1936
3627a447j0785Q92L510l983J972M323q82O579Q032M168n652P76k341j2373M10
3612f801O878q144l83K175m227M981O001p393m678j934L177m703M070l14J426
3597i869j965j094R822J0616J856j7418k4352m266J0443Q87r300M506J5755R714
3583d665m99j18n076Q470K797K80N245O530Q45j990r332o115j148R153L50L076
3567G803m795n124M143L990J1006N859j0607j2070r558l942k486M226K251J377
$$ y = [6869, 518, 2720, -7506, -9086, -7254, -11008, -6969, -6680, -9620, -12229, -12918, -6235, 3856, 10117, 8377, -451, -3467, -2231, 1514, 1182, -5524, -3253, -2373, -12733, -10548, 270, 1235, -6439, 1672, 8247, 9577, 1373, -7805, -7417, -6398, 509, 4485, -7901, -7900, -3160, -7900, -12932, -16443, -13383, -1447, -12232, -11340, -7830, -11813, -9841, -5518, -6400, 179, 8211, 12379, 6727, 7503, 5162, -7211, -6801, 77, -8067, -8450, -6275, -10502, -5521, 480, -6913, -11591, -13525, -10348, -15051, -10981, -11295, -9869, -11834, -12928, -3106, 7510, 9366, -8052, -32404, -36670, -26227, -25340, -34640, -30134, -14379, -4665, -5164, -5282, -10358, -1888, 909, 1189, 6434, 12964, 13809, 11819, 2487, -3628, -4776, 4377, 4727, 7803, 3008, -2116, 2027, 6017, 17023, 22882, 12275, 205, -9353, -13295, -15781, -11555, -9304, -7927]
3553g927q233l289M250J0894P99l757j474J3944n133n447P48L73L650J331k253
3538a524n451m446n284M391r46O19M570Q89k142j0287o792N265L597K024j579
3523a7096R419M044L690j50k348P23N184j305k64l000O26P20K56n903q12m40n909
3506a2565O059J2638l319j3832O838O011L755r590l675Q050K574j001m899K2L390
3491D56N104l040p679J793o925L067J2429L377j7516j0423O064Q734L163O94l999
3476d701o71K556N356K370K152o09m562n660j1710J613J6460J804m731p472L49
3461g456R9o278m819J93L976K725m962m697k06J4239N348N173p864l296Q639l064
3445b250o842p412O431P825o02k792K604o061k695N579p151j72N81P042m787L598
$$ y = [-7927, -16160, -19449, -15199, -4305, -3506, -7263, -8737, 5207, 74, -5373, -4625, -4252, -602, 729, -1524, -6975, -11421, -16705, -12314, -13260, -12641, -8071, -7182, -9324, -19611, -26403, -21138, -17541, -15517, -17096, -7677, -3633, 57, -93, -2441, -1718, 3466, 2161, 1897, -1103, -477, 243, 499, -5404, -6216, -6656, -12565, -6506, 6132, 2813, -11019, -4181, 1830, 5585, -4005, -7680, 370, 2944, 1943, -2956, -2934, 456, 5560, 2520, -5159, -3366, -10291, -7224, 5205, 8582, -8934, -19357, -13293, -4559, -1396, -702, -4701, -5372, -2816, 2540, 4910, 7062, 6453, 1891, -3769, -15479, -13866, 2594, 4398, -333, -7805, -7456, -7357, -13635, -18454, -18261, -14285, -11560, -16522, -21219, -21425, -7186, -1838, 3335, -4529, -7825, 814, -2250, -9092, -16504, -10073, -2248, -2850, -5642, -3038, -9099, -11794, -6215, -13366, -13538, -12957, -5915, -10702, -7104]
$$ [...]
##END NTUPLES=NMR SPECTRUM
##END=
