##TITLE=Analysis number 308386
Compound Code mo 01263
Project Code adrs
Chemist Name matrix
##JCAMPDX= 6.0         $$ Bruker NMR JCAMP-DX V2.0
##DATA TYPE= NMR SPECTRUM
##DATA CLASS= NTUPLES
##ORIGIN= Bruker BioSpin GmbH
##OWNER= NMR
$$ XWIN-NMR		Version 3.5
$$ Tue May 24 12:49:00 2005 GMT Daylight Time (UT+1h)  MAYBRIDGE\NMR@NMR_250MHZ
##.OBSERVE FREQUENCY= 250.131544655141
##.OBSERVE NUCLEUS= ^1H
##.ACQUISITION MODE= SIMULTANEOUS (DQD)
##.ACQUISITION SCHEME= undefined
##.AVERAGES= 16
##.DIGITISER RES= 18
##SPECTROMETER/DATA SYSTEM= dpx250
##.PULSE SEQUENCE= zg30
##.SOLVENT NAME= DMSO
##.SHIFT REFERENCE= (INTERNAL, DMSO, 0, 16.522)
##AUDIT TRAIL= $$ (NUMBER, WHEN, WHO, WHERE, WHAT)
$$ ##TITLE= Audit trail, XWIN-NMR		Version 3.5
$$ ##JCAMPDX= 5.01
$$ ##ORIGIN= Bruker BioSpin GmbH
$$ ##OWNER= NMR
$$ C:\u/data/dgb/nmr/ADRS/3430/pdata/1/auditp.txt
$$ ##AUDIT TRAIL=  $$ (NUMBER, WHEN, WHO, WHERE, WHAT)
(   1,<2005-05-24 12:48:40.87 +100>,<MAYBRIDGE\NMR>,<NMR_250MHZ>,
      <created by zg, POWCHK disabled, PULCHK disabled
       configuration hash MD5:
       62 19 C7 07 E1 42 D1 B7 37 6C 3D D0 77 39 F9 E6
       data hash MD5: 64K
       45 59 5E C8 BC CB DC 83 3B 8B 9C A5 21 1D AD B5>)
(   2,<2005-05-24 12:48:52.26 +100>,<MAYBRIDGE\NMR>,<NMR_250MHZ>,
      <Start of raw data processing
       ef LB = 0.3 FT_mod = 6 PKNL = 1 SI = 32K 
       data hash MD5: 32K
       40 6E 95 E6 C6 04 5B A1 6C 53 63 84 09 28 28 69>)
(   3,<2005-05-24 12:48:54.06 +100>,<MAYBRIDGE\NMR>,<NMR_250MHZ>,
      <apk 
       data hash MD5: 32K
       FB 0A 9F A2 B7 AF D3 CE 68 BA 5A 80 09 5B 04 C7>)
(   4,<2005-05-24 12:48:54.76 +100>,<MAYBRIDGE\NMR>,<NMR_250MHZ>,
      <abs ABSG = 5 
       data hash MD5: 32K
       B0 A0 F8 9E 04 D7 8A 8A 72 27 1A 17 BA 06 CC 30>)
$$ ##END=
$$ 
$$ hash MD5
$$ 26 3D 5B 4A B1 BA 7D 1C 63 ED 84 BA 67 14 FB 9B
##$RELAX= 
##$RELAX= 
##$RELAX= 
##$RELAX= 
##$RELAX= 
##$RELAX= 
##$RELAX= 
$$ Bruker specific parameters
$$ --------------------------
##$DU= <C:\u>
##$EXPNO= 3430
##$NAME= <ADRS>
##$PROCNO= 1
##$TYPE= <nmr>
##$USER= <dgb>
##$AMP= (0..31)
100 100 100 100 100 100 100 100 100 100 100 100 100 100 100 100 100 100 
100 100 100 100 100 100 100 100 100 100 100 100 100 100 
##$AQSEQ= 0
##$AQ_mod= 3
##$AUNM= <au_zg>
##$AUTOPOS= <28 >
##$BF1= 250.13
##$BF2= 250.13
##$BF3= 250.13
##$BF4= 250.13
##$BF5= 500.13
##$BF6= 500.13
##$BF7= 500.13
##$BF8= 500.13
##$BYTORDA= 1
##$CFDGTYP= 0
##$CFRGTYP= 5
##$CHEMSTR= <none>
##$CNST= (0..31)
1 1 145 1 1 1 1 1 1 1 1 1 1 1 1 1 1 1 1 1 1 1 1 1 1 1 1 1 1 1 1 1 
##$CPDPRG= <>
##$CPDPRG1= <>
##$CPDPRG2= <>
##$CPDPRG3= <>
##$CPDPRG4= <mlev>
##$CPDPRG5= <mlev>
##$CPDPRG6= <mlev>
##$CPDPRG7= <mlev>
##$CPDPRG8= <mlev>
##$CPDPRGB= <>
##$CPDPRGT= <>
##$D= (0..31)
0 1 0 0 0 0 0 0 0 0.06 0 0 0 0 0 0 0.0002 0 0 0 0 0 0 0 0 0 0 0 0 0 0 
0 
##$DATE= 1116935320
##$DBL= (0..7)
120 120 120 120 120 120 120 120 
##$DBP= (0..7)
150 150 150 150 150 150 150 150 
##$DBP07= 0
##$DBPNAM0= <>
##$DBPNAM1= <>
##$DBPNAM2= <>
##$DBPNAM3= <>
$$ [...]
##$SUBNAM7= <"">
##$SUBNAM8= <"">
##$SUBNAM9= <"">
##$SW= 20.6930455092707
##$SWIBOX= (0..15)
0 0 3 0 0 0 0 0 0 0 0 0 0 0 0 0 
##$SW_h= 5175.983436853
##$TD= 65536
##$TD0= 1
##$TE= 295.16
##$TE2= 300
##$TE3= 300
##$TEG= 300
##$TL= (0..7)
0 120 120 120 120 120 120 120 
##$TP= (0..7)
150 150 150 150 150 150 150 150 
##$TP07= 0
##$TPNAME0= <>
##$TPNAME1= <>
##$TPNAME2= <>
##$TPNAME3= <>
##$TPNAME4= <>
##$TPNAME5= <>
##$TPNAME6= <>
##$TPNAME7= <>
##$TPOAL= (0..7)
0.5 0.5 0.5 0.5 0.5 0.5 0.5 0.5 
##$TPOFFS= (0..7)
0 0 0 0 0 0 0 0 
##$TUNHIN= 0
##$TUNHOUT= 0
##$TUNXOUT= 0
##$USERA1= <user>
##$USERA2= <user>
##$USERA3= <user>
##$USERA4= <user>
##$USERA5= <user>
##$V9= 5
##$VALIST= <valist>
##$VCLIST= <CCCCCCCCCCCCCCC>
##$VD= 0
##$VDLIST= <DDDDDDDDDDDDDDD>
##$VPLIST= <PPPPPPPPPPPPPPP>
##$VTLIST= <TTTTTTTTTTTTTTT>
##$WBST= 1024
##$WBSW= 4
##$XGAIN= (0..3)
0 0 0 0 
##$XL= 0
##$YL= 0
##$YMAX_a= 327115
##$YMIN_a= -339279
##$ZGOPTNS= <>
##$ZL1= 120
##$ZL2= 120
##$ZL3= 120
##$ZL4= 120
##$ABSF1= 16.522
##$ABSF2= -4.171173
##$ABSG= 5
##$ABSL= 3
##$ALPHA= 0
##$AQORDER= 0
##$ASSFAC= 0
##$ASSFACI= 0
##$ASSFACX= 0
##$ASSWID= 0
##$AUNMP= <proc_1d>
##$AZFE= 0.1
##$AZFW= 0.1
##$BCFW= 0
##$BC_mod= 0
##$BYTORDP= 0
##$COROFFS= 0
##$CY= 12.5
##$DATMOD= 1
##$DC= 0
##$DFILT= <>
##$DTYPP= 0
##$F1P= 14.0000005364418
##$F2P= -0.99999901652339
##$FCOR= 0.5
##$FTSIZE= 32768
##$FT_mod= 6
##$GAMMA= 0
##$GB= 0
##$INTBC= 1
##$INTSCL= 1
##$ISEN= 128
##$LB= 0.3
##$LEV0= 0
##$LPBIN= 0
##$MAXI= 10000
##$MC2= 0
##$MEAN= 0
##$ME_mod= 0
##$MI= 0
##$NCOEF= 0
##$NC_proc= -4
##$NLEV= 6
##$NOISF1= 0
##$NOISF2= 0
##$NSP= 0
##$NTH_PI= 0
##$NZP= 0
##$OFFSET= 16.522
##$PC= 1
##$PHC0= -84.83057
##$PHC1= 6.734665
##$PH_mod= 1
##$PKNL= yes
##$PPARMOD= 0
##$PSCAL= 4
##$PSIGN= 0
##$REVERSE= no
##$SF= 250.13
##$SI= 32768
##$SIGF1= 0
##$SIGF2= 0
##$SINO= 400
##$SIOLD= 32768
##$SREGLST= <1H.DMSO>
##$SSB= 0
##$STSI= 32768
##$STSR= 0
##$SW_p= 5175.98343685301
##$SYMM= 0
##$S_DEV= 0
##$TDeff= 65536
##$TDoff= 0
##$TI= <Analysis number 999999
Compound Code 99
Book Reference 9
Project Code 9>
##$TILT= no
##$TM1= 0
##$TM2= 0
##$TOPLEV= 0
##$USERP1= <user>
##$USERP2= <user>
##$USERP3= <user>
##$USERP4= <user>
##$USERP5= <user>
##$WDW= 1
##$XDIM= 32768
##$YMAX_p= 285767316
##$YMIN_p= -230999
$$ End of Bruker specific parameters
$$ ---------------------------------
##NTUPLES= NMR SPECTRUM
##VAR_NAME=  FREQUENCY,     SPECTRUM/REAL,   SPECTRUM/IMAG
##SYMBOL=    X,             R,               I
##VAR_TYPE=  INDEPENDENT,   DEPENDENT,       DEPENDENT
##VAR_FORM=  AFFN,          ASDF,            ASDF
##VAR_DIM=   32768,         32768,           32768
##UNITS=     HZ,            ARBITRARY UNITS, ARBITRARY UNITS
##FACTOR=    0.157963299565203, 1,           1
##FIRST=     4132.6476996994, 0,             0
##LAST=      -1043.33573715361, 0,           0
##MIN=       -1043.33573715361, -230999,     0
##MAX=       4132.6476996994, 285767316,     0
$$ Real data points
##PAGE= N=1
##DATA TABLE= (X++(R..R)), XYDATA
$$ [...]
$$ plain form
24382 -40576 -58937 -91277 -27258 -23305 23878 46259 84101 85347 79210 43968 3032 -33648
24370 -33648 -39861 -68299 -93972 -104593 -112148 -52986 -83077 -81984 -17449 5713 2981 10490 68469
24357 68469 136577 158456 105032 35118 -21904 -53833 -53542 -96100 -154679 -158586 -88717 38928
24345 38928 53382 -4646 -36896 -19601 13796 89667 101119 114899 110098 3732 -92254 -31178
24333 -31178 -17900 28057 -23428 -40966 -38580 -80745 -108114 -82794 -124404 -116738 -105431 -22009
24321 -22009 53637 38988 18726 19322 23278 24583 4789 53100 45922 25601 50934 79647 41438
24308 41438 -5466 26718 36890 47082 54629 38392 -51165 -73283 -25096 14754 15184 -977
24296 -977 -50999 -7302 15888 -8293 -55419 1199 14221 -48191 -80667 -79012 -43903 6157
$$ packed form
24382d0576j8361l2340O4019L953M7183K2381L7842J246o137l5242m0936l6680
24370c3648o213k8438k5673j0621p555N9162l0091J093O4535K3162k732P509N7979
24357F8469O8108K1879n3424o9914n7022l1929K91m2558n8579l907O9869J27645
24345C8928J4454n8028l2250J7295L3397P5871J1452J3780m801j06366r5986O1076
24333c1178J3278M5957n1485j7538K386m2165k7369K5320m1610P666J1307Q3422
24321b2009P5646j4649k0262N96L956J305j9794M8311p178k0321K5333K8713l8209
24308D1438m6904L2184J0172J0192P547j6237q9557k2118M8187L9850M30j6161
24296i77n0022M3697K3190k4181m7126N6618J3022o2412l2476J655L5109N0060
$$ plain form
24284 6157 47934 37605 17372 -2785 5725 55475 83681 39689 25100 -16546 4958 80230
24272 80230 68440 78192 32916 292 34287 7154 13841 21062 23131 28220 2631 -6396 13113
24259 13113 61307 72925 6528 -46340 -49564 -43471 7331 6752 29597 -17309 -84472 -27075
24247 -27075 4096 -27698 -29286 22285 26654 -29840 -2618 -14077 8398 -7434 -48241 -29533
24235 -29533 -54104 -67604 7903 86530 123080 53975 23405 38901 42103 -41466 -41707 4751
24223 4751 32947 12295 -29255 -43571 -36758 -29960 -3608 36067 58139 702 -44037 -62861
24211 -62861 -63434 -77387 -39996 -2619 -28358 28822 -44416 -67600 -25281 -24785 31004 -1265
24199 -1265 -58531 -156301 -167296 -99795 -28643 -30149 -61406 -35598 -8332 -13727 -28580 17061
$$ packed form
24284F157M1777j0329k0233k0157Q510M9750K8206m3992j4589m1646K1504P5272
24272H0230j1790R752m5276l2624L3995k7133O687P221K069N089k5589r027J9509
24259A3113M8194J1618o6397n2868l224O093N0802n79K2845m6906o7163N7397
24247b7075L1171l1794j588N1571M369n6494K7222j1459K2475j5832m0807J8708
24235b9533k4571j3500P5507P8627L6550o9105l0570J5496L202q3569k41M6458
24223D751K8196k0652m1550j4316O813O798K6352L9675K2072n7437m4739j8824
24211f2861n73j3953L7391L7377k5739N7180p3238k3184M2319M96N5789l2269
24199a265n7266r7770j0995O7501P1152j506l1257K5808K7266n395j4853M5641
$$ plain form
24187 17061 -4527 -4710 -24963 -39419 -6160 -32444 15657 31825 64054 84954 57900 -3742
24175 -3742 -36043 36492 88963 103283 67863 83684 76301 45628 32142 -33321 -94506 -134721
24163 -134721 -95846 -149792 -154385 -131372 -131206 -117300 -89225 -81214 -75295 -26794 -25360 -15715 -2039
24150 -2039 -10867 -2746 34938 99542 91681 11709 -38762 -10432 -3071 15309 36634 -2681 2603
24137 2603 -15948 -38310 -48284 1331 52880 62758 86016 58774 2728 12613 1311 19537
24125 19537 28745 46554 41845 35886 46727 56755 13235 -26045 -38655 -51692 -95015 -89397
24113 -89397 -68549 -58120 -61283 -46844 183 25535 19767 -35933 -65779 -34095 -53560 -74649
24101 -74649 -32996 29494 46721 48328 32560 -15353 -87870 -109780 -78145 -23356 -9879 -29341
$$ packed form
24187A7061k1588j83k0253j4456L3259k6284M8101J6168L2229K0900k7054o1642
24175c742l2301P2535N2471J4320l5420J5821p383l0673j3486o5463o1185m0215
24163a34721L8875n3946m593K3013J66J3906K8075Q011N919M8501J434R645J3676
24150b039q828Q121L7684O4604p861p9972n0471K8330P361J8380K1325l9315N284
24137B603j8551k2362r974M9615N1549R878K3258k7242n6046R885j1302J8226
24125A9537R208J7809m709n959J0841J0028m3520l9280j2610j3037m3323N618
24113h9397K0848J0429l163J4439M7027K5352n768n5700k9846L1684j9465k1089
24101g4649M1653O2490J7227J607j5768m7913p2517k1910L1635N4789J3477j9462
$$ plain form
24089 -29341 -78336 -66290 -50075 -57096 -85677 -59218 7097 -40327 -37256 -10868 20573 32903
24077 32903 28552 57890 94409 77453 50960 -20083 -49136 -13786 35489 31376 34871 -37319
24065 -37319 -15821 11067 19495 7194 4442 -19533 5972 -3278 17272 71290 46542 -336
24053 -336 4905 -56180 -54854 -36298 -99576 -94719 -110214 -89609 -65870 -60064 10667 20049 -13375
24040 -13375 -41107 -60518 -25929 8226 41754 14135 -19377 -75005 -37185 20605 61013 63435
24028 63435 52646 64426 71900 53337 -53148 -84556 -31818 3903 8332 -13866 -39195 -46117
24016 -46117 -134023 -114223 -62423 -34076 -15497 23467 15549 -5399 44467 83483 56534 30509
24004 30509 33080 31451 -34703 -32321 -23526 9108 5178 1253 1783 -71000 -60559 -49089 -45005
$$ packed form
24089b9341m8995J2046J6215p021k8581K6459O6315m7424L071K6388L1441J2330
24077C2903m351K9338L6519j6956k6493p1043k9053L5350M9275m113L495p2190
24065c7319K1498K6888Q428j2301k752k3975K5505r250K0550N4018k4748m6878
24053c36N241o1085J326J8556o3278M857j5495K0605K3739N806P0731R382l3424
24040a3375k7732j9411L4589L4155L3528k7619l3512n5628L7820N7790M0408K422
24028F3435j0789J1780P474j8563j06485l1408N2738L5721M429k2198k5329o922
24016d6117q7906J9800N1800K8347J8579L8964p918k0948M9866L9016k6949k6025
24004C0509K571j629o6154K382Q795L2634l930l925N30p2783J0441J1470M084
$$ plain form
23991 -45005 -54064 -122347 -106936 -58857 -7849 16006 -20489 -69547 -61373 -65235 -115425 -68142
23979 -68142 17421 48874 86211 87381 65246 36648 -53775 -135422 -128212 -102480 -116077 -118978
23967 -118978 -101049 -48085 28424 40973 60043 17465 -10687 21575 55056 28010 -9415
23956 -9415 13310 71979 40550 -6205 -27588 -18156 23128 44971 68219 88517 104646 93855
23944 93855 64107 71907 113949 151522 117871 69544 80961 57577 47263 804 -23670 -23314
23932 -23314 -43913 -41285 -44939 -43621 26536 36779 37166 12423 -8522 6669 50341 -25883 -49943
23919 -49943 -36278 -46974 -94772 -127322 -129003 -70861 -87171 -74543 -31173 -57843 -64382 -54997
23907 -54997 -13027 -13788 -46458 -65620 -84843 -93531 -30125 51274 37975 -33264 -57713 -5917
$$ packed form
23991d5005r059o8283J5411M8079N1008K3855l6495m9058Q174l862n0190M7283
23979f8142Q5563L1453L7337J170k2135k8598r0423q1647P210K5732j3597k901
23967a18978J7929N2964P6509J2549J9070m2578k8152L2262L3481k7046l7425
23956i415K2725N8669l1429m6755k1383R432M1284K1843K3248K0298J6129j0791
23944I3855k9748P800M2042L7573l3651m8327J1417k3384j0314m6459k4474L56
23932b3314k0599K628l654J318P0157J0243L87k4743k0945J5191M3672p6224k4060
23919d9943J3665j0696m7798l2550j681N8142j6310J2628M3370k6670o539R385
23907e4997M1970p61l2670j9162j9223q688O3406Q1399j3299p1239k4449N1796
$$ plain form
23895 -5917 67736 87534 94106 96535 126098 121657 65982 51481 42927 18537 1739 57829 58431
23882 58431 18283 -32376 -26396 -39905 -16800 -13757 -3473 50066 82819 32535 -26068 -12365
23870 -12365 -3006 -8446 -14634 11161 7297 2906 -5394 -22531 -25399 13069 5967 -32179 -19390
23857 -19390 -10339 -39653 -57561 -50426 -82586 -77881 -14129 7571 -21020 -23771 -64833 -74521 -17699
23844 -17699 7498 6016 -52301 -70643 -46291 -82974 -79180 -4467 5578 -21044 -76857 -110031
23832 -110031 -121482 -62009 -12464 38375 57364 30265 51959 25777 -3779 -14825 -26386
23821 -26386 -34793 17774 13291 11372 40963 25850 44616 45638 53595 35749 -272 8173 -2164
23808 -2164 -93377 -170118 -103095 -56273 6529 35868 -22524 -64708 -31718 18930 -18337 -54396
$$ packed form
23895e917P3653J9798O572K429K9563m441n5675j4501q554k4390j6798N6090O02
23882E8431m0148n0659N980j3509K3105L043J0284N3539L2753n0284n8603J3703
23870a2365R359n440o188K5795l864m391q300j7137k868L8468p102l8146J2789
23857a9390R051k9314j7908P135l2160M705O3752K1700k8591k751m1062r688N6822
23844a7699K5197j482n8317j8342K4352l6683L794P4713J0045k6622n5813l3174
23832a10031j1451N9473M9545N0839J8989k7099K1694k6182k9556j1046j1561
23821b6386q407N2567m483j919K9591j5113J8766J022P957j7846l6021Q445j0337
23808b164r1213p6741O7023M6822O2802K9339n8392m2184L2990N0648l7267l6059
$$ plain form
23796 -54396 -39486 67613 96564 99806 53667 40440 5926 6065 26151 3112 -23634 -46100
23784 -46100 -62386 -20550 -19927 -3493 25344 6349 -52326 -23990 3115 7080 -14824 -2273
23772 -2273 17951 -24117 -41882 -15736 11508 4936 -14278 -24522 -18440 26666 71407 132371
23760 132371 75062 -35206 -51856 -54399 -59692 -91347 -86174 -34896 -42549 -66943 -82922 -1978
23748 -1978 32260 83729 131072 99717 31479 -21083 -49474 -37462 -56902 -74309 -85332 -70015
23736 -70015 -9408 19773 36516 27537 -12396 -24056 -68889 -50149 -13118 -16516 -11113 -6901
23724 -6901 -2455 -39130 -63387 -87585 -98211 -34047 69889 79344 33204 -29235 -39128 3866
23712 3866 22735 9158 -37144 -33242 -24726 -14851 6945 -19296 -19813 -26086 -38453 3873 44475
$$ packed form
23796e4396J4910J07099K8951L242m6139j3227l4514J39K0086k3039k6746k2466
23784d6100j6286M1836O23J6434K8837j8995n8675K8336K7105L965k1904J2551
23772b273K0224m2068j7765K6146K7244o572j9214j0244O082M5106M4741O0964
23760A32371n7309j10268j6650k543n293l1655N173N1278p653k4394j5979Q0944
23748a978L4238N1469M7343l1355o8238n2562k8391J2012j9440j7407j1023J5317
23736g0015O0607K9181J6743q979l9933j1660m4833J8740L7031l398N403M212
23724f901M446l6675k4257k4198j0626O4164J03936R455m6140o2439r893M2994
23712C866J8869j3577m6302L902Q516R875K1796k6241n17o273j2367M2326M0602
$$ plain form
23699 44475 -8594 53724 66498 16207 -10304 -61061 -45572 -1597 -23458 -29244 -17437 -16417
23687 -16417 -16983 8100 18016 9984 2291 -17443 -40120 -34941 -31009 16392 38407 1158 -49602
23674 -49602 -38305 -33389 14027 61033 82815 23869 -31554 -9282 46760 50802 17883 -4464
23662 -4464 6301 29271 26696 36467 -6239 -13357 18604 56363 45292 3061 10979 24373 7588
23649 7588 13320 13443 19466 34122 9351 -25043 -87798 -43753 52435 63926 41619 52716 52466
23636 52466 44391 4312 -29295 -50817 -49394 -1531 -43049 -107495 -118167 -96540 -123339 -97366
23624 -97366 -80071 -74990 -66066 -48422 -50256 -73297 -62685 -7614 4208 96 24972 60785
23612 60785 47602 -469 36800 62430 55871 56567 30763 70931 96668 69207 50199 75803
$$ packed form
23699D4475n3069O2318J2774n0291k6511n0757J5489M3975k1861n786J1807J020
23687a6417n66K5083R916q032p693j9734k2677N179L932M7401K2015l7249n0760
23674d9602J1297M916M7416M7006K1782n8946n5423K2272N6042M042l2919k2347
23662d464J0765K2970k575R771m2706p118L1961L7759j1071m2231P918J3394j6785
23649G588N732J23O023J4656k4771l4394o2755M4045R6188J1491k2307J1097k50
23636E2466q075m0079l3607k1522J423M7863m1518o4446j0672K1627k6799K5973
23624i7366J7295N081Q924J7644j834k3041J0612N5071J1822m112K4876L5813
23612F0785j3183m8071L7269K5630o559O96k5804M0168K5737k7461j9008K5604
$$ plain form
23600 75803 70120 591 -16625 -7601 -12544 71395 143184 143214 119470 57814 15934 19874 20718
23587 20718 1371 -18890 -51870 -97500 -122647 -33266 53715 89715 65687 -15943 -56002 -87640
23575 -87640 -99871 -116401 -54230 -59734 -32815 -32835 -37793 15975 -15098 -34587 30002 31982 -5330
23562 -5330 -38753 -62463 -46269 -11487 22783 81091 131032 66166 55508 73968 2205 3127
23550 3127 12739 13350 -5708 -34281 -52633 -50976 -42504 -39899 -53009 -28813 -34172 -33662 -20007 27396
23536 27396 28269 20795 43335 12289 -84555 -125313 -124623 -105506 -82381 -142043 -173332 -186511 -169855
23523 -169855 -144538 -54287 -50978 -59024 -85374 -128473 -123912 -64487 -52996 -22654 25924 21237
23511 21237 1094 -3484 21753 38571 35482 -34395 -85274 -116689 -129198 -53177 19247 25265
$$ packed form
23600G5803n683o9529j7216R024m943Q3939P1789L0k3744o1656m1880L940Q44
23587B0718j9347k0261l2980m5630k5147Q9381Q6981L6000k4028q1630m0059l1638
23575h7640j2231j6530O2171n504K6919k0m958N3768l1073j9489O4589J980l7312
23562e330l3423k3710J6194L4782L4270N8308M9941o4866j0658J8460p1763R22
23550C127R612O11j9058k8573j8352J657Q472K605j3110K4196n359N10J3655M7403
23536B7396Q73p474K2540l1046r6844m0758O90J9117K3125n9662l1289j3179J6656
23523a69855K5317R0251L309q046k6350m3099M561N9425J1491L0342M8578m687
23511B1237k0143m578K5237J6818l089o9877n0879l1415j2509P6021P2424O018
$$ plain form
23499 25265 26001 29771 65460 79427 36480 3067 16806 51758 42622 56640 82363 118141
23487 118141 115217 64292 18367 24042 25888 38776 41391 68415 44801 26609 -2000 9579
23475 9579 66333 114121 8985 -40733 -29397 -100954 -32488 44702 45470 -12314 -33883 26505
23463 26505 -555 -60082 -75412 -58168 -15681 36446 31927 17058 37480 87763 36670 16100
23451 16100 -6243 -51064 -40894 -3906 -40005 -63482 -37905 -2948 34169 29628 7222 -55700
23439 -55700 -96776 -92085 -131361 -124126 -31292 237 31954 64587 30985 22094 9423 -17422
23427 -17422 -28350 -65458 -107233 -82055 -89107 -52619 35503 74979 59219 38870 18739 -49552
23415 -49552 -24605 1207 18543 -19915 13869 22521 21731 33791 28414 31461 16176 -13074 2080
$$ packed form
23499B5265P36L770L5689J3967m2947l3413J3739L4952r136J4018K5723L5778
23487A18141k924n0925m5925N675J846J2888K615K7024k3614j8192k8609J1579
23475I579N6754M7788j05136m9718J1336p1557O8466P7190P68n7784k1569O0388
23463B6505k7060n9527j5330J7244M2487N2127m519j4869K0422N0283n1093k0570
23451A6100k2343m4821J0170L6988l6099k3477K5577L4957L7117m541k2406o2922
23439e5700m1076M691l9276P235R2834L1529L1717L2633l3602q891j2671k6845
23427a7422j0928l7108m1775K5178p052L6488Q8122L9476j5760k0349k0131o8291
23415d9552K4947K5812J7336l8458L3784Q652p90J2060n377L047j5285k9250J5154
$$ plain form
23402 2080 -23395 -26711 -1981 3937 21570 36807 -470 19193 14758 -54376 -43789 11561
23390 11561 56473 44340 -2168 37798 -19030 -119892 -120870 -28943 -4007 -29197 -34384 -9530
23378 -9530 27366 7733 -24505 -48293 -20612 -4166 42136 75320 64993 48790 -37994 -82598
23366 -82598 -57387 -30745 -51804 -98257 -83450 -47079 -50181 -37261 13470 72598 11812 -48753
23354 -48753 -52752 -35016 -49421 -48894 -61229 -33490 -41024 -34005 -65784 -110559 -119638 -133865 -139239
23341 -139239 -104252 -39070 11165 46527 39778 49388 9562 -65063 -108065 -94870 -138937 -97384
23329 -97384 -40573 -19360 -12787 -26356 -60897 -97837 -28867 -14463 -25351 -17466 -7945 2310
23317 2310 -76273 -96597 -48376 -17315 -31037 -69766 -65543 -20382 33460 93932 136912 127155
$$ packed form
23402B080k5475l316K4730N918J7633J5237l7277J9663m435o9134J0587N5350
23390A1561M4912j2133m6508L9966n6828j00862r78R1927K4936k5190n187K4854
23378i530L6896j9633l2238k3788K7681J6446M6302L3184j0327j6203q6784m4604
23366h2598K5211K6642k1059m6453J4807L6371l102J2920N0731N9128o0786o0565
23354d8753l999J7736j4405N27j2335K7739p534P019l1779m4775r079j4227n374
23341a39239L4987O5182N0235L5362o749R610l9826p4625m3002J3195m4067M1553
23329i7384N6811K1213O573j3569l4541l6940O8970J4404j0888P885R521J0255
23317B310p8583k0324M8221L1061j3722l8729M223M5161N3842O0472M2980r757
$$ plain form
23305 127155 60599 60612 107083 39778 -36098 -44616 -54210 -20314 27543 -19464 7196 6682 -17250
23292 -17250 9680 19816 23313 38489 58690 73666 36362 -31837 -23274 -42361 -63517 -89266
23280 -89266 -65205 4512 70785 81649 78515 8106 2390 42787 34053 -8019 -64399 -53812
23268 -53812 -43937 -12876 -15263 -57301 -54335 16454 18659 -36341 -24468 -59556 -9881 -3515 8616
23255 8616 57451 25924 24921 45922 51199 18737 -7873 -24662 -51731 -23979 -5230 -32923
23243 -32923 -59986 -69571 -64030 -6464 29698 51154 -16856 15990 611 -23786 -8812 7476
23231 7476 5364 10755 39841 38694 3031 -28455 -34819 -43349 -80719 -116758 -123361 -90861 -63411
23218 -63411 -36878 -73642 -79909 -56123 -15994 -25305 -26944 -4155 14250 18589 46597 33796
$$ packed form
23305A27155o6556J3M6471o7305p5876q518r594L3896M7857m7007K6660n14k3932
23292a7250K6930J0136L497J5176K0201J4976l7304o8199Q563j9087k1156k5749
23280h9266K4061O9717O6273J0864l134p0409n716M0397q734m2072n6380J0587
23268e3812R875L1061k387m2038K966P0789K205n5000J1873l5088M9675O366J2131
23255H616M8835l1527j003K1001N277l2462k6610j6789k7069K7752J8749k7693
23243c2923k7063r585N541N7566L6162K1456o8010L2846j5379k4397J4974J6288
23231G476k112N391K9086j147l5663l1486o364q530l7370l6039o603L2500K7450
23218f3411K6533l6764o267K3786M0129r311j639K2789J8405M339K8008j2801
$$ plain form
23206 33796 -27676 13144 2343 4617 -33655 -34953 1686 34358 -42243 -95680 -124733 -123335
23194 -123335 -86680 -11254 33871 -15311 -104342 -70946 -44899 -64527 -75295 -126980 -48277
23183 -48277 -6018 3538 -46555 -19744 -52599 -58992 -77466 -100281 -75073 -54420 -51680 -89532
23171 -89532 -88545 -117623 -122947 -58979 -60103 -45726 -18885 -2564 48560 72485 3987 11857 35436
23158 35436 99076 118629 48784 3805 -8332 9446 -7506 -22254 -28386 8508 18467 24233
23146 24233 7975 -10319 -18669 48821 25353 66729 110365 108053 92583 55868 25394 2551
23134 2551 37197 69999 149382 214151 315487 463883 590795 768877 1002984 1170059 1088226
23123 1088226 880738 727123 621755 521820 375563 248662 216778 214225 184242 155806
$$ packed form
23206C3796o1472M0820j0801K274l8272j298L6639L2672p6601n3437k9053J398
23194a23335L6655P5426M5125m9182q9031L3396K6047j9628j0768n1685P8703
23183d8277M2259R556n0093K6811l2855o393j8474k2815K5208K0653K740l7852
23171h9532R87k9078n324O3968j124J4377K6841J6321N1124K3925o8498P870K3579
23158C5436O3640J9553o9845m4979j2137J7778j6952j4748o132L6894R959N766
23146B4233j6258j8294q350O7490k3468M1376M3636k312j5470l6715l0474k2843
23134B551L4646L2802P9383O4769J01336J48396J26912J78082K34107J67075q1833
23123A088226k07488j53615j05368r9935j46257j26901l1884k553k9983k8436
$$ plain form
23113 155806 120179 101275 96004 80944 3954 -19489 60189 119750 137241 101975 80869 39560
23101 39560 15648 64680 98370 19505 -39630 -30612 15143 42748 -36319 -39055 -7703 -44646
23089 -44646 -49439 -88851 -93803 -73328 -90261 -120574 -64550 -85351 -84198 -34191 -3550 41913
23077 41913 43309 30036 -67172 -117349 -117854 -82996 -17489 -47746 -153621 -177854 -101396 -82429
23065 -82429 -74531 -52241 -2244 -54409 -94284 -126384 -155165 -106094 -78489 -96364 -79532 -50599
23053 -50599 -21703 19034 74659 84653 110982 112597 92132 125937 99957 9971 -15283 5714
23041 5714 40269 38981 -25044 -32861 -38276 -21173 79219 105900 70386 53743 -24770 -33801
23029 -33801 19504 -7547 -84870 -107349 -95946 -51678 -884 -7182 -69923 -95046 -104779 -27785
$$ packed form
23113A55806l5627j8904n271j5060p6990k3443P9678N9561J7491l5266k1106m1309
23101C9560k3912M9032L3690p8865n9135R018M5755K7605p9067k736L1352l6943
23089d4646m793l9412m952K0475j6933l0313N6024k0801J153N0007L0641M5463
23077D1913J396j3273r7208n0177n05L4858O5507l0257j05875k4233P6458J8967
23065h2429P898K2290M9997n2165l9875l2100k8781M9071K7605j7875J6832K8933
23053e0599K8896M0737N5625R994K6329J615k0465L3805k5980q9986k5254K0997
23041E714L4555j288o4025p817n415J7103J00392K6681l5514j6643p8513r031
23029c3801N3305k7051p7323k2479J1403M4268N0794o298o2741k5123r733P6994
$$ plain form
23017 -27785 68962 38165 -49779 -100987 -74263 -109676 -105671 -83842 -89497 -72437 -26552 -33772
23005 -33772 -75173 -30868 -16011 -27444 -48491 -55764 -73072 -27687 46817 32330 -5354 -49627
22993 -49627 -38564 25132 29677 8756 -22630 -4327 -38827 -98312 -119317 -55634 31673 93088
22981 93088 158148 182499 145713 75572 18046 -47244 -67394 -47106 -38408 -35461 -18233 3133
22969 3133 -39900 -28905 13381 105305 108190 66349 43843 81262 25417 -43045 -18433 -63176
22957 -63176 -83622 -77679 -49803 -2733 -5304 50563 39336 14655 18361 53176 37450 29556
22945 29556 -46304 -63916 -29108 -15066 -2175 -13801 24501 49734 33998 -27143 45367 49193
22933 49193 -8799 -61329 -121289 -70388 -10281 -385 -2172 -3076 -31081 -64942 -92299 -109029
$$ packed form
23017b7785R6747l0797q7944n1208K6724l5413M005K1829n655J7060M5885p220
23005c3772m1401M4305J4857j1433k1047p273j7308M5385P4504j4487l7684m4273
22993d9627J1063O3696M545k0921l1386J8303l4500n9485k1005O3683Q7307O1415
22981I3088O5060K4351l6786p0141n7526o5290k0150K0288Q698K947J7228K1366
22969C133m3033J0995M2286R1924K885m1841k2506L7419n5845o8462K4612m4743
22957f3176k0446N943K7876M7070k571N5867j1227k4681L706L4815j5726p894
22945B9556p5860j7612L4808J4042J2891j1626L8302K5233j5736o1141P2510L826
22933D9193n7992n2530n9960N0901O0107R896j787r04k8005l3861k7357j6730
$$ plain form
22921 -109029 -108648 -140496 -213388 -181698 -108869 -105294 -92806 -33914 40220 -1108 -32718 -24520
22909 -24520 36566 65533 86282 76222 86784 67936 83632 95688 49086 52020 28595 -1851
22897 -1851 -4982 -5743 42986 52300 47653 39954 -12399 -24222 -22472 -5651 20545 17710 -15333
22884 -15333 368 -36375 -67293 -32314 -37511 -82982 -68550 -30284 -1523 58431 42836 32272
22872 32272 -18836 -86754 -75301 23849 25348 -4761 7494 59417 79714 63162 -25186 -108268
22860 -108268 -138390 -109450 -74012 -39375 -32517 -8785 31157 31634 -9326 40353 40320 2964 -20631
22847 -20631 -46262 -33576 -26811 -16603 52772 60031 60392 58694 46254 63140 60045 -6965 -50177
22834 -50177 -34755 -36213 -46897 -22031 14081 48241 65666 60004 21365 42892 83751 115937
$$ packed form
22921a09029L81l1848p2892L1690P2829L575J2488N8892P4134m1328l1610Q198
22909b4520O1086K8967K0749j0060J0562j8848J5696J2056m6602K934k3425l0446
22897a851l131p61M8729R314m647p699n2353j1823J750J6821K6196k835l3043
22884a5333J5701l6743l0918L4979n197m5471J4432L8266K8761N9954j5595j0564
22872C2272n1108o7918J1453R9150J499l0109J2255N1923K0297j6552q8348q3082
22860a08268l0122K8940L5438L4637O858K3732L9942M77m0960M9679l3l7356k3595
22847b0631k5631J2686O765J0208O9375P259L61j698j2440J6886l095o7010m3212
22834e0177J5422j458j0684K4866L6112L4160J7425n662l8639K1527M0859L2186
$$ plain form
22822 115937 147868 129163 103563 81554 81816 56522 76606 54679 31220 27834 65506 101013
22810 101013 101498 144317 121516 99821 51682 50711 53928 35076 42478 87214 104390 126298 139132
22797 139132 104655 80484 41677 65220 66277 54630 43268 -60577 -82346 -51236 -16812
22786 -16812 -6974 17973 -7559 -58814 -107410 -106278 -58604 -50458 -102753 -73963 -54510 -83668
22774 -83668 -63198 -25702 -2373 -13077 -10687 11533 -8639 -63914 -70746 -100810 -93919 -64878
22762 -64878 -69948 -20152 71910 26905 -55289 -21244 -43202 -65937 -44668 -40039 -76545 -87501
22750 -87501 -115995 -116097 -108566 -36104 27965 29644 14016 2720 32765 74960 93708 76737
22738 76737 79907 64706 45962 23001 43760 50671 68501 53591 35940 15865 45637 27075
$$ packed form
22822A15937L1931j8705k5600k2009K62k5294K0084k1927k3459l386L7672L5507
22810A01013M85M2819k2801k1695m8139r71L217j8852P402M4736J7176K1908J2834
22797A39132l4477k4171l8807K3543J057j1647j1362j03845k1769L1110L4424
22786a6812R838K4947k5532n1255m8596J132M7674Q146n2295K8790J9453k9158
22774h3668K0470L7496K3329j0704K390K2220k0172n5275o832l0064O891K9041
22762f4878n070M9796R2062m5005q2194L4045k1958k2735K1269M629l6506j0956
22750h7501k8494j02P531P2462O4069J679j5628j1296L0045M2195J8748j6971
22738G6737L170j5201j8744k2961K0759O911J7830j4910j7651k0075K9772j8562
$$ plain form
22726 27075 -4977 -15612 -31643 -48662 -57363 -72795 5959 51400 -21645 -67167 -12738 45768
22714 45768 -19110 -24148 33211 48965 45217 5209 -33667 -15263 -4567 8152 78427 94819
22702 94819 88779 127968 166100 212545 237393 304729 350231 299910 203711 142661 177412 289233
22690 289233 396368 444146 519588 601270 659651 658424 610080 551586 556623 565715 539843 435570
22678 435570 327155 229928 190511 155434 181164 206842 243990 268019 259579 257444 240298 253050
22666 253050 308019 311848 277268 224314 226155 217516 182794 152994 177210 167681 128624 88046
22654 88046 141389 198942 196594 190643 230798 285642 339307 460303 662466 941368 1274154
22643 1274154 1569790 1749555 1718018 1443818 1193467 953351 699569 518610 390937 371642
$$ packed form
22726B7075l2052j0635j6031j7019q701j5432P8754M5441p3045m5522N4429N8506
22714D5768o4878n038N7359J5754l748m0008l8876J8404J0696J2719P0275J6392
22702I4819o040L9189L8132M6445K4848O7336M5502n0321r6199o1050L4751J11821
22690B89233J07135M7778P5442Q1682N8381j227m8344n8494N037R092k5872j04273
22678D35570j08415r7227l9417l5077K5730K5678L7148K4029q440k135j7146J2752
22666B53050N4969L829l4580n2954J841q639l4722k9800K4216r529l9057m0578
22654H8046N3343N7553k348n951M0155N4844N3665J20996K02163K78902L32786
22643A274154K95636J79765l1537k74200k50351k40116k53782j80959j27673j9295
$$ plain form
22633 371642 353582 328375 290784 261265 307426 322387 310027 306698 328702 333555 352750 401998
22621 401998 480250 447953 368065 349177 371018 401646 398230 417922 446104 455761 440924 440226
22609 440226 457923 574351 778961 981084 1095742 1198733 1202115 1149925 1059630 1040513 1067074
22598 1067074 1110572 1174044 1222569 1274735 1332355 1400490 1557267 1737573 1886673 1958846 2165846
22587 2165846 2431423 2758412 3129390 3559348 4060340 4704549 5492511 6446411 7749096
22578 7749096 9477409 11808710 15013191 19489637 26003041 36257864 54128184 86269205
22570 86269205 139056480 205271978 262232981 285767316 260913834 204933945 147177285
22563 147177285 102132133 71131479 50759042 37157384 27710032 21054509 16290124
$$ packed form
22633C71642j8060k5207l7591k9519M6161J4961j2360l329K2004M853J9195M9248
22621D01998P8252l2297p9888j8888K1841L0628l416J9692K8182R657j4837o98
22609D40226J7697J16428K04610K02123J14658J02991L382n2190r0295j9117K6561
22598A067074M3498O3472M8525N2166N7620O8135J56777J80306J49100P2173K07000
22587B165846K65577L26989L70978M29958N00992O44209P87962R53900J302685
22578G749096J728313K331301L204481M476446O513404J0254823J7870320L2141021
22570H6269205N2787275O6215498N6961003K3534335k4853482n5979889n7756660
22563A47177285m5045152l1000654k0372437j3601658r447352o655523m764385
$$ plain form
22556 16290124 12884145 10354217 8475928 7102312 6034446 5211212 4550305 3962183
22548 3962183 3523604 3182646 2883694 2663150 2503523 2341903 2137909 1952905 1802572
22539 1802572 1682927 1543000 1472603 1476419 1404528 1302392 1210662 1127761 1082044 1082871 1031722
22528 1031722 998894 985300 961226 954725 920313 881409 805230 714962 684230 639607 548495
22517 548495 479101 527119 517916 479773 444190 413025 412536 389840 382851 407052 414755 397284
22505 397284 362796 348045 390262 430334 447648 438554 413994 426877 451949 584201 679087
22494 679087 810697 1139824 1434019 1585265 1559135 1426409 1188235 896272 679228 513664
22484 513664 417373 411408 452370 379658 354864 331469 285541 293875 354420 392367 379476 375550
$$ packed form
22556A6290124l405979k529928j878289j373616j067866q23234o60907n88122
22548C962183m38579l40958k98952k20544j59627j61620k03994j85004j50333
22539A802572j19645j39927p0397L816p1891j02136r1730q2901m5717Q27n1149
22528A031722l2828j3594k4074o501l4412l8904p6179r0268l0732m4623r1112
22517E48495o9394M8018r203l8143l5583l1165m89k2696o989K4201P703j7471
22505C97284l4488j4751M2217M0072J7314r094k4560J2883K5072J32252R4886
22494F79087J31610L29127K94195J51246k6130j32726k38174k91963k17044j65564
22484E13664r6291n965M0962p2712k4794k3395m5928Q334O0545L7947j2891l926
$$ plain form
22472 375550 398056 488789 615669 791238 1108292 1489347 1807875 2025533 2065389 1838406
22462 1838406 1454106 1077953 840973 633679 476539 388362 364543 249519 190532 217300
22452 217300 216903 180451 117933 77695 484 -59632 -128092 -115485 -56783 19030 93664 126211
22440 126211 55490 59940 4367 -4272 17541 70398 79531 93330 99501 53415 12211 -82160
22428 -82160 -62483 -49548 6990 75317 122919 204562 171624 71817 63873 54128 -198 -33403
22416 -33403 -3069 111150 170904 185437 194976 136542 143427 142680 86752 3930 40958 44589
22404 44589 10687 74811 112651 83439 51910 60767 76316 47009 100376 130306 72320 21666
22392 21666 35322 38311 36737 53818 43326 56211 78591 110658 124076 104141 141946 165678
$$ packed form
22472C75550K2506R0733J26880J75569L17054L81055L18528K17658L9856k26983
22462A838406l84300l76153k36980k07294j57140q8177k3819j15024n8987K6768
22452B17300l97l6452o2518m0238p7211o0116o8460J2607N8702P5813P4634L2547
22440A26211p0721M450n5573q639K1813N2857R133J3799O171m6086m1204r4371
22428h2160J9677J2935N6538O8327M7602Q1643l2938r9807p944r745n4326l3205
22416c3403L0334J14219N9754J4533R539n8434O885p47n5928q2822L7028L631
22404D4589l3902O4124L7840k9212l1529Q857J5549k9307N3367K9930n7986n0654
22392B1666J3656K989j574J7081j0492J2885K2380L2067J3418j9935L7805K3732
$$ plain form
22380 165678 130666 112811 103847 56129 21536 -29508 37360 41493 33032 37952 25806 -2450
22368 -2450 -14027 -69039 -31505 2393 54410 51346 11581 -32004 -21783 -629 16167 14003
22356 14003 76628 96291 25544 -35610 -55397 -47620 -42200 -56449 -67825 -34584 2994 -68845
22344 -68845 -110461 -71569 36789 91502 61910 65289 27054 -5172 51516 74337 75813 13832
22332 13832 -1486 30427 35064 15186 3770 19477 20906 -23394 -75881 -60113 -62769 -26804
22320 -26804 -23480 -40927 -27514 -32509 -18759 -2442 30218 15049 24349 -30952 -40918 -3258
22308 -3258 26777 15818 56372 39596 2231 -47271 -35252 -10406 -33475 5493 17257 14940
22296 14940 2443 15775 30969 3526 20828 71203 28122 76463 69100 73649 55469 -17217
$$ packed form
22380A65678l5012j7855q964m7718l4593n1044O6868M133q461M920j2146k8256
22368b450j1577n5012L7534L3898N2017l064l9765m3585J0221K1154J6796k164
22356A4003O2625J9663p0747o1154j9787P777N420j4249j1376L3241L7578p1839
22344f8845m1616L8892J08358N4713k9592L379l8235l2226N6688K2821J476o1981
22332A3832j5318L1913M637j9878j1416J5707J429m4300n2487J5768k656L5965
22320b6804L324j7447J3413m995J3750J6317L2660j5169R300n5301r966L7660
22308c258L0035j0959M0554j6776l7365m9502J2019K4846k3069L8968J1764k317
22296A4940j2497J3332J5194k7443J7302N0375m3081M8341p363M549j8180p2686
$$ plain form
22284 -17217 -70897 -68176 -32676 -13022 8400 9803 5934 3488 9599 46263 45061 -18332 29260
22271 29260 66348 75643 46916 -8634 -26504 -24080 28400 56758 95051 132806 114359 160344
22259 160344 198702 205138 128016 60617 6011 -70727 -71396 -64622 -29941 232 -19235 -3768
22247 -3768 -27109 -54220 -50772 -31163 -47104 -30221 -3544 3243 32175 -14329 18792 31773
22235 31773 14993 35972 21160 -5967 18252 4495 14207 13969 -32062 -69021 -115692 -96129
22223 -96129 -29013 51973 44513 28518 -35122 -42576 -21838 -29696 -44061 -25108 36581 50037
22211 50037 845 -14198 21994 66042 46971 -2661 -55042 -47919 -50103 -88628 -57319 -37121
22199 -37121 -39932 -22083 40081 66680 335 -48506 -17156 -13643 -63384 -99411 -90264 -61133
$$ packed form
22284a7217n3680K721L5500J9654K1422J403l869k446O111L6664j202o3393M7592
22271B9260L7088R295k8727n5550j7870K424N2480K8358L8293L7755j8447M5985
22259A60344L8358O436p7122o7399n4606p6738o69O774L4681L0173j9467J5467
22247c768k3341k7111L448J9609j5941J6883K6677O787K8932m6504L3121J2981
22235C1773j6780K0979j4812k7127K4219j3757R712k38m6031l6959m6671J9563
22223i6129O7116Q0986p460j5995o3640p454K0738p858j4365J8953O1689J3456
22211E0037m9192j5043L6192M4048j9071m9632n2381P123k184l8525L1309K0198
22199c7121k811J7849O2164K6599o6345m8841L1350L513m9741l6027R147K9131
$$ plain form
22187 -61133 -61645 -31059 1791 5948 17003 8492 17981 -8445 -28572 3241 48929 69158 103889
22174 103889 78686 19748 -2224 32549 -15170 -22503 -12923 -14457 -37127 -71386 -142265 -125581
22162 -125581 -54611 -23578 -59903 -86666 -74107 -31672 30492 29383 3318 -611 9195 36479
22150 36479 48824 46027 32329 54095 39870 -16203 -7477 27254 -1878 -5113 -31726 -41187
22138 -41187 -82759 -94358 -45879 -34967 -62706 -77288 -42777 9960 -4163 59229 25932 -5795
22126 -5795 -96827 -113178 -54555 -16826 27268 -13830 -44440 -68482 -67281 -52581 -36575 -36522 -80226
22113 -80226 -34665 -50979 -82513 -86098 -87211 -37856 -24202 -14427 -9909 2782 17635 8834 -44877
22100 -44877 -53540 -72319 -95701 -10685 -22463 -86518 -84207 -97093 -85566 -102232 -90616 -77552
$$ packed form
22187f1133n12L0586L2850M157J1055q511R489k6426k0127L1813M5688K0229L4731
22174A03889k5203n8938k1972L4773m7719p333R580j534k2670l4259p0879J6684
22162a25581P0970L1033l6325k6763J2559M2435O2164j109k6065l929R806K7284
22150C6479J2345k797j3698K1766j4225n6073Q726L4731k9132l235k6613r461
22138d1187m1572j1599M8479J0912k7739j4582L4511N2737j4123O3392l3297l1727
22126e795r1032j6351N8623L7729M4094m1098l0610k4042J201J4700J6006N3m3704
22113h0226M5561j6314l1534l585j113M9355J3654R775M518J2691J4853q801n3711
22100d4877q663j8779k3382Q5016j1778o4055K311j2886J1527j6666J1616J3064
$$ plain form
22088 -77552 -56917 -82693 -76425 -22071 34764 83229 79600 22855 -24460 -17716 12795 35114
22076 35114 32307 12664 -3786 -30626 -116079 -99479 -44464 -31531 -42517 -41326 -26814 -47579
22064 -47579 -33917 -14066 -64580 -90806 -75973 -90787 -85451 -59455 7735 6069 -22061 -26630
22052 -26630 -60021 -44205 -71286 -110665 -103649 -28144 12231 39065 84999 43997 -17121 49614
22040 49614 85468 84781 26979 -36390 -42530 -50150 -24046 -41712 -22347 -5040 -332 3406 7532
22027 7532 63214 79975 76885 97245 28912 -45004 507 62650 89869 60463 -433 -44127
22015 -44127 -62764 -52841 19893 94667 112391 90718 107122 74987 29253 106379 255020 431061
22003 431061 651862 844904 1000573 1067247 994284 842592 706120 521927 439571 325379
$$ packed form
22088g7552K0635k5776O268N4354N6835M8465l629n6745m7315O744L0511K2319
22076C5114k807j9643j6450k6840q5453J6600N5015J2933j0986J191J4512k0765
22064d7579J3662J9851n0514k6226J4833j4814N336K5996O7190j666k8130m569
22052b6630l3391J5816k7081l9379P016P5505M0375K6834M5934m1002o1118O6735
22040D9614L5854o87n7802o3369o140p620K6104j7666J9365J7307M708L738M126
22027G532N5682J6761l090K0360o8333p3916M5511O2143K7219k9406o0896m3694
22015d4127j8637R923P2734P4774J7724k1673J6404l2135m5734P7126J48641J76041
22003D31061K20801J93042J55669O6674p2963j51692j36472j84193q2356j14192
$$ plain form
21993 325379 229248 198205 114942 61108 115749 213709 169626 102201 76529 58672 76559
21982 76559 94438 58074 37218 39937 49013 68371 79010 93093 73159 29812 -42741 -81555
21970 -81555 -88635 -51676 12900 33018 -28978 -86387 -58806 -62041 -80139 -76789 -66617 -79794
21958 -79794 -4583 53083 13641 -4494 29118 -45442 -48603 1498 38728 26618 -29606 -40943
21946 -40943 -68598 -64676 -46030 -16455 -63624 -86457 -116711 -147350 -165954 -117559 -46262 -33830
21934 -33830 -34381 -49104 -43533 22324 -215 -8472 2614 -38151 -63629 -30053 19502 1816
21922 1816 -48591 -79104 -105604 -79307 -67088 -22253 -50389 -50140 -25024 6678 39306 -15401
21910 -15401 -28707 13763 -60143 -137424 -144987 -110023 -110726 -135673 -184861 -156420 -68152 10856
$$ packed form
21993C25379r6131l1043q3263n3834N4641R7960m4083o7425k5672j7857J7887
21982G6559J7879l6364k0856K719R076J9358J0639J4083j9934m3347p2553l8814
21970h1555p080L6959O4576K0118o1996n7409K7581l235j8098L350J0172j3177
21958g9794P5211N7666l9442j8135L3612p4560l161N0101L7230j2110n6224j1337
21946d0943k7655L922J8646K9575m7169k2833l0254l0639j8604M8395P1297J2432
21934c3830n51j4723N571O5857k2539q257J1086m0765k5478L3576M9555j7686
21922A816n0407l0513k6500K6297J2219M4835k8136K49K5116L1702L2628n4707
21910a5401j3306M2470p3906p7281p563L4964p03k4947m9188K8441Q8268P9008
$$ plain form
21898 10856 85406 111940 27381 -6884 25118 68157 99086 65311 16789 43082 29464 -13088
21886 -13088 -40190 -38724 25154 32453 25505 25005 4748 -34148 -89407 -56722 -55844 -44118 -47655
21873 -47655 -36609 -59798 -94275 -80153 -95313 -72018 -7732 -34499 -34551 -83745 -98351 -133183
21861 -133183 -100575 -58843 -56741 -22028 -43201 -9726 -14779 -51551 -46351 -22424 -61313 -90717
21849 -90717 -97703 -43153 4695 -12366 -35210 -2110 -15064 -26433 -13966 -56280 -99806 -103517
21837 -103517 -78525 -95897 -80891 -28363 32989 24391 -26482 6125 -10101 -70199 -37684 -65804
21825 -65804 -50538 -41595 -38789 -53187 -40164 8249 59541 63080 18272 966 21264 22051 25865
21812 25865 24148 10107 233 -8708 -24400 11814 38977 68416 38100 16321 -26947 -31541
$$ packed form
21898A0856P4550K6534q4559l4265L2002M3039L0929l3775m8522K6293j3618m2552
21886a3088k7102J466O3878P299o948n00k0257l8896n5259L2685Q78J1726l537
21873d7655J1046k3189l4477J4122j5160K3295O4286k6767n2m9194j4606l4832
21861a33183L2608M1732K102L4713k1173L3475n053l6772N200K3927l8889k9404
21849i0717o986N4550M7848j7061k2844L3100j2954j1369J2467m2314m3526l711
21837a03517K4992j7372J5006N2528O1352q598n0873L2607j6226o0098L2515k8120
21825f5804J5266Q943K806j4398J3023M8413N1292L539m4808j7306K0298P87L814
21812B5865j717j4041r874q941j5692L6214K7163K9439l0316k1779m3268m594
$$ plain form
21800 -31541 -44964 -31940 -76011 -94685 -77424 -65198 -53523 -30260 -2636 7361 -7196 7473
21788 7473 -39115 -88957 -75493 -53425 -83367 -90454 -68513 -43242 -19922 -11248 -28282 -65473
21776 -65473 -84670 -94436 -97421 -107572 -144769 -144131 -119362 -152536 -107579 -61922 -48922 21838
21764 21838 -12522 -111826 -114421 -30698 -33806 -51980 -95427 -54488 13064 48443 62432 15047
21752 15047 13958 -42091 5499 19772 -34707 -63837 -16641 60487 48647 29280 44177 49243
21740 49243 -7465 -49204 -61129 -58970 1185 -21747 -53267 -43979 -27050 -38797 -38165 -105777
21728 -105777 -96331 -44250 -46994 -104187 -148908 -149109 -106815 -72581 -50793 -48916 -77131 -96390
21716 -96390 -79027 -110460 -156770 -153693 -136538 -64739 29223 77192 110839 108656 20397 -34783
$$ packed form
21800c1541j3423J3024m4071j8674J7261J2226J1675K3263K7624R997j4557J4669
21788G473m6588m9842J3464K2068k9942p087K1941K5271K3320Q674j7034l7191
21776f5473j9197r766k985j0151l7197O38K4769l3174M4957M5657J3000P0760
21764B1838l4360r9304k595Q3723l108j8174m3447M0939O7552L5379J3989m7385
21752A5047j089n6049M7590J4273n4479k9130M7196P7128j1840j9367J4897N066
21740D9243n6708m1739j1925K159O0155k2932l1520R288J6929j1747O32o7612
21728a05777R446N2081k744n7193m4721k01M2294L4234K1788J877k8215j9259
21716i6390J7363l1433m6310L077J7155P1799R3962M7969L3647k183q8259n5180
$$ plain form
21704 -34783 -12519 -11447 1203 21401 55477 7539 2500 3900 -54053 -44202 -52700 -56913 -3693
21691 -3693 2449 -14539 68250 101440 64959 36304 30812 32157 -16664 -42163 -42510 -52534 -66321
21678 -66321 -43231 -61384 -82525 -82559 -48949 -8755 24071 42341 -38845 -121795 -98774 -52453
21666 -52453 -2300 38830 98233 81299 -8730 -56619 -40032 3478 5136 -6690 -76192 -62535
21654 -62535 -2873 -44223 2109 33741 91691 64417 23782 27178 -2792 -55839 -85773 -103723
21642 -103723 -107644 -115253 -104755 -95112 -83150 -103471 -33444 4331 5805 40451 4745 -48510
21630 -48510 -45595 4133 18129 10876 -34568 -54708 -68889 -71594 -54940 -25086 -34207 -16420
21618 -16420 2789 -31813 -62176 3690 40134 94888 10432 -51103 -76458 -36303 -24185 -57248
$$ packed form
21704c4783K2264J072J2650K0198L4076m7938n039J400n7953R851q498m213N3220
21691c693O142j6988Q2789L3190l6481k8655n492J345m8821k5499l47j0024j3787
21678f6321K3090j8153k1141l4L3610M0194L2826J8270q1186q2950K3021M6321
21666e2453N0153M1130N9403j6934r0029m7889J6587M3510J658j1826o9502J3657
21654f2535N9662m1350M6332L1632N7950k7274m0635L396k9970n3047k9934j7950
21642a03723l921p609J0498R643J1962k0321P0027L7775J474L4646l5706n3255
21630d8510K915M9728J3996p253m5444k0140j4181k705J6654K9854r121J7787
21618a6420J9209l4602l0363O5866L6444N4754q4456o1535k5355M0155J2118l3063
$$ plain form
21606 -57248 -8559 8376 22272 41905 43620 10589 42202 71673 99712 95060 30619 -20932
21594 -20932 -50419 -64921 -77022 -45503 -28260 -2709 27389 -35158 -80205 -90406 -55105 14617
21582 14617 14384 12244 -18414 18435 27063 46910 59077 27038 57975 90268 98735 90638 48375
21569 48375 29093 56436 2745 -50744 -32296 -29078 13775 43316 8390 -8775 14463 -31302
21557 -31302 -62824 -22087 -25735 -98849 -126957 -124556 -114753 -126189 -111991 -49681 -37776 -77319
21545 -77319 -123754 -139803 -141964 -57979 -57840 -68817 -49837 4529 26977 2130 -18113 -47570
21533 -47570 -43670 -1349 -26791 -22382 19756 54330 12650 15699 47291 30381 15894 33244
21521 33244 27319 5896 -21776 2069 -15609 14997 -3785 -12529 -25795 -55306 -32568 -66481
$$ packed form
21606e7248M8689J6935J3896J9633J715l3031L1613K9471K8039m652o4441n1551
21594b0932k9487j4502j2101L1519J7243K5551L0098o2547m5047j0201L5301O9722
21582A4617k33k140l0658L6849Q628J9847J2167l2039L0937L2293Q467q097m2263
21569D8375j9282K7343n3691n3489J8448L218M2853K9541l4926j7165K3238m5765
21557c1302l1522M0737l648p3114k8108K401R803j1436J4198O2310J1905l9543
21545g7319m6435j6049k161Q3985J39j0977J8980N4366K2448k4847k0243k9457
21533d7570L900M2321k5442M409M2138L4574m1680L049L1592j6910j4487J7350
21521C3244n925k1423k7672K3845j7678L0606j8782q744j3266k9511K2738l3913
$$ plain form
21509 -66481 -69567 -14774 14716 -9477 -59979 -101411 -90942 -18974 -12783 -13635 -5503 29922 39727
21496 39727 17355 -7614 -57999 -45979 21911 52653 -3665 -6567 15311 24083 22566 -20791
21484 -20791 -9905 -17567 -25013 5410 -7793 -65793 -49092 21194 -15145 -52646 -99860 -73832
21472 -73832 -53403 -51168 -63544 -78741 -93046 -65484 -12539 34587 3967 -53782 -54093 -17160
21460 -17160 -23786 -10316 3667 -60493 -103048 -125524 -103051 -106996 -113479 -83875 -58337 -34060
21448 -34060 51716 6961 -41566 -8024 25119 -12613 5836 19440 22859 59634 88254 62350
21436 62350 80160 67357 51749 44253 41769 65173 12406 188 -6430 5888 -44144 -56350
21424 -56350 -8665 11042 25052 87731 83861 54959 49198 87844 54499 83206 77882 -35789
$$ packed form
21509f6481l086N4793K9490k4193n0502m1432J0469P1968O191q52Q132L5425R805
21496C9727k2372k4969n0385J2020O7890L0742n6318k902K1878Q772j517m3357
21484b0791J0886p662p446L0423j3203n8000J6701P0286l6339l7501m7214K6028
21472g3832K0429K235j2376j5197j4305K7562N2945M7126l0620n7749l11L6933
21460a7160o626J3470J3983o4160m2555k2476K2473l945o483K9604K5538K4277
21448c4060Q5776m4755m8527L3542L3143l7732J8449J3604L419L6775K8620k5904
21436F2350J7810j2803j5608p496k484K3404n2767j2218o618J2318n0032j2206
21424e6350M7685J9707J4010O2679l870k8902n761L8646l3345K8707n324j13671
$$ plain form
21412 -35789 -54953 22269 18461 51557 10923 24649 35958 14029 16691 17232 -4149 -76728
21400 -76728 -2395 32200 -56728 -32662 -11737 -74744 -69423 -1151 -4090 -103068 -133584 -93394
21388 -93394 -65124 -25607 -63903 -63308 -64176 -63309 -110504 -177415 -165134 -131902 -90751 -59075 -61460
21375 -61460 -36441 -23296 9556 17731 41782 42908 82067 58648 34762 -8496 -53440 -80119
21363 -80119 -118988 -84385 -46147 -70140 -68177 -44135 -92397 -85930 -46631 -7133 36433 30540
21351 30540 -15728 -21499 -55351 -89251 -96320 -53185 4217 19376 -20834 -79806 -87097 -87424 -101224
21338 -101224 -51796 44403 69091 -27034 -47213 -44900 -80825 -101127 -59026 -26284 -35424 -41793
21326 -41793 -61307 -50337 -65818 -55081 -72605 -96065 -37725 -8145 41823 105600 56794 58630
$$ packed form
21412c5789j9164P7222l808L3096m0634J3726J1309k1929K662N41k1381p2579
21400g6728P4333L4595q8928K4066K0925o3007N321O8272k939r8978l0516M0190
21388i3394K8270L9517l8296N95q68Q67m7195o6911J2281L3232M1151L1676k385
21375f1460K5019J3145L2852Q175K4051J126L9159k3419k3886m3258m4944k6679
21363h0119l8869L4603L8238k3993J963K4042m8262O467L9299L9498M3566n893
21351C0540m6268n771l3852l3900p069M3135N7402J5159m0210n8972p291l27j3800
21338a01224M9428R6199K4688r6125k0179K313l5925k0302M2101L2742r140o369
21326d1793j9514J0970j5481J0737j7524k3460N8340K9580M9968O3777m8806J836
$$ plain form
21314 58630 45239 -10198 -11783 -3731 -9147 -23883 31410 44845 1164 25560 48283 74528
21302 74528 103158 92624 87117 90506 68145 29695 48169 75767 85333 70694 50803 20458
21290 20458 23546 51405 10286 25844 17662 -31154 -2448 29747 8543 -34868 -66915 4308
21278 4308 37977 -28221 -60719 -43703 51037 50551 9602 -50354 -78516 -72791 1575 -54298
21266 -54298 -63554 -12262 24364 -1567 -49158 -15594 16745 -18842 -34239 -70882 -111645 -141475
21254 -141475 -102142 -73972 -76968 -31752 10751 35452 -6807 -49483 -103017 -71799 -15904 9434
21242 9434 11485 -3238 4319 -30092 -86743 -91985 -60283 -65892 -44996 -16999 26834 23418 -38174
21229 -38174 -70366 -48726 6614 -6082 -58154 -89117 -108904 -79215 -23020 49186 10666 -14578
$$ packed form
21314E8630j3391n5437j585Q052n416j4736N5293J3435m3681K4396K2723K6245
21302G4528K8630j0534n507L389k2361l8450J8474K7598R566j4639j9891l0345
21290B0458L088K7859m1119J5558q182m8816K8706L2195k1204m3411l2047P1223
21278D308L3669o6198l2498J7016R4740m86m0949n9956k8162N725P4366n5873
21266e4298r256N1292L6626k5931m7591L3564L2339l5587j5397l6643m0763k9830
21254a41475L9333K8170k996M5216M2503K4701m2259m2676n3534L1218N5895K5338
21242I434K051j4723P557l4411n6651n242L1702n609K0896K7997M3833l416o1592
21229c8174l2192K1640N5340j2696n2072l0963j9787K9689N6195P2206l8520k5244
$$ plain form
21217 -14578 11450 26114 25862 1672 3432 -12926 -31364 -42993 -28820 -50409 23625 98495
21205 98495 33065 28731 -13485 -49546 -73574 -26891 -37765 -80404 -119901 -86139 -58020 -97086
21193 -97086 -93299 -38869 18185 53834 60980 68941 86686 60867 11261 -10859 -46949 -48807
21181 -48807 -67518 -64828 -52554 -70504 -136027 -77971 -16666 -2160 5475 -19148 -26640 -41055
21169 -41055 -55441 -16074 -20191 -75289 -67651 -68627 -67003 -78118 -28126 28845 68750 38094 36492
21156 36492 18554 -62639 -18955 -10629 -73415 -108284 -113781 -75541 -38686 -44168 -40437 -16114
21144 -16114 -67781 -54578 -100498 -146090 -139159 -54803 -41700 -53880 -84452 -59592 -13599 -7362
21132 -7362 -18573 -24052 -21223 -69726 -72743 -39084 -57339 -54842 -35006 24382 32422 7821 -14029
$$ packed form
21217a4578K6028J4664k52k4190J760j6358j8438j1629J4173k1589P4034P4870
21205I8495o5430m334m2216l6061k4028M6683j0874m2639l9497L3762K8119l9066
21193i7086L787N4430N7054L5649P146P961J7745k5819m9606k2120l6090j858
21181d8807j8711K690J2274j7950o5523N8056O1305J4506P635k4623p492j4415
21169d1055j4386L9367m117n5098P638r76J624j1115M9992N6971L9905l0656j602
21156C6492j7938q1193M3684Q326o2786l4869n497L8240L6855n482L731K4323
21144a6114n1667J3203m5920m5592O931Q4356J3103j2180l0572K4860M5993O237
21132g362j1211n479K829m8503l017L3659j8255K497J9836N9388Q040k4601k1850
$$ plain form
21119 -14029 -58979 -97956 -63893 -470 6938 41306 26628 -43714 -58361 -21830 22069 43258
21107 43258 13759 -42003 -72957 -27031 -18214 -20493 -37748 -3881 21429 -20081 -27127 -7038
21095 -7038 56994 71446 6156 -43411 -57227 -65060 -58508 -39244 -11891 -48690 -93420 -79316
21083 -79316 -40937 -51449 -26890 -62939 -48183 -60872 -35055 28542 10847 38059 33473 -7214
21071 -7214 -21079 -44005 -752 2266 -30904 -15280 24654 -40793 -38142 -12930 -28132 -22917
21059 -22917 -41260 -157257 -228370 -230999 -220558 -139488 -112239 -52983 -71245 -8764 -30573 -34470
21047 -34470 -4750 48027 39767 -5591 49649 76215 71547 37474 14679 2014 -40498 -92822
21035 -92822 -57135 -29759 -49967 -58910 -48720 -102601 -117988 -152346 -131605 -31484 -44639 -57770
$$ packed form
21119a4029m4950l8977L4063O3423P408L4368j4678p0342j4647L6531M3899K1189
21107D3258k9499n5762l0954M5926Q817k279j7255L3867K5310m1510p046K0089
21095g038O4032J4452o5290m9567j3816p833O552J9264K7353l6799m4730J4104
21083g9316L8379j0512K4559l6049J4756j2689K5817O3597j7695K7212m586m0687
21071g214j3865k2926M3253L018l3170J5624L9934o5447K651K5212j5202N215
21059b2917j8343j15997p1113k629J0441Q1070K7249N9256j8262O2481k1809l897
21047c4470K9720N2777q260m5358N5240K6566m668l4073k2795j2665m2512n2324
21035i2822L5687K7376k0208q943J0190n3881j5387l4358K0741J00121j3155j3131
$$ plain form
21023 -57770 -62762 -95451 -129718 -140613 -103920 -46947 7023 17913 45657 42379 -1756 -16642
21011 -16642 -48377 -68360 -39985 -37316 -23989 -56034 -81926 -93886 -43923 -29437 -544 10161
20999 10161 7344 14655 11955 31002 66570 73411 44417 65775 65746 68772 31174 4392 17743
20986 17743 19981 30163 12641 -28742 -44092 -65506 718 38643 51921 5385 -32517 -40466
20974 -40466 16181 43646 75230 125904 111962 82972 39445 -9423 1553 -33937 -98468 -103149
20962 -103149 -58770 -65791 -30747 -29488 -26364 -19006 -14981 -30266 -5625 16729 50001 -49139
20950 -49139 -137397 -75909 22455 71965 70486 53429 23008 -1402 21715 -25921 -64802 -21285
20938 -21285 32665 58297 73199 -8664 -86425 -44670 -940 -10204 -60625 -66051 -37306 -30884
$$ packed form
21023e7770m992l2689l4267j0895L6693N6973N3970J0890K7744l278m4135j4886
21011a6642l1735j9983K8375K669J3327l2045k5892j1960M9963J4486K8893J0705
20999A0161k817P311k700J9047L5568O841k8994K1358k9L026l7598k6782J3351
20986A7743K238J0182j7522m1383j5350k1414O6224L7925J3278m6536l7902p949
20974d0466N6647K7465L1584N0674j3942k8990m3527m8868J0976l5490o4531m681
20962a03149M4379p021L5044J259L124P358M025j5285K4641K2354L3272r9140
20950d9139q8258O1488R8364M9510j479j7057l0421k4410K3117m7636l8881M3517
20938b1285N3950K5632J4902q1863p7761M1755M3730r264n0421n426K8745O422
$$ plain form
20926 -30884 -21064 -9219 5333 -21689 32640 60514 65362 102996 74574 24209 -28026 -31680
20914 -31680 -30588 -23421 -15080 -56015 -12392 -29934 -52838 -64189 -27253 -18621 -39960 -379
20902 -379 -3268 6859 -38888 -43757 -5789 -2125 -31756 -80279 -50895 -22098 -35454 -56527 -48900
20889 -48900 -6460 -50661 -126614 -80276 -47260 -20182 -27576 -7826 72032 93630 41291 -3416
20877 -3416 -17045 17189 8888 -24743 -70357 -65235 -50100 -20721 -42878 -90537 -127172 -129037
20865 -129037 -116918 -122318 -139330 -121389 -51374 9899 22919 30990 -75761 -104960 -87279 -35940
20853 -35940 -83654 -72190 -5836 17561 44283 68591 95903 51695 55657 -29585 -106058 -77853
20841 -77853 -42740 -74156 -65797 -56462 -83941 -89674 -71747 -69422 -57607 -37592 42082 18996
$$ packed form
20926c0884R820J1845J4552k7022N4329K7874M848L7634k8422n0365n2235l654
20914c1680J092P167Q341m0935M3623j7542k2904j1351L6936Q632k1339L9581
20902c79k889J0127m5747m869L7968L664k9631m8523K9384K8797j3356k1073P627
20889d8900M2440m4201p5953M6338L3016K7078p394J9750P9858K1598n2339m4707
20877c416j3629L4234q301l3631m5614N122J5135K9379k2157m7659l6635j865
20865a29037J2119n400j7012J7941P0015O1273J3020Q071j06751k9199J7681N1339
20853c5940m7714J1464O6354K3397K6722K4308K7312m4208L962q5242p6473K8205
20841g7853L5113l1416Q359R335k7479n733J7927K325J1815K0015P9674k3086
$$ plain form
20829 18996 -33972 -40457 -36219 -34005 -47571 -64948 -103842 -141155 -145052 -134609 -56675 7208
20817 7208 -34669 -71980 -65887 -81838 -73513 -60541 -49042 -39408 -13139 -23121 -4081 1359 16741
20804 16741 -10472 -78345 -97905 -69081 -72166 -90006 -52116 -55452 -87307 -94981 -104995 -88884
20792 -88884 -51191 23146 2819 -60675 -19630 -5641 -60631 -54846 2749 73012 131300 36150
20780 36150 17450 -29942 -48201 -69029 -76478 -126154 -101536 -102041 -89645 -81713 -43554 -41065 -41621
20767 -41621 -33940 12610 -27758 -65968 -95830 -68226 -13057 14504 -11065 48294 48371 22970
20755 22970 -30876 -49870 -23554 18702 28183 70990 97478 56959 -44821 -56736 -32853 -64294
20743 -64294 -92657 -85076 -38333 -35303 -48096 -143149 -187632 -155133 -123733 -131967 -72448 -16176
$$ packed form
20829A8996n2968o485M238K214j3566j7377l8894l7313l897J0443P7934O3883
20817G208m1877l7311O093j5951Q325J2972J1499R634K6269r982J9040N440J5382
20804A6741k7213o7873j9560K8824l085j7840L7890l336l1855p674j0014J6111
20792h8884L7693P4337k0327o3494M1045J3989n4990N785N7595P0263N8288r5150
20780C6150j8700m7392j8259k0828p449m9676K4618n05J2396P932L8159K489n56
20767d1621P681M6550m0368l8210k9862K7604N5169K7561k5569N9359P7k5401
20755B2970n3846j8994K6316M2256R481M2807K6488m0519j01780j1915K3883l1441
20743f4294k8363P581M6743L030j2793r5053m4483L2499L1400q234N9519N6272
$$ plain form
20731 -16176 22587 5159 -1950 -35965 -40115 -62785 -9685 -30385 -81295 -72426 -61981 -76309
20719 -76309 -131025 -95197 -56685 -4622 -26943 2552 -30664 -47117 -79576 -103484 -45338 -38666
20707 -38666 -52211 -11948 17264 -20399 -45725 29346 94155 80177 -38251 -71968 -15268
20696 -15268 -4182 44417 33326 33889 79092 107498 64462 63111 13559 -13675 -52825 -57020
20684 -57020 -36179 -31571 36198 8002 -14622 2333 -1982 17163 -25038 -69407 -17624 56168
20672 56168 71668 55056 -35592 -82461 -72420 -62246 -85055 -68798 -55324 4124 27315 2383
20660 2383 -5870 -33849 -22462 10964 46962 67810 -17200 -51840 -58735 -79251 -37158 -23796
20648 -23796 -14298 -38869 2222 -32861 -4027 -38863 -68022 -72754 -14624 -17919 -59022 15242
$$ packed form
20731a6176L8763j7428p109l4015m150k2670N3100k0700n0910Q869J0445j4328
20719g6309n4716L5828L8512N2063k2321K9495l3216j6453l2459k3908N8146O672
20707c8666j3545M0263K9212l7663k5326P5071O4809j3978j18428l3717N6700
20696a5268J1086M8599j1091N63M5203K8406m3036j351m9552k7234l9150m195
20684e7020K0841M608O7769k8196k2624J6955m315J9145m2201m4369N1783P3792
20672E6168J5500j6612r0648m6869J0041J0174k2809J6257J3474N9448K3191k4932
20660B383q253k7979J1387L3426L5998K0848q5010l4640o895k0516M2093J3362
20648b3796R498k4571M1091l5083K8834l4836k9159m732N8130l295m1103P4264
$$ plain form
20636 15242 -7087 -97629 -115029 -88511 -31425 3806 -54867 -130716 -131897 -112954 -106516 -78127
20624 -78127 -229 17715 -44843 -36290 -2614 -14559 -53452 -63840 -65405 -56033 -7645 14238
20612 14238 18846 -20720 -27415 -1030 -57223 -85014 -96117 -76006 -49248 -1230 -42908 -60906
20600 -60906 -87876 -103842 -86681 -86035 -63358 -69132 -90720 -107869 -58544 20122 3852 -7923
20588 -7923 52961 63722 61607 51960 13500 50229 6321 -17402 -36189 -11742 6390 12605
20576 12605 -45526 -88659 -145131 -99846 -27047 839 32588 30120 -32725 -56259 -15237 -8890
20564 -8890 14555 37982 3977 -40456 -64662 -4620 -49887 -78141 -86728 -95420 -57408 -21723
20552 -21723 8405 4157 -30430 -84683 -62465 -4856 19855 -10977 -39692 -3546 32465 62634
$$ packed form
20636A5242k2329r0542j7400K6518N7086L5231n8673p5849j181J8943O438K8389
20624g8127P7898J7944o2558Q553L3676j1945l8893j0388j565R372M8388K1883
20612A4238M608l9566o695K6385n6193k7791j1103K0111K6758M8018m1678j7998
20600f0906k6970j5966J7161O46K2677n774k1588j7149M9325P8666j6270j1775
20588g923O0884J0761k115r647l8460L6729m3908k3723j8787K4447J8132O215
20576A2605n8131m3133n6472M5285P2799K7886L1749k468o2845k3534M1022O347
20564h890K3445K3427l4005m4433k4206O0042m5267k8254q587q692L8012L5685
20552b1723L0128m248l4587n4253K2218N7609K4711l0832k8715L6146L6011L0169
$$ plain form
20540 62634 66948 -2439 -38280 -51748 -48389 46361 46344 52611 4360 51825 71957 29003 46591
20527 46591 58936 42447 10988 7958 44093 55140 -40574 -45567 -19911 846 -1981 12648
20515 12648 26443 20382 -37636 -15837 37456 54410 36291 -33239 -45809 -34561 22136 13479
20503 13479 -11700 3438 -26900 17476 30153 -13764 -31908 -17643 21445 20560 -4234 6754
20491 6754 53632 35044 4632 -43475 -74587 -71633 -81030 -78483 -111094 -113105 -111913 -107056 -110796
20478 -110796 -104284 -82988 -56601 -107105 -102463 -87376 -85124 -107667 -79639 -64742 -49390 -44146
20466 -44146 14642 32802 12462 -21855 -22173 -21077 -12274 -31642 -61237 -69651 -83335 -114298 -111472
20453 -111472 -69665 -69574 -42984 -60144 -62074 -27329 -27856 -92765 -37904 -48372 -83056 594 23594
$$ packed form
20540F2634M314o9387l5841j3468L359R4750j7O267m8251M7465K0132m2954J7588
20527D6591J2345j6489l1459l030L6135J1047r5714m993K5656K0757k827J4629
20515A2648J3795o061n8018K1799N3293J6954j8119o9530j2570J1248N6697q657
20503A3479k5179J5138l0338M4376J2677m3917j8144J4265L9088q85k4794J0988
20491F754M6878j8588l0412m8107l1112K954r397K547l2611k011J192M857l740
20478a10796O512K1296K6387n0504M642J5087K252k2543K8028J4897J5352N244
20466d4146N8788J8160k0340l4317l18J096Q803j9368k9595q414j3684l0963K826
20453a11472M1807R1K6590j7160j930L4745n27o4909N4861j0468l4684Q3650K3000
$$ plain form
20440 23594 32074 45049 34953 77302 55601 46449 15965 -7101 -14138 -62201 -88105 -72855
20428 -72855 -102886 -118116 -109568 -70093 -77267 -54710 -55277 -4919 -13434 1780 6222 19778 5265
20415 5265 -23962 -72789 -84605 -70639 -87699 -80669 -22349 -13270 28155 -19243 -10162 -25857
20403 -25857 -83118 -131777 -111959 -32719 -38542 -42414 -39381 -21964 16328 -4786 -63327 -7965
20391 -7965 -51724 -50220 -23563 12708 45619 28066 43319 -2209 -68411 -105726 -82658 -55654
20379 -55654 -26530 -5833 -69442 -20685 17986 7866 3620 17569 22618 14274 15472 -22350
20367 -22350 -82311 -67291 -9239 60542 69702 12743 -32363 -80040 -127802 -127092 -202014 -194062
20355 -194062 -163657 -88353 -29578 -71166 -87481 -123510 -140002 -127945 -70174 8726 2379 -33048
$$ packed form
20440B3594Q480J2975j0096M2349k1701r152l0484k3066p037m8063k5904J5250
20428g2855l0031j5230Q548L9475p174K2557n67N0358q515J5214M442J3556j4513
20415E265k9227m8827j1816J3966j7060P030N8320R079M1425m7398R081j5695
20403b5857n7261m8659J9818P9240n823l872L033J7417L8292k1114n8541N5362
20391g965m3759J504K6657L6271L2911j7553J5253m5528o6202l7315K3068K7004
20379e5654K9124K0697o3609M8757L8671j0120m246J3949N049q344J198l7822
20367b2350n9961J5020N8052O9781R160n6959m5106m7677m7762P10p4922P952
20355a94062L0405P5304N8775m1588j6315l6029j6492J2057N7771P8900o347l5427
$$ plain form
20343 -33048 -1834 12755 -24660 -19443 -12159 -34393 -13871 11804 43201 14097 -8811 -4682
20331 -4682 45410 56200 41506 -6763 59516 79923 66381 -149 -2238 1034 -39445 -46815
20319 -46815 -12567 -45576 -37506 -89656 -68327 -64257 -70693 -39687 34002 41023 14769 4522
20307 4522 17570 4132 -3573 16390 -9267 -71055 -48567 -41652 -57289 -89515 -110731 -29017
20295 -29017 58403 61887 36478 24237 -71850 -88896 -68222 -14422 -34918 -40698 5700 8107
20283 8107 -23512 -16651 -5652 -23381 -24591 34087 -7336 -5938 -19607 -23438 -10481 5 -14046
20270 -14046 -40640 -35219 -40522 -44570 -40967 16990 97262 74665 18291 -15534 -65442 -91913
20258 -91913 -81609 29618 25723 -23386 25645 62123 58543 23347 -32862 -55954 -76257 -72628
$$ packed form
20343c3048L1214J4589l7415N217P284k2234K0522K5675L1397k9104k2908M129
20331d682N0092J0790j4694m8269O6279K0407j3542o6530k089L272m0479p370
20319d6815L4248l3009Q070n2150K1329M070o436L1006P3689P021k6254j0247
20307D522J3048j3438p705J9963k5657o1788K2488O915j5637l2226k1216Q1714
20295b9017Q7420L484k5409j2241r6087j7046K0674N3800k0496n780M6398K407
20283H107l1619O861J0999j7729j210N8678m1423J398j3669l831J2957J0486j4051
20270a4046k6594N421n303m048L603N7957Q0272k2597n6374l3825m9908k6471
20258i1913J0304J11227l895m9109M9031L6478l580l5196n6209k3092k0303L629
$$ plain form
20246 -72628 -122230 -97791 809 -50636 -106266 -119695 -74236 -29160 4558 21149 39159 24767
20234 24767 12301 -10746 -41928 -71518 -55339 -11846 26808 73851 59489 30756 -31795 -27935
20222 -27935 -24654 -33707 -8739 6981 45577 -5995 2330 18234 -11070 15140 26060 33300
20210 33300 -54646 -105715 -109117 -133597 -56218 -30630 -71327 -125833 -106290 -71201 -36313 -17521
20198 -17521 -47232 -16190 19533 29058 19609 -12107 -27705 -85616 -63345 -24271 -58262 -37516
20186 -37516 13657 37586 70277 71746 29551 56361 57573 33561 19469 -4557 -35203 -58751
20174 -58751 -114120 -144907 -113206 -85777 -21872 -28400 -66312 -86549 -37203 -61670 -120550 -130312
20162 -130312 -125052 -78789 -21813 24172 49910 48593 20396 74072 108135 80851 59391 30981
$$ packed form
20246g2628m9602K4439R8600n1445n5630j3429M5459M5076L3718J6591J8010j4392
20234B4767j2466k3047l1182k9590J6179M3493L8654M7043j4362k8733o2551L860
20222b7935L281r053K4968J5720L8596n1572Q325J5904k9304K6210J0920P240
20210C3300q7946n1069l402k4480P7379K5588m0697n4506J9543L5089L4888J8792
20198a7521k9711L1042L5723R525r449l1716j5598n7911K2271L9074l3991K0746
20186c7516N1173K3929L2691J469m2195K6810J212k4012j4092k4026l0646k3548
20174e8751n5369l0787L1701K7429O3905o528l7912k0237M9346k4467n8880r762
20162a30312N260M6263N6976M5985K5738j317k8197N3676L4063k7284k1460k8410
$$ plain form
20150 30981 -1678 -10447 -3966 37557 20186 -2915 -5904 71736 49207 22185 20859 18793 17416
20137 17416 -12999 -42468 -66481 -73052 -53272 -58337 -63987 -54422 -21 -25592 -31735 -51778 -99059
20124 -99059 -143793 -169526 -157761 -97610 -42759 -61196 -39818 11002 6081 -19175 18991 75500
20112 75500 43730 12199 -43575 -56379 -60267 -69899 -62545 -10716 30734 -751 3865 -12300
20100 -12300 959 -28668 -58249 -71090 -59897 -4046 68026 95210 46838 -20349 -23150 -26430
20088 -26430 -14008 9366 4004 2029 -1156 24903 55521 20537 -39767 -72307 -119275 -134343
20076 -134343 -77521 -69599 -66798 -49500 -2840 -37207 -82305 -36509 -17383 -48329 -58984 -43534
20064 -43534 -21315 -58380 -49794 10877 19893 36800 43310 62162 57478 74393 107618 28702
$$ packed form
20150C0981l2659q769O481M1523j7371k3101k989P7640k2529k7022j326k066j377
20137A7416l0415k9469k4013o571J9780n065n650R565N4401k5571o143k0043m7281
20124i9059m4734k5733J1765O0151N4851j8437K1378N0820m921k5256L8166N6509
20112G5500l1770l1531n5774j2804l888r632P354N1829M1450l1485M616j6165
20100a2300J3259k9627k9581j2841J1193N5851P2072K7184m8372o7187k801l280
20088b6430J2422K3374n362j975l185K6059L0618l4984o0304l2540m6968j5068
20076a34343N6822P922K801J7298M6660l4367m5098M5796J9126l0946j0655J5450
20064d3534K2219l7065Q586O0671R016J6907O510J8852m684J6915L3225p8916
$$ plain form
20052 28702 -43904 -61865 -53588 -19844 36690 73340 13338 -52604 -77535 -19517 3180 18700
20040 18700 32009 7531 5341 -24640 -53053 -85360 -94704 -72023 -119228 -108463 -49224 7113
20028 7113 3202 3912 4988 -39619 -74837 -100386 -106671 -68754 -34380 -50054 -59940 -39093 -54921
20015 -54921 -44299 -49987 -55783 -24800 10289 -26042 -73408 -71687 -97194 -74547 -18431 -13314
20003 -13314 6624 12148 19201 6104 -10891 3413 -11795 -30933 -2879 15638 -9751 -16819
19991 -16819 -41358 -2311 28394 43507 66819 71773 5855 -39130 -43858 -21248 -11471 401
19979 401 21064 19199 8478 27278 40420 54724 41408 27732 17518 25379 72596 69940 19293
19966 19293 23640 21922 44014 38163 33588 78187 57135 11534 30935 24012 -10764 -39035 -19639
$$ packed form
20052B8702p2606j7961Q277L3744N6534L6650o0002o5942k4931N8018K2697J5520
20040A8700J3309k4478k190k9981k8413l2307r344K2681m7205J0765N9239N6337
20028G113l911P10J076m4607l5218k5549o285L7917L4374j5674r886K0847j5828
20015e4921J0622n688n796L0983L5089l6331m7366J721k5507K2647N6116N117
20003a3314J9938N524P053j3097j6995J4304j5208j9138K8054J8517k5389p068
19991a6819k4539L9047L0705J5113K3312M954o5918m4985m728K2610R777J1872
19979D01K0663j865j0721J8800J3142J4304j3316j3676j0214P861M7217k656n0647
19966A9293M347j718K2092n851m575M4599k1052m5601J9401o923l4776k8271J9396
$$ plain form
19953 -19639 2614 -32863 -11515 16297 -53043 -27404 53196 87462 93484 16252 -6493 44640
19941 44640 20391 -20955 -77115 -83905 -33142 -6875 15328 5028 -44542 -26139 35650 41958
19929 41958 28890 13431 13623 24178 29171 101705 85384 121989 66232 -15704 34967 72928
19917 72928 67826 59953 44131 -7728 -9896 -18617 8398 -21983 -5993 -29774 -44079 -56499
19905 -56499 -36675 14088 23227 65338 68461 23423 47925 34128 65079 32316 -33865 -6557
19893 -6557 -7264 -43778 -39265 -5317 -7000 -65706 -61585 -61892 -55972 -32770 -46039 -11962 38564
19880 38564 74595 38209 37513 19279 -34371 -97756 -54390 -21419 22851 63415 49071 -4523
19868 -4523 -10896 46091 9805 11117 14984 -22791 -45199 -27515 -45943 -85398 -42044 -63988
$$ packed form
19953a9639K2253l5477K1348K7812o9340K5639Q0600L4266O022p7232k2745N1133
19941D4640k4249m1346n6160o790N0763K6267K2203j0300m9570J8403O1789O308
19929D1958j3068j5459J92J0555M993P2534j6321L6605n5757q1936N0671L7961
19917G2928n102p873j5822n1859k168q721K7015l0381J5990k3781j4305j2420
19905e6499J9824N0763R139M2111L123m5038K4502j3797L0951l2763o6181K7308
19893f557p07l6514M513L3948j683n8706M121l07N920K3202j3269L4077N0526
19880C8564L6031l6386o96j8234n3650o3385M3366L2971M4270M0564j4344n3594
19868d523o373N6987l6286J312L867l7775k2408J7684j8428l9455M3354k1944
$$ plain form
19856 -63988 -129041 -67453 7563 -11932 -26931 -36933 -5091 10076 51950 35578 52102 71719
19844 71719 53997 24059 -42153 -35458 -46238 -53135 -43897 -34747 -79668 -65633 -26967 -29387 -23845
19831 -23845 12002 42784 53983 42267 -26903 41674 90789 143667 144639 113861 105715 95929
19819 95929 125644 116340 129234 157947 189987 206243 190380 114860 92013 130629 114175 118256
19807 118256 152507 145469 151388 155000 184590 169916 122671 65883 56547 41144 54336 24085
19795 24085 11874 100959 154340 112471 103948 93355 57684 68796 105675 118026 61186 47783
19783 47783 38000 36641 5772 19394 35567 21203 33619 46786 24357 11480 -7377 -1911
19771 -1911 42245 60475 38534 16767 20059 -30594 -60058 -33947 -15948 -28818 -32845 -52836
$$ packed form
19856f3988o5053O1588P5016j9495j4999j0002L1842J5167M1874j6372J6524J9617
19844G1719j7722k9938o6212O695j0780o897R238R150m4921J4035L8666k420N542
19831b3845L5847L0782J1199j1716o9170O8577M9115N2878R72l0778q146r786
19819I5929K9715r304J2894K8713L2040J6256j5863p5520k2847L8616j6454M081
19807A18256L4251p038N919L612K9590j4674m7245n6788r336j5403J3192l0251
19795B4085j2211Q9085N3381m1869q523j0593l5671J1112L6879J2351n6840j3403
19783D7783r783j359l0869J3622J6173j4364J2416J3167k2429j2877j8857N466
19771a911M4156J8230k1941k1767L292n0653k9464K6111J7999j2870m027j9991
$$ plain form
19759 -52836 -92007 -29808 5951 -36401 -102419 -85892 -61551 -73921 -35351 2474 -5691 -1151
19747 -1151 3135 -19395 -5454 7631 13326 11622 -12206 -1136 78254 82864 20012 -37231 -46196
19734 -46196 -23428 -12953 -16073 -54540 -40640 -21784 6278 10114 846 49127 46663 39076 9054
19721 9054 9625 32105 33011 7887 31659 102170 148187 132141 134399 134251 118329 64313 51792
19708 51792 52946 117660 164314 97620 84310 79981 94008 104775 87764 120251 88672 108827
19696 108827 159627 157868 171616 193263 190905 213569 260056 204261 176857 156055 183195 150456
19684 150456 211381 220507 216082 158289 147923 132210 136709 162678 149780 139148 90272 64435
19672 64435 148178 162355 145310 118439 78131 149160 201690 121453 58633 72017 113102 86364
$$ packed form
19759e2836l9171O2199L5759m2352o6018J6527K4341j2370L8570L7825q165M540
19747a151M286k2530J3941J3085N695j704k3828J1070P9390M610o2852n7243q965
19734d6196K2768J0475l120l8467J3900J8856K8062L836r268M8281k464p587l0022
19721I054N71K2480R06k5124K3772P0511M6017j6046K258j48j5922n4016j2521
19708E1792J154O4714M6654o6694j3310m329J4027J0767j7011L2487l1579K0155
19696A08827N0800j759J3748K1647k358K2664M6487n5795k7404k0802K7140l2739
19684A50456O0925R126m425n7793j0366j5713M499K5969j2898j0632m8876k5837
19672F4435Q3743J4177j7045k6871m0308P1029N2530q0237o2820J3384M1085k6738
$$ plain form
19660 86364 13022 -33386 -18456 22342 84391 69727 74887 67954 100987 116545 139899 112213
19648 112213 102860 116139 203619 189309 200993 240469 276682 218107 134784 152437 236800 178835
19636 178835 149232 120580 114780 105936 125188 154908 216212 212828 220665 202696 169374 139609
19624 139609 110755 88201 59494 46247 68455 26013 17928 14806 -11283 12469 -6461 -95621
19612 -95621 -76026 -40072 4351 -5386 -38254 -20404 25825 50487 51309 43138 -1592 7630 5324
19599 5324 49778 26757 864 12804 22145 22949 52307 64445 141213 151239 104409 71521
19587 71521 129832 260541 330306 399531 367790 373717 442568 442683 476301 595450 607887 594145
19575 594145 597546 621732 631555 587862 621352 679176 741378 702112 664968 673824 781316 900528
$$ packed form
19660H6364p3342m6408J4930M0798O2049j4664N160o933L3033J5558K3354k7686
19648A12213r353J3279Q7480j4310J1684L9476L6213n8575q3323J7653Q4363n7965
19636A78835k9603k8652n800q844J9252K9720O1304l384P837j7969l3322k9765
19624A39609k8854k2554k8707j3247K2208m2442q085l122k6089K3752j8930q9160
19612i5621J9595L5954M4423r737l2868J7850M6229K4662Q22q171m4730R222k306
19599E324M4454k3021k5893J1940R341Q04K9358J2138P6768J0026m6830l2888
19587G1521N8311J30709O9765O9225l1741N927O8851J15L3618J19149J2437j3742
19575E94145L401K4186R823m3693L3490N7824O2202l9266l7144Q856J07492J19212
$$ plain form
19563 900528 955488 973224 872707 813227 698580 540987 493980 475110 428229 401275 361464
19552 361464 328095 345618 375086 366000 340165 355276 330634 311896 268909 210920 157300 130237
19540 130237 131557 123572 79844 106182 76485 43881 22414 -2362 15633 72539 112322 110985
19528 110985 107201 110284 130646 149267 180699 113364 96818 139918 222623 218746 220485 279247
19516 279247 337656 340444 291310 277541 257048 250074 253266 278156 324688 317572 371226 387325
19504 387325 338604 326620 317108 213442 205579 200523 196489 195040 140150 123044 126961 158113
19492 158113 203364 166055 149763 124811 84019 109042 115974 88323 4323 4430 56940 72687
19480 72687 104880 142515 154425 106999 71991 62194 78993 46731 -23785 -69598 -25514 34491
$$ packed form
19563I00528N4960J7736j00517n9480j14647j57593m7007j8870m6881k6954l9811
19552C61464l3369J7523K9468r086k5835J5111k4642j8738m2987n7989n3620k7063
19540A30237J320p985m3728K6338k9697l2604k1467k4776J7995N6906L9783j337
19528A10985l784L083K0362J8621L1432o7335j6546M3100Q2705l877J739N8762
19516B79247N8409K788m9134j3769k0493o974L192K4890M6532p116N3654J6099
19504C87325m8721j1984r512j03666p863n056m034j449n4890j7106L917L1152
19492A58113M5251l7309j6292k4952m0792K5023O932k7651q4000J07N2510J5747
19480G2687L2193L7635J1910m7426l5008r797J6799l2262p0516m5813M4084O0005
$$ plain form
19468 34491 9406 22972 39730 65979 25555 4323 -15276 14399 126728 126631 141305 187603
19456 187603 191437 160008 132241 71362 27874 18681 9842 13864 13899 63691 82448 107462 98729
19443 98729 50275 20644 55360 47057 88502 63680 58584 89596 139500 159539 92450 151952
19431 151952 189366 156209 110902 146673 146966 140932 133905 111940 44323 16932 48142 90773
19419 90773 79924 118547 118287 110770 91785 128978 122179 91313 75442 70386 96594 135794 124644
19406 124644 126231 122831 84730 56888 30290 65923 101906 144714 99222 82705 31755 95235
19394 95235 119974 136215 95138 110824 127791 99503 82274 77824 90576 151591 243843 226447
19382 226447 171664 174686 111409 99754 188516 192609 172716 109303 73170 117494 96630 105529
$$ packed form
19468C4491k5085J3566J6758K6249m0424k1232j9599K9675J12329r7J4674M6298
19456A87603L834l1429k7767o0879m3488r193q839M022L5M9792J8757K5014q733
19443I8729m8454k9631L4716q303M1445k4822n096L1012M9904K0039o7089N9502
19431A51952L7414l3157m5307L5771K93o034p027k1965o7617k7391L1210M2631
19419I0773j0849L8623k60p517j8985L7193o799l0866j5871n056K6208L9200j1150
19406A24644J587l400l8101k7842k6598L5633L5983M2808m5492j6517n0950O3480
19394I5235K4739J6241m1077J5686J6967k8288j7229m450J2752O1015R2252j7396
19382B26447n4783L022o3277j1655Q8762M093j9893o3413l6133M4324k0864Q899
$$ plain form
19370 105529 161684 110333 29524 1855 56715 136875 124596 98163 178876 158604 97374
19359 97374 117673 161094 201763 216294 180060 188940 204960 216354 147032 67277 96171 127827
19347 127827 94128 133321 172763 113198 69871 93307 93475 120049 168623 179338 163880 211411
19335 211411 235132 187527 199907 203705 181917 156597 199257 218470 227672 284702 301128 239364
19323 239364 260801 257537 281208 262398 291602 302537 273019 314156 357601 383155 444229 492873
19311 492873 500504 535248 508892 516629 582895 615783 606869 550791 549949 568372 630509 649997
19299 649997 639480 595715 549639 571045 587370 553017 532916 505563 485493 423450 377926
19288 377926 410291 422214 377000 338358 347766 393032 361370 320533 323281 277972 311812 347881
$$ packed form
19370A05529N6155n1351q0809k7669N4860Q0160j2279k6433Q0713k0272o1230
19359I7374K0299M3421M0669J4531l6234Q880J6020J1394o9322p9755K8894L1656
19347A27827l3699L9193L9442n9565m3327K3436J68K6574M8574J0715j5458M7531
19335B11411K3721m7605J2380L798k1788k5320M2660J9213R202N7030J6426o1764
19323B39364K1437l264K3671j8810K9204J0935k9518M1137M3445K5554O1074M8644
19311D92873P631L4744k6356P737O6266L2888q914n6078q42J8423O2137J9488
19299F49997j0517m3765m6076K1406J6325l4353k0101k7353k0070o2043m5524
19288C77926L2365J1923m5214l8642R408M5266l1662m0837K748m5309L3840L6069
$$ plain form
19276 347881 397293 352683 342546 291784 239267 287644 370172 418815 446186 509363 557025
19265 557025 603622 677992 708084 754313 810584 905040 1007146 1033022 1042435 1001946 923582
19254 923582 867489 869467 858660 776205 731991 710309 703993 749073 803739 851306 866638 865529
19242 865529 823337 800832 824999 835562 825996 791126 750156 674555 669282 729622 779260 838862
19230 838862 937080 1078506 1261134 1419265 1631892 1944290 2310929 2516840 2664759 2707913
19220 2707913 2632126 2473037 2436980 2490654 2674324 2800818 2931533 3036382 3146520 3399460
19210 3399460 3827368 4257941 4563172 4637317 4409176 4082123 3760063 3473820 3259312 3100753
19200 3100753 3011502 2927783 2862590 2969269 3149273 3457854 3898546 4412612 5091575 6188318
$$ packed form
19276C47881M9412m4610j0137n0762n2517M8377Q2528M8643K7371O3177M7662
19265E57025M6597P4370L0092M6229N6271R4456J02106K5876R413m0489p8364
19254I23582n6093J978j0807q2455m4214k1682o316M5080N4666M7567J5332j109
19242H65529m2192k2505K4167J0563r566l4870m0970p5601n273O0340M9638N9602
19230H38862R8218J41426J82628J58131K12627L12398L66639K05911J47919M3154
19220B707913p5787j59089l6057N3674J83670J26494J30715J04849J10138K52940
19210C399460M27908M30573L05231P4145k28141l27053l22060k86243k14508j58559
19200C100753q9251q3719o5193J06679J80004L08581M40692N14066O78963J096743
$$ plain form
19190 6188318 7940498 10905699 15871243 22705933 28604798 29816238 26822487 22785162
19182 22785162 19404398 17389536 17084782 18717827 22986565 29882066 36909277 39464793
19174 39464793 37233183 34368645 34227180 37171419 39412819 37486001 31799572 25266805
19166 25266805 20098864 16689448 14754714 14291172 15353825 18317890 23869049 31447705
19158 31447705 37308567 37972377 33158065 26385670 20721006 16755278 14498237 13725946
19150 13725946 14319498 16716788 21522057 28519319 34337445 34684051 31022312 27086535
19142 27086535 24764964 25000890 28553163 35532836 43069803 44809467 40064416 33881777
19134 33881777 29577603 28508333 31265724 36977132 41351792 40161967 34752837 28918947
$$ packed form
19190F188318J752180K965201M965544O834690N898865J211440k993751m037325
19182B2785162l380764k014862l04754J633045M268738O895501P027211K555516
19174C9464793k231610k864538j41465K944239K241400j926818n686429o532767
19166B5266805n167941l409416j934734m63542J062653K964065N551159P578656
19158C1447705N860862O63810m814312o772395n664664l965728k257041p72291
19150A3725946N93552K397290M805269O997262N818126L46606l661739l935777
19142B7086535k321571K35926L552273O979673P536967J739664m745051o182639
19134C3881777m304174j069270K757391N711408M374660j189825n409130n833890
$$ plain form
19126 28918947 24522506 22249128 22321158 25120831 31151412 40122254 48026415 48345536
19118 48345536 41095530 31802742 23725455 17704782 13473982 10584985 8588448 7172817
19110 7172817 6240925 5636003 5200149 4879602 4689794 4554090 4505242 4535841 4526058 4467383
19100 4467383 4579650 4834131 5211975 5606835 6057598 6662020 7414025 8024302 8436138
19091 8436138 8961937 9914824 11528488 13371796 14232096 14242793 14424683 15570645 18371244
19082 18371244 23748206 32115085 41296179 46602483 46655365 44995665 45418585 50228709
19074 50228709 60198319 73257972 86742027 100593825 109951153 107576093 97415562
19067 97415562 88519164 86573719 91722670 97197311 94422729 83933351 73377543 68442019
$$ packed form
19126B8918947m396441k273378P2030K799673O030581Q970842P904161L19121
19118D8345536p250006r292788q077287o020673m230800k888997j996537j415631
19110G172817r31892o04922m35854l20547j89808j35704m8848L0599r783n8675
19100D467383J12267K54481L77844L94860M50763O04422P52005O10277M11836
19091H436138N25799R52887J613664J843308Q60300J0697J81890J145962K800599
19082A8371244N376962Q366879R181094N306304N2882j659700M22920M810124
19074E0228709R969610J3059653J3484055J3851798R357328k375060j0160531
19067I7415562q896398j945445N148951N474641k774582j0489378j0555808m935524
$$ plain form
19059 68442019 70186010 73383699 72502461 71717007 76591192 85575434 90716136 88728702
19051 88728702 83627117 75748510 64616906 54486092 48622964 48593358 54555134 60933628
19043 60933628 61000373 59244234 58871909 55281584 45991413 35640181 27007021 20490921
19035 20490921 15923951 12824558 10723276 9331543 8293075 7608662 7180530 6832719
19027 6832719 6614636 6457958 6290498 6182636 6162390 6157305 6147701 6108336 6113846 6123904 6259825
19016 6259825 6367239 6568988 6948532 7447426 8296679 9801041 12214073 16095450 22547180
19007 22547180 32837210 46208193 57576817 64392903 68708825 66950273 58518255 49970952
18999 49970952 45216778 46096586 52940222 62268117 67124073 67676524 67097303 62000653
$$ packed form
19059F8442019J743991L197689q81238p85454M874185Q984242N140702j987434
19051H8728702n101585p878607j1131604j0130814n863128k9606N961776O378494
19043F0933628O6745j756139l72325l590325r290171j0351232q633160o516100
19035B0490921m566970l099393k101282j391733j038468o84413m28132l47811
19027F832719k18083j56678j67460j07862k0246n085r604l9365N510J0058J35921
19016F259825J07414K01749L79544M98894Q49253J504362K413032L881377O451730
19007B2547180J0290030J3370983J1368624O816086M315922j758552q432018q547303
18999D9970952m754174Q79808O843636R327895M855956N52451n79221n096650
$$ plain form
18991 62000653 51203649 39378005 29431908 21996272 16630521 12928784 10374599 8531117
18983 8531117 7255521 6410680 5867933 5346592 4901844 4538778 4245777 3985794 3688095
18974 3688095 3328563 3053042 2833521 2607281 2424604 2276880 2173395 1985567 1881035
18965 1881035 1818720 1752817 1748018 1727145 1660690 1666243 1607195 1500862 1443663 1395293 1309360
18954 1309360 1308329 1316538 1321449 1301789 1353396 1378271 1380396 1403287 1383790 1355652 1375892 1451853
18942 1451853 1527442 1595730 1577226 1498510 1458148 1395927 1349018 1364623 1390364 1411099 1418184
18931 1418184 1377177 1357822 1269159 1097350 1022961 1003990 928420 838878 779356 721410 627877
18920 627877 609226 648888 638506 661418 684001 719077 748680 828819 929951 965686 998563
$$ packed form
18991F2000653j0797004j1825644r946097p435636n365751l701737k554185j843482
18983H531117j275596q44841n42747n21341m44748l63066k93001k59983k97699
18974C688095l59532k75521k19521k26240j82677j47724j03485j87828j04532
18965A881035o2315o5903m799k0873o6455N553n9048j06333n7199m8370q5933
18954A309360j031Q209M911j9660N1607K4875K125K2891j9497k8138K0240P5961
18942A451853P5589O8288j8504p8716m0362o2221m6909J5605K5741K0735P085
18931A418184m1007j9355q8663j71809p4389j8971p5570q9542n9522n7946r3533
18920F27877j8651L9662j0382K2912K2583L5076K9603Q0139J01132L5735L2877
$$ plain form
18909 998563 1051070 1052602 974174 972378 969603 1016224 1136396 1281164 1348323 1390249 1426320 1447295
18897 1447295 1416428 1373030 1321641 1310007 1268077 1233647 1169324 1099546 1048912 1115365 1184137
18886 1184137 1104511 1057957 1067301 1017765 947190 968633 907968 838836 819335 808130 791237
18875 791237 808664 836994 851989 802964 764312 852962 892332 985599 1110339 1180990 1243710
18864 1243710 1396064 1528632 1581828 1607099 1595734 1483221 1375374 1333016 1321334 1400639
18854 1400639 1485741 1556832 1529146 1542736 1493189 1438601 1402820 1367501 1296914 1219978 1132823
18843 1132823 1110566 1165370 1162817 1212731 1210944 1257475 1295980 1265373 1267365 1286839 1290461 1277031
18831 1277031 1345892 1440686 1548204 1702893 1801549 1914821 2148619 2526880 3117249 3588047
$$ packed form
18909I98563N2507J532p8428j796k775M6621J20172J44768O7159M1926L6071K0975
18897A447295l0867m3398n1389j1634m1930l4430o4323o9778n0634O6453O8772
18886A184137p9626m6554R344m9536p0575K1443o0665o9132j9501j1205j6893
18875G91237J7427K8330J4995m9025l8652Q8650L9370R3267J24740P0651O2720
18864A243710J52354J32568N3196K5271j1365j12513j07847m2358j1682P9305
18854A400639Q5102P1091k7686J3590m9547n4588l5781l5319p0587p6936q7155
18843A132823k2257N4804k553M9914j787M6531L8505l0607J992J9474L622j3430
18831A277031O8861R4794J07518J54689R8656J13272K33798L78261N90369M70798
$$ plain form
18821 3588047 3602350 3274321 2956033 2770425 2647225 2705910 2908455 3318861 3640588 3954329
18811 3954329 4499000 5482053 7255449 10331753 14698624 17932053 17264451 14469172 11672555
18802 11672555 9558953 8226023 7555388 7553915 8339592 10161282 13163845 15856823 15851860
18793 15851860 13878160 11725246 10035441 9063921 8587163 8453252 8608653 9077840 9831946
18784 9831946 10883703 12170346 13657983 15431041 17854661 21357243 26717884 35368214
18776 35368214 49304688 69510810 91628845 106443842 112448311 116574039 120889259
18769 120889259 123676959 124148790 127200860 140678822 163427706 180589608 178857831 161609663
18761 161609663 138837800 120489658 111845924 109666099 104953593 95979680 86339773 74857884
$$ packed form
18821C588047J4303l28029l18288j85608j23200N8685K02545M10406L21727L13741
18811C954329N44671R83053J773396L076304M366871L233429o67602k795279k796617
18802A1672555k113602j332930o70635j473P85677J821690L002563K692978m963
18793A5851860j973700k152914j689805r71520m76758j33911J55401M69187P54106
18784I831946J051757J286643J487637J773058K423620L502582N360641Q650330
18776C5368214J3936474K0206122K2118035J4814997O004469M125728M315220
18769A20889259K787700M71831L052070J3477962K2748884J7161902j731777j7248168
18761A61609663k2771863j8348142q643734k179825m712506q973913r639907j1481889
$$ plain form
18753 74857884 62420974 52467486 46288428 44468174 47692416 55998352 65565950 67533454
18745 67533454 59521510 48077135 37808188 30184067 24933554 21403715 19177899 18012526
18737 18012526 17719664 18419955 20313506 24028513 30527947 40375958 51640875 60798167
18729 60798167 67531226 71641935 73963139 75426104 74058641 70381105 64222238 56947001
18721 56947001 52022552 51822981 58021351 69875522 79166621 76452515 65387234 53452717
18713 53452717 44277933 38973267 37898059 41674690 50894924 63632611 71438808 66828195
18705 66828195 54575592 41878777 31591871 24177404 19020260 15370888 12760599 10879777
18697 10879777 9488815 8483433 7862067 7490491 7195002 6954854 6723032 6546676 6537930
$$ packed form
18753G4857884j2436910r953488o179058j820254L224242Q305936R567598J967504
18745F7533454q011944j1444375j0268947p624121n250513l529839k225816j165373
18737A8012526k92862P00291J893551L715007O499434R848011J1264917R157292
18729F0798167O733059M110709K321204J462965j367463l677536o158867p275237
18721E6947001m924449j99571O198370J1854171R291099k714106j1065281j1934517
18713E3452717r174784n304666j075208L776631R220234J2737687P806197m610613
18705F6828195j2252603j2696815j0286906p414467n157144l649372k610289j880822
18697A0879777j390962j005382o21366l71576k95489k40148k31822j76356q746
$$ plain form
18688 6537930 6751200 7251712 8116741 9635761 11747681 14286798 16485350 18116082 19246996
18679 19246996 19785696 20366592 20904541 21442352 22241827 23542858 26748419 33776212 45458482
18670 45458482 57872729 61410780 54496373 44317963 35555084 29909832 27533720 28542007
18662 28542007 33483767 42436650 51842822 53665559 46550551 36501270 27424568 20503949
18654 20503949 15624351 12228129 9850859 8163258 6935323 5987109 5276086 4752401
18646 4752401 4299532 3818046 3473472 3233125 3060562 3048223 3134953 3281779 3570018 3770330
18636 3770330 3732244 3549000 3297851 3073875 2897069 2840479 2787451 2801316 2962186 3231176
18626 3231176 3429945 3335366 3163140 3014908 2939043 2954950 2976745 3069284 3194811 3343791
$$ packed form
18688F537930K13270N00512Q65029J519020K111920K539117K198552J630732J130914
18679A9246996N38700N80896N37949N37811P99475J301031L205561P027793J1682270
18670D5458482J2414247L538051o914407j0178410q762879n645252k376112J008287
18662B8542007M941760Q952883R406172J822737p115008j0049281r076702o920619
18654B0503949m879598l396222k377270j687601j227935r48214p11023n23685
18646D752401m52869m81486l44574k40347j72563j2339Q6730J46826K88239K00312
18636C770330l8086j83244k51149k23976j76806n6590n3028J3865J60870K68990
18626C231176J98769r4579j72226j48232p5865J5907K1795R2539J25527J48980
$$ plain form
18616 3343791 3502472 3620069 3738757 3867316 3832361 3690334 3478805 3228115 2931021 2758529
18606 2758529 2678282 2668687 2698496 2755039 2932436 3184380 3402595 3581951 3671086 3816996
18596 3816996 4202187 4796139 5708532 6992546 8852630 11614075 15947578 22962025 33039843
18587 33039843 42861242 46044236 42024956 35750695 30612237 28039256 28781282 33506034
18579 33506034 42746816 54003591 58798427 52958921 42380690 32249906 24139635 18395071
18571 18395071 14408901 11694202 9831568 8537334 7582694 6893259 6484716 6212068 5977285
18562 5977285 5727150 5391734 5084494 4814465 4667437 4718143 4848371 5121682 5519503 5834866
18552 5834866 5994906 6062617 6177181 6381804 6859749 7658707 8928121 10906565 13842877
$$ packed form
18616C343791J58681J17597J18688J28559l4955j42027k11529k50690k97094j72492
18606B758529q0247r595K9809N6543J77397K51944K18215J79356Q9135J45910
18596C816996L85191N93952R12393J284014J860084K761445M333503P014447J0077818
18587C3039843R821399L182994m019280o274261n138458k572981P42026M724752
18579C3506034R240782J1256775M794836n839506j0578231j0130784q110271n744564
18571A8395071l986170k714699j862634j294234r54640o89435m08543k72648k34783
18562E977285k50135l35416l07240k70029j47028N0706J30228K73311L97821L15363
18552E834866J60040O7711J14564K04623M77945P98958J269414J978444K936312
$$ plain form
18543 13842877 18311231 25509852 36778318 51256659 62262744 63463674 56810714 48154805
18535 48154805 41530101 38596599 40210233 47415356 59936839 71947290 73103877 62556400
18527 62556400 48455083 36007484 26631110 19987504 15418796 12226991 9935746 8342089
18519 8342089 7238180 6357992 5744717 5375009 5065250 4806295 4487535 4221597 4042832
18510 4042832 3948395 3901852 3980266 4237575 4528479 4747728 4752268 4617745 4507465 4426889
18500 4426889 4485540 4777961 5259831 6012692 7159983 8859120 11760936 16656009 23491653
18491 23491653 28347470 27295322 22926447 18742383 15977256 14938608 15880674 19102169
18483 19102169 23891934 26687929 24462988 19612991 14821691 11134680 8530271 6649005
$$ packed form
18543A3842877M468354P198621J1268466J4478341J1006085J200930o652960q655909
18535D8154805o624704k933502J613634P205123J2521483J2010451J156587j0547477
18527F2556400j4101317j2447599r376374o643606m568708l191805k291245j593657
18519H342089j103909q80188o13275l69708l09759k58955l18760k65938j78765
18510D042832r4437m6543P8414K57309K90904K19249M540j34523j10280q0576
18500D426889N8651K92421M81870P52861J147291J699137K901816M895073O835644
18491B3491653M855817j052148m368875m184064k765127j038648R42066L221495
18483A9102169M789765K795995k224941m849997m791300l687011k604409j881266
$$ plain form
18475 6649005 5289818 4430653 3813264 3321173 2952954 2665371 2456188 2360462 2272703 2240238
18465 2240238 2164901 2131766 2114025 2135487 2276622 2448200 2603337 2720821 2872763 2976026
18455 2976026 3041858 3071468 3123818 3252402 3362355 3506809 3706803 4003592 4354911 4725111
18445 4725111 5191573 5767842 6462203 7456523 8998084 11322353 14794699 20051764 28223510
18436 28223510 39943261 52878132 62229791 67980995 72599493 72960422 66891621 59295943
18428 59295943 55161143 56776940 63121947 68380242 69049531 67257523 61651920 51183137
18420 51183137 39644300 29865731 22500471 17295589 13698211 11138033 9402523 8170872
18412 8170872 7246430 6596019 6149134 5812935 5502076 5335215 5235413 5202756 5215014 5236021
$$ packed form
18475F649005j359187q59165o17389m92091l68219k87583k09183r5726q7759l2465
18465B240238p5337l3135j7741K1462J41135J71578J55137J17484J51942J03263
18455B976026O5832K9610N2350J28584J09953J44454J99994K96789L51319L70200
18445D725111M66462N76269O94361R94320J541561K324269L472346N257065Q171746
18436B8223510J1719751J2934871R351659N751204M618498L60929o068801p595678
18428E9295943m134800J615797O345007N258295O69289j792008n605603j0468783
18420E1183137j1538837r778569p365260n204882l597378k560178j735510j231651
18412H170872r24442o50411m46885l36199l10859j66861r9802l2657J2258K1007
$$ plain form
18402 5236021 5204191 5202749 5286242 5418619 5610292 5757193 5975715 6395463 7056231 8318541
18392 8318541 10184095 12998991 17562827 24936226 34815035 43091197 46756722 49721863
18384 49721863 53925238 54069959 48417325 42829655 40991938 43627934 47952898 49595150
18376 49595150 49102371 47884515 43665926 35891030 27630192 20777942 15654928 12014642
18368 12014642 9389825 7579874 6310219 5403794 4774245 4301525 3952415 3623142 3329099
18359 3329099 3119447 2973511 2813478 2729735 2743304 2712186 2605816 2513592 2336379 2180686
18349 2180686 2061067 2042880 2109505 2089805 2040288 1998485 1910051 1812608 1732319 1649527 1586790
18338 1586790 1588814 1641272 1593897 1606172 1636691 1623601 1640213 1590931 1618239 1599683 1599538 1692709
$$ packed form
18402E236021l1830j442Q3493J32377J91673J46901K18522M19748O60768J262310
18392H318541J865554K814896M563836P373399R878809Q276162L665525K965141
18384D9721863M203375J44721n652634n587670j837717K635996M324964J642252
18376D9595150m92779j217856m218589p774896q260838o852250n123014l640286
18368A2014642k624817j809951j269655r06425o29549m72720l49110l29273k94043
18359C329099k09652j45936j60033q3743J3569l1118j06370r2224j77213j55693
18349B180686j19619j8187O6625j9700m9517m1803q8434r7443q0289q2792o2737
18338A586790K024N2458m7375J2275L0519j3090J6612m9282K7308j8556j45R3171
$$ plain form
18326 1692709 1704581 1692062 1628626 1577916 1467244 1369179 1300759 1220286 1124003 1054826 956399
18315 956399 886596 854937 856175 939708 980367 1007123 1049617 1095360 1112582 1111020 1011092 922095
18303 922095 902144 938407 975106 973140 1011661 1039020 994824 909609 862501 778602 804394 792195
18291 792195 750308 777083 782326 844308 861843 880455 909244 1022031 1076813 1167617 1302753
18280 1302753 1311474 1312434 1314594 1259794 1155055 1112101 1109613 1038465 1045081 1072739 1043569 996661
18268 996661 991486 1068596 1127450 1205033 1225923 1235359 1231065 1219043 1239807 1257584 1270948 1287545
18256 1287545 1297867 1282803 1251589 1212107 1157211 1111765 1087763 1074299 1091810 1086400 1066009
18245 1066009 1034951 935138 885622 832316 784862 742284 711816 734920 764050 769438 763009 818316
$$ packed form
18326A692709J1872j2519o3436n0710j10672r8065o8420q0473r6283o9177r8427
18315I56399o9803l1659J238Q3533M0659K6756M2494M5743J7222j562r9928q8997
18303I22095j9951L6263L6699j966L8521K7359m4196q5215m7108q3899K5792j2199
18291G92195m1887K6775N243O1982J7535J8612K8789J12787N4782R0804J35136
18280A302753Q721R60K160n4800j04739m2954k488p1148O616K7658k9170m6908
18268I96661n175P7110N8854P7583K0890R436m294j2022K0764J7777J3364J6597
18256A287545J0322j5064l1214l9482n4896m5446k4002j3464J7511n410k0391
18245A066009l1058r9813m9516n3306m7454m2578l0468K3104K9130N388o429N5307
$$ plain form
18233 818316 843069 897060 951775 894147 812491 754568 734499 752313 802450 759074 675582
18222 675582 650125 667724 715637 740180 834755 883445 888488 867494 803230 774919 754161 652390
18210 652390 611081 627939 626305 630797 644381 642779 574306 544371 562975 561948 559686 538792
18198 538792 481177 510813 541737 594169 652655 639388 617690 664682 637100 617177 641540
18187 641540 629025 637618 615739 614455 578614 576365 541233 599038 604290 579342 571671 569779 504315
18174 504315 459586 459122 480870 517633 494898 452069 495473 535670 543803 508300 472142 451304
18162 451304 367902 306771 230707 194534 267926 261017 265308 355882 414033 451057 410089 345745
18150 345745 371936 398978 338526 300907 300571 375029 429010 406318 336350 292141 254403 260030
$$ packed form
18233H18316K4753N3991N4715n7628q1656n7923k0069J7814N0137m3376q3492
18222F75582k5457J7599M7913K4543R4575M8690N043k0994o4264k8311k0758j01771
18210F52390m1309J6858j634M492J3584j602o8473k9935J8604j027k262k0894
18198E38792n7615K9636L0924N2432N8486j3267k1698M6992k7582j9923K4363
18187F41540j2515Q593k1879j284l5841k249l5132N7805N252k4948p671j892o5464
18174E04315m4729m64K1748L6763k2735m2829M3404M0197Q133l5503l6158k0838
18162D51304q3402o1131p6064l6173P3392o909M291R0574N8151L7024m0968o4344
18150C45745K6191K7042o0452l7619l36P4458N3981k2692o9968m4209l7738N627
$$ plain form
18138 260030 285749 318281 297553 332874 388506 426290 402502 394745 458756 531715 546435 557334
18126 557334 551203 483083 393428 383676 436408 475964 484324 512304 601461 706692 728405 679951
18114 679951 595554 594596 537744 479412 426223 369370 350330 327207 327253 352428 387636 433733
18102 433733 451240 386370 250085 178671 231966 233858 234866 231743 266566 266176 275140 361109
18090 361109 384350 337799 376457 375535 352051 316683 295015 348211 382599 341116 313082 314998
18078 314998 250268 285941 357608 407378 425508 465235 503581 567647 577989 591088 569244
18067 569244 531555 476853 473517 470013 424873 402767 429297 444654 445098 384412 289918 253457
18055 253457 256594 255245 257542 277848 245554 186817 210901 201870 218298 214675 205355 209971 206811
$$ packed form
18138B60030K5719L2532k0728L5321N5632L7784k3788p757O4011P2959J4720J0899
18126E57334o131o8120q9655r752N2732L9556Q360K7980Q9157J05231K1713m8454
18114F79951q4397r58n6852n8332n3189n6853j9040k3123M6K5175L5208M6097
18102D33733J7507o4870j36285p1414N3295J892J008l123L4823l90Q964Q5969
18090C61109K3241m6551L8658r22k3484l5368k1668N3196L4388m1483k8034J916
18078C14998o4730L5673P1667M9770J8130L9727L8346O4066J0342J3099k1844
18067E69244l7689n4702l336l504m5140k2106K6530J5357M44o0686r4494l6461
18055B53457L137j349K297K0306l2294n8737K4084r031J6428l623r320M616l160
$$ plain form
18042 206811 210273 187382 161345 171970 192613 224242 216879 206455 218736 246900 245822 268372
18030 268372 320293 295854 272900 352672 422819 434316 422005 426743 461648 541392 561501 544221
18018 544221 460073 406071 426598 438749 426329 401784 373138 402750 396180 383940 327549 251418
18006 251418 233903 257896 230017 222305 227757 211615 153296 111727 237501 274786 227396 173405
17994 173405 161401 196342 203768 252241 232152 226939 274658 266413 206121 241355 304435 332896
17982 332896 286892 244091 246044 238142 240317 199019 240434 257946 227946 258365 307506 284130
17970 284130 246794 281357 287714 306210 262550 212039 144201 131005 214347 200716 98595
17959 98595 140549 177168 190064 126942 109737 126052 159505 177531 124426 144233 120731 131876
$$ packed form
18042B06811L462k2891k6037J0625K0643L1629p363j0424J2281K8164j078K2550
18030B68372N1921k4439k2954P9772P0147J1497j2311M738L4905P9744K0109j7280
18018E44221q4148n4002K0527J2151j2420k4545k8646K9612o570j2240n6391p6131
18006B51418j7515K3993k7879p712N452j6142n8319m1569J25774L7285m7390n3991
17994A73405j2004L4941P426M8473k0089n213M7719q245o0292L5234O3080K8461
17982C32896m6004m2801J953p902K175m1298M1415J7512l0000L0419M9141k3376
17970B84130l7336L4563O357J8496m3660n0511o7838j3196Q3342j3631j02121
17959I8595M1954L6619J2896o3122j7205J6315L3453J8026n3105J9807k3502J1145
$$ plain form
17947 131876 144713 112481 69046 57065 105738 141752 122836 112333 109273 128241 102672 148765
17935 148765 166613 102997 104518 147696 174920 167982 146599 178975 200334 185940 194803 245293
17923 245293 308033 355776 356560 370828 418049 354616 309356 378084 379748 354949 378916 391240
17911 391240 365272 374311 421322 420002 295618 220633 236628 203586 112221 112957 58276 45286
17899 45286 43017 46583 46099 24059 78526 104733 66664 114708 137004 124784 68814 82341
17887 82341 144367 185092 188447 103819 29434 30045 43730 52142 103936 184141 230644 279796
17875 279796 344741 328535 302477 282640 358362 419320 409353 366830 365424 326692 319056 362082
17863 362082 380173 318091 230686 188599 194356 217945 226114 245696 215158 222691 176815 214122
$$ packed form
17947A31876J2837l2232m3435j1981M8673L6014j8916j0503l060J8968k5569M6093
17935A48765J7848o3616J521M3178K7224o938k1383L2376K1359j4394Q863N0490
17923B45293O2740M7743P84J4268M7221o3433m5260O8728J664k4799K3967J2324
17911C91240k5968R039M7011j320j24384p4985J5995l3042r1365P36n4681j2990
17899D5286k269L566m84k2040N4467K6207l8069M8044K2296j2220n5970J3527
17887H2341O2026M0725L355q4628p4385O11J3685Q412N1794Q0205M6503M9152
17875B79796O4945j6206k6058j9837P5722O0958r967m2523j406l8732p636M3026
17863C62082J8091o2082q7405m2087N757K3589Q169J9582l0538P533m5876L7307
$$ plain form
17851 214122 201933 168404 156364 141681 103468 61160 113461 182865 124101 37355 14608
17840 14608 62540 176142 205781 165563 144802 116361 112093 91933 71252 57312 77596 80264
17828 80264 64564 5732 -4865 27285 19214 67091 64626 59359 75405 86841 75344 51455
17816 51455 62470 74948 62527 42716 36777 8186 -14479 20852 19191 16899 30702 21333
17804 21333 3255 47276 76171 135406 168385 157956 97982 103639 110500 82862 89075 82318
17792 82318 90642 80371 113616 175830 215250 213989 146170 78814 116764 126829 83697 76932
17780 76932 123867 85090 34148 76247 83906 5696 1284 1240 86167 170517 103736 36013 64513
17767 64513 81787 78398 72863 72616 98476 111483 74496 24775 39820 78308 105631 98850 71706
$$ packed form
17851B14122j2189l3529j2040j4683l8213m2308N2301O9404n8764q6746k2747
17840A4608M7932J13602K9639m0218k0761k8441m268k0160k0681j3940K0284K668
17828H0264j5700n8832j0597L2150q071M7877k465n267J6046J1436j1497k3889
17816E1455J1015J2478j2421j9811n939k8591k2665L5331j661k292J3803r369
17804B1333j8078M4021K8895N9235L2979j0429n9974N657O861k7638O213o757
17792H2318Q324j0271L3245O2214L9420j261o7819o7356L7950J0065m3132o765
17780G6932M6935l8777n0942M2099P659p8210m412m4Q4927Q4350o6781o7723K8500
17767F4513J7274l389n535k47K5860J3007l6987m9721J5045L8488K7323o781k7144
$$ plain form
17754 71706 54749 17904 24857 87353 145084 120102 106272 111601 127408 51881 -32096 -59508
17742 -59508 -44962 39762 127040 114000 83263 72830 87649 75180 16640 8859 85332 67181
17730 67181 63159 25583 4019 618 17084 30631 40021 37172 70346 90744 47910 55313 107211
17717 107211 110648 82619 47282 13516 3043 18921 -7407 27314 26895 80595 84158 40565
17705 40565 27387 16022 70428 103423 112850 91263 47025 -13054 -48050 -46522 18118 78643
17693 78643 118816 100661 78025 58261 49439 55028 50215 48256 74611 74455 103774 132507 123269
17680 123269 65747 8864 -32436 -18384 -29853 -17150 45247 23979 -24007 -1379 2197 4816
17668 4816 14256 14004 3917 -62009 -59950 47248 26516 -21598 -22102 13876 44469 30056 31554
$$ packed form
17754G1706j6957l6845O953O2496N7731k4982j3830N329J5807p5527q3977k7412
17742e9508J4546Q4724Q7278j3040l0737j0433J4819j2469n8540p781P6473j8151
17730F7181m022l7576k1564l401J6466J3547R390k849L3174K0398m2834P403N1898
17717A07211L437k8029l5337l3766j0473J5878k6328L4721m19N3700L563m3593
17705D0565j3178j1365N4406L2995R427k1587m4238o0079l4996J528O4640O0525
17693G8643M0173j8155k2636j9764q822N589m813j959K6355j56K9319K8733r238
17680A23269n7522n6883m1300J4052j1469J2703O2397k1268m7986K2628L576K619
17668D816R440k52j0087o5926K059J07198k0732m8114n04L5978L0593j4413J498
$$ plain form
17655 31554 55164 72775 17780 21403 -48793 -74407 -71029 -67017 -15751 -54 28489 73936
17643 73936 47035 54353 95507 115080 82411 17884 -10421 26363 72408 139318 114299 46987
17631 46987 47120 46615 49883 46932 68134 109076 108934 161127 165994 100228 63565 63242 35855 6106
17617 6106 18281 54755 -44579 -69498 -78646 -14979 9670 75133 53668 -11452 -14495 -15201 28755
17604 28755 66037 87360 110880 87789 18232 -30281 -17186 29310 46010 34118 -10908 -11643
17592 -11643 14508 -31213 -46773 670 31220 14738 -12782 -26356 -23936 -17745 34939 40255
17580 40255 51622 106322 44432 53165 26694 37900 95040 107584 45765 -23751 -37184 -30028
17568 -30028 -59574 -41995 18695 54066 -10141 -37543 -15483 -29170 -68047 -50815 -38152 -3732
$$ packed form
17655C1554K3610J7611n4995L623p0196k5614L378M012N1266J5697K8543M5447
17643G3936k6901P318M1154J9573l2669o4527k8305L6784M6045O6910k5019o7312
17631D6987J33n05L268k951K1202M0942j42N2193M867o5766l6663l23k7387k9749
17617F106J2175L6474r9334k4919r148O3667K4649O5463k1465o5120l043p06M3956
17604B8755L7282K1323K3520k3091o9557m8513J3095M6496J6700j1892m5026p35
17592a1643K6151m5721j5560M7443L0550j6482k7520j3574K420O191N2684N316
17580D0255J1367N4700o1890Q733k6471J1206N7140J2544o1819o9516j3433P156
17568c0028k9546J7579O0690L5371o4207k7402K2060j3687l8877J7232J2663L4420
$$ plain form
17556 -3732 39682 48693 61181 81881 56045 7605 -17752 -11475 -27149 -9967 19538 -7335
17544 -7335 -13652 -50373 -65854 -39832 -5951 23210 28628 53288 49398 24068 33534 48839 60514
17531 60514 66499 48972 60778 112411 83931 911 -34142 -9050 6827 30385 -2487 -9941
17519 -9941 54419 1834 -33099 -45167 -100896 -115754 -115453 -95799 26135 83958 54898 30261
17507 30261 29663 24553 -9468 -43007 -40624 1511 -3151 -42022 -17949 -19835 -8445 11481 -84
17494 -84 16426 -16828 -25780 -28586 -44397 51754 68347 70546 79157 56485 117041 63414 80493
17481 80493 72846 30635 24327 56071 37550 -15130 -42916 21779 55943 44709 10366 1142
17469 1142 7081 44539 26628 6359 -50589 -58043 -73592 -15322 23592 36796 37488 28570 7568
$$ packed form
17556c732M3414R011J2488K0700k5836m8440k5357O277j5674J7182K9505k6873
17544g335o317l6721j5481K6022L3881K9161N418K4660l890k5330R466J5305J1675
17531F0514N985j7527J1806N1633k8480q3020l5053K5092J5877K3558l2872p454
17519i941O4360n2585l4933j2068n5729j4858L01J9654J21934N7823k9060k4637
17507C0261n98n110l4021l3539K383M2135m662l8871K4073j886J1390J9926j1565
17494h4J6510l3254q952k806j5811R6151J6593K199Q611k2672O0556n3627J7079
17481H0493p647m2211o308L1744j8521n2680k7786O4695L4164j1234l4343r224
17469A142N939L7458j7911k0269n6948p454j5549N8270L8914J3204O92q918k1002
$$ plain form
17456 7568 26345 48506 -3092 -54624 -23614 -1195 -11505 17390 71097 98409 75345 79060
17444 79060 66974 9195 11011 26762 4732 -85715 -130098 -36098 -20904 -41747 818 33332
17432 33332 25425 -3149 -13969 -25720 1206 -7726 -19355 10828 20590 36114 44491 58879
17420 58879 -230 -30588 -9520 -23482 34356 100965 117343 122015 70563 19745 -30297 25210
17408 25210 83799 97050 45966 -2046 -24861 6 1010 20112 51103 63315 52166 16300
17396 16300 9369 20129 9352 17738 30073 45525 23950 10967 25729 -1466 -11117 -10000
17384 -10000 19604 19228 13722 -23258 -49725 -102888 -61126 -33648 -25848 -46413 -37230 -12850 12118
17371 12118 -7841 -22786 -64783 -105806 -123934 -66913 -67281 -70422 -4097 12196 -50928 -52242
$$ packed form
17456G568J8777K2161n1598n1532L1010K2419j0310K8895N3707K7312k3064L715
17444G9060j2086n7779J816J5751k2030r0447m4383R4000J5194k0843M2565L2514
17432C3332p907k8574j0820j1751K6926q932j1629L0183R762J5524Q377J4388
17420E8879n9109l0358K1068j3962N7838O6609J6378M672n1452n0818n0042N5507
17408B5210N8589J3251n1084m8012k2815K4867J004J9102L0991J2212j1149l5866
17396A6300o931J0760j0777Q386J2335J5452k1575j2983J4762k7195r651J117
17384a0000K9604l76n506l6980k6467n3163M1762K7478P800k0565R183K4380K4968
17371A2118j9959j4945m1997m1023j8128N7021l68l141O6325J6293o3124j314
$$ plain form
17359 -52242 -16288 -90103 -86794 -36472 -20021 -50616 -20865 28323 9294 17021 -13937 -51954
17347 -51954 -46690 -32524 4972 21525 -34100 -42074 -24935 -6573 41316 4168 -52025 -121858
17335 -121858 -126486 -122145 -102651 -51722 -38954 -56086 -40407 3553 41942 30372 53832 -11918
17323 -11918 -45910 -2826 21264 34799 11563 -57568 -10342 62621 75446 47139 25835 20793
17311 20793 46897 65601 16802 3135 11152 18499 43009 38932 252 -43936 -81416 -122577
17299 -122577 -89577 -49204 -36825 -35039 10855 49311 37058 -4061 -54588 -66902 -18644 47214
17287 47214 7419 -12705 12263 39267 82490 117954 63671 50725 60196 84058 153722 135239
17275 135239 103672 95661 46033 43855 37121 -16521 -26997 34032 90843 63992 33964 -5637
$$ packed form
17359e2242L5954p3815L309N0322J6451l0595K9751M9188j9029P727l0958l8017
17347e1954N264J4166L7496J6553n5625p974J7139J8362M7889l7148n6193o9833
17335a21858m628M341J9494N0929J2768j7132J5679M3960L8389j1570K3460o5750
17323a1918l3992M3084K4090J3535k3236o9131M7226P2963J2825k8307k1304n042
17311B0793K6104J8704m8799j3667Q017P347K4510m077l8680m4188l7480m1161
17299a22577L3000M0373J2379J786M5894L8456j2253m1119n0527j2314M8258O5858
17287D7214l9795k0124K4968K7004M3223L5464n4283j2946R471K3862O9664j8483
17275A35239l1567q011m9628k178o734n3642j0476O1029N6811k6851l0028l9601
$$ plain form
17263 -5637 -42063 -35099 -18857 -4822 8471 13957 -3681 13137 52428 74872 72814 54555
17251 54555 11339 7240 -5658 -45567 13777 -69 7699 -23696 -3019 -21686 -24162 -41069
17239 -41069 -28911 -13121 9707 21280 59611 34754 43516 59219 71728 9927 -35156 -62449
17227 -62449 -81978 -106392 -67982 -58145 -16902 -38068 -112946 -106141 -36495 22132 37120 30030
17215 30030 21739 -40102 -41523 11864 5099 -18110 -28053 -26602 -26833 -1791 60320 63576 48129
17202 48129 51479 38496 33662 -3978 -30042 -23933 484 46470 99864 77064 91025 70690
17190 70690 20722 -10019 -25794 -61254 -49909 -14248 4424 3527 -35646 -32405 -12203 -43139
17178 -43139 -28525 6607 12122 -429 -14896 -47059 -34864 -6231 -21620 18639 116255 109756
$$ packed form
17263e637l6426O964J6242J4035J3293N486j7638J6818L9291K2444k058j8259
17251E4555m3216m099j2898l9909N9344j3846P768l1395K0677j8667k476j6907
17239d1069J2158J5790K2828J1573L8331k4857Q762J5703J2509o1801m5083k7293
17227f2449j9529k4414L8410R837M1243k1166p4878O805O9646N8627J4988p090
17215C0030q291o1841j421N3387o765k3209r943J451k31K5042O2111L256j5447
17202D8129L350j2983m834l7640k6064O109K4417M5986N3394k2800J3961k0335
17190G0690m9968l0741j5775l5460J1345L5661J8672q97l9173L241K0202l0936
17178d3139J4614L5132N515j2551j4467l2163J2195K8633j5389M0259R7616o499
$$ plain form
17166 109756 77892 27523 30112 7865 10554 -4307 -71934 -68696 -1387 36327 -1814 2996
17154 2996 47270 51300 22902 -37583 -78163 -75532 -46760 -7612 -34683 -14501 -59776 -108072
17142 -108072 -51829 -40469 -26427 25204 27619 25542 -16940 11040 -11255 -57761 -96183 -59000
17130 -59000 -20249 -94490 -110278 -62194 20956 138786 122912 114060 102840 140934 115105 126575
17118 126575 97492 58621 38838 28404 31762 18376 42220 -10252 -55007 -62968 -60606 -32867
17106 -32867 5808 15523 41713 28908 -1880 -29122 10159 -10481 -18761 -16894 -39668 -41258
17094 -41258 1419 30637 5235 13287 56958 91756 -5075 -75964 -29534 -743 11469 34714
17082 34714 21949 -18474 -65362 -36868 -61733 -59797 -64841 -40371 -43794 -77526 -51114 -78061
$$ packed form
17166A09756l1864n0369K589k2247K689j4861o7627L238O7309L7714l8141M810
17154B996M4274M030k8398o0485m0580K631K8772L9148k7071K0182m5275m8296
17142a08072N6243J1360J4042N1631K415k077m2482K7980k2295m6506l8422L7183
17130e9000L8751p4241j5788M8084Q3150J17830j5874q852j1220L8094k5829J1470
17118A26575k9083l8871j9783j0434L358j3386K3844n2472m4755p961K362K7739
17106c2867L8675R715K6190j2805l0788k7242L9281k0640q280J867k2774j590
17094d1258M2677K9218k5402Q052M3671L4798r6831p0889M6430K8791J2212K3245
17082C4714j2765m0423m6888K8494k4865J936n044K4470l423l3732K6412k6947
$$ plain form
17070 -78061 -29233 10597 -52411 -23512 -19536 -25843 -17011 -47478 -51199 -87936 -77324 -78235 -29259
17057 -29259 -6830 -28548 -25453 -22115 32797 24798 66628 57578 11165 22365 21198 42523 115095
17044 115095 71704 69104 80806 84074 102445 93991 52332 6580 -11870 12717 49281 55544
17032 55544 26975 -39134 -104414 -106692 -117168 -112206 -107475 -131403 -59611 -33448 -7302 1562
17020 1562 11295 2468 20013 17428 16026 26936 45276 101368 141416 162355 81982 32395 52068
17007 52068 44104 19805 43990 18938 6066 -1898 11165 -889 10938 18724 19937 9448
16995 9448 -21182 4535 19772 -32142 -60676 -46020 -51578 -44415 -59421 -52195 -35638 -43232 -50544
16982 -50544 -20862 -7025 -66634 -100148 -43731 -36118 -15791 45972 46410 40963 60627 68933 70041
$$ packed form
17070g8061M8828L9830o3008K8899L976o307Q832l0467l721l6737J0612r11M8976
17057b9259K2429k1718L095L338N4912p999M1830r050m6413J1200j167K1325P2572
17044A15095m3391k600J1702L268J8371q454m1659m5752j8450K4587L6564O263
17032E5544k8569o6109o5280k278j0476M962M731k3928P1792K6163K6146Q864
17020A562R733q827J7545k585j402J0910J8340N6092M0048K0939q0373m9587J9673
17007E2068p964k4299K4185k5052j2872p964J3063j2054J1827P786J213j0489
16995I448l0630K5717J5237n1914k8534J4656n558P163j5006P226J6557p594p312
16982e0544K9682J3837n9609l3514N6417P613K0327O1763M38n447J9664Q306J108
$$ plain form
16969 70041 71074 70670 73146 30282 74307 71306 20182 -4351 67240 19031 -2472 4886 3732
16956 3732 -19792 -13247 723 15320 7108 39718 57692 51891 54487 20149 -6497 44871 58659
16943 58659 63176 83015 61416 18112 -22585 -9527 5544 17769 798 17517 -56120 -88200
16931 -88200 -54656 13536 45766 13688 -14663 -19588 -10311 5032 -2544 6811 25749 34259 67045
16918 67045 61163 64069 54971 28166 -22356 -29927 18583 71850 53082 12130 -7526 -6554 -28577
16905 -28577 -75281 -52702 -70585 -54014 -53459 -3213 25522 95646 118999 119519 80868 55079
16893 55079 20574 27058 16307 18307 -13328 7259 18693 7468 3398 -33732 -40279 -32639 -7507
16880 -7507 1108 -4406 -72519 -133898 -97056 -11567 -18041 -40203 -22400 6385 48839 146753
$$ packed form
16969G0041J033m04K476m2864M4025l001n1124k4533P1591m8209k1503P358j154
16956C732k3524O545J3970J4597q212L2610J7974n801K596l4338k6646N1368J3788
16943E8659M517J9839k1599m3304m0697J3058J5071J2225j6971J6719p3637l2080
16931h8200L3544O8192L2230l2078k8351m925R277J5343p576R355J8938Q510L2786
16918F7045n882K906r098k6805n0522p571M8510N3267j8768m0952j9656R72k2023
16905b8577m6704K2579j7883J6571N55N0246K8735P0124K3353N20l8651k5789
16893E5079l4505O484j0751K000l1635K0587J1434j1225m070l7130o547P640K5132
16880g507Q615n514o8113o1379L6842Q5489o474k2162J7803K8785M2454R7914
$$ plain form
16868 146753 145612 114677 48913 -25119 -57494 -1974 3544 -23546 -31344 56013 84820 37423
16856 37423 -32131 19820 78083 27518 -18362 -2727 15507 -4177 -34848 -36974 -84500 -107377
16844 -107377 -59909 -67540 -67722 8455 58126 42447 -1914 -459 54862 80431 83391 102114
16832 102114 20956 10217 -12094 27449 5561 -64991 -63290 -76855 -91546 -123024 -130211 -116767
16820 -116767 -75261 21397 19460 15861 9606 -6687 -62554 -80242 -105453 -44647 38747 32495
16808 32495 -17368 18344 29368 96999 88946 62569 44553 41452 80749 6560 -38604 -5036
16796 -5036 -20368 -13423 47784 58330 13861 6549 -27185 -48593 -2270 -63868 -117171 -83672
16784 -83672 -15800 36378 38267 12381 -42064 -109625 -136555 -79411 -57963 -56488 -44423 -12450
$$ packed form
16868A46753j141l0935o5764p4032l2375N5520N518k7090p798Q7357K8807m7397
16856C7423o9554N1951N8263n0565m5880J5635J8234j9684l0671k126m7526k2877
16844a07377M7468p631j82P6177M9671j5679m4361J455N5321K5569K960J8723
16832A02114q1158j0739k2311L9543k1888p0552J701j3565j4691l1478p187J3444
16820a16767M1506R6658j937l599o255j6293n5867j7688k5211O0806Q3394o252
16808C2495m9863L5712J1024O7631q053k6377j8016l101L9297p4189m5164L3568
16796e036j5332O945O1207J0546m4469p312l3734k1408M6323o1598n3303L3499
16784h3672O7872N2178J889k5886n4445o7561k6930N7144K1448J475J2065L1973
$$ plain form
16772 -12450 32144 37903 15364 -7063 -8364 23194 3047 -46862 -43007 -61769 -93516 -3965
16760 -3965 -689 9973 17831 -1378 -8309 -38755 -60399 -36281 -13836 -25246 -16517 27703 92906
16747 92906 51001 36923 -4306 9944 -5447 -78827 -40624 -12021 14791 -4373 -20250 -22336
16735 -22336 -43458 -47093 -9144 23683 43477 18500 -25478 -51366 -51872 -47885 -46004 -12071 1674
16722 1674 24820 -4369 -82024 -96407 -61365 5076 15403 18704 -6822 -56191 -50086 -46020
16710 -46020 -26281 29836 52185 115424 122240 77259 9372 27094 9842 -34270 -54659 -9475
16698 -9475 -13377 -25685 9171 15430 -35484 -32497 -25348 -46863 -31408 22105 -5253 -13361 33525
16685 33525 53190 30015 76659 122587 120315 131270 106507 44277 -31406 -73267 -58392 -34619
$$ packed form
16772a2450M4594N759k2539k2427j301L1558k0147m9909L855j8762l1747Q9551
16760c965L276J0662P858j9209o931l0446k1644K4118K2445j1410Q729M4220O5203
16747I2906m1905j4078m1229J4250j5391p3380L8203K8603K6812j9164j5877k086
16735b2336k1122l635L7949L2827J9794k4977m3978k5888n06L987J881L3933J3745
16722A674K3146k9189p7655j4383L5042O6441J0327L301k5526m9369O105M066
16710d6020J9739N6117K2349O3239O816m4981o7887J7722j7252m4112k0389M5184
16698i475l902j2308L4856O259n0914K987P149k1515J5455N3513k7358q108M6886
16685C3525J9665k3175M6644M5928k272J0955k4763o2230p5683m1861J4875K3773
$$ plain form
16673 -34619 -37852 -3513 14040 8985 38830 33755 47290 32918 -30910 -37806 -59964 -26039
16661 -26039 113 -40762 -74633 -86820 -132521 -66439 22854 10030 -26212 -52636 -60843 -58411
16649 -58411 -100878 -150579 -118036 -99689 -48810 -68329 -96493 -65974 -25169 5013 13415 21196
16637 21196 76939 88025 38516 -28978 -32150 -60182 -63430 18130 59452 64524 73099 84327
16625 84327 72162 54409 27169 4898 -26575 18604 42222 58185 3377 -43831 -55646 -18503
16613 -18503 -48136 -43739 -12066 -24126 -16417 47841 64672 94198 89995 57231 64152 51128
16601 51128 36032 -28 11229 5919 -8262 14674 60942 90852 102933 34531 35781 75322
16589 75322 72580 44222 8952 13843 26626 26045 19056 13424 25562 43083 46723 38180 30047
$$ packed form
16673c4619l233L4339J7553n055K9845n075J3535j4372o3828o896k2158L3925
16661b6039K6152m0875l3871j2187m5701O6082Q9293j2824l6242k6424q207K432
16649e8411m2467m9701L2543J8347N0879j9519k8164L0519M0805L0182Q402P781
16637B1196N5743J1086m9509o7494l172k8032l248Q1560M1322N072Q575J1228
16625H4327j2165j7753k7240k2271l1473M5179K3618J5963n4808m7208j1815L7143
16613a8503k9633M397L1673j2060P709O4258J6831K9526m203l2764O921j3024
16601E1128j5096l6060J1257n310j4181K2936M6268K9910J2081o8402J250L9541
16589G5322k742k8358l5270M891J2783n81o989n632J2138J7521L640q543q133
$$ plain form
16576 30047 48397 19968 -17 21255 -59955 -79683 -17970 22851 -1210 6968 31998 22982
16564 22982 43083 3155 28221 -17267 -4575 -30790 -55638 -66292 -42844 26717 39132 66448
16552 66448 54914 11698 -7668 34533 11316 -7161 911 -5425 -17087 5271 -20798 -51014
16540 -51014 -48041 7692 15334 -3848 -22333 -45279 -51060 201 -1815 -18707 12614 -590
16528 -590 5668 35081 31118 924 32031 13806 -23581 -54319 -21789 21152 34303 -10059
16516 -10059 -15078 31760 45166 42237 27058 -2132 -31075 -61927 -30513 -40652 -57196 -76449
16504 -76449 -63477 -68460 -47877 -2627 -56387 -92000 -98183 -58052 -19016 -31689 -67257 -37268
16492 -37268 31035 23915 -22265 -48769 -14023 -11399 -32614 -18698 -60099 -45855 -9543 -67249
$$ packed form
16576C0047J8350k8429j9985K1272q1210j9728O1713M0821k4061Q178K5030r016
16564B2982K0101l9928K5066m5488J2692k6215k4848j0654K3448O9561J2415K7316
16552F6448j1534m3216j9366M2201k3217j8477Q072o336j1662K2358k6069l0216
16540e1014K973N5733P642j9182j8485k2946n781N1261k016j6892L1321j3204
16528e90O258K9413l963l0194L1107j8225l7387l0738L2530M2941J3151m4362
16516a0059n019M6838J3406k929j5179k9190k8943l0852L1414j0139j6544j9253
16504g6449J2972m983K0583M5250n3760l5613o183M0131L9036j2673l5568K9989
16492c7268O8303p120m6180k6504L4746K624k1215J3916m1401J4244L6312n7706
$$ plain form
16480 -67249 -70908 -48085 9161 -22569 -55645 -23285 16166 -45406 -50962 -15486 45571 30529
16468 30529 -2641 -26418 -38413 -58602 -76321 -69201 -48307 -24386 -5392 11199 15644 16809
16456 16809 3459 20091 19821 9828 -17417 -42035 -12115 23401 58959 68557 -8661 -35980
16444 -35980 -38994 4267 38833 -31972 -68010 -84785 -108299 -157286 -97831 -58564 -57478 -19271
16432 -19271 -56391 -94024 -93174 -52876 -11290 -6954 -3138 -63423 -70637 -44403 -8325 -10796 -25043
16419 -25043 -25470 -43188 -45891 -25543 -20863 -8306 26487 46218 37996 -7420 45947 62682 42105
16406 42105 81295 87343 100633 67959 35836 14784 -22201 -5797 -3847 -18358 -37527 18442
16394 18442 94669 122766 131082 145214 111225 70153 44218 8405 21602 25124 -11096 -19439
$$ packed form
16480f7249l659K2823N7246l1730l3076L2360L9451o1572n556L5476O1057j5042
16468C0529l3170k3777j1995k0189j7719P120K0894K3921J8994J6591M445J165
16456A6809j3350J6632k70r993k7245k4618K9920L5516L5558R598p7218k7319
16444c5980l014M3261L4566p0805l6038j6775k3514m8987N9455L9267J086L8207
16432a9271l7120l7633Q50M0298M1586M336L816o0285p214K6234L6078k471j4247
16419b5043m27j7718k703K0348M680J2557L4793J9731q222m5416N3367J6735k0577
16406D2105L9190O048J3290l2674l2123k1052l6985J6404J950j4511j9169N5969
16394A8442P6227K8097Q316J4132l3989m1072k5935l5813J3197L522l6220q343
$$ plain form
16382 -19439 -47727 -10813 -40721 -73039 -69527 -73991 -118672 -90706 3807 7356 -17689 -10505
16370 -10505 -38644 -65690 -82536 -22203 -222 43184 47740 -7503 -50113 -76846 -85134 -52591
16358 -52591 -25636 21598 74027 -13479 -67237 -15241 -9747 -29237 -61709 -138438 -151190 -133966
16346 -133966 -85468 -28916 35838 40799 9221 49064 58002 30197 8422 36319 75594 94195
16334 94195 18783 37244 50700 -22059 -35234 -48199 21684 13903 -55110 -68252 -30109 -51360
16322 -51360 -91329 -81274 -44034 -4387 -24831 29775 48971 9143 11180 -29516 -38335 -19244
16310 -19244 40482 47456 34346 87460 106376 59812 31075 6399 36206 40728 19814 -4651
16298 -4651 -45191 -51937 -83143 -62637 -16199 -34988 -63666 -39401 24617 83375 88087 35732
$$ packed form
16382a9439k8288L6914k9908l2318L512m464m4681K7966R4513L549k5045P184
16370a0505k8139k7046j6846O0333K1981M3406M556n5243m2610k6733q288L2543
16358e2591K6955M7234N2429q7506n3758N1996N494j9490l2472p6729j2752J7224
16346a33966M8498N6552O4754M961l1578L9843Q938k7805k1775K7897L9275J8601
16334I4195p5412J8461J3456p2759j3175j2965O9883p781o9013j3142L8143k1251
16322e1360l9969J0055L7240L9647k0444N4606J9196l9828K037m0696q819J9091
16310a9244N9726O974j3110N3114J8916m6564k8737k4676K9807M522k0914k4465
16298d651m0540o746l1206K0506M6438j8789k8678K4265O4018N8758M712n2355
$$ plain form
16286 35732 -5940 1373 -70466 -46662 -4898 -43291 -50387 -11012 13921 5041 39632 89273
16274 89273 15084 -71221 -75411 -6985 5192 -28639 -64527 -68871 -61409 -49842 -49707 -24475 -23834
16261 -23834 -45639 3019 1695 -92560 -113705 -77725 -74824 -34888 -24886 12650 3330 -18866
16249 -18866 -25670 -71390 -67717 -36238 -32703 -40657 6461 30897 43780 72400 45824 -7270
16237 -7270 -34077 -59393 -72605 -44643 -63284 -73422 -18317 20730 62262 51509 -22502 -33915
16225 -33915 -54814 -60645 -32849 -14447 -22520 -72350 -28019 2605 44488 54626 21078 17650
16213 17650 40901 47862 -8364 -24555 -13058 -21111 -94053 -40453 52104 82714 57021 63600
16201 63600 30049 19111 31529 19712 27433 771 49492 52975 90862 65415 -9666 -31128
$$ packed form
16286C5732m1672P313p1839K3804M1764l8393p096L9375K4933q880L4591M9641
16274H9273p4189q6305m190O8426J2177l3831l5888m344P462J1567J35K5232O41
16261b3834k1805M8658j324r4255k1145L5980K901L9936J0002L7536r320k2196
16249a8866o804m5720L673L1479L535p954M7118K4436J2883K8620k6576n3094
16237g270k6807k5316j3212K7962j8641j0138N5105L9047M1532j0753p4011j1413
16225c3915k0899n831K7796J8402q073m9830M4331L0624M1883J0138l3548l428
16213A7650K3251O961n6226j6191J1497q053p2942N3600R2557L0610k5693O579
16201F3600l3551j0938J2418j1817P721k6662M8721L483L7887k5447p5081k1462
$$ plain form
16189 -31128 13388 62219 12423 -13104 -48337 -35340 -4454 25963 1592 -38902 -82729 -150952
16177 -150952 -179299 -101848 -30097 -4041 -44251 -22427 -740 14909 20302 42080 41170 34557
16165 34557 -36371 -32214 -13290 -2843 -53484 -84523 -94474 -64641 -63116 -106636 -104815 -109815 -66571
16152 -66571 -61259 5652 79992 69460 31290 25176 49959 87097 67644 48035 26029 14663
16140 14663 19847 -20380 -23963 -41882 6811 87948 82393 104596 129422 21808 -46192 -13018
16128 -13018 2104 9833 22455 -3398 20087 5654 -17725 -43255 -34130 -7841 23256 77201
16116 77201 84996 89115 48230 39014 85614 81573 44610 21437 -14940 26051 -4790 -26083
16104 -26083 -30404 -8473 -5461 -72250 -98272 -76096 -23103 9881 -5413 1744 -23160 -45319
$$ packed form
16189c1128M4516M8831m9796k5527l5233J2997L0886L0417k4371m0494m3827o8223
16177a50952k8347P7451P1751K6056m0210K1824K1687J5649N393K1778r10o613
16165C4557p0928M157J8924J0447n0641l1039r951K9833J525m3520J821n000M3244
16152f6571N312O6911P4340j0532l8170o114K4783L7138j9453j9609k2006j1366
16140A4663N184m0227l583j7919M8693Q1137n555K2203K4826j07614o8000L3174
16128a3018J5122P729J2622k5853K3485j4433k3379k5530R125K6289L1097N3945
16116G7201P795M119m0885r216M6600m041l6963k3173l6377M0991l0841k1293
16104b6083m321K1931L012o6789k6022K2176N2993L2984j5294P157k4904k2159
$$ plain form
16092 -45319 -21183 -61588 -88109 -59106 -61772 -63260 -20814 5739 24638 3703 -43912 -61539
16080 -61539 -95123 -93422 -92225 -57448 -18908 -46577 -48362 10318 43058 33886 48061 26522
16068 26522 -5546 27729 55407 57927 50464 40664 54704 53030 87738 31726 -44037 -118841
16056 -118841 -83111 -56357 -20111 -13914 21960 78046 78058 40739 27682 -11975 15748 13697
16044 13697 4294 23205 82442 75521 77905 74978 58106 37628 17496 2225 18071 -6232
16032 -6232 2785 26174 -34812 -21636 3807 -34394 -39294 1726 32287 -34805 -25104 2011
16020 2011 39435 84145 134789 120832 157153 177822 131745 90182 63488 74638 88505 57090
16008 57090 84522 126334 178681 111586 25816 22605 92471 143101 105484 81135 87943 85895
$$ packed form
16092d5319K4136m0405k6521K9003k666j488M2446K6553J8899k0935m7615j7627
16080f1539l3584J701J197L4777L8540k7669j785N8680L2740r172J4175k1539
16068B6522l2068L3275K7678K520p463r800J4040j674L4708n6012p5763p4804
16056a18841L5730K6754L6246O197L5874N6086J2l7319j3057l9657K7723k051
16044A3697r403J8911N9237o921K384k927j6872k0478k0132j5271J5846k4303
16032f232R017K3389o0986J3176K5443l8201m900M1020L0561o7092R701K7115
16020B011L7424M4710N0644j3957L6321K0669m6077m1563k6694J1150J3867l1415
16008E7090K7432M1812N2347o7095q5770l211O9866N0630l7617k4349O808k048
$$ plain form
15996 85895 27462 -25742 -63570 -76177 -94287 -28062 39223 45152 46482 51959 63446 43390
15984 43390 -3940 -15455 9027 -19376 10352 40295 62285 115257 83622 11818 -20246 -3425
15972 -3425 9625 -2639 -3065 -12819 -31570 -44597 -44426 12207 19610 5403 -39350 -30017 38790
15959 38790 71329 87753 84111 37985 32471 -6090 4210 -15256 -42639 -32543 -48282 -102806
15947 -102806 -55801 51476 81463 57833 49048 91320 74380 37962 16555 70791 96993
15936 96993 46235 17838 -33869 -47932 -64690 -57380 -64919 -32768 -28385 -23841 -10372 -26819
15924 -26819 -435 64505 95070 59957 38360 15550 4171 -14365 -37220 -9058 2958 -8468
15912 -8468 -49014 4460 52676 75192 51459 23621 13966 -5661 -10152 -41332 -15834 49056
$$ packed form
15996H5895n8433n3204l7828j2607j8110O6225O7285N929J330N477J1487k0056
15984D3390m7330j1515K4482k8403K9728K9943K1990N2972l1635p1804l2064J6821
15972c425J3050j2264m26r754j8751j3027J71N6633P403j4207m4753R333O8807
15959C8790L2539J6424l642m6126n514l8561J0300j9466k7383J0096j5739n4524
15947a02806M7005J07277K9987k3630q785M2272j6940l6418k1407N4236K6202
15936I6993n0758k8397n1707j4063j6758P310p539L2151M383M544J3469j6447
15924b6819K6384O4940L0565l5113k1597k2810j1379j8536k2855K8162J2016j1426
15912h468m0546N3474M8216K2516k3733k7838r655j9627m491l1180K5498O4890
$$ plain form
15900 49056 34555 10537 -1600 -35836 -25283 -16539 -19863 -13357 17318 12963 29348 27208 12325
15887 12325 23291 53249 -21042 -94959 -102334 -66821 -50608 -37924 -42393 -88731 -109573 -81950
15875 -81950 -18782 -8537 -12722 -6487 -26189 -29096 46726 77174 96236 85386 50536 5097
15863 5097 57 28473 70612 51461 40247 -1039 -2595 -7095 380 64091 75334 44536 20796
15850 20796 -5081 13811 52996 58094 56411 16089 1755 10444 -40871 -28789 6467 31139
15838 31139 14953 -29140 -69012 -54655 -36052 -1672 7717 -54828 -75461 -87579 -61308 -75732
15826 -75732 -78929 -18040 81638 88196 65321 17784 -21833 -56466 -14536 4960 16568 33577
15814 33577 55246 50678 20195 7487 -4329 -41916 -95903 -62266 -4381 -39448 -18350 -23741
$$ packed form
15900D9056j4501k4018j2137l4236J0553Q744l324O506L0675m355J6385k140j4883
15887A2325J0966K9958p4291p3917p375L5513J6213J2684m469m6338k0842K7623
15875h1950O3168J0245m185O235j9702k907P5822L0448J9062j0850l4850m5439
15863E097n040K8416M2139j9151j1214m1286j556m500P475O3711J1243l0798k3740
15850B0796k5877J8892L9185N098j683m0322j4334Q689n1315J2082L5256K4672
15838C1139j6186m4093l9872J4357J8603L4380R389o2545k0633j2118K6271j4424
15826g5732l197O0889R9678O558k2875m7537l9617l4633M1930J9496J1608J7009
15814C3577K1669m568l0483j2708j1816l7587n3987L3637N7885l5067K1098n391
$$ plain form
15802 -23741 -39732 -76774 -61883 -54218 -31020 17058 9070 6386 -17006 -45777 -60481 -47840
15790 -47840 -43511 -39877 -29179 -26539 -63952 -47226 -41514 -25628 6465 16985 68646 47894
15778 47894 2543 16466 32766 -17294 -31989 29342 -6484 -20316 24077 36003 57523 61981
15766 61981 48449 11215 33788 35974 -570 49644 73975 17502 -25114 -38945 -6806 23898
15754 23898 38418 7997 35258 64259 65848 37938 -4438 18697 54271 65451 20603 -21962
15742 -21962 -28202 -28170 -19266 -28080 -20485 30250 46529 20399 988 -27802 -38565 -20673 -37108
15729 -37108 -39492 -16774 -23744 -67094 -120420 -147092 -91789 -46495 -48684 -38649 -18799 -28644
15717 -28644 -24549 -27003 22705 1924 -10061 13218 -13999 69681 84987 1114 -8631 15983
$$ packed form
15802b3741j5991l7042J4891P665K3198M8078p988k684k3392k8771j4704J2641
15790d7840M329L634J0698K640l7413J6726N712J5886L2093J0520N1661k0752
15778D7894m5351J3923J6300n0060j4695O1331l5826j3832M4393J1926K1520M458
15766F1981j3532l7234K2573K186l6544N0214K4331n6473m2616j3831L2139L0704
15754B3898J4520l0421K7261K9001J589k7910m2376K3135L5574J1180m4848m2565
15742b1962o240L2Q904q814P595N0735J6279k6130j9411k8790j0763J7892j6435
15729c7108k384K2718o970m3350n3326k6672N5303M5294k189J0035J9850r845
15717b8644M095k454M9708k0781j1985K3279k7217Q3680J5306q3873r745K4614
$$ plain form
15705 15983 31192 -15934 -60208 -13438 35130 21139 5277 105 -5272 -25318 -21211 -2770
15693 -2770 27576 55160 111607 99272 80559 104896 54166 25719 41159 14175 18196 15650
15681 15650 44870 34655 54856 97618 112423 76338 -685 -15365 -8277 -10614 -27926 -25646
15669 -25646 -9083 2288 16393 33718 79293 75356 70827 -4848 -7789 3786 34152 31037
15657 31037 59038 13874 -4790 -16186 16602 26374 2994 7052 17407 14397 55832 50302
15645 50302 71778 53060 62971 94237 62333 -7049 -42095 -6161 73898 75950 28652 7301
15633 7301 17384 -21181 -16007 54116 115754 103220 122722 59278 -33415 -61593 -79889 -1102
15621 -1102 101266 79897 56349 42673 -4429 -55524 -41700 -4911 36914 37188 22711 57538
$$ packed form
15705A5983J5209m7126m4274M6770M8568j3991j5862n172n377k0046M107J8441
15693b770L0346K7584N6447j2335j8713K4337n0730k8447J5440k6984M021k546
15681A5650K9220j0215K0201M2762J4805l6085p7023j4680P088k337j7312K280
15669b5646J6563J1371J4105J7325M5575l937m529p5675k941J1575L0366l115
15657C1037K8001m5164j8664j1396L2788R772k3380M058J0355l010M1435n530
15645E0302K1476j8718R911L1266l1904o9382l5046L5934Q0059K052m7298k1351
15633G301J0083l8565N174P0123O1638j2534J9502o3444r2693k8178j8296P8787
15621a102J02368k1369k3548j3676m7102n1095J3824L6789M1825K74j4477L4827
$$ plain form
15609 57538 -4260 -57959 -5473 57062 8911 -27913 -66964 -53312 56399 39842 30586 81854
15597 81854 91844 37809 46506 97615 79126 60144 45845 34796 -18078 -92403 -68732 -87163
15585 -87163 -95363 -114074 -134136 -67748 -41068 -32921 -32542 -55799 -110931 -93925 -33626 -33840 -31149
15572 -31149 -49426 -53049 -1218 -13939 -61462 -35881 -45497 -71135 -119961 -67334 -45981 -55069
15560 -55069 -2543 12800 -13562 -51608 -97925 -90360 -5932 33503 -12531 1956 -20290 -63376
15548 -63376 -58107 -81644 -93846 -127855 -96912 -61041 -16038 -24043 5462 -4788 24088 47290
15536 47290 20253 7768 -6344 -44820 -53131 -125825 -166837 -162858 -82915 -37448 -33588 -5915
15524 -5915 -4662 -28235 19178 33911 67292 45817 -30705 -92029 -58828 -33887 -92388 -110185
$$ packed form
15609E7538o1798n3699N2486O2535m8151l6824l9051J3652J09711j6557r256N1268
15597H1854R990n4035Q697N1109j8489j8982j4299j1049n2874p4325K3671j8431
15585h7163q200j8711k0062O6388K6680Q147L79k3257n5132J7006O0299k14K691
15572c1149j8277l623N1831j2721m7523K5581r616k5638m8826N2627K1353r088
15560e5069N2526J5343k6362l8046m6317P565Q4428L9435m6034J4487k2246m3086
15548f3376N269k3537j2202l4009L0943L5871M5003q005K9505j0250K8876K3202
15536D7290k7037j2485j4112l8476q311p2694m1012L979P9943M5467L860K7673
15524e915J253k3573M7413J4733L3381k1475p6522o1324L3201K4941n8501j7797
$$ plain form
15512 -110185 -50812 -48390 -81838 -68580 -71509 -59332 -32200 -4057 -26301 3672 -12072 21751
15500 21751 41509 65369 99101 51700 17534 7073 43433 57886 70248 17481 13895 17294
15488 17294 41346 81470 81892 41578 4536 -19353 -47497 4148 16540 33189 17704 7363
15476 7363 -9794 7351 15276 -13824 -32886 -6544 35999 22752 8375 71124 79985 72536
15464 72536 44311 14141 41522 92450 45408 1693 150 -30075 -16913 -24763 9931 -5366
15452 -5366 -7396 22785 32707 23603 33142 38942 48932 43546 12264 -17623 -69917 -109483 -2567
15439 -2567 84742 73482 105120 65262 33156 34889 13839 -58703 -92398 -45630 -358 -17837
15427 -17837 -46287 -28075 -42633 -54409 -17426 -21824 -30933 -34561 -31357 -6845 38975 13244
$$ packed form
15512a10185N9373K422l3448J3258k929J2177K7132K8143k2244K9973j5744L3823
15500B1751J9758K3860L3732m7401l4166j0461L6360J4453J2362n2767l586L399
15488A7294K4052M0124M22m0314l7042k3889k8144N1645J2392J6649j5485j0341
15476G363j7157J7145P925k9100j9062K6342M2543j3247j4377O2749Q861p449
15464G2536k8225l0170K7381N0928m7042m3715j543l0225J3162p850L4694j5297
15452e366k030L0181R922r104R539N800R990n386l1282k9887n2294l9566J06916
15439b567Q7309j1260L1638l9858l2106J733k1050p2542l3695M6768M5272j7479
15427a7837k8450J8212j4558j1776L6983m398r109l628L204K4512M5820k5731
$$ plain form
15415 13244 -14113 -802 77209 109990 79599 19682 -19056 -107073 -121521 -112948 -104845 -37277
15403 -37277 14451 40130 28111 24676 -2013 -48615 -2989 38474 18467 26564 80921 26468
15391 26468 42506 116802 66639 38306 -169 -17934 -39679 -62488 -15020 59943 19029 -50636
15379 -50636 -62128 -49863 16471 119437 125610 90382 73730 85438 75555 75987 75446 126027 166109
15366 166109 229474 297668 321071 347113 463325 553275 667174 787863 875103 918537 913583
15355 913583 933981 901531 861329 789649 719380 597973 484237 411544 361616 253194 208483
15344 208483 180437 129042 77296 48328 74797 141366 165225 172443 166109 99476 51970 16720
15332 16720 -52338 -56553 -49565 3583 77843 43291 -15958 -75452 -45982 -25511 -23808 -8290
$$ packed form
15415A3244k7357J3311P8011L2781l0391n9917l8738q8017j4448Q573Q103O7568
15403c7277N1728K5679j2019l435k6689m6602M5626M1463k0007Q097N4357n4453
15391B6468J6038P4296n0163k8333l8475j7765k1745k2809M7468P4963m0914o9665
15379e0636j1492J2265O6334J02966O173l5228j6652J1708r883M32n41N0581M0082
15366A66109O3365O8194K3403K6042J16212Q9950J13899J20689Q7240M3434m954
15355I13583K0398l2450m0202p1680p0269j21407j13736p2693m9928j08422m4711
15344B08483k8046n1395n1746k8968K6469O6569K3859P218o334o6633m7506l5250
15332A6720o9058m215O988N3148P4260l4552n9249n9494K9470K0471J703J5518
$$ plain form
15320 -8290 14990 16974 -6194 -43781 -87182 1749 95840 72443 59595 89146 88962 135883
15308 135883 158052 142675 65601 3228 -48214 -50694 -7631 55297 53496 -32459 -71237 -24456
15296 -24456 -15898 10297 21556 29663 66699 105956 122599 92860 90501 85810 68527 53321
15284 53321 -26104 -44749 -80244 -116874 -59866 -9627 26189 100491 128411 101628 53683 43067
15272 43067 69409 101854 104044 56695 41792 26106 45031 33705 -9266 25628 14680 -24397
15260 -24397 -19538 14257 9225 4981 3408 -10278 -73094 -71920 -15399 -26372 8432 -8105 42477
15247 42477 99620 155311 135668 82707 59921 8783 -78363 -87443 -72008 -41290 -51430 -133297
15235 -133297 -59761 29350 18481 -21427 -28882 -57826 -44519 13846 46771 45472 27262 -26669
$$ packed form
15320h290K3280J984k3168l7587m3401Q8931R4091k3397j2848K9551j84M6921
15308A35883K2169j5377p7074o2373n1442k480M3063O2928j801q5955l8778M6781
15296b4456Q558K6195J1259Q107L7036L9257J6643k9739k359m691j7283j5206
15284E3321p9425j8645l5495l6630N7008N0239L5816P4302K7920k6783m7945j0616
15272D3067K6342L2445K190m7349j4903j5686J8925j1326m2971L4894j0948l9077
15260b4397M859L3795n032m244j573j3686o2816J174N6521j0973L4804j6537N0582
15247D2477N7143N5691j9643n2961k2786n1138q7146r080J5435L0718j0140q1867
15235a33297P3536Q9111j0869l9908p455k8944J3307N8365L2925j299j8210n3931
$$ plain form
15223 -26669 -69683 38418 57932 62039 60136 30635 -16587 -26220 -63222 -87741 -39857 -16809
15211 -16809 -57039 -66370 1031 -25834 -50515 -39511 -54867 -28422 28732 92132 81710 39683
15199 39683 57810 48434 -31088 -49351 -28570 -32815 -219 51517 90905 18433 -62657 -55368
15187 -55368 -37775 -63381 -97472 -78018 -17444 -13438 -6741 14355 -65711 -98653 -81724 -11855
15175 -11855 -25835 -77375 -47536 -2159 57848 37455 7842 -47111 -51358 -43469 7938 43576
15163 43576 42994 10529 -57987 -99814 -117916 -62688 -75136 -73237 -37629 -29474 -8452 1544 15714
15150 15714 12780 -11125 17320 15133 8364 -11544 -58086 -61373 -45992 -7837 -7457 20920 23630
15137 23630 12827 20602 37918 66679 83574 52500 31750 46113 11788 14601 23906 67051
$$ packed form
15223b6669m3014J08101J9514M107j903k9501m7222r633l7002k4519M7884K3048
15211a6809m0230r331O7401k6865k4681J1004j5356K6445N7154O3400j0422m2027
15199C9683J8127r376p9522j8263K0781m245L2596N1736L9388p2472q1090P289
15187e5368J7593k5606l4091J9454O0574M006O697K1096q0066l2942J6929O9869
15175a1855j3980n1540K9839M5377O0007k0393k9613n4953m247P889N1407L5638
15163D3576n82l2465o8516m1827j8102N5228j2448J899L5608Q155K1022R996J4170
15150A5714k934k3905K8445k187o769j9908m6542l287J5381L8155L80K8377K710
15137B3630j0803P775J7316K8761J6895l1074k0750J4363l4325K813R305M3145
$$ plain form
15125 67051 81556 59739 13810 -29396 -32801 60470 156092 151738 98945 48308 35304 42153
15113 42153 65494 39311 18666 23844 -9913 13283 29831 41985 95211 82192 16409 -41640
15101 -41640 -44665 46025 62428 24556 37068 99767 -2009 -74495 -33924 -38940 2030 -25295
15089 -25295 -31540 41882 84132 55940 18415 44572 55562 20319 25914 14577 -8470 -15542
15077 -15542 -7206 19346 24183 8042 -14221 -28923 -2309 13212 16832 9027 10679 53269 88505
15064 88505 29353 -24776 -52740 -28928 -61882 -82738 -47538 -31279 -47678 -48086 -46212 -4000
15052 -4000 24679 43046 5172 5330 -42414 -84006 -42468 463 2835 23358 23808 -37015 -89075
15039 -89075 -70279 -7018 20058 55710 76304 -21659 -68701 -124880 -144823 -93969 -47218 -60922
$$ packed form
15125F7051J4505k1817m5929m3206l405R3271R5622m354n2793n0637j3004O849
15113D2153K3341k6183k0645N178l3757K3196J6548J2154N3226j3019o5783n8049
15101d1640l025R0690J6403l7872J2512O2699j01776p2486M0571n016M0970k7325
15089b5295o245P3422M2250k8192l7525K6157J0990l5243N595j1337k3047p072
15077a5542Q336K6552M837j6141k2263j4702K6614J5521L620p805J652M2590L5236
15064H8505n9152n4129k7964K3812l2954k0856L5200J6259j6399m08J874M2212
15052d000K8679J8367l7874J58m7744m1592M1538M2931K372K0523M50o0823n2060
15039h9075J8796O3261K7076L5652K0594r7963m7042n6179j9943N0854M6751j3704
$$ plain form
15027 -60922 -23368 49449 23610 16823 4432 -11813 41806 35431 16355 18750 88006 126681
15015 126681 123807 160792 142462 91667 102925 69344 53623 13732 8593 19751 -31067 -17302
15003 -17302 -12495 4291 33754 26551 -28526 -6319 50291 5091 -37601 -21919 6236 560
14991 560 -64616 -83027 -105766 -139957 -113432 -99607 -32830 4886 -32494 -77756 -38738 -5841
14979 -5841 24457 25423 70526 40774 12305 -11676 -63136 -93647 -93548 -89631 -33601 -52227 -2592
14966 -2592 65876 121662 103498 69612 74913 79273 79183 53940 31206 17119 -21568 -51714 -51465
14953 -51465 -53067 -70048 -63557 -58850 -26852 39585 23768 9272 -4326 25117 -3210 68162
14941 68162 69144 18636 -6733 35868 40154 81727 133171 66612 -475 37799 124042 117849
$$ packed form
15027f0922L7554P2817k5839o787j2391j6245N3619o375j9076K395O9256L8675
15015A26681k874L6985j8330n0795J1258l3581j5721l9891n139J1158n0818J3765
15003a7302M807J6786K9463p203n5077K2207N6610m5200m2692J5682K8155n676
14991E60o5176j8411k2739l4191K6525J3825O6777L7716l7380m5262L9018L2897
14979e841L0298R66M5103k9752k8469k3981n1460l0511R9L917N6030j8626M9635
14966b592O8468N5786j8164l3886N301M360r0k5243k2734j4087l8687l0146K49
14953e1465j602j6981O491M707L1998O6437j5817j4496j3598K9443k8327P1372
14941F8162R82n0508k5369M2601M286M1573N1444o6559o7087L8274Q6243o193
$$ plain form
14929 117849 83749 77466 48568 13137 30538 13165 -55191 -33716 44249 51067 57883 36505
14917 36505 16026 -53057 -4455 27615 45277 32088 42441 88398 61678 61720 32357 17528
14905 17528 35917 70996 122149 142660 99077 52441 46692 32213 5621 -21331 32882 107705
14893 107705 90399 44317 -10620 -34307 9283 -7303 -19605 31674 75960 94024 73638
14882 73638 52007 15402 -8000 24880 49555 44960 4385 -19015 -59189 -109338 -96884 -89390
14870 -89390 -76865 -53561 -46774 -28797 -4049 26271 37784 48910 102604 114014 50639 72866
14858 72866 84960 67400 15472 -27808 -40163 -32484 33999 64632 47594 -2671 -26459 -77470
14846 -77470 -66709 12306 82664 103057 111565 72028 30191 52312 64639 49759 40279 27103
$$ packed form
14929A17849l4100o283k8898l5431J7401j7373o8356K1475P7965O818O816k1378
14917C6505k0479o9083M8602L2070J7662j3189J0353M5957k6720M2k9363j4829
14905A7528J8389L5079N1153K0511m3583m6636n749j4479k6592k6952N4213P4823
14893A07705j7306m6082n4937k3687M3590j6586j2302N1279M4286J8064k0386
14882G3638k1631l6605k3402L2880K4675m595m0575k3400m0174n0149J2454P494
14870h9390J2525K3304O787J7977K4748L0320J1513J1126N3694J1410o3375K2227
14858G2866J2094j7560n1928m3280j2355P679O6483L0633j7038n0265k3788n1011
14846g7470J0761P9015P0358K0393Q508l9537m1837K2121J2327j4880r480j3176
$$ plain form
14834 27103 2904 -62165 -116073 -113263 -64831 -54626 -59938 -6066 7971 14114 38765 41531
14822 41531 58199 74017 85907 126845 96632 -19984 -45881 -36537 -25468 -30617 -19598 2234
14810 2234 28459 767 30433 18935 -3207 -30076 17647 28569 20203 -40571 -4648 31859
14798 31859 -4850 -55041 354 -15344 -54261 44076 98229 52192 46519 16631 -13633 -44708
14786 -44708 -67233 -56689 -57749 -52285 -31838 -32953 -28590 -41737 -15664 -2009 13050 63834
14774 63834 61692 -16003 -15624 -18585 -9984 -17086 -130417 -197059 -209880 -168564 -116595 -87151 -111653
14761 -111653 -28074 63771 -19179 -80438 -67576 -53926 -24650 -38555 2775 37611 43134 -35487
14749 -35487 -105701 -120769 -99768 -59455 -128047 -153255 -141229 -143859 -91864 -3503 39863 30165
$$ packed form
14834B7103k4199o5069n3908K810M8432J0205n312N3872J4037O143K4651K766
14822D1531J6668J5818J1890M0938l0213j16616k5897R344J1069n149J1019K1832
14810B234K6225k7692K9666j1498k2142k6869M7723J0922q366o0774L5923L6507
14798C1859l6709n0191N5395j5698l8917R8337N4153m6037n673k9888l0264l1075
14786d4708k2525J0544j060N464K0447j115M363j3147K6073J3655J5059N0784
14774F3834k142p7695L79k961Q601p102j13331o6642j2821M1316N1969K9444k4502
14761a11653Q3579R1845q2950o1259J2862J3650K9276j3905M1330L4836N523p8621
14749c5487p0214j5068K1001M0313o8592k5208J2026k630N1995Q8361M3366r698
$$ plain form
14737 30165 56309 73988 85392 53698 24226 -25034 -12934 35266 55896 -3315 -779 25383
14725 25383 83100 68868 60069 84942 133249 64968 4336 -9124 -61718 -62544 -10570 -26087
14713 -26087 -44641 17835 15523 70860 97729 68777 13195 -82921 -120912 -137023 -127055 -116798
14701 -116798 -74584 -44548 -36404 -78190 -98423 -32557 -16630 -27574 -43824 -40621 -28620 -28078
14689 -28078 7960 -9320 -29208 -58239 -54674 -49624 -21013 -48307 -56133 -51516 -52537 -88924 -99158
14676 -99158 -95421 -93002 -89684 -63934 -66214 -64775 -80164 -91434 -148010 -146389 -109282 -100305 -114442
14663 -114442 -74884 -20102 2929 81057 120130 64280 51300 38479 29639 6693 -6403 -41214
14651 -41214 -58887 -36523 -18712 -13796 14683 -15229 -48911 -34547 -64385 -87805 -39308 33519
$$ packed form
14737C0165K6144J7679J1404l1694k9472m9260J2100M8200K0630n9211K536K6162
14725B5383N7717j4232q799K4873M8307o8281o0632j3460n2594q26N1974j5517
14713b6087j8554O2476k312N5337K6869k8952n5582r6116l7991j6111R968J0257
14701a16798M2214L0036Q144m1786k0233O5866J5927j0944j6250L203J2001N42
14689b8078L6038j7280j9888k9031L565N050K8611k7294p826M617j021l6387j0234
14676i9158L737K419L318K5750k280J439j5389j1270n6576J621L7107Q977j4137
14663a14442L9558N4782K3031P8128L9073n5850j2980j2821q840k2946j3096l4811
14651d1214j7673K2364J7811M916K8479k9912l3682J4364k9838k3420M8497P2827
$$ plain form
14639 33519 33047 19046 22424 20301 -7562 -74657 -62216 -43097 -31110 26397 54688 27038
14627 27038 19886 29830 2316 -35821 -42834 -72189 -102331 -35619 40201 40879 55158 33732 3598
14614 3598 -23883 -31648 -4041 -45021 -47296 -7676 13485 -8630 -30804 -62758 -78320 -98326
14602 -98326 -49771 -1527 38653 59682 72405 -7799 -46461 3597 -21959 -6242 1590 35451
14590 35451 18593 -35901 -3847 -59099 -136264 -102599 -71745 -96895 -3384 71148 59511 55092
14578 55092 56939 86462 42730 -24011 -33516 648 73430 80719 44646 -16962 9306 53596
14566 53596 61035 41731 21584 -35165 -90711 -45849 -17916 70944 79419 750 -22420 -56305
14554 -56305 56 36512 -8066 -107003 -127983 -66138 -28374 -43838 -15072 -27729 -6479 3570
$$ packed form
14639C3519m72j4001L378k123k7863o7095J2441J9119J1987N7507K8291k7650
14627B7038p152R944k7514l8137p013k9355l0142O6712P5820O78J4279k1426l0134
14614C598k7481p765K7607m0980k275L9620K1161k2115k2174l1954j5562k0006
14602i8326M8555M8244M0180K1029J2723q0204l8662N0058k5556J5717P832L3861
14590C5451j6858n4494L2054n5252p7165L3665L0854k5150R3511P4532j1637m419
14578E5092J847K9523m3732o6741r505L4164P2782P289l6073o1608K6268M4290
14566E3596P439j9304k0147n6749n5546M4862K7933Q8860Q475p8669k3170l3885
14554e6305N6361L6456m4578r8937k0980O1845L7764j5464K8766j2657K1250J0049
$$ plain form
14542 3570 42491 64448 14452 8738 9270 75041 64613 17436 258 -12070 -6231 23433 52458
14529 52458 38678 65146 -196 -12768 9503 -22443 -124310 -80447 -14333 55341 36659
14518 36659 -127 51486 115578 98697 37415 -8655 9374 28150 10352 -13479 -43179 -98320
14506 -98320 -122334 -45775 50052 45100 49935 24416 -3489 8591 72454 87167 100474 80960
14494 80960 59209 4627 3005 8553 -1348 -14654 1144 -9186 -5181 6073 27231 7382
14482 7382 -26778 -67369 -102024 -104341 -25122 -41640 -41027 44261 52904 52545 41356 19565 13596
14469 13596 43477 105886 108533 83174 33800 -14026 -12564 -6662 -27002 -44144 -46816 -4434
14457 -4434 -1151 15674 9466 -799 54820 81645 47334 32030 42019 33278 6473 16426 64819
$$ packed form
14542C570L8921K1957m9996n714N32O5771j0428m7177j7178j2328N839K9664K9025
14529E2458j3780K6468o5342j2572K2271l1946j01867M3863O6114O9674j8682
14518C6659l6786N1613O4092j6881o1282m6070J8029J8776j7798k3831k9700n5141
14506i8320k4014P6559R5827m952M835k5519k7905J2080O3863J4713J3307j9514
14494H0960k1751n4582j622N548r901j3306J5798j0330M005J1254K1158j9849
14482G382l4160m0591l4655k317P9219j6518O13Q5288Q643l59j1189k1791n969
14469A3596K9881O2409K647k5359m9374m7826J462N902k0340j7142k672M2382
14457d434L283J6825o208j0265N5619K6825l4311j5304R989q741k6805R953M8393
$$ plain form
14444 64819 39877 4371 5058 -12807 25793 24682 -690 29825 12752 3691 7445 -75379 -116750
14431 -116750 -116818 -51934 22303 54491 61347 63695 -15272 -80608 -111869 -117846 -86152 -59401 -34554
14418 -34554 -56771 -61120 -50166 -83040 -88677 -45686 -46852 -19350 -1313 -7514 19719 34988
14406 34988 21734 13279 7386 34359 61040 30267 25438 19847 40805 44775 78178 93996 32854
14393 32854 36400 29036 -9226 25899 61381 56037 56869 55758 1210 -1313 -1985 9369 -18038
14380 -18038 2567 632 18489 -14467 -49946 -63814 -27377 -40232 -31130 -29638 -7973 -38601
14368 -38601 -69673 -82277 -102380 -104508 -90354 -88287 -55510 -25313 10192 -55761 -87579 -20148
14356 -20148 29552 23226 46914 32144 -34407 -11332 -62986 -83156 -66147 -47695 -66288 -12009
$$ packed form
14444F4819k4942l5506O87j7865L8600j111k5372L0515j7073r061L754q2824m1371
14431a16750o8O4884P4237L2188O856K348p8967o5336l1261n977L1694K6751K4847
14418c4554k2217m349J0954l2874n637M2991j166K7502J8037o201K7233J5269
14406C4988j3254q455n893K6973K6681l0773m829n591K0958L970L3403J5818o1142
14393C2854L546p364l8262L5125L5482n344Q32j111n4548k523o72J1354k7407
14380a8038K0605j935J7857l2956l5479j3868L6437j2855R102J492K1665l0628
14368c8601l1072j2604k0103k128J4154K067L2777L0197L5505o5953l1818O7431
14356b0148M9700o326K3688j4770o6551K3075n1654k0170J7009J8452j8593N4279
$$ plain form
14344 -12009 15647 8423 57839 15843 -87368 -88332 -42330 -50898 -56746 -45480 -58963 -35661
14332 -35661 -17866 -80250 -97469 -58556 -60693 -62085 -36180 -49757 -3624 10871 -7838 -56904
14320 -56904 -117980 -60861 28339 26318 -54408 -53487 769 460 -51442 -32116 -12328 53327 41836
14307 41836 17355 3047 35985 50229 37508 28124 -34601 -52583 -31333 27425 85938 35382
14295 35382 23939 -3648 26846 33775 14043 15481 24109 -31015 -49847 10332 -28893 -75584
14283 -75584 -76705 -59151 -7967 -2798 -46092 -107759 -102989 -79532 -64514 -8076 -3656 21331
14271 21331 -5948 16308 -16930 -59442 -63120 -36374 -5411 19829 56781 73906 72028 61642
14259 61642 26851 -31840 -23864 -25213 -53507 -53433 -88400 -56771 -23889 -40114 -37671 -19264 6233
$$ packed form
14344a2009K7656p224M9416m1996j03211r64M6002q568n848J1266j3483K3302
14332c5661J7795o2384j7219L8913k137j392K5905j3577M6133J4495j8709m9066
14320e6904o1076N7119Q9200k021q0726R21N4256l09n1902J9326J9788O5655j1491
14307D1836k4481j4308L2938J4244j2721r384o2725j7982K1250N8758N8513n0556
14295C5382j1443k7587L0494O929j9732J438Q628n5124j8832O0179l9225m6691
14283g5584j121J7554N1184N169m3294o1667M770K3457J5018N6438M420K4987
14271B1331k7279K2256l3238m2512l678K6746L0963K5240L6952J7125j878j0386
14259F1642l4791n8691P976j349k8294P4l4967L1629L2882j6225K443J8407K5497
$$ plain form
14246 6233 -32180 -24080 -17924 1005 26333 50568 29818 35904 35682 6861 2985 13300 -13050
14233 -13050 -22750 -23934 10280 1477 -25224 -68016 -97647 -71428 18431 27329 -8800 -1257 42435
14220 42435 18986 33598 41369 5063 -48942 -19107 68308 132416 113976 95317 75561 -10571
14208 -10571 -31672 20484 66765 37452 -2115 22565 20087 -4108 13497 32112 1584 -36532
14196 -36532 -102280 -117578 -112343 -111145 -105835 -109338 -44233 -7484 -64289 -59960 -62856 -86764 -101119
14183 -101119 -116643 -43268 55798 47987 -5906 54232 92775 122409 156213 113070 97457 105872
14171 105872 66865 36360 -25706 -27628 7615 20412 30593 -15510 -42468 -61228 -53428 -55565
14159 -55565 -67107 -95085 -74492 -39187 -44370 -42949 -11794 -36253 -45753 -53393 -7211 37730
$$ packed form
14246F233l8413Q100O156J8929K5328K4235k0750O086k22k8821l876J0315k6350
14233a3050r700j184L4214q803k6701m2792k9631K6219Q9859Q898l6129P543M3692
14220D2435k3449J4612P771l6306n4005K9835Q7415O4108j8440j8659j9756q6132
14208a0571k1101N2156M6281k9313l9567K4680k478k4195J7605J8615l0528l8116
14196c6532o5748j5298N235J198N310l503O5105L6749n6805M329k896k3908j4355
14183a01119j5524P3375R9066p811n3893O0138L8543K9634L3804m3143j5613Q415
14171A05872l9007l0505o2066j922L5243J2797J0181m6103k6958j8760P800k137
14159e5565j1542k7978K0593L5305n183J421L1155k4459r500p640M6182M4941
$$ plain form
14147 37730 58470 47790 35748 44765 56702 59730 17706 44796 20153 -34450 -41333 -35903
14135 -35903 -47545 -26909 -13746 -41602 1962 6321 -123152 -161126 -97992 -82892 -77344 -53924
14123 -53924 -19627 36878 96887 72122 26241 57404 60620 71816 76211 15128 -23075 -22076
14111 -22076 3663 -7677 -24696 1007 45133 -11884 -32980 -33209 -57175 -44421 -13780 41485
14099 41485 68068 8714 -3086 -49929 -83220 -35586 -34499 -95611 -74663 -105583 -52670 12256
14087 12256 28465 8925 27111 17024 17765 4157 -415 -4608 44854 32453 28582 43213 -8108
14074 -8108 -48546 -29693 -38141 -31649 -56510 -23167 -27781 -28675 43536 45416 8435 -11747 3956
14061 3956 88009 60910 -3988 -4188 -3348 -24019 -93476 -64103 -55308 -47124 -53177 -23642 -2946
$$ packed form
14147C7730K0740j0680j2042R017J1937L028m2024K7090k4643n4603o883N430
14135c5903j1642K0636J3163k7856M3564M359j29473l7974O3134J5100N548K3420
14123e3924L4297N6505O0009k4765m5881L1163L216J1196M395o1083l8203R99
14111b2076K5739j1340j7019K5703M4126n7017k1096k29k3966J2754L0641N5265
14099D1485K6583n9354j1800m6843l3291M7634J087o1112K0948l0920N2913O4926
14087A2256J6209j9540J8186j0087P41j3608m572m193M9462j2401l871J4631n1321
14074h108m0438J8853q448O492k4861L3343m614q94P2211J880l6981k0182J5703
14061C956Q4053k7099o4898k00Q40k0671o9457K9373Q795Q184o053K9535K0696
$$ plain form
14048 -2946 16054 21755 23569 13843 16104 -18352 -106155 -124491 -75772 -30116 -34116 190 7994
14035 7994 14648 -21631 -62995 -27375 30284 50163 38107 43713 85788 35066 -66245 -58773
14023 -58773 -86892 -46435 -9063 764 10638 -69886 -102668 -82177 -84573 -98707 -39572 11571
14011 11571 -50074 -87242 -109896 -106801 -110356 -70960 -114157 -195408 -132239 -51582 -30953 -40037
13999 -40037 21567 65210 38189 6684 -43572 -94870 -46600 -45148 -39662 -62788 -57199 -14711
13987 -14711 13724 -23185 -56238 1835 -22172 -24885 -26396 -23013 34434 70914 67939 5825
13975 5825 -58944 -53105 -21256 13449 34911 -12672 -23875 49613 74550 69930 83988 48743
13963 48743 34355 27058 4648 -50137 -27122 -48134 -95912 -89461 -39366 -51360 -37035 -40160
$$ packed form
14048b946J9000N701J814r726K261l4456q7803j8336M8719M5656m000L4306P804
14035G994O654l6279m1364L5620N7659J9879j2056N606M2075n0722j01311P472
14023e8773k8119M0457L7372R827R874q0524l2782K0491k396j4134N9135N1143
14011A1571o1645l7168k2654L095l555L9396m3197q1251O3169Q0657K0629r084
13999d0037O1604M3643k7021l1505n0256n1298M8270J452N486k3126N589M2488
13987a4711K8435l6909l3053N8073k4007k713j511L383N7447L6480k975o2114
13975E825o4769N839L1849L4705K1462m7583j1203P3488K4937m620J4058l5245
13963D8743j4388p297k2410n4785K3015k1012m7778O451N0095j1994J4325l125
$$ plain form
13951 -40160 -45015 -18057 49785 72139 62398 51503 -9247 9569 -38781 -1061 17155 23345
13939 23345 -56980 -81536 -9503 46226 25778 62792 80883 99271 44227 -8902 -18113 -6550
13927 -6550 21792 11426 21771 -4960 15267 5151 -8160 -9794 -18839 -31483 -73266 -52840
13915 -52840 -62862 -62449 -7952 3493 -13707 32395 67469 59629 56113 18866 -8360 -32940
13903 -32940 -6480 11004 -2607 -70189 -48493 20404 -10340 -51551 -11957 -6828 24373 33396
13891 33396 45602 35721 14292 -41271 -65041 -56228 31599 54424 38508 11353 15102 1769
13879 1769 -20576 -45400 -59153 -42193 -26209 -29704 -30417 -29716 -19663 -30198 1639 41005 62979
13866 62979 45695 22341 27335 7142 31129 69575 45140 5679 4281 -3902 46737 1718
$$ packed form
13951d0160m855K6958O7842K2354r741j0895o0750J8816m8350L7720J8216O190
13939B3345q0325k4556P2033N5729k0448L7014J8091J8388n5044n3129r211J1563
13927f550K8342j0366J0345k6731K0227j0116j3311j634r045j2644m1783K0426
13915e2840j0022M13N4497J1445j7200M6102L5074p840l516l7247k7226k4580
13903c2940K6460J7484j3611o7582K1696O8897l0744m1211L9594N129L1201R023
13891C3396J2206r881k1429n5563k3770Q813Q7827K2825j5916k7155L749j3333
13879A769k2345k4824j3753J6960J5984l495p13P01J0053j0535L1837L9366K1974
13866F2979j7284k3354M994k0193K3987L8446k4435l9461j398q183N0639m5019
$$ plain form
13854 1718 -47605 -38608 -42659 -7800 -37855 -74345 -87793 -58599 -60425 -71070 -44006 -7811
13842 -7811 35996 68559 26211 35211 4547 -98694 -148843 -83840 -20746 89772 151567 140395
13830 140395 110786 17550 -15701 19249 57377 83502 92917 136225 170036 131257 73729 73854
13818 73854 154438 133705 114507 59674 38952 22462 48771 16625 -10591 -7605 1425 17743
13806 17743 65031 64860 33165 68216 63894 55527 67775 96398 139860 127017 117380 54757 19054
13793 19054 23864 39045 106596 70161 4695 16110 -13849 -29219 -44416 -20856 -104640 -82066
13781 -82066 -34775 -49462 -57611 -42238 -36801 -60495 -29963 -13875 54717 103085 118203 120566
13769 120566 115201 56494 25610 40926 65438 85933 82436 114203 81295 41329 -12882 -33092
$$ packed form
13854A718m9323Q997m051L4859l0055l6490j3448K9194j826j0645K7064L6195
13842g811M3807L2563m2348R000l0664j03241n0149O5003O3094J10518O1795j1172
13830A40395k9609r3236l3251L4950L8128K6125R415M3308L3811l8779n7528J25
13818G3854Q0584k0733j9198n4833k0722j6490K6309l2146k7216K986R030J6318
13806A7743M7288j71l1695L5051m322q367J2248K8623M3462j2843r637o2623l5703
13793A9054M810J5181O7551l6435o5466J1415k9959j5370j5197K3560q3784K2574
13781h2066M7291j4687q149J5373N437k3694L0532J6088O8592M8368J5118K363
13769A20566n365n8707l0884J5316K4512K0495l497L1767l2908l9966n4211k0210
$$ plain form
13757 -33092 -51943 -50056 7023 70069 133669 107869 12482 -40374 2854 12455 -14704 -37296
13745 -37296 -36889 -4338 -33362 -64806 -13408 22925 25989 95852 93953 13324 2388 -39311
13733 -39311 -20664 -21796 -12606 22505 47156 37309 7305 25896 16595 -4180 12443 13904 23528
13720 23528 11346 -33215 -31786 44705 95665 71167 41960 119 -3112 15305 -11067 2153
13708 2153 46704 61295 41432 4097 -36711 -25564 -54029 -58321 -6946 55163 52721 -12724
13696 -12724 5680 26047 -53014 -67206 -52937 -56037 -96537 -76172 -53755 -54726 -25436 -10523
13684 -10523 -32391 -38549 -27090 -20283 4877 26162 24173 11724 18105 3292 23956 40029
13672 40029 32315 -49277 -74149 -34030 12727 46880 20270 -11984 -40062 -46661 -63720 -56484
$$ packed form
13757c3092j8851J887N7079O3046O3600k5800r5387n2856M3228R601k7159k2592
13745c7296M07L2551k9024l1444N1398L6333L064O9863j899q0629j0936m1699
13733c9311J8647j132R190L5111K4651r847l0004J8591r301k0775J6623J461R624
13720B3528j2182m4561J429P6491N0960k4498k9207m1841l231J8417k6372J3220
13708B153M4551J4591j9863l7335m0808J1147k8465m292N1375O2109k442o5445
13696a2724J8404K0367p9061j4192J4269l100m0500K0365K2417r71K9290J4913
13684a0523k1868o158J1459O807K5160K1285j989j2449O381j4813K0664J6073
13672D0029p714q1592k4872M0119M6757L4153k6610l2254k8078o599j7059P236
$$ plain form
13660 -56484 -46159 -81525 -36125 -20186 -44155 -65554 -82737 -81091 -57852 -26285 5999 -57564
13648 -57564 -68651 -51020 -17257 -23794 -65548 -41309 -94878 -125214 -73307 -49842 -13714 16516
13636 16516 12648 427 20739 42190 -2336 5568 57083 95850 84389 83235 91622 37359
13624 37359 -13293 -9824 9049 30723 27160 22828 13654 4187 -14662 -18567 -11208 857 -88074
13611 -88074 -61300 -15088 16491 31108 -17085 22207 5948 -74873 -103726 -97393 -54765 -90085
13599 -90085 -98689 -45323 -30327 -35105 -58885 -111530 -114006 -63133 24308 55739 36447 22277
13587 22277 37448 30213 -23062 -11199 41839 70990 103091 91414 112387 90272 44896 23523
13575 23523 50364 49203 49599 33334 4346 -6774 39516 42113 23666 3727 36989 -16971
$$ packed form
13660e6484J0325l5366M5400J5939k3969k1399j7183J646K3239L1567L2284o3563
13648e7564j1087J7631L3763o537m1754K4239n3569l0336N1907K3465L6128L0230
13636A6516l868j2221K0312K1451m4526P904N1515L8767j1461j154Q387n4263
13624C7359n0652L469J8873K1674l563m332r174r467j8849l905P359J2065q8931
13611h8074K6774M6212L1579J4617m8193L9292j6259q0821k8853O333M2628l5320
13599i0085q604N3366J4996m778k3780n2645k476N0873Q7441L1431j9292j4170
13587B2277J5171p235n3275J1863N3038K9151L2101j1677K0973k2115m5376k1373
13575B3523K6841j161L96j6265k8988j1120M6290K597j8447j9939L3262n3960
$$ plain form
13563 -16971 -24240 -5704 -16835 -51368 -34525 12636 79221 106719 9315 -65728 32878 76328
13551 76328 55107 85163 104690 -19632 -62217 1909 48456 74576 91642 69639 19299
13540 19299 16216 56106 35655 -37700 -62598 -84384 -74757 -33679 17854 -35069 -30892 -33647
13528 -33647 3017 65872 72223 45381 52076 -1838 7012 23008 62052 71764 57145 5611
13516 5611 -63106 -67502 54114 125474 57227 -4534 -3255 -5445 -38871 -43233 -61466 -101850
13504 -101850 -46757 -43946 -31479 -13330 11853 -28689 -80593 -70418 -843 -368 -19162 -4299
13492 -4299 -20876 -78492 -66782 -15562 -30055 -36414 3668 5538 -32603 -33730 -53129 -47860 -46140
13479 -46140 -53489 -37516 17677 9405 14814 96445 65652 7160 -31874 -80624 -87949 -54537
$$ packed form
13563a6971p269J8536j1131l4533J6843M7161O6585K7498r7404p5043R8606M3450
13551G6328k1221L0056J9527j24322m2585O4126M6547K6120J7066k2003n0340
13540A9299l083L9890k0451p3355k4898k1786R627M1078N1533n2923M177k755
13528c3647L6664O2855O351k6842O695n3914Q850J5996L9044R712j4619n1534
13516E611o8717m396J21616P1360o8247o1761J279k190l3426m362j8233m0384
13504a01850N5093K811J2467J8149K5183m0542n1904J0175O9575M75j8794J4863
13492d299j6577n7616J1710N1220j4493o359M0082J870l8141j127j9399N269J720
13479d6140p349J5973N5193q272N409Q1631l0793n8492l9034m8750p325L3412
$$ plain form
13467 -54537 -37994 -30444 -47921 -91062 -88242 -63802 -48416 -51363 -70210 -79196 -70836 -59421 -56020
13454 -56020 -27707 -19199 18439 34909 42187 1240 39788 33154 -19382 -43504 -37074 -34779 -16724
13441 -16724 -16058 -5048 -28517 -11405 35452 38621 52809 85532 143248 117345 60244 24834
13429 24834 -6912 -3923 -19431 -29439 18072 37615 75502 82510 21628 -16544 30483 71462
13417 71462 134620 163395 159739 136663 130302 67923 15560 11728 -7234 11549 25639 58869
13405 58869 82343 71126 11632 -22655 -71757 -66691 -26240 18137 27470 7947 25201 49767
13393 49767 39076 -18996 -19950 -18798 -11273 50518 145644 123572 77498 102054 72790 32669
13381 32669 41735 15700 -35455 -32318 -25836 -17080 -53056 -70726 -77656 -68566 -27793 -11037 11341
$$ packed form
13467e4537J6543P550j7477m3141K820K4440J5386k947j8847q986Q360J1415L401
13454e6020K8313Q508L7638J6470P278m0947L8548o634n2536k4122O430K295J8055
13441a6724O66J1010k3469J7112M6857L169J4188L2723N7716k5903n7101l5410
13429B4834l1746K989j5508j0008M7511J9543L7887P008o0882l8172M7027M0979
13417G1462O3158K8775l656k3076o361o2379n2363l832j8962J8783J4090L3230
13405E8869K3474j1217n9494l4287m9102N066M0451M4377R333j9523J7254K4566
13393D9767j0691n8072r54J152P525O1791R5126k2072m6074K4556k9264m0121
13381C2669R066k6035n1155L137O482Q756l5976j7670o930R090M0773J6756K2378
$$ plain form
13368 11341 101227 118054 29355 33025 -3767 -66981 -75335 -51152 -23412 -38733 -11145 33419
13356 33419 3396 3656 -17487 -29846 -35387 -57156 -100673 -150039 -86399 -55585 -29506 13870
13344 13870 -38236 -89075 -108173 -113033 -80003 -16851 16584 47116 21683 -64050 -103203 -93266
13332 -93266 -63533 -51424 -8387 13613 -15423 -17740 -38507 -31409 21651 31721 -6861 -9329
13320 -9329 2325 -12147 62764 38275 11797 54810 59303 85828 42163 15817 10345 34473
13308 34473 67858 91789 86237 55557 -21064 -32938 15580 63020 97050 73117 -1457 -77066
13296 -77066 -79082 -10346 -3686 7746 7039 41635 65447 29323 -15063 -64054 -23623 -20243 -17198
13283 -17198 -56499 -96585 -21639 -13840 12138 14180 -44662 -93179 -125376 -49203 20493 15256
$$ packed form
13368A1341Q9886J6827q8699L670l6792o3214q354K4183K7740j5321K7588M4564
13356C3419l0023K60k1143j2359n541k1769m3517m9366O3640L0814K6079M3376
13344A3870n2106n0839j9098m860L3030O3152L3435L0532k5433q5733l9153R937
13332i3266K9733J2109M3037K2000k9036k317k0767P098N3060J0070l8582k468
13320i329J1654j4472P4911k4489k6478M3013M493K6525m3665k6346n472K4128
13308C4473L3385K3931n552l0680p6621j1874M8518M7440L4030k3933p4574p5609
13296g7066k016O8736O660J1432p07L4596K3812l6124m4386m8991M0431L380L045
13283a7198l9301m0086P4946P799K5978K042n8842m8517l2197P6173O9696n237
$$ plain form
13271 15256 -17437 -32196 18608 -14123 -5414 -22054 -35441 -38157 -14775 28554 52614 67551
13259 67551 79801 58859 91027 120363 107953 48685 31173 -5718 8320 80369 125728 126734
13247 126734 50572 75679 59957 81423 81331 94639 108686 93123 61611 32299 40608 71361
13235 71361 57910 39262 -8972 -17836 -40127 -75102 -49755 -34157 -62241 -75386 -86076 -91457
13223 -91457 -30853 36846 13899 -15104 -37886 -39495 21560 53554 40814 -9974 74381 129097
13211 129097 71351 4825 12335 -2108 -18013 25277 59657 7745 -45204 -57954 -47885 -71801
13199 -71801 -93266 -94517 4790 36165 45152 47704 42358 44620 12060 27596 -16248 -24952 -32790
13186 -32790 -39990 -11746 -455 -23219 -52700 11060 58806 16251 -16696 -44418 19287 76995
$$ packed form
13271A5256l2693j4759N0804l2731Q709j6640j3387k716K3382M3329K4060J4937
13259F7551J2250k0942L2168K9336j2410n9268j7512l6891J4038P2049M5359J006
13247A26734p6162K5107j5722K1466r2J3308J4047j5563l1512k9312Q309L0753
13235G1361j3451j8648m8234q864k2291l4975K5347J5598k8084j3145j0690n381
13223i1457O0604O7699k2947k9003k2782j609O1055L1994j2740n0788Q4355N4716
13211A29097n7746o6526P510j4443j5905M3290L4380n1912n2949j2750J0069k3916
13199g1801k1465j251R9307L1375Q987K552n346K262l2560J5536m3844q704p838
13186c2790p200K8244J1291k2764k9481O3760M7746m2555l2947k7722O3705N7708
$$ plain form
13174 76995 88676 32719 -15760 -19607 1500 14545 -3468 -34641 -98552 -126415 -161898 -172679
13162 -172679 -160148 -88880 -19677 55833 72012 31038 11583 39596 -23705 -35782 9410
13151 9410 -35131 -37654 20299 16844 -22232 6712 65842 53842 83012 47187 37027 62555
13139 62555 67753 64216 37438 -30118 -85980 -133241 -141900 -59404 24426 41752 21635 -1791
13127 -1791 -26156 -73539 -101672 -82285 -32245 -37831 -50015 -36384 -42254 -3276 65125 82771
13115 82771 63699 15577 -11117 14624 44314 51579 7362 -44187 -61944 -39558 24110 62387
13103 62387 60871 55297 -14326 -2219 -8178 -3040 -17686 -110465 -118617 -13615 11064 9564 9791
13090 9791 8419 16404 39191 10584 47103 19326 -30320 -97393 -132030 -90654 -99563 -75714
$$ packed form
13174G6995J1681n5957m8479l847K1107J3045j8013l1173o3911k7863l5483j0781
13162a72679J2531P1268O9203P5510J6179m0974j9455K8013o3301j2077M5192
13151I410m4541k523N7953l455l9076K8944N9130j2000K9170l5825j0160K5528
13139F2555N198l537k6778o7556n5862m7261q659Q2496Q3830J7326k0117k3426
13127a791k4365m7383k8133J9387N0040n586j2184J3631n870L8978O8401J7646
13115H2771j9072m8122k6694K5741K9690P265m4217n1549j7757K2386O3668L8277
13103F2387j516n574o9623J2107n959N138j4646r2779q152J05002K4679j500K27
13090I791j372P985K2787k8607L6519k7777m9646o7073l4637M1376q909K3849
$$ [...]
##END NTUPLES=NMR SPECTRUM
##END=
