##TITLE=Analysis number 312575
Compound Code mo 07724
Project Code adrs
Chemist Name stores
##JCAMPDX= 6.0         $$ Bruker NMR JCAMP-DX V2.0
##DATA TYPE= NMR SPECTRUM
##DATA CLASS= NTUPLES
##ORIGIN= Bruker BioSpin GmbH
##OWNER= NMR
$$ XWIN-NMR		Version 3.5
$$ Tue Aug  9 10:23:57 2005 GMT Daylight Time (UT+1h)  MAYBRIDGE\NMR@NMR_250MHZ
##.OBSERVE FREQUENCY= 250.131544655141
##.OBSERVE NUCLEUS= ^1H
##.ACQUISITION MODE= SIMULTANEOUS (DQD)
##.ACQUISITION SCHEME= undefined
##.AVERAGES= 16
##.DIGITISER RES= 18
##SPECTROMETER/DATA SYSTEM= dpx250
##.PULSE SEQUENCE= zg30
##.SOLVENT NAME= DMSO
##.SHIFT REFERENCE= (INTERNAL, DMSO, 0, 16.522)
##AUDIT TRAIL= $$ (NUMBER, WHEN, WHO, WHERE, WHAT)
$$ ##TITLE= Audit trail, XWIN-NMR		Version 3.5
$$ ##JCAMPDX= 5.01
$$ ##ORIGIN= Bruker BioSpin GmbH
$$ ##OWNER= NMR
$$ C:\u/data/dgb/nmr/ADRS/7380/pdata/1/auditp.txt
$$ ##AUDIT TRAIL=  $$ (NUMBER, WHEN, WHO, WHERE, WHAT)
(   1,<2005-08-09 10:23:38.92 +100>,<MAYBRIDGE\NMR>,<NMR_250MHZ>,
      <created by zg, POWCHK disabled, PULCHK disabled
       configuration hash MD5:
       62 19 C7 07 E1 42 D1 B7 37 6C 3D D0 77 39 F9 E6
       data hash MD5: 64K
       8E 9E 27 9C DB 57 A8 36 A1 25 E4 6D AE 7A 88 60>)
(   2,<2005-08-09 10:23:50.04 +100>,<MAYBRIDGE\NMR>,<NMR_250MHZ>,
      <Start of raw data processing
       ef LB = 0.3 FT_mod = 6 PKNL = 1 SI = 32K 
       data hash MD5: 32K
       95 60 B2 F3 A1 B1 26 5E A4 15 17 4D F3 D3 E2 AD>)
(   3,<2005-08-09 10:23:51.78 +100>,<MAYBRIDGE\NMR>,<NMR_250MHZ>,
      <apk 
       data hash MD5: 32K
       BD 08 DB 66 31 0C 81 1E C3 4A C9 32 E2 D9 C1 AE>)
(   4,<2005-08-09 10:23:52.54 +100>,<MAYBRIDGE\NMR>,<NMR_250MHZ>,
      <abs ABSG = 5 
       data hash MD5: 32K
       1A 15 8F EC C5 80 90 12 AC 4D B6 B8 5C CC 7E 9F>)
$$ ##END=
$$ 
$$ hash MD5
$$ 91 50 B8 06 6F 45 1F 41 D8 D9 DD B1 8E EF 41 DD
##$RELAX= 
##$RELAX= 
##$RELAX= 
##$RELAX= 
##$RELAX= 
##$RELAX= 
##$RELAX= 
$$ Bruker specific parameters
$$ --------------------------
##$DU= <C:\u>
##$EXPNO= 7380
##$NAME= <ADRS>
##$PROCNO= 1
##$TYPE= <nmr>
##$USER= <dgb>
##$AMP= (0..31)
100 100 100 100 100 100 100 100 100 100 100 100 100 100 100 100 100 100 
100 100 100 100 100 100 100 100 100 100 100 100 100 100 
##$AQSEQ= 0
##$AQ_mod= 3
##$AUNM= <au_zg>
##$AUTOPOS= <10 >
##$BF1= 250.13
##$BF2= 250.13
##$BF3= 250.13
##$BF4= 250.13
##$BF5= 500.13
##$BF6= 500.13
##$BF7= 500.13
##$BF8= 500.13
##$BYTORDA= 1
##$CFDGTYP= 0
##$CFRGTYP= 5
##$CHEMSTR= <none>
##$CNST= (0..31)
1 1 145 1 1 1 1 1 1 1 1 1 1 1 1 1 1 1 1 1 1 1 1 1 1 1 1 1 1 1 1 1 
##$CPDPRG= <>
##$CPDPRG1= <>
##$CPDPRG2= <>
##$CPDPRG3= <>
##$CPDPRG4= <mlev>
##$CPDPRG5= <mlev>
##$CPDPRG6= <mlev>
##$CPDPRG7= <mlev>
##$CPDPRG8= <mlev>
##$CPDPRGB= <>
##$CPDPRGT= <>
##$D= (0..31)
0 1 0 0 0 0 0 0 0 0.06 0 0 0 0 0 0 0.0002 0 0 0 0 0 0 0 0 0 0 0 0 0 0 
0 
##$DATE= 1123579418
##$DBL= (0..7)
120 120 120 120 120 120 120 120 
##$DBP= (0..7)
150 150 150 150 150 150 150 150 
##$DBP07= 0
##$DBPNAM0= <>
##$DBPNAM1= <>
##$DBPNAM2= <>
##$DBPNAM3= <>
$$ [...]
##$SUBNAM7= <"">
##$SUBNAM8= <"">
##$SUBNAM9= <"">
##$SW= 20.6930455092707
##$SWIBOX= (0..15)
0 0 3 0 0 0 0 0 0 0 0 0 0 0 0 0 
##$SW_h= 5175.983436853
##$TD= 65536
##$TD0= 1
##$TE= 295.16
##$TE2= 300
##$TE3= 300
##$TEG= 300
##$TL= (0..7)
0 120 120 120 120 120 120 120 
##$TP= (0..7)
150 150 150 150 150 150 150 150 
##$TP07= 0
##$TPNAME0= <>
##$TPNAME1= <>
##$TPNAME2= <>
##$TPNAME3= <>
##$TPNAME4= <>
##$TPNAME5= <>
##$TPNAME6= <>
##$TPNAME7= <>
##$TPOAL= (0..7)
0.5 0.5 0.5 0.5 0.5 0.5 0.5 0.5 
##$TPOFFS= (0..7)
0 0 0 0 0 0 0 0 
##$TUNHIN= 0
##$TUNHOUT= 0
##$TUNXOUT= 0
##$USERA1= <user>
##$USERA2= <user>
##$USERA3= <user>
##$USERA4= <user>
##$USERA5= <user>
##$V9= 5
##$VALIST= <valist>
##$VCLIST= <CCCCCCCCCCCCCCC>
##$VD= 0
##$VDLIST= <DDDDDDDDDDDDDDD>
##$VPLIST= <PPPPPPPPPPPPPPP>
##$VTLIST= <TTTTTTTTTTTTTTT>
##$WBST= 1024
##$WBSW= 4
##$XGAIN= (0..3)
0 0 0 0 
##$XL= 0
##$YL= 0
##$YMAX_a= 221047
##$YMIN_a= -166741
##$ZGOPTNS= <>
##$ZL1= 120
##$ZL2= 120
##$ZL3= 120
##$ZL4= 120
##$ABSF1= 16.522
##$ABSF2= -4.171173
##$ABSG= 5
##$ABSL= 3
##$ALPHA= 0
##$AQORDER= 0
##$ASSFAC= 0
##$ASSFACI= 0
##$ASSFACX= 0
##$ASSWID= 0
##$AUNMP= <proc_1d>
##$AZFE= 0.1
##$AZFW= 0.1
##$BCFW= 0
##$BC_mod= 0
##$BYTORDP= 0
##$COROFFS= 0
##$CY= 12.5
##$DATMOD= 1
##$DC= 0
##$DFILT= <>
##$DTYPP= 0
##$F1P= 14.0000005364418
##$F2P= -0.99999901652339
##$FCOR= 0.5
##$FTSIZE= 32768
##$FT_mod= 6
##$GAMMA= 0
##$GB= 0
##$INTBC= 1
##$INTSCL= 1
##$ISEN= 128
##$LB= 0.3
##$LEV0= 0
##$LPBIN= 0
##$MAXI= 10000
##$MC2= 0
##$MEAN= 0
##$ME_mod= 0
##$MI= 0
##$NCOEF= 0
##$NC_proc= -5
##$NLEV= 6
##$NOISF1= 0
##$NOISF2= 0
##$NSP= 0
##$NTH_PI= 0
##$NZP= 0
##$OFFSET= 16.522
##$PC= 1
##$PHC0= -86.10223
##$PHC1= 12.21561
##$PH_mod= 1
##$PKNL= yes
##$PPARMOD= 0
##$PSCAL= 4
##$PSIGN= 0
##$REVERSE= no
##$SF= 250.13
##$SI= 32768
##$SIGF1= 0
##$SIGF2= 0
##$SINO= 400
##$SIOLD= 32768
##$SREGLST= <1H.DMSO>
##$SSB= 0
##$STSI= 32768
##$STSR= 0
##$SW_p= 5175.98343685301
##$SYMM= 0
##$S_DEV= 0
##$TDeff= 65536
##$TDoff= 0
##$TI= <Analysis number 999999
Compound Code 99
Book Reference 9
Project Code 9>
##$TILT= no
##$TM1= 0
##$TM2= 0
##$TOPLEV= 0
##$USERP1= <user>
##$USERP2= <user>
##$USERP3= <user>
##$USERP4= <user>
##$USERP5= <user>
##$WDW= 1
##$XDIM= 32768
##$YMAX_p= 465974407
##$YMIN_p= -1027078
$$ End of Bruker specific parameters
$$ ---------------------------------
##NTUPLES= NMR SPECTRUM
##VAR_NAME=  FREQUENCY,     SPECTRUM/REAL,   SPECTRUM/IMAG
##SYMBOL=    X,             R,               I
##VAR_TYPE=  INDEPENDENT,   DEPENDENT,       DEPENDENT
##VAR_FORM=  AFFN,          ASDF,            ASDF
##VAR_DIM=   32768,         32768,           32768
##UNITS=     HZ,            ARBITRARY UNITS, ARBITRARY UNITS
##FACTOR=    0.157963299565203, 1,           1
##FIRST=     4132.6476996994, 0,             0
##LAST=      -1043.33573715361, 0,           0
##MIN=       -1043.33573715361, -1027078,    0
##MAX=       4132.6476996994, 465974407,     0
$$ Real data points
##PAGE= N=1
##DATA TABLE= (X++(R..R)), XYDATA
$$ [...]
28966 5849667 6009176 5753774 5706602 5841084 5642563 5657665 5770370 5741370 5770913 5794631
28956 5794631 5815328 5753361 5898536 5788185 5782366 5813514 5587080 5393413 5463113 5773299
28946 5773299 6010041 5819772 5699565 5761753 5704764 5837560 5671643 5224639 4967215 4938839
28936 4938839 4835305 4857966 5101606 5029141 4754790 4718681 4918586 5256785 5379343 5416138
28926 5416138 5271232 5144230 5142907 4863456 4686923 4544031 4762721 5160106 5300712 5135431
28916 5135431 4992797 5029237 5074996 4807751 4396313 4384482 4248894 4213768 4320694 4318770
28906 4318770 4508802 4630335 4366430 4398429 4497045 4401595 4303209 4367324 4670315 4712822
28896 4712822 4521782 4510199 4402611 4385592 4522900 4328369 4129740 4398018 4544423 4449107
28886 4449107 4474036 4308853 4083075 3883440 4026209 4005767 4160976 4222388 4186128 4117833
28876 4117833 4225491 4291420 4406979 4318510 4348589 4310583 4404747 4254963 4045313 3928748
28866 3928748 3823896 3720413 3497047 3675258 3860341 3671648 3658911 3936144 3860457 3561087
28856 3561087 3617675 3844804 3641091 3395120 3485099 3589060 3472696 3259175 3422035 3598979
28846 3598979 3817432 3760176 3442111 3371276 3335885 3101484 3385789 3673621 3712262 3436131
28836 3436131 3047344 3285999 3342581 3440302 3533574 3341227 3364885 3404381 3441467 3419198 3203366
28825 3203366 3230573 3510915 3256324 3123521 3100964 3219548 3394756 3491851 3291488 3300720
28815 3300720 3343543 3422052 3203460 2888850 2908809 2827795 3093644 3275622 3215946 3095649
28805 3095649 2942717 2987114 3084599 3127536 3124290 3082331 3175127 3284280 3283700 3260227 3104070
28794 3104070 2828640 2656955 2704982 2549540 2656578 2711612 2547956 2491101 2762207 2810154
28784 2810154 2752171 2542254 2509862 2775556 2780245 2617857 2600062 2614813 2886739 2862592 2639291
28773 2639291 2463909 2485612 2625406 2595156 2485627 2516141 2713219 2776468 2617351 2704719
28763 2704719 2759493 2680714 2678993 2572721 2588728 2575240 2598319 2781001 2834334 2964838 2555833
28752 2555833 2237069 2281608 2574136 2525710 2398558 2234229 2128512 2189169 2139377 2060367
28742 2060367 2108413 2244607 2263587 2253484 2155156 2020448 2078614 2184844 2426615 2365644
28732 2365644 2435626 2479406 2232501 2313792 2585152 2321473 2101516 2053665 1985842 2051967
28722 2051967 2250401 2098217 1691103 1836329 1866206 2030417 2023791 1849870 1795759 1790543
28712 1790543 1657868 1763684 1687826 1600026 1647506 1855466 2159882 2383085 2323509 2408932
28702 2408932 2380215 2206849 2075114 2254415 2163333 1993198 2192546 2246211 2056133 1963285
28692 1963285 1977347 1766143 1816678 1786829 1966648 1920477 1962927 2055173 1966625 2018534 1965696
28681 1965696 1925468 2018840 2061088 2080867 2105473 2139460 2004171 1858319 1832877 1807257 1824090
28670 1824090 1635889 1623185 1677911 1795850 1794679 1453331 1375434 1250096 1483811 1570514
28660 1570514 1594503 1624007 1626215 1732634 1813471 1737731 1615326 1473477 1465968 1676360 1389181
28649 1389181 1113272 1186384 1266971 1221649 1024268 934867 1164130 1554299 1801595 1842078
28639 1842078 1764559 1824077 1742357 1387860 1318784 1326042 1366822 1249233 1558971 1816761 1814601
28628 1814601 1527580 1603717 1609765 1732165 1463714 1529278 1760689 1767121 1717718 1614557 1763015
28617 1763015 2005432 1963963 1932437 1992754 1707287 1382819 1242290 1218939 1307567 1244563
28607 1244563 1326098 1273541 1240499 1288435 1438124 1524861 1551196 1504357 1674008 1486029 1075162
28596 1075162 1029767 1211340 1219650 1374430 1163963 1063352 1104323 1128284 1274392 1387089
28586 1387089 1608037 1519406 1313003 1230697 958742 1028982 1159103 1301759 1467219 1383156
28576 1383156 1093473 985749 1030043 1322189 1322533 1465592 1639456 1886450 2021328 1675140
28566 1675140 1514045 1381361 1224432 1156283 1086964 1081666 1304747 1290835 1283052 1373037 969404
28555 969404 590443 631423 1035475 1374166 1170429 1097291 1247997 1050217 1026634 960947
28545 960947 852808 900661 993119 1022641 1052472 962755 924641 910506 680828 747247 850282
28534 850282 999860 1077967 961804 1118721 1212302 1145016 944639 1034087 1222906 1209098
28524 1209098 935298 945067 1175473 1201509 990205 942048 1153199 1448272 1360889 1170844
28514 1170844 887915 993259 878793 867206 968454 1026251 1118266 1047055 1153917 1040299
28504 1040299 990832 1187301 1127925 1079441 919837 791780 601914 865068 1212891 1232207
28494 1232207 1209009 1333697 1232697 1144901 1291949 833739 418682 552439 560005 689273
28484 689273 823567 788474 784774 692969 759757 498644 518253 653361 724971 863138 703777
28473 703777 951289 1057503 1039755 1070490 886016 893304 828082 852814 878430 1023490 888066
28462 888066 768066 797887 1020899 1150842 1150937 1020645 1102712 1082941 905403 1163357 1243610
28451 1243610 1120123 1197897 1118603 915162 651822 915962 1111405 1102669 1242281 1189690
28441 1189690 1223115 1164491 1108059 1242420 1163825 1157764 858418 756290 828808 892267 888678
28430 888678 944370 1058730 1041918 899874 848205 774292 810820 872445 1138724 1074121 803620
28419 803620 563059 373023 559640 724406 863783 1093529 1240234 1243704 1203988 1106751
28409 1106751 1053985 1200575 1193377 937106 855786 953203 1160628 1136748 880125 574433
28399 574433 252226 688140 821262 1028427 1008795 722586 629161 585390 568141 724668
28389 724668 833895 744526 527387 659587 910446 1101864 998435 1353520 1508607 1320368
28379 1320368 804137 801924 946330 944896 753258 684028 536953 484498 456761 510464 705285
28368 705285 836036 821147 849847 1009222 1149770 1211522 977112 469370 301209 558766
28358 558766 782624 1070575 1167929 1035825 968047 984972 1040775 1099700 767465 536078
28348 536078 514606 411950 418399 662215 765255 579324 824771 971517 856933 667505
28338 667505 804218 826092 648919 605397 718540 522259 537665 700581 755233 838435
28328 838435 787851 841225 726521 410387 472931 609157 860363 596835 502274 547717
28318 547717 912449 935604 877090 866969 984520 875576 743912 896391 1103717 761496
28308 761496 558287 278545 468402 681423 828210 795155 743526 608124 596922 564235
28298 564235 330294 195605 268367 328684 370705 390824 281997 236884 389618 470112 413879
28287 413879 453799 474437 371305 584701 728411 677526 670938 574300 381680 138029 322228
28276 322228 418848 319078 369612 750342 695197 329726 358725 39321 -71062 215746
28266 215746 638437 936685 1120705 1223350 1020221 588572 602450 559810 300417 183540
28256 183540 428492 629919 753177 488542 454351 450860 529310 571165 659609 376233 386302
28245 386302 727606 926158 791148 715407 813399 994002 976295 700309 706564 851797
28235 851797 920308 897539 1042299 878618 725544 692189 516704 519321 631466 601569 429916
28224 429916 425394 174505 35744 270947 537969 515190 393238 443731 369540 383926 659127
28213 659127 847940 626685 581185 616007 569680 573189 398539 97432 211333 197048 294257
28202 294257 361650 506188 133242 17287 193891 220906 250756 151347 285109 289178 251383
28191 251383 189720 256528 224816 498526 596928 407713 339500 318766 464682 535745 566232
28180 566232 443895 218912 303557 290351 446505 764726 901551 926545 837424 457741
28170 457741 352375 454232 677548 495945 305640 451190 595654 212803 143741 242066
28160 242066 556047 618112 229399 124815 332641 642197 774186 793270 431232 430230
28150 430230 435360 352574 341160 317428 386753 786862 579536 410915 418302 383948 241178
28139 241178 81524 -151866 110077 328978 301752 460977 585508 616947 464472 485892
28129 485892 601637 481418 475296 520409 412283 309143 524585 552791 474610 470357 576042
28118 576042 643589 572872 421541 306134 250197 357943 472817 279954 30597 113033
28108 113033 239909 317266 189702 252585 532987 607065 548037 716248 976572 1052821
28098 1052821 1188842 1096051 909771 682902 322592 195287 179882 433364 386954 275107
28088 275107 236601 332625 256352 478880 489539 427664 377510 452490 329646 179060 191591
28077 191591 142646 94066 -106390 72436 245673 108186 253838 634174 717039 569714
28067 569714 537552 497948 220341 201485 164030 309758 438559 313207 327172 516142
28057 516142 381200 388516 139541 321879 710919 771756 535916 163802 50295 121454
28047 121454 484488 405705 42294 -336691 -270572 85881 160011 268154 335497 467369
28037 467369 385911 428732 738932 845400 699675 524767 459985 458799 380587 379022 545224
28026 545224 209838 254123 583998 704692 506883 291513 65226 -65288 59046 196211
28016 196211 235546 328919 303572 258265 435502 323828 226459 297038 119430 131261 296037
28005 296037 369083 311174 333479 196217 -175269 -224625 116856 44736 130541 326472 342141
27994 342141 460676 651976 458715 218241 303265 416263 613939 413343 134686 382773
27984 382773 568385 527701 722284 560678 356678 431255 494302 581158 515026 294400
27974 294400 350909 333854 -104192 14351 -7013 -205382 -149672 147462 355453 347811 204212
27963 204212 52188 -212542 -46083 161389 154427 265059 518007 546355 269324 44327
27953 44327 129710 42421 -33422 -56026 -69125 -165275 -50539 38772 -175636 -51266 195746
27942 195746 168318 293384 306843 215364 197373 92379 131088 144091 165229 221366 601774
27931 601774 734871 726538 991585 839754 706127 733839 584868 531867 438235 342261 342898
27920 342898 172351 64924 37100 -83562 -335986 -466387 -183776 227671 137333 14885
27910 14885 192660 28635 -27186 274654 475367 780806 776998 660884 503028 599316
27900 599316 709789 529933 527670 513938 444223 299273 218926 339787 366943 250944 215518
27889 215518 115095 185136 307118 174121 233577 179464 322267 171726 322511 263779
27879 263779 279137 318868 250728 289096 285658 499957 357164 216731 164551 207907 172371
27868 172371 136684 253392 167691 43620 -9969 257502 264074 50034 112093 346917 502580
27857 502580 739837 418998 443719 292173 112982 132751 -7636 132308 401446 508500
27847 508500 379781 41729 3432 331698 324254 509739 677320 591841 220558 -63761
27837 -63761 7878 197867 187229 52829 196881 323456 536851 371078 86361 104326
27827 104326 257057 236524 303154 192552 328190 646717 580550 532770 360336 252669
27817 252669 325409 279183 466320 379577 835 54742 155121 255005 332614 451621 255443
27806 255443 312749 470443 441812 432260 374204 415191 281120 126828 261981 296697 259986
27795 259986 58241 -1657 -28554 -161509 102441 328541 480688 564637 477611 310051
27785 310051 -17233 -226397 -357944 -37885 225525 292963 230579 36312 -10855 93185
27775 93185 173261 167562 48981 -58985 -139009 -88201 -91937 -98627 25320 356910 508099
27764 508099 530505 352753 325133 308890 306918 209313 73574 125941 140693 311821 431721
27753 431721 396718 194109 -178560 -400084 -408023 -238637 151227 19962 -94496 -168904
27743 -168904 -158348 66243 271608 180597 -27958 -7104 123131 354063 281991 467782
27733 467782 601033 726485 843685 919865 788805 602541 618947 614420 497268 391127
27723 391127 219845 -16810 52889 164199 241448 94317 -22527 222776 282152 100251
27713 100251 66324 85606 -118956 -133012 65056 336387 240011 57617 180617 182836 55014
27702 55014 191278 117481 30866 125484 -2346 -54169 202292 91058 63564 134267 314008
27691 314008 339656 278036 217682 125459 -194866 15612 67404 -178815 -106842 29467 -75698
27680 -75698 199700 296264 141033 76270 114475 133012 261928 291568 174259 254973 133972
27669 133972 102797 400672 575433 370251 252205 123247 210224 120630 240769 208517
27659 208517 253737 287993 297439 339366 338298 282229 212162 187540 190380 -4952 59551 43372
27647 43372 289926 289189 265282 262044 305289 204213 126346 91384 -51304 -7072 79573 69249
27635 69249 -110912 -402745 -195946 54406 93583 233785 277144 448319 422378 362577
27625 362577 516237 654629 385656 220080 382798 520330 256400 134068 101445 59374
27615 59374 149435 61743 274337 158598 227643 352188 252778 116906 32671 87534 -110535
27604 -110535 -22722 311655 270666 -6795 -230800 -215283 -88136 238759 107686 -129523
27594 -129523 -351244 -377335 -259931 -500129 -669803 -432558 -210387 -120843 -53983 -35416
27584 -35416 -318468 -364618 -114998 -100911 -30797 137412 191527 285399 138277 -182572 -55437
27573 -55437 137489 -4823 53567 22406 50435 117767 262966 304660 106872 -61567 -77076
27562 -77076 -174817 -48216 477869 536846 280110 235693 270499 444854 318253 249863 -10501
27551 -10501 -82715 -119651 -169335 -215871 -398112 -410358 -225558 -151744 -106742 -99728 4586
27540 4586 79330 479727 390547 126099 214251 371951 392749 285767 429871 178380 36432
27529 36432 151020 30995 176589 183432 196015 -106642 -247402 12583 -237128 -111099
27519 -111099 -83375 -185965 -110192 363839 677849 559749 441740 396006 173581 143812
27509 143812 139889 398479 435370 342584 175044 -89626 -103020 -122861 76234 301638 422774
27498 422774 265182 183272 121176 107309 -7678 -51857 163723 1616 -105975 87108
27488 87108 57803 -216948 -308609 15983 239868 -24451 -100731 -315416 -391799 -530459
27478 -530459 -352378 -49547 157429 64196 -304597 -126776 -25667 -479336 -618388 -391712
27468 -391712 -86799 45191 -171585 -193769 -337396 -112806 148167 237783 411948 440236
27458 440236 91422 48913 266733 353493 297722 116436 -184902 -320414 -119426 106899
27448 106899 144289 20621 -208752 -299672 -259350 -322591 -255737 -284934 -102764 -36999 -48646
27437 -48646 71865 359584 421061 541946 445345 174197 -34754 91445 353846 285606
27427 285606 272774 294733 -81176 -54500 191537 261835 314024 -96478 -139540 -70271 45526
27416 45526 70674 207082 145389 -169512 -479449 -487422 -250317 -35540 -7472 109056 365769
27405 365769 443123 441298 342053 70604 -94736 124068 272094 240430 29225 -223405
27395 -223405 -466779 -396111 -302787 -239784 -226498 -347204 -303892 -210097 -7413 44972 127712
27384 127712 211388 344193 264514 305532 293724 274458 373449 149181 28864 -187625 -325333
27373 -325333 -99829 -1749 111189 317641 170474 -71966 -15497 -160143 -54492 209639
27363 209639 235 -219955 -233963 -28505 11047 -142281 -218331 -12120 -17916 -187002
27353 -187002 -204285 1435 40927 -136647 -215333 -78339 90617 373200 291735 240925
27343 240925 403352 309274 263876 314507 176327 286165 97863 46868 321923 282841
27333 282841 146519 47039 -158555 -202073 -114812 -100635 15806 -106886 -254120 -403634
27323 -403634 -331917 -220453 -171127 -83273 87223 -13863 -186139 -399014 -197865 77386
27313 77386 -46474 -96803 -40369 -183484 -272606 -117042 70854 62455 -25460 36360 197101
27302 197101 99732 -189436 -402119 -479657 -386179 -244489 -320070 -348991 -542815 -443762 -107871
27291 -107871 910 265379 214059 274208 216424 149921 130110 -147296 -153745 374363 612529
27280 612529 405212 -38829 -93803 19077 27606 44916 -37111 -77233 60248 303374 123114
27269 123114 104068 117057 30224 151578 269751 110711 -140678 -108430 -27688 62598 -120489
27258 -120489 37561 119270 41355 -76577 -162659 -29152 78232 56892 12578 -20672 -68764
27247 -68764 -142909 -50762 46882 -66149 226678 314491 91561 -2403 -61827 -96665 -39845
27236 -39845 208984 199017 53803 82170 -194641 -299110 -148359 -461002 -480979 -269359
27226 -269359 -161927 -6458 66925 235372 61780 -112248 -82236 43108 208127 224011
27216 224011 79165 -81807 -266780 -183822 5382 51133 -113877 -2723 306168 385619
27206 385619 417400 520050 599603 606207 352140 -13828 -253716 -86324 161978 140039
27196 140039 -101332 300 226808 419684 431222 35237 -99922 -60737 47692 31200
27186 31200 51293 111154 166562 -12007 84488 152194 35570 -99485 256803 219229 -48971
27175 -48971 -56363 -170053 -397732 -389852 -305019 -114300 102563 334900 210987 97056 -136006
27164 -136006 -299727 -23968 179308 32042 -57339 -302421 -623577 -592783 -149789 -31669
27154 -31669 61609 115509 -45309 -106885 232724 301506 165330 202751 152057 159856 200519
27143 200519 411001 414234 387815 501908 575230 708024 470513 -3794 -207468 -41293
27133 -41293 75650 -63482 62172 174224 -41151 -244326 -260592 -176832 -399546 -404440
27123 -404440 -244212 -110680 -144407 -28917 98531 186010 110461 72044 206308 209144 120247
27112 120247 -123725 -98273 51579 -118158 -338473 -173083 10856 17408 144532 119999
27102 119999 213103 221980 196892 184515 -137397 77650 284466 203401 83250 183397 191112
27091 191112 -55121 -211051 -153915 -34610 109594 256548 402715 168210 130851 137984
27081 137984 178587 156903 172337 -168512 -195531 -331374 -322155 114 88238 31160 -232004
27070 -232004 -182218 -182547 -36495 186479 247911 246136 291398 219982 78135 161305 227636
27059 227636 -29860 120734 149660 -202227 -41296 167659 220631 258138 107475 180190
27049 180190 326667 376073 157357 -130119 -175586 -187017 -32334 -143526 -117660 -164230
27039 -164230 -368718 41392 169728 -381741 -529496 -364992 -429899 -339592 -113197 -195302
27029 -195302 -198711 -131419 17928 102685 13698 -78125 -38665 249990 343167 249056 101398
27018 101398 87015 100106 -159545 -274302 -207387 -318385 -161693 -204769 -87596 -87520 -80977
27007 -80977 79944 27640 130614 20747 4429 156030 181628 4433 -188525 -208540
26997 -208540 -65653 -103752 -194312 -287355 -145082 178589 153809 50896 7063 -57595 100100
26986 100100 -6382 -60264 44047 211213 205977 230040 365066 531594 358336 349358 147937
26975 147937 -2133 -76628 -264984 -157486 -176221 -53239 -74067 -142066 -177873 -102078 -51862
26964 -51862 -102421 -242334 -133765 -123634 -11200 43290 321604 139210 -118202 -302587
26954 -302587 -355098 -428348 -305721 16946 263858 111970 133570 134271 210431 74555 -30402
26943 -30402 113961 199276 379903 119290 -183358 -308524 -259721 -193544 200679 283285
26933 283285 111929 -88329 -163558 -152857 -321907 -210073 -12682 -341199 -413976 -310744
26923 -310744 -180520 -67384 -39446 356398 293411 122053 147724 -27943 -63553 -4578
26913 -4578 -2534 93574 -83947 -279835 -169820 -182353 -93391 -244747 -162773 -92301 -90241
26902 -90241 14894 39861 278021 407669 182129 -120890 -56856 76190 -70217 -14427
26892 -14427 97899 -53039 -144673 -74883 -64938 85577 12970 149773 433206 152598 24424
26881 24424 -62366 78046 28871 273 -41779 33863 123345 -139160 -228672 -172661 70390
26870 70390 128358 168569 156797 242170 312355 439624 189915 76094 112498 22261 25839
26859 25839 175860 -118352 12747 399985 422260 299618 447243 407686 358225 345899
26849 345899 167788 -79685 217539 243112 -193775 -206966 -107769 81324 -62895 -379706
26839 -379706 -181481 -246974 -558448 -419431 154936 389541 82279 -11416 -396849 -68693
26829 -68693 36771 -74029 -93405 -91510 -66834 -172052 64021 -127719 -190211 -127703 -264654
26818 -264654 -398631 -299778 -220143 -196894 45429 181041 234026 384234 569817 527840
26808 527840 319419 -135820 -144197 13407 -260474 -497176 -571447 -630213 -308754 1415
26798 1415 -57791 -384409 -162917 174750 69252 -96593 35390 108118 24563 68026 47606
26787 47606 -9527 -129081 -293665 -281459 -216688 -32747 84116 -46696 70214 80627
26777 80627 304508 147950 -77643 -341064 -389415 -29198 -84514 -143140 -46063 -133387 4053
26766 4053 38053 -210002 -283253 -374898 -192251 63296 25187 118273 -119851 -301020 -12864
26755 -12864 63500 134287 -82105 -391768 -680050 -474373 -171833 -460503 -399128 -322112
26745 -322112 -389697 -149064 -6223 -79113 -115408 -48448 -244170 -132755 -222246 -409494
26735 -409494 -490891 -70497 182555 -78090 -48250 -150538 -291610 -230801 -469174 -314593
26725 -314593 67464 313932 158093 -9450 -45261 79470 38457 -88000 10584 37680
26715 37680 36402 184022 80137 24112 -87355 64083 181339 168043 173690 590716 696941
26704 696941 428145 200797 318138 291203 297206 288896 43843 -74884 -17034 101155 124171
26693 124171 31798 -5255 -229510 -648411 -505853 -139287 59418 203890 410837 446735
26683 446735 446049 15335 -193546 -62422 41953 -430444 -403131 -368433 -342047 -248183 155959
26672 155959 374589 339496 319164 332602 272192 272642 292968 224963 395610 79950 -164902
26661 -164902 -14820 -55770 -24248 -12891 22210 4396 70219 78787 218729 137630 141936
26650 141936 212208 229754 235439 93606 183578 182100 283701 222375 187127 61852 -147574
26639 -147574 -226041 71237 175013 -99482 -267718 110972 379283 298857 196453 98068
26629 98068 91651 69694 23484 190115 -44436 -26230 96140 227843 615885 578927 403690
26618 403690 202483 -50791 -82830 53589 40828 -202332 -229574 -427682 -462680 -331472
26608 -331472 -151596 -246459 -135653 -37234 158082 394691 364774 94651 150630 217148
26598 217148 325227 170032 -88805 39322 35113 -82262 160794 76052 -85285 68846
26588 68846 187042 -49670 -77955 -55740 13599 -75704 -11296 -135508 -133049 -309114 -503320
26577 -503320 -295220 -129095 -129890 -205132 -345935 -168166 90375 57714 65796 74812 73681
26566 73681 306230 -37327 -222961 -265412 -358649 -379261 -541042 -405463 -390016 -304790 -83117
26555 -83117 -304900 -647324 -663091 -335458 -60242 62473 98390 173115 276759 47881
26545 47881 -158671 -96624 -164529 -244963 -164363 -96998 -218471 -9316 -2967 -327244 -639305
26534 -639305 -679212 -152785 -93740 53583 276329 307174 106092 46263 227431 218460 136978
26523 136978 -1213 -33696 24608 22942 40701 278247 504780 659736 283707 360889 377884
26512 377884 575093 306084 212366 -16030 -178388 -245457 -289593 -224161 -155420 42404
26502 42404 227127 210003 -276077 -398723 -166025 -25534 -162887 -3892 113569 82916
26492 82916 404541 879667 751338 517839 189858 49607 -84741 -208957 105900 98280
26482 98280 142841 283006 412031 405431 190334 -45422 -105042 -255412 -135685 51650
26472 51650 94831 -555 126802 3441 -104042 -112540 -284443 -468939 -522225 -521996 -502278
26461 -502278 -487406 -222082 -139543 -5535 -1159 -222598 -282890 -117766 164913 221878 -134939
26450 -134939 -250627 -189072 -53442 52139 -165830 -144263 -50694 -179553 -24567 267323
26440 267323 70561 -14738 154752 113699 116904 -202487 -233715 18783 164684 205304 54752
26429 54752 -31050 -168526 -272133 -304773 -170173 113619 -91634 -256057 -460254 -411613
26419 -411613 -245561 -276846 -348964 -438579 -561472 -416707 -222473 27687 237460 130121
26409 130121 19566 63956 115846 4366 100561 123188 -15289 46878 127238 155491 271309
26398 271309 152505 168725 307715 366831 271429 128238 321699 617129 183813 -117391
26388 -117391 -224108 -68686 -12461 -93414 -63104 18206 -43543 37316 42274 -167543 -447297
26377 -447297 -430232 -269838 53926 279400 205571 116577 -106610 -238712 -435613 -422194
26367 -422194 -443261 -275740 -216816 -110640 -7541 221728 514939 538958 399886 433679
26357 433679 312039 53946 34640 134221 -66249 -144703 45299 248968 73368 -85814
26347 -85814 52257 -21216 -243083 -390616 -333278 -114066 -64738 -15760 -2778 47225 104208
26336 104208 361 75181 230274 135449 -73782 -53975 -41284 -34174 36128 -33544 -143173
26325 -143173 229249 166311 -135871 -292157 -120730 -43910 -268574 -219611 16111 133581
26315 133581 56901 -9097 -204190 -252413 -56430 -33244 -119174 -229739 -165989 -99844 -171990
26304 -171990 -108847 -16389 -32276 -45568 -124642 24610 -202720 -340750 -370074 -324323 -295135
26293 -295135 18306 -83146 -258443 -123426 -329258 -258784 -193461 -83439 78421 -107756
26283 -107756 -100541 14153 -165430 -303435 -233719 -125490 -22388 -26654 -266945 -279805 -337245
26272 -337245 -438202 -316112 -16548 152950 67543 -112729 -317277 -309034 -301744 -355618 -211690
26261 -211690 -159165 -62595 36252 413213 333413 1620 -1987 285182 195860 136795 459916
26250 459916 422956 -1281 -49052 -226684 -297470 -82753 -36753 180281 44848 -82840
26240 -82840 130845 226421 144278 -212385 -359731 -473311 -598132 -550578 -396424 -283482
26230 -283482 -224928 -334245 -441421 -206198 -161735 -142454 -59887 60556 -99588 -481634
26220 -481634 -581277 -146353 251870 295101 -42831 -187729 -454359 -532942 -368060 -148322
26210 -148322 -240189 -61046 -67617 -36444 -149693 104956 275347 21323 11603 235091 106845
26199 106845 191472 -41099 -213265 -198076 -301522 -472579 -565697 -369698 -191435 -207289
26189 -207289 -265349 -511370 -656458 -488826 -283643 -205839 -206874 -87544 -101097 58724
26179 58724 139595 1554 -229461 4147 5917 176962 127840 -11473 -193255 -433973
26169 -433973 -259270 -34324 5403 187199 308581 219322 353891 172920 118921 25907
26159 25907 -31154 -15547 7489 87738 39652 -125824 -134104 309357 507475 500484 506351 232257
26147 232257 -120975 -266518 -426495 -205208 103132 226439 62809 -4066 -51252 95994
26137 95994 287949 445078 464668 247233 233331 140939 26446 -26623 242189 539644
26127 539644 420490 552033 542969 416177 136941 -40538 -127200 -195940 -346735 -508528
26117 -508528 -315393 3118 164151 218710 148620 -43549 -53273 185718 230531 267075 224967
26106 224967 126780 62513 139448 -33449 -228947 -81362 -134997 -45434 303815 313058 203157
26095 203157 249079 338401 63769 6544 -69717 -95364 120254 -203626 -388545 -153667
26085 -153667 10724 101028 -38539 -234248 -316318 -76196 115875 -16620 -255 -40658
26075 -40658 -277966 -443815 -334669 -4898 246649 317214 87701 14309 82981 18059
26065 18059 -120705 -179649 68748 134288 146463 297196 351837 394487 77994 -118182 -186053
26054 -186053 -232932 -42231 201216 83570 20702 69234 149639 -136938 -249307 -218662
26044 -218662 118724 81608 -199238 -87385 84412 59317 232664 350968 -96105 -202325
26034 -202325 -98142 -331648 -345619 -654398 -546185 -272654 -134377 -243601 -377642 -282955
26024 -282955 183168 319559 287375 314251 414969 378647 394562 520101 276076 -58591
26014 -58591 7924 82754 -82057 -149724 157101 385667 291201 363350 387193 239448 431349
26003 431349 395033 68285 -135413 -244570 -37214 164768 35148 170795 366160 299902
25993 299902 31079 -107249 -127985 -181389 -18126 71665 -48780 -75151 37959 16724
25983 16724 151416 120352 119513 -64901 108607 30314 46744 223578 376852 306804 22543
25972 22543 -154978 -231487 -299054 -336443 -351265 -47380 276392 392308 348577 276069 97621
25961 97621 -77697 -57568 -88451 -74283 -67614 -134756 -241797 68469 363458 381153 315655
25950 315655 69789 -16750 -183856 8358 296120 421213 234239 230564 436734 84045
25940 84045 -158545 -322474 -247446 123924 385134 311984 -37967 64194 -124222 -112274
25930 -112274 18940 19440 167983 150394 86211 93974 58343 -54456 -131516 -194530 -208045
25919 -208045 -195318 -313204 -300357 -103310 107442 -42766 9404 178544 313763 221101
25909 221101 54823 -168940 -247346 -103930 -176825 -144051 -39063 380272 3295 -177781
25899 -177781 -49055 -3459 153293 -63320 -175373 -1745 241423 158014 60790 198717
25889 198717 240131 267574 103898 7971 -17578 22502 -68982 -279589 -437354 -384831 -530869
25878 -530869 -237858 40687 -10342 -88259 -8827 -101241 -35339 6077 30562 -140696 -259819
25867 -259819 -277956 -176655 -123911 -13934 183305 26514 -91968 -282064 -2117 240841
25857 240841 92285 112514 23050 -154213 -3549 83551 178965 -30584 -323599 -146495
25847 -146495 62994 153934 406399 447160 345409 253583 175474 171527 -126591 -346505 -148461
25836 -148461 -101127 -117387 131068 -60942 125214 414828 239681 -345452 -312143 -127055
25826 -127055 -375848 -670850 -606326 -346628 -253801 -455970 -230306 14020 60206 44759
25816 44759 55901 148940 18447 -75863 -53018 -65381 -31849 -176926 -393202 -460181 -326119
25805 -326119 -407741 -270082 -90307 330618 377879 -37736 -8445 -62681 -90314 87010
25795 87010 -57116 -214473 -444112 -447718 -229889 -185314 -163625 -393587 -396980 -292453 -87772
25784 -87772 -80152 94203 -40658 -184012 -418966 -282623 3276 82124 181159 196205 199737
25773 199737 177024 -68464 101598 241630 260749 447204 406196 162325 66559 98067
25763 98067 96343 175769 87343 150876 -72183 -82038 225634 367722 99765 -249846 -413782
25752 -413782 -382749 -256730 156689 356093 69388 148144 116070 168991 245780 -84902
25742 -84902 -323817 -193208 -76194 -411329 -622935 -626216 -628391 -522717 -277627 -191745 -290219
25731 -290219 -440283 -576519 -549145 -508885 -329250 -320558 -252189 -89287 -34331 95932 122184
25720 122184 31427 6171 -127543 -165853 -239731 -574102 -447322 -89001 -23409 280648
25710 280648 372031 254492 -22004 123303 270871 351407 292572 108274 -16682 -165324
25700 -165324 -198224 -274125 -198542 -208910 -180584 102067 -48630 -37136 16466 -21172 -81041
25689 -81041 -131407 -94006 211380 344263 303524 416672 587799 455417 138061 45204
25679 45204 -213266 -249802 21458 -110727 -203338 -85914 -208697 -361462 -338748 -215259
25669 -215259 -83104 -175037 -151924 98699 92057 246527 202812 19264 -71931 56303 244921
25658 244921 330132 110887 -19605 155876 349629 112814 -21762 2871 -293489 -273232
25648 -273232 -111039 -110286 51768 -43240 -52883 -197829 -188962 613 -31877 74496 299921
25637 299921 205097 -253951 -155901 82791 342118 316867 14706 -69226 42349 -4772
25627 -4772 58364 -52496 -122469 80979 338680 401478 501513 257607 101746 51866 128575
25616 128575 -113493 -106046 33774 -283838 -649723 -826625 -182382 213087 54024 -136902
25606 -136902 48272 99020 17348 71833 264090 187919 82008 144308 262016 107052
25596 107052 -30637 147197 37020 -70423 17029 175922 -20526 42754 145953 264588
25586 264588 22564 -198342 72844 -7161 -52589 126493 68450 -265890 -180866 -362536
25576 -362536 -423379 -366091 -251134 52393 448859 239860 -144272 -297875 56451 370394
25566 370394 245927 23365 -208476 -178426 -5342 -159329 -125548 114630 249803 160908
25556 160908 38625 -34696 -136657 -89951 -12344 121194 -46824 49499 151582 35459
25546 35459 -50240 -285366 -254963 -117762 147533 304296 301117 229811 96713 128500 7991
25535 7991 52655 199493 -16135 10231 232087 182995 -56223 -115285 -159395 -64296 81331
25524 81331 307147 391430 256306 354536 416145 175554 69867 -86107 -109687 -270992
25514 -270992 -424969 -434094 -623761 -372612 -23866 35565 20119 -66315 -180973 -353806
25504 -353806 -198866 -91556 -386793 -631806 -582653 -432345 -470175 -507023 -365748 -368437
25494 -368437 -490649 -611037 -190302 -21768 -164690 -127433 -41397 57845 261716 159107
25484 159107 -103809 -272895 -126426 48309 107385 -140838 -132378 174200 270628 50992
25474 50992 -187280 -304966 -107398 51491 -87868 -89842 156921 119821 -326991 -292733
25464 -292733 -112790 48927 29079 -192255 -163387 -55704 -69193 -31260 -20937 47845 -80233
25453 -80233 -146998 -68626 38042 400646 487598 320458 90812 -22256 -44403 -113753 -71453
25442 -71453 85219 340677 257528 -1760 -21171 -53779 -284622 -318239 -232767 -110203 -64691
25431 -64691 188744 82319 112221 209615 147752 148499 176147 167676 213963 284808 452079 109116
25419 109116 136317 194028 38934 -196136 -44862 302914 101528 -39288 -225683 -374083
25409 -374083 -322740 -296343 -463259 -671727 -573248 -339692 -143888 -164260 -278001 -307879
25399 -307879 -382776 -323810 -249702 -132422 -175010 -118389 -50074 -51345 -279429 -256233 -219518
25388 -219518 -153790 -36540 23597 328058 249513 -91497 -47333 93736 320115 201092
25378 201092 139214 225234 291818 160144 -148934 -49290 -37017 -98014 -94125 72805 209132
25367 209132 267278 -165753 -301612 -154024 -160173 -62555 -165 73156 296966 151161 -118348
25356 -118348 61955 36488 -110247 -59614 -31344 -15028 -16047 198468 90225 -8363 -70117
25345 -70117 -133218 -39160 -171574 -316197 -31463 -114401 -287065 -25039 22814 -137516
25335 -137516 -216189 -129876 -290202 -356410 -280430 -24453 -100793 -292783 -458366 -313760
25325 -313760 -212705 -122290 -54265 20238 166175 179962 182884 177794 -6770 -132869 -319388
25314 -319388 -98800 38764 -101910 3665 -60664 -31247 155345 335499 194340 282714
25304 282714 313842 289391 236333 55395 216856 368461 139666 -288704 -515223 -473251
25294 -473251 -206563 177767 253211 13685 -10398 -81672 -219093 25775 117851 103744
25284 103744 60407 103513 -36829 -119452 -319400 -218411 32602 143350 209942 25377
25274 25377 -359150 -485031 -403019 -164087 91042 131757 6667 -49126 -63567 -77065 -402150
25263 -402150 -449484 -275407 -248596 -172947 -150705 -47674 3786 -12898 18333 91182 157050
25252 157050 197952 37637 -122 52798 -129248 -155538 -182522 -235522 -263825 -149315 -87345
25241 -87345 -331710 -340048 -236344 -427433 -406728 -346096 -327049 -184546 -146723 10198 131737
25230 131737 309232 185326 -26830 -57874 -45 -193871 -358604 -414365 -316076 -258399
25220 -258399 -185556 -70183 126243 166101 120539 89488 59262 -268957 -404350 -431171 -472110
25209 -472110 -413779 -345222 -155356 -431948 -449416 -269820 -145577 -244193 -212521 14474
25199 14474 134670 100335 150171 264110 500226 483420 215622 62912 -6904 -66148 -339131
25188 -339131 -552210 -98012 -56253 -151974 -2020 146084 172486 74594 36338 91084 28747
25177 28747 -320174 -381842 -296244 -117109 244305 589322 329942 100575 -259718 -331607
25167 -331607 -99027 -222908 -491192 -183557 186124 257298 344327 248359 359294 242856
25157 242856 14848 -127581 139154 450500 330513 -103572 -58740 -3179 46711 97473
25147 97473 241721 205474 -27469 -47250 -49723 -64619 212982 218857 74322 21490 394626
25136 394626 215095 211370 318056 414510 104962 -175282 -429406 -344201 -260881 -199277 -168277
25125 -168277 -61689 153164 45076 -182917 -47364 51777 -12352 -173847 -257337 -222389
25115 -222389 60555 242443 230747 218015 228748 339075 396289 494124 439449 377088 228355
25104 228355 162588 62065 129982 -4167 13882 -175202 -205534 -202173 -58121 -22289 57358
25093 57358 21592 151988 30837 -173526 -351327 -329387 -278024 -140709 136942 246543
25083 246543 140772 42569 -104602 -275473 -337735 -223863 -158548 -131110 -183405 -268269 -98721
25072 -98721 -189086 -278690 -26747 270627 529764 366169 268643 -14805 -335129 -494703
25062 -494703 -448207 -405776 -245689 -179707 40818 289119 290604 421773 529270 191276
25052 191276 30759 127067 -312929 -623833 -313437 -59666 426 -189952 -310050 -374758
25042 -374758 -271249 -289855 -191036 -31371 -56780 -242078 -322148 -124111 -320083 -357241
25032 -357241 -351364 -263353 -237154 -301835 -399338 -456808 -216744 47753 46874 140867 133952 143464
25020 143464 55207 -306174 -447255 -411573 -229560 -164356 24363 8724 -180169 -276577
25010 -276577 -248694 -110866 94216 -197892 -245346 -30930 186794 -68613 -379742 -380215
25000 -380215 -71561 65189 -153608 16901 123745 114703 350844 399642 131515 -119665
24990 -119665 -196302 -335626 -275143 -305767 -109450 -118070 -185155 -315589 -312688 -446803 -204471
24979 -204471 -371653 -154457 -197729 -116212 -80671 -382989 -275342 -185138 -135833 73984
24969 73984 182607 184286 101613 -99571 -284688 -402672 -517183 -453445 -383253 -133275 19874
24958 19874 2736 -137687 -157184 -146192 33749 -43709 33543 183847 25005 -207255 -53749
24947 -53749 70996 111934 38969 -665311 -554463 -154311 -28674 153444 -44938 -137203
24937 -137203 210060 382447 178214 49196 2835 144657 72324 -77209 -138085 3385
24927 3385 39533 21049 71939 -70256 -80127 -110274 -208481 87249 131055 -74003 -102636
24916 -102636 -50091 -163794 20873 222581 255922 91947 26930 -5254 22142 -4363 -87566
24905 -87566 -170430 -79795 -39900 -99264 -523690 -497287 -98540 -39870 -118620 -142199 -223652
24894 -223652 -89980 -97309 109360 110082 -30132 8486 366534 135866 -67998 -285246 -288059
24883 -288059 -391365 -170972 72243 536049 785342 419646 118886 173322 147322 211366
24873 211366 317010 113796 -187296 -231430 -221442 -50949 114008 460817 484118 113255
24863 113255 -289882 -173030 70059 271137 251236 39051 335569 629529 418771 306898
24853 306898 128915 -118642 -188481 -375220 -300920 -175517 -297626 -249337 -229390 -343891
24843 -343891 -177127 56005 35221 31757 -28839 -112701 -63505 70482 108341 -27188 172461
24832 172461 283657 320189 163148 -9289 45198 39991 -14477 49161 88667 232113 265657
24821 265657 280035 268868 205283 225870 257265 151987 -5313 26788 161202 77442 21766
24810 21766 73998 -187250 -338133 -181891 -135275 -241309 -120111 114603 340461 436616
24800 436616 270188 -151341 -190640 -428994 -489177 -300912 -316688 -275382 -279645 -502159 -584896
24789 -584896 -337703 -52513 127896 212921 140214 224720 387776 360921 167562 65427
24779 65427 -7698 -217986 -289135 -114883 170335 234155 258446 279254 -86287 -236021 -16678
24768 -16678 167713 129860 144973 -121572 -117022 -116887 283996 248092 81354 94678 -386
24757 -386 101324 208495 186533 -45332 73039 118997 193083 223995 261042 195122 -77773
24746 -77773 -48744 -154933 -241348 -137420 7725 -93728 -187627 -180122 111545 -34246 -361203
24735 -361203 -445272 -401683 -407020 -263034 -471321 -607331 -374069 -363796 -405007 -392489 -288146
24724 -288146 -148413 -269121 -265412 -218981 -30084 187453 261425 75209 -216905 -349638
24714 -349638 -219348 50370 -24443 -204264 -196015 -179259 -298280 -4719 2537 -391055 -707663
24703 -707663 -316622 -52547 -66800 -234592 -282428 -138160 -100502 39206 -92835 -375990
24693 -375990 -605483 -657705 -608537 -394517 -124640 87635 -58210 -251722 -97592 96060
24683 96060 54968 43859 463689 442200 365149 182885 198388 22184 -116923 -31859 -37412
24672 -37412 -41164 204772 294275 276717 345376 237064 77510 27868 -62610 -204459 -76120
24661 -76120 -74556 -74126 84435 -66046 -356746 54225 -49099 -108982 129357 203789 -66090
24650 -66090 -274331 -325084 20878 52697 -125101 -301567 -234674 68772 20511 401691
24640 401691 442558 136963 582 92879 -121057 -81044 -67120 147152 382900 321384
24630 321384 152561 85681 333360 271053 272056 3588 -227370 -274306 -574600 -608895 -425374
24619 -425374 -329186 -301355 -376328 -316152 -404505 -525554 -415508 -46529 124096 -119948
24609 -119948 -246500 -77797 -45506 250329 289365 328655 -36317 -194578 -75344 101662
24599 101662 257973 188995 15003 151441 263811 186789 55487 -151757 -466218 -487273
24589 -487273 -108921 -137229 -425052 -552208 -490074 -430469 -389910 -298624 -215658 -122511 103121
24578 103121 143907 -129675 -165794 34068 159738 -11795 -35792 122189 3736 -73670
24568 -73670 90053 229662 16702 -48057 -2875 74102 219618 189798 397473 361448 427757
24557 427757 408250 366802 655668 544713 293446 163073 22526 -87844 -225044 -42638
24547 -42638 102162 63105 64768 126235 155041 199655 366855 45918 -106767 -148076 -271576
24536 -271576 -127478 -1295 -94898 -87753 103619 317922 467623 289858 39930 -65916
24526 -65916 66498 318234 417296 449952 589064 519167 237471 270711 263377 -54075 -183046
24515 -183046 4749 32009 359603 365913 3968 56252 179873 431674 424097 206281 118507
24504 118507 117828 2006 72989 29563 20138 54709 52300 66252 312098 242241 21562 357299
24492 357299 619183 660466 203558 -125368 -108882 -58852 -74903 -65106 -277545 -266553 -7748
24481 -7748 -178012 -265616 -106427 -122201 -242486 -173573 52641 166445 34076 98852 -139981
24470 -139981 -273113 -220701 -307061 -524647 -479546 -509129 -165485 123465 276614 483224
24460 483224 480228 183225 -15989 -66934 117082 55189 -161816 -45211 -6973 -32586 123263
24449 123263 -16632 -99606 -39434 187077 459049 283730 84783 104709 211764 449869
24439 449869 295751 176003 250619 95900 -314935 -485604 -168659 -199780 -242170 -102881
24429 -102881 56660 -52144 172013 361314 414436 414906 421267 300103 -45375 -5943 112277
24418 112277 43172 -230305 -288372 -395804 -413777 -148238 158495 95116 -294471 -505988
24408 -505988 -381217 -367381 -219263 -107789 -222032 -75326 -115099 -205124 -180086 -468199
24398 -468199 -494253 -161093 -149361 -267307 -368436 -321797 -155082 -43910 15481 164136
24388 164136 3184 -222005 -98192 121595 142137 65618 118403 65925 87626 89607 168632
24377 168632 11529 28448 139362 63586 116089 291670 360768 231937 166650 80091 -80404
24366 -80404 -76473 199117 229708 169616 273231 42696 20163 -126574 -193464 -249987 -326531
24355 -326531 -205971 -169632 -71179 -254330 -300509 -448417 -213497 98199 -51024 -213578
24345 -213578 68747 44416 10967 -121363 46841 204784 -106714 -206760 -573449 -584023
24335 -584023 -688435 -753277 -692189 -471998 -507666 -252524 -120557 -299429 -144716 -67309
24325 -67309 57993 154044 111004 192964 181718 125824 -105317 -378131 -224229 -191862 -436262
24314 -436262 -396564 -298792 -22605 213146 352621 343742 333937 273956 271789 155725 12739
24303 12739 -224036 -232082 -114726 11254 30825 166770 83027 49295 -100515 45029 86061
24292 86061 101779 126373 27005 -159583 14337 295052 493657 459480 339079 174542
24282 174542 141630 -58824 130161 129047 52086 132152 410635 323499 363464 505006 422987
24271 422987 352853 116781 201365 106070 102677 310388 140705 271574 386907 418645 599435
24260 599435 486839 297292 264945 501338 569093 378330 26580 -173469 -90765 -49814
24250 -49814 -69500 18518 55022 226851 285866 247908 45238 -251420 -289123 -233199 -404275
24239 -404275 -447030 -337901 -148104 53331 -124805 -180364 -171040 -349268 -370841 -304239 149633
24228 149633 353458 339495 188217 114034 231064 225428 122076 180064 273153 196276 92503
24217 92503 -97815 -230957 -197733 -237819 -247116 -205981 -189639 -195783 -239775 -226301 -221841 -325126
24205 -325126 -298945 -346851 -292516 -213332 -353307 -296948 -80464 250357 183426 216550 -87418
24194 -87418 -300695 -39103 21313 -92785 -120883 -127678 -78571 -87244 -74766 -284830 -498709
24183 -498709 -378905 -52775 279777 186378 -98387 -14360 -15261 143534 231049 159919 151465
24172 151465 117079 198773 358636 329482 361398 350064 176651 54666 -232065 -498897
24162 -498897 -422624 -284170 -97026 -215966 -220710 -82697 -313677 -381651 -204644 -158255
24152 -158255 -441143 -328919 -349310 -386476 -291970 -117513 -63398 -261993 -427935 -296937
24142 -296937 -318846 -186325 51966 -149828 -316277 -118426 -127903 -230159 -317248 -330869
24132 -330869 -156827 -194915 -371197 -407043 -280908 -210386 -138572 -145125 -259735 -216114 -316980
24121 -316980 -377137 -396079 -460107 -409677 -267318 -49262 178907 320683 257151 -86383
24111 -86383 -59583 -52733 -125006 -325083 -111715 27854 270347 140211 65957 63081 48404
24100 48404 -165719 -99486 255494 126325 -398356 -556551 -492644 -439450 -277006 -125026
24090 -125026 -25030 -135663 -360821 -197582 123439 252077 -49296 -381374 -464059 -709805
24080 -709805 -716810 -355820 -365336 -345623 -268699 -164983 -98367 -91165 -175468 -262323 -180031 -94568
24068 -94568 40988 113847 -75833 -96864 214133 368195 165773 -148771 -207954 -87271
24058 -87271 -223583 -373260 -446114 -239139 -316088 -355297 -80339 66972 240426 272975
24048 272975 240096 298799 329123 215657 167350 19259 -139638 -136802 -89378 -90483 -143027
24037 -143027 -67149 106320 16436 57189 48046 269111 234009 179520 276282 291140 109272
24026 109272 -273863 -374913 -163354 -8301 70813 -29461 -37776 -33956 236220 283085 94743
24015 94743 177040 149553 27144 142400 417315 140909 -66231 -360941 -710784 -640528
24005 -640528 -281934 -108220 -296907 -189622 -133590 182009 86048 103757 115190 98908
23995 98908 320517 359090 209756 309447 33289 -194578 -296481 2664 184905 245275
23985 245275 144936 165931 222951 69076 -198238 -271562 -349464 -183041 -99972 -256130
23975 -256130 -480108 -324560 152388 354749 242553 89613 -240836 -259794 -310165 -310398
23965 -310398 -430992 -375579 -236571 -118515 270671 327116 100645 88055 135868 336016
23955 336016 206747 79646 86025 -7341 -156335 -383187 -494222 -621293 -503908 105377
23945 105377 250147 195499 -38679 -93157 107347 178900 -69765 265132 655340 611788
23935 611788 425782 141714 270507 80793 -37986 85669 109967 143246 161714 57210
23925 57210 57733 121935 47455 -38554 -18751 147685 128179 60378 -95483 -140025 -85263 -49160
23913 -49160 -21340 -20803 -85466 -192294 -77810 41235 -186120 -128411 -254369 -348628 -178837
23902 -178837 62522 134778 297316 2518 -193313 -250417 -249161 -264653 90153 438075
23892 438075 346751 197879 89638 193702 345773 538736 573721 411258 115692 -231061
23882 -231061 -361487 -176309 -132770 -109277 -249927 -267607 -185265 -112511 69483 334386
23872 334386 364916 282412 178193 227259 85292 20771 352626 356555 88052 -33273 -379662
23861 -379662 -280962 -73990 20360 185430 289310 470564 233233 102961 -22513 30615
23851 30615 79231 -13475 -57527 3341 -79881 -171426 -232693 -250197 -164825 -2380 36381
23840 36381 -87925 -232666 -333610 -266725 -244559 -42339 -153585 176821 93731 -140232
23830 -140232 -153680 -91667 -70022 -121308 130160 258763 136223 70346 39825 35633 300924
23819 300924 72970 37829 49616 250228 118350 -369704 -287012 -126185 -40643 65002
23809 65002 85225 -104345 -57609 -88625 -336968 -445948 -462568 -498490 -532644 -613108 -208589
23798 -208589 -275857 -420583 -338762 -423893 -491231 -304596 58260 209206 51372 -17273
23788 -17273 -171254 -441171 -604113 -233675 -130899 -136937 -139401 -177118 -43260 -292606 -259417
23777 -259417 -179156 -146635 -244449 -143707 2802 -156726 -150020 -17494 187027 352654
23767 352654 436472 466669 393513 391359 283719 -45951 -295204 -403671 -97107 108667
23757 108667 159294 375301 430840 484228 425953 239058 146169 324118 96187 -239077
23747 -239077 -333799 -314077 -178368 -20422 37703 143912 261955 54727 -25382 -291942
23737 -291942 -75790 53355 -43928 91621 -8064 110955 115277 155886 -82784 -264670
23727 -264670 134672 202761 88819 -52676 -275739 -246934 190878 229852 -67592 -149704
23717 -149704 -127935 106665 419307 330124 412992 277979 438515 250529 1723 -56930
23707 -56930 -218544 -312013 11723 3363 -75018 68257 198687 68544 7002 -108261 -176884
23696 -176884 -13834 -23953 -286540 -285330 -461018 -540609 -585671 -250588 -157978 -134123 -37584
23685 -37584 7044 -81628 -77196 -189048 -233763 -440398 -354117 -201088 -16047 168496 158050
23674 158050 -8629 -193788 -157311 -305413 -435163 -344267 -201497 -279073 -412566 -588268
23664 -588268 -208968 108439 456755 551161 390624 139415 -194463 -384435 -189454 -120378
23654 -120378 -100723 -14325 -288684 -142468 67676 104655 -15360 -14899 139986 193215 282982
23643 282982 321074 143872 42209 -17819 199789 -13246 -149787 -51392 -83032 -116984
23633 -116984 -270321 -149757 201569 137992 -42597 -54214 133569 165657 86801 66165
23623 66165 95023 145963 -95407 -5779 199121 65122 -280849 -369903 -81561 53688
23613 53688 326858 234855 -196412 -380203 -635298 -529826 -210389 -111253 119366 77781
23603 77781 -164748 -552199 -585680 -521410 -230403 -138037 -167043 -124744 -129486 -134978 -17380
23592 -17380 84651 -66463 -67248 229651 391245 218737 166319 94894 209818 367768 703413
23581 703413 507974 214354 458159 398031 134535 90371 -246318 -65910 21473 158495
23571 158495 9051 -110115 -63459 -54954 -18295 39490 82589 77662 47148 -93252 -99521
23560 -99521 -218306 -165506 -16602 49260 26860 25353 -31129 99281 343381 255130 55498
23549 55498 73936 -4120 -100572 -230988 -256836 -440490 -620492 -536746 -556688 -487215 -193715
23538 -193715 152037 136059 67250 -194242 -203332 -17250 -85175 -47079 -201543 -332928 -287852
23527 -287852 -267432 -505205 -554114 -488136 -435061 -257133 -28439 -17942 -83049 -44922 -14456
23516 -14456 -84948 -159673 87152 23395 -153699 -359377 -449676 -289206 -8482 26371 61658
23505 61658 -61871 -297873 -504586 -599172 -519921 -319301 -319186 -147269 225158 88475 31725
23494 31725 -76212 -53375 86306 123365 10557 -129362 -373056 -355498 -99284 31363
23484 31363 71202 14409 -114196 -64109 10837 -47873 -65433 91683 185562 137857 -110495
23473 -110495 -391583 -407809 -227588 75312 117138 -6821 244062 284353 224945 395893
23463 395893 411863 448022 242513 185349 195801 107289 101021 145826 135255 191469 126586
23452 126586 99044 -15748 35334 -133393 -237606 -188494 -329953 -411659 -258798 -141125
23442 -141125 -64831 -14771 -87550 -80547 46844 -192260 -75145 -111214 90528 377975 346508
23431 346508 -89397 -230251 -414393 -358953 -57004 442086 385296 -9473 -25996 -92229
23421 -92229 -83821 -190747 -292526 -490840 -265754 -124254 -19926 149003 151264 -4166
23411 -4166 -39182 85700 5912 168998 137369 874 100653 67267 6456 -156755 -171142
23400 -171142 -95365 82531 108627 -78649 -240502 69312 281251 242077 199170 376981
23390 376981 563014 478683 415901 191570 5558 -7472 -6448 -249366 -306231 -271934 -89133
23379 -89133 73969 162111 44293 42090 62950 -40070 -285753 -396084 -263358 -51048
23369 -51048 -1866 90271 113974 120896 -36822 41724 -41397 -292627 -130811 33980 51768
23358 51768 120731 254011 126164 -79930 65879 -212240 -349454 -286230 -292156 -75517
23348 -75517 16226 -114095 -484493 -300129 -85916 -105465 -278738 -77472 -49277 -279582
23338 -279582 -343165 -426301 -501655 -561210 -341474 -168129 -164748 66791 76878 -178486 -71869
23327 -71869 129856 137374 170113 -47328 -194221 -231550 -266619 -212849 -4483 233184 343254
23316 343254 24883 3801 -37395 -180033 -94198 -61585 99749 321290 122656 2940
23306 2940 16596 113106 -23333 -259890 -137499 -94497 -131450 -76673 47832 213234 252747
23295 252747 296244 289340 134757 -110344 -492515 -372406 -53337 62835 36414 -136080
23285 -136080 -221930 -371691 -391989 -116235 -77466 -36041 69861 57951 32990 -3103 32682
23274 32682 29052 -30395 149671 385035 554003 472431 646946 380379 80633 -142384
23264 -142384 -347680 -295482 -419718 -477454 -620100 -462559 -31094 -176998 -342990 -253992
23254 -253992 -321612 -159392 -135901 -227557 -267589 -245202 -224718 45531 144246 175600 -18091
23243 -18091 -216365 -235800 -105180 73967 -36311 -24439 -6677 -80423 -254547 -227489 -361994
23232 -361994 -467807 -217052 -249412 44793 42594 -172556 -232660 -266134 -218210 -321638 -99065
23221 -99065 297146 393708 343094 470831 603600 54693 -54721 -67382 -39082 -47685 182002
23210 182002 169306 1662 -393349 -704891 -641295 -575911 -540616 -83839 137177 194659
23200 194659 60178 -245413 -258074 -259462 -202601 26986 111888 130422 -249006 -449794 -204598
23189 -204598 7560 -16801 -128334 -112967 46147 -69249 62086 132787 -28988 -82298
23179 -82298 -167782 -109313 -110346 -125154 56092 11094 -188481 -187011 13718 159165 -79813
23168 -79813 -509616 -374575 -42987 116387 168381 170938 -124416 -158619 -232396 -371956 -396542
23157 -396542 -352285 -292917 12418 59929 132155 -113584 -321951 -262163 -185215 -325063 -151662
23146 -151662 -61893 41919 105735 -47863 -79712 96244 53225 -134366 -147109 -203637 -152737
23135 -152737 -119768 -199274 -384354 -357276 -149739 -132055 -162230 -275153 -132682 -224918 -432774
23124 -432774 -385890 -396436 -325576 -282701 -248884 -105781 57823 13441 6343 -70920 30960
23113 30960 66549 5055 174943 79460 -42707 -215192 -108069 40650 143513 29503
23103 29503 -403003 -401736 -179943 -40004 -92751 -71877 -101657 -71308 186862 125013 -173933
23092 -173933 -197195 -129986 173375 276808 209369 158765 26995 -43213 -146818 -230287 -170763
23081 -170763 -58999 -57750 -168945 91130 340159 47723 -33674 107118 257813 343568
23071 343568 336228 349867 416502 119937 131097 67865 -27651 -96229 -181711 -182919 -649
23060 -649 19439 27728 -203495 -167667 -170345 -125954 -256779 -409850 -156835 204348 270358
23049 270358 249929 130863 58499 -43673 -113196 -211522 -105390 -101573 -284269 -360824 -89705
23038 -89705 -290728 -48252 -105213 62973 173447 50103 47937 -3066 -112316 -176218 -281413
23027 -281413 -475825 -399472 -163670 160312 201338 285753 235139 -141500 -209961 -341356
23017 -341356 -405805 -408390 -354869 -295091 -195528 -37199 343663 430423 326733 375528 198653
23006 198653 -2683 -65315 -41964 -193961 -351044 -338109 -280783 -178769 -118522 -145971 -180379
22995 -180379 -26641 82100 -14095 -160001 -291579 -342875 -199955 -31205 -13933 -48394
22985 -48394 3840 3274 331733 445716 653635 525484 237993 154588 103402 -171304 -229190
22974 -229190 21348 147678 -86361 -366956 -505500 -490508 -320325 -191773 170404 161195
22964 161195 -67153 -275088 -372303 -307671 -281550 -145994 -3607 65198 -28386 82822
22954 82822 462000 530404 293004 6351 -17427 168350 -8862 -242420 -130782 98127
22944 98127 61108 173485 175876 296178 275456 57871 19178 -257713 -362090 -299065 -57154
22933 -57154 -52226 145350 47123 83517 270395 337451 440360 424640 115247 34692 88809
22922 88809 -142640 -40839 -225280 -51882 381949 478131 381121 455286 220968 64934
22912 64934 -89159 -78962 -187542 -304529 -252171 -271260 -102185 -86326 28882 18372 220512
22901 220512 180084 114990 -127038 -105177 -378619 -656116 -382001 -173107 -44366 -172904
22891 -172904 -150336 -196024 -204708 -200119 -260245 -329085 -201875 -44372 -114335 21055 97491
22880 97491 -30942 -105751 -9880 131897 284330 315810 270378 204172 129674 -52037 45857
22869 45857 396863 657460 451406 350631 331472 402737 358222 449561 351661 127340 -181074
22858 -181074 -157233 -67003 89136 34850 -211681 -282445 -312911 -399042 -352206 -132690 -248745
22847 -248745 -551202 -270721 -207334 -228193 -91938 106472 58253 -88059 -118543 132035
22837 132035 218804 239347 50492 -448774 -512324 -394243 -428141 -458215 -483342 -287519 69999
22826 69999 202689 239054 224263 170331 -4357 213210 92482 -108423 -232805 -219804
22816 -219804 -173105 -112447 -114365 -311283 -412656 -224682 -201206 -181569 -353224 -199148 -18190
22805 -18190 -463366 -759923 -722503 -593169 -367649 -399553 -401327 -150510 -119290 -331218 -286217
22794 -286217 -422573 -562552 -335942 -153878 -304481 -368660 -390174 -301566 -273596 -180088
22784 -180088 -214174 -26008 146582 349487 256922 3149 -166604 -21326 -58167 209844
22774 209844 461447 468254 149206 -4121 -208378 -315510 -219744 -107155 155195 148289
22764 148289 -33179 -11584 144677 186061 -76967 -210729 -342053 -602250 -467472 -141166
22754 -141166 -152503 -145079 -72248 122177 458449 404744 166872 -117475 -246762 -183069 -126620
22743 -126620 61600 180270 68899 91846 162779 188947 326376 405132 194006 835
22733 835 -299881 -214152 -200848 64827 161007 208347 285155 192461 -13126 43719 65989
22722 65989 330808 392173 243307 506 130560 156445 -153030 -328127 -58699 157923
22712 157923 164601 150807 61 146803 -2663 -110404 -123951 -283247 -108411 261918
22702 261918 412152 279774 63140 -32532 -40544 214766 285600 200353 187716 301741 216012
22691 216012 33704 -68936 328792 400210 272716 -70008 -65419 -156556 -178726 -162780 -154074
22680 -154074 15239 130084 -180716 -248781 -187529 -295710 -126942 107494 -239894 -453102
22670 -453102 -237284 -178899 -111637 253060 324232 230458 169637 107211 -81541 -199487 -230140
22659 -230140 48394 151162 -4719 175753 150722 -31773 -53528 81670 -10796 -331550
22649 -331550 -348876 -77203 -173868 -356434 -364902 -306995 -197203 -232361 -201382 -201710 -441299
22638 -441299 -254454 -49147 19053 33939 105622 1369 -191021 -98603 -141746 138093
22628 138093 348868 422934 152524 -53797 -49349 81059 12482 -92566 60061 -140648
22618 -140648 -364967 -503878 -211679 -104960 8608 104530 80728 -135265 -391089 -221721
22608 -221721 -13446 -27615 -144616 -311627 -315260 -308094 31571 300525 501580 247586
22598 247586 -18530 53151 -91700 -103220 -85220 -415988 -345638 -118683 283196 398891
22588 398891 305679 129454 243346 183056 -154927 -292035 -174957 -151534 -96855 -426939
22578 -426939 -379813 -260662 -108459 -164699 -228200 -106525 -330221 -390548 -376788 -275189
22568 -275189 -13534 -56277 -69414 84478 -7363 -193099 -295624 -277009 -498563 -470985
22558 -470985 -418080 -197933 -117097 -199683 -142775 -83081 -52999 -111971 -185443 -2436 12025
22547 12025 -164240 -355504 -219561 -228674 -179416 -164962 175793 228872 260182 93669 -32707
22536 -32707 195291 34393 -166471 -156441 -28697 305791 158288 -231993 -524050 -268424
22526 -268424 33755 280371 184237 15481 172805 207131 234275 145555 191204 223247 267250
22515 267250 237371 105842 23566 -145005 -289200 -156008 -209940 -101933 -75219 -75394 185670
22504 185670 172776 37980 280147 239004 71330 -37829 -119593 64300 128070 266975
22494 266975 430976 245783 125980 92644 133160 114456 -214419 -29129 -698 -250988
22484 -250988 -154072 -254250 -273151 -144375 -174487 -172679 46137 142350 115227 231975 15814
22473 15814 -95093 -289066 -51220 87166 185333 139772 133309 164504 177149 93797 124346
22462 124346 224837 321828 124357 120422 126400 315556 186585 184180 126880 371923 283870
22451 283870 64678 -101331 -141353 48792 25386 72387 231499 44472 -13919 -103981
22441 -103981 -103223 -94912 215290 190416 -59755 18848 -35420 -172542 -111696 -83910 -115566
22430 -115566 9211 193697 247545 113937 14045 -198113 -176408 -245185 -126603 109450
22420 109450 99788 164506 190759 149007 173624 141662 -15426 17821 -176051 -230529 -272760
22409 -272760 -204499 -12561 -180591 -86223 -50123 108332 35153 77660 -13238 -182924 -124351
22398 -124351 -262534 -85191 -11248 -112547 -310516 -538357 -471422 -342319 62789 145958
22388 145958 -136599 -231559 -405968 -380051 -307431 -471010 -295684 -322816 -224721 53333
22378 53333 23893 1976 -14275 25038 -65456 -382022 -590723 -451317 -481555 -629553 -456451
22367 -456451 -143651 116815 119767 -2707 49813 72232 124739 240861 343144 78418
22357 78418 -25368 -107884 -83984 17424 -100975 203818 60938 -141638 -218977 -101287
22347 -101287 -116103 -209572 20791 -25162 -152531 -89183 43337 326218 443772 239743
22337 239743 85322 283526 255398 -186982 -476924 -349121 -159163 -254970 -431601 -466933
22327 -466933 -134182 101912 311762 452356 104490 -91933 -34324 127993 298710 301998
22317 301998 168972 225092 239822 127994 -8942 -82129 -15806 -53802 80394 80743 24634
22306 24634 280232 358769 23118 -285150 -94136 91325 158786 14883 -95802 -386473
22296 -386473 -116677 284727 524820 605376 288914 109065 53063 -273999 -58747 15219
22286 15219 -166107 -260305 -39779 55014 184626 228894 122051 40060 235614 301229 234210
22275 234210 170254 -76965 -173478 -86670 -36512 32232 158140 262307 119982 -139056
22265 -139056 -171432 -35241 77271 95006 -16593 -90018 5596 129832 76551 -48407
22255 -48407 22840 30008 146769 305640 101570 217474 284945 270474 -60838 -228510 -201200
22244 -201200 -130039 3156 274872 277943 259121 177352 -129142 -219451 -149070 30014 56992
22233 56992 -101124 -220409 -490049 -714558 -637345 -332745 -158532 -1342 137241 123577
22223 123577 129880 128501 231470 571743 500454 349936 178451 160101 51118 -161501 -37219
22212 -37219 91087 80298 222841 112776 102615 63494 -192079 -180440 -194393 -477720 -569342
22201 -569342 -355764 47841 127855 157377 271571 178711 -3348 -33020 287677 357034
22191 357034 178802 185892 174257 -21692 -51650 84612 211745 59169 -251105 -172308
22181 -172308 -182224 -156476 -32751 -183905 -270802 -228969 -258624 -322293 -387907 -408166 -301472
22170 -301472 -356627 -220119 38462 -10483 177785 90118 -202906 -108676 -67391 -40427 -35167
22159 -35167 -107250 -92167 -192641 -20061 121604 -16168 21564 -271005 -402062 -340688
22149 -340688 -16273 98442 -29281 -105753 -364782 -536228 -521762 -315348 -256021 -112035
22139 -112035 -52609 166246 139675 89565 147815 -96590 -285426 -227011 204921 465767
22129 465767 506883 497711 440684 366420 137350 217474 11904 -158654 -75535 -326470 -293546
22118 -293546 -288466 -364406 -426793 -238578 -303551 -304521 -172575 -195889 62812 -33849 -305072
22107 -305072 -278789 -217486 -220288 1129 94718 -111060 -177498 -7267 145800 173811 165949
22096 165949 16612 -216978 -455042 -176359 109938 48357 -2534 -41135 -133458 -72941
22086 -72941 -99821 -368644 -392978 -137601 -71752 -89543 -214425 -175163 -31418 -10111 -151810
22075 -151810 -51949 75143 226745 123432 71088 116101 385280 303383 163403 265008
22065 265008 330411 145464 35225 186941 287761 62254 -182131 -544604 -535232 -517077
22055 -517077 -379104 -72979 101772 77578 -2830 -99520 -9982 54225 191138 122142 -77034
22044 -77034 103563 64058 32919 -75745 -138572 -200697 -356701 -678224 -605431 -620805 -521393
22033 -521393 -428248 -302072 -78656 -88073 196604 302252 247131 197963 19941 73252 460463
22022 460463 360193 -31016 -275580 -282187 -1791 226965 188149 108274 292942 344128
22012 344128 368492 383711 345256 163885 97832 11623 -127623 -112526 211912 233363 43608
22001 43608 184693 197535 -73676 -225912 -158877 9868 28810 -98566 -71780 13550 34523
21990 34523 -174449 34094 -135606 -361646 -231326 -86170 -336356 -592610 -369809 -166562
21980 -166562 -82836 -116685 -45167 -40181 -186695 -62191 112678 -31486 -61809 -60711 -94511
21969 -94511 -153684 -317820 -8090 38635 -173137 -326388 -289926 -277971 -179803 -16491 -40879
21958 -40879 -146995 -66678 88777 141294 158130 19232 -78940 -59279 -190549 -312543 -227960
21947 -227960 -127527 18471 -104076 -15672 136034 259948 705775 760100 674199 627938
21937 627938 441871 342310 207571 -38364 -143973 -232470 -110099 167217 100353 187982
21927 187982 246252 265267 130394 31885 236884 220983 155778 18404 -250567 -422390
21917 -422390 -575253 -538423 -316259 -81402 -53998 -7929 263095 149752 -13290 -167956
21907 -167956 -7880 162508 175335 52373 -25706 -34155 -140142 -178332 -151805 -83188 -260938
21896 -260938 -325854 -474028 -276065 -200843 -203700 -174886 98834 44109 -238542 -318631 -304598
21885 -304598 -298736 -403136 -482256 -497455 -333548 -249500 -401497 -208652 -231007 -115555 57185
21874 57185 243644 208520 366779 352699 297257 40736 -82403 -200075 -239585 -216595 -297547
21863 -297547 -347819 -336184 -188953 -138691 -174125 -340177 -256309 -97773 -18194 -17507 11578
21852 11578 -322861 -601906 -678009 -635012 -307262 -357826 -417929 -174863 -23492 103069
21842 103069 204630 60998 -219363 -372158 -378923 -163449 -102066 -261313 -400840 -437578
21832 -437578 -262220 -245381 -222064 -111664 -309615 -246205 4982 96389 -49152 -61758
21822 -61758 -90559 -145152 -148076 -142645 -353729 -352661 -203384 -64759 -163275 -906 -26357
21811 -26357 -166703 -355464 -254614 -325985 -365602 -385618 -425622 -314540 -363335 -408525 -469476
21800 -469476 -510942 -296796 -104598 -121186 131709 92126 -74156 106920 139632 -25243
21790 -25243 -140745 -74 -41113 -184050 -192952 -229810 -370930 -263821 -291913 -338347 -280047
21779 -280047 -270686 -86651 84032 -82446 -190976 -195043 -201262 -119739 58740 152025 76398
21768 76398 64386 -43226 -139714 -62489 183489 -2833 -35071 43657 -54759 -185432 -90506
21757 -90506 7212 -2840 -70052 -134746 -80427 -105225 -3863 48545 -123551 -229472 -190841
21746 -190841 -464702 -522063 -475379 -275548 -160024 -223593 -310867 -518564 -692086 -387352
21736 -387352 -333094 -319483 -246565 -246453 -345047 -298281 112667 499834 399694 -17813 -139477
21725 -139477 189204 291604 230929 241713 -126809 -281952 -524885 -523010 -210025 -221331
21715 -221331 -142113 -308081 -352916 -231389 -210491 -166361 -120110 -208622 -181349 -221980 22614
21704 22614 137074 -71578 -518585 -429010 -183249 72298 65341 -84834 120941 134157
21694 134157 210203 272858 192351 5106 83334 308584 272212 195066 418482 361248 70478
21683 70478 -182313 -106210 111240 -48950 -1759 -32504 93972 218826 216474 232918 197769
21672 197769 98992 193588 149481 20307 141207 402690 419911 245098 224029 101848
21662 101848 3027 26615 -34869 -58819 -61365 -27372 -45696 -45304 -83761 -110493 -18905 185318
21650 185318 296541 222257 20298 17104 -35727 -187993 -208925 -86715 -37014 -43806 -22818
21639 -22818 115601 189217 79042 -121815 -127627 -146641 -63453 -75367 -35109 -125593 -57444
21628 -57444 132276 -104856 -320049 -331886 -175768 85197 502805 549053 316669 1428
21618 1428 -61869 89488 177155 264749 402017 241464 364104 245903 -72129 1319 -126904
21607 -126904 -280208 -249329 -280366 -56844 -78078 -306838 -304053 -49911 214724 284014 309861
21596 309861 366982 -55429 3703 -10323 -57590 -154357 -190501 -402542 -469864 -639062 -587645
21585 -587645 -97816 126458 178624 281449 246632 351315 324358 -114679 -310657 -313631
21575 -313631 -241174 -52717 126160 148778 291721 472228 559192 450734 89504 -23657
21565 -23657 7102 -54357 166677 238609 -34251 -64330 -8650 -56528 -280028 -424696 -299532
21554 -299532 -177321 86684 107049 -43752 -118920 58037 -17020 -310795 -134559 152047
21544 152047 244878 105400 -145052 -295636 -276306 -126917 -60003 -88824 -3233 130198
21534 130198 166919 71713 12661 -104684 -439117 -294162 -211992 -206305 -33638 282806 199842
21523 199842 -18392 138666 332260 121099 -129086 16212 30795 50524 95093 381579
21513 381579 510741 656285 436169 218495 189737 314705 358983 186620 -53446 -189273
21503 -189273 -426328 -499944 -398239 -191574 -146684 -51014 -116751 -14934 40150 105257 259599
21492 259599 315105 333510 248970 22289 -92148 100736 168429 11059 159626 300558
21482 300558 321254 207367 58779 -21287 15971 -53129 -94067 -376805 -359214 -230494 -64739
21471 -64739 -271518 -386796 -173600 -164165 4567 107175 236070 -4058 291352 352713
21461 352713 -1377 84786 122363 20499 -160972 -95962 -23389 136811 201204 207609 409039
21450 409039 476660 263767 221315 319853 295021 -99517 -351442 -337657 -366786 -364203 -245112
21439 -245112 -124412 -196735 -147025 -205218 -181036 -12353 -193184 -323639 -144138 -87798
21429 -87798 -145407 -160888 -189436 -313755 -505871 -456940 -229346 13171 17002 126318 92357
21418 92357 -468291 -405598 -26670 -49889 -278339 21090 161387 118312 117551 88569 116284
21407 116284 -7538 -83823 -2251 42299 135498 85681 285358 370493 373100 145808 -214015
21396 -214015 -32173 -80656 -60530 -66874 35138 155373 -37568 107984 368151 369700 158081
21385 158081 119753 148397 295607 377584 659356 696856 608926 359455 141727 9817
21375 9817 239584 177317 102909 -1940 -178757 -65620 -78026 -221049 -251743 -7285 94197
21364 94197 -50432 -46687 -88996 -141623 -129264 25059 -37366 -62480 -102446 147806 265869
21353 265869 312118 207228 -209489 -228747 180033 212736 -170057 -296532 -250337 -172661
21343 -172661 -354357 -147680 -3114 63960 -152826 -399371 -440874 -320481 -143935 -3275
21333 -3275 -39572 -169741 -193011 -339115 -405337 -557396 -479423 -495460 -328559 -197546 -350912
21322 -350912 -413598 -346965 -140988 126811 88014 -61469 97647 36146 52528 25103 96185
21311 96185 312147 128369 26131 19068 -38322 -24716 -57110 -150054 -146402 -104635 45292
21300 45292 138142 -5469 -109725 -68814 -284066 -499185 -406199 -171464 -93319 -169941 -141761
21289 -141761 -229939 -97179 -20804 -151801 -139724 -242373 -438553 -310681 -60147 95293
21279 95293 32311 47492 49561 -35384 -113103 27929 117241 73478 15169 58305 -65373
21268 -65373 -82756 47559 159884 108421 -175732 -374278 -551946 -472153 -203999 -198284 -1900
21257 -1900 -13651 40856 143946 154086 81856 41885 79997 140146 330948 53993 8680
21246 8680 -172410 -294756 -341063 -166567 25074 413686 277575 236357 153226 140846 78073
21235 78073 -26939 54518 219633 364582 84015 -66139 59125 379607 400866 77474
21225 77474 -100624 -54600 -101152 -125267 168625 342892 314694 353917 531201 255267 170705
21214 170705 46196 37508 4456 -10712 -338933 -228727 -262050 -307261 -347060 -358510 -234811
21203 -234811 -133084 -21187 -143713 -467621 -677650 -543133 -437490 -787420 -909749 -568504
21193 -568504 -124044 46029 73730 44437 218341 353923 38113 -247932 -373090 -333181
21183 -333181 -255752 -72017 -108447 -329535 -542463 -515761 -641528 -414200 -150459 -118701
21173 -118701 -138908 52840 117473 -20721 -298363 -343201 -205590 -233291 -178487 -315529
21163 -315529 -475301 -275250 -21856 112655 69737 111916 -160586 -393057 -173051 -109405
21153 -109405 -325297 -518454 -324417 -36627 98666 -101951 -112223 -899 -85882 -285870
21143 -285870 -330050 -444243 -258677 198729 385635 354931 329428 94055 -73915 -297967
21133 -297967 -372415 -417665 -358109 -77404 -29585 -121612 -178586 -56217 226772 117205 -57755
21122 -57755 32171 106479 87079 301483 331285 -19887 -97966 -47216 -179810 -52698 73871
21111 73871 14059 -95514 -214481 -49989 57714 -355929 -257651 -202346 -156571 -198378 -220432
21100 -220432 -378208 -320877 -331576 -302347 -374505 -301921 -185339 -293035 -254673 -383184 -374933
21089 -374933 -363963 -166990 -180724 -337331 -184281 102984 153282 -119885 -73530 -227806
21079 -227806 34289 -58374 -84869 33316 159140 184157 282187 437887 314187 86702
21069 86702 57678 92343 13437 -76867 -92805 70784 155356 305006 471492 433327 51929
21058 51929 155439 243572 187633 112910 48401 30644 -47723 -48288 87075 19105 -51675 -55242
21046 -55242 -260797 -312315 -130095 148261 285824 188520 28196 120891 111075 96555 60878
21035 60878 73639 -114767 -107556 15060 68090 191649 339255 137171 64678 269965 266848
21024 266848 192337 15744 -24546 134514 73401 -39056 -145822 -190813 -153233 -90262 -43822
21013 -43822 211344 171837 21651 -160912 -420468 -350963 -179007 -239937 -254655 -362988
21003 -362988 -478136 -552245 -491588 -327307 -112701 -112583 -146650 -117804 -289801 -370228 -282848
20992 -282848 -309655 -425123 -553822 -444677 -336654 -204119 -96279 113675 109002 -79800
20982 -79800 30065 -81457 -53590 261984 349545 242475 174311 165516 258684 492428 492818
20971 492818 177710 66217 68034 -185556 -190171 -180646 -90901 240418 164094 111392 78111
20960 78111 317850 642610 585107 423307 498585 577745 513699 442427 420925 383129 57819
20949 57819 -19968 95589 -88226 -35521 -97213 22131 -80687 67501 -48478 -71931
20939 -71931 -67555 -235555 -328831 139742 450454 351207 102039 153108 23860 -123106 -257046
20928 -257046 -364371 -382942 -515408 -353542 -277743 -346197 -305627 -258808 -42756 156705
20918 156705 -29947 -119957 -127011 -53431 -8619 -114081 -140970 141972 6021 261662 248965
20907 248965 -38412 -214994 -19600 178852 366018 334695 507478 577061 436363 102513
20897 102513 142268 379484 238201 69214 -10840 -32120 -35382 -147907 -337651 -204749
20887 -204749 -78308 -166144 -204404 -84288 32554 164907 186231 -7886 -119973 -29553
20877 -29553 233155 222572 223321 181352 37538 -105356 -200181 -235519 -236686 2570 339844
20866 339844 321070 69343 147035 -75762 -120573 74021 147367 162420 -22926 -41537 -106515
20855 -106515 -306876 -323933 -131068 224219 45135 -263997 -269544 -254319 -188768 -244639 -431309
20844 -431309 -265215 -390312 -431248 -409509 -198060 -64280 194500 173603 296930 382301
20834 382301 249268 97573 216636 180206 -14916 46012 172030 136242 197534 148162
20824 148162 292028 422982 116222 27305 118870 -43086 -113844 -131949 49316 146124
20814 146124 116782 -9428 -171064 -161555 -82893 -18493 52762 206183 130854 -62172 21221
20803 21221 150472 60290 -185249 -334265 -96432 18602 73183 -15480 -332689 -481771
20793 -481771 -150985 34617 32757 -6540 47898 -216333 -598712 -270988 -161878 -306555
20783 -306555 -503012 -370614 -181040 -60128 -179105 -141977 -236165 -165591 71241 36191
20773 36191 208875 188568 59669 183742 248277 353077 -97921 -62444 -120008 -426450
20763 -426450 -325687 -275780 -142779 -191569 -147040 -105513 -21261 -77427 -14428 4362 192868
20752 192868 102635 -33283 -119694 -167338 108901 -121689 -159799 -172494 -185118 -104682 -248489
20741 -248489 -419720 -513556 -564476 -532332 -257130 -142037 -3560 110446 54459 -31534
20731 -31534 -43558 146238 -8717 -196810 -92051 -76463 52428 228006 353664 318328
20721 318328 548865 501655 336091 228132 181630 246020 234683 157397 25741 -21476 114484
20710 114484 182516 77731 130672 158147 -70461 -208156 -237454 -202247 42246 91206 -112144
20699 -112144 10648 247031 55381 163211 360270 227156 120954 165560 65236 105619
20689 105619 153680 -19806 -65567 -145297 -71343 245272 377785 277398 -6400 -76101
20679 -76101 -198028 -332815 -295970 -46588 -28671 144236 219247 -6956 -27908 179788
20669 179788 155549 136387 83284 -16934 -103842 -179598 -166482 4691 -118925 -397154 -547441
20658 -547441 -216241 -2896 58422 97645 115114 169922 111731 31213 74826 32743 -6625
20647 -6625 -17015 275064 669606 653648 450794 105660 16543 30755 -33338 -173979 -58841
20636 -58841 -216130 -297765 -266086 -104622 -103181 -41585 -262130 -179020 95288 -35748 -50936
20625 -50936 -58708 183387 246962 -63259 55305 298229 -44831 -221769 -75451 -295922
20615 -295922 -539094 -466275 -278196 -143568 202684 112089 69901 300108 320725 250405
20605 250405 289159 -45987 -415263 -241400 -120776 -180110 6985 82052 -120613 -23352
20595 -23352 -140583 -283818 -304566 -32412 -168151 -233842 -278588 38934 156797 172074
20585 172074 -87865 90625 216091 236326 277033 132047 -204133 -213884 -219638 164861 501016
20574 501016 304613 133207 153972 32308 -184404 -137103 171333 460970 555095 426179
20564 426179 367260 80238 -85212 12948 215960 251351 345879 434439 272509 353820 317196
20553 317196 231749 127883 -5971 -72610 -23634 -87718 -196955 -177633 -36601 -103297 -81300
20542 -81300 -106989 -64052 102479 -35610 2349 152806 148956 10389 -62951 -141166 1579
20531 1579 211413 93605 96539 188578 478051 368266 437715 687368 1084688 1328842 1766563
20520 1766563 2247265 2513823 2022585 1282107 949769 667073 256372 189131 415849 528000
20510 528000 420982 108423 303473 356617 131039 169725 -42994 -153485 61346 280508
20500 280508 347573 312678 285598 33086 72271 91255 -20564 70430 217835 -61353 -76849
20489 -76849 113187 112320 141750 -107724 130516 413083 260311 252080 423482 220708 171147
20478 171147 225000 104324 179845 421816 399430 297139 414440 944293 1514673 2028692
20468 2028692 2350993 2179789 1771495 1480045 1050762 548534 438841 310968 188711
20459 188711 20907 21829 -40063 -277786 -89211 83868 93327 205306 149587 145742 369561
20448 369561 389672 400090 294440 101063 -142740 -42283 -102018 -238972 -138385 94569
20438 94569 237388 79301 176119 238989 200547 -2964 -107885 -348044 -393440 -302307 -241004
20427 -241004 -24408 49310 -46978 -206921 -161427 198607 297336 11344 28475 256443
20417 256443 195482 -161312 -284906 -40081 198147 228449 191877 3048 -140758 17398
20407 17398 2431 -37919 174670 451619 298311 151211 34692 22769 -126142 -130097 57289
20396 57289 289748 12506 -118156 30577 -157341 -48012 53690 52344 89448 257293
20386 257293 142265 177198 303077 472780 567243 384269 272276 312485 366531 185586
20376 185586 -160056 -191715 -297771 -483182 -474848 -326973 -22546 -132733 -197006 113837
20366 113837 131786 86309 60850 205519 313702 195341 65684 247818 343149 208445
20356 208445 94815 -164964 -356792 -276162 -89696 87505 208916 -85724 -370042 -364877
20346 -364877 -459712 -438661 -253290 -251373 -164259 -14599 108130 -1832 -108263 -189396 -70643
20335 -70643 -71478 -294185 -320241 -31725 19973 -79978 -340320 -503466 -661565 -461727 -332861
20324 -332861 -285496 -274684 -270576 -237548 -434248 -448333 -107093 50313 -43905 -125070 -185344
20313 -185344 -355903 -528395 -393621 -238600 -216164 -136111 -7267 -283616 -620433 -529095
20303 -529095 -95838 -79145 21915 -17391 110511 201004 172908 197197 2336 -295624
20293 -295624 -259390 -4538 88587 67106 171636 55201 -124970 120687 146689 -17819
20283 -17819 99263 314048 311165 305710 337530 449271 161923 86899 173052 200804 321472
20272 321472 183576 8618 -251777 -299110 -301588 -215627 -42466 187223 7440 -141652
20262 -141652 -245484 -95853 -8576 -74121 241262 497697 303584 -67206 -65590 95784
20252 95784 -92799 -230519 -183285 -209313 -157674 -178481 -142553 -15390 1362 -15389 73174
20241 73174 -70967 59225 12346 132775 328533 233712 31582 146059 -7274 -326622
20231 -326622 -173894 -51625 236687 254406 253305 310650 470870 285922 387689 304813
20221 304813 300337 228672 -6384 60025 353956 181631 23967 -111344 -438576 -298815
20211 -298815 -18028 40418 -86081 -273455 -218312 -103248 -163147 -12771 -29461 -141917
20201 -141917 -24530 250618 437238 501903 290116 237329 270744 254066 205783 147752 -15765
20190 -15765 -11397 245288 375237 441194 443198 336412 190894 55155 -124358 130939 126933
20179 126933 287328 329374 83888 26688 46272 180687 -34067 -168501 120448 162903
20169 162903 164303 119572 -1000 54986 -121370 -153529 2370 -89852 -166897 -122024 165123
20158 165123 123871 196589 3091 -390212 -315560 -156255 147213 394581 426080 574783
20148 574783 658796 206290 -215659 -328959 -506094 -340756 -34100 311367 478884 423386
20138 423386 269133 98719 133448 159204 73139 95000 249970 137706 182226 82771 -36516
20127 -36516 169368 338185 281229 163976 -45882 -112049 -92094 27113 14741 -100132
20117 -100132 -71349 -130063 -276638 -229897 16838 -13636 -156792 -140781 -160755 -325590 -42972
20106 -42972 179122 308903 256776 207748 52645 -4716 142441 530322 790414 931803
20096 931803 1129448 906332 576939 468203 659762 769295 392021 255269 238270 -49246
20086 -49246 -131509 41333 190302 278113 375528 449064 443884 422924 336966 379358 492573
20075 492573 367542 206048 147009 232625 170234 206598 379804 450764 536574 498363 669128
20064 669128 612142 502303 265656 305892 405945 600673 806534 864648 982373 835340
20054 835340 521909 212621 40552 142495 243309 536484 1113823 1487268 1639748 1454440
20044 1454440 1288208 1027309 890833 840289 1061277 784483 790361 993085 851882 897902
20034 897902 871861 668578 767947 759653 692103 889861 884493 737047 959788 1363501 1296156
20023 1296156 1294793 1461260 1249425 1348574 1329723 1101814 962397 1053601 1227742 1475629
20013 1475629 1633916 1638467 1758858 2403325 3153042 3942449 4346665 4496195 4333714 3858798
20003 3858798 3647597 3764396 4277933 4870212 5672793 6118113 6123330 6011170 5983725 5944508
19993 5944508 6439638 7310805 8399272 10051627 12015790 13599250 14785972 15535097 16185698
19984 16185698 17371323 19981761 23884619 29515798 37569730 49889788 69110057 101190450
19976 101190450 157026350 253953042 387495324 465974407 436328016 335241565 221235114
19969 221235114 142709809 96411066 68452968 50660361 38760969 30412840 24628519
19962 24628519 20743416 18467555 17115453 16280451 15948308 15622078 14963783 14162404 13056804
19953 13056804 11596443 10608968 10451858 10776674 11727093 12380100 12203597 11229334 10304808
19944 10304808 9892522 9831411 10329622 11493928 13230603 14891010 16204140 16933580 17034779
19935 17034779 17320676 18111651 20029720 22660747 26596833 32946911 42490978 57064023
19927 57064023 80190977 119368581 188027012 303013853 430980746 465551784 402936287
19920 402936287 287388465 183736015 119049476 81144043 58070646 43098366 32968543
19913 32968543 25869547 20961627 17804296 15890244 14662755 13726722 12602086 11217840
19905 11217840 10424391 9456300 8417190 7563038 6769861 6453496 6587009 6711488 6316302
19896 6316302 5676365 4779500 4094848 3781230 3823304 4011548 4348141 4750817 4525390 3503115
19886 3503115 2819077 2448050 2032393 1930675 1775686 1587993 1653255 1353664 1098863 1264065
19876 1264065 1079932 782177 776856 847483 1008388 901928 911449 827607 839727 788612 797678
19865 797678 859351 672811 475656 248285 233254 251106 454130 552830 328516 143327
19855 143327 8741 -58844 145066 276059 212275 -56566 -195230 -141397 -258068 -59199
19845 -59199 303433 421925 633106 952655 921874 751736 758191 993417 1068264 1296632
19835 1296632 1000846 675415 554112 641001 511167 370346 368820 278777 306554 532639
19825 532639 674553 390621 220171 203693 110161 98357 131803 161093 123769 -120361 -85261
19814 -85261 203862 277481 262581 248507 176591 449001 392344 336010 289331 261796 279257
19803 279257 187851 119883 96888 -8114 -98585 -116232 -108721 -70417 318438 794706 1082605
19792 1082605 671539 416725 344226 356629 509939 678946 616217 490493 551899 199435
19782 199435 -194609 19927 52357 -152090 -46389 151102 241140 334549 173688 325742
19772 325742 364151 453062 420456 437198 421977 383482 267588 360804 146449 -80945 129115
19761 129115 67856 -162457 -41918 66244 -81187 -4791 55869 -87962 40137 117727
19751 117727 107201 369619 666469 661812 392707 170897 229806 20097 -187463 -151562
19741 -151562 -228620 -242599 123537 12421 -169187 21831 293273 141334 -28823 -10040
19731 -10040 54869 79757 -249478 -144603 -26609 -85756 101231 -52418 -149957 -78977 -158176
19720 -158176 -195909 -196177 21525 221824 151705 76692 274615 442109 671235 563348 258584
19709 258584 99183 -46237 -319946 -254913 -147057 122687 309798 343065 191597 31900
19699 31900 -119218 -712 369416 357676 66325 -142869 -341064 -91025 -148855 -216691
19689 -216691 -387317 -543195 -345850 -102645 -162167 -117473 -95045 190401 325878 269295
19679 269295 390674 426055 510212 414352 -23594 -302528 -369899 -425986 -286945 -241550 -285411
19668 -285411 -126459 28112 202237 379242 511532 648650 495544 339312 245024 348373
19658 348373 144659 -213954 -42934 -16128 -79065 71177 220896 133451 213681 248792
19648 248792 -71471 -148282 -210217 -57267 -286562 -450355 -422151 -348226 -558604 -494679
19638 -494679 -336559 -341243 -336980 -168254 -41603 222711 94259 106562 228163 194901 272998
19627 272998 427744 354629 133024 6519 -85135 147835 197380 191149 139090 46830 96891
19616 96891 343767 -115287 -361272 -205612 -93624 -79508 20879 -74261 -234595 -422444
19606 -422444 -702251 -757192 -613006 -397063 -359543 -312768 -297624 -340308 -131920 -292553
19596 -292553 -374885 -252535 -84964 144895 222729 145102 115331 59210 62212 120038 133723
19585 133723 -38314 47222 55218 -70452 -167621 -175102 122245 285441 118622 309876 235775
19574 235775 197707 249506 56873 -103982 -240468 -153015 -250050 -256753 -255343 -209154 236293
19563 236293 556916 322579 411802 318286 188140 81245 -224312 -308034 -41604 99046
19553 99046 284473 412511 285550 175573 330863 523100 466901 281650 345239 257717
19543 257717 161198 -49138 -93570 69164 47654 20797 40787 103369 200177 140751 -80939
19532 -80939 -91494 -14502 -155619 -436213 -510546 -393253 -505544 -609748 -443197 -333453
19522 -333453 -257530 -211118 -289040 -359891 -549892 -439209 -453401 -543929 -447884 -361765 -369343
19511 -369343 -285142 -246332 10096 18399 -121692 -167362 -68515 -203069 -381920 -442018 -239032
19500 -239032 -119882 -293494 -291300 -182650 -250350 -78016 92692 187216 101698 97919 -22177
19489 -22177 -26797 74502 -66087 -219719 -314350 -153280 77345 101151 -142771 -250308
19479 -250308 -138334 -178745 -428754 -481467 -279623 -170701 -178900 156328 145422 21393
19469 21393 -84033 109214 425800 585224 357288 110565 225606 309345 446774 644877
19459 644877 553621 323670 412187 442058 404248 380397 341580 339142 210494 71293 301695
19448 301695 453924 268459 102078 18844 -13227 14655 -24112 226779 278914 116734
19438 116734 19806 -48089 37437 149271 247474 77358 129938 183075 73669 255904 191213
19427 191213 79469 461900 745860 945420 1531017 1906330 2112272 1999857 1502708 882064
19417 882064 993372 940707 722448 729819 696709 549329 410020 197801 91337 53859
19407 53859 80317 320779 598542 609755 335493 152624 -60319 4089 115758 34400
19397 34400 188353 255723 51632 56211 199855 313106 330204 254743 177259 190218 178523
19386 178523 42006 -143602 -258840 -125069 130905 441480 490761 312384 325352 348260
19376 348260 404907 340088 278655 558585 1025021 1670966 1816423 1524008 842237 287233
19366 287233 345064 483249 312151 63632 -50473 29332 203145 -23821 -9927 31757
19356 31757 260677 132624 -40241 106583 142610 -82843 -9020 -178 -125584 61130
19346 61130 -42393 -227087 -230764 -296877 -676888 -767503 -836687 -832550 -802457 -450380 -106339
19335 -106339 -103731 -471236 -450866 -236409 -304873 -356215 -192661 -86442 -109537 -82733 -21103
19324 -21103 13722 56275 -26882 -83898 -100634 79026 19095 -153677 -218074 18505 200441
19313 200441 92123 -35309 -180531 -194029 -150069 -241344 -547635 -690615 -447821 -279499
19303 -279499 -269414 -191552 -84737 -52578 -96620 -218160 -226275 42506 227662 -48316 -240559
19292 -240559 -330307 -164022 -203726 -272081 -27444 6785 164704 119 -249529 -232707
19282 -232707 91201 102523 71531 127935 1940 231507 297446 206370 55127 96613 -20460
19271 -20460 177384 214581 36968 105976 200521 150690 -20520 -90092 -278435 -392761 -259585
19260 -259585 -56334 209943 178725 107524 299283 378814 259296 211683 -144668 -312869
19250 -312869 -176584 -97681 215 225359 213627 405101 537549 451330 498038 524292 630164
19239 630164 565279 289807 14916 -39201 -94068 -122786 74586 202514 221273 32068
19229 32068 -77108 -119818 -51674 -131590 8055 284821 179212 36205 68580 246775
19219 246775 114220 238050 414752 448673 362444 276134 151404 33746 -52414 -8689
19209 -8689 35478 148031 241211 316975 226297 -111907 -195115 98256 217562 254210 426645
19198 426645 473771 309848 236614 190717 352285 846552 1010269 1073920 1358767 1681281
19188 1681281 1678538 1420475 1241257 746990 309185 306212 404014 524758 718035 565899
19178 565899 274274 -72093 13618 396432 290546 296566 187650 12963 627 -3016 79630
19167 79630 281570 96431 -74743 169310 -17645 20104 94601 162342 -26936 176156
19157 176156 527183 430819 368830 321204 232938 -251376 -110734 -83951 56702 226760
19147 226760 159930 -76976 -200522 -160573 9002 118887 175001 195880 340432 344326 287677
19136 287677 416143 210995 142241 223030 339759 201226 -25334 -63831 1494 145181
19126 145181 239114 429475 134163 -105947 85846 306344 237216 -19388 -69181 -64915
19116 -64915 -191007 -149048 15209 -211717 -258942 15769 30568 -112684 -149024 -90700 -307769
19105 -307769 -380075 -368561 -302709 -137092 -317751 -357650 -257056 -127435 -11678 -79281
19095 -79281 87108 -164332 -32772 264755 302210 -81200 -228332 -142144 -186175 -157231
19085 -157231 -202475 -169714 24036 -30125 19888 144773 23391 -174575 -300406 -295777 -137624
19074 -137624 211116 33493 104656 423551 612453 326196 120060 69065 51867 -75570
19064 -75570 -23306 71482 172015 327389 336665 253072 316507 386618 492402 -61249 -391912
19053 -391912 -94613 37267 25633 286724 311498 113970 -31485 -158288 -135556 -245125
19043 -245125 -162724 -119640 -178275 49464 170834 7909 -32873 64650 9667 -151277 47605
19032 47605 252775 137778 -176323 -183043 105549 267354 419658 497731 398383 380572 175870
19021 175870 -160190 31317 87019 68177 115620 9483 -346866 -286771 84668 214963
19011 214963 201590 222571 206586 258753 251161 415113 276375 20670 -2445 -102736 -305154
19000 -305154 -493672 -271584 -170642 -7996 8518 -248724 -285242 -132949 -61471 -11638
18990 -11638 65221 167080 294487 161692 145358 53011 -201149 -183128 69400 352524
18980 352524 432906 245445 189528 -200699 -474019 -33637 108317 105195 -154295 -267128
18970 -267128 -145754 -324265 -253271 -360903 -341829 -275670 -88056 79560 38420 -6696
18960 -6696 47706 111182 185101 327468 348401 503683 450215 358011 484078 225181 139199
18949 139199 313302 265804 24344 -122766 -152707 -82219 62356 28045 28568 44851 185995
18938 185995 301385 70602 -221584 -374285 -441057 -206947 -106889 -80616 -379148 -395140
18928 -395140 -358496 -265269 -172928 -186483 -110001 -3775 -333851 -492895 -412627 -325080 -233924
18917 -233924 -287996 -358310 -481892 -512731 -296033 -279384 -263877 -500590 -506876 -319691 -196669
18906 -196669 -83162 4580 -72886 -30964 -345947 -286858 -18095 -76030 -123077 -15656 179186
18895 179186 200316 151276 -36162 16605 288560 339477 296124 423541 341169 61829 153467
18884 153467 319361 370784 237338 63654 -60909 -155450 -297111 -226075 -59609 69998
18874 69998 -106096 -237106 -283867 -207340 -276460 -57500 -42118 68739 247636 109673
18864 109673 102674 157657 203669 86456 189024 367594 371708 249027 107054 129144 299956
18853 299956 214511 98899 3738 -43010 5597 85774 -69014 -87176 168364 179045 -17275
18842 -17275 56630 372681 167174 66754 -49904 -160931 -172417 -23991 -40143 -81938
18832 -81938 203561 434317 198060 -23173 51697 133141 159153 246404 219257 54572 -180572
18821 -180572 -349358 -410959 -157360 15589 119666 136110 228572 430275 229199 177722
18811 177722 403455 212109 -31924 -89045 169847 97295 92232 354168 205474 78069
18801 78069 236868 206211 -28165 -36855 -10112 98952 251170 178359 44331 30061 56756
18790 56756 124764 349011 613081 346701 11187 96950 113973 182488 90844 14793 199785
18779 199785 432740 349338 118851 -64451 -75621 -109492 -58681 -195287 -469280 -271825
18769 -271825 5703 115143 126880 105474 225385 258697 39647 -286780 -374852 -202517
18759 -202517 -132761 -254630 -282906 -224551 -236714 -170136 -66772 -117308 117413 83048 -172215
18748 -172215 -214370 -229328 -199195 -230181 -117811 51941 -28975 -204401 -315165 -457180
18738 -457180 -275712 -120954 -90064 48403 102448 100981 -2724 -412274 -322516 -115431
18728 -115431 39050 153962 248129 27638 -130711 -104553 -129962 -207039 -117516 -132980 -200266
18717 -200266 -331968 -369780 -267999 -104600 220589 313137 282416 79401 -217833 -172117
18707 -172117 241702 366754 193366 420184 517269 372299 267224 203362 168227 134192
18697 134192 161701 255868 236320 -4176 -300726 -268280 -196608 21980 13892 254790 224404
18686 224404 29509 179521 113666 8293 -132424 -328836 -349573 -210609 -36343 -106695
18676 -106695 -390951 -399821 -266763 -380391 -616439 -560765 -127150 16133 143803 128562
18666 128562 41340 -63561 12179 130033 136517 -8249 -39044 66833 178705 112874 -47321
18655 -47321 -128792 -50186 -22924 -71108 -61878 -278851 -98091 -93663 -24473 110596 217900
18644 217900 424420 575692 758854 776200 794818 555161 489226 411588 271351 -227559
18634 -227559 -358600 -261857 -238454 -58972 40769 -44845 -144999 -102305 -93720 -150660 -277493
18623 -277493 -87419 74869 59012 81481 -169320 -361700 -301445 -249240 126329 214981
18613 214981 94151 34532 -50457 -12087 -163502 -156338 -23145 73775 140366 20831 -108419
18602 -108419 -386182 -687119 -725830 -599955 -439994 -340853 -399049 -283770 25274 -7648
18592 -7648 -66783 -285838 -214831 -167332 -188085 -110996 -152087 -356448 -220812 -29225 240487
18581 240487 190276 -6091 56833 228416 443752 414958 252337 745 -271486 -187988
18571 -187988 -280932 -369430 -420157 -318256 27237 66086 -268277 -358123 -417988 -313027 -66514
18560 -66514 -156414 -153067 -48142 60371 -22840 108355 293554 295677 66105 -215810 -319995
18549 -319995 -216628 -728 194754 210696 218770 79716 32181 -71853 -83802 -2826 10713
18538 10713 -1023 -25355 -144357 -73128 -19502 232913 96477 -113748 -145158 91347 506630
18527 506630 425546 482336 416860 220802 260973 457923 288114 70590 148218 72814 -237632
18516 -237632 -114792 -58550 68641 166783 -62068 -83146 -140295 -286764 -400912 -102660
18506 -102660 42103 14202 -181003 -257395 -222446 -81960 67489 -16619 -38825 103866
18496 103866 2412 -131711 -162094 -217625 -416080 -218227 -425420 -402078 -131972 -145295
18486 -145295 -76863 256900 464759 491367 290664 219533 83338 -205617 -324977 -460195
18476 -460195 -371403 -174496 66000 84633 68938 194756 137770 274312 181124 58724
18466 58724 -38276 139332 90574 106517 209903 72065 152273 352007 204047 -5696
18456 -5696 -382081 -278945 4514 42942 -302310 -329080 -220808 -52210 -5947 237304
18446 237304 325578 -94039 -102988 -6817 -19818 -105028 -126716 -231250 -219128 11378 -63446
18435 -63446 -111357 -91938 128657 182197 12052 -83168 -26327 37723 238519 312386 305965
18424 305965 87025 -50851 -50271 -215927 -247298 -348635 -269654 -85062 -16743 -111313 -340852
18413 -340852 -320589 -307426 -209290 -56749 -130761 69206 210954 39442 29658 -113910 -145150
18402 -145150 38732 -81046 -157946 -94515 -399538 -506593 -323629 -251085 -317117 -257363
18392 -257363 -341590 -279879 -41633 -249399 -373946 -239957 -103084 1831 -129305 -316884
18382 -316884 -85524 2816 -49862 175960 392395 307587 21706 -52126 -125265 -200803 123298
18371 123298 286291 169246 -150613 -147054 -158034 -228554 -194116 63490 99708 167136 134901
18360 134901 -34042 -38020 110564 -6188 764 -82510 -302646 -281264 -339263 -91923 -52296
18349 -52296 -30377 52494 2903 24956 -383 10656 11903 -37277 224132 62849 62557 75959
18337 75959 235875 169907 236207 392169 400800 218524 74170 184969 317269 170741
18327 170741 53737 -110972 273292 37182 -476881 -503241 -62344 228764 177005 207519
18317 207519 143600 231573 92210 -44118 -90012 -8904 -104083 -124412 -126760 -398030 -350074
18306 -350074 -117518 -95221 -383430 -425293 -490994 -284148 -235542 -275503 -202377 -7066 77937
18295 77937 -81439 -454244 -330583 -299629 -131285 4027 33138 -114678 -196091 -33322
18285 -33322 -30595 -45309 -62167 174209 153035 18698 -6327 -114821 -350191 -242425 -167553
18274 -167553 5769 -72774 -254150 -410525 -172855 130079 118637 -42803 85913 118461
18264 118461 120625 -99832 -328039 -595256 -255397 -119909 -89940 -24084 -77210 -29126 58755
18253 58755 107371 77878 -181896 -89143 -40650 -118827 -128273 -159286 -121810 84255 161809
18242 161809 69213 -148435 -366026 -48947 -42552 -378157 -456990 -391463 -185514 -276892 -422362
18231 -422362 -418886 -246386 -78011 69410 -172840 -361721 -169635 -28035 186149 212684
18221 212684 -140009 -558738 -557627 -75325 16177 -141736 -178179 -163237 201772 328230
18211 328230 -277977 -597913 -374718 -255082 -99729 -58738 -131027 -55449 -130103 -32750
18201 -32750 174104 318865 213951 101042 135453 65114 -179946 -249980 -204259 -86738
18191 -86738 -177737 -232750 89094 248249 197420 -29575 -145492 -95204 -40680 -45513 21906
18180 21906 -61574 -13531 313130 506162 282173 180463 73962 36135 -7368 153309
18170 153309 407957 416423 67308 -4702 126797 168734 340710 66008 22995 174031
18160 174031 219716 310848 309188 210827 -114862 -295874 -307424 -383319 -218741 -259995 -207520
18149 -207520 -145864 177486 227305 74561 81016 -40919 -198907 -57032 164838 210725
18139 210725 99951 144090 -197104 -586529 -852683 -810951 -644815 -333423 -14658 -53971
18129 -53971 -170967 -323346 -184271 -305411 -527151 -246263 45466 153788 310584 448385
18119 448385 331343 236321 300452 113598 37507 -120643 -489041 -519742 -311997 -369084
18109 -369084 -370698 -70296 11431 -79742 -207681 -276242 -272004 -394842 -317959 -395645 -366864
18098 -366864 10918 57240 -205667 -405940 -323628 -374096 -157081 124793 269345 346571
18088 346571 69657 -68801 48745 6639 333622 424924 22598 -380329 -371135 122843
18078 122843 187674 -113801 -195519 -124482 -114299 13270 -6774 33032 19789 -64553 37336
18067 37336 34270 -144141 -290991 -520897 -510670 -302155 -250311 -336477 -138026 132152 66314
18056 66314 -63933 -99214 -35248 295780 514005 378044 330090 342002 306734 50027 -78551
18045 -78551 -160763 -104763 21568 232742 292930 164833 -49518 -141915 -259505 -329536 -412670
18034 -412670 -36079 215382 214603 102853 141811 51829 -10035 -129372 -1902 112354 425076
18023 425076 443125 187352 129337 173724 176290 191251 200817 109075 143182 300430 95386
18012 95386 105187 128156 335556 379366 194799 265628 398915 367287 237210 274489 279659
18001 279659 44346 5939 -56175 -263483 -522462 -305329 -269772 -378097 -296121 -386859
17991 -386859 -31151 266880 -55603 4992 209028 183291 231543 353486 453900 427735
17981 427735 212761 68182 151342 246965 393154 238023 268236 147716 27556 221674
17971 221674 320876 204048 -43599 29458 -19447 -87522 -396666 -251870 -293567 -428262
17961 -428262 -158639 51738 -247046 -392236 -330338 -391035 -289292 -165872 -8872 176161
17951 176161 101625 -89131 -59856 12726 32927 274984 409431 391559 325666 227964 85829
17940 85829 -286091 -302499 -258483 -279870 -330412 -146554 -41186 185145 96298 -65619 -121907
17929 -121907 40343 286418 289588 329455 349265 188716 184815 95562 83372 118435 185430
17918 185430 103176 319463 503869 712804 479828 77458 -52472 -327942 -456637 -342565
17908 -342565 -205863 -50503 68188 111131 101001 139046 -124364 -59218 -75579 -21887 -69285
17897 -69285 72605 46668 -102547 -191904 -182910 -71098 -479079 -574135 -262881 -138300 -98318
17886 -98318 -41134 -107343 12832 122599 260637 305393 346197 310260 78128 59977 8903
17875 8903 -40229 119609 268473 161776 1052 -91728 90921 45721 58482 189906 141564
17864 141564 -35797 -52224 124480 41478 -120176 -147085 -76611 -22908 99726 303960
17854 303960 404866 552576 657977 425669 248133 276672 235395 237120 208273 55271
17844 55271 -60596 -172438 -241309 16778 189586 22017 -79839 99492 315686 345699
17834 345699 14697 26629 5911 87968 169172 140081 27237 -287744 -167629 720
17824 720 57506 -15146 -180003 -116843 -121639 -200229 154722 69172 107157 122723 27146 -485920
17812 -485920 -574963 -391384 -289594 -220039 130571 317423 75888 -68461 -66241 -230126
17802 -230126 -243394 -48608 102861 66773 -30917 -62513 -35441 -163268 -21838 204678
17792 204678 30599 -281285 -60494 9814 -121484 -429226 -717444 -901346 -709063 -413502
17782 -413502 -385679 -579012 -580405 -615709 -636232 -622415 -411311 -322663 -564341 -617491 -530910
17771 -530910 -414037 -458752 -222155 -460790 -585382 -328135 -118156 -67524 -65142 -29216
17761 -29216 -68899 -69055 -117398 -119503 100723 106841 229191 336923 45273 -174227 -235859
17750 -235859 -162245 -49793 177726 121425 195348 111695 17061 95966 61554 -276168 -260927
17739 -260927 -222783 -255679 -36915 82960 100883 199484 279349 298518 -87191 -75796 97573
17728 97573 168019 153843 326152 425203 495517 324949 152877 -46428 -285926 -534555
17718 -534555 -428586 -1709 149384 34306 -261140 -270419 -164265 -186044 -137256 -196414
17708 -196414 -104980 -147958 -88722 -217950 -291225 -142944 -309351 -384561 -251192 -89209
17698 -89209 -27902 100303 68100 85693 10218 5131 6765 -13177 -84301 6067 60512 146688
17686 146688 291347 90865 -141341 -96840 -126295 -437848 -345734 -21250 167507 128834
17676 128834 -141486 -406986 -521972 -476063 -163129 -38538 -366790 -303346 -329927 -414061
17666 -414061 -445027 -425843 -465463 -386891 -190365 -263740 -3207 48462 64014 -70138 -227080
17655 -227080 -127035 97725 -78490 -138017 -145687 -185659 -183465 -112908 -189436 -199679 -189436
17644 -189436 -14014 228515 247705 -43411 8115 217234 -1592 -132942 -168510 34753
17634 34753 177151 59821 131318 285136 338496 66423 -108835 16321 155749 75571
17624 75571 -18400 89296 -9875 221279 533723 551040 606210 384621 242660 220958 238145
17613 238145 207530 -18542 -152478 -366617 -364048 -348861 166034 354835 24852 -43339
17603 -43339 -192920 -344537 -575726 -698289 -461901 -35743 30323 -134848 -50019 67397
17593 67397 68502 -313634 -660228 -595003 -326668 -103293 -325642 -467892 -495056 -265170
17583 -265170 -99011 -318934 -124691 153495 162761 213342 283826 173323 -237326 -277216
17573 -277216 -133100 -52955 93777 -44151 -149717 -47604 -27049 -206221 -149752 145523
17563 145523 -40998 29266 -104221 39761 172107 242864 273425 88105 71785 -82463
17553 -82463 -259194 -401527 -243009 -360774 -330187 -324947 -340614 -164954 -194507 -162458 -122580
17542 -122580 -105194 15147 -92517 -171532 -265669 -108169 145764 247120 331897 287649
17532 287649 207125 243331 115809 69433 -88978 -75584 -88798 74295 75972 157939 239858
17521 239858 168891 -67571 -175650 -17769 173665 106172 -30475 -143430 -317145 -151408
17511 -151408 130094 79832 -65961 -322797 -408160 4475 371522 476271 416705 74730
17501 74730 -103768 25272 168255 51480 100952 68744 -107652 -369384 -330211 -302176
17491 -302176 -99871 19933 -20841 -85429 -299688 -304822 -254315 -154064 -219800 -273214 -392147
17480 -392147 -148292 -93574 -96911 107628 48043 240468 378078 104384 -77675 -298849
17470 -298849 -382646 -413009 -558852 -345259 -74581 -16904 -283550 -383751 -534051 -521546
17460 -521546 -514990 -401652 -164009 33816 244523 67188 -12244 54804 156059 215167
17450 215167 128472 153479 -31245 -125096 -10525 -18171 -134888 -51808 77439 165324 -5997
17439 -5997 -121629 -153798 -324736 -423523 -307814 30575 -126050 -401777 -367149 -227895
17429 -227895 -234995 -329885 -407697 -152080 166492 152235 268 -183940 -103697 256330 499153
17418 499153 457904 216528 74616 -122472 -153531 -251254 -136660 50526 154340 42175
17408 42175 -51061 -63667 -186465 -178903 146700 118987 169582 20216 -142726 -163632 50192
17397 50192 334604 277448 -4254 391733 587137 536849 115662 -38751 -68495 -148107
17387 -148107 -130520 -225801 -384874 -351577 -175049 -209573 -151992 -30873 -43488 16634 195719
17376 195719 153220 197003 334681 464783 256661 42326 74235 -188355 -377424 -302023
17366 -302023 -306851 -262771 -69839 13627 -330439 -243656 16089 -2034 -160591 -246475 -275125
17355 -275125 -272678 -305179 -226397 -366174 -418469 -351309 -246350 -80146 108734 182973 165848
17344 165848 197507 7914 15407 -133524 -343254 -315408 -125295 228363 463407 433054
17334 433054 87798 -95505 -237009 -70548 -43699 -249006 -436915 -311310 -188410 -274952
17324 -274952 -311571 -73288 83909 -2490 -256593 -385401 -382916 -217778 -171740 -184277 -149180
17313 -149180 -312719 -518045 -218715 -257330 -186771 -127840 57760 237250 238619 256358 148038
17302 148038 -97011 41534 62260 -148076 -298825 -197540 -118229 -93135 24533 277148
17292 277148 360506 381786 338550 53856 -117270 -174964 -125592 -141731 -135695 -289088 -89633
17281 -89633 -88272 -30671 -55143 -201638 -114323 171438 613716 596420 379686 254895 464717
17270 464717 476011 340434 -94150 -140100 68810 42826 -273505 -394019 -269569 -124090
17260 -124090 37027 106001 234452 -52409 -258295 -449131 -458251 -405873 -152977 -1103
17250 -1103 5672 -162405 -273865 -198906 137643 279322 117920 278090 219574 97365 45224
17239 45224 326287 354439 118144 -69120 -196425 -189581 31231 -69413 -233084 -261765
17229 -261765 -229701 -152815 70742 124526 34451 -73626 -37881 140627 155569 45905 -215920
17218 -215920 -40322 436734 503960 155864 48818 -10306 -196871 -185202 -201847 -91011
17208 -91011 85537 67492 120599 -94767 -111013 12174 -57585 -114477 -436119 -211270 -2051
17197 -2051 24239 -170513 -188308 -159226 35356 106817 254109 259860 289439 305781 559944
17186 559944 370939 -2197 85067 178856 228918 212585 18269 3976 -87780 36338 205496
17175 205496 353689 378301 332318 19020 -167666 -217126 -262141 -360940 -449473 -551907 -536306
17164 -536306 -545987 -340670 -238418 -189389 65271 224057 59178 -173289 -103503 29218
17154 29218 82988 171076 218697 18039 -158984 -301122 -221774 -18504 -46438 191184 282755
17143 282755 -104503 -262782 11245 184733 343269 206798 116461 57074 -61753 -30131
17133 -30131 316760 245982 72295 -831 -100627 -158046 -280940 -265294 -3314 126867 85427
17122 85427 94380 93112 -17060 146086 40708 -136372 124091 152232 -150308 -180321 -86367
17111 -86367 -71221 170724 244861 120213 -312893 -413317 -258883 -206311 -36333 166497
17101 166497 89844 10180 -105818 -153395 -157578 -170314 -212251 -69047 -57883 107804 158155
17090 158155 -104562 -199798 -86282 -131962 -246445 -222106 -63368 -201736 -200801 -162163 -9602
17079 -9602 210833 126525 309942 342492 359760 132945 -101506 -380975 -351516 -236210 -224015
17068 -224015 1173 221395 390928 199310 -22127 -430432 -387462 -77372 -257005 -584351
17058 -584351 -527352 -579812 -446773 -425523 -420794 -525672 -622258 -399483 -272448 -125117 8896
17047 8896 120175 76257 -151067 -53204 -77788 -155548 -604627 -518150 -258978 -65855 -80284
17036 -80284 -102281 -70453 35637 36744 -164680 -352202 -381097 -299518 -108583 -179581 -208690
17025 -208690 -160547 -117208 126613 290826 -158063 -435657 -473816 -477204 -149518 28133
17015 28133 -147552 -148308 132078 192770 125231 41379 90691 -17667 -210785 -131204 55110
17004 55110 -84512 -140737 -153925 -174837 -292054 -417737 -293625 -71920 -74802 -96577 50377
16993 50377 70343 -18530 219221 431456 408480 225318 321871 511080 380018 136358
16983 136358 87427 -33793 -63141 41431 31541 -192814 45258 11687 113099 227240
16973 227240 75419 130532 226247 348915 322835 367745 99758 -97040 -190398 -102537 215881
16962 215881 295230 88738 -95853 1955 299312 495127 413617 185759 110218 118687 175680
16951 175680 109893 -178110 33250 -18688 190499 193987 73224 -258867 -303766 -213041 -201652
16940 -201652 -77043 -15734 163952 188969 393530 196003 189526 130484 -38902 -70981 16316
16929 16316 -7969 -83886 134973 146301 122717 17417 99269 289132 270236 96503 -199754
16918 -199754 -359374 -419260 -267158 99006 137076 27085 -91940 -134080 -198622 -198595 -167331
16907 -167331 -297586 -146409 -150460 -283887 4676 351350 304532 376173 343357 222813
16897 222813 -110864 -314888 -193674 -88288 -121835 -181777 -53405 227278 298833 6804
16887 6804 -201287 -202942 -347341 -117984 87429 423126 256538 159096 -101196 -455645
16877 -455645 -328549 -92495 158012 241459 261186 229532 184879 62829 -44590 -24709
16867 -24709 -319053 -624912 -552309 -508796 -356322 -505221 -378481 -304330 -294215 -155946
16857 -155946 20104 -62722 -8709 -69050 -172395 -238690 -329067 -359933 -110554 146573 139337
16846 139337 43191 -154142 -205094 69149 66357 -40347 -293560 -226401 -93860 -46400 -226330
16835 -226330 -152516 -132374 -167147 57857 310049 211579 202023 177054 -67926 -95774 -173617
16824 -173617 -241149 -174676 -43128 9855 -73962 -220301 -493482 -871080 -803688 -723588 -486900
16813 -486900 -269440 -24590 52541 100197 82000 -44435 -3818 -30503 50265 27747 -2590
16802 -2590 76358 -152918 -228204 -250032 -226085 -294564 -352035 -257545 -140142 -214286 28972
16791 28972 66078 -136936 -152146 -224010 -95899 35340 -30181 -30952 -44095 -13289 -187804
16780 -187804 -44645 60356 -156363 -114481 -261524 -321377 -289334 -89255 -584 -260328
16770 -260328 -129583 34701 121659 -39674 -21432 88429 -32823 -323179 -409111 -327172
16760 -327172 -200979 -151794 -142665 -238280 -240119 -254276 -202759 -169441 -242823 -225900 -233732 -546812
16748 -546812 -556909 -455838 -304069 -421847 -866643 -811355 -280547 -98598 -73579 22305
16738 22305 16258 131738 369646 268947 302324 113532 -309839 -399565 -156953 69437
16728 69437 213493 192285 -35081 1229 -79262 -105733 -10708 -216918 -301220 -443489 -432593
16717 -432593 -395054 -317949 -60048 -68642 76149 215831 100887 -209113 -188317 -267272 -430265
16706 -430265 -396799 -301703 -540697 -520301 -282905 -6575 90249 -42697 -274567 -35361
16696 -35361 -103560 -344895 -652122 -536224 -314928 -343192 -159000 -150009 -118844 24424 77966
16685 77966 25107 -3083 -11667 -141635 -166240 -332235 -440207 -189927 -103207 -218755 -288414
16674 -288414 -224902 96390 14729 -108851 57726 201408 174837 204459 131279 121365 67817
16663 67817 108048 352389 190429 77167 -60890 -161657 -337773 -426832 -275628 -169501
16653 -169501 -144185 106715 213467 208496 66906 -49492 -172117 -380513 -461660 -289521
16643 -289521 -325365 -92426 79129 210371 126957 56353 30107 -35062 100203 213002
16633 213002 235830 55703 83518 393241 555777 448343 330853 245236 30360 106671
16623 106671 368243 502233 468105 292538 -90334 -112412 20559 241778 132589 -107450
16613 -107450 -340501 -341573 -427407 -406338 -205550 -176458 -142463 300045 483370 401171 307255
16602 307255 240996 169476 97168 210519 211565 328613 459202 599295 339392 28774
16592 28774 54901 97561 156706 289807 267187 374140 420556 160311 -41078 -162272 -55075
16581 -55075 155521 205048 20946 -244278 -161027 -74771 -267473 -107225 352154 515036
16571 515036 739865 710418 505203 398868 -136655 -359830 -424062 -265041 -240958 -91110
16561 -91110 -57716 -29664 245333 264145 269710 330240 463370 332829 167575 32851 50048
16550 50048 208869 133990 87929 12030 -293194 -517024 -599180 -545894 -252334 -103725 -34888
16539 -34888 -209077 -430985 -421696 -360597 -490317 -451776 -389649 -282388 -267969 -389498 -231372
16528 -231372 -371538 -514860 -222555 111564 278931 222919 88166 43653 383194 461016
16518 461016 513871 370232 32408 18474 213249 273450 387394 210554 -151010 -254455
16508 -254455 -432210 -443574 -373579 -388153 -214469 41750 -65193 -441714 -337284 -178904
16498 -178904 -258317 -457276 -264278 -26278 -1597 -87883 -247436 -507444 -425335 -336914
16488 -336914 -201589 -275781 -208494 -42759 -28411 -64155 114533 156018 47503 35426 -27862
16477 -27862 -175333 -216184 -255971 -232520 -91100 -54237 -173502 -50077 220228 310524 213446
16466 213446 49878 -65070 -160227 -319979 -241756 -10409 76463 287721 571847 701019
16456 701019 584976 282210 63451 -27225 171730 220505 115102 -56640 -278667 -288791
16446 -288791 -180965 -216337 17315 -172202 -318677 -316946 -179442 43784 -29068 -244382
16436 -244382 -85409 -41856 -318605 -564203 -305915 -125446 -147539 45890 43121 -227773
16426 -227773 -249066 -147050 54550 208609 8148 -15455 -166813 -197156 -151707 23267
16416 23267 84307 18009 -151772 -244858 -181049 -215625 -98913 79159 146212 -71061 -222374
16405 -222374 -154202 56621 126253 100209 -45318 -165705 -143814 -275126 -98244 204039
16395 204039 600156 712043 435590 315747 409790 463593 440740 -13444 -107263 -31497
16385 -31497 25771 -99429 -83201 111273 152041 157864 250154 317905 -17044 115 30280
16374 30280 -99319 -52012 -18143 169782 211553 45649 93692 266509 273619 32964 -107727
16363 -107727 -81280 33523 108380 159094 162379 57865 -2683 -245844 -233403 11145 151571
16352 151571 125456 248656 146152 195347 -23246 -403241 -229165 -37559 27797 87361
16342 87361 20502 95438 202896 53957 -27518 70394 -103621 -114773 -112360 -415703 -565163
16331 -565163 -382634 -303692 -151725 -69084 47046 160628 -111877 75908 219437 -11979
16321 -11979 -170505 -190149 -209258 -64688 83671 264603 422311 310584 74041 240160
16311 240160 338452 618649 499963 318050 129638 -91354 -103663 -148316 -268509 -218342
16301 -218342 -24031 16559 20181 119806 94213 -37521 67182 223466 305765 219718 -4177
16290 -4177 323960 301035 135405 130648 165209 216572 147839 432542 577888 564990 331172
16279 331172 237149 38842 -105873 -91624 -54059 -204122 -330785 -191310 217090 374955
16269 374955 276864 70773 -63611 -178113 -241338 -477929 -571537 -543187 -362262 -550873
16259 -550873 -698288 -493828 -221654 -253477 -434894 -425143 -68170 -61644 -107556 73910 188990
16248 188990 16260 -86652 31808 226330 396415 435768 78087 -226839 -467762 -406163
16238 -406163 -87481 157386 345353 546494 472164 77167 -324444 -275673 -221947 -115437
16228 -115437 -91776 -231438 -305459 -100561 -140644 -62272 45220 -219842 -182730 -30106
16218 -30106 -262345 -245371 -231953 -178244 -184392 -32380 -164815 -170384 -55064 114262 222229
16207 222229 344397 365924 223929 53377 -56110 186891 263011 425263 523317 392179
16197 392179 292190 198154 36454 -46994 107279 119676 -217440 -261281 122699 519040
16187 519040 388397 170537 165663 42529 -364682 -279261 -185223 84368 318843 425216
16177 425216 235593 96235 -29944 33707 -138666 -38388 -113385 -201092 -81862 86979
16167 86979 29202 49340 375462 223272 -63580 -64798 -19379 106777 63178 -112210 -166088
16156 -166088 36119 -31895 -85395 -15979 117734 -84257 -255840 -6166 -9428 -245093
16146 -245093 -57086 17437 -61403 382525 425814 220849 35374 -64220 8630 -171689
16136 -171689 -255085 -213899 -46334 125342 31915 110057 101060 154418 217945 33718 -173627
16125 -173627 -468979 -513754 -222019 -81011 -132884 -110265 -231816 -248146 58528 150715
16115 150715 -11647 -258900 -311933 -225653 -82758 51716 245952 41339 -243829 -261999
16105 -261999 -267241 -151614 46924 159779 -37094 -300272 -228692 -160053 -467795 -473142 -358053
16094 -358053 -74649 70052 -46768 -100452 -97023 66273 372357 577316 267691 223621
16084 223621 130878 -282 93842 93296 295208 108534 -80057 43863 75719 -194701 -331579
16073 -331579 -377777 -246235 1591 307044 600142 634449 200010 -22876 106478 69197
16063 69197 81461 77895 -40878 26055 51952 -47943 48023 62591 66725 43175 -25184 -273212
16051 -273212 -407215 -43032 36455 -58390 -116411 -19793 136484 70115 -216185 -237942 59668
16040 59668 179372 42660 -134971 -16490 -185489 -283019 -199742 -272402 -304717 -99469
16030 -99469 -149283 -202432 -54192 -130086 -235622 -394358 -95078 52403 23259 142231
16020 142231 107698 223517 375511 433585 491905 354724 232601 391377 570811 636894
16010 636894 237003 -185994 -371545 -296752 -226119 -96860 -100836 -21758 18663 34439 227071
15999 227071 101352 -28989 -4568 -164163 -284193 14863 14164 91722 261638 190061 205330
15988 205330 221489 101631 188364 249255 -7215 -56343 -254789 -255609 -305901 -261535 -227545
15977 -227545 -273297 -197452 -76319 202068 448742 430212 201499 -22433 -145656 -77312
15967 -77312 -138235 -79760 -115121 -97877 -33948 -4621 -46509 -134839 20732 268390 266949
15956 266949 143599 103910 66860 109447 290819 227784 157246 4844 -89106 59398 -213977
15945 -213977 -740694 -549249 -202750 158539 67024 -133765 -88570 -64251 -151829 -274524
15935 -274524 -141298 -159478 -172565 -241816 -49553 287492 303060 -124508 32434 124019
15925 124019 -139163 256546 229237 22613 -104598 -282321 -269969 343 15536 52426
15915 52426 -7905 165971 255582 208602 413531 400644 66267 101299 136077 19826 140445
15904 140445 145138 -224174 -443179 -385682 -227576 -202312 -159485 -473015 -496090 -315599 -282549
15893 -282549 -168938 -319682 -390440 -155365 -97299 -58216 -76710 39896 12760 -323822
15883 -323822 -340155 -169248 13009 -214643 -212577 -164393 43863 223321 457407 421876
15873 421876 417860 192140 -71718 -294732 -406724 -475221 -479081 -238367 17599 96467 71309
15862 71309 126374 124367 839 63440 -98595 -274313 -318287 -408831 -342925 -41323 -86741
15851 -86741 17503 163565 206121 367927 393685 379978 296338 251034 259797 -26737 -332182
15840 -332182 -570284 -417189 -320235 -429787 -381308 -199355 -140294 201379 82901 -148746
15830 -148746 -114059 -293984 -510896 -367342 -287124 -228568 -55936 -76654 -112023 -63199 70041
15819 70041 194197 356913 287092 370689 383630 386313 197358 -113855 -304964 -266339 -229665
15808 -229665 -363356 -457981 -273809 -207634 -301280 -310343 -230426 -390019 -223631 130601 -11
15797 -11 -837 352757 523069 299209 -15748 -79341 238598 244117 121889 133138 144777 -93099
15785 -93099 -89855 25359 -58755 -118098 -88493 -262436 -414291 -334195 -226675 12666 -115113
15774 -115113 -177887 -60356 -199364 -140360 -213805 -203114 -144460 -245021 -296672 -183454 -311757
15763 -311757 -438447 -415808 -301638 -154370 -250767 -394430 -149197 -122649 -279275 -462223
15753 -462223 -322094 -132712 -331925 -241431 -254162 -121965 -196280 56450 -147915 -94638
15743 -94638 95430 -13755 -195014 -124331 -24377 -81347 -994 10536 17693 155943 27324
15732 27324 -114899 -43377 134943 347364 545726 297158 345257 617223 514729 429319
15722 429319 267883 150182 39427 20136 -111454 -165692 -109899 180662 326116 193997
15712 193997 89770 178992 137724 -98230 -77971 42287 -21203 84146 195270 103912
15702 103912 7961 46343 182360 237075 81297 -199777 -22338 200483 468889 444175
15692 444175 275568 206093 38347 -142419 -101426 -121516 40275 244639 367323 186184
15682 186184 -112473 -223007 -417942 -166133 116919 218797 100224 -130588 -88646 16348
15672 16348 -100406 -257095 -209450 -392206 -306817 83466 65033 278435 347579 16175
15662 16175 221825 269561 454998 433079 244152 137042 9653 115353 -5406 85731
15652 85731 231030 154302 409067 515151 372280 124496 -50349 -142859 -91079 -114155
15642 -114155 -123059 41382 221268 114316 -8131 -131134 2282 220384 -63451 -273510
15632 -273510 -95470 -20745 -197552 -174452 85003 47079 -22607 34395 -20189 -207672 -251938
15621 -251938 -390700 -225697 -225396 -346385 -182996 221556 157304 -34173 -117767 -312615
15611 -312615 -286926 -131976 -284488 -392927 -36471 362187 125402 -9510 -27254 179477
15601 179477 87151 -31383 178656 235944 88744 -141004 54630 -255885 -324174 48015
15591 48015 173935 530 -61756 -74806 -33569 252676 323295 75362 74909 113514 -12299
15580 -12299 188229 392433 253130 209873 157931 224198 -12642 108478 150791 -55918
15570 -55918 -459169 -554338 -415625 -388569 -151177 -217067 -97424 30738 -72283 -203711
15560 -203711 -248002 -319720 -56310 257150 352319 288851 232534 648749 529677 181196
15550 181196 182689 67460 -155826 -124203 -255491 -256657 -67417 -42460 -211680 -134315 12017
15539 12017 76417 53551 216702 -15868 -262509 -259262 -163497 27136 68795 -277824 -197983
15528 -197983 -167183 106250 179225 223487 119912 -248004 -594463 -449063 -286806 190693
15518 190693 255553 335497 315385 406993 530914 373003 29682 -107960 -198986 -312466
15508 -312466 -188661 -70396 -73409 -88448 -137373 6560 -20121 41036 9569 109311 267203
15497 267203 86877 -363220 -585024 -650050 -892778 -658094 -474823 -616198 -518280 -574408
15487 -574408 -534950 -230472 -31721 -89328 -128150 -47171 -186116 -95568 12741 -83795 160488
15476 160488 142239 1536 -854 -32213 -51343 -34548 126054 126060 189053 315437 184206 147779
15464 147779 100766 -12395 38969 -13404 -321938 -288069 -184684 -295888 -282370 -62211
15454 -62211 -21231 -155194 -266170 -104058 -11182 -209666 -403827 -441438 -201790 -69205
15444 -69205 -114504 -37697 -23162 17142 -168657 -437069 -392800 -100155 135709 221349 720833
15433 720833 812630 450379 181987 177201 -12063 -186383 39369 -71810 -71596 -164291 -225891
15422 -225891 64253 216224 220418 74296 71868 162858 112519 -172853 -159953 -142677 -219950
15411 -219950 -262724 -208201 59623 88867 84344 305864 296278 122699 -218139 -90757 63060
15400 63060 -187094 -151764 -94843 -209659 -158011 -52307 -100439 -49797 78131 -791 11855
15389 11855 50825 -121460 -126153 -83064 81468 87623 155903 99000 -191260 -426909 -531209
15378 -531209 -368388 100023 -97875 -242618 -191549 -182835 -125135 -60079 -229052 -161897 342835
15367 342835 291620 247122 322355 187865 112019 172180 18026 -197741 -340564 -382286 -434894
15356 -434894 -300949 -338648 -368733 -459510 -358850 -583377 -884860 -471689 -184364 -382538
15346 -382538 -547161 -488240 -432422 -414195 -147701 -203545 -252313 -255554 -167864 -56452 61965
15335 61965 -289919 -60294 15573 -125599 -166608 23207 160937 -8283 -186189 -481778
15325 -481778 -503377 -336313 -461502 -336347 -127179 70676 -65559 -201693 -57872 10909
15315 10909 154810 405746 577218 615633 452348 -60662 -407145 -414896 -119174 -111469 -184090
15304 -184090 23574 35148 -12691 -69366 123526 58440 -83932 -21545 41271 -17747 -430
15293 -430 101061 275139 273947 1332 20136 205190 11726 -288754 -337448 -75089 153125
15282 153125 212534 79159 -28827 -213961 -179245 -324451 -401968 -407412 -151055 14107
15272 14107 -211469 -111858 -102293 -158886 -374367 -113391 162024 72928 -188578 -242012 6717
15261 6717 41264 261215 588028 673824 663813 665561 540201 324173 -3350 -252636 -198056
15250 -198056 -26099 -64930 166066 223464 49949 4117 57112 148926 232911 218782 186108
15239 186108 291579 256549 198123 112331 -71614 -1979 143500 15771 95924 175446 172846
15228 172846 149160 87519 214110 325245 388106 402512 176791 120649 -114501 -308544
15218 -308544 -485990 -430085 -130124 245660 672719 372606 206823 228887 223320 231807 355121
15207 355121 247461 99639 49783 -167233 -100211 -164929 17643 202954 135122 145661
15197 145661 -96 97995 178447 278062 189859 75999 472423 391739 124769 295541
15187 295541 295169 71593 90850 76590 197442 570111 572365 353147 195750 -43728 -292087
15176 -292087 -63125 332104 275755 494858 524166 481591 308916 -137164 -355330 -146100
15166 -146100 -136181 80144 111166 344856 138925 -354774 -917896 -1007419 -675511 -320103
15156 -320103 -51739 -108412 82754 280381 -186229 -368824 -338883 -330484 -138924 65146
15146 65146 174860 290179 241681 -14022 -106477 -67144 -18525 -10966 -155234 -65086 -119854
15135 -119854 251730 168843 69937 326564 105054 27480 20729 -125031 -121862 10239 -101464
15124 -101464 -454291 -473375 -281137 29729 13979 -84728 12965 -38357 39368 101272 252376
15113 252376 320666 316137 231759 -70772 -314896 -258677 -125728 17235 -33161 -306267 -303280
15102 -303280 -120948 -40666 -14889 -154279 -98594 -39948 177435 420013 502873 248124
15092 248124 174982 151984 212438 38282 -141933 -121581 -84111 -155987 14653 323143 364838
15081 364838 559072 217063 133947 199720 227313 46734 -172153 -180941 -269572 -287697 -25127
15070 -25127 49797 192423 209056 73296 88158 213530 194791 134588 448449 325787 319589
15059 319589 406645 334461 157530 -73625 -33867 -144229 -363292 -579142 -310549 -20431
15049 -20431 28691 28725 -37718 -240695 -208665 -31102 220069 550340 610657 455331 233925
15038 233925 120660 163212 92949 26176 184027 46592 -33928 46813 39329 130624 297229
15027 297229 260537 85327 -32483 12332 46364 -149416 -262946 -167216 25878 46627
15017 46627 17261 102376 65336 -88957 -367668 -237100 -93933 143168 303745 186987
15007 186987 133017 -8969 -167150 -37972 -40185 -75598 -124950 -119143 53243 -58893 90170
14996 90170 33723 31981 144124 204367 365588 120362 -1768 -153231 -151222 -270138 -123856
14985 -123856 134024 202111 -113877 -32454 89607 -91464 -344448 -428135 -183167 -211074
14975 -211074 -446566 -546461 -584694 -502511 -469199 -556699 -366717 -287379 -387238 -231749 -242794
14964 -242794 -257899 12398 -15435 -95039 241515 267414 -20878 22156 222835 101503
14954 101503 -90025 -262069 -272536 -186426 -112175 16236 -33010 -70272 -198025 -115640 -195700
14943 -195700 -52879 123330 103368 198191 359537 333621 -14610 -144771 -185779 -142027
14933 -142027 -304699 -272504 -148510 -210838 -242826 -307321 -535152 -408696 -320485 -29160
14923 -29160 -111194 -249448 -402173 -214055 25890 138779 40086 186391 162241 908
14913 908 -43262 115710 145309 -83249 -85254 -21381 291912 477636 314022 476514 360083
14902 360083 22002 207445 485812 201035 -44111 -10188 221756 293455 115344 -166202
14892 -166202 -152588 129347 358368 221239 91104 41127 157230 433550 513232 438408
14882 438408 193703 97792 28389 -167410 -154139 -111857 -275762 -669453 -750830 -658335 -368431
14871 -368431 -44299 169726 212275 172219 155605 59116 97300 -2959 -253546 -129654
14861 -129654 61484 -9654 -142685 -191700 10576 171588 176646 17258 131295 261220
14851 261220 255059 183077 -264259 -350694 -530812 -543249 -221743 31893 -138140 -217505 -76827
14840 -76827 -74804 6181 140237 -43405 -240939 -330803 29939 240814 159226 82380 83259
14829 83259 -55795 -144199 -137355 -236512 -142016 -67274 -79442 -108836 -9550 -158760 -154501 -234758
14817 -234758 -386692 -365786 -291433 -214587 70813 55952 21878 184235 282560 407165 483040
14806 483040 192552 -99138 -10620 199047 189287 142376 -21615 -180 163090 399459
14796 399459 535253 333819 239905 319986 264586 157681 85328 67897 10481 42116 -516732
14785 -516732 -368469 -240747 -332273 -131012 -88649 71087 245990 237171 83999 -88984
14775 -88984 -79694 -172128 -87720 421597 291863 67432 -75277 -170377 204004 229256 -124481
14764 -124481 -123430 159645 71043 19603 133210 156961 -40900 -209797 -81405 79803
14754 79803 -8198 -121796 -168765 -57837 -126846 -207816 -203340 -14039 6304 40011 10761
14743 10761 -80046 80080 -198213 -444661 -567498 -493473 -92590 -17978 -30641 -310918
14733 -310918 8533 212147 14660 -148567 100771 326470 277749 179446 168193 187643
14723 187643 276240 38440 35044 186933 -12101 29774 94402 -90399 -189475 -72213 -333289
14712 -333289 -321901 -313515 -291341 -155551 77787 15789 -35794 328939 185869 -9348 -118182
14701 -118182 57061 66467 110815 61266 135089 101814 -68017 -91628 -12119 98149 106930
14690 106930 231233 188644 68927 -74578 -227995 -252091 -345717 -325571 -218072 -113233
14680 -113233 -142252 31684 168706 279437 75263 -180848 -239986 -204077 -104911 185064
14670 185064 256448 152845 29385 118656 299677 181267 79249 146895 499456 437570
14660 437570 244088 73701 149811 -197770 -62075 60202 17988 98458 -42702 152771
14650 152771 74931 -45241 -86318 148883 236305 -9659 59361 127585 122974 284738 209451
14639 209451 116433 154161 104014 23977 -243502 -503476 -384358 -232387 -193156 -146621 -274074
14628 -274074 -101195 -180307 -144533 -225996 -241124 -209101 -53466 -76796 -244701 -423509 -184381
14617 -184381 -153162 -328670 -449306 -296270 -70453 -14252 37133 85177 -27721 236701
14607 236701 112124 -187898 -353908 -289675 -303480 -104756 186171 343756 222568 -53528
14597 -53528 14247 242562 218128 195277 356863 335198 392940 466598 354970 186060 -2610
14586 -2610 -110126 -28021 -95059 69561 279176 95861 -185462 -315338 -295317 -346571 -398848
14575 -398848 -372023 -226619 -233688 -457818 -529570 -291996 -168833 160620 385773 369979
14565 369979 301026 259467 152747 48371 -28196 -98228 -206684 -248658 -403478 -200111
14555 -200111 37786 -23361 273466 245986 60861 -67509 -174996 -136113 -96512 20551
14545 20551 -60275 -66838 21189 213962 118711 -174334 -505682 -469133 -18016 216435 97442
14534 97442 198472 174042 175543 267560 43721 -58612 -138044 -28653 -30492 -154140 -58048
14523 -58048 137588 80208 -18295 -74827 -16103 -81592 -259098 -266392 42 207482 105601
14512 105601 71425 65262 44296 202417 90729 -53143 -91246 -87411 66631 73389 -2289
14501 -2289 -56872 -14358 -812 49784 132668 118553 148859 -72660 -153016 -359217 -448086
14490 -448086 -304678 -401504 -105887 -242007 -139818 205718 56535 -117460 -201258 -73428
14480 -73428 108626 233022 142773 -103588 -297956 -383011 -246902 274547 222838 -148481
14470 -148481 -175406 8885 -1350 14717 222073 219381 145335 -1365 7073 115885 285649
14459 285649 478378 407836 231935 143640 38955 129138 233675 125389 -26995 1916
14449 1916 157891 54899 -259419 -343627 -415688 -297375 -7823 -21678 -156377 -123194 -131733
14438 -131733 -217372 -223668 -177529 64139 298681 172116 -73181 163920 305604 446959
14428 446959 410821 390064 326110 122034 11093 106480 65953 -336560 -322612 -266491 -11241
14417 -11241 7766 -38878 158928 247768 94578 -115060 -133140 231742 473556 656918
14407 656918 563269 327432 223076 318283 338660 153273 3879 -76521 -171237 -103252 176297
14396 176297 150654 109460 -94853 -57738 -123776 -206810 -279026 -81990 108578 43707 169382
14385 169382 150310 244805 83744 -46816 110076 241452 279489 452886 239516 212562
14375 212562 259357 269061 41578 -36788 -45324 209794 428829 210537 312517 469595 431120
14364 431120 -132726 -405366 -149646 100541 36363 -35410 -68632 -116887 -40142 157911
14354 157911 233829 62692 -230405 -132661 256044 476759 351487 12956 -54110 33269
14344 33269 163964 168335 16541 -111262 -93019 -154595 14255 244077 532199 366111
14334 366111 340914 510567 339877 100230 151459 111599 50483 87807 -81042 2020 59853
14323 59853 -83271 2011 208522 17155 -5509 -110530 -118521 -91555 21151 65467 -5457
14312 -5457 -41902 -42107 -105988 -174845 -75676 91910 77658 187605 21030 -244793 -357786
14301 -357786 -204926 -57907 213895 216879 60409 -102164 -83351 38429 278361 332153
14291 332153 111820 38134 60675 481738 385968 227904 136214 259483 308340 143305
14281 143305 114430 181859 215316 -52622 -300032 -327101 -311673 -37223 -5276 12580 -118380
14270 -118380 -313098 -228615 25716 47334 8270 -187820 -135083 -85726 -153006 -175917 -178427
14259 -178427 -125362 -372939 -518199 -367013 -243850 -201980 -85310 -188304 -58891 152959
14249 152959 138405 -103258 -86634 -73589 -118489 -169332 -153644 -309965 -381699 -389534 -298557
14238 -298557 -332970 -233558 59819 168181 72612 -81744 -363053 -413499 -109429 -267
14228 -267 -227489 -405994 -270136 84277 52635 47135 67173 -15868 -34324 81674 181805
14217 181805 106318 39407 90536 21263 -105539 -53061 78029 207088 289705 180186 61161
14206 61161 87584 80573 -45970 -2098 -229111 -443153 -227147 97202 -48809 -114325 -132108
14195 -132108 -311354 -288558 -281109 -112998 129322 171066 287476 431651 323610 191432
14185 191432 144840 -94311 -300121 -208712 -158311 -71584 -25212 162603 158049 50125 303849
14174 303849 343675 373591 190114 -61517 -158640 -202665 -302211 -495701 -624710 -426520
14164 -426520 -436971 -143481 143905 56076 -18119 -152179 69479 -29965 -287023 -312815
14154 -312815 -178866 -160252 -207569 -96555 -28555 -91397 -8289 -29077 31789 75468 155976
14143 155976 -24662 -190410 -55121 150258 266997 198715 299814 504766 436915 246952
14133 246952 100414 -4619 -95626 55085 86122 -69270 33860 316859 425858 155425
14123 155425 -137446 -368741 -531257 -528094 -262179 89532 -107019 -363187 -325612 -119264
14113 -119264 143904 177787 269403 186991 188976 220764 261738 61338 -35798 39276 -113501
14102 -113501 -49633 174006 254221 67484 62268 133404 -17282 -33304 100768 235635 -4705
14091 -4705 -86404 -189643 -85863 321578 319559 92301 83507 206636 410050 561202 473214
14080 473214 88639 111326 101073 24489 -110501 -34841 243314 214466 -51543 -50922 -22432
14069 -22432 -12281 -219408 -129494 24920 -132495 -350179 -270974 -104042 5695 -36291
14059 -36291 -54177 345794 659933 542657 154167 319569 141566 -199175 -322033 -226563
14049 -226563 -277977 -414502 -332556 -219291 -259132 -160550 12114 154717 303573 566253
14039 566253 287099 -108983 -312742 -367262 -457076 -499999 -538813 -86945 117276 -9322
14029 -9322 -219391 -239156 -185782 -275037 -369365 -216275 -33128 186499 355668 367336 115661
14018 115661 210761 -50500 -135188 -218478 -296924 -205044 -51198 -47522 -364736 -397814 -142391
14007 -142391 -70943 -72040 -49292 49740 -175227 -143279 -103965 -50438 155856 197960 280016
13996 280016 -33634 -121381 -243804 -161919 -4702 -50865 25419 189529 261355 343839 362296
13985 362296 168460 189528 23585 21420 122004 354243 332944 151586 113380 -19495
13975 -19495 -83088 -57435 217265 348160 109948 29972 -83020 -130945 -24312 -73332 45717
13964 45717 20231 -63194 -4599 341839 650141 459952 2489 -473567 -565579 -460480
13954 -460480 -234515 -93404 41358 246531 546079 295767 -52709 -76242 152477 -105245
13944 -105245 -75430 262514 349861 248961 38709 -28879 48740 242885 285713 452540
13934 452540 699484 615341 380681 423477 502660 282997 45158 253028 127656 -264909
13924 -264909 -337580 -369105 -374714 -134707 -39769 405411 522617 465819 332124 350043 599838
13913 599838 423546 131133 -29706 -216704 110624 265169 409174 432390 234144 7668
13903 7668 305544 303673 68228 -79637 -253744 -118780 -123050 -84018 5763 -68785 -322311
13892 -322311 -391205 -242487 -39846 150119 265384 260830 198523 -27664 -31463 202689 283775
13881 283775 -40224 -301988 -362893 -263939 -148001 -216613 -226943 -91966 45876 -27501
13871 -27501 107417 375175 442195 178661 43014 117059 43591 35695 405298 350449 188725
13860 188725 378354 310565 119065 17234 -169292 -219426 23325 153434 -84332 -192047
13850 -192047 -13670 163260 129601 214096 345900 189256 -69102 -22728 104968 254647
13840 254647 166888 87004 300340 488109 542891 483204 424697 250095 160746 255717 520677
13829 520677 375882 -21769 -102574 -57287 -41704 -140129 -96609 149335 414375 149111
13819 149111 6638 28054 123684 238951 253521 251467 346407 566012 866393 716027 458152
13808 458152 237700 52296 47570 279720 307497 277713 185082 162268 188866 291295 336972
13797 336972 171288 31468 113365 155851 107116 264877 346537 128588 63903 216198
13787 216198 179926 185377 -64883 -376492 -214544 -190518 -111490 -209296 -217113 -12416 118551
13776 118551 -88817 -136444 121071 132289 28813 -351094 -308370 -295084 -113671 -78645
13766 -78645 8135 -7298 114445 341672 280570 60882 142229 190952 106797 -97987 17134
13755 17134 303583 440203 555358 325422 188053 -43903 -157446 7428 215298 306524
13745 306524 263993 103520 16239 39884 -132101 -441829 -419310 -290248 -78678 -130091
13735 -130091 -125663 -156769 -119056 -11829 -72220 57994 299416 381242 463466 285681 -30574
13724 -30574 -268329 -45540 202432 122532 99239 145314 9414 -57752 -148874 -39537 113942
13713 113942 87251 170584 205387 61880 -77458 -84404 -101331 -73935 35999 222364 106838
13702 106838 9506 167445 8388 27303 102983 72641 188951 98014 248436 379825
13692 379825 265074 513662 572537 458138 398225 318924 372538 236283 71479 221173
13682 221173 505379 640991 474288 338646 329764 390655 404516 365146 -144687 6398
13672 6398 368336 263320 121674 -12880 25609 186915 345526 181417 384612 203175
13662 203175 -90003 -181460 3680 -57531 -280576 -460290 -308505 -122202 169326 212477
13652 212477 511476 695452 504825 364843 228999 111317 196556 103435 -19970 -70471
13642 -70471 -163006 -129422 -91673 107274 376829 361037 128022 223430 181181 61103 -136917
13631 -136917 58197 267815 271977 395082 383273 384141 556612 511105 346046 413142 741761
13620 741761 431336 125271 24597 239265 234790 251191 127155 379663 491716 347129
13610 347129 300250 -9402 -39170 29141 172106 343488 403991 614017 646243 434664
13600 434664 -34844 -564448 -454584 -36522 152507 322800 252417 142420 299563 412945
13590 412945 381189 147430 86836 -45003 -86569 -1784 -17232 -156390 -232629 -251748 -58022
13579 -58022 -155379 -1270 117385 93843 105657 22469 24250 118553 112016 277040 391842
13568 391842 340995 299246 59831 30045 233360 380904 186025 -116973 -49931 86685
13558 86685 221356 129660 -42463 -97444 -40176 111456 116983 -3343 19827 -91953 -33487
13547 -33487 95921 54104 327406 289479 61884 -46325 -236217 39274 41950 -164987
13537 -164987 -266218 -426506 -373031 -136054 97734 291688 280550 212674 189034 332218
13527 332218 272882 341610 358956 310257 415105 552319 686535 614932 492803 245984
13517 245984 44931 171308 269412 282725 353946 280445 201014 271594 52750 -154861 -96559
13506 -96559 10565 -90374 -61326 110372 134784 39450 14783 84750 -53229 -232370 -164497
13495 -164497 129668 213863 368647 349510 165705 235828 312415 324862 361531 485635 723360
13484 723360 803388 917397 875549 545120 484758 707660 512179 383417 670613 870801
13474 870801 682133 606242 510662 287300 430100 369200 305196 189384 257645 247056 81965
13463 81965 114033 83790 87662 97844 103830 228791 151100 123140 64676 123017 9963 -104041
13451 -104041 -56597 197322 400176 314423 14230 -122643 -167569 -102710 -100258 11379 19535
13440 19535 264263 73704 -60541 -160615 -10180 164913 170448 8710 -221070 -276732
13430 -276732 -236751 -14902 265232 42693 -228361 -121241 -48397 124421 473183 368980
13420 368980 89160 321679 398643 420258 185541 119737 233084 578053 764747 626403
13410 626403 344852 186440 177843 238001 542616 479142 228451 69597 -16656 5738 16407
13399 16407 -24385 146373 290989 382239 293440 225486 260669 -4974 -161524 -45092 11848
13388 11848 327227 595304 647160 304586 7396 -80299 50225 188785 -133034 -97670
13378 -97670 67140 51975 120185 140032 284924 369973 450755 328231 504067 434259 533306
13367 533306 426313 341947 -69525 -133876 -211606 -523882 -360960 -268 86086 254821
13357 254821 46086 95507 258845 355624 419694 389130 300111 201268 231710 285878 284454
13346 284454 168973 157377 241935 253614 178631 157025 267624 389234 533182 430182
13336 430182 397900 369784 490918 472625 299957 287332 376654 474712 558251 443018 624090
13325 624090 878695 609709 376367 151887 26855 -166896 17406 73945 195917 327543
13315 327543 286077 267663 188255 160867 232378 472886 528804 614763 728046 448898 234395
13304 234395 96194 150795 228340 412258 456203 228033 -85483 32576 238346 404190
13294 404190 544248 698609 751919 609533 364834 286768 347057 393792 649861 478174
13284 478174 306661 116438 -282789 -327453 -171599 -100276 -162463 69912 197582 161641
13274 161641 93083 105976 26276 -77921 -240805 -215120 -61649 62526 337635 451143
13264 451143 112243 -112110 -172434 -176078 -98703 -47086 24251 136919 326154 436423 577163
13253 577163 254423 -19901 -113491 -198714 -107693 76015 52006 170314 342930 496167
13243 496167 341033 2542 -51038 44107 223271 -8781 -2320 -127801 -229629 -150183
13233 -150183 394605 682459 459519 199756 61895 2575 18783 258786 350361 91351
13223 91351 215388 235047 126925 -59512 -218399 -37632 116646 81203 150980 14545
13213 14545 -94796 150457 242255 137056 239510 139239 108746 40455 -15276 153217
13203 153217 289188 273448 330824 421946 236676 305446 567741 360901 77807 -290143
13193 -290143 -479789 -302719 -100307 59239 -222783 -351147 -409585 -248903 -47394 -215065
13183 -215065 -88801 70279 46435 117628 137620 46299 -132302 -9586 242629 226482
13173 226482 37998 -93669 105991 232239 260704 207986 167863 79901 69233 111644 177760
13162 177760 364767 499862 349761 296777 394408 620851 619066 665238 637177 643596 595636
13151 595636 656406 607696 512896 520304 491141 431918 325359 143926 164340 -34942 123526
13140 123526 431765 184788 192016 390094 376044 205812 362511 393736 285854 289944 140757
13129 140757 -11432 82831 297189 361049 337541 266683 231782 67147 -1735 174997 278511
13118 278511 356963 650774 857744 890313 852937 703452 688904 795738 702069 646123 636589
13107 636589 487193 224249 -32305 45181 201804 448399 545790 475336 505619 588149
13097 588149 570386 420666 455432 485372 197925 107919 211231 411159 431302 450284 456922
13086 456922 348845 170525 252230 359514 514561 341178 131161 334347 530448 232074
13076 232074 12054 99150 384101 330352 20980 -22206 62135 219275 336671 210684
13066 210684 58829 109334 -129639 -144665 81397 185754 334732 598365 626963 454632
13056 454632 77819 -138784 -21830 175926 310479 389832 271538 406737 429353 400194
13046 400194 695174 696042 436339 210066 289475 403136 517350 543892 517983 514065 602290
13035 602290 626096 760353 695717 389078 148680 -145086 -20938 206484 164999 92205
13025 92205 233822 392352 510958 483839 318528 482191 604411 707884 624645 407962
13015 407962 119288 5102 89053 145357 60342 -66723 191299 568146 641529 375379
13005 375379 251596 195767 310102 195405 170310 280531 459881 622027 295854 346923
12995 346923 293329 236326 83817 118482 176401 370175 446242 113922 -129841 -291499
12985 -291499 160822 138646 133244 262715 316911 467362 578268 773095 805111 807717 711998
12974 711998 388128 351943 483635 390620 149461 256639 522458 498529 483523 393672
12964 393672 395639 506856 572155 860214 1024160 644039 151257 98765 98368 160877 79032
12953 79032 -71086 -29437 48612 476628 417296 247902 365497 792791 773272 537058
12943 537058 505421 609719 646031 498744 550016 432951 493720 573221 403867 370456 428573
12932 428573 447343 714529 770277 439346 266223 403466 517354 891381 751074 611594
12922 611594 515986 627287 885579 1107411 856981 731039 799742 1023031 888338 799243
12912 799243 881401 1230345 1614316 1673647 2050530 2978489 4071247 4876202 5179816 5109496
12902 5109496 4465021 3730716 3201588 2657740 2279715 1842645 1445589 1320323 1105843
12893 1105843 906449 824891 763064 929477 873404 720038 620959 776469 563968 464174
12883 464174 292774 266025 512338 650154 653144 598634 685665 944015 926783 668330 701444
12872 701444 645959 532236 482774 581209 711997 777881 704304 441655 508975 461763 602797
12861 602797 939257 765518 558642 357532 536807 548346 233052 179079 346050 330784
12851 330784 256414 338752 386174 363020 541210 565657 437004 652653 983551 765859
12841 765859 540274 563788 641388 601653 652030 473341 507036 355363 401097 617492 555415
12830 555415 517957 672116 863800 849799 824618 475315 672851 696914 770079 813235 798952
12819 798952 850339 781881 774076 713385 624109 723252 736237 773918 714181 741780 972663
12808 972663 827026 508001 278314 579148 897633 1241535 1021438 668078 634858 797680
12798 797680 814899 819002 848759 825499 554790 497084 343413 508097 695307 976838 1035523
12787 1035523 751994 637153 486515 169332 22461 75800 7354 119419 266541 484684
12777 484684 506302 525946 396352 325895 325593 387469 535544 648275 838434 1072599 889625
12766 889625 803648 578243 772391 653457 506502 490591 615325 633961 755985 1000009
12756 1000009 883793 670050 476695 733903 716386 765802 1114698 1148331 1073575 1046344
12746 1046344 923838 809817 844163 1227208 1201273 977051 739344 793053 768639 798915
12736 798915 724775 887170 886788 565666 439197 259814 176750 275624 413560 454867 455402
12725 455402 504279 492712 506336 357194 322987 319213 463901 490034 382807 205049 352634
12714 352634 510744 506203 361735 330673 358893 393111 421996 259096 61020 209707 597849
12703 597849 765028 923162 1300006 1405593 1066576 985835 1168433 1367031 1207637 936852
12693 936852 859128 954471 940996 1023644 1127981 1023043 859473 761150 922481 1003025 740648
12682 740648 501130 438422 459587 759237 1116760 1172042 1253438 1106236 1011889 923025 815936
12671 815936 722803 750204 825586 845349 941908 1015404 1005191 698237 557964 728168 1034776
12660 1034776 928764 987593 1107786 940737 687818 527681 580492 585508 684075 554045
12650 554045 564129 542400 423428 596010 892559 1187943 1380721 1244113 1042050 1322665
12640 1322665 1479488 1373749 1234467 1087183 914533 918642 837829 804694 900181 946015
12630 946015 820782 935448 1064277 966368 955664 1245651 1284336 1099295 1021247 1276672
12620 1276672 1360121 1133941 928266 948004 1174950 1150629 1207459 1310019 1239647 1195445
12610 1195445 1407168 1378741 1039277 979129 1073994 1143044 1385103 1415855 1400290 1584022
12600 1584022 1300105 1070506 1029229 899166 843068 1158569 1187101 939742 802593 853783
12590 853783 816151 948217 913289 1096339 1131023 1220337 1192237 971459 834886 926081 1054867
12579 1054867 1209098 1181194 1028761 1176031 1267234 1447024 1315273 834930 605562 923404
12569 923404 905385 1239056 1468039 1275714 1195940 1390122 1213506 1286402 1136558 848799
12559 848799 867608 760771 794310 1067323 1355345 1395963 1298301 1266020 1384609 1171093
12549 1171093 1085153 1130022 1116225 1235209 1180102 1050358 957516 902641 879167 883204 992488
12538 992488 1174914 1233072 1252599 1368009 1338822 1567356 1624623 1552644 1397036 1206660
12528 1206660 1065402 1034798 1112715 1183127 1201836 1191080 1134083 985295 855055 1046203
12518 1046203 1253561 1408941 1404963 1436051 1331355 1353480 1293192 1333340 1537634 1830919
12508 1830919 1733390 1452591 1407413 1423015 1608001 1531098 1526352 1494718 1592778 1811439 1821107
12497 1821107 1518232 1166501 1228720 1337851 1403675 1361444 1159571 1092539 1139160 1474680
12487 1474680 1656636 1376664 1195517 1531483 1709616 1612430 1254169 1048758 1000545 1148069
12477 1148069 1177142 1136130 1287671 1252128 1372225 1349842 1378872 1331532 1371030 1391722 1574115
12466 1574115 1319313 1547836 1888103 1757326 1642790 1894143 1864476 1710286 1517404 1501897
12456 1501897 1357037 1352074 1386058 1600791 1651677 1765703 1701291 1743838 1630938 1675740 1743921
12445 1743921 2021070 2182277 2211212 1907380 1661112 1560188 1480850 1396069 1573465 1747871
12435 1747871 1725084 1610123 1821044 2107897 1984088 1921641 2041733 2004445 1957055 1748489
12425 1748489 1643089 1652976 1658191 1837931 1955128 1832704 1392728 1497590 1915237 1809899
12415 1809899 1744385 1859295 1999829 1708666 1802234 1881010 1904675 1842540 2017976 2067265
12405 2067265 2113134 1886315 1702877 1792459 1941717 1911340 1793783 1908355 2158337 2240142
12395 2240142 2062568 1933316 1951100 1769088 1849015 1908910 1886879 1667139 1614958 1602963
12385 1602963 1659424 1916569 1945054 1922690 1720096 1772204 2030949 1991017 1779991 1889296
12375 1889296 1745096 1834100 1895884 2011352 1821633 1764844 1860481 1822886 2136036 2138827 1920793
12364 1920793 1748393 1809683 1838719 1962986 2096364 2362347 2484069 2462489 2253135 2323005
12354 2323005 2531776 2370032 2251352 2301409 2262812 2335885 2467716 2761659 2644943 2541091
12344 2541091 2584749 2417985 2325077 2340603 2192188 1968645 2034133 2279699 2388565 2323729
12334 2323729 2584558 2792494 2558047 2205913 2237743 2358219 2369078 2166594 2153425 2332920
12324 2332920 2304009 2225980 2270970 2449013 2575118 2610153 2648202 2524794 2521666 2522425 2310534
12313 2310534 2409317 2390984 2428463 2788610 2945363 2635223 2486449 2494722 2375636 2365075
12303 2365075 2606183 2952191 2947111 2918158 3058125 3121253 3029106 3142261 3303218 3210940
12293 3210940 3326240 3506374 3417099 3161680 3006658 2896954 2681288 2591607 2663004 3016249
12283 3016249 3033098 2851589 3088607 2976490 2691163 2753896 2740853 2722806 2918878 3244402
12273 3244402 3310867 2875789 2800300 3160959 3209853 3329663 3497702 3557051 3389222 3272341
12263 3272341 3087025 3035930 3361007 3475922 3522156 3379546 3429069 3469592 3437219 3385898
12253 3385898 3352504 3342753 3290014 3411268 3365057 3213630 3096351 3079412 3343971 3457147
12243 3457147 3421489 3680031 3765904 3588787 3712895 3922488 3906831 3963666 3749418 3868142
12233 3868142 4000667 3934880 3934620 4022478 4059961 3973717 3902326 3815304 3947520 3964421 3968887
12222 3968887 4020352 4116263 4081336 3862941 3622146 3361992 3389512 3714893 3901502 3971978
12212 3971978 3896264 3959289 4046015 3990774 4261282 4423891 4241714 4007403 4041461 4170657
12202 4170657 4343278 4401177 4519489 4593837 4359470 4180662 4292806 4298841 4199040 4196034 4038637
12191 4038637 4007913 4163154 4442309 4133684 4092159 4507273 4505640 4524413 4771844 4802495
12181 4802495 4739279 4562230 4444224 4529779 4488608 4684283 4876306 4724681 4894962 4884027
12171 4884027 4916413 4710111 4457780 4411443 4737904 4875951 4801990 5102489 5041243 5055966
12161 5055966 5096282 5058862 4912843 4875414 4728055 5010670 4988324 4974611 4829001 4885095
12151 4885095 5066609 5154294 5442284 5109416 4996747 5168770 5409809 5503763 5388134 5303119
12141 5303119 5499867 5683491 5656151 5564497 5632121 5524855 5721017 5636666 5602472 5563938
12131 5563938 5837457 6087349 5951768 5758742 5677351 6086496 6103943 6037423 6077903 6123725
12121 6123725 6143367 5938434 5855771 5950352 6213139 6286638 6223695 6166671 5875969 5699513
12111 5699513 5896559 6034588 5801654 5773525 6115130 6058708 6048064 6154198 6106191 6148132
12101 6148132 6049688 6047831 6028632 6284624 6444152 6645959 6942096 7061085 6698413 6516826
12091 6516826 6708631 6544168 6502709 6456458 6438427 6359681 6348871 6602279 6908487 7021116
12081 7021116 7014655 7158386 7061406 7074189 6812736 6630097 6688681 6425824 6335701 6693680
12071 6693680 6844922 6896397 6903508 6787987 6894017 7165298 7313289 7135316 6760456 6900985
12061 6900985 7038077 7311927 7352782 7512412 7579186 7661074 7815966 8046884 7995052 7958184
12051 7958184 7836226 7871219 7664391 7681676 7692421 7566339 7575801 7768580 7958535 7756340
12041 7756340 7790117 7863131 7722428 7724572 7995139 8008241 8088710 8128162 7946923 8141876 8482920
12030 8482920 8548568 8504361 8508566 8557816 8327520 8241676 8558795 8418291 8281128 8234579 8298733
12019 8298733 8109084 8104093 8212217 8263045 8242125 8388442 8321436 8216902 8265929 8400024
12009 8400024 8488956 8486078 8479025 8809358 8827380 8648018 8707191 8721529 8614568 8534058 8765899
11998 8765899 8953376 8955046 9035278 9018639 9072537 9055264 9269798 9365304 9194892 9185943 9274392
11987 9274392 9279027 9155989 9070808 8979788 9084875 9015405 8830882 9079741 9139908 9379467
11977 9379467 9294234 9023708 8978551 8911931 9260201 9212565 9214155 9419236 9256493 9476683
11967 9476683 9730841 9468771 9136065 9146983 9449337 9512656 9507036 9272151 9219204 9102373
11957 9102373 8976436 9049841 9013928 9108435 9315863 9183806 9213565 9331398 9246433 9091872
11947 9091872 8995711 9241817 9422604 9403203 9428534 9523725 9475680 9442443 9595239 9475417
11937 9475417 9302085 9396411 9541457 9645606 9531641 9414769 9466406 9241768 9100489 9219847
11927 9219847 9200132 9146659 9039368 9201073 9156629 8958271 9046083 9226295 9355673 9626604
11917 9626604 9581553 9242123 9131400 8946416 8834903 8786117 8918867 9373323 9340571 9402335
11907 9402335 9256084 9087149 8877127 8831596 8886537 9164093 9304856 9378329 9531179 9523139
11897 9523139 9334508 9343026 9083184 9133074 9430460 9421150 9614419 9834043 9845260 9690463
11887 9690463 9709310 9724327 9409668 9043640 9007219 8859300 8881775 8929616 8835342 8748152 8939502
11876 8939502 9006518 8739842 8782802 8798075 8708509 8664208 8663311 8731472 8748108 8681736 8459166
11865 8459166 8402378 8542765 8719659 8727705 8756386 8671418 8584781 8807942 8740362 8612177 8506177
11854 8506177 8348197 8342366 8238468 8318845 8421797 8639438 8526093 8254563 8050768 8064372
11844 8064372 8195584 8142203 8124243 8019384 7843197 7797680 7771137 7771519 7919394 7864786 7768367
11833 7768367 7917269 7986217 7935130 8027091 7867311 7858806 7836576 7962137 8005689 7942397 8038882
11822 8038882 7708841 7560076 7694983 7752737 7728120 7540246 7521028 7684107 7703550 7757497
11812 7757497 7921547 7877969 7730834 7916905 7824902 7687074 7475921 7423621 7497860 7533656
11802 7533656 7576888 7509190 7584468 7529883 7376288 7324957 7190330 6987404 6710062 6758134
11792 6758134 6936548 7195787 7401469 7043498 6848096 6717514 6748477 6895866 6797490 6465040
11782 6465040 6402320 6537245 6352375 6301654 6562237 6565013 6475882 6590563 6906217 6886777
11772 6886777 6705406 6569523 6759172 6671060 6120979 5902647 6088555 6313732 6443733 6403157
11762 6403157 6204975 6144408 6191175 6302925 6004391 5799467 5886464 6050070 5992022 5810996
11752 5810996 5606513 5512306 5677464 5461676 5810843 5743959 5855708 6024499 5808081 5550118
11742 5550118 5461063 5458863 5510769 5724620 5732840 5673711 5969894 6188958 5866679 5470813 5341080
11731 5341080 5217826 5252406 5275311 5345011 5037537 4877920 5069848 5323191 5153292 5097112
11721 5097112 5172495 5186913 5225785 5326516 5354554 5188833 5133969 5148547 5257807 5411666
11711 5411666 4982065 4655332 4924142 5403860 5507636 5318987 5072693 4911485 5010950 4668749
11701 4668749 4601395 4647667 4795809 4754113 4847278 4850356 4324747 4227453 4282559 4441532 4698662
11690 4698662 4981771 4821569 4646612 4557535 4554423 4560194 4632331 4428302 4404157 4420259 4583286
11679 4583286 4707015 4546875 4258736 4324738 4451924 4293887 4069042 4033418 4090752 4545281
11669 4545281 4586980 4364984 4346094 4264525 4063187 4065352 4165728 4188754 4308376 4178489
11659 4178489 4124323 3963899 3798496 3713106 3626914 3692528 3886478 3932062 3985057 3847725
11649 3847725 3775517 3855572 3769944 3655741 3874055 4003042 3950169 4028093 4214771 4165838
11639 4165838 3906175 3776429 3742014 3733406 3970759 4282957 4225001 4036258 3788902 3843232
11629 3843232 3792982 3663482 3603765 3743805 3694076 3429158 3447463 3536692 3736873 3875311
11619 3875311 3625972 3349715 3202316 3051954 3019035 3182539 3354968 3280382 3364594 3340159
11609 3340159 3174328 2986973 2922484 3066656 3299615 3559425 3782999 3639428 3161358 3022060
11599 3022060 3065143 3042364 3056444 3317107 3429242 3265917 3253977 3184316 2925733 2548186
11589 2548186 2575608 2775266 2846272 2454510 2342327 2489552 2840775 3110682 2854699 2637949
11579 2637949 2792653 2805016 2809111 2798781 2574498 2632451 2830277 2753124 2553030 2621286 2467033
11568 2467033 2207414 2189501 2155454 2256449 2579148 2595256 2501858 2394799 2548742 2896990
11558 2896990 2925683 2961348 2831675 2752726 2828002 2861962 2953729 2876924 2603158 2236037 2214687
11547 2214687 2205616 1970503 2148297 2295817 2404539 2870121 2986950 2657934 2699206 2703994
11537 2703994 2619189 2554173 2436420 2438332 2384581 2019447 1950221 2048148 2027064 2340224 2631749
11526 2631749 2826204 2669507 2550308 2521979 2466031 2461505 2658680 2424814 2150621 2451305
11516 2451305 2743827 2558041 2417254 2572815 2572162 2575259 2470966 2402305 2455000 2325724 2106484
11505 2106484 2298642 2338471 2292598 2271659 2123707 2136692 2135952 2182826 2120576 2040664 1930972
11494 1930972 1881995 1933460 1665130 2037688 2259795 2176545 2009486 1811241 1770208 1923523
11484 1923523 1837353 1841898 1875906 2081659 2124533 2274128 2153039 1921063 2077103 2086584 1798488
11473 1798488 1872976 1880998 1920263 1909152 1865634 1708190 1704839 1571798 1533312 1628709 1836273
11462 1836273 1877514 2056039 2233963 2359225 2402964 2267120 1962340 1821180 1509940 1661064
11452 1661064 1894035 1934598 1946845 1714763 1660852 1926232 2206468 2227620 2134983 2027445
11442 2027445 2233077 2436512 2149113 1898992 1615440 1610450 1814442 1738071 1635424 1666619
11432 1666619 1736056 1769235 1581451 1386883 1565255 1730562 1594505 1542213 1565335 1699154
11422 1699154 1743445 1656073 1613368 1496078 1396925 1254782 1206650 1476501 1647273 1556728
11412 1556728 1402705 1562651 1543334 1440675 1699193 1947566 1719093 1602646 1613178 1464477
11402 1464477 1434500 1470953 1543746 1580586 1910045 1903863 1863669 1603009 1440044 1267812 1088067
11391 1088067 1117120 1160390 1158108 1213999 1165131 994428 1208757 1330293 1354735 1135049 1220357
11380 1220357 1443413 1523990 1715734 1692140 1553580 1285529 1335423 1147064 928872 1031533
11370 1031533 1335372 1198558 1144870 1031857 959308 1027710 981423 1356825 1496435 1365555
11360 1365555 1414896 1436915 1504954 1433606 1383506 1587867 1417992 1194300 1051340 1100149
11350 1100149 1019771 1034136 947079 762237 747706 635092 660103 772601 898022 1041055
11340 1041055 1010408 1150393 1071232 909451 1046150 1225563 1225086 1171507 1346943 1166930
11330 1166930 916534 881000 940734 961782 1165279 1298235 1362808 1222604 1111190 1099051
11320 1099051 1018401 1121586 1254810 1248379 1065506 1005435 1151894 1215745 1258672 1379521
11310 1379521 1246340 1048049 1035424 1397559 1731068 1730429 1557735 1392772 1254668 1218600
11300 1218600 1484422 1380535 1166804 943436 837311 667052 871368 1102218 839770
11291 839770 920915 1011825 995263 1025135 1154808 1007331 959875 1099678 1212885 1081974
11281 1081974 950851 810025 790845 927783 683342 250135 341443 548247 616400 508256
11271 508256 739302 956076 1190763 1173696 1008677 647297 544563 541782 525572 696921
11261 696921 699120 610161 668937 674652 614064 857634 777972 712691 886730 1046744 1009152
11250 1009152 812813 929114 1294007 1063937 587246 767629 861887 843297 921843 764248
11240 764248 712416 723686 685949 1110743 1377277 1281186 942300 860062 572429 339853
11230 339853 266149 496438 699515 798683 780691 866149 1017024 1265105 1257223 1259031 1029295
11219 1029295 562010 608688 986008 1063694 960264 1166583 950032 801033 585093 716460
11209 716460 1017834 943226 717344 507114 564395 646016 557241 367833 711185 657827
11199 657827 790821 811700 866782 936569 667382 863767 835093 657410 667129 811665 962473
11188 962473 735726 613725 708490 614409 513379 679536 783104 665986 631431 633873
11178 633873 568323 594367 730887 519921 497908 534637 498091 495458 604005 716939 817265
11167 817265 681819 855731 1118834 1296761 1171464 1027792 1033550 924617 824880 734976
11157 734976 670658 848945 857128 716877 446329 555024 624962 836033 855056 449092
11147 449092 547898 706724 634640 707902 719654 485359 201546 360707 625915 778590
11137 778590 708930 623000 598533 639936 709096 673944 451288 444941 542759 727493 894452
11126 894452 897179 1049730 648773 513451 610646 543608 293008 423848 847447 885183
11116 885183 829487 751319 438576 346175 352987 623408 824491 800415 774614 893329 948931
11105 948931 823423 791147 815774 728660 796768 754085 522390 426315 479076 470737 558422
11094 558422 636795 795650 828723 909218 968024 794645 616667 506723 497471 363639 418346
11083 418346 599264 473204 248773 145566 240691 297182 428373 590819 485342 361834
11073 361834 359069 529399 533811 782540 931763 940615 982735 998646 904296 872722 963008
11062 963008 906599 568428 551233 627131 675288 502382 487244 461756 487168 435504 419071
11051 419071 539097 547870 349126 669576 929709 1143286 1106777 1200742 1111483 1001394
11041 1001394 930605 1087287 1214205 1424893 1494713 1504619 1691867 1553127 1468253 1846957
11031 1846957 1956969 1877087 1831765 1474425 1393984 1563041 1473811 1763406 1761030 1977866
11021 1977866 2106935 2462296 2558380 2448242 2423375 2248713 2020400 1822871 1704416 1670519
11011 1670519 1459853 1466530 1657418 1984165 1873141 1979924 1877238 1713066 1478532 1388074
11001 1388074 1152429 844331 672247 465210 239498 434979 426875 63001 145095 164247
10991 164247 -55760 149084 70672 5546 387541 404279 114786 187293 396226 506800
10981 506800 366512 447825 370736 233876 171520 250987 77142 59730 21077 140769 171132
10970 171132 107145 -256609 -112998 300843 518852 468976 435150 367112 295698 319516 299991
10959 299991 247290 450752 637124 382744 373051 490099 637941 621425 477573 324860
10949 324860 199534 50435 35889 94184 -133744 -130236 65564 254809 240929 112733
10939 112733 94428 161411 200070 305392 -44035 -315364 -335844 -165378 59505 39050
10929 39050 -31348 -89713 -18337 160868 117041 163135 101257 -43715 125207 215630 7720
10918 7720 -88397 109078 279751 37687 -239548 -133614 34143 206217 213988 26512
10908 26512 67373 243209 276011 261908 244562 110015 14104 163974 51955 8026 139188
10897 139188 -68120 -266595 -302710 -199745 -124440 -94990 -89546 -201311 -192637 119953 304457
10886 304457 283494 262652 238682 204326 217179 90017 131963 257732 253217 45524 140744
$$ [...]
##END NTUPLES=NMR SPECTRUM
##END=
