##TITLE=Analysis number 321167
Compound Code cc 53401
Book Reference 472/171/3
Project Code adrs
Chemist Name victoriam
##JCAMPDX= 6.0         $$ Bruker NMR JCAMP-DX V2.0
##DATA TYPE= NMR SPECTRUM
##DATA CLASS= NTUPLES
##ORIGIN= Bruker BioSpin GmbH
##OWNER= nmr
$$ XWIN-NMR		Version 3.5
$$ Wed Jul 26 15:54:55 2006 GMT Daylight Time (UT+1h)  MAYBRIDGE\nmr@NMR_250MHZ
##.OBSERVE FREQUENCY= 250.131544655141
##.OBSERVE NUCLEUS= ^1H
##.ACQUISITION MODE= SIMULTANEOUS (DQD)
##.ACQUISITION SCHEME= undefined
##.AVERAGES= 16
##.DIGITISER RES= 18
##SPECTROMETER/DATA SYSTEM= dpx250
##.PULSE SEQUENCE= zg30
##.SOLVENT NAME= DMSO
##.SHIFT REFERENCE= (INTERNAL, DMSO, 0, 16.522)
##AUDIT TRAIL= $$ (NUMBER, WHEN, WHO, WHERE, WHAT)
$$ ##TITLE= Audit trail, XWIN-NMR		Version 3.5
$$ ##JCAMPDX= 5.01
$$ ##ORIGIN= Bruker BioSpin GmbH
$$ ##OWNER= nmr
$$ C:\u/data/dgb/nmr/ADRS/3650/pdata/1/auditp.txt
$$ ##AUDIT TRAIL=  $$ (NUMBER, WHEN, WHO, WHERE, WHAT)
(   1,<2006-07-26 15:54:32.90 +100>,<MAYBRIDGE\nmr>,<NMR_250MHZ>,
      <created by zg, POWCHK disabled, PULCHK disabled
       configuration hash MD5:
       E2 DF 36 D8 04 B2 41 60 5A D7 A3 38 5A 4B D0 FE
       data hash MD5: 64K
       6F CD AC 8B A3 3A 0F 1A F6 80 5C A6 2A 28 71 FA>)
(   2,<2006-07-26 15:54:46.76 +100>,<MAYBRIDGE\nmr>,<NMR_250MHZ>,
      <Start of raw data processing
       ef LB = 0.3 FT_mod = 6 PKNL = 1 SI = 32K 
       data hash MD5: 32K
       65 27 43 4D 8F 42 DD 86 B7 BF 6C 74 DC F0 6D AA>)
(   3,<2006-07-26 15:54:48.32 +100>,<MAYBRIDGE\nmr>,<NMR_250MHZ>,
      <apk 
       data hash MD5: 32K
       D2 FB 9D B8 C9 F5 CF 9F AF 11 B7 F3 A2 98 5E BE>)
(   4,<2006-07-26 15:54:49.05 +100>,<MAYBRIDGE\nmr>,<NMR_250MHZ>,
      <abs ABSG = 5 
       data hash MD5: 32K
       16 EE E7 A3 52 BF 3F 55 4E 90 40 26 56 5D 43 A0>)
$$ ##END=
$$ 
$$ hash MD5
$$ 16 61 4F 27 A0 61 E8 19 BD F7 86 EC 4D 35 13 8A
##$RELAX= 
##$RELAX= 
##$RELAX= 
##$RELAX= 
##$RELAX= 
##$RELAX= 
##$RELAX= 
$$ Bruker specific parameters
$$ --------------------------
##$DU= <C:\u>
##$EXPNO= 3650
##$NAME= <ADRS>
##$PROCNO= 1
##$TYPE= <nmr>
##$USER= <dgb>
##$AMP= (0..31)
100 100 100 100 100 100 100 100 100 100 100 100 100 100 100 100 100 100 
100 100 100 100 100 100 100 100 100 100 100 100 100 100 
##$AQSEQ= 0
##$AQ_mod= 3
##$AUNM= <au_zg>
##$AUTOPOS= <37 >
##$BF1= 250.13
##$BF2= 250.13
##$BF3= 250.13
##$BF4= 250.13
##$BF5= 500.13
##$BF6= 500.13
##$BF7= 500.13
##$BF8= 500.13
##$BYTORDA= 1
##$CFDGTYP= 0
##$CFRGTYP= 5
##$CHEMSTR= <none>
##$CNST= (0..31)
1 1 145 1 1 1 1 1 1 1 1 1 1 1 1 1 1 1 1 1 1 1 1 1 1 1 1 1 1 1 1 1 
##$CPDPRG= <>
##$CPDPRG1= <>
##$CPDPRG2= <>
##$CPDPRG3= <>
##$CPDPRG4= <mlev>
##$CPDPRG5= <mlev>
##$CPDPRG6= <mlev>
##$CPDPRG7= <mlev>
##$CPDPRG8= <mlev>
##$CPDPRGB= <>
##$CPDPRGT= <>
##$D= (0..31)
0 1 0 0 0 0 0 0 0 0.06 0 0 0 0 0 0 0.0002 0 0 0 0 0 0 0 0 0 0 0 0 0 0 
0 
##$DATE= 1153925672
##$DBL= (0..7)
120 120 120 120 120 120 120 120 
##$DBP= (0..7)
150 150 150 150 150 150 150 150 
##$DBP07= 0
##$DBPNAM0= <>
##$DBPNAM1= <>
$$ [...]
##$SUBNAM6= <"">
##$SUBNAM7= <"">
##$SUBNAM8= <"">
##$SUBNAM9= <"">
##$SW= 20.6930455092707
##$SWIBOX= (0..15)
0 0 3 0 0 0 0 0 0 0 0 0 0 0 0 0 
##$SW_h= 5175.983436853
##$TD= 65536
##$TD0= 1
##$TE= 296.16
##$TE2= 300
##$TE3= 300
##$TEG= 300
##$TL= (0..7)
0 120 120 120 120 120 120 120 
##$TP= (0..7)
150 150 150 150 150 150 150 150 
##$TP07= 0
##$TPNAME0= <>
##$TPNAME1= <>
##$TPNAME2= <>
##$TPNAME3= <>
##$TPNAME4= <>
##$TPNAME5= <>
##$TPNAME6= <>
##$TPNAME7= <>
##$TPOAL= (0..7)
0.5 0.5 0.5 0.5 0.5 0.5 0.5 0.5 
##$TPOFFS= (0..7)
0 0 0 0 0 0 0 0 
##$TUNHIN= 0
##$TUNHOUT= 0
##$TUNXOUT= 0
##$USERA1= <user>
##$USERA2= <user>
##$USERA3= <user>
##$USERA4= <user>
##$USERA5= <user>
##$V9= 5
##$VALIST= <valist>
##$VCLIST= <CCCCCCCCCCCCCCC>
##$VD= 0
##$VDLIST= <DDDDDDDDDDDDDDD>
##$VPLIST= <PPPPPPPPPPPPPPP>
##$VTLIST= <TTTTTTTTTTTTTTT>
##$WBST= 1024
##$WBSW= 4
##$XGAIN= (0..3)
0 0 0 0 
##$XL= 0
##$YL= 0
##$YMAX_a= 438402
##$YMIN_a= -500945
##$ZGOPTNS= <>
##$ZL1= 120
##$ZL2= 120
##$ZL3= 120
##$ZL4= 120
##$ABSF1= 16.522
##$ABSF2= -4.171173
##$ABSG= 5
##$ABSL= 3
##$ALPHA= 0
##$AQORDER= 0
##$ASSFAC= 0
##$ASSFACI= 0
##$ASSFACX= 0
##$ASSWID= 0
##$AUNMP= <proc_1d>
##$AZFE= 0.1
##$AZFW= 0.1
##$BCFW= 0
##$BC_mod= 0
##$BYTORDP= 0
##$COROFFS= 0
##$CY= 12.5
##$DATMOD= 1
##$DC= 0
##$DFILT= <>
##$DTYPP= 0
##$F1P= 14.0000005364418
##$F2P= -0.99999901652339
##$FCOR= 0.5
##$FTSIZE= 32768
##$FT_mod= 6
##$GAMMA= 0
##$GB= 0
##$INTBC= 1
##$INTSCL= 1
##$ISEN= 128
##$LB= 0.3
##$LEV0= 0
##$LPBIN= 0
##$MAXI= 10000
##$MC2= 0
##$MEAN= 0
##$ME_mod= 0
##$MI= 0
##$NCOEF= 0
##$NC_proc= -5
##$NLEV= 6
##$NOISF1= 0
##$NOISF2= 0
##$NSP= 0
##$NTH_PI= 0
##$NZP= 0
##$OFFSET= 16.522
##$PC= 1
##$PHC0= 154.622
##$PHC1= 13.05141
##$PH_mod= 1
##$PKNL= yes
##$PPARMOD= 0
##$PSCAL= 4
##$PSIGN= 0
##$REVERSE= no
##$SF= 250.13
##$SI= 32768
##$SIGF1= 0
##$SIGF2= 0
##$SINO= 400
##$SIOLD= 32768
##$SREGLST= <1H.DMSO>
##$SSB= 0
##$STSI= 32768
##$STSR= 0
##$SW_p= 5175.98343685301
##$SYMM= 0
##$S_DEV= 0
##$TDeff= 65536
##$TDoff= 0
##$TI= <Analysis number 999999
Compound Code 99
Book Reference 9
Project Code 9>
##$TILT= no
##$TM1= 0
##$TM2= 0
##$TOPLEV= 0
##$USERP1= <user>
##$USERP2= <user>
##$USERP3= <user>
##$USERP4= <user>
##$USERP5= <user>
##$WDW= 1
##$XDIM= 32768
##$YMAX_p= 302873797
##$YMIN_p= -958507
$$ End of Bruker specific parameters
$$ ---------------------------------
##NTUPLES= NMR SPECTRUM
##VAR_NAME=  FREQUENCY,     SPECTRUM/REAL,   SPECTRUM/IMAG
##SYMBOL=    X,             R,               I
##VAR_TYPE=  INDEPENDENT,   DEPENDENT,       DEPENDENT
##VAR_FORM=  AFFN,          ASDF,            ASDF
##VAR_DIM=   32768,         32768,           32768
##UNITS=     HZ,            ARBITRARY UNITS, ARBITRARY UNITS
##FACTOR=    0.157963299565203, 1,           1
##FIRST=     4132.6476996994, 0,             0
##LAST=      -1043.33573715361, 0,           0
##MIN=       -1043.33573715361, -958507,     0
##MAX=       4132.6476996994, 302873797,     0
$$ Real data points
##PAGE= N=1
##DATA TABLE= (X++(R..R)), XYDATA
$$ [...]
19422 24956 -211367 -455118 -192506 -222953 -126206 -52070 -174226 -113847 -153824 -234591 -55875
19411 -55875 243703 203405 133922 274357 208070 330725 387713 466121 227726 -160439 -269302
19400 -269302 -252048 -241880 18984 123799 -147080 -123315 57465 194997 -71686 -4495
19390 -4495 141649 155052 67624 61531 26680 -86579 17214 34709 24905 -36138 60104 189760
19378 189760 -33970 -482948 -575666 -283862 -315772 -370271 -259869 -135426 -177053 -69688
19368 -69688 -114912 -105007 -93740 -74844 -326886 -325388 -134680 115353 207998 28957 5377
19357 5377 -271157 -399548 -149600 12086 301920 352541 352111 352157 96513 -300639 -353813
19346 -353813 -401497 -479385 -432254 -208600 -58030 -224192 -51122 -67399 -81950 -44400 -167849
19335 -167849 -30413 -110269 -96119 11872 54460 118533 64639 25580 -43628 123440 69566
19324 69566 -92578 -147082 -66365 99676 30366 40431 4609 -71854 -212509 -360197 -219788
19313 -219788 -194932 -467925 -523464 -392689 -370581 -122265 206407 165445 16377 -371104
19303 -371104 -170254 65279 -29521 -37961 99824 234739 141412 183173 178719 -30431 29406
19292 29406 88290 62437 -63006 -235850 -92168 -247133 -466891 -281752 80326 69349
19282 69349 -65402 -281634 -315396 -118204 -23339 -113147 123714 -9265 143326 37649
19272 37649 -57429 61711 -176301 -114472 -154920 -183726 69241 389876 526748 496968 376734
19261 376734 430847 297512 37617 -54404 2536 226687 270249 231749 -84931 -119772 -307079
19250 -307079 -331295 -284575 -223829 -362209 -192438 135329 344250 258724 262187 140683 128913
19239 128913 25723 54847 122763 156251 121398 178177 205593 -49802 -173394 78969 258837
19228 258837 231046 62740 -3483 115716 166748 -35977 -27904 26853 -148808 -74343 190539
19217 190539 99387 -176896 -147806 14318 90125 200891 281045 111877 -187334 -59587
19207 -59587 -51754 5727 56254 28034 307766 460360 238705 83574 -92493 -22835 50366
19196 50366 -3982 -43765 -21681 -85674 -245436 -229385 -157468 -149704 -223382 -330102 -86593
19185 -86593 -27363 -58184 -246935 -474195 -470277 -377030 -388454 -214163 -184769 -556066 -450903
19174 -450903 -165702 -294090 -106484 -12177 -54797 -77304 -271662 -453092 -557214 -660818
19164 -660818 -824471 -711452 -425682 -179164 -161129 -68650 53718 109090 83157 117846
19154 117846 90257 38245 -133230 -443590 -410959 -360542 -267619 -280010 -217056 80301 -24926
19143 -24926 -103792 -329104 -269991 -232098 -343309 -384066 -387099 -391250 -288123 -296483 -246902 -53567
19131 -53567 -272725 -592876 -518028 -351896 -307619 -315804 -201388 -126330 -157123 -133744 128403
19120 128403 293266 82180 99041 153506 -111867 -230410 -280702 -108675 71926 37642
19110 37642 -135838 -190928 -129269 -184479 -227774 -369140 -302637 -271115 -117040 -52586 3218
19099 3218 208926 183423 22865 -98160 -153066 58164 -101243 -58644 8007 -197355 -293964
19088 -293964 -193618 19704 17800 202860 418838 207664 148441 -30721 -165821 -216422
19078 -216422 -362456 -521861 -472604 -374544 -528780 -690392 -536867 -360933 -201029 -227819
19068 -227819 -434263 -555568 -398002 -318906 -197254 -201324 -91042 22025 64555 -33565
19058 -33565 -355662 -596206 -357442 -71737 -28538 -4603 225761 386739 187706 186911 207039
19047 207039 440283 496159 354282 228849 107871 57392 109845 247540 229334 133843
19037 133843 -57182 153652 157406 186991 227662 303525 222561 37196 -86775 -22395 114244
19026 114244 -76113 -44718 179262 170878 107063 70146 -216890 -379800 -332654 -47610 -132467
19015 -132467 -217038 -435 125173 -68561 -396031 -261970 -242146 -136549 -112690 2481
19005 2481 -19324 236882 457315 389388 111371 -28082 57741 27581 -53918 -5036 105501
18994 105501 128087 -22519 -69657 -119096 -105459 -37319 -10489 -78285 -93252 -326840 -236046
18983 -236046 1482 21990 69909 98798 82623 407301 464936 426711 523996 666651 752402
18972 752402 490998 181120 82176 167690 329114 413774 449651 519288 502556 504535 355415
18961 355415 293803 189778 190183 211672 108060 -163568 -351742 -109009 109806 150441 189599
18950 189599 76803 101416 -119468 41367 96418 294552 716291 947542 781506 527069
18940 527069 658387 389574 11867 112397 232069 8221 -105715 -53261 49052 329890
18930 329890 410458 444088 351916 359618 111872 -161978 -38294 -167134 -381328 -366160 -321759
18919 -321759 -297144 -185496 -139663 -42525 19855 -61777 -191603 -290244 -343326 -301347 -215095
18908 -215095 -29972 290631 274529 146060 167949 289498 538177 515523 289929 131540
18898 131540 -195788 -318606 -368311 -332715 -367193 -478527 -469123 -235267 -50602 215523
18888 215523 192613 142583 97063 -59794 -50539 -101213 -184017 -169844 82774 177960 -36085
18877 -36085 -17071 54534 -28084 -160674 -236427 -111967 133175 74837 -163454 -421176 -501925
18866 -501925 -437390 -644538 -672801 -436197 -250512 -105356 184536 131662 -97324 -341527
18856 -341527 -420452 -223527 60411 135539 79897 -105507 -170844 -16973 24358 -268608
18846 -268608 -513964 -469166 -321839 -311620 -378768 -49645 88680 -15212 -165495 -165474 -293002
18835 -293002 -472578 -389814 -211411 -52049 54622 47325 -99191 -305462 -183727 78746
18825 78746 166010 109953 54432 -58189 -260979 -14364 260330 269980 256506 309513 498
18814 498 -163049 -49721 -142345 -210964 -264085 -184305 -214557 -74887 -193013 -258178 -133325
18803 -133325 -206171 -28455 84579 56088 -130499 -103073 -170385 161797 312617 380635
18793 380635 215782 -72169 -147116 -123131 -65317 -140202 17524 46537 117548 423598 290508
18782 290508 118921 -55808 -160798 -254245 -511883 -559111 -467955 -417762 -194441 -138432
18772 -138432 -30995 50985 108380 -10369 -232356 -153973 -152527 -156732 -78067 218885 219742
18761 219742 360785 306607 199128 -24928 -276520 -358278 -173832 222687 233856 237701
18751 237701 85977 91034 374886 282032 211692 162214 240142 168632 5410 2454 -159924
18740 -159924 -237626 -48591 -132665 -395509 -237019 75773 190463 242021 286213 353431
18730 353431 388802 301950 166551 86224 -99903 -22561 74800 281284 381816 354953 67531
18719 67531 43375 73828 130201 -95035 -60821 102501 -92544 -31409 338396 201482 190600
18708 190600 128893 -5311 -126351 -122459 -96091 14363 98603 -24557 -263532 137426
18698 137426 250823 30169 -18627 -29109 50457 36839 -118596 -5676 16624 -72501 10959
18687 10959 -63863 -163067 -97087 7253 7734 156460 420630 195331 -44067 -208225 -93100
18676 -93100 -152132 -228296 14050 -139360 -261196 -157843 -256120 -186461 -142744 -118046 179985
18665 179985 70074 -121590 -87004 271 54611 71822 -19998 -25432 -163108 -279975 -101368
18654 -101368 -110465 -324139 -165919 57821 112377 69119 -5900 16585 -83947 -93815 117728
18643 117728 186602 162822 495409 570001 516611 532977 734809 728122 372078 -30145 97082
18632 97082 146632 -5041 248793 259723 412154 402029 145764 119365 109792 75724 3511
18621 3511 288364 135183 117408 46587 -60348 -45057 67220 395099 554961 480469 387200
18610 387200 315283 295452 167703 244532 186574 243774 258229 459738 404866 327991 325975
18599 325975 314962 289607 341361 214489 207873 240331 427446 540323 265195 -22874 -214616
18588 -214616 -101758 -150221 10295 237070 298003 86348 -93333 -15053 148034 178183
18578 178183 20421 -140052 -186732 -96431 -4339 399785 594927 513593 399398 295712
18568 295712 584416 492914 148996 49783 15992 275452 619955 658140 476481 223739
18558 223739 184952 284047 131688 -18386 144549 322085 309680 192924 72027 10410
18548 10410 70663 172653 197229 310987 270116 162618 232541 222642 265541 530268 488834
18537 488834 555214 651135 776907 811248 872477 769139 460197 481683 731313 606053
18527 606053 527830 583645 504451 338189 443352 467485 457944 439402 366407 263966 422337
18516 422337 802089 921845 1013046 939245 712684 646921 443697 610697 835213 682217
18506 682217 622568 979328 1104294 1025683 900109 935615 773763 916811 708905 666727
18496 666727 592211 686948 975753 853687 744955 821462 1102138 1231822 1417723 1524302
18486 1524302 1584908 1623810 1674754 2047164 2334420 2162306 1951247 2226072 2338517 2276666
18476 2276666 2288610 2507133 2739513 2921370 3036139 3033915 3060549 3124021 3218184 3261704 3473083
18465 3473083 3749235 4128334 4432900 4943626 5373469 5685377 6122139 6607830 7229240
18456 7229240 7935321 8616187 9582929 10633481 11966580 13633973 15504097 18216536 22009248
18447 22009248 27373670 35464040 46537436 57873115 63837099 62926366 59324112 56580509
18439 56580509 55838610 57414194 60936888 65606747 67407203 59639190 46257933 35518752
18431 35518752 28965782 25138161 23047673 21963662 21519332 21592273 22145406 23219341 24783230
18422 24783230 27184631 30931414 36590769 45052510 56002540 66097337 69542832 66614972
18414 66614972 62352109 59520763 58619391 60096662 63211068 67033563 66426654 55793159
18406 55793159 41357236 30651087 23896870 19698022 17013397 15133390 13793337 12562749
18398 12562749 11635012 10853174 10074108 9393277 8727282 8178598 7671258 7193674 7032119
18389 7032119 6717816 6195824 5978530 5551358 5172555 4940384 4772465 4590765 4519026 4506936
18379 4506936 4353951 4090464 4022488 3635898 3476251 3508278 3404735 3263248 3228059 3062221
18369 3062221 2761080 2494372 2343607 2230146 2329284 2539821 2467855 2230562 1958559 1738589
18359 1738589 1780148 1764306 1610119 1668164 1512322 1531619 1367875 1470749 1545817 1571104
18349 1571104 1518100 1427487 1194840 992760 881740 877279 777735 1119137 1394249 1345805
18339 1345805 1128315 1136172 956056 778872 725272 754668 711018 784539 948356 843415
18329 843415 590793 349381 190453 290649 363263 345035 363327 361335 446979 162059 56702
18318 56702 88967 132051 217073 172286 48542 227396 268303 449697 334821 282291 303237
18307 303237 174356 185343 279363 420409 379722 193699 142861 183069 169118 -179486 -53784
18296 -53784 119449 123493 -22696 -22485 -127289 -145726 -111944 -19843 -30657 -171673 -90875
18285 -90875 15475 106065 113318 -129698 -254302 -50689 186411 340813 466896 400273
18275 400273 39109 31158 108584 -84428 -167329 -173395 -349852 -205097 121385 39095 120660
18264 120660 115472 41348 -87771 -22107 161395 -20922 256464 121466 -209723 -281541
18254 -281541 -228558 -143552 -326416 -570087 -524755 -141343 156392 278075 219131 9463
18244 9463 111923 115283 154295 8002 56711 189299 7609 -303316 -286965 -187423 93230
18233 93230 -18741 70399 -77560 -229308 -257671 -260275 -66715 44718 -77846 -100338 -256513
18222 -256513 -93975 -162100 -313749 -235191 -321720 -177708 -87403 -64935 -22733 37064 120469
18211 120469 146904 276987 274700 9039 -199873 -145045 -219189 -273275 -487901 -402129 -319206
18200 -319206 -255280 -154830 -140000 -205849 -89914 -50231 -124466 -194885 -292962 -475213 -627815
18189 -627815 -487371 -229762 23557 62774 20888 -15556 -74590 -61690 -254113 -209044 -245208
18178 -245208 -218840 -196739 -137840 -435210 -511723 -358847 -165742 -148718 61403 -45272
18168 -45272 -197430 -290277 -329822 -450519 -660678 -523349 -499250 -74016 69910 47245
18158 47245 -21021 -103998 -77203 -177261 -273183 -65942 16258 -66743 21461 46095 -4759
18147 -4759 -65063 -8037 -130302 -122168 -211676 -253343 -333829 -36061 86379 -42420 -88662
18136 -88662 -131752 -331780 -266087 -68485 -38270 -71736 -106320 -73011 -62799 75031 51487
18125 51487 -68719 32147 57630 191382 120998 216691 134185 -116983 -292546 -484357
18115 -484357 -444919 -222019 -216234 -106117 71893 131149 -4361 -161737 -389286 -183108
18105 -183108 -80813 -322363 -291832 -299447 -295168 -155907 -167988 -258608 -11675 20020 -34633
18094 -34633 62779 85514 29080 198797 -125223 -244984 -244031 -312998 -219426 -369032 -485267
18083 -485267 -397882 -103209 -36120 -146752 -168828 -263991 -402441 -249033 76552 43563
18073 43563 77320 76691 318349 339704 95068 27129 93250 68976 106393 104088 36970 -361392
18061 -361392 -101140 -23514 -7465 55974 -48308 -152043 -541950 -708262 -643476 -464649
18051 -464649 -23012 99475 46431 -178752 -325204 -351573 -204174 -10351 70882 161009
18041 161009 142662 231719 151801 91741 182020 88019 -137903 -125837 -78189 37461 -34400
18030 -34400 -103152 -208468 -201893 -189749 -198783 -225267 -300904 -301092 -277418 -364209 -364485 -184936
18018 -184936 -11624 196455 304446 -55674 -248350 -76807 -278974 -323094 -244670 -131548
18008 -131548 -101074 9842 -97598 -313808 -319987 -253044 -257658 -134500 -38410 -82525 -185256
17997 -185256 -85623 -238484 -467269 -366059 -174981 -148288 -299141 -304583 -319151 -223109 -8074
17986 -8074 -163360 -313896 -358517 -240878 -54073 210325 142466 35775 37111 -13851 -62290
17975 -62290 -45429 35063 -10597 -231681 -340516 -223116 -334461 -433446 -516442 -575924 -503227
17964 -503227 -641334 -512960 -184306 -56550 122165 -177279 -484039 -401944 -215041 -35137
17954 -35137 51558 -5656 191640 284112 305546 161043 92296 6030 40622 113216 47920
17943 47920 -50503 -45587 1200 54177 60844 -205836 -139322 72542 14905 -46761 -112567 -343299
17931 -343299 -444920 -367182 -188679 -120354 32778 -52490 70659 79857 44590 -69365 -231756
17920 -231756 -518298 -584597 -504242 -441791 -171395 19005 28301 -96237 -167421 -141867 -205527
17909 -205527 -195788 -91096 -208852 -334450 -302530 -101599 266790 603649 475663 202434
17899 202434 252088 303477 324563 524591 468345 251480 264637 310188 161268 180784 234813
17888 234813 254141 132041 7344 -120737 -67742 24778 148717 200748 125097 191702 225264
17877 225264 143376 191635 225810 491649 399252 328546 2653 -179303 -36428 521 202000
17866 202000 263370 -66645 -330690 -113879 53647 90811 6841 -125803 -29040 -131225
17856 -131225 -329312 -241060 -25561 -109691 -23769 150258 -23164 -125414 -226886 -226265 -91598
17845 -91598 -229282 -189734 -86587 99841 158459 73228 -30964 -299557 -372477 -162925
17835 -162925 41749 -13004 -294671 -192534 -238729 -96091 72215 21588 -170942 -92483
17825 -92483 82300 109362 -97625 165190 169870 129375 235010 321982 240762 50919 32877
17814 32877 -50426 -112251 45593 40833 63157 247425 317030 145479 32048 177890 216248
17803 216248 -97073 -312776 -530138 -454523 -12179 218143 168482 105931 -198500 -300242
17793 -300242 -161941 -184918 -388802 -399579 -345969 -389785 -361386 -198145 -190094 -432062 -606509
17782 -606509 -837608 -776940 -749349 -679170 -575572 -448696 -280893 -160604 -228711 -276174
17772 -276174 -37186 -83851 122450 292883 287665 242555 -34959 -52543 -160913 -259716 -318529
17761 -318529 -181434 -93482 -110883 -196282 -266715 -260334 -126095 -298636 -406762 -458129 -446736
17750 -446736 -205741 -85400 -265213 -353595 -199884 -136887 36544 -133858 -76443 68697
17740 68697 -105072 -139843 116620 96047 -22913 -232677 -473167 -328268 -99086 109517
17730 109517 85630 -16703 205622 259142 106872 -96260 -315298 -331979 -381262 -428898
17720 -428898 -315059 -229468 -229005 -254385 -69440 -17696 -28165 63296 287111 346330 262252
17709 262252 254296 210191 24540 -140933 -258051 -256176 -107794 107118 -42871 -250142
17699 -250142 -281238 -188087 -182716 -263922 -124390 8982 -58016 -9569 -28292 -169485 -224767
17688 -224767 -103928 -176049 -258867 -200822 -102588 -112813 -168771 -111371 58714 107420 -53424
17677 -53424 -292217 -91075 110399 150546 -136196 -161161 -287359 -189001 -6916 3283
17667 3283 81022 199316 -75675 29752 86112 -2915 -140848 -478320 -331991 -95425
17657 -95425 -27846 228136 298008 149665 -14474 87559 159120 2526 -255377 -254503 -105048
17646 -105048 -29196 70711 106163 -6678 45914 -72425 -103048 -134626 -88545 55973 -122502
17635 -122502 -380891 -230118 79442 42273 -122806 14336 273822 403154 318226 255840
17625 255840 221157 -193615 -377092 -425990 -195283 -210931 -249 46914 -185310 -284078
17615 -284078 -341547 -307406 -200494 -50315 -9897 130100 153300 -154316 -245191 -338747 -230208
17604 -230208 -120367 -366609 -569995 -614511 -306574 131089 365752 395540 -49916 -163340
17594 -163340 -133943 -271526 -308332 -284670 -111773 -228070 -208064 116476 210023 162752 68914
17583 68914 38701 -57201 -313118 -330453 -14855 49058 20615 53181 -97833 -65851 41005
17572 41005 -65201 -185091 -251308 -154794 -379276 -560104 -514601 -374004 -187956 -111935
17562 -111935 -229991 -299756 11857 234749 233342 179736 214841 316545 7498 -98166
17552 -98166 -251382 -144107 83047 276623 227687 166050 -92534 -174064 -7287 -45789
17542 -45789 -495927 -440366 -169040 -333731 -521552 -392839 -204 47431 -90462 -79068
17532 -79068 -99670 -61874 -55386 -197335 -182477 -96160 -142951 -238179 -239472 -715309 -730031 -551089
17520 -551089 -61647 91959 30455 134004 33407 -120389 18772 202398 113901 430281
17510 430281 193038 17355 -7190 -68078 -47943 113071 100371 -29958 -156599 -174330
17500 -174330 88661 28514 -141653 -100733 -65292 -80734 -109523 -141154 -38748 -81559 -152249
17489 -152249 -81971 -138878 -213497 -118347 -131663 -234270 -509658 -334463 -3108 -118918
17479 -118918 -126632 43121 131804 -130720 -269746 -408835 -255611 -189599 -53848 -95898
17469 -95898 -209414 -82507 -53103 -280986 -394577 -358187 -312072 -170180 -3338 -12100 -115456
17458 -115456 -345334 -215118 13513 -142865 -244713 -89041 -80548 27129 133079 9081
17448 9081 111397 11997 -253367 -234881 -203061 -285847 -421411 -465938 -436271 -124935 -132046
17437 -132046 -260506 -344169 -358550 -450272 -240786 -149769 -65139 287735 436744 334406
17427 334406 174333 61054 -25952 -90930 -73981 -96351 -337647 -251912 -255229 -367806 -403021
17416 -403021 -77370 64786 53073 141664 40239 53011 -78358 -146241 -98802 50296
17406 50296 26870 -19369 100156 222851 218650 164925 129468 259389 238362 16928 134647
17395 134647 131779 61719 44694 89586 -5140 130564 197011 311951 -90352 -315017 -120128
17384 -120128 -160482 -192500 1602 94935 -61230 -188022 -8590 80525 367854 391531
17374 391531 399975 181207 7789 68553 -53551 -62969 -126938 151654 274119 487938 603095
17363 603095 690242 366796 500313 765882 840542 595773 517034 748005 785157 693815
17353 693815 732570 677623 482382 553496 481405 492460 231471 97493 285033 405706
17343 405706 369174 153852 219769 482225 758477 913597 1186801 1311101 1160047 1065800
17333 1065800 1114477 1247348 1624945 1667413 1740206 1750547 1869401 1784150 1430216 1044634
17323 1044634 794143 742097 622478 473408 425634 560066 619296 479250 402252 400820
17313 400820 163178 -288929 -186829 11244 118421 156146 225046 337430 404991 239340
17303 239340 7304 -175861 75435 265148 162698 -44695 8321 288197 460891 440356
17293 440356 430856 297803 210221 223781 146226 72678 96910 -288485 -175767 -127185 -47107
17282 -47107 -163290 -207840 156311 271319 145656 169726 415004 201517 -106266 -15934
17272 -15934 98262 355763 233091 211297 182113 -37066 -274299 -269132 -228404 -80689 31430
17261 31430 37283 -24599 -229444 -151865 -44427 78827 65501 192449 2661 -84356 -146186
17250 -146186 -268902 -336701 -426922 -402352 -320862 -288135 -39388 50997 3142 -125964 -138745
17239 -138745 -213702 -129029 178432 215847 117181 -106798 -15923 162318 185946 475188 468347
17228 468347 290814 227492 142857 -71108 10822 262600 684375 575311 624 -112233
17218 -112233 -125281 -136776 141957 9388 -666919 -708525 -465840 -320805 -240104 -67573
17208 -67573 -202897 -320891 -356542 -191853 -190362 -284547 -388851 -379895 -472802 -402916 -171703
17197 -171703 136123 240428 437960 346210 95267 -18975 125462 190403 -24650 -78902
17187 -78902 -19202 231940 280457 184341 -2435 7652 -251229 -302932 -242753 -301012 -281180
17176 -281180 -87884 -81028 -17828 -174528 -115278 8421 16485 -36694 60936 35156 165894
17165 165894 103003 255453 219518 -13395 -270425 -89096 48557 -85051 -123050 -76294
17155 -76294 -161453 -288282 -443012 -279821 2011 128112 252966 214429 69872 -67762
17145 -67762 -69096 -255096 -259156 42419 92292 -339892 -479189 -397650 -57383 196200 345551
17134 345551 394046 359952 97654 -68832 -144031 -323867 -305751 -26179 -56792 -189159
17124 -189159 117846 -63820 -56350 74132 -31443 -127019 103730 226133 -14978 178611
17114 178611 188796 223890 395259 418617 465423 465923 676823 464575 -12655 -361112 -341933
17103 -341933 -164280 60069 -66140 -151913 134534 -119606 -43861 -109799 -232776 -128382
17093 -128382 -113693 336520 404686 311457 87982 -194566 -241976 -288851 -287105 -182564 28135
17082 28135 -15504 -63862 -315243 -386149 -171649 -158041 58853 271537 206325 -216899 -223055
17071 -223055 -115769 32801 204525 118637 41479 -59974 -13444 49538 -281604 -246136
17061 -246136 -171427 -223745 -117501 56904 51708 13063 -103871 -125017 87745 29703 209220
17050 209220 240258 49603 -127400 -167508 -88126 1619 28586 82429 -101785 -159799 -46777
17039 -46777 -141139 12216 116700 22825 -172549 -189544 105421 345880 514064 609787
17029 609787 561140 590666 633851 494128 668397 750979 538715 448980 255967 48533
17019 48533 142675 44938 -116002 43161 380484 535168 485346 387548 448779 179674 323311
17008 323311 418812 171604 24172 100105 152214 297382 482550 201261 72715 62432
16998 62432 191923 241981 380992 339364 119242 -71361 -188223 -355956 -262294 -167263
16988 -167263 -137193 -56795 -65690 289804 371744 378543 195602 -21411 -150986 -84400 -1325
16977 -1325 201723 245027 10324 -138475 50486 438168 452685 5871 -159749 -58124
16967 -58124 -49000 -164480 -212696 -172442 -28433 100976 47949 180163 216838 320589 522318
16956 522318 282454 152267 69745 23810 22574 36425 -29264 89568 152428 109784 365736
16945 365736 129501 -96925 -80683 -99578 -213640 -117878 39702 -113216 -284835 -283456
16935 -283456 -122934 93691 106041 129216 -77592 -225776 -87334 113052 -32632 -140868
16925 -140868 -155308 -76672 -308529 -206803 -151862 -293614 -86314 -68324 7686 129849
16915 129849 770 -141345 -43983 -98045 19146 163333 289320 154922 126196 -4230
16905 -4230 182265 125971 64962 201199 65741 72958 120770 96525 -154108 93019 165297
16894 165297 176462 159577 32079 -62309 -53703 -64410 2663 -243691 -267012 -117803 97405
16883 97405 262002 164624 23602 -121861 -138217 19056 195612 -24342 -170801 -102451
16873 -102451 107123 209996 -60522 -161983 -218396 -209698 -54571 238135 365110 384943
16863 384943 104193 -91057 81226 77521 -193 68714 -46324 -154128 -145864 70002 66661
16852 66661 -8257 -24387 -16623 38893 31079 181925 232389 280912 242222 232999 249843 184749
16840 184749 192361 299417 184726 12636 -21948 228327 343979 116498 -8629 47413
16830 47413 160199 327154 539258 564055 310689 76392 111167 -34418 -96489 -75745
16820 -75745 207393 228630 -172037 -366283 -279602 -203789 -194230 -66443 -125667 -102337 -36581
16809 -36581 172578 326217 238705 422052 269889 -10718 -119189 -145206 -186030 -138891
16799 -138891 42252 264688 470903 535181 497703 543655 320689 218913 332983 411359
16789 411359 236851 90412 82101 -180088 -53783 213506 177129 145479 -115666 -17075
16779 -17075 61855 90024 -24086 -20591 -77368 -120936 6876 1662 120711 318795 56572
16768 56572 7780 190017 398337 312213 159543 126976 148550 128036 117977 91904 -55913
16757 -55913 -101756 259135 406372 336617 44981 6157 -129624 -387401 -417647 -262502
16747 -262502 13462 19524 80980 217200 393691 514776 440538 314274 130221 -43172
16737 -43172 10703 6352 -199827 -89252 129219 306167 583933 640194 441277 194266
16727 194266 238612 145221 238147 311359 144734 -72931 -31743 193520 242357 16446 23458
16716 23458 231700 218989 258702 354950 108411 119565 27704 -160091 -360973 -279092 -191281
16705 -191281 86307 173667 242136 256320 171743 302773 162923 400678 529763 589723
16695 589723 391629 -115475 -272506 -233203 290339 388663 -492 -232577 -119092 78344
16685 78344 131981 124724 243872 177280 40927 39306 -49592 74652 33092 -108585 14109
16674 14109 78440 22024 295809 478774 274177 243541 212546 224554 103019 -12224 -159544
16663 -159544 -204796 -114705 -9990 -13003 27123 -105817 -140737 -156704 71867 -46006 -70703
16652 -70703 -75908 -149852 -360247 -344296 -208118 -34784 24850 141489 378582 480919 388116
16641 388116 105520 207455 390474 241799 110622 -158646 -296887 -100595 392915 566840
16631 566840 517097 304678 227548 219924 16691 -28937 23912 178595 292117 133265 330850
16620 330850 535121 312345 283751 183505 -3619 193261 215446 32921 -37892 182803
16610 182803 483897 617008 696757 576353 440297 224024 182740 323449 548374 624823
16600 624823 526582 374065 290945 328491 397104 397983 279535 229091 306910 442289 424924
16589 424924 438750 476145 384984 329948 366086 381573 114268 48307 -9669 242973 336266
16578 336266 201976 221293 429744 764456 758691 558895 453366 348069 282014 428434
16568 428434 664661 893155 986598 872964 787820 721912 729049 666364 1004283 1009909 886780
16557 886780 926391 1246175 1168821 925798 769284 706608 750347 697122 995699 1379330
16547 1379330 1645710 1435342 1369789 1395045 1748170 1823839 1604969 1307671 1340047 1599774
16537 1599774 1717111 1693249 1773938 1970385 1999361 1886335 2206681 2476797 2643808 2629530
16527 2629530 2527861 2583806 2868540 3056672 3286141 3592570 3640609 3965304 4573002 5077297
16517 5077297 5355655 5462605 5805974 6229054 6722432 7375979 8241311 9024027 9999122
16508 9999122 11493085 13150903 14993750 17545142 20951157 25481810 31630396 39576913
16500 39576913 48690060 56800486 61060428 61376554 59741244 58571892 58627625 59936273
16492 59936273 62331957 63922482 61880143 54895825 45214380 36374887 30159664 26556202
16484 26556202 23991875 22587226 21732464 21553620 22074360 23091263 24815955 27291915
16476 27291915 31152788 36531359 43228553 51253321 58701873 62722182 62760185 60714563
16468 60714563 58995439 58618906 59540132 61171827 62247354 59857024 52461789 42533610
16460 42533610 33152060 26186501 21592958 18731339 16754780 15078303 13687531 12304919
16452 12304919 11288325 10698736 10380237 9749603 8918353 8294091 7965700 7691585 7479087
16443 7479087 7108066 6804550 6782912 6640445 6291109 6433675 6308055 6015125 5518364 5283460
16433 5283460 5015043 5003081 4993260 4662882 4067114 3674423 3880003 3986906 3686931 3432336
16423 3432336 3164195 3115006 2957962 2887810 2931644 2990030 3027676 2970521 2755186 2659934 2497867
16412 2497867 2126760 1938135 1996116 1991489 2084408 2137155 2323680 2117364 1747273 1207286
16402 1207286 1197829 1334327 1355447 1196146 992491 898944 1029184 1226115 1107758 1012775
16392 1012775 960496 831351 866655 775213 741297 817953 1069237 781488 775031 744866 842923
16381 842923 737234 779674 687355 159827 90971 327265 513002 835295 1016195 971518
16371 971518 902734 1050629 964618 634437 536706 572700 727853 659440 642564 642784 721723
16360 721723 467040 392583 229987 67863 71290 233271 326102 363165 506870 474689 373875
16349 373875 232663 -42996 2537 270116 330669 351390 424295 113924 -12074 -52783
16339 -52783 161597 554349 232622 131183 325560 147638 4414 -27108 -26022 161984
16329 161984 307794 314974 284907 302226 -37258 -198330 -217968 -297124 -373144 -334802 -486975
16318 -486975 -495054 -504554 -154143 -2889 23487 141477 186682 159219 -52808 -145665 143850
16307 143850 201917 115289 195115 269334 368414 361927 273557 230916 115255 85953 255446
16296 255446 229559 11788 -43438 4032 69615 283920 305379 113220 -16838 157408
16286 157408 32294 -37896 -50961 -203293 -141190 21540 174742 332003 434589 391395
16276 391395 282429 -16971 34124 66529 87972 60444 30993 -38734 -43308 233411 285359
16265 285359 205800 -95494 -450471 -494429 -442969 -226826 19733 -116726 -119090 -48798 100290
16254 100290 -24716 77371 -173451 -144541 -28150 28198 -60475 -240348 -197259 42909
16244 42909 189602 107640 -73890 -210780 -206342 -433504 -462204 -219863 -34575 230775
16234 230775 430466 506016 407459 543061 597970 708020 718114 260901 -46664 -199845
16224 -199845 -215466 -45579 160812 -9566 -333110 -306168 93357 14117 -194394 -133205
16214 -133205 -40075 115698 215652 238855 451455 404896 252929 168639 263442 319435 212653
16203 212653 118448 157673 73011 8571 89095 -86218 -191299 -91909 42510 145911 97631
16192 97631 26544 -70788 -161049 -7754 116268 169566 325130 311905 52209 48844 165869
16181 165869 -40365 -104646 -196231 -196287 -124923 -158895 -216479 -92733 118202 56373 144436
16170 144436 113451 96897 119188 194312 154667 74206 -8940 15172 44654 22539 -125956
16159 -125956 -170700 -107532 10648 187089 115522 -173268 -40164 288690 96653 -206372
16149 -206372 -329845 -354078 -391331 -286399 -66876 1866 -23658 -180126 60299 -10934
16139 -10934 -100150 -51602 -175655 -173188 -229091 -475548 -576354 -506492 -406563 -231400 -47838
16128 -47838 122352 -104936 -295020 -97714 -93150 -276495 -294541 -253253 -376216 -389394 -306011
16117 -306011 -436322 -391371 -248124 -159054 80808 156778 211003 95793 -265723 -402583
16107 -402583 -176864 -28501 -42237 44570 220006 180152 -59345 -20792 118779 98775
16097 98775 4435 -93738 -160563 -177521 -120730 -128408 -386918 -350565 -191062 -44224 -64346
16086 -64346 -202597 -252760 360 -11967 -196947 -8707 -91367 -72950 -42280 27669 -100241
16075 -100241 -119896 -194933 -237628 105648 349021 244747 95581 275354 315292 140706
16065 140706 74086 139118 65326 147988 37726 68777 326515 194184 84611 112454 247991
16054 247991 211390 130894 302295 355400 314376 151502 69046 -4535 120656 287507 268446
16043 268446 185422 83816 -40874 -84765 143812 219184 183187 217976 354442 190576
16033 190576 85730 7977 38208 -135433 -61436 226862 448104 521471 262597 -27542
16023 -27542 115045 272744 313765 283320 162147 -80058 -306496 -447399 -456998 -353245
16013 -353245 -243461 20098 114199 59231 153612 150190 36835 -38681 805 193423 277526
16002 277526 32443 -205355 -172586 -97681 -2746 58548 -287131 -236471 -210217 -494263 -428998
15991 -428998 -156856 -58824 -330357 -439420 -301827 -78193 -110442 -69524 12267 169427
15981 169427 373120 538178 432703 358779 163034 -76576 -303481 -335132 -232532 -52392
15971 -52392 164194 253132 388007 242261 197400 238997 330583 420454 273114 226001 440260
15960 440260 569160 555664 429012 166505 218444 92151 60783 -44502 3431 271464
15950 271464 437130 453161 114081 52511 17197 -5964 -4794 -82884 133558 205211 313422
15939 313422 248671 277098 163353 17790 216 38167 93299 278976 247956 -42904 -107141
15928 -107141 143137 272734 267319 288258 101926 -77488 -204760 -264165 -222517 -70499
15918 -70499 -148018 13381 10377 151984 220984 81968 15054 -142590 -67914 -31135 -9944
15907 -9944 29473 122460 339034 314821 -65823 -337246 -184863 -46924 -212397 -304852 -376335
15896 -376335 -354222 -176383 -260739 -313934 -344712 -416644 -337260 103033 513565 572634 338601
15885 338601 392358 375371 293536 376590 399016 335167 490031 98735 -210282 -508885 -359608
15874 -359608 75080 300682 149626 -105910 -119155 -14204 16181 -63368 -164050 -393775
15864 -393775 -365486 -269483 -42163 64853 169810 136437 234538 29249 142033 118603
15854 118603 114549 82880 -86416 -209260 -201598 -84983 -131256 -119720 41321 -54842 -401891
15843 -401891 -349951 -154329 59997 163877 35780 -7412 -42165 75385 17690 -46621
15833 -46621 -228702 -451950 -422160 -526908 -270620 27840 -69807 -290363 -324544 -274719
15823 -274719 -430362 -479750 -327392 -328772 -558100 -561782 -356947 -269503 -363115 -518241 -665800
15812 -665800 -386434 -279540 -248796 35924 17498 17189 -207483 -329691 -326878 -54968 -113230
15801 -113230 -168250 -141405 -127111 157165 183026 138877 -144639 -158251 -146806 -154608 -162034
15790 -162034 -79227 -70900 218228 316523 36286 -160003 -104241 78576 177972 434311 296299
15779 296299 -3255 231195 275467 172386 67305 101756 270986 215262 82541 108952
15769 108952 6378 -26661 83785 105587 48289 -147291 -332878 -162864 -77511 -27778
15759 -27778 47926 147162 236912 400711 319045 -25131 5757 193688 -47287 -233364 59596
15748 59596 71739 156919 47739 30640 -41086 50355 141659 175228 -83915 -240047 -280900
15737 -280900 -364335 -532413 -573933 -148926 152569 29006 80028 120353 3900 -18109
15727 -18109 -115182 -227380 -118397 -31425 -107567 -46859 -106824 -271415 -152506 -212433 33886
15716 33886 233112 227960 306310 201438 233318 176772 78985 221848 475086 489836 450499
15705 450499 251718 208218 151426 -186505 -543678 -639711 -579713 -434957 -169497 -277604
15695 -277604 -295458 -225245 -228655 -341234 -477348 -588896 -542660 -371125 -301036 -356184 -376465
15684 -376465 -201701 -11236 -47819 -428659 -328516 -237633 -7177 75644 68950 197245
15674 197245 242757 -15927 -244975 -324284 -280700 -206983 -307498 -108909 15985 -121466
15664 -121466 -272731 -165807 -134887 -258101 -136088 -134835 -140032 -51741 -65741 -71843 -306038
15653 -306038 -418494 -220026 -97448 -7199 -7239 -35830 -247712 -206130 -206027 -238576 -9238
15642 -9238 -20242 -9141 -39615 -79315 -191399 -107832 -198786 -204553 -173902 -56383 16083 129535
15630 129535 14847 -5343 43642 -76537 -142535 20800 100636 -175645 -240990 -255321 -190814
15619 -190814 -205126 -150179 -272871 -196182 -230569 -153028 123050 299957 175254 29372
15609 29372 40823 -34697 -36217 -171182 22498 -17685 -55032 -268138 -227762 -282317 -231117
15598 -231117 -115193 -258276 4751 -29860 164666 63428 -58339 14385 152054 269175
15588 269175 436354 610184 359445 93946 207450 196133 70319 -56207 -161339 -69681
15578 -69681 30874 14009 -195439 -325253 -526202 -605161 -647011 -798371 -727654 -603695
15568 -603695 -452375 -684915 -840771 -805830 -566423 -186086 -67963 -47464 20872 -96460
15558 -96460 -224880 -85870 57144 -58326 -189196 -255936 -351600 -211579 -17811 1271
15548 1271 -95526 -26332 17023 -315591 -503181 -613689 -612831 -567154 -554892 -258172 -303407
15537 -303407 -258346 -121995 167452 75241 98062 29736 477733 544648 141598 -115199
15527 -115199 -106143 -98203 -108653 -133273 -198526 -271593 -445757 -625142 -771319 -484734 -528357
15516 -528357 -615253 -377911 -313880 -207283 -117191 -64804 -110306 -246603 -177909 -218877 -24225
15505 -24225 37234 231477 233666 223890 261233 318461 367462 -8503 -151489 31183 65074
15494 65074 39926 154744 138081 104983 -23242 -67812 -105463 47620 -32706 -95080 -199061
15483 -199061 -353590 -309595 -254173 -235318 -432485 -347436 -235711 -496222 -468768 -119535
15473 -119535 65390 214610 184728 97031 326994 473640 283329 111297 -203301 -263765
15463 -263765 -364433 -243764 36362 69610 147635 153099 138778 97848 -11338 -159520 -132511
15452 -132511 -197383 -87452 190283 167918 96423 31039 84647 276136 380894 340392 167492
15441 167492 7186 -19711 162329 277162 283447 357471 374748 200202 12398 -95481
15431 -95481 -12504 146288 310731 177385 -44348 101111 316266 270249 98033 284811
15421 284811 315730 297953 320848 177694 88835 252047 395702 385317 331734 280113 195327
15410 195327 348157 450842 480188 360271 154504 -82638 -64005 -108443 -134454 -132424 -182453
15399 -182453 -108192 241663 285266 278103 92280 -95412 -370786 -405707 -430925 -615964 -622329
15388 -622329 -320795 -42468 -68309 -143677 -5490 7190 44860 -9382 -46031 -47799 -47409
15377 -47409 -151854 -303384 -227276 -134305 -26026 235466 269251 193030 -103090 8986
15367 8986 205824 243604 139960 81961 -33702 28987 -53687 -116045 106397 -67869 -281937
15356 -281937 -262191 -320913 -255323 133291 228154 176572 304663 257886 -143394 -410266 -256679
15345 -256679 -124011 -133109 -265043 -422584 -400739 -118798 119511 96200 93602 142381 127896
15334 127896 140451 75980 28596 -47697 185944 354358 344375 287216 359901 148890 225374
15323 225374 191642 57473 -34897 46721 174082 400654 283612 14581 -110233 -73692
15313 -73692 -66455 2342 10676 -154423 -202263 -165640 19229 -106809 -255604 -346579 -182570
15302 -182570 -123757 -105988 -30197 130606 51457 39666 220148 300720 377496 522177 242350
15291 242350 159282 130931 82251 116543 223230 117942 31359 79208 69005 -23578 -101207
15280 -101207 -31754 -82248 -99144 -177667 -241133 -236063 -240097 -344958 -354149 -152416 -100202 -217218
15268 -217218 -130857 -196267 -240115 87794 47663 -18116 30164 267789 222548 -19452 -328621
15257 -328621 -398305 -397577 -411420 -192057 -10081 -199835 -301849 -273986 -290908 -302148 -245328
15246 -245328 -165726 -255993 -362780 -406118 -266244 -422405 -257222 -173014 -363914 -396195
15236 -396195 -240149 -285857 -287394 -201059 -237686 -240517 -272322 -199959 -65692 53134 -49882
15225 -49882 337 24827 -20907 -66029 69027 195474 405956 551700 377211 267520
15215 267520 233111 144551 146552 307162 324717 152033 -194677 -264029 8975 180648 147694
15204 147694 -51320 -276785 -169408 39035 40572 224774 344332 325491 558907 459269
15194 459269 321661 -64350 -350481 -323932 -265487 -389685 -252692 -44318 134693 347659
15184 347659 246166 -14534 20481 250728 315705 181724 133441 -7596 -220556 -413607
15174 -413607 -254608 -105082 -224513 -39379 -149098 -73072 166810 -22934 -264795 -237685
15164 -237685 -250720 -107358 -26763 4298 55907 196688 226873 168908 305570 441871 212938
15153 212938 140981 -81775 -105432 -182342 -156899 35908 182478 91573 187932 88773 36385
15142 36385 -52500 -348210 -248173 -106714 48003 5064 -82798 -35292 -71575 47547 -182758
15131 -182758 -417064 -187441 95996 39145 -97069 -74976 91482 192285 -5181 -94189
15121 -94189 -195140 -154905 -164755 -202766 -122767 55463 -145349 -306690 -337839 -267661 -122899
15110 -122899 -237717 -434944 -423003 -231904 -14146 32942 143885 301679 18407 -168767
15100 -168767 -271245 -163866 -22424 -182888 -36152 -29996 -130372 -245128 -399713 -311542
15090 -311542 -317669 -196085 -48203 -43996 -56381 81758 170214 161206 244520 -1807 -94686
15079 -94686 -147982 -452221 -231467 -49008 37894 -212623 27283 368381 474268 534307
15069 534307 386740 106413 47138 65851 45764 13807 -140069 -240722 -134933 -90614
15059 -90614 -146541 -203107 -257801 -391189 -232013 273080 545877 363596 328515 379720 175438
15048 175438 100913 172308 312925 105129 53578 205202 385 6372 159399 259201 256943
15037 256943 101689 -62393 -100630 -184451 -261699 -105576 248223 451748 365120 301924
15027 301924 270086 293982 243385 125592 -58759 -30655 189025 37420 -219097 64495
15017 64495 170560 387884 165498 120798 330282 353399 251574 252861 158666 67370 2730
15006 2730 115177 145788 47982 18927 -87324 -180789 -177373 -159029 -139402 -153811 25309
14995 25309 112997 30997 -60196 23853 35995 37134 -144557 -203838 -148138 -70662 61321
14984 61321 236761 264950 20848 -163601 -163142 -110098 25989 -44257 -100714 55155 -110075
14973 -110075 -278986 -124699 -295165 -446895 -198144 222502 328179 277727 32344 171158
14963 171158 82689 -252878 -218844 191802 285012 85081 -108965 -181168 -295119 -245981
14953 -245981 109035 299573 305631 287798 480119 392445 108593 -48911 -12606 112005
14943 112005 -207120 -264951 -297286 -82623 120669 50163 131300 40833 51338 -42539 -201768
14932 -201768 -109662 -22237 5106 28278 83653 58205 20843 241879 262061 433931 505731
14921 505731 208536 -121621 -116671 -26394 -186809 -269172 -81420 -99453 -387862 -375977 -83803
14910 -83803 -17780 -38058 -7743 133745 218570 137986 186231 215121 192113 44907 62409
14899 62409 131382 137321 169139 68250 196805 232901 220161 128940 209928 340655 256688
14888 256688 35840 -28690 2341 85776 154806 86854 -76089 -84201 -6760 -236828 -326316
14877 -326316 -369382 -252128 -100767 43473 104747 159125 249366 237862 47770 116631 325535
14866 325535 211378 219235 220123 102910 352902 380915 255913 114630 51955 240490 287909
14855 287909 102313 -7968 35681 146426 35439 78815 283917 -34923 -235899 -122392
14845 -122392 113181 -23321 -132065 136046 238326 226738 293700 331405 318226 578600
14835 578600 373402 176801 200701 260573 67764 -199575 -225216 -67249 -3020 114254
14825 114254 -27120 27996 28708 -106788 -354296 -337066 -450772 -439914 -323001 -454782 -397543
14814 -397543 -329287 -173028 -169489 -107692 -181874 -138554 101136 191860 67998 1875 54492
14803 54492 -16628 -166728 -28339 162264 -41629 -292708 -191201 -54813 327772 370368
14793 370368 34134 104854 251587 125989 -56011 17371 -150565 -127221 94769 92024
14783 92024 103471 292273 248884 -43228 -264103 -127425 -7559 235071 56772 -275103
14773 -275103 -166675 -27175 33796 85906 -61658 -5595 258985 99706 -249013 -400923
14763 -400923 -363326 -305742 -350869 -321107 -92307 -729 -20582 -92182 24642 128747 27589
14752 27589 -71189 -176832 -246954 -225594 4297 268435 417556 637720 768435 763308 528198
14741 528198 428295 274877 249548 43753 -149844 -280676 -408199 -400957 -286544 -356165
14731 -356165 -275485 -209686 -268250 -32828 150979 -4539 49003 -98512 -84552 -38329 -21351
14720 -21351 118845 60582 71769 37567 -31207 -20174 -3934 266610 381433 271722 180050
14709 180050 53057 -81320 6915 -105291 -166053 -113373 -19004 139136 158319 -29882
14699 -29882 -353463 -317179 -195042 -82396 -193221 -157134 -123518 -86894 68327 136630 156428
14688 156428 136907 -8198 -307112 -292233 114535 23306 62007 258824 104130 28854
14678 28854 -56657 148230 1345 -156180 299 120695 139545 174916 370845 368191 25076
14667 25076 -264627 -377203 -231851 18797 47878 140348 124786 88329 36376 -72999 -115687
14656 -115687 -97770 -149628 -175870 -80824 -39066 -30750 138552 157993 83808 -58204 -200610
14645 -200610 -234296 -383853 -276820 8444 2344 -94100 -107258 -114103 -155320 -244451 7635
14634 7635 376046 324314 103250 117321 279863 484529 299252 387644 566372 328673
14624 328673 -170153 -237140 820 117778 307431 302523 245493 277844 372709 528048 190654
14613 190654 -2597 62661 141475 7463 -109970 72887 -43365 90067 -46535 -64695
14603 -64695 -209213 -199581 -295340 -387277 -461790 -159555 73584 -108049 -120480 102892 -10622
14592 -10622 118706 25204 -178488 -47737 -46089 -45289 -71855 -68049 59026 -161966 -223747
14581 -223747 -63596 -87839 -79223 107738 112970 -585 164916 225948 -29364 -80299 -150862
14570 -150862 -356735 -473674 -465104 -263493 -103655 8672 41482 -99225 -198020 -180438
14560 -180438 -56949 11659 -13252 119771 157840 129188 139344 -8549 -62216 -164627 -59749
14549 -59749 279620 253329 63817 -251110 -482110 -479584 -220263 -192327 -215292 78718 221916
14538 221916 368998 365287 121329 270918 553216 456272 229607 95675 49813 -86374
14528 -86374 89597 425249 613447 559463 528834 528013 360694 146485 265947 242057 65522
14517 65522 106366 447562 306303 249237 315736 105076 -85374 -192460 -54604 82078
14507 82078 107672 379023 243004 70672 75609 300451 296632 20629 -190464 -37310 156131
14496 156131 115311 91021 101138 192221 219477 9721 -898 97606 -44287 65048 145626
14485 145626 -22605 -35953 -161852 -18084 158342 39033 56655 122123 200841 -23887
14475 -23887 55838 367251 369984 85738 200843 292621 122021 -4985 39982 89040 194995
14464 194995 88057 -32041 -34452 202493 372072 400098 310215 145282 -94712 -318270
14454 -318270 -96458 108965 107145 92413 18781 -46492 -254587 -73460 103580 244694
14444 244694 -42902 -68319 211060 400427 450294 324037 321052 192054 253366 311097 248874
14433 248874 214409 50351 -288565 -359637 -260076 -143166 50237 184566 95445 -96830
14423 -96830 -97500 -248126 -326089 -236371 -213749 -100393 -212461 -215295 -155029 -142945 -44923 218348
14411 218348 235775 114202 158791 88616 87276 98571 -68409 -295875 -407918 -103958 -282058
14400 -282058 -333310 -300263 -363678 -288652 -146882 202578 426887 368258 133267 268566
14390 268566 444472 396616 278877 57741 -148812 36380 185684 477117 321541 172013
14380 172013 46772 -43186 66559 102942 90470 33747 77962 217234 375466 452709 438766
14369 438766 268179 216947 2132 -85570 103109 103685 91353 103261 227378 286019 256743
14358 256743 129686 -35091 211631 306124 415595 426890 502485 421880 231536 170561
14348 170561 228208 226298 201657 344302 189865 -124338 86803 272461 447526 434717
14338 434717 299403 157420 237917 353099 314229 409827 358231 215804 108348 351876
14328 351876 399724 317139 144423 420688 470449 121988 6333 -62240 -51338 -12459 -97517
14317 -97517 -14059 -146107 -278284 -210356 -169364 -80478 -196096 -86328 165624 314884
14307 314884 458556 529325 343293 17329 -234262 -245545 -438749 -430693 -262385 -777
14297 -777 -40621 60034 157775 264246 160162 73251 75965 174135 122255 108314 241184
14286 241184 268 37630 51240 101297 268394 410604 408844 57236 112431 152240 115559
14275 115559 53327 -53367 -152096 -240309 -1499 3607 -151611 -364511 23447 60006 -19964
14264 -19964 -43223 -97897 -44144 -59332 152041 269080 172969 116944 113122 -109237 -237108
14253 -237108 -72647 -72659 -24803 28975 234967 443956 525405 577721 404187 110872 -10359
14242 -10359 189207 392765 368376 325422 48336 160831 335767 577149 707140 235082
14232 235082 -135800 -199149 -133652 -61441 -5124 81104 123028 -257534 -298191 -237968 -244832
14221 -244832 -140808 -241550 -244745 -217326 -382235 -670298 -564838 -469227 -564999 -414479
14211 -414479 -11360 110268 366732 361607 -71213 -22358 88336 49167 164231 182472
14201 182472 152297 -52485 -72838 -33635 31476 154558 71506 70657 101313 -57187 -72118
14190 -72118 -315363 -300841 -152311 -101654 103349 235903 390793 289216 181225 338121
14180 338121 594053 381877 402036 207495 340801 525198 565215 522154 260039 330314
14170 330314 244630 269505 289302 271674 263850 436264 274729 25650 157084 167768 176024
14159 176024 -28664 -38671 18393 3640 89091 126856 107489 58451 246898 487749 272389
14148 272389 205615 372196 384089 538779 336890 259354 201532 -28083 -31158 28685 162389
14137 162389 226255 463659 443441 408089 547753 181519 -188701 -99417 -64851 52525
14127 52525 108263 -19628 -35718 125722 64010 299370 559573 617533 571132 98578 -63709
14116 -63709 73732 273336 304716 374806 267916 280446 90705 66807 -48186 102972
14106 102972 146568 217313 441720 513917 288495 250681 237561 428582 355450 489825 564911
14095 564911 478655 412122 342953 248174 345122 281597 359535 642871 505750 299718 456039
14084 456039 260151 42462 239676 631623 549905 370512 429325 106101 -122595 20305
14074 20305 47749 112481 -48846 30814 169264 32344 -115854 -225346 -264249 -108964
14064 -108964 -119388 11981 7303 -81537 -228979 -461543 -353053 -118048 -218614 -364206
14054 -364206 -352729 -285818 -262574 73520 229199 339216 530114 737126 533233 137244
14044 137244 27234 224571 297348 -6005 -67257 67595 117005 190832 255919 152558
14034 152558 167309 4052 -144000 -49779 27706 197593 136804 19580 -105260 -63354
14024 -63354 1412 -51128 3294 -66122 -199883 26599 139157 -22467 -60654 -72950 86267
14013 86267 186989 47613 -85126 112332 453138 332192 -124472 -137454 124199 7593
14003 7593 -40100 131770 159832 115817 14058 153903 303695 357949 427606 235319 -63569
13992 -63569 -3017 129470 37561 -71733 -89463 4812 -4926 -103684 48842 249040 67842
13981 67842 -133497 26390 410843 368996 -41299 -92843 -98904 108372 57981 200134 532062
13970 532062 431787 283879 61910 -125379 -20693 261831 126367 153585 394103 520164
13960 520164 379050 376965 524636 606127 472414 517394 487699 367325 321754 406043 163710
13949 163710 -221315 -190520 347 326813 258901 164615 293379 159777 280217 360110
13939 360110 430977 265620 225676 318855 271923 7265 -5683 59264 -97884 -464213 -414783
13928 -414783 -7290 271940 321144 456825 563659 426269 397591 339201 330970 461264
13918 461264 650982 728451 575215 478334 62157 -25972 96452 -98003 -54925 118536
13908 118536 167029 198042 117253 122955 -95082 -174445 -6478 -23861 -131704 27355 163152
13897 163152 177406 114735 50777 47909 171030 91864 347960 145345 123609 271234 214121
13886 214121 283282 281826 230892 32335 224736 198320 71100 -115129 -251857 -234954 -303184
13875 -303184 -368295 -158625 -215308 -164786 -195078 -38988 176175 282739 248915 38616
13865 38616 -63160 -113694 24722 254045 237158 131176 338960 391527 459316 169763
13855 169763 47317 101290 157402 122405 147607 255946 311634 351248 314028 207299 76255
13844 76255 137637 237074 66999 28037 -45373 8202 -57501 117553 192347 27204 71274
13833 71274 309491 420647 510094 636644 442891 202775 147728 135214 12671 -131062
13823 -131062 -222941 99081 108729 42591 -9447 -139150 -244933 -264823 80892 139967 118798
13812 118798 95072 132040 318201 384503 308465 401413 180290 310475 477993 603190
13802 603190 418030 391594 432720 488620 357567 409736 515426 513374 264812 -70136 -2448
13791 -2448 32734 94369 177364 313428 355915 471220 438735 278847 111686 127555 63096
13780 63096 100981 175317 53545 -167425 -339428 -141602 -140547 190600 303784 208435 -201503
13769 -201503 -358131 -253768 27505 240114 313160 231230 146992 11705 162296 464120
13759 464120 421925 381427 218147 27272 15040 -10063 -112547 106175 363003 348447
13749 348447 305571 153283 198353 103830 159345 273241 528584 646387 349055 71648
13739 71648 -24574 -62660 74833 162489 184635 118543 264706 227788 263405 553063 383046
13728 383046 43225 -14251 56469 -16311 -172628 -91212 22411 70742 81609 87286 304471
13717 304471 400708 520773 452435 33555 -177 55579 215401 337251 209697 110820
13707 110820 204491 229748 159491 75972 175777 424928 368103 101206 -105641 -93727 -109699
13696 -109699 -205272 -138838 -200626 -164178 133932 300149 273824 252967 79447 56888 11316
13685 11316 87718 260671 321448 422141 347398 234835 135911 242286 231568 174725 -19860
13674 -19860 -114581 -176220 -325225 -152128 -267332 -467926 -489451 -333530 26526 26098 5224
13663 5224 10992 -255640 -494793 -248566 5508 -48964 139135 102959 78672 346331 219091
13652 219091 -113363 -192663 81084 124679 221173 242839 -112328 -320629 -366233 -392658 -200173
13641 -200173 181997 351243 357842 429288 546355 488575 511727 454892 472780 632366 576662
13630 576662 312733 125256 69610 314411 430036 130706 132134 179155 284245 252634
13620 252634 492997 438353 316510 324647 258718 306377 325044 507342 594627 483332 489199
13609 489199 395538 203608 122092 49532 -81501 -268573 -22045 281260 487236 688006
13599 688006 504854 56830 155805 155628 79844 204215 439132 406644 157794 128335 304583
13588 304583 255254 307774 408814 508256 589049 581507 668998 302501 51979 107685 336440
13577 336440 663295 621262 197909 -24613 -29192 206950 464862 309036 454684 354316
13567 354316 154007 372021 161110 -12759 331015 484702 599636 761962 728575 673020
13557 673020 349418 2967 -40562 131743 262156 212462 360881 708466 905845 692690
13547 692690 547746 306449 174844 203707 163162 216772 109947 -57090 85951 245949
13537 245949 188783 331612 638577 771990 658510 495985 525883 726997 598431 588100
13527 588100 598296 407825 398113 395939 322089 104077 -58726 -40402 253252 288989 213650
13516 213650 169858 219938 122661 -6712 40560 322526 574098 600477 405851 504138 554617
13505 554617 598803 573515 247952 208741 156694 219208 220544 229384 247421 70016 -94865
13494 -94865 -229174 -140611 34953 336679 199322 83513 313476 373998 439526 229390
13484 229390 150261 83783 -22442 215310 477622 504287 490585 270881 128157 156421
13474 156421 141298 189297 236052 257488 251684 279573 340975 339295 383704 490255 363069
13463 363069 114207 120129 140394 274893 258295 308125 218810 121830 415628 626628 719868
13452 719868 621811 657539 448206 279182 525320 548807 337982 84432 331835 515823
13442 515823 463503 316657 343611 469714 339468 209816 106277 225686 247903 -66030
13432 -66030 137066 238511 -104293 137511 448804 363644 98110 275530 422101 483353
13422 483353 396174 344447 93504 164307 316311 334505 83042 -211335 -236841 50477
13412 50477 192466 173923 314948 467470 465517 318778 325889 301475 355270 241989 58970
13401 58970 102646 247768 404649 336048 1158 110806 494254 511160 413806 225418
13391 225418 248291 298497 503270 437730 320867 339790 241862 181228 275714 230177 140669
13380 140669 97134 521883 780782 757558 676507 655801 558733 555895 376840 213209 93465
13369 93465 133304 196325 92108 -77792 31094 -188267 -231408 -275973 -195227 160077 479786
13358 479786 531609 539053 464103 434271 526248 542734 671091 643252 556561 526419 338633
13347 338633 53259 97416 174307 305640 502981 563363 674235 614860 436321 400128
13337 400128 334447 130406 283840 365456 424085 408751 275377 97541 -14620 180548
13327 180548 236111 329170 169743 180666 65688 -53321 222184 288339 272268 274505 88280
13316 88280 117102 -33524 -128897 -14451 -145751 -364075 -174368 12199 60978 122268
13306 122268 216259 180356 385425 530746 574936 455961 299525 248803 206245 31289
13296 31289 16844 198475 201791 164431 66574 256556 254863 263252 285941 542944 513997 442864
13284 442864 247701 113123 234939 524190 629128 389707 97097 52513 -25190 188219
13274 188219 385255 492536 464149 284516 208151 346976 480313 477401 598252 951901
13264 951901 1044206 983624 666271 524651 408251 400886 503587 358722 454622 510036 295145
13253 295145 172389 292834 358778 236882 241075 322304 460377 735643 743739 715418 578677
13242 578677 488959 533565 487400 442412 439531 355786 324924 510968 568049 530304 558007
13231 558007 338293 353822 471304 570928 708382 551366 618355 816966 1105990 1183998
13221 1183998 1135308 860226 976123 874635 870944 863833 758532 526918 403160 372307
13211 372307 477071 265956 105676 118796 253699 200363 309439 406568 506790 684368
13201 684368 799433 698164 415859 563795 536769 430144 219084 244306 236264 243129 439878
13190 439878 502427 559442 239314 48251 324888 468878 553889 402957 247053 237857
13180 237857 383628 422274 459922 459308 625929 706716 647340 818971 914185 803836 888777
13169 888777 1016255 879117 672481 608851 549054 315828 465739 652740 667067 464727
13159 464727 386486 195500 295541 395455 267972 349347 518715 505540 444750 509612 323077
13148 323077 420856 448098 377892 433959 484646 689536 790186 416040 45120 51702 245553
13137 245553 449103 460631 365169 246792 338037 500899 767765 503666 132444 275158
13127 275158 631183 766744 923639 908263 721786 683675 426083 305317 458801 282599
13117 282599 306668 469875 417754 298392 395134 514522 594094 782436 920015 644899
13107 644899 329787 348550 542882 545836 595866 707945 684511 691882 657505 536328 391065
13096 391065 320007 340419 281333 479015 528929 394924 495388 716947 687563 569556
13086 569556 662124 710275 716474 632635 362111 195559 455522 825437 1003584 757435
13076 757435 476798 503555 418478 496277 420475 207829 513137 698871 778620 907688
13066 907688 856602 841650 717914 785049 998334 914267 801595 866942 821190 974993 942737
13055 942737 736067 845179 795075 564684 677527 871758 1024446 1319497 1330980 1198967
13045 1198967 921732 667809 542811 406017 384808 775422 1022820 980008 877857 775361
13035 775361 613578 697356 722172 647748 809542 830453 754362 789508 596386 824187 836314
13024 836314 710485 783067 863181 1091976 871236 404516 578034 710030 871612 859575
13014 859575 908907 981478 857185 1114592 972310 855948 803880 985822 1074614 962775
13004 962775 785254 910764 818304 1105969 1234729 1256522 1199344 915036 848080 957560
12994 957560 1226587 1535048 1564669 1620012 1538476 1639945 1785331 1508391 1502801 1548738 1686019
12983 1686019 1758063 1689825 1656127 1777178 1563636 1522433 1635205 1534587 1579530 1662769
12973 1662769 1459679 1525108 1480827 1415449 1493402 1336243 1289249 1342886 1289319 1076193 943685
12962 943685 812845 1011515 1236515 1339913 1149064 1204622 1416572 1525997 1437102 1276891
12952 1276891 1353329 1368115 1423274 1522289 1653772 1536890 1448978 1548039 1380523 1369461 1393717
12941 1393717 1710747 1732690 1436242 1190335 1296200 1317958 1249545 1298605 1111902 836089
12931 836089 557452 552447 729473 879206 950348 908714 918579 895597 1021550 999030 1089428
12920 1089428 1157846 867394 847202 1181345 1359466 1170856 1281535 1218532 985594 970019
12910 970019 825110 658311 808798 835048 914057 1037417 1093708 817884 788794 713059
12900 713059 822038 851121 731313 783944 999682 1261652 1463868 1637075 1298324 1057591
12890 1057591 654798 589939 648763 852541 849379 783632 970145 884610 730155 648074 744777
12879 744777 610472 470733 501891 762620 962190 924656 979255 1088874 960039 832625
12869 832625 882010 904998 1016851 978807 816211 745654 670731 662713 854938 773694 847066
12858 847066 934972 787426 857779 1046651 883561 1014114 1162273 1000178 668862 522500
12848 522500 631162 721714 698096 928169 1244016 1412109 1451172 1206648 1245869 1282396
12838 1282396 1038399 985766 960772 907133 829402 718931 1027979 1007520 902619 863010
12828 863010 944739 1003129 956596 831447 1028711 1252994 1436798 1412377 1060671 875245
12818 875245 880480 667989 379946 424165 586205 687482 769387 893487 998125 1232326
12808 1232326 1236070 1132913 1134805 1263932 1312030 1211817 1063311 1212547 1148412 1001732
12798 1001732 1233677 1231097 1129797 1114701 1155285 1071035 996040 1156613 1245661 1194748 1197491
12787 1197491 1255550 1355421 1264360 1616497 1736604 1489690 1373065 1371035 1512721 1341244
12777 1341244 1087228 1073469 1021420 1000274 1087109 1207751 1327920 1455650 1683960 1466593
12767 1466593 1284422 1058654 1067328 1096913 1058098 1182380 1319701 1630509 1550021 1734662
12757 1734662 1885284 1597221 1513612 1520768 1405335 1346856 1339984 1203205 1405128 1684679
12747 1684679 1724679 1532464 1747913 1769529 1682967 1800590 1664942 1552196 1658804 1553217
12737 1553217 1551852 1305099 1388040 1503351 1438015 1385987 1337488 1303559 1147588 1456500 1873685
12726 1873685 2011153 1987376 1843730 1723638 1821839 1888510 1968907 1933187 1780333 1735057
12716 1735057 1746300 1735470 1927795 1824969 1513145 1362326 1572236 1744511 1959098 2066237
12706 2066237 2023143 1899351 1912424 1866872 1769748 1694900 1532444 1457264 1431269 1566458 1745273
12695 1745273 1969310 1865978 1733547 1765961 1751382 1913150 2144320 2284319 2435751 2212252
12685 2212252 2267458 2225889 2047564 1858400 1931291 2105736 2176269 2117453 1894511 2064467
12675 2064467 2225322 2175625 2064065 1966866 2153742 2330142 2698431 2857004 2622967 2567913
12665 2567913 2539274 2664566 2797506 2853463 2938208 2747945 2567755 2604339 2764068 2770124
12655 2770124 2857093 2847380 2933743 3036179 2997412 2925273 3180199 3489648 3516805 3215555 2959439
12644 2959439 2859659 2865794 2948918 3151065 3280789 3280103 3160610 3323739 3515334 3753872 4004476
12633 4004476 3649143 3529186 3793703 4145181 4036779 3899155 4092563 4063124 3854376 4032276
12623 4032276 4218672 4184768 4114927 4232767 4450203 4593181 4556414 4441072 4377935 4246929
12613 4246929 4517177 4956003 4908318 4749860 4998630 5261604 5621278 5867521 6019576 6259520
12603 6259520 6516675 6456339 6508714 6544952 6728557 6806189 7003570 7380990 7753366 8113071
12593 8113071 8677246 9385108 9945222 10077243 10184706 10745097 11354489 11912100 12279451
12584 12279451 12739531 13664853 14610187 15262455 16170809 17354071 18573861 20136484 21802737
12575 21802737 23727125 26185581 28745528 32106136 35952423 40705206 46357968 53188333
12567 53188333 61026884 70004216 79015427 87048283 93086990 97419259 100254497 102496254
12559 102496254 104554157 106213873 107164962 107025334 105169064 101101319 95838341 90187142
12551 90187142 85117457 81338636 79338621 78943739 80326341 83147907 87287365 92126859
12543 92126859 97218912 102377273 107532110 112669117 118056845 124316892 131549440 139204330
12535 139204330 146453523 152708677 157136009 159235543 159345093 158912293 158163738 157390576
12527 157390576 157485336 157304642 156519890 154788151 151329660 146745691 141369079 135930608
12519 135930608 130605146 125662514 121544421 118113946 114794535 111526699 108612328 105386886
12511 105386886 101955262 98652243 96219524 95159716 95783246 98125044 102217676 108008767
12503 108008767 115043897 121707242 126829773 129732147 130631855 130095064 128896338 127253244
12495 127253244 125438934 122753749 117990997 110924534 101677581 91289300 80750002 71204789
12487 71204789 63340208 56720022 51404804 47198253 43609044 40518211 37881438 35765217
12479 35765217 33682219 31797175 30050903 28335387 26968031 25653131 24447000 23448034
12471 23448034 22561615 21788390 20939420 19948395 19278519 18545906 18013881 17463081 16882771
12462 16882771 16268191 15926632 15538753 15250051 15081228 14849153 14358336 13838132 13486049
12453 13486049 13176964 12805592 12170338 11856518 11622467 11348864 11083099 10746786 10373848
12444 10373848 10182336 10154527 9967464 9597651 9168814 9079249 8817575 8460205 8569304 8575017
12434 8575017 8416730 8240201 8227147 8189511 7941618 7699451 7548635 7589201 7594843 7396342
12424 7396342 7510615 7380112 7256921 7153642 7086966 6972419 6880747 6690128 6446520 6194431
12414 6194431 5993171 5931370 5793678 5710893 5560464 5681905 5565736 5453305 5535029 5430079
12404 5430079 5379983 5435438 5216730 5014158 4884960 5036027 5344997 5352049 5373822 5288912
12394 5288912 5116671 4858585 4790903 5005266 4994861 5043138 5036315 4893092 4840172 4800652 4767269
12383 4767269 4662738 4506824 4701923 4927272 5012181 4848726 4628427 4541053 4619418 4996646
12373 4996646 5167237 5308675 5011168 4844877 4653469 4322473 4326666 4467575 4403399 4621607
12363 4621607 4764542 4474054 4254222 4226977 4193826 4000740 4130940 4172767 4188765 4187968 4435913
12352 4435913 4705425 4570636 4390860 4453351 4589513 4555126 4465542 4267187 4174351 4166348
12342 4166348 4364398 4212360 4054717 4184530 4525643 4508803 4545143 4376764 4206512 4333134
12332 4333134 4421470 4499049 4515352 4475263 4473871 4467623 4587767 4548471 4602907 4578822 4484316
12321 4484316 4288277 4052762 4100005 4076459 4150949 4381545 4653596 4667465 4531946 4282401
12311 4282401 4424528 4700338 4666209 4699687 4674683 4461272 4344962 4515875 4631297 4794415
12301 4794415 4791220 4816688 4967343 5230179 4959604 4730435 4977702 4896299 4914726 4929424
12291 4929424 4936920 4856322 4966668 4886958 4935944 5040297 4760427 4957660 5107342 5054736
12281 5054736 5170529 5137115 5019118 5073862 5140669 5294756 5342658 5366878 5522513 5374384
12271 5374384 5183723 5170816 5147176 5229441 5373589 5549599 5599401 5598501 5391762 5363845 5758773
12260 5758773 6129405 6219979 6039679 5858130 5881260 6078294 5884678 6022128 6125516 6084880
12250 6084880 6056982 6086917 6231957 6249541 6291918 6551262 6674316 6759662 6728769 6656599 6669024
12239 6669024 6664929 6593588 6591989 6429911 6166133 6321679 6619502 6534630 6450255 6640784 6801028
12228 6801028 6627906 6706619 6845409 6846191 6595699 6589310 7001950 7237228 7253454 7174870 7358272
12217 7358272 7297496 7442650 7620565 7269214 7160103 7244275 7256688 7196001 6980823 7000736
12207 7000736 7211427 7587963 7865072 8061060 8215506 8268502 8106402 7961733 7894827 8194450
12197 8194450 8512896 8513116 8426478 8312183 8173481 8114031 8249674 8352482 8318732 8334577 8410675
12186 8410675 8566479 8881048 8632913 8474040 8547228 8772791 9008759 8878305 8813486 9179815
12176 9179815 9236751 9244808 9358653 9406367 9237988 9335160 9449349 9566195 9750342 9932180
12166 9932180 9841507 9928946 9920919 9993015 9912303 9897636 10155494 10083988 10012941 10332307 10680303
12155 10680303 10919662 10661290 10472648 10528564 10756781 11047615 11291485 11580595 11808867
12146 11808867 11703127 11646772 11434766 11547348 11652856 11617708 11670728 11788579 12167131 12268873
12136 12268873 12613744 12985830 13031243 13093795 13350128 13339974 13286177 13250284 13444514 13742272
12126 13742272 13914533 14146397 14299045 14250760 14122124 14089181 14365791 14744372 14770767 14858191
12116 14858191 14960235 15272475 15603086 15488621 15649805 15850468 16076024 16201153 16305575
12107 16305575 16702100 16911502 17194523 17403263 17299707 17588007 17850010 17939849 17985207 18163541
12097 18163541 18193966 18613293 19039033 18988327 18891203 19148965 19418619 19494512 19628375 19899461
12087 19899461 19869715 19971708 20072820 19998145 20401382 20837158 21193880 21190750 21383933 21615698
12077 21615698 21798623 21867533 22000251 22206511 22619380 23039393 23457931 23381752 23595357 23933230
12067 23933230 24138247 24343141 24498590 24595840 24962238 25356637 25730376 26001567 26387818
12058 26387818 26402228 26516985 26579093 26665465 26879818 27427313 27648626 27732087 28168436 28686639
12048 28686639 28871457 29127006 29409267 29935011 30242547 30347999 30511329 30764214 31088710
12039 31088710 31440881 31877102 32168749 32397757 32802571 33137542 33416687 33820921 34186202
12030 34186202 34625793 34874814 35350067 35638157 35830852 36039966 36466357 36946995 37593049
12021 37593049 38057057 38522971 39067774 39634048 40017925 40424055 40853323 41192755 41771743
12012 41771743 42179126 42577739 43142094 43651039 44538008 45149821 45610502 45950095 46400340
12003 46400340 46905300 47373465 48119824 48833501 49328789 49780823 50389433 50750773 51291718
11994 51291718 52080029 52687321 53306081 53954510 54636519 55504781 56191012 56908030 57543827
11985 57543827 58129841 58731538 59367332 59933098 60590046 61404115 62300971 62955055 63533632
11976 63533632 64530619 65403906 66043304 66689242 67391269 67995477 68811174 69648962 70401166
11967 70401166 70969848 71611887 72301132 73295003 74054468 74506482 75103039 75733192 76392184
11958 76392184 77073281 77775171 78316144 78998566 79595326 80406992 81353014 82016047 82555505
11949 82555505 83088158 83587848 84096569 84499726 84978525 85542393 86191177 86769208 87495766
11940 87495766 88116039 88371695 88697256 88868560 89095627 89412255 89651036 89958668 90252110
11931 90252110 90556570 90941393 91271094 91397878 91479273 91838345 91938974 92065505 92257608
11922 92257608 92304569 92360343 92250843 92043389 92145946 92149775 91929473 91796755 91612311 91334838
11912 91334838 91031775 90926257 90959576 90676793 90180581 89615483 89239124 88966779 88758379
11903 88758379 88303244 87710862 86986451 86452882 86106932 85573761 85137034 84837136 84111842
11894 84111842 83336856 82810144 82238892 81745241 81165380 80584506 79826602 79111810 78365931
11885 78365931 77766634 77284287 76546315 75903657 74942941 74274383 73796159 72995131 72211359
11876 72211359 71622856 70944815 70068369 69228172 68407126 67528659 66817923 66183276 65600122
11867 65600122 64744725 64110751 63475604 62775018 62264188 61528066 60572379 59957322 59414476
11858 59414476 58725033 57994997 57283169 56586374 56066498 55458761 54785651 54211525 53372941
11849 53372941 53028146 52630795 51978797 51319606 50930281 50429234 49816159 49263994 48656801
11840 48656801 48260324 47821441 47297074 46744370 46091783 45426129 44903111 44442506 43769820
11831 43769820 42967231 42639177 42157753 41528313 41173724 40897473 40511646 40172146 39522987
11822 39522987 38977165 38684791 38494285 38270846 38014945 37628553 36944021 36499287 36015979
11813 36015979 35525110 35285757 35048310 34642710 34183554 33717260 33341104 32932869 32517159
11804 32517159 32134024 31734379 31290365 31116267 30810514 30578746 30173826 29826812 29573274
11795 29573274 29324260 28963803 28649733 28456052 28183440 28072031 27824198 27258588 26951867
11786 26951867 26704260 26588722 26524279 26442228 26337832 26167948 25809377 25348075 24910033 24567883
11776 24567883 24383009 24227922 24077720 23849129 23469365 23304346 23194086 23128107 22923123
11767 22923123 22941502 22839382 22663129 22394297 22204504 21971446 21985887 21879590 21851209 21881037
11757 21881037 21497676 21177237 21114660 21217807 21118308 20775494 20718630 20470506 20285455 20289959
11747 20289959 20456746 20417746 20379889 20485408 20416121 20429349 20131865 19802725 20021284 20185739
11737 20185739 20166415 20136797 20300585 20444856 20401869 20444048 20762354 20962317 21103807 21234757
11727 21234757 21398551 21837076 21971186 22124544 22411358 22855877 23365975 23866826 24157632
11718 24157632 25003755 25784701 26521567 27562423 28613084 29425536 30838806 32595267 34513765
11709 34513765 36832348 39350108 42292316 46093115 50598224 55943810 62746943 70383608
11701 70383608 79179590 88908587 98773595 107834455 115107556 120040252 122860603 124751859
11693 124751859 126366567 127816206 128671230 128444867 126127682 121437923 114927233 108050915
11685 108050915 102251599 98146776 95781212 95559888 97139389 99591595 102651256 105941843
11677 105941843 109399771 112894074 116531151 120607234 124775904 129060443 134201291 139676618
11669 139676618 145127913 150268437 154952187 158225347 160007618 161048317 161233276 161546564
11661 161546564 162520263 163702850 164835735 164930465 163040123 158563353 152228664 145266253
11653 145266253 138307729 131938430 126111789 120948966 116122894 111444561 106751089 102263201
11645 102263201 98181793 94480416 91945915 90666174 90737022 92297764 95446144 99911450
11637 99911450 105323708 110507060 114894815 117830267 118927393 118258619 116939087 115425938
11629 115425938 113551519 110840197 106876421 101019844 93583308 84710769 75898793 67505440
11621 67505440 60212559 54525205 49811782 45959520 42732322 39999815 37557730 35407729
11613 35407729 33625542 31985290 30381997 28981968 27723747 26588805 25553730 24692986
11605 24692986 23822737 23289080 22667260 21814237 21007014 20323338 19716677 19362708 19078970
11596 19078970 18441175 17700570 17085938 16672230 16065220 15547711 15213692 14856315 14451907
11587 14451907 14089122 13891482 13919096 13726163 13531095 13327543 13266949 13015364 12604469 12026701
11577 12026701 11774606 11449469 11152546 10947562 10873547 10938818 10866428 10655957 10441549 9938310
11567 9938310 9719147 9821222 9732416 9536701 9400229 9055024 8640254 8426777 8586979 8673028
11557 8673028 8536814 8136606 7964194 7986658 7783692 7684967 7897245 7889317 7824976 7702887
11547 7702887 7572584 7272509 7025020 6863546 6502838 6367746 6380297 6361362 6319361 6499123
11537 6499123 6294216 6060019 6119247 6259254 6162979 6209064 6110472 5967052 5719997 5603467
11527 5603467 5622863 5538332 5321560 5239559 5257728 5151638 5133290 5210718 5150962 5330547 5414295
11516 5414295 5309729 5456015 5610253 5587987 5175807 5024930 4985515 4785505 4571726 4654298
11506 4654298 4670727 4445385 4256164 4415346 4475705 4622836 4395880 4102402 4088666 4300326
11496 4300326 4434444 4425144 4413378 4287946 4166841 4090147 4103635 4066839 4180961 4191341 3767845
11485 3767845 3508931 3701987 3863657 3791533 3616561 3784969 3878105 3656163 3662824 3788065
11475 3788065 3679917 3757632 3700277 3444271 3255789 3118439 2974702 3264176 3580282 3607185
11465 3607185 3587098 3655676 3642372 3904712 4170081 4306342 4348852 4469794 4369658 4593861
11455 4593861 4659154 4441647 4457814 4607539 4770853 4616929 4530662 4477704 4242979 4062552
11445 4062552 3855115 3777257 3858265 3728682 3794012 4169888 4278808 4098984 3954436 3904015
11435 3904015 4076868 4280141 4194287 4367859 4367151 4363999 4454710 4305338 4122198 4378305 4332715
11424 4332715 4269771 4397586 4276608 4224997 4318671 4401312 4457578 4485559 4310174 4203830
11414 4203830 4181292 4220974 3880693 3750865 4011564 4008548 3832127 3823522 3608791 3572579 3672746
11403 3672746 3665373 3595318 3729088 3817963 3908486 4040009 4036418 4171699 4245344 4034337 3981036
11392 3981036 3739096 3483242 3534394 3310645 3306721 3520827 3570447 3477674 3140476 2889634
11382 2889634 2835971 2648365 2614814 2763849 2724169 2622973 2460143 2526520 2487803 2687036
11372 2687036 2774913 2708121 2717698 2738563 2878058 2900764 2733485 2603404 2428103 2283986
11362 2283986 2293485 2195652 2116511 2393434 2621052 2420549 2255118 2209215 2157413 2319690
11352 2319690 2298152 2265097 2313695 2140251 2367839 2352163 2311743 2112290 1962747 2016190
11342 2016190 2237903 2475595 2421039 2300224 2099272 1794219 1748489 1829232 1611119 1547220
11332 1547220 1636545 1724638 1731411 1776437 1873726 1812522 1736555 1911560 2028047 2194315 2236149
11321 2236149 2200449 2328209 2303462 1970954 1893349 2155902 2150558 2079388 2046011 2000634 2036004
11310 2036004 1985307 1897109 1880416 1914276 1993393 2065104 2085166 2052231 2129038 2180588 1990625
11299 1990625 1878950 1912826 1903208 1938064 1877809 2069765 2241889 2019096 1841150 1869149
11289 1869149 1858784 1863643 1927191 1966169 1950051 1706579 1538375 1565521 1701007 1982554 2096043
11278 2096043 2068889 2017187 2294849 2214939 1936119 2037127 1995526 1977016 1734448 1797630
11268 1797630 1885068 1854181 1713601 1757872 1840254 2029267 2085458 2284772 2346441 2350718 2214914
11257 2214914 2152006 2241954 2246486 2113738 2200176 2143988 2122351 1987714 2089646 2261119 2264471
11246 2264471 2074024 1926782 2096844 2060460 1991866 1805221 1820639 2006725 2434507 2343880
11236 2343880 2300465 2040989 2192283 2292829 2260927 2169409 2021978 1875355 1569804 1545819
11226 1545819 1695175 1770162 1728764 1650074 1899378 1995971 1968473 1956933 2048558 2001794 1796154
11215 1796154 1603351 1613610 1669089 1673763 1866427 1759333 1866636 1945250 1982240 1989990 2010419
11204 2010419 1675568 1521452 1506558 1691676 1691049 1556043 1570355 1560087 1524933 1470286 1349119
11193 1349119 1377752 1244416 1319293 1507630 1529813 1652608 1632035 1729221 1797949 1851426 1656388
11182 1656388 1431134 1485131 1563283 1659897 1392175 999021 967231 1165667 1149908 911276
11172 911276 851085 892157 962758 1025098 1051139 1113741 1100091 1154410 1032817 1165360 1018785
11161 1018785 987745 1170705 1177222 1041058 945016 836426 856869 907490 1163040 1320664
11151 1320664 1408615 1295531 1131522 1392262 1376730 1051206 782033 647101 537936 631699
11141 631699 850420 788752 694336 708301 752690 760752 708722 670758 777965 852966 977293
11130 977293 1229496 972553 801448 769711 841457 826186 730268 785611 877275 909719 964610
11119 964610 931225 879632 697746 724764 1001662 1093064 852125 787837 716932 755876 778391
11108 778391 878566 943804 1034635 915781 884020 769290 670396 600897 570948 615950 790357
11097 790357 780016 912434 659989 584514 664246 672133 590745 678437 711547 895107 937490
11086 937490 874593 898217 953080 1059150 968200 883747 945844 992294 938423 912473 942751
11075 942751 934063 1112137 1103418 1184500 1167995 971462 846497 989777 772509 473966 523296
11064 523296 560087 754544 712812 601428 687641 807028 676062 856780 878195 776643
11054 776643 963357 1087949 1038706 954018 952774 1093409 1100158 1270907 1274748 1319571 1227436
11043 1227436 1235694 1470526 1900510 1994400 2032864 2123379 2127240 2106732 1913268 1870916 1901963
11032 1901963 2001189 2115476 2395629 2410706 2336627 2169185 2368915 2524097 2587425 2527463
11022 2527463 2399805 2346631 2444194 2546796 2338910 2102945 2064073 2094722 2039342 1778988
11012 1778988 1657834 1905010 1730952 1720700 1787275 1759420 2011461 2061513 1840394 1468801
11002 1468801 1411487 1522701 1364354 1220338 970124 909017 1110919 1054535 916249 787387
10992 787387 600834 596446 693625 824688 888313 788595 820107 943990 994510 889857 795137
10981 795137 907922 1061178 1222097 1029860 599098 543631 715223 867550 1024633 967145
10971 967145 905634 821755 841616 950182 1243101 1387324 939080 477825 524750 635928
10961 635928 660527 628864 511303 387419 477896 480294 446341 478885 536278 341952 631758
10950 631758 559482 487068 618680 472484 418892 566355 715789 737113 914601 832637
10940 832637 772167 501190 213015 433496 471124 355140 390766 714668 754835 387096
10930 387096 403707 472048 437713 368922 416701 279883 310872 270385 406877 459875 348803
10919 348803 227983 288695 543889 475088 506448 428639 294981 326187 426707 663529
10909 663529 434978 68125 -77903 -39859 136496 288136 -3057 104132 483962 781121
10899 781121 842748 927326 969364 1078262 906788 615469 686150 785884 476748 398043 238935
10888 238935 393148 521495 768302 650936 218876 120672 319512 241803 345523 389714
10878 389714 323504 295029 277562 281654 414811 602920 716800 729662 703189 780006 822746
10867 822746 1013868 1276029 1100842 871799 778944 612375 284280 164294 54237 333233
10857 333233 542092 543853 591697 491868 819854 956447 876772 884044 889207 869328 574001
10846 574001 589505 665361 719463 775830 897956 1014337 631003 457214 537525 540108 557157
10835 557157 636510 742110 748711 718247 690237 646930 727463 696074 559003 529062 631112
10824 631112 714275 528405 589125 495142 509198 556420 527726 590311 679910 514191 339870
10813 339870 374170 493641 581414 518069 435451 253634 363335 264905 241741 416839 431079
10802 431079 375613 274183 328130 360895 226887 251686 402334 470790 575156 523713 518541
10791 518541 625918 674282 454938 205458 522107 953028 1053051 876339 836732 753880
10781 753880 323979 -44082 -117971 144295 500365 375485 79897 68676 478109 562349
10771 562349 473392 625016 631643 448415 401811 259757 342266 455092 451408 451402 585031 812287
10759 812287 862833 845535 941733 1071409 901972 642739 491107 627596 667152 656065
10749 656065 507034 378970 367535 478246 422401 495423 245490 196130 481818 995013
10739 995013 978486 814921 963751 1005231 1094341 1227729 1316223 1157850 829376 1055645
10729 1055645 1326353 1336684 1353255 1554328 1645803 1444511 1451830 1639125 1631873 1402097 1444608
10718 1444608 1543129 1562308 1685039 1748887 1858228 1646038 1457095 1527111 1700658 1734831
10708 1734831 1768601 1744340 1786567 1894709 2051872 2099490 2014209 1902014 2129802 1790307
10698 1790307 1694397 2058749 2175701 2128388 2149247 2349607 2428638 2218672 2313755 2317902 2332887
10687 2332887 2251800 2190098 2217305 2607571 2535533 2451710 2445708 2391980 2470232 2802699 3109016
10676 3109016 2998217 3163426 3359843 3422701 3513373 3659719 3794548 3897512 3850205 3990947
10666 3990947 4154531 4355574 4511920 4592656 4527537 4431053 4702482 5086734 5236505 5266929
10656 5266929 5472581 5870335 6197360 6496901 6605785 6847275 7016231 7218596 7788477
10647 7788477 8278173 8524244 9067671 9798894 10570916 11133130 11817491 12688053 13667701
10638 13667701 14974288 16112106 16967308 18207952 19587088 21112027 23281690 25764050
10630 25764050 28437260 31447956 35023905 39475271 45025050 51957011 60438511 70275399
10622 70275399 79977917 88147896 94259354 99447931 104969952 111388776 119767186 130469785
10614 130469785 142892893 156001768 169579548 183014613 194634566 201928558 204841102
10607 204841102 206228730 209119640 215408034 226092528 240317916 256445256 271108202
10600 271108202 282095661 290209502 295253680 294503762 288857236 282348273 278463049 278971676
10592 278971676 284427153 293158401 301130608 302873797 295782153 283916799 271064473 257257231
10584 257257231 243071559 230106206 220614272 215676965 214129513 214144813 212664347 206158550
10576 206158550 193406343 178208861 163780879 150703217 139147030 129403321 121797879
10569 121797879 116022122 111395858 106974380 101390108 93849247 83980232 73633836 64578565
10561 64578565 57210948 51572553 47170492 43681589 40631598 37972207 35943183 34027102
10553 34027102 32433119 31082797 29973420 28723260 27345273 26204675 25255838 24416701
10545 24416701 23345010 22567728 21906082 20857141 20016188 19268501 18543169 18029681 17468622
10536 17468622 16692914 16070500 15828356 15656552 15416355 14973716 14254411 13751749 13391979
10527 13391979 13063670 12575297 12145136 11868615 11548136 11397419 11409760 10924929 10453541
10518 10453541 10284890 9857436 9285572 9099880 8719015 8187843 7770142 7805588 7792258 7701740
10508 7701740 7736063 7537256 7270319 7044172 6847342 6504512 6129609 5911888 5886698 5778384
10498 5778384 5757820 5804191 5657210 5606523 5429204 5167908 5196854 5020382 5045558 5004004
10488 5004004 4939581 4765995 4620765 4522573 4246493 4212423 4156889 4038727 3940284 3945179 3928147
10477 3928147 3951312 3740670 3578420 3360602 3307144 3332646 3386282 3430206 3676212 3394684
10467 3394684 3049919 3003322 2988490 3072013 3094495 2845033 2599504 2443972 2531297 2622309
10457 2622309 2672860 2552310 2590925 2568250 2358321 2161476 2049683 2078058 2076840 1950683
10447 1950683 1792280 1603326 1584312 1727753 1578845 1497791 1522027 1670030 1515244 1501211
10437 1501211 1404531 1455791 1617957 1874234 1773750 1658626 1639868 1500862 1526969 1593479
10427 1593479 1663472 1593199 1506239 1359908 1285597 1226304 1182921 1055826 1170702 1089070 918701
10416 918701 765362 661122 685623 677190 844249 1018415 1161859 1014938 1039613 914292
10406 914292 829913 999780 929237 953600 881259 982088 1036572 846247 1027319 1422171
10396 1422171 1551028 1177406 1100341 1017395 945069 930072 1016701 953697 772818 811913 672283
10385 672283 588882 691674 749801 713792 556456 604561 583227 620923 335359 540180 719043
10374 719043 726052 735271 774801 848453 990652 1043412 1000598 909839 771980 707358 625128
10363 625128 722388 708206 647040 855485 923592 883540 833417 957241 1014941 861754 667837
10352 667837 596802 529132 565876 559846 503479 593983 653735 442414 545560 622718 542432
10341 542432 587095 632451 607152 657161 698820 493357 457766 553063 460768 549751 435723
10330 435723 68344 237299 369585 335136 386646 520271 530934 530744 364739 306245 -99099
10319 -99099 -187267 -163150 -36903 -44963 122977 190085 67155 272440 764403 1016425 879065
10308 879065 820003 675432 495997 353711 334218 451741 748112 655423 423277 445550
10298 445550 362663 258862 302067 451413 560165 499519 273411 147086 80662 96248
10288 96248 32922 138800 229553 127818 223505 324891 311980 184879 201400 77843 50042
10277 50042 238817 282567 246420 91337 -245624 -235585 -208225 -178101 -106395 -307275 -43325
10266 -43325 205073 214163 69633 49294 151533 92014 17819 -23556 175380 319918 485654
10255 485654 467224 166635 207723 171596 110178 156037 263682 264072 100028 281271 311206
10244 311206 263766 262835 146103 99157 162433 398597 392163 219483 57964 277731 368407
10233 368407 298698 223656 72210 78810 35478 29095 -138263 -18624 261175 182938 -78181
10222 -78181 -5007 30036 -161428 -100976 -14079 39920 67297 5779 147528 149372 43043
10211 43043 144675 190609 171498 6914 85539 185084 56182 -69174 -171314 -245941 -152240
10200 -152240 5626 -37098 509 48872 112248 120006 259719 181299 84156 150835 188525
10189 188525 59016 191571 290113 247402 217048 619848 887787 839716 628516 694239
10179 694239 601234 463416 567102 859170 1083374 1107572 1212449 978806 1036231 1074383
10169 1074383 1237935 1235284 1352649 1525684 1803538 2078351 1990523 1964000 1968751 1832613
10159 1832613 1504783 1405926 1361139 1285330 1421178 1580330 1627510 1729416 1756161 1524938
10149 1524938 1201138 948773 1120005 1047658 1098066 1146699 1285706 1305103 1181910 1105200
10139 1105200 904145 632443 673660 888790 986345 923093 980407 861590 626719 608097
10129 608097 565336 612868 591078 453356 212378 101330 175410 259108 214771 327644 411065
10118 411065 9033 28256 329213 356787 504296 590954 382248 235010 477048 476000
10108 476000 550335 632800 720410 461138 199113 105784 206116 452295 319270 375696
10098 375696 395902 448504 523846 457215 251348 247383 66329 -39428 2795 100785 196104
10087 196104 81296 91649 230637 361860 325922 115429 -23377 57198 57091 57362 -182862
10076 -182862 -336788 -132726 75456 274951 318849 361738 326385 254210 395571 329594
10066 329594 295719 342772 476345 550009 594465 320748 21882 -112860 -137892 -47518 -8044
10055 -8044 146303 150226 -65382 -36452 -79844 128216 427442 329573 558424 660387 458836
10044 458836 156461 53897 164348 -55998 37388 167583 181926 -212118 -228004 12698
10034 12698 126259 220397 188396 172255 190644 86660 257258 306542 408376 293626 -23269
10023 -23269 -155796 -158056 -18133 496499 742139 491867 320436 101269 -116747 22093
10013 22093 13141 -75457 151545 290790 394819 173869 177303 229148 49988 -185180 -69279
10002 -69279 195679 164687 121713 105218 195542 193043 259814 154236 321030 266421 137409
9991 137409 205412 101532 -3047 -183410 -80709 82619 168943 59999 100146 157543
9981 157543 63310 316439 347842 256115 300721 348662 38993 -224606 -272550 -380328 -563072
9970 -563072 -432888 -251058 -113341 -146 205788 378209 263063 121302 142776 176705
9960 176705 84571 195129 81600 38528 12254 -96738 110561 382500 580270 463227
9950 463227 333569 308082 156784 -75519 46890 471127 272465 366640 518164 686198
9940 686198 888938 741011 555749 222690 96932 378903 503683 222536 91037 97898
9930 97898 148922 48882 -30360 104811 64453 51948 63757 -162416 -257009 -161337 -326601
9919 -326601 -425844 -522359 -388401 -171038 4929 -110861 -215391 -326220 -661 -101317
9909 -101317 -245555 -300842 -162473 2896 -236110 -280095 -41126 -38218 -39070 -55666 2474
9898 2474 43886 202730 132133 -15598 -107146 -8977 77245 126727 234751 539029 575760
9887 575760 320445 223623 74759 -304944 -276512 -193565 -240633 -1705 88301 -56102 -191364
9876 -191364 37166 88946 76537 -21948 32018 362215 495915 442075 291554 186455 99512
9865 99512 148841 130060 -190151 -243809 -77334 -278263 -184123 14886 141679 205548 175487
9854 175487 127050 -34145 -192352 -383083 -400915 -291930 -237726 -314156 -70708 -147547 -117405
9843 -117405 -145072 -268238 -419990 -339747 -90022 -52368 -346212 -286316 -42198 164850
9833 164850 53344 -32982 34930 200407 139485 36165 139835 170617 177084 70070 233689
9822 233689 239595 241395 242703 234584 160587 164580 51263 -189011 -111854 -197951 52162 146361
9810 146361 198341 212799 123054 18627 -110631 17348 19438 -176618 -172896 -43993 185675
9799 185675 137531 -71183 46215 24192 39594 135445 286526 208347 13047 189633 166685
9788 166685 -10908 -254494 -304553 -56552 84217 13089 -101968 -10127 -240369 -322675
9778 -322675 -159184 27920 46021 391774 455704 228588 147708 135195 189045 95686 323452
9767 323452 333021 258723 463040 623016 437677 472216 520594 395528 222468 287145 360381
9756 360381 319504 207555 61308 147498 93245 155874 -37676 -421809 -364410 -151140 -282828
9745 -282828 -288139 -179021 -170031 -362361 -289399 90529 338295 26176 -112971 27184 -219130
9734 -219130 -189694 -150837 -390894 -348889 -203958 -112584 9527 58856 186168 184037 124669
9723 124669 285581 137140 -41588 38470 -20265 25528 -25094 -39937 -113011 -379855 -119544
9712 -119544 141792 78117 56706 -93260 -159711 -246127 -269257 -171669 -135925 -149351 84911
9701 84911 -130345 -405222 -317182 -304528 -319411 -281494 -47350 -21723 -82692 -3398 -158593
9690 -158593 -9142 195770 272015 207948 251998 350486 484895 193628 164265 300677 110155
9679 110155 29522 64192 185211 17293 -138817 -51763 -109958 -141731 -202116 -241331 -213503
9668 -213503 -230084 -125174 -87586 -315090 -468246 -343605 -222009 -49093 84254 35673
9658 35673 158258 135686 239514 48910 40526 75787 146080 251946 226502 416663 492714
9647 492714 320712 61232 5906 306677 360658 304807 78321 178372 339818 439491
9637 439491 378175 227195 331229 453514 364546 147110 153018 89904 105810 183218 171383
9626 171383 -44916 4123 294507 276304 144936 213837 120576 -28333 -146067 -290288
9616 -290288 -210139 -286310 -201491 -183310 -144324 34957 -18834 -9830 199346 340577 172812
9605 172812 130202 203608 265219 517319 582482 405310 94706 25059 44519 227920 252484
9594 252484 153642 272053 435502 216395 60082 -55468 -77782 -330165 -246822 105810
9584 105810 185141 65092 -24211 -146856 -144974 243964 180413 42300 -168298 -233977 -139851
9573 -139851 -92561 67342 211236 -34564 -260820 -256673 99011 150347 -105415 -244500
9563 -244500 -233856 -234994 -123746 47653 22402 -139277 -190643 32835 92255 -83635 8883
9552 8883 298895 143282 -15543 86250 77178 105659 99196 136236 206473 281414 296777 66947
9540 66947 -94762 -44110 86462 303145 396750 615543 358071 155444 36697 -88129
9530 -88129 -25139 294269 445494 252290 215707 406764 610448 497575 327410 222382
9520 222382 85326 -32062 -24697 -9826 -116408 -35044 249370 310510 292085 299253 499634
9509 499634 343398 97803 148799 166418 510713 444290 309767 329501 265381 136217 84242
9498 84242 274359 501618 402730 547765 691965 698351 619307 374574 27875 -258546 -241717
9487 -241717 -179381 -407892 -214163 128368 -23038 -113511 195090 171628 124971 83455 35671
9476 35671 -90722 -28367 55020 65378 -50167 -244358 -363441 -346327 -17782 136547 25878
9465 25878 -276155 -71823 -29357 -268802 -249882 -42294 70436 146324 -114084 -187521 44571
9454 44571 114322 33153 36557 266314 294236 231700 63182 -93425 -256837 -278033 -8900
9443 -8900 73153 167470 392442 364567 285556 258867 283860 383800 302842 150748 -74821
9432 -74821 -239558 -511527 -442495 -239870 -22638 89015 92815 59424 70041 -11148 -109090
9421 -109090 -191365 -258026 -317937 -193033 76426 244711 176449 -28883 11713 110536 -17072
9410 -17072 -161622 -74812 -153626 -74707 -126862 -251482 -204052 39381 167725 -64804 -370323
9399 -370323 -389507 -64311 112440 -91987 -503173 -373088 -6323 328428 215024 -86035
9389 -86035 -272057 -294549 -266765 -322502 -243281 -294105 -113916 -104653 -365816 -333022 -265043
9378 -265043 -313139 -67805 47064 240202 36647 -151720 -105945 75743 141570 59694
9368 59694 -226000 -186990 66661 188406 65444 -110969 -293862 -232888 -58769 -613
9358 -613 -12043 33983 -6290 -9667 -151591 -90341 -221073 -154749 -177419 91841 217983 217955
9346 217955 104982 222985 47696 -91495 174589 302302 138301 114238 173146 267794
9336 267794 230982 167663 180457 108675 13670 247154 270486 -53441 -158954 -60589 69010
9325 69010 -79611 -241376 -199439 -17934 -125126 -167281 166439 491736 233556 3837
9315 3837 -40878 -206812 -103660 -98560 -227842 -143016 -8770 11856 10466 -136866 -162206
9304 -162206 -169458 -307566 -261864 -208050 -404887 -507414 -516708 -301694 -61224 12651 -164026
9293 -164026 -428240 -488327 -376673 -149530 17886 -37196 -16674 221632 336314 381663
9283 381663 244122 43832 -68875 -62726 -71656 -24915 -68535 -269273 -222129 -51150 111576
9272 111576 197007 138154 -124830 -246336 -144110 -80080 -234198 -554456 -144407 67983
9262 67983 -12042 -6033 28620 -12663 -138025 -12277 188701 -91138 -285369 -247771 -192958
9251 -192958 -163263 -362369 -333351 -390615 -330203 -196618 -226212 -157534 -184642 -211637 -174028
9240 -174028 -151886 -27519 59554 186721 213126 145238 43234 -128617 -285912 -356839 -115490
9229 -115490 133979 52628 -83694 -229055 -160331 -80146 -4695 190057 190299 268992 154729
9218 154729 108051 202424 273126 235792 -55801 -79304 -201596 -265286 -386738 -297625 34763
9207 34763 74705 106965 -114037 -142004 -110912 -194460 137840 143197 173805 -21636 99753
9196 99753 364759 478960 378108 154084 29787 -54490 -149809 -209576 -97868 -67553 -397794
9185 -397794 -342869 -333043 -130604 12452 177820 170594 21762 -204956 -144342 213514 204526
9174 204526 139498 249461 348577 273506 138104 -24379 -124298 -57252 -66046 279526 491302
9163 491302 270994 168588 162682 307343 249374 193095 133688 -114865 -286926 -154416 -159649
9152 -159649 -161382 -86030 -16437 -126645 -124424 -80942 -346481 -476516 -480254 -354620 -269939
9141 -269939 -256309 -380819 -340353 -321948 -344145 -359680 -640162 -484737 -149457 47288 194994
9130 194994 81812 -18181 -190029 -166916 -11398 12301 106128 -57000 -290629 -275485 -270322
9119 -270322 -381920 -282329 10929 160009 -50612 -107715 72304 -19631 -107754 -156801 31932
9108 31932 299749 225034 250955 500597 525860 296229 129620 32944 2493 254000 64071
9097 64071 -39937 4670 91937 63805 68560 -41166 212992 239695 -109087 -152490 -403600
9086 -403600 -468548 -567732 -319232 -139902 -235110 -272532 -531456 -395674 -178011 -87704 -39888
9075 -39888 -25765 12304 -16028 52869 129171 91434 195168 -43063 -315542 -245350 -24011
9064 -24011 -119214 -190693 -63515 234278 426605 206790 112679 -140808 -402979 -336091 -226748
9053 -226748 260 134479 257703 359628 379818 355532 374097 185137 33275 19759
9043 19759 -33450 -167499 -167970 -62404 -22975 -73138 13625 204490 333919 166746 53573
9032 53573 -73963 -76921 -197776 -322009 -105570 47069 20155 120773 114744 -206853 -279818
9021 -279818 -85207 59074 280843 274066 227914 299795 222427 88803 69946 93541 -4739
9010 -4739 -79422 -327526 -213760 108293 132273 -82374 -241224 -357066 -330661 -414248 -455639
8999 -455639 -288148 -207918 -236039 -427473 -370736 -178872 -182983 -256852 -376869 -293147 -178476
8988 -178476 -168543 -90283 7238 135665 123177 198248 209525 42581 -306535 -591096 -506249
8977 -506249 -70367 -38238 -354739 -242532 -295635 -290159 -134319 54780 261410 302069 136534
8966 136534 89086 -77304 -50298 230159 308077 304635 126901 -81072 -246782 -387353 -511123
8955 -511123 -204733 -68595 32564 50112 95501 194179 203767 300155 428798 217752 209557
8944 209557 202077 360373 148778 122715 230093 85296 -59519 -270113 -218146 -116026
8934 -116026 -128926 -213037 -198405 -231083 -114133 21171 54239 146173 167430 208903 339687
8923 339687 223668 200209 233875 293478 167433 10954 154150 79319 158638 234118 251860
8912 251860 7113 -317861 -401379 -276577 -292815 -433105 -234032 -59640 -91391 6661
8902 6661 129112 343064 191834 -37818 -151826 -223332 -344472 -31017 76870 264159
8892 264159 345104 368302 417241 288706 143764 -58256 -44121 -180828 -71310 97221
8882 97221 -67787 -54851 -168674 -151068 -152654 9652 95887 96185 78255 -349374 -412578 -562757
8870 -562757 -396340 -240862 -288831 -99387 165162 212955 239049 279636 320046 101117 -67818
8859 -67818 49965 164119 229358 241004 124780 203031 194561 141820 -75851 -311522 -565191
8848 -565191 -489792 -444061 -384902 -337543 -12748 230948 157160 156698 248286 303728 49098
8837 49098 -326616 -443316 52485 150137 428209 482436 307905 265095 454505 592514
8827 592514 430044 353022 76923 -57645 -79980 -149331 -12549 -14902 -80849 -101418 -255788
8816 -255788 -202227 258121 460734 413536 132824 -152547 -135958 -63469 -106456 -312728 -325272
8805 -325272 -306834 -314044 -157996 168956 25263 -318508 -214433 -84152 53757 123506
8795 123506 72479 -53915 -9020 38085 -72729 -267023 -240378 -274218 -323864 -105007 177928
8784 177928 150648 -41370 6894 180820 264328 296066 63346 102009 110133 242075 344404
8773 344404 255414 271454 173487 141810 -199802 -334826 -104428 78761 216377 -20901
8763 -20901 -55899 -121454 -257761 1229 87360 53274 -2865 -187376 -336965 -247950 -9521
8752 -9521 -62274 -12497 171303 409828 353916 179411 320670 543020 438992 180676 -17939
8741 -17939 43848 -102309 -234914 -108246 219658 145443 72509 147589 105459 -122856 -138344
8730 -138344 54678 23137 -5525 -51046 -171213 97332 263386 106202 4306 -149915
8720 -149915 -391920 -447665 -353948 -359544 -393113 -393810 14871 -14213 -278174 -389844 -492802
8709 -492802 -381837 -200506 24655 104159 148379 -36740 -34911 192806 178329 59391 -58728
8698 -58728 52279 88562 99939 196477 123272 52961 -88008 -154259 -91325 -47521 -56592 -346477
8686 -346477 -429231 -379879 -310423 -221139 38138 296839 333733 26813 45842 264366 155845
8675 155845 275661 217678 195223 307194 117666 -78796 -144234 -64401 129412 124251 -41745
8664 -41745 -71897 -293791 -390630 -152547 91179 24309 110302 4624 15042 52147 44446
8653 44446 42923 63457 323197 320899 -2834 -19973 118272 267768 92487 -224574 -56869
8642 -56869 203764 267433 -24983 -363582 -204462 -151059 11518 155089 162209 -9023 7041
8631 7041 74016 124415 153113 248963 158063 -12498 -100804 -32867 92355 141740 142945 229856
8619 229856 150615 118024 -127685 -303961 -268781 -121548 -55022 -119308 -224627 -98518 -43067
8608 -43067 55394 43354 -69945 -147833 -314732 -358281 -132004 107772 99619 206793 221520
8597 221520 201504 -75598 95981 53188 130329 212242 -84935 -97089 235691 311760 294544
8586 294544 179317 233166 412134 454503 323896 318544 597544 573335 564271 424372 382269
8575 382269 554070 535163 540498 685845 658288 395405 116589 13114 45533 96105 131936
8564 131936 25061 40841 124232 -88038 -10175 228959 184017 179400 405946 205763 -108913
8553 -108913 -289599 -168254 -59211 145939 226535 337804 199240 -143406 -17207 140965
8543 140965 376275 422004 111839 -193465 -131397 -13953 -3797 108840 329526 365292
8533 365292 459404 335797 -138763 -407259 -183184 58710 122326 -9407 -31153 180986
8523 180986 221563 945 -117872 -171116 -27588 121966 -162392 -448480 -319090 -93959
8513 -93959 -69926 -63715 163898 -22205 -163358 -268606 -305075 -371623 -382306 -332051 -88584
8502 -88584 138158 319814 293514 -52231 -289159 4829 465833 350529 247276 167753
8492 167753 329700 164636 152608 -18816 -99236 183221 195085 93663 -131697 -293833
8482 -293833 -208158 -48599 237404 360651 145724 131194 -48987 -278813 -72634 81508
8472 81508 -59153 -187474 -233763 -226475 -39152 69523 -128905 -106126 -12497 126184 194307
8461 194307 386197 527618 356853 328326 369687 326647 91895 168754 383971 156692
8451 156692 -84117 -159454 -151501 -36351 20122 -21329 46781 73191 84747 -7078 -4554 -63376
8439 -63376 -112414 -159557 56432 249803 131726 12000 103753 24261 -41835 -73767 177138
8428 177138 341098 204670 -36389 29514 -98463 -178637 -300127 -78137 15648 -105739
8418 -105739 -7167 -49116 -148988 -176960 -382585 -431500 -430334 -119372 -112263 -41846 -56142 -101374
8406 -101374 163814 -34281 -337348 -501749 -417393 -422897 -43145 -7113 -34175 -13976 -37730
8395 -37730 -87138 62707 -75663 -199948 -151780 -91669 192162 199711 156621 -109467 -173520
8384 -173520 -140281 -11549 151513 363919 300554 162290 333782 334794 124418 107627 -327595
8373 -327595 -503978 -189422 -85755 -205042 -244864 -172511 -165154 -137495 -58536 15771 19739
8362 19739 150816 169764 220884 155982 -61780 -8602 -69704 -222974 -397265 -519299 -500196
8351 -500196 -277669 -71928 279646 552705 510275 318864 128059 367213 595681 555061
8341 555061 295197 181212 5843 -51988 -127047 -259369 -224742 -25426 81582 37263
8331 37263 -371719 -253189 76129 -13398 70909 46048 -104182 -190355 -43333 -101388 -1821
8320 -1821 113516 230483 166554 91799 87069 76214 77607 -5501 -154879 -93392 -44492 45525
8308 45525 -14160 150242 254337 419417 516242 318377 114638 -36054 -45116 306237 498976
8297 498976 440743 448426 320652 176340 59929 348629 196547 -94383 -32345 211260
8287 211260 320881 322478 361207 546586 526150 294053 4956 -64168 -18541 19592 -146725
8276 -146725 -200220 -131476 -116344 -249010 -422857 -578297 -444000 -94663 -67772 -237070
8266 -237070 -207125 172272 236751 372495 514273 314602 153870 -115603 -78190 31978
8256 31978 388530 318184 219650 239674 217574 125260 102388 106883 186587 219482 121155 63687
8244 63687 106914 230905 221065 62924 -102684 -423721 -558338 -395146 -102687 52826
8234 52826 -98815 -282350 -191507 -149544 -394588 -303004 -111620 47668 30916 -131784 -110358
8223 -110358 -81154 1307 11808 151161 58549 -53177 16374 210784 330086 502725 726934
8212 726934 608550 419286 138192 -12362 1035 -97287 -320427 -194465 -88603 -233366
8202 -233366 -362448 -430770 -671439 -805751 -754451 -659461 -528249 -277001 -197763 30350
8192 30350 153357 139220 172709 161306 281386 34417 -104681 -24777 108565 -116266 -296109
8181 -296109 -38929 260313 258815 -11875 -227622 -410688 -317751 -216527 -211087 -255532 -245471
8170 -245471 -207249 -30122 35048 124432 45488 150139 173823 69059 -54210 -201636 -139750
8159 -139750 -52699 -179825 -544742 -555415 -395671 -80013 174390 352876 333657 343330 186333
8148 186333 159927 84116 -126708 -170052 -172707 49717 72719 27213 88051 163835 44207
8137 44207 -65036 76488 -82848 -284647 -47547 21293 -66092 117696 132370 1604
8127 1604 -18919 -123044 -311427 -239913 -118069 -15800 -148755 -66345 -38427 -253291 -429928
8116 -429928 -309741 -240833 -298922 -252314 -245314 -249393 18218 171659 252123 184780 48829
8105 48829 38817 107056 305158 302351 190810 18922 -73218 -65242 -97602 -127719 -163381 -199752
8093 -199752 -66906 -236713 -417194 -314481 -228824 -352578 -377336 -141961 249593 129334
8083 129334 142057 206066 22112 165845 240798 167172 246184 99552 102743 -48716 -114594
8072 -114594 -51889 80423 394414 344597 63289 235381 271835 362616 341220 293366 21077
8061 21077 -134638 -202984 -177498 -350431 -198495 -79445 -79372 -17455 49624 69993 166492 -214310
8049 -214310 -256398 30402 9392 -264805 -340358 -357254 -515666 -486964 -199084 176824 376608
8038 376608 218067 81868 -100121 -165434 -218432 -341933 -143421 -96981 3132 72397
8028 72397 -178411 -224837 -112167 58716 243814 58412 117046 69247 79206 155054 -47910
8017 -47910 -174416 -209287 -90034 -201938 -522882 -404401 -256132 -185030 -161148 -63129 113780
8006 113780 163008 241094 348199 236387 181281 147877 173533 396480 194673 17177 -130680
7995 -130680 -113469 -191443 -412555 -222034 146716 333576 452024 424133 215966 -47450
7985 -47450 -168730 -195803 -356232 -293373 73159 206588 114700 -148060 -298904 -188824
7975 -188824 -63151 43254 73197 249932 131020 -182981 -239015 -123319 -28438 -125261
7965 -125261 -133587 -130786 -224602 -210686 -305133 -394821 -70937 35154 26690 -136656 -46141 -189191
7953 -189191 -178118 -47839 -320605 -302924 -315372 -427567 -250250 -104757 -3633 176091
7943 176091 22473 -128403 -36416 61699 -7462 -137491 -191930 80114 -108949 -194131 -24057
7932 -24057 18336 -5779 59465 137551 359473 324967 42632 -183095 -222419 -9694 172193
7921 172193 314791 415963 314651 256204 207814 286205 238070 136413 233079 336313 20623
7910 20623 -222780 -123820 101385 125156 -138430 -393690 -261686 -254004 -455376 -435902 -246800
7899 -246800 -134323 -56025 25105 -102748 17171 63600 142322 191799 482088 416848 320078
7888 320078 53367 -13893 -26327 -79460 -103221 -175796 61827 83382 -194301 -306667 -477791
7877 -477791 -633206 -554385 -163617 15864 212309 224427 118949 402632 392661 345652 150632
7866 150632 -116178 -258219 -220046 -85392 221660 434871 468559 147380 227122 271300
7856 271300 90590 127045 325059 279536 127990 -105610 -262058 -330712 -378251 -401254 -283505
7845 -283505 -58160 127880 166756 229276 161181 164265 283751 126892 177794 43613 -10179
7834 -10179 230858 143988 15811 132454 67332 69306 -13629 -108107 -267247 -147930 -47972
7823 -47972 -53493 -236272 -242406 -232256 -225824 -341843 -217369 31888 104408 -103920 14786
7812 14786 -129342 -378445 -301476 -276542 46586 28474 -69477 -104331 -123419 -238414 -530240
7801 -530240 -471944 -485344 -465761 -418441 -448529 -379537 -338607 -555650 -595509 -255938 -43776
7790 -43776 175785 95677 -9634 84165 228830 184078 37556 -3991 -43313 -262983 -250505
7779 -250505 -132997 -230751 -87482 -24544 170251 439255 612689 501273 394664 334213
7769 334213 223948 186376 119633 209753 146157 -462 -255842 -319196 -219432 13303 101347
7758 101347 20341 -131884 -103789 -87414 -118842 203044 470563 301774 101453 48314 106135
7747 106135 -67691 -318698 -346230 -98307 -98868 -180025 -79364 -89357 40272 49446 -194348
7736 -194348 -36410 136323 40808 -68667 21130 23768 10827 -384348 -367894 -173754 -111060
7725 -111060 15908 117601 -3866 178201 186039 -45674 -534235 -639698 -349715 -197844
7715 -197844 -93897 -104799 -193760 -230828 -247008 -125576 -18086 117538 201401 64567 117025
7704 117025 24469 34652 -4822 -129816 -347426 -221114 -220410 -241035 -136256 58242 13689
7693 13689 -56972 -31850 23971 -63746 -102831 -259260 -175332 -90147 -159875 -176861 -207000 -238041
7681 -238041 -473660 -441008 -243068 -63516 1124 -160040 46421 139652 235121 129572
7671 129572 -92837 -265594 -291228 -102923 -21557 -7735 240910 253424 7769 -124468
7661 -124468 -99860 225739 302945 121361 -18755 -51449 57404 62799 24209 102867 77
7650 77 131980 210281 176739 188721 139563 -134357 -252678 -186381 -135504 -152533 -78054 -26675
7638 -26675 89010 -88104 -195735 -13017 336108 630765 692877 578581 365494 273403
7628 273403 429081 608568 449064 265758 264745 119620 -14437 -85538 62044 281223
7618 281223 -83596 -182169 -417315 -405143 -170921 55459 82871 311617 294456 102460
7608 102460 86884 -218947 -447184 -328779 -231349 -118165 -154893 -246813 -139637 68680
7598 68680 7748 4941 -47029 -35901 8114 -21253 -246217 -213229 -243223 -274904 -296455 -178404
7586 -178404 -260781 -86350 -22435 -97150 -147118 -108777 154593 143643 -15507 -200190 -235836
7575 -235836 -290392 -345607 -205307 -193562 -74428 -20196 66935 53252 126989 139883 275367
7564 275367 101239 37024 31080 16854 -28448 -103379 -80409 99056 131795 -171778 -381238
7553 -381238 -181864 -25320 -299673 -546327 -431659 -285207 -94671 105871 305832 419811
7543 419811 402187 376729 131203 -32013 -83029 -196818 -396776 -249498 47889 -113645
7533 -113645 -62226 -120510 -75938 37448 124797 98253 -124858 -59202 -186110 -270263 -175639
7522 -175639 -189309 -290686 -493161 -504836 -301078 -284575 -474357 -528701 -306693 -278051 50732
7511 50732 9368 -293588 -400500 -318985 -215607 -57528 5198 -90973 -415031 -375286 -144097
7500 -144097 -150049 -70651 -59963 37084 -75293 -225012 -61674 6749 -179799 -421037 -344841
7489 -344841 -292367 -305309 15413 -67616 -213557 -156840 -295796 -349893 -334692 -327189 -288036
7478 -288036 -78890 223954 300288 196234 -1443 -116870 -137933 175417 502736 329144
7468 329144 121290 -21583 -120052 103398 14721 6145 -150926 15116 -2585 -10460 -15351
7457 -15351 -48131 -355256 -301702 -102786 -159114 -229614 -230992 7608 191541 29187 -139698
7446 -139698 -39819 132006 101744 -115521 -22963 76603 173185 219414 360318 206320 -1647
7435 -1647 5378 -128200 -361973 -339385 -171414 -265114 -238587 -320699 -144462 88494 66046
7424 66046 18763 -96905 -131178 -62143 179271 409862 307614 -70613 -126561 -40446 -284587
7413 -284587 -382402 -193707 -11938 -71514 12048 -62551 -84976 -214547 -454299 -467206 -602248
7402 -602248 -571986 -474110 -434651 -351812 -184139 -138438 -262066 -256034 -169813 -130144 -144975
7391 -144975 -263732 -113215 -6537 -13747 -46611 -350256 -333225 -133730 -212747 -193655 -40305
7380 -40305 -183861 -106019 -67167 117481 -40023 -95667 -122881 -342803 -296837 -116680 -182661
7369 -182661 -100999 -149719 23834 309356 339465 279998 72529 -313188 -422024 -356406 -275841
7358 -275841 -263147 -127059 -266403 -231171 -169610 -292308 -268190 -94575 229902 360447
7348 360447 283285 107717 -35702 -217622 -434290 -468018 -456290 -275918 -393740 -324493
7338 -324493 -203296 -55192 79697 157035 173584 217652 62065 -46457 -95583 191471
7328 191471 369385 275086 54304 -57095 -11346 28634 -75471 -192168 -230519 -120810
7318 -120810 -40428 14229 14245 8640 -13693 -171988 -52793 312991 505824 348898 247620
7307 247620 55705 -59869 -16973 312853 54306 -12734 -23975 135869 215931 285654 313881
7296 313881 461122 305551 -37387 -394620 -532847 -272729 -59744 68000 -68885 -243443
7286 -243443 -262074 -32059 64832 -64899 -118572 -129964 -183225 -190806 -76367 162731 41260
7275 41260 -130715 -62000 108130 29724 59928 129530 208713 220927 173124 24160 -161530
7264 -161530 -67947 -10977 -130940 -385584 -430189 -370130 -279359 -118467 -110520 2527 -5306
7253 -5306 -124072 -58878 76038 73801 -18976 -25045 -68664 -51340 -144917 -152551 -239495 -145822
7241 -145822 -62589 34425 63319 -48409 101954 296181 165116 179439 -4398 33208 211475
7230 211475 140098 -201724 -230513 -109827 -49308 -55445 -208393 -103138 -212819 -245284 -248806
7219 -248806 -457899 -603218 -523071 -417350 -215254 -119669 32535 -128732 3369 33450
7209 33450 -59581 -271554 -454504 -491891 -326605 -149800 -126210 -137413 9399 -174702 -474064
7198 -474064 -453403 -579463 -616383 -401963 -158549 173928 -135820 -251481 -323042 -63262
7188 -63262 187515 279943 340153 263873 -19912 251912 199589 84504 96066 -36758 57982
7177 57982 -81198 -246473 -124648 -11294 259853 395049 379608 371303 147327 -26482
7167 -26482 15799 186618 234236 203807 -58390 -270840 -298063 -160338 119049 213922 -118840
7156 -118840 -142412 -45108 -137152 -121734 106451 219739 339939 111740 9444 -239938
7146 -239938 -136254 25052 -76349 -16674 81013 229737 412342 215750 18515 -45542
7136 -45542 -29922 -37811 -100772 -435633 -403386 140535 198547 150592 7684 150470 313559
7125 313559 80572 -106119 -410062 -532494 -196010 -63534 51399 151778 45701 -57698
7115 -57698 -13753 85275 19969 -103235 -261379 -120555 -76706 -94026 -100745 -204195 -238911
7104 -238911 -55196 18161 -218827 -301602 -239693 -175372 -66388 -237937 -274572 -40343 88882
7093 88882 242817 210032 64757 283788 328241 -64562 -210113 -188293 -44654 -126433 -126876
7082 -126876 -63428 49936 153347 281284 434322 411167 -104104 -268595 24874 218528
7072 218528 433962 361458 78192 -87459 -133713 150640 173095 135604 195049 -111965 -196035
7061 -196035 18790 157768 70365 102420 102285 52156 -133272 -152322 -361452 -219505 -70705
7050 -70705 110529 219786 43313 -73028 17153 2694 -76052 -118968 99649 290753 477551
7039 477551 310770 144748 -21908 -235123 -332332 -94045 304379 371321 148274 12281
7029 12281 107464 303690 62466 -256489 -201515 -242841 -92571 28160 57403 71567 -46894
7018 -46894 106665 219765 75340 233737 113518 6442 -210239 -306791 -179452 -125696
7008 -125696 -139233 52625 323110 82282 -243993 -364068 -345200 -362717 -353161 -442126 -207543
6997 -207543 -14455 87972 129941 -70409 -140282 -48308 -74962 64533 167135 -45217
6987 -45217 -17949 17214 -24231 -57191 -140988 -258644 -259396 -49669 98843 -136212 -422006
6976 -422006 -432709 -217388 -151160 -242911 -240351 112192 66595 208474 68830 2785 18383
6965 18383 121512 141309 -47311 -298426 -440552 -381039 -276142 -198603 -89163 -66013 -254977
6954 -254977 -403801 -332758 -89696 -58821 -60920 127168 -41455 -366636 -329532 -288283 -557
6943 -557 189985 116440 -54406 -15034 -116809 -229746 -376674 -409744 -350937 -454208 -314646
6932 -314646 -187058 -200291 -131165 113300 -103965 -395258 -441428 -484877 -441406 -195693 -193575
6921 -193575 -59535 137476 78542 20454 -10627 68063 -105519 -327841 -395303 -252132 -89533
6910 -89533 966 -123482 -32753 -20140 -125565 -35273 5242 -102414 -301901 -159114 -116395
6899 -116395 -153289 -176221 -207102 -28125 143889 202745 11930 -85110 -294502 -161028 111445
6888 111445 287716 151434 163113 77220 -77155 115607 -1890 -102723 -57534 -219825
6878 -219825 -250989 -114698 -105245 -156764 -113689 66314 135152 206472 332450 153362 -68708
6867 -68708 6077 -93205 -40598 95363 70672 -245763 -294051 -633792 -489582 -383725 -207159
6856 -207159 227425 277031 285597 180614 210749 80642 -54719 -251363 -439638 -406688 -179130
6845 -179130 69774 211258 176480 184857 119028 -121063 -32626 -17989 -23654 81997 250858
6834 250858 173036 -135213 -218943 24427 366965 405172 250901 -69145 -126211 -114658 -111430
6823 -111430 -305750 -201306 -125425 -146303 -54362 -248442 -110782 -37012 170975 268815 80663
6812 80663 -9130 75079 -33711 -2799 179043 365295 282986 126683 96253 94560 -196966
6801 -196966 -460143 -356933 -291035 -337311 -154307 -78841 -181831 -177643 -127364 -149067 -102277
6790 -102277 54030 11771 65763 -8036 -237984 -107064 113209 -169000 -296746 -225509
6780 -225509 -51707 23441 -111412 -133166 -63725 77790 -57325 -167373 -267147 -48746
6770 -48746 81327 53000 70094 149681 171532 133287 46294 134665 78855 -35122 -85015
6759 -85015 65568 94163 209926 287431 -39827 -55442 187434 157303 -23515 -229005 -175259
6748 -175259 -171158 -18804 -10544 230283 359819 202898 37093 -113161 -271664 -460709
6738 -460709 -342888 -80669 -26279 101715 58521 166753 401200 229936 71520 188710
6728 188710 225917 42467 -3776 -86529 118862 256789 152223 106391 122804 142288 109488
6717 109488 159460 205293 155287 117916 229648 109964 -29960 -147182 -216182 -194518 -274617
6706 -274617 -91205 250457 323955 374169 359296 324707 243041 120931 -224380 -359695 -108154
6695 -108154 -90789 -218197 -235780 -176808 -197631 -226642 -101425 28815 340912 497497 590035
6684 590035 577921 520792 604826 612205 417660 238762 210563 85715 -45073 173016 214053
6673 214053 74847 -76004 -138184 -128018 -325322 -316336 -269425 -314325 -150866 -66612 -168801
6662 -168801 -183417 -252639 -375665 -262272 -185788 -105166 -281996 -431059 -263745 -231711 -232459
6651 -232459 -39866 -173538 -217337 -119762 -117457 -27663 45367 144831 -163855 -333741 -167074
6640 -167074 -20820 -120628 -236375 -124667 3959 -207401 -172651 -197892 63877 14381
6630 14381 -8227 160227 262487 392997 542863 440882 411281 328216 247639 138699 185100
6619 185100 -145480 -250417 -245092 -321991 -25735 153867 130534 59706 163164 320348 493143
6608 493143 542220 425145 247107 -103116 -207609 -2795 999 -191239 -209773 -7248
6598 -7248 11995 14702 111486 219762 204415 157278 264114 366148 129238 -88165 -37758
6587 -37758 140296 173270 119955 -99797 13168 154721 98929 -326538 -587647 -510284 -472608
6576 -472608 -195398 -6959 164845 334462 215479 265750 265994 22563 -344231 -182557
6566 -182557 -308923 -179542 2256 51219 456 -147788 -451340 -642238 -326255 -36219
6556 -36219 -213465 -278259 -163032 -128826 4169 -47087 156378 189483 76141 -277939 -438468
6545 -438468 -364998 -39306 306235 81999 -133029 -241113 -98949 -53369 -218767 -215245
6535 -215245 -174325 -405889 -309856 -232217 -105087 -255838 -252028 -131467 -16149 13277 -164652
6524 -164652 -239470 -61873 30152 -118880 52529 5533 -42345 -17690 -252693 -393674 -282837
6513 -282837 -59976 48192 65645 46425 221208 412258 345093 130709 25591 78781
6503 78781 -174496 -97773 -44504 -33871 90800 97012 -269687 -257340 -70728 -107308 -100428
6492 -100428 -19867 -67756 50494 -146239 -478845 -354505 -188255 17249 217361 175369
6482 175369 -149903 -196429 -232753 -529543 -639659 -691835 -480154 -375978 -494412 -312047
6472 -312047 -378866 -364041 -369221 -157987 33182 -161016 -452847 -717124 -578370 -219536
6462 -219536 -23707 54369 64583 116521 -49166 -35129 19352 -42633 -293076 -316501 -58853
6451 -58853 -125603 -60157 -252857 -543930 -561577 -371618 -178811 -150817 -302638 -230545 -340709
6440 -340709 -425283 -400347 -378194 -458037 -449266 -222838 -205811 -63008 16827 -55795 202309
6429 202309 158050 244191 363966 176574 -19099 55493 143926 -167419 -286711 -49538
6419 -49538 10060 -132844 -250217 -47655 -59252 -69418 -219994 -358058 -327674 -166736 -153153
6408 -153153 -230574 -432926 -687866 -549776 -370880 -242752 70335 249998 247694 202915
6398 202915 57836 -9020 162147 181835 24131 -46777 -6420 -166678 -184061 -286420 -485571
6387 -485571 -440267 -227513 -79042 128207 179251 216274 69178 27511 133133 -85706
6377 -85706 -356087 -93889 161172 87703 -142405 -278737 -180437 -320548 -298605 -185166
6367 -185166 61709 48562 64064 241728 250925 131753 342096 300008 32989 -80310 -211745
6356 -211745 -272866 -173463 56071 32270 11008 116157 -91562 -241728 -359159 -466034
6346 -466034 -178315 -39207 -163831 -51612 44078 -195095 -162648 -95379 -84547 91524
6336 91524 20044 71046 58913 59003 201931 307880 550718 512098 335916 207902 91871
6325 91871 120565 -96421 -173108 -104089 -129315 -194887 -89727 184650 245777 -26477 253329
6314 253329 204069 58977 -75513 -153052 -210850 -100019 -82890 -99674 -203250 -274096 -166120
6303 -166120 -196699 -295963 -311251 -432796 -558428 -432585 -354624 -251917 -356816 -461177
6293 -461177 -227885 -6587 88761 44482 -191795 -231352 -19624 19992 5140 -235611 -441872
6282 -441872 -411973 -403646 -405806 -344403 -367044 -187357 -93540 -172155 -199783 -153207 11842 52039
6270 52039 -10390 -14137 172825 198995 -58347 -6493 38116 116941 23482 -215508 -90005
6259 -90005 101754 -36897 -107100 49933 159944 197456 122629 -23367 -225401 -222379 -47465
6248 -47465 -116498 -201991 -386863 -373542 -317814 -338898 -246331 -1530 -34033 -136618 -69575
6237 -69575 -24069 -426065 -477892 -345946 -446651 -472698 -508246 -631408 -431177 -249799 -258248
6226 -258248 -252410 -183379 -130703 -197594 -198823 -165780 -113530 -346014 -549294 -232994 -3123
6215 -3123 -74941 -153357 -218621 -331451 -406751 -295134 -177440 -203354 -135665 -64332 -149603
6204 -149603 -122106 -127220 -330121 -436029 -275085 -181453 -16519 323690 304936 308285 510145
6193 510145 337682 229659 158191 2984 -124935 10411 10813 113086 202447 -159933 -248735
6182 -248735 -135768 -82991 -19335 -23918 -37205 -77114 4989 105852 141824 23383 -49401
6171 -49401 167809 434885 429983 284897 449 -103252 -98347 -92398 -264536 -311864 -189146
6160 -189146 -13990 -5332 22078 -57990 -254777 -490354 -597163 -413216 -282970 -273003 -265005
6149 -265005 -335719 -389903 -317642 -129537 -260812 -519060 -332715 -336375 -476865 -475672 -305202
6138 -305202 -198635 -27574 -24669 69285 195425 64029 -51290 7332 -12247 -162104 -107431
6127 -107431 -64166 101530 77053 -37933 -28775 -57642 -34158 -170947 -492297 -325626 -138261
6116 -138261 -64574 -142430 -352428 -332947 -129656 -6277 148934 129553 47415 -188800 -332217
6105 -332217 58614 94100 -214487 -205953 173234 357893 198891 215514 194383 176181 149213
6094 149213 114708 53050 122083 99000 93940 66564 -57985 14993 96023 -173758 -108856
6083 -108856 7919 -146012 -99916 65600 -21797 137794 354752 442965 357135 110842
6073 110842 -77592 122788 262303 395114 325420 54761 -259738 -170946 -257762 -240978
6063 -240978 -14620 -179339 -351680 -227034 -276070 -207719 -200990 -285862 -207528 -200059 -244126
6052 -244126 -149263 -209612 -238390 -187787 -131247 15510 134474 119264 -27930 -179137 -354196
6041 -354196 -396586 -390091 -306047 -136947 -107194 -91145 -224085 -204643 -216107 -122170 26647
6030 26647 88663 47239 -51665 119786 -139649 -346207 -280496 50775 -13541 -268779 -260550
6019 -260550 -226526 -154727 -40369 43866 -15136 -96081 -204341 -183830 -124698 220707 501359
6008 501359 455979 313748 135156 10465 -252710 -317107 -269188 -257400 -174502 -110098 -15542
5997 -15542 -182364 -197933 -58210 101552 -60228 -138812 -2491 101484 80375 -168314
5987 -168314 -417863 -413579 -341438 -279582 -232355 -198851 -246965 -214740 -234635 -374619 -195409
5976 -195409 -123702 -134853 90591 14661 101658 155218 319639 450069 397154 254366 281341
5965 281341 354162 225532 -101755 -155559 -126692 108545 296 -149410 -55829 -53485 -26830
5954 -26830 -149340 -210938 -172308 -231663 -107833 -40206 -196373 -160497 -128177 -7732 206811
5943 206811 305421 277726 165728 20389 127750 399712 394665 388020 277755 233307 218984
5932 218984 5236 -12716 -77323 -482228 -570594 -536028 -365471 -70362 -181528 -287421
5922 -287421 -468287 -545888 -606266 -642836 -699450 -493640 -438001 -477733 -345358 -260044 -184575
5911 -184575 -155967 -9259 -47846 -340566 -470990 -489784 -639209 -825129 -713960 -599049
5901 -599049 -432927 79568 226733 133562 122236 -196755 -170898 -182126 -154624 39480 193635
5890 193635 304676 144022 154581 135922 -6048 -179177 33300 153080 -61313 -111735
5880 -111735 17923 108961 75707 -11903 -371963 -171552 -161908 -344491 -446318 -436590 -503166
5869 -503166 -476850 -155414 -223992 -415849 -278752 -127323 -78281 -63405 -184243 70454
5859 70454 16046 -108329 -27233 -109230 -125389 -98256 -158864 -152503 -176408 -284332 -267418 -204585
5847 -204585 -289532 -245072 -87760 -104908 -138923 16171 125007 18718 93549 136903 148961
5836 148961 192690 92166 27310 -16337 -102054 -192672 36259 -122719 -230263 -96490 6396
5825 6396 -7964 122794 305160 302328 172041 142546 194469 102215 165011 40097 208462
5814 208462 91631 -99247 -119076 -241689 -63569 -19569 -48066 -115998 -15091 -151909
5804 -151909 -145984 -339639 -515604 -547298 -374691 -90681 -235867 -311723 -63448 183569
5794 183569 431764 423932 460921 398942 78896 10121 34221 -172717 -99875 131225 158106
5783 158106 -36867 -70811 77875 289403 86804 -68077 -151170 -57812 127481 19937
5773 19937 19541 194202 4702 68872 -163370 -223707 -55012 112269 143656 20374 -210828
5762 -210828 -272066 -404316 -316023 -130936 30646 118941 127515 105412 101013 105106 110456 196418
5750 196418 301608 391483 530163 201846 -112763 -364270 -346826 -147278 61427 -52611
5740 -52611 -263761 -164202 -229666 -423014 -204585 -192209 -131335 33553 170473 2832 208336
5729 208336 347506 -41688 -325710 -229290 -349427 -289384 -196684 76823 440086 483187
5719 483187 280007 -112305 12421 88082 -100705 -36701 -398775 -612106 -445612 -395355
5709 -395355 -233184 -94534 -89047 -23504 43077 57377 34836 259376 482272 277231 -8362
5698 -8362 -87700 -247018 -289864 -299273 -288903 -94906 187399 254481 103835 -4161 219052
5687 219052 308172 -13940 -144141 -175436 -262896 -443172 -290465 -78122 55441 -32233
5677 -32233 45622 130648 149951 80520 -227075 -413667 -362329 -141902 -200619 -171959 -274125
5666 -274125 -223993 -54255 -131787 -217592 -37040 444574 510199 -66957 -376606 -203324
5656 -203324 -55935 47447 -175247 -291644 -247511 -326294 -462029 -564765 -407575 -156836
5646 -156836 -109444 -103148 -61662 -29522 95367 -80534 50854 56188 39565 2733 8918 -55145
5634 -55145 -370322 -465338 -489704 -507464 -443995 -128880 116677 89239 36014 23064 257963
5623 257963 251222 14452 -64589 -140367 -182247 -233416 -73875 80167 892 -227000 -484901
5612 -484901 -466446 -499217 -198851 160398 334114 82712 1736 110816 144773 -1717
5602 -1717 -191611 -120048 -161252 -93017 -213037 -227428 -101680 20100 -48700 -103808 -251481
5591 -251481 -157349 117310 455551 273201 244589 77883 5980 -221766 -104384 59099
5581 59099 94166 -13957 -34185 -53789 -173235 -161147 -119342 -213403 -240729 -136602 -114561
5570 -114561 -306343 -247953 -235521 -98153 -140571 120524 201736 291230 377513 256601 -75034
5559 -75034 28626 284212 226506 143707 149028 97295 57825 -323538 -198127 -165524 -230678
5548 -230678 -265777 -184140 13089 226338 -24050 -75355 66712 48955 -21049 -139001 -214147
5537 -214147 -357403 -321476 -327228 -177117 -82674 -214260 -223357 -153759 -407277 -421501 -163661
5526 -163661 -145647 -116416 -96704 -128957 135457 393880 374125 123330 9003 82354 241449
5515 241449 226843 271268 526754 261429 184753 197086 262323 306876 179379 242422 401178
5504 401178 371837 328369 449806 145215 102203 183341 265417 185029 19857 -251415 -352560
5493 -352560 -70214 122056 -41097 -35772 257976 305918 51202 -209443 -307459 -174317
5483 -174317 -313873 -224865 -120411 -182000 -101859 83665 85879 23879 -161724 -249673 -368000
5472 -368000 -235717 33956 273464 73300 -11801 115038 86044 52102 149350 25122
5462 25122 -119420 -319150 -476693 -479079 -295083 -362103 -362412 -234428 -41658 113220 300347
5451 300347 360025 210077 67209 210982 256303 312779 120793 -149317 -212696 -57128
5441 -57128 -140210 -224667 -147865 -55911 -77930 -50242 -116962 -338266 -355023 -198097 -70295
5430 -70295 16577 88945 31277 -245485 -212248 -166259 -392090 -259673 -3202 95522 21546
5419 21546 110022 -129917 -95325 -107989 -61678 87414 -16157 15946 -24811 -81441 6838
5408 6838 7494 -3501 212830 301046 191099 37801 80134 227526 106356 -132089 -135743
5397 -135743 -66211 -41936 -138886 -58300 25202 137239 234021 146551 22442 194866 319170
5386 319170 208061 106 -185915 -252913 -365107 -676844 -370835 -232965 -280807 -126967
5376 -126967 -231965 -218821 -166267 -116263 -68507 89177 -43179 -76569 -131819 -108633 -243796
5365 -243796 -38861 -35729 -126806 -41476 -162550 -98010 119773 47029 28321 57229 283910
5354 283910 435356 553956 358271 193420 184640 194823 4583 -171145 8797 -102628
5344 -102628 -222243 -157809 17337 281170 290971 189967 164997 -103482 -388516 -524451
5334 -524451 -519512 -513463 -409793 -424673 -267144 15813 183641 230338 -10180 -167623 -420148
5323 -420148 -672466 -512536 -312512 -60048 -31316 -44531 -195460 -113789 47718 214174
5313 214174 112330 -217391 -544276 -602415 -349740 55440 9987 -162192 51372 369067
5303 369067 553994 483037 331489 350850 395343 351942 269934 183341 83925 -18376 107186
5292 107186 76342 128896 364174 405884 282641 315692 394123 226006 286244 302581 278823
5281 278823 179737 117481 108896 -28637 -164682 -3440 -45626 -152723 -193797 -93372 225611
5270 225611 3766 -176599 -62659 66554 177664 150140 67294 138863 126823 42692 356131
5259 356131 318574 101080 13371 15542 -89602 -156245 -247081 -282432 -253750 -281325 -494996
5248 -494996 -556310 -308847 -123369 -162186 -42272 172116 129988 113007 36336 4710 -77587
5237 -77587 -35478 65891 -4067 -27506 -274093 -576821 -687595 -422132 -9061 113226
5227 113226 47291 -201328 -185287 -291498 -356630 99862 224647 282985 168334 77028 -66312
5216 -66312 5263 53043 -48683 -290995 -266500 -41657 78415 31139 -48827 38736 -46470
5205 -46470 -286642 -401717 -532279 -599676 -432499 -239739 -96294 -153116 -283388 -160889
5195 -160889 -214986 -220313 -213271 -282056 -365868 -231375 -192647 -219573 -39929 262466 428731
5184 428731 287055 419127 442916 256708 324617 425688 396818 206095 154713 254890
5174 254890 345614 273616 416208 433552 251849 121653 21450 84626 149359 -45303 -323028
5163 -323028 -278944 -93922 90404 66839 168725 221689 245242 -1788 -45012 19238 252203
5152 252203 266190 163381 7562 -172648 -127111 -59955 -64603 -296982 -437032 -429804 -162446
5141 -162446 84023 877 -143400 -146564 8872 123239 10091 4747 -15691 -99588 -167334
5130 -167334 -246724 -310868 -112505 -161216 -116118 -1092 263901 205349 201372 207546 147860
5119 147860 -80900 -461646 -415416 -82462 -54924 -28591 -33621 249788 286849 17858 -311522
5108 -311522 -461222 -330921 -151090 -53535 -226891 -361851 -250530 -258093 -231421 12622
5098 12622 28266 71995 62450 -151793 -156255 -12566 -10242 28395 109451 149132 -249 59625
5086 59625 108030 28569 210074 288783 355337 538208 403178 271183 185642 121628 126780
5075 126780 210404 62017 65088 -28341 150190 367842 270289 -3440 -183538 -169362 -145509
5064 -145509 52157 195996 498733 505122 498791 478921 166847 -74219 -30488 144883 244078
5053 244078 136385 76027 73028 235207 266366 184629 248866 102631 -153723 -107638 -136903
5042 -136903 -217852 -232737 -255928 -211600 -18650 -131408 -67730 -187239 -111750 -33751 82952
5031 82952 163081 196025 134568 -121391 -94773 -164390 -193840 -89676 -63102 -81209 76024
5020 76024 5393 -125615 -95449 -61111 40477 123903 149521 177929 120568 -133979 -49884
5009 -49884 -25151 -75611 83051 191702 207471 101033 28478 58762 51121 -5530 -283339
4998 -283339 -162717 -28310 75578 -22084 -28590 -58305 -245480 44555 316616 91633
4988 91633 -59908 -50665 -43498 -69751 -38174 -77862 -36335 -28629 17685 -142692 -167433 -22491
4976 -22491 249543 188619 -180843 -436769 -312705 -197524 -206776 -64845 -214211 -404457
4966 -404457 -152169 -153119 -196993 15483 60230 -193829 -195542 -103610 -47391 81580 153727
4955 153727 -5383 158426 317003 394220 404068 224806 376569 574392 381426 116007
4945 116007 10599 50529 166537 78687 -97047 20534 -19253 -25261 -52769 -162114 -9811
4934 -9811 -9195 46416 161849 307860 360672 470704 471621 283666 200883 41155 -194585 -310986
4922 -310986 -65558 69315 27289 -17420 -37630 157771 277546 36393 68422 292162
4912 292162 448252 476527 458193 428362 186689 2987 -86190 -256222 -159174 -202117 -204233
4901 -204233 -172865 109074 -46123 126832 277772 413615 517403 427217 323859 304275
4891 304275 293746 326903 152748 -18074 -76085 -147306 -220020 -138159 91373 110720 -104804
4880 -104804 -347579 -357561 -221427 -178248 -537731 -585913 -501469 -332659 -21096 155798 205420
4869 205420 162116 186780 155852 -23796 -224522 -188455 -141100 -90937 189459 339226 288955
4858 288955 236700 380765 476489 506282 413212 65737 119134 -42891 -566801 -467820 -148608
4847 -148608 116292 202236 66621 58388 36716 254241 21235 -143830 -37561 128094
4837 128094 39402 -70923 -14571 -239399 -131532 -101338 -79264 -193492 -253706 -336540 -408375
4826 -408375 -335553 -189695 -64155 -191024 -277851 -327907 -178742 -30754 -68570 -275753
4816 -275753 -156637 -23661 56740 47133 -46585 -86916 -201134 -268748 -245615 -107685 -92941
4805 -92941 -113116 -17983 -139712 -207864 -91612 246636 357224 303781 13157 -215286 -275377
4794 -275377 -205696 -298858 -202148 65375 93960 96870 126052 -60067 -358276 -392158 -215568
4783 -215568 24909 65481 164096 -95653 -242282 12111 176982 71151 -99848 -24218
4773 -24218 9005 -24252 -117098 -112 342073 429638 391864 431775 406224 226406 100037
4762 100037 57882 258785 258938 156211 140575 73559 99335 -135583 -368245 -168949 -18462
4751 -18462 -76863 18519 89562 222455 466197 446932 393434 668295 637725 266178 -96091
4740 -96091 -147028 -197279 -215026 -171980 -202636 -255248 -67078 241410 318985 179895 110505
4729 110505 -157535 -86494 -1426 47376 172148 78682 -171970 -256386 -294997 -264693 -125595
4718 -125595 -168061 -215251 -256863 -242658 -115797 -33467 24782 21077 -165648 -97929 89036
4707 89036 345683 300337 176559 108490 6175 85708 -33102 -224104 -332581 -188295
4697 -188295 -135396 -54532 -24549 132598 21836 -145704 -183874 -285865 -260846 -394966 -420771
4686 -420771 -389529 -324759 -219685 -202790 -47229 56976 77433 121475 203604 238228 100126
4675 100126 -191523 -396003 -230529 -15189 62149 -5868 -24916 -3218 154630 253746 20096
4664 20096 -20185 374338 351057 -21906 -343689 -312021 -207019 4330 -64803 -365335 -350591
4653 -350591 -119991 40154 -58473 -237992 -310307 -381132 -508166 -340862 -345192 -219995 -139870
4642 -139870 -33126 74967 82095 -64158 74215 84557 -14996 -153376 -38816 96041
4632 96041 -19021 -167631 -111898 -76946 -44665 -126169 -222773 -138069 -72186 -240549 -281504
4621 -281504 -212623 11255 100088 243590 156219 -58882 -87146 -19559 289975 377852 71479
4610 71479 75928 195219 9113 106558 184994 -39026 -177293 -242845 -75851 -8418 -133132
4599 -133132 -344538 -134946 9242 49066 21490 -62904 -134089 -226327 -238178 -50629 -35558
4588 -35558 -195254 -294300 -145206 -160664 -157524 -156511 -184460 -254683 -192308 -171672 -31131 4002
4576 4002 -75511 -76134 -46892 -20327 54240 -94308 85702 55192 128274 136658 128480 120067 31120
4563 31120 -83516 -320301 -201580 70117 154201 83100 181901 64995 -44624 -126276 -267664
4552 -267664 -295144 -254339 -96918 351465 676184 634587 427100 256681 156048 66809
4542 66809 729 -12405 -68367 91763 91066 245178 353846 437119 275921 77631 82199
4531 82199 57133 123013 180310 179295 -10487 -217841 -381534 -405740 -292976 -220257 -194166
4520 -194166 -194683 -52244 -178929 -286744 -97685 93904 159913 216525 179459 -46321 -102376
4509 -102376 -37757 227422 58850 -43366 -144145 -203848 -177927 -216113 -103241 70936
4499 70936 350198 239837 141645 277480 399563 323015 324280 468019 373716 366998 153163
4488 153163 230649 249700 131589 276921 363766 352299 265894 330654 368801 176804 28725
4477 28725 223062 103028 -37320 277522 419533 190122 69838 50229 220477 45700
4467 45700 68078 167640 176239 224666 244669 251933 104909 67282 -25011 142622 379877 275128
4455 275128 29801 230320 518074 238261 65510 -86917 -180606 20114 302302 322772
4445 322772 258627 99178 182468 201657 170078 163530 81554 140244 76242 162330 108630 48485
4433 48485 59727 78771 185180 185485 188956 111198 -22988 7440 40263 171235 66655 58226
4421 58226 41658 224099 333005 295744 141490 100062 -55685 -241825 -101087 -301630
4411 -301630 -336516 -100981 -63801 -81799 -76185 -61491 1884 -20770 90100 110307 -29994
4400 -29994 -81629 149276 178808 205448 516488 386437 88214 -252454 -368022 -389163 -196145
4389 -196145 -263193 -465820 -281662 -84865 -82026 -298896 -326734 -40062 348993 311078 39897
4378 39897 140296 179493 42417 9918 193274 121753 -57477 -41745 -179065 -451260 -336322
4367 -336322 -27357 151928 289055 201543 -124848 -304094 22476 219934 -22215 -89220
4357 -89220 131622 -14720 194336 141185 199359 109776 -81073 -309514 -413150 -214576
4347 -214576 -328697 -232615 -321092 -73009 109634 -14246 -120050 -303076 -442333 -446274
4337 -446274 -338339 -250053 -283644 -253646 -286828 -93451 49204 -14140 93174 76288 15599
4326 15599 -74976 -50184 -78609 -37315 -27660 -57817 84987 -44458 -177903 -215386 -125898
4315 -125898 62390 55069 -134516 -78699 -37954 -239265 69000 319949 113180 -331641
4305 -331641 -243648 -82050 13407 307593 404157 426441 361766 443999 233565 249374 76902
4294 76902 -96218 -15999 14799 -28083 -46261 -99716 -29991 239322 181379 -4081 137873
4283 137873 39964 -156787 -326375 -479662 -412500 -370413 -221169 70035 48122 -111352
4273 -111352 56494 99161 55575 91070 114132 116795 13880 302008 501151 491791 629791
4262 629791 637847 448554 108044 -310644 -88578 158422 206262 -13587 31802 -308 -81290
4251 -81290 -95052 -89267 -192019 -269828 -239694 -180107 -417011 -102476 89247 -32771 -138440
4240 -138440 160443 162634 65218 -148523 -109097 -30806 196722 85397 141412 90394 -204797
4229 -204797 -271475 -418317 -425186 -175601 -58050 -38958 112208 79993 63841 128245 235436
4218 235436 96188 -101891 -153866 43237 11851 -186766 -270793 -116765 -239120 -446959
4208 -446959 -431250 -241447 -54123 197272 119572 42585 -67182 -183560 6031 -63028
4198 -63028 -90695 -259259 -371462 -327631 -335782 -120979 -129726 -29333 -110680 -241531 -443805
4187 -443805 -471585 -418710 -300269 -93012 -107976 -51267 -251374 54864 271723 352471 210294
4176 210294 128490 300146 367706 448993 307970 34301 -50625 -30559 -3541 -113004 -115552
4165 -115552 -61569 -129500 -239183 -226802 -320027 -304974 -425476 -447745 -285650 -107722 60024
4154 60024 -62478 -49327 123587 219286 50291 1657 132116 80504 -169530 -236029 -109150
4143 -109150 -101708 10612 -55051 -103445 -177176 -367760 -103528 -203642 -526667 -534966 -504973
4132 -504973 -623959 -383383 -81571 -163612 -148870 -125858 214437 377358 220646 -42280
4122 -42280 -13137 -98292 -34072 106184 128072 2068 -34683 105493 267734 16438 -71179
4111 -71179 -192024 -455335 -397175 -124938 -43623 81186 55203 -15614 -14906 69864 94555
4100 94555 -97879 -204966 30556 47143 -6313 -183319 -83584 -68799 -224397 -154925 212049
4089 212049 466493 684093 868549 682565 121777 -147945 -240663 -218482 -2790 247225
4079 247225 5099 -31109 183791 -36481 -91936 30215 -25907 -126205 -235259 -275649
4069 -275649 -232476 -126322 178770 316471 287962 249397 134560 140203 143497 247586 393881
4058 393881 211367 16786 86002 -23524 -60808 24602 125035 316964 197488 55276
4048 55276 155529 348106 471689 279874 150126 -2184 145867 189643 232087 304784
4038 304784 59665 -140254 -64816 -256239 -216740 -126186 165537 170006 84325 121532 370846
4027 370846 388887 210051 349987 416638 19567 -266555 -85786 183958 220369 318459
4017 318459 335697 263547 106301 192401 344338 176492 224445 268731 243515 91804 71506
4006 71506 399069 400883 310601 429276 396428 361463 226962 210374 206727 -120886 -184020
3995 -184020 -26439 -71597 -45179 92866 235378 -74272 -251447 -199005 151450 150578 66979
3984 66979 159401 60980 -52944 -155900 -107900 129934 22240 167251 209273 123203 70459
3973 70459 -126127 -305202 -88568 75926 38070 164891 188933 168661 98464 168609 12767
3962 12767 -42201 130917 249079 287214 157996 -26919 -42765 92804 126657 63117 99686
3951 99686 441553 173552 -136759 -158364 51627 202222 263688 61337 -260380 -246404
3941 -246404 -360605 -260999 -301016 -319501 -23634 72240 124872 271091 492972 153550 -209809
3930 -209809 -392796 -531070 -326528 116870 262989 225583 -7881 -186957 -174474 -80767
3920 -80767 100446 24182 -62571 77441 178892 65968 5462 -228813 -245732 117132 153646
3909 153646 161544 114206 47508 58477 -31159 -169031 -168563 -382346 -546472 -270112 -82109
3898 -82109 -77105 22532 119312 -23897 -145836 -286473 -306811 -36143 -93620 -327633 -232291
3887 -232291 -28587 309544 342284 147096 148817 23695 -204013 -358578 -299332 -99588
3877 -99588 -82814 -86238 19310 15688 55652 31294 191295 218148 9535 158597 43363
3866 43363 -123189 -50060 -205178 -362262 -423874 -349156 22245 174108 217611 269062 272401
3855 272401 300342 141251 131116 217642 189542 271130 212152 109913 119554 62890 290977
3844 290977 528792 311777 -39066 -54080 270697 342284 130200 -100309 -154348 -320144
3834 -320144 -386005 -252142 -255837 -402199 -473964 -328550 -49591 153085 140276 68265 -190393
3823 -190393 -186540 -317683 -415875 -237408 -208584 -111977 32761 -79054 -377813 -312499 -34969
3812 -34969 100463 66827 -31840 222004 236672 -104509 -198812 97408 33557 -157670 -201693
3801 -201693 -50836 44923 66955 250213 81846 43661 208410 158788 -41997 -69000 -65707
3790 -65707 153444 146306 294426 294766 -63066 -283453 -432677 -306925 -271374 -401971 -87734
3779 -87734 365234 314648 21899 -173542 -370076 -297144 -310621 -329953 -181188 50870 3604
3768 3604 -73278 44372 67114 -145532 -267470 -121536 -188188 75725 93178 128381 -77044
3757 -77044 -144823 -71007 26250 -86100 -296780 -505552 -680278 -416292 17895 46463 104488
3746 104488 248348 348631 339801 287508 182066 141590 16556 -101130 -32465 81544 168745
3735 168745 102615 -182682 -295717 -419215 -529117 -664503 -452935 -333292 -230815 -136941
3725 -136941 -334214 -294925 -313168 -407044 -236727 -153726 -221087 -236392 -50705 -72304 62282
3714 62282 108960 61691 -124562 -93182 -75700 -75605 -130119 -36411 -262527 -333454 -207803 -394843
3702 -394843 -489797 -399565 -157761 -17684 -198226 -499731 -609964 -438822 -257507 -307497
3692 -307497 -529379 -649918 -282498 49713 106114 159132 4647 33841 307692 255823
3682 255823 -84282 -270977 -213691 72134 159620 37855 -43757 -85761 -158764 -159765 -409713
3671 -409713 -318765 -285261 -542258 -495020 -288743 -189724 -24087 104277 120669 12763 -65276
3660 -65276 -86363 30455 21225 44734 77666 -102023 63059 174109 152228 264141 38176
3649 38176 9217 66087 -134946 -263582 -64613 66471 222075 283834 208148 111895 13258
3638 13258 -34960 -104725 -196839 -81306 -176281 -355126 -300667 -144156 -6343 201070 77792
3627 77792 55076 59782 992 -200833 888 326959 400376 475502 157523 70316 36120
3616 36120 -130538 32475 151529 150669 -103838 -392403 -333501 -57281 94854 227135 143096
3605 143096 287750 166573 19001 -213882 -99869 21189 145668 271353 288851 228869
3595 228869 -132563 -293765 -244550 -164734 -253021 -276442 -413524 -529442 -585763 -328231 -5925
3584 -5925 13251 3144 40649 58468 -8865 -285836 -79531 -79241 -278408 -215824 21334 86160
3572 86160 -63657 6685 340930 370113 214900 114756 -12102 -88433 168337 195054 195688
3561 195688 -114877 -409077 -169004 61287 260756 216764 201084 336946 80227 -178291
3551 -178291 24816 358098 256282 -40500 -46095 25299 24942 204167 478747 552122 294188
3540 294188 159029 139350 57835 -97595 -99917 -52332 -188392 -60471 29268 16531 15413
3529 15413 162539 286628 478681 437509 351629 390780 131624 44082 228268 146003 43639
3518 43639 -127408 -101628 -214262 -45495 -27356 -206647 -231651 -157695 -212153 -400781 -224041
3507 -224041 -42086 30209 -118348 -205221 -251493 -253769 -329072 -269560 -42170 149678 -70307
3496 -70307 -456848 -505659 -75905 160763 -74927 87026 294525 218900 -27661 -62857
3486 -62857 -15949 3746 85142 -277920 -512532 -598899 -566907 -323991 -223817 -302997 -332334
3475 -332334 -177154 -250733 -163716 -1738 -178997 -383272 -187900 -107074 -24838 63654 -65946
3464 -65946 37737 -24752 -110658 -2565 -179559 -138303 -177092 -84358 186935 419245 307518
3453 307518 366945 177836 373836 541521 394898 185017 228091 221085 201799 61183 57737
3442 57737 183421 293807 349876 115332 35540 -40464 113534 193928 124563 121870 90996
3431 90996 -201708 -373793 -306687 47239 338453 367107 189448 78067 195603 395183
3421 395183 356723 493257 610258 334265 394034 211922 74509 37095 13653 -21842 65165
3410 65165 -71795 18943 95319 42398 -21633 -141144 -340091 -342628 -156465 -59653 -33642
3399 -33642 -92205 -280960 -246771 -179225 -55519 254423 403795 396991 280263 -42146 -364187
3388 -364187 -418296 -371697 -79778 -94760 -414955 -334590 -234623 -268911 -284533 -259493 -303923
3377 -303923 -380794 -293840 -90401 -26029 27775 40417 -103565 -81428 -11909 -94845 -217903
3366 -217903 -227077 -18784 137530 -153794 -44986 273689 274082 335673 444946 310760 161079
3355 161079 436556 631347 578033 297390 -22892 -47531 -86602 -218525 6182 129102
3345 129102 152485 31686 153838 -2503 -67627 -144793 -76836 -282263 -387158 -543969
3335 -543969 -478266 -433624 -525944 -176354 242523 422884 184723 -152963 -109543 48931
3325 48931 -22084 49241 42283 -6329 -41549 -12245 208234 309498 232671 169077 241168 288986
3313 288986 381179 250358 308447 268154 177384 -9361 -90391 105180 213906 -18324 -117644
3302 -117644 -101807 109051 228912 484940 568793 361642 161342 83975 48320 5566 -98214
3291 -98214 84218 280005 334858 12060 -136898 -195188 -194382 -217250 -116520 -14630 68368
3280 68368 -34489 -158735 528 41594 74420 115473 198222 156666 152267 42788 115989
3269 115989 279245 454896 398896 192020 48393 -140089 -471006 -409308 -349348 -311067
3259 -311067 -148403 -61440 12225 34682 -9135 226061 237153 219782 79741 172705 137750
3248 137750 204325 403068 275825 242062 388590 437181 407708 104214 154615 265525 212642
3237 212642 230429 1121 -170311 -63775 269407 302326 178631 333774 294200 51606
3227 51606 -75460 -114363 -112285 103216 342003 338606 151207 345036 560912 618981 486843
3216 486843 191628 378660 516686 222296 -27038 205732 251602 -27403 -149639 70785
3206 70785 186392 183955 33960 -29751 -54685 -238330 -406171 -530114 -447880 -420883 -250896
3195 -250896 -29663 76981 149869 20512 -196614 -462465 -538758 -540586 -386092 -177593
3185 -177593 -73864 -175022 -293577 -239731 -176718 -115611 230048 256118 200206 70438 -114024
3174 -114024 -78505 114728 69276 58822 -2493 -82814 37402 446767 425671 231899 299186
3163 299186 224060 470947 255443 -182692 -265209 -235226 -89935 -111161 -256466 -159332 -106006
3152 -106006 -446959 -266463 280400 323568 313405 169189 254326 488822 275701 82073
3142 82073 41347 84042 191916 161156 -1672 -53978 -127875 -103864 100973 349018 322395
3131 322395 113312 284742 265748 359538 278491 281338 173961 145973 123051 290809 150530
3120 150530 179647 183911 -132944 -149817 -120808 -14412 -103284 -61611 -158827 -264517 -195450
3109 -195450 49474 219995 200059 10421 -122978 -148720 -111081 -246671 -433042 -387589
3099 -387589 4398 226716 121654 -17298 -51440 24352 -31326 52328 58816 90000 -23021
3088 -23021 -94668 -120502 145986 280124 255654 52638 104278 166919 22310 -101883 137084
3077 137084 104292 1104 -81907 -21077 56243 -64772 -162878 -42017 -54696 -303652 -278336
3066 -278336 -136724 -100678 5293 -110628 -191090 -261108 -341865 -73894 154040 -694
3056 -694 -261115 -83709 -24523 -83864 119358 227717 103356 -19286 -79356 -115008 -220752
3045 -220752 -375906 -520045 -501535 -242358 -67540 52196 -198355 -345930 -231042 -189433
3035 -189433 -339579 -455588 -352916 -138683 -110893 -55796 -270347 -345619 -300767 -194746
3025 -194746 -44265 -101820 -168316 -256018 -139565 -35415 -57160 -150640 -255517 -242705 -295414
3014 -295414 -222800 -231963 4462 -25318 28630 -102273 47515 153849 44355 5139 -121218
3003 -121218 239805 341545 -26133 -307261 -551732 -198576 -16325 24551 -22477 72833
2993 72833 394753 266213 -48433 -113342 91482 69862 -129276 -264327 -262949 -247515 -63262
2982 -63262 225382 33302 -114393 -69377 65057 273748 405184 391977 321322 132080
2972 132080 129407 -50218 -155955 -75638 -43716 -420341 -520339 -468462 -435530 -223484 -49573
2961 -49573 337622 381412 -32200 -134641 -173686 -59200 58559 52337 -2556 -58482 -202746
2950 -202746 -163691 -87284 36717 9869 -113829 -337726 -344882 -277757 -290388 86237 205891
2939 205891 446170 588785 270199 -2488 89325 258142 131415 87516 58170 -105212
2929 -105212 -135383 32228 61226 -59382 -210094 -113447 -163015 -204511 -144823 -221815 -22309
2918 -22309 -79081 -57745 33841 -157500 -552311 -519260 -327921 -304763 -220401 -29667 161930
2907 161930 137738 -50388 -77003 -141868 -39005 -59559 -45135 166745 162921 -210282 -318936
2896 -318936 -359663 -284606 -102862 121988 147804 108711 130409 120344 -41349 -298096 -278313
2885 -278313 -115759 -160460 -130731 -186251 29849 56950 -12295 -243353 -222305 28767 131625
2874 131625 44657 -99388 -301541 -239632 -91443 -177184 -217099 -136708 66147 243306 -35055
2863 -35055 -94458 -148875 64993 40838 -193973 -61216 112707 174217 344743 222310 14503
2852 14503 -89939 -80117 -327128 -489553 -569483 -403980 -227276 -38211 -87458 -257124 -133525
2841 -133525 38089 150391 296639 313592 315691 459447 437608 300851 172115 31585
2831 31585 24521 113487 -19681 73287 154326 94671 -22979 -32556 223744 309920 420541
2820 420541 268410 -202487 -76533 -34031 103908 82293 -83712 -80799 -69305 212341 237628
2809 237628 176964 -224289 -440345 -270968 38214 166005 155122 294597 124149 202827
2799 202827 -27426 -265041 -180724 -73376 22876 -71864 -190109 -124831 50572 65972 -100376
2788 -100376 -16817 46659 -120520 -290611 -42527 226596 122975 -78308 -141355 -5716
2778 -5716 -194695 -136085 13843 16089 -163537 -129939 36739 -14724 -80339 -221717 -43382
2767 -43382 122198 -200216 -368950 -435907 -499179 -622796 -603278 -244556 -345605 -285520 -309100
2756 -309100 -143817 -107244 89657 175712 61162 -115215 -61784 193675 388158 203630
2746 203630 101508 87424 84613 164868 164724 87638 129836 198304 239460 341832 484015 387864
2734 387864 243527 24439 -221596 27758 145224 261780 410130 364711 124918 -9355
2724 -9355 117558 119415 -238565 -222738 -245517 -186989 38849 68234 56499 -304485 -243171
2713 -243171 -90243 -101141 53065 109379 43246 -50772 -117607 -227700 -12898 84580 62994
2702 62994 51804 78394 82884 -45566 8794 -42405 -255051 -85040 95675 73494 122114
2691 122114 329441 473810 524821 559570 353323 131473 -33684 -50156 239371 308056
2681 308056 -90455 -262227 -66393 53569 39340 30549 54949 160 -360903 -322359 -42434
2670 -42434 77164 202202 136611 -123219 -225475 -51797 -33536 -190975 -152910 249757
2660 249757 495845 351546 160035 104421 93300 176074 387337 324702 310768 160533 -91041
2649 -91041 -83289 -39020 4004 13255 -25407 67516 269462 235155 -92958 -212399 -102679
2638 -102679 56583 130989 -38196 -62432 -106319 -264073 -147554 -298141 24160 173726
2628 173726 89511 -64619 -55678 -230283 -344579 -513199 -608801 -457130 -299319 -156679
2618 -156679 84007 -7675 47211 170167 162338 209536 101472 -72374 -167699 -218272 -181771
2607 -181771 32424 50134 757 20453 -60797 -233 99282 7208 -76258 -90842 -299597
2596 -299597 -452258 -123059 -157894 -352809 -343183 -102884 96396 82410 -218661 -231120 -289200
2585 -289200 -143854 17030 -69983 -310954 -393726 -253920 -318184 -135848 70193 32933
2575 32933 -198696 -265398 -183935 12998 44419 -146237 10786 263626 310732 168934 142292
2564 142292 -91421 -125921 10940 -116504 -270826 -139607 -67283 -76197 33283 117138 -17813
2553 -17813 -311767 -269541 -122807 -239798 -190054 -301060 -209410 -14554 19769 232619 322806
2542 322806 167952 13028 -49032 39982 128462 252954 355688 255041 259260 405961 441579
2531 441579 447876 235470 376820 474824 434278 209305 -107806 -433475 -339471 -223730 3677
2520 3677 -7913 28362 17050 -64454 -266234 -242436 -194481 -223678 -61216 6643 -73277 16325
2508 16325 -105333 -203709 -70606 -219023 -203022 -65578 120889 6857 -88232 -139539 -20051
2497 -20051 71137 84217 -180182 -337404 -364321 -344187 -384621 -201505 8191 177939 252492
2486 252492 89952 -132315 -178464 43638 384920 517102 606356 490403 -92980 -113605
2476 -113605 31515 82295 83113 14467 45768 37595 126277 96757 -75782 40786 222423
2465 222423 27728 -242788 -38489 -46142 -208436 -209435 -204931 -115145 1823 27960 -25017
2454 -25017 -112634 31969 234283 254644 26008 -124889 118409 513837 581633 501830 173867
2443 173867 153803 134209 73185 64804 -26281 11938 196753 247203 92576 -1582 147775
2432 147775 38101 80540 142202 8870 -311842 -479964 -408965 -516758 -561131 -694002
2422 -694002 -626512 -414674 -332166 -211509 -164041 -90951 -151451 -43476 253437 204440 -43059
2411 -43059 -138759 -463491 -320359 -99590 -204210 -160192 46826 129704 178913 -45057 -9808
2400 -9808 -41635 -185935 -115444 -38846 -74319 -71619 47396 -37490 -22614 -137037 -183733 -88321
2388 -88321 -1450 50848 52712 -87835 -144335 -213808 -430855 -351416 -43801 949 20651
2377 20651 54444 76378 -6018 -1682 -191112 -153419 133999 213742 82081 -17607 -121922
2366 -121922 -65806 226399 151819 -9370 -11304 56683 166422 413107 579536 523717 211749
2355 211749 107871 133576 159829 10277 -158379 -310493 -190799 -28237 -74984 114791
2345 114791 267125 448043 488585 257822 -7687 1074 15261 117171 93340 -57923 99542
2334 99542 286915 389879 439629 276645 95404 119848 50593 136735 387915 574709 339797
2323 339797 59831 335936 325393 64687 297309 434276 405537 293791 305340 175796
2313 175796 78693 -50255 -136482 73956 128527 22795 -66036 6516 106414 80531 173841
2302 173841 59209 -44338 97403 34019 142040 171787 -161343 -190718 -80630 -75882 -186392
2291 -186392 -79626 33099 -140343 -205352 -14722 149849 173725 87615 -90366 -29674
2281 -29674 -40983 65284 147017 8480 -108717 -73000 108503 -12772 23213 106794 128689
2270 128689 -183825 -389838 -303955 -356115 -290184 -81487 -67500 70484 235397 73278
2260 73278 -104215 -129374 255784 650737 531266 267714 -41041 -127534 35533 -29638
2250 -29638 -157481 -95622 24121 308457 483832 568328 517138 308149 217803 183788 -27996
2239 -27996 -219330 -180153 -372689 -397827 -165861 -170232 -127597 83420 310338 297388 271079
2228 271079 24758 125087 147616 7044 23695 70629 169508 381844 63366 -68752
2218 -68752 -267553 -384255 -420705 -306013 124106 112286 60970 200899 214605 69582 150343
2207 150343 70857 48112 156430 168833 -151752 -165130 15322 64380 219234 216020 -50749
2196 -50749 -44482 -71069 179666 279285 360227 106020 -215290 -347479 -239719 -16802 242121
2185 242121 274088 351596 136692 -10623 236109 248850 377947 340923 529135 659517
2175 659517 700170 342890 177464 109446 35302 -34158 -206750 -195970 -81495 -147785 15366
2164 15366 18139 -386555 -515578 -434745 -215062 -111679 49316 -14669 -111109 -113223 -140840
2153 -140840 68969 131342 -73837 -134088 29859 170242 -5090 -40245 -147481 -114566
2143 -114566 -135001 -218185 -116753 202499 288919 79092 62687 45455 97322 218503 394241
2132 394241 258177 166698 -20692 -44791 -77414 -74765 -36505 -99540 -41479 52234 -125662
2121 -125662 -264355 -120636 114124 99087 146854 302374 336287 276302 326440 363275 -35625
2110 -35625 -3164 62240 34703 45309 148219 51099 -14475 -30700 98372 -45402 -227119
2099 -227119 -138316 -120376 -309910 -163348 111998 59700 -87773 -155952 -46202 222363
2089 222363 444786 339426 285169 211019 370182 399020 366336 352666 280530 177113 157874
2078 157874 228200 141577 20138 111658 239355 200806 215311 226889 43435 -255937 -281869
2067 -281869 -357038 -138187 -132188 -107801 -31188 -189771 -166825 -148217 -264499 -28451 72077
2056 72077 94574 -26300 106920 295362 204116 143097 141413 65083 -61436 -31020 190325
2045 190325 291414 203197 171217 199299 55803 177670 123035 182096 3276 -58067 -121143
2034 -121143 -148781 109955 215152 273609 351888 291308 55725 -68825 -147688 -1114 35300
2023 35300 21321 140744 230984 253669 169937 -140774 -169715 -105729 101104 -84971 -159241
2012 -159241 151651 176172 276830 213351 39760 -72807 177781 263810 137069 228120
2002 228120 83706 19766 139906 82768 -101093 -114711 -153780 -95779 217984 180191 54940
1991 54940 149676 196800 234120 244096 293663 498740 293936 59643 -242481 -256148 -226283
1980 -226283 -135442 3283 189670 347336 354755 144759 18982 92307 -33849 -45166 184768
1969 184768 281910 344391 491422 497202 324413 273983 175753 40746 -49762 -135640 5841
1958 5841 -180192 -124307 -70614 -188810 -276633 -44902 75771 233572 322839 -63502 -370163
1947 -370163 -188528 -60752 303286 329927 118285 341170 500519 457081 308926 283028
1937 283028 238874 191923 14914 9721 83820 93060 255827 309390 124692 -81810 -175768
1926 -175768 -224697 -198523 -166247 -26368 2780 224651 328640 164999 118462 171524 142526
1915 142526 112146 70818 73940 -72276 -271850 -194700 -108882 73744 223808 166641 -12404
1904 -12404 42148 -248629 -239568 -360427 -339182 138445 305581 32549 -305124 -318413 -279119
1893 -279119 -368528 -288435 -101283 115699 163530 -57744 -341828 -381711 -312999 -195887 -46194
1882 -46194 230240 305379 207104 210338 233176 286051 372590 537630 347537 220513 64048
1871 64048 29379 -93037 -173206 -124754 -205080 -190794 -351275 -330591 78506 83757 96657
1860 96657 -43520 -130506 98892 50396 54936 -19968 -33897 -45803 -40275 -223352 -344117
1849 -344117 -339593 -136351 36837 335422 316675 376241 176674 119390 275638 268205 49261
1838 49261 112769 218179 282372 290286 456889 668708 437778 171970 127970 284295 397019
1827 397019 330307 260417 51892 -66426 -201156 -117872 216597 300888 238063 174383 -15097
1816 -15097 -166926 52092 53845 -188919 -58389 -3517 -117143 -147719 -19475 244708 209849
1805 209849 273272 288252 266769 364360 268371 105501 12386 -141131 -83753 -42591 257264
1794 257264 119837 66654 -42257 -100550 -197036 -399207 -413901 -289831 -147217 -213285 -278940
1783 -278940 -397062 -248279 -218184 -96883 37969 -125648 -346463 -406360 -120679 -73024
1773 -73024 -76368 68485 366890 466848 430016 281612 66296 -259396 -385546 -373197 -386563
1762 -386563 -363897 -176160 -105169 -91192 -199697 -270155 -467001 -677355 -374650 -93991
1752 -93991 -213882 -98116 57321 65379 208782 192077 118010 274413 553983 770354 643686
1741 643686 161701 -17887 131030 71956 -29591 -50830 -97167 -189842 60539 -39799
1731 -39799 -150948 -10846 152101 205231 94330 72560 21097 -75153 41314 229602 243143
1720 243143 149450 -27880 -364812 -526466 -370053 -105156 -172271 -106157 -247139 -164240
1710 -164240 34684 -103060 -108898 -188124 16431 239300 137476 -136416 -117946 32032
1700 32032 250155 214117 175009 374562 312153 15995 44111 14062 113169 93124 41890
1689 41890 269575 250543 181687 461647 544557 366897 103256 113859 389608 298490 -27060
1678 -27060 -43318 -11831 -8069 253101 452155 385406 190909 166583 -13853 -118089 34981
1667 34981 -27741 -215906 -241810 -185897 -165490 -198757 -164831 3466 213247 381875 384557
1656 384557 -50141 10760 161035 -171446 -310097 -365863 -201869 44719 84509 158942
1646 158942 231655 368578 423485 18919 -187915 35157 20106 56155 48665 -28854 -27379
1635 -27379 46093 262215 162169 48176 66372 30702 20391 20882 295180 462866 205178
1624 205178 82701 258431 221772 66685 64849 205559 311505 181013 -1376 19735
1614 19735 -27637 35291 247162 275770 411789 137563 98700 166472 277479 205426 145119
1603 145119 178895 141049 -18804 145568 160476 18186 -36681 -360052 -453041 -308221 -236490
1592 -236490 -230776 -411975 -265141 -58560 132378 229032 281944 203180 290035 260155 27490
1581 27490 114005 -228220 -334439 -201672 -98199 -78677 52652 330349 457979 139909
1571 139909 -154948 -74447 52147 -239476 -316756 -232837 -182536 72231 -5468 -81455 234442
1560 234442 327203 406035 55060 -121537 -194831 -237540 -135388 -103083 28780 -13876 -129893
1549 -129893 -8750 287165 81340 -62339 12681 40804 -270363 -443016 -187877 86252
1539 86252 222067 181059 184471 -7497 -430004 -358942 -31739 -86206 -55817 -114389 24706
1528 24706 32797 129985 158742 82052 262636 314733 218185 65717 211273 169988 -31669
1517 -31669 -66855 118991 -92912 -69150 11971 21753 128931 81594 -239534 -342277 -231742
1506 -231742 -142036 -87460 -73781 26888 237675 260153 336401 336887 97534 -176441 -342796
1495 -342796 -383467 -345445 86604 177163 163889 276893 117552 34691 313064 328651 150176
1484 150176 -121092 -425517 -499243 -694616 -740179 -564022 -583103 -626802 -628747 -567996 -134389
1473 -134389 -32810 -50653 -479 -109654 -119961 -24172 -26744 5644 -12753 -190342 -84439
1462 -84439 -12285 -48746 -237789 -103139 292993 326469 196546 81055 31394 121006 249311
1451 249311 124964 -52301 -190114 -432890 -655564 -430755 -396521 -222699 154856 353580
1441 353580 281409 89070 76338 -29462 584 42003 94539 189872 98324 -100963 -124576
1430 -124576 -115145 -324146 -320675 144821 182644 124043 -66780 -318966 -202456 -180611 -226996
1419 -226996 -317726 -264690 -153777 35167 95929 128643 221226 289722 173187 -71306 -53842
1408 -53842 -84604 -255336 -189804 51371 60740 -224464 -229209 -85933 108513 183248 248231
1397 248231 215217 530 45170 121981 335182 296027 186147 106395 -3974 -146703 -146563
1386 -146563 1075 184143 108291 77894 20935 170059 286449 232227 460117 115217
1376 115217 -149301 -133890 -239343 -421760 -407463 -31573 23811 271399 210008 185964 63467
$$ [...]
##END NTUPLES=NMR SPECTRUM
##END=
