##TITLE=Analysis number 322411
Compound Code ac 34469
Project Code adrs
Chemist Name frontier sci
##JCAMPDX= 6.0         $$ Bruker NMR JCAMP-DX V2.0
##DATA TYPE= NMR SPECTRUM
##DATA CLASS= NTUPLES
##ORIGIN= Bruker BioSpin GmbH
##OWNER= nmr
$$ XWIN-NMR		Version 3.5
$$ Mon Sep 25 13:23:26 2006 GMT Daylight Time (UT+1h)  MAYBRIDGE\nmr@NMR_250MHZ
##.OBSERVE FREQUENCY= 250.131544655141
##.OBSERVE NUCLEUS= ^1H
##.ACQUISITION MODE= SIMULTANEOUS (DQD)
##.ACQUISITION SCHEME= undefined
##.AVERAGES= 16
##.DIGITISER RES= 18
##SPECTROMETER/DATA SYSTEM= dpx250
##.PULSE SEQUENCE= zg30
##.SOLVENT NAME= DMSO
##.SHIFT REFERENCE= (INTERNAL, DMSO, 0, 16.522)
##AUDIT TRAIL= $$ (NUMBER, WHEN, WHO, WHERE, WHAT)
$$ ##TITLE= Audit trail, XWIN-NMR		Version 3.5
$$ ##JCAMPDX= 5.01
$$ ##ORIGIN= Bruker BioSpin GmbH
$$ ##OWNER= nmr
$$ C:\u/data/dgb/nmr/ADRS/1300/pdata/1/auditp.txt
$$ ##AUDIT TRAIL=  $$ (NUMBER, WHEN, WHO, WHERE, WHAT)
(   1,<2006-09-25 13:22:59.26 +100>,<MAYBRIDGE\nmr>,<NMR_250MHZ>,
      <created by zg, POWCHK disabled, PULCHK disabled
       configuration hash MD5:
       E2 DF 36 D8 04 B2 41 60 5A D7 A3 38 5A 4B D0 FE
       data hash MD5: 64K
       32 50 BB 8C 38 98 62 EF 6C 90 99 6D B0 FA 6E CD>)
(   2,<2006-09-25 13:23:16.85 +100>,<MAYBRIDGE\nmr>,<NMR_250MHZ>,
      <Start of raw data processing
       ef LB = 0.3 FT_mod = 6 PKNL = 1 SI = 32K 
       data hash MD5: 32K
       0F 75 E9 4E 42 B6 E3 8C C7 BB A6 5D BA 84 FE C0>)
(   3,<2006-09-25 13:23:18.65 +100>,<MAYBRIDGE\nmr>,<NMR_250MHZ>,
      <apk 
       data hash MD5: 32K
       F0 50 79 3B 6E 00 36 E6 93 94 64 C8 8D 05 9E 6D>)
(   4,<2006-09-25 13:23:19.35 +100>,<MAYBRIDGE\nmr>,<NMR_250MHZ>,
      <abs ABSG = 5 
       data hash MD5: 32K
       38 A9 D2 25 CB A3 32 EA 4F 6E 79 33 D0 6F 3A 24>)
$$ ##END=
$$ 
$$ hash MD5
$$ 25 DD 08 C1 1C A9 F2 74 D5 4D 7A F6 C7 E2 9C E9
##$RELAX= 
##$RELAX= 
##$RELAX= 
##$RELAX= 
##$RELAX= 
##$RELAX= 
##$RELAX= 
$$ Bruker specific parameters
$$ --------------------------
##$DU= <C:\u>
##$EXPNO= 1300
##$NAME= <ADRS>
##$PROCNO= 1
##$TYPE= <nmr>
##$USER= <dgb>
##$AMP= (0..31)
100 100 100 100 100 100 100 100 100 100 100 100 100 100 100 100 100 100 
100 100 100 100 100 100 100 100 100 100 100 100 100 100 
##$AQSEQ= 0
##$AQ_mod= 3
##$AUNM= <au_zg>
##$AUTOPOS= <32 >
##$BF1= 250.13
##$BF2= 250.13
##$BF3= 250.13
##$BF4= 250.13
##$BF5= 500.13
##$BF6= 500.13
##$BF7= 500.13
##$BF8= 500.13
##$BYTORDA= 1
##$CFDGTYP= 0
##$CFRGTYP= 5
##$CHEMSTR= <none>
##$CNST= (0..31)
1 1 145 1 1 1 1 1 1 1 1 1 1 1 1 1 1 1 1 1 1 1 1 1 1 1 1 1 1 1 1 1 
##$CPDPRG= <>
##$CPDPRG1= <>
##$CPDPRG2= <>
##$CPDPRG3= <>
##$CPDPRG4= <mlev>
##$CPDPRG5= <mlev>
##$CPDPRG6= <mlev>
##$CPDPRG7= <mlev>
##$CPDPRG8= <mlev>
##$CPDPRGB= <>
##$CPDPRGT= <>
##$D= (0..31)
0 1 0 0 0 0 0 0 0 0.06 0 0 0 0 0 0 0.0002 0 0 0 0 0 0 0 0 0 0 0 0 0 0 
0 
##$DATE= 1159186978
##$DBL= (0..7)
120 120 120 120 120 120 120 120 
##$DBP= (0..7)
150 150 150 150 150 150 150 150 
##$DBP07= 0
##$DBPNAM0= <>
##$DBPNAM1= <>
##$DBPNAM2= <>
$$ [...]
##$SUBNAM7= <"">
##$SUBNAM8= <"">
##$SUBNAM9= <"">
##$SW= 20.6930455092707
##$SWIBOX= (0..15)
0 0 3 0 0 0 0 0 0 0 0 0 0 0 0 0 
##$SW_h= 5175.983436853
##$TD= 65536
##$TD0= 1
##$TE= 295.16
##$TE2= 300
##$TE3= 300
##$TEG= 300
##$TL= (0..7)
0 120 120 120 120 120 120 120 
##$TP= (0..7)
150 150 150 150 150 150 150 150 
##$TP07= 0
##$TPNAME0= <>
##$TPNAME1= <>
##$TPNAME2= <>
##$TPNAME3= <>
##$TPNAME4= <>
##$TPNAME5= <>
##$TPNAME6= <>
##$TPNAME7= <>
##$TPOAL= (0..7)
0.5 0.5 0.5 0.5 0.5 0.5 0.5 0.5 
##$TPOFFS= (0..7)
0 0 0 0 0 0 0 0 
##$TUNHIN= 0
##$TUNHOUT= 0
##$TUNXOUT= 0
##$USERA1= <user>
##$USERA2= <user>
##$USERA3= <user>
##$USERA4= <user>
##$USERA5= <user>
##$V9= 5
##$VALIST= <valist>
##$VCLIST= <CCCCCCCCCCCCCCC>
##$VD= 0
##$VDLIST= <DDDDDDDDDDDDDDD>
##$VPLIST= <PPPPPPPPPPPPPPP>
##$VTLIST= <TTTTTTTTTTTTTTT>
##$WBST= 1024
##$WBSW= 4
##$XGAIN= (0..3)
0 0 0 0 
##$XL= 0
##$YL= 0
##$YMAX_a= 364743
##$YMIN_a= -608954
##$ZGOPTNS= <>
##$ZL1= 120
##$ZL2= 120
##$ZL3= 120
##$ZL4= 120
##$ABSF1= 16.522
##$ABSF2= -4.171173
##$ABSG= 5
##$ABSL= 3
##$ALPHA= 0
##$AQORDER= 0
##$ASSFAC= 0
##$ASSFACI= 0
##$ASSFACX= 0
##$ASSWID= 0
##$AUNMP= <proc_1d>
##$AZFE= 0.1
##$AZFW= 0.1
##$BCFW= 0
##$BC_mod= 0
##$BYTORDP= 0
##$COROFFS= 0
##$CY= 12.5
##$DATMOD= 1
##$DC= 0
##$DFILT= <>
##$DTYPP= 0
##$F1P= 14.0000005364418
##$F2P= -0.99999901652339
##$FCOR= 0.5
##$FTSIZE= 32768
##$FT_mod= 6
##$GAMMA= 0
##$GB= 0
##$INTBC= 1
##$INTSCL= 1
##$ISEN= 128
##$LB= 0.3
##$LEV0= 0
##$LPBIN= 0
##$MAXI= 10000
##$MC2= 0
##$MEAN= 0
##$ME_mod= 0
##$MI= 0
##$NCOEF= 0
##$NC_proc= -5
##$NLEV= 6
##$NOISF1= 0
##$NOISF2= 0
##$NSP= 0
##$NTH_PI= 0
##$NZP= 0
##$OFFSET= 16.522
##$PC= 1
##$PHC0= 135.1473
##$PHC1= 12.20635
##$PH_mod= 1
##$PKNL= yes
##$PPARMOD= 0
##$PSCAL= 4
##$PSIGN= 0
##$REVERSE= no
##$SF= 250.13
##$SI= 32768
##$SIGF1= 0
##$SIGF2= 0
##$SINO= 400
##$SIOLD= 32768
##$SREGLST= <1H.DMSO>
##$SSB= 0
##$STSI= 32768
##$STSR= 0
##$SW_p= 5175.98343685301
##$SYMM= 0
##$S_DEV= 0
##$TDeff= 65536
##$TDoff= 0
##$TI= <Analysis number 999999
Compound Code 99
Book Reference 9
Project Code 9>
##$TILT= no
##$TM1= 0
##$TM2= 0
##$TOPLEV= 0
##$USERP1= <user>
##$USERP2= <user>
##$USERP3= <user>
##$USERP4= <user>
##$USERP5= <user>
##$WDW= 1
##$XDIM= 32768
##$YMAX_p= 277051217
##$YMIN_p= -503503
$$ End of Bruker specific parameters
$$ ---------------------------------
##NTUPLES= NMR SPECTRUM
##VAR_NAME=  FREQUENCY,     SPECTRUM/REAL,   SPECTRUM/IMAG
##SYMBOL=    X,             R,               I
##VAR_TYPE=  INDEPENDENT,   DEPENDENT,       DEPENDENT
##VAR_FORM=  AFFN,          ASDF,            ASDF
##VAR_DIM=   32768,         32768,           32768
##UNITS=     HZ,            ARBITRARY UNITS, ARBITRARY UNITS
##FACTOR=    0.157963299565203, 1,           1
##FIRST=     4132.6476996994, 0,             0
##LAST=      -1043.33573715361, 0,           0
##MIN=       -1043.33573715361, -503503,     0
##MAX=       4132.6476996994, 277051217,     0
$$ Real data points
##PAGE= N=1
##DATA TABLE= (X++(R..R)), XYDATA
$$ [...]
$$ plain form
23534 15077 48963 135336 145814 139602 119676 -34690 154710 283895 179368 115195 179869
23523 179869 136018 43717 -2686 -11150 29832 161718 112888 44059 2599 7396 155 -52713
23511 -52713 -102059 -115257 -114259 -141830 -144648 -68456 9694 -14898 -20464 52046 127124 147803
23499 147803 24364 -7040 49104 212682 248392 155299 -56689 -203397 -122679 -150106 -141473
23488 -141473 27 99664 60146 35700 -1248 13209 -82277 -175034 -222923 -138096 -87960
23477 -87960 -16519 -133790 -237606 -127042 98148 146179 42533 -3481 40908 69440 39822
23466 39822 52152 51247 -23630 -12706 75063 88876 64415 78058 92489 52362 15928 66251
23454 66251 128701 141177 89208 136493 -64817 -269050 -318811 -181998 -81680 30535 -49646
$$ packed form
23534A5077L3886Q6373J0478o212j9926j54366J89400J29185j04527o4173O4674
23523A79869m3851r2301m6403q464M0982J31886m8830o8829m1460M797p241n2868
23511e2713m9346j3198R98k7571k818P6192P8150k4592n566P2510P5078K0679
23499A47803j23439l1404N6144J63578L5710r3093k11988j46708Q0718k7427Q633
23488a41473J41500R9637l9518k4446l6948J4457r5486r2757m7889Q4827N0136
23477h7960P1441j17271j03816J10564K25190M8031j03646m6014M4389K8532k9618
23466C9822J2330r05p4877J0924Q7769J3813k4461J3643J4431m0127l6434N0323
23454F6251O2450J2476n1969M7285k01310k04233m9761J36813J00318J12215q0181
$$ plain form
23443 -49646 -55278 15895 13081 -123041 -221482 -192684 -212439 -228140 -162393 -106825 574 -46450
23431 -46450 -132471 -89305 -38219 82685 22565 -32541 90899 93357 122775 94439 4051
23420 4051 -116603 -235541 -261916 -258488 -107587 -30837 -24918 -42311 -117411 -76395 -27839 -83046
23408 -83046 -129204 -150146 -36444 -87905 -136996 -39866 -64018 -209213 -209457 -127357 -56764 -6304
23396 -6304 -22351 -23249 -145249 -141719 -25650 -65376 -95119 -25130 -28472 60897 47649 50463
23384 50463 -46206 -87050 -17424 -76316 -76890 69670 54813 34934 -63010 -94398 -167700 -162382
23372 -162382 -234316 -217510 -182393 -149212 -75946 -46108 -58153 -118338 -121613 -25191 -31063 -112978
23360 -112978 -86762 -1440 32358 -18207 -47046 16056 17592 -8762 -138538 -257633 -260045
$$ packed form
23443d9646n632P1173k814j36122r8441K8798j9755j5701O5747N5568J07399m7024
23431d6450q6021M3166N1086J20904o0120n5106J23440K458K9418k8336r0388
23420D051j20654j18938k6375L428J50901P6750N919j7393p5100M1016M8556n5207
23408h3046m6158k0942J13702n1461m9091R7130k4152j45195k44Q2100P0593N0460
23396f304j6047q98j22000L530J16069l9726k9743O9989l342Q9369j3248K814
23384E0463r6669m0844O9626n8892n74J46560j4857j9879r7944l1388p3302N318
23372a62382p1934J6806L5117L3181P3266K9838j2045o0185l275R6422n872q1915
23360a12978K6216Q5322L3798n0565k8839O3102J536k6354j29776j19095k412
$$ plain form
23349 -260045 -87189 -20192 30121 -41128 -206224 -162924 -40501 -18911 -15802 -49195 -77630
23338 -77630 -128060 -106536 -21805 -34518 -18433 -68374 -58475 67672 -2168 -97656 -109211 -165360
23326 -165360 -159918 -80559 -31817 -7896 -70285 -8638 -44189 57718 -32299 -92776 23851
23315 23851 32718 -89886 -104943 -146175 7178 79835 11580 4025 54200 -37717 -45050 36604
23303 36604 86115 64596 10100 -99645 -47769 -77967 -114257 -45603 47703 100834 -214
23292 -214 -152643 -263884 -271046 -149610 -132991 -172344 -128036 -75167 -129455 -143783 -139116 -165951
23280 -165951 -139875 -153282 -145182 -131271 -205726 3441 104999 93952 120694 102797 -28562
23269 -28562 -101084 -115188 -170153 -164858 -158380 -136256 -158604 -132530 -144155 -134148 -61461 -57302
$$ packed form
23349b60045J72856O6997N0313p1249j65096M3300J22423K1590L109l3393k8435
23338g7630n0430K1524Q4731j2713J6085m9941R899J26147o9840r5488j1555n6149
23326a65360N442P9359M8742K3921o2389O1647l5551J01907r0017o0477J16627
23315B3851Q867j22604j5057m1232J53353P2657o8255p555N0175r1917p333Q1654
23303C6604M9511k1519n4496j09745N1876l0198l6290O8654R3306N3131j01048
23292b14j52429j11241p162J21436J6619l9353M4308N2869n4288j4328M667k6835
23280a65951K6076j3407Q100J3911p4455K09167J01558j1047K6742j7897j31359
23269b8562p2522j4104n4965N295O478K2124k2348K6074j1625J0007P2687M159
$$ plain form
23257 -57302 -85579 -33136 34244 123117 97986 20098 55278 -74540 -156438 -111650 -29781
23246 -29781 -24248 5830 -6925 61302 -22493 -18538 61940 6323 -158230 -161395 -156561 -147846
23234 -147846 -144412 -141750 -97358 -95375 -126732 -73352 38743 67399 95175 111971 240546 208922
23222 208922 82835 70953 51110 -99569 -3020 73965 13257 -74012 -74385 -120316 -260095
23211 -260095 -320523 -98116 27850 1601 -133411 -171329 -94132 -33527 14180 33592 -71591
23200 -71591 -16985 27329 40284 5777 -6601 24545 53865 130047 140028 100829 114074 163531
23188 163531 114801 85996 83044 -35269 -125122 -67811 -54838 93230 100230 19873 -11287
23177 -11287 -9159 -139053 -112989 -13747 43058 -17806 24910 54103 -6840 -52979 44234 99759
$$ packed form
23257e7302k8277N2443O7380Q8873k5131p7888L5180j29818q1898M4788Q1869
23246b9781N533L0078j2755O8227q3795L955Q0478n5617j64553l165M834Q715
23234a47846L434K662M4392J983l1357N3380J12095K8656K7776J6796J28575l1624
23222B08922j26087j1882j9843j50679R6549P6985o0708q7269l73m5931j39779
23211b60095o0428K22407J25966k6249j35012l7918P7197O0605M7707J9412j05183
23200g1591N4606M4314J2955l4507j2378L1146K9320P6182R981l9199J3245M9457
23188A63531m8730k8805k952j18313q9853N7311J2973J48068P000q0357l1160
23177a1287K128j29894K6064R9242N6805o0864M2716K9193o0943m6139R7213N5525
$$ plain form
23165 99759 122435 147179 177773 23368 40694 159204 104523 -84152 -166849 -229256 -351907
23154 -351907 -308341 -292879 -309011 -312837 -258339 -225413 -214123 -54861 -33343 -41391 -64499 -92161
23142 -92161 -60305 -33953 -65227 -34732 -37721 -62197 -36521 -77107 -98151 -51293 102 -29051
23130 -29051 -78788 -63734 -84700 -56564 21395 104185 -25801 1860 3185 -25908 -91685 -71350
23118 -71350 -2826 140953 30745 -74267 -6024 39905 63821 139779 185976 56104 -17445
23107 -17445 -87984 103 73104 124356 100912 95121 34688 12271 -85733 -143472 -197290 -118275
23095 -118275 -104929 -84631 -186047 -242481 -312722 -221164 -44280 -42800 -27881 58599 52126
23084 52126 -117487 -123373 -162445 -213382 -213795 -111135 -24418 -94317 -67896 -61633 -71556 -132311
$$ packed form
23165I9759K2676K4744L0594j54405J7326J18510n4681j88675q2697o2407j22651
23154c51907M3566J5462j6132l826N4498L2926J1290J59262K1518q048k3108k7662
23142i2161L1856K6352l1274L0495k989k4476K5676m0586k1044M6858N1395k9153
23130b9051m9737J5054k0966K8136P7959Q2790j29986K7661J325k9093o5777K0335
23118g1350O8524J43779j10208j05012O8243M5929K3916P5958M6197j29872p3549
23107a7445p0539Q8087P3001N1252k3444n791o0433k2417r8004n7739n3818P9015
23095a18275J3346K0298j01416n6434p0241R1558J76884J480J4919Q6480o473
23084E2126j69613n886l9072n0937m13J02660Q6717o9899K6421O263r923o0755
$$ plain form
23072 -132311 -82715 -60365 -16471 -66983 -48110 25020 43551 55988 116888 236116 159711
23061 159711 -42512 -102476 -142375 -138586 -167374 -176708 -128090 -95250 -104827 -66707 67611 98627
23049 98627 42597 -39674 -94403 -98845 -61061 1789 -53891 -183011 -125890 -20701 -3406
23038 -3406 -17178 -963 10993 4863 43880 45641 16116 9081 4141 82059 103382 142597 73021
23025 73021 -33843 -58252 -70202 -41897 -56444 -75432 -83921 -54942 -97306 -103876 -87627 31353
23013 31353 104456 3930 -126012 -221596 -174363 -48878 64120 32372 42980 85696 134325
23002 134325 44900 -33183 -117639 -173464 -187298 -183814 -93610 -64133 5909 132509 154249
22991 154249 59222 -20266 -45776 101 134025 268311 342331 283082 217103 171218 39242
$$ packed form
23072a32311M9596K2350M3894n0512J8873P3130J8531J2437O0900J19228p6405
23061A59711k02223n9964l9899L789k8788r334M8618L2840r577L8120J34318L1016
23049I8627n6030q2271n4729m442L7784O2850n5680j29120N7121J05189J7295
23038c406j3772J6215J1956o130L9017J761k9525p035m940P7918K1323L9215o9576
23025G3021j06864k4409j1950K8305j4547j8988q489K8979m2364o570J6249J18980
23013C1353P3103j00526j29942r5584M7233J25485J12998l1748J0608M2716M8629
23002A34325q9425p8083q4456n5825j3834L484R0204K9477P0042J26600K1740
22991A54249r5027p9488k5510M5877J33924J34286P4020n9249o5979m5885j31976
$$ plain form
22980 39242 76731 153407 200021 133854 59302 18743 -24263 -48339 29559 114593 66014 -73899
22968 -73899 -53260 19290 9091 17312 55494 21361 -65343 -43182 14261 107067 95619 71202
22956 71202 21550 -9367 -61221 -85182 -122359 -8908 230884 274934 224969 149287 201500
22945 201500 221065 133980 16844 -88898 -91643 35156 68917 65902 80200 24670 45270
22934 45270 100943 -4989 -42388 -122179 -99213 -102544 -181364 -198984 -88012 65520 98003
22923 98003 41100 -21320 -98504 -47231 56894 43531 788 -15016 -90395 4961 -24564
22912 -24564 104303 208975 204169 151387 -46987 -92472 -51148 -37262 -82959 -122289 -81949
22901 -81949 38728 9346 -61805 -94306 -30320 -14243 56099 37503 449 -20295 -39357
$$ packed form
22980C9242L7489P6676M6614o6167p4552m0559m3006k4076P7898Q5034m8579j39913
22968g3899K0639P2550j0199Q221L8182l4133q6704K2161N7443R2806j1448k4417
22956G1202m9652l0917n1854k3961l7177J13451K39792M4050m9965p5682N2213
22945B01500J9565q7085j17136j05742k745J26799L3761l015J4298n5530K0600
22934D5270N5673j05932l7399p9791K2966l331p8820j7620J10972J53532L2483
22923I8003n6903o2420p7184N1273J04125j3363m2743j5804p5379R5356k9525
22912b4564J28867J04672m806n2782j98374m5485M1324J3886m5697l9330M0340
22901h1949J20677k9382p1151l2501O3986J6077P0342j8596l7054k0744j9062
$$ plain form
22890 -39357 -42432 -52478 -3488 52403 39124 -3073 -101799 -20685 1472 -12923 -34842 -37318
22878 -37318 -7145 -28274 7547 -47749 -82335 -135134 -138925 -169275 -115650 -37673 -30791 35045
22866 35045 65027 -77732 -159805 -53263 -59130 5332 92376 41711 28510 34013 139 16090
22854 16090 94732 192710 284370 199226 147865 32521 -41580 -94403 -46028 56473 88978
22843 88978 104427 166852 170094 28043 20230 -1425 -154275 -219589 -118830 -65775 -128889
22832 -128889 -182660 -148661 -81585 81655 96238 22759 -149699 -201017 -134393 -2037 -46402
22821 -46402 -132906 -162682 -31171 49851 83935 67596 73407 959 -185230 -169200 -210284
22810 -210284 -203287 -73018 86348 48901 -65978 45386 248348 189855 -19512 8657
$$ packed form
22890c9357l075j0046M8990N5891j3279m2197r8726Q1114K2157j4395k1919k476
22878c7318L0173k1129L5821n5296l4586n2799l791l0350N3625P7977O882O5836
22866C5045K9982j42759q2073J06542n867O4462Q7044n0665j3201N503l3874J5951
22854A6090P8642R7978R1660q5144n1361j15344p4101n2823M8375J02501L2505
22843H8978J5449O2425L242j42051p813k1655j52850o5314J00759N3055o3114
22832a28889n3771L3999O7076J63240J4583p3479j72458n1318O6624J32356m4365
22821d6402q6504k9776J31511Q1022L4084j6339N811p2448j86189J6030m1084
22810b10284O997J30269J59366l7447j14879J11364K02962n8493k09367K8169
$$ plain form
22800 8657 71819 69511 -56335 -87953 25189 100034 26970 2546 117748 162338 201174
22789 201174 141158 -43897 -178662 -257460 -183791 -187966 -260445 -254064 -107819 40731 93505
22778 93505 -30041 -4035 148951 173002 119392 -8585 -18983 7962 92611 126870 52806
22767 52806 -152758 -206688 -280828 -242327 -142969 -151813 -158161 -204785 -116636 -30784 -13010 -111717
22755 -111717 -207299 -89374 34790 -67723 -182342 -114537 -19803 -183840 -170988 -24662
22745 -24662 -64902 -125298 -42574 15538 29247 130385 183870 136632 70991 -71951 -121127
22734 -121127 -142103 -119237 -144963 -105048 42082 59708 62452 130705 111308 108308 172097 83764
22722 83764 121906 78208 78160 116431 -38119 -91949 -59326 58642 75448 61755 138119 267059
$$ packed form
22800H657O3162k308j25846l1618J13142P4845p3064k4424J15202M4590L8836
22789B01174o0016j85055j34765p8798P3669m175p2479O381J46245J48550N2774
22778I3505j23546K6006J52986K4051n3610j27977j0398K6945Q4649L4259p4064
22767E2806k05564n3930p4140L8501R9358q844o348m6624Q8149Q5852J7774r8707
22755a11717r5582J17925J24164j02513j14619O7805R4734j64037J2852J46326
22745b4662m0240o0396Q2724N8112J3709J01138N3485m7238o5641j42942m9176
22734a21127k0976K2866k5726L9915J47130J7626K744O8253j9397l000O3789q8333
22722H3764L8142m3698m8L8271j54550n3830L2623J17968J6806j3693P6364J28940
$$ plain form
22710 267059 211423 160568 41428 -72061 -10583 47509 19148 -20725 -25219 -36366 -112392
22699 -112392 -44852 76815 65707 33399 -94629 -2936 73722 121324 67914 79044 111162
22688 111162 180372 78262 102085 93420 56362 -25579 25362 16232 -138715 -169747 -143358
22677 -143358 -58041 -47916 -84456 -90369 -91656 33166 25822 45765 29734 58140 72942 -14743
22665 -14743 49635 156890 57906 -72973 -71441 59109 83590 -30637 -45024 -9610 66429
22654 66429 56696 33292 79111 -1011 -11233 -201576 -201561 -199022 -78384 -41083 -23146 18299
22642 18299 13647 -95585 -145998 -42906 -72004 -36534 79789 144500 203620 157264 -2297
22631 -2297 18758 37099 -28117 -13369 -45777 -146219 -142735 -78068 -56285 4786 -45235 -47737
$$ packed form
22710B67059n5636n0855j19140j13489O1478N8092k8361l9873m494j1147p6026
22699a12392O7540J21667j1108l2308j28028R1693P6658M7602n3410J1130L2118
22688A11162O9210j02110K3823q665l7058q1941N0941r130j54947l1032K6389
22677a43358Q5317J0125l6540n913j287J24822p344J9943j6031K8406J4802q7685
22665a4743O4378J07255r8984j30879J532J30550K4481j14227j4387L5414P6039
22654F6429r733k3404M5819q0122j0222j90343J5K539J20638L7301J7937M1445
22642A8299m652j09232n0413J03092k9098L5470J16323O4711N9120m6356j59561
22631b297K1055J8341o5216J4748l2408j00442L484O4667K1783O1071n0021k502
$$ plain form
22619 -47737 -4377 49828 24973 -10805 20314 -41072 -129430 -96923 -14424 135204 111172
22608 111172 26949 -2913 38013 22332 47330 -43796 -75906 -160018 -96430 -44891 1225
22597 1225 38313 77899 108120 99305 -6135 -89778 51254 95385 104493 125388 45654 -47338
22585 -47338 -96038 -38035 48722 128210 184715 89926 4480 -6458 -54503 -23699 -49788 -80006
22573 -80006 -75144 -70122 -9878 -41710 30743 151531 63355 -112318 -127420 -218456 -325269
22562 -325269 -294341 -242899 -162377 -194345 -302161 -294619 -262014 -193272 -192016 -161489 -113039 -118843
22550 -118843 -47610 -147645 -116284 50737 12636 -118617 -102031 -35486 -55614 -31578 8573
22539 8573 34941 31909 15364 26511 8569 53760 24715 9770 -28428 -44714 -82161 -10639
$$ packed form
22619d7737M3360N4205k4855l5778L1119o1386q8358L2507Q2499J49628k4032
22608A11172q4223k9862M0926j5681K4998r1126l2110q4112O3588N1539M6116
22597A225L7088L9586L0221q815j05440q3643J41032M4131R108K0895p9734r2992
22585d7338m8700N8003Q6757P9488N6505r4789q5446j0938m8045L0804k6089l0218
22573h0006M862N022O0244l1832P2453J20788q8176j75673j5102r1036j06813
22562c25269L0928N1442Q0522l1968j07816P542L2605O8742J256L0527M8450n804
22550a18843P1233j00035L1361J67021l8101j31253J6586O6545k0128K4036M0151
22539H573K6368l032j6545J1147j7942M5191k9045j4945l8198j6286l7447P1522
$$ plain form
22527 -10639 25152 13592 -51927 18660 57693 8531 -47345 -34239 -9621 -106168 -64783 -134505
22515 -134505 -115297 -14590 -69832 -109882 -32981 115373 82958 -110188 -99027 -29401 64971
22504 64971 53359 -11335 -126347 -91550 -16201 52294 -9793 -87041 -149941 -203663 -166345
22493 -166345 -94507 -117881 -105122 -85026 -65971 46771 39175 -122089 -173964 -153851 -107230
22482 -107230 -112878 -342402 -354100 -231146 -195199 -106951 -14642 67604 -9058 -83408 -82441 -64282
22470 -64282 -92553 -106874 -169660 -126283 -199588 -240851 -191705 -137811 -219635 -235207 -124134
22459 -124134 -78137 -52074 -58074 -15569 35442 99447 115461 174040 71678 -66914 -132642
22448 -132642 -79620 -28339 -172533 -234868 -186317 -160977 -128711 -29317 -89741 -110790 -22959
$$ packed form
22527a0639L5791j1560o5519P0587L9033m9162n5876J3106K4618r6547M1385o9722
22515a34505J9208J00707n5242m0050P6901J48354l2415j93146J1161O9626R4372
22504F4971j1612o4694j15012L4797P5349O8495o2087p7248o2900n3722L7318
22493a66345P1838k3374J2759K0096J9055J12742p596j61264n1875K0113M6621
22482a07230n648k29524j1698J22954L5947Q8248R2309Q2246p6662p4350R67J8159
22470f4282k8271j4321o2786M3377p3305m1263M9146N3894q1824j5572J11073
22459a24134M5997K6063o000M2505N1011O4005J6014N8579j02362j38592o5728
22448a32642N3022N1281j44194o2335M8551K5340L2266R9394o0424k1049Q7831
$$ plain form
22437 -22959 75950 71835 43438 -203963 -181511 -21104 -24059 -9762 -9249 -33366 -1507 -103312
22425 -103312 -143223 -171378 -169230 -133861 -98624 -46603 -38895 49789 92974 49585 -38610 -44139
22413 -44139 -9009 -6073 6919 88901 159435 38444 66094 105787 24944 -13625 -28551 23648
22401 23648 7374 93429 33656 -23323 -617 39818 53462 -79257 -165817 -160824 -117189 -93365
22389 -93365 -93997 -99173 -17302 13505 -91026 -180806 -195241 -157240 -84022 -157394 -217013 -125098
22377 -125098 -9224 -3973 -52950 -11727 27976 24397 198673 207174 69337 16019 63055
22366 63055 44612 -26249 -25721 50163 40622 58512 21373 -42360 -30146 -34854 -71199 27907
22354 27907 89383 106418 191253 152222 27030 -59237 -113458 -69234 -118110 -93834 -194412
$$ packed form
22437b2959R8909m115k8397k47401K2452J60407k955J4297N13k4117L1859j01805
22425a03312l9911k8155K148L5369L5237N2021P708Q8684M3185m3389q8195n529
22413d4139L5130K936J2992Q1982P0534j20991K7650L9693q0843l8569j4926N2199
22401B3648j6274Q6055n9773n6979K2706M0435J3644j32719q6560M993M3635K3824
22389i3365o32n176Q1871L0807j04531q9780j4435L8001P3218p3372n9619R1915
22377a25098J15874N251m8977M1223L9703l579J74276Q501j37837n3318M7036
22366F3055j8443p0861N28P5884r541J7890l7139o3733J2214m708l6345R9106
22354B7907O1476J7035Q4835l9031j25192q6267n4221M4224m8876K4276j00578
$$ plain form
22343 -194412 -252162 -238788 -174152 -75568 -49932 -142839 -186014 -217160 -167780 -221850 -220207 -123160
22331 -123160 -106033 -182948 -144418 -56837 -13496 33431 35933 -42763 -609 -22935 3627 -56227
22319 -56227 -35242 9470 -62958 -113034 -84784 22935 138450 148730 113731 42861 5562
22308 5562 69376 72315 44601 1544 -59749 -123301 16169 68756 63464 -47314 -102410 5270
22296 5270 65874 107740 64381 -52001 -77694 -56451 -106721 -3781 26126 -2317 959 -154410
22284 -154410 -220017 -249017 -87749 -4322 29370 -26017 -133932 -142010 -205187 -139730 -179445
22273 -179445 -197320 -188862 -126451 -82352 -82931 23894 -40044 -131934 -49203 -27979 -38058 81212
22261 81212 -9160 -54876 -99715 -56377 22885 12955 29481 -23094 -78771 46657 58498 -97788
$$ packed form
22343a94412n7750J3374O4636R8584K5636r2907m3175l1146M9380n4070J643R7047
22331a23160J7127p6915L8530Q7581M3341M6927K502p8696M2154k2326K6562n9854
22319e6227K0985M4712p2428n0076K8250J07719J15515J0280l4999p0870l7299
22308E562O3814K939k7714m3057o1293o3552J39470N2587n292j10778n5096J07680
22296E270O0604M1866m3359j16382k5693K1243n0270J02940K9907k8443L276j55369
22284a54410o5607k9000J61268Q3427L3692n5387j07915q078o3177O5457l9715
22273a79445j7875Q458O2411M4099n79J06825o3938r1890Q2731K1224j0079J19270
22261H1212r0372m5716m4839M3338P9262r930J6526n2575n5677J25428J1841j56286
$$ plain form
22249 -97788 -33025 -59215 -38015 53371 16729 83319 70824 38063 -23309 -155770 -62635
22238 -62635 -76789 -36623 -141841 -196273 -105479 -161048 -126542 -10375 67766 145150 24547
22227 24547 36731 -57707 -192609 -258622 -208371 -146545 -41861 -57681 -10402 2644 -59178
22216 -59178 -112576 -96143 18767 -62845 34420 45478 60880 36844 -15467 -59584 7163
22205 7163 -12552 -72899 -50373 -68165 -55699 -16418 39922 179166 129079 -3155 -67279
22194 -67279 -119662 -159290 -99931 149283 245725 154025 61606 24792 -17543 6880 -71433
22183 -71433 -94719 -181304 -187111 -209343 -292898 -238223 -140939 -64824 -24765 -16471 100665 160712
22171 160712 25976 1142 45422 87368 129489 128924 77909 72536 16506 12075 79058 121820
$$ packed form
22249i7788O4763k6190K1200R1386l6642O6590j2495l2761o1372j32461R3135
22238f2635j4154M0166j05218n4432R0794n5569L4506J16167P8141P7384j20603
22227B4547J2184r4438j34902o6013N0251O1826J04684j5820M7279J3046o1822
22216e9178n3398J6433J14910q1612R7265J1058J5402k4036n2311m4117O6747
22205G163j9715o0347K2526j7792J2466L9281N6340J39244n0087j32234o4124
22194f7279n2383l9628N9359K49214R6442r1700r2419l6814m2335K4423p8313
22183g1433k3286q6585n807k2232q3555N4675R7284P6115M0059Q294J17136O0047
22171A60712j34736k4834M4280M1946M2121n65n1015n373n6030m431O6983M2762
$$ plain form
22159 121820 67406 78901 102119 19031 -52448 -92076 -136572 -48457 97166 86211 51484
22148 51484 81487 11810 -14719 -79804 -83391 -160900 -222561 -203548 -175827 -119931 -164718 -143993
22136 -143993 -158132 -237374 -209148 -169293 -102281 -146772 -221576 -158401 -90840 -102339 -41445
22125 -41445 45516 90719 22418 -34787 -99877 -45357 -66585 -73568 -85873 -84316 -23806 68900
22113 68900 29259 -66113 -123620 -60025 -59845 -111092 -116489 -75042 -40626 -13726 3319 49879
22101 49879 60581 70338 38125 54975 104634 158930 96692 138200 136333 114949 49686 91312
22089 91312 120442 -15478 55823 94924 -190757 -272321 -151551 -36163 -44437 -2394 -96313
22078 -96313 -251331 -157163 -39177 -54069 -160531 -210998 -157535 -133083 -158616 -91411 -49754
$$ packed form
22159A21820n4414J1495K3218q3088p1479l9628m4496Q8115J45623j0955l4727
22148E1484L0003o9677k6529o5085l587p7509o1661J9013K7721N5896m4787K0725
22136a43993j4139p9242K8226L9855O7012m4491p4804O3175O7561j1499O0894
22125d1445Q6961M5203o8301n7205o5090N4520k1228o983j2305J557O0510R2706
22113F8900l9641r5372n7507O3595J80n1247n397M1447L4416K6900J7045M6560
22101D9879J0702R757l2213J6850M9659N4296o2238M1508j867k1384o5263M1626
22089I1312K9130j35920P1301L9101k85681q1564J20770J15388q274M2043r3919
22078i6313j55018R4168J17986j4892j06462n0467N3463K4452k5533O7205M1657
$$ plain form
22067 -49754 -59779 -24678 397 -15014 23644 21145 -35081 -81950 -6344 -3347 -105713 -92948
22055 -92948 -61507 3888 5163 -63148 -63849 59391 115029 107812 38207 -24802 -52184 1435
22043 1435 -11721 -97697 -140428 8990 142414 81170 84373 57321 -9859 -120827 -202467
22032 -202467 -198537 -236314 -264679 -255229 -266841 -116099 -10555 106681 99023 85092 178533
22021 178533 235498 101087 98024 174939 189736 143688 99369 49816 96721 23162 33400
22010 33400 -83619 -133553 -163874 -284462 -167374 -57577 2049 7382 -52992 -32541 -103416
21999 -103416 -34453 -142066 -98782 47581 138754 -35012 -119862 -158164 -227559 -196650 -72724
21988 -72724 131172 186898 109846 -143501 -233482 -209650 -192955 -161832 -231425 -259993 -209143
$$ packed form
22067d9754j0025L5101K5075j5411L8658k499n6226m6869P5606K997j02366J2765
22055i2948L1441O5395J275o8311p01J23240N5638p217o9605o3009k7382N3619
22043A435j3156q5976m2731J49418J33424o1244L203k7052o7180j10968q1640
22032b02467L930l7777k8365R450j1612J50742J05544J17236p658j3931R3441
22021A78533N6965j34411l063P6915J4797m6048m4319m9553M6905p3559J0238
22010C3400j17019m9934l0321j20588J17088J09797N9626N333o0374K0451p0875
21999a03416O8963j07613M3284J46363R1173j73766q4850l8302o9395L0909J23926
21988g2724K03896N5726p7052k53347q9981K3832J6695L1123o9593k8568N0850
$$ plain form
21977 -209143 -157762 -142459 -1033 48639 73118 29650 -83692 -228140 -266447 -39406 94066
21966 94066 164991 144208 99344 89365 118855 154364 136295 160441 207091 249009 194119 -43794
21954 -43794 -94049 -32163 -23525 -52015 14343 -58971 -79338 -7097 2015 114161 86741 80964
21942 80964 149150 103329 40255 -33299 -3888 54818 74931 70001 23028 -24875 -70018 -100832
21930 -100832 -95327 -41412 -123408 -94591 -57838 -144853 -59607 86520 93364 64529 28938 -34837
21918 -34837 -24968 70915 50579 -18599 -85547 -78837 -85535 -133987 -134798 -113488 -124520 -248887
21906 -248887 -249515 -206351 -178024 -109658 -194513 -99505 15672 91200 102236 124072 110317 67119
21894 67119 -105238 -142335 -57718 -25929 92300 27374 49283 5834 10126 123252 124955
$$ packed form
21977b09143N1381J5303J41426M9672K4479m3468j13342j44448l8307K27041J33472
21966I4066P0925k0783m4864r979K9490L5509j8069K4146M6650M1918n4890k37913
21954d3794n0255O1886Q638k8490O6358p3314k0367P2241R112J12146k7420n777
21942H0964O8186m5821o3074p3554K9411N8706K0113m930m6973m7903m5143l0814
21930a00832N505N3915q1996K8817L6753q7015Q5246J46127O844k8835l5591o3775
21918c4837R869R5883k0336o9178o6948O710o698m8452q11K1310j1032j24367
21906b48887o28M3164K8327O8366q4855R5008J15177P5528J1036K1836j3755m3198
21894F7119j72357l7097Q4617L1789J18229o4926K1909m3449M292J13126J703
$$ plain form
21883 124955 117699 41995 63604 -16549 -78263 -167190 -47046 -64734 -123702 -42236 -37
21872 -37 -24886 -116773 -142501 -77570 -13833 -88316 -90580 -69776 -77745 -57890 -12512 161542
21860 161542 235052 130373 54172 53739 61472 39571 957 -12280 -54485 -74755 -46459 -53795
21848 -53795 -68408 -46570 54102 66813 -57172 -104872 -149294 -133199 46610 202444 80032
21837 80032 -9523 27407 63207 59638 54426 -3623 39427 107288 32090 -25773 66090 115661
21825 115661 86117 87642 80220 -78698 -219128 -260901 -204096 -126127 -76500 -47237 -40972 35000
21813 35000 187517 99969 977 35122 68780 5362 -38619 -133198 -145502 -216637 -182567
21802 -182567 -231451 -242758 -209301 -136672 -55952 -14886 -71035 -94082 -81648 -19320 50242
$$ packed form
21883A24955p256p5704K1609q0153o1714q8927J20144j7688n8968Q1466M2199
21872c7k4849r1887k5728O4931O3737p4483k264K0804p969J9855M5378J74054
21860A61542P3510j04679p6201m33P733k1901l8614j3237m2205k0270K8296p336
21848e3795j4613K1838J00672J2711j23985m7700m4422J6095J79809J55834j22412
21837H0032q9555L6930L5800l569n212n8049M3050O7861p5198n7863R1863M9571
21825A15661k9544J525p422j58918j40430m1773N6805P7969M9627K9263O265P5972
21813C5000J52517q7548r8992L4145L3658o3418m3981r4579j2304p1135L4070
21802a82567m8884j1307L3457P2629Q0720M1066n6149k3047J2434O2328O9562
$$ plain form
21791 50242 94825 158168 130909 85970 202517 257080 219313 133083 62868 68193 100495 93387
21779 93387 85321 32989 -9336 -8954 12813 59474 131102 82050 99048 102468 -49367 -53859
21767 -53859 -53105 -35307 -50873 -44106 -93947 -128906 -105143 -37943 41667 23559 -81024 -57568
21755 -57568 -64680 1088 3675 66365 101266 35525 -100841 -232088 -263253 -201358 -72615
21744 -72615 45484 103958 75542 -24427 -102383 -103742 -180775 -173241 -20311 -42271 17724 11878
21732 11878 -45602 3815 45102 121626 211576 192297 130873 30289 -49598 -68922 -139639
21721 -139639 -14503 23909 43234 7302 18231 -18483 -83396 -101141 -50943 28738 112878
21710 112878 96135 156794 139116 125469 80998 25515 55420 97208 267436 145423 80660
$$ packed form
21791E0242M4583O3343k7259m4939J16547N4563l7767q6230p0215N325L2302p108
21779I3387q066n2332m2325L82K1767M6661P1628m9052J6998L420j51835m492
21767e3859P54J7798j5566O767m9841l4959K3763O7200P9610j8108j04583K3456
21755e7568p112O5768K587O2690L4901o5741j36366j31247l1165O1895J28743
21744g2615J18099N8474k8416r9969p7956j359p7033P534J52930k1960N9995n846
21732A1878n7480M9417M1287P6524Q9950j9279o1424j00584p9887j9324p0717
21721a39639J25136L8412J9325l5932J0929l6714o4913j7745N0198P9681Q4140
21710A12878j6743O0659j7678j3647m4471n5483K9905M1788J70228j22013o4763
$$ plain form
21699 80660 45090 97562 164680 143700 167714 182387 109385 -42563 -88808 60564 45935
21688 45935 37364 190321 263329 186502 116110 58155 61228 111591 -8718 -121241 -32957
21677 -32957 -46580 -156340 -121045 -61408 -103914 24099 135809 21481 26865 14142 29554
21666 29554 22804 24197 41312 -36685 -59035 -22780 -77709 -9813 97116 99215 205481 124590
21654 124590 157389 238931 175256 46901 -67904 -86586 -26426 -20823 62456 137508 26221
21643 26221 -51196 -164945 -85405 31340 -3565 68816 69367 99101 101786 231590 214514 178919
21631 178919 222822 196235 187463 146281 77873 -1735 29024 42265 -65519 -51169 -28491
21620 -28491 6144 1165 37014 -46790 -19475 40760 -23403 -30941 -58881 -129251 -175426 -23001
$$ packed form
21699H0660l5570N2472O7118k0980K4014J4673p3002j51948m6245J49372j4629
21688D5935q571J52957P3008p6827p0392n7955L073N0363j20309j12523Q8284
21677c2957j3623j09760L5295N9637m2506J28013J11710j14328N384j2723J5412
21666B9554o750J393J7115p7997k2350L6255n4929O7896J06929K099J06266q0891
21654A24590L2799Q1542o3675j28355j14805j8682O0160N603Q3279P5052j11287
21643B6221p7417j13749P9540J16745l4905P2381N51K9734K685J29804j7076l5595
21631A78919M3903k6587q772m1182o8408p9608L0759J3241j07784J4350K2678
21620b8491L4635m979L5849q3804K7315O0235o4163p538k7940p0370m6175J52425
$$ plain form
21608 -23001 82604 143075 233644 278484 220882 119029 24262 22492 39675 -55088 -57290 -4057
21596 -4057 21003 -25541 -20652 87986 168369 174788 237423 221920 152630 185097 219906 261442
21584 261442 248239 174953 220421 149336 130949 90340 44457 -27075 -47307 -55240 8240 9564
21572 9564 2803 23672 -107408 -44382 142833 216057 162157 135587 109774 10109 32744 124872
21560 124872 33382 -74123 -16165 21011 41280 -10747 -26242 -471 -13145 -95883 -40298
21549 -40298 11310 23480 18165 -65229 -72466 -67946 -59277 -61036 48563 138819 101944 8930
21537 8930 -150775 -253211 -237123 -179984 -165185 -57936 -15815 112239 122773 168662 122714
21526 122714 13237 -96363 -57742 -120732 -139946 -37048 134339 202170 206215 170735 224574
$$ packed form
21608b3001J05605O0471R0569M4840n7602j01853r4767j770J7183r4763k202N3233
21596d057K5060m6544M889J08638Q0383O419O2635j5503o9290L2467L4809M1536
21584B61442j3203p3286M5468p1085j8387m0609m5883p1532k0232p933O3480J324
21572I564o761K0869j31080O3026J87215P3224n3900k6570k5813r9665K2635R2128
21560A24872r1490j07505N7958L7176K0269n2027j5495K5771j2674q2738N5585
21549d0298N1608J2170n315q3394p237M520Q669j759J09599R0256l6875r3014
21537H930j59705j02436J6088N7139J4799J07249M2121J28054J0534M5889m5948
21526A22714j09477j09600L8621o2990j9214J02898J71387O7831M045l5480N3839
$$ plain form
21515 224574 351571 381654 416687 424069 428754 330389 355632 261531 181101 133648 83160 217238
21503 217238 280982 279572 137939 37909 42705 178063 165845 157661 237898 279738 249087
21492 249087 340601 317328 222286 93024 126179 220408 224932 91763 12133 16148 34057
21481 34057 121434 138374 116551 107586 114322 25200 55298 8559 -95466 -45049 -19584 -41968
21469 -41968 -12163 110534 249297 133871 50271 35251 82211 117380 58787 58855 -16990 -60020
21457 -60020 -1402 72564 207755 246441 216283 168589 187830 238660 157676 148822 99671 3136
21445 3136 12146 -18544 44689 101796 58959 75709 85363 144004 216331 156553 -7762 -9621
21433 -9621 -80793 -143390 -233746 -245352 -129462 -23624 -50161 -21878 -105086 -153540 -44584
$$ packed form
21515B24574J26997L0083L5033P382M685r8365K5243r4101q0430m7453n0488J34078
21503B17238O3744j410j41633j00030M796J35358j2218q184Q0237M1840l0651
21492B49087R1514k3273r5042j29262L3155R4229M524j33169p9630M015J7909
21481C4057Q7377J6940k1823q965O736q9122L0098m6739j04025N0417K5465k2384
21469d1968K9805J22697J38763j15426q3600j5020M6960L5169n8593O8p5845m3030
21457f0020N8618P3966J35191L8686l0158m7694J9241N0830q0984q854m9151r6535
21445C136R010l0690O3233N7107m2837J6750R654N8641P2327n9778j64315j859
21433i621p1172o2597r0356j1606J15890J05838k6537K8283q3208m8454J08956
$$ plain form
21422 -44584 -48182 -18005 93270 68145 76983 140185 174722 -25748 -71746 -50171 50772
21411 50772 17620 -27604 -101305 -62576 10890 43696 107455 98929 -6293 -95945 -72025 37784
21399 37784 155497 202342 147382 49215 -30651 -19921 -73877 -160357 -62279 -5922 98305
21388 98305 98044 138603 110714 70124 80856 75229 29651 20702 -5017 6819 49140 174581
21376 174581 130791 125003 97735 -41578 -127352 -31548 134197 138932 42927 -27102 135314
21365 135314 210526 167247 171464 126701 150504 87542 14204 28827 50708 49159 25455 96960
21353 96960 123342 117271 134109 142303 119958 139679 96543 70359 42105 -10396 -17443 112366
21341 112366 103357 111389 82901 104269 34136 12138 107086 70451 -20340 -141114 -59887 73804
$$ packed form
21422d4584l598L0177J11275k5125Q838O3202L4537k00470m5998K1575J00943
21411E0772l3152m5224p3701L8729P3466L2806O3759q526j05222q9652K3920J09809
21399C7784J17713M6845n4960r8167p9866J0730n3956q6480R8078N6357J04227
21388I8305k61M0559k7889m0590J0732n627m5578q949k5719J1836M2321J25441
21376A74581m3790n788k7268j39313q5774R5804J65745M735r6005p0029J62416
21365A35314P5212m3279M217m4763K3803o2962p3338J4623K1881j549k3704P1505
21353I6960K6382o071J6838Q194k2345J9721m3136k6184k8254n2501p047J29809
21341A12366r009Q032k8488K1368p0133k1998R4948l6635r0791j20774Q1227J33691
$$ plain form
21329 73804 67380 25836 115988 170508 138620 216117 196050 232225 282061 138990 36655
21318 36655 21070 102958 232156 237397 167462 235722 263261 284543 296752 344808 195193
21307 195193 110326 165273 145973 255108 331947 257979 120961 135619 174336 174212 245034
21296 245034 264023 248794 166864 177916 250242 280750 266267 327057 362938 364953 332313 301892
21284 301892 347771 317934 298274 214706 172300 170891 205449 269636 301449 519387 586311
21273 586311 576760 562929 562395 538588 554115 438495 343002 319198 339329 331238 388177 582121
21261 582121 788249 845990 928098 1061815 1121987 1147566 1211417 1461498 1628083 1683515 1761336
21250 1761336 1850307 2210338 2532710 2721380 2998484 3349366 3744691 4136412 4615304 5125295
$$ packed form
21329G3804o424m1544R0152N4520l1888P7497k0067L6175M9836j43071j02335
21318C6655j5585Q1888J29198N241o9935O8260K7539K1282J2209M8056j49615
21307A95193q4867N4947j9300J09135P6839p3968j37018J4658L8717j24P0822
21296B45034J8989j5229q1930J1052P2326L0508j4483O0790L5881K015l2640l0421
21284C01892M5879k9837j9660q3568m2406j409L4558O4187L1813K17938O6924
21273E86311r551j3831n34k3807J5527j15620r5493k3804K0131q091N6939J93944
21261E82121K06128N7741Q2108J33717O0172K5579O3851K50081J66585N5432P7821
21250A761336Q8971L60031L22372J88670K77104L50882L95325L91721M78892N09991
$$ plain form
21240 5125295 5596356 6098398 6522200 6938929 7582690 8103393 8385124 8729004 9029385
21231 9029385 9248685 9441531 9642292 9787759 9791844 9816352 9567094 9449879 9210669 8718091
21221 8718091 8258986 7810300 7310466 6793418 6265321 5876972 5490853 5141604 4886865
21212 4886865 4692284 4422074 3989207 3640779 3619075 3665612 3587468 3359590 3151210 3140277
21202 3140277 3192944 3140778 3083424 3108669 3258524 3423165 3568545 3793515 4155497 4437440
21192 4437440 4822038 5305024 5776646 6185111 6544616 7006980 7521579 7952333 8463380
21183 8463380 9016824 9443753 9731144 9895649 10119935 10250211 10430201 10547979 10687419
21174 10687419 10675140 10514920 10097190 9722971 9270878 8844611 8529245 8004997 7467597
$$ packed form
21240E125295M71061N02042M23802M16729O43761N20703K81731L43880L00381
21231I029385K19300J92846K00761J45467M085K4508k49258j17215k39210m92578
21221H718091m59105m48686m99834n17048n28097l88349l86119l49249k54739
21212D886865j94581k70210m32867l48428k1704M6537p8144k27878k08380j0933
21202C140277N2667n2166n7354K5245J49855J64641J45380K24970L61982K81943
21192D437440L84598M82986M71622M08465L59505M62364N14599M30754N11047
21183H463380N53444M26929K87391J64505K24286J30276J79990J17778J39440
21174A0687419j2279j60220m17730l74219m52093m26267l15366n24248n37400
$$ plain form
21165 7467597 7046937 6515558 6113488 5820577 5380141 4880422 4461317 4190371 3913115
21156 3913115 3639595 3435296 3242069 2956050 2759675 2746408 2628817 2404998 2204848 2183146
21146 2183146 2190040 2032042 1900345 1716685 1690782 1737591 1777951 1601666 1413893 1391127
21136 1391127 1417827 1445996 1348534 1220185 1151194 1210535 1211449 993237 868104 962839 988065
21125 988065 1094864 1239565 1181765 1060613 939184 831443 890604 907135 966810 892702
21115 892702 778243 685000 635928 699823 736419 791031 886534 765721 572972 533338 686641
21104 686641 763990 662411 636068 573795 397171 474909 527173 427106 358184 374055 418010
21093 418010 401262 383009 313257 322337 397680 388709 451806 399888 205989 204797 241987 321626
$$ packed form
21165G467597m20660n31379m02070k92911m40436m99719m19105k70946k77256
21156C913115k73520k04299j93227k86019j96375j3267j17591k23819k00150k1702
21146B183146O894j57998j31697j83660k5903M6809M0360j76285j87773k2766
21136A391127K6700K8169r7462j28349o8991N9341R14k18212j25133R4735K5226
21125I88065J06799J44701n7800j21152j21429j07741N9161J6531N9675p4108
21115H92702j14459r3243m9072O3895L6596N4612R5503j20813j92749l9634J53303
21104F86641P7349j01579k6343o2273j76624P7738N2264j00067o8922J5871M3955
21093D18010j6748j8253o9752R080P5343q971O3097n1918j93899j192L7190P9639
$$ plain form
21081 321626 298027 183375 94104 175042 289847 215107 184475 202508 203086 260888 330648
21070 330648 175445 137903 255867 368858 438593 408397 346963 273462 340284 388560 375044
21059 375044 355320 243560 150486 93143 111085 125448 109468 160933 262138 312181 324106
21048 324106 220715 132531 200394 193328 267895 228227 154646 156771 181204 238541 254724 183794
21036 183794 146877 126471 115623 61249 46447 185881 271092 204205 182653 318109 336046
21025 336046 183123 56138 37811 114457 205731 251447 341660 419073 401688 446263 556525
21014 556525 662018 739692 847521 955825 1005363 1086768 1155756 1156897 1153815 1023885 891085
21003 891085 810503 863898 843288 666648 591354 535073 511540 485746 545971 613248 574327
$$ packed form
21081C21626k3599j14652q9271Q0938J14805p4740l0632J8033N78N7802O9760
21070C30648j55203l7542J17964J12991O9735l0196o1434p3501O6822M8276j3516
21059C75044j9724j11760r3074n7343J7942J4363j5980N1465J01205N0043J1925
21048C24106j03391q8184O7863p066P4567l9668p3581K125K4433N7337J6183p0930
21036A83794l6917k0406j0848n4374j4802J39434Q5211o6887k1552J35456J7937
21025C36046j52923j26985j8327P6646R1274M5716R0213P7413j7385M4575J10262
21014E56525J05493P7674J07829J08304M9538Q1405O8988J141l082j29930j32800
21003H91085q0582N3395k0610j76640p5294n6281k3533k5794O0225O7277l8921
$$ plain form
20992 574327 504995 418355 254702 205536 209024 280811 347039 291563 243036 310712 359884
20981 359884 251544 209515 174002 187464 187849 269786 262091 246114 175658 218170 300467 382290
20969 382290 252919 214097 133603 87753 24486 141118 248145 204792 122637 213328 257824
20958 257824 307237 340921 344828 306735 276249 332318 302758 279331 233498 120299 52477
20947 52477 93490 133840 151553 152512 239830 326012 304197 123791 152888 324861 333183 253168
20935 253168 222933 60303 -21994 60919 170996 276205 111185 60952 140635 72769 108024
20924 108024 92777 94801 91746 76426 65357 71218 177208 271723 272917 229147 303378 295747
20912 295747 300814 112856 58677 82443 90491 130575 122635 65708 95664 602 48237 56850
$$ packed form
20992E74327o9332q6640j63653m9166L488P1787O6228n5476m8527O7676M9172
20981C59884j08340m2029l5513J3462L85Q1937p695j5977p0456M2512Q2297Q1823
20969C82290j29371l8822q0494m5850o3267J16632J07027m3353q2155R0691M4496
20958B57824M9413L3684L907l8093l0486N6069k9560k3427m5833j13199o7822
20947E2477M1013M0350J7713R59Q7318Q6182k1815j80406K9097J71973Q322q0015
20935B53168l0235j62630q2297Q2913J10077J05209j65020n0233P9683o7866L5255
20924A08024j5247K024l055j5320j1069N861J05990R4515J194m3770P4231p631
20912B95747N067j87958n4179K3766Q048M0084p940n6927K9956r5062M7635Q613
$$ plain form
20900 56850 108321 120239 117794 77409 102779 37665 88044 144016 167853 182483 215207 306398
20888 306398 257165 161822 129211 176450 192111 171506 180593 -17933 -78905 2618 54832
20877 54832 112487 141069 51345 -51849 -37769 112607 147761 95516 105950 80358 81755
20866 81755 86903 177286 136707 93158 82551 150750 200795 89343 195602 302637 223710
20855 223710 27585 45537 144636 316081 325020 202375 222251 242730 146817 687 -41616
20844 -41616 28555 89430 155063 40626 -61027 -27135 80889 74787 69182 -18552 -72147
20833 -72147 -72601 -94397 -57337 -104536 -184492 -223905 -82603 1293 47841 150338 258338
20822 258338 290278 256674 116833 -19921 -34465 47903 106921 71151 107966 155531 155629 153060
$$ packed form
20900E6850N1471J1918k445m0385K5370o5114N0379N5972K3837J4630L2724R1191
20888C06398m9233r5343l2611M7239J5661k0605R087j98526o0972Q1523N2214
20877E4832N7655K8582q9724j03194J4080J50376L5154n2245J0434k5592J397
20866H1755N148R0383m0579m3549j0607O8199N0045j11452J06259J07035p8927
20855B23710j96125J7952R9099J71445Q939j22645J9876K0479r5913j46130m2303
20844d1616P0171O0875O5633j14437j01653L3892J08024o102n605q7734n3595
20833g2147m54k1796L7060m7199p9956l9413J41302Q3896M6548J02497J08000
20822B58338L1940l3604j39841j36754j4544Q2368N9018l5770L6815M7565R8k569
$$ plain form
20810 153060 176701 256649 232086 189758 76300 9005 88121 52088 -79241 -8897 19685
20799 19685 53272 71345 7096 90811 96352 20012 -21784 5606 56443 163296 219739 275444
20787 275444 185143 79293 80412 -22069 -25618 101626 202548 190420 116136 190052 178541
20776 178541 166094 64537 12617 25287 89960 97760 34752 -31766 106361 140737 152100
20765 152100 101755 -43281 -33654 -42489 36016 27823 -99829 -20132 -3334 69762 53385 -57619
20753 -57619 23011 95023 192444 304855 217244 120573 86271 23977 36233 86636 68946
20742 68946 166943 177579 117167 178292 289103 182593 93039 77305 87809 172640 211599
20731 211599 229680 167446 155368 147408 184855 51106 686 -25390 -16149 32754 103190 137528
$$ packed form
20810A53060K3641P9948k4563m2328j13458o7295P9116l6033j31329P0344K8582
20799A9685L3587J8073o4249Q3715N541p6340m1796K7390N0837J06853N6443N5705
20787B75444r0301j05850J119j02481l549J27244J00922j2128p4284P3916j1511
20776A78541j2447j01557n1920J2670O4673P800o3008o6518J38127L4376J1363
20765A52100n0345j45036R627q835P8505q193j27652P9697J6798P3096j6377j11004
20753e7619Q0630P2012R7421J12411q7611r6671l4302o2294J2256N0403j7690
20742F8946R7997J0636o0412O1125J10811j06510q9554j5734J0504Q4831L8959
20731B11599J8081o2234j2078p960L7447j33749n0420k6076R241M8903P0436L4338
$$ plain form
20719 137528 125278 -4238 58639 -1794 -31887 -112517 -61885 11947 115074 73058 53372
20708 53372 1906 83118 84433 92984 36345 9282 -41833 140532 163922 1963 -84217 -43901
20696 -43901 83973 150137 180374 164341 163481 27781 24440 112859 114330 188012 336777 371872
20684 371872 331217 266624 247270 183676 221422 200402 167679 57959 11868 137298 220121
20673 220121 138192 219752 137298 62945 268773 227428 189071 155281 104889 147577 82788
20662 82788 106241 125399 176629 172042 245860 406098 386725 391210 307562 236577 83169 -48773
20650 -48773 -173923 -232021 -198527 -88283 75933 102454 168405 170401 153399 203964 211453
20639 211453 113909 38708 -46724 -79503 -29886 -10556 -17139 -15191 -56469 -19326 39819 -17536
$$ packed form
20719A37528j2250j29516O2877o0433l0093q0630N0632P3832J03127m2016j9686
20708E3372n1466Q1212J315Q551n6639k7063n1115J82365K3390j61959q6180M0316
20696d3901J27874O6164L0237j6033q60j35700l341Q8419J471P3682J48765L5095
20684C71872m0655o4593j9354o3594L7746k1020l2723j09720m6091J25430Q2823
20673B20121q1929Q1560q2454p4353K05828m1345l8357l3790n0392M2688o4789
20662H2788K3453J9158N1230m587P3818J60238j9373M485q3648p0985j53408j31942
20650d8773j25150n8098L3494J10244J64216K6521O5951J996j7002N0565P489
20639B11453r7544p5201q5432l2779M9617J9330o583J948m1278L7143N9145n7355
$$ plain form
20627 -17536 22952 136179 284022 278429 155379 21490 84795 210796 94830 109923 212539
20616 212539 212587 252139 266588 179731 127445 141082 284240 257116 287503 324059 322196 351890
20604 351890 394080 298188 293574 321666 282243 226949 221411 239870 156011 132581 115814 55256
20592 55256 91897 140807 104088 164565 244493 241303 212851 230394 202665 155601 80292 4969
20580 4969 93220 139445 208898 230184 340135 286340 245267 220833 141975 176602 178379 159095
20568 159095 177085 182439 177750 169245 142509 156277 232121 142448 176497 339100 424522 321546
20556 321546 233982 253690 305429 209852 211858 159192 201826 253732 296495 346508 452508
20545 452508 496257 564262 533158 405579 236108 221127 285323 255308 280789 292649 287176
$$ packed form
20627a7536M0488J13227J47843n593j23050j33889O3305J26001j15966J5093J02616
20616B12539M8L9552J4449q6857n2286J3637J43158k7124L0387L6556j863K9694
20604C51890M2190r5892m614K8092l9423n5294n538J8459q3859k3430j6767o0558
20592E5256L6641M8910l6719O0477P9928l190k8452J7543k7729m7064p5309p5323
20580D969Q8251M6225O9453K1286J09951n3795m1073k4434p8858L4627J777j9284
20568A59095J7990N354m689q505k6736J3768P5844q9673L4049J62603Q5422j02976
20556C21546q7564J9708N1739r5577K006n2666M2634N1906M2763N0013J06000
20545D52508M3749O8005l1104j27579j69471j4981O4196l0015K5481J1860n473
$$ plain form
20534 287176 296257 357580 333653 326621 464176 465597 403100 264769 226098 284930 260628 245485
20522 245485 274325 337770 356559 273640 196206 286140 397415 460536 407483 322840 226924
20511 226924 166083 302004 393925 410408 496260 507974 387412 236765 161188 222065 206393
20500 206393 179962 173179 195487 311255 405820 422289 371373 344134 356849 302287 389530
20489 389530 337831 367288 390805 307686 347182 340323 401009 479360 423084 362370 373070 365893
20477 365893 263277 237335 267157 297344 212509 197116 399875 409710 385981 332905 323434
20466 323434 248994 193650 220521 305919 381550 432159 448564 313995 351639 444940 432459
20455 432459 441580 495760 445582 256700 246656 298364 328100 269972 280109 173208 170691
$$ packed form
20534B87176R081O1323k3927p032J37555J421o2497j38331l8671N8832k4302j5143
20522B45485K8840O3445J8789q2919p7434Q9934J11275O3121n3053q4643r5916
20511B26924o0841J35921R1921J6483Q5852J1714j20562j50647p5577O0877j5672
20500B06393k6431o783K2308J15768R4565J6469n0916k7239J2715n4562Q7243
20489C89530n1699K9457K3517q3119L9496o859O0686P8351n6276o0714J0700p177
20477C65893j02616k5942K9822L0187q4835j5393K02759R835k3729n3076r471
20466C23434p4440n5344K6871Q5398P5631N0609J6405j34569L7644R3301j2481
20455D32459R121N4180n0178j88882j0044N1708K9736n8128J0137j06901k517
$$ plain form
20444 170691 315470 368913 315889 324246 345215 233612 227883 326939 392213 474384 507701
20433 507701 415864 419397 393884 465405 423524 406265 607876 658705 522932 515844 627391
20422 627391 649807 640664 672438 645845 486330 563666 587583 608700 695031 714317 791035
20411 791035 833814 788161 729418 692989 641388 503106 451616 417209 521345 575289 564802
20400 564802 696379 756130 751554 684220 610768 658242 748913 716287 654594 722887 813685
20389 813685 748735 629144 541173 584136 730270 807695 858628 898734 848432 765831 708064
20378 708064 714356 784277 810913 712473 640760 624873 676701 698094 739414 821617 759854 680070
20366 680070 718998 730200 856919 961013 962563 907142 828459 777891 689369 634519 677787
$$ packed form
20444A70691J44779N3443n3024Q357K0969j11603n729R9056O5274Q2171L3317
20433E07701r1837L533k5513P1521m1881j7259K01611N0829j35773p088J11547
20422F27391K2416r143L1774k6593j59515P7336K3917K1117Q6331J9286P6718
20411G91035M2779m5653n8743l6429n1601j38282n1490l4407J04136N3944j0487
20400E64802J31577N9751m576o7334p3452M7474R0671l2626o1693O8293R0798
20389H13685o4950j19591q7971M2963J46134P7425N0933M0106n0302q2601n7767
20378G08064O292O9921K6636r8440p1713j5887N1828K1393M1320Q2203o1763p9784
20366F80070L8928J1202J26719J04094J550n5421p8683n0568q8522n4850M3268
$$ plain form
20355 677787 681219 592401 663844 754071 753304 841249 911299 931751 846168 780881 816995 808314
20343 808314 840125 832157 826431 879136 788410 683969 707284 750431 883996 851122 752691
20332 752691 724004 674819 653556 620329 650275 760945 816796 767774 828010 875041 805133
20321 805133 721358 697025 660039 689313 718297 806456 826656 954768 898058 617367 682115
20310 682115 777051 730199 718469 710682 613283 483052 517670 538958 613925 652534 716813
20299 716813 764073 646898 532681 640167 721614 626522 471809 540102 577065 700049
20289 700049 767613 822006 779270 718054 803592 783476 732644 768802 718668 776233 742384
20278 742384 748188 793061 738983 757355 682902 616399 607489 603292 550727 537003 563892 667510
$$ packed form
20355F77787L432q8818P1443R0227p67Q7945P0050K0452q5583o5287L6114q681
20343H08314L1811p968n726N2705r0726j04441K3315M3147J33565l2874r8431
20332G52691k8687m9185k1263l3227K9946J10670N5851m9022O0236M7031o9908
20321H05133q3775k4333l6986K9274K8984Q8159K0200J28112n6710k80691O4748
20310F82115R4936m6852j1730p787r7399j30231L4618K1288P4967L8609O4279
20299G16813M7260j17175j14217J07486Q1447r5092j54713O8293L6963J22984
20289G00049O7564N4393m2736o1216Q5538k0116n0832L6158n0134N7565l3849
20278G42384N804M4873n4078J8372p4453o6503q910m197n2565j3724K6889J03618
$$ plain form
20266 667510 661546 527448 561006 753914 761033 716767 633127 628191 714679 680941 715275 754676
20254 754676 771770 855955 771595 729266 733529 684766 582420 532089 630369 734854 764501
20243 764501 816694 874979 831682 791873 791648 950065 967438 944303 895505 746158 641078
20232 641078 660104 555210 516774 701137 846138 822277 707430 510598 565260 626994
20222 626994 763464 892150 841134 806116 786907 819892 848386 793533 825943 838933 813808
20211 813808 801189 815252 790507 842402 703060 689684 801327 853590 922199 841537 904315
20200 904315 935393 921372 866685 956540 879825 892690 811015 913305 1009265 1011497 934535
20189 934535 972544 930420 803413 887928 889168 895469 864341 913825 915923 898145 831912 846353
$$ packed form
20266F67510n964j34098L3558J92908P119m4266q3640m936Q6488l3738L4334L9401
20254G54676J7094Q4185q4360m2329M263m8763j02346n0331R8280J04485K9647
20243G64501N2193N8285m3297l9809k25J58417J7373k3135m8798j49347j05080
20232F41078J9026j04894l8436J84363J45001k3861j14847j96832N4662O1734
20222F26994J36470J28686n1016l5018j9209L2985K8494n4853L2410J2990k5125
20211H13808j2619J4063k4745N1895j39342j3376J11643N2263O8609q0662O2778
20200I04315L1078j4021n4687Q9855p6715J2865q1675J02290R5960K232p6962
20189I34535L8009m2124j27007Q4515J240O301l1128M9484K098j7778o6233J4441
$$ plain form
20177 846353 829426 795409 825874 884898 1066300 1016890 925619 832446 837594 929423 985073
20166 985073 939861 953938 940076 975265 1068228 1048439 1096554 1227392 1302747 1088857 1046953
20155 1046953 1134901 1136277 1214618 1239999 1161094 1106609 1108734 1166697 1168146 1272538 1412875
20144 1412875 1372773 1374148 1324676 1188899 1170162 1345318 1412136 1299332 1260065 1328214 1325498
20133 1325498 1474553 1518628 1546206 1470200 1435130 1536578 1538179 1457604 1477737 1647492 1706794
20122 1706794 1635445 1566787 1585921 1660083 1612427 1551406 1552708 1450207 1508754 1611005 1679338
20111 1679338 1750592 1815223 1813567 1777249 1763039 1837022 1840457 1724159 1668865 1784234 1850774
20100 1850774 1844687 1977382 1921745 1968823 2036648 2119051 2150124 2148059 2211559 2178966 2239011
$$ packed form
20177H46353j6927l4017L0465N9024J81402m9410r1271r3173N148R1829N5650
20166I85073m5212J4077j3862L5189R2963j9789M8115J30838P5355k13890m1904
20155A046953Q7948J376P8341K5381p8905n4485K125N7963J449J04392J40337
20144A412875m0102J375m9472j35777j8737J75156O6818j12804l9267O8149k716
20133A325498J49055M4075K7578p6006l5070J01448J601q0575K0133J69755N9302
20122A706794p1349o8658J9134P4162m7656o1021J302j02501N8547J02251O8333
20111A679338P1254O4631j656l6318j4210P3983L435j16298n5294J15369O6540
20100A850774o087J32695n5637M7078O7825Q2403L1073k065O3500l2593O0045
$$ plain form
20089 2239011 2284187 2183086 2003309 1995691 2015111 2051802 2212443 2395634 2415981 2387347 2325598
20078 2325598 2351372 2319713 2225054 2155673 2153599 2187444 2270275 2207281 2288584 2443647 2509879
20067 2509879 2538233 2508070 2492111 2330356 2330144 2328093 2277105 2393940 2433527 2540596 2522499
20056 2522499 2542214 2676229 2641647 2686874 2698003 2781499 2862414 2910584 2911865 2820451 2835964
20045 2835964 2845158 2967838 3038064 2851975 2930328 3166938 3225017 3159097 3153007 3165308 3233427
20034 3233427 3352678 3367041 3326736 3374191 3442715 3535402 3585652 3604981 3543509 3581452 3645943
20023 3645943 3663717 3781321 3948102 4044920 4150724 4128267 4157289 4272920 4252496 4170326
20013 4170326 4228592 4288649 4416913 4496580 4518564 4591631 4697254 4845371 4915210 5004662 5078209
$$ packed form
20089B239011M5176j01101j79777p618J9420L6691J60641J83191K0347k8634o1749
20078B325598K5774l1659r4659o9381k074L3845Q2831o2994Q1303J55063O6232
20067B509879K8354l0163j5959j61755k12k051n0988J16835L9587J07069j8097
20056B522499J9715J34015l4582M5227J1129Q3496Q0915M8170J281r1414J5513
20045B835964R194J22680P0226j86089P8353K36610N8079o5920o090J2301O8119
20034C233427J19251J4363m0305M7455O8524R2687N0250J9329o1472L7943O4491
20023C645943J7774J17604J66781R6818J05804k2457K9022J15631k0424q2170
20013D170326N8266O0057J28264P9667K1984P3067J05623J48117O9839Q9452P3547
$$ plain form
20002 5078209 5160442 5201775 5197396 5420394 5538874 5535739 5464989 5703618 5823984 5797503 5885316
19991 5885316 6039935 6044489 6242523 6455022 6575737 6667793 6695814 6799448 6944201 7068545
19981 7068545 7065441 7128927 7154686 7249873 7504583 7649363 7678520 7793983 8004715 8196238
19971 8196238 8252570 8386230 8417878 8446064 8538501 8635513 8803151 8936744 9086870 9314320
19961 9314320 9509578 9753525 9932361 10041509 10264973 10676523 10911370 11108607 11459862
19952 11459862 11766141 12169614 12571314 13112608 13560712 14025955 14650712 15132734 15559865
19943 15559865 16159004 16695291 17132303 17796864 18424703 19118819 19940103 20908927 21953943
19934 21953943 23087305 24425550 25657824 26562619 27408672 28223804 29293128 30437690
$$ packed form
20002E078209Q2233M1333m379K22998J18480l135p0750K38629J20366k6481Q7813
19991E885316J54619M554J98034K12499J20715R2056K8021J03634J44753J24344
19981G068545l104O3486K5759R5187K54710J44780K9157J15463K10732J91523
19971H196238N6332J33660L1648K8186R2437R7012J67638J33593J50126K27450
19961I314320J95258K43947J78836J09148K23464M11550K34847J97237L51255
19952A1459862L06279M03473M01700N41294M48104M65243O24757M82022M27131
19943A5559865N99139N36287M37012O64561O27839O94116Q21284R68824J045016
19934B1953943J133362J338245J232274R04795Q46053Q15132J069324J144562
$$ plain form
19926 30437690 31406572 32444951 33803800 35460504 37604186 40369159 43491000 46981246
19918 46981246 50840469 55235335 60485020 66515004 72783789 78416153 83080794 87338709
19910 87338709 92059386 97016562 100323423 100391519 98501149 96772559 96209633 96116093 95379209
19901 95379209 94041303 93186774 93546564 95496695 99162089 103796727 108219303 111353573
19893 111353573 113381284 115401080 118145197 121529881 124740759 127387337 129688912 131697668
19885 131697668 133553761 135914837 139082642 142728245 146022051 148764263 151308828 153475991
19877 153475991 155346843 157491985 160490621 164608391 169413207 174544550 179443312 183583528
19869 183583528 187118746 191001454 195759417 201304169 207241974 213772109 221007531 228882655
$$ packed form
19926C0437690R68882J038379J358849J656704K143682K764973L121841L490246
19918D6981246L859223M394866N249685O029984O268785N632364M664641M257915
19910H7338709M720677M957176L306861O8096j890370j728590n62926r3540p36884
19901I5379209j337906q54529L59790J950131L665394M634638M422576L134270
19893A11353573K027711K019796K744117L384684L210878K646578K301575K008756
19885A31697668J856093K361076L167805L645603L293806K742212K544565K167163
19877A53475991J870852K145142K998636M117770M804816N131343M898762M140216
19869A83583528L535218L882708M757963N544752N937805O530135P235422P875124
$$ plain form
19861 228882655 236730179 242858458 246671986 249163511 251621743 254760325 257967008 260062463
19853 260062463 260260297 258807832 256119524 252659790 249547825 247331458 244651846 239831771
19845 239831771 231675133 221500494 211585616 202633335 193926004 184686227 175068752 165967436
19837 165967436 158173157 151800996 146483364 141747706 137481265 133391502 129220633 125219961
19829 125219961 121462221 117917440 114303655 110284757 106260759 102350187 98573493 95138777
19821 95138777 92165495 89260560 86548923 83741474 80826944 77874230 75045780 72447729
19813 72447729 69914714 67536476 65419936 63392850 61550398 59601169 57549785 55734309
19805 55734309 54137703 52777880 51452885 50163500 48876875 47546863 46239116 45069547
$$ packed form
19861B28882655P847524O128279L813528K491525K458232L138582L206683K095455
19853B60062463J97834j452465k688308l459734l111965k216367k679612m820075
19845B39831771q156638j0174639r914878q952281q707331r239777r617475r101316
19837A65967436p794279o372161n317632m735658m266441m089763m170869m000672
19829A25219961l757740l544781l613785m018898m023998l910572l776694l434716
19821I5138777k973282k904935k711637k807449k914530k952714k828450k598051
19813G2447729k533015k378238k116540k027086j842452j949229k051384j815476
19805E5734309j596606j359823j324995j289385j286625j330012j307747j169569
$$ plain form
19797 45069547 44152489 43235643 42446273 41728981 41136891 40717445 40388927 40089997 39889631
19788 39889631 39730721 39747760 39711679 39733692 39634571 39399622 38971126 38257712 37513630 36769747
19778 36769747 35997318 35432428 34810704 34048058 33201987 32125560 30973733 29709464 28498457
19769 28498457 27474467 26573073 25682351 24767022 23842864 23077810 22389836 21629800 21043447
19760 21043447 20520778 19941018 19485670 19054573 18649137 18166097 17548568 17218366 16936636
19751 16936636 16652030 16384748 16025818 15739166 15388592 15172635 14960531 14716895 14302210
19742 14302210 14018353 13773370 13345024 12945943 12659422 12455431 12170263 11890461 11827931
19733 11827931 11795198 11497942 11254301 11044781 10965086 10902750 10704714 10520138 10352135 10287311
$$ packed form
19797D5069547r17058r16846p89370p17292n92090m19446l28518k98930k00366
19788C9889631j58910J7039l6081K2013r9121k34949m28496p13414p44082p43883
19778C6769747p72429n64890o21724p62646q46071j076427j151827j264269j211007
19769B8498457j023990r01394q90722r15329r24158p65054o87974p60036n86353
19760B1043447n22669n79760m55348m31097m05436m83040o17529l30202k81730
19751A6936636k84606k67282l58930k86652l50574k15957k12104k43636m14685
19742A4302210k83857k44983m28346l99081k86521k03991k85168k79802o2530
19733A1827931l2733k97256k43641k09520p9695o2336j98036j84576j68003o4824
$$ plain form
19723 10287311 10080861 9826628 9719473 9618184 9518743 9337318 9173772 9087707 8903121 8715473
19713 8715473 8544122 8375897 8221704 8014459 7865510 7817041 7733507 7526131 7386905 7255191
19703 7255191 7147902 7016116 6875901 6680055 6485244 6458613 6446235 6432443 6381517 6332784
19693 6332784 6212120 6127767 6112647 5994983 5946631 5808946 5606868 5460295 5382741 5372449
19683 5372449 5455133 5547446 5571868 5471743 5357568 5390790 5522480 5493986 5442141 5335765
19673 5335765 5196556 5132174 5098346 5034099 4896348 4910931 4849815 4746240 4814865 4803318 4725516
19662 4725516 4651355 4698138 4536736 4388243 4317683 4204836 4089851 4199765 4259876 4277163
19652 4277163 4122556 4047106 4057301 4028992 3953489 3930992 3968765 4030081 4108471 4250329 4384210
$$ packed form
19723A0287311k06450k54233j07155j01289r9441j81425j63546q6065j84586j87648
19713H715473j71351j68225j54193k07245j48949m8469q3534k07376j39226j31714
19703G255191j07289j31786j40215j95846j94811k6631j2378j3792n0926m8733
19693F332784j20664q4353j5120j17664m8352j37685k02078j46573p7554j0292
19683E372449Q2684R2313K4422j00125j14175L3222J31690k8494n1845j06376
19673E335765j39209o4382l3828o4247j37751J4583o1116j03575O8625j1547p7802
19662D725516p4161M6783j61402j48493p0560j12847j14985J09914O0111J7287
19652D277163j54607p5450J0195k8309p5503k2497L7773O1316P8390J41858J33881
$$ plain form
19641 4384210 4508773 4525941 4544898 4495627 4470742 4491371 4413099 4288148 4242713 4165084 4148936
19630 4148936 4220349 4381028 4385803 4463970 4598134 4643120 4703276 4703787 4687105 4657207 4735255
19619 4735255 4894191 4893477 5013327 5028034 4984618 4897296 4851709 4857255 4794722 4689551 4551493
19608 4551493 4447150 4428293 4496704 4506213 4502885 4486237 4401410 4411914 4431795 4350067 4313419
19597 4313419 4194368 4117259 4017942 3830447 3692907 3620926 3620159 3577392 3423764 3329086 3327733
19586 3327733 3346324 3304074 3187596 3170584 3167187 3048557 2937799 2816854 2883087 2918396 2762782
19575 2762782 2641904 2507505 2429858 2440571 2411586 2438289 2371096 2387006 2394391 2371353 2285760
19564 2285760 2299036 2286553 2236509 2134669 2039181 2095677 2131553 2198831 2151531 2055932 1985529
$$ packed form
19641D384210J24563J7168J8957m9271k4885K0629p8272j24951m5435p7629j6148
19630D148936P1413J60679M775P8167J34164M4986O0156N11j6682k9898P8048
19619D735255J58936p14J19850J4707m3416q7322m5587N546o2533j05171j38058
19608D551493j04343j8857O8411R509l328j6648q4827J0504J9881q1728l6648
19597D313419j19051p7109r9317j87495j37540p1981p67m2767j53628r4678j353
19586C327733J8591m2250j16478j7012l397j18630j10758j20945O6233L5309j55614
19575B762782j20878j34399p7647J0713k8985K6703o7193J5910P385k3038q5593
19564B285760J3276j2483n0044j01840r5488N6496L5876O7278m7300r5599p0403
$$ plain form
19553 1985529 2019719 2079025 2124059 2006893 1992796 1892373 1706768 1691632 1803281 1858441
19543 1858441 1808000 1766542 1781476 1715784 1683444 1611645 1495497 1517419 1653930 1638568 1500118
19532 1500118 1449968 1587060 1572551 1550334 1432082 1284245 1342199 1493945 1436314 1381467
19522 1381467 1449451 1382113 1310569 1341744 1320613 1407483 1466327 1472508 1450503 1443158 1324648
19511 1324648 1249801 1242246 1310189 1242138 1238607 1293837 1312633 1395837 1346605 1331432 1243073 1173707
19499 1173707 1130472 1096023 1140325 1239451 1228031 1198493 1152954 1152595 1155958 1100872 1138744 1027012
19487 1027012 1004078 1150813 1091877 1066331 1140769 1102174 1021993 1089391 1099162 1080262 1094955
19476 1094955 1025244 959320 1003218 990938 1078816 1123015 1180125 1076207 978904 978998 1001300 1041632
$$ packed form
19553A985529L4190N9306M5034j17166j4097j00423j85605j5136J11649N5160
19543A858441n0441m1458J4934o5692l2340p1799j16148K1922J36511j5362j38450
19532A500118n0150J37092j4509k2217j18252j47837N7954J51746n7631n4847
19522A381467O7984o7338p1544L1175k1131Q6870N8844O181k2005p345j18510
19511A324648p4847p555O7943o8051l531N5230J8796Q3204m9232j5173q8359o9366
19499A173707m3235l4449M4302R9126j1420k9538m5539l59L363n5086L7872j11732
19487A027012k2934J46735n8936k5546P4438l8595q0181O7398R771j8900J4693
19476A094955o9711o5924M3898j2280Q7878M4199N7110j03918r7303R4K2302M0332
$$ plain form
19464 1041632 1152628 1081078 1030500 1006759 1053047 1140055 1118882 1100492 1032296 959646 829525
19453 829525 773548 677789 773774 814201 956103 1054021 986339 770755 661317 703314 798805
19442 798805 870007 878691 926140 998609 1095088 1090907 1048473 1118658 1143252 1190212 1202804 1151371
19430 1151371 1033964 1067586 1066470 1083888 1123233 1152063 1165641 1304237 1343188 1258654 1243555
19419 1243555 1254869 1276950 1308338 1326448 1376852 1391381 1327235 1305307 1395803 1462929 1387863
19408 1387863 1323574 1345944 1406492 1419644 1333805 1313206 1370573 1496912 1668970 1776986 1797553
19397 1797553 1722349 1779744 1905140 1888926 1950433 2023176 1995972 1960928 2024999 2065250 2021300
19386 2021300 1975361 1980773 1972519 1841831 1840687 1953767 1900322 1937436 1968041 1836337 1793133
$$ packed form
19464A041632J10996p1550n0578k3741M6288Q7008k1173j8390o8196p2650j30121
19453H29525n5977r5759R5985M0427J41902R7918o7682k15584j09438M1997R5491
19442G98805P1202Q684M7449P2469R6479m181m2434P0185K4594M6960J2592n1433
19430A151371j17407L3622j116J7418L9345K8830J3578J38596L8951q4534j5099
19419A243555J1314K2081L1388J8110N0404J4529o4146k1928R0496O7126p5066
19408A387863o4289K2370O0548J3152q5839k0599N7367J26339J72058J08016K0567
19397A797553p5204N7395J25396j6214O1507P2743k7204l5044O4071M0251m3950
19386B021300m5939N412q254j30688j144J13080n3445L7114L0605j31704m3204
$$ plain form
19375 1793133 1731492 1730309 1815083 1873073 1928769 1917506 1843942 1772513 1761285 1690115 1628397
19364 1628397 1691258 1755197 1834513 1837467 1791388 1815145 1812776 1852369 1968158 1929280 1991319
19353 1991319 2129741 2292609 2354396 2348317 2300020 2208824 2207356 2276321 2398537 2513572 2343187
19342 2343187 2294274 2426015 2388690 2311391 2296480 2301181 2230382 2162013 2314952 2345457 2320850
19331 2320850 2309484 2324526 2321118 2404447 2291193 2222713 2092936 2109858 2200972 2284624 2354105
19320 2354105 2371234 2288851 2309621 2374872 2503120 2577489 2517065 2637431 2739473 2943928
19310 2943928 3208711 3519185 3735521 4017759 4325725 4794854 5411366 5948975 6485185
19301 6485185 6988632 7598731 8370792 9073444 9562312 10076243 10583432 11029939 11404372
$$ packed form
19375A793133o1641j183Q4774N7990N5696j1263p3564p1429j1228p1170o1718
19364A628397O2861O3939P9316K954m6079K3757k369L9593J15789l8878O2039
19353A991319J38422J62868O1787o079m8297r1196j468O8965J22216J15035j70385
19342B343187m8913J31741l7325p7299j4911M701p0799o8369J52939L0505k4607
19331B320850j1366J5042l408Q3329j13254o8480j29777J6922R1114Q3652O9481
19320B354105J7129q2383K0770O5251J28248P4369o0424J20366J02042K04455
19310B943928K64783L10474K16336K82238L07966M69129O16512N37609N36210
19301F485185N03447O10099P72061P02652M88868N13931N07189M46507L74433
$$ plain form
19292 11404372 11669930 11822072 11896628 11792164 11744360 11578656 11282698 10963076 10524164 10007956
19282 10007956 9469045 8991852 8469712 7893002 7451354 7071985 6648352 6412301 6087138
19273 6087138 5835624 5712667 5632914 5505171 5337553 5170781 5100387 5123811 5153111 5211216
19263 5211216 5351859 5499933 5563536 5689950 5839758 6157901 6525092 6876371 7290303 7826458
19253 7826458 8343108 8923477 9549420 10420042 11342991 12120359 12970208 13912454 14863060
19244 14863060 15791153 16577681 17288638 18013653 18729294 19299373 19863976 20277028 20566791
19235 20566791 20854235 21097503 21382184 21433592 21294303 21019807 20448287 19835442 19222261
19226 19222261 18630631 18039779 17671266 17334595 16826362 16468192 16042133 15546056 15037390
$$ packed form
19292A1404372K65558J52142P4556j04464m7804j65704k95958l19622m38912n16208
19282A0007956n38911m77193n22140n76710m41648l79369m23633k36051l25163
19273F087138k51514j22957p9753j27743j67618j66772p0394K3424K9300N8105
19263E211216J40643J48074O3603J26414J49808L18143L67191L51279M13932N36155
19253G826458N16650N80369O25943Q70622R22949P77368Q49849R42246R50606
19244A4863060R28093P86528P10957P25015P15641N70079N64603M13052K89763
19235B0566791K87444K43268K84681N1408j39289k74496n71520o12845o13181
19226A9222261n91630n90852l68513l36671n08233l58170m26059m96077n08666
$$ plain form
19217 15037390 14440565 13968419 13533518 12897578 12288317 11922670 11582737 11146400 10947971
19208 10947971 10869696 10841345 10895816 10860824 10971284 11128434 11221404 11523608 11946361 12406370
19198 12406370 12864390 13461441 14272441 15259799 16297851 17675815 19275184 20972869 22807899
19189 22807899 25194540 28007229 31076464 34673450 38897599 43545467 48528672 53823741
19181 53823741 59978838 66946829 74777527 82860701 90067869 96287957 101770503 106465881
19173 106465881 110501178 114283377 118155650 121699520 123231121 121775530 118514061 114814180
19165 114814180 110985374 107163462 103061931 98718459 94259310 88692850 82044416 75667821
19157 75667821 70834267 67708986 65912015 65154723 65158249 65835546 67123488 69137880 72038656
$$ packed form
19217A5037390n96825m72146m34901o35940o09261l65647l39933m36337j98429
19208A0947971p8275k8351N4471l4992J10460J57150R2970L02204M22753M60009
19198A2406370M58020N97051Q11000R87358J038052J377964J599369J697685J835030
19189B2807899K386641K812689L069235L596986M224149M647868M983205N295069
19181E3823741O155097O967991P830698Q083174P207168O220088N482546M695378
19173A06465881M035297L782199L872273L543870J531601j455591l261469l699881
19165A14814180l828806l821912m101531m343472m459149n566460o648434o376595
19157G5667821m833554l125281j796971p57292L526O77297J287942K014392K900776
$$ plain form
19148 72038656 75862761 80864787 86391905 91801262 96204144 99955989 102979879 104771644
19140 104771644 104612345 102980939 101075657 99031558 97104022 96452776 98140277 102268925
19132 102268925 107916577 113399456 118520685 124386118 131029020 136909874 141051518 143732583
19124 143732583 146490377 150499979 154654069 158527753 162671672 167649760 173419870 177538067
19116 177538067 178306248 177821953 177484994 176858043 176038666 173952955 168553662 160428252 152059345
19107 152059345 144770465 138283025 131658237 124343817 117056577 111418430 108174657 107254516
19099 107254516 107946763 108443755 107448628 104337400 99527641 94156418 89819440 87324093
19091 87324093 86372171 86764096 87998538 90200946 93647894 98280397 103404448 107828551
$$ packed form
19148G2038656L824105N002026N527118N409357M402882L751845L023890J791765
19140A04771644j59299j631406j905282k044099j927536o51246J687501M128648
19132A02268925N647652N482879N121229N865433O642902N880854M141644K681065
19124A43732583K757794M009602M154090L873684M143919M978088N770110M118197
19116A77538067P68181m84295l36959o26951q19377k085711n399293q125410q368907
19107A52059345p288880o487440o624788p314420p287240n638147l243773r20141
19099A07254516O92247M96992r95127l111228m809759n371223m336978k495347
19091H7324093r51922L91925J234442K202408L446948M632503N124051M424103
$$ plain form
19083 107828551 110706636 111874205 111320376 108582337 103839306 97773188 90744316 82874076
19075 82874076 74503784 66762711 60746557 56176817 52696812 50124521 47813944 45814029
19067 45814029 44167259 42545027 41189208 40145031 39526456 38978638 38217202 37019800
19059 37019800 35346795 33382952 31184370 28933117 27122356 25656263 24526722 23540854
19051 23540854 22712407 21779295 20995677 20386284 19813549 19220795 18792313 18472716 18128900
19042 18128900 17485811 16726263 15916566 15004130 14258632 13774330 13278049 12878038 12439418
19033 12439418 12175567 11830639 11489620 11087507 10725108 10543420 10352432 10085155 9938961
19024 9938961 9815399 9642158 9468095 9255708 9067672 8932490 8775020 8666398 8600585 8344098
$$ packed form
19083A07828551K878085J167569n53829k738039m743031o066118p028872p870240
19075H2874076q370292p741073o016154m569740l480005k572291k310577j999915
19067D5814029j646770j622232j355819j044177o18575n47818p61436j197402
19059C7019800j673005j963843k198582k251253j810761j466093j129541r85868
19051B3540854q28447r33112p83618o09393n72735n92754m28482l19597l43816
19042A8128900o43089p59548q09697r12436p45498m84302m96281m00011m38620
19033A2439418k63851l44928l41019m02113l62399j81688j90988k67277j46194
19024I938961j23562j73241j74063k12387j88036j35182j57470j08622o5813k56487
$$ plain form
19014 8344098 8317488 8346743 8270420 8200118 8116316 7932400 7739255 7497971 7308229 6996455
19004 6996455 6809064 6659682 6487633 6384162 6434870 6349070 6238675 6050613 6072541 6081265
18994 6081265 6104113 6013902 5918577 5877986 5692154 5588173 5567247 5498497 5411181 5378082 5326109
18983 5326109 5318518 5298224 5265088 5123646 5023353 5041588 5143087 5098391 5057425 5115387 5111916
18972 5111916 5049722 5076930 5084601 5121997 5099604 5052416 5034283 5043916 4903424 4748102 4694623
18961 4694623 4610673 4555408 4447621 4414565 4421305 4448992 4414684 4349284 4270323 4239241 4303924
18950 4303924 4341762 4245806 4150304 4257180 4433401 4293838 4132426 4128300 4099902 4155397 4273004
18939 4273004 4364585 4303373 4252173 4303593 4395130 4465123 4617691 4874723 5056059 5252193
$$ packed form
19014H344098k6610K9255p6323p0302q3802j83916j93145k41284j89742l11774
19004F996455j87391j49382j72049j03471N0708q5800j10395j88062K1928Q724
18994F081265K2848r0211r5325m0591j85832j03981k0926o8750q7316l3099n1973
18983E326109p591k0294l3136j41442j00293J8235J01499m4696m0966N7962l471
18972E111916o2194K7208P671L7396k2393m7188j8133R633j40492j55322n3479
18961D694623q3950n5265j07787l3056O740K7687l4308o5400p8961l1082O4683
18950D303924L7838r5956r5502J06876J76221j39563j61412m126k8398N5495J17607
18939D273004R1581o1212n1200N1420R1537O9993J52568K57032J81336J96134
$$ plain form
18929 5252193 5546732 5870500 6052077 6267034 6619450 6930504 7318443 7821700 8429924
18920 8429924 9000674 9717533 10549893 11513223 12660236 14026708 15589670 17704513 20169885
18911 20169885 22984720 26369295 30413923 34810179 39673018 44901335 50484830 56976433
18903 56976433 64898774 74888001 86504001 97427685 104447375 105774561 102414798 97171460
18895 97171460 93080400 91970167 94441800 99036077 102782691 102152033 95494287 84625522
18887 84625522 73210972 63627675 56180653 50545331 46357296 43073572 40502635 38653906
18879 38653906 37121756 35979940 34975638 34130125 33496017 33098156 33114280 33590564 34581917
18870 34581917 36252693 38554989 41644591 45410279 49758122 54566698 60003498 66041107
$$ packed form
18929E252193K94539L23768J81577K14957L52416L11054L87939N03257O08224
18920H429924N70750P16859Q32360R63330J147013J366472J562962K114843K465372
18911B0169885K814835L384575M044628M396256M862839N228317N583495O491603
18903E6976433P922341R989227J1616000J0923684P019690J327186l359763n243338
18895I7171460m091060j110233K471633M594277L746614o30658o657746j0868765
18887H4625522j1414550r583297p447022n635322m188035l283724k570937j848729
18879C8653906j532150j141816j004302q45513o34108l97861J6124M76284R91353
18870C4581917J670776K302296L089602L765688M347843M808576N436800O037609
$$ plain form
18862 66041107 72676974 80258697 89410436 100792329 114430702 128217774 137631885 139535184
18854 139535184 134581499 126429153 119457063 116318646 117378449 121120495 123945792 121965122
18846 121965122 113918502 101734099 88639789 76962125 67556064 60220081 54561095
18839 54561095 49991162 46318992 43273058 40658104 38272461 36093411 34082696 32144049
18831 32144049 30182404 28510164 27060531 25738725 24514233 23321977 22094748 21004499
18823 21004499 19971309 18937855 18199321 17486488 16702977 15812560 15124649 14596822 13867665
18814 13867665 13332378 12920429 12645894 12218278 11625946 11162685 10791883 10382469 10048344
18805 10048344 9823416 9708593 9542342 9221960 8854336 8686372 8477604 8140351 7788913
$$ packed form
18862F6041107O635867P581723R151739J1381893J3638373J3787072R414111J903299
18854A39535184m953685q152346o972090l138417J059803L742046K825297j980670
18846A21965122q046620j2184403j3094310j1677664r406061p335983n658986
18839E4561095m569933l672170l045934k614954k385643k179050k010715j938647
18831C2144049j961645j672240j449633j321806j224492j192256j227229j090249
18823B1004499j033190j033454p38534p12833p83511q90417o87911n27827p29157
18814A3867665n35287m11949k74535m27616n92332m63261l70802m09414l34125
18805A0048344k24928j14823j66251l20382l67624j67964k08768l37253l51438
$$ plain form
18796 7788913 7554568 7451468 7330083 7133609 6901952 6632590 6358114 6236623 6097293
18787 6097293 6121417 6059910 5855581 5627382 5604096 5665229 5585660 5547877 5508186 5374047 5266837
18776 5266837 5106971 5060669 5030750 4885486 4733491 4550352 4382734 4328085 4211738 4092805
18766 4092805 3930687 3801489 3796186 3710192 3619356 3584083 3625531 3655418 3577852 3593196 3552129
18755 3552129 3350105 3191225 3241850 3228153 3103495 3023465 2950016 2897320 2964717 3045930 3232500
18744 3232500 3245538 3198480 3155542 3105172 2920058 2865895 2878157 2817668 2711373 2753526 2899543
18733 2899543 3054025 3014299 2882872 2895808 2927965 2949426 2950315 2946697 2962418 2979034 2974571 2881618
18721 2881618 2834070 2783126 2892801 2994909 3115179 3191078 3302058 3375124 3369704 3518394
$$ packed form
18796G788913k34345j03100j21385j96474k31657k69362k74476j21491j39330
18787F097293K4124o1507k04329k28199k3286O1133p9569l7783l9691j34139j07210
18776E266837j59866m6302k9919j45264j51995j83139j67618n4649j16347j18933
18766D092805j62118j29198n303q5994r0836l5273M1448K9887p7566J5344m1067
18755C552129k02024j58880N0625j3697j24658q0030p3449n2696O7397Q1213J86570
18744C232500J3038m7058m2938n0370j85114n4163J2262o0489j06295M2153J46017
18733B899543J54482l9726j31427J2936L2157K1461Q89l618J5721J6616m463r2953
18721B881618m7548n0944J09675J02108J20270P5899J10980P3066n420J48690
$$ plain form
18711 3518394 3666173 3655455 3872093 4130044 4379798 4580745 4834576 5311505 5701692 5688940
18701 5688940 5616531 5585267 5472328 5537837 5768273 5928364 5974963 6074838 6241915 6239295 6205326
18690 6205326 6121685 5910635 5667450 5425255 5308281 5268510 5286134 5464257 5578222 5669181
18680 5669181 5936414 6110966 6444473 6809383 7215446 7760143 8318717 9004590 9892918
18671 9892918 10794848 11693304 12748815 13687288 14417840 14996680 15311295 15492992 15447012
18662 15447012 15273658 15154349 15201253 15206191 14918534 14507495 14105675 13968659 13771154 13721885
18652 13721885 13770205 13844780 13914886 13888860 13566536 13008986 12491368 11968866 11524659 11287157
18642 11287157 11288360 11425254 11470699 11482158 11508907 11417151 11257343 11147087 11217849 11351678
$$ packed form
18711C518394J47779j0718K16638K57951K49754K00947K53831M76929L90187j2752
18701E688940p2409l1264j12939O5509K30436J60091M6599R9875J67077k620l3969
18690F205326q3641k11050k43185k42195j16974l9771J7624J78123J13965R0959
18680E669181K67233J74552L33507L64910M06063N44697N58574O85873Q88328
18671I892918R01930Q98456J055511R38473P30552N78840L14615J81697m5980
18662A5447012j73354j19309M6904M938k87657m11039m01820j37016j97505m9269
18652A3721885M8320P4575P0106k6026l22324n57550n17618n22502m44207k37502
18642A1287157J203J36894M5445J1459K6749r1756j59808j10256P0762J33829
$$ plain form
18632 11351678 11682055 12165434 12644667 13176965 13838625 14543055 15278602 16198126 17122218
18623 17122218 17889797 18304929 18479507 18611783 18710280 18910409 19206288 19670294 20061972
18614 20061972 20239587 20194957 19998056 19762847 19692437 19544925 19320156 19048649 18551696 18132482
18604 18132482 17805430 17625583 17497878 17436819 17646936 18012143 18379292 18753324 19018123
18595 19018123 19293995 19334110 19344719 19391967 19411448 19270444 18996031 18754648 18597558 18483551
18585 18483551 18531310 18756048 19068857 19571375 19990844 20153636 20130891 20001784 19738986 19426553
18575 19426553 19279519 19252729 19439662 19694756 19776429 19501554 19045782 18661061 18373641 18251194
18565 18251194 18202562 18251363 18390967 18712159 19216540 19867949 20934476 22292942 23814752
$$ packed form
18632A1351678L30377M83379M79233N32298O61660P04430P35547R19524R24092
18623A7122218P67579M15132J74578J32276R8497K00129K95879M64006L91678
18614B0061972J77615m4630j96901k35209p0410j47512k24769k71507m96953m19214
18604A8132482l27052j79847j27705o1059K10117L65207L67149L74032K64799
18595A9018123K75872M0115J0609M7248J9481j41004k74413k41383j57090j14007
18585A8483551M7759K24738L12809N02518M19469J62792k2745j29107k62798l12433
18575A9426553j47034k6790J86933K55094Q1673k74875m55772l84721k87420j22447
18565A8251194m8632M8801J39604L21192N04381O51409J066527J358466J521810
$$ plain form
18556 23814752 25272982 26291674 26456026 26138951 26122058 26720180 27808247 29106917 30443677
18547 30443677 31755646 33349393 35544828 38495462 42237221 45630361 46921590 45293966
18539 45293966 42002354 39029007 36880293 35545520 34661398 34118969 34045671 34307515 34820542
18530 34820542 35480186 36473150 37802795 39486758 41647506 44453194 48105209 52738542
18522 52738542 58443703 65062725 72044297 79375561 87343013 96888592 109245484 125717984
18514 125717984 145435274 163953326 175492196 178739917 178380837 180453098 188608700 202878392
18506 202878392 220269801 235284490 243544946 245126758 242755794 237122014 227773518 215032843
18498 215032843 199102178 180772584 162410389 147150934 136188418 128420398 122655402
$$ packed form
18556B3814752J458230J018692J64352l17075j6893N98122J088067J298670J336760
18547C0443677J311969J593747K195435K950634L741759L393140J291229j627624
18539D5293966l291612k973347k148714j334773q84122n42429p3298K61844N13027
18530C4820542O59644R92964J329645J683963K160748K805688L652015M633333
18522E2738542N705161O619022O981572P331264P967452R545579J2356892J6472500
18514A25717984J9717290J8518052J1538870L247721l59080K072261Q155602J4269692
18506B02878392J7391409J5014689Q260456J581812k370964n633780r348496j2740675
18498B15032843j5930665j8329594j8362195j5259455j0962516p768020n764996
$$ plain form
18491 122655402 118595809 116102951 115496702 116551767 118893941 122455402 126917732 132205607
18483 132205607 138474573 145900311 155237302 167707117 183639132 201021013 214855876
18476 214855876 220174207 214918792 200203847 181497495 165267127 154684471 149529329
18469 149529329 148687582 150925500 155859139 163677292 175174442 190462854 207113862 221002694
18461 221002694 228527677 230078517 229334486 230581131 236714850 248060900 261586592 272658549
18453 272658549 277051217 274034344 264451303 248898508 228496971 206646796 187753564
18446 187753564 174351506 166879015 164782161 166329515 167563664 163334259 151897483 136224242
18438 136224242 120813218 108486871 99136996 91886793 86138725 81402957 77264721 73572873
$$ packed form
18491A22655402m059593k492858o06249J055065K342174L561461M462330N287875
18483A32205607O268966P425738R336991J2469815J5932015J7381881J3834863
18476B14855876N318331n255415j4714945j8706352j6230368j0582656n155142
18469A49529329q41747K237918M933639P818153J1497150J5288412J6651008J3888832
18461B21002694P524983J550840p44031J246645O133719J1346050J3525692J1071957
18453B72658549M392668l016873r583041j5552795k0401537k1850175j8893232
18446A87753564j3402058p472491k096854J547354J234149m229405j1436776j5673241
18438A36224242j5411024j2326347r349875p250203n748068m735768m138236l691848
$$ plain form
18430 73572873 70362497 67502382 65002960 62997587 61494104 60775453 60618140 61211115
18422 61211115 62525465 64483978 67190097 70237763 73588114 77241735 81179445 86137102
18414 86137102 92718449 101566845 111526928 119585336 121455032 114810469 101866493 87461259
18406 87461259 75316136 66435071 60254475 55990063 52876494 50654949 49148346 47704409
18398 47704409 45654125 43051063 40199512 37529247 35230472 33199084 31478242 29916258
18390 29916258 28456936 27102505 26012760 25114369 24196787 23290966 22429253 21657469 20720912
18381 20720912 19807029 18971265 18234886 17518649 16913795 16424358 15880082 15377818 15038802
18372 15038802 14710332 14257026 13789880 13370240 12950235 12494361 12286356 12144363 11772774
$$ packed form
18430G3572873l210376k860115k499422k005373j503483p18651j57313N92975
18422F1211115J314350J958513K706119L047666L350351L653621L937710M957657
18414H6137102O581347Q848396R960083Q058408J869696o644563j2943976j4405234
18406H7461259j2145123q881065o180596m264412l113569k221545j506603j443937
18398D7704409k050284k603062k851551k670265k298775k031388j720842j561984
18390B9916258j459322j354431j089745q98391r17582r05821q61713p71784r36557
18381B0720912r13883q35764p36379p16237o04854m89437n44276n02264l39016
18372A5038802l28470m53306m67146m19640m20005m55874k08005j41993l71589
$$ plain form
18363 11772774 11412449 11097973 10771221 10512931 10247271 9830493 9498307 9246165 9134801
18354 9134801 8929671 8770657 8655589 8417389 8188204 8055611 7956070 7791812 7580205 7317456
18344 7317456 7257961 7251835 7243341 7199092 7109224 6976073 6823184 6692478 6426290 6169232 5977915
18333 5977915 5828523 5704491 5587562 5500989 5446995 5279349 5119719 5012478 4829269 4791661
18323 4791661 4600001 4492834 4362778 4219548 4092261 3913742 3928807 3896103 3828300 3806735
18313 3806735 3636124 3485681 3529962 3474277 3399588 3371408 3320725 3339505 3298683 3310295 3251328
18302 3251328 3285212 3173604 3040043 2966779 2934795 2836834 2856051 2917925 2856898 2767876 2672961
18291 2672961 2513693 2460930 2489304 2350836 2246082 2236846 2302317 2347219 2304415 2267290 2231634
$$ packed form
18363A1772774l60325l14476l26752k58290k65660m16778l32186k52142j11364
18354I134801k05130j59014j15068k38200k29185j32593r9541j64258k11607k62749
18344G317456n9495o126q494m4249q9868j33151j52889j30706k66188k57058j91317
18333E977915j49392j24032j16929q6573n3994j67646j59630j07241j83209l7608
18323D791661j91660j07167j30056j43230j27287j78519J5065l2704o7803k1565
18313C806735j70611j50443M4281n5685p4689k8180n0683J8780m0822J1612n8967
18302C251328L3884j11608j33561p3264l1984r7961J9217O1874o1027q9022r4915
18291B672961j59268n2763K8374j38468j04754r236O5471M4902m2804l7125l5656
$$ plain form
18280 2231634 2243102 2234045 2156726 2118214 2190221 2165440 2060640 1899517 1789711 1808390 1886367
18269 1886367 1874062 1723145 1659582 1699984 1716740 1650902 1521299 1637267 1655946 1666902 1729783
18258 1729783 1686301 1715537 1683903 1648345 1735779 1743862 1750107 1613665 1515779 1559955 1607169
18247 1607169 1498345 1391763 1349787 1357909 1476075 1591340 1500959 1396358 1286203 1156839
18237 1156839 1084587 1117796 1162806 1209831 1129619 993319 1032867 1065222 934572 979265 1020630
18226 1020630 1107598 1111599 1089844 1059742 1064119 1071866 1112154 1022581 968852 941414 872668 742197
18214 742197 843012 981797 1012771 984455 1019957 1049307 937545 779699 717009 751863 816918
18203 816918 856425 797324 803195 820623 887776 858461 844368 861986 888233 820317 874475 932839
$$ packed form
18280B231634J1468r057p7319l8512P2007k4781j04800j61123j09806J8679P7977
18269A886367j2305j50917o3563M0402J6756o5838j29603J15968J8679J0956O2881
18258A729783m3482K9236l1634l5558Q7434Q083O245j36442r7886M4176M7214
18247A607169j08824j06582m1976Q122J18166J15265r0381j04601j10155j29364
18237A156839p2252L3209M5010M7025q0212j36300L9548L2355j30650M4693M1365
18226A020630Q6968M001k1755l0102M377P747M0288q9573n3729k7438o8746j30471
18214G42197J00815J38785L0974k8316L5502K9350j11762j57846o2690L4854O5055
18203H16918L9507n9101N871J7428O7153k9315j4093J7618K6247o7916N4158N8364
$$ plain form
18191 932839 811655 798917 965895 986622 882312 738995 725668 785458 794891 826993 661630
18180 661630 576941 551063 682626 765508 646540 600051 570267 593849 599831 601078 663159
18169 663159 820243 844793 759416 775246 789262 743048 702874 750036 676366 546687 609046
18158 609046 687249 618418 478364 535298 665783 657833 634684 622033 551031 513155 522477
18147 522477 487957 423308 379465 410784 417679 476790 660151 751979 607213 412314 449894
18136 449894 478535 531806 524253 515089 449228 421402 572895 615297 554633 471200 470426 441625
18124 441625 414826 479311 419765 219429 120624 213883 359389 468026 369890 464148 516355
18113 516355 510723 411764 353713 307600 351357 456652 451378 424799 434400 403012 417003 449583
$$ packed form
18191I32839j21184j2738J66978K0727j04310j43317j3327N9790R433L2102j65363
18180F61630q4689k5878J31563Q2882j18968m6489k9784K3582N982J247O2081
18169F63159J57084K4550q5377J5830J4016m6214m0174M7162p3670j29679O2359
18158F09046P8203o8831j40054N6934J30485p950k3149j2651p1002l7876R322
18147E22477l4520o4649m3843L1319O895N9111J83361R1828j44766j94899L7580
18136D49894K8641N3271p553r164o5861k7826J51493M2402o0664q3433p74k8801
18124D41625k6799O4485n9546k00336r8805R3259J45506J08637r8136R4258N2207
18113E16355n632r8959n8051m6113M3757J05295n274k6579R601l1388J3991L2580
$$ plain form
18101 449583 484685 541536 545753 466883 466651 479676 458239 466747 400167 343222 368251 451017
18089 451017 460135 418380 393389 349208 243844 258334 276118 274599 245243 208227 253707 248915
18077 248915 271407 264382 323014 360327 240388 174227 259580 255505 256608 377629 487469
18066 487469 554215 493366 426484 364653 344471 234881 263908 294133 216988 237496 276079
18055 276079 307193 382208 395821 404901 428925 363546 290039 354364 460828 496189 502958 525996
18043 525996 537117 506312 506373 521204 675417 638390 663576 664432 617589 536795 555945 681156
18031 681156 755735 673807 599233 665831 710627 565049 505529 447095 444264 576021 516783
18020 516783 510288 637520 659783 576541 469452 515166 577603 562034 428466 470177 624061
$$ packed form
18101D49583L5102N6851M217p8870k32J3025k1437Q508o6580n6945K5029Q2766
18089D51017R118m1755k4991m4181j05364J4490J7784j519k9356l7016M5480m792
18077B48915K2492p025N8632L7313j19939o6161Q5353m075J103J21021J09840
18066D87469O6746o0849o6882o1831k0182j09590K9027L0225p7145K0508L8583
18055B76079L1114P5015J3613R080K4024o5379p3507O4325J06464L5361O769K3038
18043E25996J1121l0805O1J4831J54213l7027K5186Q56m6843q0794J9150J25211
18031F81156P4579q1928p4574O6598M4796j45578n9520n8434k831J31757n9238
18020E16783o495J27232K2263q3242j07089M5714O2437j5569j33568M1711J53884
$$ plain form
18009 624061 839917 929240 923366 794949 792867 914388 951576 925990 1014331 1195249 1421156
17998 1421156 1469004 1279262 1208707 1225692 1185827 1047181 1066796 1132614 1189243 1171327 1157862
17987 1157862 1150307 1092264 1162559 1099816 953929 1024694 956319 836205 957944 977417 890945
17976 890945 820920 789658 934055 955049 857189 849160 801294 756649 806675 731496 649350
17965 649350 736914 837958 877169 960687 1094351 1271852 1332063 1349963 1325588 1276469 1218222
17954 1218222 1343404 1350595 1305242 1298764 1401513 1564572 1574026 1453275 1418935 1366943 1245054
17943 1245054 1035388 989527 1089472 1092379 1080001 1006902 961210 971253 810072 791687 908911
17932 908911 988280 931047 801483 758829 612157 572671 516167 478313 293578 215733 367875
$$ packed form
18009F24061K15856Q9323n874j28417k082J21521L7188k5586Q8341J80918K25907
17998A421156M7848j89742p0555J6985l9865j38646J9615O5818N6629j7916j3465
17987A157862p555n8043P0295o2743j45887P0765o8375j20114J21739J9473q6472
17976H90945p0025l1262J44397K0994r7860q029m7866m4645N0026p5179q2146
17965F49350Q7564J01044L9211Q3518J33664J77501O0211J7900k4375m9119n8247
17954A218222J25182P191m5353o478J02749J63059R454j20751l4340n1992j21889
17943A245054k09666m5861R9945K907j2378p3099m5692J0043j61181j8385J17224
17932I08911P9369n7233j29564m2654j46672l9486n6504l7854j84735p7845J52142
$$ plain form
17921 367875 403734 423502 478820 543284 648030 666547 598571 519585 635637 754237 773444
17910 773444 770404 717831 714050 709154 803526 878428 1026865 1180598 1161175 866578 716282
17899 716282 653953 532916 416798 498933 606816 663096 571253 422845 315000 359597
17889 359597 405781 324056 137732 91802 109923 62631 21103 139565 214898 229093 323448
17878 323448 381409 373483 261694 253591 292958 227133 268188 306154 402686 416374 356988 207461
17866 207461 133428 142810 189647 208660 240908 241471 242794 235539 156364 149298 190247 262596 174530
17853 174530 243068 139741 -34698 -20666 54852 101147 147568 151944 231215 184956 139303
17842 139303 258790 280881 223766 175586 205777 277078 218815 51121 40793 113709 60257
$$ packed form
17921C67875L5859J9768N5318O4464J04746J8517o7976p8986J16052J18600J9207
17910G73444l040n2573l781m896R4372P4902J48437J53733j9423k94597j50296
17899G16282o2329j21037j16118Q2135J07883N6280r1843j48408j07845M4597
17889C59597M6184q1725j86324m5930J8121m7292m1528J18462P5333J4195R4355
17878C23448N7961p926j11789q103L9367o5825M1055L7966R6532J3688n9386j49527
17866B07461p4033R382M6837J9013L2248N63J323p255p9175p066M0949P2349q8066
17853A74530O8538j03327j74439J4032P5518M6295M6421M376P9271m6259m5653
17842A39303J19487K2091n7115m8180L0191P1301n8263j67694j0328P2916n3452
$$ plain form
17831 60257 45509 121863 147076 112462 142648 225184 174624 84040 20110 10841 86785 43723
17819 43723 -16184 -15485 -105764 -131343 -18101 22690 109858 71844 61520 60131 102375 212524
17807 212524 130184 46613 69524 165562 120271 39964 23816 497 97831 169176 79570
17796 79570 49578 23006 -60377 -24308 83808 117039 174555 200335 196813 243483 265724 125387
17784 125387 113411 97778 34976 98736 86526 99484 174450 158834 119109 178667 267386
17773 267386 262967 178725 208246 211369 119551 93892 180604 215550 130015 157161 207591 280413
17761 280413 334079 268944 160567 146927 196848 131438 157017 111359 227596 350460 395010
17750 395010 220879 161843 200073 233603 170161 64927 104163 41578 -4466 -41791 -9837
$$ packed form
17831F0257j4748P6354K5213l4614L0186Q2536n0560r0584o3930r269P5944m3062
17819D3723n9907O99r0279k5579J13242M0791Q7168l8014j0324j389M2244J10149
17807B12524q2340q3571K2911R6038m5291q0307j6148k3319R7334P1345q9606
17796G9570k9992k6572q3383L6069J08116L3231N7516K5780l522M6670K2241j40337
17784A25387j1976j5633o2802O3760j2210J2958P4966j5616l9725N9558Q8719
17773B67386m419q4242K9521L123r1818k5659Q6712L4946q5535K7146N0430P2822
17761B80413N3666o5135j08377j3640M9921o5410K5579m5658J16237J22864M4550
17750C95010j74131n9036L8230L3530o3442j05234L9236o2585m6044l7325L1954
$$ plain form
17739 -9837 67557 2280 55204 178770 161125 119169 76670 -68362 -66529 -66994 -15644 118284
17727 118284 74758 166445 204621 104468 89472 116899 117339 135918 231288 197374 126582 199777
17715 199777 115759 99295 137800 119727 127683 172061 242171 207756 123723 64376 150429 311456
17703 311456 316002 197426 153620 50320 2082 40327 4959 -39669 1460 122318 221441
17692 221441 175845 32989 -43719 -49763 -14693 71330 78175 118744 58315 -240633 -235494 -169304
17680 -169304 -114845 1373 -4605 88947 74826 126882 88426 44425 99633 56917 739
17669 739 47319 56792 122427 112027 -46194 14061 101646 162130 181958 186593 142432 130463
17657 130463 131953 178454 59461 -40206 -63064 33139 126670 113148 79823 79216 61857 49963
$$ packed form
17739i837P7394o5277N2924J23566j7645m1956m2499j45032J833m65N1350J33928
17727A18284m3526R1687L8176j00153j4996K7427M40J8579R5370l3914p0792P3195
17715A99777q4018j6464L8505j8073P956M4378P0110l4415q4033n9347Q6053J61027
17703C11456M546j18576m3806j03300m8238L8245l5368m4628M1129J20858R9123
17692B21441m5596j42856p6708o044L5070Q6023O845M0569o0429k98948N139O6190
17680a69304N4459J16218n978R3552j4121N2056l8456m4001N5208m2716n6178
17669G39M6580R473O5635j0400j58221O0255Q7585O0484J9828M635m4161j1969
17657A30463J490M6501j18993r9667k2858R6203R3531j3522l3325o07j7359j1894
$$ plain form
17645 49963 -38110 -50974 41968 87576 163730 119380 76695 40642 57682 55797 97795 58413
17633 58413 74464 131060 111960 36417 11795 65183 83947 52908 -43781 -20681 -517 -27884
17621 -27884 79130 131836 114310 71263 74510 503 -82599 -81940 38839 165785 161418 105641
17609 105641 -11700 94002 85903 19487 50177 143041 107001 137457 159892 113439 27098
17598 27098 -40711 44669 110811 51714 -5922 -24087 -48184 -142428 -111122 -42021 16723 -23442
17586 -23442 -29646 -55310 -156775 -125813 -51573 -70903 -10719 59231 128876 53434 105272 89783
17574 89783 -9305 -12661 58222 102709 60640 -62871 -58024 -73561 33253 44835 -46227 -49645
17562 -49645 -44686 -80982 -171927 -60810 -1244 -44456 -52025 -104299 -180462 -9632 30048 57371
$$ packed form
17645D9963q8073j2864R2942M5608P6154m4350m2685l6053J7040j885M1998l9382
17633E8413J6051N6596j9100p5543k4622N3388J8764l1039r6689K3100K0164k7367
17621b7884J07014N2706j7526m3047L247p4007q3102O59J20779J26946m367n5777
17609A05641j17341J05702q099o6416L0690R2864l6040L0456K2435m6453q6341
17598B7098o7809Q5380O6142n9097n7636j8165k4097r4244L1306O9101N8744m0165
17586b3442o204k5664j01465L0962P4240j9330O0184O9950O9645p5442N1838j5489
17574H9783r9088l356P0883M4487m2069j23511M847j5537J06814J1582r1062l418
17562d9645M959l6296r0945J11117N9566m3212p569n2274p6163J70830L9680K7323
$$ plain form
17550 57371 30390 28824 -22454 29317 160691 176503 100319 18143 -61721 -86969 -78519 -52720
17538 -52720 -85568 -162512 -191800 -135622 -89492 -71502 8638 53554 34349 28166 -10932 67267
17526 67267 42596 67392 135616 84305 -87957 -200775 -179235 -138038 9032 14762 5337
17515 5337 80160 82400 137161 152558 75354 106626 128882 55515 31328 74795 74308 112833
17503 112833 139144 116546 59969 120780 121537 70318 43382 66724 -45142 -171234 -100548
17492 -100548 -10914 -34482 -52212 -24703 -127972 -175828 -133088 -43232 11937 114538 181684
17481 181684 97047 138705 53360 91849 135407 85854 46386 101951 71483 207589 294607
17470 294607 183606 55986 52576 31524 -89535 -8733 58618 -74124 -3254 79821 35200
$$ packed form
17550E7371k6981j566n1278N1771J31374J5812p6184q2176p9864k5248Q450K5799
17538e2720l2848p6944k9288N6178M6130J7990Q0140M4916j9205o183l9098P8199
17526F7267k4671K4796O8224n1311j72262j12818K1540M1197J47070N730r425
17515E337P4823K240N4761J5397p7204L1272K2256p3367k4187M3467m87L8525
17503A12833K6311k2598n6577O0811P57n1219k6936K3342j11866j26092P0686
17492a00548Q9634k3568j7730K7509j03269m7856M2740Q9856N5169J02601O7146
17481A81684q4637M1658q5345L8489M3558m9553l9468N5565l0468J36106Q7018
17470B94607j11001j27620l410k1052j21059Q0802O7351j32742P0870Q3075m4621
$$ plain form
17459 35200 190182 185110 86323 16388 76420 60731 36181 64130 95307 6196 1832 81867
17447 81867 38066 23263 -2974 62297 28746 90144 134952 65598 118256 50814 -38555 5266
17435 5266 40332 37616 30347 147208 155157 125731 97651 172292 113176 -60534 -45516 83522
17423 83522 102147 75678 122332 60137 -25693 -72535 -88286 -95624 -94583 -19700 -2863 84363
17411 84363 78146 45063 164159 185811 226738 198019 154584 76944 7691 -14142 -7058 71311
17399 71311 73305 23782 13406 98173 82145 -6582 -88980 -67718 79768 43408 -728 12933
17387 12933 55712 14897 182859 204010 61594 1315 75630 188635 177848 10746 -103240
17376 -103240 -75129 26381 50098 46202 -50978 -32676 56981 -6031 -37239 53796 239718
$$ packed form
17459C5200J54982n072r8787o9935O0032j5689k4550K7949L1177q9111m364Q0035
17447H1867m3801j4803k6237O5271l3551O1398M4808o9354N2658o7442q9369M3821
17435E266L5066k716p269J16861P949k9426k8080P4641n9116j73710J5018J29038
17423H3522J8625k6469M6654o2195q5830m6842j5751p338J041P4883J6837Q7226
17411H4363o217l3083J19096K1652M0927k8719m3435p7640o9253k1833P084P8369
17399G1311J994m9523j0376Q4767j6028q8727q2398K1262J47486l6360m4136J3661
17387A2933M2779m0815J67962K1151j42416o0279P4315J13005j0787j67102j13986
17376a03240K8111J01510K3717l896r7180J8302Q9657o3012l1208R1035J85922
$$ plain form
17365 239718 182192 52839 -21432 -1189 -85847 -15875 80209 115547 -5722 -32751 -33495
17354 -33495 34371 86132 169137 189217 149263 80563 136947 113557 64605 -38697 -118768
17343 -118768 -92702 -87060 -62843 -40445 114063 287566 168188 94531 85393 114609 94105
17332 94105 68139 32941 71723 169117 199190 95207 10253 -3356 -25520 57828 131859
17321 131859 102764 100899 200254 230029 162168 108754 46529 -47258 -64088 -41149 -17467 -63588
17309 -63588 -45416 41750 89347 -1151 -62336 41767 53776 -66150 -95340 -60639 -26772
17298 -26772 1669 -70893 81555 82142 -42730 -76513 -27853 -53068 -12483 63806 38085 69675
17286 69675 55477 95842 189642 163496 46033 -38857 -39368 -31287 -14993 -71483 -134408 -57245
$$ packed form
17365B39718n7526j29353p4271K0243q4658O9972R6084L5338j21269k7029p44
17354c3495O7866N1761Q3005K0080l9954o8700N6384k3390m8952j03302q0071
17343a18768K6066N642K4217K2398J54508J73503j19378p3657r138K9216k0504
17332I4105k5966l5198L8782R7394L0073j03983q4954j3609k2164Q3348P4031
17321A31859k9095j865R9355K9775o7861n3414o2225r3787j6830K2939K3682m6121
17309f3588J8172Q7166M7597r0498o1185J04103J2009j19926k9190L4701L3867
17298b6772K8441p2562J52448N87j24872l3783M8660k5215M0585P6289k5721L1590
17286F9675j4198M0365R3800k6146j17463q4890n11Q081J6294n6490o2925P7163
$$ plain form
17274 -57245 -39830 -78389 -10279 44543 100255 138673 2863 -98215 -191213 -280474 -274454
17263 -274454 -275836 -236061 -272011 -323441 -288431 -154872 -114025 -88695 37884 54700 -88401
17252 -88401 -190235 -186513 -186570 10453 83514 129063 1921 43748 78089 183541 177799 -31712
17240 -31712 -157255 -30430 -19666 -43735 -16868 4349 -66347 -21962 64673 56049 42012
17229 42012 -30192 -93767 -108291 -40586 -79205 -152672 -106281 5028 85269 88106 -17428
17218 -17428 50549 129333 193358 206315 60716 13190 39946 67096 75 -42227 -73754
17207 -73754 -71605 -111070 -135448 -204917 -189110 -145634 -103498 -118996 -94727 -98282 -4090 48487
17195 48487 12865 -17951 -52995 -70589 -84821 -142502 -50546 102410 84290 82986 101108 66675
$$ packed form
17274e7245J7415l8559O8110N4822N5712L8418j35810j01078r2998q9261O020
17263b74454j382L9775l5950n1430L5010J33559M0847K5330J26579J6816j43101
17252h8401j01834L722n7J97023P3061M5549j27142M1827L4341J05452n742k09511
17240c1712j25543J26825J0764k4069K6867K1217p0696M4385Q6635q624j4037
17229D2012p2204o3575j4524O7705l8619p3467M6391J11309Q0241K837j05534
17218a7428O7977P8784O4025J2957j45599m7526K6756K7150o7021m2302l1527
17207g3754K149l9465k4378o9469J5807M3476M2136j5498K4269l555R4192N2577
17195D8487l5622l0816l5044j7594j4232n7681R1956J52956j8120j304J8122l4433
$$ plain form
17183 66675 99961 13942 -18194 -9766 47623 -12696 -76725 49010 45346 84941 30932 -27387
17171 -27387 -79652 -229952 -201769 -61523 -167454 -267953 -247496 -252023 -216488 -150736 56618
17160 56618 63197 -48230 -5854 -50185 -35895 1104 59697 -36291 -137374 -88142 -70485
17149 -70485 -59369 -71944 -8555 87593 94383 76693 81198 86840 82020 92254 40279 49685 149687
17136 149687 169543 204135 45113 -84178 -29326 5668 -57520 -179673 -196401 -71581 15089
17125 15089 54487 120873 107752 61912 44085 60071 67807 69380 14547 -127773 -150542 -130720
17113 -130720 -105904 15987 94613 119989 37635 64934 -25815 13084 39861 96547 169356
17102 169356 125415 -9195 -75338 -76225 -97089 -4613 9904 63926 140091 57112 -44884
$$ packed form
17183F6675L3286q6019l2136Q428N7389o0319o4029J25735l664L9595n4009n8319
17171b7387n2265j50300K8183J40246j05931j00499K0457m527L5535O5752K07354
17160E6618O579j11427M2376m4331J4290L6999N8593r5988j01083M9232J7657
17149g0485J1116j2575O3389R6148O790j7690M505N642m820J0234n1975R406J00002
17136A49687J9856L4592j59022j29291N4852L4994o3188j22153j6728J24820Q6670
17125A5089L9398O6386j3121m5840j7827J5986P736J573n4833j42320k2769J9822
17113a30720K4816J21891P8626K5376q2354K7299r0749L8899K6777N6686P2809
17102A69356m3941j34610o6143q87k0864R2476J4517N4022P6165q2979j01996
$$ plain form
17091 -44884 -192415 -128036 -189788 -133831 -83759 -118418 -59918 -16058 94781 110615 119684
17080 119684 158690 107970 -31928 38440 51858 -122231 -149857 -68596 64069 136695 27920
17069 27920 6569 77343 11426 38576 -13417 -46359 -164398 -182469 -86614 -64720 -34790
17058 -34790 160617 150406 94780 54501 -35598 -98102 -48664 -85571 -34509 -90959 -161725
17047 -161725 -175902 -61833 10256 10179 -149983 -227784 -178937 -19845 139572 202623 108456
17036 108456 168585 101370 131320 149935 116898 78731 51979 24787 75605 25071 9193
17025 9193 43839 -29272 17367 -21409 -60509 17543 7246 14549 -76630 -56380 -67992 -119899
17013 -119899 -71295 65675 114946 102750 99912 96945 6707 54386 106241 179566 25011
$$ packed form
17091d4884j47531O4379o1752N5957N0072l4659N8500M3860J10839J5834R069
17080A19684L9006n0720j39898P0368J3418j74089k7626Q1261J32665P2626j08775
17069B7920k1351P0774o5917K7150n1993l2942j18039j8071R5855K1894K9930
17058c4790J95407j0211n5626m0279r0099o2504M9438l6907N1062n6450p0766
17047a61725j4177J14069P2089p7j60162p7801M8847J59092J59417O3051r4167
17036A08456O0129o7215K9950J8615l3037l8167k6752k7192N0818n0534j5878
17025I193L4646p3111M6639l8776l9100P8052j0297P303r1179K0250j1612n1907
17013a19899M8604J36970M9271j2196k838k967r0238M7679N1855P3325j54555
$$ plain form
17002 25011 -67473 -81019 -27445 8336 -64184 -123442 -15989 18139 -131827 -202493 -23595
16991 -23595 31729 68495 6745 70772 94244 163343 168917 143271 213111 207608 203075 208523
16979 208523 193408 157430 35658 -36436 -56997 -106435 -93325 -14083 30113 103937 49617
16968 49617 19687 -32329 42559 43752 120493 80474 -24305 -4233 -33815 -32342 -59787 -81345
16956 -81345 -48550 20451 -5741 -35486 31644 57989 128410 240303 160816 32234 -4153
16945 -4153 -13538 -16076 -13844 36709 9521 -22523 33074 100536 114947 7628 -65885 -42622
16933 -42622 -38310 -14488 -92819 -84331 -96554 -17131 -18730 -84968 -121708 -82845 -35503 -55982
16921 -55982 -33370 70627 155192 69140 35028 48245 112997 37761 -31428 -132716 -127084
$$ packed form
17002B5011r2484j3546N3574L5781p2520n9258J07453L4128j49966p0666J78898
16991b3595N5324L6766o1750O4027K3472O9099N574k5646O9840n503m533N448
16979B08523j5115l5978j21772p2094k0561m9438J3110P9242M4196P3824n4320
16968D9617k9930n2016P4888J193P6741m0019j04779K0072k9582J473k7445k1558
16956h1345L2795O9001k6192k9745O7130K6345P0421J11893p9487j28582l6387
16945d153r385k538K232N0553k7188l2044N5597O7462J4411j07319p3513K3263
16933d2622M312K3822p8331Q488j2223P9423j599o6238l6740L8863M7342k0479
16921e5982K2612J03997Q4565q6052l4112J3217O4752p5236o9189j01288N632
$$ plain form
16910 -127084 -22936 68313 125946 147742 73644 103571 44415 -49844 -116822 -107947 -158407
16899 -158407 -225000 -209349 -116476 -116499 -121956 -147874 -112332 -157445 -90669 -36733 22179 -15888
16887 -15888 -69508 -45116 -9550 -118066 -69017 -63758 -82506 18253 23089 -94225 -224637
16876 -224637 -103967 -25000 11552 125129 135720 55569 173665 262180 205441 134635 -403
16865 -403 -104611 -233964 -401408 -366186 -176087 -123278 -17902 42354 58172 75885 -34243
16854 -34243 -20453 -9322 43861 -6649 -44023 24276 115183 87872 66457 134894 131268 133069
16842 133069 22017 -13751 34446 113811 68612 -101460 -213401 -214071 -246651 -152789 -23300
16831 -23300 33245 189557 278277 273050 183675 165678 25182 -21623 29857 -31629 -44678
$$ packed form
16910a27084J04148R1249N7633K1796p4098K9927n9156r4259o6978Q875n0460
16899a58407o6593J5651R2873k3n457k5918L5542m5113O6776N3936N8912l8067
16887a5888n3620K4392L5566j08516M9049N259j8748J00759M836j17314j30412
16876b24637J20670P8967L6552J13577J0591q0151J18096Q8515n6739p0806j35038
16865d03j04208j29353j67444L5222J90099N2809J05376O0256J5818J7713j10128
16854c4243J3790J1131N3183n0510l7374O8299R0907k7311k1415O8437l626J801
16842A33069j11052l5768M8197P9365m5199j70072j11941o70l2580R3862J29489
16831b3300N6545J56312Q8720n227q9375j7997j40496m6805N1480o1486j3049
$$ plain form
16820 -44678 58112 49516 32710 145333 201488 196420 145132 15458 36019 -1461 23698
16809 23698 2564 87113 116751 -71562 -139298 -91534 -166947 -161017 -84033 33639 -35119
16798 -35119 -48475 -46299 66185 192851 178403 185820 148293 50518 -53445 83122 146816
16787 146816 88911 71806 34283 -26710 -55666 -131537 -243181 -212199 -54543 -82000 -218576
16776 -218576 -264135 -203027 -143116 -26891 107133 102621 142916 141146 74695 57779 8695
16765 8695 -19188 -66312 -80992 -53214 -23485 -49766 -135063 -126032 -184077 -201405 -104199 -82116
16753 -82116 -2992 -71503 -126139 -140828 -83910 37242 94860 32924 1650 59600 -25853
16742 -25853 -27840 -64180 -90447 -47648 54118 -6788 -11588 -51753 1457 -25431 -6561 -13426
$$ packed form
16820d4678J02790q596j6806J12623N6155n068n1288j29674K0561l7480K5159
16809B3698k1134Q4549K9638j88313o7736M7764p5413N930P6984J17672o8758
16798c5119j3356K176J12484J26666j4448P417l7527r7775j03963J36567O3694
16787A46816n7905j7105l7523o0993k8956p5871j11644L0982J57656k7457j36576
16776b18576m5559O1108N9911J16225J34024m512M0295j770o6451j6916m9084
16765H695k7883m7124j4680K7778K9729k6281q5297R031n8045j7328R7206K2083
16753h2116P9124o8511n4636j4689N6918J21152N7618o1936l1274N7950q5453
16742b5853j987l6340k6267M2799J01766o0906m800m0165N3210k6888J8870o865
$$ plain form
16730 -13426 -14897 -89305 -76535 -190516 -167204 -175229 30056 51206 4855 -73416 -34725 -1537
16718 -1537 59263 6522 -27367 14055 3798 -18291 -19786 -50726 -48377 -45107 -180449 -247574
16706 -247574 -121048 -27420 11210 -78313 -93367 -79239 -47296 -36455 14019 50775 11608
16695 11608 17728 -23040 -78129 -134432 -64102 -120624 -169796 -31184 19244 65114 60800 30164
16683 30164 11835 -17856 22119 -48738 126762 39992 -113666 -171047 -167508 -171708 -191664 -218281
16671 -218281 -265937 -130382 -86922 -125739 -165135 -129606 -77791 -102492 -110456 -105347 -61658 -92121
16659 -92121 -90725 -49321 -118992 -141999 -149210 -158852 -219765 -112725 18898 117588 159327 129782
16647 129782 47704 45694 53765 67780 -1466 -88501 -26905 -6065 -8375 72259 143300 103428
$$ packed form
16730a3426j471p4408J2770j13981K3312q025K05285K1150m6351p8271L8691L3188
16718a537O0800n2741l3889M1422j0257k2089j495l0940K349L270j35342o7125
16706b47574J26526R3628L8630q9523j5054J4128L1943J0841N0474L6756l9167
16695A1608O120m0768n5089n6303P0330n6522m9172J38612N0428M5870m314l0636
16683C0164j8329k9691L9975p0857J75500q6770j53658n7381L539m200j9956k6617
16671b18281m7656J35555M3460l8817l9396L5529N1815k4701p964N109M3689l0463
16659i2121J396M1404o9671k3007p211r642o0913J07040J31623R8690M1739k9545
16647A29782q2078k010Q071J4015o9246q7035O1596K0840k310Q0634P1041l9872
$$ plain form
16635 103428 67040 57399 70051 33954 -29608 -59724 -68295 -48037 -28915 -8198 1900 19490
16623 19490 54016 70755 -24768 -22716 -10223 -14604 20669 -16661 -18960 -31842 -36522 23801
16611 23801 37425 60124 49079 93202 107361 162937 140378 263566 280514 105828 -18467
16600 -18467 -4890 -4957 -49472 -32731 178 -58220 -111076 -158437 -113743 -140459 -66043 -75917
16588 -75917 -94655 -52946 -29423 -181401 -273575 -120648 -108132 -93995 88954 92934 -51428
16577 -51428 -88028 -98759 -57973 10562 40101 42193 56018 -35165 -24843 -697 145814 82300
16565 82300 -36786 -14351 86612 217387 108441 34431 -40229 -121492 -167692 -82089 -72498
16554 -72498 -142621 -172892 -45077 87444 12630 -70356 -113030 -160528 -128610 -26398 -107389
$$ packed form
16635A03428l6388r641J2652l6097o3562l0116q571K0258J9122K0717J0098J7590
16623A9490L4526J6739r5523K052J2493m381L5273l7330k299j2882m680O0323
16611B3801J3624K2699j1045M4123J4159N5576k2559J23188J6948j74686j24295
16600a8467J3577o7m4515J6741L2909n8398n2856m7361M4694k6716P4416r874
16588g5917j8738M1709K3523j51978r2174J52927J2516J4137J82949L980j44362
16577e1428l6600j0731M0786O8535K9539K092J3825r1183J0322K4146J46511o3514
16565H2300j19086K2435J00963J30775j08946p4010p4660q1263m6200Q5603R591
16554g2498p0123l0271J27815J32521p4814q2986m2674m7498L1918J02212q0991
$$ plain form
16543 -107389 -113128 -43116 66805 136616 232232 282963 236289 136786 51774 -1138 -207523
16532 -207523 -377708 -361973 -244886 -125411 -110915 -163889 -41407 -31613 92889 18863 -16555
16521 -16555 -200 -9180 -50656 -26964 -7721 71198 -14966 -52145 -4272 -57828 -54713 -88972
16509 -88972 -121895 -146978 -17510 18466 -27323 27295 137429 188557 52625 -6962 21567
16498 21567 34372 -43599 -26551 -30922 -58314 -57564 -163426 -220706 -184899 -128439 -92031 4945
16486 4945 58152 -10719 -1538 26117 118094 175206 97339 26760 -38440 -56878 -17936 25201
16474 25201 171219 159963 104674 3570 -87582 -25032 -15943 35505 -313 -35664 99236
16463 99236 147729 -4802 -46018 -23487 -4572 36571 71061 68804 61852 27413 5269 5207
$$ packed form
16543a07389n739P0012J09921O9811R5616N0731m6674r9503q5012n2912k06385
16532b07523j70185J5735J17087J19475J4496n2974J22482R794J24502p4026l5418
16521a6555J6355q980m1476K3692J9243P8919q6164l7179M7873n3556L115l4259
16509h8972l2923k5083J29468L5976m5789N4618J10134N1128j35932n9587K8529
16498B1567J2805p7971J7048m371k7392P50j05862n7280L5807N6460L6408R6976
16486D945N3207o8871R181K7655R1977N7112p7867p0579o5200j8438L8942M3137
16474B5201J46018j1256n5289j01104r1152O2550R089N1448l5818l5351J34900
16463I9236M8493j52531m1216K2531J8915M1143L4490k257o952l4439k2144o2
$$ plain form
16451 5207 -16389 708 -54626 -34771 -10009 -66602 -133847 -63841 -87552 -95490 51839 55507
16439 55507 50296 32432 19641 -120214 -182172 -219799 -99764 33059 -47490 -64547 -165181
16428 -165181 -174729 -144345 -17649 79452 114212 42856 37507 9067 -7066 -60952 -157416 -134430
16416 -134430 -60480 -13739 -113825 -187953 -132729 66523 88017 46982 65045 73778 18487
16405 18487 -21944 7150 86109 184691 158904 20141 -32675 -14247 -77362 -77066 -156095 -151452
16393 -151452 -81904 -48372 72572 162686 238979 222287 132368 71368 83704 72743 6957
16382 6957 14573 4590 75709 63230 -101872 -199348 -259353 -196010 -269854 -333778 -213818 -117650
16370 -117650 -107297 -77056 -94130 -162194 -185651 -188904 -275979 -302032 -171546 -110357 -191352
$$ packed form
16451E207k1596J7097n5334J9855K4762n6593o7245P0006k3711p938J47329L668
16439E5507n211j7864j2791j39855o1958l7627J20035J32823q0549j7057j00634
16428a65181r548L0384J26696R7101L4760p1356n349k8440j6133n3886r6464K2986
16416a34430P3950M6741j00086p4128N5224J99252K1494m1035J8063Q733n5291
16405A8487m0431K9094P8959R8582k5787j38763n2816J8428o3115K96p9029M643
16393a51452O9548L3532J20944R0114P6293j6692q9919o1000J2336j0961o5786
16382F957P616r983P1119j2479j65102r7476o0005O3343p3844o3924J19960R6168
16370a17650J0353L0241j7074o8064k3457l253q7075k6053J30486O1189q0995
$$ plain form
16359 -191352 -172215 -84308 -40366 -28923 121542 177547 112443 -6527 -101489 -103445 -95893
16348 -95893 -94051 -114903 -14860 20296 8677 51881 76546 11058 -79921 -71264 -55629 -46875
16336 -46875 -140626 -142212 -155250 -223987 -148833 -97927 -118422 -156275 -252487 -200513 -127802 -271816
16324 -271816 -377819 -304353 -122263 -71241 -99714 -101038 -152514 -70347 14825 -31146 25872
16313 25872 87303 116597 205891 203209 155971 60387 -47841 -45430 4423 -35287 -29333 -128634
16301 -128634 -242209 -335761 -385704 -354608 -209651 -196795 -82020 4152 -58379 -71457 -33118
16290 -33118 84597 81334 12792 -126945 -37526 -42685 -40920 -194786 -199004 -129000 -188188 -137196
16278 -137196 -53219 29073 22194 107035 145423 56114 4047 -9394 21199 -59682 -56670 -82459
$$ packed form
16359a91352J9137Q7907M3942J1443J50465N6005o5104j18970r4962j956P552
16348i5893J842k0852J00043L5156j1619M3204K4665o5488r0979Q657J5635Q754
16336d6875r3751j586j3038o8737P5154N0906k0495l7853r6212N1974P2711j44014
16324b71816j06003P3466J82090N1022k8473j324n1476Q2167Q5172m5971N7018
16313B5872O1431K9294Q9294k682m7238r5584j08228K411M9853l9710N954r9301
16301a28634j13575r3552m9943L1096J44957J2856J14775Q6172o2531j3078L8339
16290c3118J17715l263o8542j39737Q9419n159J765j53866m218P0004n9188N0992
16278a37196Q3977Q2292o879Q4841L8388q9309n2067j3441L0593q0881L012k5789
$$ plain form
16266 -82459 51957 120530 31570 -65214 -109173 -57525 -36260 -95336 -50257 -106856 -182561
16255 -182561 -145578 -134741 -160001 -191469 -241722 -115684 -32356 -91974 -162008 -109685 -113579
16244 -113579 -87192 -58048 -67718 -32785 -42945 -47274 -148041 -270858 -349628 -299552 -173130
16233 -173130 -87332 -123834 -233828 -136168 -119927 -137739 -130439 -210047 -256721 -197440 -221573
16222 -221573 -160287 -77281 -94497 -139861 -144025 -190799 -177158 -151249 -223830 -79856 9241
16211 9241 -24417 -42411 -24134 -19186 25566 -48660 -137090 -93103 -8344 -53025 -103372 -117810
16199 -117810 -148874 -153571 -125144 -337877 -411840 -264617 -164962 -58076 -3865 24362 -6022
16188 -6022 -28 -40983 -61465 -1313 28047 -30179 -41014 -71497 -127375 -200710 -190886 -107969
$$ packed form
16266h2459J34416O8573q8960r6784m3959N1648K1265n9076M5079n6599p5705
16255a82561L6983J0837k5260l1468n0253J26038Q3328n9618p0034N2323l894
16244a13579K6387K9144r670L4933j0160m329j00767j22817p8770N0076J26422
16233a73130Q5798l6502j09994R7660J6241j7812P300p9608m6674N9281k4133
16222b21573O1286Q3006j7216m5364m164m6774J3641K5909p2581J43974Q9097
16211I241l3658j7994J8277M948M4752p4226q8430M3987Q4759m4681n0347j4438
16199a17810l1064m697K8427k12733p3963J47223R9655J06886N4211K8227l0384
16188f022N994m0955k0482O0152K9360n8226j0835l0483n5878p3335R824Q2917
$$ plain form
16176 -107969 -66279 44315 -3939 -172166 -118392 -3182 -42605 -34316 -46716 -150122 -148619
16165 -148619 -111777 -88370 -64855 5474 -290 98524 130699 28252 -64483 -162693 -209592
16154 -209592 -194143 -85463 -5169 34469 45801 17578 9052 26661 180760 202469 44793
16143 44793 -12323 -77184 -68700 -72602 -72452 -2861 85406 141710 167682 112650 -29637 -6738
16131 -6738 104633 90418 -49017 -160227 -107450 22208 107706 61767 77961 27592 46012
16120 46012 73644 -26353 -132793 -224830 -173951 -111208 -156811 -257550 -250814 -61007 10013
16109 10013 -30219 -102602 -83790 -92467 -107544 -57463 -42606 -71737 -135751 -190049 -66071 33723
16097 33723 11695 8150 -60792 -11201 -88441 -106323 -94068 -33419 -1809 68889 56284 36917
$$ packed form
16176a07969M1690J10594m8254j68227N3774J15210l9423Q289j2400j03406J503
16165a48619L6842K3407K3515P0329n764R8814L2175j02447r2735r8210m6899
16154b09592J5449J08680Q0294L9638J1332k8223q526J7609J54099K1709j57676
16143D4793n7116o4861Q484l902J50O9591Q8267N6304K5972n5032j42287K2899
16131f738J11371j4215j39435j11210N2777J29658Q5498m5939J6194n0369J8420
16120D6012K7632r9997j06440r2037N0879O2743m5603j00739O736J89807P1020
16109A0013m0232p2383J8812q677j5077N0081J4857k9131o4014n4298J23978R9794
16097C3723k2028l545o8942M9591p7240j7882J2255O0649L1610P0698j2605j9367
$$ plain form
16085 36917 -5696 10295 -7767 33312 7270 -96645 -3698 -72297 -149338 -167761 -154483
16074 -154483 -119504 -104533 -88724 -58195 -24983 7710 49929 67987 93787 121655 77838
16063 77838 -5737 -35691 60236 208464 197746 75077 -49541 -45312 -65555 -132023 -75376
16052 -75376 -17619 -41382 -62747 -134422 -102410 -5298 -538 -19226 81453 51572 11974 10334
16040 10334 -64957 -62649 72162 119796 47556 40538 -68757 -87951 -9062 27029 -62484 -100939
16028 -100939 -33648 -92818 -170468 -149875 -66845 -79037 -7791 41314 -61328 -68558 -51631
16017 -51631 58757 133668 48928 -74032 -121778 -114660 -28037 19118 71005 76525 -33167
16006 -33167 -60651 -93346 -5963 49812 77735 -79120 -101199 -62502 -699 -82691 -72578
$$ packed form
16085C6917m2613J5991j8062M1079k6042j03915R2947o8599p7041j8423J3278
16074a54483L4979J4971J5809L0529L3212L2693M2219J8058K5800K7868m3817
16063G7838q3575k9954R5927J48228j0718j22669j24618M229k0243o6468N6647
16052g5376N7757k3763k1365p1675L2012R7112M760j8688J00679k9881l9598j640
16040A0334p5291K308J34811M7634p2240p018j09295j9194P8889L6091q9513l8455
16028a00939O7291n9170p7650K0593Q3030j2192P1246M9105j02642p230J6927
16017e1631J10388P4911q4740j22960m7746P118Q6623M7155N1887N520j09692
16006c3167k7484l2695Q7383N5775K7923j56855k2079L8697O1803q1992J0113
$$ plain form
15995 -72578 -84218 -63597 -59344 -63084 -16436 -99262 -114259 -86638 -147799 -134092 -146972 -260944
15983 -260944 -261893 -199785 -192450 -138143 -48816 -7016 -25274 -67165 -145653 -67302 -6469 -12862
15971 -12862 -77006 -89826 -22050 50464 87320 11456 47451 4876 -136754 -185142 -262159
15960 -262159 -201628 -93794 -71313 -51547 -6428 26128 59345 45889 61560 163521 86823
15949 86823 -38185 -76828 -45672 23242 -33304 -41780 -12949 -101213 -162443 -172531 -190057 -187276
15937 -187276 -159515 -78109 109137 180743 118057 46277 6178 12152 -44064 -132067 12217
15926 12217 10480 80790 30500 -75431 -88904 44566 94535 137607 159533 141285 56918
15915 56918 35463 13963 47976 119088 56624 -47355 -62840 -95650 -119948 8722 143635
$$ packed form
15995g2578j1640K0621M253l740M6648q2826j4997K7621o1161J3707j2880j13972
15983b60944r49O2108P335N4307Q9327M1800j8258m1891p8488P8351O0833o393
15971a2862o4144j2820O7776P2514L6856p5864L5995m2575j41630m8388p7017
15960b62159O0531J07834K2481J9766M5119L2556L3217j3456J5671J01961p6698
15949H6823j25008l8643L1156O8914n6546q476K8831q8264o1230j0088j7526K781
15937a87276K7761Q1406J87246P1606o2686p1780m0099N974n6216q8003J44284
15926A2217j737P0310n0290j05931j3473J33470M9969M3072K1926j8248q4367
15915E6918k1455k1500L4013P1112o2464j03979j5485l2810k4298J28670J34913
$$ plain form
15904 143635 164365 4561 -155077 -305821 -316504 -257499 -129554 53918 136637 103944
15894 103944 32158 12017 -35644 20276 10746 19792 -6877 -73320 -95891 -67720 -107470 -151238
15882 -151238 -142196 -135334 -989 186423 190578 20858 -20325 66292 91831 10655 -59298
15871 -59298 -41725 -79783 -75220 -161823 -240980 -226763 -167241 -106681 -15133 -67576 17838 157560
15859 157560 62490 -61477 995 73772 116714 123374 154614 249670 203512 82045 77663
15848 77663 121898 114767 97975 83998 -59687 -57777 -91934 -136257 -204496 -144536 -63051 -78118
15836 -78118 -175977 -229028 -239276 -289690 -306368 -214250 -177928 -71133 -92949 -210116 -240084
15825 -240084 -129465 -77949 -3828 -102338 -113118 -92196 23275 6576 -119291 -211642 -190659
$$ packed form
15904A43635K0730j59804j59638j50744j0683N9005J27945J83472Q2719l2693
15894A03944p1786k0141m7661N5920r530R046k6669o6443k2571K8171l9750m3768
15882a51238R042O862J34345J87412M155j69720m1183Q6617K5539q1176o9953
15871e9298J7573l8058M563q6603p9157J4217N9522O0560R1548n2443Q5414J39722
15859A57560r5070j23967O2472P2777M2942O660L1240R5056m6158j21467m382
15848G7663M4235p131j6792j3977j43685J910l4157m4323o8239N9960Q1485j5067
15836g8118r7859n3051j0248n0414j6678R2118L6322J06795k1816j17167k9968
15825b40084J10619N1516P4121r8510j0780K0922J15471j6699j25867r2351K0983
$$ plain form
15814 -190659 -159785 -142429 -164837 -231250 -300096 -185777 -107095 -97681 -125108 -232911 -258315
15803 -258315 -240524 -243046 -83060 -11715 -15478 16780 60844 101173 118301 128345 91191 89894
15791 89894 16634 23789 42482 -37204 -104771 -125741 -105404 -21173 28079 10723 34355 1110
15779 1110 -27509 28062 43609 49596 34157 2264 115207 139910 176762 157651 -35371 -120647
15767 -120647 -133185 -104135 -70887 -122538 -166354 -84017 -83598 -28143 -20997 16304 33001 -94853
15755 -94853 -219865 -90594 103678 150450 54934 107486 149020 138620 38191 -7573 -9214
15744 -9214 -89832 -159559 -6883 91278 55052 29750 200 -98186 -66468 -155565 -135925 -132366
15732 -132366 -155222 -89788 -5481 50479 -50572 -220457 -316433 -226942 -298344 -376852 -353823
$$ packed form
15814a90659L0874J7356k2408o6413o8846J14319P8682R414k7427j07803k5404
15803b58315J7791k522J59986P1345l763L2258M4064M0329J7128J0044l7154j297
15791H9894p3260P155J8693p9686o7567k0970K0337Q4231M9252j7356K3632l3245
15779A110k8619N5571J5547N987j5439l1893J12943K4703L6852j9111j93022q5276
15767a20647j2538K9050L3248n1651m3816Q2337M19N5455P146L7301J6697j27854
15755i4853j25012J29271J94272M6772r5516N2552M1534j0400j00429m5764j641
15744i214q0618o9727J52676R8161l6226k5302k9550r8386L1718q9097J9640L559
15732a32366k2856O5434Q4307N5960j01051j69885r5976Q9491p1402p8508K3029
$$ plain form
15721 -353823 -182709 -144811 -226457 -74615 -66857 -114515 -166180 -219398 -194401 -171343 -189912
15710 -189912 -118254 -26216 65274 93258 89710 59631 9586 -79204 -12815 58426 114720 118726
15698 118726 2449 -59683 -28501 77664 35191 -2408 -46633 -67459 -68478 -38245 -86085
15687 -86085 22946 85122 -29794 -101965 -133684 -199092 -188508 -161446 -144777 -55991 -65331
15676 -65331 -98423 -38260 -13285 -118111 -200466 -235748 -268979 -83717 -94728 -45689 -63513
15665 -63513 -134495 -233912 -146375 -58567 -9245 -44161 -16078 33634 53738 32882 30745 -53363
15653 -53363 -39095 -63732 -61368 -19070 -32928 -17667 -22142 -66790 -34532 -14330 38063 -1774
15641 -1774 -34071 -105604 -157111 -214786 -127191 -28 -12972 -50695 -153237 -206117 -171193
$$ packed form
15721c53823J71114L7898q1646J51842P758m7658n1665n3218K4997K3058j8569
15710a89912P1658R2038R1490K7984l548l0079n0045q8790O6389P1241N6294M006
15698A18726j16277o2132L1182J06165m2473l7599m4225k0826j019L0233m7840
15687h6085J09031O2176j14916p2171l1719o5408J0584K7062J6669Q8786r340
15676f5331l3092O0163K4975j04826q2355l5282l3231J85262j1011M9039j7824
15665f3513p0982r9417Q7537Q7808M9322l4916K8083M9712K0104k0856k137q4108
15653e3363J4268k4637K364M2298j3858J5261m475m4648L2258K0202N2393l9837
15641a774l2297p1533n1507n7675Q7595J27163j2944l7723j02542n2880L4924
$$ plain form
15630 -171193 -171321 -116904 -104421 -188210 -183367 -51489 -61409 -94190 1423 111927 162253 134691
15618 134691 3460 -72096 26106 159700 145162 43611 12228 6893 -32794 23412 -47785
15607 -47785 -120886 -30008 35784 79387 81935 14202 35717 68499 -14798 9025 -126027 -193391
15595 -193391 -117525 -75808 -148942 -113353 -161337 -24620 -3948 -18769 -85063 -76894 -70657 -26009
15583 -26009 -26574 -199051 -261605 -128758 88328 60895 -25856 -135113 -127446 -17671 102472
15572 102472 78052 28853 -316 -89740 -3071 -14708 -50643 23874 131945 193343 126351
15561 126351 26619 29060 -49816 51947 72923 -108887 -140527 -48512 -61697 -97142 -47207
15550 -47207 62719 189780 212829 125887 78334 5 -195880 -216082 -251875 -197551 -109984
$$ packed form
15630a71193j28N4417J2483q3789M843J31878r920l2781R5613J10504N0326k7562
15618A34691j31231p5556R8202J33594j4538j01551l1383n335l9687N6206p1197
15607d7785p3101R0878O5792M3603K548o7733K1515L2782q3297K3823j35052o7364
15595a93391P5866M1717p3134L5589m7984J36717K0672j4821o6294Q169O237M4648
15583b6009n65j72477o2554J32847K17086k7433q6751j09257P667J09775J20143
15572A02472k4420m9199k9169q9424Q6669j1637l5935P4517J08071O1398o6992
15561A26351r9732K441p8876J01763K0976j81810l1640R2015j3185l5445M9935
15550d7207J09926J27061K3049q6942m7553p8329j95885k0202l5793N4324Q7567
$$ plain form
15539 -109984 -186098 -226750 -210630 -87860 -67623 -194336 -112428 -67256 -38960 1618 -140973
15528 -140973 -262461 -144800 -50621 -64343 -102856 -148597 -91416 -18163 -113947 -90560 14590
15517 14590 42645 59348 -32663 -237590 -278319 -89376 5022 -1752 -116319 -86205 -232128
15506 -232128 -280489 -289997 -240106 -252962 -211162 -146474 -132007 -38198 -53004 -65519 26923 82846
15494 82846 -8630 -31743 -12293 56490 115532 44228 21644 64070 99515 53729 15210 70489
15482 70489 71654 53476 9054 54086 123055 151757 197934 172170 -17846 -149123 -236174
15471 -236174 -262974 -215698 -202470 -62168 -4005 17917 -84461 -34048 -2947 -63906 -90081
15460 -90081 -37175 -46750 -109424 -147834 -172619 -179646 -71179 -86576 -149146 -233116 -240203 -143906
$$ packed form
15539a09984p6114m0652J6120J22770K0237j26713Q1908M5172K8296M0578j42591
15528a40973j21488J17661R4179j3722l8513m5741N7181P3253r5784K3387J05150
15517A4590K8055J6703r2011k04927m0729J88943R4398o774j14567L0114j45923
15506b32128m8361r508M9891j2856M1800O4688J4467R3809j4806j2515R2442N5923
15494H2846r1476k3113J9450O8783N9042p1304k2584M2426L5445m5786l8519N5279
15482G0489J165j8178m4422M5032O8969K8702M6177k5764j90016j31277q7051
15471b36174k6800M7276J3228J40302N8163K1922j02378N0413L1101o0959k6175
15460i0081N2906r575o2674l8410k4785p027J08467j5397o2570q3970p087R6297
$$ plain form
15448 -143906 -53484 -73980 -235389 -194950 -265626 -283569 -202465 -111110 -125297 -157089 -174278
15437 -174278 343 120956 127363 3596 -70897 -23383 52154 82730 61789 192430 208718
15426 208718 186026 77553 -72848 -99959 -146542 -146504 -104261 -16992 73463 166085 105056 33910
15414 33910 -185832 -279022 -173413 -56369 103397 96963 17229 -2015 -83568 -44213 -36609
15403 -36609 -82669 -181834 -238936 -248542 -177640 -64011 -95941 -86106 3681 17122 49657 12149
15391 12149 66052 -8081 35173 54263 159854 102384 -26976 -143904 -135290 -148191 -55190
15380 -55190 71738 85560 157402 91485 -129388 -82379 -68594 -224649 -249999 -183669 -56421
15369 -56421 -144043 -198180 -149517 -87420 -72356 -93075 -113148 -71731 -125521 -121089 -91160 -16767
$$ packed form
15448a43906R0422k0496j61409M0439p0676j7943Q1104R1355j4187l1792j7189
15437a74278J74621J20613O407j23767p4493M7514P5537L0576k0941J30641J6288
15426B08718k2692j08473j50401k7111m6583L8M2243Q7269R0455R2622o1029p1146
15414C3910k19742r3190J05609J17044J59766o434p9734j9244q1553L9355P604
15403c6609m6060r9165n7102r606P0902J13629l1930R835Q9787J3441L2535l7508
15391A2149N3903p4133M3254J9090J05591n7470j29360j16928Q614j2901R3001
15380e5190J26928J3822P1842o5917k20873M7009J3785j56055k5350O6330J27248
15369e6421q7622n4137M8663O2097J5064k0719k0073M1417n3790M432K9929P4393
$$ plain form
15357 -16767 -16260 26833 38419 81655 67615 55151 -22932 -65142 758 4230 -35372 114784
15345 114784 51174 -24692 53699 126349 85532 12937 2330 -34765 28195 87771 27091
15334 27091 -8843 -10535 -56982 42295 93728 72256 47702 30813 13166 110884 99777 150752
15322 150752 199360 188978 240233 180981 25046 -72399 14000 112346 77152 70276 -45745
15311 -45745 -52630 -35126 -29626 -43862 -37708 -211453 -274171 -280894 -157290 -13214 34503 15672
15299 15672 -82790 -25989 51727 12047 -104502 -29605 -22538 -108178 -141283 -77356 -8656 6798
15287 6798 -27034 70130 138894 55372 8550 47506 147383 176430 145110 120662 66627 82657
15275 82657 85 54502 118668 163483 59260 -50219 -54545 11727 31492 58798 68184 -55744
$$ packed form
15357a6767N07M3093J1586M3236j4040j2464p8083m2210O5900L472l9602J50156
15345A14784o3610p5866P8391P2650m0817p2595j0607l7095O2960N9576o0680
15334B7091l5934j692m6447R9277N1433k1472k4554j6889j7647R7718j1107N0975
15322A50752M8608j0382N1255n9252j55935r7445Q6399R8346l5194o876j16021
15311d5745o885J7504N500j4236O154j73745o2718o723J23604J44076M7717j8831
15299A5672r8462N6801P7716l9680j16549P4897P067q5640l3105O3927O8700J5454
15287F798l3832R7164O8764q3522m6822L8956R9877K9047l1320k4448n4035J6030
15275H2657q2572N4417O4166M4815j04223j09479m326O6272J9765K7306R386j23928
$$ plain form
15263 -55744 -150714 -147174 -96337 -129029 -178942 -114974 -125513 -156323 -204332 -148431 -44745 -8517
15251 -8517 87251 45522 -73852 -64736 -5400 -52596 -161003 -114648 -144168 -202330 -67279
15240 -67279 21855 -3117 -94835 -106880 -115814 -147045 -183686 -102137 62669 52811 23474 -81770
15228 -81770 -1648 115305 46127 34063 58768 55055 63310 -8366 -205435 -340476 -250355
15217 -250355 -124478 -59659 -7891 -29589 -15155 -30736 -31643 -52016 28664 17571 -91028
15206 -91028 -87207 33649 42807 -57175 -155663 -144631 -112594 -99893 3455 -44828 -157006
15195 -157006 -105437 -8704 -23485 -40162 -205024 -187223 -141173 -135390 -213452 -279359 -233483
15184 -233483 -188716 -71728 -97994 -131950 -156356 -155515 5467 52737 51671 13815 -42907 -124481
$$ packed form
15263e5744r4970L540N0837l2692m9913O3968j0539l0810m8009N5901J03686L6228
15251h517R5768m1729j19374R116N9336m7196j08407M6355k9520n8162J35051
15240f7279Q9134k4972r1718j2045q934l1231l6641Q1549J64806r858k9337j05244
15228h1770Q0122J16953o9178j2064K4705l713Q255p1676j97069j35041R0121
15217b50355J25877O4819N1768k1698J4434j5581r07k0373Q0680j1093j08599
15206i1028L821J20856R158r9982r8488J1032L2037J2701J03348m8283j12178
15195a57006N1569R6733j4781j6677j64862J7801M6050N783p8062o5907M5876
15184b33483M4767J16988k6266l3956k4406Q41J60982M7270j066l7856n6722q1574
$$ plain form
15172 -124481 -134747 -111070 -75907 -34315 -71808 -32721 -34965 -41329 -31436 52402 84516 61610
15160 61610 -13792 -56134 -22993 -44958 -79178 -80031 -33494 48004 52614 -28088 -164417 -205466
15148 -205466 -68040 -80244 -83255 -24302 -27030 15138 -20808 -15950 -36498 -56048 -94897 -47633
15136 -47633 53007 61423 184612 261083 136530 -10684 -69776 -80899 -49801 -79878 -62001
15125 -62001 -42986 -136801 -209118 -150179 -123343 -105792 -91769 -24200 -12955 -39520 -197663
15114 -197663 -250521 -46114 52146 98946 122107 92776 115211 -12582 -68003 -32653 -51573
15103 -51573 8691 -159049 -198558 -161568 -293956 -230673 -167648 -135343 -103964 -188038 -215752
15092 -215752 -121521 -166798 -48566 -115160 -166940 -256623 -286192 -147661 -66418 24461 88092
$$ packed form
15172a24481j0266K3677L5163M1592l7493L9087k244o364R893Q3838L2114k2906
15160F1610p5402m2342L3141k1965l4220q53M6537Q1498M610q0702j36329m1049
15148b05466J37426j2204l011N8953k728M2168l5946M858k0548j9550l8849M7264
15136d7633J00640Q416J23189P6471j24553j47214n9092j1123L1098l0077J7877
15125f2001J9015r3815p2317N8939K6836J7551J4023O7569J1245k6565j58143
15114a97663n2858K04407R8260M6800K3161k9331K2435j27793n5421L5350j8920
15103e1573O0264j67740l9509L6990j32388O3283O3025L2305L1379q4074k7714
15092b15752R4231m5277J18232o6594n1780q9683k9569J38531Q1243R0879O3631
$$ plain form
15081 88092 58858 172933 212283 160083 134626 174946 32930 61943 122914 33247 -32614
15070 -32614 -6664 63460 2207 76550 54353 42459 58965 -86360 -80767 11996 -15119 -21913
15058 -21913 101621 170527 182556 103849 -17198 -31225 110237 165941 117864 -7290 -106774
15047 -106774 -130160 -96326 -21539 140626 68428 -112168 6831 65397 37323 47969 199455
15036 199455 204837 114890 -65181 -178384 -209287 -107272 -152115 -128164 -148836 -201748 -120574
15025 -120574 -17716 36330 145200 198235 192657 57942 -5506 4582 82218 156884 166798
15014 166798 99948 79143 125534 115282 64153 -11963 7300 42638 55364 93336 55782
15003 55782 32936 -44059 -1839 34613 71551 190888 255952 254183 136295 178355 91806
$$ packed form
15081H8092k9234J14075L9350n2200k5457M0320j42016K9013O0971q9667o5861
15070c2614K5950P0124o1253P4343k2197j1894J6506j45325N593R2763k7115o794
15058b1913J23534O8906J2029p8707j21047j4027J41462N5704m8077j25154r9484
15047a06774k3386L3834P4787J62165p2198j80596J18999N8566k8074J0646J51486
15036A99455N382q9947j80071j13203l0903J02015m4843K3951k0672n2912Q1174
15025a20574J02858N4046J08870N3035n578j34715o3448J0088P7636P4666R914
15014A66798o6850k0805M6391j0252n1129p6116J9263L5338J2726L7972l7554
15003E5782k2846p6995M2220L6452L6938J19337O5064j769j17888M2060q6549
$$ plain form
14992 91806 15976 47797 26053 28358 -52318 -27662 -68879 -172576 -128730 -152915 -213304 -148996
14980 -148996 -27615 72961 103136 85139 18768 -36290 -29364 -63148 -94613 -208139 -318371
14969 -318371 -228130 -62836 46293 56426 4536 116706 126822 70502 -43167 -19965 52769
14958 52769 -9919 40959 -83167 -83032 -59084 -14084 44580 -15114 12206 -58295 -262118 -296791
14946 -296791 -312920 -226120 -93937 100618 101215 -14765 -44237 -143292 -178931 -189122 -222090
14935 -222090 -323326 -280815 -141319 -88951 -105647 26663 98791 15968 -3693 -33046 -97957
14924 -97957 -29490 8154 119170 223817 197300 181184 108085 -27020 -108566 -191768 -124518
14913 -124518 -65687 -65403 -17535 -76102 -110417 -65557 -58787 -48687 -131164 -95235 51845 138703
$$ packed form
14992I1806p5830L1821k1744K305q0676K4656m1217j03697M3846k4185o0389O4308
14980a48996J21381J00576L0175j7997o6371n5058O926l3784l1465j13526j10232
14969c18371R0241J65294J09129J0133n1890J12170J0116n6320j13669K3202P2734
14958E2769o2688N0878j24126J35K3948M5000N8664n9694K7320p0501k03823l4673
14946b96791j6129Q6800J32183J94555N97j15980k9472r9055l5639j0191l2968
14935b22090j01236M2511J39496N2368j6696J32310P2128q2823j9661k9353o4911
14924i7957O8467L7644J11016J04647k6517j6116p3099j35105q1546q3202O7250
14913a24518N8831K84M7868n8567l4315M4860O770J0100q2477L5929J47080Q6858
$$ plain form
14901 138703 148126 53565 -11230 -114557 -86223 -80578 -104884 -158284 -142919 -188854 -211331 -150361
14889 -150361 -133492 -233564 -213581 -163445 -160745 -73440 19369 -43932 -44811 9560 75331 23789
14877 23789 14168 -8302 18790 20992 -110555 -92912 -15477 -8702 -22385 55344 -27843 -104687
14865 -104687 -67164 -54029 -99948 30086 149004 -67206 -181727 -127052 -90593 -35258 40139
14854 40139 -20975 -157033 -241858 -204095 -67423 -59642 -48471 15579 -18128 -108626 -84689
14843 -84689 5756 -127662 -48071 -74732 -55227 -59066 39154 38526 16181 81032 87234 62962
14831 62962 10684 38294 -120805 -195877 -151203 -45268 -3219 13261 16013 27674 -19366
14820 -19366 -66614 -135989 -205619 -185505 -97742 -15808 86850 11281 -95679 -102288 -23535
$$ packed form
14901A38703R423r4561o4795j03327K8334N645k4306n3400J5365m5935k2477O0970
14889a50361J6869j00072J9983N0136K700Q7305R2809o3301q79N4371O5771n1542
14877B3789r621k2470K7092K202j31547J7643P7435O775j3683P7729q3187p6844
14865a04687L7523J3135m5919J30034J18918k16210j14521N4675L6459N5335P5397
14854D0139o1114j36058q4825L7763J36672P781J1171O4050l3707r0498K3937
14843h4689R0445j33418P9591k6661J9505l839R8220o28k2345O4851O202k4272
14831F2962n2278K7610j59099p5072M4674J05935M2049J6480K752J1661m7040
14820a9366m7248o9375o9630K0114Q7763Q1934J02658p5569j06960o609P8753
$$ plain form
14809 -23535 37132 70335 122099 96451 -9507 -39785 -34201 -29934 19460 -45077 -21772 35897
14797 35897 7911 52530 93584 89306 -19745 -63883 -56809 -159607 -245549 -277025 -138367
14786 -138367 -6793 87820 28349 -85131 -42039 -73009 -77899 35466 69454 -13969 -64631
14775 -64631 -34564 -99232 -90466 -142961 -107601 -142830 -178384 -220724 -182416 -199561 -242665 -265827
14763 -265827 -165768 -146014 -83824 -65421 -47391 -171480 -109615 -56200 -41883 3656 -69951
14752 -69951 -243343 -272742 -89481 41229 45108 45350 -21918 -57293 -22270 -31017 57833 69157
14740 69157 21268 84458 143168 115893 169740 240038 193941 124440 95398 121709 17851
14729 17851 -92922 -70768 -46897 48160 64954 -19243 -2096 69513 15248 -86792 -29672
$$ packed form
14809b3535O0667L3203N1764k5648j05958l0278N584M267M9394o4537K3305N7669
14797C5897k7986M4619M1054m278j09051m4138P074j02798q5942l1476J38658
14786a38367J31574R4613n9471j13480M3092l0970m890J13365L3988q3423n0662
14775f4631L0067o4668Q766n2495L5360l5229l5554m2340L8308j7145m3104k3162
14763b65827J00059J9754O2190J8403J8030j24089O1865N3415J4317M5539p3607
14752f9951j73392k9399J83261J30710L879K42o7268l5375L5023q747Q8850J1324
14740F9157m7889O3190N8710k7275N3847P0298m6097o9501k9042K6311j03858
14729A7851j10773K2154K3871R5057J6794q4197J7147P1609n4265j02040N7120
$$ plain form
14718 -29672 24020 -66710 -59265 -84909 -87872 -88164 13025 47399 74925 140749 49203 -42027
14706 -42027 37134 58341 29211 -77997 -46862 9180 -22012 -91944 -159728 -225497 -90335
14695 -90335 25368 -87054 -192876 -124978 -45014 -103050 -127644 38997 135371 14696 79455
14684 79455 92246 148675 38276 -76981 -86916 -82758 -54979 -136546 -109477 -39473 -38623 -232017
14672 -232017 -271054 -222067 -268812 -217818 -74973 54293 63160 109739 -1236 -44629 11986
14661 11986 103385 168119 30335 -50802 -49311 -61203 -52225 -17943 64592 66498 36833 30131
14649 30131 55615 48947 9452 -20490 56850 535 -45408 -86285 -133002 -109674 -52774 23169
14637 23169 47582 24 11112 5673 -6251 73500 38102 122615 73983 -23970 22162 6693
$$ packed form
14718b9672N3692r0730P445k5644k963k92J01189L4374K7526O5824r1546r1230
14706d2027P9161K1207k9130j07208L1135N6042l1192o9932o7784o5769J35162
14695i0335J15703j12422j05822O7898P9964n8036k4594J66641R6374j20675O4759
14684G9455J2791N6429j10399j15257r935M158K7779q1567K7069P0004Q50j93394
14672b32017l9037M8987m6745N0994J42845J29266Q867M6579j10975m3393N6615
14661A1986R1399O4734j37784q1137J491j1892Q978L4282Q2535J906k9665o702
14649C0131K5484o668l9495k9942P7340n6315m5943m0877m6717K3328N6900P5943
14637B3169K4413m7558J1088n439j1924P9751l5398Q4513m8632r7953M6132j5469
$$ plain form
14625 6693 -51197 -102819 -156366 -166250 -87985 -24625 -108100 -93333 -98575 -159353 -137476 -157769
14613 -157769 -205564 -83127 -18698 -61000 -135188 -184471 -251324 -175711 -135296 -127543 -127770 -92684
14601 -92684 -9346 -3913 -146483 -76644 101196 34797 2770 -95901 -6688 20947 -96523
14590 -96523 -48434 13614 -2719 40018 71409 93032 97813 882 -22156 39915 22822 6782
14578 6782 -1447 -23748 4888 85630 50744 106450 201415 85108 -102141 -113180 -60246 -103319
14566 -103319 -69352 -5972 -112720 -38256 -9726 36210 27331 -32883 -26506 -71437 -209105
14555 -209105 -306007 -300638 -208853 -61417 -123680 -178262 -143807 -84318 -33421 55718 -44790
14544 -44790 -249950 -204423 -68765 31556 -61061 -122825 -95291 -203610 -215229 -86489 -15363
$$ packed form
14625F693n7890n1622n3547r884P8265O3360q3475J4767n242o0778K1877k0293
14613a57769m7795J22437O4429m2302p4188m9283o6853P5613M0415P753k27L5086
14601i2684Q3338N433j42570O9839J77840o6399l2027r8671Q9213K7635j17470
14590i6523M8089O2048j6333M2737L1391K1623M781r6931k3038O2071j7093j6040
14578F782q229k2301K8636Q0742l4886N5706R4965j16307j87249j1039N2934m3073
14566a03319L3967O3380j06748P4464K8530M5936q879o0214O377m4931j37668
14555b09105r6902N369R1785J47436o2263n4582L4455N9489N0897Q9139j00508
14544d4790k05160M5527J35658J00321r2617o1764K7534j08319j1619J28740P1126
$$ plain form
14533 -15363 50163 108094 102164 69441 183764 163090 -52466 -145877 28209 113387 93920
14522 93920 32574 -19526 -86165 -58881 -81709 -150924 -100712 -88787 -148115 -50769 125774
14511 125774 115701 118389 44507 -26230 -120714 -15196 30941 -98784 -88876 -88607 -107882 -103999
14499 -103999 -29980 -74652 -65211 -146409 -60652 55190 5342 -39012 28302 60734 146089
14488 146089 207611 132968 5558 -11975 -32192 -42699 -56095 -222561 -131963 -47977 40014
14477 40014 127582 64202 29979 7888 6600 15109 90171 79888 97518 19808 3993 -26843
14465 -26843 48202 40434 -117721 -251584 -279607 -207632 -71017 -36235 -40351 -25412 31024
14454 31024 -63883 -68600 -3069 42309 96345 -20932 -115172 -85091 -41865 -189 4283 20932
$$ packed form
14533a5363O5526N7931n930l2723J14323k0674k15556r3411J74086Q5178j9467
14522I3920o1346n2100o6639K7284k2828o9215N0212J1925n9328R7346J76543
14511A25774j0073K688p3882p0737r4484J05518M6137j29725R908K69j9275L883
14499a03999P4019m4672R441q1198Q5757J15842m9848m4354O7314L2432Q5355
14488A46089O1522p4643j27410j7533k0217j0507j3396j66466R0598Q3986Q7991
14477D0014Q7568o3380l4223k2091j288Q509P5062j0283J7630p7710j5815l0836
14465b6843P5045p768j58155j33863k8023P1975J36615L4782m116J4939N6436
14454C1024r4907m717O5531M5378N4036j17277r4240L0081M3226M1676M472J6649
$$ plain form
14442 20932 13774 33127 13545 -2421 41840 -3301 -65835 -19862 -11285 -28233 17398 -43219
14430 -43219 -32937 24579 -65070 -36053 126442 257138 257932 172790 110637 104542 167365 147295
14418 147295 898 -95083 -104934 78163 111163 -23724 -21485 51743 58531 40461 40382 108635
14406 108635 190511 74168 29475 21041 -39469 46977 57918 -126413 -160718 -235135 -305639
14395 -305639 -192794 -181574 -183790 -83518 -9083 -44707 -119002 -234747 -247310 -111139 -73751
14384 -73751 -46475 73546 28901 -57698 -43777 -62506 -119971 -279698 -345911 -324218 -215096
14373 -215096 -139632 -219398 -336536 -301402 -167537 -74034 -12938 96279 3438 -136496 -146432
14362 -146432 -152124 -231707 -272426 -112273 -166528 -228140 -165140 -15467 1796 13643 24007
$$ packed form
14442B0932p158J9353j9582j5966M4261m5141o2534M5973Q577j6948M5631o0617
14430d3219J0282N7516q9649K9017J62495J30696P94q5142o2153o095O2823k0070
14418A47295j46397r5981r851J83097L3000j34887K239P3228O788j8070p9O8253
14406A08635Q1876j16343m4693q434o0510Q6446J0941j84331l4305p4417p0504
14395c05639J12845J1220k216J00272P4435l5624p4295j15745j2563J36171L7388
14384g3751K7276J20021m4645q6599J3921j8729n7465j59727o6213K1693J09122
14373b15096P5464p9766j17138L5134J33865R3503O1096J09217r2841j39934r936
14362a46432n692p9583m0719J60153n4255o1612O3000J49673J7263J1847J0364
$$ plain form
14351 24007 64910 92910 27918 -164496 -233168 -165202 -95722 7331 86028 23270 70578
14340 70578 104117 99394 140214 97115 114194 175258 30373 -43852 -77758 -89569 -125348 -98796
14328 -98796 -127291 -103413 -144800 -111941 68078 47537 -49389 -186647 -155276 -46300 49306
14317 49306 -38446 -190013 -197945 -145741 -110233 -93996 -157512 -168950 -116259 -178114 -52429
14306 -52429 11914 7400 59968 -48664 -91049 -52931 125487 268124 199799 58846 150570
14295 150570 148908 -11010 -109997 -72305 -90193 -132138 -117116 -39958 4811 -116400 -196105
14284 -196105 -263626 -223661 -97670 -83904 -130034 -79140 12877 -8426 -147805 -136600 -142423
14273 -142423 -201035 -149692 -132171 -253754 -306426 -275660 -103754 8262 -81772 -190436 -192980
$$ packed form
14351B4007M0903K8000o4992j92414o8672O7966O9480J03053P8697o2758M7308
14340G0578L3539m723M0820m3099J7079O1064j44885p4225l3906j1811l5779K6552
14328i8796k8495K3878m1387L2859J80019k0541r6926j37258L1371J08976R5606
14317D9306q7752j51567p932N2204L5508J6237o3516j1438N2691o1855J25685
14306e2429O4343m514N2568j08632m2385L8118J78418J42637o8325j40953R1724
14295A50570j662j59918r8987L7692j7888m1945J5022P7158M4769j21211p9705
14284a96105o7521L9965J25991J3766m6130N0894R2017k1303j39379J1205n823
14273a42423n8612N1343J7521j21583n2672L0766J71906J12016r0034j08664k544
$$ plain form
14262 -192980 -147814 -85409 12725 16825 4861 -99245 -152490 -89048 40278 61466 -27456
14251 -27456 -39425 48837 -21394 -56407 -192109 -307959 -238411 -169282 -192837 -186361 -137092
14240 -137092 -159616 -247984 -202241 -36805 12562 6899 79430 99237 -8136 -62455 63478
14229 63478 -20247 -96492 22207 8547 -36143 36425 89484 30195 52273 6664 21827
14218 21827 123574 201534 135798 -11974 -27470 -37484 -10462 -38648 -43877 10051 37558
14207 37558 -8689 -75616 -122711 -105654 -76369 -136643 -236338 -141258 -39625 -76366 -38282
14196 -38282 -89864 -46679 6579 4507 52776 62368 4012 23522 69692 79350 46700 -45847
14184 -45847 -104643 -46591 -27517 10585 53680 68675 61041 6863 -103738 -254741 -265311
$$ packed form
14262a92980M5166O2405R8134M100j1964j04106n3245O3442J29326K1188q8922
14251b7456j1969Q8262p0231l5013j35702j15850O9548O9129k3555O476M9269
14240a37092k2524q8368M5743J65436M9367n663P2531J9807j07373n4319J25933
14229F3478q3725p6245J18699j3660m4690P2568N3059n9289K2078m5609J5163
14218B1827J01747P7960o5736j47772j5496j0014K7022k8186n229N3928K7507
14207C7558m6247o6927m7095J7057K9285o0274r9695R5080J01633l6741L8084
14196c8282n1582M3185N3258k072M8269R592n8356J9510M6170R658l2650r2547
14184d5847n8796N8052J9074L8102M3095J4995p634n4178j10601j51003j0570
$$ plain form
14173 -265311 -296827 -217720 -107365 -53866 -13808 -120076 -179360 -124665 -185987 -154100 44766
14162 44766 160091 136901 61084 43393 2464 -58606 -93041 -39397 -50772 497 12811
14151 12811 50253 78111 56053 79466 82715 81331 138066 138120 40116 -91793 -36598 41856
14139 41856 72888 41729 -39288 64897 178072 143037 167783 52673 9327 31660 -259
14128 -259 -46318 17513 69572 80079 61671 23793 -57040 -27440 72283 131207 126137 -43551
14116 -43551 -100689 48274 10244 -35479 40672 102475 125406 37765 -31322 -59099 -68897 -7467
14104 -7467 24261 73310 102905 92034 7679 15418 -41449 -45409 -119990 -146001 -163340 -111450
14092 -111450 -53762 -66651 -34893 -135676 -168512 -160886 -209668 -169733 -95148 -84912 -89953 -127749
$$ packed form
14173b65311l1516P9107J10355N3499M0058j06268n9284N4695o1322L1887J98866
14162D4766J15325k3190p5817j7691m0929o1070l4435N3644j1375N1269J2314
14151A2811L7442K7858k2058K3413L249j384N6735N4r8004j31909N5195P8454
14139D1856L1032l1159q1017J04185J13175l5035K4746j15110m3346K2333l1919
14128b59m6059O3831N2059J0507j8408l7878q0833K9600R9723N8924n070j69688
14116d3551n7138J48963l8030m5723P6151O1803K2931q7641o9087k7777r798O1430
14104g467L1728M9049K9595j0871q4355P739n6867l960p4581k6011j7339N1890
14092a11450N7688j2889L1758j00783l2836P626m8782L9935P4585J0236n041l7796
$$ plain form
14080 -127749 -44172 53474 28070 64691 40415 106108 131640 -46861 -175044 -249555 -229631
14069 -229631 -273303 -142809 -34250 -826 16071 6075 -36324 -103771 -133571 -29039 18963
14058 18963 -120365 -99219 -62875 -16418 -60982 -41768 -7133 -30346 4491 -6207 -65719
14047 -65719 -23848 -57749 -24548 -21537 86730 133210 82987 2693 -104006 -104647 -76630 140863
14035 140863 42770 -50111 -34352 10708 -3781 -93543 -54379 -22121 -39689 -46137 -57165 -54760
14023 -54760 -73335 -71555 -94181 -272866 -301066 -259682 -260555 -274188 -173690 -24777 26218 72146
14011 72146 136700 93526 -25370 -89687 -100959 -78940 -48137 -11341 37092 -116694 -236084
14000 -236084 -216657 -183714 -194889 -166599 -168017 -153416 -170158 -112827 -57822 -66300 -120230 -114087
$$ packed form
14080a27749Q3577R7646k5404L6621k4276O5693K5532j78501j28183p4511J9924
14069b29631m3672J30494J08559L3424J6897r996m2399o7447k9800J04532M8002
14058A8963j39328K1146L6344M6457m4564J9214L4635k3213L4837j0698n9512
14047f5719M1871l3901L3201L011J08267M6480n0223q0294j06699o41K8017K17493
14035A40863r8093r2881J5759M5060j4489q9762L9164L2258j7568o448j1028K405
14023e4760j8575J780k2626j78685k8200M1384q73j3633J00498J48913N0995M5928
14011G2146O4554m3174j18896o4317j1272K2019L0803L6796M8433j53786j19390
14000b36084J9427L2943j1175K8290j418J4601j6742N7331N5005q478n3930O143
$$ plain form
13988 -114087 -186198 -131226 33707 43702 72089 -43893 -30892 37498 62837 108822 160772
13977 160772 38880 -23663 -118021 -143251 -141825 -46833 -6148 22039 -62748 -138426 -238326
13966 -238326 -234803 -293877 -384957 -237811 -106969 -186162 -206629 -172027 -19857 -51571 -7494
13955 -7494 30953 -43376 -87519 -137841 -112417 -57009 -2742 105233 73436 -17223 -116206 -164989
13943 -164989 -157911 -62144 -152471 -152873 -197070 -119630 -107875 -78611 -85512 -109087 -159824 -34708
13931 -34708 -110955 -134661 -114514 -55607 -49316 -53098 -80399 -120030 -60859 -61764 -10436 -39965
13919 -39965 -141533 -165222 -156507 -146849 -69384 -80986 -45773 -11481 -57660 -27162 -77184 -80083
13907 -80083 -31354 -44908 -127273 -120411 -112713 -132186 -113225 -73674 -25932 59987 131856 150830
$$ packed form
13988a14087p2111N4972J64933R995K8387j15982J3001O8390K5339M5985N1950
13977A60772j21892o2543r4358k5230J426R4992M0685K8187q4787p5678r9900
13966b38326L523n9074r1080J47146J30842p9193k0467L4602J52170l1714M4077
13955g494L8447p4329m4143n0322K5424N5408N4267J07975l1797r0659r8983m8783
13943a64989P078R5767r0327m02m4197P7440J1755K9264o901k3575n0737J25116
13931c4708p6247k3706K0147N8907O291l782k7301l9631N9171r05N1328k9529
13919c9965j01568k3689Q715R658P7465j1602L5213L4292m6179L0498n0022k899
13907h0083M8729j3554q2365O862P698j9473J8961L9551M7742Q5919P1869J8974
$$ plain form
13895 150830 22500 -85586 -145950 -57900 22204 58242 36344 -16274 -90178 -178825 -171008
13884 -171008 -51742 -3555 25016 37903 113188 64833 -82896 -146863 -55402 58586 55410
13873 55410 -13457 -98324 -181238 -251236 -213386 -84082 -12099 -93898 -92607 -126852 -26919 50156
13861 50156 -2736 -45738 -84471 18626 57644 -126776 -203283 -699 -36044 -67343 36655
13850 36655 -71094 -174645 -97795 -95608 -189354 -160903 -132000 19789 134412 93545 110599
13839 110599 106919 149496 55874 29743 -2450 -59869 -219861 -196552 -69541 -69704 -112430 -155573
13827 -155573 -150680 -127110 -119597 -78817 -241856 -303971 -229031 -228299 -136923 -57259 -35717 -39624
13815 -39624 -15130 7216 7267 -51314 -83003 -176615 -162915 -148586 -6411 150560 107794 -27515
$$ packed form
13895A50830j28330j08086o0364Q8050Q0104L6038k1898n2618p3904q8647P817
13884a71008J19266M8187K8571J2887P5285m8355j47729o3967R1461J13988l176
13873E5410o8867q4867q2914o9998L7850J29304P1983q1799J291l4245R9933P7075
13861E0156n2892m3002l8733J03097L9018j84420p6507K02584l5345l1299J03998
13850C6655j07749j03551P6850K187r3746K8451K8903J51789J14623m0867J7054
13839A10599l680M2577r3622k6131l2193n7419j59992K3309J27011j63m2726m3143
13827a55573M893K3570P513M0780j63039o2115P4940P32R1376P9664K1542l907
13815c9624K4494K2346N1n8581l1689r3612J3700J4329J42175J56971m2766j35309
$$ plain form
13803 -27515 -67211 -34753 -113218 -166273 -27359 24098 49075 49033 45927 67014 31577 14960
13791 14960 85431 111931 100566 31482 -64023 -101082 -18555 57374 130619 139888 125621 1485
13779 1485 -80392 -30409 -51680 -26079 10752 181966 241858 149011 113780 95403 1491 -118538
13767 -118538 -122394 -112305 -91242 -71383 -37506 -58345 -172453 -259296 -223877 -212622 -273351
13756 -273351 -264818 -332520 -234815 -76009 3508 76058 70786 6378 -25240 -19482 11725 -9777
13744 -9777 -2872 -104835 -85070 -68179 -59085 2202 88184 50796 -43427 -147507 -109263 -64402
13732 -64402 -85985 -23987 15354 23038 40418 8008 2624 -10639 -29348 -106569 -83538 -54527
13720 -54527 -46953 -57709 -51104 -991 150507 232038 140408 115431 185341 201048 191722 -31765
$$ packed form
13803b7515l9696L2458p8465n3055J38914N1457K4977m2l106K1087l5437j6617
13791A4960P0471K6500j1365o9084r5505l7059Q2527P5929P3245R269j4267j24136
13779A485q1877M9983k1271K5601L6831J71214N9892r2847l5231j8377r3912j20029
13767a18538l856J0089K1063J9859L3877k0839j14108q6843L5419J1255o0729
13756b73351Q533o7702R7705J58806P9517P2550n272o4408l1618N758L1207k1502
13744i777O905j01963J9765J6891R094O1287Q5982l7388r4223j04080L8244M4861
13732f4402k1583O1998L9341P684J7380l2410n384j3263j8709p7221K3031K9011
13720e4527P574j0756O605N0113J51498Q1531r1630k4977O9910J5707r326k23487
$$ plain form
13708 -31765 -182412 -123072 -212202 -251802 -250536 -172808 -82289 -121075 -181438 -199413 -236337 -123665
13696 -123665 -70918 -12805 -33002 134859 279059 280650 196721 15110 -54016 -67919 -44818
13685 -44818 -51384 -60178 9287 4647 -34026 -1903 -29918 -43948 -35811 105016 100710 12156
13673 12156 65161 -47401 -93781 -13401 12053 39646 48745 18868 61741 92753 168752 172356
13661 172356 209024 141782 121048 142235 211529 107393 54851 43626 69060 134552 -23635
13650 -23635 -52834 -46469 18851 80116 44305 32422 -56269 42168 140539 218996 230854 76661
13638 76661 -52642 -68184 5946 161394 144081 155172 150231 192856 206754 82191 7728
13627 7728 188356 137472 -54115 -94130 -91959 -12640 -4085 -56561 -74155 13972 134460 104043
$$ packed form
13708c1765j50647N9340q9130l9600J266P7728R0519l8786o0363j7975l6924J12672
13696a23665N2747N8113k0197J67861J44200J591q3929j81611o9126j3903K3101
13685d4818o566q794O9465m640l8673L2123k8015j4030Q137J40827m306q8554
13673A2156N3005j12562m6380Q0380K5454K7593R099k9877M2873L1012P5999L604
13661A72356L6668o7242k0734K1187O9294j04136n2542j1225K5434O5492j58187
13650b3635k9199O365O5320O1265l5811j1883q8691R8437R8371P8457J1858j54193
13638G6661j29303j5542P4130J55448j7313J1091m941M2625J3898j24563p4463
13627G728J80628n0884j91587m0015K171P9319Q555n2476j7594Q8127J20488l0417
$$ plain form
13615 104043 84489 134315 175539 83186 45733 14166 -85809 -59732 11347 48153 135649
13604 135649 109942 25233 129818 -352 -94170 -160652 -60373 23834 3887 76366 116027
13593 116027 116709 71877 104870 47766 -111288 -186359 -161964 26422 128869 48455 10168
13582 10168 3398 71355 -43082 -7541 68082 47061 32640 -3712 -56424 -15391 67037 83424
13570 83424 91448 223658 178014 56321 43923 73256 11582 -73814 -59672 -20902 97190
13559 97190 187967 182701 103785 49860 56715 -46605 -87671 72813 102357 108984 109864 -17999
13547 -17999 -107748 -44235 -49986 -107065 -136207 -119504 -45718 -29718 13937 89496 94795 -1036
13535 -1036 13653 26609 13358 66808 182537 213351 224209 277171 245748 190469 248137 314192
$$ packed form
13615A04043j9554M9826M1224r2353l7453l1567r9975K6077P1079L6806Q7496
13604A35649k5707q4709J04585j30170r3818o6482J00279Q4207j9947P2479L9661
13593A16027O82m4832L2993n7104j59054p5071K4395J88386J02447q0414l8287
13582A0168o770O7957j14437L5541P5623k1021j4421l6352n2712M1033Q2428J6387
13570H3424Q024J32210m5644j21693j2398K9333o1674q5396J4142L8770J18092
13559I7190R0777n266p8916n3925O855j03320m1066J60484K9544O627Q80j27863
13547a7999q9749O3513n751n7079k9142J6703P3786J6000M3655P5559N299r5831
13535a036J4689J2956j3251N3450J15729L0814J0858N2962l1423n5279N7668O6055
$$ plain form
13523 314192 318713 255785 82585 1051 2046 -22271 9807 108991 163571 197709 223642 206511
13511 206511 145162 158597 229071 116907 132625 75409 84011 30850 7944 -27899 -53495
13500 -53495 15544 -122416 -92801 -62736 2555 -35252 -122705 -185623 -78478 -3970 83309
13489 83309 153887 102798 93483 152218 104215 28894 -82889 41194 105813 117750 173315
13478 173315 207941 267547 174702 34431 -31148 -88014 -45392 167092 217454 209140 154355
13467 154355 77041 50447 168356 224976 164587 109117 -21731 -125685 -138553 -44811 30514
13456 30514 36954 -15760 34769 1851 -25812 81749 237344 251315 223848 180614 154841
13445 154841 116596 4338 -98082 -115972 -94690 -83525 -126860 -60502 7336 28734 -5370
$$ packed form
13523C14192M521o2928j73200q1534R95k4317L2078R9184N4580L4138K5933j7131
13511B06511o1349J3435P0474j12164J5718n7216Q602n3161k2906l5843k5596
13500e3495O9039j37960K9615L0065O5291l7807q7453o2918J07145P4508Q7279
13489H3309P0578n1089r315N8735m8003p5321j11783J24083O4619J1937N5565
13478A73315L4626N9606r2845j40271o5579n6866M2622K12484N0362q314n4785
13467A54355p7314k6594J17909N6620o0389n5470j30848j03954j2868R3742P5325
13456C0514O440n2714N0529l2918k7663J07561J55595J3971k7467m3234k5773
13445A54841l8245j12258j02420j7890K1282J1165m3335O6358O7838K1398l4104
$$ plain form
13434 -5370 -7210 -53866 -114633 -108194 -151810 -163024 -133057 -47537 -23474 45458 195444 282771
13422 282771 246860 242404 56527 -79440 32172 110663 202419 263359 251822 218986 108414
13411 108414 49710 -33518 -22035 57331 -4227 -61173 42752 66166 20223 53560 16001
13400 16001 37244 189023 257766 217230 200372 241466 255604 247829 173709 300123 323730
13389 323730 194750 119976 4329 -143067 1521 190359 160100 80071 -17665 -31935
13379 -31935 -85415 -2916 145190 238258 229512 81997 9461 17260 23233 67231 -71633 -115884
13367 -115884 -30564 68351 147325 126467 80181 16204 21726 56759 61400 25983 -10556 35183
13355 35183 -92 -8609 24818 -18021 30680 35968 145061 253640 134828 11281 -76001
$$ packed form
13434e370j840m6656o0767O439m3616j1214K9967Q5520K4063O8932J49986Q7327
13422B82771l5911m456j85877j35967J11612P8491R1756O0940j1537l2836j10572
13411A08414n8704q3228J1483P9366o1558n6946J03925K3414m5943L3337l7559
13400A6001K1243J51779O8743m0536j6858M1094J4138p775p4120J26414K3607
13389C23730j28980p4774j15647j47396J44588J88838l0259q0029r7736j4270
13379c1935n3480Q2499J48106R3068q746j47515p2536P799N973M3998j38864m4251
13367a15884Q5320R8915P8974k0858m6286o3977N522L5033M641l5417l6539M5739
13355C5183l5275q517L3427m2839M8701N288J09093J08579j18812j23547q7282
$$ plain form
13344 -76001 17222 32469 49909 -17575 -74916 8707 52315 122564 112636 29039 33002 -15616
13332 -15616 -107022 -136547 -148817 2730 -4877 -3295 88935 88205 46677 74628 104207 11100
13320 11100 -122641 -147943 -78363 -2594 27685 50240 96008 150094 150229 93560 152550 73487
13308 73487 87494 67697 45577 -53824 41948 14178 63402 101755 45136 8084 61292 -102035
13296 -102035 -166326 -15543 -7173 11956 78528 -28661 -101462 -90125 -43337 -63256 -84837
13285 -84837 111986 61567 -8434 52095 194381 174974 79793 99287 159465 240432 72525
13274 72525 -39509 15847 75621 -101534 -218806 -150655 -60963 -44276 -33663 1617 2600
13263 2600 -59152 -164114 -156695 -145724 -206606 -99873 49589 69552 156963 114885 39816
$$ packed form
13344g6001R3223J5247J7440o7484n7341Q3623M3608P0249r928q3597L963m8618
13332a5616r1406k9525j2270J51547p607J582R2230p30m1528K7951K9579r3107
13320A1100j33741k5302O9580P5769L0279K2555M5768N4086J35n6669N8990p9063
13308G3487J4007j9797k2120r9401R5772k7770M9224L8353n6619l7052N3208j63327
13296a02035o4291J50783Q370J9129O6572j07189p2801J1337M6788j9919k1581
13285h4837J96823n0419p0001O0529J42286j9407r5181J9494O0178Q0967j67907
13274G2525j12034N5356N9774j77155j17272O8151Q9692J6687J0613L5280R83
13263B600o1752j04962P419J0971o0882J06733J49462J9963Q7411m2078p5069
$$ plain form
13252 39816 -315 -177402 -252242 -135305 -34169 153082 116774 90893 44613 80443 5406
13241 5406 22093 117366 74515 53989 -43014 -150143 -184661 -178147 -211962 -214171 -72929 -1240
13229 -1240 16637 24168 -17970 -50036 -61491 -15937 50048 50745 -58462 -138321 -180973 -172118
13217 -172118 -217575 -148983 -47996 -13931 32153 -73670 -169958 -211621 -78174 -110765 -212015
13206 -212015 -213942 -213508 -29973 111142 89130 -7351 -25698 -1956 -11064 -38104 11723 64542
13194 64542 55228 187002 208190 78271 33854 75686 -11418 -43014 55011 54905 15895 27712
13182 27712 129187 242615 201605 159662 61333 66004 78301 7271 -37002 -47261 -22260
13171 -22260 67602 120547 116037 87341 107640 146243 266377 358570 252175 228365 245041
$$ packed form
13252C9816m0131j77087p4840J16937J01136J87251l6308k5881m6280L5830p5037
13241E406J6687R5273m2851k0526r7003j07129l4518O514l3815k209J41242P1689
13229a240J7877P531m2138l2066j1455M5554O5985O97j09207p9859m2652Q855
13217a72118m5457O8592J00987L4065M6084j05823r6288m1663J33447l2591j01250
13206b12015j927M34J83535J41115k2012r6481j8347K3742r108k7040M9827N2819
13194F4542r314J31774K1188j29919m4417M1832q7104l1596R8025j06l9010J1817
13182B7712J01475J13428m1010m1943r8329M671J2297p1030m4273j0259K5001
13171b2260Q9862N2945m510k8696K0299L8603J20134R2193j06395k3810J6676
$$ plain form
13160 245041 236883 108071 92951 184927 292047 372630 397452 553883 605820 589047 479823
13149 479823 391231 348441 336390 236859 157537 261492 283343 145443 125370 155227 120110
13138 120110 97011 33590 -14610 63834 102300 119197 80655 28840 -114665 -138032 -52911
13127 -52911 81904 142541 258212 279605 274328 303296 389739 351771 361427 449893 439113 445163
13115 445163 457241 450540 581156 718411 874771 927879 987256 1159231 1194742 1035524 900251
13104 900251 724912 652897 562276 516491 603189 644098 566078 386242 344969 300903 239420
13093 239420 240952 269772 208550 203142 158218 85367 142293 318361 436996 447483 319257
13082 319257 242881 225647 262704 321482 376107 511236 504700 391721 229139 274046 329636
$$ packed form
13160B45041q158j28812j5120R1976J07120Q0583K4822J56431N1937j6773j09224
13149D79823q8592m2790j2051r9531p9322J03955K1851j37900k0073K9857l5117
13138A20110k3099o3421m8200P8444L8466J6897l8542n1815j43505k3367Q5121
13127e2911J34815O0637J15671K1393n277K8968Q6443l7968R656Q8466j0780O050
13115D45163J2078o701J30616J37255J56360N3108N9377J71975L5511j59218j35273
13104I00251j75339p2015r0621m5785Q6698M0909p8020j79836m1273m4066o1483
13093B39420J532K8820o1222n408m4924p2851N6926J76068J18635J0487j28226
13082C19257p6376j7234L7057N8778N4625J35129o536j12979j62582M4907N5590
$$ plain form
13071 329636 464877 700189 750833 790382 840141 872249 960712 1063285 1137733 1243572 1227534
13060 1227534 1088757 805001 603229 405517 234419 260646 205161 215311 182064 156042
13050 156042 154039 130683 102431 103287 56419 66350 147650 219584 185517 155617 183747 137555
$$ packed form
13071C29636J35241K35312N0644L9549M9759L2108Q8463J02573P4448J05839j6038
13060A227534j38777k83756k01772j97712j71098K6227n5485J0150l3247k6022
13050A56042k003k3356k8252Q56m6868R931Q1300P1934l4067k9900K8130m6192
$$ [...]
##END NTUPLES=NMR SPECTRUM
##END=
