##TITLE=Analysis number 322442
Compound Code btb 01214
Book Reference a
Project Code adrs
Chemist Name stores
##JCAMPDX= 6.0         $$ Bruker NMR JCAMP-DX V2.0
##DATA TYPE= NMR SPECTRUM
##DATA CLASS= NTUPLES
##ORIGIN= Bruker BioSpin GmbH
##OWNER= nmr
$$ XWIN-NMR		Version 3.5
$$ Tue Sep 26 14:00:30 2006 GMT Daylight Time (UT+1h)  MAYBRIDGE\nmr@NMR_250MHZ
##.OBSERVE FREQUENCY= 250.131544655141
##.OBSERVE NUCLEUS= ^1H
##.ACQUISITION MODE= SIMULTANEOUS (DQD)
##.ACQUISITION SCHEME= undefined
##.AVERAGES= 16
##.DIGITISER RES= 18
##SPECTROMETER/DATA SYSTEM= dpx250
##.PULSE SEQUENCE= zg30
##.SOLVENT NAME= CDCl3
##.SHIFT REFERENCE= (INTERNAL, CDCl3, 0, 16.522)
##AUDIT TRAIL= $$ (NUMBER, WHEN, WHO, WHERE, WHAT)
$$ ##TITLE= Audit trail, XWIN-NMR		Version 3.5
$$ ##JCAMPDX= 5.01
$$ ##ORIGIN= Bruker BioSpin GmbH
$$ ##OWNER= nmr
$$ C:\u/data/dgb/nmr/ADRS/1390/pdata/1/auditp.txt
$$ ##AUDIT TRAIL=  $$ (NUMBER, WHEN, WHO, WHERE, WHAT)
(   1,<2006-09-26 13:59:48.94 +100>,<MAYBRIDGE\nmr>,<NMR_250MHZ>,
      <created by zg, POWCHK disabled, PULCHK disabled
       configuration hash MD5:
       E2 DF 36 D8 04 B2 41 60 5A D7 A3 38 5A 4B D0 FE
       data hash MD5: 64K
       A5 7E DD F7 46 0C A4 37 78 84 9E 60 D7 7F EE 97>)
(   2,<2006-09-26 14:00:06.87 +100>,<MAYBRIDGE\nmr>,<NMR_250MHZ>,
      <Start of raw data processing
       ef LB = 0.3 FT_mod = 6 PKNL = 1 SI = 32K 
       data hash MD5: 32K
       5A 8A 7C 58 4F 72 C9 E3 69 CF 6C 87 A0 F5 87 69>)
(   3,<2006-09-26 14:00:08.66 +100>,<MAYBRIDGE\nmr>,<NMR_250MHZ>,
      <apk 
       data hash MD5: 32K
       83 6A A7 DF 8B 58 76 D5 38 FB ED 48 14 B4 6A 0A>)
(   4,<2006-09-26 14:00:09.41 +100>,<MAYBRIDGE\nmr>,<NMR_250MHZ>,
      <abs ABSG = 5 
       data hash MD5: 32K
       91 62 5B 31 95 51 25 FF 01 42 4F 11 C1 72 F0 3C>)
$$ ##END=
$$ 
$$ hash MD5
$$ E0 C1 01 FC EF 44 B1 89 CC A2 42 36 EB 88 5D DE
##$RELAX= 
##$RELAX= 
##$RELAX= 
##$RELAX= 
##$RELAX= 
##$RELAX= 
##$RELAX= 
$$ Bruker specific parameters
$$ --------------------------
##$DU= <C:\u>
##$EXPNO= 1390
##$NAME= <ADRS>
##$PROCNO= 1
##$TYPE= <nmr>
##$USER= <dgb>
##$AMP= (0..31)
100 100 100 100 100 100 100 100 100 100 100 100 100 100 100 100 100 100 
100 100 100 100 100 100 100 100 100 100 100 100 100 100 
##$AQSEQ= 0
##$AQ_mod= 3
##$AUNM= <au_zg>
##$AUTOPOS= <37 >
##$BF1= 250.13
##$BF2= 250.13
##$BF3= 250.13
##$BF4= 250.13
##$BF5= 500.13
##$BF6= 500.13
##$BF7= 500.13
##$BF8= 500.13
##$BYTORDA= 1
##$CFDGTYP= 0
##$CFRGTYP= 5
##$CHEMSTR= <none>
##$CNST= (0..31)
1 1 145 1 1 1 1 1 1 1 1 1 1 1 1 1 1 1 1 1 1 1 1 1 1 1 1 1 1 1 1 1 
##$CPDPRG= <>
##$CPDPRG1= <>
##$CPDPRG2= <>
##$CPDPRG3= <>
##$CPDPRG4= <mlev>
##$CPDPRG5= <mlev>
##$CPDPRG6= <mlev>
##$CPDPRG7= <mlev>
##$CPDPRG8= <mlev>
##$CPDPRGB= <>
##$CPDPRGT= <>
##$D= (0..31)
0 1 0 0 0 0 0 0 0 0.06 0 0 0 0 0 0 0.0002 0 0 0 0 0 0 0 0 0 0 0 0 0 0 
0 
##$DATE= 1159275587
##$DBL= (0..7)
120 120 120 120 120 120 120 120 
##$DBP= (0..7)
150 150 150 150 150 150 150 150 
##$DBP07= 0
##$DBPNAM0= <>
##$DBPNAM1= <>
$$ [...]
##$SUBNAM7= <"">
##$SUBNAM8= <"">
##$SUBNAM9= <"">
##$SW= 20.6930455092707
##$SWIBOX= (0..15)
0 0 3 0 0 0 0 0 0 0 0 0 0 0 0 0 
##$SW_h= 5175.983436853
##$TD= 65536
##$TD0= 1
##$TE= 295.16
##$TE2= 300
##$TE3= 300
##$TEG= 300
##$TL= (0..7)
0 120 120 120 120 120 120 120 
##$TP= (0..7)
150 150 150 150 150 150 150 150 
##$TP07= 0
##$TPNAME0= <>
##$TPNAME1= <>
##$TPNAME2= <>
##$TPNAME3= <>
##$TPNAME4= <>
##$TPNAME5= <>
##$TPNAME6= <>
##$TPNAME7= <>
##$TPOAL= (0..7)
0.5 0.5 0.5 0.5 0.5 0.5 0.5 0.5 
##$TPOFFS= (0..7)
0 0 0 0 0 0 0 0 
##$TUNHIN= 0
##$TUNHOUT= 0
##$TUNXOUT= 0
##$USERA1= <user>
##$USERA2= <user>
##$USERA3= <user>
##$USERA4= <user>
##$USERA5= <user>
##$V9= 5
##$VALIST= <valist>
##$VCLIST= <CCCCCCCCCCCCCCC>
##$VD= 0
##$VDLIST= <DDDDDDDDDDDDDDD>
##$VPLIST= <PPPPPPPPPPPPPPP>
##$VTLIST= <TTTTTTTTTTTTTTT>
##$WBST= 1024
##$WBSW= 4
##$XGAIN= (0..3)
0 0 0 0 
##$XL= 0
##$YL= 0
##$YMAX_a= 398264
##$YMIN_a= -518304
##$ZGOPTNS= <>
##$ZL1= 120
##$ZL2= 120
##$ZL3= 120
##$ZL4= 120
##$ABSF1= 16.522
##$ABSF2= -4.171173
##$ABSG= 5
##$ABSL= 3
##$ALPHA= 0
##$AQORDER= 0
##$ASSFAC= 0
##$ASSFACI= 0
##$ASSFACX= 0
##$ASSWID= 0
##$AUNMP= <proc_1d>
##$AZFE= 0.1
##$AZFW= 0.1
##$BCFW= 0
##$BC_mod= 0
##$BYTORDP= 0
##$COROFFS= 0
##$CY= 12.5
##$DATMOD= 1
##$DC= 0
##$DFILT= <>
##$DTYPP= 0
##$F1P= 14.0000005364418
##$F2P= -0.99999901652339
##$FCOR= 0.5
##$FTSIZE= 32768
##$FT_mod= 6
##$GAMMA= 0
##$GB= 0
##$INTBC= 1
##$INTSCL= 1
##$ISEN= 128
##$LB= 0.3
##$LEV0= 0
##$LPBIN= 0
##$MAXI= 10000
##$MC2= 0
##$MEAN= 0
##$ME_mod= 0
##$MI= 0
##$NCOEF= 0
##$NC_proc= -5
##$NLEV= 6
##$NOISF1= 0
##$NOISF2= 0
##$NSP= 0
##$NTH_PI= 0
##$NZP= 0
##$OFFSET= 16.522
##$PC= 1
##$PHC0= 147.1184
##$PHC1= 6.885992
##$PH_mod= 1
##$PKNL= yes
##$PPARMOD= 0
##$PSCAL= 4
##$PSIGN= 0
##$REVERSE= no
##$SF= 250.13
##$SI= 32768
##$SIGF1= 0
##$SIGF2= 0
##$SINO= 400
##$SIOLD= 32768
##$SREGLST= <1H.CDCl3>
##$SSB= 0
##$STSI= 32768
##$STSR= 0
##$SW_p= 5175.98343685301
##$SYMM= 0
##$S_DEV= 0
##$TDeff= 65536
##$TDoff= 0
##$TI= <Analysis number 999999
Compound Code 99
Book Reference 9
Project Code 9>
##$TILT= no
##$TM1= 0
##$TM2= 0
##$TOPLEV= 0
##$USERP1= <user>
##$USERP2= <user>
##$USERP3= <user>
##$USERP4= <user>
##$USERP5= <user>
##$WDW= 1
##$XDIM= 32768
##$YMAX_p= 429066872
##$YMIN_p= -429368
$$ End of Bruker specific parameters
$$ ---------------------------------
##NTUPLES= NMR SPECTRUM
##VAR_NAME=  FREQUENCY,     SPECTRUM/REAL,   SPECTRUM/IMAG
##SYMBOL=    X,             R,               I
##VAR_TYPE=  INDEPENDENT,   DEPENDENT,       DEPENDENT
##VAR_FORM=  AFFN,          ASDF,            ASDF
##VAR_DIM=   32768,         32768,           32768
##UNITS=     HZ,            ARBITRARY UNITS, ARBITRARY UNITS
##FACTOR=    0.157963299565203, 1,           1
##FIRST=     4132.6476996994, 0,             0
##LAST=      -1043.33573715361, 0,           0
##MIN=       -1043.33573715361, -429368,     0
##MAX=       4132.6476996994, 429066872,     0
$$ Real data points
##PAGE= N=1
##DATA TABLE= (X++(R..R)), XYDATA
$$ [...]
17870D779226J39377J32542L12775L01091K68950L47057N15719M47502N32489
$$ 4779226 4918603 5051145 5363920 5665011 5933961 6281018 6796737 7244239 7776728
17861G776728N37356Q85252R55546R71207J305202J676812K091898K684549L631695
$$ 7776728 8314084 9199336 10154882 11126089 12431291 14108103 16200001 18884550 22516245
17852B2516245N030703P092564R640492J2606411J5370652J8189321K1363675
$$ 22516245 27546948 34639512 44280004 56886415 72257067 90446388 111810063
17845A11810063K2690737J9773818J3168973J0913744J1920080O488017n975472
$$ 111810063 134500800 154274618 167443591 178357335 190277415 196765432 190789960
17838A90789960j5957264j0797735m333786l384958p180135r493208o778145r74858
$$ 190789960 174832696 164034961 159701175 156316217 149136082 139642874 132864729 131889871
17830A31889871P74661n265749j3420970j1931227p273246n912153p397484o102744
$$ 131889871 132664532 127398783 113977813 102046586 94773340 88861187 81463703 75360959
17822G5360959j601705K653932O091944R002266J2038449J4021692J2346844Q536740
$$ 75360959 73759254 76413186 82505130 91507396 103545845 117567537 129914381 138451121
17814A38451121R077982J2110947J0262826J994771j225674M537651J0706052
$$ 138451121 147529103 159640050 169902876 171897647 170671973 175209624 185915676
17807A85915676J2192577P900862K227758K404112O077644M150498r350254k1685337
$$ 185915676 198108253 206009115 208236873 210640985 216718629 220869127 211518873 189833536
17799A89833536k1040188j7647901j7176777k0141819j8903698j4950897j0461363
$$ 189833536 168793348 151145447 133968670 113826851 94923153 79972256 69510893
17792F9510893o748542m184360k606561j699758j256125q65081l86020r4440l4515
$$ 69510893 62762351 58577991 55971430 54271672 53015547 52150466 51764446 51670006 51635491
17783E1635491l83628n24377l22767J62355J45945q3135l96967m03970k36030
$$ 51635491 51251863 50727486 50404719 50567074 50713019 50629884 50232917 49828947 49592917
17774D9592917l72548j148488j868429k150604j996694k008940k258511k447185
$$ 49592917 49220369 48071881 46203452 44052848 42056154 40047214 37788703 35341518
17766C5341518k297810k035107j703535j510436j414208j266498j022022q98890
$$ 35341518 33043708 31008601 29305066 27794630 26380422 25113924 24091902 23193012
17758B3193012r33984r30687q01729o79577p34207p21926o82522n54956m65918
$$ 23193012 22259028 21328341 20526612 19847035 19112828 18390902 17708380 17153424 16687506
17749A6687506n22870n47496l97193m52319n08420n49083l79145k78630l08267
$$ 16687506 16164636 15617140 15219947 14767628 14259208 13710125 13330980 13052350 12744083
17740A2744083l62192k80017l26117m25710m99771k26015l5845j20930l37059
$$ 12744083 12381891 12101874 11775757 11350047 10850276 10624261 10588416 10467486 10130427
17731A0130427l77987k26688j80691j28255k01505j51119j84517o1996j73519
$$ 10130427 9752440 9525752 9345061 9216806 9015301 8864182 8679665 8617669 8444150
17722H444150k55108k67368k59891k09962n8082Q9856o2706q7249j49733j50283
$$ 8444150 8189042 7921674 7661783 7451821 7393739 7483595 7420889 7333640 7183907 7033624
17712G033624n1776k03151k32824j28924o8757m5199j17556L756Q5816j05723
$$ 7033624 6981848 6778697 6545873 6416949 6348192 6302993 6185437 6189193 6275009 6169286
17702F169286k5557k2683o7969p3559O975j09539m2108l4452k057J10116o957
$$ 6169286 6143729 6121046 6053077 5979518 5986493 5876954 5834846 5800394 5798337 5908453 5901496
17691E901496q7412J8339K3014M5712R1806Q2037K47710K12220J97088J53325
$$ 5901496 5814084 5832423 5855437 5901149 5992955 6074992 6322702 6534922 6732010 6885335
17681F885335P8992L23320M39460L44798M77740N32053O21938Q19773J064741
$$ 6885335 6964327 7287647 7727107 8071905 8549645 9081698 9703636 10523409 11588150
17672A1588150J286313J569323J909698K008883J944664J769651J654974J341472
$$ 11588150 12874463 14443786 16353484 18362367 20307031 22076682 23731656 25073128
17664B5073128N31529K7387M48078J183517J756829L101369N413832Q117093J1020357
$$ 25073128 25604657 25632044 26080122 27263639 29020468 32121837 37535669 45652762 56673119
17655E6673119J4063891J7852586K1130625K1496781J8457304J5319959J3066486
$$ 56673119 70737010 88589596 109720221 131217002 149674306 164994265 178060751
17648A78060751O663332m455096j1966045j3310913j4205646j6211803j5741066
$$ 178060751 184724083 180268987 168302942 154992029 140786383 124574580 108833514
17641A08833514j1588176o967003l946224k433733j636006j108164j264750l060203
$$ 108833514 97245338 90278335 86332111 83898378 82262372 81154208 79889458 76829255
17633G6829255n477022n943695n256539m735737m210316k895930j435544m33963
$$ 76829255 71352233 65408538 60151999 55416262 51205946 48310016 46874472 46440509
17625D6440509N85812J010584J186388J414435J853115J741894J349399J452710
$$ 46440509 47026321 48036905 49223293 50637728 52490843 54232737 55582136 57034846
17617E7034846K030849K683031L341281M464109N989751O881977O390385N495943
$$ 57034846 59065695 61748726 65090007 69554116 75543867 82425844 88816229 94312172
17609I4312172M884012M093370J885041K43354J708497N111293Q733625J2395559
$$ 94312172 99196184 103289554 105174595 105417949 107126446 112237739 120971364 133366923
17601A33366923J6017419J9461556K2456042K1730149J4956550O838184J927324
$$ 133366923 149384342 168845898 191301940 213032089 227988639 234826823 236754147
17594B36754147m697568j6793929k6467309k6318613k3726872k2967587k0693077
$$ 236754147 232056579 215262650 188795341 162476728 138749856 115782269 95089192
17587I5089192j5404642r777075n687805k846884q85522L89403Q96336N61979
$$ 95089192 79684550 69907475 64219670 61372786 60487264 60876667 61773003 62334982
17579F2334982K43212J39508p27448j894817k237788j630506j374346j248510
$$ 62334982 62578194 62717702 61990254 60095437 57857649 56227143 54852797 53604287
17571E3604287o87565n3573J11984k7315l32430q80692j563774k323168k626726
$$ 53604287 52916722 52863149 52975133 52947818 52615388 51734696 50170922 47847754 45221028
17562D5221028k677956k808942k662036k453548k037166j783606j522872j214246
$$ 45221028 42543072 39734130 37072094 34618546 32581380 30797774 29274902 28060656
17554B8060656j161984j158555r03795q44696r31325p40564p39487q50240q81065
$$ 28060656 26898672 25740117 24836322 23991626 23060301 22319737 21580250 20730010 19848945
17545A9848945r64862p24697p26369n24701n91763o22461m61402o05802n62638
$$ 19848945 18884083 18159386 17433017 16908316 16316553 15694092 15232690 14626888 14064250
17536A4064250l87367m36754n20153l94657m44040l69932l36633k77601l84760
$$ 14064250 13676883 13240129 12719976 12325319 11881279 11511347 11174714 10897113 10512353
17527A0512353l25164j74250k99930l48701k84195k91461k99414j95903j70426
$$ 10512353 10187189 10012939 9713009 9364308 9080113 8788652 8489238 8293335 8122909
17518H122909k27371k74573j94756j82266k80339j44261j55927k20359j82664
$$ 8122909 7895538 7620965 7426209 7243943 6963604 6819343 6663416 6443057 6260393
17509F260393j76645p6671j42850j92965k06068j30666m9487j72949k60710j70466
$$ 6260393 6083748 6007077 5864227 5671262 5465194 5334528 5285041 5112092 4851382 4680916
17499D680916o0671J8689k156j91283j98442o8143r3106o4694j274k9896k15354
$$ 4680916 4620245 4638934 4636778 4445495 4247053 4178910 4085804 4021110 4019836 3989940 3774586
17488C774586k36880j27888j70776j7365m1468k15317j25682N4731M3270m9335
$$ 3774586 3537706 3409818 3239042 3221677 3180209 2964892 2839210 2893941 2937211 2887876
17478B887876j49863p0098p861J06569j37642j82822o3268O3657m3405j69010
$$ 2887876 2738013 2667915 2660054 2766623 2628981 2446159 2382891 2446548 2403143 2234133
17468B234133j06381m4648J1407o4558O7209L6340K6860n5693p8868n8923n6220
$$ 2234133 2127752 2083104 2094511 2029953 2097162 2133502 2160362 2104669 2025801 1966878 1910658
17457A910658j24647m5409l7180k4154l7564N0044K4731m2205r8101j03524L7765
$$ 1910658 1786011 1740602 1703422 1679268 1641704 1691748 1716479 1674274 1576173 1472649 1510414
17446A510414O9973k7144k9298K775R0213N8997R1135L5655m7931j4202j17584
$$ 1510414 1580387 1553243 1523945 1526720 1616933 1675930 1767065 1802720 1754789 1740587 1623003
17435A623003k09237P427o7853r6396p3282j30451j12435j3546l3237j11981N563
$$ 1623003 1413766 1421193 1353340 1256944 1183662 1053211 940776 927230 893993 782012 787575
17424G87575r0735Q754L731o111O5942j0435K7813m1195j4120o685o7174R8814
$$ 787575 696840 705594 709325 703214 769156 758721 786534 745339 731219 724534 657360 756174
17412G56174N1440J05347L6165L5704J27346r5247n0426M508j59269j6619l6073
$$ 756174 807614 912961 949126 984830 1112176 1016929 966503 971011 811742 795123 759050
17401G59050o3122M3145M038L503n7596J98553J11174o7880R928o2361j42989
$$ 759050 695928 739073 743111 746614 689018 887571 998745 930865 940793 878432 735443
17390G35443n9364q7282Q0910R1034P9405m8965j66143M8336Q2664j14187j18291
$$ 735443 676079 588797 669707 760741 840146 791181 625038 673374 756038 641851 523560
17379E23560Q5807J54180q6466j5563m4083L0501O3433J973j3241o5588k04672
$$ 523560 609367 763547 677081 661518 617435 647936 711369 713342 700101 634513 429841
17368D29841O1194J14995Q7875L0132J8817j9034p309n3931p6652k1513l8763
$$ 429841 491035 606030 693905 724037 742854 723820 716511 662580 585928 564415 525652
17357E25652j8227L3390J20918l1637l7605Q2669N6024n2251M699j7573q8598
$$ 525652 507425 540815 661733 630096 592491 675160 731184 678933 683632 666059 577461
17346E77461O1575J60665m4931q0199L156O3558O0921l796J76169J16174m9378
$$ 577461 639036 799701 754770 674571 677727 741285 802206 798410 974579 1090753 1041375
17335A041375r5729O1610J25124L7834J15575q0308l8768R5598P829K7707O894
$$ 1041375 945646 1007256 1132380 1170214 1285789 1205481 1166713 1262311 1270140 1297847 1304741
17324A304741O8436M5280O577r4664j9759q3211n6381p750N8805j08972o3797
$$ 1304741 1373177 1418457 1425034 1330370 1310611 1227400 1171019 1163269 1222074 1113102 1049305
17313A049305N3033J2547r5493j17779N3970J53593J9893j35178l3064J68046
$$ 1049305 1102338 1114885 1019392 901613 955583 1109176 1129069 993891 960827 1128873
17303A128873J49190K9323P4576J47693q425j7969M7571R116k443j12247q9382
$$ 1128873 1278063 1307386 1381962 1529655 1521230 1503261 1550832 1559948 1557505 1445258 1355876
17292A355876o4480M7752K9271k2044j17266Q2107Q293l4862K2246N2975n8567
$$ 1355876 1291396 1339148 1368419 1346375 1229109 1311216 1319509 1284647 1306893 1359868 1301301
17281A301301p363N439n568O0778k3136N79O568j8682j7248j34836j42296k2971
$$ 1301301 1293938 1299377 1293809 1354587 1331451 1332030 1338598 1319916 1302668 1167832 1025536 1002565
17269A002565R1525L5566J3569J00272k07390j00138J3921J4345K23498K3580
$$ 1002565 1094090 1129656 1143225 1243497 1036107 935969 949890 964235 1187733 1211313
17259A211313N0386K6305k1791r9761r1559j512J01111p3824L6797o4604n6333
$$ 1211313 1261699 1288004 1266213 1166452 1074893 1073381 1174492 1100668 1137465 1072861 1016528
17248A016528k0776L1174L2444J69842N7985m3526l2393Q2106p7199j31055J2835
$$ 1016528 995752 1026926 1059370 1229212 1287197 1243671 1211278 1293384 1216185 1085130 1097965
17237A097965O7621L939L2466j6545M7668J49115K4666j50358O2450N9021M133
$$ 1097965 1165586 1169525 1201991 1185446 1233114 1382229 1406895 1256537 1318987 1378008 1382141
17226A382141j7027K22529J11967J4130R926j0106n4770J08792K2537j01143n9518
$$ 1382141 1365114 1587643 1699610 1713740 1723666 1713560 1658790 1767582 1790119 1688976 1629458
17215A629458p6109o0046R7441P8432n4644Q7618J0352O32k9838M4874M1866O5889
$$ 1629458 1553349 1493303 1590744 1669176 1614532 1702150 1712502 1713134 1683296 1728170 1770036 1835925
17203A835925o9367q8938J58527L6565M1190O4381N9456O724r075J00463J64492
$$ 1835925 1766558 1677620 1836147 1872712 1913902 1978283 2037739 2044463 2035388 2135851 2300343
17192B300343K70539J38164O7604M2217J1178M6253J51764J93239L9935J50862
$$ 2300343 2570882 2709046 2776650 2818867 2830045 2876298 3028062 3221301 3261236 3412098
17182C412098J28822J98780L85496M85822L66146M17406N27094R19411R01325
$$ 3412098 3540920 3739700 4125196 4611018 4977164 5394570 5921664 6841075 7742400
17173G742400J047982J418946J814814K327620K985294L562625L830661L876220
$$ 7742400 8790382 10209328 12024142 14351762 17337056 20899681 24730342 28606562
17165B8606562L357261J991937j28270j936046k193709j211482N36151K708721
$$ 28606562 31963823 33955760 33827490 31891444 29697735 28486253 29022404 31731125
17157C1731125M893780P784895J2017188J7663906K4219235L0570899L5295509
$$ 31731125 36624905 44409800 56426988 74090894 98310129 128881028 164176537
17150A64176537L7674125L5940817K5831183O886185j6377671l1711500l6113035
$$ 164176537 201850662 237791479 263622662 270508847 254131176 222419676 186306641
17143A86306641l2613157k6862478k0278545j3145606o278434p55765K904796
$$ 186306641 153693484 126831006 106552461 93406855 87128421 86372656 89277452
17136H9277452M794059M477767J508444l743327q807987j1114665j0279883p641244
$$ 89277452 94071511 98549278 100057722 96314395 87506408 76391743 66111860 58470616
17128E8470616n021800l024741j330961L7102J061045J940249K586338L049491
$$ 58470616 53448816 50424075 49093114 49130216 50191261 52131510 54717848 57767339
17120E7767339K689630J737250N86503k56075k81549L68030J344620K744932M333866
$$ 57767339 60456969 62194219 62780722 62524647 62243098 62611128 63955748 66700680 71034546
17111G1034546O128563P562730Q233765P463634M644582L64586l828663m575142
$$ 71034546 77163109 84725839 92959604 100423238 105067820 105432406 101603743 97028601
17103I7028601j804393L332475R377346J5518967K0913871K3828678K3423040
$$ 97028601 95224208 98556683 107934029 123452996 144366867 168195545 191618585
17096A91618585J9706792J3613578M211353j0033308k5375836l5728965l4804534
$$ 191618585 211325377 224938955 229150308 219117000 193741164 158012199 123207665
17089A23207665k7593929j8728367j2109098p870528m931594k861548j266674
$$ 123207665 95613736 76885369 64776271 56905743 51974149 49112601 47845927
17082D7845927J66031J087693J869945K192448J789822N02894j124980k428357
$$ 47845927 48011958 49099651 50969596 53162044 54951866 55454760 54329780 51901423
17074E1901423k841118k563384j583057n70908J03079M77296M37779L75053J45801
$$ 51901423 49060305 46496921 44913864 44342956 44446035 44923331 45361110 45736163 45881964
17065D5881964p21829j769679k813220l076403k905056k533677j993291j757427
$$ 45881964 45160135 43390456 40577236 37500833 34595777 32062100 30068809 28311382
17057B8311382j615819j308972j159236j079263r97301p88619o58007o48463n73149
$$ 28311382 26695563 25386591 24227355 23148092 22150791 21362172 20704165 20055702 19482553
17048A9482553o31301p12372p46986o42138o83258o26947n66337m83241n27762
$$ 19482553 18851252 18138880 17391894 16749756 16066498 15439551 14873214 14389973 13862211
17039A3862211n23425m07972m46960l25545l03212l56749m21039m35390l52283
$$ 13862211 13338786 12930814 12483854 12158309 11855097 11498348 11077309 10641919 10289636
17030A0289636k95238m71147k91910j49444j73471k45426k24687j90850j13623
$$ 10289636 9994398 9523251 9231341 9081897 8908426 8663000 8438313 8247463 8133840
17021H133840k69212m11581k42284j08506j69141k18209k64431l49823k53633
$$ 8133840 7864628 7453047 7210763 7102257 6933116 6714907 6450476 6100653 5847020
17012E847020p973p5562j76610j84713j42226J7265n6032k05845j05714j29444
$$ 5847020 5839047 5763485 5586875 5402162 5259936 5277201 5221169 5015324 4909610 4780166
17002D780166j47962j84476j49651j53522r0896o5003j31667j82888j10210j6744
$$ 4780166 4632204 4447728 4298077 4144555 4053659 3988656 3856989 3674101 3563891 3547147
16992C547147o5628l0846r7053j71931k02345J00101Q874j2335p9152j09834l4607
$$ 3547147 3481519 3450673 3353620 3181689 2979344 3079445 3088319 3075984 2996832 2886998 2852391
16981B852391p3330P4074j15183j63595j50447j43040q837N5543j49066j09817
$$ 2852391 2779061 2853135 2737952 2574357 2423910 2280870 2272033 2327576 2178510 2068693
16971B068693P8144J3262p8860r5762j25356R5033J17827m7802j309l7831j39611
$$ 2068693 2146837 2160099 2081239 1985477 1860121 1955154 2072981 2025179 2023870 1986039 1846428
16960A846428k09439l0657N5844L0729L1717j67276j58751j3776j12748n6196
$$ 1846428 1636989 1606332 1662176 1692905 1724622 1557346 1398595 1384819 1272071 1215875
16950A215875J05116P6956j21806r6043n5459J5404k2917o6486P3309M2334r5099
$$ 1215875 1320991 1397947 1276141 1180098 1124639 1140043 1117126 1050640 1123949 1166283 1071184
16939A071184P6320j1888n4872k3754j62022l6114p0777j45909m9020J2712Q292
$$ 1071184 1147504 1135616 1080744 1056990 894968 858854 788077 642168 593148 605860 614152
16928F14152q578o8907p3511J6323Q4280R9579O5038r0993j49656r9260r8291
$$ 614152 605574 536667 463156 479479 563759 663338 728376 637383 487727 388467 290176
16917B90176M9897J62664o8610L7956P6900M9594L58l9492j12921j06287J3779
$$ 290176 340073 502737 434127 472083 548983 598577 598935 559443 446522 340235 354014
16906C54014L9787R0080J09955K359j00921j04380M047o8541q4496P3069M3001
$$ 354014 393801 483881 593836 596195 495274 390894 394941 326400 241904 314973 357974
16895C57974k0155j07966j25932O5393L1147p5716O3038k4962k7227P1183J1749
$$ 357974 337819 229853 103921 169314 200461 124745 187783 162821 135594 206777 218526
16884B18526Q3284M6509M5005r2199O9592m7784o1944o862R4868M3985k5725l410
$$ 218526 301810 348319 393324 301125 370717 322933 260989 254127 348995 392980 367255 363845
16872C63845J24202o1346j03040q905k9434J82711J00724l8634j79419j07831
$$ 363845 488047 426701 323661 314756 285322 468033 568757 530123 350704 242873
16862B42873n26j0108N5255Q2674J5797m7220l4695r0213k4417P2483J01807R8689
$$ 242873 242347 232239 287494 370168 385965 338745 304050 213837 189420 261903 363710 462399
16850D62399o4962p763n0470P9560O4655l6477j17831j35408q8848J11949J13813
$$ 462399 397437 389674 339204 418764 483419 446942 329111 193703 104855 216804 330617
16839C30617J9377q7199j43427M5163M7656l7227l3888o8911m5408l3297J9245
$$ 330617 349994 262795 119368 164531 212187 174960 141072 72161 26753 -6544 12701
16828A2701J04279Q2775l4879o7049m5923J80879P5540n0796O48J6519n1831l962
$$ 12701 116980 199755 164876 97827 51904 232783 308323 257527 258175 274694 222863 218901
16816B18901k2168N7903O2527M5312l9870K0302r6620k33271j39756Q0524J72817
$$ 218901 196733 254636 317163 362475 322605 342907 246287 13016 -126740 -46216 126601
16805A26601M9443P140O8883O9411p6769n3184j31878j3581N738r6111o9435O5252
$$ 126601 176044 183184 252067 321478 244709 191525 59647 46066 51804 -44307 -113742 -48490
16793d8490J07525K13756J08923J6949j37045q3097o4491j5734O8555q3826p6442
$$ -48490 59035 272791 381714 398663 261618 178521 114030 98296 166851 83025 6583
16782F583L4556j0163M0732K05297p1863j27827O135j01717q7875J46854N3539
$$ 6583 41139 30976 71708 277005 205142 77315 83450 -18267 -106142 40712 94251
16771I4251N4113K1506q5933j08955r722j8363O603J73163Q3088m1503M025q6761
$$ 94251 148364 169870 83937 -25018 -34740 -53103 -46500 126663 209751 168248 172273 85512
16759H5512j53091l6138K2458o592j2932M3602m4684o177J15109k0335j29206
$$ 85512 -67579 -103717 -81259 -87851 -100783 -57181 -101865 -108042 7067 -13268 -142474
16748a42474N6625J51788n6410k519J23955r971k5705m2567p6845o3705m0474
$$ -142474 -85849 65939 9529 7010 130965 120994 95289 52722 -24123 -87828 -128302
16737a28302M482N6746k2657K1996k5750l7408P8020J31835J8840P452k9578q7786
$$ -128302 -123820 -67074 -89731 -67735 -93485 -130893 -52873 78962 97802 105254 75676 -12110
16725a2110p6663L6090J84990N5545K8289J6834l4689j03043p8528O5137k7322
$$ -12110 -88773 -52683 132307 187852 216141 232975 198286 95243 16715 81852 54530
16714E4530l5884n5460o2619J13322N5944p9473O4123J35341Q2167R4296n9759
$$ 54530 18646 -36814 -99433 13889 69833 -9640 54483 189824 271991 366287 306528
16703C06528j91824k38047J7471K9370J05311Q0767q9613J3332K30801N8232j69452
$$ 306528 114704 -123343 -105872 -76502 28809 109576 19963 33295 264096 322328 152876
16692A52876n8407M6097j6000j95711O931J23225J0869o292j12488j7307Q2346
$$ 152876 94469 140566 124566 -71145 -64214 59011 69880 63588 -48900 -66207 16139
16681A6139m780q5870N304O5914K6303k2330R8986N9776n0738Q5299N9406Q661
$$ 16139 11359 -74511 -69207 -3293 23010 680 99666 159442 108704 194003 253409 262070
16669B62070o3343k7364K4141R6116Q7457O5999M5967J39642l0906R6963J36985
$$ 262070 198727 171363 195504 291620 379077 445076 491043 630685 599779 696742 833727
16658H33727J0122k06686j38959j5666N4909Q2854M7165j05489m4786M6482J47660
$$ 833727 843849 637163 498204 482538 537447 620301 667466 561977 517191 563673 711333
16647G11333J02768M23P7370P7952l2987j29311k29096j25382q8801p1512M2359
$$ 711333 814101 814524 891894 969846 936859 807548 578452 453070 364269 292757 335116
16636C35116M2840J719O5351N4737n8459j18585q4062p853R4277J4325j23388
$$ 335116 377956 379675 445026 499763 441304 322719 238657 230804 325081 339406 216018
16625B16018r0508O2105L6981Q7646N9150k3115m3477o1128l6670N2532J35617
$$ 216018 125510 187615 224596 312242 371392 348277 304800 243672 207002 259534 395151
16614C95151n2595K0122M3915O1694J19582O8395l5313p2466L3230Q5877j6155
$$ 395151 342556 362678 406593 468287 587869 656264 620951 548485 581715 667592 651437
16603F51437j33497o6590r6951P0363O8937j9167j05108N9759J28477J2904o6730
$$ 651437 517940 451350 354399 424762 493699 474532 369424 429183 557660 570564 503834
16592E03834M839L8369J22427N4250Q987k8069p4752p6468p7249m1306j18318
$$ 503834 508673 547042 669469 723719 732706 704637 629885 553417 476168 434862 316544
16581C16544j10464n2231J54157r128n841o9466q6763L4944q7636k9805j4053
$$ 316544 206080 153849 308006 298878 293037 223571 136808 171752 84116 54311 40258
16570D0258l5791n0457K3899P0039l2055O9951J60795J89843j4159p0772o1552
$$ 40258 4467 -45990 -22091 47948 15893 85844 246639 436482 422323 351551 289999
16559B89999j70677m8414O3636o5210q2613l0912Q4729J51938k5862l6358k0127
$$ 289999 119322 70908 134544 69334 -13279 -44191 40538 192476 166614 130256 110129
16548A10129P4038O5509p2878j58263p1219J20728K00242M645j22043j53931P73
$$ 110129 184167 249676 176798 18535 -52684 68044 268286 272931 150888 -3043 -2270
16537b270J9272j73147q3369N4264N5564m217J7557K8512j345n8330N5194R0836
$$ -2270 17002 -156145 -239514 -185250 -129686 -133903 -116346 -87834 -89179 -147509 -92315 -1479
16525a479K3749o2850l3939o856q7466k0607J3726J25557n430n1178l77J21488
$$ -1479 22270 -40580 -74519 -81375 -168841 -189448 -175722 -50165 -55595 -106773 -107150 14338
16513A4338J43317P7353j69708r1160N0563o3867j02036J14925J54953M4309r489
$$ 14338 157655 235008 65300 -25860 24703 -39164 -141200 -26275 128678 172987 163498
16502A63498n3055j9354j58900j21501K6254N2634n1671o3271k1226L9196J42332
$$ 163498 110443 91089 -67811 -189312 -163058 -110424 -162095 -225366 -246592 -207396 -65064
16491f5064J56619R5269O4436l1240k6118j41101j96323L0375L6717m5001J07596
$$ -65064 91555 186824 251260 220020 193902 52801 -143522 -113147 -76430 -121431 -13835
16480a3835R0808j53759J9551J69782J1205j9465l1708q8709m4364K2537l8254
$$ -13835 76973 -76786 -57235 112547 123752 104287 72579 -16130 -60494 -37957 -76211
16469g6211k1033J48005J13816j22465l2496P0693R9614m7741o67L5026k2634
$$ -76211 -97244 50761 164577 42112 9616 80309 179923 132182 131515 166541 143907
16458A43907k7864n2230j40510J7929J14481O240j27464Q8728M6932n1865J5451
$$ 143907 116043 63813 -76697 -58768 55713 61953 -65511 23217 70149 18284 33735
16447C3735j190k6320l7531n1040J23102M7724n3663k2935J190k06051J4322R6570
$$ 33735 32545 6225 -31306 -82346 40756 88480 34817 11882 13072 -192979 -178657 -82087
16435h2087J6128J13648N0142J01244m5499j69331p7008m2923Q7583K868n6429
$$ -82087 -65959 47689 97831 199075 153576 -15755 -92763 -135686 -48103 -45235 -101664
16424a01664p2023L8101R0815O2528J0417j19363j07693l9815J59219R7076j58846
$$ -101664 -173687 -135586 -44771 17757 28174 -91189 -198882 -238697 -79478 17598 -141248
16413a41248r1186R6667P7371M0099m6799j05412N6O5578Q0889k8684L0851L8725
$$ -141248 -232434 -135767 -58396 -18297 -65096 -170508 -170452 -104874 -23985 -52669 -21818 16907
16401A6907j12775o8613o2547L7564J24880M0420j38197j51933M4963K06566L935
$$ 16907 -95868 -164481 -227028 -189464 -64584 -24164 -162361 -314294 -269331 -62765 -58830
16390e8830r8066l2847J33669P5844M2333j2240q7951m3137n1986J43968M0734
$$ -58830 -156896 -189743 -56074 19770 62103 49863 -38088 -81225 -133211 10757 51491
16379E1491n8694j13808o8780J09791J22707O7348q9877o2086M4786k0963J0857
$$ 51491 -7203 -121011 -189791 -80000 42707 110055 20178 -41908 2878 -18085 -7228
16368g228o8936k3782K3488j309k0423l9809K9656L2583l7191l1770L8072J32292
$$ -7228 -76164 -99946 -76458 -77767 -98190 -137999 -108343 -75760 -112951 -144721 -106649 25643
16356B5643K3630j70016R2131J31942k2805j70913L8948J19107M1216p0719m9760
$$ 25643 49273 -120743 -28612 103330 80525 -90388 -51440 67667 108883 38164 -11596
16345a1596k1165o5110O842P9880r0p5693K136J3952O804K21937P191n0744m3846
$$ -11596 -32761 -97871 -91029 -11149 -11239 -86932 -84796 -70844 -64040 157897 165088 114344 70498
16332G0498M7837j0754n2316P149o807L2435Q2726J1846Q264k01882j21091O8942
$$ 70498 118335 107581 55265 62414 55607 88042 170768 182614 190878 -11004 -132095 -63153
16320f3153j6331q5380k646J8721K2157N6169L9829m4627J9674j9636Q3781Q7635
$$ -63153 -79484 -164864 -167510 -148789 -126632 -70463 -30634 -75261 -55587 -75223 8558 96193
16308I6193o2932j49657r1954J0787K2762P7158j816m5641J8543O8545N5157L2601
$$ 96193 33261 -116396 -208350 -197563 -174801 -97643 -99459 -145100 -126557 -58012 -2855 29746
16296B9746L3107o7106k7147n8795k5317O9071k1166M5881j8822j75287m6097
$$ 29746 62853 -4253 -31400 -90195 -115512 -46441 -67607 -21726 -40548 -215835 -261932
16285b61932l5600M4995J10373O3553N2003n2309j9787K5983q92M5873l884j2948
$$ -261932 -297532 -252537 -142164 -78611 -26608 -78917 -98704 -72721 -73613 -27740 -31624 -44572
16273d4572q9177j08008r4407O8311J47900R6802o1450m1478J06641Q7972n6768
$$ -44572 -133749 -241757 -336164 -267853 -119953 -23151 -84601 -126079 -19438 68534 11766
16262A1766p8667L0385L994K7477k7725l1893P244j48036n2496L5696R5250N6327
$$ 11766 -66901 -36516 -32522 -5045 -32770 -64663 -57419 -205455 -257951 -222255 -127005 -70678
16250g0678j2610K4403j8410j0835Q3354q9982j47325o1247P6816J47249o8591
$$ -70678 -83288 -58885 -77295 -88130 -4776 -94758 -242083 -303330 -226514 -79265 -147856
16239a47856o9176m8143J13036J63571m6912j09598l9584K4743J45077O0706O7521
$$ -147856 -217032 -265175 -152139 11432 -35480 -145078 -184662 -159919 -14842 45864 113385
16228A13385j55184J2354j8435j43469N8560K1388L934J41539M7388q8606k9950
$$ 113385 -41799 -29445 -47880 -191349 -132789 -111401 -107467 34072 81460 -7146 -37096
16217c7096m8814j06675m6573J30023M3395L4888l6407Q4980l561q0421J1976
$$ -37096 -85910 -192585 -239158 -109135 -65740 -30852 -67259 17721 14160 -66261 -54285
16206e4285o0972o4283n4616j23052k1295J38451J91642J13759N3907j13445j59394
$$ -54285 -115257 -179540 -234156 -357208 -378503 -240052 -48410 65349 119256 5811 -153583
16195a53583j1965J3648K4662n416N598L3924J8146N1994M2278j46396n611L0227
$$ -153583 -165548 -151900 -127238 -132654 -127056 -93132 -74986 -22992 19286 -127110 -132721 -102494
16183a02494N1946J47786O7553j07837Q8626o1509n7499L5144J29518j43652k38184
$$ -102494 -50548 97238 164791 56954 145580 84071 26572 61716 191234 47582 -190602
16172a90602J6168P5447J07181O9011m9234p7734m3909j00948m3831j2370J28214
$$ -190602 -174434 -98987 8194 77205 27971 -49763 -93672 -194620 -238451 -250821 -122607
16161a22607K04132O0947m7086m7294Q8147o0720m1814J3713j25947K0106J1126
$$ -122607 81525 142472 95386 48092 136239 75519 33705 47418 -78529 -58423 -47297
16150d7297J37839N3749j18406m4123L3895l1272o9955N7661L6673m6735j07527
$$ -47297 90542 144291 25885 -18238 15657 -15615 -85570 -27909 8764 -37971 -145498
16139a45498K3115M3381o873l188r100O385N111N549o9786N763J07003m7816j23464
$$ -145498 -122383 -79002 -85875 -89063 -98163 -91778 -86667 -81118 -150904 -145141 -38138 -85954 -209418
16126b09418r9509K2507J83722J49955r9833j15878J575J5700l8538K2381K5770
$$ -209418 -308927 -286420 -102698 47257 -52576 -168454 -166879 -151179 -189717 -167336 -141566
16115a41566N66o9581q756L2193m1479n5258j4716Q7929K586M7349R3137r1585
$$ -141566 -141000 -210581 -219337 -187144 -228623 -283881 -298597 -210668 -208082 -160733 -67596 -159181
16103a59181j06894K2259Q4327Q6912M9061M8298L5688o8366j10284l800k5911
$$ -159181 -266075 -243816 -159489 -72577 -23516 24782 60470 -7896 -118180 -121980 -147891
16092a47891n0647j1123R0308N4910l6938J67662J745j80490k4235l6051l3530
$$ -147891 -198538 -209661 -119353 -64443 -101381 66281 68026 -112464 -136699 -172750 -206280
16081b06280J06547N2232n3402j8277J27985m004j98609j19409J35472j2956n131
$$ -206280 -99733 -47501 -100903 -119180 8805 4801 -193808 -313217 -177745 -190701 -195832
16070a95832J1998k4860j749q4231J49856J60121j3831k5180J50778R1989j46329
$$ -195832 -183834 -208694 -210443 -294674 -144818 15303 1472 -23708 127070 219059 72730
16059G2730j53189j39220L8090P020K7739j30718j16011L0601k6599K01658J94825
$$ 72730 -80459 -219679 -181589 -174569 -146830 -277548 -393559 -362958 -389557 -187899 6926
16048F926p126p2613o4309M7590j5248l5760K919o413J04908P4841L1002r6698
$$ 6926 -200 -72813 -137122 -89532 -104780 -140540 -137621 -144034 -39126 35715 66717 -29981
16036b9981j09154o1006l3336k3624M0978M6374O4231J36097k6487j97368k0177
$$ -29981 -139135 -200141 -233477 -257101 -216123 -169749 -105518 30579 4092 -193276 -213453
16025b13453j6231P3835N1659J00838R2619M2776n2757j29022j27768n5816P83
$$ -213453 -229684 -155849 -104190 -3352 89267 132043 79286 -49736 -177504 -233320 -232537
16014b32537n9646Q9290R2833l0687l2460J9468R6912l6233j7751k3954m2098
$$ -232537 -292183 -202893 -110060 -140747 -173207 -153739 -56827 -93060 -110811 -134765 -176863
16003a76863J4309R1684J04977o704n5514L9189J630m6287L3399m668M0800P6932
$$ -176863 -162554 -70870 34107 27403 -28111 11078 12708 -33579 -180 -4848 35952 112884
15991A12884k3995k99880n5932Q8584l4733M1604J26766M2075j1409q285p3466
$$ 112884 88889 -210991 -266923 -178339 -213072 -171468 -44702 -2627 -14036 -22321 -95787
15980i5787n5150j7444R7401l7773m5695N4897M146L9599N3487k7863m7286m8072
$$ -95787 -150937 -168381 -70980 -108753 -154448 -99551 -95405 -55806 -2319 -30182 -77468 -125540
15968a25540M7062j3089j33184k3674Q8957J0313M1575P9945N217j84759k7373
$$ -125540 -78478 -91567 -224751 -248425 -159468 -149155 -107580 -27635 -22418 -207177 -234550
15957b34550Q2741K3417m7994k2637N3499Q2149P6098M3873J0180j55720n4970
$$ -234550 -151809 -128392 -176386 -199023 -145524 -63375 12723 56596 66776 -88944 -143914
15946a43914J5126J29317N933j12418j14525N3577L1415P6944K311o2732L2341
$$ -143914 -128788 529 6462 -105956 -220481 -166904 -135489 -58545 -56234 -118966 -86625
15935h6625L9409O0228j8559l7626r317L5490m5076j10279j1821l532J69116J16282
$$ -86625 -47216 13012 -5547 -43173 -52490 -17000 -62076 -172355 -184176 -187708 -18592 97690
15923I7690L4039l2878j40279j17560p0270m9615p9148M079J00205J12363L3867
$$ 97690 131729 98851 -41428 -158988 -229258 -278873 -358021 -353942 -253737 -141374 -107507
15912a07507m3299q3612P0230O5630L0490p3014O6503J10142j02899m0393r5513
$$ -107507 -150806 -234418 -164188 -98558 -68068 -141082 -74579 35563 -67336 -107729 -203242
15901b03242j0428n2562R2094l2286m3888N0106J91569m754M0907j19021K5474
$$ -203242 -213670 -266232 -174138 -206424 -250312 -200206 -8637 -13391 27516 -91505 -66031
15890f6031K7217k6131M4027K1856r1115l4134J16633J59907k4152m9414k6077
$$ -66031 -38814 -64945 -20918 938 -90177 -124311 -7678 152229 128077 78663 52586
15879E2586j88607j5105P0245q8648P463N6029J02054m830O8204n0292p6820m0880
$$ 52586 -136021 -151126 -80881 -169529 -162066 -106037 -3983 -8813 59391 9099 -67721 -108601
15867a08601N1660j10613o8492Q7863K4890j19777R044J33644P5355o718o4899
$$ -108601 -56941 -167554 -236046 -148183 -123293 -243070 -234026 -100382 -25027 -31745 -96644
15856i6644J3392K9258j11972J812p8456L1143L6213R595n2291O2395O1475K4640
$$ -96644 -83252 -53994 -165966 -164154 -242610 -211467 -175254 -165659 -217950 -155555 -94080 -69440
15844f9440q1675p2641J00214M7173l0848J45955m7600r8332j6314J60640J1757
$$ -69440 -151115 -223756 -123542 -76369 -107217 38738 -8862 -107194 -123508 37132 48889
15833D8889n3400q9293M0445R1609K860j07165L1530r2418j1481k328J0123j11119
$$ 48889 -4511 -93804 -53359 38250 41110 -66055 -34525 -126943 -138424 -140752 -130629 -241748
15821b41748J11192M7524l4354O0485N0789m0824J000P083k4485p9059k4704l1907
$$ -241748 -130556 -83032 -117386 -56901 -6112 -46936 -45936 -38853 -63338 -142397 -167101 -199008
15809a99008o1770L9328M2999P9030M2607n7217l1563m2771k3016J04214Q0521
$$ -199008 -260778 -221450 -178451 -99421 -56814 -114031 -145594 -188365 -211381 -107167 -26646
15798b6646N8039Q0661j8206j21894r789j4359K661l021l7811L4860J19040m6972
$$ -26646 31393 112054 93848 -28046 -37835 -52194 -49533 -52554 -90365 -55505 63535 16563
15786A6563j86426O6867K4659l8612p0866M2704J38650M8558j16734r6112o0581
$$ 16563 -169863 -102996 -78337 -116949 -187815 -145111 -6461 42097 -74637 -170749 -231330
15775b31330N5030N3942J00870k6931j04147J87N093Q233N0715J7473L0553q1569
$$ -231330 -176300 -122358 -21488 -48419 -152566 -152379 -147286 -139053 -88338 -70865 -40312 -121881
15763a21881k9848M777r326K472P4563l8286L0577K5372j5728j03883j6367K9101
$$ -121881 -151729 -146952 -156278 -153806 -79243 -117529 -86952 -61580 -77308 -181191 -197558 -168457
15751a68457j1168J6530l2959N9283L7046k0714q6078N3380R6712R307Q673n919
$$ -168457 -179625 -163095 -196054 -136771 -99725 -120439 -206517 -153137 -56425 -47118 -38445 -44364
15739d4364n2935J811n8260r1503O4962Q0707Q0455p468j0249j0046r9649Q312
$$ -44364 -97299 -95488 -153748 -245251 -180289 -99582 -19127 -26595 -36844 -46890 -146539 -138227
15727a38227Q9527M3524O5618L2532m7850l8066p0068j08055m4071M4805K2126
$$ -138227 -48700 -5176 60442 92974 45124 7058 -63010 -171065 -215136 -170331 -148205
15716a48205J19796m920n2244q0534j05785M8929J67189J23968l8623k2373o4054
$$ -148205 -28409 -33329 -85573 -166107 -271892 -222963 -55774 68194 29571 7198 -56856
15705e6856Q752j5556O3336O5982n3520q8899l9458n944R6749M4608N3849R4569
$$ -56856 -48104 -63660 -324 65658 12138 -76761 -116219 -122163 -25414 19194 73043 167612
15693A67612K1144r0160j22601n7180M7073j514k2958r6380k9389M4770K5852
$$ 167612 188756 98596 -24005 -81185 -34112 -35626 -58584 -154964 -184353 -139583 -113731
15682a13731R5092R8422j28017j08565j52P1766J32327P0858q5335k2740j2042
$$ -113731 -18639 79783 -48234 -156799 -156951 -85185 47142 118000 32665 9925 -2117
15671b117j6544N4605l4104L1593j0046j37322l7678m4499Q1375N3216q3892q0868
$$ -2117 -18661 35944 1840 33433 23387 -113935 -151613 -196112 -114737 -61521 -145413 -226281
15659b26281K6867R3485O7693j2270K4798L7951p4128q2929L9168J63306K506
$$ -226281 -199414 -105929 -38236 -50506 -25708 12243 -61885 -144814 -105646 57660 60166
15648F0166J0875m3462J9514P1364j16027p4104J38641M7606r4078K6417j00067
$$ 60166 71041 27579 47093 118457 2430 -71674 66967 114573 20495 46912 -53155
15637e3155r5804o1474P8362O3775m9663K9978J07151j3416n2371O0104n3174
$$ -53155 -148959 -210433 -132071 -68296 -117959 -87981 19170 5754 -46617 13487 -39687
15626c9687j2799o4797j37068r379J01286P3327q0649J8706K1934R3902N5043
$$ -39687 -52486 -117283 -254351 -263730 -162444 -89117 -169766 -151060 -129126 -35224 19819
15615A9819L5691r9104l5576M305N7943N0711j76551n5895J13437J06249L4281
$$ 19819 55510 -43594 -79170 -74865 -16922 33789 -142762 -198657 -85220 21029 55310
15604E5310p3944l214R0521L6184k0337j9767O3318l3181m944j51812m4639J01142
$$ 55310 -18634 -21848 68673 104857 84520 64753 128071 94890 89946 -61866 -106505 -5363
15592e363M2618q8918m4738k0174Q4570M5522O2567M3189n6186j9593j9409q4582
$$ -5363 37255 -51663 -96401 -116575 -32005 13517 76084 119273 63087 43494 24085 -60497
15580f0497k725R3544K421j85086j08421P2647P2403m6673l534N8815J29477l7281
$$ -60497 -63222 30322 32743 -152343 -260764 -188117 -115714 -162387 -165921 -107106 22371 -14910
15568a4910k6169Q6387o3563n3097n4164N8897M3798M2433J04632Q9823p5365
$$ -14910 -41079 45308 -18255 -71352 -125516 -66619 -22821 19612 124244 214067 138702
15557A38702j1945k8354q470m4419l5271N5352M1767J7258j6057r2910j26322
$$ 138702 126757 98403 89933 45514 10243 65595 107362 124620 108563 15653 -110669
15546a10669Q57J50273L0449K7929m2844j42297j19304N0967R8029L965M1385
$$ -110669 -109812 40461 70910 98839 55995 -86302 -205606 -154639 -56610 -52645 -11260
15535a1260R5050o6468j52340Q3750j4853J5058L1545M6854J3219Q078J13156
$$ -11260 83790 17322 -135018 -51268 -66121 -51063 -19518 27336 40555 48633 161789
15524A61789L5383j05532j16785p5063Q3793j7386p964J05551l6158k4524R6521
$$ 161789 197172 91640 -25145 -100208 -16415 -33801 -41765 63786 27628 3104 99625
15513I9625n7403p6544q1598J26725R6806o8960K2538K711q5327J1773p4058j00057
$$ 99625 42222 -34322 -115920 10805 107611 38651 61189 63900 -21427 -9654 -83712 -183769
15501a83769J5386p3656n8154J49595J56922J24076L2841p7048j78473r5576k3044
$$ -183769 -168383 -242039 -300193 -150598 6324 130400 163241 86193 -92280 -187856 -210900
15490b10900R1954L3407o1078p6473r3980J09236J70400R7247j43764p26Q5214
$$ -210900 -118946 -85539 -146617 -223090 -317070 -207834 -37434 59813 -83951 -84677 537
15479E37q5210o7024N4314N6619P1375J1677r5238j1984O2178l2189r2357p8152
$$ 537 -84673 -151697 -97383 -40764 30611 42288 -52950 -64934 -2756 -34945 -127302 -205454
15467b05454O1369n4294J2372J05308Q6637L1644Q4400L117R8k4792n9405J5933
$$ -205454 -144085 -198379 -186007 -80699 5938 37582 121982 125099 125197 100405 41000 56933
15455E6933l409o7769K3582Q2132n9658K0445k9119j30749J8851J09001p6091
$$ 56933 53524 -14245 9337 91469 31811 52256 23137 -107612 -88761 20240 -55851
15444e5851j954O2711j34680r0838J1555m9168J348J36977P5803L6637k877k6056
$$ -55851 -57805 4906 -129774 -220612 -209057 -258225 -256877 -119900 -44097 -7460 -10337 -36393
15432c6393n2585m9153R800l4373n536N172n417P006j7984L8768J2908J44693
$$ -36393 -88978 -138131 -128331 -162704 -168240 -163068 -168485 -161479 -179463 -140695 -127787 16906
15420A6906Q2865j21326M8500J4213m827n359p2586p499l4722n2361L8043l5850
$$ 16906 99771 -21555 26945 41158 36331 30972 -41614 -49113 -83835 -136196 -98153 -134003
15408a34003j10286p271L49J44682J48969J37400p9756j17303k4335L610j6054
$$ -134003 -244289 -251560 -251211 -106529 42440 179840 100084 -17219 -41554 -37944 -53998
15397e3998r1329O6967J17376k9976l8844j406O6293p3245O2749o9807j07667
$$ -53998 -145327 -78360 39016 9040 -29804 -31210 35083 -38162 24587 -45220 -152887
15386a52887m8574J5377M4951J41747j1962q3628p712k5941j0921J9272J6872
$$ -152887 -201461 -186084 -141133 614 -11348 -94976 -102688 -128629 -139550 -120278 -103406
15375a03406K9167k7180P107K6470R16R1165K8234R378m9348q4242M5700k134
$$ -103406 -74239 -101419 -94312 -67842 -66926 24239 52473 61851 12503 -71739 -26039 -28173
15363b8173L8912l8434j22126N3992R5821M5054P0608m7264j55479N253L506K706
$$ -28173 10739 -27695 -149821 -95829 -8 45046 115654 68390 -87089 -81836 -78330 -75624
15351g5624k7308L3688o6Q2746O9660p6516j19650M5997Q584p8729L6350K6809
$$ -75624 -102932 -69244 -69310 13436 83096 6580 -113070 -67073 -58489 -137218 -100868 -74059
15339g4059L5354j14406J04641o2239n7351k1784l355M3052J44361N5259l3820
$$ -74059 -38705 -153111 -48470 -110709 -168060 -189844 -193199 -150147 -5786 49473 15653
15328A5653p6310m4136m2714K9421Q2644Q1138l4555j5480l2943P9521m6234M3034
$$ 15653 -60657 -104793 -147507 -118086 -35442 45696 11141 -4339 -37282 42239 -3995 39039
15316C9039J61497J0440o9098j53494n5142p5808j9227K136q0441M3857K83555
$$ 39039 200536 210976 141878 -11616 -66758 -142566 -161793 -159657 -240098 -196241 87314
15305H7314L4564n5417L6466Q4448m1164P966J7033k5019q4985P804r9226p1360
$$ 87314 121878 66461 102927 187375 146211 154177 171210 146191 61206 69010 -30216 -101576
15293a01576M1566J23235N5358l9398k6130n3475q7079R5034J43478J6612p1144
$$ -101576 -60010 63225 118583 79185 53055 -420 -87499 7535 151013 167625 96481
15282I6481j43765n8749P25J1712L6795N6698J52466m6418n8186j12508j15448
$$ 96481 -47284 -106033 -105308 -93596 -56801 -103 152363 105945 47759 -64749 -180197
15271a80197J14058L4735P6549P2190q0896j59210R912M7036p3020L0575N0816
$$ -180197 -66139 -31404 45145 117335 36439 -122771 -112859 -65823 -138843 -108268 -57452
15260e7452J58985L3302j57119r9784R91J14507L7800L6741L7992q4685k9643
$$ -57452 101533 134835 -22284 -122068 -121077 -6570 31230 67971 105963 21278 -8365
15249h365j53732p289N3216M7227P735J51693j09056o4927P9017K6354L7084q95
$$ -8365 -162097 -169386 -116170 -68943 -61208 90485 -18571 -83498 -4481 21873 58957 58062
15237E8062p9368p3695j21083l462O0331R4740j1334n001l8761J8721k7989n5848
$$ 58062 -21306 -95001 -216084 -219546 -159215 -64475 -75809 -80810 -119571 -100850 -128839 -184687
15225a84687j45900P0796J972J54433J16829J2406l7732j19760q5130J28647J13314
$$ -184687 -330587 -259791 -257819 -103386 13443 25849 -11883 -131643 -216773 -88126 25188
15214B5188J7414j00417p4944K2812l598L2768J65049j2396p1255p6567p0693
$$ 25188 42602 -57815 -132759 -109947 -113545 -80777 84272 71876 621 -75946 -146639
15203a46639L0498k521R720j15609q517Q9695J0656j0568P3082N1195l5094j3979
$$ -146639 -116141 -118662 -108942 -224551 -233068 -143373 -132717 -143285 -70203 -19008 -54102 -68081
15191f8081K1292m6061p8690j14493k1652J32958Q5406k3937j26953N0180R9227
$$ -68081 -46789 -92850 -171540 -286033 -307685 -174727 -89321 -113258 -240211 -190031 -90804
15180i0804j941M4271m1367N2186k1031J06089l6599l4594n1648n4993l5192M2369
$$ -90804 -92745 -48474 -89841 -37655 -58686 47403 10804 -23790 -75438 -130431 -165623 -123254
15168a23254N174l2202J17692Q9797P1163j50213o9031n9098K1178K1975m0523
$$ -123254 -118080 -150282 -32590 57207 128370 -21843 -90874 -149972 -128794 -106819 -147342
15157a47342j2703p1515P8380l0638L0154O5378O6982K434p2967j3290n413L8561
$$ -147342 -160045 -231560 -153180 -183818 -153664 -88286 -21304 -18870 -91837 -105127 -110540 -71979
15145g1979j6875J36924Q1040o6611M064n9690q9934k7024J37426P031N545R2165
$$ -71979 -88854 48070 129110 62499 66563 6873 -83061 -110085 27341 34372 39917 132082
15133A32082J9671o2836n8267Q2502q3722o4023o5419K6290K1377l8950l2468
$$ 132082 151753 88917 30650 113152 29430 -34593 -100012 -73722 -52345 -91295 -123763
15122a23763P376N935m8902K1598m3316K3621K8427L5623K2115J06446J31081
$$ -123763 -116387 -110452 -159354 -137756 -181072 -157451 -129024 -93401 -71286 35160 166241
15111A66241j03441O500k3108j5889P1964n8258j01662M3405N4677j078m1862
$$ 166241 62800 69300 46192 30303 102267 44009 -57653 -14248 40429 39351 -2511
15100b511M96o0997j02162l675K8946l54j6797m8584J6854L8715J16667L3442
$$ -2511 -2015 -63012 -165174 -168849 -139903 -140257 -157054 -205638 -188784 -150069 -33402 40
15088D0O869K791j06461J7664J07819j4858j4193P5595O6497p9008q6255L4974
$$ 40 6909 9700 -96761 -79097 28722 13864 -329 75266 141763 62755 -23500 11474
15076A1474o3660o55m9792l447J06952K3543p1563M3686J4617L9611m2839k8911
$$ 11474 -52186 -52841 -102633 -106080 872 24415 -47148 -3462 11155 50766 7927 -20984
15064b0984L2684J03820j5877O0942l551p8460j04405N0245m964m6863r1413m6679
$$ -20984 11700 115520 99643 160585 157034 78574 -25831 24414 19450 -27413 -118826 -165505
15052a65505M5010L279m1795M2720o638l9428k3538J0873N7219J31947o0963l1661
$$ -165505 -120495 -117216 -159011 -116291 -122929 -162357 -185895 -175022 -117803 14144 -46819 -78480
15040g8480O2514N6495N6444N2544J3634N8112M8775m8125j55649k10098J69116
$$ -78480 -15966 40529 96973 149517 163151 221263 270038 221913 66264 -143834 25282
15029B5282P4555r0769Q244k2243P2396j23190k2160N5251m8621N9091p7162N9305
$$ 25282 99837 9068 17312 -4931 67465 -55725 -77885 -22634 -71255 -12164 -89326 -30021
15017c0021O1009J9832j07766m1225m3082R026J16559N2983m6884Q7592l5195
$$ -30021 30988 50820 -56946 -98171 -141253 -132227 -15668 37315 -9569 78023 42828
15006D2828p2692l2585M0353M0357j8591n1885p6503J9404K285o7261N1740m2963
$$ 42828 -29864 -62449 -22096 18261 -330 -52215 -128718 -109314 -107029 -174290 -122550 -165513
14994a65513M2691J03129J50793J4291l7171j88815K1651J63771K28360q5497
$$ -165513 -122822 -19693 131100 145391 108220 -80595 -58944 104827 333187 247690
14984B47690j19774m2601l8573l6970K6157L7019R408n4726q7807M2310J1876
$$ 247690 127916 85315 46742 9772 35929 72948 82356 27630 -60177 -17867 -5991
14973e991R0049K5566r6083n5967M183J20288K1072R7623o8048r9149j17352j17808
$$ -5991 84058 109624 13541 -42426 -38243 82045 103117 200740 132692 33543 -83809 -201617
14961b01617Q2431R1439K7717K5464r8966P2150P0171j3048j24615k18174M6573
$$ -201617 -119186 -27747 -30 25434 -73532 -1382 68789 55741 -68874 -287048 -240475
14950b40475J41465M5594k1474p0280j9512Q6861R351k3536k364M7532M0651K4138
$$ -240475 -99010 -53416 -74890 -145170 -164682 -77821 -68470 -92006 -94370 -46838 -6187 17951
14938A7951O1267P335N3090o9247n3677Q673K0962P163J12620K3617o8473J22285
$$ 17951 79218 86553 139643 70396 16719 25392 46354 53517 166137 189754 121281 243566
14926B43566J29316j55013j95468p0497K5301q6856M5693J38735n0173MO0008
$$ 243566 372882 217869 22401 -48096 -22795 -109651 -63958 74777 24604 24608 84616
14915H4616q1775n5584J45122N4218j34086m5528J9299l9577Q4187M883m6799
$$ 84616 2841 -52743 92379 146597 12511 -33017 -13718 -53295 30892 35775 -11024
14904a1024q0960n9727n8730J41596J10522O2468J2712R687q8496o1381Q7791
$$ -11024 -91984 -151711 -210441 -68845 41677 104145 116857 126544 38048 -23333 64458
14893F4458R417k1520L3138O2764m8735j15298K1443q7115k4991j9090k883P8220
$$ 64458 73875 52355 85493 148257 99522 -15776 5667 -81448 -106439 -125529 -128412 -50192
14881e0192J02884n964l8386R0125P7047O5116r57n1350o3050O0927J11488p1541
$$ -50192 52692 46728 8342 98467 175514 240630 239673 188323 125273 186200 297688 226147
14869B26147j45296j53927j78480K7178J28992P8419M3742N0368j37503P214J7201
$$ 226147 80851 -73076 -251556 -224378 -95386 -16967 26775 77143 -60360 -53146 -35945
14858c5945L9459K427j12354j00782J82599Q3995r1802j71028j6437m1363O3860
$$ -35945 3514 5941 -106413 -207195 -24596 59399 -32403 -203431 -219868 -261231 -197371
14847a97371P8765l8827L8158R9493L1716q8j92937j02674J36393J23486p8566
$$ -197371 -118606 -157433 -119275 -19782 11934 11846 -181091 -283765 -147372 -23886 -102452
14836a02452j03363l0118l527L3146R3075R7494p8084P6144J58730j8265j41664
$$ -102452 -205815 -235933 -239460 -206314 -113239 -15745 -93829 -17685 141045 122780 -18884
14825a8884o9360j07587Q2414R2801p8729L4372m0345J0181P5814j6919q9124
$$ -18884 -88244 -195831 -113417 -20616 -99345 -64973 -105318 -95137 -19323 -36242 -125366
14814a25366j29903p7566R7911J28802J34797l0741q0699N6884q9160q8019R8299
$$ -125366 -255269 -332835 -234924 -106122 28675 -2066 -82765 -25881 -115041 -203060 -104761
14803a04761R2858R9176j9195k8885n9529q8379J22222J8748p6759k6400n4793
$$ -104761 -11903 87273 68078 39193 -20336 -108715 13507 32255 -44504 -70904 -125697
14792a25697n1817j0562P9186N9439M1874J888M5366j9871j06741j0135r4058
$$ -125697 -177514 -188076 -108890 -49451 -7577 -5689 39677 19806 -86935 -97070 -191128
14781a91128l9381R0967J27162L1627O5002m2012p5344P606M1839p7688J05422
$$ -191128 -230509 -139542 -12380 19247 84249 42237 -33107 -25501 16338 -61350 44072
14770D4072O9446j34760M5752R1468l0927n5162K622k745M4750L3973k5058M1284
$$ 44072 113518 -21242 24510 115978 85051 29889 32511 29766 74516 108489 83431 124715
14758A24715K7556j4825q5612j6844O7799R250n5144j44562j45654M556J63573
$$ 124715 152271 137446 51834 34990 102789 112039 56895 -87667 -233321 -228765 -65192
14747f5192J27947m2910k5450m6700q6072L6638J01856M9377k3757j49778j25344
$$ -65192 62755 19845 -5605 -52305 -138377 -101739 117 49494 25737 -124041 -249385
14736b49385k2383M8791M1017q625N4053j73343j7450J59826M4884k2737j01982
$$ -249385 -271768 -222977 -181960 -190585 -136532 -309875 -327325 -167499 -122615 -145352 -247334
14725b47334l8912P3599J74124j6471r1308r2986K5490J36914M0n660P5179J25129
$$ -247334 -286246 -212647 -38523 -54994 -146302 -239288 -213798 -76884 -76844 -82504 -7325 117804
14713A17804q7781j01129O2246l6678L0171K1790M3840J09130R1878K4248q4307
$$ 117804 30023 -71106 -8860 -45538 -15367 6423 50263 159393 251271 275519 191212
14702A91212j45897p1293L8151J5096k9847K0100J9101o541N311j41893j17776
$$ 191212 45315 -25978 12173 27269 -2578 17522 36623 30082 35393 -106500 -224276
14691b24276J7852N9874P3236Q1440J07319j04458K2893J01837m9546j21782N4239
$$ -224276 -206424 -146550 -73314 8126 115445 10987 33880 135717 86171 -35611 18628
14680A8628L1145p2200j4944j1942j32745n1116R9207J5722m1471K5206M515L2858
$$ 18628 49773 -22427 -37371 -49313 -182058 -233174 -133967 -118245 -159716 -134510 -129995 -97137
14668i7137J0190J7056j6287J73475K7579n5168J52281r1587n2121q5021L3852
$$ -97137 -86947 -69891 -86178 87297 114876 59708 211989 120402 68281 -16740 17112
14657A7112J0576J3326l0387j10563L6236J10942L5872k3254j17746m2417P1348
$$ 17112 27688 41014 10627 -99936 -63700 47242 83114 59860 -57886 -100303 -28955
14646b8955N84n5249l3458J85512N9883r1774q2399o813K0152m128P2278J04319
$$ -28955 -28371 -83620 -117078 68434 128317 36543 -45856 -52669 -32517 -36645 35633 139952
14634A39952N2131q1233Q161p4453j71682O8519K07063Q8031k3228r9959r5711
$$ 139952 192083 110850 119011 44558 -127124 -58605 148458 236489 213261 113302 17591
14623A7591n0629n1415l304P1565R48j05620L4665M968J6463k6086J17822J1218
$$ 17591 -33038 -84453 -87757 -16192 -15244 -120864 -86199 -81231 -64768 -90854 26968 38186
14611C8186m161k9530P494J73233J56965J6849n7082n876j01704j51021K2334
$$ 38186 34025 4495 11989 185222 342187 359036 301954 296078 194374 43353 65687
14600F5687j7502l2080r0267J4257J24014J1607n2353K467m4166J5732l4824o280
$$ 65687 48185 16105 -74162 -59905 64109 75716 23363 25830 -18336 -2604 -37428 -43708
14588d3708p6595J7093K1069O8118J01473M1988P3989n4716j03009m2919j09599
$$ -43708 -120303 -103210 -82141 -14023 87450 129438 203427 148711 45702 2783 -106816
14577a06816n6055P1843N0185P32N0018M1915m661o9645q4849j7777m3925P0807
$$ -106816 -162871 -91028 -40843 -40111 9907 51822 47161 -22484 -107333 -125110 -169035 -98228
14565i8228J43971J0910j68805o7084R3780M2107m2109P769J10869M4886N6139
$$ -98228 45743 56653 -112152 -179236 -85456 -43349 -85458 -77689 33180 78066 134205
14554A34205N5210M0599j11034o0272N5190L84p259m7002m5312r5712l3007L8
$$ 134205 189415 230014 118980 58708 113898 114282 107023 60021 14709 -81003 -114010 -113972
14542a13972L0325L3099K6101J0339O4619q821j8648p1275k7842Q0650N3340M9939
$$ -113972 -83647 -50548 -24447 -14108 50511 41690 23042 -48233 -76075 4575 57915 107854
14530A07854k721j95854l4169j1050K8399N0173j8347Q484O0662K7353J18251
$$ 107854 105133 -90721 -124890 -135940 -107541 -57368 -75715 -67231 -6569 20784 139035
14519A39035M2403N7140k26445q2543J8664J8372o7317P6157k3226j68834o3658
$$ 139035 181438 238578 12133 -70410 -51746 -33374 -100691 -24534 -47760 -216594 -280252
14508b80252J14770J83695K4409M9062J8572o8553k1979q5584l3826m0705P8155
$$ -280252 -165482 18213 42622 91684 110256 41703 19724 -65860 -99686 -140391 -62236
14497f2236o470j702R8357J3545l9889Q7919P684p1568j9933R6296J31963K8022
$$ -62236 -68706 -70408 27949 41494 1605 89524 97208 25640 5707 102003 233966 261988
14485B61988k1853q6554p2867o7982q0615N4799n1877p95L1408q3334o3774n724
$$ 261988 240135 153581 80714 12732 -67883 -13084 -64961 -65756 -34348 -117682 -181456 -187180
14473a87180M1399R2723n6845p3221R5226J28592J22539j79747j30433R5133Q3867
$$ -187180 -145781 -53058 -109903 -183124 -87898 40694 163233 -16514 -146947 -51814 32053
14462C2053J3002n4746k1928L2083L5767r106o2382K2705j09080r8814M6580K7321
$$ 32053 45055 -9691 -31619 464 36231 27125 -35257 -12552 -121632 -220446 -173866 -146545
14450a46545K8311J0635j0509o064N4854m5357k1158P4494P2679q114j16474n2180
$$ -146545 -118234 -107599 -118108 -124172 -69318 -114675 -135833 -61339 11340 3226 -113248 -165428
14438a65428K3007J108J9232N4752J16209Q9943j70355o0355m2149j23409n6451
$$ -165428 -142421 -141313 -122081 -67329 48880 138823 -31532 -91887 -134036 -257445 -313896
14427c13896R3041R2738J76553N5941P670N5701j26081m9984l2862K1134N6322
$$ -313896 -220855 -128117 48436 104377 112047 167748 41667 -8317 -41179 -20045 36277
14416C6277l0099m5307L247j70341j37401J34224J60041Q4126p597l3387N021
$$ 36277 6178 -39129 -35882 -206223 -343624 -209400 -49359 34767 27170 -6217 -1196
14405a196M8818m4923j55881k4085J39870M6839m7519L9095J3371N6521N0739
$$ -1196 47622 2699 -153182 -177267 -37397 9442 -38077 1018 14389 70910 121649
14394A21649j0712L2022n1787j0934o4486k2818m5279k2787P383k2835M5614j9430
$$ 121649 110937 142959 91172 80238 15752 -7066 -52345 -75132 -67749 -90584 -44970 -64400
14382f4400k6771J18433N6251L1466M0878j22884j08871j28181j001J14725n3161
$$ -64400 -91171 27262 83513 114979 155857 32973 -75898 -204079 -205080 -90355 -143516
14371a43516j9856J8573p4119j8618J31755J42333J00386P5710K9451j22395j50042
$$ -143516 -163372 -144799 -218918 -237536 -105781 36552 136938 212648 242099 119704 -30338
14360c0338l9158N0154N3856l4337p1841M8179j54025N3004K6698k6620Q1330
$$ -30338 -69496 -19342 34514 177 -71664 -23485 -177510 -124506 -97808 -124428 -43098
14349d3098J09367Q2855M4999r5121o5164o1480J0415O3150R2198M8890K4925
$$ -43098 66269 149124 194123 99002 33838 -27642 -17227 45923 138121 187011 211936
14338B11936K8218m6866j68037q674j0585j751j30137K401o6799k39m1900O4568
$$ 211936 240154 193288 25251 16577 5992 4241 -125896 -123495 -190294 -190533 -232433 -167865
14326a67865J10247N9496k6375k7651j35555n880J11108O8145O9738q8133p2524
$$ -167865 -57618 1878 -24497 -52148 -187703 -193583 -82475 -14330 55408 -32725 -105249
14315a05249J14716J42300Q5184q7058j12001p6147O5628Q3930p7922j58465n6426
$$ -105249 9467 151767 236951 149893 37892 -38255 27373 111303 33381 -125084 -181510
14304a81510O3516Q5695p5088p6110o8989k8369M6502J27295K1427M7790m0472
$$ -181510 -117994 -32299 -107387 -183497 -252486 -280855 -234353 -107058 -85631 -37841 -78313
14293g8313M2377M4327j6030o2898l5671R9477o7198J10777M4902o7282p0023
$$ -78313 -35936 8391 -7639 -70537 -106208 -6731 -73929 36848 81750 14468 -55555
14282e5555R281k5644P7092n6748N7522K3318o4950j11427j36776P6655P2007
$$ -55555 -46274 -71918 5174 -51574 5948 29266 -35684 -147111 -283887 -207232 -135225
14271a35225l0830J02078J25353o1319L5397J22916N5324P689M5474l7489j12202
$$ -135225 -166055 -63977 61376 57 35454 158370 213694 221383 266857 229368 117166
14260A17166j67192p2701P7901P3017j9905j1789O3189L4980k0205k8715j7629
$$ 117166 -50026 -122727 -44826 28191 8286 -3503 59686 94666 74461 45746 28117
14249B8117J15550o8718n4333k4642k7184L7940L9038p2428j63657N2576N5989
$$ 28117 143667 74949 20616 -4026 -31210 6730 45768 -26660 -190317 -137741 -81752
14238h1752Q1109j30257O015j4698q5386P5348P5569J34329K1228r675M3773n7013
$$ -81752 -643 -130900 -124885 -139583 -224969 -149621 -74052 60277 81505 71830 115603 58590
14226E8590k8981m6046L0501Q2506n4441j6180J435O4789K7051q3578j47270k7495
$$ 58590 29609 -16437 14064 96570 42129 25949 27384 92173 119224 35646 -111624 -139119
14214a39119P6790M1155K4992N0852L3422P160M8001Q141q2977j76253j23881
$$ -139119 -62329 -21174 3818 54670 88092 95252 143253 151394 68417 -107836 -231717
14203b31717O3052Q5621M2743J73306M9625J1977O2755j267q9016r8604k5035
$$ -231717 -168665 -83044 -40301 133005 182630 194607 257362 256095 167079 68475 43440
14192D3440q700p2348J482k3681R730L2129O9170L7915j23142n9246m2286O21
$$ 43440 34740 -37608 -36126 -59807 -50077 -17948 51222 89137 -34005 -93251 -135537 -134916
14180a34916J34920J21686J9518r9979K6190M0964m4775m8863n939J2436M8475
$$ -134916 4 121690 141208 41229 67419 108383 63608 14745 8806 21242 69717
14169F9717K7740M2180J0734k2527j15618k5915l6962l3197p8559m0069J0083
$$ 69717 97457 139637 150371 127844 12226 -13689 -50651 -83848 -162407 -202476 -192393
14158a92393j3719Q7692m4491l7044M816R7174J40087J00001k1359j8959K6515
$$ -192393 -206112 -118420 -162911 -199955 -195139 -97965 42122 142123 120764 101805 128320
14147A28320N9527k16991j15829Q7864J12349L0671k5841P5024R5747l8352j82183
$$ 128320 187847 -29144 -144973 -57109 55240 85911 60070 135094 230841 192489 10306
14136A0306j7450J39075n9639n8605M6999o9906j43970Q0874J27265O6782l8555
$$ 10306 -7144 131931 72292 13687 60686 -9220 -153190 -72316 54949 121731 83176
14125H3176j298Q3205o6855j10731m9436n0251L150R6700M4443n1939k4866P2191
$$ 83176 81878 165083 98228 -12503 -61939 -112190 -109040 -12340 32103 -19836 -44702 27489
14113B7489r0482N0427R8038P7123J21352J19110q8926j38539m4306J1748r1870
$$ 27489 -62993 -12566 85472 162595 283947 403057 314131 175592 131286 143034 51164
14102E1164j086O687p6441q1810L1727J4887k2444J7634M31r5810P7369n2527
$$ 51164 50078 56765 -19676 -101486 -69759 -54872 -77316 -59682 -59251 -155061 -77692 -130219
14090a30219j09751M033Q2326L8239m960L8106m7816M1615p9689K7658l0426o3825
$$ -130219 -239970 -235937 -153611 -115372 -120332 -82226 -130042 -88427 -168116 -140458 -170884 -234709
14078b34709q7073O6654Q6044L1281j39775J17268K8870m162M5083K2672J31808
$$ -234709 -321782 -255128 -169084 -137803 -277578 -160310 -131440 -135602 -90519 -67847 63961
14067F3961J98510k7004j70835n4261K208L0941p4471m8088k6946m6937J33626
$$ 63961 262471 235467 64632 10371 12579 43520 -30951 -79039 -105985 -152922 -19296
14056a9296K6446j51766j1727J01331M0687p3046j06416P3136N2727j63544L4406
$$ -19296 7150 -144616 -156343 -55012 -14325 -87371 -193787 -120651 -67924 -231468 -197062
14045a97062J66196Q5198j2807J8530r8370n8812j04528k822Q2375Q9588J86474
$$ -197062 -30866 54332 41525 60055 -38315 -97127 -201655 -204477 -122102 -32514 153960
14034A53960j6929k7458r8710M2322L6115k005j24993j47957J03679J19509K8392
$$ 153960 137031 109573 10863 53185 89300 87295 -37698 -185655 -81976 37533 65925
14023F5925J15529j660j07022m4687J68519m612j0463l409r9418k5608R0042J6771
$$ 65925 181454 179794 72772 28085 196604 191992 181529 178120 78702 53094 143136 159907
14011A59907o484L0637N4713r3193K745p6898j7978j0526O494Q0885k0270j02225
$$ 159907 153423 184060 238773 145580 148325 71427 53449 42923 49417 130302 110032 7807
13999G807K3592J04901O779J5221N4662m7682O4j41169o5093K7451n8121Q9953
$$ 7807 31399 136300 143079 158300 212962 165280 165344 24175 -40918 -13467 -71588 18365
13987A8365J29493R2988j9480J8950o2415n0059J040j6318J6698L2201o8493m5522
$$ 18365 147858 240846 221366 240316 177901 127842 128882 112564 129262 161463 92970 47448
13975D7448J8875j2736j14302o2202k393L0709J4007R1261P4115P6555p3486P0417
$$ 47448 66323 53587 -60715 -122917 -125310 -94601 -80594 10667 84782 161337 87851 158268
13963A58268l6879q338J31732M0493j0151r8679j81257O3516l9409m3629M8041
$$ 158268 121389 113051 244783 285276 275125 176446 -4811 58705 19296 -24333 23708
13952B3708M6049p937O6748L6947M78L0439K7827J3695o7758r5053j29264M5377
$$ 23708 69757 61820 128568 165515 165993 196432 224259 237954 170196 75143 -54121 -8744
13940h744M2257l882r5373L2343J17384l7787j4725J6243P6512J06382P8533j22102
$$ -8744 33513 29631 -65742 -33399 83985 46198 31473 47716 124228 230610 309143 187041
13928A87041k0276P7521q1q4669j99355k7452J41261M7353P861K146q1980o0523
$$ 187041 166765 244286 244205 159536 -39819 -67271 73990 121343 129204 131350 49370 -11153
13916a1153P4759m5733k5828P5942L3596R843J3573N5538r0011p0141j03361l7373
$$ -11153 63606 17873 -7955 67987 101583 111426 124999 180537 90526 20385 -82976 -120349
13904a20349K2010J31753J6081j6591J00852o3408j20680M0148n2739J4109k4811
$$ -120349 -98339 33414 49495 32904 133756 70348 -50332 -10184 -62923 -48814 -73625
13893g3625J4794P1269R5072J30622m646R103j26862k20713p8551K2211O3472
$$ -73625 -58831 12438 107510 238132 233486 242589 115727 -104986 -183537 -161326 -97854
13882i7854J13198J13042j6468j19944N7930N4850l813k3150L752j9205p0269
$$ -97854 15344 128386 111918 -8026 49904 104754 100941 77791 81543 62338 -7931
13871g931j05240n2392O4092J05906M0904j67097j90621L4564J95186J30296O6956
$$ -7931 -113171 -165563 -101471 4435 45339 -121758 -312379 -277815 -82629 47667 114623
13860A14623o6053r3189k5332P4679M6646k5603j6574K0457l6599N794J29925
$$ 114623 48570 -44619 -69951 4728 51374 25771 9197 29654 -6945 -1151 128774
13849A28774K3905n2746m0462o3420j5062J26721L0886j05484L501j4163K5960
$$ 128774 152679 99933 59471 -3949 -19011 107710 138596 33112 36613 22450 48410
13838D8410O0143L228J15664k2686r8511k9750j9573N2604p7971j22056l1668
$$ 48410 108553 111781 227445 204759 106248 76498 56925 109529 31558 -90498 -122166
13827a22166K7118N7228J50092j634j48821J3403n9426l7405K6849n6627K4859
$$ -122166 -95048 -37820 112272 110638 -38183 -24780 -84206 -121611 -94762 -151389 -126530
13816a26530J11337Q61p4713j8507M7925J11811j0047o4091m7681O7428J32690
$$ -126530 -15193 -14332 -89045 -107552 -59627 52184 42137 -21954 -69635 -2207 130483
13805A30483L0368K3886O4490P1060p3256m3922j60297j05788o3607Q2173J23185
$$ 130483 160851 184737 249227 320287 247031 203109 42812 -62976 -126583 -44410 78775
13794G8775N9813j3895j60509j74637o0399J00179J60727K6550J0125o2947N0014
$$ 78775 138588 124693 -35816 -210453 -270852 -170673 -9946 16604 26729 -36218 13796
13783A3796j09823J5523J20897N2338n047J11724p3333o1264o9468o4979P2586
$$ 13796 -96027 -80504 40393 92731 87684 199408 126075 64811 -4657 -69636 2950
13772B950r8759N0485J58803p4469q3761j0843J27610J10562k2585J3323j15852
$$ 2950 -95809 -45324 113479 39010 -44751 -55594 72016 182578 159993 173316 57464
13761E7464L0012J7365j1464j11618j2797K5558L8520K4536Q1609l8286o5854
$$ 57464 87476 104841 93377 -18241 -31038 -5480 33040 57576 139185 100899 35045
13750C5045J17837J52279j6922p0371j11294K1803N6171p9058M595k2657J1780
$$ 35045 152882 305161 288239 217868 106574 128377 184548 105490 110085 87428 99208
13739I9208M7042k9697m4161j11206n5510Q3999J22283L94m3167J9530r7576n6836
$$ 99208 146250 116553 72392 -38814 -94324 -10325 111958 112352 69185 88715 -8861 -65697
13727f5697l7322K37346J96662r8704j02089J2257R8856j16383j8915m0910q6687
$$ -65697 -103019 134327 330989 232285 130196 142453 241309 124926 106011 65101 -21586
13716b1586K5148P7446q8623r4780p1331J4259Q870L4317K1426J2411q4316L3350
$$ -21586 3562 81008 -7615 -102395 -173726 -159467 -150597 -116280 -94854 -82443 -166759 -133409
13704a33409J42305K8587o395q4435R6606R8051n6950J10929J01608n1538j61969
$$ -133409 8896 37483 31088 -53347 43259 141310 84360 195289 296897 245359 83390
13693H3390m6335N8673Q1963J23858O0020j17916k3330M3871k0995m1399m4929
$$ 83390 37055 95728 177691 301549 361569 243653 220323 264194 243199 201800 156871
13682A56871M8819J19037j14066n4350M3361L5788K8308J3276m3058m0501j0557
$$ 156871 205690 324727 210661 156311 199672 235460 263768 277044 233986 193485 182928
13671A82928n5522o8498M8560O1500j06708k4415J4695p859j2380K2313J16142
$$ 182928 127406 58908 107468 168968 62260 37845 52540 44681 32301 54614 170756
13660A70756j6115L3381n7324j23039q8396m7813K551p5578O7653J2079M1355
$$ 170756 154641 188022 130698 7659 -80737 -128550 -125999 -201577 -133924 -121845 -80490
13649h0490o6229J35153O9000N803M671j1039K1909j2602O9472j25263m4633n337
$$ -80490 -146719 -11566 57434 63237 67908 56869 78778 66176 135648 10385 -34248 -39585
13637c9585M9847L1723m9595k1743j05971r4727J53526N2627L2552o67R8744O9592
$$ -39585 10262 41985 -7610 -29353 -135324 -230051 -76525 -23898 8654 7987 106731 176323
13625A76323J4612J8646m8627m9606p5550p9556n774R5022K02385R2387R4558
$$ 176323 190935 209581 160954 111348 35798 -43758 -49532 45490 247875 340262 434820
13614D34820r4901j40271l8311l1847J35315O023j13144q6229J0772M4683J4562
$$ 434820 339919 199648 161337 129490 264805 270828 157684 71455 82227 126910 141472
13603A41472k4571L3388l8527j09010K2608J6067o9537J1279J4153K36134M262
$$ 141472 116901 150289 111762 2752 25360 41427 -28110 -16831 -2678 233456 237718
13592B37718n1887r0831k6856Q3768Q2172j08830j08691L752l8350J44377N7065
$$ 237718 185831 95000 68144 151912 234084 125254 16563 20315 -18035 126342 183407
13581A83407K0804R14p154J9793J4183N277j05509m8721J8006J3766o0767M6982
$$ 183407 204211 205125 197971 217764 231947 237224 131715 82994 101000 114766 53999 100981
13569A00981J30544R4723N6868j3907M3396l0780n247o9274o6119L9845l4765
$$ 100981 231525 326248 383116 369209 412605 381825 376578 307304 241185 281030 246265
13558B46265Q5145o9639m1895J01270j50588p9076P3568K5373m3734q0928j411
$$ 246265 331410 261771 219876 321146 170558 91482 165050 190423 146689 65761 64350
13547F4350M6612Q2544k0148P111n7957k3257J15282J52619j07007M3384K1492
$$ 64350 110962 193506 173358 180469 122512 99255 214537 367156 260149 303533 325025
13536C25025o9186K4751j08035l6651m7070O7050m8170j08890K8575J45342M9972
$$ 325025 255839 280590 172555 135904 88834 155884 107714 -1176 27399 172741 222713
13525B22713o8810O7763n8997o8098J5627O5091j3241j00598J9772j4587O9158
$$ 222713 153903 221666 162669 94571 110198 175289 162048 61450 81222 66635 135793
13514A35793P6324r3624m0617k162R5101M8608p9079p6410M6692K2822J5545R2724
$$ 135793 212117 118493 77876 75714 170815 219423 140344 63934 110626 133448 148993 241717
13502B41717j71268l0558J3925J2646N2753j4400N1101R672j05576l1199j15870
$$ 241717 70449 39891 53816 66462 119215 104815 155916 165588 60012 28813 -87057
13491h7057Q6035M1911q3220o5020J09604J86155N6398q6426L7151n3741j87654
$$ -87057 -1022 40889 -42331 -107351 2253 188408 244806 158380 195531 141790 -45864
13480d5864q0097P8860L8742M8703k5843L8525R8765j02248N5386O8184K2563
$$ -45864 -125961 -47101 -8359 40344 14501 53026 151791 49543 104929 173113 195676
13469A95676n1554q3005o2326L8118o7500j26523J03066L7546O7648J9125R4732
$$ 195676 144122 61117 -1209 36909 -30591 -157114 -54048 -16502 51146 70271 165003
13458A65003Q046K4841L6491Q810R8922L9572M02j37831j38637P2608L9130P0895
$$ 165003 173049 197890 234381 243191 342113 381685 382087 244256 105619 178227 217357 288252
13446B88252K2550o7127r8964J5728K3434k4140l4158p5415N0777M6680l0899
$$ 288252 310802 243675 144711 160439 183873 159733 125575 50160 100937 147617 116718
13435A16718O261Q3655o106n2037j12913J0925J18931j34747J6023J01825M9566
$$ 116718 122979 206634 200528 148491 35578 46503 165434 30687 46710 148535 198101
13424A98101P7253o8737j39646o2784R0507J17810N7445m6245q5167O927Q743
$$ 198101 275354 206617 66971 4187 94694 212504 269949 223704 138537 145464 154207
13413A54207N4400r2580O4955L5912K5781J3028q8823J8015J31474O4601q4219
$$ 154207 208607 116027 180982 216894 242675 255703 166880 184895 316369 380970 296751
13402B96751j19456l4658n0675p152P8400M2913N3308N8718p6555o3387N0937
$$ 296751 177295 142637 91962 84810 163210 206123 259431 318149 241594 178207 229144
13391B29144k8548q7119p4061J03713K8115k0611l8007j6313p9667j0078Q9086
$$ 229144 200596 113477 39416 143129 171244 150633 112626 96313 16646 6568 95654
13380I5654O8792K7066O0333K3149k3134m7306O2107p7914o5585J28730k0816
$$ 95654 164446 191512 251845 274994 251860 204554 266661 188747 123162 251892 231076
13369B31076j8595l5717N9574P427m8439J3381o9369J3302J3034j7805K2517L5159
$$ 231076 212481 176764 236338 243765 195326 208707 139338 152640 165674 147869 170386 205545
13357B05545m1727n9448n8417M3476N8982j18243m1834R9229J4856j21941O4030
$$ 205545 163818 104370 45953 89429 148411 30168 -11666 87563 102419 -19522 44508
13346D4508N8325Q7381K2154j92108j39311k2319J56978J13356m1650Q1639Q2154
$$ 44508 102833 190214 212368 20260 -119051 -141370 15608 128964 87314 168953 251107
13335B51107M8733n5592k680m5287p4028k4633k3139R0942L1675J6933N7059Q0771
$$ 251107 299840 244248 241568 196281 122253 97620 74481 165423 197098 214031 271090 351861
13323C51861o9979m4140m5913L6385j10737l2300Q4798M0196J01887J18049l5191
$$ 351861 281882 237742 191829 228214 117477 85177 169975 210171 312058 430107 394916
13312C94916m9276n8016o4963l4679j14334p3484Q4130J05852l9696o0231J69828
$$ 394916 345640 287624 222661 187982 73648 164 84294 190146 150450 90219 260047
13301B60047N2071j59010p8999k0107K2175l2706j8040J09896M1822j07991L1327
$$ 260047 312118 153108 74109 54002 76177 43471 25431 135327 177149 69158 100485
13290A00485J44620M4827o9132o1602r457k0955N0807J40682k2563j10368P473
$$ 100485 245105 289932 220800 159198 149741 128786 179593 320275 297712 187344 194817
13279A94817N4986K9721l0640q700J21485n2187k7630N4847L2359K0654p8674
$$ 194817 249803 279524 248884 240184 361669 309482 281852 336699 369058 389712 311038
13268C11038j56700K1722J5384o4658q2898Q089J12444N8562R9455L4406l7252
$$ 311038 154338 176060 191444 126786 43888 51977 164421 222983 322438 356844 319592
13257C19592n1451q3722j21981j10319P0675J15939J17823J9075k9724O4584k8056
$$ 319592 268141 184419 62438 -47881 22794 138733 256556 275631 245907 310491 282435
13246B82435j19424L115L1909J19853J4273j754m1774m5817j0601m6789j12524
$$ 282435 163011 166126 198035 317888 332161 330407 288633 242816 232215 185426 72902
13235G2902J1600l7228n5190J37373O2558L3235m3723L4505o6394l4328N764J07319
$$ 72902 84502 47274 -7916 129457 192015 225250 181527 216032 149638 115310 121074 228393
13223B28393Q2454m8701M3692k9417j27065K7599J0577L2612k9231n8799l8357
$$ 228393 310847 262146 305838 276421 149356 176955 187532 220144 190913 132114 93757
13212I3757Q9714J16713Q9629O1941k64j24205j1954j14859O7947J29444k5091
$$ 93757 183471 300184 389813 451754 451490 327285 315331 200472 268419 397863 372772
13201C72772j10188k72768j07804P2314J56564J13272P5024K475q4971M718L1271
$$ 372772 262584 -10184 -117988 -45674 110890 224162 299186 301661 216690 221408 252679
13190B52679o8200N5111P8500J27372K1374J4655m5511j21490j65887m9262J9294
$$ 252679 184479 239590 318090 445462 466836 481491 435980 314490 148603 99341 118635
13179A18635q4025N3652M1439p2097R1228k7621k7786J28733N703Q349m5387j2195
$$ 118635 34610 88262 129701 57604 148832 121211 93425 222158 227861 236210 190823 178628
13167A78628j7274J73652m5163j10018l3118m8628J18079J13959J0537j03891
$$ 178628 161354 335006 289843 179825 146707 98079 216158 330117 340654 236763
13157B36763p3747K5417J66288K3547l304q5925j07805J1961O106r6663p090j9744
$$ 236763 163016 188433 354721 378268 374964 289039 181234 193195 199301 102638 95548 75804
13145G5804Q3295K13027J4326q5736N693m4244j36379O8515K6513m2571K4067
$$ 75804 159099 372126 386452 300716 306409 262165 125786 194301 220814 178243 202310
13134B02310Q7731n7448j13409J89857J16768p0881n9882O6451J3263R6086l4938
$$ 202310 290041 232593 119184 309041 425809 354928 295046 361497 374760 470846 435908
13123D35908l3505n1177L8952J2325m7528k1120R1442J41134J56053J57247J85372
$$ 435908 402403 351226 390178 402503 354975 333855 425297 566431 722484 879731 1065103
13112A065103J43954J87839K76722K46024J31311J29986J10723J71937P5650p7301
$$ 1065103 1209057 1396896 1673618 1919642 2050953 2180939 2291662 2463599 2539249 2461948
13102B461948M9856j01142k36703j62993j83725k19913j31159j02973j62554j60595
$$ 2461948 2511804 2410662 2173959 2010966 1827241 1607328 1476169 1373196 1210642 1050047
13092A050047n3033j16779j00388j2078n0890k9176n2774m0652O1966L3017N730
$$ 1050047 997014 880235 779847 767769 716879 687703 634929 594277 656243 689260 694990
13081F94990L9997O998Q0278j60719j13790J69432m2940p9248k8642J68798J29186
$$ 694990 734987 741985 822263 661544 547754 717186 674246 594998 566356 735154 864340
13070H64340p3078j34958p708L4589J243q4648j04602k0139n6878j16970L8794
$$ 864340 791262 656304 648596 683185 684428 599780 495178 475039 418161 301191 339985
13059C39985J47574l5966R728J13427K4319j6055k8797K179N7348J9811m4196
$$ 339985 487559 451593 461321 574748 599067 583012 554215 556394 613742 633553 589357
13048E89357K1931R5650m7551j25469N6620J04938K4971M5407K1180k4150l5805
$$ 589357 611288 706938 659387 533918 590538 695476 720447 765854 787034 762884 727079
13037G27079p080o4063p7939K4021N7875K4230L9247m5691p7262L4864J02034
$$ 727079 719999 655936 577997 602018 659893 684123 723370 677679 600417 635281 737315
13026G37315Q121j5125R5815M5045M8800P8445N6202K58249J70346O7853J03808
$$ 737315 745436 730311 826126 871171 919971 998416 1054618 1312867 1483213 1551066 1654874
13015A654874J9679j13328k6136r6796l9726o5330j49399p8981p4801k0571j32935
$$ 1654874 1674553 1561225 1535089 1438293 1398567 1333237 1183838 1104857 1030056 1009485 876550
13004H76550q6329k0744l2486j6858m492j6114K7650Q8741M049j15947l2435R2347
$$ 876550 790221 769477 736991 720133 715641 699527 727177 815918 819967 704020 671585 763932
12992G63932P8501K4112j1257j13091o5588n153M2874M4448r5431k528M9144J8033
$$ 763932 842433 866545 855288 742197 676609 671456 714330 758778 663347 660819 709963 727996
12980G27996m7474j3086J45599J0579K0125o202K1196P975o7177L0918o1006q5646
$$ 727996 680522 667436 813035 823614 843739 837537 858733 866708 799531 830449 769443 683797
12968F83797j735J4608J6084L5132r8474O2242J20217O9607j03627n6112N8404
$$ 683797 682062 696670 712754 747886 649412 711654 831871 901478 797851 741739 800143
12957H00143J7124O4192L5127n8019j36748j2773k558j36465P3011L6004p3419
$$ 800143 817267 881459 916586 858567 721819 709046 706488 570023 643034 679038 605619
12946F05619o5662L8543J22350O7555O1183P4281n328K0707l3989j9638k8077
$$ 605619 539957 578500 700850 768405 829588 903869 898541 919248 885259 865621 837544
12935H37544j7194k1535Q772j51657l8525J40810J24109P663N945m9145r0558
$$ 837544 820350 798815 807587 655930 617405 758215 882324 889987 895932 846787 756229
12924G56229J8665O9559q0748N344P8029n5954P3n7584j2046k0413l6025K3756
$$ 756229 774894 844453 763705 769049 847078 791124 791197 733613 721567 701154 665129 688885
12912F88885n2851k7339N0780l2352r0023N7484J31830O3868O4951j9109n2611
$$ 688885 636034 608695 659475 627123 537100 594584 726414 790282 855233 836124 783513
12901G83513O9612R8956J0342J15780m2887j92724j13189n757P3922m0128J6580
$$ 783513 853125 952081 962423 1078203 1035316 842592 729403 723646 797568 757440 774020
12890G74020l3904j0964m1012p0569J46143L1539n1800N035J08051j676L5190
$$ 774020 740116 729152 688140 617571 763714 795253 743453 748488 856539 854863 890053
12879H90053N2108l7634O8887o5191l7684J82362J21348P236j29740q9134j64980
$$ 890053 942161 904527 973414 908223 870539 1052901 1174249 1181485 1051745 962611 797631
12868G97631p1273O8303M2048L5422M0158M8370J22074j4572k1134k5863k733
$$ 797631 726358 794661 836709 872131 912289 960659 1082733 1068161 1047027 1021164 1018431
12857A018431j3497J36982o11j00036j02427n6099j0636J9671L9258M3848n3770
$$ 1018431 1004934 1141916 1141305 1041269 938842 882743 872107 891778 931036 974884 921114
12846I21114r3063o2746J44134J27490J05043J23913J06931J69490R1733J8420
$$ 921114 828051 765305 909439 1036929 1141972 1265885 1372816 1542306 1634039 1652459
12836A652459l6393k5942M6384J33440R9580J9699o8421K367K2343j6381k2477
$$ 1652459 1616066 1590124 1636508 1769948 1869528 1889227 1820806 1823173 1845516 1829135 1806658
12825A806658n4760o6807K3334j25914j82621O6572J03604N1876R1158M8030o3048
$$ 1806658 1751898 1685091 1708425 1582511 1399890 1466462 1570066 1621942 1713100 1761130 1698082
12814A698082q4947Q8432K9291M5285R3415J59284m0575r4024r3638N1931l9317
$$ 1698082 1613135 1701567 1730858 1776143 1869558 2028842 1988267 1894243 1800605 1852536 1813219
12803A813219O0074J32088j57P6721K09051J2197j3357l9677q6333Q4410P5978
$$ 1813219 1873293 2005381 2005224 2081945 2290996 2303193 2289836 2250159 2163826 2248236 2324214
12792B324214l9055j06094L8244R6463J11627J3376r3364j9147K04R2487P0730
$$ 2324214 2285159 2179065 2217309 2313772 2425399 2438775 2345411 2326264 2326468 2418955 2489685
12781B489685k5722k8267L9567L959Q3974L2679k3846N7593R9749j3662M6934
$$ 2489685 2463963 2435696 2475263 2479222 2563196 2595875 2572029 2629622 2729371 2715709 2762643
12770B762643Q7506R4663m0538j77034Q7986J16042K6078P3746N4079k5147l3569
$$ 2762643 2850149 2944812 2904274 2727240 2815226 2931268 2957346 3031092 3085171 3060024 3026455
12759C026455p8482J44956J63356M9036M4945J4240O12J33469K1648M7916R4505
$$ 3026455 2947973 3092929 3256285 3305321 3350266 3364506 3365118 3498587 3520235 3568151 3662656
12748C662656L17048J27748j7946K22793K69778J95146K11223K62247K28921K95847
$$ 3662656 3979704 4107452 4089506 4312299 4582077 4777223 4988446 5250693 5479614 5775461
12738E775461L86144M69353N45007M52891O59861R05969J057324J078961J249893
$$ 5775461 6161605 6630958 7175965 7628856 8288717 9194686 10252010 11330971 12580864
12729A2580864J618444J799110J992311K125510K326818K484796K577820K997375
$$ 12580864 14199308 15998418 17990729 20116239 22443057 24927853 27505673 30503048
12721C0503048L319356L732861M609643N839416P593243J0133313J3527983J7718773
$$ 30503048 33822404 37555265 42164908 48004324 55597567 65730880 79258863 96977636
12713I6977636K2723744K7808366L2560160L6860258M0100100M1124405L9682445
$$ 96977636 119701380 147509746 180069906 216930164 257030264 298154669 337837114
12706C37837114L5112864K8072078J9136987Q907829k445368j3771531k3833087
$$ 337837114 372949978 401022056 420159043 429066872 426621504 412849973 389016886
12699C89016886l1397819l6135998l8618464l8792811l6380045l2344467k6964303
$$ 389016886 357619067 321483069 282864605 244071794 207691749 175347282 148382979
12692A48382979k1558835j6409876j2008355q245597n064874k953192j548177
$$ 148382979 126824144 110414268 98405913 90160316 85095442 82142250 80594073
12685H0594073m01306L08045P23164J079438J498251J759317J759288J652383
$$ 80594073 80192767 80500812 81223976 82303414 83801665 85560982 87320270 88972653
12677H8972653J316964P74629J83629m90586j394982k336468l063451l599326
$$ 88972653 90289617 91064246 91247875 90757289 89362307 87025839 83962388 80363062
12669H0363062l946798m345640m506948m316266m106654l765246l426807l131293
$$ 80363062 76416264 72070624 67563676 63247410 59140756 55375510 51948703 48817410
12661D8817410k738067k262132k057643j954695j858066j600152j486324j348836
$$ 48817410 46079343 43817211 41759568 39804873 37946807 36346655 34860331 33511495
12653C3511495j323389j204128j140053j046569j025195q93796q13041q52215
$$ 33511495 32188106 30983978 29843925 28797356 27772161 26878365 26065324 25213109
12645B5213109r31311q94456p84034p01043p62470p89007o90395o38570o48016
$$ 25213109 24281798 23387342 22603308 21902265 21139795 20350788 19660393 19021823 18373807
12636A8373807m21054l29489m56467o87879n49741m37041l66300m00653m10834
$$ 18373807 17952753 17623264 17166797 16478918 15929177 15492136 15125836 14725183 14314349
12627A4314349l28340l20228l38074k59245k48374l85590l43049l45745l51689
$$ 14314349 13986009 13665781 13327707 13068462 12820088 12434498 12091449 11745704 11394015
12618A1394015k68932k01870l51407k24767j76739k27676n3152k55055l23468
$$ 11394015 11125083 10923213 10571806 10347039 10170300 9942624 9889472 9634417 9310949
12609I310949j95201l6194j61468k27755j44986j14361p5065j42679j33076J4772
$$ 9310949 9115748 9079554 8918086 8690331 8545345 8430984 8355919 8213240 8080164 8094936
12599H094936l7308j85329j91574j93657n0873J05525q8807j97333j31993j49026
$$ 8094936 8057628 7872299 7680725 7487068 7436195 7541720 7452913 7255580 7123587 6974561
12589F974561j28146q8994n8533q442j44307J417p578j1909o7110n0729j00392
$$ 6974561 6846415 6757421 6698888 6690446 6546139 6547556 6539978 6528069 6460959 6410230 6309838
12578F309838j72213p0059o8017o3482K25667N6825k23628j48423q4577j54732
$$ 6309838 6137625 6067566 5999549 5936067 6161734 6218559 5994931 5846508 5761931 5607199
12568E607199M348l296m3511q8896r5493K6935J02107j11530K7530K20934k0850
$$ 5607199 5611547 5608251 5564740 5475844 5380351 5407286 5509393 5397863 5425393 5646327 5625477
12557E625477j08532j08888j64337j50182j27446L795j5378r7466l3756n8268
$$ 5625477 5516945 5408057 5243720 5093538 4966092 4969887 4954509 4857043 4823287 4765019
12547D765019K9447J027l5365o1710o4938q7207k2563l1231l1158K4006o2724
$$ 4765019 4794466 4795493 4760128 4698418 4633480 4546273 4523710 4492479 4461321 4485327 4422603
12536D422603j3290N8726m9081o1660r9358J4156J80235L3029j60048l0836J59097
$$ 4422603 4409313 4468039 4418958 4357298 4257940 4272096 4452331 4485360 4325312 4294476 4453573
12525D453573J01655J04032L3474N1616j1244K9520M7348P4204J21863J1684P2145
$$ 4453573 4555228 4659260 4692734 4744350 4733106 4762626 4809974 4884178 5006041 5017725 5089870
12514E089870n449m8977q186J02038L4983M9960j2387R5693K8733P9071M6692
$$ 5089870 5084421 5035444 5027258 5129296 5164279 5214239 5201852 5297545 5326278 5405349 5452041
12503E452041O5335L4185J0364J3187R6528J52517l7817O918L0868J12244L7109
$$ 5452041 5517376 5551561 5561925 5575112 5671640 5824157 5786340 5793258 5824126 5936370 5973479
12492E973479J31444K09246M0890j1329K609M9957L9253K1790J09305L2046O8176
$$ 5973479 6104923 6314169 6355059 6343730 6346339 6396296 6435549 6457339 6566644 6598690 6666866
12481F666866M6409J30859L5912R703P0040J39978J12701J58950J27732M7936
$$ 6666866 6713275 6844134 6880046 6889749 6959789 7099767 7212468 7371418 7499150 7547086
12471G547086k9484P0830J01468J13571J29697K06918O7206J51009J96056J51149
$$ 7547086 7517602 7588432 7689900 7803471 7933168 8140086 8207292 8358301 8554357 8705506
12461H705506J58154j2469J04446K05335J47490J17614N5171J39986J09200N9768
$$ 8705506 8863660 8851191 8955637 9160972 9308462 9426076 9481247 9621233 9730433 9790201
12451I790201J72214J88180J61849K05958K01049J15779J23020K77037K54095
$$ 9790201 9962415 10150595 10312444 10518402 10719451 10835230 10958250 11235287 11489382
12442A1489382K74533J35162K75627L55049Q9507J83169K28057K30066K19671
$$ 11489382 11763915 11899077 12174704 12529753 12619260 12802429 13030486 13260552 13480223
12433A3480223L08429K95437K62882K65533L98184K57095L42570L55606K70552
$$ 13480223 13788652 14084089 14346971 14612504 15010688 15267783 15610353 15965959 16236511
12424A6236511K93959K75819L66500L88419M27456M33159M18557L97058L98746
$$ 16236511 16530470 16806289 17172789 17561208 17988664 18421823 18840380 19237438 19636184
12415A9636184M69184N40169M40723M28752M88992M35403N11755O02531N93673
$$ 19636184 20105368 20645537 21086260 21515012 22004004 22439407 22951162 23553693 24147366
12406B4147366O37845P04121O20046P25319P74499P13081P21435P31270P38521
$$ 24147366 24785211 25489332 26109378 26834697 27609196 28322277 29043712 29774982 30513503
12397C0513503P71783R48070Q96838Q96276J002334J121602J030315R79266R62603
$$ 30513503 31285286 32233356 33130194 34026470 35028804 36150406 37180721 38159987 39122590
12388C9122590J063742J042623J142278J260025J295494J419229J433881J346867
$$ 39122590 40186332 41228955 42371233 43631258 44926752 46345981 47779862 49126729
12380D9126729J395542J623619J549918J424534J339858J578055J595973J490700
$$ 49126729 50522271 52145890 53695808 55120342 56460200 58038255 59634228 61124928
12372F1124928J790923J726293J696017J573964J712264J588137J659933J578966
$$ 61124928 62915851 64642144 66338161 67912125 69624389 71212526 72872459 74451425
12364G4451425J541507J376856J306198J320755J265814J169478J144661J138273
$$ 74451425 75992932 77369788 78675986 79996741 81262555 82432033 83576694 84714967
12356H4714967Q57566P79614O71197N92043N69839L63247J41440Q2851O4763o7087
$$ 84714967 85572533 86352147 87023344 87615387 88185226 88548473 88689913 88772764 88837527 88770440
12346H8770440k10650l85867m06504n57694n90348o09127p18706q60161q73353
$$ 88770440 88559790 88173923 87767419 87209725 86619377 86010250 85291544 84431383 83558030
12337H3558030j059696r74245r03265r51443j075341j226135j158274j025640
$$ 83558030 82498334 81524089 80620824 79669381 78594040 77367905 76209631 75183991
12329G5183991j089885j084410j080381j206313j169372j289180j150849j146068
$$ 75183991 74094106 73009696 71929315 70723002 69553630 68264450 67113601 65967533
12321F5967533j220361j218278j189682j066106r77380r85404r88514j022293
$$ 65967533 64747172 63528894 62339212 61273106 60295726 59310322 58321808 57299515
12313E7299515j039551j121214j131896r87484r96682r88912q35697p20528q43985
$$ 57299515 56259964 55138750 54006854 53019370 52022688 51033776 50198079 49477551 48633566
12304D8633566p28750p77335p50133p19185q00259p72973p10018r42885q67329
$$ 48633566 47904816 47127481 46377348 45658163 44857904 44084931 43374913 42432028 41564699
12295D1564699p87100q73074r94870q78190r34500j084366r63804q23863q88778
$$ 41564699 40777599 39904525 38909655 38031465 37096965 36012599 35048795 34224932 33336154
12286C3336154q22950o58235o31679o69442o65758o64405n18657n99916o34774
$$ 33336154 32513204 31854969 31223290 30553848 29888090 29223685 28705028 28105112 27470338
12277B7470338m84528n64631l75957l39538n35699o65514n48979m35379m50516
$$ 27470338 26985810 26421179 26045222 25705684 25169985 24504471 23955492 23520113 23069597
12268B3069597m44675n35093m00979l35524l84356l39559l50998m80300m85958
$$ 23069597 22624922 22089829 21688850 21353326 20968970 20629411 20278413 19798113 19312155
12259A9312155k51137k97033k71980l67950l40506l41635l04420l15351m03797
$$ 19312155 19061018 18763985 18492005 18124055 17783549 17441914 17137494 16822143 16418346
12250A6418346k64272j93938l50966k78297j23480l21415k29613k06147k98176
$$ 16418346 16154074 15960136 15609170 15330873 15207393 14885978 14656365 14450218 14152042
12241A4152042k27870l68572k13244k48616j72830k10051k68929j48299k38364
$$ 14152042 13924172 13555600 13342356 13093740 12920910 12710859 12441930 12293631 12055267
12232A2055267j69992k14327j95255k17317k06088k37824j98679j79839k01944
$$ 12055267 11885275 11670948 11475693 11258376 11052288 10814464 10615785 10435946 10234002
12223A0234002j61896p5478j29997j78823j29526j21562p2651j57986j58499j52130
$$ 10234002 10072106 9996628 9866631 9687808 9558282 9436720 9364069 9206083 9047584 8895454
12213H895454n5339j05907j75156n2076n2662j99118k04159k11589k07550j01370
$$ 8895454 8840115 8734208 8559052 8506976 8454314 8255196 8051037 7839448 7631898 7530528
12203G530528k0948j25193j30081m3563j05497j95049n6570O8831r4595k00778
$$ 7530528 7509580 7384387 7254306 7210743 7105246 6910197 6853627 6922458 6827863 6627085
12193F627085m8585N7285p2575j40626j13517o0842j01402q2823o9519j09656
$$ 6627085 6578500 6635785 6563210 6422584 6309067 6248225 6146823 6064000 5994481 5884825
12183E884825l7715j21061j01751j4625K4760r8594r1310j51702j28993J8488
$$ 5884825 5847110 5726049 5624298 5609673 5634433 5535839 5444529 5292827 5163834 5182322
12173E182322m8043j01599j37915r0922j14879n2064m058r3355q7138j19861j56929
$$ 5182322 5134279 5032680 4894765 4803843 4688964 4636900 4632842 4539487 4452349 4332488 4175559
12162D175559l0914m1154p539m796M7209m7429j9209J23094j8512j57261j59053
$$ 4175559 4144645 4103491 4095952 4091156 4138365 4090936 4071727 4194821 4176309 4019048 3859995
12151C859995L8155O586j68341o9878q1845p1380N2567J19250l3603r7381j15544
$$ 3859995 3898150 3904736 3736395 3666517 3584672 3513292 3565859 3685109 3651506 3554125 3438581
12140C438581o1166M8299K2544K9238J3511L4692k478r2106q9998J8977P4186
$$ 3438581 3377415 3425714 3448258 3477496 3491007 3525699 3523221 3431115 3341117 3360094 3434280
12129C434280M6489N2055J08716m7578q1329N8494J43763P6682o8007o0744m4524
$$ 3434280 3480769 3532824 3641540 3593962 3512633 3571127 3714890 3791572 3723565 3662821 3618297
12118C618297p4303r4224k4011j25544j65853k4691o7644M6158K13104Q4352l3728
$$ 3618297 3543994 3449770 3425759 3300215 3134362 3109671 3042027 3088185 3301289 3385641 3351913
12107C351913N6309J59750k6880k2148l5243q1016j40337o1816o4164j23219o8757
$$ 3351913 3408222 3567972 3541092 3518944 3483701 3402685 3262348 3200532 3136368 3013149 2944392
12096B944392j26514j47728p9913k3811j07879n7160p675p5990o2986k2598N3042
$$ 2944392 2817878 2670150 2590237 2566426 2458547 2401387 2393712 2317722 2254736 2232138 2285180
12085B285180O6154j14904j04081n231n2133n6044O7914J03414n3652l8672n487
$$ 2285180 2351334 2236430 2132349 2127118 2074985 2018941 2086855 2190269 2136617 2097945 2092458
12074B092458o2423O308p941R862o036L4888j0227m0007j92757j75102O2962O1724
$$ 2092458 2030035 2036343 2028402 2038264 2032228 2067116 2056889 2016882 1824125 1649023 1711985 1773709
12062A773709K1013N9511l8160m9219M8773N8839L0475j59764j16041L0850M778
$$ 1773709 1794722 1854233 1816073 1766854 1815627 1874466 1904941 1745177 1629136 1659986 1664764
12051A664764J00959Q15r9485k5971Q5719L4890Q7656j2608j80991j20174n6310
$$ 1664764 1765723 1766538 1667053 1641082 1726801 1761691 1849347 1836739 1655748 1535574 1479264
12040A479264r4820M5212P1777J7329K1965K6932n2800m9328k244L1760j4864
$$ 1479264 1384444 1429656 1501433 1518762 1540727 1567659 1514859 1465531 1463287 1495047 1480183
12029A480183j808p4768K5307O8912Q4681j12406j46549l7151M9676p2087m3366
$$ 1480183 1478375 1403607 1428914 1497826 1582507 1470101 1323552 1286401 1336077 1263990 1220624
12018A220624Q1433M2152j7130K326j26130o6414J28073r5922n7645j51518O9157
$$ 1220624 1302057 1344209 1327079 1329405 1203275 1136861 1264934 1169012 1111367 959849 1029006
12007A029006M1725o7575p7752J30057J73277K2870l5428n3415j25475n7906N4627
$$ 1029006 1070731 1003156 925404 1055461 1228738 1251608 1216180 1162765 1037290 979384 1034011
11996A034011J26979o6461L9185j2133r0969q4535m184N1370N4330L5813n4430
$$ 1034011 1160990 1094529 1133714 1121581 1030612 946077 941893 993263 1047593 1083406 1028976
11985A028976o4459m7506l5162Q5274M416L8140J10630M9626n7933j01935m1419
$$ 1028976 964517 917011 881849 967123 971539 1009679 1120309 1169935 1112002 1010067 968648
11974I68648L978R0444M8461n0817k9515r4460L8238k0918m1986Q3014k6343L6765
$$ 968648 972626 1063070 1111531 1060714 1031199 936739 974977 954059 912073 995087 968744 1005509
11962A005509J43467M6997n4543r668n0893o4037j26323j9589M0704p269Q0040
$$ 1005509 1148976 1195973 1141430 1131762 1080869 1016832 890509 870920 911624 904355 984395
11951I84395Q9427j01420o2274p4777L8897j7808Q7214J7623o9531j84547o1965
$$ 984395 1073822 972402 910128 835351 874248 856440 943654 961277 891746 707199 645234
11940F45234P9009P3018O2462L0168j4555n5096m4873O1162N8971p7591j11535
$$ 645234 724243 797261 859723 889891 875336 820240 775367 836529 895500 817909 706374
11929G06374m4119o662j3893N7131Q7291O1098m0033j65856L8098K7303q5190
$$ 706374 662255 655593 641700 698831 786122 847220 807187 641331 679429 706732 621542
11918F21542O3170O0940r5016j80449J6013J49145N8532K7992P0176J7491m7658
$$ 621542 684712 745652 650636 470187 486200 635345 693877 721869 792045 809536 761878
11907G61878n4931o6399r0803o0281J3530J17347N3212Q8438K9892q8405k6549
$$ 761878 706947 640548 549745 489464 502994 620341 673553 761991 791883 703478 676929
11896F76929k1998m7609l5908J4349J3193j5566k1739R4879P9690k3017l4012
$$ 676929 654931 607322 571414 585763 598956 583390 561651 656530 736220 713203 679191
11885F79191P0610R5660l5965j32163j05917K0215O4594o4089n3833j34448j8388
$$ 679191 749801 845461 809496 677333 571416 591631 656225 592136 538303 403855 385467
11874C85467J31832n466k8522N4960K4438q8049J6847m3664l8190J07416K0761
$$ 385467 517299 511833 483311 538271 562709 474660 491507 447843 409653 517069 537830
11863E37830J7189o0375o192Q4191J07235J9619J1164K5575j89283j51677r768
$$ 537830 555019 494644 488452 572643 679878 699497 710661 736236 546953 395276 385508
11852C85508J53893Q3214N1734J1905J15132R9718m6797j42732j1320Q0014n0635
$$ 385508 539401 622615 674349 686254 801386 901104 854307 711575 700255 780269 729634
11841G29634j45416Q923j42644m1039Q4309j4922R940K6593J9732j63792q74Q6933
$$ 729634 584218 593141 450497 409458 493767 478845 488785 515378 535110 371318 370444 457377
11829D57377L3729O4552M2572L7978p3046j50561k388j7742N2412J58224q0469
$$ 457377 491106 555658 598230 636208 563162 412601 410213 392471 444883 603107 522638
11818E22638j09218N07j08760J5328N5315K1538M0042j235m3737n5781k6623k3555
$$ 522638 413420 413927 305167 320495 375810 397348 437390 436155 392418 336637 310014 286459
11806B86459J25001R3380r9760r7697J0452L1685J87942P0044n7449O223N0568
$$ 286459 411460 504840 405080 307383 317835 349520 537462 607506 550057 556280 606848
11795F06848n2082o9016P8899Q0491p0933n1311j6952j44838o1341Q1634o7847
$$ 606848 554766 485750 564649 645140 574207 522896 505944 361106 299765 381399 313552
11784C13552o1627M3915o0467n8582P7072M2206L1028J44535r784k24520j09786
$$ 313552 251925 295840 235373 176791 253863 296069 327097 471632 461848 237328 127542
11773A27542j1149J26872R1511m533m8161J6696N1147o1545J3733l6415L3498
$$ 127542 116393 243265 334776 330243 282082 298778 349925 288380 302113 265698 299196
11762B99196L978n3780K4756K5273p851p7185m0732J9041J16553M2788Q2802M4405
$$ 299196 303174 249394 274150 299423 291572 214387 173655 192696 309249 352037 434839 479244
11750D79244j18386j14263k8583l7931M306J051R615J02491Q4514J0700j6509
$$ 479244 360858 246595 218012 180081 184387 185438 195053 297544 382058 392758 376249
11739C76249n1763J6519L9737o6261Q6983O7528j67903p7314r399Q6163p8957
$$ 376249 324486 341005 380742 314481 401464 468992 301089 223775 214376 300539 221582
11728B21582q930Q7801k838N4727J0175K2495O4868r8392l0852J44204Q1658j94363
$$ 221582 212652 300453 297615 352342 362517 385012 449880 351488 320636 464840 546498 352135
11716C52135r229J68100k33350j45590j80483J36645M3756n4510j8469K15J22974
$$ 352135 342906 511006 277656 132066 -48417 88228 131984 77474 59005 59220 182194
11705A82194N8797r8735q6724J5998J86290K2452r2897q3993m8204N9470K4819
$$ 182194 240991 142256 55532 71530 257820 280272 187375 103382 55178 114648 139467
11694A39467L2260n8413j22185m8698J62100Q6859N599L0630J9768o2991k5510
$$ 139467 171727 113314 -8871 -57569 104531 191390 196989 227619 247387 184396 158886
11683A58886J23136M648n9060j6315J0703K037J5400q7938M8075J6792J50635
$$ 158886 282022 286670 227610 211295 221998 224035 239435 151497 199572 216364 366999
11672C66999n6888j92414j43753R3626J03608R1519K8896j23437k3793O5173n029
$$ 366999 310111 117697 -26056 67570 171178 262697 291593 168156 144363 209536 204507
11661B04507j22062L4964K7939L784M2590M0445K0529N8648k2595l0478R4190
$$ 204507 82445 117409 145348 149132 191722 232167 252696 311344 288749 258271 352461
11650C52461K9733n8127l4532j35734p5898L1737l1949J12544j8839j04905J1343
$$ 352461 382194 324067 289535 153801 77903 109640 77691 190235 171396 66491 77834
11639G7834Q2435K8545q7116n1407K3555R6525M3459L8003K1104Q586l3299k6187
$$ 77834 160269 188814 101698 50291 73846 170371 213830 251833 272937 281523 248224 222037
11627B22037n6876K310L8086P4465r9173J68135k2072j55714j21641j20188J8232
$$ 222037 165161 167471 205557 280022 180849 348984 326912 171198 49557 -70631 -52399
11616e2399J04787J08436j09521j6132J02736p162k0688P1573M0739k5030p0578
$$ -52399 52388 160824 51303 35171 137907 130745 110057 181630 222369 197339 126761
11605A26761o3491o6701K6905J34349J72758l9103j76295j14055P5562J23613
$$ 126761 63270 -3431 23474 157823 330581 291478 115183 1128 76690 200303
11595B00303n0183j04073J7949m2197l8044l0526J828L3406n6789l0556J29162
$$ 200303 150120 46047 63996 21799 -16245 -46771 -44943 -11537 -68326 -98882 30280
11584C0280r3681j25541L1584J30451K03945L5444j05739q2681L8204J43011L8146
$$ 30280 -63401 -188942 -157358 -26907 177038 212482 106743 24062 62266 205277 243423
11573B43423l2012q6425K3434J08243j4610J38170j3887j41829j3332m3611P699
$$ 243423 211411 124986 148420 256663 242053 380223 366336 224507 211175 167564 175263
11562A75263L8726M0390K1774O8578j18134j89921j04643O4722P563J26893J72328
$$ 175263 213989 254379 276153 344731 226597 36676 -67967 -3245 4318 131211 303539
11551C03539Q3922j20935q0771m5294p5389k2199J0039n4506R3854P4019N0400
$$ 303539 387461 266526 185755 140461 65072 42873 52912 -1594 92260 166279 216679
11540B16679j1158k5884L273M0084p6816J7768J98474J74790r3289j61697j89022
$$ 216679 205521 179637 182910 222994 146178 163946 362420 537210 443921 282224 93202
11529I3202k3676j29390p839J91273M7844K2807l4401O3121P282q7203O323j0084
$$ 93202 69526 -59864 -67703 123570 171414 194221 159820 222941 230223 143020 149343 139259
11517A39259n7838j835n8706m4671N5446J14743N138q8499J47536L8873p3187
$$ 139259 81421 79586 20880 -23791 31655 146398 151536 63037 210573 249446 176259
11506A76259o1284r0076Q3248O0821l5838M1148M0959k9903l3369J01708M5726
$$ 176259 114975 24899 108147 168968 133130 174278 215237 185334 151965 253673 299399
11495B99399j65798j0402j07618k2806Q855N9429L70n7597n1394o7634J7205Q5447
$$ 299399 133601 123199 15581 -7225 1630 61059 61429 3832 -47562 -115196 -97991 -12544
11483a2544R0532J9212J8320m5024l4789q765J2962L367R5871M6115N0526R9067
$$ -12544 77988 97200 115520 70496 35707 26942 39904 43271 139142 185257 235783 334850
11471C34850M2568o0139q9733J6361j1396j49476k6582J11509K5347r0737Q0179
$$ 334850 377418 317279 227546 243907 232511 83035 56453 167962 193309 102572 182751
11460A82751q1957Q1769Q3029L7828K0917j24538r7833l8800K582J31141M2980
$$ 182751 100794 182563 265592 303420 324337 199799 101966 63166 65748 196889 239869
11449B39869Q772k9660K3052n5976J0141M3656L919j16774n7990N6165M842k2470
$$ 239869 248641 218981 242033 186057 196198 239854 243773 126999 69009 125174 130016 107546
11437A07546l2358J34834K6898m0900n5705k3305L2720J7377M1756l2693j40905
$$ 107546 75188 210022 236920 196020 140315 117010 149730 167107 208863 176170 35265
11426C5265l0220o5942K5067m27J02282N4884J05887M3630o3922p6322N150O8886
$$ 35265 5045 -60897 -35830 -36257 66025 120909 226796 270426 206504 130182 135332 204218
11414B04218J51993o592o6683j34822n6253m7764n9667q6444l841p0709M0938
$$ 204218 356211 349619 282936 148114 91861 44097 -15570 -102014 -105855 -176564 -135626
11403a35626P5316M346k2263P5006P4094N3175L6188L5635j48905N4055J0073
$$ -135626 -60310 -55964 -78227 -3221 70873 124048 160236 195871 46966 101021 111094
11392A11094j2055O639O58L3543j3895q028m5622O8904L8075M5030l9193q2003
$$ 111094 99039 105678 106336 139879 125984 117956 72334 141238 179313 224343 185150 103147
11380A03147o9407l1126R7995j1063n2925N745J32605K6166N2328M0308q0198
$$ 103147 33740 2614 100609 89546 36621 42366 174971 201137 253465 293773 213575
11369B13575j15377J3428M7962m6191m9468n6454o9866l2979M5039P8301K7874
$$ 213575 98198 111626 159588 113397 63929 7475 -62391 -95370 -50331 27970 55844
11358E5844L4807o8683m5229O8580Q237j03690l6792J19785K43109R9198q9952
$$ 55844 90651 21968 -23261 45319 53556 -50134 -86926 32859 275968 375166 285214
11347B85214j02769p0007q0070N2503N140k4073P5069L0297P1764j77074n1629
$$ 285214 182445 112438 32368 84871 90011 65938 141007 171304 243068 65994 14365
11336A4365J22447p6748j73680l1025P7348N8361O3934j04084N7307J2052K02380
$$ 14365 136812 60064 -113616 -144641 -67293 -8932 55002 -49082 8225 20277 222657
11325B22657J53999r2372o6592o2535k5417o565L2474k6433n5820R283k3853Q0109
$$ 222657 376656 284284 217692 155157 129740 123175 155649 129216 73396 82679 58826 138935
11313A38935Q4111K7452j11072o379p3031m1367N9408N4978J25996L6209o931
$$ 138935 223046 250498 139426 133047 60016 18649 78057 133035 259031 295240 288309
11302B88309j10309j22220p9434N4374J60194L5481m0761n2027j861k3915j7739
$$ 288309 178000 55780 -23654 30720 190914 226395 185634 133607 131746 107831 90092
11291I0092P421o6398k1986J7811q1029q4037l9259j05518J25496P625l0391J82486
$$ 90092 97513 31115 9129 26940 -54089 -138126 -177385 -282903 -157407 -149782 -180173 2313
11279B313J18430l5996n6441j10743K5247R311K3837n8207m9485P0769k085O3839
$$ 2313 120743 84747 28306 -82437 -57190 -47879 -24042 -82249 -131734 -60965 -63050 789
11267G89N5363R1037j46354o5856J91551M2960p1672l7614K8440J14205J6814
$$ 789 56152 147189 835 -65021 126530 169490 97818 60204 88644 202849 219663
11256B19663k4225j3334l6499n4124n2797O7825Q5754n4479k6567P947j9010o6227
$$ 219663 195438 182104 145605 91481 38684 106509 192263 137784 111217 119164 100154 33927
11244C3927P7011m6280l0341k1052l4848J01931L2907o7976k7823o7078Q158j9215
$$ 33927 110938 64658 34317 13265 -21583 80348 113255 45279 17456 -49622 -41464 -60679
11232f0679L136K4580O1558P4311M0926O0083p3126j71010j17795k9790J44213
$$ -60679 -57543 -32963 28595 102906 143832 203915 130789 -40221 -158016 -187806 -43593
11221d3593P4100r4577J1326k914J759k5753K9082Q1445R8072J19242j1550q5420
$$ -43593 30507 -64070 -52744 -55658 -53899 -79652 -50570 30875 128947 248189 236639 151219
11209A51219p365k4545J6989m4848k5784r9378l081P3001K3086m759J2509m0065
$$ 151219 143854 119309 136298 91450 65666 -33712 -36793 36208 59294 54535 67044 26979
11197B6979J64061J19175j0652k52953k19992K3489J27960j6898m7342P9171P0997
$$ 26979 191040 310215 299563 46610 -173382 -149893 -21933 -38831 -86173 -7002 63995
11186F3995m4044k2455r4840j0807K893O7715J37629q382l2354k7454r9730j2801
$$ 63995 19951 -2504 -97344 -108151 -105258 -37543 100086 91704 59350 31896 -67834 -80635
11174h0635L9420J02685N339l7537L4011j4782L4809M3085J0606j08774n1434
$$ -80635 -41215 61470 66809 29272 63283 48501 83310 126395 137001 28227 -23207
11163b3207R1199J29022l6245o9480j3228o0478m0002O9176L4178Q98j5623p27
$$ -23207 67992 197014 160769 91289 78061 17583 -22419 46757 80935 81833 66210 65483
11151F5483K5391l366r9762l7245r1774J403L9334R8908M7260N3229j0751O0393
$$ 65483 90874 87508 -12254 -49499 -141273 -139870 -100536 -1628 45632 98861 88110 148503
11139A48503m71k3272p2949L2009j07792n7866L0828J43906J6989L8388O9835
$$ 148503 148032 124760 51811 83820 -23972 -81838 -51010 92896 109885 148273 218108
11128B18108L4378p6132n2343l3240K471j3832k2579N0279r58k8562n1373n1605
$$ 218108 252486 176354 124011 90771 93242 79410 56831 107110 106152 77590 26217 -25388
11116b5388l1498j13068J0127J05423J07586o9748q1785J2446K16745J84886j21616
$$ -25388 -56886 -169954 -159827 -54404 53182 -16566 -98351 -85905 130840 315726 194110
11105A94110k2010j72078r0929N8707k3382r3427O044J09684R1958q4887k3282
$$ 194110 172100 22 -90907 -32200 -55582 -149009 -142965 -33281 58677 -26210 -49492
11094d9492N8804J85630O4181M5829j24134j5046O114J07001p1869l9806O2171
$$ -49492 9312 194942 259123 304952 180818 165772 171886 278887 207018 167212 229383
11083B29383J6091n2086j14l2443N651k1703m4324l6732R6897J14888j51604n5916
$$ 229383 245474 193388 193274 160831 166482 144779 100455 63723 160620 275508 123904 67988
11071F7988R3213P5785K1761m5025l9550N6066p0269p3365l1601L939J34274l0506
$$ 67988 161201 236986 258747 213722 174172 230238 159969 86604 55003 58942 193216 162710
11059A62710p2542K0588M8443j003l3344N5199P6525q0704l4530o1626j51099
$$ 162710 90168 110756 159199 158196 124852 180051 256576 175872 141342 79716 -71383
11048g1383R0506M4503Q7507m0826j9200J44730O4379q6988p8457k4488O1714
$$ -71383 19123 63626 151133 110307 91107 235837 300216 213228 134771 110283 171997
11037A71997l4491n5683J7619M3956m8381L494j00916o4536L7643J09342L7613
$$ 171997 137506 81823 99442 143398 95017 98511 -2405 -66941 -29298 80044 117657
11026A17657m5287j4K9359K1747M1910N0527J1727j16022m4236o653j57563J273
$$ 117657 72370 72356 101715 123462 165372 215899 227626 111604 67368 60715 -96848 -95575
11014i5575J38880l3610N795o3100j99R0087J1175p1332j28213m0025J16844N4250
$$ -95575 43305 9695 15490 -47610 -47809 42278 53453 -17879 -146092 -186117 -69273 -15023
11002a5023r6465K9250L8239M1479l2990j5920J14263k7477k8536j2940j1530
$$ -15023 -111488 -82238 -43999 -2520 -35510 -51430 62833 35356 6820 -6120 -17650
10991a7650j20406r6144O2404P7992R2226M3799p9190m0375L6141P2750O1191
$$ -17650 -138056 -234200 -171796 -93804 -1578 42221 -36969 -77344 -41203 31547 92738
10980I2738K9810j90948j77656P2423J08599N8607J4616k8557m3590P4371n811
$$ 92738 122548 -68400 -246056 -173633 -65034 -6427 8189 -20368 -63958 10413 4602
10969D602M277m8812J17130p6202l8697N502j1485j876n9955K122L635N9602m2589
$$ 4602 8879 -39933 77197 995 -37702 -32200 -43685 -45561 -105516 -103394 -99759 -40157 -82746
10956h2746R4602R0476O1178K7241j16905j10389n5665J0109P8299o834l1822
$$ -82746 11856 102332 163510 190751 73846 -36543 -92208 -82099 -3800 -10634 -42456
10945d2456J04273J58055l406p2461l9146n8464O49Q884j08160J04K776P6198
$$ -42456 61817 219872 216466 144005 104859 46395 47044 55928 -52232 -52128 -49352 26846
10933B6846P7176J16818q2020j15200j18972r0955J10732M2980o0814P4131K5000
$$ 26846 104022 220840 138820 23620 -95352 -186307 -75575 -32595 -93409 -19278 5722
10922E722p3881p344l1463l1559O390N1528K155N8522k3441J32335K27592R7950
$$ 5722 -68159 -75503 -106966 -138525 -132135 -80607 -78452 -19930 -43371 88964 316556 414506
10910D14506q1552j29792l3210J9288j1589o7877r2325o7922J0432N2031m9098
$$ 414506 332954 203162 169952 189240 177651 109774 17449 -50473 -40041 11990 -37108
10899c7108m2203r2077O8762L6445K1101l9634k588p6763R8576R7428q9600r4054
$$ -37108 -79311 -171388 -102626 -66181 -45080 -84714 -87302 -164065 -65489 31939 -57661 -151715
10887a51715l8372J16492J56197J04626J5903n7943j23088N3838R9888j19775
$$ -151715 -190087 -73595 82602 187228 203131 145188 22100 75938 175826 56051
10877E6051p7249N3018o1260r4335J04002P8177l988N6295M015o8151k6908m466
$$ 56051 -21198 31820 -29440 -123775 -19773 58404 54416 110711 114726 46575 19667 15201
10865A5201k1180R584p3773l1765M1297O5077o5241o1260O1403Q9524Q022p2938
$$ 15201 -5979 3605 -70168 -101933 -60636 4441 -60800 -122060 -60657 28867 36889 -36049
10853c6049J2099K7443L9287N2271L0900m6496r2374l7209o3990M4635J9316r1874
$$ -36049 -23950 3493 42780 95051 125951 79455 -12919 -50128 -114118 -69483 -50167 -142041
10841a42041J0096J02026K1743p9962j41509N1086R1485m0380o412N9739j5425
$$ -142041 -131945 -29919 -8176 -88138 -229647 -178561 -87076 -127456 -133868 -74129 -89554
10830h9554j6634M6356N7738m3102p0211L9010R4310M8742k8716q7759n3865J16710
$$ -89554 -106188 -59832 -2094 -45196 -115407 -76397 17913 66655 37939 -49820 -103685 13025
10818A3025R7190j8912J7250j52543p9506P3472M600q1797M1217L0465M4143o9216
$$ 13025 110215 91303 108553 -43990 -123496 -50024 -45424 -127221 -86004 -55539 -11396 -80612
10806h0612j70600n3554k5140R8195J86528R8746L6201m5183l0826k2503m1339
$$ -80612 -251212 -304766 -329906 -231711 -45183 53563 89764 44581 13755 -8748 -50087
10795e0087J32789M8896L2692m2315k12471O480j2061Q4367J5028R3610M4578
$$ -50087 82702 131598 164290 121975 -90496 -84016 -96077 -11710 3318 96928 141506
10784A41506p1032p2589n0887k8391J15067P3241j12088j01590l7422K0387O1720
$$ 141506 70474 -2115 -53002 -81393 33674 106915 -5173 -106763 -144185 -123798 -62078
10773f2078K7505L7869P2296Q3592j10583n765K4199p3775n9370J06003o604j0744
$$ -62078 -34573 3296 75592 159184 48601 42836 67035 -6740 -66110 39893 33289 22545
10761B2545L0266J18405p5818j11859L1253O780j18123p4840o7408N0909K6986
$$ 22545 52811 171216 95398 -16461 14792 21572 -96551 -171391 -238799 -187890 -160904
10750a60904J77207M6705M4913J55485L3565r8130q7287p0778q8375K7405N8108
$$ -160904 16303 63008 107921 263406 296971 198841 111554 40776 -47599 -20194 37914
10739C7914J5338M0539j22858J60880O0133q4853j8369P876m3608M7174n9822
$$ 37914 53252 93791 -29067 131813 191946 107093 88724 96600 52992 100166 40344
10728D0344N749M1038n4860o1660M085o3870j01984n9791J01447k9697r9254M9826
$$ 40344 46093 87131 32271 -29389 -25304 -89174 -191158 -250949 -149502 -179199 -278453 -228627
10716b28627J48872j179M2427J8889N6455N3700P3551J32990j7547j63898n2535
$$ -228627 -79755 -80934 -38507 -19618 36837 90537 164088 297078 279531 115633 63098
10705F3098M3108J00963k7035q8786q0004j3242m2285P038m517r6329j16617Q5740
$$ 63098 106206 207169 180134 91348 11344 -1898 -44183 -37145 -41662 -137991 -254608 -168868
10693a68868j17478N4572J06157N6833o560j18594O3484J52658J29200m786N6157
$$ -168868 -286346 -231774 -125617 -68784 -75344 -193938 -130454 22204 151404 146618 202775
10682B02775M3939l6010J3681O1963k3632p2816j23696r8289m9260J2017m2611
$$ 202775 246714 210704 224385 286348 262716 189900 66204 -32085 -81345 -69328 -111939
10671a11939L9794P0287l7165M1414n4728J27360Q4569M669j0230m8410P4303
$$ -111939 -72145 -1858 -39023 2391 -52337 75023 159592 164261 154031 105621 179924
10660A79924P2695Q3122j57963q9396R1196j6620j37044k4643J01903J7395l7830
$$ 179924 252619 335741 177778 88382 179578 162958 25914 1271 103174 120569 82739
10649H2739o0757r932O9419K9944k8256n0936l5313K7045l351j60247j88696O7674
$$ 82739 21982 12050 81469 111413 83157 32221 -3092 23953 20602 -139645 -328341 -260667
10637b60667J32432J4171M6194M9618K1563K657k2948j4391l2520R6227r7480
$$ -260667 -128235 -114064 -67870 -18252 3311 5968 -16980 -31371 -63891 32336 -65144
10626f5144J5102q239J0596J29007Q169j03189K2590k2523m6303r3453J03501
$$ -65144 -50042 -58281 -47685 81322 89491 -13698 8892 -13631 -59934 -153387 -49886
10615d9886L1673l8012l6696J9984J49392Q8126l4593j18820n6317O0690J01731
$$ -49886 -18213 -56225 -92921 -72937 76455 164581 129988 11168 -45149 15541 117272
10604A17272P196n2266l7163M3809k9333K1064p780j28080l6480P3605M2564j25347
$$ 117272 124468 72202 35039 78848 49515 70579 62799 -65281 -101761 -28156 14408 -110939
10592a10939k9860R385Q4206J08379N2262r450k6129p6848j78967M3503L3922
$$ -110939 -140799 -131414 -47208 61171 113433 103983 77854 1006 -177961 -134458 -100536
10581a00536N1102l3617J2597J23894j806p820o8550p3360J16556N8093p535L2095
$$ -100536 -49434 -83051 -70454 53440 51634 43814 -24736 -98096 18460 76553 69018 101113
10569A01113N6579L249n7060m9261O3505p041K1206j10456o8491J3498o8598n2303
$$ 101113 157692 160941 103881 54620 118125 111084 132290 21834 -46657 -33159 -101757 -154060
10557a54060L5465P2793J46178r3723m0042J3233j546m1281l3690R9007K4267
$$ -154060 -118595 -45802 100376 6653 -33389 -20156 -21702 -62983 -96673 2334 26601
10546B6601q7216Q3599J31732P7953n2425K400j4658k7008j13716O5854K4302
$$ 26601 -60615 22984 154716 232669 180244 182644 167986 140978 27262 93116 117418
10535A17418j46957k9303K3949q360Q548N4958J38179m3295L2033j04179j50024
$$ 117418 -29539 -58842 -34893 -43253 -34705 20253 158432 115137 147170 42991 -107033
10524a07033L927K863M7809m7057j1115N6797J03549P1534l126j11114n92N1876
$$ -107033 -103106 -100243 -52434 -99491 -110606 -53809 49740 121274 118148 7034 6442 58318
10512E8318J9762N0298K7162j58720j52747K10130J47862J1576j04303j53729
$$ 58318 78080 128378 155540 -3180 -155927 54203 202065 213641 109338 -44391
10502d4391j4076L799K9624j196J659J09851N0204j05785j38359P702k6342J03508
$$ -44391 -58467 -54668 -25044 -26240 -24581 85270 135474 29689 -108670 -100968 -127310 -23802
10490b3802P544o3062N5669k260o6776k3403K6034L4834N6223j05715q4076Q6438
$$ -23802 -16258 -79320 -23651 -25911 -92687 -116090 -90056 -55222 1001 -104714 -188790 -102352
10478a02352J28323P4058l2947p1109r8568j32053N2030Q9636K7850J34353R2807
$$ -102352 25971 100029 67082 -4027 -102595 -234648 -182618 -92982 -65132 69221 162028
10467A62028q7392l1093m60p3398L1889Q8548J02320Q3174m0446j00670j07724
$$ 162028 74636 43543 43083 -30315 1574 90122 192442 275616 235170 134500 26776
10456B6776k4769J21885o339R253q0610k2197j4728k7281o3572o7698p2887j9122
$$ 26776 2007 123892 117553 126806 46196 23999 9271 -18010 -81582 -149280 -222167 -241289
10444b41289n4771k5781R0261O807Q663R8769r422L1494L8715l5932o6509N7917
$$ -241289 -296060 -321841 -231580 -224773 -216110 -117341 -126763 -95269 -56554 -92486 -158995 -101078
10432a01078J8335o003L9495P3417J70463n3545j02398m9380p0584R0735q689
$$ -101078 -82743 -88746 -49251 24166 194629 141084 38686 -10694 -81278 9457 768
10421G68J2578Q7681P5806L6577K2555M7637k00410j72101J08359K5717R0417
$$ 768 13346 101027 176833 213410 235965 283602 83192 -88909 19450 45167 135584
10410A35584Q9301l4565R8585j8548j04098J1288K5972J7459l154N0741m9308
$$ 135584 224885 190320 288905 270357 166259 177547 203519 220978 217824 268565 219257
10399B19257O5308p1158J0181n4888l47M4153M8872K600j19100m615m2393m1017
$$ 219257 284565 213407 223588 168700 168353 212506 261378 263978 144878 140263 97870 56853
10387E6853J1037o4200O6930o1928L8107k0049n169O7475l8853L7933L7263K6581
$$ 56853 67890 3690 70620 8692 46799 26750 21581 89056 50203 88136 125399 151980
10375A51980n8532l9095o3781k0430m1066L7636N3156j14611J80707O004q6337
$$ 151980 93448 54353 -9428 -29858 -70924 -33288 19868 -94743 85964 91968 5631
10364E631o3166J20698J83957L6451r3464j33887p2525R5565M2084K1013M6183
$$ 5631 -57535 63163 247120 283571 190107 56220 -16305 79260 121344 142357 188540
10353A88540k3492o4191j01442Q3594k2953o2945O7341L2555j40884j279j06554
$$ 188540 165048 100857 -585 83009 60056 -2889 64452 97007 -43877 -45156 -151710
10342a51710p6386K1144O7829N2546O8532O6033R3266j643j85713l8999M7640
$$ -151710 -228096 -206952 -139123 -86577 -18045 47988 141254 139611 -46102 -85101 -37461
10331c7461J13609K3986j92266j86736J51445L5498o2684j5179J4320j6170P2723
$$ -37461 76148 100134 -92132 -278868 -127423 -91925 -154609 -169788 -155468 -171638 -98915
10320i8915Q1460n4621K2565O5725L9258K2856J13143O9396Q7602j67476k19992
$$ -98915 -17455 -72076 -49511 16214 55472 78328 191471 260867 348469 180993 -38999
10309c8999l9517K1858N3598p9328Q743K509j0464M4312Q9693K2417m3648R947
$$ -38999 -78516 -56658 -3060 -82388 -73645 -71136 -81600 -37288 52405 74822 31174 41121
10297D1121k2848j30204k496q117J10595J72901P2478j20198j03304q7022P186
$$ 41121 18273 -111931 -114427 -122544 -11949 160952 233430 113232 9928 -77094 -69908
10286f9908J27983J86623O305j35577p266L965p3140n4637L4990J1192m3767n8572
$$ -69908 58075 244698 251003 115426 108160 112125 38985 -15652 19338 30530 -13237 -71809
10274g1809k471q28n2717m5201K0646j5048J0529P0866N7722J7776N1318J6964
$$ -71809 -74280 -75108 -127825 -173026 -152380 -167428 -156899 -86033 -28311 -10535 40783 57747
10262E7747q6854n833J17547O1969l9506P2981N8347P9602o7122j5960l6823j05531
$$ 57747 -29107 -34940 82607 144576 105070 178051 236398 316000 248878 232918 196095 90564
10250I0564o8742k3O1668l1312p0931J9592Q436k5365K8629K0312P5923Q9565
$$ 90564 21822 21799 83467 52155 -18776 816 9252 -16113 12516 32828 108751 198316
10238A98316M8481k02814k30643k0314J61517J01561j9925O9497N2834r2155q5025
$$ 198316 246797 43983 -186660 -206974 -45457 56104 36179 105676 158510 66355 -18670
10227a8670q493J8479J23965M878j17321j64376j469N1590O7074L9727K1536j4823
$$ -18670 -27163 -8684 115281 120159 2838 -161538 -163007 -111417 -44343 -4616 16920 2097
10215B097L7552k5989j7668J04604j2566L785O7665j0392o3983r4071o5232J453
$$ 2097 39649 13660 -4008 100596 88030 91815 159480 149088 85105 -8966 -74198 -72745
10203g2745J05531J13973k3972M8482J5226j8713p2590j1818N9407j5197P4080
$$ -72745 32786 146759 122787 171269 186495 167782 95192 83374 142781 127584 201664
10192B01664j13509j35053Q716M9834P7405o3619q0567M3503n1719O5662j3411
$$ 201664 88155 -46898 -38182 11652 89057 25438 -55129 -11626 -63345 2317 -11094
10181a1094J7383L7426j03883J18106J08835L7375j23056j04722q3377l5337N8917
$$ -11094 6289 43715 -60168 57938 166773 204148 81092 -23630 -107007 -142344 -83427
10170h3427o6845O9006K74676N8971p4934p9115j5648j27275j71235K9917p782
$$ -83427 -150272 -81266 193410 252381 177447 98332 82684 -44591 -215826 -185909 -193691
10159a93691J70110L530l4116L6349N1794n6317k7033L5541L064j43723p3179
$$ -193691 -23581 -20051 -54167 -17818 33976 -22341 -49374 -13833 -10769 -154492 -227671
10148b27671J22211K8580k8430n0779o0248J58348R8388n31M1138k2478M0069
$$ -227671 -105460 -76880 -105310 -156089 -216337 -57989 40399 39868 81006 58528 98597
10137I8597k0272j64293n7174l4007m0193l1650K7514L0234p782j3406k7375k0707
$$ 98597 78325 -85968 -143142 -177149 -217342 -248992 -221478 -191244 -199026 -212432 -239807 -260514
10125b60514Q3534Q9737K3394n0487j4659J9527L8004j26930j4724N5275M9342
$$ -260514 -176980 -87243 -63849 -114336 -128995 -109468 -71464 -198394 -213118 -157843 -108501
10114a08501j0916K5406o811L2439J01964O4356J29969J7947m0051L104j39448
$$ -108501 -119417 -94011 -100822 -68383 33581 97937 227906 245853 205802 208906 69458
10103F9458j64816p262k0127Q8141L2547r1990o2671j6675j9251J29997J64170
$$ 69458 -95358 -102620 -122747 -34606 -2059 -94049 -156720 -173395 -192646 -62649 101521
10092A01521K091q6569q0936j21054l2782K9594J01801P43O5020k8487j9028j0213
$$ 101521 103612 17043 -63893 -184947 -217729 -188135 -86334 -85591 -20571 -49058 -68086 -78299
10080g8299J29292l8649j14157k9688R8289J24268j8751J25370J9709p8863p8718
$$ -78299 50993 12344 -101813 -131501 -33212 91056 72305 197675 217384 138521 59803
10069E9803p1287j3195M9232n6879j55925O7875R7730p2530q7083o086l8870J59554
$$ 59803 -11484 -24679 24553 -32326 -188251 -120376 -22646 -95176 -182259 -188345 -227215 -67661
10057f7661J42213J12092K0649n7331n7742m5058m9583J7985M6233P1001P9852
$$ -67661 74552 186644 207293 149962 92220 47162 -2421 15564 61797 132798 212650
10046B12650k5170r7463j24242J48355Q6605P8570j55817j2258q1620q2013l4178
$$ 212650 187480 90017 -34225 114130 200735 279305 123488 111230 29610 -52403 -86581
10035h6581j45095J5670N6308M9695J27917l3854R8614Q9982q6989L0089j1825
$$ -86581 -231676 -216006 -159698 -110003 17914 -15940 82674 172656 85667 115756 103931
10024A03931j4339l1428o3126l7979j07559Q6478K6445p1343q4507M1045J11390
$$ 103931 89592 58164 -4962 -42941 -150500 -64022 -37577 -108920 -193427 -152382 -40992
10013d0992L3004k7221l1012R6095M7578n6691Q4644m1525o2055Q8522j42980
$$ -40992 -7988 -35209 -66221 29874 77452 20761 105405 63880 1825 90347 -52633
10002e2633r2555J24561M4208o7666k9999O4680q970q191k0977j9735N6105N8413
$$ -52633 -145188 -20627 23581 -44085 -74084 -9404 -18374 -26565 -47542 -67277 -11172 47241
9990D7241l8646J1570L0645l7142L8292k2586j18360K9815M5824O6838l4172J09372
$$ 47241 8595 20165 50810 13668 51960 29374 -88986 -59171 -13347 53491 19319 128691
9978A28691J04271r033l5663q8217p8490j5367K7033p3002r390N3799k4286J9618
$$ 128691 232962 223929 188266 100049 21559 6192 33225 -39777 -49167 4632 -19654 -36
9966c6j0179j8280N9877N3638q3952J43820J6042j35215m3739p6594j37370J32725
$$ -36 -10215 -28495 31382 85020 1068 144888 160930 25715 -18024 -94618 -231988 -99263
9954i9263J2563n2203p9106J28846J65796L4517o0032p3948j10605L1566M1242
$$ -99263 -86700 -138903 -218009 -89163 76633 111150 51118 -22830 -133435 -101869 -60627
9943f0627O3470K4473J3678L0333k7642r994M3294M347n5617R1978K2201n2881
$$ -60627 2843 27316 40994 71327 43685 33691 76985 81332 25715 117693 139894 87013
9931H7013p1615j03618o1543r8180L214K20465J25295P103n9147n715R064j4976
$$ 87013 15398 -88220 -149763 -247943 -244729 -24264 101031 108134 48987 43272 52336 37360
9919C7360k1596p777Q9662M0593M2295L672K9353j41516r8077p8792K3291J21496
$$ 37360 15764 7987 97649 138242 180537 184209 213562 72046 -26031 -104823 -81532 39964
9907C9964R3310m3978q55j56571j4689K08869k4859o6526N9224n2600M251L41
$$ 39964 133274 89296 88441 -68130 -82819 126050 101191 34665 93889 41289 45540 45881
9895D5881j9442J8728m3756o9407J4384Q0370R846J4371M2313j2056j4125O2232
$$ 45881 26439 45167 1411 -67996 -53612 26758 36604 50975 93288 81232 67107 129339
9883A29339j7110r5286r0678j9507J4716P8674k3919j7388J34626R9173P4361
$$ 129339 112229 16943 -73735 -93242 -78526 148 -23771 -41159 93467 192640 267001
9872B67001j00551j30032m5327j08909k5848J8820R5809n4302k680J21279o062
$$ 267001 166450 36418 -8909 -117818 -143666 -124846 -29037 -83339 -86019 35260 29198
9861B9198j07936J7287J36712P9305o3438j21599K4760P4790J49468K4039k6338
$$ 29198 -78738 -61451 75261 154566 91128 -30471 -5711 69079 218547 242586 216248
9850B16248j473r7727j10906k5230N4655J7427R8921Q5265O8089j9641j48672
$$ 216248 214775 117048 6142 -19088 35567 52994 151915 237180 305269 285628 136956
9839A36956j02955l522O9529k1327j99383j0379J23310M0481J7960L1582L9249
$$ 136956 34001 30479 100008 78681 -120702 -131081 -7771 32710 50670 82252 121501
9828A21501O0522m3656L2132r854j00765n3740Q563J19631O857p4126n8042J48196
$$ 121501 182023 138367 170499 160645 59880 6140 14703 134334 141191 67065 9023 157219
9816A57219r814r5311q1401N6382K5451k839n557N8775J15526j5151j22987j30123
$$ 157219 147405 52094 -29307 27075 52526 49687 44130 102905 218431 203280 80293 -49830
9804d9830p5786J3346l9664K6160J10104J7410p2083P2974L9971O8169J8119m9678
$$ -49830 -125616 -112270 -151934 -125774 -15670 1740 -70343 2631 42602 110771 128890 79212
9792G9212P4370Q5502m8556Q1577K6767j30871j63513m9035J11022K7615q0161
$$ 79212 153582 239084 190528 272105 298872 168001 4488 -44547 66475 94090 13929
9781A3929R2087Q3182m3710K2113j52634K187K8697n3179J34119M1732l8591j2018
$$ 13929 106016 189198 145488 167601 14967 17154 45851 -7328 126791 168523 129932 117914
9769A17914L1451K058r0661j59928J8771K08331Q2942m1095r8596j18659l8309
$$ 117914 149365 151423 60762 -99166 -80395 127936 210878 169783 71187 -47472 -85781
9758h5781O7408Q3659J6509J42920J36140k754p5970j01729m0182j5354L8888
$$ -85781 -18373 65286 81795 224715 360855 358101 282131 180402 140220 124866 163754
9747A63754L4804m1943n9350J3092O1762R9536q3920K6763j12275p2330q1593
$$ 163754 198558 156615 97265 110357 172119 271655 187735 214498 102223 29893 -51700
9736e1700j36016J26298J00261P4266m7784o877K086p256N0537L0551J37599P6758
$$ -51700 -187716 -61418 38843 113109 65325 58448 60534 53278 103815 134366 271965 348723
9724C48723K0221o2200o3637p8036R1299Q0222k3381k3434k1854m1558j6404N6385
$$ 348723 368944 306744 243107 165071 256370 336592 313211 289777 267923 226365 209961 266346
9712B66346K387r3078K7622k5120Q1442P4031J3174j2800j3112m9324m6790J00086
$$ 266346 268733 175655 203277 178157 259599 333630 346804 334004 320892 271568 224778 324864
9700C24864J01490q4693q3733Q285M0727N4857M8290n4006l0671J37821p0202
$$ 324864 426354 341661 257928 266213 306940 361797 410087 356081 325410 463231 393029
9689C93029r8724J02198M2112j31160j1126R735R2802R0845j13667O9321j46848
$$ 393029 294305 396503 438615 307455 296329 306064 398866 489711 376044 445365 298517
9678B98517k164M79R0049R9866l4081L1646P5891o3379m8302j8641L7858j4534
$$ 298517 296353 296832 386881 486747 452666 484312 560203 496824 448522 429881 467739 453205
9666D53205L52P8529K2889n686k0525n4956j01581K8609J33706j0380N1755M9267
$$ 453205 453557 532086 554975 549289 528764 473808 372227 400836 534542 524162 575917 625184
9654F25184O6077k3076l9680m0800L251J29653q3117K1857J60155j7122J93743
$$ 625184 691261 668185 628505 587705 590956 720609 637492 659349 819504 802382 996125
9643I96125N2481k6673O5217l016j3696k8788L4317o490J58572K8792L1435m0331
$$ 996125 1048606 1021933 1087150 1084134 1070438 1041650 1075967 1069477 1228049 1256841 1288276 1247945
9631A247945J06776J06398K2R9044Q7570q9448j7358J14188J09270o7473n3698
$$ 1247945 1354721 1461119 1461141 1560185 1647755 1558307 1540949 1655137 1764407 1696934 1643236
9620A643236J14120J27763K08350L0104j2559J01917M2940J47609l3133o1812
$$ 1643236 1757356 1885119 2093469 2123573 2111014 2212931 2255871 2403480 2370347 2308535
9610B308535K15594L20528K75187K12891J62445J6047K06239J05570N5429J12590
$$ 2308535 2524129 2844657 3119844 3332735 3495180 3511227 3717466 3823036 3878465 3991055
9600C991055K46238J74305Q3648J81643J14303K15666K83068J01122J19528P9131
$$ 3991055 4237293 4411598 4495246 4676889 4791192 5006858 5289926 5391048 5510576 5589707
9590E589707J35133J33609Q3082J48957o0329j40489m8418k7764L3039J17003
$$ 5589707 5724840 5858449 5941531 6090488 6030159 5889670 5841252 5813488 5846527 5963530
9580E963530M8495O1132j41001j34925l9857k1955j88972k87870q4445k8427j02518
$$ 5963530 6012025 6073157 5932156 5797231 5757374 5735419 5546447 5258577 5174132 5145705 5043187
9569E043187j24222l4808k90050j48026K1054r8812j96171m0739O934k3245j01305
$$ 5043187 4918965 4884157 4594107 4446081 4467135 4368323 4172152 4131413 4138347 4115102 4013797
9558D013797K007j42807j63900n1115l0948p7749j27565j53056K315j12216j3665
$$ 4013797 4015804 3872997 3709097 3657982 3627034 3549285 3421720 3268664 3270979 3158763 3145098
9547C145098j60775r3406l8588j8786j29336j00931r9850q7143j15572j11829
$$ 3145098 2984323 2890917 2852329 2833543 2704207 2603276 2503426 2416283 2300711 2188882
9537B188882R484j00187j29136k4561M519k3006M6472K2762k01746j02709M675
$$ 2188882 2198366 2098179 1969043 1944482 1949001 1925995 1972467 1995229 1793483 1690774 1695449
9526A695449m5220R4768P1878k61769k59427Q7102J4796Q3792n9172O8512n1195
$$ 1695449 1650229 1744997 1816875 1555106 1295679 1382781 1397577 1481369 1422197 1490709 1439514
9515A439514j36983q7581J3193R634l4006k980P5922q4951o7448j46562r7092
$$ 1439514 1302531 1214950 1228143 1237777 1203771 1200791 1276713 1191762 1124314 977752 880660
9504H80660J77602m295l3865r874n3410j11617M2970Q5647n5746j26425j32509
$$ 880660 1058262 1053967 1020102 1010228 956818 845201 888171 973818 918072 791647 659138
9493F59138l7439J25463J8569J9653M9595J272j66509p8732l1124Q4795P4696
$$ 659138 621699 747162 765731 785384 834979 836251 669742 591010 559886 644681 719377
9482G19377O9515M782k9426j81006k0826q6196r1243K3096M981Q06q894J19709
$$ 719377 788892 793674 764248 583242 562416 476220 384977 408073 413054 413860 404966 524675
9470E24675P3133k6485o2150K8544L8373j03691L714N9657l6301L8678K3474q3764
$$ 524675 597808 571323 509173 537717 576090 472399 476113 535770 499469 538147 561621 477857
9458D77857q401r1936L2804L8277n3747L0600j0594n0468j2959k8318n2827l619
$$ 477857 469456 377520 410324 448601 394854 425454 414860 364392 351433 323115 270288 266669
9446B66669k6134r2889K1710Q6410j219O43q984l6517o3390j1079R0323K4285
$$ 266669 240535 147646 169356 255766 254547 255190 246206 209689 146299 135220 225543 249828
9434B49828k7763o8346N1303k5010Q4084M6181p677N0180K2751J6609L5216m3175
$$ 249828 222065 153719 205022 180012 264096 310277 302600 352780 375531 392140 427356 384181
9422C84181r8415p7448j2237Q4173L2125J4979q7986j68351o3802K9075n4545
$$ 384181 285766 208318 196081 280254 312379 327358 239372 71021 7219 36294 -18251
9411a8251j3961k5329K7479J54380l2018j9271O1247P8119N9454n6269j17102
$$ -18251 -32212 -57541 -30062 124318 92300 73029 134276 212395 271849 215580 98478
9400I8478k6904m108J0976J41285P5893Q5697j54311q5643K9171N7008j7831m6637
$$ 98478 71574 67466 78442 219727 295620 381317 227006 141363 170534 227542 209711 163074
9388A63074n0098J7955l0895K3236Q8392J7306q7770p5725J60716J3232R724j01595
$$ 163074 112976 130931 100036 123272 211664 228970 141200 65475 226191 239423 249147 147552
9376A47552o3354M9458J25117K9820o5331m3354j26053K4866J8654l593Q5739
$$ 147552 84198 133656 258773 288593 223262 179908 53855 78721 97375 93782 179521
9365A79521k2681o0698o673K478q2557L7420N3583L7049m9308q1415q6439J0784
$$ 179521 156840 96142 89469 91947 9390 46810 100393 137442 88134 6719 -79720 -68936
9353f8936m2845O7975p0334m4338O2306O7730O1535P6077N9015j24165n1938n5587
$$ -68936 -111781 -43806 -114140 -158478 -96172 -28442 33093 109170 168185 44020 -7918 -63505
9341f3505L0279J04018R0091j02864k4583J32798M3903o8117j57629j74128n0680
$$ -63505 -33226 70792 160883 58019 33436 166234 210137 142020 -15609 -189737 -240417
9330b40417J61140P2400K9670k9304O501O7262J44603O6011k1634n5546o7922
$$ -240417 -79277 -6877 22793 -6511 -10 67252 211855 277866 256232 200686 132764
9319A32764K7216Q4606m4853K6985M5602M473o3729n6337R495j6997r6843L2925
$$ 132764 159980 244586 199733 226718 272320 276793 213064 156727 166222 149225 52382 85307
9307H5307k4340R7989J44464N5653j44712p0857k2635N319M9891m0668O5572L1973
$$ 85307 60967 158956 303420 359073 214361 143504 120869 126188 176079 135411 200983 232956
9295B32956r3966j18311k6657J17059J07718k9770j77341Q1314K8966j30205r231
$$ 232956 138990 20679 -5978 111081 218799 189029 11688 93002 121968 -8237 -17468
9284a7468L1648Q996J3975k6207O0317J08781r7502j63599O6868J6233q4734k1742
$$ -17468 14180 23176 37151 10944 71261 180042 82540 -81059 -14191 2042 -82692 -104434
9272a04434J00518p462j60536l2045J31640J0991q092O7164J7386O605n7059L382
$$ -104434 -3916 -11378 -171914 -203959 -72319 -61328 -69420 -2256 15130 21735 -35324 -31942
9260c1942M8400O4887J03830o198k26620j85293P5320K07405L5963j47026n6951
$$ -31942 16458 81345 185175 178977 -47643 -232936 -157616 49789 85752 -61274 -118225
9249a18225P8481J61270M6560j5398j79666n1884Q734j4846l8079o329m8963O2728
$$ -118225 -39744 121526 168086 152688 -26978 -78862 -70128 -84974 -123053 -129382 -178345 -115617
9237a15617J70790P558m301P5360K0896m1736k3766N9493k2258J1113J08477n8539
$$ -115617 55173 62731 58430 133790 154686 112950 89184 148677 126419 137532 246009 187470
9225A87470q5460j21490q6035L2896N5031Q8139l2059j49405j016J56225l4006
$$ 187470 102010 -19480 -105515 -72619 -17588 70551 38492 -110913 -111929 44296 10290
9214A0290o8976J8964N3982J00109o4768l6424K62J26654Q9071k6402L8732o2898
$$ 10290 -58686 -39722 14260 114369 49601 13177 13439 140093 229164 202762 241494 178596
9202A78596j4387p9060k21741K032J02542K4883J83247k6331n9773o6845Q7996
$$ 178596 164209 85149 -136592 -134560 -32018 -7135 176112 149781 90008 23163 111159
9191A11159L718j06560l7300p8212j12254K3909R9416Q8479j05228K2093J8418
$$ 111159 114877 8317 -28983 -107195 -219449 -195540 -96124 -7645 -112873 -90780 -72362
9180g2362M3304j2129R4913R5774L6809l5582r4009l4764q3944j5944J00978o3950
$$ -72362 -29058 -41187 53726 149500 186309 150727 56718 21954 -61990 -77934 23044 -40906
9168d0906j84264P1557R9392J53753M4912q0584j15744j73504O9719J80856Q4415
$$ -40906 -225170 -153613 -54221 99532 144444 63860 -51884 -225388 -155669 25187 109602
9157A09602M1632K5441p3131n8772j27260j9657M7306J0613M3894O4869K4542
$$ 109602 151234 176675 103544 44772 -82488 -102145 -54839 -44226 -332 64537 89079
9146H9079j19126j34396O4449R7370N7576j7313K3218n2930P7761K07416n6790
$$ 89079 -30047 -164443 -99994 -2624 54952 37639 60857 7927 85688 293104 236314
9135B36314j15105j12176j03419O0400k8697Q9126J4642k3927L8187q001o2359
$$ 236314 121209 9033 -94386 -33986 -62683 26443 41085 17158 55345 47344 -15015
9124a5015J005P3718q0699o0415K329N9918l9899O9407N0700j25134N182o406
$$ -15015 -14010 59708 -20991 -81406 -79077 -19159 -59058 10349 61049 -64085 -58903 -65309
9112f5309n644M1898L9653p8542m6757j5248Q4553M070N6289K0506O0852L2881
$$ -65309 -70953 -29055 10598 -67944 -114701 -129949 -45396 -41326 14963 35469 96321 129202
9100A29202J4136k8055k1393n5959M4041J6726l3480q2130L3142J52466m1288
$$ 129202 143338 115283 93890 37931 81972 98698 65218 -16912 16230 168696 127408
9089A27408j06006k4494o2964O8545Q5006j00128J668P5467p403j3690K2403n4472
$$ 127408 21402 -3092 -66056 2489 87495 -12633 -10965 64502 57099 43409 65812 11340
9077A1340p7847J9308J43617j44562m9571R4225K700R78J2441J53795M8952o2883
$$ 11340 -66507 -47199 96418 -48144 -97715 -3490 -790 188 12629 166424 215376 152493
9065A52493l7823m4239n862m2215r5937J1552k429O0274O7808m5631M0588L3035
$$ 152493 114670 70431 64569 22354 -73583 -62031 -64460 -4186 63622 17991 58579 91614
9053I1614j00887Q7832K4964m7359J391P5246j5230K9007m4244j1335N1051N992
$$ 91614 -9273 78559 103523 56164 57555 132801 117571 146578 102334 90999 142050 148042
9041A48042p6500m0915m2447j8640j47798r928R560K047N6682K04932Q6482N24
$$ 148042 71542 30627 -11820 -30460 -178258 -188186 -178626 -176579 -119897 85035 171517 172041
9029A72041p2724J1097j6735N114r2682L948O6441q111j12856N4130K7305O638
$$ 172041 99317 110414 93679 98793 6111 10059 76500 68389 -44467 9663 36968 43606
9017D3606R6244J07765K635q3876p5163J02941Q4263q4264r5807p0626J0074k3945
$$ 43606 139850 247615 250250 166374 91211 194152 278415 194151 98344 27718 37792 13847
9005A3847n4649n3137j12977O450o0293J03976J48660l2119L8547M6768P8221
$$ 13847 -40802 -93939 -206916 -200466 -260759 -156783 -8123 -40242 -1695 45073 123294
8994A23294p7328m6259K1476j17998R7118K592K6198l7661l1414p1300r5295N9295
$$ 123294 45966 -293 21183 -96815 303 2895 29093 -8568 -39982 -111282 -206577 -147282
8982a47282N7008O6134J4566p0616J20971J0867K7674o0592n2122L1596O3019
$$ -147282 -90274 -24140 -9574 -80190 40781 51648 79322 18730 -33392 -1796 61223
8971F1223k90m8078R5450K5426n9066r4969M5301K487M8336L4883m0462m6119
$$ 61223 60933 12855 108305 133731 74665 -20304 24997 27484 75820 110703 70241 24122
8959B4122r4649o1247k1979j7404P8975J38054L6883k3988j10397N1644J06071
$$ 24122 -70527 -131774 -153753 -171157 -92182 45872 82755 58767 -51630 14 106085
8948A06085L0948j39665J1787P3741J6066q3154k4139O4869j11875J11572M4304
$$ 106085 137033 -2632 9155 82896 98962 15808 -8331 56538 -55337 56235 100539
8937A00539p4789J1735L9542r7208o8602J609Q4079R4963k1778M3819o7405j18024
$$ 100539 25750 37485 77027 -20181 -88783 -87174 -3095 91868 70090 113909 46504 -71520
8925g1520j26494l4999R2785P2910J28498n0141q2791l5471O716j2604K2228J83163
$$ -71520 -198014 -233013 -140228 -67318 61180 11039 -71752 -107223 -100507 -113111 -90883 92280
8913I2280J31149L0691l2460j85044L8445r206J2987L641m743k2633k8447J3781
$$ 92280 223429 254120 221660 36616 75061 65855 78842 82483 77740 55107 26660 40441
8901D0441J5045j27950K0902M2784m6232m9662Q1107P8580O6799k3570k8324M7936
$$ 40441 55486 -72464 -51562 -8778 -55010 -104672 -23565 55015 121814 98244 69920 117856
8889A17856R963Q9384k5952o7469o4107R5774l691o4873m6933q2538K3697M594
$$ 117856 127819 217203 191251 123782 59675 155449 151758 86885 39952 -42586 -18889 -14295
8877a4295O0567l626k4682J4280j04943p4210J0351l1584r3609Q6704J40912K9951
$$ -14295 46272 42646 17964 32244 -72699 -146909 -136558 -168142 -261751 -175047 -34135 -4184
8865d184p0667K0727q9867r698K923M2505j2398J09469J32399N3437k6337p8820
$$ -4184 -74851 -54124 -143991 -153689 -150766 -108261 -120659 -11190 121209 174646 148309 69489
8853F9489j4071J15405K2731P4409j8256K2479m0422j20818r3856L6609k0883
$$ 69489 55418 170823 193554 267963 249707 272186 231764 110946 17090 53699 32816
8842C2816O050o4766J18475o41j30347N433K3108j2536J05403j4219j327R3819
$$ 32816 38866 -25900 92575 91934 -38413 -32980 -9872 -22408 82995 68776 67449 161268
8830A61268m1284l1394l0889m7353p2103J1211P9121O353l3979L6511L2886J09558
$$ 161268 119984 88590 57701 10348 -61755 -50544 28577 34930 951 37462 70348 179906
8818A79906O297j57622j12642J31702J64J6276m346j57113r1321J30724J21284
$$ 179906 186203 28581 -84061 47641 47805 64081 59735 -97378 -188699 -57975 63309
8807F3309m7969J13726q3552q9159k3328N5712k6118n3011o1027n3484O8872K25741
$$ 63309 15340 129066 45514 -43645 -66973 -11261 -37379 -90390 -151417 -204901 -136029 89712
8795H9712n3324m8775m2634r1289k0421j6278M1983j2513q5919Q8150J46308p028
$$ 89712 36388 -12387 -55021 -146310 -166731 -183009 -141026 -153539 -239458 -151308 -5000 -12028
8783a2028k2536R6571j8221j0709q4643O0540M9154K7127k7601r4925J20814J29211
$$ -12028 -34564 62007 43786 33077 -51566 8974 58128 85255 57654 -37271 83543 212754
8771B12754l4035j6107q8948K6048N1955m3689p7835l9834k2549L520O6315M1451
$$ 212754 178719 162612 73664 99712 151667 107978 30143 -9691 -32240 -28720 37595 79046
8759G9046J02569K9595j9480K1998j06508l1178o0990M554M7448k0311j17643
$$ 79046 181615 211210 191730 213728 107220 76042 15052 19606 67054 46743 -70900
8748g0900m0143Q0639J6242p2242L4264O2293r2254P4923J7014o3671o7812k5015
$$ -70900 -111043 -30404 -14162 -86404 -52140 10153 -82101 -7178 9836 -53835 -121647 -146662
8736a46662Q4717P5444j0219R3643P6700n7629j37967L7284J50559o5981j33073
$$ -146662 -61945 13499 3280 96923 173623 115994 -21973 15311 165870 99889 -33184
8725c3184P3267P0878p1152J22360k4791q5000l3808j55742J19905J21015K8458
$$ -33184 40083 110961 39809 162169 137378 52378 18570 -137172 -17267 103748 132206
8714A32206j02776l0529O981l1877k2390j0499L1200L5028q2081p4135Q3768M4779
$$ 132206 29430 -1099 5882 -25995 -48385 -58884 -27684 7344 -74737 -148872 -65104 -20325
8702b0325j36541n389R0492J64811l0056m0245l1792P7673Q9449l7970j24464
$$ -20325 -156866 -162255 -71763 93048 62992 22747 -9045 68628 158077 120107 -4357
8691d357m6112j26647r7874k0956P2240J00009N3289j9641l2850P9610P0436j04507
$$ -4357 -50469 -177116 -274990 -295946 -223706 -123697 -70408 -90049 -122899 -43289 27147 -77360
8679g7360J31009R9953q1948o0956j05216k014j136l6402J3948J8388k5065N3058
$$ -77360 53649 153602 71654 10698 -94518 -96532 -97668 -134070 -120122 -101734 -126799 -73741
8667g3741p923K3304p9600J3190J05990K8434j30593j60375p8443J40264Q3977
$$ -73741 -81664 -58360 -137960 -124770 -18780 9654 -120939 -281314 -359757 -219493 -135516
8656a35516K4810M2537n2036M9150N2454N9974O2582M9161L2754N7469j4345j7528
$$ -135516 -110706 -68169 -120205 -71055 -18601 41373 103955 153116 185870 243339 228994 211466
8644B11466j38706k26238R8974J03282j5189m1339k13O3956n2129j42410j4508
$$ 211466 72760 -153478 -54504 48778 33589 -7750 -7963 55993 3864 -138546 -153054
8633a53054J84751O9745J9909K405m0608l9507r8935m2395j5542N6641M2133K0239
$$ -153054 31697 101442 121351 123756 83148 43641 -55294 -97689 -113231 -56590 -14457 5782
8621E782L1034L94J29561J10993o821m3068j27175j60071l8943M1633J31210n1452
$$ 5782 36816 37210 166771 277764 270943 227875 100700 -59371 -98314 -56681 74529 23077
8609B3077j02467P1017l5577N5495L5459O5741l8291J7828P8673J6813J9524j33333
$$ 23077 -79390 -8373 -43950 11545 47004 112745 74454 92282 170955 187768 207292 73959
8597G3959P999N4030K09882m6214o1955p7928n6019K0642R6936J04827n1541k60429
$$ 73959 81958 135988 345870 299656 237701 159773 103754 124396 221332 326159 274618 14189
8585A4189j82723L1344j357L7959P9343M855P0638o7346q425k1263J2080j4342
$$ 14189 -168534 -137190 -138547 -100588 -21245 -16390 54248 -13098 -21523 -42786 -30706 -45048
8573d5048M2714r6006q8661M2420M6305J02183O7043P675L5286j6732p6929m4702
$$ -45048 -2334 -98340 -187001 -144581 -98276 3907 70950 78625 113911 97179 20250 -24452
8561b4452R749P3718K233P515j29519j02290R3905N7367k98l5519R7060M5740
$$ -24452 -14703 59015 61248 68763 -60756 -163046 -69141 -11774 -12072 -47591 49469 95209
8549I5209K8747J7319j16357q9225n0860L6189q6057k6618Q5266P5244K1725l3452
$$ 95209 123956 141275 24918 -64307 -115167 -78978 -165035 -191653 -106387 -31143 -9418 -42870
8537d2870o0401L7811Q9254M7488n512o9922O5965q744j03209j75932l4869O2124
$$ -42870 -103271 -65460 23794 71282 65770 -4152 61813 53069 -50140 -226072 -260941 -198817
8525a98817P4042L8644Q2144o2686Q7725j1099q1113k5549p3697Q0482m301L5675
$$ -198817 -124775 -86131 -3987 -66673 21052 9953 -71160 -96709 -170406 -89924 -94225 -58550
8513e8550L9394l7315n264j2386N4017M4750q8693o9179p0342Q6824P6644q651
$$ -58550 -19156 -56471 -61735 -74121 -20104 24646 -64047 -133226 -203568 -116744 -40100 -48751
8501d8751R0323L5056j0306K2058L6803j28683m2896R2100N098o0688M0703N2165
$$ -48751 41572 76628 66322 88380 125183 -3500 -46396 45704 50802 -9886 30817 82982
8489H2982N5451K3389P5600o4204m8482l6862o8192r479L8697j48382j76058J43521
$$ 82982 138433 161822 237422 173218 124736 87874 19682 10203 48900 -99482 -275540 -132019
8477a32019M8692m7270P4440P461K9013J38025L5664j8573r2588p3236p3629r0934
$$ -132019 -83327 -130597 -56157 -48696 -19683 118342 154006 135433 42845 -30391 -104020 -194954
8465a94954Q62J65466J80900P02j0140P0491p5368J5655l7604n9562K7269N8000
$$ -194954 -194092 -28626 152274 152976 142836 213327 137959 153614 116010 56448 83717 141717
8453A41717q6083j76035m626J20958M4968N5115O8852j46752j14226L7575L7353
$$ 141717 55634 -120401 -125027 -4069 40899 96014 164866 18114 -96112 -58537 -21184
8442b1184k6876N4511K4918k4828J01391n0828l9542K0118k2429L896J07170N6643
$$ -21184 -48060 6451 31369 6541 107932 57104 17562 37680 15251 19147 126317 182960
8430A82960p2368r6863Q6146M1047r6829n4703l5803N5411o681j35170M3690R15
$$ 182960 110592 13729 99875 140922 44093 -10610 -46413 8998 2317 -132853 -89163 -88248
8418h8248n7535m1424P8972K3187O5273P6531M927l1164j7287J4729Q4817P2946
$$ -88248 -145783 -187207 -108235 -85048 -19775 56756 61683 30519 13232 27961 112778 185724
8406A85724N4807r4108j25939M1273M7586K8213J14658K241k5115m8585q4351
$$ 185724 240531 146423 20484 61757 109343 137556 252214 254455 229340 180755 96404
8395I6404j79730L4386N5648j17205j2414J17271J6691r9796o19Q0652N4689N3373
$$ 96404 -83326 -48940 6708 -110497 -122911 -5640 11051 -88745 -89364 -8712 45977 99350
8383I9350J7764p5838k08048k4061L4670O6299Q2258J04586n512k3783r8646p7128
$$ 99350 117114 41276 -166772 -190833 -156163 -89864 -7606 96980 91468 67685 -30961 -108089
8371a08089Q216J51344K3385n6195O1238N181L0128J2975j86968j86136n7602
$$ -108089 -99873 51471 74856 18661 79899 85080 115208 128183 -58785 -244921 -302523
8360c02523Q3773O7714j08607K5301p650J7729K08293K62223m2195j19153j05593
$$ -302523 -218750 -151036 -259643 -234342 -241992 -224263 -15970 246253 204058 84905 -20688
8349b0688m3212n1881r650Q1744P3532M7272k9396j2283J9883j29277N9805Q9319
$$ -20688 -63900 -115781 -125431 -43687 29845 77117 47721 35438 55321 -73956 -14151 75168
8337G5168K8235j29399o6812j29830K8799J32268k9953k5378J9146J3767p6842
$$ 75168 103403 -25996 -92808 -222638 -193839 -61571 -91524 -116902 -97756 -83989 -160831
8326a60831n460O3209L4690l6211R4464l8033n2773j06734l6582O7819Q5189J30422
$$ -160831 -166291 -103082 -68392 -104603 -10139 -48172 -100945 -207679 -244261 -176442 -91253 39169
8314C9169j12961n7692K8679L1913M3161n7491O3345l7327l9345R2598N2237R519
$$ 39169 -73792 -131484 -102805 -70892 -27731 -85222 -21877 -59204 -98549 -5951 46286 55805
8302E5805O8796l5028r1371n1986j16859J33324Q7395N2705k5158j24468q2781
$$ 55805 124601 89573 -1798 -53784 -170643 -37319 50076 102781 77623 -46845 -129626
8291a29626R6927J7820j40673k6191L6472m6066j3958Q1833J23343l7093k8574
$$ -129626 -32699 -14879 -155552 -181743 -145271 -191337 -205295 -123462 -119 -37212 -65786
8280f5786M8147j36857j07156J8879P7324J05767M9277m4594K621N3368k731q4845
$$ -65786 -17639 -154496 -261652 -242773 -165449 -59682 -10405 -54999 -52378 990 -1741 -86586
8268h6586P4912M6764o0460q9296L2590J38060K7879r428q372J53084k6901k5495
$$ -86586 -11674 35090 -25370 -114666 -82076 55984 83863 74435 66063 219147 192246 166751
8256A66751m8182k6346k273k5234n629N2539L4683o4011j8448n5690k9288J09838
$$ 166751 118569 92223 89950 64716 59087 111626 146309 82298 63850 8160 -21128 88710
8244H8710q7547l7019J10834M5170r8995l9476O9833O5813M4684q9395j41508
$$ 88710 1163 -35856 74978 120148 21153 -18323 51510 117323 162007 72612 -68896
8233f8896k1174J29959l3093N2461P3848o0608j68583m4631O6738P3795l1574
$$ -68896 -90070 39889 6796 59257 133105 72497 -96086 -140717 -73979 -184 -31758
8222c1758m3238q1685m9144l5081L5115J10160J40098m2861j49580R339o1375
$$ -31758 -74996 -156681 -205825 -240906 -205791 -95631 44467 1606 -147974 -138635 -200010
8211b00010k234L4969M90M0522M7821J05265p5580j38612M1142m0163O7928J8286
$$ -200010 -202244 -167275 -166785 -126263 -78442 26823 -48757 -187369 -146227 -186390 -118462 -100176
8199a00176R296k5228J53835J13927N6711L6079L208n7218k1122N1808k5117m9063
$$ -100176 -90880 -116108 37727 151654 208365 244444 247652 190434 169312 221120 196003 146940
8187A46940j32019l7880M4100p8910O2113R3997J2073k8794L8880J04688j54417
$$ 146940 14921 -22959 21141 -57769 4344 98341 110414 81620 120500 225188 70771
8176G0771p2448L0441N736L1440N3921j3804o3429j30000M1786q7913p0472M0458
$$ 70771 -1677 28764 34500 65940 119861 106057 42628 -87372 -45586 -133499 -203971 -163513
8164a63513M6018j3672n083L5049j43620r7404J34147J71934O4020l992m9035
$$ -163513 -117495 -131167 -136250 -101201 -244821 -342225 -208078 -36144 27876 23884 -25151
8153b5151N613k2967k6395p8287P53K5991J08782Q5059j41049n9640l3688j5382
$$ -25151 -19538 -42505 -68900 -147187 -146434 -120443 -11661 73398 -67651 -127291 -160979 -176361
8141a76361J1653P9415o4397p9891o1002L9103Q1310J69389m2725o3869N211O4344
$$ -176361 -164708 -85293 -149690 -229581 -290583 -251480 -170170 -781 -43506 -107375 -102164 -37820
8129c7820J0964k1073O3103k5718M0281N9771l255n764j42296j3035J7207L684
$$ -37820 -26856 -47929 15174 -10544 29737 89508 86253 80489 -61807 -74842 -57635 -53951
8117e3951J2159M517l5477n2754n7474K1869P7929P9971l0283k0014k6255q7486
$$ -53951 -41792 -37275 -72752 -125506 -182980 -161111 -83182 -3211 -33494 -53508 -79763 -167249
8105a67249P9917J17989K9214J1374q4284n2907M3591M2383M3223L1568m8727
$$ -167249 -87332 30657 59871 71245 -13039 -65946 -22355 20028 63251 94819 46092
8094D6092j27906O2472P161o2831j12249q3581J00295R208N220L8753N8973j8244
$$ 46092 -81814 -19342 -12181 -75012 -187261 -270842 -170547 -161339 -156119 -117366 -58393 -76637
8082g6637r811J15592J2008o8676M6140K9572n6999J9671j18133k8936J01095
$$ -76637 -86448 29144 41152 -27524 18616 48188 -8811 10860 -107273 -136209 -35114
8071c5114M4541J50125Q0069m5722j03852j31379R8360j9278j23394n9883J09851
$$ -35114 9427 159552 239621 193899 90047 -41332 57028 37750 -85644 -145527 -35676
8060c5676L3804O563K9968n5083j46907M8526R4103J1482o8834j57464L620J17538
$$ -35676 -1872 4691 34659 -20424 -167331 -118805 -24702 -13220 -82054 -239518 -235898 -118360
8048a18360J5568Q0795k5563M4286m1699j05602M14O8601R3682l6250M5281n3084
$$ -118360 -102792 -21997 -47560 -3274 -44973 -150575 -150161 -81560 12122 -24128 21153 -31931
8036c1931r7150J04323O481j00310j27460L0226J30502J8403P2603P1023k0420
$$ -31931 -129081 -24758 -18277 -118587 -246047 -215821 -85319 -66916 5687 76710 56290
8025E6290r7672l8599M1068N215K0482m5786M5305Q2954m6470j33694o2756Q4778
$$ 56290 -41382 -79981 -38913 -33698 -13216 -59002 -13697 69257 22787 -110907 -173663 -88885
8013h8885J42035k3133Q6277P5618Q203j01025k0731O985L6746J93j61062p9246
$$ -88885 53150 30017 116294 191912 200115 99090 78359 85344 122090 122283 -38779 -118025
8001a18025K4769K9067Q39q1833n1599P0942P1395P3942J5095K4386J1647R0967
$$ -118025 -93256 -64189 -63350 -145183 -196782 -125840 -54445 19497 34592 58978 70625 161592
7989A61592K6211q7835j83512n7638J6911M5983Q7536J08281K7053j7537j9861
$$ 161592 187803 99968 -83544 -141182 -124271 -78288 9248 117529 144582 127045 107184
7978A07184l7624j4983M2325j67202M2153J8142j68328k7050J01195J36881O8871
$$ 107184 69560 54577 96902 -70300 -28147 -10005 -178333 -205383 -104188 32693 101564
7967A01564K8241R7480j16332j58503k0982P9760K05314o112k666m6095j556N1226
$$ 101564 129805 227285 110953 -47550 -68532 11228 216542 210430 207764 161669 160113 211339
7955B11339n5931k0846P768K2616l7341o5504J7929m7357N0044J5747l6199M5972
$$ 211339 155408 134562 142330 164946 127605 62101 80030 32673 82717 98464 62265 108237
7943A08237j8003l0141K7444K4923M4161m2417j72840j24427J94039K15645p4845
$$ 108237 90234 60093 87537 112460 156621 114204 -58636 -183063 10976 226621 151776
7932A51776r1611j6933R5975K3176o9255M1513m0697K4061m1657O1696q685j92648
$$ 151776 60165 43232 139207 162383 93128 134641 93944 118005 76348 138044 129359 -63289
7920f3289r1616O4208R3391N3944p680l4069K8377j036L1274J9465j55844R872
$$ -63289 -154905 -90697 2694 56638 48958 14889 43266 42230 73504 92969 -62875 -53003
7908e3003J96803Q9229l9963k3377k6720k0346k1001k2729j14283j11802L7266
$$ -53003 143800 233029 193066 169689 142969 122623 101622 78893 -35390 -147192 -109926
7897a09926R0757k102j12005k6795M1946J27885M6378J7152J5169q7924j9354
$$ -109926 -19169 -21271 -133276 -160071 -118125 9760 56138 73290 88459 535 -18819
7886a8819o387M2212q738k1452P639R3522n5463j3522j6506J55282j51801r0648
$$ -18819 -25206 17006 8268 -13184 -5545 87977 32514 18992 2486 157768 5967 -84681
7874h4681o4590L3863J13494j7222l2272K6573o0060q6199k1217l3895m1680O7141
$$ -84681 -149271 -115408 -1914 -19136 -51408 -24835 -84895 -171094 -192311 -226206 -267886 -200745
7862b00745J37358o635Q596L392m6245k382J87731R0936j16374r6629M6979M3001
$$ -200745 -63387 -70022 -61426 -58034 -104279 -106661 81070 172006 55632 -40997 5982 48983
7850D8983n4426J140Q7828M1683o5152q5786J6806N8591o526K4548P5029Q614
$$ 48983 -5443 -4303 83525 125208 60056 -25730 -8924 49667 43141 67689 142718 151332
7838A51332p8014j54512m7602J10301M7385J38415r6650j86153j8648J28917K0161
$$ 151332 73318 -81194 -128796 -18495 28890 167305 70655 -115498 -134146 -5229 14932
7827A4932m1134j00723M3777j256P699N0830r023k5637N8126J3484O2503k3764
$$ 14932 -26202 -126925 -83148 -84404 -76705 -25875 -34898 -60535 -2409 11075 73578 49814
7815D9814j905m5362J7830o4990m7122Q2173m7242P6235P7414J17388q2475j14615
$$ 49814 47909 2547 20377 -44613 -91735 -9562 -56804 19431 96845 214233 131758 17143
7803A7143q9103k1617k497M6013L6024O9527J42242L3016j17989j11125l3821
$$ 17143 -71960 -93577 -96074 -50061 -14037 55490 197732 230748 112759 1634 -32187
7792c2187J11009k528l6091K8812O7897M1996j41582q5841N8570n1175m3600K3995
$$ -32187 78822 76294 40203 69015 136912 178908 37326 -48515 10055 -41120 -84720 -60725
7780f0725O4012q0143j21180j0596M9396J65301p4439r1593N7722P5183j5658
$$ -60725 3287 -76856 -198036 -208632 -159236 6065 -68374 -159967 -102245 -27062 -42720
7769d2720K4596m247K8504K4072l8052R3160J45756j09090j44133O1783O3028
$$ -42720 -18124 -22371 6133 30205 -7847 85313 231069 121979 -22154 39629 102657
7758A02657l912K7076m1662r19J6749k1791P073m846n5614O443L0837J5429k5602
$$ 102657 98745 125821 84159 83240 99989 78198 85271 80425 24811 31254 62091 77520 51918
7745E1918L0629m6491m8050n1102J2602L2687j582J49155O0203N7924M4808q4030
$$ 51918 82547 36056 -11994 -63096 -50494 -17807 -19389 129766 189969 247893 292701 208671
7733B08671L759l5458n9262M2334O8377n5372q8871m5343j4127q2711O5543m5828
$$ 208671 212430 176972 117710 160044 228421 173049 84178 38835 24708 -58003 7540 -38288
7721c8288l9502j9202o407J11498P3339n7412k7922L2288r02m2809q270m8461
$$ -38288 -77790 -96992 -103399 8099 81438 24026 -3896 28392 27490 -15319 -23589 -72050
7709g2050o884K9551L1381J03193J04958j7576o5786K3871K0520j10715j28171
$$ -72050 -78934 -49383 -18002 85191 190149 172573 106787 130658 151178 40463 -87708
7698h7708K3790O8416Q238l0685M4121j0875J8171o1796p3952m9369o1826p4260
$$ -87708 -63918 4498 12736 -17949 26172 15297 33468 -28328 -102280 -151649 -213475 -287735
7686b87735J5019P2758N9383K7459Q10M7379J36247O1136q4555J22024J00822
$$ -287735 -272716 -199958 -140575 -113116 -112306 -64927 71320 132456 47901 169925 270747
7675B70747r7074n3723L2678M942K9549L0156o7323j67253j7065q95j67056o3956
$$ 270747 173673 119950 152628 157570 187119 217275 149952 -17301 -34366 -35261 -202317 -266273
7663b66273j9356K3359O5823M8819R3187j4491O372J32322J12193n9010j1473
$$ -266273 -285629 -262270 -196447 -147628 -54441 -68932 -62560 69762 181955 122945 111472
7652A11472P2163l085j19748j23353k3218k413m9981N3030M9802l7460j4119j16972
$$ 111472 183635 180550 60802 -62551 -85769 -88182 -138163 -85133 -35331 -72791 -86910 -203882
7640b03882k7091R4815k9661k2523N8148L111O6314P1611Q3752P6603n2416k3869
$$ -203882 -230973 -136158 -165819 -188342 -130194 -127083 -60769 10842 94594 171197 118781 94912
7628I4912j00514o1634O8181J57588L6292p2639r1024M400j02154l0137m9657
$$ 94912 -5602 -67236 945 158533 194825 122186 31162 35562 -66592 -96729 -146386
7617a46386o4943p677K6140P0964N5958R0056K7438j1289p8952k3252j4895j27532
$$ -146386 -211329 -219006 -192866 -121902 -65944 24112 51550 40261 -38691 -61943 -76838 -204370
7605b04370j457J45157N5296Q9421l7165p1613j5017o5198o774k2167n0712Q1698
$$ -204370 -205827 -60670 -5374 84047 46882 -24731 -39748 -104946 -111720 -133887 -184599 -102901
7593a02901J37672M070L6644J8316j19039j06065n3036l9482N2547j6498P0581
$$ -102901 34771 38841 75485 93801 -25238 -131303 -184339 -223821 -171274 -187772 -117191
7582a17191K9070J2022J1473L2755k02108k8382J32546j6169J25828K8352m7536
$$ -117191 -88121 -76099 -64626 -31871 -233979 -262361 -129815 -145984 -20156 8196 -39340
7571c9340j34330J2347N3782M3207n1126M3469J55105J7961j20186Q929P3215
$$ -39340 -173670 -161323 -107541 -64334 -115460 -71991 83114 101075 -19111 -10182 63033
7560F3033P1897k2710j61889J9516K4001j4952R161K7102L5853Q773j51684j66678
$$ 63033 134930 112220 -49669 -30153 -6152 -21104 -11943 15159 51012 59785 -91899 -258577
7548b58577L1066L6669O7433O693J0896N3852K5410J1534j893J6323l0516l5184
$$ -258577 -227511 -190842 -123409 -116716 -105820 -51968 -26558 -15024 -16917 -594 -31110 -66294
7536f6294O430Q757L7215N8507q6701l3526k4481N7057r85k4409J6316j41334
$$ -66294 -59864 -51107 -13892 44615 -42086 -75612 -100093 -43036 -44021 -68430 -52114 -193448
7524a93448o80Q3472N6311P449p7804j96820M4892J83643N5652j5307J2706N2693
$$ -193448 -194128 -110656 -54345 -46896 -124700 -321520 -276628 -92985 -37333 -52640 -39934 12759
7512A2759J09940j0873o7299k2142Q469n4636R3789l6995o0122o7077N6124j3138
$$ 12759 122699 111826 44527 22385 30854 -23782 70007 33012 -27110 -94187 -38063 -51201
7500e1201m4901N4888J6543J7259j21321n3588Q4569K7647n399O3577J42596L005
$$ -51201 -96102 -41214 -24671 -7412 -128733 -182321 -97752 -70105 -75504 -11927 130669 133674
7488A33674o6597m9552K0641Q0457l5120o9771J2102n9400m4627r6218j912P5960
$$ 133674 67077 17525 38166 118623 83503 13732 25834 -33566 -78193 -174411 -176323 -100363
7476a00363Q6861N6024J00250p0802k2311k0031k4855N0516J7996k036m3269j75363
$$ -100363 -13502 42522 142772 71970 49659 29628 4773 55289 73285 71249 27980 -147383
7464a47383n0570J59874J46499r605q2539j32797N876m3630n0939R0720J11719
$$ -147383 -197953 -38079 108420 98815 16276 -116521 -110645 -154275 -205214 -114494 -2775
7453b775k165K1809m8965Q6244Q820R1012P0902k6100k26553j32091J58305L1563
$$ -2775 -4940 16869 -32096 54148 62968 153980 224882 198782 -27771 -159862 -1557 30006
7441C0006m8783j07685K3678J7470L5014r42L4675q9923q5593J0068j30560M2481
$$ 30006 -18777 -126462 -102784 -85314 -50300 -51242 -16567 -106490 -192083 -182015 -312575 -270094
7429b70094n0674R6141O3072J23689M6305q6390J08592N6910k4180l9126m6990
$$ -270094 -320768 -224627 -161555 -37866 8439 -77951 30641 87551 63371 24245 -22745
7418b2745n990m9973J60611P8553L4879K9490p7990j50830j18168J25883J31422
$$ -22745 -28735 -78708 81903 160456 195335 224825 146835 -3995 -122163 3720 135142
7407A35142l7922p0232M4962m925j3650L8690j02141k1476O2807n8116k7001k5861
$$ 135142 97220 26988 71950 67025 53375 92065 -10076 -31552 31255 -26861 -53862 -79723
7395g9723o0251J0771O3681K2429k637k2022R461K5775o972o9390j6484l6848
$$ -79723 -139974 -129203 -65522 -43093 -45730 -67752 -58291 -32516 -39488 -108878 -125362 -162210
7383a62210M2683R5311K0641m9967j4456M8486r3101M8578j2602o3464J3593j1949
$$ -162210 -119527 -24216 -3575 -53542 -67998 -19512 -112613 -64035 -76637 -140101 -126508 -138457
7371a38457R1984K0738n6802J5179l2233O791M7717j7234p614P6168M2462O9323
$$ -138457 -46473 -25735 -82537 -67358 -99591 -92800 -45083 -62317 -69931 6237 48699 118022
7359A18022K3778n7534J3391k4045j46570L1869l3821o0919P2134Q7702J35620
$$ 118022 141800 84266 97657 73612 -72958 -41089 -74910 -135829 -63695 24007 159627
7348A59627K0946j14007j88428K6058m0371o2014O6907L6091P7934L1211p2083
$$ 159627 180573 66566 -121862 -95804 -136175 -198189 -131282 -95191 -17257 13954 -58129
7337e8129Q2015J1094L3157o154P9998O3886n9919M7349r6078K6239j332j18614
$$ -58129 23886 34980 68137 61983 141981 205867 145948 193297 97219 123458 122126 3512
$$ [...]
##END NTUPLES=NMR SPECTRUM
##END=
