##TITLE=Analysis number 322416
Compound Code btb 07379
Project Code adrs
Chemist Name fudan
##JCAMPDX= 6.0         $$ Bruker NMR JCAMP-DX V2.0
##DATA TYPE= NMR SPECTRUM
##DATA CLASS= NTUPLES
##ORIGIN= Bruker BioSpin GmbH
##OWNER= nmr
$$ XWIN-NMR		Version 3.5
$$ Tue Sep 26 08:29:47 2006 GMT Daylight Time (UT+1h)  MAYBRIDGE\nmr@NMR_250MHZ
##.OBSERVE FREQUENCY= 250.131544655141
##.OBSERVE NUCLEUS= ^1H
##.ACQUISITION MODE= SIMULTANEOUS (DQD)
##.ACQUISITION SCHEME= undefined
##.AVERAGES= 16
##.DIGITISER RES= 18
##SPECTROMETER/DATA SYSTEM= dpx250
##.PULSE SEQUENCE= zg30
##.SOLVENT NAME= DMSO
##.SHIFT REFERENCE= (INTERNAL, DMSO, 0, 16.522)
##AUDIT TRAIL= $$ (NUMBER, WHEN, WHO, WHERE, WHAT)
$$ ##TITLE= Audit trail, XWIN-NMR		Version 3.5
$$ ##JCAMPDX= 5.01
$$ ##ORIGIN= Bruker BioSpin GmbH
$$ ##OWNER= nmr
$$ C:\u/data/dgb/nmr/ADRS/1350/pdata/1/auditp.txt
$$ ##AUDIT TRAIL=  $$ (NUMBER, WHEN, WHO, WHERE, WHAT)
(   1,<2006-09-26 08:29:20.77 +100>,<MAYBRIDGE\nmr>,<NMR_250MHZ>,
      <created by zg, POWCHK disabled, PULCHK disabled
       configuration hash MD5:
       E2 DF 36 D8 04 B2 41 60 5A D7 A3 38 5A 4B D0 FE
       data hash MD5: 64K
       A2 6C EB 6F F6 25 53 F3 05 97 D3 2F B3 B5 EA 4F>)
(   2,<2006-09-26 08:29:37.37 +100>,<MAYBRIDGE\nmr>,<NMR_250MHZ>,
      <Start of raw data processing
       ef LB = 0.3 FT_mod = 6 PKNL = 1 SI = 32K 
       data hash MD5: 32K
       52 FD F1 EA 45 DE 81 3A 9D 2F E3 09 5D C7 9B A2>)
(   3,<2006-09-26 08:29:39.01 +100>,<MAYBRIDGE\nmr>,<NMR_250MHZ>,
      <apk 
       data hash MD5: 32K
       FC 97 17 9C F7 4F 6C 4B C0 36 60 36 91 EB EF 03>)
(   4,<2006-09-26 08:29:39.80 +100>,<MAYBRIDGE\nmr>,<NMR_250MHZ>,
      <abs ABSG = 5 
       data hash MD5: 32K
       23 C7 AB DB F6 B3 52 72 6C 09 D3 BE 1F 08 12 54>)
$$ ##END=
$$ 
$$ hash MD5
$$ DA 19 C0 2C 67 91 E1 D2 56 BA A9 9B B5 D1 37 A4
##$RELAX= 
##$RELAX= 
##$RELAX= 
##$RELAX= 
##$RELAX= 
##$RELAX= 
##$RELAX= 
$$ Bruker specific parameters
$$ --------------------------
##$DU= <C:\u>
##$EXPNO= 1350
##$NAME= <ADRS>
##$PROCNO= 1
##$TYPE= <nmr>
##$USER= <dgb>
##$AMP= (0..31)
100 100 100 100 100 100 100 100 100 100 100 100 100 100 100 100 100 100 
100 100 100 100 100 100 100 100 100 100 100 100 100 100 
##$AQSEQ= 0
##$AQ_mod= 3
##$AUNM= <au_zg>
##$AUTOPOS= <37 >
##$BF1= 250.13
##$BF2= 250.13
##$BF3= 250.13
##$BF4= 250.13
##$BF5= 500.13
##$BF6= 500.13
##$BF7= 500.13
##$BF8= 500.13
##$BYTORDA= 1
##$CFDGTYP= 0
##$CFRGTYP= 5
##$CHEMSTR= <none>
##$CNST= (0..31)
1 1 145 1 1 1 1 1 1 1 1 1 1 1 1 1 1 1 1 1 1 1 1 1 1 1 1 1 1 1 1 1 
##$CPDPRG= <>
##$CPDPRG1= <>
##$CPDPRG2= <>
##$CPDPRG3= <>
##$CPDPRG4= <mlev>
##$CPDPRG5= <mlev>
##$CPDPRG6= <mlev>
##$CPDPRG7= <mlev>
##$CPDPRG8= <mlev>
##$CPDPRGB= <>
##$CPDPRGT= <>
##$D= (0..31)
0 1 0 0 0 0 0 0 0 0.06 0 0 0 0 0 0 0.0002 0 0 0 0 0 0 0 0 0 0 0 0 0 0 
0 
##$DATE= 1159255758
##$DBL= (0..7)
120 120 120 120 120 120 120 120 
##$DBP= (0..7)
150 150 150 150 150 150 150 150 
##$DBP07= 0
##$DBPNAM0= <>
##$DBPNAM1= <>
##$DBPNAM2= <>
##$DBPNAM3= <>
$$ [...]
##$SUBNAM7= <"">
##$SUBNAM8= <"">
##$SUBNAM9= <"">
##$SW= 20.6930455092707
##$SWIBOX= (0..15)
0 0 3 0 0 0 0 0 0 0 0 0 0 0 0 0 
##$SW_h= 5175.983436853
##$TD= 65536
##$TD0= 1
##$TE= 295.16
##$TE2= 300
##$TE3= 300
##$TEG= 300
##$TL= (0..7)
0 120 120 120 120 120 120 120 
##$TP= (0..7)
150 150 150 150 150 150 150 150 
##$TP07= 0
##$TPNAME0= <>
##$TPNAME1= <>
##$TPNAME2= <>
##$TPNAME3= <>
##$TPNAME4= <>
##$TPNAME5= <>
##$TPNAME6= <>
##$TPNAME7= <>
##$TPOAL= (0..7)
0.5 0.5 0.5 0.5 0.5 0.5 0.5 0.5 
##$TPOFFS= (0..7)
0 0 0 0 0 0 0 0 
##$TUNHIN= 0
##$TUNHOUT= 0
##$TUNXOUT= 0
##$USERA1= <user>
##$USERA2= <user>
##$USERA3= <user>
##$USERA4= <user>
##$USERA5= <user>
##$V9= 5
##$VALIST= <valist>
##$VCLIST= <CCCCCCCCCCCCCCC>
##$VD= 0
##$VDLIST= <DDDDDDDDDDDDDDD>
##$VPLIST= <PPPPPPPPPPPPPPP>
##$VTLIST= <TTTTTTTTTTTTTTT>
##$WBST= 1024
##$WBSW= 4
##$XGAIN= (0..3)
0 0 0 0 
##$XL= 0
##$YL= 0
##$YMAX_a= 367940
##$YMIN_a= -426086
##$ZGOPTNS= <>
##$ZL1= 120
##$ZL2= 120
##$ZL3= 120
##$ZL4= 120
##$ABSF1= 16.522
##$ABSF2= -4.171173
##$ABSG= 5
##$ABSL= 3
##$ALPHA= 0
##$AQORDER= 0
##$ASSFAC= 0
##$ASSFACI= 0
##$ASSFACX= 0
##$ASSWID= 0
##$AUNMP= <proc_1d>
##$AZFE= 0.1
##$AZFW= 0.1
##$BCFW= 0
##$BC_mod= 0
##$BYTORDP= 0
##$COROFFS= 0
##$CY= 12.5
##$DATMOD= 1
##$DC= 0
##$DFILT= <>
##$DTYPP= 0
##$F1P= 14.0000005364418
##$F2P= -0.99999901652339
##$FCOR= 0.5
##$FTSIZE= 32768
##$FT_mod= 6
##$GAMMA= 0
##$GB= 0
##$INTBC= 1
##$INTSCL= 1
##$ISEN= 128
##$LB= 0.3
##$LEV0= 0
##$LPBIN= 0
##$MAXI= 10000
##$MC2= 0
##$MEAN= 0
##$ME_mod= 0
##$MI= 0
##$NCOEF= 0
##$NC_proc= -4
##$NLEV= 6
##$NOISF1= 0
##$NOISF2= 0
##$NSP= 0
##$NTH_PI= 0
##$NZP= 0
##$OFFSET= 16.522
##$PC= 1
##$PHC0= 143.9403
##$PHC1= 5.499034
##$PH_mod= 1
##$PKNL= yes
##$PPARMOD= 0
##$PSCAL= 4
##$PSIGN= 0
##$REVERSE= no
##$SF= 250.13
##$SI= 32768
##$SIGF1= 0
##$SIGF2= 0
##$SINO= 400
##$SIOLD= 32768
##$SREGLST= <1H.DMSO>
##$SSB= 0
##$STSI= 32768
##$STSR= 0
##$SW_p= 5175.98343685301
##$SYMM= 0
##$S_DEV= 0
##$TDeff= 65536
##$TDoff= 0
##$TI= <Analysis number 999999
Compound Code 99
Book Reference 9
Project Code 9>
##$TILT= no
##$TM1= 0
##$TM2= 0
##$TOPLEV= 0
##$USERP1= <user>
##$USERP2= <user>
##$USERP3= <user>
##$USERP4= <user>
##$USERP5= <user>
##$WDW= 1
##$XDIM= 32768
##$YMAX_p= 416773182
##$YMIN_p= -443906
$$ End of Bruker specific parameters
$$ ---------------------------------
##NTUPLES= NMR SPECTRUM
##VAR_NAME=  FREQUENCY,     SPECTRUM/REAL,   SPECTRUM/IMAG
##SYMBOL=    X,             R,               I
##VAR_TYPE=  INDEPENDENT,   DEPENDENT,       DEPENDENT
##VAR_FORM=  AFFN,          ASDF,            ASDF
##VAR_DIM=   32768,         32768,           32768
##UNITS=     HZ,            ARBITRARY UNITS, ARBITRARY UNITS
##FACTOR=    0.157963299565203, 1,           1
##FIRST=     4132.6476996994, 0,             0
##LAST=      -1043.33573715361, 0,           0
##MIN=       -1043.33573715361, -443906,     0
##MAX=       4132.6476996994, 416773182,     0
$$ Real data points
##PAGE= N=1
##DATA TABLE= (X++(R..R)), XYDATA
$$ [...]
17348H8103r6193O7166k849j29546j06239O6905k5462K95R1632K0464n2970J436
17336g7258j16282p892P8965J04787M7968l392K8506O4959K4982n9161r0282j39223
17324a43323O3130R6204Q1563Q5550n0868j79845r6636N9007J18986p1813N1697
17313A3652K24380L8605K667j32837j51075O1203l9911k3043k7765n0171k7371
17302a11666l281O9340l1501j36034J0638K7574J13123P8686j36496k9345J03365
17291d5597J47k9951k2804N0019K6384J19389n1326j41037r64j7305O5604n0216
17279i7657j46774L5953Q5605J22381P530M6051L1318J9612K0210m30J6701r7347
17267D3153m1934l3976l160o8959j3418J2521N8634j2795j09275l3746K06246
$$ y = [88103, -8090, 59076, 56227, -73319, -179558, -112653, -138115, -137820, -46188, -25724, -78694, -77258, -193540, -201432, -122467, -17680, 30288, 26896, 55402, 120361, 145343, 86182, -4100, -143323, -80193, 16011, 97574, 183124, 132256, -47589, -144225, -85218, 33768, -38045, 13652, 238032, 276637, 279304, 146467, -4608, 56595, 16684, -6359, -34124, -84295, -111666, -114947, -45607, -77108, -213142, -202504, -174930, -61807, 16879, -119617, -148962, -45597, -45450, -75401, -98205, -48186, -21802, 97587, 46261, -94776, -95740, -113045, -47441, -97657, -244431, -208478, -122873, -492, 7038, 53089, 84407, 104019, 124229, 123799, 140500, 43153, 1219, -32757, -35917, -104876, -118294, -105773, -47139, -59934, -169209, -202955, 3291]
17256C291L9828o0901m9895J40451J2423l0075j10616m445J02292q339j0845o8056
17244d4887j1566R8931J8759j00766q067L5946P0727K8691r5406k3576L0326j3386
17232a4274j4859j8664l7726j7403M7997J15448k984o178q587n4892k42O9504
17220E7140N0396q1187j2231R4949n3386l8566l6687k4715n1501J487P0578N4655
17208C0932j6197r6669m047n9764P7996o3514M0335m7193o7958l962K2362k301
17196a89980J85065q2954M993R7532j1997r3733k3841L9148k4916J28111m1643
17185a4215j39876o7818q5842l4185Q8768J99261L8074J21078k9737K1710L1665
17174A28883p1386j30970R946R2888Q7477O5620r7834j00277j05701o4709N6247
$$ y = [3291, 43119, -17782, -67677, 72774, 85197, 55122, -55494, -59939, 42353, 34014, 23169, -44887, -56453, 42478, 61237, -39529, -47596, -11650, 59077, 87768, -7638, -31214, -888, -14274, -29133, -47797, -85523, -102926, -54929, 60519, 57535, 51357, 42770, -12122, -12364, 57140, 107536, 26349, 14118, 109067, 55681, 17115, -19572, -44287, -95788, -94301, -23723, 30932, 14735, -81934, -85981, -145745, -67749, -131263, -90928, -138121, -206079, -210041, -187679, -189980, -4915, -87869, -82876, 14656, 2659, -91074, -114915, -75767, -100683, 27428, -14215, -154091, -221909, -307751, -341936, -253168, -53907, -15833, 105245, 75508, 97218, 128883, 57497, -73473, -63527, 29361, 116838, 182458, 84624, -15653, -121354, -186063, -129816]
17163a29816O4593L9385M1182O5282j53619l5433K9675O8929J01838R3041k3738
17152A61319n1986j76791m4226P7109M521j39304n4735k626J10209J04253M1403
17141B9146r0183n170N5640r5032k418R3934N1804J8554l6494n6297m6504K9204
17129e3816N0776L3801M7031k6370J8440j20596j77763Q0830J04768J08559K0567
17118H6227q4823j42821J77142J18934p8145o5565p1081k8225N6569m4580o0667
17107a37035Q220j9775J26149N6392k096o9753q5410P8750J9973O0148K7126P2908
17095A35597j8346l0995o4469j26564M3966N3045r3161j24271J5643k826J06018
17084a06363M5367k9052r7685J0444P6895K0705N134q64o2389j34622M3987k9077
$$ y = [-129816, -65223, -25838, 15344, 80626, -72993, -108426, -78751, -9822, 92016, 185057, 161319, 109333, -67458, -111684, -34575, -30054, -169358, -224093, -226719, -116510, -12257, 29146, -61037, -66207, -10567, -105599, -108017, -14083, 37721, 56275, 19781, -36516, -83020, -53816, -3040, 30761, 77792, 51422, 69862, -50734, -228497, -147667, -42899, 65660, 86227, 1404, -141417, 35725, 154659, 76514, 10949, -60132, -88357, -31788, -76368, -137035, -128815, -148590, -22441, 33951, 31855, -37898, -123308, -44558, -24585, 35563, 62689, 135597, 117251, 86256, 21787, -104777, -60811, -7766, -100927, -225198, -209555, -212381, -106363, -60996, -90048, -187733, -177289, -100394, -79689, -74555, -75419, -137808, -272430, -228443, -257520]
17072b57520n7403Q9035M3185r959P1675N2926Q906P7725j1673k500J89138M2950
17060B36485j24411j59117q9029M7774n6501n7839K9677J39848J5816n9177J4306
17049f2168p6919n099M0013m6686K9927R1309R2603o6160R812o7190l4831m903
17037a00292p9927L3071J3123j04438p635O5698R5325j01081K5910R4995J0509
17026e4742L8551L3403J6994K2907R7012j1980j46990q2882J7162P1202O6940
17015F7577j1686M1510o6340L0565m9844k2523J05197J3983j5733r7926r5934
17004a01154n587M0906J7314n8377K3001J7426N0583K8562m0064n4962j885J48359
16992F4122J5818l3017j7008m4194J4514P8485L1171l4052j08282n8103K9677
$$ y = [-257520, -314923, -225888, -182703, -192662, -120987, -68061, -59155, 18570, 6897, 4397, 193535, 236485, 112074, -47043, -136072, -88298, -144799, -202638, -172961, -33113, -17297, -76474, -62168, -139087, -144186, -104173, -150859, -120932, -29623, 62980, -3180, 6632, -60558, -95389, -100292, -180219, -147148, -134025, -238463, -246098, -180400, -85075, -186156, -160246, -65251, -54742, -16191, 17212, 34206, 57113, 154125, 142145, -4845, -87727, -70565, 637, 67577, 55891, 97401, 31061, 61626, 11782, -10741, 94456, 108439, 92706, -5220, -101154, -106741, -65835, -48521, -106898, -83897, -66471, -15888, 12674, -27390, -82352, -84237, 64122, 79940, 46923, 29915, -14279, 235, 78720, 109891, 75839, -32443, -90546, -60869]
16981f0869R9156J0835q7845Q7715J07857l5097L1278n0533j10195q359o077l9614
16969f1748O6647l7303P544j553M4603R219l1813j37747j5551N3994k9772P0250
16957f3230N2317N1931J05494p3201q6191P2621J31799j15087j5506q884P3835
16946A25898l4161J4227j21223j03336J7290l6591Q650Q8975O1981j01552j20002
16935a99844N9015J28704j9345p1906M7204k2254O7683m4380l9871M4166K316
16924d8512J0230Q4729J02530K1329k1023p0585p0319n4753p1468J622J03235
16913a2985Q9808m4352P7047J38491q2178J2265l5609m8672k7071l2880j6439
16902A7425r0780o3054K59591J78877q4557k36396j02057O4270L0260M4109L5747
$$ y = [-60869, 38287, 49122, -38723, 48992, 156849, 121752, 153030, 102497, -7698, -16057, -22134, -61748, 4899, -32404, -24860, -26413, 18190, 27409, -4404, -142151, -157702, -103708, -133480, -63230, -10913, 41018, 146512, 73311, -12880, 59741, 191540, 76453, 60947, 52063, 125898, 91737, 105964, -15259, -118595, -101305, -137896, -129246, -40271, 21710, -79842, -199844, -140829, -12125, -31470, -103376, -56172, -78426, -10743, -55123, -94994, -50828, -48512, -38282, 46447, 148977, 170306, 149283, 78698, 8379, -46374, -117842, -116220, -12985, 76823, 32471, 109518, 248009, 165831, 178096, 142487, 93815, 66744, 33864, 17425, -73355, -136409, 123182, 302059, 217502, -18894, -120951, -56681, -26421, 17688, 53435]
16891E3435J5437p2927j38603l6579J42666k5456o5239n6606R9293O8134j43026
16880a59471O8146Q3796M1078M8293p207j00455j5961M9853r966O7025l8116j18030
16868i1015j09232J73734J09664k302j09002k01762k8053R6535m391J00228K5095
16857d0501L9881j23571O474J09249j5080j64737j1805J2849J0488J23717l8374
16846i1410r2333n3241O953J09169K0193p3351l1188J5059L7453N3283j1118n673
16834a16204j18925O7217L4687k9186M9276M0080O7580N4725J2884P2556L1884
16823A66574L3861o6644o3704k9746j15053j65154K7614M0836J48770P1872Q534
16812E7760j8244l1182R3574O5407p4943p1192j50778j36449p5322R5530J06601
$$ y = [53435, 68872, -4055, -142658, -179237, -36571, -62027, -127266, -183872, -84579, -16445, -159471, -91325, -7529, 33549, 81842, 74635, -25820, -41781, 8072, -1894, 65131, 27015, -91015, -200247, -26513, 83151, 80849, -28153, -229915, -257968, -161433, -165824, -65596, -40501, -620, -124191, -117717, -8468, -23548, -188285, -200090, -187241, -176753, -53036, -91410, -183743, -236984, -230031, -120862, -100669, -174020, -205208, -190149, -152696, -99413, -110531, -116204, -235129, -167912, -133225, -162411, -113135, -73055, -5475, 49250, 62134, 134690, 166574, 200435, 133791, 70087, 40341, -74712, -239866, -212252, -171416, -22646, 49226, 57760, 39516, 8334, 101908, 167315, 92372, 21180, -129598, -266047, -341369, -245839, -139238]
16801a39238j7224o0617J7256k6542m845J00378k9161Q5064n0314P0205j9913
16790g4951l7898O9822j02490k4365J02344J01307l4967n3733K8255J3310j7485
16779c0851j5181o95J36146K14330p2765j02004N0818O9500j40434j04169J28130
16768A32825r7088j46493K060J50838P6998q939q146j51076k6578R7239J46424
16757A68064o19o0641j98853J9539J2946l5768p686k1143n4801R5491J83255M2029
16745A41813k20242j17845J30442J43114M3400r8234p9810j0047Q6953m1779M7239
16734B5004n6916n1704N219O4306p367O1188o014o0336k7293r0659J8337l3573
16722a59808j00720j6952k2249Q4573N6010J63179L4857L6119q9274j80424p1983
$$ y = [-139238, -156462, -217079, -199823, -226365, -231210, -130832, -159993, -74929, -125243, -55038, -74951, -112849, -43027, -145517, -169882, -67538, 33769, -1198, -54931, -26676, -13366, -30851, -46032, -46727, 89419, 303749, 230984, 128980, 179798, 249298, 108864, 4695, 132825, 35737, -110756, -108696, 42142, 119140, 110201, 102055, -49021, -75599, 21640, 168064, 167445, 106804, -92049, -72510, -59564, -95332, -103018, -124161, -178962, -83471, 99784, 141813, -78429, -196274, -65832, 77282, 120682, 22448, -57362, -67409, 19544, -22235, 25004, -31912, -83616, -78397, -14091, -21458, 39730, 33716, -26620, -53913, -144572, -126235, -159808, -260528, -277480, -299729, -215156, -159146, 4033, 38890, 75009, -14265, -194689, -266672]
16711b66672O2862j3747l8579O3161J02492J65645k2405P72L7948N4400k0205
16700A25672J17517K0440P444j29560L070j7868M0450n9474n1452p4561L8718
16689B0396O2031k3065l9296j5709K937O2350J026n477P572J1442J5403n2349
16677D7261j0386J09619l1515j99083j31238J97567O5071J63290J09391k6205
16667B93772r6329j47797j02816O0373K3992P3003m6169q2712J07215k3453q9586
16656c0507n7678q1870k3832P9333p5479m4435J1222R9096J21221r1889K3539
16645g1279J48469m6817j39183J25061O2376k9384j2219J53742J1963l704L9199
16634B38224K0485k0355r8577j77890p5984L5093K9286Q620O0093o1331M9317
$$ y = [-266672, -203810, -217557, -256136, -192975, -90483, 75162, 52757, 53529, 91477, 145877, 125672, 243189, 263629, 271073, 141513, 144583, 126715, 167165, 107691, 56239, -18322, 20396, 82427, 59362, 20066, 4357, 7294, 69644, 70670, 65193, 72765, 84207, 99610, 47261, 36875, 146494, 114979, -84104, -215342, -17775, 47296, 210586, 319977, 293772, 197443, 49646, -53170, 7203, 31195, 104198, 58029, -24683, 82532, 59079, -30507, -88185, -170055, -193887, -114554, -190033, -234468, -223246, -124150, -2929, -94818, -71279, 77190, 30373, -108810, 16251, 78627, 49243, 37024, 190766, 202729, 199025, 238224, 258709, 238354, 139777, -38113, -114097, -79004, -49718, -41098, 18995, -42336, 6981]
16623F981M7077L7763m1341M1924k6349l8899o7520M4996J22876l5816j54270
16612f2578L0343j02841o7215K18322M4844p8968j21749k594Q2866N0666k06325
16601b15229q9517n6307J34771J29470M2705k9596N1222K8714Q4904R6186j47657
16590B9666n5528j09486j4453N3137L7632J4561l0125K4257p3542O7103J31596
16579G4818m8875l5462p3181L1387l2319J77473O5661j67044k8040r4382J5551
16568a14413P1856r9089n2238K2692L6016J01730Q1467j6003L7114o5704q318
16557d890j07796k1966L7283R3991P4463Q040r6078j11695j2369O3463J6576L0223
16545c0755o4550K01J48045N6918j05872j50142K1473J00153J28369Q3345j5358
$$ y = [6981, 54058, 91821, 50480, 92404, 66055, 27156, -40364, 4632, 127508, 91692, -62578, -32235, -135076, -202291, 16031, 60875, -18093, -139842, -142436, -59570, -8904, -215229, -304746, -361053, -226282, -96812, -54107, -83703, -32481, -3767, 81137, 177323, 29666, -25862, -135348, -149801, -96664, -59032, -44471, -74596, -50339, -123881, -56778, 74818, 25943, -9519, -82700, -51313, -83632, 93841, 159502, -7542, -35582, -129964, -114413, -42557, -141646, -193884, -171192, -135176, -33446, 48021, 32018, 69132, 3428, -4890, -112686, -134652, -97369, -3378, 71085, 79125, -16953, -128648, -141017, -77554, -60978, -30755, -95305, -95104, 52941, 109859, 3987, -146155, -124682, -24529, 103840, 187185, 171827]
16534A71827k8196q2076m0918o4821Q3197J8761j73259Q1998J26609j8045j19082
16523d4005l9872L3128K5288M082L4851P1821p235n8545K5805m886M664J4159
16511E9255L4670N5807p3236K964J16338K4594m6170q8975l7257L5062l1550O6932
16499A18434k3355j74776o5262J15584M7459o9116n6972m116K2459J06900j5287
16488A952M4536k9255r2574J09811J5347J1162L1502j2361m8685k5039R027O968
16476B2391m308k5724o0303P974R9738k0118O8001L2451q2810Q933l0567J19127
16464A34785j0631j09002N4000O5476K0801L0376n2790j01433o1419j9350J0167
16453c9020l427l4278Q7807j8241o3867N6384q7075Q620k8947k3744J7762j338
$$ y = [171827, 143631, 61555, 20637, -44184, 39013, 57774, -115485, -33487, 93122, 75077, -44005, -83877, -50749, -25461, -21379, 13472, 85293, 78058, 19513, 45318, 40432, 45096, 59255, 93925, 149732, 76496, 79460, 195798, 220392, 174222, 85247, 47990, 83052, 51502, 118434, 95079, -79697, -144959, -29375, 18084, -51032, -108004, -112120, -89661, 17239, 1952, 46488, 17233, -75341, 34470, 49817, 60979, 92481, 80120, 31435, 6396, 15423, 22391, 18083, -7641, -67944, -59970, 39768, 19650, 87651, 120102, 37292, 46225, 15658, 134785, 124154, 15152, 69152, 134628, 155429, 185805, 133015, 31582, -29837, -49187, -39020, -42447, -76725, 11082, -7159, -71026, -14642, -101717, -93097, -122044, -145788, -128026, -129364]
16441a29364P891O7546J1376o7535l3202J10741N6234M8018r775k5561m6660N065
16429e226j22894j04718K7038P5485k9976n0579N2020P9580P7771P1639m7360
16418B2780j02484n4283n1026p8367R4814N843j6174R2022M6336j8379p3137j19494
16406b51549J00453Q7184J2369K2923R3949p3616j94719J12080K16498L8841k2430
16395A41983j25894p3341P1054K4329K3037k0622J3944n980n1356j7000j18236
16384a38082O0467R084q3900n482K3199O9077K050p7494K7093K22061o4153j52758
16372a08838n4313k1246q4178J2014M4702N888N5215L3093N4000j2114Q3617R0014
16360I7854k4788q889o1590j6114J30704M3598p4150r6670n5638J2593j91879
$$ y = [-129364, -121473, -53927, -42551, -110086, -143288, -32547, 23687, 71705, 61930, 36369, -10291, -5226, -128120, -232838, -205800, -130315, -160291, -210870, -158850, -79270, -1499, 70140, 22780, -79704, -133987, -185013, -263380, -168566, -162723, -178897, -86875, -40539, -58918, -132055, -251549, -151096, -63912, -51543, -28620, 65329, -8287, -203006, -90926, 125572, 164413, 141983, 16089, -57252, 13802, 38131, 61168, 40546, 54490, 48510, -2846, -19846, -138082, -77615, -68531, -152431, -157913, -134714, -65637, -63587, -141081, -113988, 108073, 43920, -108838, -163151, -184397, -268575, -256561, -211859, -205971, -150756, -117663, -63663, -75777, 7840, 97854, 73066, 64177, 2587, -13527, 117177, 160775, 86625, -10045, -65683, -53090, -244969]
16349b44969l4453M3526J39473P0702n3293J4404P3962P6048M381k9171P4876
16338A35486L9385K1389j6645n3890k5417k1502l7582K7373l1014q9309k4423
16327g6149o9540j4880k385K2047O2865l5318j3634M1903o997L9048R9886r340
16315C7506n342o3671p4233M3328L7763L2184j49458k1235L0920J27255k9052
16304c4035j26415n9143R1798k4862j60885l2014J74647J38216K13470l2284k26488
16293g7995O7102M5065p0180q728L4322J23291N5050r5876k6226j1822Q004K0671
16281F2678n8393j24343p1729O9459P9558m8239j752N650p3931o2765P4616P8882
16269g0309P9712q2087q3473j9746P1147j8256m5690m4817O6542P4987m4819Q7576
$$ y = [-244969, -279422, -235896, -96423, -25721, -79014, -64610, 9352, 85400, 89781, 60610, 135486, 174871, 196260, 179615, 125725, 100308, 78806, 41224, 68597, 37583, -51726, -76149, -145689, -160569, -162954, -140907, -78042, -113360, -126994, -85091, -92088, -53040, 46846, 37506, 32164, -31507, -105740, -62412, -24649, 7535, -141923, -163158, -132238, -4983, -34035, -160450, -219593, -127795, -152657, -313542, -345556, -170909, -32693, 180777, 148493, -77995, -10893, 34172, -36008, -44736, -10414, 112877, 167927, 72051, 45825, 34003, 42007, 62678, 4285, -120058, -191787, -122328, -42770, -91009, -92761, -87111, -161042, -223807, -149191, -70309, 9403, -72684, -156157, -175903, -104756, -123012, -168702, -213519, -146977, -71990, -116809, -29233]
16257b9233R5249j5118J8797o0798q2569J13087n063J05739j30115j07072N5224
16246d1872L2165j682j2994n2464o5626O2749l2302m8167j7160L3715N0272N5048
16234c8318K3983k4272j03982N3953o4675J8545j0578J02057L2394j13107k8930
16223a52930J9028J16089M1055n7141q2740k2022O131M7958l3259J9386J39100
16212D0655J0526o2908L9719k4421r0974k1641J02923M5425l1228j00494j5822
16201a08240P7168J78301O2694q0775j77234M85L5123j2607r246O0938J10150
16190A36757n3142m4855q8524j3896O319k0567K2999l9413n009J1632R2579J0485
16178A5365k4411k9881q188o0336P1774J15179N7529j18409j71523k8961P4059
$$ y = [-29233, 66016, 50898, 69695, 8897, -73672, 39415, 34352, 140091, 9976, -97096, -41872, -9707, -11389, -24383, -76847, -142473, -79724, -112026, -160193, -177353, -143638, -93366, -38318, -14335, -38607, -142589, -88636, -153311, -134766, -145344, -43287, -10893, -124000, -152930, -133902, -17813, 23242, -33899, -116639, -138661, -132530, -84572, -117831, -98445, 40655, 51181, -11727, 27992, 3571, -87403, -109044, -6121, 39304, 8076, -92418, -108240, -31072, 147229, 209923, 129148, -48086, -47601, -12478, -25085, -34331, 26607, 136757, 83615, 38760, -49764, -63660, -57341, -77908, -54909, -94322, -99331, -87699, 4880, 15365, -9046, -38927, -47115, -107451, -35677, 79502, 137031, 18622, -152901, -181862, -107803]
16167a07803n889l0229K4049K5510P1470K9293r4109J0548P9331l4022n3358L8098
16155d7111K4268p2270l02l8821l1447K1413J00283R63r3869M5321M0920L2858
16143a7794j0989J9690q4953n1761O4906K9377J8866l1920Q4615J59724j08901
16132G0860j4319M1973n4211p3441L7677j710O586K592o8374k4058L626J59432
16120H6633l9093k115m5516j59956k8293J9645j5882N6813l3646k6650M0494L0614
16108a16952l1313N8737J24013P8574Q677j13190O619M1724m3317K1259M8790
16097H3621j7271j18860l1108M1390M1225l3120N1582O8579L6506l2353k4244
16086F5947J1125L8204l1979n7798k3392j7571m8525N1979K6340N4776N336L290
$$ y = [-107803, -113692, -143921, -119872, -94362, -22892, 6401, -87708, -77160, 2171, -31851, -85209, -47111, -22843, -95113, -95415, -134236, -165683, -144270, -43987, -43024, -136893, -91572, -50652, -17794, -28783, -9093, -94046, -145807, -80901, -51524, -32658, -64578, 20037, 179761, 70860, 56541, 98514, 44303, -29138, 8539, 6829, 13415, 16007, -52367, -76425, -72799, 86633, 47540, 45425, -91, -160047, -188340, -168695, -184577, -127764, -161410, -188060, -147566, -116952, -148265, -89528, 34485, 113059, 121736, 8546, 15165, 56889, 13572, 34831, 83621, 66350, -52510, -83618, -42228, -1003, -34123, 17459, 86038, 122544, 90191, 65947, 77072, 115276, 83297, 25499, 2107, -15464, -63989, -12010, 14330, 69106, 74442, 77732]
16074G7732q1375M8495J02075R4268n8161j14519k1306L9145K5232P4835k1576
16063A64845r8960j43989J7049R8189O9242k3988k0396K8394N1686j12744p9344
16052e0016k2999r732l3701m2376o6041P4125J16042Q6068o926j73804k4665J38010
16040a6015O0975j95008n6158J79392K666j36210Q6266M2371O4741R0708o8915
16029E4813j08968k4890p6156J1350L4194j861R2801P592l6853j1787q7930Q130
16017a39565K4192Q9137L9708n6219M1359M7242L5229J0168M8485M6978o6839
16006A19875j2390j0236j23904q4495R757N5623J10367l6375Q513p1962j45280
15995a80507O1511Q9052K8486r862j81384L2549J23294l5078q5540R320R2919
$$ y = [77732, -3643, 44852, 146927, 241195, 183034, 68515, 47209, 86354, 111586, 186421, 164845, 65885, -78104, -61055, 37134, 106376, 82388, 61992, 90386, 142072, 29328, -50016, -73015, -82747, -116448, -158824, -224865, -150740, -34698, 51370, 44444, -129360, -154025, -16015, 44960, -150048, -206206, -26814, -24148, -160358, -74092, -31721, 33020, 123728, 54813, -54155, -79045, -155201, -143851, -109657, -111518, -18717, -11125, -47978, -59765, -147695, -139565, -115373, -26236, 13472, -42747, -1388, 45854, 81083, 91251, 139736, 186714, 119875, 107485, 97249, -26655, -111150, -101393, -45770, 64597, 28222, 36735, -35227, -180507, -118996, -29944, -1458, -11320, -192704, -160155, -36861, -71939, -157479, -148159, -55240]
15984e5240R2849Q8101j9146k07925m7063M8058N3984L526Q6582q480k2195L3728
15972D6779M4884p071j6801J4463p035K3242j02645k0522k4157j54535M1420o1204
15960b23182k348K42260M8469j02206M5229O0355q360k2647j4470j11598Q3N2443
15948c5972R6488l1949q3905j32001J2934R8154Q4722j2047m9019j63968L0973
15937a85590j4401N2711J13000M215r9687N083M2311K879l5712L6690j364r916
15925h9781K8066r7550J34971R7697j22587r1593j3500J64949o474k5833j7057
15914c8692K8824Q7780P4143l1877o5027L2673N5324o7447j19112L9576J2182
15903H347m3238O1931K4723j11177l3269J28400K3005n5877o9074o8851M6812
$$ y = [-55240, 37609, 125710, 106564, -101361, -148424, -100366, -46382, -42856, 43726, 35246, 13051, 46779, 91663, 84592, 67791, 82254, 75219, 98461, -4184, -24706, -48863, -203398, -161978, -223182, -225530, 16730, 65199, -37007, 8222, 68577, 60217, 37570, 23100, -88498, -88415, -35972, 60516, 28567, -55338, -187339, -174405, -76251, 8471, -3576, -52595, -216563, -185590, -199991, -147280, -34280, -30065, -129752, -124669, -82358, -79479, -115191, -78501, -79865, -89781, -61715, -159265, -24294, 73403, -49184, -140777, -154277, 10672, 4198, -21635, -38692, -9868, 77912, 152055, 120178, 55151, 87824, 143148, 75701, -43411, -3835, 8347, -34891, 27040, 51763, -59414, -92683, 35717, 58722, 2845, -66229, -135080, -88268]
15892h8268L5873j38784p5631j302Q7711P2783m1544P3687J99779O9673L1320
15881B25297p175n7970o1899o0097o4497n8806j8302J7355O2956R5037M9654p490
15869A14063J22685n3896o0621k6055j52237m5246L2064J8415j13537O2865M8346
15858e3154K7687k3878N0533r0587q1754r640R0123l3461l0602j7014K1891Q963
15846a40893J75546K1001L3459O1834r9739O1419k775m5390J60467j00618n5416
15835F8895o14j3626j03551N1447L3189j56541q0403K5841N2841n3470j2386M2835
15823a45543O3138r2163o708J15088J8363K8823J35395K6936k1214k3232o4975
15812C3908J6032M1385P1355j1854j10045l8213l7231m5590J10955M6044o5153
$$ y = [-88268, -52395, -191179, -266810, -268112, -180401, -107618, -149162, -75475, 124304, 193977, 225297, 218122, 160152, 98253, 38156, -26341, -85147, -103449, -86094, -23138, 71899, 121553, 114063, 236748, 182852, 122231, 96176, -56061, -101307, -69243, -50828, -164365, -101500, -53154, -25467, -49345, 1188, -89399, -171153, -180793, -90670, -124131, -154733, -171747, -149856, -140893, 34653, 55654, 89113, 150947, 51208, 112627, 109852, 64462, 224929, 124311, 68895, 68281, 54655, -48896, 2551, 35740, -120801, -201204, -175363, -122522, -175992, -188378, -145543, -82405, -174568, -181276, -66188, -47825, -19002, 116393, 143329, 122115, 98883, 33908, 49940, 91325, 162680, 150826, 40781, 2568, -34663, -80253, 30702, 76746, 11593]
15801A1593l9431J3725m1676k4545Q2967l3711o9255o9684P400O3395j1606j1721
15789a22549J18742L9349l955P634j7528R627K8803p2345j605P003K7405m4076
15777b3495J2013j21706j0920l4164J21483P9979l3992n5125N2385K9036L1596
15766D7090L3990J29533j8130j65140j63281j5588J32439J70179Q2201j62298
15756G0995j14684k7185J0590N9091O1852J5268Q675n9334l0546o8753M329M3301
15744b6401P1461j8319o6296J24662Q138o0595N0344o9813m6134M8085M1161o1846
15732e553j52n5105k4873R5182J24049p0571j2524l2766j40270j03434J08499
15721a17518O9333M9994k4881Q919l9416N3860l1780j01262r161K3958j2013k9846
$$ y = [11593, -27838, -14113, -55789, -80334, 2633, -31078, -100333, -170017, -162617, -99222, -110828, -122549, -3807, 35542, 31587, 39221, 21693, 31320, 60123, -12222, -13827, -6824, 20581, -23495, -11482, -133188, -144108, -178272, -56789, 23190, -10802, -65927, -13542, 15494, 47090, 81080, 210613, 192483, 27343, -135938, -151526, -19087, 151092, 233293, 70995, -43689, -70874, -60284, -1193, 60659, 75927, 84602, 25268, -5278, -74031, -69702, -26401, 45060, 26741, -39555, 85107, 93245, 32650, 82994, 13181, -32953, 15132, 56293, -5553, -5705, -60810, -85683, 9499, 133548, 62977, 50453, 17687, -122583, -226017, -117518, -48185, 1809, -23072, -14153, -53569, 291, -31489, -132751, -141912, -117954, -129967, -159813]
15709a59813J24917p5138j42827L7937M4753j2252N1949J4645K9828J8556l8870
15698a06315K1415M7234J41428j6620m3166n2068M6217M4341J6718n8804n1879
15687a1499p6480J8294k9879J4295L4499q3647k3837L9318L7679R8385m6581j03134
15675a32587l26J05580r043j04039P97R3644k7080p4892M3620O2809j4812K4329
15663c2000l3791j9437J2810o8110q9740k7911R9793J00637O5734M3382M0789
15652I2156p319p7470j16922q9049L6606N323N7503J65053K7055n2513k2609P7702
15640I5516j03581q7357o7218O5111k6328l5887o776L8034M1693Q5179o3565R4939
15628B9760K8511k7092K3955j3435J12495m2698m2125j67422l5409N2801J03953
$$ y = [-159813, -34896, -110034, -252861, -214924, -170171, -182423, -130474, -115829, -86001, -67445, -106315, -84900, -37666, 103762, 87142, 43976, -8092, 38125, 82466, 99184, 40380, -11499, -87979, -69685, -99564, -85269, -50770, -134417, -158254, -118936, -81257, 17128, -29453, -132587, -132913, -27333, -36376, -140415, -139618, -45974, -73054, -147946, -104326, -41517, -56329, -32000, -65791, -85228, -72418, -140528, -230268, -258179, -158386, -57749, 7985, 51367, 92156, 84837, 7367, -109555, -198604, -161998, -156675, -99172, 65881, 92936, 40423, 17814, 95516, -8065, -95422, -162640, -97529, -123857, -159744, -166520, -128486, -86793, -1614, -65179, 29760, 58271, 31179, 55134, 41699, 154194, 111496, 69371, -98051, -133460, -80659, 23294]
15617B3294O7854j7648o3366M1787J45180k0507m1713o015j8593L3365L4928P305
15605A85871l8756o7514K5282r5453q0933Q665k3284j80312q5376J6100J73020
15594a62690J20650O733j35606j7092R0499Q1595j0478k7958j0489j422J3455
15583e2803n6153m0964Q7341M9665n470P8818L6788m6542p7246q884o6957n6919
15571a59326q5726n5146P6909j8557M3482O7398o7385J9590J38070J6558j39954
15560a64087n17J04168O3634j4329R3656O3277J43096m484o0650n3373j34514
15549C5877j1117j10947j30586J07611N8140M5057j38083J8231K05864R1750j44804
15538B6993o8472M671N8482P4730k9880j81667K9912J64950L0016m4122P0128
$$ y = [23294, 91148, 73500, 10134, 51921, 197101, 176594, 134881, 128866, 110273, 143638, 178566, 185871, 147115, 79601, 104883, 9430, -71503, -62838, -86122, -266434, -351810, -335710, -162690, -42040, -35307, -170913, -188005, -97506, -15911, -26389, -54347, -64836, -66258, -52803, -108956, -149920, -62579, -12914, -18384, 60434, 97222, 50680, -26566, -35450, -102407, -159326, -245052, -300198, -223289, -241846, -198364, -130966, -198351, -178761, -40691, -24133, -164087, -164604, -60436, 3198, -11131, 82525, 145802, 288898, 284414, 223764, 170391, 35877, 24760, -86187, -216773, -109162, -51022, -5965, -144048, -125817, 80047, 171797, 26993, -41479, -36808, 21674, 96404, 66524, -115143, -85231, 79719, 109735, 65613, 135741]
15527A35741P3408j05316j09941M001P1356k1730m0470n5868l6849P6598O524
15516b546l0247l4700N9185L5077K6499P110n8552j13961O5003J21062J3957j40177
15504e2290j13264j01285N9914O0055k619O4144L2303L5294q703j19414m8596
15493a94461J55177o5611q71J22656o6733q4725J5111Q3457R1547J51800N024
15482B12371j78264Q22M3352p6324L4549j34065j40113Q4461J52355j73498L7232
15471a37122P8537K04206O8836p3625o7912r0564L5381k0340p0404m4105J04772
15460a2340m8587l3773J24745M5112k976p063o418P6585r5935K7459j9248o2314
15448a4753L3053n8201p5553J0527q5236o6062R5143J18220J26042K9251p1544
$$ y = [135741, 209149, 103833, -6108, -2107, 69249, 47519, 7049, -48819, -85668, -9070, -2546, -32793, -67493, -8308, 26769, 53268, 60378, 1826, -112135, -47132, 73930, 87887, -52290, -165554, -266839, -206925, -146870, -149489, -85345, -53042, -17748, -26451, -145865, -194461, -39284, -104895, -105766, 16890, -49843, -134568, -119457, -36000, 55547, 207347, 212371, 34107, 34929, 78281, 1957, 36506, -97559, -237672, -153211, -856, -174354, -137122, -58585, 145621, 214457, 140832, 72920, -17644, 17737, -2603, -73007, -117112, -12340, -60927, -94700, 30045, 75157, 72181, 65118, 58700, 135285, 39350, 66809, 47561, -14753, 18300, -39901, -115454, -104927, -190163, -256225, -161082, -42862, 83180, 112431, 40887]
15437D0887j16339R964J20144J2338l3271l0910k9063O7662J18384m0328m4847
15426G4621j7030m5687R1098P5483o3826l9377K5777J035r5873M6339P7035q4240
15414D5355N593j139j16890n1583N6934Q7649R3538R3597L1912p938j07923k2645
15402A06460N9873p1038j05800r3156J9849K8351J29492l6888L8940n9335n5127
15391c8379j55592j36806J33469R508J51908J85655M7441K0259j44041l2702q464
15380C2256P0559o8991k3369Q0292O5420n481k3741o666j3406m2785o6436j22646
15368a24994J08419R5102r0567j3479K92m2021J42155J9591n7300m3677N2034
15357D5555O1098j05615p5422J15431J44660M1369r6081l9320k1364k6250l7329
$$ y = [40887, -75452, -65488, 54656, 66994, 33723, 2813, -26250, 41412, 159796, 119468, 74621, 57591, 11904, 103002, 178485, 114659, 75282, 101059, 102094, 6221, 52560, 129595, 45355, 50948, 49809, -67081, -118664, -61730, 25919, 119457, 213054, 244966, 237028, 129105, 106460, 166333, 95295, -10505, -103661, -83812, -55461, 74031, 37143, 76083, 16748, -38379, -193971, -330777, -197308, -187800, -35892, 149763, 197204, 217463, 73422, 40720, 32256, 102815, 33824, 10455, 90747, 156167, 150686, 126945, 120279, 106873, 64088, -2348, -124994, -16575, 78527, -12040, -25519, -25227, -67248, 74907, 94498, 37198, -6479, 45555, 106653, 1038, -74384, 41047, 185707, 227076, 130995, 91675, 70311, 44061, 6732]
15346F732j77260J7436k0667Q3206J55734K6063R980j2052j22437o2951J10568
15335A4352R2427p1748J8790K4737L3646n968o8772r2587J9552j6190o8986M2551
15323g8196Q8219M5466N2135O435L2962k9150j03006o4547L0938N1504k853j6533
15311A3374j1694Q2735P1554J6655j38790j18101r838J34467n2674o745P5872
15300E6815J0799k8989J0387O5648j1796j8178Q6618N4147j44370m1203K6676
15289F6554o2220j26524r568J37495J35990J8429j8695n0456q6569O1943J07104
15278A73483j2533J209j65047r9549O3243Q4627l0389o2929j22267q6732Q8939
15267a67945J00676J34261M0210l8640P0740n6568m2789J5097j49752R494O280
$$ y = [6732, -170528, -153092, -173759, -90553, 65181, 91244, 101224, 89172, -33265, -96216, 14352, 106779, 35031, 53821, 78558, 112204, 106236, 37464, -55123, -35571, -51761, -120747, -78196, 10023, 55489, 107624, 114059, 147021, 117871, 14865, -49682, -18744, 32760, 29907, 13374, 1680, 84415, 155969, 172624, 33834, -84267, -94105, 40362, -12312, -19057, 56815, 67614, 38625, 49012, 114660, 102864, 84686, 171304, 225451, 81081, 39878, 66554, 4334, -122190, -131758, 5737, 141727, 160156, 141461, 91005, 4436, 66379, 173483, 160950, 162159, -2888, -102437, -39194, 45433, 15044, -47885, -170152, -256884, -167945, -67269, 66992, 107202, 68562, 139302, 82734, 39945, 55042, -94710, -85216, -78936]
15256g8936j55736K7822J53061J24007j07466n9956k7938J0585J6181J00227l424
15245a573o0794j69946Q5602R1660k2796n8047k6545q0206J00307J21545l1036
15234e1829n471K3215K1568l2567K0153O8041l4574r5342j40932j6686M2563J36714
15222f5147Q3542R3020N5776K5164J8474k7981l9934k924m880r6607j05772j03808
15210a71077j1764J56362j2231L4232O258J5453M7031N0134n4210k0197M8777
15199H8768N0731j29587j53565R1688J21104N8061l765m6169o2088n4804L732
15188c5894L2940M3313j5900l4823o1162o8727k9173J13779O1740j9370p0223
15177h3500j39495Q2750Q2160n6783k046n2743N1604J3771j9350J02978J25492
$$ y = [-78936, -234672, -206850, -53789, 70218, -37248, -97204, -125142, -114557, -98376, 1851, -1573, -62367, -232313, -146711, -55051, -77847, -135894, -162439, -242645, -142338, -20793, -51829, -57300, -34085, -12517, -45084, -24931, 43110, 8536, -86806, -227738, -244424, -201861, -65147, 18395, 111415, 167191, 192355, 210829, 182848, 142914, 139990, 135110, 38503, -67269, -171077, -182841, -26479, -38710, -4478, 1780, 17233, 64264, 114398, 60188, 39991, 88768, 139499, 9912, -143653, -51965, 69139, 127200, 123435, 77266, 15178, -39626, -35894, -2954, 40359, 24459, -10364, -71526, -140253, -169426, -55647, 6093, -13277, -83500, -222995, -140245, -58085, -114868, -116914, -169657, -118053, -104282, -123632, -20654, 104838]
15166A04838o3597m5343J12944K0449M2701r1423j81577o035Q0314j9184j48747
15155a94660j06767Q2163J25560K4845O1009O2377O7800L527q1244k1679o6909
15144d3978l1665N1010n430J06579N3235o7361P626O0453j8975l6135j04664J9251
15132a0054k1627r9631n9123K7826Q4505R0513k080p0246m8237P4264k7882l7840
15120i9612J51867M0000J1815l041p9320o5951J314q808L5566N5191k5926j93662
15108a80567L5306k3936j4475O1035L3189J88439Q4898n1099j83569m5890J29439
15097C2770J13059R320m3203p8765N4291k931j31291j3039k9870L5713m1122L014
15085i2054L0071K9707K1618n8575L9569J14402m7168O9932L0745j40274N5883
$$ y = [104838, 41241, -4102, 108842, 129291, 171992, 80569, -101008, -107043, -26729, -45913, -194660, -301427, -219264, -93704, -68859, -7850, 54527, 122327, 125854, 44610, 22931, -43978, -75643, -24633, -30063, 76516, 129751, 62390, 70016, 130469, 111494, 75359, -29305, -10054, -31681, -131312, -190435, -162609, -78104, 12409, 10329, -59917, -108154, -33890, -61772, -99612, 52255, 92255, 104070, 101029, 21709, -44242, -42928, -51736, -16170, 39021, 13095, -180567, -145261, -169197, -183672, -122637, -89448, 98991, 183889, 132790, -50779, -96669, 32770, 145829, 155149, 111946, 33181, 87472, 84541, -46750, -59789, -89659, -53946, -95068, -92054, -61983, -32276, -10658, -69233, -29664, 84738, 37570, 107502, 138247, -2027, 53856]
15074E3856R6299n3401k1778m4094R833K2006M4150n8537p3640J04671Q7971J0897
15062A78233r8718j02205n1261n4583O8381O9755M4723j5936k9116J3676J12619
15051A35568N1525j07485o7338N5261N0952M5157j12812l9179O8130k7356K0754
15040G3177M5293K6424o9686j31066N9953O0403q2348K1747l4324k2182P5630
15029B3021K68L3008N9884J7393J5962l0153j28095q6501n4163P4526k1211K3
15017i6038R7797k2230j15830M7883N5595N7622q051r9420P2551N5409L8834M9637
15005A33759k4670k3947r9185n9314m0587j7694K1583J82391J1054j05739K3672
14994A323R7966o6734p2133Q0205M2665O2732O64j17358j54341m0858j0757Q953
$$ y = [53856, 150155, 96754, 74976, 30882, 40715, 62721, 106871, 48334, -25306, 79365, 167336, 178233, 79515, -22690, -73951, -128534, -60153, 9602, 54325, 38389, 9273, 22949, 135568, 187093, 79608, 12270, 67531, 118483, 163640, 50828, 11649, 79779, 52423, 73177, 118470, 144894, 75208, -55858, 4095, 64498, -17850, 3897, -30427, -52609, 23021, 23289, 56297, 116181, 133574, 149536, 119383, -8712, -95213, -149376, -74850, -96061, -96038, 1759, -20471, -136301, -88418, -32823, 24799, 16748, -82672, -10121, 45288, 84122, 133759, 109089, 85142, -14043, -73357, -113944, -131638, -110055, 72336, 83390, -22349, 1323, 99289, 32555, -39578, 40627, 83292, 146024, 146688, 29330, -125011, -165869, -176626, -167673]
14982a67673k5465m7695q2188m9897K03405J05233q5948m5841K7762R9312J72282
14971A03287O9181m7977j28608m1471P8048R1758J9208J3710o4172M146j15190
14960a8080r3165J2205Q4174O2075Q2658L6179j88752j07458P9713m9516m0302
14949a40269M0748M9485O1547k4194L62L1084n4173k1091M8875J17044P8477j26054
14937F1841J1952R4497j41408j1289l0885K7134P3879P6820l1768j1429p1486
14926D7858j25705M793j5906j26842M8267l0066j7208J05056K3495j515P9551
14915h222Q6981L1442j16791l4490p4827J8269J3566M4612K3937L5017r609l5557
14903b5672l0391n2646j05432J01426O7320J38236r4946j52569M4178N2739L1369
$$ y = [-167673, -193138, -240833, -323021, -372918, -169513, -64280, -150228, -196069, -168307, -68995, 103287, 172468, 124491, -4117, -45588, 32460, 124218, 143426, 157136, 92964, 97110, -18080, -111245, -99040, -14866, 47209, 129867, 166046, -22706, -130164, -50451, -99967, -140269, -99521, -50036, 11511, -12683, -12321, 18763, -35410, -56501, -7626, 109418, 187895, 61841, 73793, 168290, 26882, 15593, -15292, 11842, 85721, 162541, 130773, 119344, 47858, -77847, -73054, -88960, -215802, -167535, -197601, -214809, -109753, -86258, -87773, -8222, 78759, 110201, -6590, -41080, -115907, -97638, -84072, -39460, -15523, 19494, 9885, -25672, -56063, -108709, -214141, -112715, -45395, 92841, -2105, -154674, -110496, -57757, -26388]
14892b6388P917J8586n1500N273M0583l4623j34894q3083L0136N6548K9498k2565
14880a64512m5100j5103m6597J6859M9972K9932K7172N4841k0604k0335k9723
14869a63198J42122J45608m575j6498J6120p9015L2105J4419q9531k2367J19508
14858I4698J23641n707j39525j09398L0490n8572j3802J17498J15071L3861o1835
14847A26420j47597j29551k9509Q7686N9544P5606J1924r8110m8384m4392j8400
14836a54763K4243L3465l7345m1461N710k4750j3420K5387K8391O4824N6295R844
14824b3580M6484R6292R3693j01696j55856j8584j0504k1879K6482L6855J34166
14813A01873L5726Q1899j09064j575j9632K9347O4483j03861m9858j14245r4824
$$ y = [-26388, -18471, 115, -51385, -46112, -5529, -40152, -175046, -258129, -227993, -171445, -141947, -164512, -209612, -224715, -271312, -254453, -204481, -174549, -147377, -92536, -113140, -133475, -163198, -21076, 124532, 119957, 103459, 119579, 40564, 72669, 87088, -2443, -24810, 94698, 218339, 212632, 73107, -36291, -5801, -64373, -78175, 39323, 154394, 188255, 126420, -21177, -150728, -180237, -92551, -33007, 42599, 54523, -43587, -91971, -136363, -154763, -130520, -97055, -134400, -175861, -170151, -194901, -208321, -182934, -154543, -89719, -33424, -23580, 22904, 119196, 212889, 111193, -44663, -63247, -73751, -95630, -69148, -32293, 101873, 137599, 219498, 110434, 108859, 89227, 118574, 183057, 79196, 29338, -84907, -179731]
14802a79731j9251J12303O5135k6543L0899N3742l4341o4304k7970m4209R577
14791a24693L2633l5148j05616Q7199K54734M3567k3899m6480r2703O5810J08399
14780A63803j0121j19491p0459J9391O4270L150o6568p9665m812K6243J21523
14769D7264K4128l456J5026J0569m2085R9659J07317j64189p8942n2240l1453
14758f8402k6704j05763K1009O2304L1446J2240K6180l669J8931k8772J1166k4591
14746g4625M5890k7070N2593O7125j2722k380n9319q2441Q6471P188q8854N5043
14734c3101O4927o0232k823J41981K583j21907m8827M9209j42583p4046k8529
14723b53348J22851k740j04339J63781Q1475o6250Q9319K9744j45101K1945Q7158
$$ y = [-179731, -198982, -86679, -21544, -48087, -17188, 36554, 2213, -62091, -90061, -134270, -124693, -92060, -127208, -232824, -145625, 109109, 152676, 128777, 82297, -10406, 55404, 163803, 153682, 34191, -36268, -16877, 47393, 50543, -16025, -95690, -100502, -74259, 47264, 71392, 67936, 82962, 93531, 51446, 151105, 258422, 94233, 15291, -36949, -68402, -95106, -200869, -179860, -117556, -86110, -73870, -47690, -51359, -32428, -61200, -50034, -74625, -28735, -55805, -3212, 63913, 51191, 48811, -10508, -92949, -6478, 710, -88144, -33101, 31826, -28406, -31229, 110752, 113335, -8572, -57399, -8190, -150773, -224819, -253348, -130497, -133237, -237576, -73795, 7680, -58570, 30749, 60493, -84608, -62663, 24495]
14712B4495O7726j45645l8585r825j456Q0280J08265j53930j05231L9779P0509
14701f3618K5812j186L2164J0143j8594o4512J12277J17463l5394m6352J20124
14690A88327l4882o7341j9420M9363l6947j9541J6381m4307J9427Q2266J77524
14679C10850n461j00565p2584L7610j2582j3361o5967j84959l1672O7876K9561
14668d1254m9539k850J05605j6179l7682k6654K7032K8396p544l6274p0613l9539
14656a67095l9342N2847J12495N7248q9019J6641M5867q1656k4177R7150l3656
14645e2697j0985l4302j564q3897n5541R1783J58520P3910j03234q4789K7668
14634g5128Q5163M4956K6601R3435N9354j17987m2780j14773k6309J23865J5289
$$ y = [24495, 92221, -53424, -92009, -101834, -103290, -23010, 85255, -68675, -173906, -134127, -63618, -37806, -38992, -6828, 3315, -15279, -79791, 32486, 149949, 114555, 68203, 188327, 153445, 86104, 66684, 116047, 79100, 59559, 75940, 31633, 51060, 133326, 310850, 305389, 204824, 132240, 169850, 157268, 143907, 77940, -107019, -138691, -70815, -41254, -90793, -93643, 11962, -4217, -41899, -68553, -41521, -13125, -20669, -56943, -127556, -167095, -206437, -153590, -41095, 16153, -72866, -56225, -10358, -92014, -116191, -19041, -52697, -63682, -97984, -99548, -183445, -238986, -147203, 11317, 85227, -18007, -102796, -75128, 10035, 54991, 81592, 175027, 234381, 116394, 73614, -41159, -67468, 56397, 71686]
14623G1686j93609K3142L486j8978j750L5671q739j5737J70196J16152O7114R047
14611B57681j20206r6295k6550M0238j10396k0227J54007k4232j06820P0320p1874
14600e4354p3077o6757Q2616J5593o7347p134O1491J3894j10666N0148J96143
14589D0550J24830n313j8696o064n9450p6424o9265q082O7833K2674N6026n3000
14577A5619q8668J2524L308o640P9790K0732o1770O774J1125m6210O1154J09947
14565A17685P5431o2247J9129r0197j77225j24556J16945J10112K8693n4425k7925
14554f8580j02923k6690L5952P1319N7350l5772k2306O4812M6424Q668N4409P8197
14542A60860n780r9112o9774j48965N8547O4495j56876n0681R0776J5452R3770
$$ y = [71686, -121923, -98781, -95295, -114273, -116023, -80352, -89091, -104828, 65368, 181520, 248634, 257681, 137475, 41180, 14630, 54868, -55528, -75755, 78252, 54020, -52800, 17520, -54354, -127431, -194188, -111572, -95979, -163326, -170460, -108969, -95075, -205741, -155593, 40550, 165380, 160067, 141371, 135307, 75857, -567, -69832, -77914, -10081, 12593, 68619, 15619, -73049, -60525, -57217, -63857, 15933, 36665, -25105, -18331, -7206, -53416, 7738, 117685, 193116, 130869, 149998, 59801, -117424, -241980, -125035, -14923, 13770, -40655, -68580, -171503, -198193, -162241, -90922, -33572, -69344, -91650, -26838, 19586, 28254, 82663, 160860, 155080, 55968, -13806, -162771, -104224, -39729, -196605, -247286, -156510, -141058, -47288]
14531d7288J15396N3156J682q0550P5810M1679m6445J723n884m7893j08652J9858
14519b7408R3474M5958j22642p1012l5839l4542o1437N8680P0871k9684j9668
14508a33249k7812L0161J45856J68734k4155n726l5726q9280L3615j4719q5220
14497c7521n1410P8737R4218j6411J29253o6283j36260r446j8704P5150M5409
14486H6732j4175J60499K6630k42560k2456K8641q5059K9734J90747o214j03297
14475D9222j02504n1041j1422l7413J7018K4343O7657O6581J16916K0863K8174
14464A88394J320J5965n8495j0655n7296j43735j6454M7224j10526r7750J7309
14453b24699P8126J38185Q940j38522M3526k039P9861p2300j16204m2045J86515
$$ y = [-47288, 68108, 121264, 122946, 42396, 118206, 159885, 113440, 115163, 109279, 61386, -47266, -27408, 66066, 112024, -10618, -81630, -117469, -152011, -213448, -154768, -83897, -113581, -133249, -161061, -130900, 14956, 183690, 159535, 153809, 118083, 28803, 62418, 47699, -37521, -88931, -10194, 84024, 67613, 196866, 130583, -5677, -15123, -33827, 41323, 86732, 72557, 233056, 259686, 17126, -5330, 23311, -61748, -32014, 158733, 152519, 49222, -53282, -104323, -115745, -153158, -136140, -111797, -44140, 22441, 139357, 160220, 188394, 189714, 205679, 147184, 136529, 79233, -64502, -80956, -33732, -144258, -242008, -224699, -146573, -8388, 552, -137970, -94444, -96483, -16622, -88922, -205126, -247171, -60656]
14442f0656K01427o6505m2238J3397j69363l8570R8736N9199n8712l8954N5271
14431d6968J808P4647q864L5638K1595k532j45883j93965k3210K4859J40620Q1976
14419d0279P6794M2259n8921j28821m5625l0575J11160J69762k7741k06389R739
14408a28637j1801k9817J63341L8559l9886j5892J07318k1037q6154m0809M4973
14397a9842q878J6715N8559l6915r0553r2079L4096J11293R9232M0130o8521n3907
14385a0670r5228j64884r6089Q0636J97505J17001N2556o0994P3248P6091K8977
14374A98149l1539p7318o5722M781q1886J7449p67N3367j0348L1874J33794l7423
14362A34411n4942j09561J11737P3737m9526q2706J01202L1579j44571K8817J14738
$$ y = [-60656, 140771, 74266, 32028, 45425, -123938, -162508, -63772, -4573, -63285, -102239, -46968, -45160, 29487, 20623, 56261, 77856, 75324, -70559, -264524, -287734, -262875, -122255, -40279, 36515, 78774, 19853, -108968, -154593, -185168, -74008, 95754, 68013, -138376, -128637, -140438, -170255, -6914, 31645, -8241, -24133, 83185, 62148, -24006, -64815, -19842, -28720, -12005, 46554, 9639, -80914, -172993, -138897, -27604, 71628, 111758, 43237, -10670, -105898, -270782, -366871, -286235, -88730, 28271, 80827, 19833, 93081, 169172, 198149, 166610, 89292, 23570, 28351, -53535, -36086, -36853, 16514, 6166, 38040, 171834, 134411, 79469, -30092, 81645, 155382, 105856, 23150, 124352, 155931, 11360, 40177, 154915]
14351A54915k7370K3205j33884q5217K6661j6675k2934O0224n2947m5011o9442
14340a88475K3249O495j06370j01295l92K14040R7161L1180m5449p8765L4853
14329a13768o0261K445K5292M3872n499M3141k5000m8528L3343J33669L2767J642
14317F3115m6716n2309l6830P424K3117O6055o4928M642l065j04513N06J4029
14305a29473K7783K2606j5802J49006J0359R264L103N2669K9389p1560j88164
14294a00820J2865J40008J54049J7669l5266O1992J9245p1424j69718j17645O8923
14283b0122n5687j2166J37546J22484r1169J5263p1740Q693R7236L9615m1007
14272A28946q3612J8140m9329q7779o0007k0501L6112N379L1204R8191M9038J02548
$$ y = [154915, 127545, 150750, 16866, -68351, -41690, -58365, -81299, -21075, -74022, -119033, -188475, -165226, -158731, -265101, -366396, -366788, -152748, -55587, -24407, -69856, -148621, -113768, -174029, -171584, -146292, -102420, -107919, -64778, -89778, -138306, -104963, 28706, 61473, 63115, 16399, -35910, -72740, -65316, -42199, 23856, -41072, -36430, -39495, -144008, -143502, -129473, -101690, -79084, -94886, 54120, 64479, 73743, 76846, 129515, 158904, 87344, -100820, -87955, 52053, 206102, 223771, 188505, 250497, 269742, 198318, 28600, -89045, -20122, -75809, -87975, 49571, 172055, 80886, 96149, 24409, 33102, 130338, 169953, 128946, 45334, 63474, 14145, -73634, -133641, -154142, -118030, -112651, -81447, 16744, 65782, 168330]
14260A68330J6934q837L3736K7188k86872k30901J38763P7023K2591q5714k5343
14249a53102n9613N2395J10862Q1325J54821O751j60322j03277K8974l3168l3174
14238a07528j1272M2055M6069m7842l1079n227J7372Q3156L4781M258o1220L3790
14226b687J42901N6087j35481k8231Q444J1592J1325L1289L9333j5753j29759
14215a0940l1146O7297J22466q4378L5627K5987J6227L1637O6094n3696n2804
14204A32371j09200J6311m7765m2490m520j2349k6650j7476O8399p587j404M4018
14192h342m0142o6324l9487k0807J03687J40406N8400J5086K2429j05900p6555
14181a7549k3582r1218L5431J49079j5845o9517K0632n1610p3903L2096J16385
$$ y = [168330, 185264, 176427, 210163, 237351, -49521, -280422, -141659, -64636, -42045, -127759, -153102, -212715, -160320, -49458, 31867, 186688, 193439, 33117, -70160, -41186, -74354, -107528, -118800, -76745, -30676, -78518, -109597, -114824, -97452, -14296, 20485, 24743, -36477, -2687, 140214, 196301, 60820, 32589, 41033, 52625, 63950, 95239, 134572, 118819, -10940, -42086, 25211, 147677, 63299, 98926, 124913, 141140, 172777, 238871, 185175, 132371, 23171, 39482, -8283, -50773, -55293, -67642, -94292, -111768, -43369, -50956, -52360, -8342, -48484, -114808, -154295, -175102, -71415, 68991, 127391, 142477, 164906, 59006, -17549, -41131, -132349, -96918, 52161, 36316, -33201, -12569, -64179, -138082, -105986, 10399]
14170A0399M7564j7606p7331n9975O7545O5077k6530m8297q7551R048Q7801R8249
14158F8393k4928O444M0625m9322j00855l4181J45176L5035o0227j4739K8889
14147D0310l2642o9812j2248o4834Q8002J8158L2981N0730N1371k5437J44984
14136B21563k2503p3898j22970j56795m888Q8705l1906N0270j06917J1471K3703
14125a24165M7905p0005N3155J13277J59802J1311j44555j56739Q694L1172l9996
14114a10144L9662k8519L3473J34920P4489j04013r0231m238j8251o9583n4130
14103a96565n138L1033j2945p9581Q9605J34928K8055k9353P107j9624J33363
14092H0885J48420o5019j33609o073M3169j26301p5600l4877M2136O7447m1400
$$ y = [10399, 57963, 40357, -36974, -96949, -29404, 35673, 9143, -39154, -126705, -117657, -29856, 68393, 43465, 49909, 90534, 41212, -59643, -93824, 51352, 86387, 26160, 11421, 40310, 7668, -62144, -74392, -139226, -51224, -33066, -85, 50645, 102016, 76579, 221563, 199060, 125162, 2192, -154603, -159491, -70786, -102692, -52422, -159339, -147868, -124165, -76260, -146265, -93110, 20167, 179969, 191280, 46725, -110014, -101320, -70148, -110144, -70482, -99001, -65528, 69392, 143881, 39868, -50363, -54601, -72852, -142435, -196565, -201703, -170670, -183615, -263196, -173591, -38663, -10608, -39961, -32854, -52478, 80885, 229305, 164286, 30677, 24604, 67773, -58528, -134128, -169005, -126869, -59422, -100822]
14081a00822m9906K1895m1271L9482J13486K836L3761K0729K3966k1849K0009
14070F2316q1173l3578P8958Q5309l0807p4997O038P663J4648j11695q7774j3688
14058a78780m1691P985J05536R6113m0427k9662N635K9424k4587k9556l0964p5741
14046b06715o5623k0469M1792L1797J10381R8874J40343j5935j56298j2578N2150
14035b281K5296J6521n8714r9636J9857N4665q70p492J5034l1040N4557R896L6045
14022C1838q5723m8319L7061M3376O7013J1023J2805n0208j33512n0483P8179
14011h6950N8918Q5139k3796p9173k3152K8939J38852L6165j01585K721J21380
14000A57458L6689K0604j7226l1104l0532k4685m9261J02207K7939j71203p2098
$$ y = [-100822, -150728, -128833, -170104, -130622, -17136, -14300, 19461, 40190, 64156, 42307, 62316, -18857, -52435, 26523, 111832, 81025, 6028, 12066, 19729, 34377, -77318, -165092, -178780, -220471, -212486, -106950, -10837, -51264, -80926, -75291, -45867, -70454, -100010, -130974, -206715, -272338, -292807, -251015, -219218, -108837, -9963, 130380, 114445, -41853, -54431, -2281, 23015, 39536, -19178, -118814, -98957, -44292, -45162, -52654, -37620, -68660, -14103, -4207, 31838, -53885, -102204, -65143, -21767, 45246, 56269, 69074, 18866, -114646, -165129, -86950, -28032, 57107, 33311, -45862, -69014, -40075, 98777, 134942, 33357, 36078, 157458, 194147, 214751, 197525, 166421, 135889, 111204, 61943, 164150, 192089, 20886, -51212]
13989e1212p2916J51581J07850j06745l5785p4043k9242J29300J5308J19758j037
13978A52817o2944k3693R6515J6002j99375j01079Q4363O5641p3089j20910J4197
13967a51555m3469N274j0951P4555J14603M8905n5079O456q6582o3899N9887j474
13955a03329k6979m626l2463J17582L4264k1058O7480N6107j6110q7419K4617
13944H066L9663L9912k1722o1694N7853k714j64561J02430M7602o2997l522J67244
13932A45560p93j90429J0700J07751j1336j12395P3953N8935r3893j6921J57943
13921A29075J6501o8924q1024K4190P3527r2584j01630k6311j19013m5790J67967
13910a24016J64867O3056J4905m519m6694j75220n1175J84116M1484q0708K6846
$$ y = [-51212, -124128, 27453, 135303, 28558, -7227, -81270, -110512, 18788, 34096, 153854, 152817, 89873, 66180, 162695, 178697, -20678, -121757, -37394, 28247, -44842, -165752, -151555, -195024, -189750, -200701, -126146, -11543, 37362, -17717, -11261, -97843, -161742, -101855, -103329, -130308, -134934, -167397, -49815, -15551, -36609, 30871, 86978, 70868, -16551, 8066, 47729, 87641, 65919, 4225, 62078, 59364, -105197, -2767, 44835, -18162, -21684, 145560, 144767, -45662, -34962, 72789, 61453, -50942, 23011, 81946, -11947, -28868, 129075, 145576, 76652, -4372, 19818, 93345, 761, -100869, -127180, -246193, -291983, -124016, 40851, 103907, 118812, 114293, 67599, -107621, -158796, 25320, 66804, -13904, 12942]
13899A2942n4573k0144P4452J62946p8963p8347L0976N6954K3930n5721l8160
13888C6292r1891Q0086J19834L5058j16159j37753m7287R5928K6009N7357N0306
13877A07780l9419K6400o495q5423m433P2218j5353l1358J60719m6330j29449
13866H857O3106O4432l4824J8190j27224K8700R5420N5334M1793n8691K3180m4719
13854A33554j15830j09611r1840Q5029J38249n144k1957j2708J1004N1100n6519
13843E327r5015p0859M1601j18264L5159m631k7580J6244J0180M9497P6915R8984
13831A7558j6322j34456j20667N2200N8718J43666J44579o6250l2882N7522p678
13820I5988P2362p1450q7176o5369M3932K1445j10791j9578J21027J62916J6269
$$ y = [12942, -41631, -61775, 12677, 175623, 96660, 18313, 49289, 106243, 130173, 74452, 36292, -55599, 24487, 144321, 179379, 63220, -74533, -121820, -25892, 117, 57474, 107780, 68361, 94761, 88266, 2843, -1590, 70628, 55275, 23917, 184636, 138306, 8857, 71963, 136395, 101571, 119761, -7463, 21237, 116657, 171991, 213784, 155093, 178273, 133554, 17724, -91887, -183727, -98698, 39551, 34407, 12450, -258, 10746, 61846, 5327, -89688, -160547, -118946, -237210, -202051, -206682, -234262, -218018, -207838, -158341, -81426, 17558, 1236, -133220, -253887, -201687, -142969, 697, 145276, 79026, 46144, 103666, 95988, 168350, 96900, 9724, -55645, -11713, 9732, -101059, -120637, 390, 163306, 179575]
13809A79575K177k6084o23l0205J9616K0435l7893j33239l7438m7610M4927P6224
13797B9862L8661L6164o503n4723m3486j18013M6453L8045p4593J7206O8930P4456
13785E2459J05070j34205l2725k1691Q1919R4183m6515o8244j44570P2834J37367
13774I5882l6565K3624j34740P9222j0886N2538j7257m8373j30087J2295o4608
13763a78955M935N2393N2979O7430N3846J38536Q172j1861r0503n1359K7944J5692
13751H9249k0061O2390m9091m5357l7454J05892J4570j03582J3431P3910K646
13740A06543n4138k9001r0590J3626N9394q966j21560k4295J148K8460J44537
13729B5158m2398r2247M8264N3706m8983n7604O640o613K4185J16180L7704o6286
$$ y = [179575, 181752, 155668, 155045, 124840, 144456, 164891, 126998, -6241, -43679, -91289, -46362, 29862, 68523, 104687, 98184, 43461, -25, -118038, -71585, -33540, -108133, -90927, -21997, 52459, 157529, 23324, -9401, -31092, 50827, 145010, 98495, 30251, -114319, -41485, 95882, 59317, 82941, -51799, 27423, 16537, 69075, 51818, 3445, -126642, -114347, -178955, -174020, -121627, -68648, -1218, 52628, 191164, 199336, 187475, 96972, 45613, 73557, 89249, 69188, 131578, 82487, 37130, -324, 105568, 120138, 16556, 29987, 103897, 106543, 52405, 23404, -67186, -53560, 5834, -3132, -124692, -148987, -147839, -119379, 25158, -17240, -109487, -61223, -7517, -56500, -114104, -107464, -114077, -89892, 26288, 63992, -2294]
13717b294K8043M6372j2351o054J04785K1496j4665r1239o236J24737O0506n0196
13705B02904j57495j89911r9125q0923P248J43448J05066o3609m5199J06101J37598
13694F6103Q5594j11360j77025J6019M8530r1857J8850J46705J26586m391j43918
13683b0164L871J6859p6656J03006N587j14684n1167J2133r2162j5032J10927
13672a17482M0135J21371R4550r3188l074n2719k4697n6079o9986J01472j4653
13661g4350L78J11894O3252m2155k9196Q7552n1482J9221M5965p8428j03079N6429
13649F001Q9762j6699q1068l8031Q5397L4626Q242j38003m7389K1128J26989J26987
13637A77942k1793M0473j2168k6434l0262Q707q7251j05923L4706J204M1233R4104
$$ y = [-2294, 25749, 72121, 59770, 53716, 158501, 179997, 165332, 74093, 67857, 192594, 253100, 202904, 45409, -144502, -243627, -324550, -317302, -173854, -68788, -132397, -177596, -71495, 66103, 151697, 40337, -136688, -120669, -72139, -163996, -145146, 1559, 128145, 123754, -20164, -16293, 566, -76090, 26916, 32503, -82181, -133348, -121215, -213377, -228409, -117482, -77347, 44024, 138574, 45386, 42312, -10407, -35104, -91183, -161169, -59697, -74350, -73972, 37922, 101174, 59019, 29823, 117375, 65893, 85114, 131079, 52651, -50428, 6001, 95763, 79064, -2004, -40035, 45362, 79988, 88230, -49773, -97162, -76034, 50955, 177942, 156149, 196622, 184454, 158020, 127758, 136465, 49214, -56709, -22003, -20799, 20434, 114538]
13625A14538r2569Q15N9376M9421N5770o0572q7409Q682q5426O5379n1718m9770
13613g3483J3084J9017J45935n530K2892r4768m6002p5312O4547J7754l2201q1248
13601a25315K2810M0445M0423n3353j01154j41663o3774P3280J35206K0621o5750
13590b18224J11133J16157j14918L4627J21411K3181J9722N5653j03229p6601
13580c1088K880J03184J6144j0937J3960n3755J3943n5852r0513l4240J03120
13569b3154J9644P0883j0311j09454k2570j54352L0699J60013M0169J12642n6524
13558E7685n2843O2722Q7620O6285N7055o5602q7021Q2249N1825j07840j28808
13547B3327p9020R1006J01460j46208m2127n062l8796k7422K8321J31453K7660
$$ y = [114538, 21969, 22784, 82160, 131581, 187351, 126779, 39370, 48052, -37374, 28005, -23713, -73483, -60399, -41382, 104553, 99023, 121915, 27147, -18855, -94167, -29620, -11866, -44067, -125315, -102505, -62060, -21637, -74990, -176144, -317807, -381581, -308301, -173095, -152474, -218224, -107091, 9066, -105852, -71225, 50186, 73367, 93089, 148742, 45513, -31088, -28208, 74976, 91120, 80183, 94143, 40388, 54331, -1521, -92034, -126274, -23154, -3510, 67373, 57062, -52392, -74962, -229314, -198615, -38602, 1567, 114209, 57685, 4842, 67564, 155184, 221469, 278524, 212922, 125901, 208150, 259975, 152135, 23327, -55693, 35313, 136773, -9435, -51562, -56624, -95420, -122842, -94521, 36932, 64592]
13536F4592J1518q6505N558J15649K8738r2370p7439L2690n09r833K8893R3175
13524A14157p258j20267k0105J39954J18882J150o63Q18q264j7759j50759j93726
13512a43840R280Q5276R8914J42311r6883j70738j24289K2902K00158J64513O6009
13501B53613k7944j19059j43709N935J08292j0503n4021R0223j8970n8680k2476
13490B701K9795O9039p4299K1996J17245N1407o331j7761j14426o223N4441R427
13478A37011L4005P4413p0502M206L1545q5849j33615J5968K0697J63606p8211
13467A13274R3603O743q8891p6276n7922m426Q0770Q6147m6922m9663l8396N8299
13455G6340O7836M8138N3667n0933J8097l914j34102j34406M7663J03352J08843
$$ y = [64592, 76110, -10395, -4837, 110812, 139550, 47180, -30259, 2431, 1922, -7911, 20982, 114157, 106899, -13368, -33473, 106481, 225363, 226513, 225850, 226668, 218404, 200645, 49886, -143840, -134560, -49284, 49630, 191941, 95058, -75680, -199969, -177067, 23091, 187604, 253613, 225669, 106610, -37099, -31164, 77128, 66625, 12604, 102827, 83857, 25177, 2701, 32496, 101535, 27236, 49232, 166477, 217884, 211553, 193792, 79366, 73143, 127584, 137011, 171016, 245429, 174927, 179133, 210678, 124829, -8786, 7182, 27879, 191485, 113274, 206877, 213620, 124729, 48453, -9469, -13895, 66875, 153022, 106100, 56437, 18041, 76340, 144176, 192314, 245981, 195048, 213145, 209231, 75129, -59277, -11614, 91738, 200581]
13444B00581n7432O7124N9418n0140j32163r5503J61864j4810j26637M2735q712
13433D6325m5244n752N982q8603k0000K8653j7076O6076j8923m1795r1948M0752
13421a41553o795J4666m996M5397J2826J27024o3970q2652Q84o0024k8277N6903
13409a30567L6332N037Q6789J28116j244p1915j9508K156l3795J3160q739j33133
13397a27311P3438N9691n409j6650n0325K4115Q9449q398R0824Q5818j32066j03088
13385a9912M7328j9388J00183m297j6712r9902n688N3526J16214O1441q7470p783
13373A17540L5795J2685M0261k536n9304k53274l8113J00573P3761M4418J11899
13362A83705M5914r5279j47228q3221L3436J31270M8661k7454p7705L6576L7263
$$ y = [200581, 143149, 210273, 269691, 219551, 87388, -8115, 153749, 138939, 12302, 55037, 46325, 1081, -4671, 1311, -87292, -107292, -78639, -95715, -29639, -48562, -90357, -182305, -141553, -148348, -133682, -138678, -93281, -80455, 46569, -17401, -100053, -99169, -159193, -187470, -130567, -94235, -89198, -2409, 125707, 124463, 52548, 33040, 35196, 1401, 14561, 5822, -127311, -53873, 5818, 409, -16241, -66566, -42451, 46998, 38600, 129424, 215242, 83176, -19912, 27416, 8028, 108211, 103914, 87202, -12700, -18388, 35138, 151352, 212793, 125323, 117540, 153335, 166020, 206281, 203745, 144441, -108833, -146946, -46373, 27388, 71806, 183705, 229619, 134340, -12888, -96109, -62673, 68597, 117258, 89804, 12099, 48675, 85938]
13351H5938p3877P823J05342J32003K97q8776j01257q5426n622J57136p539j8303
13339A07739j32204l0458o368N0599J41412n0489j91603L8414l0465j18044N9390
13328a62077O9175K5745K9353L885k4866p8269Q0211N2039M5351P8681j18568
13317F60j19889q522L4126O722J8765L4553m0785n0259J07670P7697J4850R0978
13305A66566J18040L9826j43639K0262k465j53981k6294O4254L0714R190J5043
13294A37516L322p0148R5399J3737j16483n358Q788J2099k7109K5521K1383P8741
13282A77408j98930r7375R293K7343L8164M101m352k10855O900J09695N7379k1098
13270a02327Q5255o5912j07791R6978J08942o6895m4513J2958m2877M1903J01656
$$ y = [85938, 12061, 19884, 125226, 257229, 257526, 168750, 67493, -17933, -23555, 133581, 126042, 107739, -24465, -54923, -61291, -10692, 130720, 80231, -111372, -72958, -103423, -221467, -162077, -92902, -67157, -37804, -33919, -58785, -137054, -56843, -4804, 40547, 119228, 660, -119229, -127751, -93625, -86903, -68138, -33585, -74370, -124629, -16959, 60738, 75588, 166566, 284606, 324432, 180793, 201055, 198590, 44609, 18315, 82569, 113283, 122473, 137516, 140838, 70690, 166089, 179826, 63343, 57985, 66773, 78872, 51763, 77284, 98667, 177408, -21522, -118897, -109604, -82261, -44097, -39996, -44348, -255203, -248303, -138608, -81229, -102327, -17072, -82984, -190775, -93797, 15145, -51750, -96263, -83305, -126182, -84279, 17377]
13259A7377J17426J01751j1898j47466r3479L36j1513L066R7359Q0761k4532r1234
13247C7954J41253N3025o6009O274k0236n7311J0622l7974j3786j24552N374P3271
13235G905o2321j6393k937o9612L1885R8515J04873L3618k8145o6117o1824R4534
13223F3981L3088J2896L9539l2446m2125M6583L4117m2602N5761j84j70472p7677
13211g9541K3840M6453M1985k6633k6924j81729m2016J62201J73059N6556o3144
13200H4107J58951q6403j28158l3324r410m2295L8887o4887O7970L7881P0273
13189I3592L1343M2862Q7242j34786m7797j6862m9906n4678n3532n142M8921Q9003
13177C0260J37589J20211n8696k26540p4502Q242L4973K5259O3101O633q6966
$$ y = [17377, 134803, 236554, 224656, 77190, -16289, -15953, -27466, -24400, 72959, 153720, 129188, 37954, 179207, 232232, 166223, 172497, 152261, 94950, 105572, 67598, 53812, -70740, -65366, 7905, -54416, -70809, -73746, -143358, -111473, -12958, 91915, 125533, 97388, 31271, -30553, 63981, 97069, 109965, 149504, 117058, 74933, 121516, 155633, 113031, 168792, 168608, -1864, -79541, -55701, -9248, 32737, 6104, -20820, -202549, -244565, -82364, 90695, 147251, 84107, 243058, 156655, 28497, -4827, -14237, -56532, -17645, -82532, -14562, 23319, 93592, 124935, 167797, 255039, 120253, 72456, 55594, 5688, -48990, -102522, -107664, -58743, 30260, 167849, 288060, 229364, 2824, -71678, -63436, -28463, -3204, 59897, 66530, -20436]
13166b0436k8719P586L2261M3179Q3852L6561Q32J4756q4541o0798J4475O4196
13154A03204n842o7429J00837q9291o0510m4050L4761R0484l2603K9150j4931
13143D3780m1254R2125J15909j07467j13321j3053J03824M4006r2906l5402n1304
13132e5063M7182Q6931q890j13866J5902j0968m4214o9990k8690R5332J68498
13121H2164J1108n3247q6437L5996R655M474Q2681J5636p4520r0351o9182J2528
13109a19495J06168J08454n4388m4558R1917l9594n5200j7490N925N9259P4824
13098A15822o8382j51969J00966O2829k8996n1263O541Q5667r066J6155r6511
13087a8207j1962R5657l1382l8260j1733L0341k7325q9277n4744P0976O2251n9709
$$ y = [-20436, -49155, -41569, -9308, 33871, 117723, 154284, 155116, 169872, 85331, 24533, 39008, 103204, 97362, 29933, 130770, 41479, -19031, -63081, -28320, 62164, 29561, 58711, 43780, 2526, 94651, 210560, 103093, -10228, -23281, 80543, 124549, 31643, -3759, -55063, -7881, 79050, 70160, -43706, -27804, -38772, -82986, -152976, -181666, -86334, 82164, 93272, 40025, -46412, -10416, -761, 3713, 86394, 102030, 27510, -62841, -132023, -119495, -13327, 95127, 40739, -3819, 88098, 48504, -6696, -24186, -18261, 40998, 115822, 47440, -104529, -3563, 59266, 30270, -20993, -14452, 71215, 62149, 78304, -18207, -30169, 65488, 34106, -4154, -15887, 14454, -12871, -102148, -156892, -85916, -23665, -83374]
13075h3374N9097O4358j9994L1542k0518p9429j151J23806n983k7486q9374J64062
13063A15556O6884l3581r7826O6741N9724j22489p0041j5636L4287K5461O1257
13052I0337o241l1506M2352Q7311j03365n8773M455j5948j22884n6797k4021N0217
13040a44863R0146j08342q0648k556J10845J19171p3601O3567q1466p4753R4171
13029h8329R4234M420l0754m8545l0884o2439L8025n1743O7724K46755P6791r2617
13017A22638r8922J3402J02053m8910q363N9421l9937p2865L6350l516J20470
13006A81821k21l2445k9097r767p9641j24700o5063J05129J00940j31737q4361
12995a69142O5158K5485P874J290j30617J17767l1352j28495p7066J52032J08082
$$ y = [-83374, -24277, 40081, 20087, 51629, 31111, -48318, -49469, 74337, 68354, 40868, -48506, 115556, 182440, 148859, 51033, 117774, 177498, 55009, -15032, -30668, 3619, 29080, 90337, 84096, 52590, 94942, 182253, 78888, 20115, 24570, 8622, -114262, -171059, -195080, -144863, -54717, -163059, -243707, -246263, -135418, -16247, -89848, -26281, -107747, -182500, -88329, 5905, 10325, -20429, -68974, -99858, -162297, -124272, -176015, -108291, 138464, 215255, 122638, 23716, 37118, 139171, 90261, 81898, 141319, 101382, 28517, 64867, 61351, 181821, 181600, 149155, 120058, 110291, 30650, -94050, -159113, -53984, 46956, -84781, -169142, -103984, -78499, -70625, -69335, -199952, -82185, -113537, -242032, -319098, -167066, -58984]
12984e8984o2135j3222J29456J50443L6815l8614N3357n3692K553n1353o0566
12973C4058j2811N0116q2049r5145K3488J64974j3033j28544l18K573p2300m52
12961a29443O1903L6621R7143L0756o4556L0563j0907j69768j8716R2032N9577
12950A5205n004l6096N5970l8754r3148K9217N2271N6499k3608m9306Q935Q7727
12938E9908q6771o1300N8533J11950N4204o2446L9993j38645r1573m4293J3940
12927a46500P1644J17155J16434J08926n6473j27538j07682n6177P6872K153M5490
12916D4304n8017J7172q7794l3244n3724q8268Q0936P3738R6432M5798J5033J01221
12904A53587p184o9214q0330j41635n1005N4367R0398R4886M8215O4249N3519
$$ y = [-58984, -121119, -134341, -4885, 145558, 182373, 143759, 197116, 143424, 145977, 94624, 34058, 21247, 71363, -10686, -105831, -82343, 82631, 69598, -58946, -59264, -56691, -128991, -129443, -67540, -30919, 66224, 96980, 32424, 62987, 52080, -117688, -136404, -44372, 15205, 10201, -25895, 30075, -8679, -101827, -72610, -20339, 36160, 12552, -36754, -27819, 59908, -26863, -88163, -29630, 82320, 136524, 74078, 114071, -24574, -116147, -160440, -146500, -74856, 42299, 158733, 267659, 211186, 83648, -24034, -80211, -3339, -1186, 44304, -13713, 3459, -84335, -117579, -171303, -259571, -178635, -104897, -8465, 37333, 52366, 153587, 146403, 77189, -3141, -144776, -195781, -141414, -51016, 43870, 92085, 156334, 209853]
12893B09853O7168K1521l2997j25405q7035o8487M5189J6917K601l9619K4194
12882C3900L4489l2520J44311R5382j05124j28942m6442N3446M0272j600l1924
12871E5248j18738j03586m3002J12351O0095j3837M2988J52275j6716j1547K2176
12860A37707j09692O3534k1794q4019L257J28278K8986N8423k9283m1783L6665
12849A70279j75870k79349r3434P7849J63227l06o6881O9615J02009J2436J48139
12838A27714J399j33079l5500O9723R4749L8051j7645k1659Q574Q6161l8260M5694
12826B25922j28799m0562K234L0428L7883m3625o0521L280J02789J03628j01575
12815A31082j17809j16854n4571J68837J08210k1942k3653L3590n4998l2039N0310
$$ y = [209853, 277021, 298542, 265545, 140140, 53105, -15382, 29807, 46724, 49325, 9706, 33900, 68389, 35869, 180180, 275562, 170438, 41496, -4946, 48500, 88772, 87172, 55248, -63490, -167076, -210078, -97727, -37632, -51469, -8481, 143794, 127078, 115531, 137707, 28015, 91549, 69755, -14264, -11007, 117271, 146257, 204680, 175397, 133614, 170279, -5591, -284940, -378374, -300525, -137298, -137604, -204485, -134870, -32861, -20425, 127714, 129113, -3966, -39466, 30257, 125006, 163057, 145412, 123753, 132327, 218488, 180228, 225922, 97123, 56561, 58795, 89223, 127106, 83481, 22960, 26240, 129029, 232657, 131082, 13273, -103581, -158152, 10685, 118895, 96953, 73300, 106890, 51892, 19853, 70163]
12804G0163M0204l8531N9425l7473j33031P408M322j01929m832N415N9692K2086
12792d7081Q9721O3024n8498m0272J18804o1943j22177q0051J58155M5271l565
12781F1388M5650k8697o0552M2117J23133o3700j05831r8756L5150J90764O9010
12770B09676r6206j38197N5852m9874M7575J404Q2171o3386q7295j2919l8920
12759i0119P2095j23009j8603p7752O0398N5406m381O1107M2532N5819J66593
12748B00086l5825m8327m7894R416o5011R681N3796o0354q8671K5938K291Q5829
12736D0955J5246q4972r377o0953o4559O4765Q3832O5199N3749k9771o9335l4156
12724b9377l816J4608R1471j54644j98230L2954N6032J48321K8773M0230R2997
$$ y = [70163, 110367, 71836, 131261, 93788, -39243, -31835, -27513, -129442, -134274, -128859, -69167, -47081, 42640, 105664, 47166, 6894, 125698, 63755, -58422, -138473, 19682, 64953, 61388, 107038, 78341, 17789, 59906, 183039, 119339, 13508, -85248, -50098, 140666, 209676, 113470, -24727, 31125, -18749, 28826, 30230, 112401, 49015, -38280, -51199, -90119, -18024, -141033, -159636, -237388, -176990, -121584, -125965, -64858, -22326, 33493, 200086, 164261, 115934, 68040, 77456, 12445, 22126, 75922, 15568, -73103, -47165, -44874, 40955, 56201, -28771, -38148, -99101, -163660, -98895, -15063, 50136, 103885, 74114, 4779, -29377, -33193, -18585, 72886, -81758, -279988, -247034, -191002, -42681, -13908, 26322, 119319]
12713A19319J0527j1267o5082o0298m3218N5332M3676l4508p1623r368K2250M5790
12701A530O5084l750k527m9591p5803l009K3645O5257j55415Q6176J0108K3240
12689a5055l4881m8297R7917K9480j13171l3406M7351L3480P2166r776j04491
12678g8683m4228K7723J9335O8082N761j9987n0527r600j471j5543k5802p795
12666a32735N001m1644K4523K8687M991Q328L9377L0733R1348J58733l1198n4423
12654A31721Q0686k8078l2704l0584k7629J1424O3132o705r8513j02330O5138
12643B5558p463j24592p1908J47667J77757l6122q7755j15050N284J55678P4753
12632A43807O7154n0875r0514k9459P057M3035Q25j32856L7888j7199j0697L8654
$$ y = [119319, 129846, 118579, 53497, -6801, -50019, 5313, 48989, 14481, -57142, -66510, -44260, 1530, 66614, 62864, 60337, 10746, -65057, -68066, -44421, 20836, -134579, -48403, -38295, -15055, -49936, -98233, -316, 29164, -84007, -117413, -70062, -36582, 35584, 25808, -78683, -122911, -95188, -75853, -7771, -2010, -21997, -72524, -82124, -83595, -99138, -124940, -132735, -127734, -169378, -144855, -116168, -111177, -102849, -63472, -32739, 58609, 217342, 186144, 131721, 212407, 184329, 151625, 121041, 93412, 104836, 167968, 161263, 62750, -39580, 25558, 18095, -106497, -178405, -30738, 147019, 110897, 23142, -91908, -86624, 69054, 143807, 210961, 160086, 69572, 40113, 47170, 90205, 91030, -41826, -3938, -21137, -31834, 6820]
12620F820k2655N2761J6602K6140O120K6800Q6644j51460j74731K4510n95J55728
12608E2684N3436O8578J8001j30251N7934Q2596k01905j8307N3600O424l6681
12597F109k993q3907j07779N0885J4294J14510J12959J0006o9887m3468O8603
12586F9332R6981q2132k6446k040n2929R4029M2893L9328o2640m3189P384r1978
12574a1407K8845P7514J88456l4912j40036r7882J34119J50510k0952q3875p6316
12563A14064n3684n8228j05213K0449O6315J0805j17975J4134K2322Q6305J2879
12552A2173p8320L787M4627R2317P0484J06073r6967k19747k3119R8520Q4684
12541I4512k0667o3247J8813O5171L1531M5587l5664j2076m4587j8051R9545j11276
$$ y = [6820, -15835, 36926, 53528, 79668, 85788, 112588, 199232, 47772, -126959, -102449, -103044, 52684, 106120, 174698, 192699, 62448, 120382, 202978, 1073, -17234, 36366, 42790, 6109, 3116, -80791, -188570, -137685, -123391, -8881, 104078, 114084, 44197, 729, 69332, 166313, 84181, 57735, 55695, 2766, 96795, 139688, 179016, 116376, 73187, 80571, -11407, 17438, 94952, 283408, 248496, 108460, 10578, 144697, 295207, 274255, 190380, 114064, 60380, 2152, -103061, -82612, -16297, -5492, -123467, -109333, -87011, -706, 12173, -66147, -62360, -17733, 74584, 145068, 251141, 154174, -65573, -88692, 9828, 94512, 73845, 10598, 29411, 94582, 126113, 171700, 136036, 123960, 79373, 61322, 160867, 49591]
12529D9591n6020j0543m5489Q4229M9087n9806J8080l873j2203O5405N3448J8933
12517A50839L597N6669p0156n3524k7967m9868Q3049m7472j75793p7182L1309
12506a76499q865K298P5089J72813O3860Q9698m0216k11303O739J31471j02568
12495B517n9557O4377N3263J16168O8378l4795r9688M6563j2319o8432r465o1171
12483E839K3960j01350o3886J5205p930n4037J0633J29591M3982P1652J31917
12472B05576R9516o6881n8841j33899l7041O0619o9286r3718P3312q9006K777
12461a06872Q3669K8992M914J8705P2269r720j5187Q0167j8196n4913Q0073m6643
12449A17258p9223r1209N7330J46655r3737K1166J07602l5627k3207l5375n3486
$$ y = [49591, -6429, -16972, -62461, 21768, 70855, 11049, 29129, 25256, 13053, 78458, 131906, 150839, 154436, 211105, 140949, 87425, 59458, 9590, 92639, 45167, -130626, -207808, -176499, -185364, -183066, -107977, 64836, 128696, 218394, 178178, -33125, -26386, 105085, 2517, -57040, 7337, 60600, 176768, 245146, 210351, 110663, 157226, 144907, 76475, 67010, 5839, 29799, -71551, -135437, -120232, -128162, -182199, -171566, -41975, 2007, 73659, 205576, 305092, 238211, 179370, 45471, 8430, 69049, -237, -93955, -20643, -109649, -106872, -23203, 5789, 10703, 29408, 101677, 91957, 76770, 156937, 138741, 83828, 163901, 117258, 38035, -53174, 4156, 150811, 57074, 78240, 185842, 150215, 127008, 91633, 38147]
12438C8147N1975j9351o9929m2438n2928L9904R6933O4143k00180M9315Q2021
12427C7612j4363M7594k2142P2969L7413n1360O9194j51773r6852p242L9376n1568
12415i1142K3474K3346m8Q0058l3207L854p4O7751N2629j49396j30717K8410n715
12402a30777J17405J07650O9989j10341j2827J1578M0145J7563j27356j0078J09223
12391H2174J36878m0519p9601o9298m370L0749j3991q2159m9775O3606K6689Q016
12379H399m6746J4156n7957o3990M6346J49890k1845K8830n1339j19657K1876
12368i2037J70166J9145r8518o2492J01894k7550M6910m7064k7598J44565Q2628
12357B10049k9165j34889k2378q766M0224k14n1145K2258o8402m6266l3830l5321
$$ y = [38147, 90122, 70771, 842, -41596, -94524, -54620, 42313, 106456, -93724, -44409, 37612, 23249, 70843, 48701, 121670, 159083, 107723, 176917, 25144, -71708, -78950, -39574, -91142, -67668, -44322, -44370, 35688, 2481, 6335, 6261, 74012, 126641, -22755, -153472, -125062, -130777, -13372, 94278, 164267, 53926, 41099, 52677, 92822, 110385, -16971, -27049, 82174, 219052, 178533, 98932, 29634, 25264, 56013, 42022, -40137, -89912, -26306, 383, 8399, -38347, -24191, -82148, -146138, -99792, 50098, 28253, 57083, 5744, -113913, -92037, 78129, 97274, -1244, -63736, 38158, 10608, 57518, 10454, -17144, 127421, 210049, 180884, 45995, 23617, 14851, 55075, 54861, 3716, 25974, -42428, -88694, -122524, -157845]
12345a57845Q9734P0810M1826M6926j4423O5087K2168O9525o107j34805l4343
12334E8553k0657j37103p5835J18859J06940J09998L3659L4827o9953r6325o2949
12323A4j51384l3299R7590J03014N3949J5729J29208J6852k2521k8992M574j6419
12311A68315o8409J4110o5398p815P3968j00789J18Q7200q401L3617P3436m2994
12299A56958j49472J2921p6805o2655q047J04104m9808m5289L140O5105J9662
12288c0186N0908m0601k3551O3441K0840m2010L0203J43097p1947l1889M1761
12277A10066M1617j1627L5811K6240k0908m1675o9955N5353N7324J22054Q7405
12266C91705j6378m8356J28803o3558j65873j04086n7071O5149n1910N4929N9284
$$ y = [-157845, -68111, 2699, 44525, 91451, 77028, 142115, 164283, 233808, 227701, 92896, 58553, 37896, -99207, -175042, -56183, 50757, 160755, 194414, 229241, 159288, 62963, 14, -151370, -184669, -87079, 15935, 69884, 85613, 214821, 231673, 209152, 180160, 184734, 168315, 99906, 114016, 48618, 40803, 114771, 13982, 14100, 101300, 92899, 126516, 199952, 156958, 7486, 20407, -56398, -119053, -127100, -22996, -72804, -118093, -114953, -49848, -30186, 20722, -19879, -43430, 20011, 40851, -1159, 29044, 172141, 100194, 68305, 110066, 151683, 140056, 175867, 202107, 181199, 139524, 69569, 124922, 182246, 304300, 391705, 375327, 326971, 455774, 392216, 226343, 122257, 65186, 130335, 78425, 133354, 192638]
12255A92638q2134n4242J1995l0126k5828m911K8117j44349p3335P6244L3998
12244g1933n3845J2281L8369J73456L5361j83791j54469R9811J29523J01181O4855
12233A90799j44428N6415m2146j01608j11016q2219R8041K13478J21842p7459
12223A21699p3845K0793k1925m0342O0913L8576J8729r369M9951K07648M03l7176
12211C36055P069L7958j2050n1225q2867q6393r5084L3622L0061R53J01464o8258
12199A51305p9387L5168j0395r7856O8956J36183M1350j11437M0910P0472l3301
12188B11968j02115l9068J50216J02227L0823l4316j42345o2445q7382l4529L5577
12177B8611P5668J05146M7036l1707l0921j5153q4395q3540r4687N67J71359J63536
$$ y = [192638, 110504, 56262, 68257, 38131, 12303, 7392, 35509, -108840, -182175, -105931, -71933, -125778, -113497, -75128, 98328, 133689, -50102, -204571, -104760, 24763, 125944, 190799, 46371, 102786, 60640, -40968, -151984, -234203, -136162, 77316, 199158, 121699, 47854, 68647, 46722, 6380, 67293, 105869, 124598, 115229, 165180, 372828, 373231, 336055, 343124, 381082, 369032, 317807, 234940, 148547, 53463, 87085, 117146, 118099, 219563, 151305, 71918, 107086, 96691, -1165, 67791, 203974, 245324, 133887, 174797, 245269, 211968, 109853, 70785, 221001, 323228, 354051, 319735, 177390, 114945, 27563, -6966, 28611, 104279, 209425, 256461, 224754, 193833, 178680, 94285, 10745, -83942, -83375, 87984, 251520]
12165B51520R2393m258M3308j8387j50829l6269l2211j6310J09696N160j1770
12154B32043j5904m6704q5271m0296j2274j9594l2967l3828j8120K051n4479q4723
12142b10066n922j5214P4712J66643R9602R2099J78054M8333o9795j53033p7317
12131A28096O6856P4304J55444k9866p4204O679J1522j02332j20805R1331k9406
12120A77619Q562k4389L6204M0387Q0320p6318r8464k6684N6286J08327K9007
12109C10857j5903p4206r3718q3775K7413R7572k1070N6623M8785M3596J6086
12098C12260L9257M6414J52780o002k01108j7098P7743L8772l2738j28506r1045
12087A90729O3296L788K1319k3401k2128J6060m4495J8636Q9276R9991l1308R892
$$ y = [251520, 343913, 339655, 382963, 364576, 213747, 177478, 145267, 128957, 238653, 243813, 232043, 216139, 169435, 84164, 43868, 31594, 12000, -20967, -54795, -72915, -70864, -125343, -210066, -215988, -231202, -156490, 10153, 109755, 201854, 379908, 428241, 358446, 205413, 128096, 194952, 269256, 424700, 394834, 320630, 327309, 338831, 236499, 115694, 207025, 177619, 186181, 161792, 197996, 238383, 318703, 242385, 143921, 117237, 173523, 281850, 310857, 294954, 220748, 127030, 43255, 70668, 168240, 147170, 203793, 252578, 296174, 312260, 351517, 397931, 550711, 544709, 343601, 326503, 404246, 443018, 410280, 281774, 190729, 254025, 257813, 279132, 255731, 233603, 249663, 205168, 223804, 313080, 413071, 381763, 391655]
12075C91655K7953N3624p1885r1235P3407j879q1796j16987J25940R4971l4844
12064C68924O3556R3345n9520q9916l4693l5225N2204M7683O029Q7193J32232
12053F31812P908q7603j31454L6733k596p7925J9895P5005m3808O3243J12676
12042F03886J17822J04517J08491j5984O0876R8815L2032q092J36594P6819j36695
12031A179081o2299j5363N5318o8559q1088r0327j7115m8807r7948Q572J96593
12020I58058M0737p1290L9607P7202J1002m1418j68091n5735L1765J8775j03051
12009G37561o3056J6607K3296J01171r2735L3795M6289O849M2990J45890L0541
11998A029198J07208J17831m0912j35476l2277N8537l872p497p7946o0150J05399
$$ y = [391655, 419608, 473232, 401347, 310112, 383519, 381640, 299844, 182857, 308797, 403768, 368924, 432480, 525825, 466305, 376389, 341696, 306471, 358675, 406358, 412387, 499580, 631812, 639720, 552117, 420663, 457396, 454800, 376875, 396770, 471775, 427967, 491210, 603886, 721708, 826225, 934716, 918732, 979608, 1078423, 1110455, 1102363, 1238957, 1315776, 1179081, 1116782, 1101419, 1156737, 1088178, 1007090, 916763, 899648, 850841, 752893, 761465, 958058, 998795, 927505, 967112, 1044314, 1055316, 1013898, 845807, 790072, 821837, 840612, 737561, 674505, 691112, 714408, 815579, 722844, 756639, 802928, 809777, 852767, 998657, 1029198, 1136406, 1254237, 1213325, 1077849, 1045572, 1104109, 1100237, 1092740, 1014794, 954644, 1060043]
11987A060043K8137m9650j8392M9751O4831R9081n3243k7696K9459L0566p0680
11976A142207P4869Q1608L6147o09R499P534N3906o1005r8513l6890J15709J49631
11964A474093M2512p451J85864l9770L9305R6322P2680m989J7719O970J03601
11953A986856J83097N6980N9302R2006P4484J86863J70148o5154M4596J94363
11943B983541K12169K14945N4655K5901J55747M16547L44204K96422K63257K10582
11933E177970M24923M61748N31035N07063O69245P54391R33781J021098J142527
11924A1623781J418130J875407K425042L048088L713092M800259O144347P824181
11916D2872327R819654J1597127J3665890J6172488J8897153K1419525K3129267
$$ y = [1060043, 1088180, 1038530, 1020138, 1069889, 1134720, 1233801, 1180558, 1152862, 1182321, 1212887, 1142207, 1217076, 1298684, 1334831, 1334222, 1343721, 1351255, 1405161, 1344156, 1245643, 1208753, 1324462, 1474093, 1516605, 1509154, 1695018, 1655248, 1694553, 1790875, 1863555, 1858566, 1876285, 1883255, 1986856, 2169953, 2226933, 2286235, 2378241, 2452725, 2639588, 2809736, 2744582, 2789178, 2983541, 3195710, 3410655, 3465310, 3491211, 3646958, 4063505, 4407709, 4704131, 4967388, 5177970, 5602893, 6064641, 6595676, 7102739, 7771984, 8526375, 9460156, 10481254, 11623781, 13041911, 14917318, 17342360, 20390448, 24103540, 28903799, 35048146, 42872327, 52691981, 64289108, 77954998, 94127486, 113024639, 134444164, 157573431]
11909A57573431K3894391K4897327L0192394M3446670N9990979O2417951J4360039
11902D16773182o5052181q7828611o3537600l9021283k4711635j7078654j2757391
11895A06785827r708630p258624n676234n069985n293572n739301n490135m895741
11887E7653605m558267m070227l567595l289854k856722k644939k374041k216597
11879C2075363j921532j539899j512520j362980j239406j153865j033661r94251
11871B1317249r09520q69546p87870q30857o25650n88609o78310o70415n50871
11862A4805601n68379n35450m48387n58267o25157m63699l98381m25872m07562
11853A0374447m22240n07108l33073k87617l10036k54160j67292k17395k43474
$$ y = [157573431, 181467822, 206365149, 236557543, 280004213, 339995192, 402413143, 416773182, 351721001, 263892390, 200354790, 161333507, 136621872, 119543218, 106785827, 97077197, 89818573, 84142339, 79072354, 73778782, 68039481, 62549346, 57653605, 53095338, 49025111, 45457516, 42167662, 39310940, 36666001, 34291960, 32075363, 30153831, 28613932, 27101412, 25738432, 24499026, 23345161, 22311500, 21317249, 20407729, 19538183, 18750313, 17919456, 17293806, 16705197, 16026887, 15356472, 14805601, 14237222, 13701772, 13253385, 12695118, 12069961, 11606262, 11207881, 10782009, 10374447, 9952207, 9445099, 9112026, 8824409, 8514373, 8260213, 8092921, 7875526, 7632052]
11844G632052k16892l36645k50962l09432k29099p5440o1125k66807k22149k08907
11834E454594k38351k26511k08273j93010L924J09363j21397l9555k5067r2447
11824D423270j55274l04335j39243j10604j00688j66346j25880j14098q9329r1660
11814C025813m0473k6708p9032l2494r4712j45179o1288K3608p5187j20121j28009
11803B246218J5538o905o0281l0414r4725j13980N6145r723l4364m7719o7435
11792A852355K500K4381O5769j19559J6835k9815j16789O5370O7549M2784l028
11781A868352r7272Q1029n4554n4179L0860L5754q1151m9528k1971k00021j40989
11770A316330N4515J1289q7047n3204K1310l8310j65376j00654K7699O9454N2635
$$ y = [7632052, 7415160, 7078515, 6827553, 6518121, 6289022, 6213582, 6152457, 5885650, 5663501, 5454594, 5216243, 4989732, 4781459, 4588449, 4592373, 4701736, 4580339, 4540784, 4515717, 4423270, 4267996, 3963661, 3824418, 3713814, 3613126, 3446780, 3320900, 3206802, 3117473, 3025813, 2985340, 2958632, 2879600, 2847106, 2752394, 2607215, 2545927, 2569535, 2494348, 2374227, 2246218, 2261756, 2254851, 2194570, 2164156, 2069431, 1955451, 2011596, 2001873, 1967509, 1919790, 1852355, 1854855, 1879236, 1945005, 1825446, 1842281, 1812466, 1695677, 1761047, 1828596, 1871380, 1868352, 1771080, 1852109, 1797555, 1743376, 1774236, 1809990, 1728839, 1679311, 1657340, 1457319, 1316330, 1370845, 1382134, 1295087, 1241883, 1263193, 1224883, 1059507, 958853, 986552, 1056006, 1108641]
11759A108641P7058m8164p3222m958m9300l5610r328j76430j82349j9004R0542
11748F77876P9663m8562n3693m6192J776Q234l7937j33071N2173p0482m2227Q3501
11736D71059J19791O9983M4755N103n6514M8940N0739n9680o2633j41487m2786
11725D47270l9835j14131P444O2477P2471p0218r2380m1096J66081N2192l2920
11714D17355J00648k8726p4875J21066R819J6217m2466j6391k5059j9526o5493
11703C92569J2121j01880r0464p8020r2282M7841P093L9777j3702L1321J16000
11692B70374L3768l61j4337L751J4300N1904j40232q6695P8831K2937M9168m2107
11680B41301L205p731j37688M5428J43031L7796L3873O9805J2870K6182p6748
$$ y = [1108641, 1185699, 1137535, 1064313, 1059355, 1010055, 974445, 965117, 788687, 606338, 587334, 677876, 757539, 708977, 655284, 609092, 610868, 619102, 581165, 448094, 500267, 429785, 387558, 471059, 590850, 660833, 705588, 710691, 654177, 703117, 753856, 694176, 631543, 490056, 447270, 407435, 293304, 300748, 363225, 435696, 365478, 273098, 232002, 398083, 450275, 417355, 518003, 489277, 414402, 535468, 545287, 561504, 519038, 502647, 477588, 458062, 392569, 404690, 302810, 212346, 134326, 42044, 89885, 96978, 136755, 123053, 154374, 270374, 304142, 303781, 289444, 293195, 307495, 359399, 219167, 132472, 211303, 234240, 283408, 241301, 244506, 236775, 99087, 144515, 287546, 325342, 359215, 429020, 441890, 468072, 391324]
11669C91324j40850j46981q0116l0522q9580M723Q1296J14081Q1625J2101r3661
11658A03440p2372N1095m3168r176J90419J06247m4229n8007J13335m602k6482
11647C06500n3601Q7570N4960k8540l5756m0829k7093M11o8824M1269K8645p0881
11635A93831M8693j6108L574P4141K380j28506n2546l1842Q4627J64967l681j49046
11623A90484J7624K2270O5063J268r2468k4315O5508n5248O8485n6264N45J5629
11611B18581p9452m5035P7000n6230P6046l8203q8016n4083k0484l6499O9009
11600B2634O0718j51131p3057J8498J67400J23805o934N3640p7367o2112p1840
11589D254k786P8401j7982o1564m0794O169J7253M6551J26899o2723J6627p3810
$$ y = [391324, 250474, 103493, 23377, -7145, -96725, -92002, -10706, 103375, 185000, 197101, 103440, 31068, 82163, 38995, 29819, 220238, 326485, 282256, 224249, 337584, 332982, 306500, 252899, 340469, 395429, 366889, 331133, 290304, 263211, 263622, 194798, 236067, 264712, 193831, 242524, 226416, 229990, 304131, 306511, 178005, 125459, 93617, 178244, 343211, 339530, 190484, 208108, 230378, 295441, 296709, 204241, 179926, 245434, 190186, 258671, 202407, 202952, 218581, 139129, 94094, 171094, 114864, 190910, 152707, 64691, 10608, -9876, -46375, 22634, 83352, -67779, -140836, -122338, 45062, 168867, 161933, 215573, 138206, 76094, 4254, 1468, 79869, 61887, 323, -40471, -34302, -17049, 29502, 156401, 93678, 110305, 36495]
11577C6495p4264m5736o042L030m3241J9519k1130K4669R3590J9959N4329L895
11565F5073L9193l1106j35533j04660J1104K01340K73l683J1253k3074P1583L2929
11553A34692q7971l0434p4153p0871K3525K1566K2304J66031n0808o4493k0624
11542c1236N4394O3072L3805k7842N3059J00116l2490K606p8696m5825l4705j3074
11530D3184R4024l9522j9286m3534p7294n7276J59250J32407l5383Q933Q7102
11519B52605L9883l4353j1987j4911l428k5496q5892j34487M5886J42264o137
11508A63947n7161p1314M7991j6137j02972l8827l6Q2664r8542K228J74978l0836
11496E5983L98P8994m1786m9532m5993K92J39462m9M8869k8555q0038Q5804l4340
$$ y = [36495, -37769, -83505, -89547, -86517, -129758, -110239, -131369, -106700, -13110, 6849, 61178, 65073, 104266, 73160, -62373, -167033, -155929, 45411, 45684, 42001, 53254, 30180, 101763, 134692, 46721, 16287, -57866, -128737, -105212, -83646, -61342, 104689, 53881, -10612, -31236, 23158, 86230, 120035, 92193, 145252, 245368, 212878, 215484, 136788, 90963, 56258, 43184, 137208, 97686, 78400, 34866, -42428, -99704, 59546, 191953, 156570, 165503, 252605, 292488, 258135, 246148, 231237, 227809, 202313, 116421, -18066, 27820, 170084, 163947, 106786, 35472, 83463, 67326, -35646, -74473, -74509, 8155, -90387, -88159, 86819, 55983, 56381, 135375, 93589, 44057, -1936, -1644, 137818, 137769, 186638, 158083, 78045, 163849, 129509]
11483A29509L2656R8463M748j04499J0875l8748k6103L1809k4974p2019L6239
11472G7956L4360P9241p2702o6450K610M2898O4605j12781r1808P7709M0606L6300
11460A12544K5319r2223J214o0459o307M6374k3974n0292N2924L9302J24603O8577
11448B37602p1390k5132N1839p1577n3671q0851M5787O4518j0466o5382j7372
11437C905k127j35l39O3006j7192m5210j571O5069n9774j01094K6906l8483N4403
11424e2636O644m9874r7324m4310J24066J49436J30056O6339m2886m5092m0997
11413A03422j15171q7040j0341J39321L5117j52514M0514N0492J7243k188k7072
11402h217k1823J4455k6936J05318J1003K4706K4517j32370Q5828N3780r8937
$$ y = [129509, 162165, 260628, 265376, 160877, 171752, 133004, 106901, 138710, 113736, 41717, 77956, 112316, 191557, 118855, 52405, 55015, 97913, 162518, 49737, -42071, 35638, 76244, 112544, 137863, 45640, 46854, -13605, -19912, 26462, 2488, -47804, 5120, 44422, 169025, 237602, 166212, 141080, 192919, 121342, 67671, -13180, 32607, 97125, 86659, 21277, 3905, 1778, 1643, 1304, 64310, 47118, 1908, 337, 65406, 5632, -95462, -68556, -107039, -52636, -45992, -95866, -193190, -237500, -113434, 36002, 166058, 232397, 189511, 144419, 103422, -11749, -98789, -109130, 30191, 65308, -87206, -46692, 3800, 21043, 18855, -8217, -30040, -15585, -42521, 62797, 73800, 98506, 123023, -9347, 76481, 130261, 31324]
11391C1324k49189l6631J30875Q8377N0134M9027P0138m1085j30237r4543L8215
11380i3595J19488o4339o3843J50406J62403L0127j04560R4145Q4044l6081j42840
11369A35355m6317J08839j2437j42625j4401O3127l0648l8376r9373p2181o8144
11358b17181O3775L0760R2640N0892J51679R2739M6562j21102K459J23073K5947
11347C42243j20671j33372j8533L231l7543R0556K4995K960m5895j753K6659J59007
11335B91884o2380k50289l3694N8286K1528m745p9328Q9465J1633J8677l9853
11324B1184p7707j16597n4881J06848m405j29317k7789J11657J03793j535N5418
11313a3331L1662n5156N0564Q2924o1539j54846k1829J11208J25812n3540j19945
$$ y = [31324, -217865, -254496, -123621, -35244, 14890, 63917, 134055, 92970, -37267, -131810, -93595, 25893, -38446, -102289, 48117, 210520, 240647, 136087, 230232, 314276, 278195, 135355, 89038, 197877, 185440, 42815, 28414, 91541, 60893, 22517, -76856, -149037, -217181, -153406, -122646, -30006, 20886, 172565, 265304, 311866, 190764, 193223, 316296, 342243, 221572, 88200, 69667, 72898, 35355, 125911, 150906, 153866, 107971, 106218, 132877, 291884, 229504, -20785, -54479, 3807, 25335, 20590, -58738, 30727, 42360, 61037, 21184, -56523, -173120, -228001, -121153, -125558, -254875, -282664, -171007, -67214, -68749, -13331, 18331, -36825, 13739, 96663, 35124, -119722, -141551, -30343, 95469, 41929, -78016]
11302g8016M7962P9649M9838n382M6021r9602J8030j5856J1793P1727P9422k8995
11290A76591O669J1153J3744q9243j2386l1537o9310o3538L9353j0557l0778o2510
11278a22349K9217n019l2301J01859Q3690K08734N2042j47392j28680K7207r9531
11267c2523N683O0844o7682O9661o220l3886M7767P5203j17530J4595J29485M2595
11255A87992n8096o7105p7941K0406M548j01199p3599O3689N4276J39786J3196
11244A05953m904L8881p892K4411l8538q2306j03337K5919j1309m606k2479J2290
11232f7917J3096k4166L6936L4738R6047n655j88404n9132J86188R1769p2218
11221D1282m7241k2942k4919m9128J40418j06719l0861R2791J08696O0651k1808
$$ y = [-78016, -30054, 49595, 99433, 94051, 140072, 40470, 58500, 42644, 54437, 126164, 205586, 176591, 183260, 194413, 208157, 118914, 106528, 74991, 5681, -57857, -18504, -29061, -59839, -122349, -93132, -98151, -130452, -28593, 55097, 263831, 315873, 168481, 39801, 67008, -32523, -26840, 34004, -33678, 35983, 29763, -4123, 43644, 118847, 1317, 15912, 145397, 187992, 129896, 62791, -15150, 5256, 9804, -91395, -164994, -101305, -47029, 92757, 105953, 101049, 139930, 132038, 156449, 117911, 35605, -67732, -41813, -53122, -57728, -80207, -67917, -54821, -78987, -42051, -7313, 88734, 83079, -105325, -164457, 21731, 113500, 41282, -5959, -28901, -53820, -102948, 37470, -69249, -100110, -7319, 101377, 162028, 140220]
11210A40220q6699o4310K4535J62900J37386j61528j94130l1625j2252J02534
11200A7031J01072p8974o4430O3203m5873K7423M0508r379j3655Q6930M8497P2163
11188B44516J37760j24890j51603l8240Q9375n9478k9544l7403M2078p41r4959
11177b3129l3246Q6932p0553L010J46428J856o2552L3866J11499P98p3655j75588
11165e4334k7442J8535J7963J0633j5875k6609m1079o1134Q7278J35486O4341
11154A07763J2908p5852j04397r1491j00857r3202K8942R2624K3358N3935J38373
11143g896N1132K9621o511m7672j9142j20426q657Q5544J661K621Q7902n4492
11131f315m3731Q9064N2474r9573j04520K7935O5486K3050q3052n8504N8929R5641
$$ y = [140220, 53521, -10789, 13746, 176646, 314032, 152504, -41626, -73251, -85503, 17031, 118103, 39129, -25301, 37902, -7971, 19452, 59960, 50581, 36926, 123856, 172353, 244516, 382276, 257386, 105783, 67543, 156918, 97440, 67896, 30493, 72571, 71830, -23129, -56375, 30557, -39996, -36986, 109442, 111298, 48746, 82612, 194111, 194909, 121254, -54334, -81776, -63241, -45278, -34645, -50520, -77129, -118208, -179342, -92064, 43422, 107763, 120671, 44819, -59578, -151069, -251926, -345128, -316186, -223562, -200204, -146269, -7896, 43236, 72857, 66346, 18674, -468, -120894, -129551, -44007, -42346, -39725, 48177, -6315, -50046, 39018, 91492, -8081, -112601, -84666, -19180, 3870, -79182, -137686, -78757, 16884]
11119A6884n0018m6263n5577q092J62708R5177j3076p3463m2212N0259J58224
11108A94551L6921O8275j5266J283p5199j40372q1844K4434M0833J08367r453
11097A52530Q7514p2576r0428Q2341j8891P064j57931p5121P6290J07179J43231
11086B41202l1488j27154L1787K5026r2248r5213j27450M8822O7085P6691K4367
11075D1427M4316J39475M7855L6997r9155j01434J7361M7724m0191p6011p6141
11064a7777m7127k5565r3122J05940k4783O0695N6642M1096l6535j6372J0763
11053A3855n865j37929m9978J5145J44244P0222P7924j21403q5977J15420K6826
11042F2484J33426M1185q4686l3458m6311k4498K7082q5822m725J09399Q3282
$$ y = [16884, -33134, -79397, -134974, -143066, 19642, 114819, 101743, 28280, -13932, 36327, 194551, 231472, 299747, 284481, 285764, 210565, 70193, -11651, 12783, 53616, 161983, 152530, 240044, 167468, 77040, 159381, 140490, 147554, -10377, -85498, -9208, 97971, 241202, 209714, 82560, 114347, 139373, 47125, -48088, -175538, -126716, -59631, 17060, 41427, 85743, 225218, 273073, 310070, 210915, 109481, 126842, 174566, 134375, 58364, -17777, -64904, -90469, -183591, -77651, -102434, -41739, 14903, 55999, 19464, 3092, 13855, 7990, -129939, -179917, -164772, -20528, 49694, 127618, 6215, -79762, 35658, 62484, 195910, 237095, 152409, 118951, 72640, 48142, 75224, -10598, -15323, 94076, 177358]
11031A77358M8271P5084j1700K0392R6220p551J52682J08797l2573l139O4135
11020F87976k0318o6191j4368q7822J1288O3511K7023O7356j2943l2616m0805
11009E82091r0351P2937m1917r9657O9144M7273n4656j9314O0057k2535K8793
10998E31865K2804j07467j46432q5981K8046Q8695J93669j01041j06701k2908
10988B94549o2544q4565n6070r7838J67362K1477j6314k9355n7797j2368P6125
10977A42662m2012N2651l0004k5087K0250J5273n6146j6534q7324l6783M0345
10966b2709J4752N7553l0392j1260P7974J1422L1192N2551J293j41953l5833J32698
10954A37288m0290M5281J0086j5342N7643L3164n4009p414L4933j9134o4568o1861
$$ y = [177358, 225629, 300713, 289013, 309405, 405625, 398074, 550756, 659553, 626980, 623841, 687976, 667658, 601467, 587099, 499277, 510565, 574076, 601099, 668455, 655512, 622896, 582091, 491740, 564677, 522760, 423103, 492247, 539520, 484864, 465550, 525607, 503072, 531865, 554669, 447202, 300770, 214789, 242835, 331530, 525199, 424158, 317457, 294549, 232005, 147440, 91370, -6468, 160894, 182371, 166057, 136702, 78905, 66537, 142662, 100650, 153301, 123297, 98210, 118460, 133733, 77587, 61053, -26271, -63054, -22709, -7957, 49596, 19204, 7944, 85918, 97340, 128532, 181083, 182376, 40423, 4590, 137288, 96998, 142279, 152365, 137023, 194666, 227830, 173821, 166407, 201340, 182206, 117638, 55777]
10942E5777n1674J60720J61663m9595m4307O1074l1135k4177q9147j64591Q3247
10931F7855J60299L620j77146j19764O8639j6192k4288N6768J49387o7063r3574
10920H541k386K5094N7930j5846J2073r650L7192K3856J5492l0526M7976O9913
10908B39659L5254K4888K5700q4479j97162m0511J11552n4585N3453P2893M4695
10897B31357n7311j51324j6387n2633J09666n3922m0423R1982l156J0574k1866
10886D6557l59J8211M589Q776O9864k4944p0470K7383J12877P2298J23358p8842
10874C09298j54973j49241N2273M8006o8456k0942K3290N6325j2318j8179O1525
10863A26608k917o0806M0840q1436j0502N112j5679l3508K5803L716j5228j41374
$$ y = [55777, 4103, 164823, 326486, 276891, 232584, 293658, 262523, 238346, 149199, -15392, 67855, 228154, 231774, 54628, -65136, 3503, -12689, -36977, 19791, 169178, 102115, 8541, 6155, 31249, 89179, 73333, 85406, 75756, 112948, 136804, 152296, 121770, 169746, 239659, 274913, 299801, 325501, 241022, 43860, 3349, 114901, 60316, 113769, 186662, 231357, 174046, 22722, 6335, -46298, 63368, 9446, -30977, 61005, 57849, 68423, 46557, 46198, 64409, 68998, 77774, 147638, 122694, 52224, 79607, 192484, 264782, 388140, 309298, 154325, 5084, 57357, 105363, 36907, 15965, 39255, 95580, 83262, 65083, 126608, 123691, 62885, 103725, 22289, 11787, 16899, 1220, -32288, -6485, -2769, -17997, -159371]
10851a59371j9210J25801R5520J7580J2340o2636N7361J7741j3377N8309N7124
10840A87182o9278l4579k8321p5305o7854P2912N8009K5345M5928m5918J0223
10829G8344J21285m5159l3098R3157n791K8617J6962Q6019L1162j74202r0290
10818A07006R9196P1891q3543k9126R1592p6857p3031n4210P7796o6187l4432
10807C0095M989M0943N3877M6979j02965o779J6001j3851K346J01587O7422J0791
10795B51435L1101K1933j21302N4425K4021k7847J7925R1417P1942p7993k3331
10784C13726j13940j48912j6911M3770O7650J169q599o7889K6934O2967l7778
10773A22187p4688R9613Q7927n4000j4300r1097m7488N8417J7726j8635L4732
$$ y = [-159371, -178581, -52780, 42740, 60320, 72660, 10024, 67385, 85126, 71749, 130058, 187182, 117904, 83325, 55004, -20301, -88155, -15243, 42766, 68111, 114039, 68121, 78344, 199629, 154470, 121372, 214529, 208738, 237355, 254317, 340336, 371498, 197296, 107006, 206202, 278093, 194550, 165424, 257016, 180159, 107128, 52918, 130714, 64527, 30095, 35084, 76027, 129904, 176883, 73918, 67139, 83140, 69289, 71635, 173222, 240644, 251435, 282536, 304469, 183167, 237592, 261613, 233766, 251691, 343108, 415050, 337057, 313726, 199786, 50874, 33963, 77733, 145383, 146552, 137953, 70064, 96998, 159965, 122187, 47499, 147112, 235039, 181039, 166739, 75642, 28154, 86571, 104297, 85662, 120394]
10762A20394R9594o3253j97360o5598J9393Q0062K00786O7278q5273n4484J7915
10751A39454R053M3314j4564j13315j2524J24956J24898l8199q7783Q2198N3192
10740C10680o1528m0059k8800n3686r6815J40552J32797l330m0286J4792J39162
10729D13479m5318q2596N830J39578Q9616r5849m675k628Q102j0703R83Q8933
10717E04752L3373R888l058M8297Q9341N0261l5671P8733p1459l5615k26053k8898
10705D13891m3062N6114K6939o4739J61967K21078p5576k1555j4313J25611J0063
10694G96418k05799j06567o4244M3073P1638J7419o4052N0168P466N1245o6644
10683E30121Q804O5515J8932n7732Q712K6559Q1881m8371M1741o8606K7311N2936
$$ y = [120394, 219988, 156735, -40625, -106223, -86830, -6768, 194018, 261296, 176023, 121539, 139454, 148507, 191821, 177257, 63942, 51418, 176374, 301272, 263073, 175290, 257488, 310680, 249152, 209093, 180293, 126607, 29792, 170344, 303141, 299811, 259525, 274317, 413479, 368161, 285565, 291395, 430973, 520589, 424740, 420065, 417437, 425539, 414836, 415819, 504752, 538125, 548013, 544955, 593252, 682593, 732854, 697183, 775916, 704457, 668842, 442789, 413891, 370829, 426943, 453882, 389143, 551110, 772188, 696612, 675057, 660744, 786355, 796418, 590619, 484052, 419808, 462881, 534519, 551938, 487886, 538054, 545520, 596765, 530121, 538925, 604440, 623372, 565640, 574352, 600911, 682792, 634421, 676162, 607556, 634867, 687803]
10671F87803J2200j9582P4764L5716o9543j5364K2098o1133k1049J14674M3299
10660H03883O8505l4775k6639l9998R5198J51758Q424r4586l4542p2012k3450
10649H01766l562j3173o2677J81449R7474Q8095k0350o473J33373l256J95392
10638A388058J72045J03887P7716o3603O4934m2188K7296P711J06340K25292J88511
10627B255999L15348K53944J86031K45094M64004M59372N65230O96342P81799
10618F223163R78323J124747J361738J533584J744436K043744K340431K607961
10610A9958127L055848L553218M155275M582214M542742L457202J752994P82261
10602D5839881R02993J641097K614823L394189M494413N650573P118586Q084563
$$ y = [687803, 700003, 680421, 755185, 790901, 721358, 705994, 728092, 666959, 645910, 760584, 803883, 872388, 837613, 810974, 770976, 866174, 1017932, 1026356, 931770, 897228, 825216, 801766, 798204, 785031, 722354, 903803, 1001277, 1089372, 1069022, 1062549, 1195922, 1192666, 1388058, 1560103, 1663990, 1741706, 1678103, 1743037, 1700849, 1728145, 1735856, 1842196, 2067488, 2255999, 2571347, 2825291, 3011322, 3256416, 3720420, 4179792, 4745022, 5441364, 6223163, 7201486, 8326233, 9687971, 11221555, 12965991, 15009735, 17350166, 19958127, 23013975, 26567193, 30722468, 35304682, 39847424, 43304626, 45057620, 45839881, 46742874, 48383971, 50998794, 54392983, 58887396, 64537969, 71656555, 79741118]
10594G9741118P389221M005129l11385k706811k442915p94001J165299K760648
10586H8806303M201977N713342P560258Q379678O463082J002237n707483r152395
10578A07266999q281470n756674l370477j471438R9263J568784K708042L192673
10570I5955702J555496k393403o784216q617235p672524n815349m112964k808495
10562E9307012j677419r16219n38026n59393j381848k836938m627252n109334
10554D1660583m776622l804539l173428k600650k013560j821809j447187j295416
10546B0727372j153443r89354j007462r70181q77902q20829p51752q12509o84787
10537A2659153n79165n84620n30198m64846n87780m71677l38594l41475j52069
$$ y = [79741118, 87130339, 91135468, 90824083, 88117272, 85674357, 84880356, 86045655, 88806303, 93008280, 98721622, 106281880, 114661558, 121124640, 122126877, 116419394, 107266999, 98985529, 93228855, 89858378, 88386940, 88486203, 90054987, 92763029, 95955702, 97511198, 95117795, 88333579, 79716344, 72043820, 66228471, 62115507, 59307012, 57629593, 56713374, 56175348, 55615955, 54234107, 51397169, 46769917, 41660583, 36883961, 33079422, 29905994, 27305344, 25291784, 23469975, 22022788, 20727372, 19573929, 18584575, 17577113, 16606932, 15729030, 14908201, 14156449, 13343940, 12659153, 12079988, 11495368, 10965170, 10500324, 9912544, 9440867, 9102273, 8760798, 8608729]
10528H608729k79703l26415l43785l24037k34021k31204k51398k51584k17141
10519F149441j73257j60963j21836k59001j73380j82921j71692j12714o6713k5825
10509D701139p7714j41159m9489k29976k51979j51564k03995j46084r5156j03291
10499C250732j4314l3503j39888k11324j48018N673L4785j02012j22704p9984
10489B439443n7019l1080n6206o6767m1557M4888O80o1270L5792N9434j23934
10478B142404k56346j59308j03789J00995K8012M4397m7703R5158M4965l8992
10468A849793j14251k66297n9909m9560m1096k5188P2350R4333O5442M0554o884
10457A559287p6994r2141m6521j06023o0672k9985o2452J8958O484J1982o0696
$$ y = [8608729, 8329026, 8002611, 7658826, 7334789, 7100768, 6869564, 6618166, 6366582, 6149441, 5976184, 5815221, 5693385, 5434384, 5261004, 5078083, 4906391, 4793677, 4726964, 4701139, 4623425, 4482266, 4432777, 4202801, 3950822, 3799258, 3595263, 3449179, 3354023, 3250732, 3236418, 3202915, 3063027, 2851703, 2703685, 2709358, 2744143, 2642131, 2519427, 2439443, 2382424, 2351344, 2295138, 2228371, 2186814, 2231702, 2232382, 2171112, 2206904, 2266338, 2142404, 1886058, 1726750, 1622961, 1723956, 1751968, 1796365, 1748662, 1843820, 1888785, 1849793, 1735542, 1469245, 1409336, 1359776, 1318680, 1293492, 1365842, 1460175, 1525617, 1566171, 1559287, 1482293, 1390152, 1343631, 1237608, 1176936, 1146951, 1084499, 1103457, 1109941, 1121923, 1061227]
10446A061227K584j21320O632J88666J7299j62463j35990j1162L4655J08498o8459
10435I20167n3497o1431J18532K9086n5461q3669j51997j05699l5204l280P1709
10424E89256j148L8321k05784k1024J22193n7046k964l6610q9382j8940r513P0801
10412C78160M9245j37821j1914R4564K8157M9300n7964m5186O2569K5019O9220
10401E03349J7353n2071j37798l3750O4294n4218o2331K8340p9659m6308P1622
10390B18823J657k5931q4130L2203R2087n3489R859J29394N2365J15559o4076
10379D24321q9503N110Q899N217k3786j35002n2816J00507Q8642L7651j03388
10368B65852j8399K4851j1898o2873O6320K0991J02598k9975j80343K4408Q3209
$$ y = [1061227, 1063811, 942491, 949123, 1137789, 1155088, 992625, 856635, 845473, 880128, 988626, 920167, 866670, 805239, 923771, 952857, 897396, 813727, 661730, 556031, 520827, 517547, 589256, 588108, 626429, 420645, 399621, 521814, 464768, 461804, 425194, 335812, 316872, 307359, 378160, 427405, 289584, 277670, 372234, 400391, 449691, 391727, 346541, 409110, 434129, 503349, 520702, 468631, 330833, 297083, 361377, 307159, 244828, 273168, 193509, 147201, 218823, 220480, 194549, 110419, 142622, 234709, 181220, 191079, 320473, 372838, 488397, 424321, 334818, 339928, 348827, 354044, 330258, 195256, 142440, 242947, 331589, 369240, 265852, 247453, 272304, 260406, 197533, 263853, 284844, 387442, 357467, 177124, 201532, 284741]
10357B84741j2426K6726K9790j04235j2494N9046j4337j9671k4386M920l1338
10346A86336l5820k3624O7764M039j8545p5267L436K556k4546J7424N2058l9437
10334A16374Q282N9123p1526j31683J04327N2918r4250J885M0308q4095R636J5367
10322B6666j15787l6966O3291N5214L7541K9192K9463l1327k893j07192l9298
10311i2096J20650J53840Q4563l8681M1993L4094k9747m2148m8414p5491R21N0625
10299A60109N9027m4102k3392m2690k3620j03558n7570L9988M1233M9827J437
10288E6689m5552j6326j4821l44j14670O6798j7285m235m0412M5713N8413q557
10276c4589o6508M2734n6370K7239J7150N5968N1193j16201j37828N715n9591
$$ y = [284741, 272315, 299041, 328831, 224596, 212102, 271148, 256811, 237140, 212754, 217674, 186336, 150516, 126892, 194656, 198695, 180150, 104883, 108319, 110875, 86329, 103753, 155811, 116374, 124656, 183779, 112253, -19430, 84897, 137815, 43565, 45450, 85758, 1663, 11299, 26666, -89121, -126087, -62796, -7582, 29959, 59151, 88614, 57287, 54394, -52798, -92096, 28554, 182394, 266957, 228276, 270269, 304363, 274616, 232468, 184054, 108563, 109484, 160109, 219136, 175034, 151642, 108952, 85332, -18226, -75796, -35808, 5425, 55252, 56689, 11137, -5189, -20010, -20354, -135024, -68226, -85511, -89746, -130158, -84445, -26032, -34589, -101097, -58363, -114733, -87494, -70344, -14376, 36817, -79384, -217212, -211497, -271088]
10265b71088k400O4715N7098R2433R6394L5059P2086L6073n2321j31444j2516
10254a5911M1316J5083O4951o3429l7922r984m1460N9310O7850q1365M1911O1015
10242A01365N4247P2374k8433q3208o529m6685K9989m2935n8234j3468M2405M3630
10230F4518m4075l2687k9096j20357p6828K7997r99K6253P0619M4962J0058l5118
10218i4753j621Q5581K1110L6822o9236l8693K8704j36686J0973J29987O0562
10207C2750P6402K4825q1158k668p5931k33371l4519O1054N708P9387Q4579Q1221
10195A8279R0389J9386j32398o2614M3867O9393R7896l550j40993m6538N2641
10184E758k8917q0751j83109R1051J45299J1041q6270m1969L8356M9699M8952
$$ y = [-271088, -273488, -208773, -151675, -59242, 37152, 72211, 144297, 180370, 128049, -3395, -15911, 25405, 40488, 105439, 42010, 4088, -5896, -47356, 11954, 79804, -1561, 40350, 101365, 155612, 227986, 199553, 116345, 109816, 63131, 93120, 50185, -8049, -21517, 20888, 64518, 20443, -12244, -41340, -161697, -238525, -210528, -211527, -185274, -114655, -69693, -59635, -94753, -96374, -10793, 10317, 47139, -22097, -60790, -32086, -168772, -157799, -27812, 32750, 109152, 133977, 52819, 50151, -25780, -259151, -293670, -232616, -226908, -147521, -62942, 18279, 108668, 128054, -4344, -66958, -23091, 46302, 144198, 140648, -345, -46883, 5758, -23159, -103910, -287019, -195968, -50669, -39628, -125898, -167867, -129511, -79812, -30860]
10173c0860P5478J25082J40064n9546l6592N7267P7127m3872o7666J39614o003
10162C70093m5586r8597M7367Q8232P2033K6372l4221m0243M5020Q8967L9340
10151E58777k7108n632M2207Q7157K3713k4449j12098J5123k5205J2409M3920
10140E88814L6227O9058M5211j46449j9457M9490q7146N3858m9952k5641j0758
10129E03255m1703m1472o3178o126j6190o1900J00960l1745o6965n8056p9940
10118A36940J3326j11839n6833k4885J12350M0862n9179J3118Q5536M1283J2720
10107B03399Q989j44927j24666R6160J56362q7483o3736k8460O1749J21650Q746
10096B07783R0726k7878j33717P22K1047k03220J3482k5033k5866K4923n6585
$$ y = [-30860, 44618, 169700, 309764, 250218, 213626, 270893, 348020, 304148, 236482, 376096, 370093, 324507, 225910, 273277, 361509, 433542, 459914, 425693, 385450, 430470, 519437, 558777, 531669, 526037, 568244, 655401, 679114, 654665, 542567, 557690, 532485, 544894, 588814, 625041, 694099, 739310, 592861, 573404, 622894, 535748, 589606, 539654, 514013, 503255, 461552, 420080, 356902, 350776, 334586, 272686, 373646, 341901, 274936, 216880, 136940, 150266, 38427, -18406, -43291, 69059, 109921, 50742, 63860, 149396, 190679, 203399, 212388, 67461, -57205, 38955, 195317, 107834, 44098, 15638, 77387, 199037, 207783, 298509, 270631, 136914, 137636, 158683, -44537, -31055, -56088, -81954, -57031, -113616]
10085a13616k1277K9171J5350J2755J05457j43130j3281J83591O689J9837K8991
10074A10537N15J789P1334n5614j7894q578l7111o509j7906l3259R0919M7044
10062A45267o1943P0970o0387k043k9428o2703o0546p1410R438O9718R9732J5034
10050F1699n997j11387L037k840q219L6906n0758j36978N5245j7193K408Q0426
10038i3651j7172q5161J12629J35411j24809r5022P2790O3821N7419l0707N2756
10027D8304R775J9446r8327o5196L358P5032N627K9699m2103J8727k0987N974
10015a0671n0393k721K5002R5646M0681l0606J1382j60313l5109R6347j1566r707
10003d2028l7216q705N133J20345K6229L3737l3830j01979J0612P8877j48280
$$ y = [-113616, -134893, -105722, -90372, -77617, 27840, -115290, -128571, 55020, 61709, 81546, 110537, 111052, 112841, 184175, 128561, 110667, 102089, 64978, 58469, 40563, 7304, 98223, 145267, 83324, 154294, 93907, 91864, 62436, -267, -60813, -132223, -122785, -53067, 46665, 61699, 55702, -55685, -52648, -55488, -63707, -26801, -77559, -214537, -159292, -176485, -174077, -93651, -110823, -195984, -83355, 52056, -72753, -167775, -94985, -31164, 26255, -4452, 48304, 58079, 77525, -20802, -85998, -82640, -7608, -1981, 27718, -14385, 4342, -16645, -10671, -61064, -63785, -38783, 56863, 97544, 66938, 78320, -81993, -117102, -20755, -32321, -42028, -79244, -87949, -82816, 37529, 63758, 97495, 63665, -38314, -27702, 51175, -97105]
9992i7105j02483k3079m1930L3327J03203J01389J32917J1663j27526j7270J02633
9981G5739J9495K3235l4484p768K0453q7577j02195K7257M0170n9262q88O5777
9969b0048L6484n5807j22055O5007J27530J24982r2098q3425P3493J13368m9210
9958A18221l2285k5110L756n3599j00182k8121L3985N4073o3339M8736r080o9505
9946a22450K2094P8490M8031k8594Q1529L2270o500j08820m7939J8833M7483j04770
9934i0343M9190l3721l6652J9351J2398n5249J22827J71271j37853k22154J4515
9923a86420N8069m4519r7663O5013J70028J0766l0459O0819j6994q0850K4849
9912f7361O3449j08935k7637O9236l02q1236K9242K1431q209N9878L3716O2779
$$ y = [-97105, -199588, -222667, -264597, -231270, -128067, -26678, 106239, 117902, -9624, -26894, 75739, 95234, 118469, 83985, 76217, 96670, 9093, -93102, -65845, -25675, -84937, -85825, -20048, 16436, -39371, -161426, -96419, 31111, 156093, 63995, -19430, 54063, 167431, 118221, 85936, 60826, 64582, 10983, -89199, -117320, -83335, -29262, -92601, -43865, -52945, -122450, -100356, -21866, 26165, -2429, 79100, 111370, 104870, -3950, -51889, -33056, 14427, -90343, -41153, -74874, -111526, -92175, -79777, -135026, -12199, 159072, 21219, -200935, -186420, -128351, -172870, -270533, -205520, -35492, -24726, -55185, 5634, -11360, -92210, -67361, -3912, -112847, -140484, -71248, -71550, -152786, -123544, -102113, -110322, -50444, -16728, 46051]
9900D6051K48997J0297j17898j27117k24493j21946O6008K16164N8524L2184q250
9889G8521K4240n1384o9257K0562p9349P6297l1817K5269J796J0865J6578n1202
9877b8881n617O226l0619N8917J35072O5653j30787p5585o8554j15718K6868L1382
9865a31643Q2335l322j1872K2577p509R6759j2627m8799j394J41363q8101r0098
9853e2331K546n931n179q8809j00471M2549J6761J6628R6664J5247P937J7723
9841c6666l7137n6612J900L5088q283M4301o4419K232K6959J15129N3909j2196
9829F4205P4561l4704j35284j86164J09357Q0568L176J26262J27687p883j29528
9818I2253o1239j19327J1973j02663n5743J00187n7728Q208K6095p1511j2593
$$ y = [46051, 295048, 305345, 187447, 60330, -164163, -286109, -220101, -3937, 54587, 86771, 78521, 102761, 51377, -17880, 2682, -76667, -370, -32187, -6918, -5122, 5743, 22321, -28881, -34498, -28272, -58891, 26, 135098, 200751, 69964, -5621, -74175, -189893, -163025, -131643, -49308, -52630, -64502, -41925, -49434, 47325, 34698, -14101, -15495, 125868, 37767, -52331, -49785, -55716, -60895, -149704, -250175, -207626, -190865, -174237, -77573, -62326, -54389, -36666, -73803, -130415, -128515, -93427, -101710, -57409, -121828, -119596, -92637, 22492, 76401, 64205, 138766, 104062, -31222, -217386, -108029, -27461, -24285, 101977, 229664, 221781, 92253, 31014, -88313, -76340, -179003, -234746, -134559, -192287, -184079, -157984, -229495, -242088]
9807b42088J17501L7647j37189P2015Q0187n1636q7180J1694P7282R9038K8210
9796E481K0883M7697n0259K2258Q2485r7744J3258K9507j21920j05768O1078R2126
9784i18p3898L6934M7820M9498k4494j8092k3358o6337p4030K3779j8378L490
9772a37984L1514O5864J98936m2387n5118L5913K0701p3020p1112K1341R3341
9761H7989M9578p7959p7434l3516J9111l8752r5989J3929O4025K7372Q1207N7998
9749G7559m254Q8488n5999j7376m6661q8439j79366j205J79277R9200j07626J683
9737e4719m5565j22169o2342P1134K37696P3701o1476M8285P9760o980k2576k9301
9725A05448r3422j8934K6574j43157k454n7900l0999O3078R9463J2368J24215
$$ y = [-242088, -124587, -86940, -224129, -152114, -71927, -123563, -210743, -199049, -121767, -22729, 5481, 26364, 74061, 23802, 46060, 128545, 30801, 44059, 73566, -48354, -154122, -93044, -918, -74816, -37882, 9938, 59436, 34942, 16850, -6508, -72845, -146875, -123096, -141474, -137984, -106470, -40606, 158330, 115943, 60825, 96738, 117439, 44419, -26693, -5352, 87989, 137567, 59608, -17826, -51342, -32231, -70983, -166972, -153043, -89018, -61646, 19561, 77559, 73305, 161793, 105794, 88418, 41757, -46682, -226048, -227253, -47976, 51224, -56402, -54719, -100284, -222453, -284795, -213661, 24035, 97736, 36260, 84545, 164305, 157325, 134749, 105448, 12026, -6908, 19666, -123491, -125945, -183845, -214844, -151766, -52303, -39935, 84280]
9714H4280Q4994K1409M794n1979j36791o332N3419m0208L1917K2413J4639L1176
9702A13731M6724J1098j48232r1900k823N3815K2021j0903K8252l9032r8056m0128
9690a55433P6719K3803J4696R4618l8190j0120K2450q2521j6915p947L4254O2206
9678A7620O294p4627n7072J14644M9505l2494j2936J20150L4457R8384r2902n2674
9666A18349N1632j22309n9092M295M1656p6503k8261k562P7003n5252m9634K9060
9654g1618P996k7293J4156J54398K1431o2790m7182m1514o6087J5606L8434N2457
9642a2006m22j8848r3119K249L030k0528L4879J3967J07133q3184Q0754R6898
9630A10803J9459M5417j4201N6396n3914j80365j25725J45416j8941R6972O0779
$$ y = [84280, 169274, 190683, 195477, 143498, 6707, 375, 53794, 13586, 45503, 67916, 82555, 113731, 160455, 171553, 23321, -68579, -71402, -17587, 4434, -6469, 21783, -17249, -115305, -155433, -78714, -54911, -40215, 54403, 16213, 6093, 28543, -53978, -70893, -78840, -44586, 17620, 23914, -50713, -107785, 6859, 56364, 23870, 10934, 131084, 165541, 263925, 171023, 118349, 169981, 47672, -11420, -7125, 34531, -41972, -70233, -72795, 4208, -51044, -100678, -71618, -63622, -90915, -76759, 77639, 99070, 36280, -10902, -52416, -118503, -102897, -64463, -12006, -12428, -31276, -124395, -122146, -119116, -139644, -104765, -90798, 16335, -66849, 13905, 110803, 130262, 175679, 161478, 217874, 163960, -16405, -142130, 3286, -15655, 81317, 142096]
9619A42096l2414n9392J9021q4238J49328J06487J43740J06189n3456N125j0163
9608D32323p0190m343J06726J07648k6078n6628R4701K9044n0525O0250k4123
9597E98805j81429n9313k4373P1022J20555o3611j05718j02891j4958j15487j14641
9586G961M1505P904j498m924j3531J56015P4830p8386p9023k0087k7603k510p5968
9573a5315o0777O7168q6570Q4659Q761N5896J7216L8186J7972l7466O4086J57592
9561C11408l6976r051j29247j51593j12127L7845K8592K3855K7544J13912m6686
9550E7476j06290k0610o379o8600m3978J2779J45812O7002O3244l6233k318J32525
9538A94430Q3321m4906J3067j4118r7436K7925n1115j6463l7009o5266m6656k0127
$$ y = [142096, 109682, 50290, 69311, -14927, 134401, 240888, 384628, 490817, 437361, 442486, 432323, 362133, 357790, 464516, 572164, 546086, 489458, 584159, 613203, 562678, 622928, 598805, 417376, 358063, 333690, 404712, 525267, 461656, 355938, 253047, 238089, 122602, 7961, 49466, 57370, 55872, 50948, 37417, 193432, 268262, 189876, 110853, 90766, 63163, 60653, -15315, -76092, -8924, -95494, -10835, -2074, 53822, 71038, 109224, 127196, 89730, 153816, 311408, 274432, 265381, 136134, -15459, -127586, -89741, -61149, -37294, -9750, 104162, 57476, -48814, -69424, -75803, -144403, -188381, -175602, -29790, 37212, 100456, 64223, 61905, 194430, 277751, 232845, 245912, 231794, 134358, 162283, 111168, 94705, 57696, -7570, -54226, -74353]
9526g4353j18576m1203J8474l010P9556M0885j5204j7003L902J03274L7990n178
9514I554n0075j61747j10102O8116P6518L8672J61764J34312Q1482k7257m8153
9503A73084j76497j10794q123p7834K5918N2529L9528M1027k8218O6115J02163
9492I8898j4175K258J776k1372R042J03120j207N8216k102j94803J1956j6133
9480C5474j18389R7394N6656p2052n4050l3425K9608N4723j6372o2173O0988M187
9468a7431k6736Q4280q750q1943j6314Q5442L1078n7935K9523P4462J10311P648
9456B13635j9525q4695r4474p4586l3682L8825L623k323P2582p1166j5270R4979
9444B7923K3561o8426m3716n8L4991k8429m7759n5022K9278l2359q2035K7502
$$ y = [-74353, -192929, -234132, -215658, -218668, -139112, -98227, -113431, -130434, -126532, -23258, 14732, 9554, -40521, -202268, -312370, -244254, -167736, -129064, 32700, 167012, 248494, 221237, 173084, -3413, -114207, -122330, -200164, -174246, -121717, -82189, -41162, -69380, -3265, 98898, 84723, 86981, 88757, 67385, 76427, 179547, 178340, 236556, 234454, 39651, 51607, 35474, -82915, 14479, 71135, -917, -54967, -88392, -58784, -4061, -20433, -82606, -21618, -17431, -44167, 40113, 31363, -50580, -66894, 18548, 49626, -8309, 21214, 95676, 205987, 213635, 194110, 109415, 14941, -59645, -93327, -54502, -50879, -53202, 19380, -51786, -67056, 27923, 51484, -16942, -60658, -60716, -25725, -54154, -101913, -156935, -127657, -160016, -242051, -214549]
9432b14549P3594M6805R9542L2938L388j04756L422O2817o2222N6747R001J48
9420F875J6342J3924j58768j1702N3J24361J09228K4305P0846J6972n2615l8400
9408A21421o0459M3315N3923p7849p5101Q0098j2100j4413L086o7890M0710N8424
9396I3165n9310j74383M752Q3934R7671J11552m4887j08233J1333P2325l6848
9385E1071p4655m5285N7597M9647O9819j3630m2422p3915L1034q2090k5791N9715
9373c8905K9956m8721L7168k8716j4245K9350L0884k0718j19599N7105M1302o1740
9361a06879M1828L3769l6162M5817O1552J31829K0385n3228k16894j7924M4309
9350e1598p4644O3704R5513J088o7053m5142O6119L8101k5285o58k5079J209K7550
$$ y = [-214549, -140955, -94150, 5392, 38330, 41718, -63038, -59616, 3201, -59021, -2274, 6727, 6875, 23217, 37141, -121627, -133329, -133276, -8915, 100313, 124618, 195464, 212436, 159821, 121421, 60962, 104277, 158200, 80351, 5250, 85348, 73248, 58835, 61921, -5969, 34741, 93165, 33855, -140528, -135776, -51842, 45829, 157381, 112494, 4261, 15594, 87919, 51071, -23584, -68869, -11272, 38375, 108194, 94564, 52142, -21773, 9261, -72829, -98620, -38905, -8949, -57670, -20502, -49218, -63463, -34113, -3229, -23947, -143546, -86441, -45139, -106879, -65051, -31282, -67444, -21627, 39925, 171754, 192139, 138911, -77983, -95907, -51598, -126242, -62538, 32975, 34063, -32990, -78132, -12013, 26088, 803, 145, -24934, -23725, 3825]
9337C825J16912L3868l7194l2430K9467r5700r8782K5696k3620k7705k0507O8537
9325e7633J25898J6000q7098L4012k1918j43670n9902L3758O0274J1085n7782
9314a46976M1814L2228L9752K6968j1240l2681J9124n0680p9623N0947J1191l5527
9302a34703n7825l350R3000L5928Q7775n2466l3108j49469L7285J74949J34849
9291A32865l5461l528J4283K2152r3854m4866L0171J2180m0203N985n0691J8734
9279c2233j9987n8908L6198J2181J36478j1679m4961K0314N0881N2835j487k6674
9267A12958j14280j64980m1889J36040N3343R6518N5069j31424K408O8049M2379
9256A14191k6661j00571r3767p2317N7291M5251j0630J2219j2218N1848r1501
$$ y = [3825, 120737, 154605, 117411, 84981, 114448, 18748, -80034, -54338, -77958, -105663, -126170, -57633, 68265, 84265, -2833, 31179, 9261, -134409, -194311, -160553, -100279, -89194, -146976, -105162, -72934, -33182, -6214, -17454, -50135, -31011, -81691, -161314, -110367, -99176, -134703, -192528, -195878, -102878, -66950, 20825, -31641, -64749, -214218, -176933, -1984, 132865, 97404, 93876, 108159, 130311, 36457, -8409, 21762, 33942, -6261, -276, -50967, -32233, -52220, -111128, -74930, -62749, 73729, 62050, 17089, 37403, 88284, 141119, 139632, 112958, -1322, -166302, -208191, -72151, -18808, 77710, 132779, 1355, 3763, 71812, 114191, 87530, -13041, -106808, -179125, -121834, -76583, -87213, -74994, -87212, -35364, -126865]
9245a26865j57900j1442J80791J21790J4341p3706j44507O9788k146m1003M6665
9234a24194N2452O8765R5891n3890p3104j6532j4732l5634k7714K7027L0312l6888
9222a08241J1409O3682L8213l2484k4248j9160n6889p1197J22741J24502l9608
9211H720o6471j716r9203P371J16607k2148q1574j25509J06925K2399M3647J38640
9199D7688P2187M4455L5406j57167j30615o4774j59438j16847Q9476K01004P8117
9188f0508J01932N7100J3510m5185r3528J2107Q0780N2743Q7735M5854q6415j25663
9176D0462o5238j09551k2316q0750N3341K7738K2730o0628R4597J8633P465J59021
9164H5504J26975n5912p8112l5612j42546k5044M2462M2502j59255l9664J05685
$$ y = [-126865, -284765, -296207, -115416, 6374, 20715, -52991, -197498, -127710, -129856, -170859, -124194, -71742, -2977, 92914, 39024, -34080, -50612, -65344, -100978, -128692, -101665, -71353, -108241, -96832, -33150, 5063, -27421, -51669, -70829, -127718, -198915, -76174, 48328, 8720, -57751, -59467, -158670, -151299, -34692, -56840, -138414, -263923, -156998, -134599, -90952, 47688, 119875, 164330, 199736, 42569, -88046, -152820, -312258, -429105, -339629, -138625, -60508, 41424, 98524, 112034, 66849, -26679, -14572, 66208, 118951, 206686, 252540, 166125, 40462, -24776, -134327, -156643, -237393, -184052, -156314, -133584, -194212, -99615, -80982, -73517, 85504, 212479, 156567, 78455, 42843, -99703, -124747, -82285, -39783, -199038, -238702, -133017]
9153a33017o1834O6821N0817j21q9590j9436k659k6625J55539J9312M0961J7120
9141A7288K5502r788o3323o2288j24499j0879J70412P2867r1530K5306K3325Q1380
9129E3773Q1403J2836K6821j2684N909o8340r5683n3368r104J55529Q3482r6924
9117H3650p9917n6133P612K6167L7746m4503k930R2162N8251m9324k6860O1951
9105A07872j3461J03181J05904j33928j52953j09216p3648L1951k9136O3496J61990
9094F2052Q1336j1677k0161o2500j9338j6871K5505N2367o3512M5703K8314M5154
9082A46372N9269L6867m2720L655l3397n2068j14000p3046N8512M9626L2585J06498
9070A78153N8483k7045r3597m0372K118L4194q7323o4595n0751j7182J3811Q3128
$$ y = [-133017, -194851, -128030, -77213, -77334, -166924, -186360, -189019, -215644, -60105, -40793, 168, 17288, 42790, 33002, -30321, -92609, -217108, -227987, -57575, 15292, -76238, -50932, -27607, 53773, 135176, 148012, 174833, 162149, 168058, 99718, 4035, -49333, -58437, 97092, 180574, 83650, 3733, -52400, -44788, -18621, 19125, -25378, -28308, 63854, 122105, 72781, 45921, 107872, 94411, 197592, 303496, 169568, 16615, -92601, -166249, -134298, -163434, -99938, 62052, 143388, 131711, 111550, 49050, 29712, 12841, 38346, 90713, 27201, 72904, 101218, 146372, 205641, 242508, 199788, 203443, 170046, 117978, 3978, -69068, -10556, 39070, 71655, 178153, 236636, 209591, 115994, 75622, 77740, 111934, 24611, -39984, -90735, -107917, -94106, -10978]
9058a0978M6279r043o0307q9409J8986m1545K4863K402l1023j1955O3729m7508
9046a45509k4973j6674j367J04736J25524m7665j46982k1130l3023P3865N9065
9035g4133n4029j7804P3399M8922Q2911K4363o8221q2443j38265O1210m858K8341
9023a20607O5229K1151n5831J04124p3367R560j33447J0264J49913O7166P2441
9012A16596l1974r8314n0289R649o5023K4115P9733J7556Q0168N3385O601O4834
9000B07037k4424J8186K319j37407r6289M651Q1208R1675m7103q7430j9491M9315
8988D2247j8006q05R4488o344o2232J14318j83451j08591K23805J27101m1755
8977A80775o1551k5329n3537O0236k1009j00930j47149M703J14959O1913k285
$$ y = [-10978, 35301, 26258, -34049, -123458, -104472, -146017, -121154, -118752, -149775, -161730, -98001, -145509, -170482, -187156, -188523, -83787, 41737, -5928, -152910, -174040, -207063, -133198, -74133, -128162, -145966, -72567, -23645, 59266, 83629, 15408, -67035, -205300, -144090, -148948, -120607, -55378, -34227, -90058, 14066, -59301, -49741, -183188, -172924, -23011, 44155, 116596, 84622, -13692, -63981, -54332, -119355, -95240, -15507, 2049, 82217, 135602, 142203, 207037, 182613, 200799, 203118, 65711, -30578, -25927, 55281, 146956, 99853, 12423, -7068, 42247, 24241, 23436, 117924, 111580, 49348, 163666, -19785, -128376, 95429, 222530, 180775, 119224, 93895, 40358, 100594, 79585, -21345, -168494, -163791, -48832, 13081, 10796]
8966A0796r0525O2641M2472k2510J3132J45059J78440L8260j02123j06282l1082
8955A38278j10461k5192J22986j22108j04070J41334R2936r6331j23700n5815
8945a42143N1887j8310n1324J36119j15l2392l521J13193K7607M6830Q349Q435
8933A44615j66508j46653n632q0420j1565M184J36952J54609K4259Q41Q24q759
8921D6747Q3785K267j14011l3497r759P6174q87j39548j24611Q5960O0296O2727
8909d357P5323j07593R2781q505O1405n0773J4849q9M1965j6762j9556M6319p9864
8896D5143J6150J5117n5563P3646J6843j21448l809R5342M9909q7432q7670l3166
8884g6938l4275J5285k3293o3909j01228R2411K27359N2578N5965p9980m9948
$$ y = [10796, -79729, -17088, 25384, 2874, 16006, 161065, 339505, 377765, 275642, 169360, 138278, 27817, 2625, 125611, 3503, -100567, 40767, 133703, 37372, -86328, -142143, -90256, -108566, -159890, -23771, -23886, -56278, -59799, 53394, 81001, 127831, 136180, 144615, -21893, -168546, -174178, -254598, -266163, -261979, -125027, 29582, 53841, 54682, 55506, 46747, 130532, 132799, 18788, -14709, -24468, 51706, 50819, -88729, -213340, -127380, -67084, -4357, 70966, -36627, 56154, 47649, 109054, 58281, 73130, 73041, 115006, 98244, 78688, 125007, 45143, 61293, 76410, 20847, 94493, 111336, -10112, -13921, 81421, 131330, 43898, -43772, -76938, -111213, -95928, -119221, -183130, -284358, -191947, 35412, 87990, 143955, 63975, 14027]
8873A4027n9653j8580Q1027K009N0599K3925Q5266j19284j06505q1037J03797
8862b4409J03138l3663j27699n9115K8298J58094J33874j08079L753l2533n4158
8851a2499r6416L1916n6127N5376r3206J483M3399k7987L0713J73700p3402j564
8839b4614P8115k0960l2264J2885q088r7627L0691K6612O8296L9675j7175Q585
8827F4131J4550j24173r23N238p3684L3122O1263k7222N2763j7410k1768q213
8815d2326j35762k0264L9797K8324K977N3101O1767j8608K5252j09523l5274Q615
8803a41924O1233n1579m9892N5590j9416K7362K5896r085o3312P0439J07905p8549
8791f5332N1747J09899M559J872Q7957m483m6455L3p2129o543O3111k0307n9247
$$ y = [14027, -45626, -64206, 16821, 18830, 69429, 93354, 178620, 59336, -47169, -128206, -24409, 78729, 45066, -82633, -141748, -113450, 44644, 178518, 70439, 74192, 41659, -12499, -108915, -76999, -133126, -77750, -170956, -169473, -126074, -154061, -123348, 50352, -23050, -24614, 53501, 32541, 277, 13162, 5074, -92553, -61862, -35250, 33046, 72721, 55546, 64131, 78681, -45492, -46415, -41177, -114861, -81739, -20476, -47698, 5065, -12345, -34113, -42326, -178088, -198352, -158555, -130231, -127254, -74153, -12386, -30994, -5742, -115265, -150539, -141924, -80691, -132270, -182162, -126572, -145988, -118626, -92730, -101815, -165127, -94688, 13217, -65332, -13585, 96314, 100873, 102745, 190702, 186219, 139764, 139797, 67668, 61125, 124236, 103929, 44682]
8778D4682k6989m8236j3925k2980J00441M4539m0140K0733p1406m8027l3115p3964
8766a68387J1198N309l5504R607m6389Q4772Q4926J9116m7988M0312p4854j17005
8754b34887J51720J02028J18748J33795k8617p8120M2979p1666m9338Q2134p1758
8743I7018M0992o6976k2452P1456n4376k0950r291p5509p6231J47859j8660J0949
8731B3829m4681J9986K2155M2222L8888k8556o9170L9334K9151j21038l1717j11860
8719a91457L5590R5487P2624J05225j3712q1079p1547n013l5804n1216l1045o2775
8707b34722J11098J40350K1882j24332j8198q9504j24204J8735R7154J2117J51333
8696c8291O8800n562l2433K2395o0106q4236K3754L6092p4083J1428Q544K6366
$$ y = [44682, 17693, -30543, -44468, -67448, 32993, 77532, 37392, 58125, -13281, -61308, -94423, -168387, -157189, -151880, -187384, -177777, -224166, -139394, -54468, -35352, -83340, -43028, -117882, -234887, -83167, 18861, 137609, 271404, 242787, 164667, 207646, 135980, 86642, 168776, 97018, 138010, 71034, 48582, 120038, 65662, 44712, 35421, -40088, -116319, 31540, 12880, 23829, -20852, -866, 21289, 63511, 102399, 73843, 4673, 44007, 73158, -47880, -79597, -191457, -155867, -60380, 12244, 117469, 103757, 22678, -48869, -53882, -89686, -140902, -171947, -234722, -123624, 16726, 38608, -85724, -103922, -193426, -317630, -298895, -201741, -189624, -38291, 30509, 24947, -7486, 14909, -45197, -129433, -105679, -69587, -143670, -132242, -123698, -97332]
8684i7332k4014O345N1501m8474l0213N6292j1161K8347J1902j6127L8575R3036
8672E8677J9756k1220P970j21926k5120q1221m6285J8751p243J25496M0909O1731
8660C0275M5062J35783l9957j12292m0198J5544K3580o7967j3217n1931k2638
8649i7956R1493n2557j40099n3333o6487M4322J86450j6199o6679j942Q8209Q9464
8637D686R7275M7010k319M0824m798m9195k657L7318p112j26678j07121l5522
8625a08289j390M3564P3574K2566K0678O7332j20580m0341O0206P4846n240M8226
8613A35152J37965J08068m7783j79163q6611J4925K6401j1614J8416M7523K5257
8602A88536o9637N072Q4528m4943l6353j5032K3128l6499p9523L9296O6030K5809
$$ y = [-97332, -121346, -115001, -63500, -111974, -142187, -85895, -97056, -68709, -56807, -72934, -34359, 58677, 78433, 57213, 65183, -56743, -81863, -163084, -209369, -190618, -197861, -72365, -31456, 30275, 75337, 211120, 171163, 58871, 18673, 34217, 57797, -10170, -23387, -75318, -97956, -6463, -59020, -199119, -252452, -318939, -274617, -88167, -104366, -171045, -172987, -84778, 4686, 101961, 148971, 146652, 187476, 182678, 133483, 130826, 168144, 161032, 34354, -72767, -108289, -109679, -66115, 7459, 30025, 50703, 118035, -2545, -42886, 17320, 92166, 86926, 135152, 273117, 381185, 333402, 154239, 67628, 82553, 108954, 97340, 115756, 163279, 188536, 118899, 123971, 208499, 163556, 127203, 112171, 135299, 98800, 19277, 58573, 124603, 150412]
8590A50412n7223r9107q9519Q8637K06867k297p9519j09854K2409R9315L9512
8579A69633n3546K117o189r4566L1830J16005J14653N2315j87302j75028n1858
8568h1936K0173Q4940j29395p7393k8556O2770P2270k0252j6870m4586R8586p700
8556f7949k9515j9011O2704R1082J8275J14996J93878l1754j01894r5757K5458
8545A60513j00201j06064o1709l5093J5180J03915L0162K2158p2164l9769J47022
8534F3950o3283r0656n4879K8848J05253J12224m2689j45p9381l2821P4533L1647
8522E2601J0960q751Q8739j18577j75626M3725J09045m1562j4365m9166j6125
8511a19102J60558J04360J5157r4203j06559m0206O870Q829r7884j9110J1761
$$ y = [150412, 93189, -5918, -95437, -6800, 200067, 197770, 118251, 8397, 30806, 130121, 169633, 116087, 118204, 112015, 17449, 49279, 165284, 279937, 332252, 144950, -30078, -81936, -61763, 23177, -106218, -183611, -212167, -149397, -77127, -97379, -114249, -158835, -60249, -67949, -97464, -116475, -53771, 37311, 55586, 170582, 364460, 332706, 230812, 135055, 160513, 60312, -45752, -107461, -142554, -127374, -23459, 6703, 28861, -43303, -83072, 63950, 667, -89989, -144868, -116020, -10767, 101457, 58768, 58623, -20758, -53579, 20954, 52601, 63561, 54810, 143549, 24972, -150654, -106929, 2116, -39446, -53811, -102977, -119102, 41456, 145816, 160973, 66770, -39789, -79995, -73125, -64296, -162180, -181290, -169529]
8500a69529R4894k3136j7246j1997m590O1247P9928K0802J0984L4226m2072j06307
8488g2796L8290L7519O6189K6240q7382R3039n7445j17773N3379n7800l922J9551
8476f2911K5736O9645j9587p835J0222J66043K1616l9594j4271j57903n7540J6874
8464d9505R6875Q3611k1382j8071j06129j36817j9637J8640R1391K7505k660j0391
8452d6570J1339L5920l2113l4832O3213k6060O3312N241J38947L849l5838J8137
8440A64545o9141K945N5812l7265J5575p4649k9855Q2691O5355M2263N4629J9292
8428B92197m2830j3315j18291j03886J31700n4175q5436r4667l672O1113Q3888
8417E2626k6464n5749r7717J13596Q3100m4163j1438O0146O2268m2275L1536j8192
$$ y = [-169529, -74635, -97771, -115017, -127014, -131604, -70357, 9571, 30373, 41357, 75583, 33511, -72796, -34506, 3013, 69202, 95442, 8060, 101099, 43654, -74119, -20740, -78540, -82462, -62911, -37175, 32470, 12883, 5048, 15270, 181313, 202929, 163335, 149064, -8839, -66379, -49505, 47370, 130981, 109599, 91528, -14601, -151418, -171055, -152415, -61024, -33519, -36179, -46570, -35231, 689, -31424, -66256, -3043, -29103, 34209, 39450, 178397, 182246, 146408, 164545, 95404, 98349, 154161, 116896, 132471, 57822, 27967, 110658, 176013, 218276, 272905, 292197, 249367, 236052, 117761, 13875, 145575, 91400, 5964, -88703, -92375, -31262, 52626, 26162, -29587, -127304, -13708, 69392, 25229, 13791, 73937, 136205, 93930, 125466, 107274]
8405A07274j4884j26797q3480o986J32098q7093l8386K4048r9941m6632Q1417
8394a59362J6017Q2436m3195n9969l0450o315J47226J25274r306q7397n3019k3929
8382a01989J5816Q1250R1893m6144r532q2220N197R2973N0371J6980m5917o8530
8370A48J9651k067o7449j842p9699j5686K4233O084K0417K1656j6694M1742N9663
8357A0157J60407l703n9811j5574n8817r968M2947M1317l1619j60455l0923J08519
8345g523J05464o5116j20477J11151k3087k2697J69732P0636n0361r2735K1478
8334I6465K3577p7407L9866k4557q816L0266m2664j30197k6759Q7233O2135O1368
8322I0510r165J0803R5951J8005r3588j17706L9230k5747J02498Q3352j27016
$$ y = [107274, 92390, -34407, -117887, -124873, 7225, -79868, -118254, -94206, -194147, -240779, -159362, -143345, -60909, -104104, -164073, -194523, -200838, -53612, 71662, 62356, -25041, -78060, -101989, -86173, -4923, 86970, 40826, 31294, -50926, -45729, 47244, 97615, 114595, 68678, 148, 19799, 17732, -49717, -51559, -131258, -146944, -122711, -116627, -96210, -74554, -91248, -49506, 10157, 170564, 166861, 107050, 91476, 32659, 22691, 65638, 106955, 75336, -85119, -116042, -7523, 97941, 32825, -87652, 23499, 412, -22285, 147447, 218083, 167722, 74987, 96465, 120042, 42635, 82501, 57944, 49128, 79394, 36730, -93467, -120226, -32993, 29142, 90510, 81345, 92148, 188099, 206104, 112516, -5190, 34040, 8293, 110791, 194143, 67127]
8311F7127L0532l00o1715m4812J3999p477o1678l8322j01718j02893J40844M2844
8299a23569o7378J42929l4174M0641j3379n1616p7395O6949N0181l8712K7075
8288g8448J03383k6508n3871L80P3643K2255j178O3552p2675Q695l7600q785M2255
8275C5098K0073L3074M2044R972M4612q2913l0376q8706j22766o8483Q994J18110
8263h1267N434n5533J05870Q6087J54032Q2988j63802j42637j0693j1215k5126
8252e5862k7154p609q561M8028k8930L1125N8335j35724j15134P95J41358J81535
8240H2202j3669l1089M0710k3590l2970O4514l0798L6534K02049r9958q0401q1242
8228C2292n5953m2740Q2575R9704M4948j45778o1634m9142j6037m0682N5764Q7864
$$ y = [67127, 97659, 97359, 35644, -9168, 4831, -2646, -64324, -102646, -204364, -307257, -166413, -123569, -190947, -48018, -82192, -41551, -54930, -106546, -183941, -116992, -66811, -105523, -78448, 24935, -1573, -55444, -55064, 18579, 40834, 39656, 103208, 30533, 39228, 1628, -7157, 35098, 55171, 88245, 130289, 140261, 184873, 101960, 71584, -17122, -139888, -208371, -199377, -81267, -75833, -131366, -25496, 60591, 214623, 297611, 133809, -8828, -19521, -30736, -55862, -83016, -90625, -99186, -51158, -80088, -48963, 9372, -126352, -241486, -240691, -99333, 82202, 68533, 37444, 78154, 54564, 21594, 86108, 55310, 91844, 293893, 193935, 113534, 32292, -23661, -66401, 16174, 115878, 160826, 15048, -46586, -95728, -111765, -152447, -96683, -8819]
8216h819n2346q1036N7323J02987O0350P4098k0229j42061q0701K0953M0722j2973
8204d1732m0816r8976K1035J5J7567l3564J21426J44888k2045K7781O7676J06566
8192B69821q0258r5472l2278o149k7777n5556J0999J8421r6187q1789M0279R2473
8180d3473k2474j47924J14986Q2292j42995k2250M2647J371Q109N1419M7458O835
8168b3999k6606j9340M0076q059O5004K5595P1306p5683q2885m5930O4735l5060
8156e0846J3283q383M4255L8870m3977N4121N4553k1849r716j05212m4748n4430
8144a34079Q5121L1992j04254N4976P1210M9005j38175m1058n2345J6322Q2323
8133g8962R2669j6738j1195L4954j14923j6797P3793J107N5295j6955o8331j9812
$$ y = [-8819, -61165, -142201, -84878, 18109, 78459, 152557, 132328, -9733, -90434, -69481, -28759, -41732, -82548, -181524, -160489, -160474, -142907, -176471, -55045, 89843, 67798, 95579, 163255, 269821, 189563, 94091, 61813, 55664, 27887, -27669, -16670, 1751, -94436, -176225, -135946, -43473, -65947, -213871, -98885, -16593, -159588, -181838, -139191, -137820, -129711, -78292, -30834, -23999, -50605, -69945, -29869, -37928, 27076, 52671, 123977, 48294, -34591, -80521, -15786, -50846, -37563, -45946, -1691, 37179, -6798, 47323, 101876, 80027, 70311, -34901, -79649, -134079, -48958, -16966, -121220, -66244, 4966, 53971, -84204, -125262, -177607, -161285, -78962, 13707, -3031, -14226, 20728, -94195, -110992, -37199, -36092, 19203, 2248, -66083, -85895]
8121h5895p0158O1787L2590J5506O8839p701M6798P9989q1901k75J06072l2686
8109A32965n1705Q0180p1065j61611l9727O3177J6021l9323J7625m2165r4266
8098a89894O3011q3281O1883R2841m0647J48141r4023o1225L1309L4987n3977
8087i0875l4297l6827p5548k9385n1898Q5322L213J62941R2045P5324L4187m347
8075A29855m7368m8587j8160j37967N5223J05757K4094K1700j09579k8673K4487
8064b9218j04416J2300L794J17270q526j01461j4410p5244p719L4434N5453J02000
8052a5743Q0925M575p5209j30370L9615R7248N7759J2048o1106j6375o7182J5671
8040e8144Q8759k4609j20043O6743K8428M797j22788o4231J10560J36707j18071
$$ y = [-85895, -156053, -94266, -61676, -46170, 22669, 14968, 61766, 141755, 59854, 59579, 165651, 132965, 81260, 161440, 90375, -71236, -110963, -47786, -31765, -71088, -53463, -95628, -189894, -126883, -210164, -148281, -55440, -96087, 52054, -41969, -103194, -71885, -36898, -90875, -125172, -161999, -237547, -266932, -318830, -233508, -230295, -67354, 24691, 100015, 134202, 129855, 82487, 33900, 15740, -122227, -67004, 38753, 62847, 84547, -25032, -53705, -29218, -133634, -121334, -117540, -270, -8796, -110257, -124667, -199911, -207630, -173196, -117743, -15743, 65182, 69757, -5452, -135822, -96207, 1041, 58800, 70848, 9742, -6633, -73815, -58144, 30615, 6006, -114037, -47294, -18866, -14069, -136857, -201088, -90528, 46179, -71892]
8029g1892o0719M1787J2067k2553O9354L0890J2437j0334j56633n4949J22394
8018h8151J25255L9582Q7187M6319j31153j03558J6495l5082J5619l6242l848
8007f7577R1823L3743m2654k7317M351q506R177J42629N7737N7200o3540n8262
7995A28804p9525m8376q6954n8169J00279L6471L4755k2585L7488q512N690M8073
7983H7439L3446j35320j18512j0887k6005k0588O5040K1431M5936K7447R5674
7972F5101P1271j5780L3487l6478q5671J40295p5730j14546n3790j6443O0135
7961b8149J5466J33474J08837m5907p0062j4132n6730L4195P880O4777P2952p2183
7949A50418j58803l6266R3938J08181Q9112p0050j59788r6739O9847J6990r1969
$$ y = [-71892, -132611, -90824, -78757, -101310, -31956, -1066, 11371, 1037, -155596, -210545, -88151, 37104, 76686, 163873, 210192, 79039, -24519, -8024, -43106, -27487, -63729, -67577, 24246, 57989, 15335, -11982, -7631, -16137, -6960, 135669, 193406, 250606, 187066, 128804, 49279, 903, -86051, -144220, -43941, -7470, 27285, 4700, 42188, 33676, 39366, 87439, 120885, -14435, -132947, -143834, -169839, -190427, -125387, -103956, -58020, -30573, 65101, 136372, 120592, 154079, 117601, 31930, 172225, 96495, -18051, -71841, -88284, -28149, -12683, 120791, 229628, 183721, 113659, 99527, 42797, 76992, 84872, 149649, 222601, 150418, -8385, -44651, 49287, 157468, 246580, 176530, 16742, -79997, -10150, 6840, -85129]
7938h5129O1218M9947l9652J6102J48064M6798m5397j3143r908p4989p2980j467
7926b0536P2696J5136m2640r1369J344J29867L3595k6975O4143L3436n7524j36500
7914b5327j56465K5005J23150N3726N2878p9440j68445K0071R5906O6566J08390
7903A16015j3886j13788M4941O5691p838q3094q0892j02618N4342O7592J01102
7892D7567q0676m6539q64J1598N9425L1241M3666j23882l8776J0862J21356k0041
7880A4937r239Q334k3032p4534j01270O1509J45373L2318K5297q673r7822L1735
7868D933r7354O8194J4060O3551P1905J6443p0581p3304L4311k06284n0858N6857
7856a68127k8807j8771R4496J0460j6954R0632K9078N9896J30637J6624r7969
$$ y = [-85129, -23911, 26036, -13616, 2486, 150550, 197348, 151951, 138808, 128900, 53911, -19069, -20536, 52160, 67296, 24656, -66713, -65369, 64498, 98093, 71118, 135261, 168697, 111173, -25327, -181792, -156787, -33637, 20089, 72967, -6473, -174918, -154847, -58941, 7625, 116015, 102129, -11659, 33282, 98973, 91135, 8041, -72851, -175469, -121127, -53535, 47567, -33109, -79648, -80512, -68914, -9489, 21752, 65418, -58464, -97240, -86378, 34978, 14937, 5698, 14032, -9000, -83534, -184804, -123295, 22078, 54396, 79693, 71020, -26802, 4933, -92421, -24227, -10167, 53384, 125289, 141732, 71151, -2153, 32158, -174126, -224984, -168127, -196934, -215705, -121209, -110749, -127703, -37071, -7993, 51903, 182540, 199164, 101195]
7845A01195o8027p081m2003R82m2621r7200P539Q6827J03574R749l7237J1551
7833B7248o188L3219j3314k8487J56597P4792N442K6088o2922j09997M3257k729
7821A43006j01260k9214Q7411l6957l3018J2933k8697J3319m7005O5352K6162
7810G2032p2313j34335p4503J0283K3284P4183P8785J11233m9521m2978n826O5322
7798E5646J29788j84646j10074K0820q300j36123j8399Q1197J16780k3575m4724
7787a21610J01191M3246Q1043L651O6p6754j09026l5431K6955N8708J6932n3532
7775f4561L0944l1393M8611J47474O2759o3964p9622p1935o4118r3767j6978Q622
7763a87928M5127P3627M8245O8825j5498m5646m2474j3221K4809o2079p1380O0374
$$ y = [101195, 33168, 26087, -15916, -14934, -57555, -154755, -147216, -60389, 43185, 52934, 15697, 27248, 21060, 54279, 40965, 12478, 169075, 243867, 249309, 275397, 212475, 102478, 145735, 143006, 41746, 12532, 99943, 62986, 29968, 42901, 14204, 27523, -19482, 45870, 72032, -281, -134616, -209119, -198836, -175552, -101369, -22584, 88649, 39128, -3850, -9676, 55646, 185434, 788, -109286, -88466, -96766, -232889, -251288, -170091, -53311, -76886, -121610, -20419, 22827, 103870, 107521, 107587, 30833, -78193, -113624, -86669, -27961, -11029, -64561, -33617, -65010, -16399, 131075, 193834, 129870, 50248, -21687, -85805, -179572, -196550, -187928, -142801, -69174, -20929, 47896, 32398, -13248, -55722, -68943, -44134, -106213, -177593, -117219]
7751a17219M7455K4885L0990J7226k5221m0848P3338j7429L797Q9287J01821j00604
7739H7478j49725j68177o5215P9995K4305Q0989J31235J80838N1569m8957n3987
7728A50348m5667o8451j39545p5055L6983J29317O4855n0075N1220L1748k3052
7717F2626j38976j37662Q3286N7999O5720L0416j01659Q1499l7605M1883N4181
7706F1708j47053j07211L9756J25002J06363p3058r9513J10757n7984j01711R5844
7695d7100N74r7157l4158p844M0230J50475K6395L9163O3349l9032j06535j5316
7683b6956K276K3111M1131o0743n8190j0673M6349n3431K685o582M6855K0657
7671c3511P9799K5556N264J629k5115j4471o221m6271j01279k6646P3457Q7696
$$ y = [-117219, -69764, -44879, -13889, 3337, -21884, -62732, 10606, -6823, -3026, 86261, 188082, 87478, -62247, -230424, -295639, -215644, -191339, -110350, 20885, 201723, 253292, 204335, 150348, 104681, 36230, -103315, -178370, -141387, -12070, 52785, 2710, 53930, 85678, 62626, -76350, -214012, -130726, -72727, -7007, 23409, -78250, 3249, -34356, 7527, 61708, -85345, -192556, -152800, -27798, 78565, 5507, -94006, 16751, -41233, -142944, -47100, -46526, -143683, -177841, -185685, -145455, 5020, 31415, 70578, 133927, 94895, -11640, -26956, -24680, -1569, 39562, -21181, -79371, -90044, -43695, -97126, -94441, -101023, -54168, -33511, 46288, 71844, 77108, 78737, 53622, 39151, 32930, -13341, -114620, -141266, -67809, 19887]
7659A9887k0028o9932p517r1697M4043n9457J8773J37104J60034J0524j33991
7648G743m5435J02403J9344j4549m7156o2422Q1643K6330k7714L2906o5723r8461
7636i1091q9331q463P6871K2919k029r6220J23765O4250N5591r2662J6579R2213
7624G2392M8925j3155q3736P0537Q0823j26752j30687j69470o198N6198M2731
7613a58392O415o888M1558o8298M2109l981m9578P8197M5081p9479n5524K18371
7601I591M063J4000j590P61k1752j867L2816K509l3047P9030l4418j1541K4274
7588F2829J6373M4618j00100p1775O4515P4452J1095j21279l1249J5649o5815
7577a00687o9253P0236L6602Q5897L7119P0277j4846l0026l9168N1271R5150k314
$$ y = [19887, -141, -70073, -77590, -169287, -125244, -184701, -165928, -28824, 131210, 141734, 7743, -37692, 64711, 84055, 69506, 22350, -40072, 41571, 67901, 40187, 73093, 7370, -91091, -180422, -188885, -112014, -89095, -91124, -187344, -63579, 671, 56262, -36400, -19821, 72392, 121317, 108162, 24426, 94963, 175786, 49034, -81653, -251123, -257321, -201123, -158392, -151977, -158865, -117307, -185605, -143496, -147477, -197055, -118858, -73777, -153256, -208780, 9591, 13654, 27654, 26064, 26825, 5073, 3206, 36022, 38531, 5484, 84514, 50096, 38555, 62829, 79202, 123820, 23720, -48055, 16460, 90912, 102007, -19272, -50521, -34872, -100687, -169940, -99704, -63102, 22795, 59914, 130191, 115345, 85319, 46151, 97422, 192572, 190258]
7565A90258j73069p2504J74071L8729j77183J06094P9463M0174k2846j51861j56942
7554a25616k8678J88444O7634n5933M0539J49263r952n9532j24903m0838o2412
7543f1984j19521j12063J3125O8600J3966r7884P7364J14137P0181o3616O439
7532i1256M1045q007Q501P7312J55288m2756l06250j36866K7603N1119J22471
7521a01796J55778n4470L871k9059k0620q6735K2988P7634j49176k2206Q7185
7510a16606l8566P5420q8833k100k2513N7702l766O4418P7974j0477J2496j7279
7498a2130J35553J17860j47723j41591K0584P9111K513J7650p0371O665r0662
7487h2541L2052K1848K5998o1896m3919K2829K2780M7203R8504J19026l8424m2629
$$ y = [190258, 17189, -55315, 118756, 157485, -19698, 86396, 165859, 206033, 183187, 31326, -125616, -154294, 34150, 101784, 45851, 86390, 235653, 225701, 166169, 41266, 428, -61984, -181505, -293568, -280443, -211843, -197877, -295761, -218397, -104260, -34079, -97695, -91256, -50211, -58218, -49717, 27595, 182883, 140127, -166123, -302989, -275386, -224267, -101796, 53982, -488, 3383, -25676, -46296, -133031, -110043, -32409, -181585, -203791, -116606, -155172, -79752, -168585, -170685, -193198, -135496, -139262, -74844, 3130, -7347, 5149, -12130, 123423, 241283, 93560, -48031, -27447, 51664, 54177, 71827, 1456, 8121, -82541, -50489, -28641, -2643, -64539, -108458, -85629, -62849, -15646, 82858, 201884, 163460, 120831]
7475A20831k4908N0394P6862p8317p1503j75847o9751L8418O3150J9706L7527
7464a3438m189k4388Q7959o6216j29920k3599p0460l4339J40146J34969m5109
7453d8584J8956j1409j26852l9792j00920Q1481K31473J81796l8801l2327j19192
7442d171n9130O4294N0058K6755r59l3672L018N9288j33713k2552J5364J26799
7430I1379N5990j37451O50K1524l1890P4691n8371p5368l3420N9953m1069l5736
7418a09118K6876j07407r6640R1182K17988J52248O0249L107r05r2293l5392k3506
7406H6389n1557o2986J15536J25834l3287j66616m3043j4172j31735L7691O6920
7395g1026P5877m3513K606M8273P9726n355o8213j31713R3739m5623J4148K0835
$$ y = [120831, 95923, 146317, 223179, 144862, 73359, -102488, -172239, -133821, -70671, -50965, -13438, -17627, -42015, 45944, -20272, -150192, -173791, -244251, -278590, -138444, -3475, -48584, -29628, -41037, -167889, -207681, -308601, -227120, 4353, 186149, 147348, 115021, -4171, -63301, 993, 51051, 77806, 76847, 43175, 46193, 105481, -28232, -50784, -35420, 91379, 147369, 9918, 10568, 32092, 202, 74893, 16522, -58846, -92266, -32313, -73382, -109118, -82242, -189649, -286289, -195107, 22881, 175129, 235378, 238485, 237580, 145287, 109895, 86389, 34832, -28154, 87382, 213216, 179929, 13313, -29730, -43902, -175637, -137946, -71026, 4851, -38662, -36056, 12217, 91943, 86588, 18375, -113338, -19599, -65222, -51074, -30239]
7383c0239k7686J16683q625q3282N930L9481R2694l883q2643O1318J28576j51827
7371E6497L567M7397O403j8833P3336j4796o439K4949q6954m6021N1454J21439
7359B11999o8297l525l7166j65608O1380J08762P4711n5895j15874r387M6559
7348D7659q074o9441j9459L3442R438Q1952o80O625M6569o720L1398n713q5070
7335F1926j0663P3419J7990k7117q0300r1861n6113j37369L0409J62162k6239
7324h3756j188o2255K9194J44260k1929K3189p0115o871M4190j6043K5824k0144
7312a5644M1718J09047J23060j01012j60669Q3983N1113j24144k8161O1019O2259
7301A02569P945l8064r0054l9935N2230N9527j128m8717j05887m7120J6484Q7796
$$ y = [-30239, -57925, 58758, 50133, -33149, -27219, 12262, 104956, 101073, 18430, 79748, 208324, 56497, 60064, 107461, 113864, 95031, 168367, 153571, 147132, 172081, 85127, 39106, 90560, 211999, 143702, 140177, 103011, -62597, -1217, 107545, 182256, 126361, 10487, 1100, 47659, 39585, -29856, -49315, -15873, -6435, 75517, 74837, 81462, 128031, 121311, 152709, 146996, 61926, 51263, 124682, 142672, 115555, 35255, -56606, -112719, -250088, -219679, -57517, -83756, -84944, -147199, -118005, 26255, 4326, 27515, -42600, -49471, -5281, -21324, 4500, -15644, 26074, 135121, 258181, 157169, -3500, 80483, 131596, 7452, -20709, 40310, 102569, 110514, 72450, -17604, -57539, -5309, 54218, 53090, 4373, -101514, -148634, -132150, -44354]
7289d4354k4451r6340L3595K04090M898o0030q3868Q793N4000J10717M9019k9809
7277A26260m5043m2275j27980p1425K6405J44746M319q6229k1047M457J6189Q349
7265f3274n987m9402l944J2460R0017J28301L9889k8436o455j19300L7083q3739
7253e2787o3729j5502k8528m2662N9789N1852J75061K4963O087r2214q7418j8815
7241h3903j4776n6660J00524J59052m2122Q4446k7901j22216l8514o3504j9488
7230a25062O1996M6147j9729L7293R1644P0429P8686o4817j2392r322p5835j45933
7218f6895M8525J26407l5275j52213O1249R1550r6599j33262N0922R1016Q804
7207e771m590M3280N3405q261n2191j58985O6708J18591n6468k6390R8153r423
$$ y = [-44354, -68805, -165145, -131550, 72540, 77438, 17408, -66460, -57667, -3667, 107050, 156069, 126260, 81217, 38942, -89038, -160463, -134058, 10688, 15007, -71222, -92269, -87812, -71623, -63274, -69261, -118663, -122607, -110147, -20130, 108171, 148060, 119624, 113169, -6131, 30952, -52787, -116516, -132018, -160546, -203208, -143419, -91567, 83494, 108457, 114544, 22330, -65088, -83903, -98679, -155339, -54815, 104237, 62115, 146561, 118660, -3556, -42070, -105574, -125062, -63066, -16919, -36648, 645, 92289, 162718, 241404, 176587, 164195, 154873, 79038, -66895, -18370, 108037, 72762, -79451, -18202, 73348, -23251, -156513, -105591, -14575, -5771, -10361, 32919, 86324, 78063, 25872, -133113, -66405, 52186, -4282, -30672, 67481, 58058]
7195E8058p7337L5053m6432j03931k160j19973r674J01595k260O5762M0225P2068
7183A0994J65805q1794j20554K2592K048N489L2583Q5268j24662r9547p7919p2325
7171b52022K8665R7098P4159J30066N5978N1264j33917j38915L7733n5391o7886
7160a73168q4348j5174Q0340J64974L8364j8628j03412K6353J79565R8674j17823
7149G5717q0083M2219n909q3111l2032k5098k5448J9584P6230R5083n939j47059
7137i5846j23941J4583m2604N6482M4247J16433N6122j0793N7542l6022L7628
7126G3831J15687p6731r4814n1030M8317l7779q9447N6075L0597O7889j39764
7115i7169n7227p2218o61m9177j0341J16462J31153N6619k7590m4812J6364M477
$$ y = [58058, -19279, 15774, -30658, -134589, -136749, -256722, -266396, -164801, -167061, -101299, -61074, 10994, 176799, 95005, -25549, -2957, -909, 4580, 37163, 122431, -2231, -101778, -179697, -252022, -223357, -126259, -52100, 77966, 133944, 185208, 51291, -87624, -49891, -105282, -173168, -257516, -272690, -192350, -27376, 10988, -7640, -111052, -84699, 94866, 193540, 75717, -4366, 37853, 31944, -51167, -83199, -108297, -133745, -114161, -37931, 57152, 51213, -95846, -219787, -205204, -247808, -191326, -147079, -30646, 25476, 14683, 72225, 36203, 73831, 189518, 112787, 17973, -33057, 15260, -22519, -111966, -55891, -25294, 42595, -97169, -154396, -226614, -227275, -276452, -286793, -170331, -39178, 17441, -10149, -54961, -38597, -34120]
7103c4120N7737M6459K1176o1109j43165j4087j132p6501q3584k1958j8060N9224
7091b69120Q4899l7676P8119J64993j44264m7868J06731P9797l7155o0767K9945
7080e2366p4270n5226L0105Q5735P8532j24489j00878J54717J12200J41199K3632
7069B18891j31439r7888q0058L117j036M8345R2609N9862M7926L5927j01097q2513
7057A2646p5765N7018M2250P5806K0959L820j2975j8655j2207j5560p3459O2991
7045F6869k993L3600m3840j33162k3986J1292j71n7262N6005J4379O5154J45549
7033A31434Q333r8807J4058l4215J0383P5763J01347J08099n6529j22974m8906
7022H7986q3786J21850j3233L508M2220J8896J3512r6874L2262P9589j28863Q235
$$ y = [-34120, 23617, 70076, 91252, 30143, -113022, -127109, -128241, -204742, -288326, -310284, -328344, -269120, -184221, -221897, -143778, 21215, -123049, -170917, -64186, 15611, -21544, -82311, -52366, -126636, -181862, -151757, -66022, 12510, -111979, -212857, -58140, 54060, 195259, 218891, 87452, -10436, -90494, -87377, -88413, -40068, 52541, 112403, 160329, 196256, 95159, 12646, -63119, -6101, 36149, 111955, 132914, 136734, 123759, 105104, 92897, 77337, 3878, 66869, 63876, 97476, 53636, -79526, -103512, -92220, -92391, -149653, -93648, -79269, -14115, 131434, 139767, 40960, 55018, 20803, 31186, 106949, 208296, 316395, 259866, 136892, 87986, 4200, 126050, 112817, 116325, 158545, 177441, 190953, 94079, 126341, 205930, 77067, 85302]
7010H5302Q9375j4074p5257n1233o9050r259J4120O7638l0843l6212J5398L8910
6998B4815k4004O437k0325N4981k8397O049l1293J26518l189j04161m7683N1789
6986A1537R813l9448p9853J6951n9842k2984L5946j9982J3825O8140K8601r090
6974d6386K1769L8033p6219k223N0914J75804Q0230j39580k0836l5805L8190N8813
6962A42704r6048L618O4624k2149l2109j0770J1817j57251j5238J54467L5595
6951G9260o8626k9281K041l3843M03o5796J83902L4965p4763p0926l1768k16N3538
6938b1110J21382R0670j21937k26o682P6842j7105j5239N5963m7758j2928j2641
6926H9231N58N6677m7553j06796j09314M4963J35623O4575j2476n2543j5947j10625
$$ y = [85302, 174677, 160603, 85346, 34113, -34937, -44196, -30076, 37562, 6719, -29493, -14095, 24815, 811, 7248, -13077, 41904, 13507, 19556, -11737, 114781, 111592, 7431, -40252, 11537, 21350, -18098, -97951, -81000, -140842, -163826, -127880, -147862, -134037, -65897, -37296, -46386, -24617, 13416, -62803, -65026, -14112, 161692, 241922, 102342, 81506, 45701, 83891, 142704, 46656, 50274, 114898, 92749, 60640, 49870, 61687, -95564, -110802, 43665, 79260, 10634, -18647, -16606, -50449, -50046, -115842, 68060, 103025, 28262, -42664, -74432, -74648, -21110, 100272, 190942, 69005, 68779, 62097, 138939, 121834, 106595, 162558, 114800, 101872, 89231, 89789, 146466, 98913, -7883, -117197, -72234, 63389, 127964, 115488, 62945, 46998, -63627]
6914f3627L0237M693o3355Q6367Q0178k7048p6785r3000O0066R4874o606p7868
6902e1874j1802j2461j4520O5793n8439q9384o9469P0047Q913J31740Q5486m8814
6890E216j21467N354k6843q139L2988M4790l8875j62332P0154R6614N140K1347
6878g6053Q3221n7936m8725o313p7143m6047L4073R4884L3626n5721j14436l9792
6866b76362Q684k6282R550J5965j9890J24661J66817J00921k1516m1824p870J5675
6854D8529n9563o6L460j00752n3623l3792R4055J35997r1413n4920l930J80292
6842F4274N6460o3165r6680m6052o259q1761M1837O0949k1399K0643J44575O5579
6830A39001r7565j13702J0878J11017p0976j44611k5047R3200R2496j35635R1966
$$ y = [-63627, -33390, -28697, -92052, -5685, 74493, 47445, -29340, -122340, -62274, 32600, 25994, -51874, -63676, -76137, -90657, -24864, -83303, -172687, -242156, -172109, -163196, -31456, 54030, 5216, -116251, -110897, -137740, -145879, -112891, -68101, -106976, -269308, -199154, -102540, -97400, -76053, 7168, -50768, -99493, -105806, -182949, -228996, -194923, -100039, -66413, -122134, -236570, -276362, -267678, -293960, -284410, -268445, -288335, -163674, 3143, 104064, 82548, 40724, 32854, 48529, -11034, -11100, -7640, -108392, -162015, -195807, -101752, 34245, -57168, -112088, -116018, 64274, 120734, 57569, -39111, -85163, -91422, -173183, -131346, -70397, -91796, -71153, 73422, 139001, 41436, -72266, -61388, 49629, -21347, -165958, -191005, -97805, -5309, -140944, -48978]
6819d8978J17405P988k9714j86121j09158o8604O4841J03985M8220M7961M1280
6808a0895l1113m5570k9986p0859L8380J39198J02888r5234j17166N4386O1663
6797d308P6774L2904m4110p2059l4384n4896p1743l7938j0747O8303R3695O9287
6785A0778m0599m7958J1048P7679O9355j12779n1528R0164P0448N2189R8941k2469
6773B05269m5260j5589n9202l2920J10516l2728j74874K0393M4037q7737N7284
6762a0811Q660l2999p720j4810J41926L9010q3328l0278j2178n3555R0120M6581
6750H0618q576q7851P5302P0291R7868l2600j22228j6490Q2670L6318K6702p7039
6738A24985j858K7264Q4036l8493j70993o8396K2317J6021l475o6959J8480n9181
$$ y = [-48978, 68427, 76415, 46701, -139420, -248578, -317182, -252341, -148356, -100136, -52175, -10895, -42008, -87578, -117564, -188423, -150043, -10845, 92043, -3191, -120357, -65971, -4308, 72466, 105370, 61260, -10799, -45183, -100079, -171822, -209760, -220507, -152204, -58509, 10778, -29821, -77779, -66731, 10948, 80303, -32476, -84004, 6160, 76608, 128797, 227738, 205269, 160009, 144420, 85218, 52298, 162814, 130086, -44788, -24395, 19642, -68095, -10811, -2151, -35150, -42870, -57680, 84246, 123256, 39928, 9650, -2528, -56083, 34037, 80618, 72042, -15809, 59493, 129784, 227652, 195052, 72824, 56334, 139004, 175322, 202024, 124985, 123127, 150391, 234427, 195934, 24941, -43455, -21138, -5117, -8592, -75551, -57071, -116252]
6726a16252n7690P9314r1063J2688J33491O6375l7654l0515J04177K2401k3017
6715F2255k9611m1930l3982l1275l6973J8747J39680K6889l4974J2802m0216o1623
6703e0211J41752J04746j3573L5212n8178j23893q2662O6509j30210j87353k0372
6692c18233N1950K3497J0162m4500m1262L6105J10432J50445r312m9164n7134
6681a37014M4376R6530p5046n4825R4857k7690J5044o1362l0204O6403l954N31
6669g2354N433J10351N4546K6603m3772r3789q9707J04622k412N2264P2126K0196
6657A44107q1359k5239l0405K2996O3852K3400J14918n2705j18711k5988M8612
6646H3478J47156l323p3085o45L4867m5149l3015j0919K981q1130M1095O5487
$$ y = [-116252, -173942, -94628, -185691, -173003, -39512, 26863, -10791, -41306, 62871, 85272, 62255, 32644, -9286, -43268, -74543, -111516, -92769, 46911, 73800, 38826, 51628, 11412, -50211, 91541, 196287, 182714, 217926, 159748, 35855, -46807, 19702, -110508, -297861, -318233, -266283, -242786, -232624, -277124, -318386, -282281, -171849, -21404, -30716, -79880, -137014, -92638, 3892, -71154, -125979, -31122, -58812, -43768, -105130, -135334, -68931, -72885, -72354, -66921, 43430, 97976, 124579, 80807, -12982, -102689, 1933, -479, 51785, 123911, 144107, 62748, 37509, 7104, 30100, 93952, 117352, 232270, 179565, 60854, 34866, 83478, 230634, 227311, 154226, 153581, 188448, 143299, 110284, 99365, 102346, 21216, 62311, 127798]
6634A27798k3802l8630J08249L394j36181q0796j4927N7306K0319J60694R3700
6623B77124n9725l2321l5661p960Q9611q0447j26939o4842N8041j9834m7872q079
6611e8904M9121M1402J27370Q7053l7823m2360l2173o1176l2979k7671k4107P3137
6599F0890j6879r6683j26672L71J00518K3921L2117m8759J01154N4028j45519
6588f1513j6011Q5375L1494r4177N8662L9976P5436j578m4473K4790p2693m998
6576B0290P3473K7874p0694j572m9916o6677k2127o0474P1368K0169l2983P5242
6564a6027J07265m0620N0890M9080r6931l5490K1066o2922J3417q0095o2178N9450
6552i3095l362q8425Q1922P1069Q5746M719j03160J05914J57955j29573j5418
$$ y = [127798, 103996, 65366, 173615, 177009, 40828, -39968, -54895, 2411, 22730, 183424, 277124, 217399, 185078, 149417, 141457, 231068, 150621, 23682, -41160, 16881, -2953, -50825, -58904, -9783, 31619, 158989, 246042, 208219, 165859, 133686, 72510, 39531, 11860, -12247, 60890, 44011, -52672, -179344, -178973, -78455, -54534, -22417, -71176, 29978, 84006, -61513, -77524, 7851, 39345, -54832, 3830, 43806, 119242, 117664, 73191, 97981, 25288, 20290, 93763, 121637, 50943, 49371, -545, -67222, -89349, -149823, -78455, -58286, -91269, -16027, 91238, 50618, 101508, 150588, 53657, 18167, 39233, -23689, -10272, -90367, -152545, -93095, -96457, -184882, -102960, -31891, 53855, 58574, -44586, 61328, 219283, 89710, 74292]
6541G4292q6808K2562j7217l4967N4302J34273p2209o5339L0409k6261M8913m4740
6529A7210k3421M6891M8389m6805j5507o2235l782J5270K1719j4060O0510P439
6517E1618q0282R206J1893N7350k0757n3562P928p255K3304j24801m4685O0463
6505a09580j8895J42566q3681P322J77247N4558q8869r2152k4536p175J18434
6494G5239M6097r5650l147m8427l3810j6033j4306l4960p4099K5663J7025J5692
6482a40716N4291N9907J291N0925m4773r733q3504R1978R0847M2247k6553m7484
6470C8723M5148j1909j28616j55641k9364J25422K2952r7598m5102M8700M8502
6459a38783L4859l1268O8760J06972N3886r4537l5571n2185K01197K04957o3060
$$ y = [74292, -12516, 10046, -7171, -42138, 12164, 146437, 74228, 8889, 39298, 13037, 61950, 17210, -6211, 40680, 89069, 42264, 26757, -35478, -39260, -23990, -2271, -16331, 44179, 51618, -28664, -19458, -7565, 49785, 29028, -24534, -16606, -23861, -557, -125358, -170043, -109580, -128475, 14091, -69590, -62268, 114979, 169537, 80668, -11484, -36020, -43195, 75239, 121336, 25686, 22539, -25888, -59698, -75731, -90037, -124997, -199096, -173433, -156408, -140716, -86425, -26518, -25227, 25698, -19075, -28808, -112312, -20334, 70513, 112760, 86207, 38723, 83871, 71962, -56654, -212295, -241659, -116237, -93285, -190883, -235985, -187285, -138783, -103924, -135192, -66432, 40540, 94426, -111, -35682, -87867, 113330, 318287, 255227]
6448B55227j76002j2188m9515j5595J48N2487L2593r387l9426r4042q7578K3167
6436a20111J19976M8593n6656o1937P7103q49N6794L9964k7049n1160r780P9697
6424I4585l7817k842l4237K5185P4889N2988j23808j16304k7719Q5969N0420N0073
6412I1382J25794n2310j73775j68756n1282j3516J27684P3612R6364k5632r4126
$$ y = [255227, 79225, 67037, 17522, 1927, 2075, 54562, 87155, 77768, 38342, -55700, -143278, -120111, -135, 48458, -8198, -70135, 6968, 6119, 62913, 102877, 75828, 24668, 14888, 94585, 56768, 53926, 19689, 44874, 119763, 172751, 48943, -67361, -95080, -9111, 41309, 91382, 217176, 164866, -8909, -177665, -228947, -242463, -114779, -41167, 55197, 29565, -64561]
$$ [...]
##END NTUPLES=NMR SPECTRUM
##END=
