##TITLE=Analysis number 322072
Compound Code cc 01404
Project Code adrs
Chemist Name synnovation
##JCAMPDX= 6.0         $$ Bruker NMR JCAMP-DX V2.0
##DATA TYPE= NMR SPECTRUM
##DATA CLASS= NTUPLES
##ORIGIN= Bruker BioSpin GmbH
##OWNER= nmr
$$ XWIN-NMR		Version 3.5
$$ Tue Sep 12 09:44:34 2006 GMT Daylight Time (UT+1h)  MAYBRIDGE\nmr@NMR_250MHZ
##.OBSERVE FREQUENCY= 250.131544655141
##.OBSERVE NUCLEUS= ^1H
##.ACQUISITION MODE= SIMULTANEOUS (DQD)
##.ACQUISITION SCHEME= undefined
##.AVERAGES= 16
##.DIGITISER RES= 18
##SPECTROMETER/DATA SYSTEM= dpx250
##.PULSE SEQUENCE= zg30
##.SOLVENT NAME= CDCl3
##.SHIFT REFERENCE= (INTERNAL, CDCl3, 0, 16.522)
##AUDIT TRAIL= $$ (NUMBER, WHEN, WHO, WHERE, WHAT)
$$ ##TITLE= Audit trail, XWIN-NMR		Version 3.5
$$ ##JCAMPDX= 5.01
$$ ##ORIGIN= Bruker BioSpin GmbH
$$ ##OWNER= nmr
$$ C:\u/data/dgb/nmr/ADRS/530/pdata/1/auditp.txt
$$ ##AUDIT TRAIL=  $$ (NUMBER, WHEN, WHO, WHERE, WHAT)
(   1,<2006-09-12 09:44:06.44 +100>,<MAYBRIDGE\nmr>,<NMR_250MHZ>,
      <created by zg, POWCHK disabled, PULCHK disabled
       configuration hash MD5:
       E2 DF 36 D8 04 B2 41 60 5A D7 A3 38 5A 4B D0 FE
       data hash MD5: 64K
       5A F2 B3 A1 11 25 07 2C E7 DB 96 30 0C 81 27 3F>)
(   2,<2006-09-12 09:44:22.46 +100>,<MAYBRIDGE\nmr>,<NMR_250MHZ>,
      <Start of raw data processing
       ef LB = 0.3 FT_mod = 6 PKNL = 1 SI = 32K 
       data hash MD5: 32K
       D6 58 F2 DE EB 9A C0 FE B7 0F 4C F7 70 CB FB 01>)
(   3,<2006-09-12 09:44:24.94 +100>,<MAYBRIDGE\nmr>,<NMR_250MHZ>,
      <apk 
       data hash MD5: 32K
       62 6D DF 24 03 44 19 AF 9B 30 C7 9E 8B E1 B4 21>)
(   4,<2006-09-12 09:44:25.74 +100>,<MAYBRIDGE\nmr>,<NMR_250MHZ>,
      <abs ABSG = 5 
       data hash MD5: 32K
       69 F7 1D 0F 5F F5 E3 1D EB 32 CB 75 FF 6B 9F BC>)
$$ ##END=
$$ 
$$ hash MD5
$$ E1 4D CA B7 7E 68 6C E5 4C 14 CE 7A 9F 76 7F 49
##$RELAX= 
##$RELAX= 
##$RELAX= 
##$RELAX= 
##$RELAX= 
##$RELAX= 
##$RELAX= 
$$ Bruker specific parameters
$$ --------------------------
##$DU= <C:\u>
##$EXPNO= 530
##$NAME= <ADRS>
##$PROCNO= 1
##$TYPE= <nmr>
##$USER= <dgb>
##$AMP= (0..31)
100 100 100 100 100 100 100 100 100 100 100 100 100 100 100 100 100 100 
100 100 100 100 100 100 100 100 100 100 100 100 100 100 
##$AQSEQ= 0
##$AQ_mod= 3
##$AUNM= <au_zg>
##$AUTOPOS= <25 >
##$BF1= 250.13
##$BF2= 250.13
##$BF3= 250.13
##$BF4= 250.13
##$BF5= 500.13
##$BF6= 500.13
##$BF7= 500.13
##$BF8= 500.13
##$BYTORDA= 1
##$CFDGTYP= 0
##$CFRGTYP= 5
##$CHEMSTR= <none>
##$CNST= (0..31)
1 1 145 1 1 1 1 1 1 1 1 1 1 1 1 1 1 1 1 1 1 1 1 1 1 1 1 1 1 1 1 1 
##$CPDPRG= <>
##$CPDPRG1= <>
##$CPDPRG2= <>
##$CPDPRG3= <>
##$CPDPRG4= <mlev>
##$CPDPRG5= <mlev>
##$CPDPRG6= <mlev>
##$CPDPRG7= <mlev>
##$CPDPRG8= <mlev>
##$CPDPRGB= <>
##$CPDPRGT= <>
##$D= (0..31)
0 1 0 0 0 0 0 0 0 0.06 0 0 0 0 0 0 0.0002 0 0 0 0 0 0 0 0 0 0 0 0 0 0 
0 
##$DATE= 1158050645
##$DBL= (0..7)
120 120 120 120 120 120 120 120 
##$DBP= (0..7)
150 150 150 150 150 150 150 150 
##$DBP07= 0
##$DBPNAM0= <>
##$DBPNAM1= <>
##$DBPNAM2= <>
$$ [...]
##$SUBNAM7= <"">
##$SUBNAM8= <"">
##$SUBNAM9= <"">
##$SW= 20.6930455092707
##$SWIBOX= (0..15)
0 0 3 0 0 0 0 0 0 0 0 0 0 0 0 0 
##$SW_h= 5175.983436853
##$TD= 65536
##$TD0= 1
##$TE= 296.16
##$TE2= 300
##$TE3= 300
##$TEG= 300
##$TL= (0..7)
0 120 120 120 120 120 120 120 
##$TP= (0..7)
150 150 150 150 150 150 150 150 
##$TP07= 0
##$TPNAME0= <>
##$TPNAME1= <>
##$TPNAME2= <>
##$TPNAME3= <>
##$TPNAME4= <>
##$TPNAME5= <>
##$TPNAME6= <>
##$TPNAME7= <>
##$TPOAL= (0..7)
0.5 0.5 0.5 0.5 0.5 0.5 0.5 0.5 
##$TPOFFS= (0..7)
0 0 0 0 0 0 0 0 
##$TUNHIN= 0
##$TUNHOUT= 0
##$TUNXOUT= 0
##$USERA1= <user>
##$USERA2= <user>
##$USERA3= <user>
##$USERA4= <user>
##$USERA5= <user>
##$V9= 5
##$VALIST= <valist>
##$VCLIST= <CCCCCCCCCCCCCCC>
##$VD= 0
##$VDLIST= <DDDDDDDDDDDDDDD>
##$VPLIST= <PPPPPPPPPPPPPPP>
##$VTLIST= <TTTTTTTTTTTTTTT>
##$WBST= 1024
##$WBSW= 4
##$XGAIN= (0..3)
0 0 0 0 
##$XL= 0
##$YL= 0
##$YMAX_a= 410610
##$YMIN_a= -518103
##$ZGOPTNS= <>
##$ZL1= 120
##$ZL2= 120
##$ZL3= 120
##$ZL4= 120
##$ABSF1= 16.522
##$ABSF2= -4.171173
##$ABSG= 5
##$ABSL= 3
##$ALPHA= 0
##$AQORDER= 0
##$ASSFAC= 0
##$ASSFACI= 0
##$ASSFACX= 0
##$ASSWID= 0
##$AUNMP= <proc_1d>
##$AZFE= 0.1
##$AZFW= 0.1
##$BCFW= 0
##$BC_mod= 0
##$BYTORDP= 0
##$COROFFS= 0
##$CY= 12.5
##$DATMOD= 1
##$DC= 0
##$DFILT= <>
##$DTYPP= 0
##$F1P= 14.0000005364418
##$F2P= -0.99999901652339
##$FCOR= 0.5
##$FTSIZE= 32768
##$FT_mod= 6
##$GAMMA= 0
##$GB= 0
##$INTBC= 1
##$INTSCL= 1
##$ISEN= 128
##$LB= 0.3
##$LEV0= 0
##$LPBIN= 0
##$MAXI= 10000
##$MC2= 0
##$MEAN= 0
##$ME_mod= 0
##$MI= 0
##$NCOEF= 0
##$NC_proc= -5
##$NLEV= 6
##$NOISF1= 0
##$NOISF2= 0
##$NSP= 0
##$NTH_PI= 0
##$NZP= 0
##$OFFSET= 16.522
##$PC= 1
##$PHC0= 143.5293
##$PHC1= 6.568317
##$PH_mod= 1
##$PKNL= yes
##$PPARMOD= 0
##$PSCAL= 4
##$PSIGN= 0
##$REVERSE= no
##$SF= 250.13
##$SI= 32768
##$SIGF1= 0
##$SIGF2= 0
##$SINO= 400
##$SIOLD= 32768
##$SREGLST= <1H.CDCl3>
##$SSB= 0
##$STSI= 32768
##$STSR= 0
##$SW_p= 5175.98343685301
##$SYMM= 0
##$S_DEV= 0
##$TDeff= 65536
##$TDoff= 0
##$TI= <Analysis number 999999
Compound Code 99
Book Reference 9
Project Code 9>
##$TILT= no
##$TM1= 0
##$TM2= 0
##$TOPLEV= 0
##$USERP1= <user>
##$USERP2= <user>
##$USERP3= <user>
##$USERP4= <user>
##$USERP5= <user>
##$WDW= 1
##$XDIM= 32768
##$YMAX_p= 506977040
##$YMIN_p= -583258
$$ End of Bruker specific parameters
$$ ---------------------------------
##NTUPLES= NMR SPECTRUM
##VAR_NAME=  FREQUENCY,     SPECTRUM/REAL,   SPECTRUM/IMAG
##SYMBOL=    X,             R,               I
##VAR_TYPE=  INDEPENDENT,   DEPENDENT,       DEPENDENT
##VAR_FORM=  AFFN,          ASDF,            ASDF
##VAR_DIM=   32768,         32768,           32768
##UNITS=     HZ,            ARBITRARY UNITS, ARBITRARY UNITS
##FACTOR=    0.157963299565203, 1,           1
##FIRST=     4132.6476996994, 0,             0
##LAST=      -1043.33573715361, 0,           0
##MIN=       -1043.33573715361, -583258,     0
##MAX=       4132.6476996994, 506977040,     0
$$ Real data points
##PAGE= N=1
##DATA TABLE= (X++(R..R)), XYDATA
$$ [...]
28437a9190L0867N4398o712n2858k3038k3681L0881N4751N0419M6885m7361O4212
$$ -19190 11677 66075 59363 6505 -16533 -40214 -9333 45418 95837 142722 95361 159573
28425A59573J1168o2178K9282M38j58720L910R4243k1061p647J4777J3472l229
$$ 159573 170741 108563 137845 138283 -20437 -16527 77716 56655 49008 63785 77257 74028
28413G4028J166o6573m7913j81394o5095J13681K6598j8636Q8714k4462P4400
$$ 74028 75194 8621 -39292 -220686 -285781 -172100 -145502 -164138 -75424 -99886 -25486
28402b5486Q643K0082k26245j11921J23824K1345J4499J22547J84888k3851r4526
$$ -25486 -16843 3239 -223006 -334927 -211103 -189758 -175259 -52712 132176 108325 13799
28391A3799l1317N670J4449q4495j67714L0967J81358K03172J33116k2645j76663
$$ 13799 -17518 -11848 2601 -81894 -249608 -218641 -37283 165889 299005 276360 99697
28380I9697j06219j52868j7050l7248m1768L5024N7126L6898Q4330J65380l0083
$$ 99697 -6522 -159390 -176440 -213688 -255456 -220432 -163306 -126408 -42078 123302 93219
28369I3219l0772K6425q290n0704L5263p7356l777p6771O8372M2291m3724o1666
$$ 93219 62447 88872 80582 29878 65141 -12215 -15992 -92763 -24391 17900 -25824 -87490
28357h7490P747J13634M245o9112j01779Q7642K34274m2075j59379K8243J49266
$$ -87490 -79743 33891 38136 -30976 -132755 -45113 189161 147086 -12293 15950 165216
28346A65216j9870k11266j94911J31724K46753Q2177M4729R1847J666k31556j73237
$$ 165216 145346 -65920 -260831 -129107 117646 199823 244552 336399 338065 106509 -66728
28335f6728k180R3330J48140P1964j27536j77565o5694R0715n563J01374o9134
$$ -66728 -68908 24422 172562 244526 116990 -60575 -126269 -35554 -41117 60257 -8877
28324h877L2695q969p3498M1765R2985k745J06040j92577j12281Q1208R1196k2983
$$ -8877 23818 14849 -58649 -16884 76101 73356 179396 -13181 -125462 -44254 46942 23959
28312B3959j22771P2659r8281p3913l9026Q6003J51138J784J2843k0310l6758
$$ 23959 -98812 -26153 -124434 -198347 -237373 -151370 -232 1552 14395 -5915 -42673
28301d2673Q7872m6665N0093O4373p3597j76020R7782R1028N9672Q1722j9787
$$ -42673 45199 -1466 48627 113000 39403 -136617 -38835 52193 111865 193587 173800
28290A73800o7126r8395J428p1294J04558N8991l026N0290j03729p3096J3862
$$ 173800 106674 8279 9707 -61587 42971 101962 98936 149226 45497 -27599 -13737
28279a3737l2675r8767p530K08138J23308j4467j08593k7255l4214O2643Q797
$$ -13737 -46412 -145179 -152709 55429 178737 164270 55677 28422 -5792 56851 65648
28268F5648J12921q9521l89o4999l3689l079P215P1333Q1535q6283j2221q8598
$$ 65648 178569 89048 88659 23660 -10029 -13108 -5893 65440 146975 60692 48471 -40127
28256d0127j32602P7947M3206m9992J26166R3329L8160J2749l7983K3344q4019
$$ -40127 -172729 -94782 -51576 -101568 24598 117927 156087 168836 130853 154197 70178
28245G0178N7734N0570m8004K1991O9193m7242l7663j0190J6631j51113m3949
$$ 70178 127912 178482 130478 152469 221662 174420 136757 126567 143198 -7915 -51864
28234e1864L6674N6448J24937j04560j39027n7203J92586J95702l867p9479N4352
$$ -51864 -15190 41258 166195 61635 -77392 -134595 57991 253693 249826 170347 224699
28223B24699o7528k53922j26361J11428R7932O4707j2418m843p0142p4121p1611
$$ 224699 157171 -96751 -223112 -111684 -13752 50955 38537 33694 -36448 -110569 -182180
28212a82180J13395p265r2069o8093J5736Q2294P2535m2984Q4907k3299j0742
$$ -182180 -68785 -76050 -168119 -236212 -220476 -138182 -65647 -108631 -23724 -47023 -57765
28201e7765P0510k5695j3404j46034l3121K4977J33619J38751N1342j23697o1581
$$ -57765 12745 -12950 -26354 -172388 -205509 -180532 -46913 91838 143180 19483 -42098
28190d2098l8926m3086M6560L8468j10759Q5785K5347k2806L4812N48j30492j8924
$$ -42098 -81024 -124110 -77550 -39082 -149841 -64056 -38709 -61515 -26703 -26155 -156647 -175571
28178a75571K52090J39809j04999L1294j63059m6763j8986J969N6844L372J00054
$$ -175571 76519 216328 111329 142623 -20436 -67199 -86185 -84216 -27372 -24000 76054
28167G6054k2662m6883j53592k26624R4329P5175J17342J08261k9411K85198L9827
$$ 76054 53392 6509 -147083 -373707 -279378 -204203 -86861 21400 -8011 277187 317014
28156C17014j92073r9478j7291J04462J5742j54646J9457N6161K6353q7744o2954
$$ 317014 124941 25463 8172 112634 128376 -26270 -6813 49348 75701 -12043 -74997
28145g4997R3498m4841o8008N1300n6864m7771J11663l9618J69460l270j07282
$$ -74997 18501 -26340 -94348 -43048 -99912 -147683 -36020 -75638 93822 90552 -16730
28134a6730N2076N447n9901o8421L386N6592k0189n2525K8483J36105p406j54443
$$ -16730 35346 40793 -19108 -87529 -84143 -27551 -47740 -100265 -71782 64323 56917 -97526
28122i7526l1617J49396J60490n6888q2915o109M2314N5987K4859m7275p6874
$$ -97526 -129143 20253 180743 123855 40940 34831 77145 133132 157991 110716 33842
28111C3842K6680p1734l7628l1656P7095j4262j9885j47124L6084R5300l7625
$$ 33842 60522 -11212 -48840 -80496 -3401 -17663 -37548 -184672 -148588 -53288 -90913
28100i0913k9887Q9293p0195J14956J20881O8644J9572n1320n4857l0844o9317
$$ -90913 -120800 -31507 -101702 13254 134135 202779 222351 171031 116174 85330 16013
28089A6013p3763p9571J3126K5117j23723K4425K2013N0164j11871J73683K97967
$$ 16013 -57750 -137321 -124195 -99078 -222801 -198376 -176363 -126199 -238070 -64387 233580
28078B33580o8593j51210j8498K3174J19265o9488o9901o6767M4837m028Q1894
$$ 233580 164987 13777 -4721 18453 137718 68230 -1671 -68438 -23601 -27629 54265
28067E4265O8478L1107n4582j33244r2719J61108n4811o8686R8269o6635m7286
$$ 54265 122743 153850 99268 -33976 -126695 34413 -20398 -89084 9185 -57450 -104736
28056a04736m6899r6459J33118r0912j9011L1923R5786J57137j5396j29878L2819
$$ -104736 -151635 -248094 -114976 -205888 -224899 -192976 -97190 59947 44551 -85327 -52508
28045e2508K3227p2390O667P1427N8896p4915J751Q597J6825M5337q2105Q32P4270
$$ -52508 -29281 -101671 -95004 -23577 35319 -39596 -37845 -29248 -12423 32914 -49191 -48359 25911
28032B5911j8846j6708k9051J5726Q7197R759J7797p721m7530r9055J41083J52975
$$ 25911 7065 -9643 -38694 -22968 64229 73988 91785 84064 36534 -62521 78562 231537
28020B31537N8214k62258k3052J62572L2304q3268J6871n9444q8857N4966J08974
$$ 231537 289751 27493 4441 167013 199317 116049 132920 73476 -15381 39585 148559
28009A48559R330l9138q515K1395R15o1015J46754L5544o5698k53270R891o938
$$ 148559 157889 118751 110236 131631 132546 71531 218285 253829 188131 -65139 -55248 -62186
27997f2186r8451l0366N0802K5899O4402n953K521R2886k4850J840N1429j6908
$$ -62186 -160637 -191003 -140201 -114302 -49900 -55853 -53332 39554 14704 16544 67973 51065
27985E1065j1769n263L4024n4118J9612j49406O5629R3758R465K44558l5895j01470
$$ 51065 39296 34033 68057 13939 33551 -115855 -50226 43532 52997 297555 261660 160190
27973A60190k58340o3057J32534q107J4258K1546j621Q3944Q7105p3306j4558
$$ 160190 -98150 -161207 -28673 -36780 -22522 -976 -2597 81347 168452 95146 80588
27962H0588N7733Q4312n6507q0370J66315N6664J7798k2450k53489k20938j00955
$$ 80588 138321 222633 166126 85756 252071 308735 326533 304083 50594 -170344 -271299
27951b71299J27813K3628n5278J43854J14360k3790q6171N3883l6825J4566j0680
$$ -271299 -143486 -119858 -175136 -31282 83078 59288 -26883 27000 -9825 4741 -5939
27940e939k94k2696j5433l4128j02992L9235M9864N6655O2860L534n4737L2054
$$ -5939 -6233 -28929 -44362 -78490 -181482 -142247 -92383 -35728 27132 30666 -24071 7983
27928G983L3446r4340l3675M5868O8256J6497M923j04751r2457m2652O4317q179
$$ 7983 41429 -52911 -86586 -40718 27538 44035 48958 -55793 -148250 -190902 -126585 -134764
27916a34764J97240N7121Q3482Q1925m6191L6957J1004k301l4207q3917o0834
$$ -134764 62476 119597 203079 285004 238813 275770 286774 284473 250266 166349 105515
27905A05515o4404k5704R6339N6665j13801m6917J2594j4623L5457J38162o2470
$$ 105515 41111 15407 111746 168411 54610 7693 20287 5664 41121 179283 116813
27894A16813M4863k1322j28513N7986j84J3285P8781k7846o9752N6207J84485
$$ 116813 161676 140354 11841 69827 69643 82928 161709 133863 64111 120318 304803
27883C04803n6149j04939j83181j31516m1362Q9328N2624j6340J13352J58930
$$ 304803 248654 143715 -39466 -170982 -212344 -123016 -70392 -86732 26620 185550
27873A85550j3813o3920j03900M9342N2339j00530p5019p887p636N6276J54313
$$ 185550 171737 107817 3917 53259 105598 5068 -69951 -77838 -85474 -29198 125115
27862A25115P095q5176l8852K7962j03939l5900J27985J92931p802N1746n4406
$$ 125115 132210 47034 8182 36144 -67795 -103695 24290 217221 209419 261165 206759
27851B06759j70694o8158j25520p3885R3670Q9149N0695j6168n5851L85J65557
$$ 206759 36065 -32093 -157613 -231498 -137828 -48679 2016 -14152 -70003 -69618 95939
27840I5939J06988J494n187L6140k4417r0330M8513L8599k3566j07773p8645N0595
$$ 95939 202927 204421 199234 235374 210957 120627 169140 207739 184173 76400 -2245 48350
27828D8350n0183J6532j8325r0335K5525P472O3511Q8296O5617K585J05986p422
$$ 48350 -1833 14699 -3626 -93961 -68436 -60964 2547 90843 156460 159045 265031 257609
27816B57609j44250q2993J4847P0991q8118n681J42641r4768J138P5229n520q8861
$$ 257609 113359 30366 45213 116204 28086 22405 165046 70278 71416 146645 141125 52264
27804E2264j21641N3083r3760l1869J51646M1406j288J8500N6106p8046m6172
$$ 52264 -69377 -16294 -110054 -141923 9723 51129 49841 68341 124447 46401 229
27793B29J12965O4887L4799L1001k8787p9422r2801R8368O8272m1230p6004l6744
$$ 229 113194 178081 212880 243881 215094 135672 42871 141239 209511 168281 92277 55533
27781E5533J14772m5741j37699k9228M9957Q9940l5525n5578l4202n907Q6027
$$ 55533 170305 124564 -13135 -42363 7594 97534 62009 6431 -27771 -33678 52349
27770E2349M9676J0143Q3585k0934L3561m2132J07686o3045l0809j90385K8975
$$ 52349 102025 112168 195753 174819 208380 166248 273934 210889 180080 -10305 18670
27759A8670o7041k6264Q6448P2847p628l2637n8171m6573J04100j5723J6766n9571
$$ 18670 -48371 -74635 11813 84660 77032 44395 -13776 -60349 43751 28028 44794 -14777
27747a4777N7649M8353M5333J0469L6946J79233r6486k58750r2780r2461n3365
$$ -14777 42872 91225 136558 147027 183973 363206 266720 7970 -84810 -177271 -230636
27736b30636R0061J7651N2924P9362O1505m8440o3202n3679J2748J4652K1506
$$ -230636 -140575 -122924 -70000 9362 70867 22427 -40775 -94454 -81706 -67054 -45548
27725d5548q2361q8724P7643K8205R6996M9568r3754K0420L7690P169m5651J0235
$$ -45548 -127909 -216633 -138990 -110785 -13789 35779 -57975 -37555 135 7304 -38347 -28112
27713b8112L0584O0768o501o2957l9400N3162Q0416L2399N7257l9560J29110j78
$$ -28112 2472 63240 56739 -6218 -45618 7544 87960 120359 177616 138056 267166 266988
27701B66988l9213k1300n3525r0288j99293N3912J14084j7154O0712m1230K563
$$ 266988 227775 206475 152950 62662 -136631 -82719 31365 14211 74923 33693 36256
27690C6256L5964m6106O9619m9802j04971J95797P7767K2437o2170j7100j47971
$$ 36256 72220 26114 95733 45931 -59040 136757 214524 236961 174791 157691 9720
27679I720J4103R8062M7342m5097J06018l919q1497j04126N032P2556K0525K0762
$$ 9720 23823 121885 169227 124130 230148 226229 144732 40606 45638 118194 138719 159481
27667A59481J1929K127o3904K1999m7837l9160o2778j3756r675o1754O7150J08677
$$ 159481 171410 173537 109633 131632 83795 44635 -18143 -31899 -41574 -103328 -36178 72499
27655G2499Q2727j17573r2275K7843p4339N7261K8087J1281N7538P0652q1157
$$ 72499 155226 37653 -54622 -26779 -101118 -43857 -15770 -4489 53049 123701 42544
27644D2544K7099o271k6258J01267l9562K1497o3478j43919k9634j17535j02481
$$ 42544 69643 63372 37114 138381 98819 120316 56838 -87081 -116715 -234250 -336731
27633c36731L6622J24185j2220l3888J1124Q140J56015J3616O4101m0593j35045
$$ -336731 -300109 -175924 -188144 -222032 -210908 -202768 -46753 -33137 30964 -9629 -144674
27622a44674N6046J7699l2735L1052K5220J13858j08944j84362N4910J2416j82387
$$ -144674 -88628 -70929 -103664 -72612 -47392 66466 -42478 -226840 -171930 -159514 -341901
27611c41901J72092K20457q5044q349J25753M2113j055p5122l4144O441K0714
$$ -341901 -169809 50648 -34396 -42745 83008 125121 124066 48944 14800 21241 41955
27600D1955q383q667q4332p1955j1057N8033P1496p8235M5651L3049l8599k5085
$$ 41955 33572 24905 -59427 -131382 -142439 -84406 -12910 -91145 -45494 -12445 -51044 -76129
27588g6129Q2618Q3720O989j13425j27614J62360L6355L1551Q4040J4055l5826
$$ -76129 6489 90209 97198 -16227 -143841 18519 54874 86425 170465 184520 148694
27577A48694j45479m3533J12278N2097k7231o8544o7355j95660j84803m2356M4262
$$ 148694 3215 -40318 71960 124057 96826 28282 -39073 -234733 -419536 -461892 -417630
27566d17630R3707J90860K4815n9627R2519J39751n426K4943k4801K9583L78l2279
$$ -417630 -323923 -133063 -108248 -167875 -75356 64395 58969 83912 59111 88694 89072 56793
27554E6793J6949p011L3893M1162n597o0873j38885J2584L1912m765N8110J00545
$$ 56793 73742 66731 100624 141786 136189 75316 -63569 -50985 -19073 -23838 34272 134817
27542A34817M96o8082n6422o0239j6764J10353j29136r7220j1038P3442P1789
$$ 134817 135313 67231 10809 -49430 -66194 44159 -84977 -182197 -193235 -119793 -48004
27531d8004J8590O6623J22533j56807k6072k5070R550Q1922M3045J04514r9438
$$ -48004 -29414 37209 159742 2935 -23137 -48207 -38657 43265 86310 190824 91386
27520I1386l2800o153n1714j61162n1087O7878J91366K06694K3358k5587j6463
$$ 91386 58586 52433 719 -160443 -211530 -143652 47714 254408 277766 252179 235716
27509B35716q2770j09364j5829n4263j3005k2975Q0804p9661N0473L3056l5556
$$ 235716 152946 43582 27753 -26510 -39515 -62490 18314 -61347 -10874 22182 -13374
27498a3374j2572o3078k0161o3915p254M1488p5001j4116l2827n5228Q7158O5031
$$ -13374 -25946 -89024 -109185 -173100 -180354 -138866 -213867 -227983 -260810 -316038 -228880 -163849
27486a63849N5641L6747N7847Q062K6663j8956l3773o7292j28705L8736R2234
$$ -163849 -108208 -71461 -13614 -5552 21111 2155 -31618 -98910 -227615 -188879 -96645
27475i6645N1034L4157Q6580r3223M9901q4359k10893K717j2823P0158l193L6914
$$ -96645 -45611 -11454 75126 -18097 31804 -52555 -263448 -260731 -273554 -203396 -206589 -169675
27463a69675J32301J32745o637j5663o2392j1030O8391P3725n705j70952N0067
$$ -169675 -37374 95371 88734 73071 10679 -351 68040 141765 136060 -34892 15175
27452A5175M6052J43759l9079q9197K3095l1318l3713K8767N2188n116l8906K3649
$$ 15175 61227 204986 165907 76710 99805 68487 34774 63541 115729 110613 71707 95356
27440I5356j6785j47217m0163P3262L6122j1542O1929l5537L532r8507j8381P3784
$$ 95356 78571 -68646 -108809 -35547 575 -10967 50962 15425 18957 -79550 -97931 -24147
27428b4147J48001m4471j65752J16412L3490L7k9087l1272l1544L763L4493j67920
$$ -24147 123854 79383 -86369 30043 63533 63570 34483 3211 -28333 -24570 9923 -157997
27416a57997p5461k7555P5861J67947M2529p4311j04223K5742Q8190J53633J70615
$$ -157997 -233458 -261013 -185152 -17205 25324 -48987 -153210 -127468 -39278 114355 284970
27405B84970p5487j19329j00811p7846J6736L6622Q0796N9920M7987J4436j20778
$$ 284970 209483 90154 -10657 -88503 -71767 -35145 45651 105571 153558 167994 47216
27394D7216j55205m9007j02213Q3540R0860j4224l0032m7622J29321J14295m9601
$$ 47216 -107989 -156996 -259209 -175669 -84809 -99033 -129065 -176687 -47366 66929 17328
27383A7328R5473J13589j75233j14788M1771m132n8492L1607M8483k5407j3069
$$ 17328 112801 226390 51157 -63631 -21860 -25992 -84484 -52877 -4394 -29801 -42870
27372d2870j5232j3044J26293L8955r7415m5392J0284l526R9153j3574R060r3262
$$ -42870 -58102 -71146 55147 94102 -3313 -48705 -38421 -41947 57206 43632 52692 -40570
27360d0570K7226o5662J1158K36272O9067l9366j73833r789P7578J06859n5717
$$ -40570 -13344 -79006 -67848 168424 237491 198125 24292 14503 92081 198940 143223
27349A43223j0315L7957k7501m8873j46928l793Q8130P6841k8253j08154j90313
$$ 143223 132908 170865 143364 94491 -52437 -56230 31900 108741 80488 -27666 -217979
27338b17979j5453J55281J96286m9181j21560l4753J50527J17450n7746j1406
$$ -217979 -233432 -78151 118135 68954 -52606 -87359 63168 180618 122872 111466
27328A11466r1348k2831n5325j7181n2139P0169M8814J5360R0099O3321N0327
$$ 111466 20118 -2713 -58038 -75219 -127358 -57189 -8375 6985 97084 160405 210732
27317B10732o5681l4114p3944l1994m5025O841j9792O0005M302O7520J33902K5189
$$ 210732 145051 110937 36993 4999 -40026 -33185 -52977 7028 11330 78850 212752 237941
27305B37941j42726o611j51709o2819J28870K06010N2945o8149m2323p7572J00503
$$ 237941 95215 88604 -63105 -125924 2946 208956 261901 193752 151429 73857 174360
27294A74360L1192j15115k6503l6919j07747Q2911R4747q327j50000p2123J12378
$$ 174360 205552 90437 63934 27015 -80732 2179 96926 88599 -61401 -133524 -21146
27283b1146J43144J4345j14603K909j7780q569M673J574J43428L6002j79369k4095
$$ -21146 121998 136343 21740 24649 6869 -1700 2973 4547 147975 183977 4608 -19487
27271a9487J1203m8516j27112N7477J57154P27j37392l2712P5763N8945Q8438
$$ -19487 -8284 -56800 -183912 -126435 30719 31446 -105946 -138658 -62895 -3950 84488
27260H4488R0896p530M524j0828o4461r5021K288R3141L4258m9555j22406l3942
$$ 84488 175384 167854 172378 161550 97089 2068 4356 97497 131755 82200 -40206 -74148
27248g4148j0374R9414L6201L2339j32399m1780N1598J54929O6582m304P243l2526
$$ -74148 -84522 14892 51093 83432 -48967 -90747 -39149 115780 182362 178058 185301 152775
27236A52775j00993j22110O1197N1720o5663m3555M8538M1348m5088p1510j00741
$$ 152775 51782 -70328 -9131 42589 -23074 -66629 -18091 23257 -21831 -93341 -194082
27225a94082o7347P5515J60186r6L797l5483J5548j3035O8474M0092J19619J68721
$$ -194082 -261429 -185914 -25728 -25824 -22027 -57510 -41962 -54997 13477 53569 173188 341909
27213C41909N387k20507k71217k9768Q0828r4169Q9900J72746J18667p4085j82337
$$ 341909 347296 126789 -144428 -174196 -93368 -187537 -97637 75109 193776 119691 -62646
27202f2646n006J07417O0725n0473M1057J8500k4647o8149j05841k0739Q3277
$$ -62646 -67652 39765 100490 50017 91074 109574 84927 16778 -89063 -109802 -26525
27191b6525L7200l7143l9780P0074L7120K3601L3355j7936n6943J1372L116Q3161
$$ -26525 10675 -26468 -66248 3826 40946 64547 97902 79966 23023 34395 37511 120672
27179A20672M2995R305n1252R6406j82621j07998L7738j4403j1667j05581J3203
$$ 120672 163667 172972 121720 218126 35505 -72493 -34755 -49158 -60825 -166406 -153203
27168a53203J38790M3523L1528o5988J1708m9906k224k5917j975K432Q4450J55046
$$ -153203 -14413 29110 60638 -5350 6358 -43548 -45772 -71689 -73664 -71232 13218 168264
27156A68264l4438n2312M8709l4188k28034N3321J24162L0824m6392K9317o6637
$$ 168264 133826 81514 130223 96035 -131999 -78678 45484 76308 29916 59233 -7404
27145g404j22173Q836J96948k875R1626R1282o4371j33032j16693k666K5014n852
$$ -7404 -129577 -120741 76207 73332 164958 256240 191869 58837 -57856 -60522 -35508 -41360
27133d1360j0713j4369j11536l9529K355Q4507J52445J021K5015L0192J16662
$$ -41360 -52073 -66442 -177978 -217507 -215152 -130645 21800 22821 47836 78028 194690
27122A94690J03733k0228p4000j12437j29607j10447o0520n0542l4173O1428J29771
$$ 194690 298423 278195 204195 91758 -37849 -148296 -208816 -259358 -293531 -232103 -102332
27111a02332l5765R3907R4672k310o1359l2266J5672p7921r4772m2172Q9416o5139
$$ -102332 -138097 -44190 50482 48172 -13187 -45453 -29781 -107702 -202474 -244646 -155230 -220369
27099b20369p6287J04459N7674o4695j8566J68300P04n2586j47320j4903J77566
$$ -220369 -296656 -192197 -134523 -199218 -217784 -49484 -48780 -101366 -248686 -263589 -86023
27088h6023J33380r5054Q269m0299L5578L9179J5041q8822p1074j1959J56213
$$ -86023 47357 -47697 -39428 -79727 -44149 -4970 10071 -78751 -149825 -161784 -5571
27077e571J29226j09290j02958o3995L2110O6685q0848K0246J7603L9963j34743
$$ -5571 123655 14365 -88593 -152588 -120478 -53793 -134641 -114395 -96792 -56829 -191572
27066a91572j12155J04310J97178l3j52680j27486O7147J2457J05254J51348p1981
$$ -191572 -303727 -199417 -2239 -2272 -154952 -282438 -215291 -202834 -97580 53768 -18213
27055a8213p1199j34044m4692K09809J39859J5019r4923o3654o241Q4863j1203
$$ -18213 -89412 -223456 -268148 -58339 81520 96539 1616 -62038 -68279 16584 5381
27044E381K8567M9699N731j85322l485J45082k3225j00549k00815J74323J44198
$$ 5381 33948 83647 89378 -95944 -99429 45653 22428 -78121 -278936 -104613 39585
27033C9585Q1808O9177N6811k44003j00053l0669J40049R3858j07790j38498j14509
$$ 39585 121393 190570 247381 3378 -96675 -127344 12705 106563 -1227 -139725 -254234
27022b54234K0720Q2471L7335J2670J9562J03343R6053q0436q9216j8932o5056
$$ -254234 -233514 -151043 -113708 -101038 -81476 21867 117920 37484 -51732 -70664 -135720
27011a35720q553R9492Q0661M4297p249j47592r0082J16373R5092k0070j59856
$$ -135720 -144273 -44781 35880 80177 72928 -74664 -164746 -48373 46719 26649 -133207
27000a33207o3474k1214P8999K34523J14287l5267j42891J01320J32614n1078
$$ -133207 -196681 -217895 -138896 95627 209914 174647 31756 133076 265690 214612
26990B14612p3938j34731J8012M991j03830p4436K4235J17353j5978o569M9271
$$ 214612 140674 5943 23955 28946 -74884 -149320 -125085 -7732 -23710 -30279 18992
26979A8992k4414j7966p667j41948l6658J65166M0243j704J1466K29171j2566
$$ 18992 -5422 -23388 -31055 -173003 -209661 -44495 -4252 -5956 5510 234681 222115
26968B22115j45000j17458P8812J9693K0249J7758p3008j0045q012K248R8146
$$ 222115 77115 -40343 38469 58162 78411 96169 23161 13116 5104 7352 105498
26957A05498p4762n3922O0122J57263L7300l0795p6441q8980r3460l2664P1536
$$ 105498 30736 -23186 36936 194199 231499 200704 124263 35283 -58177 -90841 -19305
26946a9305P1015J4554L9869m3177k6635O6846k3170j49845j07993O3203N7322
$$ -19305 51710 66264 106133 62956 36321 103167 79997 -69848 -177841 -114638 -57316
26935e7316k6423l6006l6336J6785Q1689o5790k1383k94M5448o5304k9039Q5465
$$ -57316 -83739 -119745 -156081 -139296 -57607 -123397 -144780 -145074 -99626 -164930 -193969 -108504
26923a08504J32953L1115M4834P427o6593l8236P2618r22O9136r0575m9984n0231
$$ -108504 24449 55564 100398 107825 41232 2996 75614 74692 143828 53253 3269 -46962
26911d6962j42088Q5218Q5458J46061L8229J34482k0428r1276j54416j6972m1703
$$ -46962 -189050 -103832 -18374 127687 165916 300398 279970 188694 34278 17306 -24397
26900b4397j17685j4963K8772J16936j07107q5182j198Q0901J3641n7682l5911
$$ -24397 -142082 -157045 -128273 -11337 -118444 -203626 -204824 -123923 -110282 -167964 -203875
26889b03875p6829K1416R3172j0757N9841n8582k0501L8684K6261m4860K4147
$$ -203875 -280704 -259288 -166116 -176873 -117032 -175614 -196115 -157431 -131170 -176030 -151883
26878a51883P9663J77768L9755J52091L5147j28893r7699M9213j470j02941K7630
$$ -151883 -72220 105548 145303 297394 332541 203648 105949 155162 153692 50751 78381
26867G8381J0932j04006n6644J61782N4900J9792K7344r616l5217j08046m978
$$ 78381 89313 -14693 -71337 90445 145345 165137 192481 182865 147648 39602 34624
26856C4624K0810q2923r304P6745Q2538P4410J2850j02210m905J600Q2953m6609
$$ 34624 55434 -27489 -36793 39952 122490 196900 209750 107540 102635 104235 187188 140579
26844A40579O6666k9401j1925j00695k04060j02648O4618J24826J94464j0679
$$ 140579 207245 177844 165919 65224 -138836 -241484 -176866 -52040 142424 131745
26834A31745q2702m2349K051J04530r930o6498Q2662L1167j19559r6153l0252
$$ 131745 49043 6694 8745 113275 103345 36847 119509 150676 31117 -65036 -95288
26823i5288R7333J43187J1360j05897p3643n7508n244R5605N7393o7120l4144
$$ -95288 2045 145232 156592 50695 -22948 -80456 -85700 9905 67298 178 -33966
26812c3966K2861Q237Q20N8492M683J00449p3595j74711n0843R4980L5278P8471
$$ -33966 -11105 -2868 -2048 56444 61127 161576 87981 -86730 -137573 -42593 -7315 71156
26800G1156J2127l0453j40267M1059R8585o7531R5022K9440l2771N8312Q3228
$$ 71156 83283 52830 -87437 -46378 52207 -15324 79698 109138 76367 134679 217907
26789B17907K2934q9553M0070J9770j55089K2605J0447k0098m0431k0031l8151
$$ 217907 240841 151288 191358 211128 56039 78644 89091 68993 28562 8531 -29620
26778b9620N82o9060j26905N7408J03727O6733M4052Q0359k782j00736j01680
$$ -29620 -29038 -98098 -225003 -167595 -63868 2865 46917 127276 124494 23758 -77922
26767g7922Q0819l1125K3432J79564P6576m3317l1517j40598q9674k5954J28647
$$ -77922 2897 -28228 -4796 174768 251344 208027 176510 35912 -53762 -79716 48931
26756D8931K20810j45594q5814R293J50447M5216j05709j35302M9091j13010j07304
$$ 48931 269741 124147 38333 47626 198073 243289 137580 2278 51369 -61641 -168945
26745a68945N97K5447K4820Q6692R1927j8086j64648o3533o5202J24068J75248
$$ -168945 -168348 -142901 -118081 -31389 60538 42452 -122196 -185729 -250931 -126863 48385
26734D8385n6258j24871K1452l1306K590N1453K6629N9645Q9785K2073l2219L0453
$$ 48385 -7873 -132744 -111292 -142598 -140008 -88555 -61926 -2281 87504 109577 77358 107811
26722A07811P6355L4223R5937n0008k4809k2776K7033k5330J6893j01442m8253
$$ 107811 184166 218389 314326 264318 239509 216733 243766 218436 235329 133887 85634
26711H5634j7107j2293j61970J4199O9997N2845j26340n128O7752K5178m9645
$$ 85634 68527 56234 -105736 -91537 -21540 31305 -95035 -100163 -32411 -7233 -56878
26700e6878K5809N6213l85L9526P3148r8134p1130j05847l90j14717K8667J21695
$$ -56878 -31069 25144 24759 64285 137433 39299 -31831 -137678 -138068 -252785 -224118 -102423
26688a02423J51683l3382j03379q007N1150k7564j2130k2398j08105l3769J32517
$$ -102423 49260 15878 -87501 -95508 -44358 -71922 -84052 -106450 -214555 -248324 -115807
26677a15807J33380J4759L223J09331J631K6518j09773o5540n4679K5389J19715
$$ -115807 17573 32332 35555 144886 146517 173035 63262 -2278 -56957 -31568 88147
26666H8147j1071M6902j1965j01775J364m8271O516N5506M4826k0088p5084n8460
$$ 88147 77076 123978 112013 10238 11602 -36669 -30153 25353 70179 50091 -24993 -83453
26654h3453q0027N9683m9870R6564J61269L1458q1097j03594j49465K10697J08977
$$ -83453 -163480 -103797 -153667 -57103 104166 135624 54527 -49067 -198532 12165 121142
26643A21142p3178q2946M9364l7423o0156k7117q812m0122J14673L9043n637o1058
$$ 121142 47964 -34982 14382 -23041 -83197 -110314 -119126 -159248 -44575 -5532 -11169 -72227
26631g2227L1732j0664k7018J12507J82331k4478j42347q8789l9686l1793L2604
$$ -72227 -40495 -51159 -78177 34330 216661 192183 49836 -38953 -78639 -110432 -77828
26620g7828N5297R18m6767j7956j12276O0060J14306p5300N288Q4748J93256l1625
$$ -77828 -22531 -21613 -68380 -86336 -198612 -138552 -24246 -99546 -94258 -9510 183746 152121
26608A52121r4652j31507n9210n3135k15597j49598J57121K39842L4535n4648
$$ 152121 57469 -74038 -133248 -186383 -401980 -551578 -394457 -154615 -120080 -174728
26598a74728k8238Q7161R5052J01416J7559M5715n4849M490n7014j07086M757
$$ -174728 -202966 -115805 -20753 80663 98222 143937 89088 93578 36564 -70522 -65765
26587f5765J54087L1702m4601P763Q3270j13105p1876J74426P4459r8311q5524
$$ -65765 88322 120024 75423 83186 166456 53351 -18525 155901 230360 132049 46525
26576D6525k1494j15826j9830K007R9676m8632j4420K3588J08041K207j01003
$$ 46525 25031 -90795 -110625 -108618 -8942 -57574 -71994 -48406 59635 61842 -39161
26565c9161m5323J18135n3888k2377j7940n3704J33399P6061j1044O6438l9478
$$ -39161 -84484 33651 -20237 -42614 -60554 -114258 19141 95202 84158 150596 111118
26554A11118J7669j909r4467l4767r5496M3235J41035k7487p6870K5059K3832
$$ 111118 128787 126878 32411 -2356 -97852 -54617 86418 58931 -17939 7120 30952
26543C0952n626o6144N5194J51690J32392j2736J5742j8967j92067j22055p4497
$$ 30952 25326 -40818 14376 166066 298458 285722 301464 282497 90430 -31625 -106122
26532a06122P2938J18744L1956o5679J0941J11220K5962j45399q0742M9720N2637
$$ -106122 -33184 85560 117516 51837 62778 173998 199960 54561 -26181 23539 76176
26521G6176O4686L9380k12426L4444J01164j65348o3701N1057o4112k8462N2543
$$ 76176 140862 180242 -32184 2260 103424 -61924 -125625 -74568 -138680 -167142 -114599
26510a14599K6243Q5815N3080n7505j82022j1489O7408j1231P115K8960J34425
$$ -114599 -88356 -2541 50539 -6966 -188988 -200477 -133069 -144300 -137185 -108225 26200
26499B6200Q6112k9061k3411M9628J3293j04264n1371R8416P0628o734O948j8612
$$ 26200 112312 83251 59840 109468 122761 18497 -32874 65542 136170 129436 136384 117772
26487A17772j5316P3668l7675k2389j36074M4117N4999K494R686o5891j29945
$$ 117772 102456 176124 138449 116060 -20014 24103 79102 81596 91282 25391 -104554
26476a04554q714P2434k0754N0101O8211j2582l1195j56971k7252L5071Q7624
$$ -104554 -113268 -40834 -61588 -11487 56724 44142 12947 -144024 -171276 -136205 -48581
26465d8581o2179N3752O6566R5826p967k8036p1164m5898K7175p5666K1482J17648
$$ -48581 -110760 -57008 9558 105384 97417 69381 -1783 -47681 -20506 -96172 -74690 42958
26453D2958N493q9203n0910q6985R4128L75j48107J7212J92787M9792n1037L813
$$ 42958 48451 -40752 -91662 -178647 -84519 -84144 -232251 -215039 -22252 27540 -23497 -19684
26441a9684k4195J31471p1146j60255k5923L3553J32179J05316J1426l3114q1017
$$ -19684 -43879 87592 16446 -143809 -169732 -136179 -4000 101316 112742 79628 -1389
26430a389r7133J13065k934j54686L5324N4306J77795J43651m4851R236j7496
$$ -1389 -98522 14543 11609 -143077 -107753 -53447 124348 267999 223148 232384 214888
26419B14888j04184j46194J2962q3722l5993N0551O699Q9907N7336M2759Q2772
$$ 214888 110704 -35490 -22528 -106250 -142243 -91692 -84993 4914 62250 105009 187781
26408A87781o555M289j32638r8039o0430L0402M5594Q9595m2359O283k2529m3006
$$ 187781 181226 185515 52877 -45162 -105592 -75190 -29596 59999 17640 23923 1394 -41612
26396d1612o3167o2223K665L6598o7581j9862j2860J25032R5017P509j33702o5940
$$ -41612 -104779 -167002 -164337 -127739 -195320 -215182 -228042 -103010 -7993 -484 -134186 -200126
26384b00126P1598q000q9821k1119J65010N2068J00736J26537p4234j69036M3503
$$ -200126 -128528 -136528 -226349 -247468 -82458 -30390 70346 196883 122649 -46387 -2884
26373b884M3411J12365k6065k54869R381l1842K9423J44961k4346p528N7036R9116
$$ -2884 40527 152892 126827 -128042 -118661 -150503 -121080 23881 -465 -7993 49043 148159
26361A48159n3499j52970j19315m3672R0902O4640o3676j75010J9671M5067R2741
$$ 148159 94660 -58310 -177625 -221297 -130395 -65755 -129431 -304441 -284770 -239703 -146962
26350a46962J2578K6531K6486J55911j923q9511j4298j4764M5968o8336l1587
$$ -146962 -134384 -107853 -81367 74544 72621 -16890 -31188 -45952 16 -68320 -99907
26339i9907r8153Q6498J5161L2754J9099k3779q0335p0940K32126p7935j46728
$$ -99907 -198060 -111562 -96401 -63647 -44548 -68327 -148662 -219602 12524 -65411 -212139
26328b12139m1076J01984J79773K1935N0527p2427J21270j5374j42453r4281J01480
$$ -212139 -253215 -151231 28542 50477 101004 28577 149847 134473 -7980 -102261 -781
26317g81r510q7458k6872l8698P3101O4204n3018k2341J6835N5712J27636N2396
$$ -781 -10291 -97749 -124621 -163319 -90218 -26014 -79032 -101373 -84538 -28826 98810 151206
26305A51206n2067p5684n269n6144j57704L7401P6806K1341J82807j187r2093
$$ 151206 99139 23455 18186 -37958 -195662 -158261 -81455 -60114 122693 121506 29413
26294B9413q169o974n6106K8033J48188q1025j08581J1194Q7642j2867p4572N2330
$$ 29413 21244 14270 -41836 -13803 134385 53360 -55221 -44027 43615 30748 -43824 8506
26282H506K01884k4220q7889j78241r2441P2450l5611J74312M3524k9418m7584
$$ 8506 210390 186170 98281 -79960 -172401 -99951 -135562 38750 82274 52856 5272
26271E272j06051m809l5868j06853L9652J45536P7172o2824K5677Q8588q7918
$$ 5272 -100779 -105588 -141456 -248309 -208657 -63121 14051 -48773 -23096 65492 -22426
26260b2426Q3348M924m6772J69508M9257j58653N3605O2444p1678k358P4646K522
$$ -22426 60922 65846 19074 188582 237839 79186 132791 195235 123557 121199 195845 198367
26248A98367j20732j09969j305K2298L5675j9636n019P958L4483j05592j80649
$$ 198367 77635 -32334 -33639 -11341 24334 4698 -321 7637 42120 -63472 -244121
26237b44121P5206N9030M9279J9853j9735p2611q5918q5449o242J30106J16105
$$ -244121 -168915 -109885 -60606 -40753 -60488 -133099 -219017 -304466 -310708 -180602 -64497
26226f4497O3264j35551n7795J644J86756O0544j86208p6585o7603O8938k4770
$$ -64497 -1233 -136784 -194579 -192935 -6179 54365 -131843 -208428 -276031 -207093 -231863
26215b31863J08032O3030k8796j5675n8440o4983r1418J43594Q9757J516N9422
$$ -231863 -123831 -60801 -89597 -105272 -163712 -228695 -320113 -176519 -86762 -85246 -25824
26204b5824R6709o5808m7239O218K4601L9907R105K3010L000r8283r4847M7891
$$ -25824 70885 5077 -42162 -35944 -11343 28564 37669 60679 63679 -34604 -129451 -81560
26192h1560P2915k7591J06349J82385j04011j59208Q0404J09205R7908j01895
$$ -81560 -8645 -36236 70113 252498 148487 -10721 69683 178888 276796 174901
26182A74901n1006N7812o3015o2400j29944q90M7136L2571R3922l3712k9953l0625
$$ 174901 123895 181707 118692 56292 -73652 -74542 -27406 5165 99087 65375 35422 4797
26170D797p1741K1544J03364N8539L269j19859n9915j6061J09085J14889j21144
$$ 4797 -66944 -45400 57964 116503 119772 -87 -60002 -76063 33022 147911 26767
26159B6767q0248N7265R9445N1162o3285k30352M0289R5571j619j788n021r1662
$$ 26767 -53481 3784 103229 154391 91106 -139246 -98957 -3386 -5005 -6793 -11814 -103476
26147a03476o3957j9599j1102j7617J10457N0240l5681J33000J52770j319j8765
$$ -103476 -167433 -187032 -198134 -215751 -105294 -55054 -90735 42265 195035 193716 174951
26136A74951r599q9277p1741O5591J0739o0257K4950N6499J3007j4283r5802O7169
$$ 174951 165352 76075 4334 69925 80664 20407 45357 101856 114863 100580 4778 71947
26124G1947m2005j02398q4140r3499O8507N6208N6248K3321J14637J07692J7185
$$ 71947 29942 -72456 -156596 -250095 -181588 -125380 -69132 -45811 68826 176518 193703
26113A93703j372j86136q517l1735J5926J09761J6141j12380j44275p4086N8083
$$ 193703 192331 6195 -2322 -34057 -18131 91630 107771 -4609 -148884 -222970 -164887
26102a64887J26417J12671k4039j3030K7095J01420l4776j11360j6078N6916R209
$$ -164887 -38470 74201 50162 37132 64227 165647 130871 19511 3433 60349 69558
26091F9558p258j54820o9627M3245kj19136p0739J35197J54377M3299j7133O2683
$$ 69558 62300 -92520 -162147 -118902 -118904 -238040 -308779 -173582 -19205 24094 6961 69644
26079F9644Q7934m6259q1945j07773j05736n0597K71495P962k3232j24198r2542
$$ 69644 157578 111319 29374 -78399 -184135 -234732 36763 44725 21493 -102705 -195247
26068a95247o42J33553L2954j24008o3909P98M8557J34444Q224o3538Q6400j8451
$$ -195247 -195889 -62336 -29382 -153390 -217299 -216501 -167944 -33500 -25276 -88814 -2414 -20865
26056b0865k1289p008N7400l865m1188q1590r6136K9436Q1621R6185M3115M3605
$$ -20865 -42154 -49162 8238 4373 -36815 -118405 -214541 -185105 -103484 -7299 35816 79421
26044G9421j13368j70455j1177M8727j3539R6804J44042r9066o1443J51670J2277
$$ 79421 -33947 -204402 -215579 -166852 -180391 -83587 60455 -38611 -100054 51616 63893
26033F3893l1458o2472N908l4751l0134j03462m0532M1616P749M8442P0130L7618
$$ 63893 32435 -30037 -24129 -58880 -89014 -192476 -233008 -191392 -183643 -135201 -65071 -27453
26021b7453Q3253N8303L5712L2836r3394j32676k6667O083k8176n5916P4199O0030
$$ -27453 55800 114103 149815 182651 89257 -43419 -70086 -64003 -92179 -148095 -73896 -13866
26009a3866J8695K2297M0379k4743P9551L7047j00512o2777J1146M387j06981
$$ -13866 4829 27126 67505 42762 122313 159360 58848 -3929 7217 11604 -95377
25998i5377J71361R2616r6865K7456m2297m355O7643l086p0150j4732o5422l3033
$$ -95377 75984 168600 71735 99191 56894 52539 120182 117096 46946 32214 -33208 -66241
25986f6241j21562j04615M8710M4009o4067N0272M6397J10399J80971P4923N7008
$$ -66241 -187803 -292418 -243708 -199699 -263766 -213494 -167097 -56698 124273 199196 256204
25975B56204j16541p3700J1325P60r4485P0243j2400r4755K1397l7093J6148l7146
$$ 256204 139663 65963 77288 78048 -16437 53806 41406 -53349 -31952 -69045 -52897 -90043
25963i0043O2353J10858L9622Q7818K8965q2857m0387P921J5375J0753j12029
$$ -90043 -27690 83168 122790 210608 239573 156716 116329 124250 139625 150378 38349
25952C8349l1241j62218M3996O5557k5681J30164R7760o9231j73856J04406n8122
$$ 38349 7108 -155110 -111114 -45557 -71238 58926 156686 87455 -86401 18005 -40117
25941d0117o7524j4388P2412O8299R517n6567N5040Q6555J05321M6776j01430
$$ -40117 -107641 -122029 -49617 18682 28199 -28368 26672 113227 218548 265324 163894
25930A63894j95034q0755j1258N4044M3343J21979J0410j529p2827k5213J21453
$$ 163894 -31140 -111895 -123153 -69109 -25766 96213 106623 105094 32267 7054 128507
25919A28507M9871p318K0694l573m1552J24277O1304m9178n7900o1346q6414n89
$$ 128507 178378 171060 191754 188181 146629 270906 332210 283032 225132 163786 77372 76783
25907G6783p5732J137J45125L5450j72031p5918J4300J372N1756M4791R3040j91288
$$ 76783 1051 2188 147313 182763 10732 -65186 -50886 -49514 2242 47033 140073 -51215
25895e1215j11675J26726q2576M9857N109m4053k9888j09591l6653K348R3239
$$ -51215 -162890 -36164 -118740 -68883 -63774 -107827 -137715 -247306 -283959 -281611 -188372
25884a88372J3953K732O9327N1253J04827j20916m9933P8847Q2023M543J01150
$$ -188372 -174419 -171687 -102360 -51107 53720 -67196 -117129 -38282 43741 48284 149434
25873A49434J5200n5702r4948l9877J08029M819q3668L1298l354J0325k5376Q2355
$$ 149434 164634 108932 13984 -25893 82136 86955 3287 34585 31231 41556 16180 98535
25861I8535O2890k4370j08101N0305O84m3050P9302L2812O4207K1863j09103Q8922
$$ 98535 161425 137055 28954 79259 79943 36893 116195 149007 213214 235077 125974 214896
25849B14896j25780p8935l6340j64346m1493Q1015m716J12491M6631J06723L1386
$$ 214896 89116 10181 -26159 -190505 -231998 -150983 -155699 -43208 3423 110146 141532
25838A41532J7875Q739k6925j14114p8873J3129j1110M4958O7038K2411P6635
$$ 141532 159407 168146 141221 27107 -51766 -38637 -49747 -4789 62249 84660 161295
25827A61295R0768k6024p7868m9646J7780q4935l6572J09909N1787R338O4536
$$ 161295 252063 226039 148171 98525 116305 31370 -5202 104707 156494 165832 230368
25816B30368k6192j86164N202l744k2769J6406Q3445P8658j64185n8832k817j9673
$$ 230368 204176 18012 23214 19470 -3299 13107 96552 175210 11025 -47807 -50624 -70297
25804g0297k064n5636j06872j8441m4164P5286J00900P4439J27122m5466k4562
$$ -70297 -72361 -127997 -234869 -253310 -297474 -222188 -121288 -46849 80273 34807 10245
25793A0245J10661O6593j74517r5972n9591q8217J01586m865n5365j4088J16468
$$ 10245 120906 187499 12982 -82990 -142581 -230798 -129212 -134077 -189442 -203530 -87062
25782h7062N0543N0464K6812n4074m426J01145O554M8602O7068l4850m5728P346
$$ -87062 -36519 13945 40757 -13317 -17743 83402 89956 138558 205626 170776 125048 132394
25770A32394k2403r0039o722r2588l4174O9609k4274O5949K9752K9966L3847j2947
$$ 132394 109991 19952 13230 -79358 -113532 -43923 -68197 -2248 27504 57470 91317 78370
25758G8370n8445N4293O7038o8247p4593O9709P329j1547L652P037p3238p8612
$$ 78370 19925 74218 141256 73009 -1584 68125 75454 63907 67559 74596 1358 -77254
25746g7254J0468M3254M6348j34777R209N7983L0550j9500q080P8186j8801M2595
$$ -77254 -66786 -23532 22816 -111961 -102752 -44769 -14219 -33719 -41799 36387 17586 60181
25734F0181o3388J09190J2258o3535m5820m3526J1579l1324M8452K26851r2994
$$ 60181 -3207 105983 118241 54706 8886 -34640 -23061 -54385 -5933 220918 127924
25723A27924q331k5136m2495k5386o5039K8212O3324l5233K0300j5260J01714
$$ 127924 119593 94457 51962 26576 -38463 -10251 53073 17840 38140 22880 124594
25712A24594J36594p6274p9699r8863p6604J13498Q490p8070r7776M0635P9227
$$ 124594 261188 184914 105215 6352 -70252 43246 51736 -26334 -124110 -83475 -4248
25701d248q1917r3135j8445J69698J35082m9478r2907o8670r5381O1345J23412
$$ -4248 -86165 -179300 -197745 -28047 107035 57557 -35350 -104020 -199401 -138056 -14644
25690a4644j86013N1164J28916O5490N5933L9991n5625L8592j35240o6989K0621
$$ -14644 -200657 -149493 -20577 44913 100846 140837 85212 123804 -11436 -78425 -57804
25679e7804K9404K355O3342R8553J36786j08603n4433r0170K8718O7609p0023
$$ -57804 -28400 -26045 37297 135850 272636 164033 109600 19430 48148 115757 45734
25668D5734J24974J26890o2990j48592p3091k7062J73699l7308j54220P8933p7784
$$ 45734 170708 297598 234608 86016 12925 -14137 159562 122254 -31966 46967 -30817
25657c0817N6188J18201J07469M7004j84535o3398P1957r7625p9230J9749R0883
$$ -30817 25371 143572 251041 298045 113510 50112 122069 24444 -54786 -35037 55846
25646E5846r4446r5336M5135m573q3720k2575J65244O7676Q3607p236o393p161
$$ 55846 -38600 -133936 -88801 -93374 -177094 -199669 -34425 33251 116858 109622 103229 96068
25634I6068j1159K1594k8201r8463j0372p2438M8982M7803l8180o2234k3499m0042
$$ 96068 84909 106503 78302 -20161 -30533 -102971 -53989 -6186 -44366 -106600 -130099 -170141
25622a70141J0201Q8319m0054l2678N9330L5735j52273n0287J39844K00136K31
$$ -170141 -159940 -71621 -111675 -144353 -85023 -49288 -201561 -251848 -112004 88132 88363
25611H8363j71166P3662J47258k6876q7440p515m7796k6995J2458q646O2211K3169
$$ 88363 -82803 -9141 138117 111241 23801 16286 -31510 -58505 -46047 -54693 7518 30687
25599C0687n5855K6301m6949p220j22449N8211j6199O2261R0664R7022o9617M9129
$$ 30687 -25168 1133 -45816 -53036 -175485 -117274 -133473 -71212 19452 116474 46857 95986
25587I5986j6513p908k859O597k8801n2138J31733j22255j91154n0944L0920N9036
$$ 95986 79473 71565 68706 75303 46502 -5636 126097 3842 -187312 -238256 -207336 -148300
25575a48300L3295r9703j26J36755J21053p4080K642O5411R5745k5594k5360M12
$$ -148300 -115005 -214708 -214834 -78079 42974 -31106 -28464 36947 132692 107098 81738 82150
25563H2150m9004K08688l9816j28653k0983l0702j168R441o8839R5351J22052
$$ 82150 33146 241834 202018 73365 52382 21680 20512 29953 -38886 56465 178517
25552A78517l4995l6904j0324P929K8725j31107o2079M6442L4104k277M0240n9885
$$ 178517 143522 106618 96294 104223 132948 1841 -60238 -13796 20308 18031 58271 -1614
25540a614j87136m7439l3438J82117O2463M7753r0663j66738k5303k0011k7986
$$ -1614 -188750 -236189 -269627 -87510 -25047 22706 -67957 -234695 -259998 -280009 -307995
25529c07995J32865N8212j5143O6798L7362M3846j9737l9203Q226J71167J2231
$$ -307995 -175130 -116918 -132061 -65263 -27901 15945 -3792 -42995 -34769 136398 148629
25518A48629n911O265j38323m3283m5593L1826R2239N6257L6501k9024r737p1528
$$ 148629 142718 148983 10660 -32623 -78216 -46390 45849 102106 138607 109583 99846 28318
25506B8318p9679L5646o6325p5126L6652J14810o5205J7059J32235m9526r9541
$$ 28318 -51361 -15715 -82040 -157166 -120514 -5704 -70909 -53850 78385 28859 -70682
25495g0682m8437N3504R7697j944L0875o468r983Q0910p3615r9774q1052M713
$$ -70682 -119119 -65615 32082 30138 61013 54545 44562 125472 51857 -47917 -128969 -124256
25483a24256P9487J46243R9204J46457r9307j15614j33260j5395P9947l3748P2181
$$ -124256 -44769 101474 200678 347135 247828 132214 -1046 -16441 63506 29758 101939
25472A01939Q644M7904r7352k897m664q1913r7166r0529J38652K0660r6052J00415
$$ 101939 110583 158487 61135 58238 53574 -28339 -125505 -216034 -77382 -56722 -152774 -52359
25460e2359K34900N3117N216n1431n6376L439L4931O3271k2783n9055k03893m3185
$$ -52359 182541 235658 240874 189443 133067 136506 171437 234708 211925 152870 -51023 -94208
25448i4208L730J25382J97109P2545j19508k22469m1793N7033P7058o3631K6372
$$ -94208 -90478 34904 232013 304558 185050 -37419 -79212 -22179 54879 -8752 17620
25437A7620m0931K1989O1867J2166q2732j1416Q277M2192r4320j427P932M995
$$ 17620 -23311 -1322 60545 72711 -10021 -21437 -13160 29032 -65288 -66715 -58783 -53788
25425e3788n2319o457J00220J28897l6650j2281l7010j56144n5205J17680Q8956
$$ -53788 -106107 -112564 -12344 116553 79903 67622 30612 -125532 -180737 -63057 25899
25414B5899J30886P9629j08648r8180l6208P1828P066n832L2747l2155o4030j93658
$$ 25899 156785 236414 127766 29586 -6622 65206 72272 66440 99187 67032 3002 -190656
25402a90656J28825J06918P871M7820j2408j309q0767J00728l9864m4105l9479
$$ -190656 -61831 45087 52958 100778 88370 87061 6294 107022 67158 23053 -16426
25391a6426J5895N7017l3092l2058Q787k1695P1835j2888M7783Q9660m7135j10297
$$ -16426 -531 56486 23394 -8664 123 -21572 50263 37375 85158 174818 127683 17386
25379A7386m2991J3015n532J34544R5322m6590n3694l3803p2175n0090k8715J13998
$$ 17386 -25605 -12590 -18122 116422 211744 165154 111460 77657 5482 -44608 -73323 40675
25367D0675J93419p6134m24n9624q3628q8571J25517j8407p2153L3951J75194
$$ 40675 234094 157960 157536 97912 14284 -74287 51230 32823 -39330 -5379 169815
25356A69815j4074l0587O8610R0624q4678q7661q4644p0628q8014l200m3961M2225
$$ 169815 155741 125154 193764 284388 199710 112049 27405 -43223 -131237 -134437 -178398 -136173
25344a36173J56075L5614r0323J52868Q8153J3409m8689o4446j40484K0963q7573
$$ -136173 19902 55516 -34807 118061 206214 219623 170934 106488 -33996 -13033 -100606
25333a00606j11174J39877J44068n3653N952R8185P067N2557j34537k9003M2762
$$ -100606 -211780 -71903 72165 18512 24464 122649 129716 182273 47736 18733 61495
25322F1495j79072j46578N6968J12030M1845R0788J72828l2304j87265O4778N6240
$$ 61495 -117577 -264155 -207187 -95157 -53312 37476 210304 178000 -9265 55513 111753
25311A11753p7367o546r9500q1589K109J00415j8293j43586J03387J10224j01001
$$ 111753 34386 27840 -71660 -153249 -151140 -50725 -69018 -212604 -109217 1007 -99994
25300i9994l4300J7278Q463p5983P8415m6844M2528Q8936j3904M8327O0319m0176
$$ -99994 -134294 -117016 -108553 -184536 -106121 -152965 -110437 -21501 -35405 12922 73241 33065
25288C3065J6833R8878J55317K2387J0729j68395k06370q2338P0663O3073n6745
$$ 33065 49898 148776 304093 326480 337209 168814 -37556 -119894 -49231 13842 -42903
25277d2903J5755J1487o9342q3507o3369K31934Q1100K3299P2079j32750o1029
$$ -42903 -27148 -15661 -85003 -168510 -231879 55 81155 104454 176533 43783 -17246
25266a7246o1410j42494j0K48577q3458j42518j5967p3386K070J19919J94456
$$ -17246 -78656 -221150 -221160 27417 -56041 -198559 -214526 -287912 -285842 -165923 28533
25255B8533n9656o4816P6553O7054l4654k9960j8616L4225K355K9708K562r323
$$ 28533 -31123 -95939 -19386 47668 13014 -16946 -35562 -1337 1018 30726 33288 23965
25243B3965K2160o800o760k4939L1839N1007m676j49799J0296R7901L3583r2367
$$ 23965 46125 39325 32565 7626 39465 90472 85796 -64003 -53707 44194 77777 -14590
25231a4590r5156k08464l4164L9406J42136m5564O8485J0784K9232P6179R8289
$$ -14590 -109746 -318210 -352374 -312968 -170832 -216396 -147911 -137127 -107895 -31716 66573
25220F6573r376j98L8877l2150p6577m1283Q0146K32445j15585k4643P758j31983
$$ 66573 57197 56999 95876 63726 -12851 -54134 26012 258457 142872 118229 125987 -5996
25208e996L1427m4698J04340k1343K8831J45387J25917j36997j03441j12924l0002
$$ -5996 25431 -19267 85073 63730 92561 237948 363865 226868 123427 10503 -19499
25197a9499L5306J38048j05993j15263o5655R7550p7696m7912R4269J64802L1572
$$ -19499 15807 153855 47862 -67401 -133056 -35506 -113202 -161114 -66845 97957 129529
25186A29529j11568L3910O0233q6147q6693R1388L244o6374K5277j57207p156
$$ 129529 17961 51871 112104 25957 -60736 30652 33896 -32478 -7201 -164408 -171564
25175a71564N6384O2253m1082k3783K5106Q5614p6950J9332l6131q7864L3628
$$ -171564 -115180 -52927 -94009 -117792 -92686 -7072 -84022 -64690 -100821 -188685 -155057
25164a55057J06559j37618o656J60819k1983M8251J5792J11997r830j4537J4112
$$ -155057 -48498 -186116 -192772 -31953 -53936 -5685 10107 122104 112274 97737 111849
25153A11849N9183p662J5304M5740j73220j04921P9885q95j62248J09592N5312
$$ 111849 171032 163370 178674 224414 51194 -53727 26158 25263 -136985 -27393 27919
25142B7919R236O1416J00190o6103r9859k1836j5486l5079j22901q3288R3500
$$ 27919 37155 98571 198761 132658 32799 10963 -4523 -39602 -162503 -245791 -152291
25131a52291N8299m0967m9294j3533Q5237N6896j8288p3246q581O1652L1672R4297
$$ -152291 -93992 -134959 -184253 -197786 -112549 -55653 -73941 -147187 -155768 -94116 -62444 31853
25119C1853N2578O8916o3302p1872q2975q1943J23848J00976L7122q4893k3902
$$ 31853 84431 153347 90045 18173 -64802 -146745 -22897 78079 115201 30308 6406
25108F406O2188K2923q1909P383L7314p3299l2336j31347l1774k3341L1456p2002
$$ 6406 68594 91517 9608 16991 54305 -18994 -51330 -182677 -214451 -237792 -206336 -278338
25096b78338M5562K98626l4905l9258p7809j4085N9224m4046Q1737N7804j4686
$$ -278338 -232776 65850 30945 -8313 -86122 -100207 -40983 -85029 -3292 54512 39826
25085C9826n7102j45843l3950J6863R2286j8459J06726K2626j21977L2847J59843
$$ 39826 -17276 -163119 -197069 -180206 -87920 -106379 347 22973 -99004 -66157 93686
25074I3686Q632j42109j836L1584j4307q264K7160n9328o4416M0348R5561J3837
$$ 93686 102318 -39791 -41627 -10043 -24350 -32614 -5454 -64782 -129198 -88850 6711 20548
25062B0548K9886K25291L8974j18010p0720j10705m9543J5430J06068J9137j23611
$$ 20548 50434 275725 314699 196689 125969 15264 -34279 -18849 87219 106356 -17255
25051a7255r4189q1265N308J36789J36227O836j87486k658K4317M8333J05104
$$ -17255 -111444 -192709 -187401 -50612 85615 92451 -95035 -97693 -73376 -25043 80061
25040H0061O5145j5966j18635k3687j78247j07356O0096Q2270N726k9226J15288
$$ 80061 145206 129240 10605 -13082 -191329 -298685 -238589 -156319 -150593 -179819 -64531
25029f4531R2988q6969J7221J78936m2249j66164j1434L689M3013J24455M490
$$ -64531 28457 -58512 -41291 137645 95396 -70768 -82202 -78513 -35500 88955 93445
25018I3445j11860J4060J34641M2420m7710R795J0463r7267j75517J932L38339
$$ 93445 -18415 -4355 130286 172706 124996 134791 145254 47987 -127530 -125598 212741
25007B12741J58201L110k05982j82859O4782J11105K0260o5332k36682j72291
$$ 212741 370942 374052 168070 -14789 49993 161098 181358 116026 -120656 -292947
24997b92947N7574J47675J8612r2036m9038P6698K9088m3110J7457P1707M8829
$$ -292947 -235373 -87698 -69086 -161122 -210160 -133462 -104374 -147484 -130027 -58320 -9491
24986i491r0842K142M9373O5013J41903N6900K8254k2452k12351o6527O4509J10502
$$ -9491 -100333 -98191 -48818 16195 158098 214998 243252 220800 8449 -58078 6431 116933
24974A16933M1608n0213j746J3589n2572l5448l0404o9047L2535L0520J5729k7932
$$ 116933 158541 108328 106582 120171 67599 32151 1747 -67300 -34765 -4245 11484 -16448
24962a6448j734N7713J38941j36897j68325Q6154k109j49421J16319J09555R7562
$$ -16448 -18182 39531 178472 41575 -126750 -40596 -42705 -192126 -75807 33748 131310
24951A31310O5417N398j69020j15980q7968r718K09866N4135K53048N3697j02203
$$ 131310 196727 202125 33105 -82875 -170843 -180561 29305 83440 336488 390185 287982
24940B87982j30720r555p1261q1963l180Q0320N9489q2055j5480l4749J0943J64722
$$ 287982 157262 147707 76446 -5517 -8697 71623 131112 49057 33577 -1172 9771 174493
24928A74493K9094j58659P537J8440o0976m3480j13966P1923N1379N6396j55443
$$ 174493 203587 44928 52465 70905 9929 -33551 -147517 -75594 -24215 32181 -123262
24917a23262k4593J50393M3943r6543k2017J05333J26113j06412P1969M2573j19332
$$ -123262 -147855 2538 46481 -50062 -72079 33254 159367 52955 124924 167497 48165
24906D8165k5647J167m223o9288J5721N7291l7198q1705J1917Q2395P5908J5834
$$ 48165 22518 23685 19462 -49826 -34105 23186 -14012 -95717 -83800 -1405 74503 90337
24894I0337k3122J9742o665J29409R9624j17686r2711n4667M7642K4399L0479
$$ 90337 67215 86957 80292 209701 309325 191639 98928 44261 91903 116302 146781
24883A46781M2435n5553k2402k00223m3060L8340o7232j2173J7422p103k882K2852
$$ 146781 189216 133663 111261 -88962 -132022 -93682 -160914 -173087 -155665 -162768 -165650 -142798
24871a42798J27223L015l0257o9949J63318M2489q1157o1459n6683P5913J9790
$$ -142798 -15575 -12560 -42817 -112766 50552 93041 11884 -49575 -106258 -30345 -10555
24860a0555n6129P238P4594O2184p3727J3701J20553K0576j17565n2470J34846
$$ -10555 -66684 -59446 15148 77332 3605 17306 137859 158435 40870 -11600 123246
24849A23246J71883l2175j15392j17763Q0088K9650o0350n2306L5337K0203J73426
$$ 123246 295129 262954 147562 29799 109887 139537 79187 26881 62218 82421 255847
24838B55847q5945p0352L5442m1295p9045r268k8155M038L0671J4229m5284k4433
$$ 255847 169902 99550 134992 93697 14652 5384 -22771 -18733 11938 26167 -19117 -43550
24826d3550j0882o9032K535J27447O5016r0017o5723O4868P9118q7093j10164
$$ -43550 -54432 -123464 -120929 6518 71534 -18483 -84206 -19338 59780 -27313 -137477
24815a37477m9874j90690k1423J33578P1146O5220N0525P9206J26354R612j38875
$$ -137477 -187351 -378041 -399464 -265886 -194740 -129520 -78995 211 126565 136177 -2698
24804b698o983J39200m3866j45792N6616J63426M4735j31205k54839k9616J00178
$$ -2698 -9681 129519 85653 -60139 -3523 159903 204638 73433 -181406 -211022 -110844
24793a10844K8318N1022n732k5865o349L2064j07589l8256J31978N8761m9834
$$ -110844 -82526 -31504 -37236 -63101 -69450 -37386 -144975 -183231 -51253 7508 -42326
24782d2326R1725M3334j00988k00694J064K15595J78501p5010l715j14552K3073
$$ -42326 49399 92733 -8255 -208949 -207885 7710 186211 111201 107486 -7066 16007
24771A6007K4362J2311o8472l7149j235J6736J2682M2379P4963o9854q261o2125
$$ 16007 40369 52680 -15792 -52941 -54176 -37440 -24758 17621 92584 22730 14469 -47656
24759d7656P4597k0785Q3084N172n3506N9783O549j90768k00172r1562J20863
$$ -47656 26941 6156 89240 94412 40906 100689 107238 -83530 -283702 -375264 -254401
24748b54401K02004j5912N4573q1731L3244M5211N9739J2055q5381m6134J14710
$$ -254401 -52397 -68309 -13736 -95467 -62223 -17012 42727 54782 -30599 -76733 37977
24737C7977j30702m9627Q4975O9763k0933q0618M5157j28321k7837J37548l2557
$$ 37977 -92725 -142352 -57377 12386 -8547 -89165 -44008 -172329 -200166 -62618 -95175
24726i5175q557J25438r6120L152q2176k0855J07748O7407N6485K2675o5907j36458
$$ -95175 -103732 21706 -74414 -71262 -153438 -174293 -66545 862 57347 80022 14115 -122343
24714a22343K9222J83170P7698j07829k5747q4245k931N6451j07058j13954m2811
$$ -122343 -93121 90049 167747 59918 34171 -50074 -53005 3446 -103612 -217566 -260377
24703b60377P3274R0062K4406L0334K1180N4105J06764n1473p9640n6452q496
$$ -260377 -187103 -97041 -72635 -42301 -21121 32984 139748 88275 8635 -47817 -56313
24692e6313j8760j25168L4866m6387L8754K6088P040N226P1418J23722J41534
$$ -56313 -75073 -200241 -165375 -211762 -173008 -146920 -139880 -134654 -63236 60486 202020
24681B02020Q2773P3613l5711N607j17019r3586l684p2904r7743o4360L0835K4432
$$ 202020 284793 358406 322695 328302 211283 117697 114013 41109 -56634 -120994 -90159 -65727
24669f5727M1094P3646P9062n9020r0079J3723m8787q4618J10512M7354L5983
$$ -65727 -24633 49013 128075 69055 -21024 -7301 -56088 -140706 -30194 17160 53143
24658E3143Q682J293l0992K8749r4989n4162j0134O8637p4074Q9139R7478L0134
$$ 53143 61825 63118 32126 60875 -34114 -88276 -98410 -29773 -103847 -14708 82770 112904
24646A12904k2459N4233k5060K8220Q5931j18879o0504K15833l8381j66328p9835
$$ 112904 90445 144678 119618 147838 233769 114890 54386 270219 231838 65510 -14325
24635a4325q6300n3711J10482J0254j9007K3400L8384L0466Q8408L5407M7833
$$ -14325 -100625 -154336 -43854 -33600 -52607 -29207 9177 39643 128051 163458 211291
24624B11291r7259r8684j29619J50737M6539R7664q0574k10507o1405l0980n0519
$$ 211291 114032 15348 -114271 36466 83005 180669 100095 -110412 -171817 -202797 -253316
24613b53316J50751J32456J3583q6804m9002j16988n7232P9236j3091N0691J24202
$$ -253316 -102565 29891 43474 -43330 -92332 -209320 -266552 -187316 -200407 -149716 -25514
24602b5514R0927R1513o8541m9699m2668p1612Q3712m4465p5438m6957p6787K06689
$$ -25514 65413 156926 88385 38686 -3982 -75594 8118 -36347 -111785 -158742 -235529 -28840
24590b8840O2537n2115L4647P6041j17269k6436J38075l6161j7594M4228k4525
$$ -28840 33697 -18418 16229 92270 -24999 -51435 86640 50479 32885 77113 52588
24579E2588l3149j19558L3189P2437k2782r749O7543J02332m9034M8136j6436
$$ 52588 19439 -100119 -66930 5507 -17275 -27024 40519 142851 93817 141953 125517
24568A25517N0375N4612j25988n1610R9631N9443M4729K0473q9822n6683j72562
$$ 125517 175892 230504 104516 52906 152537 211980 256709 277182 187360 130677 -41885
24557d1885q3444l3675N2946L06378L3671m9070K1520j04108q4049K0204m6328
$$ -41885 -125329 -159004 -106058 200320 233991 184921 206441 102333 18284 38488 -7840
24546g840J6234j33137m5156J82613K62192p6362j68493j17325R82p6063j39625
$$ -7840 8394 -124743 -169899 12714 274906 198544 30051 -87274 -86292 -162355 -301980
24535c01980L7744J02166r660R3469J9425P445k7464n6177K0958O2106J48308
$$ -301980 -264236 -162070 -171730 -78261 -58836 -51391 -78855 -135032 -114074 -51968 96340
24524I6340k4422o4570n456M3628M4610k7093p6176K5845Q8589m8n3091k8769
$$ 96340 71918 7348 1892 45520 90130 63037 -13139 12706 101295 101247 48156 19387
24512A9387j03363N6787Q1557r36m72l5133Q821K9132k8406k2061R1721P8854
$$ 19387 -83976 -27189 54368 53432 52960 17827 26648 55780 27374 5313 97034 175888
24500A75888K6189J2615M5148K2005N755o3129j39295n6279j71650j05326M2508
$$ 175888 202077 214692 259840 281845 287600 224471 85176 28897 -142753 -248079 -205571
24489b05571N4611n8394J3841L8237k4673j804L5033j39183j2014P1331R7374
$$ -205571 -150960 -209354 -195513 -157276 -181949 -183753 -148720 -287903 -299917 -228586 -131212
24478a31212j050q146k5934L9494K4145J5386J09556l3194q3569Q4069M4666j20472
$$ -131212 -132262 -140408 -166342 -126848 -102703 -87317 22239 -10955 -94524 -10455 34211 -86261
24466h6261j31300o7091J45544O1333j69951r7183J84549K70350J12170j20772
$$ -86261 -217561 -284652 -139108 -77775 -247726 -344909 -160360 109990 222160 101388
24456A01388J9060p7557l7470O9497k0916M2340n6799l1621k9151M5311O4511
$$ 101388 120448 42891 5421 74918 54002 96342 39543 7922 -21229 24082 88593
24445H8593j72113l6571P6595K76L182k0006q3777J33860p6355l1068R2036J57777
$$ 88593 -83520 -120091 -43496 -43220 -40038 -60044 -143821 -9961 -86316 -117384 -25348 132429
24433A32429o4482R6181n4828k42831O2708Q5376R4492R2899K0985j04980k10842
$$ 132429 67947 164128 109300 -133531 -70823 14553 109045 201944 222929 117949 -92893
24422i2893j16049l5098P92J10114K27149O5661R6758n7332N5305l3170n583m5290
$$ -92893 -208942 -244040 -243248 -133134 94015 159676 256434 199102 254407 221237 215654 170364
24410A70364j92114k0507j01353L146P3999J8379O950J06252k5299o6804n6861
$$ 170364 -21750 -42257 -143610 -140464 -66465 -48086 -41136 65116 39817 -26987 -83848
24399h3848p6448r3397Q4894J35696J0538L4459K2086r9678p0849N5621P8140
$$ -83848 -160296 -253693 -168799 -33103 -22565 11894 33980 -65698 -136547 -80926 -2786
24388b786R0122P1169j22009j05525p5749o0215J7400J20515M144N0445O2530
$$ -2786 87336 158505 36496 -69029 -144778 -204993 -187593 -67078 -62934 -12489 50041
24377E0041L2293j30039j07646O6790R8395L6584o567j7548k8596k2946k9024
$$ 50041 82334 -47705 -155351 -88561 9834 46418 39851 22303 -6293 -29239 -58263
24366e8263N1526P6357K8048l7234P530j16806p8011N3229K5973L2418J00998
$$ -58263 -6737 69620 97668 60434 67964 -48842 -126853 -73624 -47651 -15233 85765
24355H5765L8474j80729j40548M0298J88958J25020o7993j04778j23154n9287
$$ 85765 124239 -56490 -197038 -156740 32218 157238 89245 -15533 -138687 -197974
24345a97974j09278j0167N4802J42694J50991o2466M8696L0672j6767J13517q7403
$$ -197974 -307252 -317419 -262617 -119923 31068 -31398 17298 47970 31203 144720 57317
24334E7317j01196o021j0006M6633N2623K6039j07374J769j63710N6446o3695
$$ 57317 -43879 -49900 -59906 -13273 39350 65389 -41985 -40216 -203926 -147480 -211175
24323b11175o684R581R2974j1424k9491l6572J43464J87234j49391N0495o9539
$$ -211175 -217859 -208278 -115304 -126728 -156219 -192791 -49327 137907 -11484 39011 -30528
24312c0528J02044m7312j58475k545j6337J31186Q1495n3930J4561n9476n8748
$$ -30528 71516 24204 -134271 -136816 -153153 -21967 59528 5598 20159 -39317 -98065
24301i8065N757K884P9843J03993n7672r1982m6971j34403J3910O8009K6965O3438
$$ -98065 -92308 -89424 -9581 94412 36740 -55242 -102213 -236616 -222706 -154697 -127732 -64294
24289f4294N892o6646O3132R9464m5174o6768J04035o6849J24481k1259o8136
$$ -64294 -58402 -125048 -61916 37548 -7626 -74394 29641 -37208 87273 66014 -2122
24278b122o9505l3238j22534J3198J36304Q6911q174k952j0848M6538J02325O9094
$$ -2122 -71627 -104865 -227399 -214201 -77897 9014 840 -2112 -12960 33578 135903 204997
24266B04997j13525l1994R5691O1496o3093M2797K3303j52904j25514k1703J42750
$$ 204997 91472 59478 155169 216665 153572 196369 219672 66768 -58746 -80449 62301
24255F2301L8372q5061R3534J57075L3507l283q7269m0973N8820j04366j7532
$$ 62301 100673 15612 109146 266221 299728 296445 209176 168203 227023 122657 105125
24244A05125p0670k02074r223L5228N845j42260n6139o0471O1245M6578l7901
$$ 105125 34455 -167619 -176842 -141614 -135769 -278029 -334168 -394639 -333394 -286816 -324717
24233c24717R048O130j5368j6693K15486J88504j38849j33790P3971J35572j4916
$$ -324717 -315669 -309539 -324907 -341600 -126114 62390 -76459 -210249 -136278 -706 -15622
24222a5622K3363n4465M0160Q118m1010O0726J4346j09104J4965j0764n446p6292
$$ -15622 7741 -46724 -6564 1554 -39456 21270 35616 -73488 -58523 -69287 -74733 -151025
24210a51025M9121j7959l2190j9973J05904J7983N745L0950j2677J5914N5619
$$ -151025 -101904 -119863 -152053 -172026 -66122 -48139 -42394 -11444 -24121 -8207 47412
24199D7412p0584j09800j00595P1864K06926M8838K9587j40769K0435N1673j07114
$$ 47412 -23172 -132972 -233567 -161703 45223 94061 123648 -17121 3314 54987 -52127
24188e2127o151Q315J4695r7895J9611J0617O1810o7151o2976J32368R8022k7240
$$ -52127 -58278 -49963 -35268 -133163 -113552 -102935 -41125 -108276 -171252 -38884 59138 31898
24176C1898l6524N955L9404n3692k8844m1291M0591j26120m0324J48374j05054
$$ 31898 -4626 1329 40733 -12959 -41803 -83094 -42503 -168623 -208947 -60573 -165627
24165a65627K4590J49545Q680o9065O7256m956n9820Q0197m938l837L2070p4971
$$ -165627 -141037 8508 17188 -51877 15379 10423 -49397 30800 25862 22025 54095 -20876
24153b0876R5143J13285n6204k4843j1864q1383J10075N2428m7479N7466O176
$$ -20876 74267 187552 131348 106505 94641 13258 123333 175761 128282 185748 191924
24142A91924k20974r1221j2876P4340K08575N1685k8786P2715O432k15015j73621
$$ 191924 -29050 -120271 -133147 -58807 149768 201453 172667 245382 251814 36799 -136822
24131a36822J01393p0557q198J22099M5306l9558R2400N857p9818p9937p2894
$$ -136822 -35429 -105986 -114184 7915 53221 13663 106063 111920 32102 -47835 -120729
24120a20729k376M6334m7724j98838M1079J50082P9832P7413Q2892P1902l5648
$$ -120729 -123105 -76771 -124495 -323333 -282254 -132172 -52340 25073 107965 179867 144219
24109A44219r2722J4385J4382l8491p8850l9673K9411K6937k8881l4665K9164
$$ 144219 51497 65882 80264 41773 -37077 -76750 -47339 -20402 -49283 -83948 -54784
24098e4784J47742J44447j52890j29548j1990P768N6960J19435o3478p6804R3574
$$ -54784 92958 237405 84515 -45033 -57023 -49255 7705 127140 63662 -13142 80432
24087H0432O739m2306L8973j28641m7461P0647k9421J356l4980p3779P6860O803
$$ 80432 87171 44865 83838 -44803 -92264 -21617 -51038 -49682 -84662 -158441 -81581 -74778
24075g4778L4486j01817o2771J01821n343Q2834J0863O1259q4213q6583l4636
$$ -74778 -40292 -142109 -204880 -103059 -108402 -25568 -14705 46554 -37659 -124242 -158878
24064a58878J08990J03022n1968j17991l1890O2836k1324O036N0665N5265o4424
$$ -158878 -49888 53134 1166 -116825 -148715 -85879 -107203 -101167 -50502 4763 -59661
24053e9661J04091q5357J00538J38520P7729Q839j21030j25389m9627M7108j2265
$$ -59661 44430 -40927 59611 198131 275860 284699 163669 38280 -11347 35761 23496
24042B3496J41266J6111l9886j4426L4012j2954j17372R206r1186j14933J56509
$$ 23496 164762 180873 140987 126561 160573 147619 30247 39453 -51733 -166666 -10157
24031a0157q5713M142L4785N0387M7050q0718m0343p8572R8295O2067J86268L8162
$$ -10157 -95870 -91728 -56943 -6556 40494 -40224 -80567 -159139 -60844 1223 187491 225653
24019B25653r7585j0700j30425P3788j0836r8643k9452J17545q6082q2489N0963
$$ 225653 128068 117368 -13057 60731 49895 -48748 -78200 39345 -46737 -129226 -78263
24008g8263P6190P6373N3798K04394o7548j80126K0831M3049m1623J3879O6967
$$ -78263 -2073 74300 128098 332492 264944 84818 105649 148698 107075 120954 187921
23997A87921j51667M07J26691K1273o0445L4441P9348M5046Q709m4186k09028
$$ 187921 36254 36661 163352 184625 124180 158621 237969 283015 291724 247538 38510
23986C8510p1905k5030L2694m9156M7565k4512r5229J24012l5055q5995k79236
$$ 38510 -33395 -58425 -25731 -74887 -27322 -51834 -147063 -23051 -58106 -144101 -423337
23975d23337n0319R9908R194K10060J85892k987q1287k7719J46584j1383O5777
$$ -423337 -473656 -373748 -364554 -154494 31398 28411 -52876 -80595 65989 54606 120383
23964A20383Q327j01852l9337j9896N2008J42373K5616n8984L8594r010J2066
$$ 120383 128710 26858 -12479 -32375 19633 162006 187622 128638 167232 158222 170288
23953A70288q0976k48997j04013O76K09719J76337P6005Q4272Q4774m5305o5097
$$ 170288 89312 -159685 -263698 -263022 -53303 123034 199039 283311 368085 322780 257683
23942B57683j81017j34312K3385J24076O4121l3587j17442l0419P2938k0448p8395
$$ 257683 76666 -57646 -34261 89815 153936 120349 2907 -27512 45426 24978 -53417
23931e3417k4805k9247K6471Q1656r031k844j58150k0435k1434p367K3410J19801
$$ -53417 -78222 -107469 -80998 658 -8373 -11217 -169367 -189802 -211236 -218603 -195193 -75392
23919g5392J20755J74685k8356m2289k7515n6887P3587Q9068j69293m0342K01367
$$ -75392 45363 220048 191692 149403 121888 65001 138588 227656 58363 18021 219388
23908B19388l1325j00379k3307M0041J2870r9093p2336j60m5724Q5491N9358p1477
$$ 219388 188063 87684 64377 104418 117288 18195 -54141 -54301 -100025 -14534 44824 -26653
23896b6653p2574M3443L8415j40943p1645J70223P3284O959P1389J66846L4144
$$ -26653 -99227 -55784 -17369 -158312 -229957 -59734 13550 20509 91898 258744 292888
23885B92888k82538j27095O8880K42329R0889q7210j23887l2571P3409n9451j01586
$$ 292888 10350 -116745 -47865 194464 285353 198143 74256 41685 115094 55643 -45943
23874d5943Q654O9695l0171J1040m8501r096l9693n931K7090j2052O7406M822
$$ -45943 -37289 32406 2235 13275 -35226 -44322 -84015 -89946 -62856 -74908 -7502 -2680
23862b680J0097P5188K1j7753j8371Q886j0098N1438P3016P5482O564j40251p9424
$$ -2680 7417 82605 82626 64873 46502 55388 45290 96728 169744 245226 251790 111539 32115
23849C2115j41075N568J71010M4953p2907n9657J23992R1267p1483k8794q4569
$$ 32115 -108960 -103392 67618 112571 39664 -19993 103999 195266 123783 94989 10420
23838A0420M6331J6320j08549K572o5673J6020r8538n2162J61410J05642j69621
$$ 10420 56751 73071 -35478 -32906 -98579 -82559 -181097 -233259 -71849 33793 -135828
23827a35828N7166J10500Q4945K1527m3442o7926n7450j24761n5511q386p671
$$ -135828 -78662 31838 116783 138310 94868 26942 -30508 -155269 -210780 -219166 -226837
23816b26837M9871Q3069O3625J07881o5886k12050J4628j9584r3139K9019O2519
$$ -226837 -176966 -93897 -30272 77609 11723 -200327 -185699 -205283 -298422 -269403 -206884
23805b06884N6107P9874J54173o4226O2414K0733Q10p0054k5010L7753n3414m3476
$$ -206884 -150777 -70903 83270 19044 81458 102191 103001 32947 7937 45690 -7724 -51200
23793e1200o6333m9552l263M4376p6175n5412M5650O2498J84347L2206q3721m257
$$ -51200 -117533 -167085 -170348 -125972 -202147 -257559 -211909 -149411 34936 67142 -16579 -20836
23781b0836K1872P7447J0457m7527j55434m5449O9860J69183M4778J9852O0543
$$ -20836 1036 78483 88940 41413 -114021 -159470 -89610 79573 124351 144203 204746
23770B04746m2244p0360P515M3240k1712k1254M951j3113o1559j4007r478P985
$$ 204746 162502 92142 99657 142897 121185 99931 104882 91769 30210 16203 6725 14710
23758A4710l7340m2287O1985J30111J7373k1050j01742n4654q8861r1609j7484
$$ 14710 -22630 -64917 -2932 127179 144552 123502 21760 -32894 -121755 -213364 -230848
23747b30848N9948J02050R7162O3148J5788p6942K020n4497k40498N4585K48034
$$ -230848 -170900 -68850 28312 91460 107248 30306 32326 -22171 -262669 -208084 39950
23736C9950M2784q4063N4921P7908m596j74934K8149J06047J29399J7214o2258
$$ 39950 82734 -1329 53592 131500 126904 -48030 -19881 86166 215565 232779 170521
23725A70521n2740n9483O429P8816J2069j7614j14606K4335O1480M8547J4498
$$ 170521 117781 58298 64727 143543 155612 137998 23392 47727 109207 157754 172252
23714A72252j39149m3552P4109l4185L7526k9490j1612M5095j16291j8762L1599
$$ 172252 33103 -10449 63660 29475 67001 37511 25899 70994 -45297 -64059 -32460
23703c2460k230O2209P7301J03963K1929m3681j49508j17267M0551J03767J01692
$$ -32460 -34690 27519 104820 208783 230712 187031 37523 -79744 -39193 64574 166266
23692A66266N6123q9247k10932k8210K12712J19939r0236j99584j29378j0446
$$ 166266 222389 133142 -77790 -106000 106712 226651 136415 -63169 -192547 -202993
23682b02993m340J56797k0194j18359M8171J80658O324j26387r9151p8204l5352
$$ -202993 -207333 -50536 -70730 -189089 -140918 39740 46064 -80323 -179474 -257678 -293030
23671b93030N1670P4547N3653J47075J68238k0346P1975r6496q1487j3600M952
$$ -293030 -241360 -166813 -113160 33915 202153 181807 253782 157286 75799 62199 67151
23660F7151K8810p3802n4201J5155m5809j0161p8755k9337r620j6727k1587J21320
$$ 67151 95961 22159 -32042 -16887 -62696 -72857 -151612 -180949 -190569 -207296 -228883 -107563
23648a07563M9928L0703J06794Q7997J45918j4749j80468j60993q0638J4921K7206
$$ -107563 -57635 -26932 79862 167859 313777 299028 118560 -42433 -123071 -108150 -80944
23637h0944N9998J74158L5967o1988m6547m946Q7642L7907n7929p3513k7235J05276
$$ -80944 -20946 153212 189179 127191 80644 75698 163340 201247 143318 69805 42570 147846
23625A47846P0282o3211q1009k2688J41776J2150j10651r8978r1982R3298L8604
$$ 147846 218128 154917 73908 51220 192996 205146 94495 -4483 -96465 -3167 35437
23614C5437M2568L9828m2406M83n7378k6920J8178j4113o9048q8934r60N3100
$$ 35437 78005 117833 75427 75910 18532 -8388 9790 -4323 -73371 -162305 -163265 -110165
23602a10165Q9826K08795R4429J31854N1797j38311o908Q48M0424Q2189K99316
$$ -110165 -20339 188456 282885 414739 466536 328225 321317 322165 362589 444778 744094
23591G44094L45618K84129L21667L84271M01841K65785J45306j91973k12996j31215
$$ 744094 1089712 1373841 1695508 2079779 2481620 2747405 2892711 2700738 2487742 2356527
23581B356527r6249l20642n02707k81809k65714k89415j53485M960o4853j47204
$$ 2356527 2260278 1939636 1436929 1155120 889406 599991 446506 451466 386613 239409
23571B39409O3341J37947P1442P51o1085p0207k7644j13705j50202l1702n7281
$$ 239409 302750 440697 512139 512890 451805 381598 353954 240249 90047 58345 1064
23560A064N0642P4088l040P4632j19421q1098J9235J09554M9277p1742L8904N1759
$$ 1064 51706 125794 122754 197386 77965 -3133 16102 125656 174933 103191 142095 193854
23548A93854j06632K8481J65491P8210j76959l6876k14248l9869O8547J26389
$$ 193854 87222 115703 281194 359404 182445 145569 -68679 -108548 -40001 86388
23538H6388J36111J767J8633k4513n1701k0700K6110j0148p9380k4049m7054p9199
$$ 86388 222499 224266 242899 218386 166685 145985 172095 161947 82567 58518 11464 -67735
23526f7735k6521J18689O9450J6722J75065J14722j83828p1399O1385P9584M2788
$$ -67735 -94256 24433 93883 110605 285670 400392 216564 145165 206550 286134 328922
23515C28922n801m4298k00218j8423R0656j25779l6545Q8726J16218n6860p9690
$$ 328922 323121 278823 78605 60182 150838 25059 -11486 77240 193458 136598 56908
23504E6908J11450N9944L2531J08464N2926P7919r2560r9283N4926M7623R050
$$ 56908 168358 228302 260833 369297 422223 500142 407582 308299 363225 410848 419898
23493D19898p3772J4876R650j04927Q020j11747n3381j1176O4249Q3824p2955
$$ 419898 346126 361002 370652 265725 273745 161998 108617 97441 161690 245514 172559
23482A72559j20869k1906q121O4293M4199O5605Q7611o8480j9130o1803j53003
$$ 172559 51690 29784 21663 85956 130155 195760 283371 214891 195761 133958 -19045
23471a9045j6507J3032J02245m8498l4782N4947J9402K4847N1309o3786J6311
$$ -19045 -35552 -22520 79725 31227 -3555 51392 70794 95641 146950 83164 99475
23460I9475q216Q6097M9385K5379k4389L665k9482j662K9700R2198j00234j53264
$$ 99475 91259 177356 226741 252120 227731 231396 201914 200252 229952 322150 221916 68652
23448F8652o147J52895L8696k61459j52283J59240O2446O9801J21468J19833m6618
$$ 68652 62505 215400 254096 -7363 -159646 -406 62040 131841 253309 373142 326524
23437C26524k16034n8403M4187N9354p5677l426K5286j29803J6674N6559j46631
$$ 326524 110490 52087 96274 155628 79951 76525 101811 -27992 -11318 45241 -101390
23426a01390m8692P8428M146p2835P1995M3684o395k4741l3147O7913N3718p6712
$$ -101390 -150082 -71654 -67508 -140343 -68348 -24664 -31059 -55800 -88947 -21034 32684 -44028
23414d4028K9492P5454m6513q2474N2776m0473o2742M5820P0313N5453m7765K1990
$$ -44028 -14536 60918 14405 -68069 -15293 -55766 -118508 -72688 -2375 53078 5313 27303
23402B7303N0286K56659N7587q8418k89099O554J21618p6610j9391O1139K12851
$$ 27303 77589 334248 391835 303417 14318 20872 142490 65880 46489 107628 320479
23391C20479m9020r1748J2382J25355K7158N3260r3231j55346O190p6484k1444
$$ 320479 271459 179711 192093 317448 344606 397866 304635 149289 155479 78995 57551
23380E7551l7968J7828J54948M2358j11252m2285J8120j7662K8170N8859R423
$$ 57551 19583 37411 192359 234717 123465 81180 99300 81638 109808 168667 178090
23369A78090L7185m9950q2280n3775J72696J9190r3610K7707Q1121R7334J98296
$$ 178090 215275 165325 83045 29270 201966 221156 127546 155253 236374 333708 532004
23358E32004J50257K1299r0047q7161j1149n6652j45926o5070J04278j05884K9594
$$ 532004 682261 703560 613513 526352 515203 458551 312625 247555 351833 245949 275543
23347B75543Q8646P786j6093k6989l986l5300j0143q3335p8944r5614J94694N6787
$$ 275543 364189 371975 355882 328893 324907 289607 279464 196129 117185 21571 216265 273052
23335B73052n6110L6951k7094j26914p017l2205n6722m7576M9918K8333r813o408
$$ 273052 216942 253893 226799 99885 92868 60663 3941 -43635 6283 34616 24803 18395
23323A8395l8028m7252L6029J62639R2807r803j51293Q6636M4726O2035Q8101
$$ 18395 -19633 -66885 -30856 131783 224590 214787 63494 150130 194856 256891 344992
23312C44992j40370M4433J8797n0322j06952l7676M7075m6791J23343M8579r8892
$$ 344992 204622 249055 267852 217530 110578 72902 119977 73186 196529 245108 146216
23301A46216j35232r2398J2027l2162P4219Q1558o5308J5708k515K850M9509J25512
$$ 146216 10984 -81414 -69387 -101549 -27330 54228 -11080 4628 2113 4963 54472 179984
23289A79984M3085j7552K5069q9760R2441M2539J2540K7860l3319l9866N3267
$$ 179984 223069 205517 230586 140826 233267 275806 288346 316206 282887 243021 296288
23278B96288l9693K2673m6598N6303Q3510P7095P1990Q8937M6759P6106Q0924
$$ 296288 256595 279268 232670 288973 372483 449578 521568 610505 657264 733370 814294
23267H14294r0601J0187j04158j30964o7196k7936K0382k10194N370K6241n3026
$$ 814294 723693 733880 629722 498758 431562 403626 424008 213814 219184 245425 192399
23256A92399O0896P5830J3295L9027K2077K0651N3567L941j65935J767m2634M8664
$$ 192399 253295 329125 342420 381447 403524 424175 477742 481683 315748 317515 274881 323545
23244C23545n6561r8013o3831j80913L2423K59907N789j39092j47346J17714J89391
$$ 323545 266984 168971 105140 -75773 -43350 216557 222346 83254 -64092 53622 243013
23233B43013N1990j10240o4832j05744J54665J02424p5636P7394J73820j52987
$$ 243013 295003 184763 119931 14187 168852 271276 195640 273034 446854 293867
23223B93867m0063j066J12567P1349j1139o590j26750K3482m0264L4609R7200
$$ 293867 253804 252738 365305 436654 425515 418925 292175 315657 275393 310002 407202
23212D07202P8488j54813p4369K0142n319O871J56760j1781l0864l3160j27235
$$ 407202 485690 330877 256508 276650 271331 278202 434962 423181 392317 359157 231922
23201B31922L8069L90j56318N190J20251L2205m0351r5391k8705J01665J44894
$$ 231922 269991 270381 114063 119253 239504 271709 231358 135967 107262 208927 353821
23190C53821o5309j6831L9411J0319j20344J11773J9537j78641n7342J49441L5427
$$ 353821 288512 271681 311092 321411 201067 312840 332377 153736 96394 245835 281262
23179B81262j9779M467Q0089o2395j53376J5388J21663Q7825M1150O0713k209
$$ 281262 261483 265950 346039 283644 130268 145656 267319 355144 396294 457007 454798
23168D54798K863k4030j55552p6780J08374J71741M4585j32701j06693J43363
$$ 454798 457661 433631 278079 201299 309673 481414 525999 393298 286605 429968
23158D29968M1825J12894J18522Q3420K3816q3204p3681J80431K26993J35802
$$ 429968 471793 584687 703209 786629 810445 727241 653560 833991 1060984 1196786
23148A196786K59897n0290j75785j03807J6233K12010K6697l71415k49611j2103
$$ 1196786 1456683 1406393 1230608 1126801 1143034 1355044 1381741 1010326 760715 748612
23138G48612O783J30553o393K3795J37244R3811k3740N0625Q4965j14129n4769
$$ 748612 755395 885948 879555 903350 1040594 1134405 1110665 1161290 1246255 1132126 1077357
23127A077357j89245j24646n3081L7539J0283L55l1747O0499J66168P3103J69050
$$ 1077357 888112 763466 710385 747924 758207 758562 726815 787314 953482 1026585 1195635
23116A195635l2149j07727j00908j296L4387J19096j10408q0381N4775l3946n820
$$ 1195635 1163486 1055759 954851 953555 987942 1107038 996630 916249 971024 937078 931258
23105I31258K9120M1734J69689J55488J53594M4057R5498L57112L21666J46103
$$ 931258 960378 1002112 1171801 1327289 1480883 1524940 1620438 1977550 2299216 2445319
23095B445319J96163K70021M88270L89089O5815j79609k36617p4402j29672m42691
$$ 2445319 2641482 2911503 3399773 3788862 3854677 3675068 3438451 3364049 3234377 2791686
23085B791686m42463l70407j92069j10500J05053N6236j6226n9466K0950J68395
$$ 2791686 2349223 1978816 1786747 1676247 1781300 1837536 1821310 1761844 1782794 1951189
23075A951189J91800J55144n9604K6041L5407j7326K9354O2002l4672K591J45833
$$ 1951189 2142989 2298133 2238529 2264570 2299977 2282651 2312005 2374007 2339335 2341926 2487759
23064B487759J16644K1591J46301K02738K0256K8355N8348Q2906J28281J92429
$$ 2487759 2604403 2625994 2772295 2975033 2995289 3023644 3081992 3164898 3293179 3485608
23054C485608K44100J6043K04039K11011J63872J48382J30488L44673N36619N15206
$$ 3485608 3729708 3745751 3949790 4160801 4324673 4473055 4603543 4948216 5484835 6000041
23044F000041M71882O86234O98661O88691P78864J155498J434123J673430K078401
$$ 6000041 6471923 7158157 7856818 8545509 9324373 10479871 11913994 13587424 15665825
23035A5665825K562067L070074L947872N045669O633398R659841J4710961K3297980
$$ 15665825 18227892 21297966 25245838 30291507 36924905 46584746 61295707 84593687
23027H4593687L6832773N0530141N2040815M3954622N0598551P3701165Q0190397
$$ 84593687 121426460 171956601 223997416 267952038 318550589 392251754 472442151
23020D72442151L4534889l2219603m4798711j3388009n046453m1880026q3255368
$$ 472442151 506977040 474757437 429958726 416570717 411524264 369644238 286388870
23013B86388870p9547249n0717706l1485753k1106140j5021844j1035404q240016
$$ 286388870 206841621 156123915 124638162 103532022 88510178 77474774 69234758
23006F9234758o400740n278210m385218l613558l209671k730216k207763j773600
$$ 69234758 62834018 57555808 53170590 49557032 46347361 43617145 41409382 39635782
22998C9635782j758166j674384j666310j497828j296487j183698j200794j242234
$$ 39635782 37877616 36203232 34536922 33039094 31742607 30558909 29358115 28115881
22990B8115881j281431j153533j169822j075040r54006r08100r06123r27243r39834
$$ 28115881 26834450 25680917 24511095 23436055 22482049 21573949 20667826 19740583 18800749
22981A8800749p56037p54386n55860m32703n96629n94359m12231l88997l97997
$$ 18800749 18044712 17290326 16734466 16301763 15705134 15110775 14698544 14309547 13911550
22972A3911550m09320k02625l07388j73673j95772m73893m73686k67368l63954
$$ 13911550 13502230 13299605 12992217 12818544 12622772 12148879 11675193 11407825 11043871
22963A1043871k70858l20335l73132j56371j07031k45311k43618l13614j19635
$$ 11043871 10773013 10452678 10079546 9923175 9816144 9570833 9327215 9013601 8893966
22954H893966L5252j4475M111m1988L2903K40212K45597n0523m75538m00060j37529
$$ 8893966 8929218 8914743 8918854 8876866 8909769 9149981 9395578 9345055 8869517 8469457 8331928
22943H331928k31871l10017m43799l67521m74458m09495k58776p4265l5765K4994
$$ 8331928 8100057 7790040 7346241 6978720 6504262 6094767 5835991 5761726 5725961 5750955
22933E750955m8621k1879j70386k33749k21827j09931j22980l61453k02293k64849
$$ 5750955 5702334 5680455 5510069 5276320 5054493 4944562 4821582 4460129 4257836 3992987
22923C992987j82239j74233j18092L5052j1592j75311j56646j49018R5126M6200
$$ 3992987 3810748 3636515 3518423 3553475 3541883 3366572 3209926 3060908 3156034 3202234
22913C202234o5404j19671L9979P421o9342m996R6873J4907j56159n0367m8015
$$ 3202234 3136830 3017159 3057138 3064559 2995217 2990221 3087094 3102001 2945842 2895475 2847460
22902B847460m7274l1614j06922j85915k55328q1801J45177L6521j79568k37186
$$ 2847460 2800186 2768572 2661650 2475735 2220407 2138606 2283783 2320304 2140736 1903550
22892A903550j59307j2943o357k5044j70394k56693j11972q0667J6764p0929m6906
$$ 1903550 1744243 1731300 1724943 1699899 1529505 1272812 1160840 1080173 1096937 1026008 979102
22881I79102q0231j36605R9310O8774j03371r8410p5554N628p7976O7945j25620
$$ 979102 898871 762266 861576 930350 826979 728569 653015 658643 580667 648612 522992
22870E22992r1669L622n467K5990p3017m2104j34614j39758J86221P5245J7461
$$ 522992 431323 434945 429478 455468 382451 340347 205733 65975 252196 327441 344902
22859C44902L7823l1784o8428O80L1600N198n368K6550J67546N1049N9952n3613
$$ 344902 382725 350941 282513 283193 314793 319991 314623 341173 508719 559768 619720 566107
22847E66107k2546l1793K3773K2117j27291j72534O9754k190j1679J7685N7568
$$ 566107 543561 511768 535541 557658 430367 257833 327587 325397 313718 331403 388971
22836C88971j1546j3481M0001n3499p1922Q6807N9242k1231j12839o1939K0515
$$ 388971 377425 363944 403945 350446 278524 365331 424573 403342 290503 228564 249079
22825B49079L5009P0136L235n488m0044j41554j68410O9582J54119J57967J08979
$$ 249079 284088 354224 357459 351971 311927 170373 1963 71545 225664 383631 492610
22814D92610K7608J7622J3362q8780L5406L2065j03876j58980p5925n2628P1246
$$ 492610 520218 537840 551202 462422 497828 529893 426017 267037 191112 138484 209730
22803B09730l7899K1796P1861J51336K5065p4818k48113j26202K7456P0883p704
$$ 209730 171831 193627 265488 416824 441889 367071 118958 -7244 20212 91095 83391
22792H3391l3804l1561p5483J325P0073K01199J6124j17765J36480L5355n717
$$ 83391 49587 18026 -57457 -56132 13941 215140 231264 113499 249979 285334 279617
22781B79617j52101k11782R9983J12873M5357l21J18018j7949M1902K486j83795
$$ 279617 127516 -84266 15717 128590 173947 173626 291644 273695 315597 318083 134288
22770A34288N674N6488o3534o3395O632p4408k7687J33285k5031k0797m9655p596
$$ 134288 139962 196450 132916 69521 76153 1745 -25942 107343 82312 61515 11860 4264
22758D264O589Q0958P8199q628j9329o3406n3628O8296P4921P8462Q5804J8972
$$ 4264 10853 91811 170010 161382 142053 78647 25019 93315 168236 246698 332502 351474
22746C51474p9899j46258n4218O0672k8860M0356p788J2620j08017J4667R8449
$$ 351474 271575 125317 71099 131771 102911 143267 135479 148099 40082 54749 153198
22735A53198l1583k0349j683Q8848r9252j51676O0097O4309M3979j3061O1890
$$ 153198 121615 101266 99583 188431 89179 -62497 -2400 61909 105888 92827 154717
22724A54717L4492o1341n0239m3597J2233N71P7541M2483m4102N9857p3216o936
$$ 154717 189209 127868 77629 34032 46265 46836 124377 166860 122758 182615 109399 102463
22712A02463m327l21473r6355J71302K1070J54267k8605n8432O625N693l8648
$$ 102463 98136 -223337 -319692 -148390 -127320 26947 -1658 -60090 -53465 -47772 -86420
22701h6420m7007M8464J07253m083j44378j55124k0270l4623J00184J75132O8174
$$ -86420 -133427 -84963 22290 18207 -126171 -281295 -301565 -336188 -236004 -60872 7302
22690G302J8105j4999j12536K2632K1441l1842K4559p3571K2698J63637Q0258
$$ 7302 25407 10408 -102128 -79496 -58055 -89897 -65338 -138909 -116211 47426 127684
22679A27684R475n9895r7580j05305R1421P8159m4284n7808p8279K166q6699n0505
$$ 127684 137159 77264 -20316 -125621 -34200 43959 -325 -58133 -136412 -134246 -220945 -271450
22667b71450J35058J07129L3273l1369P7157r6799j67753n1195Q5081R5758J76468
$$ -271450 -136392 -29263 4010 -27359 49798 -47001 -214754 -265949 -180868 -85110 91358
22656I1358n0499o0315j70610O5715O7533r5595O5782J29586q611q2849j83059
$$ 91358 40859 -19456 -190066 -124351 -56818 -152413 -86631 42955 34344 -48505 -231564
22645b31564N0849J22487L8179o6068j0066J24904k7896o9931o729q445m5744
$$ -231564 -180715 -58228 -20049 -86117 -96183 28721 825 -69106 -75835 -84280 -130024
22634a30024k2123Q1734R2547n890k5361L2702R5798N0945o3127r2881j61038
$$ -130024 -152147 -70413 22134 16244 -9117 23585 119383 170328 107201 14320 -146718
22623a46718J33590l1442j6132J8560N7339K0326N1484m8384j00734L1171o457
$$ -146718 -13128 -44570 -60702 -42142 15197 35523 87007 38623 -62111 -30940 -37397
22612c7397J64202J15226j02678j03929j3721j1081J8568O2444m2703p9076j57344
$$ -37397 126805 242031 139353 35424 21703 10622 29190 91634 48931 -30145 -187489
22601a87489J0117j2709O198N5871J56278q932N9433K3321j4682j34246M2451
$$ -187489 -177372 -190081 -183883 -128012 28266 19334 78767 102088 87406 -46840 -4389
22590d389M8773L7231O1807p5302P970P0101R456p8258l6200j89N2345P9721l8837
$$ -4389 44384 81615 143422 68120 76090 146191 155647 77389 41189 41000 93345 173066 134229
22577A34229l7427n9124K104m9299L7876K13209N0907l1520R3571o0245O5203
$$ 134229 96802 37678 39782 -9517 28359 241568 292475 260955 354526 294281 359484
22566C59484m8045o4829m0410j07189j22255K721o9132L1391j7823o5154P3429
$$ 359484 311439 246610 206200 99011 -23244 -20523 -89655 -58264 -76087 -141241 -67812
22555f7812J1568M6567N8185j18246p9030J2903O7465j3052q0227m8040J46643
$$ -67812 -56244 -9677 48508 -69738 -148768 -135865 -68400 -81452 -161679 -209719 -63076
22544f3076K08950J13421r3410j48109j28345l0226k1108M1177m56J3316p7261
$$ -63076 145874 259295 165885 17776 -110569 -140795 -161903 -120726 -121182 -107866 -185127
22533a85127p5236J22587N8353n3435q0187P0712j1639M14k0915j0551L398J02539
$$ -185127 -260363 -137776 -79423 -132858 -213045 -142333 -153972 -153558 -174473 -185024 -181626 -79087
22521g9087J20528n5832m3507P7820P0271N7815q3444j11956r8467N3664J04433
$$ -79087 41441 -14391 -57898 19922 90193 148008 64564 -47392 -145859 -92195 12238
22510A2238o9791n6503k4818n7406m5450j459J6746N1466J93106K11465k4586
$$ 12238 -57553 -114056 -138874 -196280 -241730 -243189 -226443 -174977 18129 229594 205008
22499B05008q3384k4469M515q021j67914p9168R1106P3526p870N5739K8689o9001
$$ 205008 121624 97155 101670 93649 -74265 -153433 -62327 11199 3329 59068 87757 18756
22487A8756m4902p1449J376Q4300K0017r6496M62N0192q6437m4851R0073L7450
$$ 18756 -26146 -97595 -96219 -11919 8098 -88398 -87936 -37744 -124181 -169032 -78959 -41509
22475d1509J37425L3993j08826l0706Q2026p7046j18852Q0314M9204l9610m2797
$$ -41509 95916 129909 21083 -9623 72403 -4643 -123495 -43181 6023 -33587 -76384
22464g6384J25827J24614R1694m3846j19369j6578N9634J12402m66R136K13349
$$ -76384 49443 174057 265751 221905 102536 85958 145592 257994 257528 266664 480013
22453D80013O9918P9665L42070K65976J62197K26760M45267M52462J89580j78618
$$ 480013 549931 629596 971666 1237642 1399839 1626599 2071866 2524328 2713908 2535290
22443B535290k37972p5738j23044k07686l49237l41846k58920r1882k63093j54837
$$ 2535290 2297318 2221580 2098536 1890850 1541613 1199767 940847 848965 585872 431035
22433D31035k8027k683p7802j01302q7027q5292J00667J67987R960o3707J1948
$$ 431035 403008 400325 322523 221221 134194 48902 149569 317556 327516 263809 275757
22422B75757R5364j92211j60010j3092O9167l3290J21688L3665n1979P7539K37753
$$ 275757 371121 178910 18900 5808 74975 41685 163373 197038 145059 222598 460351
22411D60351p8859k9853m104p6073M3463p4133k30816k383L531l8423k2597j17590
$$ 460351 381492 351639 347535 271462 314925 240792 9976 7593 11124 -27299 -49896 -167486
22399a67486J4910K15978N2600O6524J08676p2871j75073q291P2132O6124K3834
$$ -167486 -152576 63402 116002 182526 291202 218331 43258 34967 107099 173223 197057
22388A97057P4856K8607N3812o9571j68271j17475K8230k6141J408L1858j49300
$$ 197057 271913 300520 354332 284761 116490 -985 27245 1104 2512 34370 -114930
22377a14930m9900J29075R3166P8009J5645r2540m0238m1835r7828j20918K6979
$$ -114930 -164830 -35755 57411 135420 151065 58525 18287 -23548 -121376 -242294 -215315
22366b15315m8165k4628m7752P3007K30829J21691P9850L4980r5929j80494o797
$$ -215315 -263480 -288108 -335860 -262853 -32024 89667 169517 204497 108568 -71926 -78723
22355g8723J37509Q8548m6004o2911m2874j10922o1428l814Q061R6504J06876
$$ -78723 58786 147334 101330 38419 -4455 -115377 -176805 -180619 -172558 -76054 30822
22344C0822m9406o6091L0815M864p4961J20681r736j26876P4463J19871L6239
$$ 30822 -18584 -84675 -53860 -48996 -123957 -3276 -13012 -139888 -65425 54446 90685
22333I0685r9234N6743K0917l5662N0357j9909j80625L5243J39309M7440o3240
$$ 90685 -8549 48194 69111 33449 83806 63897 -116728 -81485 57824 105264 42024
22322D2024K9065M9624j13039j253N4796n2687r2936r3352L912N9082J30268k443
$$ 42024 71089 120713 7674 6421 61217 8530 -84406 -177758 -173846 -114764 15504 13061
22310A3061j11059k7036Q7819J05055n4687r4684Q1033O124k1472L0899J48110
$$ 13061 -97998 -125034 -37215 67840 13153 -81531 -498 5626 -15846 15053 163163
22299A63163L3044j70988n0069j8393J41105p0933m1105L4018K2058k6734l953
$$ 163163 196207 25219 -24850 -43243 97862 26929 -14176 19842 41900 15166 11213
22288A1213l5869j63946j8817R1530K5342l3937N4078J33911l5188m385N6481
$$ 11213 -24656 -188602 -207419 -115889 -90547 -124484 -70406 63505 28317 23932 80413
22277H0413Q250J23754j09269q0385l6111q2952J11243J4375q3706j07223K0244
$$ 80413 88663 212417 103148 22763 -13348 -96300 14943 29318 -54388 -161611 -141367
22266a41367K8034m332P3709K6829P2484j17740k126J857O3169j8014o4910p8708
$$ -141367 -113333 -117665 -43956 -17127 55357 -62383 -64509 -62652 517 -17497 -82407 -161115
22254a61115k0471M8389J32369K5514l3069o0135r0385J3986Q5753N3521j13147
$$ -161115 -181586 -133197 -828 24686 -8383 -68518 -158903 -144917 -59164 -5643 -118790
22243a18790j31042m1977K3733J33373J21872j2852L5927R2853R9279q3638q725
$$ -118790 -249832 -291809 -268076 -134703 -12831 -25683 10244 103097 202376 118738 110013
22232A10013l3413m0435l3162K9855P3396j6009L8269q90J27017p7321k10384
$$ 110013 76600 36165 3003 32858 106254 90245 128514 127624 254641 177320 -33064
22221c3064r4785N226n1625J05514Q1982o519o0927j17041n8659J0694K7183L5103
$$ -33064 -127849 -122623 -174248 -68734 13248 6729 -54198 -171239 -229898 -219204 -192021 -156918
22209a56918l985O6133M4544L6290j18944K6835K7982l3350m3209M9286O5822
$$ -156918 -160903 -94770 -50226 -13936 -132880 -106045 -78063 -111413 -154622 -105336 -39514
22198c9514J75729j11495k76482o0517J6045O8397J48305J54740O7080j20267
$$ -39514 136215 24720 -251762 -312279 -296234 -227837 -79532 75208 142288 22021
22188B2021j01523J5956K4090l9165p352Q5230Q5943j3518j21226q7457l7868
$$ 22021 -79502 -63546 -39456 -78621 -85973 -743 85200 71682 -49544 -137001 -174869
22177a74869j5955M6034J04296j29255p7390J84450J22974k8268K241M3367j08645
$$ -174869 -190824 -144790 -40494 -169749 -247139 -62689 60285 32017 34258 77625 -31020
22166c1020m9144q1927O6852J33971M3707R8199j22719M3096P7498J8308N166
$$ -31020 -80164 -162091 -95239 38732 82439 180638 57919 101015 178513 196821 201987
22155B01987p0068j51246R263j0977n2275o7422Q7950O3243q5531J4152Q8759
$$ 201987 131919 -19327 -10064 -21041 -73316 -140738 -52788 10455 -75076 -60924 27835
22144B7835R3920N383n1154j17390o2039o5039O3994Q2292P0674m025m8261R4352
$$ 27835 121755 127138 75984 -41406 -103445 -168484 -104490 -22198 48476 44451 -3810 90542
22132I0542q5491j13224j9560P9609N6524j21177O9041n994j02940R8567J07902
$$ 90542 5051 -108173 -127733 -48124 8400 -112777 -43736 -49730 -152670 -54103 53799
22121E3799p8593p9782Q8391N951l1359r7171P1012M0814J7078m9725r7815P4467
$$ 53799 -24794 -104576 -16185 -10234 -41593 -138764 -67752 -26938 -9860 -59585 -157400 -82933
22109h2933M9682o3061J3454J30533j4674p1767k1427N4541j7053j69202N821
$$ -82933 -33251 -96312 -82858 47675 33001 -38766 -60193 -5652 -22705 -191907 -186086
22098a86086J80361Q8418K1856j0003j29814J659m7611l788L7567m7538m3193
$$ -186086 -5725 82693 104549 94546 -35268 -33609 -81220 -85008 -47441 -94979 -138172
22087a38172l885L1642K2143J03916q8345o2134p4733m0945J14649J06755J20435
$$ -138172 -142057 -110415 -88272 15644 -72701 -134835 -209568 -250513 -135864 -29109 91326
22076I1326O638l8237J00014L5384j48566Q5724L2142Q746l8320j38998J3000
$$ 91326 97964 59727 159741 195125 46559 132283 164425 173171 134851 -4147 8853
22065H853o173n6668j3073J4129J07582k1123N8076j7107j3796o4624j52347k9097
$$ 8853 2680 -53988 -67061 -52932 54650 33527 91603 74496 60700 -3924 -156271 -185368
22053a85368J90450J5323J01592P0808M353o0204L145J6060l2767j67936n7576
$$ -185368 5082 20405 121997 192805 197158 136954 140099 156159 123392 -44544 -102120
22042a02120n4606K6067P6293k7838r3322J43774J22688n1078l3544N6121q3328
$$ -102120 -156726 -130659 -54366 -82204 -175526 -31752 90936 39858 6314 62435 -20893
22031b0893k6574R3341L3893M5764k0790M1397j78901j5466l5989K4279n3507
$$ -20893 -47467 45874 79767 125531 104741 146138 -32763 -48229 -84218 -59939 -113446
22020a13446J78108J27434l5114o3291J2671j5196P3722n0752J9387M5169j03179
$$ -113446 64662 192096 156982 93691 106362 91166 164888 114136 133523 178692 75513
22009G5513j24530n9934P998J9350m3859l8431j20664P9136M9845N6895l919O2458
$$ 75513 -49017 -108951 -100953 -81603 -125462 -163893 -284557 -205421 -155576 -98681 -102600 -40142
21997d0142q489j32291j5804J32068R4352J24303L2239m4289j11613J05813J21292
$$ -40142 -48631 -180922 -196726 -64658 29694 153997 186236 141947 30334 136147 257439
21986B57439k3676j44706j35458j42620Q0849R6736j8387k0804K3675J47461J11568
$$ 257439 233763 89057 -46401 -189021 -108172 -11436 -29823 -50627 -26952 120509 232077
21975B32077O0810n5462o4133j39587p4582L4354K33713J20698N2748J58149J0556
$$ 232077 292887 237425 173292 33705 -40877 -6523 227190 347888 400636 558785 569341
21964E69341R9524J28514K01229J90466R9311M8481j54676l53947j32621j83338
$$ 569341 668865 797379 998608 1189074 1288385 1336866 1182190 828243 695622 512284
21954E12284j80791q4717J14010j7850o4649n1922k7294M6954l2062l6688j02497
$$ 512284 331493 246776 360786 342936 278287 226365 199071 246025 213963 177275 74778
21943G4778J33722j6441j05472J2992L1136k2420Q4898R0123j20583N3872P4961
$$ 74778 208500 192059 86587 99579 130715 108295 193193 283316 162733 216605 291566
21932B91566j32918j32614J452J43959J06444k0554q2688j56210L9231l1082K1577
$$ 291566 158648 26034 27486 171445 277889 257335 174647 18437 57668 26586 48163
21921D8163n1577K4232P3313J42678J94449K47666K52486M494J0895K41864K58353
$$ 48163 -3414 20818 94131 236809 431258 678924 931410 935904 946799 1188663 1447016
21910A447016J63174j67910k74566l58047k30205K2171j60135k11968j50877m1338
$$ 1447016 1610190 1442280 1167714 809667 579462 601633 441498 229530 78653 37315
21900C7315J89459J55970K9951l6102j77132p6695o0283m1976R4041M4103l1158
$$ 37315 226774 382744 412695 376593 199461 122766 62483 20507 114548 158651 127493
21889A27493m3908K7500l9542j36312j6319K23339Q8913j50215k5275J11042j87946
$$ 127493 83585 111085 71543 -64769 -81088 142251 231164 80949 55674 166716 -21230
21878b1230j69951J07603J13718K3874k5576l7315N0015j55234m4907N1902J12757
$$ -21230 -191181 -83578 30140 54014 28438 -8877 41138 -114096 -159003 -107101 5656
21867E656N72N0102J6290L2577M5627r669j41378j33244p1666R2225N3827K1069
$$ 5656 6228 56330 72620 105197 150824 141155 -223 -133467 -205133 -112908 -59081 -38012
21855c8012J6573J07814L5579r0331j77257l6552K1890P5373J00154O6071O8576
$$ -38012 -21439 86375 121954 31623 -145634 -182186 -160296 -84923 15231 81302 149878
21844A49878J08906j5229j82468o6441l5961n4023K1664K10126P04p3711j10299
$$ 149878 258784 243555 61087 -5354 -41315 -95338 -73674 136452 137156 63445 -46854
21833d6854q8525J0758N6214J00589J4421L3797Q5357k53p2720R6207N5215j5373
$$ -46854 -135379 -124621 -68407 32182 46603 80400 165757 165504 92784 188991 244206 228833
21821B28833M2597n0849j75191j29609R0689N4509o4696q6839p8816j16272J12781
$$ 228833 271430 220581 45390 -84219 6470 60979 -3717 -90556 -169372 -285644 -172863
21810a72863J59782j185J948j36702l5980M1209P5513M9423j8717N4139n2194
$$ -172863 -13081 -14266 -12318 -149020 -185000 -143791 -68278 -18855 -37572 16567 -35627
21799c5627m2783p227Q3166J61140J45887j57784k01904P731j10986j13931n9150
$$ -35627 -78410 -85637 -2471 158669 304556 146772 -55132 -47401 -158387 -272318 -331468
21788c31468N8814P8829j559K5666O1594j1015J1772Q9646j12220k8331J37187
$$ -331468 -272654 -193825 -195384 -169718 -108124 -119139 -107367 -17721 -129941 -158272 -21085
21777b1085J47335k7024P1518j09783l2534m5628J87620o9398j58986j2465p6290
$$ -21085 126250 99226 170744 60961 28427 -17201 170419 101021 -57965 -70430 -146720
21766a46720J5804J65418N0902J1998N6855k1143o4267m3454L0625m8259n957
$$ -146720 -130916 34502 85404 97402 154257 133114 68847 25393 56018 7759 1802
21755A802o2679M5818j5696j1608m5734m1502M0935Q9926K7265l9307m2181q3196
$$ 1802 -60877 -15059 -30755 -42363 -88097 -129599 -88664 1262 28527 -10780 -52961 -136157
21743a36157p9695p282L7826N0445J0197M3898n9859L8976L9235P2189m4419j04102
$$ -136157 -215852 -223134 -185308 -134863 -124666 -80768 -140627 -101651 -62416 9773 -34646 -138748
21731a38748j12884o4978J3432J366O2694P6339o116j8293q3225K6889J01305
$$ -138748 -251632 -316610 -303178 -301812 -239118 -162779 -168895 -187188 -270413 -243524 -142219
21720a42219J13997m5276k0194P0322J022n4321j5119J64936k3582l8620l9779
$$ -142219 -28222 -73498 -93692 -23370 -22348 -76669 -91788 73148 49566 10946 -28833
21709b8833Q822J25272N5090q429Q340M5202L3745k73992j68572n4525J81028
$$ -28833 -20011 105261 160351 151922 160262 205464 239209 -34783 -203355 -257880 -76852
21698g6852J68155J04280p0388j17558K9881o8719o5820j76535J06954K97543
$$ -76852 91303 195583 125195 7637 37518 -31201 -97021 -273556 -166602 130941
21688A30941r9646j61741o5670J05351L4321L6567j48004r5002R0889J31462l7895
$$ 130941 31295 -130446 -196116 -90765 -56444 -19877 -167881 -262883 -171994 -40532 -78427
21677g8427k5307j53699M5746J14282l0988n6257q7598M6485k8915n3187j34200
$$ -78427 -103734 -257433 -211687 -97405 -128393 -184650 -272248 -225763 -254678 -307865 -442065
21666d42065K1866J24675J38767J02917K6529J44149n0269j28742k5300p9899
$$ -442065 -420199 -295524 -156757 -53840 -27311 116838 66569 -62173 -87473 -167372
21656a67372n522O2116O8750J17654k836l0710o7464j30347M1828L4255J12272
$$ -167372 -172894 -110778 -42028 75626 72790 42080 -25384 -155731 -113903 -79648 32624
21645C2624j06973R0134M9919j98366n7488j7069R1030k7939M7341q860o2443
$$ 32624 -74349 15785 65704 -132662 -190150 -207219 -116189 -144128 -96787 -105647 -168090
21634a68090R145j70303M4815J30666n225N9996J9301k7934J00273r604q6658
$$ -168090 -158945 -329248 -284433 -153767 -158992 -98996 -79695 -107629 -7356 -16960 -103618
21623a03618J4748J22727P2496m9764L6276P8699k3555N6784j79028o1926J9190
$$ -103618 -88870 33857 106353 56589 92865 171564 148009 204793 25765 -36161 -16971
21612a6971O0587m5466j5982j1737K002L5955r7922o6720L014L3895o9079m4642
$$ -16971 43616 -1850 -17832 -29569 -27567 8388 -89534 -156254 -153240 -119345 -188424 -233066
21600b33066o1025j3535Q4906P418L3200q827O5537N4747M5933q834o5000m0691
$$ -233066 -294091 -307626 -222720 -215302 -182102 -190929 -125392 -70645 -24712 -33546 -98546 -139237
21588a39237J22619P0659P9185j3090P2188k5210o2212j29807j233L4966L7361
$$ -139237 -16618 54041 133226 120136 192324 167114 104902 -24905 -26138 8828 46189
21577D6189j26736j60688l2659o8521N6532J46337R4973q6799K4243O4454L8458
$$ 46189 -80547 -241235 -273894 -342415 -285883 -139546 -44573 -131372 -107129 -42675 -4217
21566d217k07065R982m458j2671k8194M0256m6614J42965J55968J5063k8371j5342
$$ -4217 -211282 -201300 -205758 -218429 -246623 -206367 -252981 -110016 45952 61015 32644 17302
21554A7302J70126P398j37545J15379M3944j41287k16494k0010o5033j345L4772
$$ 17302 187428 194826 57281 172660 216604 75317 -141177 -161187 -226220 -227565 -192793
21543a92793j8427j847j06127J30423J73851L1599l0290j01935j822J37803K9742
$$ -192793 -211220 -213067 -319194 -188771 -14920 16679 -13611 -115546 -117368 20435 50177
21532E0177M9059O8574m3917l7975m9427j9131j6471o2858J5295k957l06j39060
$$ 50177 99236 167810 123893 85918 36491 17360 889 -61969 -46674 -49631 -49937 -188997
21520a88997P6862p262K3705P4362m6251J9038p6086J3941L8882O6190K4634l3581
$$ -188997 -112135 -119397 -95692 -21330 -67581 -48543 -124629 -110688 -71806 -5616 19018 -14563
21508a4563J42324M8159k4071J2055j554o9756j13807l3382m4006J17499L3296
$$ -14563 127761 175920 151849 163904 162350 92594 -21213 -54595 -98601 18898 52194
21497E2194P1862r100k00699j44247m8754P3454J39987J4499j6750P0987j494
$$ 52194 124056 114956 -85743 -229990 -278744 -205290 -65303 -50804 -67554 3433 1939
21486A939p4573n7978j09234j13192J37913K63080o7129j64988j4784o652N8394
$$ 1939 -72634 -130612 -239846 -353038 -215125 47955 -19174 -184162 -198946 -205598 -147204
21475a47204M5053P9885J08321j22867j17313n3207L5564J06873P7150l8092j07785
$$ -147204 -102151 -22266 86055 -36812 -154125 -207332 -171768 -64895 12255 -25837 -133622
21464a33622J84031M4586m1561r9576n1343J10980J3641p0100P8632L4120j18700
$$ -133622 50409 94995 53434 -46142 -97485 13495 27136 -42964 35668 69788 -48912
21453d8912l8093J01344M0770q0617l5838N04R287Q2272Q5229l3831k3688L4422
$$ -48912 -87005 14339 55109 -25508 -61346 -60842 -51555 30717 115946 82115 58427 92849
21441I2849j3630j15430m5529k7474r8192j4047O3700j2415L6030j08951P7817
$$ 92849 79219 -36211 -81740 -109214 -207406 -221453 -157753 -170168 -134138 -243089 -165272
21430a65272Q0375m9638p7111j3507J8125J508K3008m5047P1494R1668L4165J01575
$$ -165272 -84897 -134535 -211646 -225153 -207028 -205520 -182512 -227559 -156065 -64397 -30232 71343
21418G1343r7981M719m1166m2137l6354M3494J1502P164Q0694J9177P1320J08250
$$ 71343 -26638 -21919 -63085 -105222 -141576 -98082 -86580 -79416 1278 20455 91775 200025
21406B00025R0500n0259m2269q5643k39407p9102K10697M1122N836r8788j0927
$$ 200025 290525 240266 197997 112354 -127053 -206155 4542 45664 51500 -47288 -58215
21395e8215l0127j35754m1535M0311p6740q0443J92145J1844l1368O0983j7130
$$ -58215 -88342 -224096 -265631 -225320 -302060 -382503 -190358 -178514 -209882 -148899 -166029
21384a66029M390n979J1375Q5544R3158P6810o6301m7519q7174N117L6211K7121
$$ -166029 -161639 -167618 -156243 -70699 22459 99269 32968 -14551 -101725 -96608 -60397 -33276
21372c3276n6881o7339q6135Q8222N0102N4552k4736n748O5055o930r9551Q5705
$$ -33276 -90157 -157496 -243631 -155409 -105307 -50755 -75491 -81239 -16184 -23114 -122665 -36960
21360c6960j4225l2159k3890j57494l9181K9886J222o991J50794J63894p6292
$$ -36960 -51185 -83344 -107234 -264728 -303909 -274023 -272801 -279792 -128998 34896 -41396
21349d1396o4158n8918J44883Q8085j29056m4204R7335k9944j51533j78918J27029
$$ -41396 -105554 -164472 -19589 68496 -60560 -104764 -7429 -37373 -188906 -367824 -240795
21338b40795J45673M9690k6979P9925r302j26670M0442M2656j19045Q5105N2351
$$ -240795 -95122 -45432 -72411 7514 -1788 -128458 -88016 -45360 -164405 -79300 -26949
21327b6949M2766K3928J48206p8799j53089j05813R7097n5266k3668p7943K399
$$ -26949 15817 39745 187951 109152 -43937 -149750 -52653 -107919 -131587 -209530 -207131
21316b07131J12856J72541l9381k05509k750J12672Q357q2839O0055K6823J51852
$$ -207131 -94275 78266 38885 -166624 -169374 -56702 -48345 -131184 -71129 -44306 107546
21305A07546l6128j95143l7543K1258O8067N2513N8378N9486m68O3182k6585j29574
$$ 107546 71418 -123725 -161268 -140010 -71943 -19430 38948 98434 97966 161148 134563 4989
21293D989j36343j6884Q4470J01801N4198l090p5047p1474J47640p330o5506o0613
$$ 4989 -131354 -148238 -63768 38033 92231 89141 14094 -57380 90260 82930 17424 -43189
21281d3189J4817J06476J35884m9964j57654r5219p0380j12416J27628K19911
$$ -43189 -28372 78104 213988 164024 6370 -88849 -159229 -271645 -144017 75894
21271G5894l3078n8447L3571o4089k3352J5546N3317Q464K8842O3576n7026p5566
$$ 75894 42816 -15631 17940 -46149 -69501 -53955 -638 7826 36668 100244 43218 -32348
21259c2348p8665j01342J0349J85142q0210L6165J68106Q5104n9434n8599j64488
$$ -32348 -111013 -212355 -202006 -16864 -97074 -60909 107197 192301 132867 74268 -90220
21248i0220j23625L0622K3347O5541P7270n1840r3983q3293M6925J84812K9824
$$ -90220 -213845 -183223 -159876 -94335 -17065 -68905 -162888 -246181 -199256 -14444 15380
21237A5380k1221j11908j07784J09698J18484m7285o6511o9155M7743p0073k3502
$$ 15380 -5841 -117749 -225533 -115835 2649 -44636 -111147 -180302 -132559 -202632 -226134
21226b26134N2187J34726L9808n9329j6723J69549n8816k9843m2852l0281j37380
$$ -226134 -173947 -39221 587 -58742 -75465 94084 35268 5425 -37427 -67708 -205088
21215b05088k5133O2358J37426o9111Q8278Q5786l8273j35972n916K548j21683
$$ -205088 -230221 -167863 -30437 -99548 -11270 74516 36243 -99729 -105645 -103097 -224780
21204b24780p3844N6455J84224K6287j223q3711O7258J4551p6371j7998O0776
$$ -224780 -298624 -242169 -57945 -31658 -32881 -116592 -49334 -34783 -111154 -129152 -68376
21193f8376P8606M9671n7966p6090J5553L7110L8740o443p0391n2821o456m7331
$$ -68376 10230 59901 1935 -74155 -58602 -21492 17248 10805 -59586 -112407 -118863 -166194
21181a66194J16951j0260p2557O4595R7569L5951L5286n6949p6736n9061m5628
$$ -166194 -49243 -59503 -132060 -67465 30104 66055 101341 44392 -32344 -91405 -137033
21170a37033k12037j1551J13152N7448l6273M1909j4054L4851Q8682N723j61401
$$ -137033 -349070 -360621 -247469 -190021 -226294 -184385 -198439 -163588 -74906 -69183 -230584
21159b30584N0768O8164m249j4746M3988L6658K0807J9400J39353o6599p2684
$$ -230584 -179816 -111652 -115901 -130647 -86659 -50001 -29194 -9794 129559 62960 -9724
21148i724r0783r3786l9353O1510Q5022P9948q157J1421K9455r8610k9520L7015
$$ -9724 -100507 -194293 -233646 -172136 -87114 -7166 -15323 -3902 25553 -73057 -102577 -65562
21136f5562L2929l91r8822J09514R7577j40389j13058J8620O4134n782K5990k3491
$$ -65562 -32633 -33024 -131846 -22332 75245 -65144 -178202 -159582 -95448 -101230 -75240 -98731
21124i8731k15212m8740J7551J15376M1735j15172l4552J04979K2362M0791J53277
$$ -98731 -313943 -362683 -345132 -229756 -188021 -303193 -337745 -232766 -210404 -169613 -16336
21113a6336J71130M6958N2993j35124p6637k24385l653K06462J66611J2333J31598
$$ -16336 154794 201752 254745 119621 42984 -181401 -185054 21408 188019 200352 331950
21102C31950q6517l1495r006m3064j03496q4326j27122j09494N0986j00835L5595
$$ 331950 245433 213938 204932 161868 58372 -25954 -153076 -262570 -211584 -312419 -276824
21091b76824k1909R4772J09673J01839Q5086k6200n1006j05679J8957o7552J5280
$$ -276824 -298733 -203961 -94288 7551 92637 66437 15431 -90248 -71291 -138843 -123563
21080a23563L0422j7338m5943J22767N4600k8380n3402j27441j0004J49661L2404
$$ -123563 -93141 -110479 -156422 -33655 20945 -7435 -60837 -188278 -198282 -48621 -16217
21069a6217P1758J00583j25530j18209p362P2028o8418M5389n5194q0819R424
$$ -16217 55541 156124 30594 -87615 -94977 -22949 -91367 -45978 -101172 -181991 -172567
21058a72567J6386M3527r570j08124n2259k2105n187M2483K4520O4611J37995
$$ -172567 -156181 -112654 -122224 -230348 -282607 -304712 -309899 -267416 -242896 -178285 -40290
21047d0290P4501K7679j7774J01865K7261O2133K0118j06901j46188q399m8206
$$ -40290 34211 61890 44116 145981 173242 235375 255493 148592 2404 -5995 -54201
21036e4201J7203m5406k3001K2833J83739J95493n6634j68009j1062O690k44320
$$ -54201 -36998 -82404 -105405 -82572 101167 296660 240026 72017 60955 67645 -176675
21025a76675m1530J61247J67689J28804j41899j51948r9525q3169k23250K1113
$$ -176675 -218205 -56958 110731 239535 97636 -54312 -153837 -237006 -460256 -439143
21015d39143J81830J88476l9262J313j036P8743L0998n0278J07277k2104j52523
$$ -439143 -257313 -68837 -108099 -106786 -107822 -29079 1919 -48359 58918 36814 -115709
21004a15709j37110J08712J96536J58488o0232j8600Q448j10696L9968M8230n7156
$$ -115709 -252819 -144107 52429 210917 150685 132085 140533 29837 69805 118035 60879
20993F0879j67156k665m5647j27818K0021L9831J00490K2111J64588k4583k20170
$$ 60879 -106277 -108942 -154589 -282407 -262386 -222555 -122065 -99954 64634 40051 -180119
20982a80119m3500Q7843Q9241J83835j1933q0995j01502n285p1554O4088N3266
$$ -180119 -223619 -135776 -46535 137300 125367 44372 -57130 -62415 -133969 -69881 -16615
20971a6615N4930O851O5717K04756j2900l08567k33250j5078J42666J81764J5079
$$ -16615 38315 45166 110883 315639 302739 -5828 -239078 -254156 -111490 70274 85353
20960H5353k07236k07904J35885m1821J12868J09145j9197j24228j9297k3790
$$ 85353 -121883 -329787 -193902 -235723 -122855 -13710 -32907 -157135 -176432 -200222
20950b00222n7035p6752O5081O2951O7893P0570m698J9264J40507m8295k19299
$$ -200222 -257257 -334009 -268928 -205977 -138084 -67514 -72212 -52948 87559 39264 -180035
20939a80035j07867k0819J51211J28913L3472q160p6693p7606J81645Q0643j13854
$$ -180035 -287902 -308721 -157510 -28597 4875 -3285 -79978 -157584 24061 104704 -9150
20928i150j80890J1566J0733N5132j04219m8592O5096M9060J24210L0013r5545
$$ -9150 -190040 -178474 -167741 -112609 -216828 -265420 -200324 -151264 -27054 2959 -92586
20917i2586o1499L2837L1761N1446M9300q762j77667r768j762k8974K431l6993
$$ -92586 -154085 -121248 -89487 -38041 11259 2497 -175170 -184938 -186700 -215674 -213243 -250236
20905b50236L1111J49461L0013k9658J8964J33778n6152j4966k1513O7559N7158
$$ -250236 -219125 -69664 -39651 -69309 -50345 83433 27281 12315 -9198 58361 115519
20894A15519j19539l1890k1688P4232N1843k0417q3927j5639j58876l2513O778
$$ 115519 -4020 -35910 -57598 16634 68477 48060 -35867 -51506 -210382 -242895 -236117
20883b36117L1669N1090K4635L3068Q3750O0688N230r6126k1299L3596q1619p5293
$$ -236117 -204448 -153358 -128723 -95655 -11905 48783 54013 -42113 -63412 -29816 -111435 -186728
20871a86728L7305l4658P3859M4012K65590L0246k04860j33600m3769P0448R9645
$$ -186728 -149423 -184081 -110222 -66210 199380 229626 24766 -108834 -152603 -82155 17490
20860A7490K2918o7040l4180l069N3657P0543K9472J2906p8402q4000J28161o479
$$ 17490 40408 -26632 -60812 -63881 -10224 60319 89791 102697 24295 -59705 68456 61977
20848F1977p1611J14477P7935l6219N9570r9112j16795q0044J45372o2219R1743
$$ 61977 -9634 104843 182778 146559 206129 107017 -9778 -89822 55550 -6669 85074
20837H5074K49338q3136j76763l3613J61300p4854j74298j21866R4336Q2979m0762
$$ 85074 334412 251276 74513 40900 202200 127346 -46952 -168818 -74482 8497 -32265
20826c2265K1117Q2635M4754j09755n0270j67817m3768J18388J80405K6234j01068
$$ -32265 -11148 71487 116241 6486 -43784 -211601 -255369 -136981 43424 69658 -31410
20815c1410M2232J36085l9429r4784m6461N3008p831Q2117l8884n016p3978P2634
$$ -31410 10822 146907 107478 12694 -33767 19241 11410 93527 54643 49627 -24351 48283
20803D8283L7576r0512p7536m5150Q1990l5361k5712N6723p363k2740J42153n4507
$$ 48283 85859 -4653 -82189 -127339 -45349 -80710 -106422 -49699 -57062 -79802 62351 7844
20791G844J3948J14747P4121j22400P724r4006p5440N7480O2046q8469O1238N8576
$$ 7844 21792 136539 210660 88260 95984 1978 -73462 -15982 46064 -42405 18833 77409
20779G7409o9500j1339N87K5278J60421j52574j95420o8431L0783m3196k9599
$$ 77409 7909 -3430 -2843 22435 182856 30282 -165138 -233569 -202786 -245982 -275581
20768b75581O2878J04497L7323m3645j56209L2135J73820j2750o3010K1275J06567
$$ -275581 -212703 -108206 -70883 -114528 -270737 -238602 -64782 -77532 -140542 -119267 -12700
20757a2700q0999k11127j0559O2317J61767J22179l1774k5469O064l5971p1717
$$ -12700 -93699 -304826 -315385 -253068 -91301 30878 -896 -26365 -20301 -56272 -127989
20746a27989n3115k5505L0703N6386j22642j38316J01810Q1883M2496J02183k4536
$$ -127989 -181104 -206609 -175906 -119520 -242162 -380478 -278668 -196785 -154289 -52106 -76642
20735g6642j18642p641M6451l806R6632J31521j90138o1768J7983k0664J11607
$$ -76642 -195284 -202925 -156474 -160280 -63648 67873 -122265 -184033 -166050 -186714 -75107
20724g5107N7442Q7333k5201n1766J0485M1492j5451M1660j25217j37314K0699
$$ -75107 -17665 69668 44467 -7299 3186 44678 29227 70887 -54330 -191644 -170945
20713a70945J60196j18522L4041O6984p7604K9857N3386o0546p7487o5112n242
$$ -170945 -10749 -129271 -95230 -28246 -105850 -75993 -22607 -83153 -160640 -225752 -230994
20702b30994P1108M4891J79589K1640l2164n4065Q0395j4844j21122K8327K759
$$ -230994 -159886 -114995 64594 86234 54070 5 80400 65556 -55566 -27239 -24480
20691b4480k4122Q4747M8866r3037j0516M1731J28235p4073R9607J29548l7868
$$ -24480 -48602 36145 85011 -8026 -18542 23189 151424 77351 176958 306506 268638
20680B68638j03823r2253k0789n7792l7872K00115Q1511j27572O108m3721k2640
$$ 268638 164815 72562 51773 -6019 -43891 156224 237735 110163 116271 72550 49910
20669D9910q30L3169o4435l9211M9553P0855j08271j05327J3092J33537P5729
$$ 49910 49080 82249 17814 -21397 28156 99011 -9260 -114587 -101495 32042 107771
20658A07771M8720K0371k5395j39136J3734j7989r7230M8031Q205p1162M0051
$$ 107771 156491 176862 151467 12331 26065 8076 -89154 -41123 -32918 -104080 -64029
20647f4029J0964r9113r728J09709J06710m0361o2315j13613o8946j699J24144
$$ -64029 -53065 -152178 -161906 -52197 54513 14152 -48163 -161776 -230722 -232421 -108277
20636a08277J22506m2226Q7710k5112n7501N7848n7919q4708n405o7521q634L3876
$$ -108277 14229 -27997 59713 34601 -22900 34948 -22971 -107679 -113084 -180605 -189239 -155363
20624a55363k288l3134Q7133j7017q953k270O344P8317J40826J37338o6486j43705
$$ -155363 -157651 -190785 -103652 -120669 -129622 -131892 -125548 -47231 93595 230933 164447 20742
20612B0742o1181p1442o9639o4572N0950O6113l418O5560L8555J5580m0257j68093
$$ 20742 -40439 -111881 -181520 -246092 -195142 -129029 -132447 -66887 -28332 -12752 -53009 -221102
20600b21102j02189Q7375R7515J09921P1997O5336J3857K4154j26357n8319j5228
$$ -221102 -323291 -235916 -138401 -28480 43517 108853 122710 146864 20507 -37812 -53040
20589e3040j04155n6124N7874J4181K7809n7896j17431R196R1026Q8788k8744
$$ -53040 -157195 -213319 -155445 -141264 -113455 -171351 -288782 -279586 -188560 -99772 -128516
20578a28516R2819k9830r7957L9472P0905M1147j27188M8766J33284p6657j85881
$$ -128516 -35697 -65527 -163484 -124012 -53107 -11960 -139148 -90382 42902 -33755 -219636
20567b19636j20751n5312R1063P2626O8917J05749J2781m0542j54839m9188O3292
$$ -219636 -340387 -395699 -304636 -232010 -163093 -57344 -44563 -85105 -239944 -289132 -225840
20556b25840L0263L3511n4124p3238K1883J08606p8787k95R6065J14072n9956
$$ -225840 -195577 -162066 -216190 -289428 -267545 -158939 -237726 -238021 -141956 -27884 -87840
20545h7840j22147J38381P883k9906k2553Q2364n7072N0876j65015j82064J78046
$$ -87840 -209987 -71606 -63723 -93629 -116182 -33818 -90890 -40014 -205029 -387093 -209047
20534b09047K75579j8814p8409m1050J1702M3220n7367l3807J7089J20393J0590
$$ -209047 66532 47718 -30691 -71741 -60039 -16819 -74186 -107993 -90904 29489 40079
20523D0079k2803O9289l6567r5181p2698J7924P8181o2543JJ71223q469j1318
$$ 40079 17276 86565 49998 -45183 -117881 -99957 -21776 -84319 -84318 86905 78436 67118
20511F7118n055J05371P5171r7613N6142J18441n1551j46510L3699P825o4889
$$ 67118 62063 167434 242605 144992 201134 319575 268024 121514 155213 163038 98149
20500I8149J072K3449P8437j04111J4759o8329m5410O7466P8182l8407j32330
$$ 98149 99221 122670 201107 96996 111755 43426 -1984 65482 143664 105257 -27073
20489b7073J4760n0492j3617J01640K8142j31373j9153o8655l394l0465J07141
$$ -27073 -12313 -62805 -76422 25218 53360 -78013 -97166 -165821 -169215 -199680 -92539
20478i2539Q1734j74591m7843J41808N81m1103L1757P043L5325m5552P342M1897
$$ -92539 -10805 -185396 -233239 -91431 -90850 -131953 -100196 -93153 -57828 -103380 -96038 -54141
20466e4141o2304m749j5624P7376J90682m4570l1132j893j17708j23330M7934
$$ -54141 -116445 -121194 -136818 -59442 131240 86670 55538 53645 -64063 -187393 -139459
20455a39459P9952m9608o9325N162N458R175r7423J00175N4221N9292m506j11611
$$ -139459 -59507 -109115 -178440 -173278 -167820 -158645 -256068 -155893 -101672 -42380 -46886 -158497
20443a58497J8118l7479m2951J04866K963k3008p908l0910o1305J4164M052J25038
$$ -158497 -140379 -177858 -220809 -115943 -112980 -135988 -143896 -174806 -236111 -221947 -217895 -92857
20431i2857N1164J9821M9542Q1122K7400j536m3735p0057O222K2061K05671K6531
$$ -92857 -41693 -21872 27670 108792 136192 134656 90921 20864 27086 49147 254818 281349
20419B81349j50505j13845K4902n6832j03287o943m285J47931M4473k10115l9202
$$ 281349 130844 16999 41901 -14931 -118218 -125161 -129446 18485 62958 -147157 -186359
20408a86359J3259M9143o0552M0667k1166j20709N7618O8039J23102m0312m4826
$$ -186359 -173100 -123957 -184509 -143842 -165008 -285717 -228099 -160060 -36958 -77270 -122096
20397a22096r305j4107O7038N2191O6109O0858J3366m1549j19265K3539j55209
$$ -122096 -131401 -145508 -78470 -26279 39830 100688 114054 72505 -46760 -23221 -178430
20386a78430j5424N6350k0083j08816K5261N9991j07390o5240J35830J76733M1205
$$ -178430 -193854 -137504 -157587 -266403 -241142 -181151 -288541 -353781 -217951 -41218 -13
20375a3o5462n3632m8149j9J57965q966n548q9893O2438P2042O287n3570n7936
$$ -13 -65475 -119107 -167256 -167275 -9310 -18276 -23824 -113717 -51279 20763 27050 -26520 -84456
20362h4456J9080n5438k971k2452O6408J5164L9159J16244o264p3313m0916J02409
$$ -84456 -65376 -120814 -123785 -146237 -79829 -64665 -25506 90738 84474 11161 -29755 72654
20350G2654Q2265n45o5032P12j12418p1720j8399l0216j1869q330P8359M9324
$$ 72654 154919 154374 89342 90054 -22364 -94084 -112483 -142699 -154568 -162898 -84539 -35215
20338c5215K7469p1939j5869J1316N0471N0247J2943n5942L9890N403j11974j05883
$$ -35215 -7746 -79685 -95554 -84238 -33767 16480 29423 -26519 13371 18774 -93200 -199083
20326a99083j2055p0717r794j7455J22972O2676j6693O0576P8456k1069j31247
$$ -199083 -211138 -281855 -291649 -309104 -186132 -123456 -140149 -79573 -1117 -22186 -153433
20315a53433n3272Q2008K00874j07487j64574K3722P4288J8822J07798N0162J7864
$$ -153433 -206705 -124697 76177 -31310 -195884 -172162 -97874 -79052 28746 78908 96772
20304I6772J9568P154m5060L9187L5740R790l6016P4587k0500P138j3735q8267
$$ 96772 116340 123494 78434 117621 153361 163151 127135 201722 181222 188360 174625 86358
20292H6358m2557j3044O364l8788M7602m9341n4943N8109P879l8383J40187m523
$$ 86358 43801 30757 37121 -1667 45935 -3406 -58349 -240 7639 -30744 109443 104920
20280A04920n8314k23112j70844Q0763J32483O5681J05870O1377J20039m0284
$$ 104920 46606 -176506 -347350 -266587 -134104 -68423 37447 98824 218863 178579
20270A78579r0250j09381n8848r9608j10934Q1283K0193j657N2058M8486J66413
$$ 178579 88329 -21052 -79900 -179508 -290442 -209159 -188966 -190623 -138565 -90079 76334
20259G6334J47747R0597n4476k29267k34442R9507N0842j25753l9751J04505J00539
$$ 76334 224081 314678 260202 30935 -203507 -104000 -53158 -178911 -218662 -114157 -13618
20248a3618P156o2678Q3690R7191o1798j4551M6074N5936J3245L8959q2701j57241
$$ -13618 -6462 -69140 14550 111741 49943 35392 81466 137402 150647 189606 106905 -50336
20236e0336m6338o3195P258K5943m393J4440Q7866K4308l7374R612n0111m6519
$$ -50336 -96674 -159869 -152611 -126668 -131061 -116621 -28755 -4447 -41821 -32209 -82320 -128839
20224a28839O4453J3621j4466P3904k6228p7828l2334O8866k120R2971j8683j62966
$$ -128839 -64386 -50765 -65231 8673 -17555 -95383 -127717 -58851 -60971 32000 13317 -149649
20212a49649P7879R6124P4058q8705q7001j54714N8119L4894j7881K5269K6472
$$ -149649 -71770 24354 98412 9707 -77294 -232008 -173889 -138995 -156876 -131607 -105135
20201a05135P205n594K6606R8179P1676L8200r0770j7508J12145Q4255m1033p3856
$$ -105135 -97930 -103524 -76918 21261 92937 131137 40367 22859 135004 219259 178226 104370
20189A04370p0468k4319l9843M6444j7685k4640J54859N6914n1287j02793j67281
$$ 104370 33902 9583 -30260 16184 -1501 -26141 128718 185632 134345 31552 -135729
20178a35729N3184J88447J15967K1285j96122k50974m9612R8691J30860R6378
$$ -135729 -82545 105902 221869 243154 47032 -203942 -253554 -154863 -24003 72375
20168G2375j9537n5813j6385J0511p4421P6773k7106K1284o2132r158j5375N3085
$$ 72375 52838 -2975 -19360 -8849 -83270 -6497 -33603 -12319 -74451 -83609 -98984 -45899
20156d5899L5743j24634l6858O036P6874L5239n146J7959J4132J6678N1363j19217
$$ -45899 -10156 -134790 -171648 -165612 -88738 -53499 -58645 -40686 -26554 -9876 41487 -77730
20144g7730r4875q2799Q2756J09027q723l5192Q0368j8825j9527P4724J23505
$$ -77730 -172605 -255404 -172648 -63621 -72344 -107536 -27168 -45993 -65520 9204 132709
20133A32709o5595j4769j11171k3029K3766q026Q8889o5059o7808M8297n6717
$$ 132709 67114 52345 -58826 -81855 -58089 -66115 22774 -42285 -110093 -61796 -118513
20122a18513j12121P9820J22383J68709L9850l9654j9077k691M8116l2320m5682
$$ -118513 -230634 -150814 -28431 140278 180128 140474 121397 118706 166822 134502 88820
20111H8820m4742j11889J8854J0698p4920m409K976R4849J18534p614j45954n2936
$$ 88820 44078 -67811 -48957 -38259 -113179 -117588 -114612 -19763 98771 91157 -54797 -107733
20099a07733M5353J93029J1126m2768R0393o1587j72332L244n9539R8935j1097
$$ -107733 -62380 130649 141775 99007 189400 127813 -44519 -41275 -100814 -1879 -12976
20088a2976q9932K2Q1452o1451l9953K27297r367j60293o8815k9220J2927J16603
$$ -12976 -102908 -102886 -21434 -82885 -122838 104459 95092 -65201 -134016 -163236 -150309 -33706
20076c3706J14765l6572Q611J7280L0754n6417M3051p1977q9526J774J12045J32958
$$ -33706 81059 44487 53098 70378 101132 44715 87766 15789 -73737 -71963 40082 173040
20064A73040k0902j12690p1969k1744K25180J50369n5311l9970j78736o5296J2206
$$ 173040 152138 39448 -32521 -54265 170915 321284 265973 226003 47267 -18029 -5823
20053e823L3377k5953M8116J02263l0799J2500M2337p1109j40693l4254J3692
$$ -5823 27554 1601 49717 151980 121181 133681 176018 104909 -35784 -70038 -56346
20042e6346J2444M5955n7424j04052J5054M6144J30668O1641q8722O198R2153
$$ -56346 -43902 2053 -55371 -159423 -144369 -98225 32443 94084 5362 11560 103713
20031A03713J40646R1156k5628j15737j53185L1000j8224p7289k2409K7116R1390
$$ 103713 244359 335515 309887 194150 40965 71965 53741 -23548 -45957 -18841 72549
20020G2549j4565j08273Q163N4183J17505J88315j9873j62831l5742Q4374o3615
$$ 72549 57984 -50289 -42126 12057 129562 317877 298004 135173 99431 183805 120190
20009A20190o2997O2881o1588p6616L9308M4819k2337R2908K0117J4332j48899
$$ 120190 57193 120074 58486 -18130 21178 65997 43660 136568 156685 171017 22118
19998B2118j33830J20436l5462q7949L7345J25116J8145j49719j18912J01246
$$ 22118 -111712 8724 -26738 -114687 -77342 47774 65919 -83800 -202712 -101466
19988a01466J02063r2242Q6871J33740l9563j75012o1412Q8765N5816P9401N7506
$$ -101466 597 -91645 -4774 128966 89403 -85609 -147021 -58256 -2440 76961 134467
19977A34467l8158j17666j83203j3662M7924J19518R6229l3305k43217o4034Q4146
$$ 134467 96309 -21357 -204560 -218222 -170298 -50780 45449 12144 -231073 -295107 -210961
19966b10961J17022N5819J526m1267j7544p3062L5068J82534L4938j46222o4547
$$ -210961 -93939 -38120 -36594 -77861 -95405 -168467 -133399 49135 84073 -62149 -126696
19955a26696K281p843K5856J03986k344N6750J26192Q8535q8976j92999K4992
$$ -126696 -124415 -132258 -106402 -2416 -4760 51990 178182 266717 177741 -15258 9734
19944I734q0470J9204P7689n1662q5751M8973P2283j30721r7467O9908J83073
$$ 9734 -70736 -51532 26157 -25505 -111256 -62283 10000 -120721 -218188 -148280 34793
19933C4793O5440R7120k5210j40461j14898K2562J06261j00886j15237k6500l7136
$$ 34793 100233 197353 172143 31682 -83216 -60654 45607 -55279 -170516 -197016 -234152
19922b34152J37024n4644r1811J6923O0155k6523N624J04134J02479R5639m6428
$$ -234152 -97128 -151772 -243583 -226660 -166505 -193028 -187404 -83270 19209 114848 68420
19911F8420j39943k459R1725J01669N4194M916q7637q5064Q2272j29194j35914
$$ 68420 -71523 -73982 17743 119412 173606 178522 90885 5821 88093 -41101 -177015
19900a77015M3847L9098M8953J04213P2598k7392k1691l6355k1312l6623J18395
$$ -177015 -133168 -94070 -45117 59096 131694 104302 82611 46256 24944 -11679 106716
19889A06716M2716j45124j52842P4234J01478L2239P0408J19589n0103O2547k4510
$$ 106716 149432 4308 -148534 -74300 27178 59417 129825 249414 199311 261858 237348
19878B37348q9858M789J05546j987j61861p7987M6600l2386r4714k6534O6467
$$ 237348 147490 152279 257825 255838 93977 15990 62590 30204 -64510 -91044 -24577
19867b4577J1435q3747j10615l210P0724P0908j0576K9125q2291O68O5465l3761
$$ -24577 -13142 -96889 -207504 -210714 -139990 -69082 -79658 -50533 -132824 -132156 -66691 -100452
19855a00452K127O428N0871N4987J00607l4588q2333j9547R7693L145J7839n932
$$ -100452 -98325 -91897 -41026 13961 114568 79980 -2353 -21900 75793 78938 96777 90845
19843I0845j72030R1821J68821M5258m2608j45185p8782Q5407K2314m1311j186
$$ 90845 -81185 10636 179457 224715 182107 36922 -41860 43547 65861 24550 23364
19832B3364J5525m0598j36520k7510J0523R0070j8600o6901M7461o178N3002l4254
$$ 23364 38889 -1709 -138229 -165739 -155216 -65146 -83746 -150647 -103186 -109364 -56362 -90616
19820i0616m1834o6408k9155O6299P9794o8568J23231R5041r631M3876j24582
$$ -90616 -132450 -198858 -228013 -161714 -81920 -150488 -27257 67784 58153 102029 -22553
19809b2553n938Q3346p399q6150l7204J61640o253m5308k4160M0082p396l7220
$$ -22553 -28491 54855 47456 -38694 -75898 85742 79489 34181 10021 50103 42707 5487
19797E487J3024o0630K598K0341j53786n5460M3091N5219L1950o391j2515N5794
$$ 5487 18511 -42119 -39521 -19180 -172966 -228426 -185335 -130116 -98166 -104557 -117072 -61278
19785f1278K4707o9715J37050Q187q0213K5779R9505j3094L49j4927r3959l4933
$$ -61278 -36571 -106286 30764 38951 -41262 -15483 84022 70928 71277 56350 -37609 -72542
19773g2542L258o6871M4701R5253j2251N3069J21355n5297q0531m0102j15890
$$ -72542 -69284 -136155 -91454 3799 -8452 44617 165972 110675 30144 -9958 -125848
19762a25848q8757r4521O3575J77830J23294l9869k02030K0400J22684p9205j93759
$$ -125848 -214605 -309126 -245551 -67721 55573 15704 -186326 -165926 -43242 -122447 -316206
19751c16206J5304K9193j3421P6733K03244L2532j23167m3155p3634p1272R8079
$$ -316206 -300902 -271709 -285130 -208397 -5153 27379 -95788 -138943 -212577 -283849 -185770
19740a85770J40067K6009M1843n4425o7661K4941L0393M2519o5998J51275O9976
$$ -185770 -45703 -19694 22149 -32276 -99937 -74996 -44603 -2084 -68082 83193 153169
19729A53169J8779q7612n1783J52928L4698J2950j23615j98273o9440J07517J53298
$$ 153169 171948 84336 32553 185481 220179 233129 109514 -88759 -158199 -50682 102616
19718A02616O3088r4536r3543m394N4674k9173j2281q4973m8203j1030j4876k174
$$ 102616 165704 71168 -22375 -26769 27905 -1268 -13549 -98522 -146725 -157755 -172631 -174805
19706a74805J67894K28300M4047j19894j30173M4029L1216n8728J13175J10045
$$ -174805 -6911 221389 265436 145542 15369 59398 90614 31886 145061 255106
19696B55106n4837q9695j22783P0199K8604k9190Q0637L0436r5236q7992o0595
$$ 255106 200269 110574 -12209 57990 86594 57404 138041 168477 73241 -14751 -75346
19685g5346j3440J1765k594j6604q1992q0664J0088R6379J8402R3071K538m9446
$$ -75346 -88786 -77021 -79615 -96219 -178211 -258875 -248787 -152408 -134006 -40935 -38397 -87843
19673h7843O9456j3060j08475o6276j0253N7610M9022L0512J00005j11744o7472
$$ -87843 -18387 -31447 -139922 -206198 -216451 -158841 -109819 -79307 20698 -91046 -158518
19662a58518n5626m5786j13688N3394J65825N6001j7830O7755j30324j04913o5838
$$ -158518 -214144 -259930 -373618 -320224 -154399 -98398 -116228 -48473 -178797 -283710 -349548
19651c49548R2955J34778L1348j50852m2978L7416P4728O8495P5095o616o3413
$$ -349548 -256593 -121815 -90467 -241319 -284297 -246881 -172153 -103658 -28563 -35179 -98592
19640i8592K4778N9130p559q9211n9635n198k1322l8422J28762L2927M1950J08465
$$ -98592 -73814 -14684 -22243 -111454 -171089 -176287 -197609 -236031 -107269 -74342 -32392 76073
19628G6073k1694r5967J974K4265O2403N6351R941j30622K5083j09406j05495
$$ 76073 54379 -41588 -39614 -15349 47054 103405 113346 -17276 7807 -101599 -207094
19617b07094J04020J34619R7812K6798Q3684J2382j92839M8193j259j04910P3339
$$ -207094 -103074 31545 129357 156155 239839 252221 59382 107575 106316 1406 74745
19606G4745O2127j38428J0332P969P861l5325N6641p764j23403J2702J20036n065
$$ 74745 136872 -1556 8776 16745 24606 -10719 45922 38158 -85245 -72543 47493 42428
19594D2428m4364L7832K3549j65720j86340l0290R7130P6488N1009O3143J28019
$$ 42428 -1936 35896 59445 -106275 -292615 -322905 -225775 -149287 -98278 -35135 92884
19583I2884J0213o0181o3692j2253Q5416p42J1987O239j58777q52m8035m0269
$$ 92884 103097 42916 -20776 -33029 52387 51645 63632 69871 -88906 -89758 -137793 -178062
19571a78062M1195m5428K8058J20185M106m504j6613j28262M4075N992R134r8782
$$ -178062 -136867 -182295 -154237 -34052 -29946 -34450 -51063 -179325 -135250 -129258 -120124 -218906
19559b18906l6721k1671L4088L8125p1352k4698J16719J18588K5057K4986j08027
$$ -218906 -255627 -277298 -243210 -205085 -276437 -301135 -184416 -65828 -40771 -15785 -123812
19548a23812N9801J5880r4104n3764J282P2097m241L759L808R5619K7434Q6490
$$ -123812 -64011 -48131 -142235 -195999 -194717 -122620 -126861 -123102 -119294 -23675 3759 90249
19536I0249l376m9050m5035M4866k5069q0452L1066l0259N2520k5410j53621j7118
$$ 90249 86873 37823 -7212 37654 12585 -67867 -36801 -67060 -14540 -39950 -193571 -210689
19524b10689J34167l2494n7317N0911J28382N1277n192R0571J1495J13640O9516
$$ -210689 -76522 -109016 -166333 -115422 12960 64237 59045 149616 161111 274751 344267
19513C44267r6466r5236P347J03269o075m8240k5422p8500N6242j1637M1490R9369
$$ 344267 247801 152565 159912 263181 257106 208866 183444 104944 161186 149549 191039 290408
19501B90408j35009k12549J4028j17135R6470J30002o9007o9204N0636N9388q0174
$$ 290408 155399 -57150 -43122 -160257 -63787 66215 -2792 -71996 -21360 38028 -42146
19490d2146M8060o7018J9672l75p4060j7577j6454l7131J64982J55543R0503r3232
$$ -42146 5914 -61104 -41432 -41807 -115867 -133444 -149898 -187029 -22047 133496 223999 130767
19478A30767q7666j10191j5342N4295O2187j6143Q6875L9670r4110k7355N3358
$$ 130767 43101 -67090 -82432 -28137 34050 17907 104782 144452 50342 22987 76345
19467G6345o2068o3877j59047O6081P6664J23263J39655n6098j06403j72661q1646
$$ 76345 14277 -49600 -208647 -142566 -65902 57361 197016 140918 34515 -138146 -219792
19456b19792J0761R1232q0156j12164J5124K38737R701r2577m3558J5190Q8083
$$ -219792 -209031 -117799 -197955 -310119 -294995 -56258 -46557 -139134 -182692 -167502 -79419
19445g9419O7936j05652r4616R236J11738Q743j09837J07701J63664m1835N1562
$$ -79419 -11483 -117135 -211751 -202515 -90777 -82034 -191871 -84170 79494 37659 89221
19434H9221J9395j82054o7468O1293J01097o0548j07136J46309J47027l173j08722
$$ 89221 108616 -73438 -140906 -79613 21484 -39064 -146200 109 147136 143963 35241
19423C5241p5485M2219L3054n293j14842n8152m2400J8897m3255N6888R7573m0333
$$ 35241 -40244 1975 35029 29736 -85106 -143258 -185658 -166761 -210016 -153128 -55555 -95888
19411i5888p0537k0552l609J75261K2706M4845n603o8160m7577j27431m8718J45605
$$ -95888 -166425 -186977 -190586 -15325 7381 52226 46623 -21537 -69114 -196545 -245263 -99658
19399i9658J33493J5842j10958l507J27735o0221P7152M2754q6513l4735o3805
$$ -99658 33835 49677 -61281 -64788 62947 2726 79878 122632 36119 1384 -62421
19388f2421N4698O8734K6322k9280j9103N5167p7197j33794l8737R1248n8749
$$ -62421 -7723 61011 87333 58053 38950 94117 16920 -116874 -155611 -64363 -123112
19377a23112P0912J6853L0069m7117o269J29068L2996p4284j89948K0375J27676
$$ -123112 -52200 -35347 -5278 -52395 -58664 70404 103400 29116 -160832 -140457 -12781
19366a2781j7831K2974p5711k0729j1388K6383Q562L9349J53334N3204J8598r1515
$$ -12781 -30612 -7638 -83349 -104078 -115466 -89083 -80521 -41172 112162 165366 183964 92449
19354I2449m1741P2730L8491p6255j48429O9091J38752j22012j50178L3239j0191
$$ 92449 50708 123438 161929 85674 -62755 6336 145088 23076 -127102 -93863 -104054
19343a04054l1571j4353L2091P3036j3581q4618J21389J04993k6051j42753r2095
$$ -104054 -135625 -149978 -117887 -44851 -58432 -143050 -21661 83332 57281 -85472 -177567
19332a77567K4296J09426J10615l1657O49J186J5281M1694M2157J00171m2725
$$ -177567 -153271 -43845 66770 35113 35762 36948 52229 93923 136080 236251 193526
19321A93526q4059j18263O4203j264p6103j18407J43895J01478L7851j61382n4865
$$ 193526 109467 -8796 55407 54143 -21960 -140367 3528 105006 142857 -18525 -73390
19310g3390o6292J77071K1826k7135M4306P019p1710J0571L4762J6393l7041j9484
$$ -73390 -139682 37389 59215 32080 76386 83405 11695 22266 57028 73421 36380 16896
19298A6896O7227r375l6756r824n689p6094O4517l1524K2302k5023N0016J02441
$$ 16896 84123 74748 37992 28168 22479 -53615 10902 -20622 1680 -23343 26673 129114
19286A29114P5979p9782l7910r4034O3404M3883J18196n1991j17295P3507J36901
$$ 129114 205093 125311 87401 -6633 56771 100654 218850 166859 49564 123071 259972
19275B59972P8976q7946j12890k07564j10090Q0094l3256l4790J26915l6216O1160
$$ 259972 338948 251002 138112 -69452 -179542 -99448 -132704 -167494 -40579 -76795 -15635
19264a5635J39616J1918o4322j00716q6962J42697j5552M946p6566l5708q2085
$$ -15635 123981 135899 71577 -29139 -116101 26596 11044 15990 -60576 -96284 -178369
19253a78369J61725K0457J741M9717j23987o8592M8040N5458j05795j07024K2536
$$ -178369 -16644 3813 5554 55271 -68716 -137308 -89268 -33810 -139605 -246629 -224093
19242b24093J35705M3357j1703k2950P2319P2336l4251j16829p0386q3968M386
$$ -224093 -88388 -45031 -56734 -79684 -7365 64971 30720 -86109 -156495 -240463 -236077
19231b36077M9770q72O5571K1903O516p1566M869l2914l0820J73221J28502J4884
$$ -236077 -186307 -187179 -121608 -99705 -93189 -164755 -159886 -192800 -223620 -50399 78103 92987
19219I2987M0838o4974j6826L986j1238J0966L0079p1534m2836L6120K14510M6048
$$ 92987 133825 68851 52025 56011 44773 55739 85818 14284 -28552 7568 222078 268126
19207B68126l4361j5899m2657q6726L8755l4123r8264J0200L4307o9137p120P5633
$$ 268126 233765 217866 175209 88483 127238 93115 -5149 5051 39358 -29779 -36899 38734
19195C8734M0249m7147k76094j71169l5399n8898J28893J37145J26144K30039
$$ 38734 78983 31836 -244258 -415427 -450826 -509724 -380831 -243686 -117542 112497
19185A12497Q4787M7974o6546j19186J5437J8364N0233O9888M3111m9515j43997
$$ 112497 197284 245258 178712 59526 74963 93327 143560 213448 256559 207044 63047
19174F3047p9070R8812J27253N8519O3061n7545l3993j22454j1380M5745q3806
$$ 63047 -16023 82789 210042 268561 331622 274077 240084 117630 106250 151995 68189
19163F8189n3365k0708P8878L0876l3689r901M5549j17524j98517K1268R2189
$$ 68189 14824 -5884 72994 103870 70181 60280 105829 -11695 -210212 -188944 -96755
19152i6755J24302n8768j31336J03272O3622j59216q8381P1781Q8923M7174J08213
$$ -96755 27547 -31221 -162557 -59285 4337 -154879 -243260 -171479 -82556 -35382 72831
19141G2831J12002l800o0685J23152L6781N984l4729p3683J01575q2732q7595
$$ 72831 184833 181033 120348 243500 280281 286265 251536 177853 279428 196696 109101
19130A09101J5546j63056J60254J18790k6995n5318j8195n0038J9096o3671p8306
$$ 109101 124647 -38409 121845 240635 213640 158322 140127 90089 109185 45514 -32792
19119c2792k8172J2974Q7587j8720l489P2595j3916J84487M1042m2692j46961
$$ -32792 -60964 -47990 39597 20877 17388 89983 76067 260554 301596 258904 111943
19108A11943p6450L9496j4434q5031M2351l0353k1696m7672R568K9823l5961k6931
$$ 111943 35493 74989 60555 -24476 17875 -12478 -34174 -81846 -72278 -42455 -78416 -105347
19096a05347L5263O4991P995L6744L2749M6676J28672N4317j84242p2918L1121
$$ -105347 -70084 -5093 2902 39646 72395 119071 247743 302060 117818 44900 76021
19085G6021J62705o5675j45143r0042o4568O5112K8283O2742L8190O3970O3023
$$ 76021 238726 173051 27908 -62134 -126702 -61590 -33307 29435 67625 131595 194618
19074A94618j47649j54311m1295j643N9660J23214K9210K6545n3161p4223l7780
$$ 194618 46969 -107342 -148637 -150280 -90620 32594 61804 88349 35188 -39035 -76815
19063g6815l7963J1617j11915l1338J50736K7989Q4951O0331J26589o5116j15013
$$ -76815 -114778 -103161 -215076 -246414 -95678 -67689 17262 77593 204182 139066 24053
19052B4053j38677J19261Q347m0788K2240J7557P327q1269L6737j19500J53831
$$ 24053 -114624 4637 12984 -27804 -5564 11993 19320 -61949 -25212 -144712 9119
19041I119J45067M441J23482m9914j57981L2806P106j563q6041k7982N2329P1922
$$ 9119 154186 158627 282109 232195 74214 107020 114126 112563 26522 -1460 50869 122791
19029A22791N8949r6915j66518p091L9601J11233J14820P9640q071k0816n7457
$$ 122791 181740 84825 -81693 -88784 -49183 62050 176870 256510 248439 227623 170166
19018A70166O2293p0089j19612o7689L9149N2969L1795r828m5244o2767J18240
$$ 170166 232459 162370 42758 -24931 14218 67187 98982 89154 43910 -18857 99383
19007I9383J46668J2812m5752m0843M7132k0492j05119j878l8342q480O8175o9126
$$ 99383 246051 258863 213111 172268 219400 198908 93789 91911 53569 45089 113264 44138
18995D4138l3827O620j11607m5920J53424P8514L8591n38P1p4462k03221P7992
$$ 44138 10311 16931 -94676 -140596 12828 91342 129933 129395 129466 55004 -148217 -70225
18983g0225J43277R8892j29209n2147r2516j43423J69748R0401q0821k5377p7274
$$ -70225 73052 171944 42735 -9412 -101928 -245351 -75603 14798 -66023 -91400 -168674
18972a68674m2785k4223P1890j53028n8972K48267J97232k5156P2489P0399j82794
$$ -168674 -211459 -235682 -163792 -316820 -375792 -127525 69707 44551 117040 187439 4645
18961D645j09968Q0861J88256n3168j1852K2598K448r3155p2446q2794Q0223R4302
$$ 4645 -105323 -24462 163794 110626 98774 121372 123820 30665 -41781 -124575 -44352 49950
18949D9950J31285J5354n7093q0860k6959n8366k0444l6117O2150O4409j33321
$$ 49950 181235 196589 139496 58636 31677 -26689 -47133 -83250 -21100 43309 -90012
18938i0012l2413p3492J59168O6804o671j65532m2271J2220N4489J03750j2085
$$ -90012 -122425 -195917 -36749 30055 23384 -142148 -184419 -172199 -117710 -13960 -26045
18927b6045M5463j2748R215Q5099j23548Q0666J04096J48550n0104L7378O1400
$$ -26045 19418 6670 15885 100984 -22564 58102 162198 310748 260644 298022 359422
18916C59422m3363l2574J00646K19930K28760L55830J09786o8080j59487j7343
$$ 359422 316059 283485 384131 604061 832821 1188651 1298437 1230357 1070870 1053527
18906A053527J45244l8882j14821k81388j83843j42416m6071J8327J62356R046
$$ 1053527 1198771 1159889 1045068 763680 579837 437421 391350 409677 572033 581079
18896E81079j28286k04891m8258L4482J18692L7054j72090r7771J38218n9737
$$ 581079 452793 247902 199644 234126 352818 389872 217782 120011 258229 198492
18886A98492n2189R619k3335k7993N4894N854M8764j11806n9543j0580N2726j21622
$$ 198492 146303 155922 132587 104594 159488 165342 214106 102300 42757 32177 84903 -36719
18874c6719O1529J19115j8426P4125L841r6624J14490Q4631L1750r4753j3536
$$ -36719 24810 143925 125499 199624 203465 106841 221331 305962 337712 242959 229423
18863B29423J33982J34127J92523J10730J44950Q1813L3766j63455k85483n1370
$$ 229423 363405 497532 690055 800785 945735 1027548 1061314 897859 612376 561006
18853E61006L7940J40832J37233O7636J06265N0946m2238j28394j68106k86068
$$ 561006 598946 739778 877011 944647 1050912 1101858 1059620 931226 763120 477052
18843D77052k67092L2334Q2050J1493j7191n0295L7437j10185j28803o3493P7047
$$ 477052 209960 242294 324344 335837 318646 268351 305788 195603 66800 3307 80354
18832H0354K01844J66566J73519k3586l07388j5793j03380k437Q8957j7551r4336
$$ 80354 282198 448764 622283 598697 291309 275516 172136 169699 258656 241105 146769
18821A46769k4401K3366N0777K49324J45581j0253p4059Q9184K91472L63844L31162
$$ 146769 122368 145734 196511 445835 591416 581163 507104 596288 887760 1251604 1582766
18810A582766K65642K37159K13110m518j33741m9924k12256q0584L4091j7857
$$ 1582766 1848408 2085567 2298677 2294159 2160418 2110494 1898238 1817654 1851745 1833888
18800A833888k47082p7489L6976j46587j88748j20091j55929j66144j81890o4761
$$ 1833888 1586806 1509317 1546293 1399706 1210958 1090867 934938 768794 586904 522143
18790E22143K0323l5012q7724J04924l7403j9581j27597n1751q8980O0092l1238
$$ 522143 542466 507454 419730 524654 487251 467670 340073 288322 199342 259434 228196
18779B28196n0244j2391K8368R8598O3970P1224R2275J13802L1114M6168j17886
$$ 228196 177952 165561 193929 292527 356497 427721 519996 633798 664912 711080 593194
18768E93194J40516J34100J89879K8097l46502j32675k9391p0357n1624j4825
$$ 593194 733710 867810 1057689 1085786 739284 606609 577218 506861 455237 440412
18758D40412r9858J3366L2930j26609j30670Q2922K06954J2507L3553k7354j74065
$$ 440412 340554 353920 386850 260241 129571 212493 419447 431954 465507 438153 264088
18747B64088J1267j4753K3805O9127J25073j8729j25115p2501R4541k3199K1760
$$ 264088 275355 260602 284407 353534 478607 459878 334763 262262 356803 333604 355364
18736C55364r1908k8335k8037j63019Q7591M6800j14750j04050L8745l3791l3418
$$ 355364 263456 235121 207084 44065 131656 178456 63706 -40344 -1599 -35390 -68808
18725f8808P3756L9232j5099l578Q1532p1503k30522K3409J07415j3054J23617
$$ -68808 4948 44180 29081 25503 107035 35532 -194990 -171581 -64166 -77220 46397
18714D6397P0403j3733k0794J94552J38711n1971j05497j95747j0221k328L6035
$$ 46397 116800 103067 82273 276825 415536 363565 258068 62321 52100 49772 85807
18703H5807j36616r5052l9516J82702k8132m7614m054J0850J04934J12059k5664
$$ 85807 -50809 -145861 -185377 -2675 -30807 -78421 -82475 -71625 33309 145368 119704
18692A19704J9337P2689q6948q0812J50728M7019o4166R7379J28397M2577q2513
$$ 119704 139041 211730 124782 43970 194698 241717 177551 274930 403327 445904 363391
18681C63391o3444L0826M5747K5839K6467L625j40472j11185p8477P8323J2053
$$ 363391 299947 330773 376520 402359 428826 432451 291979 180794 102317 180640 192693
18670A92693j52746L3622N7834j17319N0174J0159R8393j5204q3694J2941M4698
$$ 192693 39947 73569 131403 14084 64258 74417 172810 157606 73912 86853 131551
18659A31551m9317J65369j11735j9120r3735o4069P3813J43384O2341o3979J15743
$$ 131551 82234 247603 135868 116748 23013 -41056 32757 176141 238482 174503 290246
18648B90246o9296l8201N5192j22685M7406j07632p336K04096J41848N126p4803
$$ 290246 220950 182749 237941 115256 162662 55030 47694 251790 393638 398764 323961
18637C23961R2279M0225q7981j0466L5093k7731j12145j13877J133P1708J44166
$$ 323961 416240 456465 368484 358018 393111 365380 253235 139358 140491 212199 356365
18626C56365J53654r721p6600o3844j49142l5407J18324m8253k1276n9210J00419
$$ 356365 510019 500298 423698 359854 210712 175305 293629 245376 224100 164890 265309
18615B65309j07068j52785n9223L2926J20747j2624L3355L00464R230j57252k38380
$$ 265309 158241 5456 -53767 -20841 99906 87282 120637 421101 430331 273079 34699
18604C4699q0847R5233J51907L4981n5436m040R2074L9005M0390J4320L1044L1654
$$ 34699 -46148 49085 200992 235973 180537 176497 268571 307576 347966 362286 393330 424984
18592D24984o770j09524o1278M6693r3584j0483r7185m2847j4657P4011K4074
$$ 424984 418214 308690 247412 294105 200521 190038 92853 50006 35349 109360 133434
18581A33434O8581K2060p923q7601N5968R7938Q4534j35164j33875k5547J57225
$$ 133434 202015 224075 216152 128551 184519 282457 366991 231827 97952 72405 229630
18570B29630R1685O3764m3420k3153J8172P4742N1735j19993o6000j9484K4214
$$ 229630 321315 385079 341659 318506 336678 411420 463155 343162 277162 257678 281892
18559B81892J2978k7802J42642P8248J5697j06361Q814Q6234p3707j08748L946
$$ 281892 294870 267068 409710 487958 503655 397294 406108 492342 418635 309887 313833
18548C13833Q5441j68512n1300J50921P7476R1P7965n8502j64066r5825J35382
$$ 313833 399274 230762 179462 330383 407859 407950 485915 427413 263347 167522 302904
18537C02904J19547J1215j59444k59872L2504J54716J46454M0672L2913N1075
$$ 302904 422451 433666 274222 14350 46854 201570 348024 388696 421609 472684
18527D72684Q2741K6103k13070r2938J09457O4003K5141j53833m5434J61661J52177
$$ 472684 555425 581528 368458 275520 384977 448980 474121 320288 274854 436515 588692
18516E88692j24378J20999j2679p3240j03235l3326N9710L5008k468K14r1055
$$ 588692 464314 585313 572634 499394 396159 362833 422543 457551 455083 455297 364242
18505C64242p2261N627o279q5769j6598O5118j397J50974k5352q1509r3239O0559
$$ 364242 291981 297608 291329 205560 188962 254080 252683 403657 378305 296796 203557 264116
18493B64116J28289j5117j08696K9836j520O6539J16863J9613P5501j7601M0987
$$ 264116 392405 377288 268592 298428 296908 363447 480310 499923 575424 557823 598810
18482E98810R1753q7194k6118r5026j57875J05510L5328j25285p5916K08736J56651
$$ 598810 690563 603369 577251 482225 324350 429860 465188 339903 263987 472723 629374
18471F29374L9722J23838j9921o9750j53953j55545P0212K09950N0771j66845
$$ 629374 669096 792934 773013 703263 549310 393765 463977 673927 724698 557853
18461E57853M4905J45939J51478J88821J16318j96317j78481L6431O701q8610
$$ 557853 602758 748697 900175 1088996 1205314 1008997 830516 866947 873648 785038
18451G85038N8578n916l2178p7157O676K3001k9924k00903j57k368R979O8293
$$ 785038 843616 837700 805522 728365 735041 758042 728118 527215 527058 524690 534669 602962
18439F02962J47621m1166r0784j5091J20283O9509J764M8858p8076J21747o0183
$$ 602962 750583 709417 618633 603542 723825 793334 795098 843956 765880 887627 827444
18428H27444K0038n7014n8385j5722o2571p397k4907J66610J75927K31334J42609
$$ 827444 847482 790468 732083 716361 653790 646393 621486 788096 964023 1195357 1337966
18417A337966k2579j40132j07448m7117J25157J9556L6142J73296J23675o5115
$$ 1337966 1315387 1175255 1067807 1020690 1145847 1165403 1201545 1374841 1498516 1433401
18407A433401j26564r7578j0521Q5120M1268m8974j33079j20047J00314Q1622
$$ 1433401 1306837 1209259 1198738 1283858 1325126 1276152 1143073 1023026 1123340 1204962
18397A204962p1968j4918N3485Q5185m9895J61695R0537n8857J07943O744M0263
$$ 1204962 1132994 1118076 1171561 1256746 1206851 1368546 1459083 1400226 1508169 1514913 1555176
18386A555176K13679K91352N6543Q4548M8454J72055J1074N6140L04497K08011
$$ 1555176 1768855 2060207 2116750 2201298 2249752 2421807 2432881 2489021 2793518 3001529
18376C001529O9000Q2584L29379M29641O16955O10874M22405K78485M64311L65826
$$ 3001529 3070529 3153113 3482492 3912133 4529088 5139962 5562367 5840852 6305163 6670989
18366F670989k4262l49743l12164j86167K1947K46965N73483O26390N77158N75981
$$ 6670989 6646727 6296984 5984820 5798653 5820600 6067565 6641048 7267438 7844596 8420577
18356H420577P23732R28458J256892J547240K197148L218941M829780P602589
$$ 8420577 9144309 10072767 11329659 12876899 15074047 18292988 23122768 30725357
18348C0725357J2511880J8212865K0364950J6738630J2868580J4966994J7634780
$$ 30725357 43237237 61450102 81815052 98553682 111422262 126389256 144024036
18341A44024036R440495j1022748k4216030j7653340k826680Q741410J2605028
$$ 144024036 153464531 142441783 118225753 100572413 97745733 106487143 119092171
18334A19092171R309902Q162768J2780375J3462393o62399k3778123l3797083
$$ 119092171 128402073 136564841 149345216 162807609 162145210 138367087 104570004
18327A04570004k5738120j6171115j0499310p119156n115839l483717k455126
$$ 104570004 78831884 62660769 52161459 45042303 39926464 36442747 33987621
18320C3987621j744157j220339q70311o98107j040942j216145j050616p85927
$$ 33987621 32243464 31023125 30152814 29454707 28413765 27197620 26147004 25361077
18312B5361077p90151o10259m07448k23330J55300M72332P81396R11396J314335
$$ 25361077 24570926 23960667 23553219 23329889 23485189 23957521 24738917 25650313 26964648
18303B6964648K206098L321127N246376Q147688J3565640K0064417K2677857J8328402
$$ 26964648 29170746 32491873 37738249 45885937 59451577 79515994 102193851 120522253
18295A20522253J3918405J6631572J9599278R892718j3316855k7672720j9681896
$$ 120522253 134440658 151072230 170671508 180564226 167247371 139574651 119892755
18288A19892755l010378R817822J3923560R985476Q860415J3757310J4164859
$$ 119892755 116882377 126700199 140623759 150609235 159469650 173226960 187391819
18281A87391819j780677k7393944l8104426k9178712j8559768j2326903q705287
$$ 187391819 185611142 158217198 120112772 90934060 72374292 60047389 51342102
18274E1342102o541350m827013l484017k606187j878058j494740j341385j258424
$$ 51342102 44800752 39973739 36489722 33883535 32005477 30510737 29169352 27910928
18266B7910928j145586j110241q73156j251727j294317j165156q69994o51338
$$ 27910928 26765342 25655101 24781945 23530218 22235901 21070745 20200751 19549413
18258A9549413n83677o45255o01809m93274m58391m40006p30887q98553q92571
$$ 19549413 18965736 18320481 17718672 17225398 16767007 16327001 15596114 14697561 13804990
18249A3804990n86028o14911n49601m95967l03483l94104n76450m51215j77567
$$ 13804990 13218962 12604051 12054450 11558483 11255000 10860896 10284446 9833231 9655664
18240I655664k19551k53774j67070k30768k32399j11934q3007l70554l48428k15396
$$ 9655664 9436113 9182339 9015269 8784501 8552102 8440168 8357161 7986607 7638179 7422783
18230G422783j56584j72550j46400m0809j39098r0896j78083k40057k21663p0545
$$ 7422783 7266199 7093649 6947249 6906440 6767342 6676446 6498363 6258306 6036643 5966098
18220E966098j78144j71901j16471j3014p3792j37050k29210l13726j37785k66957
$$ 5966098 5787954 5616053 5499582 5486568 5412776 5275726 5046516 4732790 4595005 4328048
18210D328048j90676k06140j72707j41938Q9618J18282p1115k14511j64417J06607
$$ 4328048 4137372 3931232 3758525 3616587 3706205 3824487 3753372 3538861 3374444 3481051
18200C481051j4202j54615k26178j78007p9749r8395j78004m4542J7421P3876
$$ 3481051 3466849 3312234 3086056 2908049 2828300 2729905 2551901 2507359 2524780 2598656
18190B598656l7693k02247j23377J3824q4817r0037q3446m1799K22135J60704
$$ 2598656 2560963 2358716 2235339 2249163 2164346 2074309 1990863 1949064 2171199 2331903
18180B331903M9347J924l5436m2415J37194J07792k58675k05966j17061j40432
$$ 2331903 2381250 2383174 2347738 2305323 2442517 2550309 2291634 2085668 1968607 1828175
18170A828175m4519M1746N3482J19476M762n7516P7777j58183o4581n4656m2941
$$ 1828175 1783656 1825402 1878884 1998360 2003122 1945606 2023383 1865200 1800619 1745963 1703022
18159A703022j75759p9234L2008J22156K19860k7274o5301L5678j4156j3430j04847
$$ 1703022 1527263 1448029 1480037 1602193 1822053 1794779 1729478 1765156 1751000 1737570 1632723
18148A632723L2284J1501o1063j00618p4014J53714k6816j02983q120J51009J57744
$$ 1632723 1665007 1676508 1615445 1514827 1440813 1594527 1567711 1464728 1456608 1607617 1765361
18137A765361j62837p6911O0810J06730J89983J92387K26183J43017L03465L88590
$$ 1765361 1602524 1525613 1586423 1693153 1883136 2075523 2301706 2444723 2748188 3136778
18127C136778K89663K61236L50055L11982O04945P53737Q04079J091891J493403
$$ 3136778 3426441 3687677 4037732 4349714 4954659 5708396 6512475 7604366 9097769
18118I097769J951280L034488N011395Q259976J4051111K0117352J8613438R581562
$$ 9097769 11049049 14083537 19094932 27354908 41406019 61523371 80136809 89718371
18110H9718371R123678J7326411J6557079r33417l3398109l2486131j8755185
$$ 89718371 98842049 116168460 132725539 131792122 98394013 65907882 47152697
18103D7152697j0957022p218213m926614l697706k731430j899599j397139j101667
$$ 47152697 36195675 28977462 24050848 20353142 17621712 15722113 14324974 13223307
18095A3223307r20852q53766o67043m42951l80018m61492n33361n10638n14312
$$ 13223307 12302455 11448689 10781646 10338695 9958677 9497185 8963824 8453186 7938874
18086G938874m12222k89706j31515q9214m1767k78267l52369k41704k09058r9557
$$ 7938874 7526652 7236946 7105431 7016217 6974450 6696183 6343814 6102110 5893052 5793495
18076E793495k24124l72897j89107o9238j80257K830m8074p5156K6161r6743Q2345
$$ 5793495 5569371 5196474 5007367 4938129 4757872 4760702 4712628 4637472 4663633 4566890 4649235
18065D649235R5682j5228j0847j73357n9015q783j26911K5485j70052k41274j83566
$$ 4649235 4744917 4729689 4718842 4545485 4486470 4477687 4350776 4376261 4206209 3964935 3781369
18054C781369j44949p7398k3925q6157j40568j63970O5376j80887k15862j77070
$$ 3781369 3636420 3559022 3535097 3448940 3308372 3144402 3209778 3028891 2813029 2635959
18044B635959m7640K7128p9326p2056l8546m7067j59949k40531m7805M7615J67299
$$ 2635959 2588319 2615447 2536121 2464065 2425519 2378452 2218503 1977972 1930167 1977782 2145081
18033B145081M8104j20026m2199j19200p6322j2197j62122j46694o7980j01888
$$ 2145081 2193185 2073159 2030960 1911760 1835438 1823241 1661119 1514425 1446445 1344557
18023A344557Q7563M8461Q9343N3843J08454O3092N2308J47235P1284R6327J6984
$$ 1344557 1432120 1480581 1569924 1623767 1732221 1795313 1847621 1994856 2066140 2162467 2179451
18012B179451j37944J9465j28035k09283m0129r1434p4885J32926m1423k21825
$$ 2179451 2041507 2060972 1932937 1723654 1683525 1592091 1517206 1650132 1608709 1386884
18002A386884p9813J23216l1509J00677J55018r045j05434j21585j48823J9414
$$ 1386884 1307071 1430287 1398778 1499455 1654473 1645428 1539994 1418409 1269586 1289000
17992A289000P0764J34661K02426J7950J3418P4929n4286k62230j16695k6829
$$ 1289000 1359764 1494425 1696851 1714801 1728219 1803148 1748862 1486632 1369937 1343108
17982A343108O2924J47872j73083j24951m2361m9864j08767n3212J5084p1882
$$ 1343108 1406032 1553904 1380821 1255870 1213509 1163645 1054878 1001666 1016750 944868
17972I44868n9702P9126j6601J44322r783p4759J09604Q4393M9407N3166Q2636
$$ 944868 885166 964292 947691 1092013 1082230 1007471 1117075 1201468 1250875 1304041 1386677
17961A386677r9734j30098J0468M6070O8887j8439K7838q9662k4570K40741K05884
$$ 1386677 1286943 1156845 1167313 1213383 1282270 1263831 1291669 1202007 1177437 1418178 1624062
17950A624062M7505J86529L00256J36178n518k43975k53860j0041j9627L7931
$$ 1624062 1671567 1858096 2158352 2294530 2289012 2045037 1791177 1781136 1761509 1799440
17940A799440l0880J29287J01497J9993l263j28081k42456p6046O115k9129J00010
$$ 1799440 1768560 1897847 1999344 2019337 2016074 1887993 1645537 1569491 1575606 1546477 1646487
17929A646487J05703M3806O7914k5317k3021J33673J43791J01662K84122K44482
$$ 1646487 1752190 1795996 1863910 1838593 1815572 1949245 2093036 2194698 2478820 2723302
17919B723302O4752J32329p168m1409K414N3896j03328n5503n2507O5608K0514
$$ 2723302 2788054 2920383 2913215 2871806 2874220 2928116 2824788 2769285 2716778 2782386 2802900
17908B802900J48321J77340j02615J65661J55537Q005j20131J40631J26167K39946
$$ 2802900 2951221 3128561 3025946 3191607 3347144 3355149 3235018 3375649 3501816 3741762
17898C741762K24873J15888L8609K83266J85676L99045K68451R9244K36908L71154
$$ 3741762 3966635 4082523 4121132 4404398 4590074 4989119 5257570 5356814 5593722 5964876
17888E964876O05169N62462O48682Q15046J022584J423347J871599K290092L068663
$$ 5964876 6570045 7132507 7781189 8596235 9618819 11042166 12913765 15203857 18272520
17879A8272520M609213P807533J3308414J9312321J9480361J2323395J0074777
$$ 18272520 22881733 30689266 43997680 63310001 82790362 95113757 105188534
17872A05188534J6687247J7698603M837854k2627125k5833983j0845050K720166
$$ 105188534 121875781 139574384 144412238 121785113 95951130 85106080 87826246
17865H7826246J1879456J1699496N221498P172331J4191932J1874204p048319
$$ 87826246 99705702 111405198 116626696 123799027 137990959 149865163 142816844
17858A42816844l3501542k9732856j7972628j1079715p288560n161672l875478
$$ 142816844 109315302 79582446 61609818 50530103 43241543 38079871 34204393
17851C4204393k940246k146403j412523j053652r47975j196975j088004n96242
$$ 34204393 31264147 29117744 27705221 26651569 25703594 24506619 23418615 22822373
17843B2822373k16366k3952l52822o58050l38638J58856M15856M24418N35542
$$ 22822373 22606007 22582055 22229233 21571183 21232545 21391401 21807257 22231675 22767217
17834B2767217R70781J291090J678199K270456L112348M739509P965231J3873316
$$ 22767217 23737998 25029088 26707287 28977743 32090091 36829600 44794831 58668147
17826E8668147K2606089K9297502K4773872J4417846J7543956K6214311K1000734
$$ 58668147 81274236 110571738 135345610 149763456 167307412 193521723 214522457
17819B14522457q689854m2008588l1039659r389376P766963J6155606J1486252
$$ 214522457 205832603 163824015 132784356 123394980 131161943 147317549 158803801
17812A58803801N647358J3087660J8715670Q427129k5752010m7031757l3654118
$$ 158803801 164451159 177538819 196254489 204681618 178929608 131897851 98243733
17805I8243733k0298765j3012473q989770o590081n065432l802916l031218k331342
$$ 98243733 77944968 64932495 55942725 49352644 44287212 40484296 37453078 35121736
17797C5121736j998748j853999j690575j371085j346804j204095j163542r58000
$$ 35121736 33122988 31268989 29578414 28207329 26860525 25656430 24492888 23534888
$$ [...]
##END NTUPLES=NMR SPECTRUM
##END=
