##TITLE=Analysis number 322081
Compound Code cc 04212
Project Code adrs
Chemist Name cuschem
##JCAMPDX= 6.0         $$ Bruker NMR JCAMP-DX V2.0
##DATA TYPE= NMR SPECTRUM
##DATA CLASS= NTUPLES
##ORIGIN= Bruker BioSpin GmbH
##OWNER= nmr
$$ XWIN-NMR		Version 3.5
$$ Tue Sep 12 12:22:15 2006 GMT Daylight Time (UT+1h)  MAYBRIDGE\nmr@NMR_250MHZ
##.OBSERVE FREQUENCY= 250.131544655141
##.OBSERVE NUCLEUS= ^1H
##.ACQUISITION MODE= SIMULTANEOUS (DQD)
##.ACQUISITION SCHEME= undefined
##.AVERAGES= 16
##.DIGITISER RES= 18
##SPECTROMETER/DATA SYSTEM= dpx250
##.PULSE SEQUENCE= zg30
##.SOLVENT NAME= DMSO
##.SHIFT REFERENCE= (INTERNAL, DMSO, 0, 16.522)
##AUDIT TRAIL= $$ (NUMBER, WHEN, WHO, WHERE, WHAT)
$$ ##TITLE= Audit trail, XWIN-NMR		Version 3.5
$$ ##JCAMPDX= 5.01
$$ ##ORIGIN= Bruker BioSpin GmbH
$$ ##OWNER= nmr
$$ C:\u/data/dgb/nmr/ADRS/600/pdata/1/auditp.txt
$$ ##AUDIT TRAIL=  $$ (NUMBER, WHEN, WHO, WHERE, WHAT)
(   1,<2006-09-12 12:21:52.63 +100>,<MAYBRIDGE\nmr>,<NMR_250MHZ>,
      <created by zg, POWCHK disabled, PULCHK disabled
       configuration hash MD5:
       E2 DF 36 D8 04 B2 41 60 5A D7 A3 38 5A 4B D0 FE
       data hash MD5: 64K
       D6 8B FF A6 0E 92 68 2A FA FE F3 96 7C 29 DF 66>)
(   2,<2006-09-12 12:22:07.35 +100>,<MAYBRIDGE\nmr>,<NMR_250MHZ>,
      <Start of raw data processing
       ef LB = 0.3 FT_mod = 6 PKNL = 1 SI = 32K 
       data hash MD5: 32K
       92 FF 06 63 E4 EE B7 8C 1F 1C AC B7 59 D9 91 CA>)
(   3,<2006-09-12 12:22:09.03 +100>,<MAYBRIDGE\nmr>,<NMR_250MHZ>,
      <apk 
       data hash MD5: 32K
       69 C3 A7 A6 7E 7E 49 3F 24 52 14 C3 67 57 3E 66>)
(   4,<2006-09-12 12:22:09.96 +100>,<MAYBRIDGE\nmr>,<NMR_250MHZ>,
      <abs ABSG = 5 
       data hash MD5: 32K
       39 2E 7E 94 DE 7F 32 22 45 63 6A 59 EE 84 C5 51>)
$$ ##END=
$$ 
$$ hash MD5
$$ 08 7F 74 EE 64 81 E4 4A 2A 1B F5 D1 8A AE 3D A0
##$RELAX= 
##$RELAX= 
##$RELAX= 
##$RELAX= 
##$RELAX= 
##$RELAX= 
##$RELAX= 
$$ Bruker specific parameters
$$ --------------------------
##$DU= <C:\u>
##$EXPNO= 600
##$NAME= <ADRS>
##$PROCNO= 1
##$TYPE= <nmr>
##$USER= <dgb>
##$AMP= (0..31)
100 100 100 100 100 100 100 100 100 100 100 100 100 100 100 100 100 100 
100 100 100 100 100 100 100 100 100 100 100 100 100 100 
##$AQSEQ= 0
##$AQ_mod= 3
##$AUNM= <au_zg>
##$AUTOPOS= <46 >
##$BF1= 250.13
##$BF2= 250.13
##$BF3= 250.13
##$BF4= 250.13
##$BF5= 500.13
##$BF6= 500.13
##$BF7= 500.13
##$BF8= 500.13
##$BYTORDA= 1
##$CFDGTYP= 0
##$CFRGTYP= 5
##$CHEMSTR= <none>
##$CNST= (0..31)
1 1 145 1 1 1 1 1 1 1 1 1 1 1 1 1 1 1 1 1 1 1 1 1 1 1 1 1 1 1 1 1 
##$CPDPRG= <>
##$CPDPRG1= <>
##$CPDPRG2= <>
##$CPDPRG3= <>
##$CPDPRG4= <mlev>
##$CPDPRG5= <mlev>
##$CPDPRG6= <mlev>
##$CPDPRG7= <mlev>
##$CPDPRG8= <mlev>
##$CPDPRGB= <>
##$CPDPRGT= <>
##$D= (0..31)
0 1 0 0 0 0 0 0 0 0.06 0 0 0 0 0 0 0.0002 0 0 0 0 0 0 0 0 0 0 0 0 0 0 
0 
##$DATE= 1158060111
##$DBL= (0..7)
120 120 120 120 120 120 120 120 
##$DBP= (0..7)
150 150 150 150 150 150 150 150 
##$DBP07= 0
##$DBPNAM0= <>
##$DBPNAM1= <>
##$DBPNAM2= <>
##$DBPNAM3= <>
$$ [...]
##$SUBNAM7= <"">
##$SUBNAM8= <"">
##$SUBNAM9= <"">
##$SW= 20.6930455092707
##$SWIBOX= (0..15)
0 0 3 0 0 0 0 0 0 0 0 0 0 0 0 0 
##$SW_h= 5175.983436853
##$TD= 65536
##$TD0= 1
##$TE= 296.16
##$TE2= 300
##$TE3= 300
##$TEG= 300
##$TL= (0..7)
0 120 120 120 120 120 120 120 
##$TP= (0..7)
150 150 150 150 150 150 150 150 
##$TP07= 0
##$TPNAME0= <>
##$TPNAME1= <>
##$TPNAME2= <>
##$TPNAME3= <>
##$TPNAME4= <>
##$TPNAME5= <>
##$TPNAME6= <>
##$TPNAME7= <>
##$TPOAL= (0..7)
0.5 0.5 0.5 0.5 0.5 0.5 0.5 0.5 
##$TPOFFS= (0..7)
0 0 0 0 0 0 0 0 
##$TUNHIN= 0
##$TUNHOUT= 0
##$TUNXOUT= 0
##$USERA1= <user>
##$USERA2= <user>
##$USERA3= <user>
##$USERA4= <user>
##$USERA5= <user>
##$V9= 5
##$VALIST= <valist>
##$VCLIST= <CCCCCCCCCCCCCCC>
##$VD= 0
##$VDLIST= <DDDDDDDDDDDDDDD>
##$VPLIST= <PPPPPPPPPPPPPPP>
##$VTLIST= <TTTTTTTTTTTTTTT>
##$WBST= 1024
##$WBSW= 4
##$XGAIN= (0..3)
0 0 0 0 
##$XL= 0
##$YL= 0
##$YMAX_a= 347597
##$YMIN_a= -309777
##$ZGOPTNS= <>
##$ZL1= 120
##$ZL2= 120
##$ZL3= 120
##$ZL4= 120
##$ABSF1= 16.522
##$ABSF2= -4.171173
##$ABSG= 5
##$ABSL= 3
##$ALPHA= 0
##$AQORDER= 0
##$ASSFAC= 0
##$ASSFACI= 0
##$ASSFACX= 0
##$ASSWID= 0
##$AUNMP= <proc_1d>
##$AZFE= 0.1
##$AZFW= 0.1
##$BCFW= 0
##$BC_mod= 0
##$BYTORDP= 0
##$COROFFS= 0
##$CY= 12.5
##$DATMOD= 1
##$DC= 0
##$DFILT= <>
##$DTYPP= 0
##$F1P= 14.0000005364418
##$F2P= -0.99999901652339
##$FCOR= 0.5
##$FTSIZE= 32768
##$FT_mod= 6
##$GAMMA= 0
##$GB= 0
##$INTBC= 1
##$INTSCL= 1
##$ISEN= 128
##$LB= 0.3
##$LEV0= 0
##$LPBIN= 0
##$MAXI= 10000
##$MC2= 0
##$MEAN= 0
##$ME_mod= 0
##$MI= 0
##$NCOEF= 0
##$NC_proc= -3
##$NLEV= 6
##$NOISF1= 0
##$NOISF2= 0
##$NSP= 0
##$NTH_PI= 0
##$NZP= 0
##$OFFSET= 16.522
##$PC= 1
##$PHC0= 138.8474
##$PHC1= 7.516288
##$PH_mod= 1
##$PKNL= yes
##$PPARMOD= 0
##$PSCAL= 4
##$PSIGN= 0
##$REVERSE= no
##$SF= 250.13
##$SI= 32768
##$SIGF1= 0
##$SIGF2= 0
##$SINO= 400
##$SIOLD= 32768
##$SREGLST= <1H.DMSO>
##$SSB= 0
##$STSI= 32768
##$STSR= 0
##$SW_p= 5175.98343685301
##$SYMM= 0
##$S_DEV= 0
##$TDeff= 65536
##$TDoff= 0
##$TI= <Analysis number 999999
Compound Code 99
Book Reference 9
Project Code 9>
##$TILT= no
##$TM1= 0
##$TM2= 0
##$TOPLEV= 0
##$USERP1= <user>
##$USERP2= <user>
##$USERP3= <user>
##$USERP4= <user>
##$USERP5= <user>
##$WDW= 1
##$XDIM= 32768
##$YMAX_p= 354143869
##$YMIN_p= -229578
$$ End of Bruker specific parameters
$$ ---------------------------------
##NTUPLES= NMR SPECTRUM
##VAR_NAME=  FREQUENCY,     SPECTRUM/REAL,   SPECTRUM/IMAG
##SYMBOL=    X,             R,               I
##VAR_TYPE=  INDEPENDENT,   DEPENDENT,       DEPENDENT
##VAR_FORM=  AFFN,          ASDF,            ASDF
##VAR_DIM=   32768,         32768,           32768
##UNITS=     HZ,            ARBITRARY UNITS, ARBITRARY UNITS
##FACTOR=    0.157963299565203, 1,           1
##FIRST=     4132.6476996994, 0,             0
##LAST=      -1043.33573715361, 0,           0
##MIN=       -1043.33573715361, -229578,     0
##MAX=       4132.6476996994, 354143869,     0
$$ Real data points
##PAGE= N=1
##DATA TABLE= (X++(R..R)), XYDATA
$$ [...]
17719f449N6952Q71J6025j8599l5372J948j5315n5705l7004j8397k9717L1143
17707a09619M7996O4885O9838J0056k9836k750l6995k1251K9272j2088j6561m1622
17695d8675m7434j2365K4103L6821P7665l8820m9343p0538k0178K2703K8083M4607
17683e3371M5950k1902n0778l0408k212K5571N7767J2253o5196j7645O9749R1915
17671F1693L5486L304l1213m1171o891J7708N920m0416j2645K4276n8450k250
17659d4649l8939R647L5327r705M6236k1607l7985j3656l6294P940R987Q184L3919
17646e1595J8505K4800J5770K7579k0730k303j6900k5218L8509l6300n0395K8366
17634d9912K8777l2480L2141K5184P412k501J4541P2187K3531L267o4508p0021
$$ plain form
17719 -6449 50503 51374 67399 48800 13428 15376 61 -55644 -92648 -111045 -140762 -109619
17707 -109619 -61623 3262 73100 83156 53320 50570 13575 -7676 21596 9508 -7053 -48675
17695 -48675 -96109 -108474 -84371 -47550 30115 -8705 -58048 -128586 -148764 -126061 -97978 -53371
17683 -53371 -7421 -29323 -80101 -110509 -112721 -87150 -29383 -17130 -82326 -99971 -30222 61693
17671 61693 97179 100483 69270 28099 21208 38916 44836 4420 -8225 16051 -42399 -44649
17659 -44649 -83588 -73941 -38614 -48319 -2083 -23690 -61675 -75331 -111625 -103685 -93698 -85514 -51595
17646 -51595 -33090 -8290 7480 35059 14329 12026 -4874 -30092 8417 -27883 -78278 -49912
17634 -49912 -21135 -53615 -21474 3710 11122 8621 23162 95349 118880 122147 57639 -12382
17622a2382m1342N1233K6450n3069m6783J8298J4671J7329J1614j3269K6184M1740
17610D0674J555P158r029Q483j1986o4102l0021M6439m2651l1817M3245R4190
17598E2138M8783o5867r7283j6437J6975M7062l595j7223l8246N8323j8996n5150
17586h9516P419K340j2375j3637k1220N2510K7748K08J2708P372Q461k3433k5762
17573f7177l4444K5301P4838J9541j6706j5605J5654O899o2865m1044K2178K8368
17561d5062m9368M3383M2333M2603L3387r3388j6804O2399j3858o1691l6502M1129
17549e1439L484P106q680Q408L9241L9922j7156N557k1521K5367J3776J1564m3698
17536A1931J3693J9914k1935l3894o7528o661N194j3270L2008J8751q791l5598
$$ plain form
17622 -12382 -53724 -2491 23959 -29110 -75893 -57595 -42924 -25595 -13981 -27250 -1066 40674
17610 40674 42229 49387 40358 48841 36855 -27247 -57268 -10829 -53480 -85297 -42052 52138
17598 52138 100921 35054 -62229 -78666 -61691 -14629 -18224 -35447 -73693 -15370 -34366 -89516
17586 -89516 -82097 -79757 -92132 -105769 -126989 -74479 -46731 -46523 -33815 -26443 -17982 -41415 -67177
17573 -67177 -101621 -76320 -1482 18059 1353 -14252 1402 8301 -54564 -95608 -73430 -45062
17561 -45062 -94430 -51047 -8714 33889 67276 -26112 -42916 19483 5625 -56066 -92568 -51439
17549 -51439 -47955 -40849 -49529 -41121 -1880 38042 20886 26443 4922 30289 44065 55629 11931
17536 11931 25624 45538 23603 -10291 -77819 -84480 -79286 -92556 -60548 -41797 -50588 -86186
17524h6186L3507Q090J4173J8074l511k2914k4794j032l004J6369J5871l7050
17512g2407J8580L1835K9712j6013k7550O403n1026j9941j3087P2142O5123j5718
17500H053l8188k5228j5542k0198P7010P5823l3791j3207K6628k3738k7943O829
17488c492m2549k4662J1845l0890k8825m6202R044L3362L4854O972L8019j0115
17476e2639N1675J014j368K1227o8151l2036L7841R83j2384M5195k0094l4522
17464f3259K9743K6136J216m2871Q417p045k2140k491K2160L6282J6330k5212
17452b2734k8691N808N013N0348l8921o8014m7102O435K3686K6759L037J9231
17440f5145L4834M1362K5526j5065l1645N096N3438j6022m8902m3633k4130M2764
$$ plain form
17524 -86186 -52679 -44589 -30416 -12342 -15853 -38767 -63561 -64593 -67597 -51228 -35357 -72407
17512 -72407 -53827 -21992 7720 -8293 -35843 -29440 -80466 -100407 -113494 -41352 23771 8053
17500 8053 -30135 -55363 -70905 -91103 -14093 61730 27939 14732 41360 17622 -10321 -3492
17488 -3492 -46041 -70703 -58858 -89748 -118573 -164775 -155731 -122369 -87515 -80543 -42524 -52639
17476 -52639 -964 50 -1318 19909 -48242 -80278 -42437 -41454 -53838 -8643 -28737 -63259
17464 -63259 -33516 -7380 -6164 -49035 -40618 -47663 -69803 -72294 -50134 -13852 2478 -22734
17452 -22734 -51425 -45617 -40604 9744 -29177 -97191 -144293 -137858 -114172 -87413 -84376 -65145
17440 -65145 -30311 11051 36577 21512 -10133 -5037 48401 32379 -16523 -60156 -84286 -41522
17428d1522P4487j6036m1981O270K8596k6403j3556j1379M102l5313k0724R118
17416h4341M1631m765l1242J1122L9483K6227L2939k817l5949m6702q0252M0764
17404i3902P8626l7895k8045K4084N5864K7347J3163N197Q426J577k1398j5046
17392A7998k3244n2585k0771J8728J4144j4872n5080K2282K4806J4518k5051N4131
17380b4996P3788k1520j9734j09130j9600M8976l110J11106j4826k1292p539O498
17368a379J2075J415j4867K4224M2781l2307k0138L6517o037J7578p9523o1911
17356h1572K7471P5633L5537j6047k6520K5738n6318k2327O8557J878J9129J120
17344E2279o1952o3652L5217J4804m3081P1187k2954m5675N1681k729k9744L0938
$$ plain form
17428 -41522 32965 16929 -25052 -18782 9814 -16589 -30145 -41524 -37422 -72735 -93459 -84341
17416 -84341 -42710 -47475 -78717 -67595 -28112 -1885 31054 28237 -7712 -54414 -134666 -93902
17404 -93902 -15276 -53171 -81216 -57132 -1268 26079 39242 44439 52865 54442 33044 17998
17392 17998 -5246 -57831 -78602 -59874 -45730 -60602 -115682 -93400 -68594 -54076 -79127 -24996
17380 -24996 48792 27272 7538 -101592 -121192 -72216 -75326 35780 20954 -338 -7877 -1379
17368 -1379 10696 12111 -2756 21468 64249 31942 11804 48321 42284 59862 -19661 -81572
17356 -81572 -54101 21532 57069 41022 14502 40240 -16078 -38405 30152 32030 51159 52279
17344 52279 -9673 -73325 -38108 -23304 -66385 4802 -18152 -63827 -12146 -14875 -44619 -13681
17332a3681M346j04006m4817P0232J8100k7086q0254N9002L0997L7122Q806m3498
17320h4737l4907M278m239L6374P6596j2647k428N9041m581k2459m8328j8861
17308e6898l7825m449L0768O2756N3956K7159j0443o8002j7503K2628J9825K4102
17296D6074k8058o9866l8951J7609K8886K7159n042M6276N2499k958m9387k4605
17284c64j8270Q909k9168j7940M7651M6890j4118J1549j1390p1487o717l092O6047
17271H500L9980j9469k0514j1737n2174O4609L9348K9923j1609l1964J4156K2858
17259G1907l5355m3004J6475o68K0587k143k5689Q76J6132l6765m2617k0183J7456
17246f2991N961k187M8747J9950n3541j5391o4821p830L4778j5801k3278R1796
$$ plain form
17332 -13681 -9335 -113341 -158158 -87926 -69826 -96912 -177166 -118164 -87167 -50045 -41239 -84737
17320 -84737 -119644 -115366 -119605 -83231 -6635 -19282 -21710 37331 32750 10291 -38037 -56898
17308 -56898 -94723 -99172 -68404 -5648 48308 75467 65024 -2978 -20481 2147 21972 46074
17296 46074 18016 -51850 -90801 -73192 -44306 -17147 -22189 24087 76586 73628 24241 -364
17284 -364 -18634 -9725 -38893 -56833 -9182 37708 23590 35139 23749 -47738 -54455 -57547 8500
17271 8500 48480 29011 8497 -3240 -55414 9195 48543 78466 66857 34893 49049 71907
17259 71907 36552 -6452 10023 9355 29942 27799 2110 2986 19118 -17647 -60264 -80447 -62991
17246 -62991 -57030 -59217 -10470 9480 -44061 -59452 -124273 -132103 -97325 -113126 -136404 -44608
17234d4608N4518Q10J185J4669J2346m1375m4357Q144l3308L5910K7546q5359
17222i3879q2766M7581M7787P5195j1198K8143k113j3689o4018k0521j905l968
17210i5351k6357k7150M697J4139Q6562P1364k1771m8754j7000N4618J4002k7803
17198a8804R780K3912R72q5127k8321N600q3549o032R8503K9592M9383P0793k6355
17185D0347k3676l41m1095M768j5318j4382K3002J020J0099J3102J7150J6878
17173C1554l5024M7202K1753l0604Q526k7197m7019n848j3900J5208j1763L2648
17161a4464k3378o6620M3881N8376K894k5351o9056O3697O5648k5371K9133M6085
17149H5474n2374n8294m1463m038K0814J3936O2811K7601n8349l6307R683P806
$$ plain form
17234 -44608 9910 10720 11905 26574 38920 -2455 -46812 -38668 -71976 -36066 -8520 -93879
17222 -93879 -176645 -129064 -81277 -6082 -17280 10863 8750 -4939 -68957 -89478 -91383 -95351
17210 -95351 -121708 -148858 -144161 -130022 -43460 27904 6133 -42621 -59621 -5003 8999 -18804
17198 -18804 -9024 14888 15860 -69267 -97588 -91988 -175537 -181569 -83066 -53474 -4091 66702 40347
17185 40347 16671 16330 -24765 -19997 -35315 -49697 -26695 -25675 -15576 -2474 14676 31554
17173 31554 -3470 43732 65485 34881 43407 16210 -30809 -36657 -50557 -35349 -47112 -14464
17161 -14464 -37842 -104462 -60581 -2205 689 -24662 -93718 -30021 35627 10256 39389 85474
17149 85474 33100 -25194 -66657 -70695 -49881 -35945 26866 54467 -3882 -40189 -30506 -22700
17137b2700q745L5780n409o992M5353J8083j6818k811j2747q066l6827k0440K8977
17124a3362j099q573O340R257J0947n573l4753N798M3038k932O5352k0643n7128
17111c331N314m514J4781k0593k2o9582j1848K2926R595j3197J8567k5112j3429
17098i0445J5942J3362J9831J9402j3967J3944K2298k2711j2586M3299L5035o241
17086C7163j7074k122m0352m6760j8615M4445O8039j6650l8298l9010M315j4409
17074g9328L2220K1417O8174J1005q5578n2877J155N6953K8351p9362o1796L9211
17062a00455Q9861O182K2299o311p2917l506J7536J7546Q86J5488K5055J01216
17050A12880L66K1139m2631o5679N4595m248k2820m6933j2184k5237m243M4l1518
$$ plain form
17137 -22700 -31445 4335 -1074 -8066 37287 55370 38552 35741 22994 14928 -21899 -42339 -13362
17124 -13362 -14461 -23034 -16694 -7437 3510 -2063 -36816 -31018 12020 9088 74440 53797 -3331
17111 -3331 1983 -2531 12250 -8343 -8365 -77947 -89795 -66869 -57274 -70471 -51904 -77016 -90445
17098 -90445 -74503 -61141 -41310 -21908 -35875 -21931 367 -22344 -34930 8369 43404 37163
17086 37163 20089 17967 -22385 -69145 -87760 -43315 24724 8074 -30224 -69234 -64919 -79328
17074 -79328 -47108 -25691 42483 53488 -32090 -84967 -83812 -26859 1492 -77870 -139666 -100455
17062 -100455 -10594 -4412 17887 11576 -61341 -64847 -47311 -29765 -28879 -13391 11664 112880
17050 112880 113246 134385 91754 26075 80670 76422 53602 6669 -5515 -30752 -34995 -34951 -66469
17037f6469k5123J3626Q6344L4512J6204j2327M2324K4874J7761p5954j7382K0316
17025E8706j3005o9573k1904j3936j1688k6731o430L5121L0093j4037L1222K6777
17013D615l0735k6381L767N633K2152K3776K5897N3702j1508k0022k5055k7625
17001a784P9606J19521Q1172M2886J6354M1601L7270J6163Q7809L7105j0629k5483
16989E21591m665m1432p7558r1182n7460p218p8634m8430j6547j3468n939K6806
16977A05864J9644m57m3256k3308j2543L5504j7122R412k1199j9365L2623P8683
16965A44480K0830o5617o3352O5024m163m7842l9024K5889j5226q0567o1258L4602
16953h6224Q3205O8730K1225p841q834J1165Q010k8675Q214j5298l0786q124k4618
$$ plain form
17037 -66469 -91592 -77966 8378 42890 59094 46767 89091 113965 131726 55772 38390 58706
17025 58706 45701 -23872 -45776 -59712 -71400 -98131 -104561 -69440 -39347 -53384 -22162 4615
17013 4615 -26120 -52501 -48734 -43101 -20949 2827 28724 82426 70918 50896 25841 -1784
17001 -1784 77822 197343 278515 321401 337755 379356 416626 432789 520598 557703 547074 521591
16989 521591 516926 475494 397936 306754 249294 242076 163442 115012 98465 84997 79058 105864
16977 105864 125508 125051 81795 58487 45944 81448 64326 73738 52539 33174 65797 144480
16965 144480 165310 99693 36341 101365 97202 49360 10336 36225 20999 -59568 -120826 -86224
16953 -86224 -3019 65711 86936 79095 70261 81426 89436 60761 68975 53677 22891 14767 -9851
16940i851k9519r798K2011J9163K091L5323L9659M7214l8808q9436l0784j4312
16928e7047L957n8677m4307M1971O4371l8066J3778L7692Q158q7256J9514J8731
16916g7181n798N4223K5142Q344L5455l4987j5207q89o2433q716M3497L3450k3126
16903b8226M3085M9142j4763m5454o2716o022R745K7195J9016k1345J3541K1212
16891D410J6672K8488n1401p4854k1458j8758P548P8694L1302N3407N2414k0181
16879H6283m8389q4094j714M2771m2849K0209R2474J071m206J5344J0742O749
16867I4391j604j1265o1894p6605J8640N3629l6570l0167K3513n087N1939J4124
16855C3044M4489r313r4613k7150R313L155L4652j0827O7767J2382n4260K0209
$$ plain form
16940 -9851 -39370 -49168 -27157 -7994 -5903 29420 69079 116293 77485 -11951 -42735 -57047
16928 -57047 -53090 -111767 -156074 -114103 -49732 -87798 -74020 -36328 -28170 -115426 -95912 -77181
16916 -77181 -82979 -28756 -3614 4730 40185 5198 -10009 -10898 -73331 -82047 -38550 -5100 -28226
16903 -28226 14859 64001 49238 3784 -58932 -64954 -55209 -28014 -8998 -30343 -16802 4410
16891 4410 21082 49570 -1831 -76685 -98143 -116901 -109353 -30659 643 54050 106464 86283
16879 86283 37894 -46200 -47914 -5143 -47992 -27783 64691 65762 61556 76900 87642 94391
16867 94391 92787 81522 19628 -56977 -38337 15292 -21278 -51445 -27932 -33019 18920 33044
16855 33044 77533 68220 -26393 -53543 -44230 -41075 -6423 -17250 50517 62899 8639 28848
16843B8848j9289L2053J6384o3516j6081P5500L4291l332p3160J2152k4516l6293
16831c6959n0468r00P0304O4713k0980n863p3725k3968R266L6989N6528k7046
16819b109j01768L7594R5410o758p3713p2943O0291N6880K1508j9862N4841j5276
16807C4095L7850J5603l7065k9766l4220l4320k9517J3695K3869J7428r797m5438
16795g7583L9275M3307L0790m7635L0466K0715j9052m0681l7833l9466J7063O4317
16783a6317M0473k7394k9917o482j7243l5986M6342j0569M296K5783K065J6483
16771h466Q78K8687L9271K5074j1027l4260J4816m3620l3954L0275O6140k6885
16759D6929r0787o009J6611j7697l2182m0485O6090L0058J7091l7208n9444L248
$$ plain form
16843 28848 9559 41612 57996 -5520 -21601 53899 88190 84858 11698 23850 -666 -36959
16831 -36959 -87427 -88327 -18023 46690 25710 19847 -53878 -77846 -68580 -31591 24937 -2109
16819 -2109 -103877 -66283 29127 22369 -51344 -124287 -63996 -7116 14392 -5470 49371 34095
16807 34095 71945 87548 50483 20717 -13503 -47823 -77340 -63645 -39776 -22348 -32145 -77583
16795 -77583 -38308 4999 35789 -11846 18620 39335 20283 -20398 -58231 -97697 -80634 -16317
16783 -16317 24156 -3238 -33155 -39637 -56880 -92866 -46524 -57093 -52797 -27014 -24949 -8466
16771 -8466 -7588 21099 60370 85444 74417 40157 54973 11353 -22601 7674 73814 46929
16759 46929 -43858 -49867 -33256 -50953 -83135 -123620 -57530 -27472 -10381 -47589 -107033 -103785
16747a03785R1451J8302Q170l625L440k7915l2689K7204O519L6081q825l7016
16735b2688K0653j3329J8779r12J6195p2419o8215l0355L5143M585N8326L4121
16723b0116l0136j740N2784Q239J5385N211L3075j8272Q639L2462l0532k0575
16711C4424m5405q3295K4954L690L6516n1766o29L7708K5553L6196n727m7108
16699c4889l1503K2552j3659k5469M9024K1405r258m2943K6568J1316J2199n0246
16687f4903m4602M5828L1736M0855J5372j0841l6278l1801O196L9485L0561L3829
16675E5437J6573j118P575l9173k5401k289j3352j6450o8418M3722L5052n0046
16663e7888n6335J8015K8185l5050J7580J0088O0110J2865l4769k6180l0439K6970
$$ plain form
16747 -103785 -12334 5968 14138 10513 13953 -13962 -46651 -19447 -12928 23153 14328 -22688
16735 -22688 -2035 -15364 3415 2503 18698 -53721 -121936 -152291 -117148 -112563 -54237 -20116
16723 -20116 -50252 -51992 792 9031 24416 29627 62702 44430 53069 85531 54999 34424
16711 34424 -10981 -94276 -69322 -65632 -29116 -80882 -81511 -43803 -18250 17946 12219 -34889
16699 -34889 -66392 -43840 -57499 -82968 -33944 -12539 -21797 -64740 -38172 -26856 -14657 -64903
16687 -64903 -109505 -63677 -31941 8914 24286 13445 -22833 -54634 -48438 -8953 21608 55437
16675 55437 72010 70892 78467 39294 13893 11604 -1748 -18198 -86616 -42894 -7842 -57888
16663 -57888 -114223 -96208 -68023 -103073 -85493 -75405 -15295 -2430 -37199 -63379 -93818 -66848
16651f6848L5256L6587m2401l0876N8326M3737J7023j5407o1762J2456J5975l1201
16639b9135R450J0856O513K52L8679n294l0483m0874L2173K3958k1829j7574K4716
16626A408n3839j9802R276M1105O699k1380L277j6321N3126L6994m4837m8384
16614e2678p597L5943P915q2740l3123n686J2682k3077J2138L141L1380K1685
16602h0017O4871O891k8551J8472l6711k5180R9137J44J2136p0941j722K1267
16590b0204N9992R883K564K8000l5087l4363l4796j8175R816Q0309M6405l0221
16578F4123N264K980m4666j6293J7227n7727m2609J0127N1250N263q4308j0163
16566i9532L1241J0270K691m915K6078J3294M0202m7047J6896Q33k9377J0094
$$ plain form
16651 -66848 -31592 4995 -37406 -68282 -9956 33781 50804 35397 -26365 -13909 2066 -29135
16639 -29135 -19685 -8829 -2316 -2064 36615 31321 838 -40036 -7863 16095 -5734 -23308 1408
16626 1408 -52431 -72233 -62957 -21852 -15153 -36533 -33256 -49577 3549 40543 -4294 -52678
16614 -52678 -60275 -24332 -16417 -99157 -132280 -137966 -125284 -148361 -136223 -133082 -101702 -80017
16602 -80017 -15146 -8255 -36806 -18334 -55045 -80225 18912 19056 31192 -39749 -41471 -20204
16590 -20204 39788 49671 52235 80235 45148 10785 -24011 -42186 -32370 47939 94344 64123
16578 64123 69387 72367 27701 11408 28635 -29092 -71701 -61574 -10324 -5061 -89369 -99532
16566 -99532 -68291 -58021 -55330 -60245 -34167 -20873 19329 -27718 -10822 -9989 -39366 -29272
16554b9272n221L7539m093m5379K9142J8260N3792N8266l6480r2949K1517J6269
16542B1391k1643J5586l7287Q235l3360j2872o977l9712J03133N0508J884o784
16530D2102k8072n4659k7147m0364K4857R6211M4804j6196m9367k4422j0953J0325
16518c2881Q3805K913q9929k9033L2346j1564o3489M5321K6161m6466Q971L2179
16506d1666M3576o6463q6930p484Q5906K8796l9897M1822L7166J044K4707n780
16494A4797j3490k5868j5147r352j0786k2759L2504K7352j8852j0280J9651L1194
16482a036J759m6485J669J1252J2909K6387n268j8992L3955n1089J886O6912m9809
16469a5950j3642O5682J2523J8711j3841j6777J0887M7595j563o9930n3704L1873
$$ plain form
16554 -29272 -34493 3046 -1047 -46426 -17284 976 54768 113034 76554 -16395 5122 21391
16542 21391 -252 15334 -21953 -13718 -47078 -59950 -66927 -106639 -3506 47002 48886 42102
16530 42102 14030 -40629 -67776 -108140 -83283 12928 57732 41536 -7831 -32253 -43206 -32881
16518 -32881 50924 53837 -36092 -65125 -32779 -44343 -107832 -62511 -36350 -82816 -73845 -41666
16506 -41666 1910 -64553 -151483 -158967 -73061 -44265 -84162 -42340 -5174 -4130 20577 14797
16494 14797 1307 -24561 -39708 -49060 -59846 -82605 -50101 -22749 -41601 -51881 -32230 -1036
16482 -1036 723 -45762 -44093 -32841 -19932 6455 1187 -17805 16150 -34939 -33053 33859 -15950
16469 -15950 -29592 36090 48613 67324 53483 36706 47593 95188 93625 23695 -30009 1864
16457A864L7300j00275m5880j8231M3313L2789J1255j1647l230L9918P5965r697
16445E3444N299l0136J70k7616j64K8825K4131L9471l6388o3427k3091P257j7655
16432c9880M7343Q1994l0316q5885k1518k1939k621M6827N1189L5660J2464K560
16420G5878n6778N966L2617o2963n1711L1498j1032j6981m3911p640K5191Q2525
16408B659K9490K3470l2408k5267N690J4302O2925L9061K1368o2339o8384k7988
16396a7421m4933N1125R4565j0946l1306n7213l2725L0298m112J4986k9353O77
16384c6358k6191l093K9740K5792j4926j9484P511k840J6630N74P5659j9794l3326
16371a06L4114k5014K780P526o3345k8887J6609J0891K3460J7209K0325L8378
$$ plain form
16457 1864 39164 -61111 -106991 -125222 -81909 -49120 -37865 -49512 -52742 -12824 63141 53444
16445 53444 58743 28607 28777 1161 997 29822 53953 93424 57036 -6391 -29482 -22225 -39880
16432 -39880 7463 89457 59141 -26744 -48262 -70201 -72822 -25995 25194 60854 73318 75878
16420 75878 19100 25066 57683 -5280 -56991 -25493 -36525 -53506 -97417 -105057 -79866 2659
16408 2659 32149 55619 23211 -2056 3634 17936 80861 119922 141290 78951 10567 -17421
16396 -17421 -62354 -11229 83336 72390 41084 -16129 -48854 -18556 -22668 -7682 -37035 -36358
16384 -36358 -62549 -65642 -35902 -10110 -25036 -44520 -37009 -39849 -23219 -22645 53014 33220 -106
16371 -106 34008 8994 11774 19300 -44045 -72932 -56323 -45432 -21972 -4763 15562 53940
16359E3940k7789m4657K763Q2983l526r3097O07p238r248L937K1971O724O0805
16346D8175M3670j2605m3287L2737l1778J2641O8345Q85j6830n54k4541o918k9696
16333D0244l4945p0861L1715n528l2492j7723J4738M4273P7598j3964l8462l2936
16321c8343O498K1966j1539j1454K4314L6440p12j0135n8432l0060K222J8435
16309e0800K5081j9032l3376n3854K6482N6572m4842m8044N2681N4546N455K6335
16297b796k5717K765M569K6275K4728k118m2060k2721J8925k185p757N4776P066
16284C3750l3024K6251J6904l2808m7108p516J4920J7469K5013J0060n070j1606
16272G235k5001m9905l4279M8834M7685N2272m1090j8412L2808j4511j13328N171
$$ plain form
16359 53940 26151 -18506 -15743 67240 63714 -29383 -28776 -36014 -45262 -41325 -19354 -12630 48175
16346 48175 91845 79240 35953 68690 36912 49553 117898 118783 101953 101399 76858 69940 40244
16333 40244 5299 -65562 -33847 -39375 -71867 -89590 -74852 -30579 47019 33055 -5407 -38343
16321 -38343 -31845 -9879 -21418 -32872 -8558 27882 27170 17035 -41397 -71457 -69235 -50800
16309 -50800 -25719 -44751 -78127 -131981 -105499 -48927 -93769 -141813 -89132 -34586 -29131 -2796
16297 -2796 -28513 -25748 -21179 5096 29824 27706 -14354 -37075 -18150 -20335 -28092 26684 33750
16284 33750 726 26977 43881 11073 -36035 -43551 -28631 -11162 13851 23911 18841 7235
16272 7235 -17766 -67671 -101950 -53116 -5431 46841 5751 -12661 20147 5636 -107692 -102521
16260a02521O1045O9886R763K6705P302k2260k0900j6938n8068L8592Q460K7091
16248B8157M59o227m955j9199j2551K3920j4413L5710K7273J8375K8142k6922
16236G7769j33K356m259q0223o9876m5938M8866L7655M3328M831n4125j7507L81
16223e6875j2599n1220P6566Q4252K0661j3132q8026j2283P9485Q7585j8406m9035
16211D6973m7282p7885k984O0052P1175n5461n0571K4249J7949m2643j009l278
16199f0715J8744J1006m0823l0194O4569M0021J5339m169k9555m0871L0648O4793
16187C8793J9263o0414q782m0961j9534M5814N960K7104m7577j424K7104M3211
16175B8557J3696k730l1630j1320o9450M3210J0992M1370j6547K0138q6637k7215
$$ plain form
16260 -102521 -41476 28410 38173 64878 72180 49920 29020 12082 -45986 -7394 1066 28157
16248 28157 28616 22389 17434 -1765 -14316 9604 -4809 30901 58174 76549 104691 77769
16236 77769 77636 79992 75733 -4490 -74366 -120304 -71438 -33783 9545 14376 -39749 -57256 -56875
16223 -56875 -69474 -120694 -44128 40124 60785 47653 -40373 -52656 26829 114414 96008 46973
16211 46973 -309 -78194 -81178 -21126 50049 -5412 -55983 -31734 -13785 -56428 -57437 -60715
16199 -60715 -41971 -30965 -71788 -101982 -37413 2608 17947 13778 -15777 -56648 -26000 38793
16187 38793 58056 -2358 -11140 -52101 -71635 -25821 -19861 7243 -40334 -41758 -14654 28557
16175 28557 42253 39523 7893 -3427 -72877 -29667 -18675 22695 6148 26286 -60351 -87566
16163h7566M5831l0545L4909Q279o981l114J2612J891J8754K8156N2184m3806
16151C0604l311n498j4600N579k3161j6109J706j3107j6377J526J4844O9766J4635
16138D6497k2054l7459n8509J349K2473L2244O706q1756Q25K5245k7546o3290
16126a55275m4842N4232P6853P1510K5654L982k2076l6790Q356L5198j2918k9342
16114b5458j389k4322J7371n1209J5386L0238J2814Q571L9244K8058m3400k6065
16102b0161O2282K207m7264k1251K0040J6427R685N63K6753K8882k3839n5506
16090a182l1075L4930j558n3329n486O5433L7528K0792J6456K0394M0298n7005
16078H6196n204K3073m471o9669k970J1411l4465n5710j4121O8634k557j5554
$$ plain form
16163 -87566 -41735 -72280 -37371 -29092 -36073 -39187 -26575 -24684 -5930 22226 74410 30604
16151 30604 27293 21795 7195 12774 -10387 -26496 -24790 -37897 -54274 -52748 -37904 31862 46497
16138 46497 24443 -13016 -71525 -70176 -47703 -15459 -8753 -90509 -89684 -64439 -91985 -155275
16126 -155275 -200117 -145885 -69032 2478 28132 32114 10038 -26752 -18396 16802 3884 -25458
16114 -25458 -26847 -51169 -33798 -85007 -69621 -39383 -26569 -17998 21246 49304 5904 -20161
16102 -20161 42121 44328 -2936 -24187 -4147 12280 21965 22528 49281 78163 54324 -1182
16090 -1182 -32257 2673 1115 -52214 -57700 7733 45261 66053 82509 102903 143201 86196
16078 86196 80992 104065 99594 29925 26955 38366 3901 -51809 -65930 2704 147 -15407
16066a5407L1891M074k1145p8030k6854R6440K231m7834l3039k255L5365K0516
16054c4047k2745q272R157K6499l7946L166j0608o4743P0605J6362K4422L8870
16042A0720K0973m2107k5075L0176O444o2855l6516N3318N3451N9003l6094l5074
16030c636J2340o900L3893K139o0416m531L1966J0092K389k4831K602L0238L3933
16017E9278p55k8948p7326N5224P1739o3660k8327K2149j1133j3247K5665q269
16005B390n0038N0702L3206q065j9590J4080j6684j4203K7416j0914r864R2646
15993I1082j5478q8932m7659k0996L6861J2741l018n8789K4738J2601k9460L4703
15981e1606m8871l1786K2030N3524M7051j1145n9889j543K0312M0908P2877K5825
$$ plain form
16066 -15407 16484 20558 -587 -78617 -105471 -9031 -6800 -54634 -87673 -89928 -54563 -34047
16054 -34047 -56792 -65064 -55907 -29408 -67354 -64188 -74796 -139539 -68934 -52572 -28150 10720
16042 10720 31693 -10414 -35489 -5313 1131 -61724 -98240 -44922 8529 67532 31438 -3636
16030 -3636 8704 1804 35697 37836 -22580 -27111 4855 14947 17336 -7495 -4893 25345 59278
16017 59278 58523 29575 -47751 7473 79212 15552 -12775 9374 -1759 -15006 10659 2390
16005 2390 -47648 3054 36260 28195 8605 22685 6001 -8202 19214 8300 -1564 91082
15993 91082 75604 -13328 -60987 -81983 -45122 -32381 -35399 -94188 -69450 -56849 -86309 -51606
15981 -51606 -100477 -132263 -110233 -56709 -9658 -20803 -80692 -82235 -61923 -21015 51862 77687
15969G7687l8685L676O5660k9904p998R1523j9534j03256l8895M917o224K4357
15957B3324j8598m8065J9680K5152K068k8343J9541N0095N045M6112m2835p5616
15945b2440j5476O3427K6989j6277k140j2343j7289j883k1070k7055L7847K7105
15933A9395k0199j4565k694K9564N438n9225L6j562N7123o848K5838J0418L4246
15920G6965q170k1304p6141J4748K6453q9066n6332J5863L09L2994L0556O146
15908d6979K936J0808K2674P060P7357K6781p8677J7210L84J9942O153m4472K6404
15895D7581m915O964j1030k0840m4421m5555M9694M1631K3913O08O3176n4421
15883E2385q8961k0615M732m015M1312N1988M472L5554k2371O579k4559j408o5025
$$ plain form
15969 77687 39002 42678 108338 78434 70436 161959 142425 39169 274 5191 -1033 23324
15957 23324 4726 -43339 -23659 1493 3561 -24782 -5241 44854 49899 96011 53176 -22440
15945 -22440 -37916 25511 52500 36223 34083 21740 4451 2568 -18502 -45557 -7710 19395
15933 19395 -804 -15369 -18063 11501 16939 -42286 -42250 -43812 13311 6463 32301 42719 76965
15920 76965 68795 47491 -28650 -13902 12551 -76515 -132847 -116984 -116675 -83681 -53125 -46979
15908 -46979 -44043 -33235 -10561 -3501 73856 100637 21960 39170 39554 59496 65649 21177 47581
15895 47581 42666 49630 38600 17760 -26661 -72216 -22522 19109 43022 43630 106806 52385
15883 52385 -36576 -57191 -52459 -56474 -15162 36826 41298 76852 54481 61060 36501 35093 -29932
15870b9932o7316L9030R7688K0067o2378k8561M9059O9320q5423q5934P020Q4513
15858G153k0365J6988M5462n2227K4345J7510k3702m828p2354p4671L8913O1401
15846c6375k7674o9097L2529Q3421O311L559P308l4873K1688N2094J6438L887
15834E9216l8350K1922K4994j431k0597o3998j2129O518K418j1008M4803j7248
15822d890r653k4043o8309J8342N2481j0741p380k6890J4526P5334J9443k6094
15810B126n016N7764O48m337j8669k1753J4899K7232l1176k4701Q558j105o902
15797b432K7852R44j6324n2494m3892K8704K4319m993l6521M9125O2644J5890
15785E2822m5860n6339o3980L0411N3649K7678M141Q463r8120J7832L6215p977
$$ plain form
15870 -29932 -97248 -58218 39470 59537 -2841 -31402 17657 86977 1554 -84380 -77360 7153
15858 7153 -13212 3776 49238 -2989 21356 38866 15164 10336 -62018 -136689 -97776 -36375
15846 -36375 -64049 -133146 -100617 -17196 -10885 -7326 -18 -34891 -13203 38891 55329 59216
15834 59216 20866 42788 67782 66351 45754 -18244 -30373 -23855 -21437 -32445 12358 -4890
15822 -4890 -14543 -38586 -106895 -88553 -36072 -46813 -54193 -81083 -66557 8777 28220 2126
15810 2126 -2890 54874 55522 51185 32516 10763 25662 52894 21718 -2983 5575 4470 -2432
15797 -2432 25420 26364 10040 -42454 -86346 -57642 -33323 -38316 -74837 -25712 36932 52822
15785 52822 6962 -49377 -113357 -82946 -29297 -1619 2522 10985 -87135 -69303 -33088 -41065
15773d1065l0249J9665M5945l5035j2356J3653O6189K7343J3822k7422q837L4247
15761F5900L5903J3501o1844k1790n0547q4356O701N5187N3495J9798m3127O858
15749d321O184J991M3505O811M202j3225l240l6929k0150L784K9753L0549k9712
15736A9202k7281L0150K8925l24K5296J9706R790L259k6308k0733L6395k8090
15724F9987j8365j2769k158K5614M5702n9874j9366J4640q803N232J4850p848
15712D6842l7715m0696n817k8K6861n196n12K9073O558J1251l9235k8167k7676
15699f4457L7213k3864m543O0412L0299j8921l3082J7352L0295l7062J2756O8168
15687G4566p498p7686l0361k6967l625j3270n3926J0461J9886L1686l432M0115
$$ plain form
15773 -41065 -71314 -51649 -5704 -40739 -53095 -39442 26747 54090 67912 40490 31653 65900
15761 65900 101803 115304 53460 31670 -18877 -103233 -96532 -41345 12150 31948 -11179 -4321
15749 -4321 1863 3854 47359 54170 58372 45147 41907 4978 -15172 -11388 18365 48914 19202
15736 19202 -8079 22071 50996 50672 75968 95674 105464 108723 82415 61682 98077 69987
15724 69987 51622 38853 36695 62309 108011 48137 28771 43411 34608 39840 54690 46842
15712 46842 9127 -31569 -37386 -37414 -10553 -15749 -16261 12812 19370 30621 -8614 -36781 -64457
15699 -64457 -27244 -51108 -55651 4761 35060 16139 -16943 409 30704 -6358 6398 74566
15687 74566 67068 -10618 -40979 -67946 -71571 -84841 -138767 -128306 -108420 -76734 -80166 -40051
15675d0051K3314M619l920p9030K1444Q859P4126K1620j5300m6226l2383r771
15663g2699M6610j3636P141l1840j1936K5099J7432J1602L620J3171j9880J3956
15651a1360P050o2820M813R107K1944J0257o791k6989R147J2328K7669q0572J5628
15638g0589N059l1263K7326K1495j6811j6364L9695J0768k7673j4585N3179N8305
15626C8542j4317m5913l164J3926p627L2225M4842o180j0124R914k7237k5993
15614a106L6559L9408o4179m3763j3759j992Q435m238J0857L9609L4004m5220
15602e385Q271K7979R776J7436j0989R021n5458p7102n4863R4091R1253m529l9407
15589A0094k9795k142K5120L7440r752n9919o4438L8975P5863K9934r654K4537
$$ plain form
15675 -40051 -16737 -12118 -16038 -95068 -73624 -64765 9361 30981 15681 -30545 -62928 -72699
15663 -72699 -26089 -39725 -32584 -64424 -76360 -51261 -33829 -22227 -18607 -5436 -25316 -11360
15651 -11360 -4310 -67130 -62317 -53210 -31266 -21009 -27800 -54789 -45642 -33314 -5645 -86217 -70589
15638 -70589 -65530 -96793 -69467 -47972 -64783 -81147 -41452 -30684 -58357 -72942 -19763 38542
15626 38542 24225 -21688 -24852 -10926 -18553 13672 58514 52334 42210 52124 24887 -1106
15614 -1106 35453 74861 10682 -33081 -46840 -48832 -40397 -44635 -33778 5831 39835 -5385
15602 -5385 2886 30865 40641 58077 47088 56109 651 -76451 -131314 -37223 54030 49501 10094
15589 10094 -19701 -21843 3277 40717 30965 -28954 -93392 -54417 21446 51380 41726 66263
15577F6263p082k4873p4182l3950l0733j0546J9595Q9684N719m7555j7989L0416
15565c5233q1377n52K2941q334M4693j1221P334L3192K3125M9320q174p5125k2236
15552f1647K6507j060n1052l8494J4917K0289K9233m92k4854L4991K428j3319
15540f2553L6502K4138K1339J6828l9358q6217o8567M1284P0642M3739j1042J340
15528a1925J9030l4025m2199L8261L3057m084j4708j9855j4253L8836r948n815
15516b7628J4527O879j3011o696L7216L0282L667o5757n408J6784j042m4010l3645
15503h7842J1843k4680K0100l1914m3577N2070O1380K6268j0738J9760j4925Q654
15491a3601L2645l2126r272L9778N226k9630r107j4820J3340J1734K5866q26P251
$$ plain form
15577 66263 59181 34308 -39874 -73824 -104557 -115103 -95508 -5824 -105 -47660 -65649 -35233
15565 -35233 -116610 -117162 -94221 -102555 -57862 -69083 -61749 -28557 -5432 43888 35714 -39411 -61647
15552 -61647 -35140 -36200 -87252 -125746 -110829 -90540 -61307 -61799 -86653 -51662 -49234 -62553
15540 -62553 -26051 -1913 19426 36254 -3104 -89321 -157888 -116604 -45962 -2223 -13265 -11925
15528 -11925 7105 -26920 -69119 -30858 2199 -1885 -16593 -36448 -50701 -11865 -21813 -27628
15516 -27628 -13101 -6222 -19233 -25929 11287 41569 45236 -20521 -25929 -9145 -10187 -54197 -87842
15503 -87842 -75999 -100679 -80579 -112493 -156070 -104000 -42620 -16352 -27090 -7330 -22255 -13601
15491 -13601 19044 -13082 -22354 17424 22650 -6980 -16087 -30907 -17567 -5833 20033 19207 26458
15478B6458r089m0384j0882j1115r330k1665K0519O2397N73m7612j4644m492o933
15465f6199j7616L7051J8733m1561R113K2755j1813L3708M067K2531l3765k4320
15453d7316l2792R794K2867k8565m3696L780O6051Q5435K0071l8615n422k4213
15441a2621o8170L083L3934N3978J9844k186J5903J6133r742n2751k3774M1839
15429A5470L9493j1896q086q926l2188k6069Q33L8033J8849j650q9491k9760m6762
15416a42150M5486N6348K7226k1328l6110M3074K6148J4611r612l5573l49L0572
15404a657N1699J2262L7379j4680o8866l333R732j4275l5685j91j4284M3786o723
15391d836k8390L5029l9441r358j4053j2637O0423J2370m1647O801O7152J4391
$$ plain form
15478 26458 17369 -23015 -33897 -45012 -54342 -76007 -55488 6909 7482 -40130 -54774 -59266 -66199
15465 -66199 -83815 -46764 -28031 -69592 -60479 -37724 -49537 -15829 -11762 10769 -22996 -47316
15453 -47316 -80108 -70314 -47447 -76012 -119708 -115928 -49877 35558 55629 17014 11592 -12621
15441 -12621 -80791 -77708 -43774 10204 30048 27862 43765 59898 50156 -2595 -26369 15470
15429 15470 54963 43067 34981 26055 -6133 -32202 -31369 6664 25513 23863 -65628 -95388 -142150
15416 -142150 -96664 -40316 -13090 -34418 -70528 -27454 -1306 13305 3693 -31880 -32229 -1657
15404 -1657 50042 62304 99683 85003 16137 12804 22536 8261 -27424 -27615 -41899 1887 -4836
15391 -4836 -33226 1803 -37638 -46996 -61049 -73686 -13263 -893 -42540 -35739 31413 45804
15379D5804j08526m9027J8181J13688L5393j6124m3123k5826l0810J4198L7381
15368h791p613l3118l389O710L7951k2733J5533J2106K326J693o6431P067o065
15355f4754j1888M923K9793K3458m3137k0894n0546o3053N4729L2951l5126K1690
15343a21854O1853P4611N5125q902J2907n2845K6327k1153m056J0013k7490l4584
15331c0048k6563j2946J7693j416l8832J2489p714L7518K6429O3104J3837l1796
15319B1755j05663o9532L7411Q9300L6730n3319q303l040J9032J9947M115k2707
15307c4274J7834P301j8420j6039K3194O5722J912o5224L35M654J0064L1185O29
15294B8873r173j5047k8857j994l0160m2192J9542O1623L4150r862K400q06K129
$$ plain form
15379 45804 -62722 -111749 -93568 20120 55513 39389 -3734 -29560 -60370 -46172 -8791
15368 -8791 -16404 -49522 -52911 -46201 -8250 -30983 -15450 -3344 -1018 675 -65756 -58689 -64754
15355 -64754 -76642 -71719 -41926 -18468 -61605 -82499 -133045 -196098 -141369 -108418 -143544 -121854
15343 -121854 -60001 14610 69735 60833 73740 20895 47222 26069 22013 32026 4536 -30048
15331 -30048 -56611 -69557 -51864 -53280 -92112 -79623 -87337 -49819 -23390 39714 53551 21755
15319 21755 -83908 -153440 -116029 -26729 10001 -43318 -51621 -54661 -35629 -15682 -11567 -34274
15307 -34274 -16440 -9139 -27559 -43598 -20404 45318 47230 -17994 -17659 -13005 -2941 28244 28873
15294 28873 19700 4653 -24204 -26198 -56358 -98550 -79008 -17385 16765 6903 9303 8497 10626
15281A0626L856K8692j1410J3445n1787m5677O756L243M344M3598K3485K3882
15269E3053L0142n8917l0778n4443k0689J0523j6062J4885j0776Q7578P5063k2710
15257E6869j4866k4702p374k1272n2527L2155K556k9215L0247O2508M9266J4291
15245I7936k2933k5681j7678K2462r718P762l573j0738l502j4665m5988l5361
15233f1677K6645k5536K590J7471j5746l0476K9632j067m4820M6207m367k1437
15221h2581j6031J14M3467J824l0769K7589M6660j6749K3683m297j7106N5054
15209C0858q417O7015m1070q0751k9713j2433j1486q64J5627K3645J3282l0280
15197f4587L4344L8073L0987k7989R139L4268J7032K1165l3089l9714l1898m83
$$ plain form
15281 10626 14482 43174 31764 45209 -6578 -52255 -45499 -42256 -37912 5686 29171 53053
15269 53053 83195 24278 -6500 -60943 -81632 -71109 -87171 -72286 -83062 4516 79579 56869
15257 56869 42003 17301 9927 -11345 -63872 -31717 -29161 -58376 -28129 34379 83645 97936
15245 97936 75003 49322 31644 54106 44388 52150 48577 37839 34337 19672 -26316 -61677
15233 -61677 -35032 -60568 -57978 -40507 -56253 -86729 -57097 -58164 -102984 -56777 -61144 -82581
15221 -82581 -98612 -98498 -55031 -53207 -83976 -56387 -9727 -26476 -2793 -7090 -24196 30858
15209 30858 22441 89456 48386 -32365 -62078 -74511 -85997 -86861 -71234 -47589 -34307 -64587
15197 -64587 -30243 7830 38817 10828 19967 54235 71267 92432 59343 19629 -12269 -12752
15185a2752J9985J5705J2696k1949q9714J6521K7937N3886j665M0554k2988k6236
15173A1980K7450K1350n3372p5701Q571j1709K2757L2800j5444k8815J3037O415
15161d0681O3563M2484q96l3090K1055l9497m4361k8370K7799k0625K717p741
15149e7643L328k9449j9872M2934O9845j8627l3726N6279R446m3886o548M5446
15137A7527M9164k9526P541K4852k7239J2518l8019q262j8016K6788k5711m9502
15125e7885m739l879j410Q743M0088O867n5605o249L928K7333M0997P782J6944
15112B2915n1425o2158p0052J18299P6213Q3956m9384n6648q502j3146J6979o79
15100F368J1555m2028K6136O5225l5185m0834J3587L8048o305m2342j2182L9911
$$ plain form
15185 -12752 7233 22938 35634 13685 -76029 -59508 -31571 22315 20650 61204 38216 11980
15173 11980 39430 60780 7408 -68293 -59722 -71431 -48674 -15874 -31318 -60133 -47096 -40681
15161 -40681 22882 65366 64470 31380 52435 12938 -31423 -59793 -31994 -52619 -49902 -57643
15149 -57643 -54315 -83764 -103636 -60702 9143 -9484 -43210 13069 22515 -21371 -27919 17527
15137 17527 66691 37165 44706 69558 42319 54837 16818 8556 -9460 17328 -8383 -57885
15125 -57885 -62624 -66503 -67913 -59170 -19082 -12215 -67820 -74069 -70141 -42808 -1811 5971 22915
15112 22915 -28510 -90668 -160720 -42421 33792 117748 68364 11716 3214 -9932 7047 6368
15100 6368 17923 -24105 2031 67256 32071 -8763 4824 42872 36567 -5775 -17957 21954
15088B1954M6953j3386o7304j1026J8999m534J0065K3115K4380L1183J7352j9561
15076G8190n6167L1046J8487J6556j6212n6348J3252M5075r484m6774m1107R160
15064a4326p936J635L8980j8092n7885n0464Q102J6547K9213L1164J3681j7941
15052b7322J2988N976K5673M5166K7444j5750j065l5136K0209j231n6269r255
15040h572j3185J8449l4811j8955K169N7137L1161P613l7728o0245J5595N5832
15028A4460j8115m818L9365K1772n4212n0459k7948L5774J3088K42J1534K5332
15016F015m6607J8813K6601o564r5750O1171O0145J443k9795J1590Q972J1754
15004B7788J7389k2817K8058j7669l9395M9792L2765J7091m3857o8016K7432n2623
$$ plain form
15088 21954 68907 55521 -11783 -22809 -3810 -8344 1721 24836 49216 80399 97751 78190
15076 78190 22023 53069 71556 88112 71900 15552 28804 73879 64395 17621 -23486 -14326
15064 -14326 -22262 -20627 18353 261 -57624 -108088 -99986 -83439 -54226 -23062 -9381 -27322
15052 -27322 -14334 -8358 17315 62481 89925 74175 73110 37974 58183 56952 683 -8572
15040 -8572 -21757 -3308 -38119 -57074 -54905 2232 33393 41006 3278 -56967 -41372 14460
15028 14460 -3655 -8473 30892 52664 -1548 -52007 -79955 -44181 -31093 -30851 -19317 6015
15016 6015 -40592 -21779 4822 -1742 -97492 -36321 23824 25267 -4528 7062 16034 27788
15004 27788 45177 22360 50418 32749 -6646 43146 75911 93002 49145 -18871 8561 -44062
14992d4062m3335j802P238k3825M0325m0044K0585K7236o8437K9817N6485j769
14980d1588j1991L8993M2962M327q2985n9228J1747L60l9916N165L3030K4729
14968g4395K8751m4867J4112M1372L7386k1034Q397j8689M861j6854J3207J0793
14956a6960O338P2514k2265l0714k9019l046M2367N0080m2288o0945o3062n0688
14944a47688K4047O4755J3718m3769j459j4894N7485N1548o488j2779p410L3705
14932A0771L1423r136j1789q768j6954l2586K232K0247N3509m7971J3055K2903
14920B6936j3698l8378R473J3660j0906k8173k2959J2004m5013N5153O8264j3759
14908A2604m5292K4504M6055o0008m5486j0550J03744L1587P76o2273l4961L1421
$$ plain form
14992 -44062 -87397 -89199 -81961 -105786 -65461 -105505 -84920 -57684 -126121 -96304 -39819 -41588
14980 -41588 -53579 -14586 28376 32703 -50282 -109510 -97763 -97403 -137319 -132154 -99124 -74395
14968 -74395 -45644 -90511 -76399 -35027 2359 -18675 -10278 -28967 -24106 -40960 -27753 -16960
14956 -16960 -10622 61892 39627 8913 -20106 -23152 19215 69295 27007 -33938 -97000 -147688
14944 -147688 -123641 -58886 -45168 -88937 -90396 -105290 -47805 3743 -2745 -15524 -22934 10771
14932 10771 42194 33058 21269 12501 -4453 -37039 -34807 -14560 38949 -9022 4033 26936
14920 26936 13238 -25140 -15667 -2007 -12913 -41086 -64045 -52041 -97054 -41901 26363 12604
14908 12604 -32688 -8184 37871 -22137 -67623 -78173 25571 57158 57934 -4339 -39300 -7879
14896g879M635k0919l9391k6M0530o42K4112n2940j2926L6365K1840M1186n4796
14883b0851p6297j7491O2060Q4441J4451r036L7621J8909j1344k6710P660l8715
14871B4698J5053j9508M47N2903j4528l4308m4706j2708J9070K7508J654r235
14859F340L5871N3468m624r3124l4709M5703M3180J8011Q671k6161l6682J9902
14847C5846n7563k7797j6733l3126P5013k7312n1140j4907J8944L4839k4214K2721
14835f5429O5801O0860p1754j7180q013j2728J321j1437O160M1159l383j9663
14823c4286o040J636L1377J6072l3778n791k629r571N432q103L7658j9020k451
14810b9494Q4817l9608j5085P176m5662k7387L0757O034j0539L615L0606L5848
$$ plain form
14896 -7879 -3244 -24163 -63554 -63580 -23050 -23692 420 -52520 -65446 -29081 -7241 33945 -20851
14883 -20851 -97148 -114639 -52579 31862 46313 37277 74898 93807 82463 55753 63413 24698
14871 24698 39751 20243 20690 73593 59065 24757 -19949 -32657 -13587 13921 15575 6340
14859 6340 42211 95679 91055 -2069 -36778 8925 52105 70116 78787 52626 15944 35846
14847 35846 -21717 -49514 -66247 -99373 -24360 -51672 -102812 -117719 -98775 -63936 -88150 -65429
14835 -65429 372 61232 -10522 -27702 -35715 -48443 -47122 -58559 -52399 -11240 -14623 -34286
14823 -34286 -40326 -38690 -7313 8759 -25019 -30810 -33439 -43010 -37578 -45681 -8023 -27043 -29494
14810 -29494 55323 15715 630 7806 -37856 -65243 -34486 -28452 -38991 -35376 -4770 31078
14798C1078J1266k4046r407m3800P133r605m9553L4890K465j7206r202J4807j6996
14785g8176P977P268K5610k3200j5073J3607L0377Q2840K8595k816J2765L4729
14773A24503m895k9029j4795J2623J0367m1133q7657j4303Q374k8990L4528M3334
14761A2927K2238O7153l3046p8564n7007L6891Q5519j1046n5195k657P0236J1476
14749F8925K4875l9145l9886l9722J5731q091l152j3912L214N631o327o99K8437
14736d121k2676o4173J1794O0654L2712m6734o6754K9119J07663M45k3408p1924
14724e7403m2124K09j2918k41N1155J7747k7472k3037m1815Q4575N4731k3266
14712a9859j5006M0833M6811L8480N9522o0998n8898q8339k9403O6272J9344K6910
$$ plain form
14798 31078 42344 18298 8891 -34909 -27776 -37381 -86934 -52044 -49579 -66785 -75987 -61180 -78176
14785 -78176 -70199 -62931 -37321 -60521 -75594 -61987 -31610 51230 79825 77009 89774 124503
14773 124503 119608 90579 75784 88407 98774 57641 -30016 -44319 -35945 -64935 -30407 12927
14761 12927 35165 102318 69272 -9292 -66299 -29408 56111 45065 -10130 -12787 57449 68925
14749 68925 93800 54655 14769 -24953 -9222 -17313 -20465 -34377 -31163 -25532 -31859 -32558 -4121
14736 -4121 -26797 -90970 -79176 -18522 14190 -32544 -99298 -70179 37484 37929 14521 -57403
14724 -57403 -99527 -99318 -112236 -112477 -61322 -43575 -71047 -94084 -135899 -51324 3407 -19859
14712 -19859 -34865 5968 52779 91259 150781 89783 30885 -57454 -86857 -20585 -1241 25669
14700B5669J0260o4766K0470L4453p8367J8249O5784O772j9689J1431O978L8002
14688G5246O645j1925J451j6152m3610J5950L4387n0041J0388M2546k8189J618
14676C8314L9109r242k9530j00579n4984o4756K3153K5461P097M5431N8992L8583
14664A7049n1878m0653M9695K3757k1232j8564k9694j6356j7133L3819R2660L5335
14652E6805l509l8118o308k5053p6195J7196K2257K6150r531j8692l0162O4765
14640b0395m247L2135J0255J5822N7186n9992r1707J6953L2185K4716n1434N417
14628c3106N8361m5700l1987J6354K6338J7577q1450n9785L3408J744j3112N9587
14616e1771M643k5716L578J1090K7757J4040J5473j8870n2129k7263j646r251
$$ plain form
14700 25669 35929 -28837 -8367 26086 -52281 -34032 31752 38524 18835 30266 37244 75246
14688 75246 81891 69966 71417 55265 11655 27605 61992 11951 22339 64885 36696 38314
14676 38314 77423 68181 38651 -61928 -116912 -181668 -158515 -133054 -125957 -80526 -21534 17049
14664 17049 -34829 -75482 -25787 -2030 -23262 -41826 -71520 -87876 -105009 -71190 21470 56805
14652 56805 53296 15178 8870 -16183 -92378 -75182 -52925 -26775 -36306 -54998 -85160 -20395
14640 -20395 -24642 7493 17748 33570 90756 30764 -60943 -43990 -11805 12911 -38523 -33106
14628 -33106 25255 -20445 -52432 -36078 -9740 7837 -73613 -133398 -99990 -98246 -111358 -51771
14616 -51771 -47128 -72844 -69266 -58176 -30419 -16379 -906 -19776 -71905 -99168 -100814 -110065
14604a10065K5239J1428J8637K1092K3389L9656p242j3123j5163p1151k0335N8046
14592c9592J2287J5972K4014K1916J6704J038l6623m1474L6465L1512l8641k9561
14580b5983r765L1169M354Q832J0660q7933K4336K3951K0825j2511q019P0942
14568E0858N0203L1354l5223r3164l1912j6903k2792K5375l1308o216L2994j300
14556d8034P536M6462J8771Q455l4929m0067M8219K9393m9829r5972k390M385
14544a08000L4517M9289K948j1461l1846L57J3877J0640M489N1345L8871M2689
14532I7715k4459l4207l9932n4668L2757O5430M0652M951J2526m1448q706r241
14520D1370p6103L883j9645J2015N2349k2904l5779L1189j3910p564m2453m9711
$$ plain form
14604 -110065 -84826 -73398 -54761 -33669 -10280 29376 22134 9011 -6152 -77303 -97638 -39592
14592 -39592 -27305 -11333 12681 34597 51301 52339 15716 -25758 10707 42219 3578 -25983
14580 -25983 -35748 -4579 -225 8607 19267 -68666 -44330 -20379 446 -12065 -20084 50858
14568 50858 101061 132415 97192 4028 -27884 -44787 -67579 -42204 -73512 -79728 -46734 -48034
14556 -48034 -40498 5964 24735 33190 -1739 -41806 6413 35806 -14023 -109995 -112385 -108000
14544 -108000 -73483 -24194 -21246 -32707 -64553 -64196 -50319 -39679 -35190 16155 55026 97715
14532 97715 73256 39049 -883 -55551 -22794 42636 83288 88239 100765 59317 50611 41370
14520 41370 -34733 -30850 -50495 -38480 13869 -9035 -44814 -13625 -27535 -35099 -77552 -127263
14508a27263J9733O468k2865K0324m55j7514L1198L6502k700K5949p590N053j4461
14495d7621J4482j2876k3573k2228P8826J3658k4687j718m0732j3936N465p465
14483h2405P486R522Q7040K2040q486K0112o9498n0797M4501O1299l4984n0930
14471d5100l1707L5974J2881M361Q072L9105K386q8880Q275P7206J7636m7103
14459f894M43p4126R425L9566L3795m7345O080J7809L9035N587l439n4237k201
14446c6502j2629Q177J1764k7815L081l0778J8354J10523K6865K2264n9115n3888
14434a9699l1696l912L1667M3530L021l4122k6965L2490M2287l247J4574m3916
14422D012k1142L2794m4753o7585P2008M0045k8466K5607n71l7749j6582M1585
$$ plain form
14508 -127263 -107530 -101062 -123927 -103603 -104058 -121572 -90374 -53872 -56572 -30623 -38213 -33160 -47621
14495 -47621 -33139 -46015 -69588 -91816 -12990 668 -24019 -25737 -66469 -80405 -74940 -82405
14483 -82405 -74919 -65397 21643 43683 35197 55309 -14189 -64986 -20485 40814 5830 -45100
14471 -45100 -76807 -40833 -27952 -23591 -15519 23586 25972 -62908 -54633 22573 40209 -6894
14459 -6894 -6451 -80577 -71152 -31586 2209 -45136 -39056 -21247 17788 23375 19936 -34301 -36502
14446 -36502 -49131 -40954 -29190 -57005 -53924 -84702 -66348 44175 71040 93304 34189 -19699
14434 -19699 -51395 -55307 -23640 19890 22911 -11211 -38176 -5686 36601 33354 47928 4012
14422 4012 -17130 15664 -29089 -96674 -24666 15379 -13087 12520 11949 -25800 -42382 -797
14410g97K5604K2964K453j677M6186l6473j9591K0809k7170J6387n1788j5069
14398a8162Q2311J8086m2129n9777m0975k7816J2459M9064K8088r969p322J0278
14386e864J8227n2305n1975k2726N1048J7544K5843J6630L2645l517L2398l835
14374E4113m3882K1035j4633q5024Q057L9985L0173j3358J0433n298l8866k5456
14362f2721M2555K2873L2723j3701R298L5114j8960o3807m701n472J3292Q226
14350e281K2100L9206M5555p770J4813l4563m4281k7693J4142L3817K577k378
14338E0244j525m1128k2911m9758m846M3093n388J2372P136L3489k9372O206k8979
14325c1367N791J18255Q735n6660J965O423l2785l2894m7932O0550K0292n6029
$$ plain form
14410 -797 24807 47771 50224 48547 94733 58260 38669 59478 32308 48695 -3093 -18162
14398 -18162 64149 82235 40106 -19671 -60646 -88462 -76003 -26939 1149 -8820 -16142 -5864
14386 -5864 12363 -39942 -91917 -114643 -63595 -46051 -20208 -3578 29067 25550 57948 54113
14374 54113 10231 31266 16633 -68391 -60334 -20349 9824 -3534 6899 1601 -37265 -62721
14362 -62721 -20166 2707 35430 21729 31027 66141 47181 -16626 -21327 -26799 -13507 -5281
14350 -5281 16819 56025 101580 93810 108623 74060 29779 2086 16228 50045 52622 50244
14338 50244 48719 7591 -15320 -65078 -69924 -26831 -32219 -19847 -12711 20778 -8594 -2388 -31367
14325 -31367 -25576 92679 101414 44754 46719 53142 20357 -12537 -60469 81 20373 -35656
14313c5656j1251m575K344q5055k6213J759J5723O2737O6279L5721L1110k0519
14301C2404k7682L3059j9594Q081j5866n7021o2089o875j3857j6921O0882Q5614
14289A35p067q8011k7530k8921M1552J9867L6977J7922L6194O3035J7204J5349
14277I6706q2545k5558j7936J7513K8719j0715L743l4615K9928P927N751K3470
14265D2388j7798j5378o716l5113N3935l4976m7099l0019J7753l311k5701j7758
14253a19793O9205N8741J043k23m7932N551M2260M287J6119K0602l197K2213L466
14240G2342o4335p589l7135k4213K8570m9094q370Q7319M2334l3595j8222Q672
14228c316m5959m6934K9176J9500j3718j0473j1879k2547J1729K3302L5328N7009
$$ plain form
14313 -35656 -46907 -51482 -49138 -134193 -160406 -158647 -142924 -80187 -13908 21813 52923 32404
14301 32404 4722 37781 18187 26268 10402 -46619 -108708 -115583 -129440 -146361 -85479 135
14289 135 -6932 -94943 -122473 -151394 -109842 -89975 -52998 -35076 1118 64153 81357 96706
14277 96706 14161 -11397 -29333 -11820 16899 6184 9927 -24688 5240 13167 18918 42388
14265 42388 24590 9212 2496 -32617 21318 -13658 -60757 -90776 -73023 -76334 -102035 -119793
14253 -119793 -50588 8153 9196 8973 -38959 -33408 8852 13139 29258 49860 46663 68876 72342
14240 72342 8007 418 -36717 -60930 -32360 -81454 -89824 -2505 39829 6234 -11988 -3316
14228 -3316 -49275 -96209 -67033 -47533 -61251 -71724 -83603 -106150 -94421 -71119 -35791 21218
14216B1218N727j2182M232O381j2608k7438k2472J1777j3096L6120O9531L9514
14204A06704m9560q3337k9929r199j2719O9697N8031m4692j8394o328J1203k2330
14192c0853l2048p65K5263L6217q989j9594p173k9202j4394L3616K3264K6635
14180A977j9558J6248K8978K8779k4825l7927n4256N2154j593j0422O227k6375
14168d0593J8172J0610J2573j9179k8209M2974K6849J5576L3356l6830m1185K4930
14156A9044k522n080K3011K272l1200j3590m722p358n0447m633N1523m3437p095
14143g4234J1877L4294L1157Q52n8843O4062q462n0705l5244L5850k1525l2828
14131a03749k940k3476k8307k4007K3431M7611N8283k5954k3920Q63q303L48k9815
$$ plain form
14216 21218 26945 14763 18995 25376 12768 -14670 -37142 -25365 -38461 -2341 67190 106704
14204 106704 57144 -26193 -56122 -65321 -78040 -8343 49688 4996 -13398 -19726 -8523 -30853
14192 -30853 -62901 -63666 -38403 -2186 -11175 -30769 -37942 -67144 -81538 -47922 -24658 1977
14180 1977 -17581 -1333 27645 56424 31599 -6328 -60584 -8430 -10023 -20445 -14218 -40593
14168 -40593 -22421 -11811 762 -18417 -46626 -3652 23197 38773 72129 35299 -5886 19044
14156 19044 16522 11442 34453 36725 5525 -8065 -12787 -20145 -70592 -75225 -23702 -67139 -74234
14143 -74234 -62357 -28063 3094 3946 -54897 9165 703 -50002 -85246 -49396 -70921 -103749
14131 -103749 -106689 -130165 -158472 -182479 -159048 -111437 -53154 -79108 -103028 -102165 -110468 -110120 -139935
14118a39935P1005K2854J7739j7834p0890L4775J8939k3412M0495P3393O7290
14107I4419l4247n8753l5059p763k7892p6470j2710P6391P4778p282n2265l3082
14095i9935N124M8053K4991l3842j3724K5604O6164O590O485p0557j7328M1532
14083a0843o887L784k282j7830k1617r788J0352R524l0471N6305M5736j8579J7001
14070B4405o1362j0541J2943K1372j4060l3297j0927K0259J08O4930k6554l8921
14058e1645M3174N7447k4504r247k161p074r366N0424J5495q461J1032M8253p901
14045A05466k2432l2538n0175J6333K4334l39k8994M174m2636M1749M2376j4224
14033D3094p1354J0215j3906k5810J6754J3785l443p7422p024N3377N7851k998
$$ plain form
14118 -139935 -68930 -46076 -28337 -46171 -117061 -82286 -63347 -86759 -46264 27129 94419
14107 94419 60172 1419 -33640 -41403 -69295 -145765 -158475 -82084 -7306 -14588 -66853 -99935
14095 -99935 -94811 -46758 -21767 -55609 -69333 -43729 22435 29025 35510 -35047 -52375 -10843
14083 -10843 -17730 -13946 -16228 -34058 -55675 -65463 -55111 -45587 -76058 -19753 25983 7404 24405
14070 24405 -36957 -47498 -34555 -13183 -27243 -60540 -71467 -51208 -51100 13830 -12724 -51645
14058 -51645 -8471 48976 24472 15225 13064 5990 -3376 47048 62543 54082 65114 113367 105466
14045 105466 83034 50496 321 16654 40988 40649 11655 15829 -26807 14942 57318 43094
14033 43094 -28260 -18045 -31951 -57761 -41007 -27222 -30665 -108087 -115111 -61734 -3883 -6881
14021f881m3703K9101K0644l9123j7840r202N4318K2065K8173l7874M2176m2553
14009f99J1778j598m8521p2442m5512L1481J13230R7581n7328o8942L2047R2219
13997H3294L0598n1190r3491j9015M9205J1151j2736j2989k0351K9468k92k2636
13985b8984K641m9396L0021M9354k1360k1966J5438L8819M1591o9210q0976k3069
13973a17097R744p66N5287K4238o850j3227j3012K0445J2983k940j7501K1814
13961b6882O1563J0907l7029q0890l748J7699l2637J7635q703r612L4790K263
13949e4644K0601L210J4137M2869N7175J252j6738l1631k8211j4151J5583j1508
13937b056m7093m1458N169O5740L3149k9938j0718M7541n4134n0335N0984J3237
$$ plain form
14021 -6881 -50584 -21483 -839 -39962 -57802 -67004 -12686 9379 37552 -322 41854 -699
14009 -699 11079 9481 -39040 -111482 -156994 -125513 -12283 85298 27970 -40972 -8925 83294
13997 83294 113892 62702 -30789 -49804 -599 10552 -2184 -15173 -35524 -6056 -6348 -28984
13985 -28984 -26343 -75739 -45718 3636 -17724 -39690 -24252 14567 56158 -13052 -94028 -117097
13973 -117097 -107353 -108119 -52832 -28594 -35444 -48671 -61683 -41238 -28255 -31195 -48696 -26882
13961 -26882 34681 45588 8559 -72331 -76079 -58380 -91017 -73382 -82085 -91697 -56907 -54644
13949 -54644 -34043 -30833 -16696 26173 83348 84600 67862 36231 8020 -6131 9452 -2056
13937 -2056 -49149 -90607 -85438 -19698 13451 -16487 -27205 20336 -33798 -84133 -33149 -19912
13925a9912o688j4274j4250n989j8301M1477K5306k19M5878K2165K8855k6962
13913E7086o6021l9263k9069l8316N2996J5450Q5536J7443O246j8260m6034l143
13901e349K0765n325J2228l8142J0342J087p423o066j9322K0623J4452J4344K9413
13888D1627J7962k6101o3211j4408K1064J1199j7343k8491J4257p7689j9593K2185
13876a18542l8929j020Q8305M2609j0407K2002J3232J2240J9027k1314m2119M9032
13864A4116k5691o626J6783J2441L269K1480J336k1061l7725l7201N6209K7849
13852B5179l8050n7411J3672M193L1781k8125o9752l08P0452j2736l135K2975
13840d1265J8289n682j7716L9303L4555J0096k7536j1043P067o894j3422N4500
$$ plain form
13925 -19912 -26600 -40874 -55124 -61113 -79414 -37937 -12631 -12850 33028 55193 84048 57086
13913 57086 -8935 -48198 -77267 -115583 -62587 -47137 38399 55842 62088 43828 -2206 -5349
13901 -5349 15416 10091 22319 -15823 -5481 -4394 -11817 -17883 -37205 -16582 -2130 12214 41627
13888 41627 59589 33488 -29723 -44131 -23067 -11868 -29211 -57702 -43445 -121134 -140727 -118542
13876 -118542 -157471 -158491 -70186 -27577 -37984 -15982 -2750 9490 28517 7203 -34916 14116
13864 14116 -11575 -18201 -1418 11023 14292 35772 37108 16047 -21678 -58879 -2670 25179
13852 25179 -12871 -70282 -56610 -52417 -20636 -48761 -118513 -118821 -48369 -61105 -64240 -41265
13840 -41265 -22976 -28658 -46374 -7071 27484 37580 10044 -999 6068 -826 -14248 40252
13828D0252m8214j8379K1755k6746j9552M2742K0767l1615l883j0240L2012K6357
13816B5256K9483P958j0144p298m6931m0938J4981O9364J939l2370j9109m5182
13804e2991j9636n5709M4092R1135L1795j5923J0606j932n838J1152J8678K425
13792E7854j6843k8338j8476N259L844L0655K9532r0574p198K9257k0066L7462
13780A2368M2408o3589J2338M0002J9955p8967o7035k6816O7656N248k876L1006
13768h302K7723o5082j1913j0555M9058J8392m2110j404k2667j4690K2912J8350
13756d0288l4065k8197L5673K8322m3570j5108J3552O2486N4368n8177k4908L3634
13744a6278K7942n4066k9644K4138N2145l0872L0208K7467l4476j8684M2005R169
$$ plain form
13828 40252 -7962 -26341 -4586 -31332 -50884 -8142 12625 -18990 -22873 -33113 -1101 25256
13816 25256 54739 62697 52553 45255 -1676 -42614 -27633 41731 43670 11300 -7809 -52991
13804 -52991 -72627 -128336 -84244 6891 38686 22763 33369 31437 25599 36751 55429 57854
13792 57854 41011 12673 -5803 -544 3300 33955 63487 -27087 -34285 -5028 -25094 12368
13780 12368 54776 -8813 3525 43527 63482 -15485 -82520 -109336 -41680 -36432 -39308 -8302
13768 -8302 19421 -45661 -57574 -68129 -19071 -679 -42789 -44193 -66860 -81550 -58638 -40288
13756 -40288 -74353 -102550 -66877 -38555 -82125 -97233 -83681 -21195 33173 -25004 -49912 -16278
13744 -16278 11664 -42402 -72046 -47908 4237 -26635 3573 31040 -3436 -22120 19885 29054
13732B9054k3289m2701j527n845K0588J1953j0585P607K5887l453m988k8141j6656
13719d2096Q044M6511k1184k0130l4354K7194N8207K2632K596l3864J7170K3188
13707E3914j7365L805j4158l6624P3231M1419n5713o1584M938K1799K6629L779
13695D4070K4748n284o5023l3217q928j5055J4j7773j9855M5314K2836J440K9703
13682B990k2938q734L2878J7766K9316k7332q5353L7514O8648k2484m0756K6015
13670G530P319n7225k4722K1958j8276J6898j2708j7087q747m2487l1850M51l891
13657a62837j8184J1216O6599k9006N2912M4222n135k4333o5441l519K8213l8985
13645a44278m4449M6963M6995J8101J9192L4711N7538k7484n3436k5515M1004
$$ plain form
13732 29054 5765 -36936 -38463 -44308 -23720 -11767 -22352 -14745 11142 7689 2701 -25440 -42096
13719 -42096 -34052 12459 -8725 -28855 -63209 -36015 22192 44824 47420 13556 30726 53914
13707 53914 36549 40354 26196 -10428 62803 104222 48509 -13075 -8137 13662 40291 44070
13695 44070 68818 63534 -1489 -34706 -43634 -58689 -58675 -76448 -96303 -50989 -28153 -26713 2990
13682 2990 -19948 -28682 4196 21962 51278 23946 -61407 -23893 44755 22271 -18485 7530
13670 7530 14849 -42376 -67098 -45140 -63416 -46518 -59226 -76313 -85060 -127547 -159397 -158946 -162837
13657 -162837 -181021 -169805 -103206 -132212 -79300 -35078 -40213 -64546 -129987 -133506 -105293 -144278
13645 -144278 -188727 -141764 -94769 -76668 -57476 -22765 34773 7289 -46147 -71662 -30658
13634c0658K9222K3546J1383O468n6939o4944l8505j6545N1083J175L6686N8676
13622A0648l3266k1493J6387O7571m8757k4179l4958k0596j3642m7975M2284O3207
13610d4769J1097l812l6362J952j662m1348k5873L5144j8810M9157M1651k8101
13598f1736L3646O9951l5891k9776K6060L1834l7285j6202L5568Q9950o817n5508
13586D3794o28m8992R090n2015J8117L6501j4385K3100K2178l8641m3359O9660
13574B4420k7434J3951K7346n3033K6973L6501J3238n3730k4728q033p229p3041
13562a04799o8552k2130L9839L3402k7077P857O1973N3624Q0847K5510j4137o0400
13550E957k3815J304K2703j1153p671l9008L257L0439J1843j6242N9388M6142
$$ plain form
13634 -30658 -1436 22110 33493 39961 -16978 -81922 -120427 -136972 -85889 -84714 -48028 10648
13622 10648 -22618 -44111 -27724 39847 -8910 -33089 -68047 -88643 -102285 -150260 -107976 -44769
13610 -44769 -33672 -37484 -73846 -71894 -73556 -114904 -140777 -105633 -124443 -75286 -33635 -61736
13598 -61736 -28090 41861 5970 -23806 2254 34088 -3197 -19399 16169 106119 99302 43794
13586 43794 43166 -5826 3264 -48751 -30634 5867 -8518 14582 36760 -1881 -45240 24420
13574 24420 -3014 10937 38283 -14750 12223 48724 61962 8232 -16496 -24529 -31758 -104799
13562 -104799 -173351 -195481 -155642 -122240 -149317 -141460 -79487 -25863 54984 80494 66357 5957
13550 5957 -17858 -16554 6149 -5004 -12675 -51683 -48426 -17987 -6144 -22386 37002 83144
13538H3144j854k8200l9662J7257P3368n585L8083q655k6939j00656n8028J5439
13526d2288J08904r956o5230L1561j3785L360J3828J2772p518M7351j4585j3053
13514E1361L9850k9874p958k2075N919l5886J1334P508l3775J3280J0996P376
13502A8056j1114q554L7896R59m2446k2677K9855K202L7107j3139P1539N452l5378
13489F9758j8409K1171M8243k1947k7679j4688J225o545q38M116l414Q585k6167
13476C3411j562j150j11525n3228j5558N4624N1155N7358l379J4641J681q947
13464A7521q682k1350j8246K6751Q109J8060m1353J7023K4995k4819L4958K2832
13452E5799l1043l9178r480K4535K7850L0353k0139J3618L7903K1070k6633j849
$$ plain form
13538 83144 81290 53090 13428 30685 104053 98468 136551 127896 100957 301 -57727 -42288
13526 -42288 66616 56660 -8570 22991 9206 12566 26394 39166 31648 78999 64414 51361
13514 51361 91211 61337 53379 31304 37223 1337 12671 20179 -13596 -316 10680 18056
13502 18056 6942 -1612 36284 37243 -5203 -27880 1975 4177 41284 28145 99684 105136 69758
13489 69758 51349 72520 120763 98816 71137 56449 57674 51129 50291 54407 50993 59578 33411
13476 33411 31849 30699 -80826 -134054 -149612 -94988 -43833 13525 10146 24787 26468 17521
13464 17521 8839 -12511 -30757 -4006 4103 22163 -19190 -2167 22828 -1991 32967 55799
13452 55799 24756 -14422 -23902 633 28483 58836 38697 52315 90218 111288 84655 82806
13440H2806j5041p7894p5718j5199M8728Q1599l2253k2284m5013n5691R187M1132
13428g5641J5864M9963L4325J7777K1649m0791l603M846m1113k6419M3308J3052
13416A3217m8095J9651Q4996m4180m8430J5372K3556K9297l7756M0114l7144m9475
13404c8877j4474k0996l103O806P44k943l9637l3982L3761P5370M0032K8640K8708
13391F0049P164l4299j1781o2520l6568M2090N5069j0889L7776j225L6303q539
13379G2630k1689m171L552k9857K6999J6689o221k0798j7791L172k895l5567p831
13366b3778k0084L709O952l2558K5903K4287J1578p1340j9952o513K1877j7051
13354i6970r077N7548K774L1681M021p559l2971J127Q777K8817K3397k6419J4268
$$ plain form
13440 82806 67765 -10129 -85847 -101046 -52318 29281 -2972 -25256 -70269 -125960 -116773 -75641
13428 -75641 -59777 -9814 24511 42288 63937 23146 19543 24389 -16724 -43143 165 13217
13416 13217 -34878 -15227 69769 25589 -22841 -7469 16087 45384 7628 47742 10598 -38877
13404 -38877 -53351 -74347 -77450 -70644 -69900 -72843 -112480 -146462 -112701 -37331 2701 31341 60049
13391 60049 67213 32914 21133 -41387 -77955 -35865 19204 8315 46091 44866 81169 72630
13379 72630 50941 46770 50322 20465 47464 64153 57932 37134 19343 22515 19620 -15947 -23778
13366 -23778 -43862 -40153 -33201 -65759 -39856 -15569 -3991 -75331 -95283 -101796 -79919 -96970
13354 -96970 -106047 -48499 -45725 -14044 -10023 -17582 -50553 -49426 -40649 -11832 11565 -14854 -586
13341e86K3824J2043J86l0384k2861M01K7114K0274l5976R373j6694L956k9529
13328c8859L62q590q523J1708j4495L2188N8423K8823l5775l0953M6725K088m2916
13315B06J0314J0421k1838k0875j8988m438J1758k0490j1565L3982k2682m191
13303e8386k3280k6087K4015L2831M7850M4962l6397o0923N7256K941r0762m8380
13291a34360N3067Q9010M7652k5665j8648j6410k3621k0723l4693N6386J5642
13280a2363l811K6717L0032j1206m2465M509P8448N9483o9485q4873m4108l4345
13268a03467j2113L4200k807J5924J7541q179K9714J2928N3081j3138n4697J4292
13256a6721q663M5649P2235O956Q466m6192k4132J9486N20k996M1493k5083o8151
$$ plain form
13341 -586 23238 35281 35467 5083 -17778 -17377 9737 30011 -5965 3408 -13286 -9330 -38859
13328 -38859 -38497 -47087 -55610 -43902 -58397 -26209 32214 61037 25262 -5691 41034 43122 206
13315 206 10520 20941 -897 -21772 -40760 -45198 -33440 -53930 -65495 -31513 -54195 -58386
13303 -58386 -81666 -107753 -83738 -50907 -3057 41905 5508 -55415 1841 4782 -85980 -134360
13291 -134360 -81293 7717 55369 29704 11056 -5354 -28975 -49698 -84391 -28005 -12363
13280 -12363 -16174 10543 40575 29369 -13096 -8587 69861 129344 59859 -25014 -69122 -103467
13268 -103467 -115580 -81380 -84187 -68263 -50722 -58901 -29187 -16259 36822 23684 -31013 -16721
13256 -16721 -25384 20265 92500 99456 107922 61730 37598 57084 57604 54608 96101 71018 2867
13243B867q818k4270m725L8388M714L0806P274K2469j5875l1407J8181n6595j9225
13230c6216r230J9041L7080l9188p217k1531L7184O0559M3172j8791j4899L1311
13218H1275k6722n2387J1826j5709m0787n1095J398L2092k2906J875K6145M1304
13206a3691K6530N1208J5067o0236o1906m3164J4217J22J8236N2060k1567O734
13194a6390L9487P328l3937K8433j7519j6670j2763n8087j1193N6839O8083j626
13182C1985k9723j9485k1670l1791K9458O4658K2997L6218j720R758l7513K1241
13170G4413l9537l7165R104L013j7468M3415k1644m9482J8955j7191K5098L0456
13158B1967k3270n115k6352K6971j5582l2639P713j8590J1703J2816l8438p763
$$ plain form
13243 2867 -5951 -30221 -34946 3442 8156 38962 46236 68705 52830 21423 39604 -16991 -36216
13230 -36216 -45446 -26405 10675 -28513 -35730 -57261 -20077 40482 83654 64863 49964 81275
13218 81275 54553 2166 13992 -1717 -42504 -93599 -92201 -60109 -83015 -81140 -54995 -13691
13206 -13691 12839 64047 79114 18878 -43028 -86192 -71975 -71853 -53617 -1557 -23124 -16390
13194 -16390 23097 30425 -3512 24921 7402 -9268 -22031 -80118 -91311 -34472 33611 31985
13182 31985 2262 -17223 -38893 -70684 -41226 23432 46429 82647 80927 90685 53172 74413
13170 74413 34876 -2289 6815 9828 -7640 35775 14131 -35351 -16396 -33587 -8489 21967
13158 21967 -1303 -6418 -32770 -5799 -21381 -54020 -46307 -64897 -53194 -40378 -78816 -86579
13146h6579K4792L5764K5837p734m2235O468N6252K2447J2815O962l5046K4732
13134D4475R5245J9447m2374o2203r995J6810K0024K5697L4817j7706l5009k2169
13122F7059l5229N7114J7029n9574o0722j0449j9826J538M4794L3485o18l9986
13110e385o0126L786Q0728l420L5926M4917J3608o3738k8404j1834O8367L4749
13098A09174r3595p901L6411j6734o165J9269k3155n194L5236M7536j2287k3521
13086E9074j476r807j7787k2077J3832l0576J988j7083n192n5827J2596j811O7172
13073f974P5415k3042M1108J5104l1708q0432k5062N4545r152m982J0742j6076
13061e14j1687k5430L8519P1002j5930J4643m4241k4785M2268p024j900k6596
$$ plain form
13146 -86579 -61787 -26023 -186 -7920 -50155 -43687 12565 35012 47827 54789 19743 44475
13134 44475 139720 159167 116793 54590 44595 61405 81429 107126 141943 124237 89228 67059
13122 67059 31830 88944 105973 46399 -14323 -24772 -44598 -43060 1734 35219 34601 -5385
13110 -5385 -65511 -61725 19003 15583 51509 96426 110034 46296 17892 6058 74425 109174
13098 109174 15579 7678 44089 27355 21190 40459 17304 12110 47346 94882 82595 59074
13086 59074 57598 47791 30004 7927 21759 -8817 -6829 -23912 -29104 -84931 -72335 -74146 -6974
13073 -6974 68441 45399 86507 101611 69903 -10529 -35591 18954 9802 4820 15562 -514
13061 -514 -12201 -37631 888 71890 55960 70603 26362 1577 43845 36821 34921 8325
13049H325J2373N3063L7551J5024o5874p6187j1450R3822j2631j5209j8257o4242
13037d3692k5745m5492J4308N7952M9638j4308j3327J6775N05J9603k4516k2258
13025c0557J1353j6061o7926L0193O7037N008J6485l1198P651P2360L8104q5233
13013A7216L613P0851P2757k0634o9143p1268q2157L01K8251R423j166j2690l275
13000e7921L955j0186j3223L3238O3678j178K3621N2370o994q4984m7634L2564
12988a2694K1784l5146l1760L0866r134l333K1649j1689p887k0842M4397M0929
12976B7140K7234m3363k1782O268l9375l2512J6015L0988Q708O619M0925J3233
12964D0098P064M6905N776Q801k8575p8405m8196q517Q1918J3985n205j934J9740
$$ plain form
13049 8325 20698 73761 111312 126336 60462 -15725 -27175 66647 54016 38807 20550 -43692
13037 -43692 -69437 -114929 -100621 -42669 6969 -7339 -20666 -3891 -3386 16217 -8299 -30557
13025 -30557 -19204 -35265 -103191 -72998 -5961 -953 15532 -15666 -8015 64345 102449 17216
13013 17216 20829 91680 164437 143803 74660 3392 -78765 -78464 -50213 -40790 -41956 -54646 -57921
13000 -57921 -53966 -64152 -77375 -44137 19541 18363 41984 94354 87360 2376 -45258 -12694
12988 -12694 9090 -26056 -57816 -26950 -36084 -39417 -17768 -29457 -37344 -58186 -13789 27140
12976 27140 54374 11011 -10771 -4503 -43878 -76390 -60375 -29387 -20679 -14060 26865 40098
12964 40098 47162 94067 99843 108644 80069 1664 -46532 -55049 26869 40854 35649 33715 53455
12951E3455J3123k3596M3695J6176p4089r245K1468p716n656k9076P236l2972
12939b7197l1355J3404P5180l0770o7111l6233j1596j774M6376K096K1734n9035
12927a06281J4012K7653j0526N8276L0134K097o2985l6845j0236J0757K5697P3900
12915A5653L2827K2232J6500j05047o0155N542j4454J01429L7516J4977j6768
12904E0252k9888J3439k1071M5160P431k5832J3779k1644o7042M205P2609K8998
12892G0396M5167Q409n3665J3830j8227J134L8390k7270l3546J4629J7157l4054
12880D2350q448l8838m2275j0220M354n095j459L5534O3791L887r899N847m5015
12867e486l2918K4643N097L8766P036j8729l0529J6556J3628M355O7831J4221
$$ plain form
12951 53455 66578 42982 86677 102853 28764 19519 40987 33271 27615 -1461 5775 -27197
12939 -27197 -58552 -45148 30032 -738 -67849 -104082 -115678 -117452 -71076 -68980 -47246 -106281
12927 -106281 -92269 -64616 -75142 -16866 13268 15365 -47620 -84465 -94701 -83944 -58247 15653
12915 15653 48480 70712 87212 -17835 -77990 -72448 -86902 14527 52043 67020 50252
12904 50252 20364 33803 12732 57892 65323 39491 53270 31626 -35416 -31211 41398 70396
12892 70396 115563 123972 70307 84137 65910 67044 105434 78164 44618 59247 76404 42350
12880 42350 33902 -4936 -47211 -57431 -53077 -58172 -59631 -24097 39694 43581 33682 39529 -5486
12867 -5486 -38404 -13761 -8664 30102 37138 18409 -12120 4436 18064 22419 90250 104471
12855A04471o1373m2314jN4847j5715N0254J2199j6940l6858m7740M653K8779
12843C4262j9746k9991n878K8095N216O493L0107K0413J5304q4121r6495K588
12831i3753P8684L2975j3506m1805L7453L5889J653O015L464Q505k767k9018O291
12818C0080j6474j6408j1471l097L8415M3754J6329O6165o202k4796k4341j646
12806I0308N6950m6035o3111p792l0025k8402k4880l0814J2894k643J715K6175
12794d5660M2305M250N0179K5269l8287J4534k5427P958k0789k3020k5813j1907
12782d6408n414n551j6625m4793L4119K7537j771j069j0668P1189J7343k1043
12770c154K470l2075m0618j1013O1597K4101J7635j1224l111K0531J9943J5657
$$ plain form
12855 104471 43098 784 783 55630 39915 90169 102368 85428 48570 830 5483 34262
12843 34262 14516 -15475 -21353 6742 11958 18451 48558 68971 84275 154 -96341 -93753
12831 -93753 -15069 17906 4400 -37405 48 35937 37590 43605 47069 55574 52807 23789 30080
12818 30080 13606 -2802 -14273 -17370 21045 64799 81128 147293 141091 116295 91954 90308
12806 90308 147258 101223 38112 30320 295 -28107 -52987 -83801 -70907 -73550 -71835 -45660
12794 -45660 -3355 895 51074 76343 38056 52590 27163 35121 14332 -8688 -34501 -46408
12782 -46408 -51822 -57373 -73998 -118791 -84672 -57135 -58906 -59975 -70643 546 17889 -3154
12770 -3154 -684 -32759 -73377 -84390 -22793 1308 18943 7719 4608 25139 45082 60739
12758F0739p3082M6188J9443j8712l8379l4832l5593l641M5917N1069J50n9870
12746d0603L592o427m0372r880n391K1523J4840J2219N4340J3460Q127k054m5831
12733b2457n4988L2652l8840K5915K8277K378K5763J9513j5602l0036N3686J0198
12721C6459j5608k8716K3013l5187l3699L672O836R078J8218L0251J1815r874
12709A6258j4821l1269k0301O7909K9376L827R9613M3p4771j9410M9286K4502
12697A30242o83o8744m7563m0881j132k202l2921J4767J5117j9410L1314m503
12685b6599o0298K1409K0415K4568M143J9147r72N4324J8593k8497l5542q416
12673B275L0291k835k8177q050M1779k2748l7557R976M7688L6319L3468n2760
$$ plain form
12758 60739 -12343 33845 53288 34576 -3803 -38635 -74228 -77869 -31952 19117 19267 -40603
12746 -40603 -37011 -43438 -83810 -93690 -99081 -77558 -62718 -50499 3841 17301 25428 23374 -22457
12733 -22457 -77445 -44793 -83633 -57718 -29441 -27063 -1300 18213 2611 -27425 26261 36459
12721 36459 20851 -7865 15148 -20039 -53738 -50066 -43230 -34152 -15934 14317 26132 16258
12709 16258 1437 -29832 -50133 17776 47152 50979 150592 150635 75864 56454 105740 130242
12697 130242 129559 60815 13252 -27629 -28761 -30963 -63884 -49117 -34000 -53410 -22096 -26599
12685 -26599 -86897 -65488 -45073 -20505 -16362 2785 1813 56137 74730 46233 10691 2275
12673 2275 32566 29731 1554 -6496 35283 12535 -25022 -15046 32642 68961 102429 49669
12661D9669k3913l465j3221J7192J3328L523J267l6274j0248r611j7006L4678
12649E919L9235m5052l9555j8115K6731L816J8087o9375L5644N2543n3944M6594
12637B528M9190J0729l5230k296k7758k9499K0453K0887l5814N522l0950J6822
12625c5416M0509M2963J8340m1125o182J3981K2914l2224l7545m8490N6014J3827
12613G566K9149k8263p34J7397k2385L3357L8482l8915p320k6094k4030j7233
12601c9023J9890J3651m1319k9201j2219L4804K4265K8309M249R810k5888R481
12589c191K5393k2232o050L4881k3469m0553R689l0112M1583Q3257k8986j4500
12577B5710k7672J980P3415P151n2883K4327N3745n5053n6791J077J7525J0004
$$ plain form
12661 49669 25756 22291 9070 26262 39590 43113 44380 8106 -2142 -11753 -28759 5919
12649 5919 45154 102 -39453 -57568 -30837 -27021 -8934 -78309 -42665 9878 -44066 2528
12637 2528 51718 62447 27217 24921 -2837 -32336 -11883 9004 -26810 -21288 -52238 -35416
12625 -35416 5093 48056 66396 25271 19089 33070 55984 23760 -13785 -62275 -6261 7566
12613 7566 36715 8452 7718 25115 2730 36087 74569 35654 28334 2240 -21790 -39023
12601 -39023 -19133 -5482 -46801 -76002 -88221 -53417 -29152 -843 3406 13216 -12672 -3191
12589 -3191 22202 -30 -6080 28801 5332 -35221 -25532 -55644 -14061 69196 40210 25710
12577 25710 -1962 18 73433 80584 27701 52028 105773 50720 -6071 -4994 12531 22535
12565B2535m2035j0901P6442K1260K2705j1426k2232J2664j6049k4356o2343K1661
12553a2075M4891o327o2202M2275K1092J1785k7232M0956j4718o2830J5259M6623
12541C7497J7607L7068N1342k7379j13334j15561j5679L6364J9617N4875M2706
12530B5123K008L4366j3450p1201j3275K4094J0548J4222J8078L2284m1525m5498
12518b4226L3289M2565R773m5318k2105n1939l0351Q5023K4603M0083m7438j677
12506A2282m7820m135J4675K2418K2767J4748k5j8666P2143L8746p0638n6802
12494c07j1038M0008K5841k2156l8148m1942m6560M118J36843L0131p4717J5051
12482A7124O264J9616p677o712j0824l4769J1545N0352J2785j2520J6354o2841
$$ plain form
12565 22535 -19500 -30401 46041 67301 90006 78580 56348 69012 52963 28607 -33736 -12075
12553 -12075 32816 26489 -35713 6562 27654 39439 12207 53163 38445 -24385 -9126 37497
12541 37497 55104 92172 143514 116135 2801 -112760 -128439 -92075 -72458 -17583 25123
12530 25123 27131 61497 48047 -23154 -36429 -12335 -1787 12435 30513 62797 21272 -24226
12518 -24226 9063 51628 61401 16083 -6022 -57961 -88312 -3289 21314 61397 13959 12282
12506 12282 -35538 -39673 -24998 -2580 20187 34935 34910 16244 88387 127133 56495 -307
12494 -307 -11345 28663 54504 32348 -5800 -47742 -94302 -90184 46659 76790 2073 17124
12482 17124 23388 43004 35327 28615 17791 -16978 -5433 44919 57704 45184 61538 -1303
12470a303n2960M796J0152j3744N4790N2268j3331Q183n6660l8621L3239L7745
12458B4554K4318k5317m5164L4832L8609M4044P057q856L817M5575M124J2953
12446A60546l7495o7678l060K0202r927n9376k0668P3667K5438l1901n1464R515
12434G799j3730K5968j6680j1262j6488P3985K19m3501N669j2669J1009L8979
12422D9298M840N4938l1760n1663m649O5060K0320L6154P0162n2741n6161k6723
12410G7075p1759p8561j60L4604n285p188M0059M7477M4194M1804l8554j0690
12398G3016M0095J6258m5553n7486m2152J1156m6733O8180L9111l86j7214K2272
12386F0564R397k7865K5307J7256l7765M1381L4522l5602m1725L1352J5528P393
$$ plain form
12470 -1303 -54263 -49467 -39315 -53059 1731 53999 40668 48851 -7809 -46430 -13191 24554
12458 24554 48872 23555 -21609 13223 51832 95876 102933 94077 97894 143469 147593 160546
12446 160546 123051 55373 52313 72515 62588 3212 -17456 56211 81649 49748 -1716 7799
12434 7799 -5931 20037 3357 -7905 -24393 49592 49811 6310 11979 -690 10319 49298
12422 49298 54138 109076 77316 25653 21004 86064 106384 142538 212700 159959 103798 77075
12410 77075 5316 -73245 -73405 -38801 -44086 -51274 -11215 36262 80456 122260 83706 73016
12398 73016 113111 129369 83816 26330 -15822 -4666 -51399 16781 55892 55506 38292 60564
12386 60564 69961 42096 67403 84659 46894 88275 122797 87195 45470 76822 92350 99743
12374I9743j4948o5541j0995J571K6361N6049J5128L744L2488o4195o9975o2658
12362e3228K897M4269J5979m0242k4740J5513k883K3626P7151J0763J5059J9445
12350A03609l9618k7418L699O945k2182L58j125M8626R398j1839j1985N579J3642
12337G7689m8676m7018L8322j3427j2421M9467N7465m145j0639L3618M4428m0959
12325A23704M9151J00251j1642r57k4065p0866m4663j8516l1639K1073N1858K3625
12313A67314K8676l3126J6272l3018Oj2424p391l7478N7633n6023q7956M2765
12301D5250M2488j2572j2097M5353N330K0272N3182J4122l8832q7265N3198K3565
12289A51994k491K9394l5871k2749m0210j9181J0043n8537m840L3329j482m4553
$$ plain form
12374 99743 84795 19254 8259 9830 36191 92240 107368 111112 143600 79405 9430 -53228
12362 -53228 -50331 -6062 9917 -30325 -55065 -39552 -42435 -18809 58342 69105 84164 103609
12350 103609 63991 36573 40272 47217 25035 25393 24268 72894 82292 70453 58468 64047 77689
12337 77689 29013 -18005 20317 6890 -5531 43936 101401 97256 86617 120235 164663 123704
12325 123704 172855 273106 261464 260507 236442 165576 120913 102397 70758 91831 143689 167314
12313 167314 195990 162864 179136 146118 146124 133700 126309 88831 146464 90441 2485 45250
12301 45250 87738 75166 63069 108422 113752 134024 187206 201328 162496 75231 128429 151994
12289 151994 149503 178897 143026 120277 80067 60886 70929 12392 7552 40881 39399 -5154
12277e154R292j7020l7755L5270J0497j1680j3838K0186J7791p552M7032J0214
12265E7283N4909L6042K2036M4476m5436m8715l287J3713k9211l0228L2597K8558
12253A32737j0266R833Q999J37r2032l2026q798j2141K7308O1341K368O1482n492
12240A43450m6752m4015k5817L0573M4408j0528m9870j077J25808K0484J0076
12229A96740k5788J8547J8459l9526l6880k2354m3367Q591j2776L0534k1255M8492
12217A19417J9973J0407L412q3380p0101K8826N5875L3261j0345l6604J0279L5877
12205A16897q816k3596L0945O233J6129J8667j3410l5144k3392L2395l2822J8284
12193A02370r201k9072j8285J6448Q2992J5764o8551q5117j4536J1412L2653K2288
$$ plain form
12277 -5154 4138 -12882 -50637 -15367 -4870 -16550 -30388 -10202 7589 37 47069 57283
12265 57283 112192 148234 170270 214746 169310 120595 117308 131021 101810 71582 104179 132737
12253 132737 122471 132304 141303 141440 49408 17382 8584 -3557 23751 85092 87460 148942 143450
12240 143450 96698 52683 26866 57439 101847 91319 41449 40372 166180 186664 196740
12229 196740 170952 189499 207958 168432 131552 109198 65831 74422 61646 92180 70925 119417
12217 119417 139390 149797 153209 69829 -272 28554 84429 117690 107345 70741 81020 116897
12205 116897 108081 84485 115430 121663 137792 156459 143049 107905 84513 116908 84086 102370
12193 102370 93169 64097 45812 62260 145252 161016 92465 7348 -7188 4224 36877 59165
12181E9165M2011M2017K2815j1153K0136O9838N9811m8479q697R628J5855K7501
12169C00448n1614j9957J1673M4984l3474k7189l923m3796m547l8263K1711O2933
12157B18986M186n7308l4735o8305l3072K7358L9122M5817K8869m6363N1700R531
12145A85786n5734J8289L7426J1983K0825J2380m23l9014N309k8351o242j4057
12133A48177R001Q909K8096k9628l9035L2156p5198r590O8979R133K3451L7097
12121B11548k3065L418k5076m6532N7270M1678M677l602j0498n359j8199J2355
12109A98615k2302o2363n4845j3886N0608L5737M7235K1589l0083o682L3760L638
12097B01021P764K3930P814p9403n5124J9232q842m3496J7688L2884O5531j2827
$$ plain form
12181 59165 101176 143193 166008 154855 174991 244829 304640 256161 247464 257092 272947 300448
12169 300448 248834 228877 240550 285534 252060 224871 220948 177152 172605 134342 156053 218986
12157 218986 223172 165864 131129 62824 29752 57110 96232 142049 170918 124555 176255 185786
12145 185786 130052 148341 185767 197750 218575 230955 230532 191518 196827 168476 162234 148177
12133 148177 157178 166087 194183 164555 125520 157676 82478 72888 141867 151000 174451 211548
12121 211548 188483 191901 166825 120293 177563 219241 223918 220316 209818 204459 186260 198615
12109 198615 176313 113950 59105 45219 95827 131564 178799 200388 170305 163623 197383 201021
12097 201021 208785 232715 240529 161126 106002 125234 116392 72896 90584 123468 188999 176172
12085A76172n0394J1047M6571l1958o7490l030k0268l5793J76p49L6119O2265
12073A22668l1559j1029j1445J3918K8927N9266P195j3008K7339o088J9494k0203
12061A85475N2916K3413j5556M3579L9429m0194O5014Q1394J02455J27256K9997
12050F95178L445L5257J9035P5192R5092M9658L0448R509n4972r0830n7693n457
12038H03862m0160o5593l4381L9001Q8364J5605k1161q509m9769m9437P129P58
12026F85709j6008J7557P169j7456o309N5869O1376l2727K6779M6610N7927r036
12014H77460p1218L44k779k265J7948K1063L990K6507J7161M2055J2462l5308
12002I07420O0834P7276M9602O422n393K1290N2810L9647k5852N557M501K130
$$ plain form
12085 176172 125778 136825 183396 151438 83948 80918 60650 24857 25033 24284 60403 122668
12073 122668 91109 80080 68635 82553 111480 170746 177941 164933 192272 186184 205678 185475
12061 185475 238391 261804 246248 289827 329256 289062 354076 435470 537925 665181 695178
12050 695178 698623 733880 752915 828107 923199 972857 1003305 1012814 957842 867012 809319 803862
12038 803862 763702 698109 663728 702729 791093 806698 785537 777028 727259 677822 684951 685709
12026 685709 669701 687258 694427 676971 670662 726531 787907 755180 781959 828569 886496 877460
12014 877460 806242 806586 803807 801542 819490 840553 844543 871050 888211 930266 942728 907420
12002 907420 968254 1045530 1095132 1101554 1096161 1117451 1170261 1209908 1184056 1189613 1194114 1196244
11990A196244M7093N3573K3760l509J94L6582K5280K3968l6319j4285N1664J8615
11978A422860J9775Q8485P0518N8795M2896J9717P7889L2916P5776R5167K8729
11967B033523J10050J16160J67837J07191J05592J28334J60026J05465J14164
11958C148342J88080J96218K38490J89505K41033K43989K28822L05647L92966
11949E373092M18745L70622N13943O18007O41720P19439Q44465R33765J083165
11940A1516963J333343J624033J913216K257829K867587L633299M578319O066674
11932C5791263Q247942J1474120J6229210K2967724L0783068L6389142L5278243
11925A97160712K6627015J7155320J5598953K3216188L2612470L1621812J0151399
$$ plain form
11990 1196244 1243337 1296910 1320670 1317161 1317355 1353937 1379217 1403185 1366866 1352581 1404245 1422860
11978 1422860 1442635 1531120 1601638 1660433 1703329 1723046 1800935 1833851 1909627 2004794 2033523
11967 2033523 2143573 2259733 2427570 2534761 2640353 2768687 2928713 3034178 3148342
11958 3148342 3336422 3532640 3771130 3960635 4201668 4445657 4674479 4980126 5373092
11949 5373092 5791837 6162459 6676402 7294409 7936129 8655568 9500033 10433798 11516963
11940 11516963 12850306 14474339 16387555 18645384 21512971 25146270 29724589 35791263
11932 35791263 44039205 55513325 71742535 94710259 125493327 161882469 197160712
11925 197160712 223787727 240943047 256542000 279758188 312370658 343992470 354143869
11918C54143869k7363646n5154946n7969046m6658144l3787032k4092116j7427965
11911I1690974j2810729r737497p606124o144582n072935m195184l464849k905155
11903C9753919k503557k183951j982828j798185j516373j360823j305837j247344
11895B5855021j133650j036581r49575r30753q97095q91564q54402p34633o78859
11886A7747909o06921o23637n50725n80042n78014n00545n56618m94334l53003
11877A2904070l92312m07758l82328l70402k77636l33716k42712k45815k71346
11868I980045k43765k14807k43446k18708k50872k47885j77174k16354j58370
11859H008664j95063k20943k68211k65082j47084j78706j71915j85695j52267
$$ plain form
11918 354143869 326780223 271625277 213656231 166998087 133211055 109118939 91690974
11911 91690974 78880245 69142748 61536624 55392042 50319107 46123923 42659074 39753919
11903 39753919 37250362 35066411 33083583 31285398 29769025 28408202 27102365 25855021
11895 25855021 24721371 23684790 22735215 21804462 20907367 20015803 19161401 18426768 17747909
11886 17747909 17140988 16517351 15966626 15386584 14808570 14308025 13751407 13257073 12904070
11877 12904070 12511758 12104000 11721672 11351270 11073634 10739918 10497206 10251391 9980045
11868 9980045 9736280 9521473 9278027 9059319 8808447 8560562 8383388 8167034 8008664
11859 8008664 7813601 7592658 7324447 7059365 6912281 6733575 6561660 6375965 6223698
11850F223698j08410r8469r3640j96900j51759j96415j85985j42802p2028j14304
11840D862986j21489j67996q9459k854l4033j56002j54879o5180r2007j12931
11830C866156j44645l1830n0292r1865r1836j20952p7702q3204j13596q7663m6525
11819B926046j14462j34045j06290j3316m1856m6485j6568j4266l3797q5157l6112
11808B283692k3022l7088p5052j09861m3298j5826m5541k250k5784m6185o0522
11797A799263m631M7040n627K232p584J600j652o4536j33366q7014m8313k3100
11785A474312O7J0976n996M1760m1992r3133p5638m5226k5257L1736J5966k34
11773A287341r88p8798j3340o726l323k4703q048j889K1773j088k1398k2365n740
$$ plain form
11850 6223698 6115288 6016819 5923179 5726279 5574520 5378105 5192120 5049318 4977290 4862986
11840 4862986 4741497 4573501 4484042 4481188 4447155 4291153 4136274 4071094 3979087 3866156
11830 3866156 3721511 3689681 3639389 3547524 3455688 3334736 3257034 3173830 3060234 2972571 2926046
11819 2926046 2811584 2677539 2571249 2557933 2516077 2469592 2453024 2438758 2404961 2319804 2283692
11808 2283692 2260670 2223582 2148530 2038669 1995371 1979545 1934004 1931754 1905970 1859785 1799263
11797 1799263 1794632 1841672 1836045 1838277 1830693 1832293 1830641 1766105 1632739 1545725 1497412 1474312
11785 1474312 1474379 1485355 1479359 1521119 1479127 1385994 1310356 1265130 1239873 1271609 1287575 1287341
11773 1287341 1286353 1207555 1194215 1187489 1184166 1159463 1151415 1149526 1171299 1170211 1148813 1126448 1120708
11760A120708k4568k0848n6003j05971N911k995K8313r744o2325o4789P176M607
11748H19472m450j0288J2148L654j7792M565J7623j6719k5047M897k3212J7916
11736G82767K8228q7578o6709m3505p1962j4764l2809j7626J7224Q4886R430l3084
11724E54498l7052j3779q3267J6050J444j5195L557O2247N208l2675L5840m726
11712D92150n4542j5160j7919j8325r663N8456L7334L1163k9525l4769p0824j3821
11700C54555P1332L9527o4048m3164L2589L9223J4116l4448r7445k5886L8370
11689C24721K857q5533k2663N6772P553r273j1449m157p996L5123Q289l3182P215
11676B68277p8707o5985K2083R8333J0590l662J8135N1527j7732j8839o0950J1462
$$ plain form
11760 1120708 1096140 1075292 1019289 913318 919229 916234 944547 934803 872478 807689 814865 819472
11748 819472 815022 804734 816882 820536 802744 807309 824932 808213 783166 788063 764851 782767
11736 782767 810995 723417 656708 613203 541241 526477 493668 476042 493266 578152 587582 554498
11724 554498 517446 503667 420400 436450 437894 422699 426256 488503 493711 461036 496876 492150
11712 492150 437608 422448 404529 386204 376541 434997 472331 503494 473969 439200 368376 354555
11700 354555 425887 465414 401366 358202 390791 430014 444130 409682 312237 286351 324721
11689 324721 327578 242045 219382 276154 283707 274434 262985 258828 250832 285955 294244 261062 268277
11676 268277 189570 123585 145668 244001 254591 250929 269064 320591 302859 284020 223070 234532
11664B34532J4763k7231n926K3438L4429J6289l1751k7792Q306L5364l3550o0810
11652A80061P231j3427L80j4551j171M2862J7006o1988k3715K4627n961J1187
11640A62541o898m2722L0072M4157k0503l1317k4324N618l5778k4562N1462K1362
11628A29108M612J6310K5234k7500n7775l0587m762j9955o741m2439O769M263
11616c463l9151J3015q650N133j3914r574J3773m5300L7706R9253j19j7812k7388
11603C509O0429O3949q083n6389l4994L1710l8328l592j920J5059j441L0975L4369
11590I5253l0271j1252q642L697J7500R856J7203j248l9299k0846R433j922L9547
11577G9009K293n0951o746n2808M1456L7130k717l7274L7243J3038n3239m1643
$$ plain form
11664 234532 249295 222064 216138 239576 274005 290294 258543 230751 239057 274421 240871 180061
11652 180061 187292 173865 174245 159694 158523 201385 218391 156403 132688 157315 151354 162541
11640 162541 155643 112921 142993 187150 166647 135330 111006 116624 80846 56284 107746 129108
11628 129108 133720 150030 175264 147764 89989 59402 54640 34685 27944 -14495 -7726 -3463
11616 -3463 -42614 -29599 -38249 -33116 -47030 -56604 -42831 -88131 -50425 48828 48709 30897 3509
11603 3509 63938 127887 119804 63415 28421 60131 21803 18211 16291 31350 29909 60884 95253
11590 95253 64982 53730 45088 48785 66285 76141 93344 92096 52797 31951 41384 39462 79009
11577 79009 81302 30351 23605 -29203 12253 49383 46666 9392 46635 59673 6434 -35209
11565c5209J7500Q7541N1974o624l5495J0336L3994K0804K4462l6851n507K4053
11553A50978k1836n1284n6185J0817J1203n6341k7659J00010L9105n6513j5506
11542B6789M2136K1477k5695p621m6147k6277M5654M0432J6740q532m6299l6953
11530d296p6307M6265R685J0585O2547J5353M2257n998k2351n5157j0628N851
11518A7806O8727K0421J0265l5627J1762J1472k9508k1751k0766j2883l5862l7868
11506e3812K4938L6057O2167j7963l9609j9153o396N549Q457L6072Q1198K4443
11494A41948K6231p0595o3314m9245J944L8998j4521j306l5921r921m7493j1995
11482i5190O7300P4550L213J7822O980m8629m7114p4232K30O091L6785P5423l1965
$$ plain form
11565 -35209 -17709 69832 121806 115182 79687 90023 124017 144821 169283 132432 126925 150978
11553 150978 129142 77858 21673 32490 43693 -12648 -40307 59703 98808 42295 26789
11542 26789 68925 90402 64707 57086 10939 -15338 30316 70748 87488 78956 32657 -4296
11530 -4296 -80603 -34338 -24653 -14068 48479 63832 106089 100091 77740 22583 11955 17806
11518 17806 86533 106954 117219 81592 93354 104826 75318 53567 32801 19918 -15944 -53812
11506 -53812 -28874 7183 69350 51387 11778 -7375 -13771 -8222 235 36307 117505 141948
11494 141948 168179 97584 34270 -14975 -13031 25967 11446 10140 -25781 -35702 -83195 -95190
11482 -95190 -27890 46660 49873 67695 74675 26046 -21068 -95300 -95070 -88979 -52194 23229 -8736
11469h736j09976j1869O9188Q7715j5047J512L488K2150n9572l8765l8427N2620
11457d5719L0745j0148N0100j5766k9225P1866l0285m3222M1904L8393K3097o6239
11445A5501k6934k1191j7828M446M6683J6116k8984J4914L593o716J3657J2944
11433B6201M4224k0771m702m840L5930N198J3535R89o361l2318J5259j2361j2850
11420D7133K0985L8104j0811n5399q5095J4618N8159J609k5274o56j4553k565
11408a3745k4185M042L611O6187l568N521o3724o4163M2478R8457J0284r0582
11396b9387L317R6499L5548l0252n4253j1740K1185J4249k1952l2436k52P1486
11384F2012O7996K4603J103m4078q1991k0084k4250O7575K7568k4608J1778K6177
$$ plain form
11469 -8736 -118712 -130581 -61393 26322 11275 12787 16275 38425 -21147 -59912 -98339 -45719
11457 -45719 -14974 -25122 24978 9212 -20013 51853 21568 -21654 20250 58643 81740 15501
11445 15501 -11433 -32624 -50452 -46006 677 16793 -12191 2723 6316 -400 13257 26201
11433 26201 70425 49654 44952 40112 76042 81240 94775 95764 89403 57085 72344 59983 47133
11420 47133 68118 106222 95411 40012 -45083 -30465 27694 29303 4029 3373 -11180 -13745
11408 -13745 -37930 -33888 -30277 35910 32342 37863 -25861 -90024 -47546 50911 61195 -29387
11396 -29387 -26070 70429 105977 75725 21472 9732 30917 45166 23214 -9222 -9474 62012
11384 62012 130008 154611 155714 111636 29645 9561 -14689 52886 80454 55846 67624 93801
11372I3801q834n406n3869J1792J1568j0878J4753N943n859K029j3311J912O596
11359E0237J215p76J7681l4651j1739J1244j4831M2808K8348J0724M1758l3580
11347A08438l5876N017l3299o7733l8386P1707L7278r469j5255Q107k7613k3790
11335b0874o041M6037m3678l5237J0310N5388M3612K9409l269l5243m4780m4991
11323d9357l2426K2317Q0683k3623k4054L8759M3924j0367n07K0195k7857n1991
11311a4304j9032L1345L9356P922K774J8685j1543j9198j5994J265n963J0393
11299B5706J0552n265K6087k1326j0201Q4773O6579M709k5793n5015m9559l1573
11287A9674J5899L1814k1329O0072K6293J6525l9353n9490m0073K5761l9556l9746
$$ plain form
11372 93801 84967 79561 25692 37484 49052 38174 52927 58870 53011 55040 41729 43641 50237
11359 50237 51452 50676 68357 33706 21967 33211 18380 61188 89536 100260 142018 108438
11347 108438 72562 77579 44280 -23453 -61839 9868 47146 37677 22422 30529 2916 -20874
11335 -20874 -26915 19122 -24556 -59793 -49483 5905 49517 78926 75657 40414 -4366 -49357
11323 -49357 -81783 -59466 21217 -2406 -26460 12299 56223 45856 45349 65544 37687 -14304
11311 -14304 -33336 -1991 37365 45287 48061 66746 55203 36005 20011 21276 15313 25706
11299 25706 36258 30993 57080 35754 25553 110326 176905 181614 155821 100806 51247 19674
11287 19674 35573 67387 46058 106130 132423 148948 109595 50105 10032 35793 -3763 -43509
11275d3509k3591k4686O5725L610J9044O4106M6515L05p684o477m6745m8208l901
11262e496P841p758K8511M8879Q236l7631k6932N7402K2147m5315n7877K5228
11250A7235m275L7293K8995q2972O157r657j9510k0635L0358L7705O548j4954
11238A2288K832l26L2846j2128q487J0104N576m4878o798o156K9139K1388k0709
11225A4691k0478k3531p1581L1407K7743p348j1482k2679M6215J7978n2999j9616
11213i1680L7060J4229k548q709J4260K3232K2025j8067l8242L9125J0934m4349
11201d2730K6380O371J3772M0590k5573o0809P2421K4962l9567k1196n1713m8806
11189a05898N0664M3218j753o1912L0053K0714K5731K5209k1364J8411L7629L9295
$$ plain form
11275 -43509 -67100 -91786 -26061 -22451 -3407 60699 107214 107519 99835 93358 46613 -1595 -5496
11262 -5496 2345 -5413 23098 71977 80213 42582 15650 73052 95199 49884 -7993 17235
11250 17235 12960 50253 79248 -3724 2433 -7224 -26734 -47369 -17011 20694 27242 12288
11238 12288 15120 14794 47640 35512 27025 37129 42705 -2173 -8971 -15127 14012 35400 14691
11225 14691 -5787 -29318 -100899 -69492 -41749 -49097 -60579 -83258 -37043 -19065 -72064 -91680
11213 -91680 -54620 -40391 -42939 -51648 -37388 -14156 7869 -10198 -48440 -9315 1619 -42730
11201 -42730 -16350 -9979 3793 44383 18810 -41999 30422 55384 15817 -5379 -57092 -105898
11189 -105898 -55234 -12016 -13769 -75681 -45628 -24914 817 26026 4662 23073 60702 99997
11177I9997K8748l6332n4804J8741j5262L931l6827M7110J6280k6724l8243M770
11165A1385l3556l0426O7253J0988k1564K8517r257j7450p098l2896P179k1016
11153d7941L1288L9657k2885P970o298K4731Q7849m8786o6109M982P002J7646
11141B9106O003O4007J6816j1803k5085M0o8625m0046L1934M8511m1961n0923
11129d2026L9950K7450L8247L7732n5280o8416o4991J1376M0017M9505J3420J4374
11117D1358k1418j3124K192N1656N2011j829Q558l7639p8141m7258R895O0348
11105B6609L9008M684m6575m8122o3419P5223L1212l3369p5199K4083P2036J8539
11093B4710m7589J4173K9600m9262j3730M0876K2856k0275J5800l2008k9943j3730
$$ plain form
11177 99997 128745 92413 37609 56350 41088 45019 8192 55302 71582 44858 6615 11385
11165 11385 -22171 -52597 14656 25644 4080 32597 23340 5890 -1208 -34104 -26925 -47941
11153 -47941 -16653 23004 119 8089 1791 26522 114371 65585 -524 4458 11460 29106
11141 29106 35109 99116 115932 104129 79044 79084 10459 -29587 2347 50858 8897 -42026
11129 -42026 -2076 25374 63621 101353 46073 -22343 -87334 -75958 -35941 13564 26984 41358
11117 41358 19940 6816 9008 60664 112675 110846 119404 81765 3624 -43634 -33739 26609
11105 26609 65617 70301 23726 -24396 -87815 -12592 18620 -14749 -89948 -65865 6171 24710
11093 24710 -22879 -8706 20894 -28368 -42098 -1222 21634 1359 17159 -14849 -44792 -58522
11081e8522k9981N0538j6870L9759J134N749n5790n2487N8259J1844R0708M0096
11069H4437k2518j7879l0555J5121j7446l6304J4068P9826M0049O0316j7509m7436
11057A04170o0549N0884R676K084L0131l646J5956K9371j7509l2065N3624j2560
11045A69567o57m6659l7947O2831J5189M5869j3147j6305M683L9920P5409J04985
11033D03738K6760L2229j5393q565j3506m0271o5197P070L3229L2127Q470m001
11021C96690k5024o8954k2128M016J1133l6469l808N0487q683l4281L7199L6956
11009C37134j9571r3232o045M7896k6155p9494k8613J8256K8940M7942k1232j4549
10997A91277k9333n6210J7612K40n7265r273J6839j4529K0949M2081l6256j9374
$$ plain form
11081 -58522 -88503 -37965 -54835 -15076 -13942 -8193 -63983 -116470 -58211 -46367 44341 84437
11069 84437 61919 44040 13485 28606 11160 -25144 -11076 68750 108799 169115 151606 104170
11057 104170 43621 94505 104181 106265 136396 132750 148706 178077 160568 128503 182127 169567
11045 169567 168910 122251 84304 147135 162324 208193 195046 178741 183424 223344 298753 403738
11033 403738 430498 462727 447334 438769 425263 384992 319795 326865 360094 392221 400691 396690
11021 396690 371666 302712 280584 284600 295733 259264 255456 305943 297260 262979 300178 337134
11009 337134 317563 224331 218286 266182 240027 160533 131920 150176 179116 227058 205826 191277
10997 191277 161944 105734 123346 123586 66321 57048 73887 59358 80307 122388 86132 66758
10985F6758O6303j4563j5266J5227L4040j6053m7775m4086K051J0249L6085k5433
10973F7537p8593k4496r407q270N6397O7836J4106o173L1877j6312j8150n7795
10961A8557m6791K7661L7664P480J5666j8458m1697M0668N2549j4062k645K2727
10949I9319M6742l898m832j1678j7101J9365j6227l7293j5478l9301M5252K7225
10937I2095j525j09808p2941J2086Q5840L3921m0792J864l5954L9099l2911p1175
10925a00201o2705R50P3428J04081j1582J972K9353j6902o3397l7184L2758O9574
10913B0145K1521n1353j7535P2038K4379K2094j0378k429P394j915N932q913K71
10900H1251L0821M0309r249J511k6705k2244m5395j1811j80L915K128K0885J176
$$ plain form
10985 66758 133061 118498 103232 118459 152499 136446 88671 44585 46636 56885 92970 67537
10973 67537 -11056 -35552 -44959 -53229 3168 71004 85110 78937 110814 94502 76352 18557
10961 18557 -28234 -573 37091 44571 60237 41779 82 40750 93299 79237 76592 99319
10949 99319 146061 142163 137331 125653 108552 127917 111690 74397 58919 19618 64870 92095
10937 92095 90570 -19238 -92179 -80093 5747 39668 -1124 740 -35214 3885 -29026 -100201
10925 -100201 -162906 -161956 -88528 15553 3971 5943 35296 18394 -45003 -82187 -49429 20145
10913 20145 41666 -9687 -27222 44816 69195 91289 80911 78482 85876 83961 89893 80980 81251
10900 81251 112072 152381 143132 144643 117938 95694 50299 38488 38308 42223 44351 65236 66412
10887F6412L7686M2837n9573k1365L4552m3429m733K7541l732L4825j385l4145
10875G5491l0160L7264M487m9538k7092k2046j1819J2811j3662m599j6085K7787
10863a7161M9244O418l2254p4857n0841K187L7704N7334N1762L1459m3155k2988
10851e148L8273l9291M4986k0267J8329L4098M3935r745O43n0754J8531m1686
10839C1904j1512L5133n48J7644K6659K0429l1922j10369l1996K3708J5645m4081
10827e9306K0906K6532M879l9998K2368K9096M965o51N7675Q038n9593l1603M2352
10814B5660K1294K0897o44M018j8274j8287K4320L0457k3013k1493q055j6167
10802B0713o1707J7097L5437L4852M1728K0655j6472m4628J7457k830j1538l0703
$$ plain form
10887 66412 104098 146935 87362 65997 100549 57120 52387 79928 76196 111021 109636 75491
10875 75491 45331 82595 87082 37544 10452 -11594 -23413 -10602 -24264 -28863 -44948 -17161
10863 -17161 32083 38501 6247 -68610 -119451 -117264 -79560 -22226 29536 60995 17840 -5148
10851 -5148 33125 -6166 38820 18553 36882 70980 114915 105170 105813 55059 73590 31904
10839 31904 20392 55525 54977 72621 99280 119709 87787 -22582 -54578 -30870 -15225 -59306
10827 -59306 -38400 -11868 -6989 -46987 -24619 4477 9442 8791 66466 74504 14911 -16692 25660
10814 25660 46954 67851 67207 71225 52951 34664 58984 89441 66428 44935 36880 20713
10802 20713 -40994 -23897 11540 46392 88120 108775 92303 47675 65132 62302 50764 20061
10790B0061K1480n3056n5756m7024J6544L8113J7661L5768J8057K2518M3750j1600
10778F6516j2031L1237J3224N5004j0723J6281l2964k3858m9585K7786L0377k4655
10766H6609l0385L056J4391k9233M694J3761m5463k8200L2702J154l3053J5059
10754E092k9601L0526R1206K0190k6383o3622K2710Q3357o52p569m324P178l0857
10741I7251N06L5183J1286o0456l1713N485k7140K6238M0205N5179k2716k7731
10729A01577j9673L4981K759L9803K1997L8515L7115J0237J678j2789k6931n5179
10717A74090k7932J01077M9087k2122J8931o5743l9385J2125K1006j0838R6407
10706C06703L0720m1212k1521j9564l278k6656J9169L369m4689j7714k0857O077
$$ plain form
10790 20061 41541 -11515 -67271 -114295 -97751 -59638 -41977 -6209 11848 34366 78116 66516
10778 66516 54485 85722 98946 153950 143227 159508 126544 102686 53101 80887 111264 86609
10766 86609 56224 59280 73671 44438 49132 62893 17430 -10770 21932 23086 -9967 5092
10754 5092 -24509 6017 97223 117413 91030 27408 50118 133475 132823 125254 120930 128108 97251
10741 97251 97757 132940 144226 83770 52057 57542 30402 56640 96845 152024 129308 101577
10729 101577 81904 116885 119644 159447 181444 219959 257074 267311 268989 256200 229269 174090
10717 174090 146158 247235 296322 274200 293131 227388 188003 200128 221134 210296 306703
10706 306703 337423 296211 274690 255126 251848 225192 244361 247730 203041 185327 164470 170547
10694A70547L7408L2215m953J1849K6789N1667J6572k6351l5374j3965L7475n927
10682B97952J8j2703p7558M2282M8753K0097k3167p4075k1078K2616p703J5013
10670B30447K3614J3686J6407L3172N9922K2317m2498k5022j4969o778k8153M8457
10658C30602M7802M4445j2037o031O5866P9187j2774Q666l042l5200J5106L8978
10646E61568R2308L2394O1815J9233L6204N6232K6894P5458J44823J90099P4571
10635A371599O7655J77354K83628K80259K21603K79298L68751N08865O89926R59168
10625E208106J272771J560099J882413K010193J905950J784262J762730K062312
10617A9448836K410309K569628K328992J878430J467828J659846K184292K510955
$$ plain form
10694 170547 207955 240170 235217 247066 273855 325522 342094 315743 280369 266404 303879 297952
10682 297952 297970 285267 207709 249991 298744 318841 295674 221599 200521 223137 215434 230447
10670 230447 254061 267747 284154 317326 377248 399565 357067 332045 317076 310298 282145 330602
10658 330602 378404 422849 410812 404781 470647 549834 537060 545726 542684 507484 522590 561568
10646 561568 653876 686270 748085 767318 803522 859754 886648 962106 1106929 1297028 1371599
10635 1371599 1439254 1616608 1900236 2180495 2402098 2681396 3050147 3559012 4248938 5208106
10625 5208106 6480877 8040976 9923389 11933582 13839532 15623794 17386524 19448836
10617 19448836 21859145 24428773 26757765 28636195 30104023 31763869 33948161 36459116
10609C6459116K304535K023543K227722L025601L902501M186963L300073J395788
10601E8825842q1575j13725Q20902J482555J478519J208538J731901K919871L845894
10592G2118722L626385J637116j661820m213384m606258l559274k473504j839780
10584E9028203j395706p05799K85806J025530Q10726o10087k996688m657204m715168
10575D6069613l874550k942277k264497j837242j241888p69992o23848q37616
10567C1677703j598365k340450k961546l020019k653060k164668j796139j356356
10559A3787100j049635r33636p85885n61867m83920n02580m42538m53224l89008
10550H184807l39348l35783l16397k38258k36763j84162k19686k06531j57435
$$ plain form
10609 36459116 38763651 40787194 43014916 46040517 49943018 54129981 57430054 58825842
10601 58825842 58744267 58630542 59451444 60933999 62412518 63621056 65352957 68272828 72118722
10592 72118722 75745107 77382223 75720403 71507019 66900761 63341487 60867983 59028203
10584 59028203 57632497 56926698 57212504 58238034 59048760 58438673 55441985 50784781 46069613
10575 46069613 42195063 39252786 36988289 35151047 33909159 33139167 32515319 31677703
10567 31677703 30079338 27738888 24777342 21757323 19104263 16939595 15143456 13787100
10559 13787100 12737465 11803829 11017944 10456077 9972157 9469577 9027039 8573815 8184807
10550 8184807 7845459 7509676 7193279 6955021 6718258 6534096 6314410 6107879 5950444
10541E950444j78568j48457k03615k20523k01490j16575j61895j11392j15092
10532D492837j44111o1456l8125j04408k25947j86759r7990J617o9606q5824m1514
10521C438714n3853j06647j13558j33372q7500l8166k5031j23721q4571p0641
10511B601654q3822l3806n1620k0865l5393p6600j00137q1485q5530O209k557
10500B036048q8715k7090o5284o9219m2529m9944k6798r7834n4318l0924k8968
10489A454425p238M1224m7864L5320j9024l5838q201l41r2387n5489j9385m5781
10477A199421j06952m9642L7806n092m4030n2369L8446J6334r005L2233o852q8814
10465I61484m6669l5330L9303m753n4693l5370J2014M2963K741p8552p9154Q13
$$ plain form
10541 5950444 5771876 5623419 5419804 5199281 4997791 4881216 4719321 4607929 4492837
10532 4492837 4348726 4287270 4249145 4144737 3918790 3732031 3634041 3635658 3566052 3480228 3438714
10521 3438714 3384861 3278214 3164656 3031284 2943784 2905618 2880587 2756866 2672295 2601654
10511 2601654 2517832 2484026 2432406 2411541 2376148 2299548 2199411 2117926 2032396 2038605 2036048
10500 2036048 1947333 1920243 1854959 1785740 1743211 1693267 1666469 1568635 1514317 1483393 1454425
10489 1454425 1447187 1488411 1440547 1475867 1456843 1421005 1412804 1412463 1320076 1264587 1245202 1199421
10477 1199421 1092469 1042827 1080633 1075541 1031511 979142 1017588 1033922 1024917 1057150 1050298 961484
10465 961484 914815 879485 918788 914035 859342 823972 835986 878949 881690 803138 723984 724797
10453G24797K4100j6513L220L535K6616J5953L4137N654K1609p424n2613p2108
10441G10963j7022k6277k3973K944j0441j5936r003J8927k4643p7957k904P968
10429E32646J4047K6231M9795o6009o9004J5698q819L4508j874p1018m7889p368
10417D00944K6640K0451L5317q6976k8322r438K1559L7413Q258p6269n4558J9090
10405C14109P3189J6266K0499j4725p2267l7981l526M77M192k6836j8942L2046
10393B86501M7351k2018p8600k7365j1695j0739k5613J1450L2820L0453M1250
10382B73795K1218n5746p0399n2329k043Q8916L3889l7463J8952M5753m1243q2126
10370A41174O555P8203O353m1821R571k25l9993R737o6418j5954K3717K3968k5373
$$ plain form
10453 724797 748897 732384 735604 739139 765755 781708 815845 821499 843108 835684 783071 710963
10441 710963 693941 667664 643691 646635 636194 620258 611255 630182 605539 527582 524678 532646
10429 532646 546693 572924 622719 556710 487706 503404 494585 529093 527219 456201 408312 400944
10417 400944 427584 448035 483352 396376 368054 358616 380175 417588 425846 349577 295019 314109
10405 314109 387298 403564 424063 409338 337071 299090 295564 296041 300233 273397 254455 286501
10393 286501 333852 311834 233234 205869 194174 183435 157822 169272 202092 232545 273795
10382 273795 295013 239267 168868 116539 114496 203412 237301 199838 218790 264543 223300 141174
10370 141174 147729 225932 232285 190464 200035 199810 159817 169554 103136 87182 110899 134867 109494
10357A09494l8209l941n4171j6605J6960L3330P3338J7632j4161m6116m5909q746
10345B2896K6842K8118J6679K4479m1691M403J2653J356L8078q685K470j1227
10333A16371m1860j7087n2412n780M7846R4j7670Q24K9249k722J4355O3517J5955
10320A50680m4459l1680k8714J6698K0660M4991N9476p0742m012J4946k2779r6811
10308H254n2176N6063K4956M574q819K5711N7522j5153j4439M9256J1471k7968
10296A19252m0163J5138l8927o6942j0986k335N2625j9110r053P1041l0227J624
10284D1937N460O279J3506J4930j8936j4881k6851l8718K5974J1155k0357k5941
10272b6443k4525N8456M1596k9277L3569j6315m6843m4319j860Q1025j3750k9408
$$ plain form
10357 109494 71285 67344 13173 -3432 13528 46858 120196 137828 123667 77551 31642 22896
10345 22896 49738 77856 94535 119014 77323 81726 94379 95735 133813 125128 127598 116371
10333 116371 74511 57424 5012 -768 47078 47172 29502 30326 59575 56853 71208 134725 150680
10320 150680 106221 74541 45827 62525 83185 128176 187652 116910 112898 127844 105065 8254
10308 8254 -43922 12141 37097 41671 32852 58563 116085 100932 86493 135749 147220 119252
10296 119252 79089 94227 55300 -11642 -22628 -24963 27662 8552 -501 70540 40313 41937
10284 41937 47397 53676 67182 82112 63176 48295 21444 -17274 8700 19855 -502 -26443
10272 -26443 -50968 7488 49084 19807 53376 37061 -9782 -54101 -55961 25064 11314 -18094
10260a8094n7104J7299K4511l7905R351K2322n220P5799P3838n7426p3401K1338
10248d692O1328K8390k7069R646k1072n3074j1959N0484K8109k3596j9510k717
10236A4268J874m7815l2521L9504j48L9819k5137M097l795q8492j1439P9459M3316
10223A2990K1923p9380p686N0861j1828r318P5458K0420l341l5048K0j7887K3841
10210D1025J04251k3474n5273J5505K4815p468n6511p0106L9027L8172k4445q7161
10198f1643m541R4106M1086J6727q243l4332j1475J7175J5872j8216n1593J0634
10186E557J9726j6040L935J9925J5880n0901K5034J12172K7118j9356L0308L3758
10174B07116J7980K119j847L5254L4141M2272K2180j2637N1822R06m3529r95J0053
$$ plain form
10260 -18094 -75198 -57899 -33388 -71293 -61942 -39620 -44840 30959 104797 47371 -26030 -4692
10248 -4692 56636 85026 57957 67603 46531 -6543 -18502 31982 60091 36495 16985 14268
10236 14268 16142 -31673 -64194 -24690 -24838 14981 -10156 -6059 -9854 -98346 -109785 -30326 12990
10223 12990 34913 -44467 -52153 -1292 -13120 -22438 53020 73440 70099 35051 35071 17184 41025
10210 41025 145276 121802 66529 82034 106849 99381 42870 -27236 11791 49963 25518 -61643
10198 -61643 -66184 27922 69008 85735 77492 43160 31685 48860 64732 46516 -5077 5557
10186 5557 25283 9243 13178 33103 48983 -1918 23116 135288 162406 143050 173358 207116
10174 207116 225096 227215 225368 260622 294763 337035 359215 346578 398400 399306 355777 354782 364835
10161C64835K8099k0471j9415o888M347j2841L2730N2908n6766K3047l0278l6369
10149C22938o0202n7594M9146M6586j3959l4626l3964j179J7726k9596p1505P0483
10137B04254J8378o3588j6652J5659k2854l7412n262J0370j9999j1388J037n3609
10125A8934k111K6018n739l6519K5815K9602M6333O1678p006n0179m7903N4530
10113A13453M1394k2921k5562K5397K4780o8399q0058N012K7028Q76k2169j1800
10101G031n0880R425L4654j7603l2795J1994M2829p097k2766l6912j2803L2367
10089d2556o751k5713O666N2340K0513K5480M5156Q575k2071j5851J2644L043
10077F1475n0244J5218L5124m9411M144J868M0921p147q2020m7316K9868M0170
$$ plain form
10161 364835 392934 372463 353048 346160 350507 337666 370396 423304 366538 389585 359307 322938
10149 322938 262736 205142 254288 300874 286915 252289 218325 217146 234872 205276 133771 204254
10137 204254 222632 159044 142392 158051 135197 97785 92523 102893 82894 71506 72543 18934
10125 18934 16823 42841 37102 583 26398 56000 102333 164011 157005 106826 58923 113453
10113 113453 154847 131926 106364 131761 156541 88142 8084 13096 40124 41000 18831 7031
10101 7031 -43849 -34424 230 -17373 -50168 -38174 4655 -2442 -25208 -62120 -74923 -42556
10089 -42556 -49307 -75020 -68354 -16014 4499 29979 75135 83710 61639 45788 58432 61475
10077 61475 11231 26449 61573 12162 16306 18174 59095 51948 -30072 -77388 -47520 -7350
10065g350O7372N7589m5903j1526j0608J2886K5956R963P562Q738p4831J106K0095
10052F1049L4691J7303j4709k6677j2437K838n013l090n0740o4677k0679L2523
10040d9618J106K395m2204q617O3916J4682J321J8147M4868m7921m581j9997K9024
10027B521J4440m6968j9899N6871L6663k3575k527j7199J8115J6648R546O511
10015E1147k028m1500n4431M1432j6890l5121l3406M9433L0350j2307R34P7370
10003E4983n128n4721l1967J3263j890l0632L9013M1988o796j5648Q4484J0755
9991I7704p3158j0622O2919l4824l8369J7818P308P268L0916L7053p059r4271
9979B683o4201j5673J8652k3552k0724k1526R870M702p999K2013k0198k0144N0629
$$ plain form
10065 -7350 60022 117611 71708 60182 49574 62460 88416 98379 105941 114679 39848 40954 61049
10052 61049 95740 113043 98334 71657 59220 62058 57045 53955 3215 -61462 -82141 -49618
10040 -49618 -48512 -46117 -88321 -96938 -33022 -18340 -17019 1128 45996 -1925 -6506 -26503 2521
10027 2521 16961 -30007 -49906 6965 43628 20053 17526 327 18442 35090 44636 51147
10015 51147 49119 7619 -46812 -5380 -22270 -57391 -90797 -41364 -11014 -23321 -22387 54983
10003 54983 49855 -4866 -36833 -23570 -25460 -56092 -17079 24909 18113 2465 86949 97704
9991 97704 24546 13924 76843 42019 3650 21468 28776 36044 66960 104013 96954 2683
9979 2683 -61518 -77191 -58539 -82091 -102815 -124341 -114471 -109769 -117768 -95755 -115953 -136097 -85468
9966h5468L9946J5167k2249J6248O9628L279k0985k6816o101J5910K6749J0059
9954C5367k990m6702J0552k1804J9051k0154L3045K8025l5148k4004M143j9567
9942d0186n873K0229M3823L0899m4044m6052J9004R380M7462K1338k0582J0362
9930D5760N870N7385J7875l3474p9309j8219K4262o785O3114O731l6994k3834
9918B2382L0489J427n529o074O7917J5495o0709p3575K936M5617j0403p719J5217
9905C7471R499J954m4780n2664p606M678j3133K7395o278k7247L4080j1190Q467
9892c9354L734K3150J9078l3427n3128L6934l6974j526M3799j1636L2077l1123
9880d8396j8153j9396O7987O3592n8449k0969K0029j1107q270l1747n996k381
$$ plain form
9966 -85468 -45522 -30355 -52604 -36356 33272 36551 15566 -11250 -17351 -1441 25308 35367
9954 35367 32377 -14325 -3773 -25577 -6526 -26680 6365 34390 -758 -24762 -20619 -40186
9942 -40186 -46059 -25830 17993 48892 4848 -41204 -22200 -12820 34642 55980 35398 45760
9930 45760 51630 109015 126890 93416 14107 -4112 20150 13365 76479 83210 46216 22382
9918 22382 52871 54298 48769 42695 110612 126107 65398 -8177 -5241 40376 29973 22254 37471
9905 37471 46970 48924 4144 -48520 -56126 -51448 -64581 -37186 -43464 -70711 -36631 -47821 -39354
9892 -39354 -35620 -12470 6608 -26819 -79947 -43013 -79987 -81513 -37714 -49350 -17273 -48396
9880 -48396 -66549 -85945 -17958 45634 -12815 -33784 -13755 -24862 -33132 -64879 -70875 -73256
9868g3256M4699J1440O3294j1105K907N001J2521k9511m2841J6735n0869j1833
9856f2818M296m5132M496j1321L2805Q7384P454o0347l8800N760j7325M0305J8479
9843c4764J6688O639m3113j3474L7353J4016l6183q914p035O938P5989M1771j3702
9830D2209j01096m1089J7188L0749j5534l1830N999O0838J6958M1591K4430J4720
9818F5133k0148o4569m1662n663j9275M2600j5681K0770l909Q71N6135k0312j299
9805g009K9858q374o2841l9439K5182K4958M3546J8224J0149j6450o9187J2494
9793c8889N6961K6098N07n2029k8369K2527K5719m4089j2326o695n9374m0232
9781a50191M6373N4186M1598K5221J0611j4568k7586o1017O319K9209m1723N153
$$ plain form
9868 -73256 -28557 -17117 46177 35072 37979 42980 55501 25990 -16851 -116 -50985 -62818
9856 -62818 -58522 -103654 -99158 -110479 -77674 9710 17164 -43183 -81983 -76223 -93548 -53243 -34764
9843 -34764 -18076 -11437 -54550 -68024 -30671 -16655 -52838 -61752 -68787 -61849 14140 55911 42209
9830 42209 -58887 -99976 -82788 -52039 -67573 -99403 -93404 -32566 -15608 25983 50413 65133
9818 65133 44985 -19584 -61246 -66909 -86184 -43584 -59265 -38495 -42404 -41533 14602 -5710 -7009
9805 -7009 22849 14475 -48366 -87805 -62623 -37665 5881 24105 34254 17804 -51383 -38889
9793 -38889 18072 44170 44677 -7352 -35721 -13194 12525 -31564 -43890 -50585 -109959 -150191
9781 -150191 -103818 -49632 -8034 17187 27798 13230 -14356 -75373 -69054 -39845 -81568 -76415
9769g6415P2396M5820O543p5177l8685J5032K3943N5548K1225j05552l3116j1969
9757a00407j6084M8784J7973j535K1678K3835O2451k7402m1989M9410N4940l0845
9745F0809r8814m1331O8503M0612j703J8725r118j7546P380K0159O0397k9029
9733G9044l3987m9634o5191O0900K1096k0J3503n0434M0940O140J1988K9643l4345
9720B9643Q123K9763J5345j0009M428k4576l5614l4995K1130l389P1J57J3691
9707A3768K3325j2306l7632l3094M9060L4510r223n8190O094L4542O9453j9569
9695F0738l5140M5436j3882r2124j4998L1591N8299Q584j8044o332o260M1123
9683E8991J2161o9103R831k3307M112l2825l6482M0006M9667l3110L2007j6213
$$ plain form
9769 -76415 -4019 41801 48344 -26833 -65518 -50486 -26543 29005 50230 -55322 -88438 -100407
9757 -100407 -116491 -67707 -49734 -51269 -29591 -5756 56695 29293 -12696 36714 91654 60809
9745 60809 -38005 -79336 -10833 29779 28076 46801 37683 20137 27517 47676 108073 79044
9733 79044 45057 -4577 -69768 -8868 12228 12208 25711 -24723 16217 22357 34345 63988 29643
9720 29643 37766 67529 82874 72865 77293 52717 17103 -17892 3238 -151 -80 77 13768
9707 13768 37093 24787 -12845 -45939 3121 37631 28408 -29782 -23688 10854 80307 60738
9695 60738 25598 71034 57152 -34972 -49970 -18379 39920 48504 30460 24128 17868 58991
9683 58991 71152 2049 11880 -11427 -7315 -40140 -76622 -36616 13051 -20059 11948 -4265
9671d265p908m9538r061N7872P5035L337m8801J3727N3702k0086n9618k2783M1935
9658B3548P3271j0803l2410L0353M4910K1428J162p15m51l8474m6178J6099O289
9645H8029M00l2632j6863l9754j2272j412J0729R4j3081K0709J1329j4188p182
9632f094Q187J1851j9313k1435J7201L2584r433m521Q012P736K6654j9337n2017
9619a9925l0998K4112O1871N120p187k88j9915J8067O2079j3011n3369n0491k840
9606b6775M9588j5233j9232j9094L5846j9441j1912k3672Q097N7802K3814j6598
9594B3190o6410l365K9623J2986j8667m1223J2118O3016K7093l8105J5956j5382
9582H30K508J3963Q0611K1511p5940m5102J3571Q783J2044n260p994l798k0928
$$ plain form
9671 -4265 -12173 -61711 -70772 -12900 62135 65472 16671 30398 84100 64014 4396 -18387 23548
9658 23548 96819 86016 53606 83959 128869 150297 151459 150744 150293 111819 65641 81740 88029
9645 88029 88429 55797 38934 -820 -13092 -14504 -3775 -3681 -16762 3947 15276 1088 -6094
9632 -6094 2093 13944 -5369 -26804 -9603 22981 13548 9027 17039 24775 51429 32092 -19925
9619 -19925 -50923 -26811 35060 40180 32993 32705 12790 30857 92936 79925 26556 -23935 -26775
9606 -26775 22813 7580 -11652 -30746 5100 -14341 -26253 -49925 -41828 15974 39788 23190
9594 23190 -43220 -46585 -16962 -3976 -22643 -63866 -51748 11268 38361 256 16212 830
9582 830 3338 17301 97912 119423 43483 -1619 11952 20735 32779 27519 19525 15727 -5201
9569e201L3993K9751o2836n2148J5251j370J6180l459J5870J0908j8175j0983
9557c2219N188N5171Q8625l3131p1294L2979M6815R037m2821n1224l7344N5840
9545B5622J4528j03153j01178K9373N5464J8702n315J9065L3265Q539J2198j0627
9533c517k0330J4628M5144k4729l0710m8958J4156N0490k7967p164l2J4249J5502
9520i238j188J8269n8342j8834o345K08L0257O4732J4650J5423n0030m4748j1119
9507e6305J9773k2892J8819L5527R5836J1172j5031m8104k8357o8506P69J8219
9495c9080P7480j4959n0693R470L302j9858m751k2237K1870N8112m450l7844j4562
9482c8200K1388q886P24k562k3288k0126l5101j5153L4912P4403K493P720o80
$$ plain form
9569 -5201 28792 58543 -4293 -56441 -41190 -42560 -26380 -29839 -13969 -3061 -21236 -32219
9557 -32219 -27031 28140 116765 83634 12340 45319 92134 101171 58350 7126 -30218 25622
9545 25622 40150 -63003 -164181 -134808 -79344 -60642 -65957 -46892 -13627 -5088 7110 -3517
9533 -3517 -23847 -9219 35925 11196 -19514 -68472 -54316 -3826 -31793 -38957 -38989 -24740 -9238
9520 -9238 -10426 7843 -50499 -69333 -75678 -75470 -45213 19519 34169 49592 -438 -45186 -56305
9507 -56305 -36532 -59424 -40605 -5078 90758 101930 86899 38795 10438 -58068 -57299 -39080
9495 -39080 38400 23441 -27252 -17782 -14480 -34338 -39089 -61326 -39456 18656 14206 -23638 -38200
9482 -38200 -16812 -25698 -24974 -27536 -50824 -70950 -106051 -121204 -86292 -11889 -9396 -1676 -2356
9469b356L7076J6639j767J8j6552l7595M2522n0855p6946K4797N3458K4572o6347
9456e3336j9073J0451j6741r485j427M366P9409M0317O108n6731k7530L1304J6466
9443D098k4066m6901o776j4926K9267L6969J6316M5283L6103p6K7684K26O897
9430A10098M416m2096l0839j025N6862j1476k4213l9647J2523n0632o700J5814
9418f915J3393j6060K480L7273q7826K7280L3674k4103L514l490Q325N16o8178
9405h0117j04603J1537P0656R0326K5956l3474n2862M510O542J2293L5727M7747
9393C4238L1894k3930M453j00841K7651P4753K8643m3602p7005m4925J4675N7637
9381a6359P0092O423k1528q5117J7350O2051L9461R356l5700K0305k757m5023
$$ plain form
9469 -2356 34720 51359 49592 49610 33058 -4537 37985 -12870 -89816 -65019 -11561 13011 -53336
9456 -53336 -72409 -61958 -78699 -88184 -89611 -85245 -5836 34481 40589 -16142 -43672 -12368 4098
9443 4098 -19968 -66869 -73645 -88571 -59304 -22335 -6019 39264 75367 75291 102975 103201 110098
9430 110098 114514 72418 41579 40554 97416 85940 61727 22080 34603 -16029 -22729 -6915
9418 -6915 6478 -9582 -7102 30171 -57655 -30375 3299 -20804 -17290 -20780 -12455 -11939 -80117
9405 -80117 -184720 -173183 -102527 -12201 13755 -19719 -72581 -68071 -61529 -49236 -13509 34238
9393 34238 66132 42202 46655 -54186 -26535 48218 76861 33259 -43746 -88671 -73996 -16359
9381 -16359 53733 60156 38628 -46489 -29139 32912 72373 81729 46029 66334 63577 18554
9369A8554L8813M8179j5247n6851m0471o168J6772j0507J74m123k9195N5167L3138
9356D8235o4602o2861j6539K2872J09412K3666m250K3220Q416j4383j5292l6305
9344B1589J2103K5039N2924O281j01330l3171k421q231K4731L0997K5208J9820
9332G3539k8572j0358j7308j5916J5986J4110m928n2431P605K9866k7180j1019
9320b6606m8041J9030N0239L699J1046J06309k977o7946k9511l6564L7630k5294
9308h986L0995L1521k1006l6842l3873l9686L8482O0464L1267j4240m0627J1377
9296H846N629J4316l7988j900m9991k2784j096L8702O6115K5922l6915j7382j0517
9283a9043M0045L0227n1735r954l502l136j5324J6910M343M050J690m6286K4992
$$ plain form
9369 18554 57367 105546 90299 33448 -7023 -13191 3581 -6926 -6752 -10875 -40070 15097 48235
9356 48235 -16367 -79228 -95767 -72895 36517 60183 55933 79153 87569 73186 57894 21589
9344 21589 33692 58731 111655 117936 16606 -16565 -18986 -27217 -2486 28511 53719 73539
9332 73539 44967 34609 17301 1385 17371 31481 26553 -25878 -18273 11593 -15587 -26606
9320 -26606 -74647 -55617 -5378 -1679 9367 115676 112699 44753 15242 -21322 16308 -8986
9308 -8986 22009 53530 32524 -4318 -38191 -77877 -39395 21069 52336 38096 -2531 8846
9296 8846 14475 28791 -9197 -11097 -61088 -83872 -84968 -46266 19849 45771 8856 -8526 -19043
9283 -19043 21002 51229 -506 -10460 -13962 -17098 -32422 -15512 -11169 -7119 -5429 -51715 -26723
9270b6723K0112l4751k1990q210P4941L0531p489p851J1020N3241K2760j853L654
9257A07392k7620q7695k7572m0929K4875N1312J4674k0368J448m8386l3018J2551
9245g3336J8096L5960L1470m2782j4186L3011n01J0789O688m5568N3576M5801
9233E9018m1152J7213r507J57L8814p736l6148l5473J4555j7218o4484m2888P2366
9220e2483L9938m04M0742M1396k2702m4600K1852l9725m5994j7891L9513o658
9208d7016l150P164j2498r952m7966j0304k9332L1939N3189M7868N1404J3209
9196D4555p958l7634L1192q902m9368k4905M4174L4599m5684m8680J1436K3126
9184c4049K3561L553k1498j2250m237N0800M9967P798k6957J3725m4154L7689
$$ plain form
9270 -26723 -6611 -41362 -63352 -71562 3379 33910 26421 18570 29590 82831 105591 103738 107392
9257 107392 79772 -7923 -35495 -76424 -51549 -237 14437 -5931 -4483 -52869 -85887 -73336
9245 -73336 -55240 -19280 12190 -30592 -44778 -11767 -12268 -1479 5209 -40359 13217 59018
9233 59018 17866 35079 25572 25729 64543 56807 20659 -14814 -259 -17477 -81961 -124849 -52483
9220 -52483 -12545 -12949 27793 69189 46487 1887 23739 -15986 -61980 -79871 -40358 -47016
9208 -47016 -50166 -43002 -55500 -65452 -113418 -123722 -153054 -121115 -67926 -20058 31346 44555
9196 44555 36597 -1037 30155 21253 -28115 -53020 -8846 25753 -19931 -68611 -57175 -34049
9184 -34049 -10488 -6935 -28433 -40683 -44920 5880 55847 63645 36688 50413 6259 43948
9172D3948P614o1762m7132J7222l2884J9273J147m4063n335L2981l7798q856K6937
9159h8708M7060L0365j1069L6150M157k2779J7851m0975K6620J2881k1832R2832
9147H2553k739p4843m3559K1637L3559K7174j9266l977N1383l8800l0807M5443
9135D7758m1253L5337M8983j3958k5154n964J3163j5514n3606n2110l1202m102
9123i7622O4677P834j3237P729L8736j2574l5867O7051N3994l7199l4451L946
9111A3017o492J7465L5374j0980k1038L6507k6617l5432k7173K61k9901l8240
9099i3249P184L6480j6249l572K7671j9781j7277J1222M0661K2658L6790k8683
9087C855m0789L5464L1237K2359P825k6843k5374l6342l9006k179J3244Q7236
$$ plain form
9172 43948 51562 -10200 -57332 -40110 -72994 -53721 -52574 -96637 -101972 -68991 -106789 -115645 -88708
9159 -88708 -41648 -11283 -22352 13798 17955 -4824 13027 -27948 -1328 11553 -10279 82553
9147 82553 79814 4971 -38588 -16951 16608 43782 24516 20539 71922 33122 2315 47758
9135 47758 6505 41842 90825 76867 51713 45749 58912 43398 -10208 -62318 -93520 -97622
9123 -97622 -32945 -25111 -38348 -30619 8117 -4457 -40324 26727 80721 43522 9071 13017
9111 13017 6525 23990 59364 48384 27346 63853 37236 1804 -25369 -25108 -55009 -93249
9099 -93249 -86065 -49585 -65834 -69406 -41735 -61516 -78793 -67571 -26910 -4252 32538 3855
9087 3855 -36934 -1470 29767 52126 59951 33108 7734 -28608 -67614 -69793 -56549 30687
9075C0687K7338k2164j3896L4577N2168n0181l2643n054l2255l4914L3370O949
9063f018l0854M8142P4021k373p072m5273j9098l859O763j5337p269Q396J2137
9050A2306P647j5002k3291m4814m604o40j754j5045j4573m843j9121N1024N4035
9037a8675L1950J4791k5538K8321m2988n4426K6488K7733N8513R003k5769j7549
9025A1854o4959K3024J3305n5809K8072M1407K2073K5899j9136p8110j9421L2702
9013c9099l847j3251k9909K3605Q2075K7297o1723k7239K2040n0615j936M021
9001f8581L864Q153L5885n260j4351J9637k2777j2584O9138K3567J0353m2134
8989D910k0759P8638J005K39K747o878r462j2692O429j8592k7063K1210L7900
$$ plain form
9075 30687 58025 35861 21965 56542 108710 58529 25886 20832 -11423 -46337 -12967 -6018
9063 -6018 -36872 11270 85291 82918 75846 30573 11475 7616 14379 -958 -8227 169 12306
9050 12306 19953 4951 -18340 -63154 -67758 -68398 -70152 -85197 -99770 -104613 -123734 -72710 -18675
9037 -18675 13275 28066 2528 30849 -12139 -66565 -40077 -12344 46169 55172 29403 11854
9025 11854 -53105 -30081 -16776 -72585 -44513 -3106 18967 44866 25730 -52380 -71801 -39099
9013 -39099 -42946 -56197 -86106 -62501 19574 46871 -14852 -42091 -20051 -70666 -72602 -68581
9001 -68581 -64717 -56564 -20679 -25939 -40290 -20653 -43430 -56014 13124 36691 47044 4910
8989 4910 -15849 62789 63794 64033 66780 59902 50440 37748 44177 25585 -1478 19732 57632
8976E7632k2805k9954m2246p2944J5541N5720R5298k1443l5666M9234r435k3925
8964A5007J8476j5331j0573k0849m269M7917J1716o1509m2272l5597j0868M7537
8952f0615K259l299L9992m6375q731L258L7014R196P670K3690k5688J981P2649
8939E3001Q3800l9144n9303J9967k3185o0895J0105j6685o317j1918o3651R741
8927a04484O4068O1317O5892J7370n600l3996m1962N1129k6150m7256o310K3994
8915A8012j4578n3736l6480Q978P3934k470n1559P3710N9966k904R300L4183j0503
8902A05853l7406n8101L7371L269j3471j4132j8275n0109n9182P1085L3250m8077
8890d7925L8079j2108o501j1203M0152M3700M0393L526L4581p3349m6644p885
$$ plain form
8976 57632 34827 4873 -37373 -110317 -94776 -39056 56242 34799 -867 48367 38932 15007
8964 15007 33483 18152 7579 -13270 -17539 30378 42094 -19415 -61687 -97284 -108152 -60615
8952 -60615 -58356 -61655 -21663 -68038 -76769 -73511 -36497 -27301 -19631 4059 -21629 -19648 53001
8939 53001 136801 97657 38354 58321 35136 -25759 -15654 -32339 -38656 -50574 -114225 -104484
8927 -104484 -40416 20901 86793 104163 98563 64567 22605 73734 47584 328 -5982 18012
8915 18012 3434 -50302 -86782 -77804 -3870 -6340 -57899 15811 75777 72873 82173 116356 105853
8902 105853 68447 10346 47717 50986 37515 23383 5108 -45001 -104183 -33098 152 -47925
8890 -47925 -9846 -21954 -28455 -39658 494 44194 84587 88113 122694 49345 2701 -5184
8878e184n165j3227P428J1915K6151K9422j808m0695n965J3175m951L9503J9908
8865G0507L9750m8138l9076J5450M8842q455K6792j0833j1675P494l1456p17K606
8852F1091L089m8151j67m2091p847R3309O1399J3235k6750m9508m8765k0604k2548
8839c4308J4082l115M1166L4671m756o23j928J8238l4441o565j8957o374M840
8826A930J718l6371K505J2139j0317R7653N5210o7558m8461J7240M2739K5640
8814I4067o4059n7478j892j4628l110O623j6531J2889L7839O3935j8647j8905
8802B0103J6160J9127J9248J5117m4919j3842l2945J5711J2535K2743l7805J9944
8790C1177l095N0394P2976p969o1218Q772J6020l4210m0091O2784q129K1612l2815
$$ plain form
8878 -5184 -10349 -23576 -16148 -4233 21918 51340 49532 8837 2872 16047 11096 50599 70507
8865 70507 110257 62119 23043 38493 87335 78880 105672 94839 83164 90658 59202 58485 61091
8852 61091 64180 16029 15862 -26229 -34076 59233 120632 133867 107117 57609 8844 -11760 -34308
8839 -34308 -20226 -23341 17825 52496 47740 47117 45189 63427 28986 22421 3464 -2910 1930
8826 1930 3648 -32723 -30218 -18079 -28396 69257 124467 56909 8448 25688 68427 94067
8814 94067 30008 -27470 -29362 -43990 -47100 -40477 -57008 -44119 -6280 57655 39008 20103
8802 20103 36263 55390 74638 89755 44836 30994 -1951 13760 26295 49038 11233 31177
8790 31177 28082 78476 151452 143483 82265 91037 107057 72847 32756 95540 87411 109023 76208
8777G6208k7984m4993j0542l3840J9236M8010L1440m2495n007m0808k2782Q977
8765d4580l008j0382N8291O7446j7298l6523k0128n6252k6140L5006R2251N4331
8753I3014Q767J0836k162J5711O648j4440J025J3157O059P746j2272o3580l668
8740F6841k6229l3248K8885p203M6086J4677N231j1429n2124k8233r059r052k0839
8727c5696L9710K2575j7509j3770q980j7346N0709K3444L260n0174p305m8308
8715e9390K7475k0809l7239j5274P1243L1282M1014J0618k101o4648m3334N0199
8703a0964N4302j9772m1706O1717N8993K7980l4824K281j8232m3469J9603k3068
8691C2841l0527P250N12j2204q900J5323j9344l1383L0833K5219K2609J1252Q201
$$ plain form
8777 76208 48224 3231 -7311 -41151 -21915 26095 57535 15040 10033 -30775 -53557 -44580
8765 -44580 -47588 -57970 321 67767 50469 13946 -6182 -62434 -88574 -53568 38683 93014
8753 93014 101781 112617 110455 126166 132814 118374 119399 132556 138615 146361 134089 70509 66841
8740 66841 40612 7364 36249 29046 75132 89809 95040 83611 31487 3254 -5805 -14857 -35696
8727 -35696 4014 26589 9080 -4690 -13670 -31016 19693 43137 46397 -3777 -11082 -59390
8715 -59390 -31915 -52724 -89963 -105237 -33994 -2712 38302 48920 46819 -17829 -61163 -10964
8703 -10964 43338 23566 -18140 43577 102570 130550 95726 98007 79775 36306 55909 32841
8691 32841 2314 9564 10076 -2128 -11028 4295 -15049 -46432 -15599 9620 32229 43481 51682
8678E1682k7365q5617N1774J0325l6083n87K3075J3682K2805O2989n348k3941
8666E7391k1631l3408L1787R942k586J4928k6738j156j1867k0253O9490P52j0387
8653E6264n8369j754K1717k3915O7771j4055o9660j0762l2147M416J8589P075
8641c4830J3033N0941L5163L4410j9245j7729J1980j4524l6454j5831M0805Q2199
8629A29918M7574K8284n0935l2490n019j05446n3223L8378L6161K8019L2936k3757
8617G0400o7925n9053k7960N8161J9622Q658k76k2138O8846L3702J5848Q9869
8605A87754L9602m1842j13536l005k612l573O765Q847L4999j4798j139j9102j0120
8592F8240K1198J2272M1655O7011j9942q6554l6734k0654q625p152j6949o411
$$ plain form
8678 51682 24317 -61300 -9526 799 -35284 -35871 -12796 886 23691 86680 81332 57391
8666 57391 35760 2352 34139 44081 41495 56423 29685 28529 16662 -3591 65899 66651 56264
8653 56264 -2105 -3859 17858 -6057 61714 47659 -22001 -32763 -64910 -60494 -41905 -34830
8641 -34830 -21797 29144 64307 98717 79472 61743 73723 59199 22745 6914 47719 129918
8629 129918 177492 205776 154841 122351 117332 11886 -41337 -2959 33202 61221 94157 70400
8617 70400 2475 -56578 -84538 -26377 -6755 1903 1627 -20511 48335 82037 97885 187754
8605 187754 227356 185514 71978 68973 66361 62788 69553 78400 113399 98601 97462 78360 68240
8592 68240 89438 101710 143365 210376 190434 103880 67146 46492 37867 30715 13766 7355
8580G355j6080K9849J8623K7715N308j0568L815j6381l353K7566P539l2134q101
8567D1153M4885N4180k5470k2904j1957r978k4905k2607k1540M0567J7688J8326
8555G7438l2428l8412J4515n984m3450n8547L5590L431L0032K4838J2210n282
8543A3951K6921K2155P5549P297J7655p8644o313k972m4346k0066P117L2835J1418
8530F2557l811O48p950M987R495M6720N976o1267J783o472j490K1356O2087j0877
8516A23742j0449l4943k0092k9850n4875K9791N1932l3289j1677Q677K7284K6502
8504G2753J4259K0442j9023k5867j8225q375k607k1286l5630L1694n799r049P972
8491A259l390K4691L7879j1694L1316k0968m4856l5985K2637M9035m2911M3392
$$ plain form
8580 7355 -8725 21124 39747 67462 72770 62202 66017 49636 46283 73849 81388 49254 41153
8567 41153 86038 140218 114748 91844 79887 69909 45004 22397 857 41424 59112 77438
8555 77438 45010 6598 21113 15129 -28321 -86868 -51278 -47847 -17815 7023 19233 13951
8543 13951 40872 63027 138576 145873 163528 84884 78571 75599 31253 11187 18304 51139 62557
8530 62557 58746 59394 51444 56431 65926 112646 118622 57355 59138 52666 51176 72532 134619 123742
8516 123742 113293 78350 58258 28408 -26467 3324 55256 21967 10290 18967 46251 72753
8504 72753 87012 107454 88431 62564 44339 35964 33357 12071 -23559 8135 2336 -6713 1259
8491 1259 -2131 22560 60439 48745 80061 59093 14237 -21748 889 49924 7013 50405
8479E0405k7717l8221m2L9102P2330O4175K7264k3581j5096n4782o3701k5741
8467D395N7625m3945n749K1642K3877N1216K5183l6040P7P2980J5821j337r2612
8454I3133q6916m50K7407K1854J14803K5615j7982l325j0737K8583J5841k7936
8442A79890m248r282m4476q0628L807K0864K6009L9602j101j2350N2402k5220
8430A45269l7231m0121M255M2444N2783l976m6199l6963m3211o2642K0224O4322
8418E8954O1168K6802j0682K909j9865l7829L109l4046l1789L4807k6540k2653
8406D345p7684m4432k6449Q5926P2401J5080K1886p7086m685p223J7411L5979
8394A5469J1519k9412K1776k0645p6074k3179M6770n541m637M220K1202L4765
$$ plain form
8479 50405 22688 -15533 -15575 23527 95857 160032 187296 163715 148619 93837 30136 4395
8467 4395 62020 18075 12326 33968 57845 109061 134244 98204 98281 171261 187082 185745 93133
8454 93133 6217 5767 33174 55028 169831 195446 177464 174139 163402 191985 207826 179890
8442 179890 175642 166360 121884 41256 45063 65927 91936 131538 130437 118087 170489 145269
8430 145269 108038 67917 72172 114616 167399 163423 117224 80261 37050 -25592 -5368 58954
8418 58954 120122 146924 136242 139151 119286 81457 84566 50520 18731 53538 26998 4345
8406 4345 -73339 -117771 -144220 -58294 14107 29187 51073 -26013 -30698 -37921 -20510 15469
8394 15469 26988 -2424 19352 -1293 -77367 -100546 -53776 -59317 -63954 -59734 -38532 -3767
8382c767M2792J4119n4899j8878J7322l1627m3266P24J4370K6149j040J0723L62
8369b6916O6125N4631k1761j3461j3472K4983m009k5680k2636k308l6366m6740
8357f7610l1631M0020N6351L048k8201L1399n3017K456N29q993M232l4363o253
8344i2033N9840N7037M2007N2704q657k5124j9182l0887q9975l3070N2920o800
8332d1220m4951j891j3741J0090M0361M9652O6204N7523r5911q9356N3190R1262
8320H1212J075j3933p542k0480K6391j7220L322o4737L2074K0543r814K2327o385
8307D6833m8851m0592J2649K2591K6644n6073n4594J3810J0436Q6863q506j7792
8295f582J7401N356J7535M3770j6028n5430J521J0969l0783N6400O5482M1314
$$ plain form
8382 -3767 39025 53144 -1755 -20633 -3311 -34938 -78204 -77480 -63110 -36961 -38001 -27278 -26916
8369 -26916 39209 93840 72079 58618 45146 70129 66120 40440 17804 15496 -20870 -67610
8357 -67610 -99241 -59221 -2870 178 -28023 3376 -49641 -47185 -46656 -55649 -51417 -85780 -92033
8344 -92033 -32193 24844 66851 119555 110898 85774 66592 35705 -54270 -87340 -34420 -41220
8332 -41220 -86171 -88062 -101803 -91713 -51352 -1700 64504 122027 26116 -63240 -10050 81212
8320 81212 82287 68354 60812 40332 66723 49503 52825 -11912 20162 40705 30891 53218 46833
8307 46833 -2018 -42610 -29961 -7370 19274 -36799 -91393 -77583 -67147 19716 11210 -6582
8295 -6582 10819 16175 33710 77480 61452 6022 7543 18512 -12271 44129 109611 150925
8283A50925o5389j7943M403r265o6809k9125q208J9567Q094K7197P517k3303J8063
8270A5724k993J126l3624K8324N7501k4320K1996o7758r3945j0148P1535K6941
8258i641n366M405j4139k3031N504o2415j3166P5946P6946M9059j575j17905k0220
8245e5598K3536j3225K4376P939O249K4509n6249l4882O4692K7606l2729k2435
8233c6211M055J9619P1119N5706n450m4996j9496o1874n1570M7509K3677j5354
8221a3266O2207L5461n253n0214k9677k2349j4135Q715l5137M244N8797j2124
8209a2731j9545j4035j6363m8872N9122M3924r223K2197j6690L1134M1273N4577
8197A14768j05465o5488r664j4990M046P9519N8911l4861j7859q572J1301n354
$$ plain form
8283 150925 85536 67593 71996 62731 -4078 -33203 -41411 -21844 -13750 13447 20964 -2339 15724
8270 15724 12731 13857 -19767 8557 66058 41738 63734 -4024 -97969 -108117 -36582 -9641
8258 -9641 -15007 -10602 -24741 -47772 -42268 -104683 -117849 -41903 35043 84102 82527 -35378 -55598
8245 -55598 -32062 -45287 -20911 -12972 -6723 17786 -38463 -73345 -8653 18953 -13776 -36211
8233 -36211 -32156 -12537 58582 114288 108838 63842 44346 -17528 -69098 -21589 2088 -13266
8221 -13266 48941 84402 79149 28935 -742 -23091 -37226 -28511 -63648 -59404 -607 -12731
8209 -12731 -32276 -46311 -62674 -111546 -52424 -8500 -17723 4474 -12216 18918 60191 114768
8197 114768 9303 -56185 -65849 -80839 -76793 2726 61637 26776 8917 345 11646 6292
8185F292q335K2448K8123K512m4637m200R073L3216R744n3330l0702K5382p795
8172a2209P0888N1039k7962n6503k7435J1592j5760k450N2122j6421L416k6076
8160D241m5484K3124j506l1036o3226J8371P6157O4501k9181p2407l2008Q920
8148g9534K161Q909l7500n400O5356K4773K552J2036n572l3790l7785j6726k773
8135a03293M5482L5963R413J2731Q33K2834L1286N2360k8566o5294p1770L7164
8123b0857R4836l4245j8925K1142K615l4350k5552M7874Q4625l8249m0616o0834
8111b2536J710L4464K0996k541R544j4059L2483l7690k3038r695N2498K597K6348
8098G1081j3336l6221p0156R426R1367l6274n0119N4150J06828K6708r9429m9824
$$ plain form
8185 6292 -2043 20405 48528 51040 6403 2203 11276 44492 54236 906 -29796 -4414 -12209
8172 -12209 58679 109718 81756 25253 -2182 9410 -6350 -8800 43322 26901 30317 4241
8160 4241 -41243 -18119 -19625 -50661 -113887 -95516 -19359 45142 15961 -56446 -88454 -79534
8148 -79534 -77373 -68464 -105964 -111364 -46008 -21235 -18683 -6647 -12219 -46009 -83794 -100520 -103293
8135 -103293 -57811 -21848 -12435 296 1129 23963 55249 107609 79043 13749 -58021 -20857
8123 -20857 73979 39734 20809 41951 44566 10216 -15336 32538 117163 78914 38298 -22536
8111 -22536 -20826 13638 34634 32093 41637 27578 60061 22371 -667 -10362 42136 44733 71081
8098 71081 57745 21524 -48632 -39206 52161 15887 -34232 19918 126746 153454 54025 4201
8086D201k0880j8108N7674L0710j9118K5285K286k2065k8121k728O2448J8558
8074I0142n0107k031Q4947J3267o6027k5085K4832K0302l4595n5846k5665N3131
8062B7265r36l4570k018m2852j9408r166K6591J1132L8943O3193J193l117R710
8049F5960j7148j8466K4809M883N030J237L0249k797o0147N1761P2642L2319k2414
8036A67918J1167M8013N825p4704l4260l530L2150n6084j42p490n5080j4063j8828
8023H92L6376O3180q1386k3160J0802L3222N7281L0336J7984k2912j557n312k4448
8010I1298m609l4949k7728L1976O2687K9537p597N1504k6553m3948N9347M50k950
7997A78465l179L2059P562o995L1153P138K8461k6119l9907J2889k9625n0414
$$ plain form
8086 4201 -16679 -34787 22887 53597 34479 59764 62050 39985 11864 9136 71584 90142
8074 90142 40035 38004 122951 136218 70191 45106 69938 90240 55645 -201 -25866 27265
8062 27265 26329 -8241 -10259 -53111 -72519 -81685 -55094 -43962 -5019 58174 59367 56250 65960
8049 65960 48812 30346 55155 60038 65068 66305 96554 93757 33610 85371 158013 190332 167918
8036 167918 179085 227098 232923 158219 123959 120429 152579 96495 96353 88863 33783 19720 892
8023 892 37268 100448 19062 -4098 6704 39926 97207 127543 145527 122615 121058 115746 91298
8010 91298 86689 51740 24012 55988 118675 148212 140615 192119 165566 121618 180965 181415 178465
7997 178465 175286 207345 214907 207912 239065 246203 274664 248545 208638 221527 191902 141488
7985A41488O8912L6886k0160p38j6937r536m3532L0805J6037J4153n7217m9807
7973A10354l1772j1628K7380j9475k7858J8039m0331K3310O0034Q83k2711K4270
7961A10495J5164K3541K3806j8679k4759L3416L8991N974l0294n5053j5064k8221
7949G9317k0794N8814N5463K4535k5325p6789j6795j0766J5235M8715M2453p260
7937A66803j638j4494k3090l989K8745j5530l586p6211j8288J6394M2256j946
7925I5426p7957l4640J2348J653L6504k2383K4580L9011O0815l2548j6959l3275
7913E2575p2965J5678q305m7949J0273L8596K1999M4363N600j3199J6442J7090
7901H0198K581j3284P231j1001j06k2413K4791O4407J6600m5557j2182l2558m2259
$$ plain form
7985 141488 210400 247286 227126 226388 209451 199915 156383 187188 203225 217378 160161 110354
7973 110354 78582 66954 94334 74859 47001 65040 24709 48019 108053 108936 86225 110495
7961 110495 125659 149200 173006 154327 129568 162984 201975 207949 177655 122602 107538 79317
7949 79317 58523 117337 172800 197335 172010 95221 78426 67660 82895 131610 174063 166803
7937 166803 165165 150671 127581 123592 152337 136807 133221 57010 38722 55116 97372 95426
7925 95426 17469 -17171 -4823 -3170 33334 10951 35531 74542 135357 102809 85850 52575
7913 52575 -20390 -4712 -13017 -60966 -50693 -12097 9902 54265 59865 46666 63108 80198
7901 80198 82779 69495 76726 65725 65619 43206 67997 132404 149004 103447 91265 58707 16448
7888A6448j5604N8093J8577k3040j0981O7407L5266l6400k6275N721L628k2340
7876G0500j2820J8802j5236K189L1769N0864P404M042m2631p8351J1637L035K2528
7863G3732K033j2470J0356r603p5998K2549o4060L7648K1867K87k0152L1715L7808
7850E5712q5190k0408K9916N5535J6739K6861r791j3095L6594Q0963n4130n5999
7838F3707L390j8112J9710K2009O717j4470j555r354N2943l79l7371K2808L2795
7825A42838n026j1607K493l5608K5905M6038j7811J5808K4983j9122m7670J8173
7813A39394L6268o3293K657J4881k4634k7091L0198Q569n507K5730K7275l6610
7801A27837R575K8968o944J2218j3087n5637j7447l427J1251J9608NJ525o803
$$ plain form
7888 16448 844 58937 77514 54474 43493 110900 146166 109766 83491 89212 92840 70500
7876 70500 57680 76482 61246 63435 95204 146068 153472 157514 114883 36532 48169 51204 73732
7863 73732 75765 63295 73651 64048 -11950 10599 -53461 -15813 6054 6341 -13811 17904 55712
7850 55712 -29478 -49886 -19970 35565 52304 79165 69374 56279 92873 173836 119706 63707
7838 63707 67097 48985 68695 90704 97421 82951 81396 72042 124985 124606 87235 110043 142838
7825 142838 137812 126205 128698 93090 118995 165033 147222 163030 188013 168891 121221 139394
7813 139394 175662 112369 115026 129907 105273 78182 108380 116949 111442 137172 164447 127837
7801 127837 137412 166380 159436 171654 158567 102930 85483 82056 93307 112915 112920 114445 107642
7788A07642M3584J2275O8R280m3980l3029m8303k543Q269M4843K8168J8700K5789
7775A70763O809p241n1706j5689l5317L896M4005K5905k2319J7344k1438J2991
7763A28003o0116m0611j9619J2592L588n916k9280j8278Q674j77P786K3201j7218
7750g371n1744M7773P0373l3203r196K0351k655k0954k6302J4334j4634J7868
7738D640J3125J4129j4551L1295n6000j596K824J4377k0781J7813J7265K9689
7726E2229J5154j7297j5888j9402n4669l2465n270N7257J7589n859L620n7753
7714f2754j212K1958L8172J1164R967K65L8234k619L5362K7917j384k7074l1408
7701E6588p3648m6364k0705L8745K2018m896n5310M0233O7644O828l8674j4289
$$ plain form
7788 107642 151226 163501 163569 172849 128869 95840 47537 44994 53263 98106 126274 144974 170763
7775 170763 177572 170331 118625 102936 67619 71515 115520 141425 119106 136450 115012 128003
7763 128003 67887 27276 7657 20249 23837 17921 -11359 -29637 -20963 -21140 -13354 9847 -7371
7750 -7371 -59115 -11342 59031 25828 16632 36983 34328 13374 -12928 1406 -13228 4640
7738 4640 17765 31894 17343 48638 -7362 -8958 -6134 8243 -12538 5275 22540 52229
7726 52229 67383 50086 34198 14796 -39873 -72338 -77608 -20351 -2762 -8621 -5001 -62754
7714 -62754 -63966 -42008 -3836 7328 17295 17560 55794 53175 88537 116454 115070 87996 56588
7701 56588 -17060 -63424 -84129 -45384 -23366 -28262 -83572 -43339 24305 31133 -7541 -21830
7689b1830j5565N031J931j9535l645j993Q378O9009J5297l0938l4193m0439k20
7676f8712J7611l6557j4822M6076K7198N1493P1889j4804m8540j5560L3828L8860
7664H7960l1012j9801l8681p768J1423M2863R551l6460l7041K0416K0466M3062
7652F4978m1296m3271l8386l6863J99P5621O9520l6896n5066K8622m561l0230
7640d7629L2620J4566J5892k550j2829K6930k2953k1212j7263j8348L1949q519
7628b9346m2982l737J7187j342J8906P219p992M7167k6814n796N0698k6877n7485
7615f1194P7501O127l3315m6599k3721L3293N0481l032j7222J1104K8128L8513
7603F0064O365o7191K49j1469m2849l235N091M0825K1630l2217K1562L0189r301
$$ plain form
7689 -21830 -37395 -32364 -30433 -49968 -53613 -55606 -47228 21781 37078 6140 -28053 -68492 -68712
7676 -68712 -51101 -87658 -102480 -56404 -29206 22287 94176 79372 30832 15272 49100 87960
7664 87960 56948 37147 -1534 -9302 2121 44984 54535 18075 -18966 1450 21916 64978
7652 64978 23682 -19589 -57975 -94838 -94639 -19018 50502 13606 -41460 -12838 -17399 -47629
7640 -47629 -15009 -443 15449 12899 70 27000 4047 -17165 -34428 -52776 -20827 -29346
7628 -29346 -72328 -76065 -58878 -60220 -41314 -34095 -42087 5080 -21734 -27530 23168 -3709 -61194
7615 -61194 16307 22434 -10881 -57480 -81201 -47908 2573 -459 -17681 -6577 21551 60064
7603 60064 66429 -762 -513 -11982 -54831 -58066 -52975 -12150 9480 -22737 -1175 29014 19713
7590A9713P6821m3504q672K6270k3660n6746k2802K8343m1786m1357k7763m9115
7578a64258L5430Q8250J8572K7570j5546O361K5301m1403l9165O0809q366m3395
7566d9840j0468R3801J8501l8675k0292K2936N2962L21o3964k9819l5928J3778
7554d6687n947N841J898o28R497j8055j441M3854J4460J6409p350N340l5235M8827
7540C0783n134K4870M4073p1957m3971m3985k4655J074j1212J7654L7675K6305
7528a8480J9455n7662k2382K4768P258L7481L0352p158p124j6213r161m1223l0847
7515i0936l5481L9026J8864n653j0752Q746K0464R814j407Q562O3695M5089j8836
7502E1195j3830k1674o921J6074o7743k5634L098K7733Q4019K3698n4974k5953
$$ plain form
7590 19713 96534 53030 44358 70628 46968 -9778 -32580 -4237 -46023 -87380 -115143 -164258
7578 -164258 -128828 -40578 -22006 5564 -9982 -3621 21680 -19723 -58888 1921 -6445 -49840
7566 -49840 -60308 33493 51994 13319 -6973 15963 68925 69246 5282 -24537 -60465 -46687
7554 -46687 -52634 -46793 -44895 -45523 -36026 -54081 -55522 -11668 2792 19201 11851 17191 -18044 30783
7540 30783 25649 50519 94592 22635 -21336 -65321 -89976 -88902 -100114 -82460 -44785 -18480
7528 -18480 975 -56687 -79069 -54301 -47043 -9562 20790 13632 6508 -9705 -18866 -60089 -90936
7515 -90936 -126417 -87391 -68527 -74180 -84932 -76186 -55722 -45908 -47315 -38753 24942 70031 51195
7502 51195 37365 15691 8770 24844 -42899 -68533 -65435 -37702 46317 70015 15041 -10912
7490a0912K3119L689J1984k1688m7466l3304J5806P0811K1217j2265L4202J7921
7478G3114K3724L6290m9064p3771oK299l0138k0966M4998J1082k6434n4589k5017
7465h8478J164Q127l822P7840K3731k8345k6041K9441J3834J3840K6054q940l2894
7452E511K863L4229k1643m9449P700j8351L6788k6957j4546M5026K718k7464l0252
7439e3827m0630j9025L296M2907J0398K6681L5267l4773m1426k9783K8509M4823
7427b7583M0319J6918m8252k5745O7931Q4011M6764k1700j1756n0600P66J3593
7415H4666j4149l5701j8891J4785J3090m032k0853l5756n687N5502j0930M9116
7403G1160N975n6680J5712K1300n6205p4308n0654L0427O146O5203O5233l0025
$$ plain form
7490 -10912 12207 15896 27880 6192 -41274 -74578 -58772 12039 33256 20991 55193 73114
7478 73114 96838 133128 84064 10293 10287 12586 -17552 -38518 6480 17562 -8872 -63461 -88478
7465 -88478 -87314 -79187 -83009 -5169 18562 -9783 -35824 -6383 7451 21291 47345 38405 5511
7452 5511 8374 42603 20960 -28489 -20789 -39140 -2352 -29309 -43855 1171 3889 -23575 -53827
7439 -53827 -94457 -113482 -110186 -67279 -56881 -30200 5067 -29706 -71132 -100915 -72406 -27583
7427 -27583 12736 29654 -18598 -44343 23588 107599 154363 132663 120907 70307 71073 84666
7415 84666 70517 34816 15925 30710 43800 39768 18915 -16841 -22528 32974 22044 71160
7403 71160 77135 20455 36167 57467 1262 -73046 -123700 -93273 -87127 -21924 43309 13284
7391A3284m925R540l7947L8572L4844k0015l214Q541k90J8247j8364K2395L270
7378F3938L7920J1547r920k5766k4890j1599J4798K4680J676k6565M6831N7757
7366A60407m2624l2120M316l0552n986L7732J6290j5013l6902n5882k8166j9821
7354d8321j929q40r591n9921K0316P0705N0257L145L0460r100m3442o361p339
7341a1961n0461L9748L7418J712N9577J2536n3033k4006n3265m9429M3795K1132
7329b6237K3717J3755j7842l3374m4134l18M9005q77j3693J6200N004l9645o5426
7316a33865k0219K9411K9883m373K0314l3896k517M5925O3246k6870N8937P072
7304C3048j6440l4133l631q035p973l4678Q481J7761L647Q081o2612m4465L7273
$$ plain form
7391 13284 8359 17899 -20048 18524 53368 33353 30139 38680 38390 56637 38273 60668 63938
7378 63938 101858 113405 103485 77719 52829 41230 56028 80708 82384 55819 102650 160407
7366 160407 117783 85663 89979 59427 53441 91173 107463 92450 55548 -334 -28500 -48321
7354 -48321 -50250 -51090 -60681 -120602 -100286 -29581 20676 23821 54281 45181 1739 -4622 -11961
7341 -11961 -62422 -22674 14744 16456 76033 88569 35536 11530 -41735 -91164 -47369 -26237
7329 -26237 -2520 11235 -6607 -39981 -84115 -84433 -35428 -36305 -49998 -33798 -28794 -68439 -133865
7316 -133865 -154084 -124673 -94790 -99163 -78849 -112745 -115262 -69337 -6091 -32961 25976 33048
7304 33048 16608 -17525 -21156 -29191 -37164 -71842 -63361 -45600 -41953 -33872 -96484 -140949 -103676
7291a03676N86L3434L9978l4150p7847M5943Q6932J9618j5638L3170J9951j4577
7279C3724m1780k3798M9875L1728l8254m9641n6232P849N0547Q2847R829L2501
7267H9195q120l6403m393l7187J5280Q415l0549j1833j4768J3684L0894J8491
7255C2706p0847p4763L6993P1474k2006k2010J7651j3741O179J5419N631M3908
7243B6594j3991J2295J4804J3179k5812M53N262L8515L4087K7602p4032p7981
7231a9025L3677P757p942N1729m1873j0282K7348K476n0579k7590N5538k1837
7219f03m467R832j6144p0126L230j2428Q5691L2637k0171j0482n469p0481K3222
7206e5759J2616q5854K2164P0402K307k6186M4474M4170K6207l4331J3150j2660
$$ plain form
7291 -103676 -103090 -69656 -29678 -63828 -141675 -95732 -8800 10818 -4820 28350 48301 33724
7279 33724 -8056 -31854 18021 49749 11495 -38146 -94378 -86529 -35982 46865 56694 89195
7267 89195 81075 44672 40279 3092 18372 26787 -3762 -15595 -30363 -16679 14215 32706
7255 32706 -38141 -112904 -75911 -4437 -26443 -48453 -30802 -44543 -38364 -22945 -17314 26594
7243 26594 12603 24898 39702 52881 27069 27522 32784 71299 105386 132988 58956 -19025
7231 -19025 14652 22409 14467 66196 24323 14041 41389 43865 -6714 -34304 21234 -603
7219 -603 -5070 4762 -11382 -81508 -78278 -90706 -5015 27622 7451 -3031 -8500 -78981 -55759
7206 -55759 -43143 -128997 -106833 -36431 -34124 -60310 -15836 28334 54541 20210 33360 20700
7194B0700k7344k9178r410L4210m9008R038o937M1473Q5235k4463M745l5825q9850
7181g6614k0238J18872R892m7929l114l3558m3908O440J014Q6938O8478j8549
7169D7724n0875N7448J4957L4356J2302L0407K3687l3671k6341k2461l1869n9892
7157d228n8579R544Q9281M4262j2312k9953M299j6085l0029M832M7458K192l1295
7144A9387k2730K0529j3973L8239J1762p531j3237L7370J0786j5923l8424r01
7132B5354k7891J9201L0210l049Q673J8801L68l9029j0229O740O8941k4011q5748
7119a1669m1530j1824J7839M5874N999L0409o623j6227j6312L3929M8232M2806
7107A20903r3512m9241j7208L5852L3684K4771k5411n7618J1836N2143M267k6094
$$ plain form
7194 20700 -6644 -35822 -45232 -11022 -60030 -50992 -57929 -16456 68779 44316 49061 13236 -76614
7181 -76614 -96852 22020 31912 -16017 -19131 -52689 -96597 -90157 -89143 -2205 66273 47724
7169 47724 -3151 54297 69254 103610 115912 146319 170006 136335 109994 87533 55664 -4228
7157 -4228 -62807 -53263 36018 80280 67968 38015 42314 26229 -3800 1032 48490 50682 19387
7144 19387 -3343 17186 3213 41452 53214 45683 32446 69816 80602 64679 26255 25354
7132 25354 -2537 16664 46874 43825 52498 71299 71667 32638 22409 29149 98090 74079 -11669
7119 -11669 -53199 -65023 -47184 -1310 4689 35098 28475 12248 -4064 29865 78097 120903
7107 120903 27391 -21850 -39058 -3206 30478 55249 29838 -27780 -15944 36199 40466 14372
7095A4372k005l0904k6907N4605P9069j8423k3322k4881k045o168m8904k3706
7083e9219J6267N0187K2855j2359n1494K465M1385l403m3052K4407N7160N569
7071E0768o7213K8039P9372j4368o9223m6739M2707P1698J5050k0204K0971j5819
7059G5039l2251m3689o8510k4748O5085Q838L4450k5845k6408j1384J8657M1845
7047A1079N2976J1878J0859L2311o5373l9295K909N658K1875L5459k9120r959
7035D1257J7298q935p508m3176l0071O771K8430J8422j2103P648R2058J8225r6498
7022C1818n7459L732M942O598O2885N1345k132j3823m8302k5921j796n5645J1681
7009c2077M833M4730J8494k2042L8032j5185n8439k2450Q33J9445K5129O586l3745
$$ plain form
7095 14372 12367 -18537 -45444 9161 88230 69807 46485 21604 19559 13391 -35513 -59219
7083 -59219 -42952 7235 30090 17731 -33763 -31298 10087 6684 -36368 -11961 45199 50768
7071 50768 -16445 11594 90966 76598 7375 -39364 3343 75041 90091 69887 90858 75039
7059 75039 42788 -901 -69411 -94159 -29074 -20236 14214 -11631 -38039 -49423 -30766 11079
7047 11079 64055 75933 86792 119103 53730 14435 17344 23002 44877 80336 51216 41257
7035 41257 58555 49620 42112 -1064 -31135 -24364 4066 22488 10385 18033 110091 128316 31818
7022 31818 -25641 -21909 -16967 -10369 52516 103861 101729 87906 39604 13683 11887 -43758 -32077
7009 -32077 -27244 17486 35980 13938 51970 36785 -21654 -44104 -43271 -23826 1303 7889 -25856
6996b5856n35K4285k3553J1645k0587J5206K0984L8541n496O880J4552Q736j5517
6983D9285m9953N4366M0841r979j8625k699j33m8782l0476j2269r10j4129J9747
6970b3716n965q873q918m946N6761N265l7355j466O604j353m9237j0032M2325
6957d0906J8055J1257Q651k245j9970l2211k3144R988L665J3446k6793J5560R446
6944e5201R793m504N0283K5667k2300l1485l8679K1556J6887m8569J3157n802
6932f9197N1969K7102O0858K5053k5582m5785J4166o9901p692P4110k818j7678
6920A4605j5539l4008l456M878L6922j7669q928N9235N6504K0210K9454p282n50
6907A34376l9759p5268p459j7959j2441K6011R615K0868J8397J5904K8176l1549
$$ plain form
6996 -25856 -26391 -2106 -25659 -14014 -34601 -19395 1589 40130 34634 41514 56066 64802 49285
6983 49285 -668 53698 94539 84560 65935 63236 63103 14321 -16155 -28424 -29334 -43463 -23716
6970 -23716 -29681 -38554 -47472 -52418 4343 9608 -27747 -29213 -22609 -23962 -73199 -83231 -40906
6957 -40906 -22851 -11594 -2943 -5188 -25158 -57369 -80513 -70525 -66860 -53414 -80207 -64647 -55201
6944 -55201 -45408 -49912 371 26038 3738 -27747 -66426 -44870 -27983 -76552 -63395 -69197
6932 -69197 -17228 9874 70732 95785 70203 24418 38584 -31317 -39009 35101 32283 14605
6920 14605 -934 -34942 -38398 -33520 3402 -14267 -23195 36040 92544 112754 142208 134926 134376
6907 134376 94617 19349 11890 -6069 -18510 7501 17116 37984 56381 72285 100461 68912
6895F8912m8757j4400l8714m3943K4814R1619L1497m2526l8697K8185o71j4340
6883B979K3915n586M319k2793L132j0940l4799k2704O7950j3k9645m384J4008
6870a4561K8797p96k8094m970l1604j4038M3144k70M2890K5821j4355j4905p8222
6857f1163R346J0124M4836l2143k5667m8184M9167L3396N0800M0492m0115o0489
6845b9600k7155K6467R3143J8728P527k0345p7959J5734P902o4447p933l6795
6833i4733j796j8693N2428P0916L6398l9548K0372j0602p5540l6921L4312M6792
6821a6615j4613j7296m53k353J032j2520L4080L5695k5100n0587j5074N1722j7073
6808d9155M5855L5129k084k486l0166K524P7183M5149m2300j2247k2507n9584
$$ plain form
6895 68912 20155 5755 -32959 -76902 -52088 39531 71028 28502 -10195 17990 17319 2979
6883 2979 26894 21308 25627 2834 5966 -4974 -39773 -62477 5473 5460 -24185 -28569 -14561
6870 -14561 14236 13440 -14654 -19624 -51228 -65266 -22122 -22392 20498 46319 31964 17059 -61163
6857 -61163 -51817 -41693 3143 -29000 -54667 -102851 -53684 -20288 30512 71004 30889 -29600
6845 -29600 -56755 -30288 62855 81583 89110 68765 -9194 6540 14442 -50005 -57938 -94733
6833 -94733 -96529 -115222 -62794 8122 44520 4972 25344 14742 -60798 -97719 -63407 -16615
6821 -16615 -31228 -48524 -48977 -51330 -50298 -62818 -28738 6957 -18143 -68730 -83804 -32082 -49155
6808 -49155 -3300 31829 29745 27259 -2907 -383 76800 121949 79649 67402 44895 -14689
6796a4689l0599l2987m0137N7776J19635L5479n0279o1173j1040J9298O27P3859
6784F5770m2386m8381n1549j0226L3952M4490N243M150N041Q651j0007Q5601J49
6771I0498p1208n3980n4187j7775L2871k8591Q3763K4038K7654M7691q224L5843
6759A08393k6692m1769J9983K3722o6447p195j6865k6143K5211N9313L8782o2376
6747B7917m2259P0042j0460k6051j3000n04l8550K6654J7157q314l6785j6864
6735e1017L2889J5004m2972j077L0682M8643J6475l3846m1559m436m6863R228
6723f8849J1569L3201Q81J6716L2284j4542p325k737o021J3460l1757p408M7047
6710A6519l2344k2483m2447l16N148K1914N7018L0321K4080J3573m5048M602L3162
$$ plain form
6796 -14689 -45288 -78275 -118412 -60636 58999 94478 44199 -16974 -28014 -8716 -8089 65770
6784 65770 23384 -24997 -76546 -86772 -52820 -8330 -3087 1063 6104 14755 4748 90349 90498
6771 90498 19290 -34690 -88877 -106652 -73781 -102372 -18609 5429 33083 80774 72550 108393
6759 108393 81701 39932 59915 83637 17190 9995 -6870 -33013 -7802 51511 90293 27917
6747 27917 -14342 55700 45240 19189 6189 5685 -32865 -6211 10946 2632 -34153 -51017
6735 -51017 -18128 -3124 -46096 -47173 -16491 32152 48627 14781 -26778 -31214 -78077 -68849
6723 -68849 -57280 -24079 -23198 -6482 25802 11260 3935 1198 -4823 8637 -23120 -30528 16519
6710 16519 -15825 -38308 -80755 -81071 -75923 -54009 3009 33330 57410 70983 25935 30537 63699
6697F3699N455p3776k7042J7643j2164K6881M0010j5999m0108o2565j5621N8818
6685c4769L959N0560q890k4906L664M2125K8488o38n897J4463L126k8176l2405
6672A0704l6952p8631o5482j7853Q9087J06745Q0400l7343o1700p866J7274k8359
6660b9976r61l4081l9234j0195L9141k082j142P6558j8100n9912l8431L5804N1876
6647c0735N2665m907l9133p1880l8606J15682J8583n6262l3490l2356N2645M7265
6635b0529N5624M1568l98n4045j08277j9928Q4688O7918J9320j8219L2866J212
6623H1800l34k6975q994K2481l2348m9341Q76K3990J2332L8183q341m2406J2174
6610B3097k9783j548j7929k6638Q278l3633M5552K3094n5269m6185K1329J00644
$$ plain form
6697 63699 69154 -4622 -31664 -14021 -26185 696 40706 24707 -15401 -77966 -93587 -34769
6685 -34769 -30810 19750 10860 -14046 -10382 31743 60231 59593 53696 68159 71285 43109 10704
6672 10704 -26248 -104879 -170361 -188214 -99127 7618 88018 50675 -11025 -18891 -1617 -29976
6660 -29976 -30937 -65018 -104252 -114447 -75306 -77388 -78530 -1972 -20072 -79984 -118415 -82611 -30735
6647 -30735 21930 17023 -22110 -93990 -132596 -16914 1669 -54593 -88083 -120439 -67794 -20529
6635 -20529 35095 76663 76265 22220 -86057 -105985 -21297 46621 65941 47722 80588 81800
6623 81800 81466 54491 45497 67978 35630 -13711 -12835 11155 23487 61670 53329 10923 23097
6610 23097 -6686 -8234 -26163 -52801 -44523 -78156 -32604 -9510 -64779 -110964 -89635 11009
6598A1009p686p7730k0946O0921O7127O1594j797m370Q613p502o1277k2715l1035
6585b5794M9453M4581j2079q475l9863l2330j8827J6406J3207k2480l5476L0976
6573d0701L4544J28612J1939n0349m2925m5357l1389q839N5504o21L4314R275
6561E4007l9883j0121M3789l6742m0523k6447J1076n9079J1919L0412N164O131
6549e0297n0636N840J5252N5323K1943M1323M1236O67k3274k1236N5264J6164
6537A07569k3052m4142OP629j3082M1333Q580p6890n6670K2526K1457K5459m4026
6524b3303j2661K5728M1917J0605j6922o9163J2845N1027K6159K7094L208O408
6512H2942L8610m2121n6064k0846l1180J9487J5305m3072j7346m8400K8991M2495
$$ plain form
6598 11009 3323 -74407 -95353 -34432 32695 94289 92492 88122 96735 89233 27956 5241 -25794
6585 -25794 23659 68240 56161 47686 7823 -24507 -43334 -26928 -13721 -36201 -71677 -40701
6573 -40701 -6157 122455 134394 84045 41120 -4237 -35626 -44465 11039 10418 44732 54007
6561 54007 14124 4003 47792 11050 -29473 -55920 -44844 -103923 -92004 -61592 -56428 -50297
6549 -50297 -100933 -95093 -79841 -24518 -2575 38748 79984 80651 57377 36141 91405 107569
6537 107569 84517 40375 40381 48010 34928 76261 84841 7951 -48719 -26193 -4736 20723 -23303
6524 -23303 -35964 -10236 31681 42286 25364 -43799 -30954 20073 46232 73326 76534 82942
6512 82942 121552 79431 23367 2521 -28659 -9172 6133 -36939 -54285 -102685 -73694 -31199
6500c1199L3976o5166k1011m719O246L5039J7192L7957N5829L5021n1362m8386
6488e83J5140q926j7119k9350k8458r244J5609J1799J6837o0520M3296K4680K7803
6475I64m881J5810J1137k1253j1708M879R863n9834L4234m611O6921M2148J1706
6462I5375n2194Q571j4691r967Q110o866q432Q121N7752Q322k8893L1095l0877
6449F5426k9676k1169J2524L0971L2603k9322j4068j4407J9367m2718l7038Q427
6437a9080K9687J2790K1915q144j0333j9039P9728K2380K2425p6376m6799L993
6425A3147l1082p3102l8952O137N8752O6881O3497J9356o8904R249P5705k1119
6413G9565o6227n1000m1022L2875M7991J0390K081j9830K2145j5484q6886J7051
$$ plain form
6500 -31199 2777 -62389 -83400 -88119 -81873 -46834 -29642 8315 64144 99165 47803 -583
6488 -583 14557 5631 -11488 -40838 -69296 -78540 -62931 -51132 -34295 -94815 -51519 -26839 964
6475 964 -3917 11893 23030 1777 -9931 -5052 4811 -55023 -20789 -25400 41521 83669 95375
6462 95375 43181 51752 37061 27094 35204 28338 19906 28027 85779 94101 65208 96303 65426
6449 65426 35750 14581 27105 58076 90679 61357 47289 32882 52249 9531 -27507 -19080
6437 -19080 10607 23397 45312 37168 26835 7796 87524 109904 132329 55953 9154 13147
6425 13147 -17935 -91037 -129989 -123852 -65100 1781 65278 84634 15730 24979 100684 79565
6413 79565 13338 -37662 -78684 -45809 2182 12572 14653 -5177 16968 1484 -85402 -68351
6401f8351O2499m111J4188L1198L0927J5850j3432K42k0435k5270P2119L5220
6389A30644j7745m8113n3353K656k751n6063j1391N4220M168j1081N2544L4971
6377G8706n7241m6786j3579j7214L116n254N1146L3967r527J1673J743R066K1517
6364F1333o3275K3051J2872j0231j1803K9125j9143k3744J82m5544J2252K4469
6352a0456n7611J3215O1573N934q1287l3641L8951J03047j2890m9912j7575R127
6340c1525Q104N0516N9993K181j16505l7379L0098M3035l3445n4036J9927Q4991
6328B5955L4082l1287p6691l8583K1355K0309L1523J9013L921J0540M7969o1286
6316F820r5O6660J1866K0772J953J632m5531n2311J6489k2980n8498k3983O5224
$$ plain form
6401 -68351 -5852 -9963 4225 35423 66350 82200 68768 69010 48575 23305 95424 130644
6389 130644 112899 64786 11433 14089 11338 -44725 -56116 -1896 2272 -8809 43735 78706
6377 78706 21465 -25321 -38900 -56114 -52998 -58252 -7106 26861 17334 29007 30750 39816 61333
6364 61333 -1942 21109 33981 23750 11947 41072 21929 -1815 -1633 -47177 -34925 -10456
6352 -10456 -68067 -54852 6721 12655 -68632 -102273 -63322 39725 26835 -23077 -40652 -31525
6340 -31525 -23421 27095 87088 89269 -27236 -64615 -34517 8518 -24927 -78963 -59036 25955
6328 25955 60037 28750 -47941 -86524 -65169 -44860 -13337 5676 9597 20137 68106 6820
6316 6820 6725 73385 85251 106023 107976 109608 64077 11766 28255 5275 -53223 -77206 -11982
6303a1982L9247p104k1083j2134q478M803J5027J4722m562M7311j5067j7234o8959
6290d5493k7571M9016Q3987K7651m4818q2397n6410K193j8459J22958J02093k9201
6278H3549o827m9622j03457j5269K7339J0072J1635K6938n2861j9471L3194M857
6266d9923L2244L993o944j965n6122J552Q0836p596N544J5577l7907k1491O0828
6253A8626K7278o8515j11P2224K7519M8396k4263l1596j0097n854K0597p692n6446
6240A0066p83N915n1341K4572Q775n3944L2349N7423J0152q888l2513n203L2690
6227B9270L2477k5723Q015q254o702k8858L745Q657J4129o5876L870L9294k7952
6214b3908J7876K0818J7346q531m4195p1816j1658p506M8753N4134r253l0965
$$ plain form
6303 -11982 27265 20161 -922 -13056 -21534 -16731 -1704 13018 8456 55767 40700 23466 -45493
6290 -45493 -73064 -24048 59939 87590 42772 -39625 -96035 -93842 -112301 10657 112750 83549
6278 83549 76722 27100 -76357 -91626 -64287 -54215 -42580 -15642 -68503 -87974 -54780 -49923
6266 -49923 -17679 -13686 -20630 -22595 -78717 -77165 3671 -3925 1619 17196 -20711 -42202 18626
6253 18626 45904 -22611 -22722 49502 77021 125417 101154 69558 59461 53607 74204 66512 10066
6240 10066 9283 15198 -36143 -11571 -2796 -56740 -24391 33032 43184 34296 1783 -3420 29270
6227 29270 61747 36024 44039 35785 29083 225 3970 12627 26756 -39120 -35250 4044 -23908
6214 -23908 -6032 14786 32132 23601 -20594 -92410 -104068 -111574 -62821 -8687 -17940 -48905
6202d8905K0974J1986M832p1617k8402L9417L7455L6720m56K2153k9629K0626
6190A5154j0786m9224l7850M8426K7630m891m353P779L0985N5716M8460J009o7527
6177F0528m5763l3730J6177l473j81r1198P4256M6475R041k4292j6539k6594k2474
6164e7767m5740N3882R277j2700K7694r587l729j5964k0383K6341L8619J208k6821
6151c5670L1532j9411l4047N6122j9666q3787J6152L376L6459k2075n1806l6299
6139a59120J3671L6263O521j3339J2987K7717k7143j3033J7330N5936P9157J6221
6127E3168k0125o4826O516M4483m025o3634r320K5894Q824l4690m1971o625J1079
6114i5252M412k0050K9042j5321l7062L9558O4802M5280K2837K3903K903l1600
$$ plain form
6202 -48905 -27931 -15945 -11113 -82730 -111132 -71715 -34260 2460 2004 24157 -5472 15154
6190 15154 4368 -44856 -82706 -34280 -6650 -11541 -15894 -8115 22870 78586 127046 128055 60528
6177 60528 14765 -18965 -2788 -6261 -6442 -97640 -23384 23091 32132 7840 -8699 -35293 -57767
6164 -57767 -103507 -49625 -40348 -53048 -25354 -34941 -38670 -54634 -75017 -48676 -10057 -8849 -35670
6151 -35670 -4138 -23549 -57596 -1474 -21140 -104927 -88775 -85399 -48940 -71015 -122821 -159120
6139 -159120 -145449 -109186 -102665 -116004 -103017 -75300 -102443 -115476 -98146 -42210 36947 53168
6127 53168 33043 -31783 -25267 19216 15191 -48443 -57763 -31869 -23045 -57735 -99706 -106331 -95252
6114 -95252 -90840 -110890 -81848 -97169 -134231 -94673 -29871 15409 38246 62149 65052 33452
6102C3452n0837J2569k1245m0660J4527M6985J6318j5099P8906l5903l6847j7620
6090a5454j7427O4440J1477n6336n4234mK8618R319J4142l0215k4049O3708M2782
$$ plain form
6102 33452 -17385 -4816 -26061 -66721 -52194 -5209 11109 -3990 74916 39013 2166 -15454
6090 -15454 -32881 31559 43036 -13300 -67534 -67538 -38920 -29601 -15459 -45674 -69723 -6015 36767
$$ [...]
##END NTUPLES=NMR SPECTRUM
##END=
