##TITLE=Analysis number 321995
Compound Code cc 04701
Project Code adrs
Chemist Name stores
##JCAMPDX= 6.0         $$ Bruker NMR JCAMP-DX V2.0
##DATA TYPE= NMR SPECTRUM
##DATA CLASS= NTUPLES
##ORIGIN= Bruker BioSpin GmbH
##OWNER= nmr
$$ XWIN-NMR		Version 3.5
$$ Fri Sep  8 08:43:05 2006 GMT Daylight Time (UT+1h)  MAYBRIDGE\nmr@NMR_250MHZ
##.OBSERVE FREQUENCY= 250.131544655141
##.OBSERVE NUCLEUS= ^1H
##.ACQUISITION MODE= SIMULTANEOUS (DQD)
##.ACQUISITION SCHEME= undefined
##.AVERAGES= 16
##.DIGITISER RES= 18
##SPECTROMETER/DATA SYSTEM= dpx250
##.PULSE SEQUENCE= zg30
##.SOLVENT NAME= DMSO
##.SHIFT REFERENCE= (INTERNAL, DMSO, 0, 16.522)
##AUDIT TRAIL= $$ (NUMBER, WHEN, WHO, WHERE, WHAT)
$$ ##TITLE= Audit trail, XWIN-NMR		Version 3.5
$$ ##JCAMPDX= 5.01
$$ ##ORIGIN= Bruker BioSpin GmbH
$$ ##OWNER= nmr
$$ C:\u/data/dgb/nmr/ADRS/340/pdata/1/auditp.txt
$$ ##AUDIT TRAIL=  $$ (NUMBER, WHEN, WHO, WHERE, WHAT)
(   1,<2006-09-08 08:42:41.94 +100>,<MAYBRIDGE\nmr>,<NMR_250MHZ>,
      <created by zg, POWCHK disabled, PULCHK disabled
       configuration hash MD5:
       E2 DF 36 D8 04 B2 41 60 5A D7 A3 38 5A 4B D0 FE
       data hash MD5: 64K
       8F 50 38 28 4B EF 73 91 68 42 AB 3C B5 85 23 F1>)
(   2,<2006-09-08 08:42:54.55 +100>,<MAYBRIDGE\nmr>,<NMR_250MHZ>,
      <Start of raw data processing
       ef LB = 0.3 FT_mod = 6 PKNL = 1 SI = 32K 
       data hash MD5: 32K
       01 12 84 0F 7A 0F 9A 4E FB 25 D9 10 10 4B F7 9F>)
(   3,<2006-09-08 08:42:56.31 +100>,<MAYBRIDGE\nmr>,<NMR_250MHZ>,
      <apk 
       data hash MD5: 32K
       0F 11 F9 CA DD 5A F2 AF F1 2A 55 1D 7A 81 4F 55>)
(   4,<2006-09-08 08:42:57.06 +100>,<MAYBRIDGE\nmr>,<NMR_250MHZ>,
      <abs ABSG = 5 
       data hash MD5: 32K
       7D F9 F9 38 BE 0F 2B 14 77 72 84 03 14 5E 92 63>)
$$ ##END=
$$ 
$$ hash MD5
$$ C1 BD 86 6E 2B E5 EA 3F 1C 0F EE 10 62 88 B8 D7
##$RELAX= 
##$RELAX= 
##$RELAX= 
##$RELAX= 
##$RELAX= 
##$RELAX= 
##$RELAX= 
$$ Bruker specific parameters
$$ --------------------------
##$DU= <C:\u>
##$EXPNO= 340
##$NAME= <ADRS>
##$PROCNO= 1
##$TYPE= <nmr>
##$USER= <dgb>
##$AMP= (0..31)
100 100 100 100 100 100 100 100 100 100 100 100 100 100 100 100 100 100 
100 100 100 100 100 100 100 100 100 100 100 100 100 100 
##$AQSEQ= 0
##$AQ_mod= 3
##$AUNM= <au_zg>
##$AUTOPOS= <2 >
##$BF1= 250.13
##$BF2= 250.13
##$BF3= 250.13
##$BF4= 250.13
##$BF5= 500.13
##$BF6= 500.13
##$BF7= 500.13
##$BF8= 500.13
##$BYTORDA= 1
##$CFDGTYP= 0
##$CFRGTYP= 5
##$CHEMSTR= <none>
##$CNST= (0..31)
1 1 145 1 1 1 1 1 1 1 1 1 1 1 1 1 1 1 1 1 1 1 1 1 1 1 1 1 1 1 1 1 
##$CPDPRG= <>
##$CPDPRG1= <>
##$CPDPRG2= <>
##$CPDPRG3= <>
##$CPDPRG4= <mlev>
##$CPDPRG5= <mlev>
##$CPDPRG6= <mlev>
##$CPDPRG7= <mlev>
##$CPDPRG8= <mlev>
##$CPDPRGB= <>
##$CPDPRGT= <>
##$D= (0..31)
0 1 0 0 0 0 0 0 0 0.06 0 0 0 0 0 0 0.0002 0 0 0 0 0 0 0 0 0 0 0 0 0 0 
0 
##$DATE= 1157701361
##$DBL= (0..7)
120 120 120 120 120 120 120 120 
##$DBP= (0..7)
150 150 150 150 150 150 150 150 
##$DBP07= 0
##$DBPNAM0= <>
##$DBPNAM1= <>
##$DBPNAM2= <>
##$DBPNAM3= <>
$$ [...]
##$SUBNAM7= <"">
##$SUBNAM8= <"">
##$SUBNAM9= <"">
##$SW= 20.6930455092707
##$SWIBOX= (0..15)
0 0 3 0 0 0 0 0 0 0 0 0 0 0 0 0 
##$SW_h= 5175.983436853
##$TD= 65536
##$TD0= 1
##$TE= 295.16
##$TE2= 300
##$TE3= 300
##$TEG= 300
##$TL= (0..7)
0 120 120 120 120 120 120 120 
##$TP= (0..7)
150 150 150 150 150 150 150 150 
##$TP07= 0
##$TPNAME0= <>
##$TPNAME1= <>
##$TPNAME2= <>
##$TPNAME3= <>
##$TPNAME4= <>
##$TPNAME5= <>
##$TPNAME6= <>
##$TPNAME7= <>
##$TPOAL= (0..7)
0.5 0.5 0.5 0.5 0.5 0.5 0.5 0.5 
##$TPOFFS= (0..7)
0 0 0 0 0 0 0 0 
##$TUNHIN= 0
##$TUNHOUT= 0
##$TUNXOUT= 0
##$USERA1= <user>
##$USERA2= <user>
##$USERA3= <user>
##$USERA4= <user>
##$USERA5= <user>
##$V9= 5
##$VALIST= <valist>
##$VCLIST= <CCCCCCCCCCCCCCC>
##$VD= 0
##$VDLIST= <DDDDDDDDDDDDDDD>
##$VPLIST= <PPPPPPPPPPPPPPP>
##$VTLIST= <TTTTTTTTTTTTTTT>
##$WBST= 1024
##$WBSW= 4
##$XGAIN= (0..3)
0 0 0 0 
##$XL= 0
##$YL= 0
##$YMAX_a= 271610
##$YMIN_a= -422423
##$ZGOPTNS= <>
##$ZL1= 120
##$ZL2= 120
##$ZL3= 120
##$ZL4= 120
##$ABSF1= 16.522
##$ABSF2= -4.171173
##$ABSG= 5
##$ABSL= 3
##$ALPHA= 0
##$AQORDER= 0
##$ASSFAC= 0
##$ASSFACI= 0
##$ASSFACX= 0
##$ASSWID= 0
##$AUNMP= <proc_1d>
##$AZFE= 0.1
##$AZFW= 0.1
##$BCFW= 0
##$BC_mod= 0
##$BYTORDP= 0
##$COROFFS= 0
##$CY= 12.5
##$DATMOD= 1
##$DC= 0
##$DFILT= <>
##$DTYPP= 0
##$F1P= 14.0000005364418
##$F2P= -0.99999901652339
##$FCOR= 0.5
##$FTSIZE= 32768
##$FT_mod= 6
##$GAMMA= 0
##$GB= 0
##$INTBC= 1
##$INTSCL= 1
##$ISEN= 128
##$LB= 0.3
##$LEV0= 0
##$LPBIN= 0
##$MAXI= 10000
##$MC2= 0
##$MEAN= 0
##$ME_mod= 0
##$MI= 0
##$NCOEF= 0
##$NC_proc= -6
##$NLEV= 6
##$NOISF1= 0
##$NOISF2= 0
##$NSP= 0
##$NTH_PI= 0
##$NZP= 0
##$OFFSET= 16.522
##$PC= 1
##$PHC0= 140.1069
##$PHC1= -3.570726
##$PH_mod= 1
##$PKNL= yes
##$PPARMOD= 0
##$PSCAL= 4
##$PSIGN= 0
##$REVERSE= no
##$SF= 250.13
##$SI= 32768
##$SIGF1= 0
##$SIGF2= 0
##$SINO= 400
##$SIOLD= 32768
##$SREGLST= <1H.DMSO>
##$SSB= 0
##$STSI= 32768
##$STSR= 0
##$SW_p= 5175.98343685301
##$SYMM= 0
##$S_DEV= 0
##$TDeff= 65536
##$TDoff= 0
##$TI= <Analysis number 999999
Compound Code 99
Book Reference 9
Project Code 9>
##$TILT= no
##$TM1= 0
##$TM2= 0
##$TOPLEV= 0
##$USERP1= <user>
##$USERP2= <user>
##$USERP3= <user>
##$USERP4= <user>
##$USERP5= <user>
##$WDW= 1
##$XDIM= 32768
##$YMAX_p= 538533095
##$YMIN_p= -1175257
$$ End of Bruker specific parameters
$$ ---------------------------------
##NTUPLES= NMR SPECTRUM
##VAR_NAME=  FREQUENCY,     SPECTRUM/REAL,   SPECTRUM/IMAG
##SYMBOL=    X,             R,               I
##VAR_TYPE=  INDEPENDENT,   DEPENDENT,       DEPENDENT
##VAR_FORM=  AFFN,          ASDF,            ASDF
##VAR_DIM=   32768,         32768,           32768
##UNITS=     HZ,            ARBITRARY UNITS, ARBITRARY UNITS
##FACTOR=    0.157963299565203, 1,           1
##FIRST=     4132.6476996994, 0,             0
##LAST=      -1043.33573715361, 0,           0
##MIN=       -1043.33573715361, -1175257,    0
##MAX=       4132.6476996994, 538533095,     0
$$ Real data points
##PAGE= N=1
##DATA TABLE= (X++(R..R)), XYDATA
$$ [...]
$$ plain form
26506 1512118 1349384 1018454 915667 1131806 1159733 1106309 1197204 1478732 1348453 1193392
26496 1193392 1095109 1201636 1387867 1289252 1342962 1327028 963494 821939 1047482 1081711
26486 1081711 901883 1122689 1309677 1083434 1092610 1325828 1464607 1431419 1316467 1060966
26476 1060966 1209053 1097912 794177 777313 1071586 1227069 1287168 1024082 825748 944340
26466 944340 1044243 1266263 1627092 1676460 1206851 1064684 1165413 930117 1000044 1052431
26456 1052431 1087145 1054584 803634 776518 966782 1116671 1364164 1177027 1204382 993460
26446 993460 1021175 1120423 1341254 1471158 1281982 1025208 931443 986194 721667 760902
26436 760902 1197164 1435165 1338405 1116823 1098161 1281576 1456291 1363174 1024558 1060408
$$ packed form
26506A512118j62734l30930j02787K16139K7927n3424R0895K81528j30279j55061
26496A193392r8283J06527J86231r8615N3710j5934l63534j41555K25543L4229
26486A081711j79828K20806J86988k26243R176K33218J38779l3188j14952k55501
26476A060966J48087j11141l03735j6864K94273J55483O0099k63086j98334J18592
26466I44340R9903K22020L60829M9368m69609j42167J00729k35296O9927N2387
26456A052431L4714l2561k50950k7116J90264J49889K47493j87137K7355k10922
26446I93460K7715R9248K20831J29904j89176k56774r3765N4751k64527L9235
26436G60902M36262K38001r6760k21582j8662J83415J74715r3117l38616L5850
$$ plain form
26426 1060408 876839 978348 1023338 923411 1071334 1204283 963618 567329 530149 786780
26416 786780 737357 741890 827752 858896 1212683 1209756 1185082 1215507 1182338 1352561 1440297
26405 1440297 1338817 1032452 797138 859828 1144602 1159095 1152697 1357074 1330410 987832
26395 987832 867566 970618 981256 1148446 1073737 844843 714665 917628 1027703 1192287
26385 1192287 1135269 1024525 1224541 1234849 1034145 930311 942648 743967 713038 767476
26375 767476 808893 832098 1099243 1196401 1244991 1276833 1520036 1515702 1158413 831437 827859
26364 827859 906919 638352 688851 793565 819547 1114122 983013 990335 835805 901408 1060027
26353 1060027 1248725 1014792 1055526 1003734 1099067 1248534 1085941 1384047 1209759 719508
$$ packed form
26426A060408j83569J01509M4990r9927J47923J32949k40665l96289l7180K56631
26416G86780m9423M533Q5862L1144L53787k927k4674L0425l3169J70223Q7736
26405A440297j01480l06365k35314O2690K84774J4493o398K04377k6664l42578
26395I87832j20266J03052J0638J67190p4709k28894j30178K02963J10075J64584
26385A192287n7018j10744K00016J0308k00704j03834J2337j98681l0929N4438
26375G67476M1417K3205K67145R7158M8590L1842K43203m334l57289l26976l578
26364H27859P9060k68567N0499J04714K5982K94575j31109P322j54530O5603J58619
26353A060027J88698k33933M0734n1792R5333J49467j62593K98106j74288m90251
$$ plain form
26343 719508 478619 534434 353348 211397 289041 247978 380870 193085 153850 620955
26333 620955 935641 1108812 1098661 1025585 1159817 1231898 1169698 1267530 1141847 1243717
26323 1243717 1329843 1229853 1267198 982212 898694 806752 854151 1072702 1179553 1091645 920773
26312 920773 1020454 983290 864448 984026 1207826 1404003 1313151 989974 868847 864541
26302 864541 861748 855660 865369 716512 614120 863558 1051002 1129638 1245733 1189896 1060076
26291 1060076 1091135 1110191 1120897 1145935 1189383 1159283 920365 782966 916384 756164
26281 756164 834943 766292 823821 1026120 950333 809274 862172 932443 1135362 1070686 958020
26270 958020 954749 1020381 883440 749421 648981 861608 985312 943840 938163 737026 731526
$$ packed form
26343G19508k40889N5815j81086j41951P7644m1063J32892j87785l9235M67105
26333F20955L14686J73171j0151p3076J34232P2081o2200R7832j25683J01870
26323A243717Q6126r9990L7345k84986q3518r1942M7399K18551J06851q7908j70872
26312I20773R9681l7164j18842J19578K23800J96177r0852l23177j21127m306
26302H64541k793o088R709j48857j02392K49438J87444P8636J16095n5837j29820
26291A060076L1059J9056J0706K5038M3448l0100k38918j37399J33418j60220
26281G56164P8779o8651N7529K02299p5787j41059N2898P0271K02919o4676j12666
26270I58020l271O5632j36941j34019j00440K12627J23704m1472n677k01137n500
$$ plain form
26259 731526 637486 674327 866038 796115 793033 702592 797534 640742 726068 872154 885775
26248 885775 798243 785224 841062 768494 906462 837177 530754 392341 383676 334389 489332
26237 489332 505252 477296 522627 637976 795402 796867 761916 812019 912572 928202 1065157
26226 1065157 1116552 1154564 1173036 1171380 1025957 944994 959399 1226032 1325995 1247144 1077961
26215 1077961 777936 715149 726630 757158 626339 661455 638344 349800 352710 383407 801854
26204 801854 978289 841060 688575 722579 933928 1150329 1105664 747134 716413 355262
26194 355262 -60479 -59373 177970 447954 635694 650351 653846 620762 653100 848010 885482
26183 885482 616881 309860 362403 613767 899084 966402 821555 546334 334685 215019
$$ packed form
26259G31526r4040L6841J91711o9923l082r0441R4942j56792Q5326J46086J3621
26248H85775q7532j3019N5838p2568J37968o9285l06423j38413q665m9287J54943
26237D89332J5920k7956M5331J15349J57426J465l4951N0103J00553J5630J36955
26226A065157N1395L8012J8472j656j45423q0963J4405K66633R9963p8851j69183
26215A077961l00025o2787J1481L0528j30819L5116k3111k88544K910L0697M18447
26204H01854J76435j37229j52485L4004K11349K16401m4665l58530l0721l61151
26194C55262m15741J106K37343K69984J87740J4657L495l3084L2338J94910L7472
26183H85482k68601l07021N2543K51364K85317O7318j44847k75221k11649j19666
$$ plain form
26173 215019 710855 1070134 1229769 1157270 707460 453605 514468 627284 708595 742476
26163 742476 808435 1002113 821019 729887 947327 1165745 999911 584889 423783 349885
26153 349885 409616 559094 573298 833541 1138838 1068946 1081669 887520 741457 912307
26143 912307 932945 933200 1004672 1090820 1095864 979797 715401 521922 273966 131524 367226
26132 367226 751560 810440 468675 139569 475397 906277 893089 720303 673706 520627
26122 520627 431199 569034 309090 64461 -114443 -22543 282965 620163 701636 808635
26112 808635 926227 917912 988353 549498 514825 593917 660058 583808 626257 982510 1152283
26101 1152283 969438 684283 755120 739024 910318 824625 524312 733604 1142831 1085953
$$ packed form
26173B15019M95836L59279J59635p2499m49810k53855O0863J12816Q1311L3881
26163G42476O5959J93678j81094r1132K17440K18418j65834m15022j61106p3898
26153C49885N9731J49478J4204K60243L05297o9892J2723j94149j46063J70850
26143I12307K0638K55P1472Q6148N044j16067k64396j93479k47956j42442K35702
26132C67226L84334N8880l41765l29106L35828M30880j3188j72786m6597j53079
26122E20627q9428J37835k59944k44629j78904R1900L05508L37198Q1473J06999
26112H08635J17592q315P0441m38855l4673P9092O6141p6250M2449L56253J69773
26101A152283j82845k85155P0837j6096J71294q5693l00313K09292M09227n6878
$$ plain form
26091 1085953 879858 792065 858040 898584 1020964 890619 882763 801830 773143 657116 546100
26080 546100 245291 144353 443168 448271 313994 117919 275970 413213 583038 964604
26070 964604 1181821 1290257 1107294 885876 850375 905230 911022 629902 763496 837670
26060 837670 786381 453495 392551 624624 341094 431001 649564 867873 595860 291705
26050 291705 466469 883868 908883 713407 293067 185097 138540 331291 288896 270203
26040 270203 360718 225809 341158 590355 627821 497787 842348 868121 777991 702814
26030 702814 454949 457094 653274 612200 611789 768213 615685 547173 675344 689219 583205
26019 583205 778301 846997 531189 395018 361887 444285 625784 614394 475947 329601
$$ packed form
26091A085953k06095q7793O5975M0544J22380j30345p856q0933k8687j16027j11016
26080E46100l00809j00938K98815N103j34277j96075J58051J37243J69825L81566
26070I64604K17217J08436j82963k21418l5501N4855N792k81120J33594P4174
26060H37670n1289l32886o0944K32073k83530Q9907K18563K18309k72013l04155
26050B91705J74764M17399K5015j95476m20340j07970m6557J92751m2395j8693
26040B70203R0515j34909J15349K49197L7466j30034L44561K5773r0130p5177
26030G02814k47865K145J96180m1074m11J56424j52528o8512J28171J3875j06014
26019E83205J95096O8696l15808j36171l3131Q2398J81499j1390j38447j46346
$$ plain form
26009 329601 565906 720337 808753 742530 699892 514454 582731 644482 462263 549247 719675
25998 719675 758095 883625 910650 815230 1026451 1133363 777074 644181 779439 788251
25988 788251 460025 349397 542673 507007 410837 575339 664910 523373 712174 684282
25978 684282 699195 640320 775811 663670 541719 612227 598101 471829 411577 271224
25968 271224 288159 506892 567839 444781 700465 637055 338755 50089 323605 808078
25958 808078 908291 757158 589925 677943 791641 779339 738657 762519 839532 643924
25948 643924 600685 583095 614139 691671 728112 711658 849611 755708 389276 57598 -34156
25937 -34156 174822 332054 516620 528325 532807 503902 394044 525906 658456 624622 438083
$$ packed form
26009C29601K36305J54431Q8416o6223m2638j85438O8277O1751j82219Q6984J70428
25998G19675L8420J25530K7025r5420K11221J06912l56289j32893J35258Q812
25988G88251l28226j10628J93276l5666r6170J64502Q9571j41537J88801k7892
25978F84282J4913n8875J35491j12141j21951P0508j4126j26272o0252j40353
25968B71224J6935K18733O0947j23058K55684o3410k98300k88666K73516M84473
25958H08078J00213j51133j67233Q8018J13698j2302m0682K3862P7013j95608
25948F43924m3239j7590L1044P7532L6441j6454J37953r3903l66432l31678r1754
25937c4156K08978J57232J84566J1705M482k8905j09858J31862J32550l3834j86539
$$ plain form
25926 438083 635339 595634 684029 591816 397877 384012 599329 472624 586807 798576
25916 798576 1010528 1040523 871790 814916 949954 883145 845816 597788 289331 279124
25906 279124 374488 348774 311866 538989 519946 269954 344538 619971 900223 715682
25896 715682 381488 411294 470597 309664 220112 303658 424665 558912 571945 530604 428740
25885 428740 512753 686897 816224 706068 467351 490112 506507 558056 415709 333327
25875 333327 355555 359861 385642 510812 330186 387649 589266 519661 262754 240851 461769
25864 461769 654309 639956 626145 446549 404305 515825 637683 503966 239232 335553
25854 335553 469258 464133 416526 45325 195037 364395 389893 227233 254915 329056 503634
$$ packed form
25926D38083J97256l9705Q8395r2213j93939j3865K15317j26705J14183K11769
25916G98576K11952K9995j68733n6874J35038o6809l7329k48028l08457j0207
25906B79124R5364k5714l6908K27123j9043k49992P4584K75433K80252j84541
25896G15682l34194K9806N9303j60933q9552Q3546J21007J34247J3033m1341j01864
25885D28740Q4013J74144J29327j10156k38717K2761J6395N1549j42347q2382
25875C33327K2228M306K5781J25170j80626N7463K01617o9605k56907k1903K20918
25864D61769J92540j4353j3811j79596m2244J11520J21858j33717k64734R6321
25854C35553J33705n125m7607l71201J49712J69358K5498j62660K7682P4141J74578
$$ plain form
25843 503634 497559 316680 372256 224076 357247 529710 534973 705162 641140 355690 338274
25832 338274 375193 598674 752722 638944 437754 264290 363933 602671 661876 587430
25822 587430 559157 442676 160341 -95144 -153244 -164602 80090 519149 745714 757165
25812 757165 474380 196466 177578 155403 531941 658626 801851 815689 450593 322919
25802 322919 461635 627604 446243 387380 530743 501599 12429 -221730 -57697 203830
25792 203830 153020 205965 239544 -40945 -77445 77863 330626 402403 620173 359487
25782 359487 290173 571272 536723 333400 261952 174644 203612 406121 460099 476745 647023
25771 647023 568398 505476 13730 219036 454614 654950 711697 524765 214574 242476
$$ packed form
25843E03634o075j80879N5576j48180J33171J72463N263J70189o4022k85450j7416
25832C38274L6919K23481J54048j13778k01190j73464R9643K38738N9205p4446
25822E87430k8273j16481k82335k55485n8100j1358K44692M39059K26565J1451
25812G57165k82785k77914j8888k2175L76538J26685J43225J3838l65096j27674
25802C22919J38716J65969j81361n8863J43363k9144m89170k34159J64033K61527
25792B03830n0810N2945L3579k80489l6500J55308K52763P1777K17770k60686
25782C59487o9314K81099l4549k03323p1448q7308K8968K02509N3978J6646J70278
25771F47023p8625o2922m91746K05306K35578K00336N6747j86932l10191K7902
$$ plain form
25761 242476 327228 414922 541831 532045 290722 400828 627034 460143 446169 494991 222500
25750 222500 104437 151330 97565 118746 525947 580814 538826 518609 445840 717863 810575
25739 810575 689011 448024 97730 189285 555327 656212 727296 759334 715596 745816
25729 745816 611530 330030 292847 386733 401136 371686 489138 437991 416068 515582 596220
25718 596220 434470 288015 477319 736199 952705 809985 602265 551880 733669 578104
25708 578104 561773 487300 428822 465573 435862 338733 176612 280390 172582 9423 70262
25697 70262 116852 -117445 100441 103433 206679 428439 649820 813835 883448 787276 712790
25686 712790 478221 244561 219393 237943 243875 62822 -74595 46035 255863 409981
$$ packed form
25761B42476Q4752Q7694J26909r786k41323J10106K26206j66891j3974M8822k72491
25750B22500j18063M6893n3765K1181M07201N4867m1988k0217p2769K72023R2712
25739H10575j21564k40987l50294R1555L66042J00885P1084L2038m3738L0220
25729G45816j34286k81500l7183R3886J4403k9450J17452n1147k1923R9514Q0638
25718E96220j61750j46455J89304K58880K16506j42720k07720n0385J81789j55565
25708E78104j6331p4473n8478L6751k9711r7129j62121J03778j07808j63159O0839
25697G0262M6590k34297K17886K992J03246K21760K21381J64015O9613r6172p4486
25686G12790k34569k33660k5168J8550N932j81053j37417J20630K09828J54118
$$ plain form
25676 409981 561408 614343 661695 643554 642417 482435 516656 716361 846666 863017 589071
25665 589071 630077 580531 277457 -69027 70160 109081 91238 356065 430571 377807 184176
25654 184176 -137964 -124788 -60492 215084 396063 314777 191606 -60317 -21114 172653
25644 172653 119139 188459 321536 300918 204568 433808 271981 450241 640391 974274
25634 974274 930807 666681 512147 238872 133478 88222 231429 317110 366483 212722
25624 212722 27035 152682 402692 374632 153960 1846 73838 262250 200825 185556
25614 185556 223212 325211 367074 301210 432091 309178 268241 487452 546517 456181 331232
25603 331232 294056 275202 289796 424259 355279 31896 -131720 -17373 2067 16498 -247970
$$ packed form
25676D09981J51427N2935M7352j8141j137j59982L4221J99705J30305J6351k73946
25665E89071M1006m9546l03074l46484J39187L8921j7843K64827P4506n2764j93631
25654A84176l22140J3176O4296K75576J80979q1286j23171k51923L9203J93767
25644A72653n3514O9320J33077k0618r6350K29240j61827J78260J90150L33883
25634I74274m3467k64126j54534k73275j05394m5256J43207Q5681M9373j53761
25624B12722j85687J25647K50010k8060k20672j52114P1992J88412o1425j5269
25614A85556L7656J01999M1863o5864J30881j22913m0937K19211N9065r0336j24949
25603C31232l7176j8854J4594J34463o8980l23383j63616J14347J9440J4431k64468
$$ plain form
25592 -247970 -194297 37700 158405 325730 271444 205931 120738 -72424 42726 86849
25582 86849 143520 76272 -31876 62106 79461 -186829 223360 467352 537645 388481 314984
25571 314984 430637 493832 342325 50459 98222 72591 88040 351357 127797 -23071
25561 -23071 -18054 23733 106071 112495 -106216 -132864 -175665 -321026 -318368 -64672 217687
25550 217687 305713 413473 553559 537077 240957 -48718 67028 75888 394693 556052
25540 556052 517449 382386 30164 36117 4410 115093 368307 250223 209847 249628 190266
25529 190266 20365 21223 141678 378024 349486 227499 59583 202350 332483 144311
25519 144311 251426 312284 204022 269921 360657 108090 -108019 49720 378741 680645
$$ packed form
25592b47970N3673K31997J20705J67325n4286o5513q5193j93162J15150M4123
25582H6849N6671o7248j08148R3982J7355k66290M10189K43992P0293j49164p3497
25571C14984J15653O3195j51507k91866M7763k5631J5449K63317k23560j50868
25561b3071N017M1787Q2338O424k18711k6648m2801j45361K658K53696K82359
25550B17687Q8026J07760J40086j6482k96120k89675J15746Q860L18805J61359
25540E56052l8603j35063l52222N953l1707J10683K53214j18084m0376L9781n9362
25529A90266j69901Q58J20455K36346k8538j21987j67916J42767J30133j88172
25519A44311J07115O0858j08262O5899R0736k52567k16109J57739L29021L01904
$$ plain form
25509 680645 417303 368620 85068 -79743 21400 106772 -58929 128563 409047 541506
25499 541506 472926 527575 498166 283219 133119 253193 239127 89571 140078 -205030
25489 -205030 -25 113048 74868 205908 490993 555234 481171 146673 155048 175623 208227
25478 208227 -24394 -43603 -63113 -94743 59471 391431 511982 391054 50655 -81309
25468 -81309 -32999 96639 94989 259186 339204 433187 540260 354315 256467 302319 221382
25457 221382 219777 312597 357752 409801 324887 380204 272413 196767 22038 -213086 -313129
25446 -313129 -390785 -185152 -114004 -266116 -48693 132942 1646 -223399 28897 -98884
25436 -98884 24858 462168 354870 29348 -27361 -58415 -48495 7268 218550 346030 344596
$$ packed form
25509F80645k63342m8683k83552j64811J01143Q5372j65701J87492K80484J32459
25499E41506o8580N4649k9409k14947j50100J20074j4066j49556N0507l45108
25489b05030K05005J13073l8180J31040K85085O4241p4063l34498Q375K0575L2604
25478B08227k32621j9209j9510l1630J54214L31960J20551j20928l40399j31964
25468h1309M8310J29638j650J64197Q0018R3983J07073j85945r7848M5852q0937
25457B21382j605R2820M5155N2049q4914N5317j07791p5646j74729k35124j00043
25446c13129p7656K05633P1148j52112K17423J81635j31296k25045K52296j27781
25436i8884J23742M37310j07298l25522n6709l1054R920N5763K11282J27480j434
$$ plain form
25425 344596 320906 269900 -78394 184458 578317 656501 567680 532711 701996 614235 508136
25414 508136 187127 116780 148119 176569 245800 4812 -169063 -170876 -134918 12808 190555
25403 190555 198058 206616 119009 48805 47495 93355 390415 381369 309663 122319 169692 253942
25391 253942 446721 369570 433355 352448 289031 356548 457640 277195 271732 615766 715684
25380 715684 562285 704763 557088 340372 106522 208025 180726 118861 132909 75727
25370 75727 260605 324544 272401 170230 150632 512138 403944 188570 173203 125795 -71584
25359 -71584 -239689 150234 203346 162419 125312 -21808 -116558 -367638 -459463 -89474 181772
25348 181772 86047 -8235 -106015 -132240 41132 -34618 -19825 34051 -88341 -158309 -157177
$$ packed form
25425C44596k3690n1006l48294K62852L93859P8184q8821l4969J69285q7761j06099
25414E08136l21009p0347L1339K8450O9231k40988j73875j813L5958J47726J77747
25403A90555P503Q558q7607p0204j310M5860K97060r046p1706j87344M7373Q4250
25391B53942J92779p7151O3785q0907o3417O7517J01092j80445n463L44034R9918
25380G15684j53399J42478j47675k16716k33850J01503k7299o1865J4048n7182
25370G5727J84878O3939n2143j02171j9598L61506j08194k15374j5367m7408j97379
25359g1584j68105L89923N3112m0927l7107j47120r4750k51080r1825L69989K71246
25348A81772r5725r4282r7780k6225J73372p5750J4793N3876j22392o9968J132
$$ plain form
25337 -157177 21243 137813 133940 195613 71310 -101852 35796 8171 73523 77090 -51301
25326 -51301 -162476 -143817 166657 247218 92611 307673 495973 442774 212859 137227
25316 137227 313857 429650 388748 350598 137781 -22224 -82680 -39087 10267 83289 -59360
25305 -59360 -387791 -176816 341808 370565 168400 -255625 -128080 -104514 -365946 -461527
25295 -461527 -410112 -312387 -157108 -273632 -167818 -11183 33613 228724 319014 76384
25285 76384 -100293 -256482 -327966 -115201 117498 125526 59784 -68520 -38163 76728 62006
25274 62006 -81288 -506018 -579793 -145076 304625 389689 44865 -95202 45210 343648
25264 343648 315440 -20733 -502311 -490551 -339686 -415536 -294396 -245608 262699 386324
$$ packed form
25337a57177J78420J16570l873O1673j24303j73162J37648k7625O5352L567j28391
25326e1301j11175J8659L10474Q0561j54607K15062J88300n3199k29915p5632
25316A37227J76630J15793m0902l8150k12817j60005o0456M3593M9354P3022j42649
25305e9360l28431K10975N18624K8757k02165m24025J27545K3566k61432r5581
25295d61527N1415R7725J55279j16524J05814J56635M4796J95111R0290k42630
25285G6384j76677j56189p1484K12765K32699Q028o5742j28304L0357J14891j4722
25274F2006j43294m24730p3775M34717M49701Q5064l44824j40067J40412K98438
25264C43648k8208l36173m81578J1760J50865p5850J21140M8788N08307J23625
$$ plain form
25254 386324 248387 -249960 -356657 -199775 -192825 16424 255789 98208 -302352 -576008
25244 -576008 -706351 -566979 -390816 -133696 -13533 -12701 20965 -11176 -336856 -449182
25234 -449182 -530309 -493397 -98812 -13455 -288811 -390474 -436354 -366974 -232362 -106369
25224 -106369 -120376 -20079 -55369 -50007 -185708 -124595 -76911 -158188 -150722 -90634 12550
25213 12550 50474 195341 489971 463266 138095 225746 224824 -15004 -63785 39900 75239
25202 75239 -7323 56769 -3790 42015 -1183 -8412 191943 309842 307019 37323 -30457
25191 -30457 163771 414710 449364 264787 130918 87125 -6556 176198 317914 140311
25181 140311 235279 269257 -1932 23032 131814 -29793 -278240 -101100 -108827 -92256 -90080
$$ packed form
25254C86324j37937m98347j06697J56882O950K09249K39365j57581m00560k73656
25244e76008j30343J39372J76163K57120J20163Q32L3666l2141l25680j12326
25234d49182q1127L6912L94585Q5357k75356j01663m5880O9380J34612J25993
25224a06369j4007J00297l5290N362j35701O1113M7684q1277P466O0088J03184
25213A2550L7924J44867K94630k6705l25171Q7651r22k39828m8781J03685L5339
25202G5239q2562O4092o0559M5805m3198p229K00355J17899k823k69696o7780
25191c0457J94228K50939L4654j84577j33869m3793r3681J82754J41716j77603
25181A40311R4968L3978k71189K4964J08782j61607k48447J77140p727J6571K176
$$ plain form
25170 -90080 -104689 -217187 -272086 -96630 167071 -83661 -312669 -13412 -111644 -164543
25160 -164543 -165376 -273586 -653412 -439876 53385 162741 220615 50898 -51681 74506
25150 74506 -192962 -39080 46362 -106359 -172229 159222 140579 129076 196200 357337 262034
25139 262034 96336 -117201 -216490 -129588 -79392 -107640 -56084 -12149 -50771 -137107 -175669
25128 -175669 -269005 -141896 137672 278093 37767 -68816 -240574 -96010 102440 32534
25118 32534 -6594 -98943 -127687 -36171 -54562 96814 324187 536381 261878 -195557 -380916
25107 -380916 -240898 -85086 3092 54483 -42161 -81390 -68097 231526 259144 25928 -198722
25096 -198722 -298224 -303915 -473324 -480723 -368439 -346578 -482810 -427035 -188799 197907 424695
$$ packed form
25170i0080j4609j12498n4899J75456K63701k50732k29008K99257r8232n2899
25160a64543q33j08210l79826K13536M93261J09356N7874j69717j02579J26187
25150G4506k67468J53882Q5442j52721o5870L31451j8643j1503O7124J61137r5303
25139B62034j65698k13537r9289Q6902N0196k8248N1556M3935l8622q6336l8562
25128a75669r3336J27109K79568J40421k40326j06583j71758J44564J98450o9906
25118C2534l9128r2349k8744R1516j8391J51376K27373K12194k74503m57435j85359
25107c80916J40018J55812Q8178N1391r6644l9229J3293K99623K7618k33216k24650
25096a98722r9502n691j69409p399J12284K1861j36232N5775K38236L86706K26788
$$ plain form
25085 424695 185727 58529 -6905 -431 -180083 -19510 -134107 -499883 -885904 -911463
25075 -911463 -886741 -449688 -188063 -82120 -171148 -178170 -59464 -114967 46875 54852 241445
25064 241445 463379 136440 -479592 -386036 -9968 282371 279135 -55217 -112069 -234154
25054 -234154 141833 361668 162538 -270259 -209745 -163465 -26782 -59619 -226269 20521
25044 20521 256246 92165 -39785 -123083 -122177 -116338 -159338 -138881 -97865 134617 46156
25033 46156 -225390 -273976 -79047 -239187 -165856 -175988 -242666 -241571 -36449 -144954 -255732
25022 -255732 -113815 23198 170580 -61721 68362 -83860 36323 89326 32244 -202917
25012 -202917 -557904 -525383 -374866 -62326 211604 102997 -128964 61813 101134 47843
$$ packed form
25085D24695k38968j27198o5434O474j79652J60573j14597l65776l86021k5559
25075i11463K4722M37053K61625J05943q9028p022J18706n5503J61842P977J86593
25064B41445K21934l26939o16032R3556L76068K92339l236l34352n6852j22085
25054b34154L75987K19835j99130m32797O0514M6280J36683l2837j66650K46790
25044B0521K35725j64081j31950q3298R06N839m3000K0457M1016K32482q8461
25033D6156k71546m8586J94929j60140P3331j0132o6678J095K05122j08505j10778
25022b55732J41917J37013J47382k32301J30083j52222J20183N3003n7082k35161
25012b02917l54987L2521J50517L12540K73930j08607k31961J90777L9321n3291
$$ plain form
25002 47843 204406 448858 463055 573166 310352 214640 223775 -57125 76497 316306
24992 316306 215658 70293 23672 -122137 -111546 46807 -79423 -103633 -166796 -117761
24982 -117761 -215546 -403178 -420269 -205123 -149188 -213830 -434922 -318165 22534 8792
24972 8792 -7548 52028 -168762 -286054 -258711 -329525 -143438 -23947 -63947 -56824 -70502
24961 -70502 208414 138232 204764 259454 222838 84738 -60815 33872 -34444 -333338 -202377
24950 -202377 -232189 -194321 -171274 -174982 -242065 -259947 -49106 102155 104493 102911 42863 -7019
24938 -7019 -63456 -122562 17432 -134646 -105667 162207 128459 191606 126362 -67045 -292645
24927 -292645 -377499 -57095 273087 125641 187973 165031 -24282 -38685 23668 -106212
$$ packed form
25002D7843J56563K44452J4197J10111k62814r5712R135k80900J33622K39809
24992C16306j00648j45365m6621j45809J0591J58353j26230k4210o3163M9035
24982a17761r7785j87632j7091K15146N5935o4642k21092J16757L40699j3742
24972H792j6340N9576k20790j17292K7343p0814J86087J19491m0000P123j3678
24961g0502K78916p0182O6532N4690l6616j38100j45553R4687o8316k98894J30961
24950b02377k9812L7868K3047l708o7083j7882K10841J51261K338j582o0048m9882
24938g019n6437n9106J39994j52078K8979K67874l3748O3147o5244j93407k25600
24927b92645q4854L20404L30182j47446O2332k2942j89313j4403O2353j29880
$$ plain form
24917 -106212 -236094 -311964 -307627 124170 418971 266616 27786 -163922 -146577 -116165
24907 -116165 -242271 -397129 -424028 -435671 -344832 -567152 -627076 -619040 -498419 -284082 -125742
24896 -125742 -149190 -170402 32688 86201 -125365 -5785 208996 167797 -119549 -378185
24886 -378185 -478578 -478045 -617779 -358433 -25883 200721 203580 127600 -102016 -100352 13858
24875 13858 -130149 -86779 -16877 186992 396719 226554 400353 228648 105323 -286807
24865 -286807 -499296 -400509 -283309 -84083 -290277 -476554 -654981 -681948 -347672 -240702
24855 -240702 -374963 -238445 52185 -253279 -522744 -388704 -209688 -156519 -101375 -18267
24845 -18267 105758 300006 121475 -324845 -772434 -786744 -344626 -26392 186157 183278
$$ packed form
24917a06212j29882p5870M337M31797K94801j52355k38830j91708J7345L0412
24907a16165j26106j54858k6899j1643R0839k22320n9924Q036J20621K14337J58340
24896a25742k3448k1212K03090N3513k11566J19580K14781m1199k87346k58636
24886c78185j00393N33j39734K59346L32550K26604K859p5980k29616J664J14210
24875A3858j44007M3370O9902K03869K09727j70165J73799j71705j23325l92130
24865b86807k12489R8787J17200J99226k06194j86277j78427k6967L34276J06970
24855b40702j34261J36518K90630l05464k69465J34040J79016N3169N5144Q3108
24845a8267J24025J94248j78531m46320m47589j4310M42118L18234K12549k879
$$ plain form
24835 183278 -102380 -242076 18994 199627 -106211 -396682 -54889 71989 -123484 -333239
24825 -333239 -304626 -177461 -8551 -246434 -255134 -277772 -480130 -417756 -258323 5551
24815 5551 151022 14293 -40011 38195 198375 170402 -155424 -130624 22349 298049 -22006
24804 -22006 -553340 -513462 -163999 51309 41683 -164237 -292996 47676 301801 359712
24794 359712 396959 267600 -4215 -180737 -97687 38358 -220440 -292224 -610593 -698785
24784 -698785 -427135 -383163 -381335 -310447 -256561 -624899 -768148 -499566 -73132 65265
24774 65265 -113632 -174419 -134359 -313684 -390087 -335382 -166347 -45433 37172 211770 436766
24763 436766 91955 49784 -37701 -55830 -451353 -519512 -150904 -326687 -533350 -350767
$$ packed form
24835A83278k85658j39696K61070J80633l05838k90471L41793J26878j95473k09755
24825c33239K8613J27165J68910k37883q700k2638k02358O2374J59433K63874
24815E551J45471j36729n4304P8206J60180k7973l25826K4800J52973K75700l20055
24804b2006n31334L9878L49463K15308r626k05920j28759L40672K54125N7911
24794C59712L7247j29359k71815j76522Q3050J36045k58798p1784l18369q8192
24784f98785K71650M3972J828P0888N3886l68338j43249K68582M26434J38397
24774F5265j78897o0787M0060j79325p6403N4705J69035J20914Q2605J74598K24996
24763D36766l44811m2171q7485j8129l95523o8159L68608j75783k06663J82583
$$ plain form
24753 -350767 -276151 -294036 -282229 -140854 153706 100465 -114139 -204971 -274081 -330522 -491665
24742 -491665 -592206 -471638 -478012 -341701 -347404 -562758 -572235 -386143 -85834 -78962 -358602
24731 -358602 -225574 110334 40319 -31900 -11249 -73747 -168686 -345286 -670298 -650856 -508859
24720 -508859 -340739 -361866 -202969 -49235 127103 7860 -187272 -263074 -340941 118503
24710 118503 461573 394789 335264 528344 466646 368932 252271 25916 18461 11195 -135645
24699 -135645 -70817 116861 -42576 -144791 -139517 -340978 -509821 -296939 -25249 -59486
24689 -59486 -205536 -240247 -39271 343420 344361 35936 60206 119455 188784 199508 231161
24678 231161 181499 169563 227415 342685 150365 -149668 -149828 42728 74458 -44395 -240631
$$ packed form
24753c50767P4616j7885J1807J41375K94560n3241k14604r0832o9110n6441j61143
24742d91665j00541J20568o374J36311n703k15354r477J86092L00309O872k79640
24731c58602J33028L35908p0015p2219K0651o2498r4939j76600l25012J9442J41997
24720e08859J68120k1127J58897J53734J76338j19243j95132p5802p7867M59444
24710A18503L43070o6784n9525J93080o1698r7714j16661k26355p455p266j46840
24699a35645O4828J87678j59437j02215N274k01461j68843K12882K71690l4237
24689e9486j46050l4711K00976L82691R41l08425K4270N9249O9329J0724L1653
24678B31161m9662j1936N7852J15270j92320l00033j60J92556L1730j18853j96236
$$ plain form
24667 -240631 -191377 96692 184729 152245 91774 -112201 61124 253964 -69360 -151790
24657 -151790 -304213 -289307 -153304 -249180 -270587 -142501 40445 -244347 -752959 -737662
24647 -737662 -247389 116518 -71958 -192479 -243650 -171691 -40868 -285067 -278605 -127894
24637 -127894 -147891 -491447 -513813 -363623 -394733 -380313 -238705 113356 102974 -152888
24627 -152888 -180004 -251464 -303774 -188074 -200236 -284995 -209220 -5407 81471 227959 251725
24616 251725 314121 393434 294359 223638 242159 298246 325578 410423 630116 615794 405259
24605 405259 2714 -199708 -217719 -45546 -113538 -248910 -449828 -301873 -281919 -474632
24595 -474632 -311882 -320996 -426249 -239395 -85567 -56950 -101381 -153501 -188630 -208049 -106087
$$ packed form
24667b40631M9254K88069Q8037l2484o0471k03975J73325J92840l23324q2430
24657a51790j52423J4906J36003r5876k1407J28086J82946k84792n08612J5297
24647g37662M90273L63907j88476j20521n1171P1959J30823k44199O462J50711
24637a27894j9997l43556k2366J50190l1110J4420J41608L52061j0382k55862
24627a52888k7116p1460n2310J15700j2162q4759P5775K03813Q6878J46488K3766
24616B51725O2396P9313r9075p0721J8521N6087K7332Q4845K19693j4322k10535
24605D05259m02545k02422j8011J72173o7992j35372k00918J47955J9954j92713
24595d74632J62750r114j05253J86854J53828K8617m4431n2120l5129j9419J01962
$$ plain form
24584 -106087 55996 -106081 -59391 -202542 -274046 -114473 -29307 158956 281674 136311
24574 136311 97720 -238731 -434839 -478972 -19790 203395 24742 -223845 -417319 -454106
24564 -454106 -215139 -246175 -304945 -229511 -102146 -48990 49266 228288 256188 7532 -51381
24553 -51381 -76965 -96282 52530 -161877 -327831 -145254 -61726 -232190 -370389 -449877
24543 -449877 -218903 -369387 -752573 -872300 -632653 -464726 -335910 -381775 -441082 -343676
24533 -343676 -163509 -109457 -46565 -288132 -647693 -728480 -370942 -100272 -103713 -202346 -302215
24522 -302215 -85446 -317107 -557172 -463441 -298909 -339624 -433312 -211791 26292 -160952
24512 -160952 -131470 -182034 -36574 -35660 -190597 -47768 145325 -28456 -307612 -489957
$$ packed form
24584a06087J62083j62077M6690j43151p1504J59573Q5166J88263J22718j45363
24574A36311l8591l36451j96108m4133M59182K23185j78653k48587j93474l6787
24564d54106K38967l1036n8770P5434J27365N3156R8256J79022K7900k48656n8913
24553e1381k5584j9317J48812k14407j65954J82577Q3528j70464j38199p9488
24543d49877K30974j50484l83186j19727K39647J67927J28816m5865n9307R7406
24533c43676J80167N4052O2892k41567l59561q0787L57538K70670l441r8633r9869
24522c02215K16769k31661k40065R3731J64532m0715r3688K21521K38083j87244
24512a60952K9482n0564J45460R14j54937J42829J93093j73781k79156j82345
$$ plain form
24502 -489957 -471256 -452350 -590922 -505822 -294455 -251354 -219199 -265296 -145802 -61029 -146605
24491 -146605 -189985 -339724 -270885 -300956 -193171 -211341 -246054 -176683 -337988 -422702 -403340
24480 -403340 -305058 -149020 -92944 33929 118855 -24667 -198574 -128728 -201918 -363812
24470 -363812 -455882 -355361 -337986 -246729 78765 306544 63207 -332412 -171050 -192338
24460 -192338 -396489 -223446 -314878 -202632 -470871 -590316 -719193 -679393 -569103 -587352
24450 -587352 -328932 -197604 -435611 -282968 -203063 -233169 -302687 -286446 -37020 146030
24440 146030 131251 -13255 -120948 37239 55661 -43531 -287390 -423014 -352153 -486938
24430 -486938 -346091 -158728 75832 -9798 -153815 10577 211386 351811 285547 191637
$$ packed form
24502d89957J8701J8906j38572Q5100K11367M3101L2155m6097J19494Q4773q5576
24491a46605m3380j49739O8839l0071J07785j8170l4713O9371j61305q4714J9362
24480d03340R8282J56038N6076J26873Q4926j43522j73907O9846p3190j61894
24470c63812r2070J00521J7375R1257L25494K27779k43337l95619J61362k1288
24460a92338k04151J73043r1432J12246k68239j19445j28877L9800J10290j8249
24450e87352K58420J31328k38007J52643P9905l0106o9518J6241K49426J83050
24440A46030j4779j44506j07693J58187J8422r9192k43859j35624P0861j34785
24430d86938J40847J87363K34560q5630j44017J64392K00809J40425o6264r3910
$$ plain form
24420 191637 296636 197828 169753 354699 751351 276700 -41112 169421 95248 -217165
24410 -217165 -267883 106384 110570 -62578 -178052 -423773 -229564 -466908 -529933 -704870
24400 -704870 -767888 -735835 -814436 -780798 -559386 -485400 -740904 -572154 -548753 -177590 92791
24389 92791 13322 244477 495719 326382 -69401 154 -70107 -211598 -300110 -271904 -293475
24378 -293475 -152110 46065 -104616 -304179 -202348 134163 503248 500051 343475 112511
24368 112511 -146942 -329510 -496306 -496983 -222633 -201141 -132555 -173234 59954 306576 170321
24357 170321 -230225 -263506 -638551 -655631 -386199 -443660 -464721 -640741 -425772 -572619
24347 -572619 -683770 -496555 -38623 202960 119349 -218488 -347158 -300859 49511 273854
$$ packed form
24420A91637J04999r8808k8075J84946L96652m74651l17812K10533p4173l12413
24410b17165n0718L74267M186j73148j15474k45721J94209k37344o3025j74937
24400g04870o3018L2053p8601L3638K21412P3986k55504J68750K3401L71163K70381
24389I2791p9469K31155K51242j69337l95783O9555p0261j41491q8512K8206k1571
24378b93475J41365J98175j50681j99563J01831L36511L69085l197j56576k30964
24368A12511k59453j82568j66796o77K74350K1492O8586m0679K33188K46622j36255
24357A70321m00546l3281l75045j7080K69432n7461k1061j76020K14969j46847
24347e72619j11151J87215M57932K41583q3611l37837j28670M6299L50370K24343
$$ plain form
24337 273854 -146905 -375362 -552286 -466659 -412890 -333793 -380440 -306698 -133942 197089
24327 197089 353080 496561 363816 163615 -79956 -139878 -307868 -489047 -364136 -266887
24317 -266887 -5623 296139 21128 -532269 -373299 -533013 -582226 -168176 28460 -242944
24307 -242944 -59751 -64312 -293341 -125038 -61274 -71901 84072 -74077 -251418 -148094
24297 -148094 -243318 -341441 -311601 -119083 -179230 -119453 -5017 -137094 193180 277002 -75591
24286 -75591 -294425 -100531 -3448 -44626 187109 242322 -63981 -15199 128097 13312
24276 13312 -295915 -517181 -733588 -1067073 -844304 -370388 -58663 58213 110448 -152788
24266 -152788 -244798 -206587 -161994 -220717 -184057 -377833 -563980 -579421 -288860 -360378 -462028
$$ packed form
24337B73854m20759k28457j76924Q5627N3769P9097m6647P3742J72756L31031
24327A97089J55991J43481j32745k00201k43571n9922j67990j81179J24911R7249
24317b66887K61264L01762k75011n53397J58970j59714m9213M14050J96636k71404
24307b42944J83193m561k29029J68303O3764j0627J55973j58149j77341J03324
24297a48094r5224r8123K9840J92518o0147N9777J14436j32077L30274Q3822l52593
24286g5591k18834J93894R7083m1178K31735N5213l06303M8782J43296j14785
24276A3312l09227k21266k16407l33485K22769M73916L11725J16876N2235k63236
24266a52788r2010L8211M4593n8723L6660j93776j86147j5441K90561p1518j01650
$$ plain form
24255 -462028 -457882 -404339 -538773 -484898 -482835 -566517 -407286 -240765 -623308 -793516 -631069
24244 -631069 -238135 -301072 -444451 -438097 -141143 -90907 38342 161171 158878 -59494 -280263
24233 -280263 -356156 -286548 -334269 -438882 -473640 -186520 -54607 -418286 -608291 -636633
24223 -636633 -522387 -512366 -450565 -228507 -185413 -20187 -55776 -55558 -140050 -443267 -241384
24212 -241384 -185985 -180901 -345925 -562994 -663227 -720731 -470687 -104375 -1061 -32141
24202 -32141 -17174 78236 8285 -72911 -50551 -133159 -49927 -260926 -473479 -331504 -414948
24191 -414948 -744200 -481741 -294504 -487545 -572232 -546391 -288405 -525371 -850764 -708670
24181 -708670 -489575 -480050 -392560 -723171 -955087 -929348 -608555 -550775 -610649 -420208 -353456
$$ packed form
24255d62028M146N3543j34434N3875K063q3682J59231J66521l82543j70208J62447
24244f31069L92934o2937j43379O354K96954N0236J29249J22829k293k18372k20769
24233b80263p5893O9608m7721j04613l4758K87120J31913l63679j90005k8342
24223f36633J14246J0021O1801K22058M3094J65226l5589K18q4492l03217K01883
24212b41384N5399N084j65024k17069j00233n7504K50044L66312J03314l1080
24202c2141J4967R5410o9951q1196K2360q2608Q3232k10999k12553J41975q3444
24191d14948l29252K62459J87237j93041q4687K5841K57986k36966l25393J42094
24181g08670K19095R525Q7490l30611k31916K5739L20793N7780n9874J90441O6752
$$ plain form
24170 -353456 -543423 -639022 -180507 -224670 -462115 -286670 -147465 -89266 19882 15441
24160 15441 -77212 -25126 -317273 -367998 -497168 -292744 -232703 -196401 -209519 -309983 -327994
24149 -327994 -669747 -847090 -765069 -466076 -274959 -381190 -468446 -496477 -692824 -565135
24139 -565135 -458542 -278113 -270635 -273219 -186766 -344157 -678736 -703513 -582273 -490843 -384232
24128 -384232 -235825 -292038 -411682 -392678 -457936 -99527 -152994 -329388 -363715 -442882 -311565
24117 -311565 -271021 -242683 -359062 -529047 -266318 -45533 45674 48270 -231480 -292344 -418312
24106 -418312 -582387 -719413 -973840 -1057168 -867460 -683501 -627546 -685283 -426646 -317061
24096 -317061 -193796 -1104 -120989 -371909 -489716 -462816 -428888 -229895 -63891 -126627
$$ packed form
24170c53456j89967r5599M58515m4163k37445J75445J39205N8199J09148m441
24160A5441r2653N2086k92147n0725j29170K04424O0041L6302j3118j00464j8011
24149c27994l41753j77343Q2021K98993J91117j06231q7256k8031j96347J27689
24139e65135J06593J80429P478k584Q6453j57391l34579k4777J21240R1430J06611
24128c84232J48407n6213j19644J9004o5258L58409n3467j76394l4327p9167J31317
24117c11565M0544K8338j16379j69985K62729K20785R1207K596k79750o0864j25968
24106d18312j64075j37026k54427q3328J89708J83959N5955n7737K58637J09585
24096c17061J23265J92692j19885k50920j17807K6900L3928J98993J66004o2736
$$ plain form
24086 -126627 -484126 -641578 -776073 -297159 -105681 -188438 -414059 -269113 -142956 -503981
24076 -503981 -484231 42593 151817 -215487 -448371 -533708 -726962 -393424 -134019 -227498
24066 -227498 -216559 -425984 -507088 -595525 -507724 -96412 -270138 -345936 -463328 -421709 -173394
24055 -173394 -78895 164099 234545 197103 177368 -41416 -354522 -382837 -37782 -45761 -153766
24044 -153766 -281150 -526560 -562019 -692549 -733937 -562798 -325297 -219101 -276725 -499501
24034 -499501 -510640 -631832 -726392 -633428 -719919 -969673 -778231 -549183 -597492 -668270 -825742
24023 -825742 -857689 -862948 -542342 -233700 -160771 -301973 -512309 -530398 -406530 -344534 -66658
24012 -66658 -317792 -309522 135713 116940 189505 89027 22125 -280733 -408791 -270281 -151024
$$ packed form
24086a26627l57499j57452j34495M78914J91478q2757k25621J44946J26157l61025
24076e03981J9750N26824J09224l67304k32884q5337j93254L33538K59405r3479
24066b27498J0939k09425q1104q8437Q7801M11312j73726p5798j17392M1619K48315
24055a73394R4499K42994P0446l7442j9735k18784l13106k8315L45055p979j08005
24044a53766j27384k45410l5459j30530m1388J71139K37501J06196n7624k22776
24034d99501j1139j21192r4560R2964q6491k49754J91442K29048m8309p0778j57472
24023h25742l1947n259L20606L08642P2929j41202k10336j8089J23868O1996K77876
24012f6658k51134Q270M45235j8773P2565j00478o6902l02858j28058J38510J19257
$$ plain form
24001 -151024 -203186 -651041 -511814 -21358 -23653 -362196 -500882 -500576 -373639 -416745 -305923
23990 -305923 -209886 -186403 33281 -147840 -488959 -520722 -394027 -393119 -445133 -496039 -483063
23979 -483063 -222236 226482 164348 -110147 -127515 -323429 -426120 -277941 -125168 -111581
23969 -111581 -187117 -169850 -132723 -105895 -188952 -276843 -252941 -303969 -536788 -459632 -22946
23958 -22946 128769 -157028 -246952 -374069 -584511 -719709 -573990 -462450 -494321 -617693
23948 -617693 -641328 -586076 -484661 -647395 -667053 -461239 -415459 -577834 -448531 -446777 -464314
23937 -464314 -462503 -227622 -362267 -573030 -383101 -282112 -378902 -499658 -590527 -807106
23927 -807106 -975018 -734817 -236736 41114 -247867 -271710 -169060 -214544 -520499 -596932
$$ packed form
24001a51024n2162m47855J39227M90456k295l38543j38686L06J26937m3106J10822
23990c05923R6037K3483K19684j81121l41119l1763J26695R08n2014n0906J2976
23979d83063K60827M48718o2134k74495j7368j95914j02691J48179J52773J3587
23969a11581p5536J7267L7127K6828q3057q7891K3902n1028k32819P7156M36686
23958b2946J51715k85797q9924j27117k10442j35198J45719J11540l1871j23372
23948f17693k3635N5252J01415j62734j9658K05814M5780j62375J29303J754j7537
23937d64314J811K34881j34645k10763J89929J00989r6790j20756r0869k16579
23927h07106j67912K40201M98081K77850k88981k3843J02650m5484l05955p6433
$$ plain form
23917 -596932 -726047 -599326 -378321 -447356 -431583 -271306 38097 -36628 -162331 -295520
23907 -295520 -392861 -353745 -92452 -77798 -114896 -22182 128938 119075 56689 -322912 -433787
23896 -433787 -587845 -710965 -452083 -497510 -671593 -557629 -548461 -355924 -231515 -390929
23886 -390929 -609920 -351284 -172473 -100459 -71116 -20745 -92128 -85928 -314406 -393844 -389151
23875 -389151 -370187 -216419 -170785 -185725 -151085 -107163 -326155 -356841 -297815 -299623 -427380
23864 -427380 -387526 -64040 -91994 -60357 -68266 -112455 -212653 -286427 -167360 -249597 -464991
23853 -464991 -558635 -639450 -540237 -376051 -345915 -559779 -638020 -324589 -235744 -115112 -106336
23842 -106336 -86268 -27701 -189675 -395148 -470506 -536223 -579156 -461518 -321737 -369203 -116566
$$ packed form
23917e96932j29115J26721K21005o9035J5773J60277L09403p4725j25703j33189
23907b95520r7341L9116K61293J4654l7098R2714J51120r863o2386l79601j10875
23896d33787j54058j23120K58882m5427j74083J13964R168J92537J24409j59414
23886c90929k18991K58636J78811P2014K9343N0371p1383O200k28478p9438M693
23875c89151J8964J53768M5634j4940L4640M3922k18992l0686N9026j808j27757
23864d27380L9854L23486k7954L1637p909m4189j00198p3774J19067q2237k15394
23853d64991r3644q0815R9213J64186L0136k13864p8241L13431Q8845J20632Q776
23842a06336K0068N8567j61974k05473p5358o5717m2933J17638J39781m7466K52637
$$ plain form
23831 -116566 109660 56013 -203888 -541429 -620410 -576957 -440753 -525858 -485215 -433521 -417474
23820 -417474 -494875 -407449 -513407 -808073 -908086 -758768 -651820 -761363 -599729 -301227
23810 -301227 -181576 -299023 -333629 -326184 -176413 -228465 -319830 -415293 -527613 -224037 -208840
23799 -208840 -407872 -364238 -186581 -137408 -163766 38053 113107 105656 42445 -70585 -235924
23788 -235924 -441398 -588770 -412518 -154967 -302903 -282739 -212600 -129661 -245071 -151619
23778 -151619 -318982 -199041 -101535 -30109 144248 343392 356098 -463 -275083 -532137
23768 -532137 -433240 -257470 49214 146493 -231149 -315544 -362838 -442375 -423283 -321880 7527
23757 7527 -78033 -360089 -569345 -612318 -566855 -397008 -339540 -54353 176050 -37757 -4345
$$ packed form
23831a16566K26226n3647k59901l37541p8981M3453J36204q5105M0643N1694J6047
23820d17474p7401Q7426j05958k94666j00013J49318J06948j09543J61634K98502
23810c01227J19651j17447l4606P445J49771n2052r1365r5463j12320L03576J5197
23799b08840j99032M3634J77657M9173k6358K01819P5054p451o3211j13030j65339
23788b35924k05474j47372J76252K57551j47936K0164P0139Q2939j15410R3452
23778a51619j67363J19941R7506P1426J74357J99144J2706l56561k74620k57054
23768e32137R8897J75770L06684R7279l77642q4395m7294p9537J9092J01403L29407
23757G527q5560k82056k09256m2973M5463J69847N7468K85187K30403k13807L3412
$$ plain form
23746 -4345 9843 -139481 -310025 -254351 56434 63236 -101850 -123727 -142872 -188609 -352989
23735 -352989 -197654 -290486 -468782 -358117 -152296 -234222 -301467 -539600 -581584 -437927
23725 -437927 -243723 -20568 -165465 -444115 -611511 -411684 -353065 -527046 -399009 -257023
23715 -257023 -188639 -128884 -378161 -527660 -404706 -162501 -34603 42149 205465 -42293
23705 -42293 -275531 -130376 -86342 34900 -147758 -380489 -336766 -113093 -196735 -120602
23695 -120602 -310443 -713752 -673518 -532037 -428201 -397259 -513399 -469642 -326015 -220458
23685 -220458 -31613 -121779 -186326 -108682 -483340 -763194 -796791 -566778 -207686 -153357
23675 -153357 -115830 42008 93376 -49748 -171582 -107596 -48042 -15372 -93266 -173092 -276126
$$ packed form
23746d345J4188j49324j70544N5674L10785O802j65086k1877j9145m5737j64380
23735c52989J55335r2832j78296J10665K05821q1926o7245k38133m1984J43657
23725d37927J94204K23155j44897k78650j67396J99827N8619j73981J28037J41986
23715b57023O8384N9755k49277j49499J22954K42205J27898P6752J63316k47758
23705d2293k33238J45155M4034J21242j82658k32731M3723K23673q3642P6133
23695a20602j89841m03309M0234J41481J03836L0942j16140M3757J43627J05557
23685b20458J88845r0166o4547P7644l74658k79854l3597K30013L59092N4329
23675a53357L7527J57838N1368j43124j21834O3986N9554L2670p7894p9826j03034
$$ plain form
23664 -276126 -262884 -239413 -391826 -334758 -257234 -331589 -309573 -404321 -302021 -111324 -62460
23653 -62460 -210530 -273583 -411871 -790187 -641594 -436551 -241026 -233523 -175117 -220560 -391458
23642 -391458 -464315 -384974 -268416 -387030 -383629 -84790 13499 -134746 -305900 -298404 -110521
23631 -110521 -209847 -129210 -250198 -529592 -650545 -623197 -306131 -158425 -265916 -550907
23621 -550907 -589338 -684868 -745880 -410404 -201588 -302090 -22280 130525 -53643 -1146
23611 -1146 -101438 -410579 -466659 -347777 -461218 -280209 -241258 -324033 -226731 -289339 -326076
23600 -326076 -492770 -427939 -373776 -431971 -588104 -477301 -426017 -583652 -693335 -600667
23590 -600667 -463599 -386883 -445123 -546469 -575601 -408164 -466377 -397973 -424996 -566999 -640730
$$ packed form
23664b76126J3242K3471j52413N7068P7524p4355K2016r4748J02300J90697M8864
23653f2460j48070o3053j38288l78316J48593K05043J95525P503N8406m5443j70898
23642c91458p2857P9341J16558j18614L401K98839R8289j48245j71154P496J87883
23631a10521r9326Q0637j20988k79394j20953K7348L17066J47706j07491k84991
23621e50907l8431r5530o1012L35476K08816j00502K79810J52805j84168N2497
23611a146j00292l09141n6080J18882j13441J81009L8951q2775R7302o2608l6737
23600c26076j66694O4831N4163n8195j56133J10803N1284j57635j09683R2668
23590f00667J37068P6716n8240j01346k9132J67437n8213O8404k7023j42003p3731
$$ plain form
23579 -640730 -754346 -834991 -835793 -686397 -624828 -617495 -550007 -443433 -537204 -450348 -377069
23568 -377069 -410466 -190985 -325604 -423132 -491798 -459953 -335864 -556197 -459678 -318277
23558 -318277 -273872 -324343 -620548 -577696 -570882 -522202 -470166 -609845 -627754 -476641 -486506
23547 -486506 -457830 -417961 -450858 -296538 13294 77375 -54224 -76231 -51275 106000 68087
23536 68087 -108673 -405850 -257240 -2755 113527 -231459 -493869 -264819 -61955 17160
23526 17160 -318427 -516949 -426686 -283898 -284737 -137869 -473153 -410554 -141690 -372102 -448809
23515 -448809 -380548 -338869 -368727 -430643 -337591 -273105 -146473 -519607 -732429 -492238 -252673
23504 -252673 -456789 -646738 -210768 123518 -32794 -228402 -410870 -383762 -253759 -349510
$$ packed form
23579f40730j13616q0645q02J49396O1569P333O7488J06574r3771Q6856P3279
23568c77069l3397K19481j34619r7528o8666L1845J24089k20333R6519J41401
23558c18277M4405n0471k96205M2852O814M8680N2036j39679j7909J51113r865
23547d86506K8676L9869l2897J54320L09832O4081j31599k2007K4956J57275l7913
23536F8087j76760k97177J48610K54485J16282l44986k62410K29050K02864P9115
23526A7160l35587j98522R0263J42788q39J46868l35284O2599K68864k30412p6707
23515d48809O8261M1679k9858o1916R3052O4486J26632l73134k12822K40191K39565
23504b52673k04116j89949M35970L34286j56312j95608j82468K7108J30003r5751
$$ plain form
23494 -349510 -401705 -424516 -498046 -542257 -402654 -582417 -439079 -344607 -250269 -251019 -384615
23483 -384615 -362702 -309047 -437400 -445765 -305698 -324946 -475704 -357589 -165626 -106549 -249525
23472 -249525 -398766 -434313 -616025 -691145 -547068 -433812 -375450 -60752 -274049 -375181
23462 -375181 -415228 -359332 -366350 -475820 -753861 -902702 -985266 -765385 -693276 -614745 -609830
23451 -609830 -473313 -224194 -319877 -338572 -314548 -379107 -491549 -423304 -386731 -463301 -636312
23440 -636312 -653574 -543933 -528383 -402035 -519887 -179046 -377284 -496421 -395520 -473861
23430 -473861 -448536 -456176 -500664 -478625 -358481 -270500 -192787 -168840 -109369 -165504 -344367
23419 -344367 -149820 -217456 -484298 -305331 -345416 -555357 -593436 -660593 -543195 -513636
$$ packed form
23494c49510n2195k2811p3530m4211J39603j79763J43338R4472R4338p50j33596
23483c84615K1913N3655j28353q365J40067j9248j50758J18115J91963N9077j42976
23472b49525j49241l5547j81712p5120J44077J13256N8362L14698k13297j01132
23462c75181m0047N5896p018j09470k78041j48841q2564K19881P2109P8531M915
23451f09830J36517K49119r5683j8695K4024o4559j12442O8245L6573p6570j73011
23440f36312j7262J09641J5550J26348j17852L40841j98238j19137J00901p8341
23430d73861K5325p640m4488K2039J20144Q7981P7713K3947N9471n6135j78863
23419c44367J94547o7636k66842J78967m0085k09941l8079o7157J17398K9559
$$ plain form
23409 -513636 -586108 -508856 -527553 -332329 -20338 112501 -120158 -334499 -294101 -262682
23399 -262682 -159564 -202855 -497281 -762023 -877722 -737870 -387674 -387248 -529887 -589681
23389 -589681 -718173 -798060 -625810 -228737 194930 220347 85059 -125578 -245916 -210326
23379 -210326 -436745 -519963 -318179 -335339 -361769 -469057 -564792 -653944 -439683 -442511 -427836
23368 -427836 -518478 -751347 -875966 -899139 -822358 -552641 -392703 -365487 -399095 -253818
23358 -253818 -179211 64634 113600 -189406 -155002 -115933 -89635 -369050 -388344 -238123 -269452
23347 -269452 -271948 -97903 59443 -148581 -380133 -671734 -677980 -486120 -437303 -487935 -487575
23336 -487575 -347968 -165051 -238722 -455137 -508760 -501295 -299508 -139726 -185896 -86703 -246941
$$ packed form
23409e13636p2472P7252j8697J95224L11991J32839k32659k14341M0398L1419
23399b62682J03118m3291k94426k64742j15699J39852L50196M26j42639n9794
23389e89681j28492p9887J72250L97073M23667K5417j35288k10637j20338L5590
23379b10326k26419q3218K01784j7160k6430j07288r5735q9152K14261k828J4675
23368d27836r0642k32869j24619k3173P6781K69717J59938K7216l3608J45277
23358b53818P4607K43845M8966l03006L4404L9069K6298k79415j9294J50221l1329
23347b69452k496J74045J57346k08024k31552k91601o246J91860M8817n0632L60
23336d87575J39607J82917p3671k16415n3623P465K01787J59782m6170R9193j60238
$$ plain form
23325 -246941 -195563 -376497 -442585 -582059 -682550 -571791 -454583 -94020 4204 -53660
23315 -53660 -227245 7341 -61441 102077 149607 -164676 -97256 -333903 -531035 -364046
23305 -364046 -257617 -481998 -564834 -603127 -505281 -607853 -514361 -297575 -404906 -519222
23295 -519222 -568623 -383122 -305886 -145988 12517 29127 68586 102008 155551 -199577 -415845
23284 -415845 -285657 -414118 -682916 -651708 -316085 -293894 -497631 -464403 -662682 -645780
23274 -645780 -432281 -492349 -580450 -730172 -570447 -731490 -459751 -153802 -362491 -308309
23264 -308309 -318145 -682685 -672841 -596207 -791536 -891414 -995941 -880654 -789728 -770859 -625114
23253 -625114 -346295 -418024 -347492 -376194 -339969 -316589 -290142 -247147 -291041 -208157 -58273
$$ packed form
23325b46941N1378j80934o6088j39474j00491J10759J17208L60563R8224n7864
23315e3660j73585K34586o8782J63518M7530l14283O7420k36647j97132J66989
23305c64046J06429k24381q2836l8293R7846j02572R3492K16786j07331j14316
23295e19222m9401J85501P7236J59898J58505J6610L9459L3422N3543l55128k16268
23284d15845J30188j28461k68798L1208L35623K2191k03737L3228j98279J6902
23274f45780K13499o0068q8101j49722J59725j61043K71739L05949k08689N4182
23264c08309r836l64540R844P6634j95329r9878j04527J15287R0926J8869J45745
23253f25114K78819p1729P0532k8702L6225K3380K6447M2995m3894Q2884J49884
$$ plain form
23242 -58273 106555 -116977 -67039 -65137 -373538 -310598 27734 61056 43119 -167616 -519715
23231 -519715 -515999 -362169 -340133 -535477 -469636 -410213 -110054 184149 -102058 -259054
23221 -259054 -163278 -115238 -164482 -475287 -687716 -578032 -635433 -656366 -576979 -679480 -594786
23210 -594786 -637951 -771098 -720158 -364271 -451773 -365648 -360936 -410536 -257963 -116885 -221781
23199 -221781 -47061 -266303 -327047 -243294 -201000 -457195 -690461 -556661 -618957 -750279
23189 -750279 -676400 -527194 -623253 -486581 -197817 -269614 -516376 -546618 -287412 -277293
23179 -277293 -428980 -490893 -472063 -396131 -425917 -306103 -33548 162179 110711 -299523
23169 -299523 -726189 -899254 -609436 -331891 -333715 -475209 -327759 -89367 -194913 -343027
$$ packed form
23242e8273J64828k23532M9938J902l08401O2940L38332L3322j7937k10735l52099
23231e19715L716J53830K2036j95344O5841N9423L00159K94203k86207j56996
23221b59054R5776M8040m9244l10805k12429J09684n7401k0933P9387j02501Q4694
23210e94786m3165j33147N0940L55887q7502Q6125M712m9600J52573J41078j04896
23199b21781J74720k19242o0744Q3753M2294k56195k33266J33800o2296j31322
23189g50279P3879J49206r6059J36672K88764p1797k46762l0242K59206J0119
23179b77293j51687o1913J8830P5932k9786J19814K72555J95727n1468m10234
23169b99523m26666j73065K89818K77545j824j41494J47450K38392j05546j48114
$$ plain form
23159 -343027 -363587 -474962 -580915 -587378 -397791 -134449 -235597 -294967 -662693 -658629 -547922
23148 -547922 -609857 -662327 -616575 -528251 -345728 -442985 -390568 -460846 -789742 -875974 -800022
23137 -800022 -662756 -823354 -905285 -709398 -435746 -270113 -316711 -309980 -206723 -276104
23127 -276104 -250647 -268554 -319300 -372177 -381996 -353228 -274307 -349842 -327979 -162248 44837
23116 44837 159363 -55044 -286816 -249613 -112105 -44504 -352241 -553419 -537117 -312447
23106 -312447 -139590 -290591 -492053 -449956 -318601 -343132 -486402 -580495 -545187 -521407
23096 -521407 -786782 -875291 -863716 -677850 -758012 -795103 -506169 -408301 -429772 -591481 -362947
23085 -362947 -318102 -526360 -503701 -557228 -684803 -580097 -445332 -705277 -732417 -641080
$$ packed form
23159c43027k0560j11375j05953o463J89587K63342j01148n9370l67726M064J10707
23148e47922o1935n2470M5752Q8324J82523r7257N2417p0278l28896q6232P5952
23137h00022J37266j60598q1931J95887K73652J65633m6598O731J03257o9381
23127b76104K5457j7907n0746n2877r819K8768P8921p5535K1863J65731K07085
23116D4837J14526k14407k31772L7203J37508O7601l07737k01178J6302K24670
23106c12447J72857j51001k01462M2097J31355k4531j43270r4093L5308K3780
23096e21407k65375q8509J1575J85866q0162l7091K88934R7868k1471j61709K28534
23085c62947M4845k08258K2659n3527j27575J04706J34765k59945k7140R1337
$$ plain form
23075 -641080 -412838 -346790 -269712 -162558 -298130 -394251 -279223 -94348 -226858 -476179
23065 -476179 -569698 -661285 -805598 -695076 -699525 -698494 -920187 -951252 -816536 -922870 -813242
23054 -813242 -474166 -512897 -37605 4147 -64306 -6308 6428 1373 -262045 -494719 -685936
23043 -685936 -954643 -950359 -674215 -519830 -499500 -436182 -390474 -389834 -369179 -467457 -347124
23032 -347124 -188778 -76478 -215665 -195300 -70350 95606 19150 -169700 -268322 -291539
23022 -291539 -436095 -204787 -58898 -102813 -408996 -610985 -413503 49465 165050 315607
23012 315607 152981 -269547 -318155 -379149 -355013 -308771 -364005 -460890 -446238 -331387 -683747
23001 -683747 -773513 -595634 -660625 -785912 -525768 -469089 -525713 -294225 -132512 -198874
$$ packed form
23075f41080K28242O6048P7078J07154j35572r6121J15028J84875j32510k49321
23065d76179r3519r1587j44313J10522m449J031k21693l1065J34716j06334J09628
23054h13242L39076l8731M75292M1752o8453N7998J2736n055k63418k32674j91217
23043f85936k68707M284K76144J54385K0330O3318M5708O40K0655r8278J20333
23032c47124J58346J12300j39187K0365J24950J65956p6456j88850r8622k3217
23022b91539j44556K31308J45889m3915l06183k01989J97482M62968J15585J50557
23012C15607j62626m22528m8608o0994K4136M6242n5234r6885J4652J14851l52360
23001f83747q9766J77879o4991j25287K60144N6679n6624K31488J61713o6362
$$ plain form
22991 -198874 -392176 -250883 -337707 -544949 -378117 -482686 -329585 -321706 -296458 -353951
22981 -353951 -333966 -345171 -525869 -702569 -613676 -360895 -233270 -110191 -177741 -394064
22971 -394064 -482094 -724278 -727295 -554899 -426656 -124977 -51654 -228784 -175504 -210725 -378531
22960 -378531 -438804 -516198 -871114 -874268 -589624 -396087 -330418 -357727 -340600 -365739 -392560
22949 -392560 -574813 -580168 -477637 -565491 -848259 -972377 -740541 -711347 -686393 -798069
22939 -798069 -591162 -323838 -299225 -240701 -186558 -359343 -358088 -171389 -287463 -321297 -374953
22928 -374953 -354747 -227433 -368258 -640364 -529708 -383106 -577469 -653524 -728687 -962312
22918 -962312 -707727 -469773 -466635 -126625 -146976 -413129 -311960 -316891 -272270 -351025 -576963
$$ packed form
22991a98874j93302J41293q6824k07242J66832j04569J53101P879K5248n7493
22981c53951J9985j1205j80698j76700Q8893K52781J27625J23079o7550k16323
22971c94064q8030k42184l017J72396J28243L01679P3323j77130N3280l5221j67806
22960c78531o0273p7394l54916l154K84644J93537O5669k7309J7127k5139k6821
22949c92560j82253n355J02531q7854k82768j24118K31836K9194K4954j11676
22939g98069K06907K67324K4613N8524N4143j72785J255J86699j16074l3834n3656
22928c74953K0206J27314j40825k72106J10656J46602j94363p6055p5163k33625
22918i62312K54585K37954L138L40010k0351k66153J01169m931M4621p8755k25938
$$ plain form
22907 -576963 -479804 -187220 -131061 -360154 -426526 -515205 -490871 -378116 -287144 -161949 -202228
22896 -202228 -337536 -625714 -892765 -948965 -497260 -280298 -354567 -368366 -355936 -668787
22886 -668787 -775542 -760792 -661970 -382936 -318315 -435070 -614912 -1013456 -965725 -922737
22876 -922737 -908763 -925005 -793823 -670852 -658723 -812228 -639267 -593179 -711876 -833658
22866 -833658 -726771 -488191 -510526 -583838 -518960 -574970 -420946 -243803 28046 248485
22856 248485 51909 -145421 -246117 -317698 -521909 -522448 -678096 -673797 -629768 -453955 -684615
22845 -684615 -836667 -754056 -699081 -639394 -475850 -540526 -816199 -849072 -918835 -958754 -937443
22834 -937443 -841767 -834740 -885278 -680090 -661711 -630915 -874469 -986097 -783280 -518810 -679105
$$ packed form
22907e76963R7159K92584N6159k29093o6372q8679K4334J12755R0972J25195m0279
22896b02228j35308k88178k67051n6200M51705K16962p4269j3799J2430l12851
22886f68787j06755J4750R8822K79034O4621j16755j79842l98544M7731M2988
22876i22737J3974j6242J31182J22971J2129j53505J72961M6088j18697j21782
22866h33658J06887K38580k2335p3312O4878n6010J54024J77143K71849K20439
22856B48485j96576j97330j00696p1581k04211n39j55648M299M4029J75813k30660
22845f84615j52052Q2611N4975N9687J63544o4676k75673l2873o9763l9919K1311
22834i37443R5676P027n0538K05188J8379L0796k43554j11628K02817K64470j60295
$$ plain form
22823 -679105 -841924 -849948 -762838 -653089 -582986 -545707 -616916 -313829 -125714 -379194 -528625
22812 -528625 -426521 -601394 -580919 -303129 -161598 -403402 -430272 -288866 -138498 -30454
22802 -30454 -283431 -659971 -739240 -566668 -495245 -508952 -559405 -579463 -454731 -273632 -520665
22791 -520665 -1004534 -889338 -764746 -441990 -130440 -147732 -115080 -186094 -183135 -190846 -434075
22780 -434075 -210119 -53029 -440264 -608649 -420227 -205370 76235 144385 -66827 -173894
22770 -173894 -185769 -216501 -202813 -161413 30456 -83661 -26951 185317 41027 -318575
22760 -318575 -491535 -609425 -773090 -738915 -462767 -354815 -410589 -543565 -515947 -528274
22750 -528274 -476414 -368961 -404115 -235398 -191909 -313902 -535543 -586601 -583296 -549356 -635164
$$ packed form
22823f79105j62819q024Q7110J09749P0103L7279p1209L03087J88115k53480j49431
22812e28625J02104j74873K0475K77790J41531k41804k6870J41406J50368J08044
22802c0454k52977l76540p9269J72572P1423j3707n0453k0058J24732J81099k47033
22791e20665m83869J15196J24592L22756L11550j7292L2652p1014K959p711k43229
22780d34075K23956J57090l87235j68385J88422K14857K81605O8150k11212j07067
22770a73894j1875l0732J3688M1400J91869j14117N6710K12268j44290l59602
22760c18575j72960j17890j63665L4175K76148J07952n5774j32976K7618j2327
22750e28274N1860J07453l5154J68717M3489j21993k21641n1058L305L3940q5808
$$ plain form
22739 -635164 -809331 -879870 -731999 -129763 -102834 -17598 -358825 -810951 -694284 -490813
22729 -490813 -668693 -784738 -621153 -582870 -610954 -750095 -593219 -302533 -106639 -563214
22719 -563214 -811087 -634443 -515502 -496492 -773078 -853365 -898498 -711304 -505675 -637262
22709 -637262 -870615 -1058320 -1111818 -1076837 -908942 -637528 -676638 -621905 -493615 -347457
22699 -347457 -141928 -131511 21028 -91624 1579 -309080 -300210 -369684 -337247 -340645 -403777
22688 -403777 -768734 -756742 -786530 -766328 -466201 -529719 -451545 -125043 -128726 -291988 -758799
22677 -758799 -696880 -323125 -172965 -453373 -537538 -633686 -567879 -304108 -146116 -199226
22667 -199226 -237017 -251431 -444745 -314555 -227973 -234723 -328514 -313916 -109425 -71558 -47708
$$ packed form
22739f35164j74167p0539J47871O02236K6929Q5236l41227m52126J16667K03471
22729d90813j77880j16045J63585L8283k8084j39141J56876K90686J95894m56575
22719e63214k47873J76644J18941J9010k76586q0287m5133J87194K05629j31587
22709f37262k33353j87705n3498L4981J67895K71414l9110N4733J28290J46158
22699c47457K05529J0417J52539j12652R3203l10659Q870o9474L2437l398o3132
22688d03777l64957J1992k9788K0202L00127o3518P8174L26502l683j63262m66811
22677g58799O1919L73755J50160k80408q4165r6148O5807K63771J57992n3110
22667a99226l7791j4414j93314J30190Q6582o750r3791J4598K04491L7867K3850
$$ plain form
22656 -47708 -369090 -306083 -311739 -452118 -213358 -97644 -368918 -497069 -292146 -373638
22646 -373638 -307827 -305023 -471593 -397899 -122587 -277997 -524793 -639408 -432145 -354105
22636 -354105 -488422 -582285 -563730 -367343 -345515 -482013 -533341 -655867 -596284 -516026 -627968
22625 -627968 -785534 -724941 -555788 -318286 -376842 -224626 -490507 -592010 -260221 -327090
22615 -327090 -232472 -270013 -256436 -343309 -353333 -360635 -538678 -746475 -815723 -896114 -801438
22604 -801438 -664873 -568428 -692020 -905057 -934188 -938931 -973152 -755519 -650908 -461172
22594 -461172 -255782 -160486 -436538 -558853 -794301 -748748 -895512 -624495 -174548 -252897
22584 -252897 -535848 -437791 -593547 -510486 -221186 -231191 -247506 -293498 -195447 -267345 -473744
$$ packed form
22656d7708l21382O3007n656j40379K38760J15714k71274j28151K04923q1492
22646c73638O5811K804j66570P3694K75312j55410k46796j14615K07263P8040
22636c54105j34317r3863J8555J96387K1828j36498n1328j22526N9583Q0258j11942
22625f27968j57566O0593J69153K37502n8556J52216k65881j01503L31789o6869
22615c27090R4618l7541J3577q6873j0024p302j78043k07797o9248q0391R4676
22604h01438J36565R6445j23592k13037k9131m743l4221K17633J04611J89736
22594d61172K05390R5296k76052j22315k35448M5553j46764K71017M49947p8349
22584b52897k82951R8057j55756Q3061K89300j0005j6315m5992R8051p1898k06399
$$ plain form
22573 -473744 -626759 -787552 -461058 -298209 -355998 -368305 -437537 -197760 -24920 -416847
22563 -416847 -576873 -496007 -465228 -301421 -130877 -274937 -357973 -377329 -531743 -649907
22553 -649907 -413820 -587208 -559465 -163040 -224486 -417893 -451815 -645533 -922807 -1030303
22543 -1030303 -753665 -321244 -408167 -662761 -616127 -448268 -479907 -431544 -601398 -760067
22533 -760067 -788891 -516908 -512823 -245585 -346231 -267761 -5787 47595 5493 -22641 -189793
22522 -189793 -375507 -502369 -535466 -479939 -342586 -225039 -466585 -737025 -791849 -603013
22512 -603013 -594090 -601484 -616347 -547118 -596939 -722778 -795579 -823380 -753050 -794322 -895579
22501 -895579 -810116 -736261 -495594 -455915 -454317 -289243 -475762 -622316 -652659 -563399 -323375
$$ packed form
22573d73744j53015j60793L26494J62849n7789j2307o9232K39777J72840l91927
22563d16847j60026Q0866L0779J63807J70544j44060q3036j9356j54414j18164
22553f49907K36087j73388K7743L96425o1446j93407l3922j93718k77274j07496
22543a030303K76638M32421q6923k54594M6634J67859l1639M8363j69854j58669
22533g60067k8824K71983M085K67238j00646P8470K61974N3382m2102k8134j67152
22522a89793j85714j26862l3097N5527J37353J17547k41546k70440n4824J88836
22512f03013Q923p394j4863O9229m9821j25839p2801k7801P0330m1272j01257
22501h95579Q5463P3855K40667L9679J598J65074j86519j46554l0343Q9260K40024
$$ plain form
22490 -323375 -296981 -225356 -158634 -313850 -355615 -424724 -575518 -382998 -336610 -473021 -357972
22479 -357972 -138395 -222752 -405881 -591901 -447071 -110622 162674 -68586 -51361 -130240
22469 -130240 -11600 -41237 244140 413593 246388 267756 275931 57410 -273154 -431073
22459 -431073 -399069 -486016 -553140 -482433 -410754 -191393 -109683 -13442 -56368 -240151 -234662
22448 -234662 -11702 -126804 -554273 -519098 -61550 150327 -157213 -444125 -397577 -282802
22438 -282802 -232942 -218794 -42770 78149 79990 -200784 -163594 36067 -83679 -400651
22428 -400651 -491526 -460942 -463929 -510566 -411938 -307816 -123308 9731 -143382 6759 -257814
22417 -257814 -565022 -510764 -591206 -461224 -370888 -366408 -441552 -622037 -519538 -501249 -467061
$$ packed form
22490c23375K6394P1625O6722j55216m1765o9109j50794J92520M6388j36411J15049
22479c57972K19577q4357j83129j86020J44830L36449K73296k31260J7225p8879
22469a30240J18640k9637K85377J69453j67205K1368Q175k18521l30564j57919
22459d31073L2004q6947o7124P0707P1679K19361Q1710R6241m2926j83783N489
22448b34662K22960j15102m27469L5175M57548K11877l07540k86912M6548J14775
22438b82802M9860J4148J76024J20919J841k80774L7190J99661j19746l16972
22428d00651r0875L0584k987m6637R8628J04122J84508J33039j53113J50141k64573
22417b57814l07208N4258q0442J29982R0336M480p5144j80485J02499J8289L4188
$$ plain form
22406 -467061 -501249 -410406 -379448 -619214 -756929 -417639 -350463 -275510 -145095 -328631
22396 -328631 -493235 -550488 -509170 -364058 -488217 -466363 -576321 -568435 -746326 -631143
22386 -631143 -585126 -547219 -283732 -81244 -141523 -486255 -796830 -783798 -475767 -474437 -601185
22375 -601185 -455872 -428818 -198582 -241877 -346893 -749269 -707721 -658128 -666209 -690227 -697668
22364 -697668 -540047 -605993 -691476 -703216 -693548 -567363 -99413 -126108 -106865 -211500 -287077
22353 -287077 -231237 -287682 -302302 -174273 -213874 -372190 -367453 -263745 75166 13636 -264587
22342 -264587 -176602 -124143 -146802 -5502 39338 92659 -196412 -238460 23511 78007 31018
22331 31018 -305268 -404047 -292065 -285586 -281576 -142457 -77454 -67637 -121773 -157099 -451361
$$ packed form
22406d67061l4188R0843L0958k39766j37715L39290O7176P4953J30415j83536
22396c28631j64604n7253M1318J45112j24159K1854j09958P886j77891J15183
22386f31143M6017L7907K63487K02488o0279l44732l10575J3032L08031J330j26748
22375f01185J45313K7054K30236m3295j05016m02376M1548M9593q081k4018p441
22364f97668J57621o5946q5483j1740R668J26185M67950k6695J9243j04635p5577
22353b87077N5840n6445j4620J28029l9601j58316M737J03708L38911o1530k78223
22342b64587Q7985N2459k2659J41300M4840N3321k89071m2048K61971N4496m6989
22331C1018l36286r8779J11982O479M010J39119O5003R817n4136l5326k94262
$$ plain form
22320 -451361 -400539 -513925 -881091 -649485 -336550 -353559 -321785 -87497 -46783 -204068
22310 -204068 -349276 -54390 -121109 -253230 -357209 -561416 -599729 -437162 -349100 -202189
22300 -202189 30386 -50163 66479 -175308 -476461 -375643 -498615 -800842 -693586 -503597
22290 -503597 -394353 -477655 -549970 -280261 -197885 -180267 -247673 -343852 -636049 -686107 -286799
22279 -286799 31096 -13778 -24255 -323459 -558832 -661408 -767191 -887990 -797562 -586033
22269 -586033 -573601 -850874 -800846 -538620 -515140 -329726 -543257 -665704 -330441 -233946
22259 -233946 -320900 -532428 -781750 -725316 -495778 -384145 -442968 -481884 -457285 -419168 -515550
22248 -515550 -685529 -662069 -470229 -232135 -172919 -322557 -513648 -728459 -677332 -575804
$$ packed form
22320d51361N0822j13386l67166K31606L12935j7009L1774K34288M0714j57285
22310b04068j45208K94886o6719j32121j03979k04207l8313J62567Q8062J46911
22300b02189K32575q0549J16642k41787l01153J00818j22972l02227J07256J89989
22290e03597J09244q3302p2315K69709Q2376J7618o7406r6179k92197n0058L99308
22279b86799L17895m4874j0477k99204k35373j02576j05783j20799R0428K11529
22269e86033J2432k77273N0028K62226K3480J85414k13531j22447L35263R6495
22259b33946q6954k11528k49322N6434K29538J11633n8823l8916K4599L8117r6382
22248e15550j69979K3460J91840K38094N9216j49638j91091k14811N1127J01528
$$ plain form
22238 -575804 -751252 -983127 -989958 -1083917 -811895 -472448 -332048 -388668 -562416 -702162
22228 -702162 -874024 -622624 -305441 -263534 -202745 -95431 -97262 -89835 -86473 27726 1875
22217 1875 -48880 -348366 -484761 -505157 -546106 -587468 -482643 -418473 -609086 -673313 -642078
22206 -642078 -552672 -586836 -658007 -785365 -772784 -553590 -641475 -813391 -679596 -526324
22196 -526324 -606449 -538843 -623250 -298615 -229665 -13743 100240 -45361 -171070 -398196
22186 -398196 -341811 -378673 -411494 -282448 -10648 57950 2761 -100608 -147335 -368231 -310377
22175 -310377 -195599 -314376 -535956 -279872 -354308 -639053 -732308 -515217 -155658 -170658
22165 -170658 -308811 -438898 -366686 -172214 -200445 -278460 -87755 -67653 -181385 114609
$$ packed form
22238e75804j75448k31875o831r3959K72022L39447J40400n6620j73748j39746
22228g02162j71862K51400L17183M1907O0789J07314j831P427L362J14199k5851
22217A875n0755k99486j36395k0396m0949m1362J04825O4170j90613o4227L1235
22206f42078Q9406l4164p1171j27358J2581K19194q7885j71916J33795J53272
22196e26324q0125O7606q4407L24635O8950K15922J13983j45601j25709k27126
22186c98196N6385l6862l2821J29046K71800O8598n5189j03369m6727k20896N7854
22175c10377J14778j18777k21580K56084p4436k84745r3255K17091L59559j5000
22165a70658j38153j30087P2212J94472k8231p8015J90705K0102j13732K95994
$$ plain form
22155 114609 159489 142595 134781 174564 126916 -186270 -392987 -306173 -380025 -315687 -279341
22144 -279341 -132862 142921 -48276 -123774 -118236 -335571 -357054 -497769 -561016 -600487 -426512
22133 -426512 -340361 -243059 -234181 -76030 -349633 -325838 -238600 -323240 -440778 -650672 -670411
22122 -670411 -459657 -340719 -543600 -908140 -694582 -444975 -400592 -524381 -512301 -427730
22112 -427730 -457109 -481787 -296991 -122851 -125253 -322493 -301607 -51133 134651 192273 238316
22101 238316 645368 579634 792195 1188235 1584952 1679776 1748717 1910753 1940028 1903864
22091 1903864 1726538 1757492 1943191 1646646 1204671 1097561 1070315 938700 843785 648414
22081 648414 489187 444260 115283 383242 658058 454879 254173 -104298 -184824 -431143
$$ packed form
22155A14609M4880j6894p814L9783m7648l13186k06717Q6814p3852O4338L6346
22144b79341J46479K75783j91197p5498N538k17335k1483j40715o3247l9471J73975
22133d26512Q6151R7302Q878J58151k73603K3795Q7238q4640j17538k09894j9739
22122f70411K10754J18938k02881l64540K13558K49607M4383j23789J2080Q4571
22112d27730k9379k4678J84796J74140k402j97240K0886K50474J85784N7622M6043
22101B38316M07052o5734K12561L96040L96717R4824O8941J62036K9275l6164
22091A903864j77326L0954J85699k96545m41975j07110k7246j31615r4915j95371
22081F48414j59227m4927l28977K67959K74816k03179k00706l58471q0526k46319
$$ plain form
22071 -431143 -524365 -281752 -158277 -319700 -478180 -362191 -152662 316025 460712 297685
22061 297685 7470 -152641 -223924 -62718 154130 95579 21823 120053 -212351 -213001 -23493
22050 -23493 186789 138705 242350 271114 122053 -318174 -580629 -465051 -437827 -471713
22040 -471713 -383081 -386368 -338869 -278808 -207156 -332191 -625513 -630536 -504468 -311757 -149445
22029 -149445 -111539 -210703 -460576 -559469 -449971 -309950 -96743 11334 56490 -129695
22019 -129695 -128232 -198189 -297088 -428947 -282798 -189299 -584381 -643847 -315259 -211947 -262898
22008 -262898 -165366 -79430 -182370 -167475 28327 -40481 -398721 -240710 -230567 -487390
21998 -487390 -677239 -790518 -870214 -531629 -166850 -211223 -313402 -148730 -106956 -161262
$$ packed form
22071d31143r3222K42613J23475j61423j58480J15989K09529M68687J44687j63027
22061B97685k90215j60111p1283J61206K16848n8551p3756R8230l32404o50J89508
22050b3493K10282m8084J03645K8764j49061m40227k62455J15578K7224l3886
22040d71713Q8632l287M7499O0061P1652j25035k93322n023J26068J92711J62312
22029a49445L7906r9164k49873r8893J09498J40021K13207J08077M5156j86185
22019a29695J463o9957r8899j31859J46149R3499l95082n9466L28588J03312n0951
22008b62898R7532Q5936j02940J4895J95802o8808l58240J58011J0143k56823
21998d87390j89849j13279p9696L38585L64779m4373j02179J64672M1774n4306
$$ plain form
21988 -161262 76929 275436 349260 135182 75897 42567 -183189 -473133 -426155 -190438
21978 -190438 -241076 -266069 -221693 58527 152114 32451 105226 142938 6902 -58316 -20348
21967 -20348 73284 -7923 -188960 -430630 -413884 -244204 -307399 -467912 -288549 -144294
21957 -144294 -313691 -460654 -582013 -565862 -334551 -243983 -349172 165978 356409 259589
21947 259589 -2857 -40874 -344126 -487000 -533105 -579636 -677876 -485439 -432680 -428837 -398561
21936 -398561 -409297 -406824 -161350 -272804 -235916 -220024 -226190 -747 38221 -310941 -375813
21925 -375813 -232055 24647 -78674 -414507 -419412 -366081 -255622 -298023 -484598 -449613
21915 -449613 -115070 -171158 -503707 -715139 -647577 -623434 -624804 -787183 -924931 -893882 -968488
$$ packed form
21988a61262K38191J98507P3824k14078n9285l3330k25756k89944M6978K35717
21978a90438n0638k4993M4376K80220R3587j19663P2775L7712j36036o5218L7968
21967b0348R3632q1207j81037k41670J6746J69680o3195j60513J79363J44255
21957a44294j69397j46963j21359J6151K31311R0568j05189N15150J90431r6820
21947B59589k62446l8017l03252j42874m6105m6531r8240J92437N2759L843L0276
21936c98561j0736K473K45474j11454L6888J5892o166K25443L8968l49162o4872
21925c75813J43758K56702j03321l35833m905N3331J10459m2401j86575L4985
21915d49613L34543n6088l32549k11432O7562K4143j370j62379j37748L1049p4606
$$ plain form
21904 -968488 -831949 -718993 -796103 -334371 204524 318487 319144 305287 134134 139268 42691
21893 42691 189363 138619 -350855 -758208 -916246 -862814 -703482 -715807 -889000 -856759
21883 -856759 -688582 -543308 -570087 -531707 -432930 -277487 1867 80166 -223401 -115642
21873 -115642 167309 142682 66157 -170488 -311098 -143529 -355505 -338368 -211918 -342831
21863 -342831 -404357 -200298 -248924 -480990 -457845 -432301 -568901 -456629 -757429 -711581
21853 -711581 -347248 -493450 -635704 -559923 -245577 -80643 -144273 -442641 -653309 -766119
21843 -766119 -924463 -869078 -488852 -91366 -157467 915 172304 174777 206187 362176
21833 362176 388468 91761 -236593 -129289 195961 299535 314780 189304 105631 274021
$$ packed form
21904i68488J36539J12956p7110M61732N38895J13963O57j3857j71153N134r6577
21893D2691J46672n0744m89474m07353j58038N3432J59332j2325j73193L2241
21883h56759J68177J45274k6779L8380R8777J55443K79354P8299l03567J07759
21873a15642K82951k4627p6525k36645j40610J67569k11976J7137J26450j30913
21863c42831o1526K04059m8626k32066K3145K5544j36600J12272l00800M5848
21853g11581L64333j46202j42254P5781L14346J64934o3630k98368k10668j12810
21843g66119j58344N5385L80226L97486o6101J58382J71389K473L1410J55989
21833C62176K6292k96707l28354J07304L25250J03574J5245j25476q3673J68390
$$ plain form
21823 274021 386078 562526 498794 382345 138784 30634 112533 292441 409263 402283
21813 402283 66277 -300083 -225653 74059 -122161 -379897 -368412 -307994 -128710 -323317
21803 -323317 -333583 -168812 -122718 -325407 -322155 -255496 -168171 62488 74685 -3490 170226
21792 170226 483555 670811 409794 214007 -37697 -274170 -394456 -148776 24132 278005
21782 278005 50098 -49196 258064 414000 513293 622573 372479 202217 378151 599683
21772 599683 414000 349586 349366 453354 494090 346873 452524 489482 216487 -238042 -88869
21761 -88869 -17947 95749 135331 24669 -75197 -88111 84571 -76310 -178525 -40504
21751 -40504 137098 141091 300758 310498 188904 238174 239851 72917 -67431 119005 242678
$$ packed form
21823B74021J12057J76448o3732j16449k43561j08150Q1899J79908J16822o980
21813D02283l36006l66360P4430K99712j96220k57736J1485O0418J79284j94607
21803c23317j0266J64771M6094k02689L252O6659Q7325K30659J2197p8175J73716
21792A70226L13329J87256k61017j95787k51704k36473j20286K45680J72908K53873
21782B78005k27907r9294L07260J55936R9293J09280k50094j70262J75934K21532
21772E99683j85683o4414k20J03988M0736j47217J05651L6958k72995m54529J49173
21761h8869P0922J13696L9582j10662r9866j2914J72682j60881j02215J38021
21751d0504J77602L993J59667R740j21594M9270J677j66934j40348J86436J23673
$$ plain form
21740 242678 104667 -74363 -117962 -99721 -19724 67434 305078 522620 356248 53805
21730 53805 4240 -1015 -471626 -612066 -407625 -73205 -142730 -180782 -313410 -428371 -283253
21719 -283253 67441 90882 242593 209571 192580 56165 163149 151879 20239 -65952
21709 -65952 -221721 -222194 -214893 -303539 -271858 -336792 -355255 -450918 -454444 -380055 -524792 -590616
21697 -590616 -608402 -255351 -162437 -412323 -474564 -405486 -427640 -204676 -175378 -153320 -15371
21686 -15371 199531 351775 159132 -122582 -252352 -35919 300743 396398 408692 442077
21676 442077 334624 213750 32011 14118 -30368 47570 34546 45340 -143813 -329457
21666 -329457 -335228 -224836 -6317 18567 150489 183782 37537 99803 9687 271609 421715
$$ packed form
21740B42678j38011j79030m3599J8241P9997Q7158K37644K17542j66372l02443
21730E3805m9565n255m70611j40440K04441L34420o9525l8052j32628j14961J45118
21719b83253L50694K3441J51711l3022j6991j36415J06984j1270j31640q6191
21709f5952j55769m73P301q8646L1681o4934j8463r5663l526P4389j44737o5824
21697e90616j7786L53051R2914k49886o2241O9078k2154K22964K9298K2058J37949
21686a5371K14902J52244j92643k81714j29770K16433L36662R5655J2294L3385
21676D42077j07453j20874j81739j7893m4486P7938j3024J0794j89153j85644
21666c29457n771J10392K18519K4884J31922L3293j46245O2266r0116K61922J50106
$$ plain form
21655 421715 467652 445803 331342 189937 24243 228147 522018 651691 727054 507977
21645 507977 405958 575998 643392 656508 622488 596502 655173 847896 1102877 1097458 1012518
21634 1012518 916048 695724 797298 874951 678613 499085 675275 871098 622512 572756
21624 572756 630245 701157 447209 671704 982223 989205 1030027 893835 978842 1060337 832930
21613 832930 922783 1002165 1107142 844313 805305 868403 1112846 1134350 1300273 1433922
21603 1433922 1284328 1199518 1554084 1675067 1211347 641698 623477 1056927 961851 871516
21593 871516 980980 1174144 1127030 1204045 1294633 1317677 1457904 1458907 1346574 1666387 1986552
21582 1986552 2149804 2316507 2606519 2535418 2444376 2506036 2763147 3065225 3195471 3297676
$$ packed form
21655D21715M5937k1849j14461j41405j65694K03904K93871J29673P5363k19077
21645E07977j02019J70040O7394J3116l4020k5986N8671J92723K54981n419q4940
21634A012518r6470k20324J01574P7653j96338j79528J76190J95823k48586m9756
21624E72756N7489P0912k53948K24495L10519O982M0822j36192Q5007Q1495k27407
21613H32930Q9853P9382J04977k62829l9008O3098K44443K1504J65923J33649
21603A433922j49594q4810L54566J20983m63720n69649j8221M33450r5076r0335
21593H71516J09464J93164m7114P7015R0588K3044J40227J003j12333L19813L20165
21582A986552J63252J66703K90012p1101r1042O1660K57111L02078J30246J02205
$$ plain form
21572 3297676 3457317 3674399 3808068 4107720 4184307 4612027 5363214 6226693 6950492 7543972
21562 7543972 7758339 8205964 8853497 9598364 9949185 10255664 10456528 10913029 11291158
21553 11291158 11713900 11735936 12218297 12798904 13484292 14004017 14716696 15779602 16905909
21544 16905909 18408248 20037988 21963422 24303239 27106648 30922342 36278401 44031266
21536 44031266 54893026 69546105 89735520 115450379 144686085 175420111 209315584
21529 209315584 251294699 305956601 367420054 419058526 449792230 463318363 477666060
21522 477666060 505017753 533580681 538533095 507631824 452950254 400477206 363948084
21515 363948084 335996945 302745673 259308382 212715693 173154725 144078193 122952745
$$ packed form
21572C297676J59641K17082J33669K99652P6587M27720P51187Q63479P23799N93480
21562G543972K14367M47625O47533P44867L50821L06479K00864M56501L78129
21553A1291158M22742K2036M82361N80607O85388N19725P12679J062906J126307
21544A6905909J502339J629740J925434K339817K803409L815694N356059P752865
21536D4031266J0861760J4653079K0189415K5714859K9235706L0734026L3895473
21529B09315584M1979115N4661902O1463453N1638472L0733704J3526133J4347697
21522D77666060K7351693K8562928M952414l0901271n4681570n2473048l6529122
21515C63948084k7951139l3251272m3437291m6592689l9560968k9076532k1125448
$$ plain form
21508 122952745 107267175 95690408 87053167 79818366 73478855 68101980 63870079 60638556
21500 60638556 57457352 54781981 52389235 50073346 48293000 46741163 44898463 43085726
21492 43085726 41848859 40718792 39623548 38321129 37205709 36085654 35006422 33623598
21484 33623598 32443256 31359815 30479791 29442206 28039392 26861955 25590305 24644664
21476 24644664 24004234 23179104 22199873 21243986 20573279 19768924 18834673 18210545 17468682
21467 17468682 16557419 15972700 15542603 14976374 14847475 14701807 14182884 13509076 13021026
21458 13021026 12599320 11986477 11867854 11572346 11022194 10829605 10623402 10245422 9913730
21449 9913730 9636639 9274750 9097520 8787290 8626645 8520637 8332746 8413517 8089794 7926901
$$ packed form
21508A22952745j5685570j1576767q637241p234801o339511n376875m231901l231523
21500F0638556l181204k675371k392746k315889j780346j551837j842700j812737
21492D3085726j236867j130067j095244j302419j115420j120055j079232j382824
21484C3623598j180342j083441q80024j037585j402814j177437j271650r45641
21476B4644664o40430q25130r79231r55887o70707q04355r34251o24128p41863
21467A7468682r11263n84719m30097n66229j28899j45668n18923o73808m88050
21458A3021026m21706o12843j18623k95508n50152j92589k06203l77980l31692
21449I913730k77091l61889j77230l10230j60645j06008j87891Q0771l23723j62893
$$ plain form
21439 7926901 7489467 6975696 6979210 6859473 6657451 6415889 6166430 6021922 5858598 5655279
21429 5655279 5442298 5380120 5179694 5222973 4906524 4682440 4754985 4948488 4778460 4510253
21419 4510253 4528303 4214996 3887318 3658199 3548914 3513321 3457133 3374053 3410580 3372887
21409 3372887 3213366 3153144 3081256 2998349 2956426 3009491 2908210 2690546 2644736 2548989 2505602
21398 2505602 2502318 2457746 2426432 2453378 2520712 2553213 2509397 2769997 2831553 2922215 2517621
21387 2517621 2451579 2553094 2457692 2307971 2207325 2175836 2119442 2201858 2273053 2441589
21377 2441589 2380180 2411675 2174687 1851447 1687407 1630996 1571468 1445062 1401162 1343225
21367 1343225 1234186 1286063 1509162 1470904 1465994 1535403 1605855 1665353 1449421 1122006 1063338
$$ packed form
21439G926901m37434n13771L514j19737k02022k41562k49459j44508j63324k03319
21429E655279k12981o2178k00426M3279l16449k24084P2545J93503j70028k68207
21419D510253J8050l13307l27678k29119j09285l5593n6188q3080L6527l7693
21409C372887j59521o0222p1888q2907m1923N3065j01281k17664m5810r5747m3387
21398B505602l284m4572l1314K6946O7334L2501m3816K60600O1556R0662m04594
21387B517621o6042J01515r5402j49721j00646l1489n6394Q2416P1195J68536
21377B441589o1409L1495k36988l23240j64040n6411n9528j26406m3900n7937
21367A343225j09039N1877K23099l8258m910O9409P0452N9498k15932l27415n8668
$$ plain form
21356 1063338 1062787 1378251 1580321 1348801 1090441 900655 729728 596134 851986 667930
21346 667930 408773 247695 363717 520299 467619 564011 634496 430355 84599 59735
21336 59735 350146 312647 -51400 -43182 240736 240230 95931 192516 259638 165294 356841
21325 356841 350127 251146 -13894 82286 98584 104471 73416 65435 -119150 -44178 240057
21314 240057 582325 602306 403463 468641 588546 539940 235804 90965 189781 516107
21304 516107 599163 272847 67672 561444 797362 584032 703910 403224 268676 306876
21294 306876 187571 371184 565449 553457 305327 -25606 -165071 -140231 -87951 -83380
21284 -83380 9601 30011 -10462 -228688 -166812 -116056 -144027 -212222 -491084 -539780 -265666
$$ packed form
21356A063338n51L15464K02070k31520k58360j89786j70927j33594K55852j84056
21346F67930k59157j61078J16022J56582n2680R6392P0485k04141l45756k4864
21336E9735K90411l7499l64047Q218K83918n06j44299R6585O7122r4344J91547
21325C56841o714r8981k65040R6180J6298N887l1055p981j84585P4972K84235
21314B40057L42268J9981j98843O5178J19905m8606l04136j44839R8816L26326
21304E16107Q3056l26316k05175M93772K35918k13330J19878l00686j34548L8200
21294C06876j19305J83613J94265j1992k48130l30933j39465K4840N2280M571
21284h3380R2981K0410m0473k18226O1876N0756k7971o8195k78862m8696K74114
$$ plain form
21273 -265666 -58125 200016 22632 -143790 105026 23681 -310412 -244293 -231053 -305088
21263 -305088 -370266 21558 91245 73937 65238 104955 357228 284669 153525 115398 33126
21252 33126 252783 317328 60580 -34444 -130993 -224250 45510 72407 11476 -160373 -225344
21241 -225344 -158695 -159163 -389608 -437151 -518068 -493371 -640465 -710173 -883347 -1026436 -778700
21230 -778700 -707977 -487612 -419659 -165604 -323419 -470663 -229693 -207780 -444955 -327465
21220 -327465 -404418 -536281 -566673 -444032 -670517 -816971 -977436 -1040144 -1020821 -657068
21210 -657068 -359606 -331508 -348300 -552727 -519057 -357838 -505181 -303459 -52743 -150848
21200 -150848 -247618 -384052 -346536 17338 132627 274826 -27955 -115612 22968 -41066
$$ packed form
21273b65666K07541K58141j77384j66422K48816q1345l34093O6119J3240p4035
21263c05088o5178L91824O9687j7308q699L9717K52273p2559j31144l8127q2272
21252C3126K19657O4545k56748r5024r6549r3257K69760K6897o0931j71849o4971
21241b25344O6649m68k30445m7543q0917K4697j47094o9708j73174j43089K47736
21230g78700P0723K20365O7953K54055j57815j47244K40970K1913k37175J17490
21220c27465p6953j31863l0392J22641k26485j46454j60465o2708J9323L63753
21210f57068K97462K8098j6792k04427L3670J61219j47343K01722K50716r8105
21200a50848r6770j36434L7516L63874J15289J42199l02781q7657J38580o4034
$$ plain form
21190 -41066 -372005 -309197 -279777 -331444 -367585 -560750 -741326 -658594 -580338 -705940 -558601
21179 -558601 -304503 -328317 -438645 -382404 -411394 -301757 -476900 -399728 -337709 -321833 -243679
21168 -243679 -210463 -225801 -199235 -402138 -425608 -346163 -331705 -464259 -678379 -589810 -448923
21157 -448923 -405084 -420027 -381465 -286499 -268327 -253060 -152384 -58734 -99026 -205285 -450013
21146 -450013 -529237 -464809 -557184 -407475 -414008 -431464 -336061 -327287 -292261 -340428 -304894 -469434
21134 -469434 -333096 -179351 -209258 -93761 -69898 -139853 -113024 -295737 -236104 -131792
21124 -131792 -145085 -206066 -110745 165014 306814 185941 246470 -85677 -328089 -351766
21114 -351766 -218942 -295623 -548712 -555458 -410471 -90422 154116 -10360 -123711 -127433
$$ packed form
21190d1066l30939O2808K9420n1667l6141j93165j80576Q2732P8256j25602J47339
21179e58601K54098k3814j10328N6241k8990J09637j75143P7172O2019J5876P8154
21168b43679L3216j5338K6566k02903k3470P9445J4458j32554k14120Q8569J40887
21157d48923M3839j4943L8562R4966J8172J5267J00676R3650m0292j06259k44728
21146d50013p9224O4428r2375J49709o533j7456R5403Q774L5026m8167L5534j64540
21134d69434J36338J53745k9907J15497K3863o9955K6829j82713N9633J04312
21124a31792j3293o0981R5321K75759J41800j20873O0529l32147k42412k3677
21114c51766J32824p6681k53089o746J44987L20049K44538j64476j13351l722
$$ plain form
21104 -127433 -150411 -332520 -252230 -151929 -237954 -467310 -312894 -369543 -550632 -618889
21094 -618889 -504126 -424483 -454785 -402914 -377605 -127717 48060 8059 -119851 -408897
21084 -408897 -367885 -94325 -46184 -152191 -101304 21063 -292559 -174249 194304 42328
21074 42328 -295968 -473616 -695086 -633585 -494576 -474299 -461898 -287609 -234062 -120429
21064 -120429 -308277 -775382 -988767 -1009204 -952593 -797422 -419073 -130053 70456 -116726
21054 -116726 -121917 -268694 -310361 -80891 69521 130327 63692 16891 148351 261745 -85162
21043 -85162 -289611 -42596 93380 218335 73645 15785 24443 -54924 -252507 -433125
21033 -433125 -552618 -752272 -905671 -683910 -448685 -292615 -353071 -68431 205544 200787
$$ packed form
21104a27433k2978j82109Q0290J00301q6025k29356J54416n6649j81089o8257
21094f18889J14763P9643l0302N1871K5309K49888J75777m0001j27910k89046
21084d08897M1012K73560M8141j06007N0887J22367l13622J18310L68553j51976
21074D2328l38296j77648k21470O1501J39009K0277J2401J74289N3547J13633
21064a20429j87848m67105k13385k0437N6611J55171L78349K89020K00509j87182
21054a16726n191j46777m1667K29470J50412O0806o6635m6801J31460J13394l46907
21043h5162k04449K47015J35976J24955j44690n7860Q658p9367j97583j80618
21033d33125j19493j99654j53399K21761K35225J56070o0456K84640K73975m757
$$ plain form
21023 200787 -11062 -293199 -327964 -404281 -253889 -50551 4591 -10352 -72543 -139294 -268636
21012 -268636 -433370 -591533 -513937 -302558 -180308 -45969 -103119 -198337 -266511 -291099
21002 -291099 -340954 -104703 -46315 -197397 -347905 -291784 -222715 -27740 131257 250883
20992 250883 92114 -163237 -166147 -113827 -125347 -246544 -105791 47375 48530 -166889 -188485
20981 -188485 -39902 132222 22221 -231451 -252545 -370673 -551470 -483805 -323402 -378507
20971 -378507 -546600 -309532 -26367 278171 412454 298521 256169 78067 -120271 -207481
20961 -207481 -173727 -344081 -264008 44178 405041 840043 984407 1043419 1381504 1399783
20951 1399783 1343231 1538141 1811593 1982939 2017455 2255178 2502630 2471673 2548080 2401840
$$ packed form
21023B00787k11849k82137l4765p6317J50392K03338N5142j4943o2191o6751j29342
21012b68636j64734j58163P7596K11379J22250J34339n7150r5218o8174k4588
21002b91099m9855K36251N8388j51082j50508N6121O9069J94975J58997J19626
20992B50883j58769k55351k910N2320j1520j21197J40753J53166J155k15419k1596
20981a88485J48583J72124j10001k53672k1094j18128j80797O7665J60403n5105
20971c78507j68093K37068K83165L04538J34283j13933m2352j78102j98338q7210
20961b07481L3754j70354Q0073L08186L60863M35002J44364N9012L38085J8279
20951A399783n6552J94910K73452J71346L4516K37723K47452l0957P6407j46240
$$ plain form
20941 2401840 1791738 1495705 1646318 1415096 1222200 758036 539890 452207 392719 238844
20931 238844 93111 -84293 22280 506254 724291 398666 145281 106856 83433 -69587
20921 -69587 109144 94002 80642 80939 215658 149787 219690 495461 646099 480344 265381
20910 265381 201810 256809 79801 257914 199185 12088 -80225 -181525 245082 557436
20900 557436 493300 192429 367 -146620 -486819 -311430 -61352 191467 280249 64308
20890 64308 90854 -241432 -543634 -479213 -9326 -9101 -361397 -310316 -182682 -190101 -245360
20879 -245360 -156811 -271925 -512238 -323358 -112344 -8155 -84751 -75088 71776 149431
20869 149431 93886 -6316 -165767 -371373 -380500 -234615 -151259 20517 297222 241065
$$ packed form
20941B401840o10102k96033J50613k31222j92896m64164k18146q7683n9488j53875
20931B38844j45733j77404J06573M83974K18037l25625k53385l8425k3423j53020
20921f9587J78731j5142j3360K97J34719o5871O9903K75771J50638j65755k14963
20910B65381o3571N4999j77008J78113n8729j87097r2313j01300M26607L12354
20900E57436o4136l00871j92062j46987l40199J75389K50078K52819Q8782k15941
20890F4308K6546l32286l02202O4421M69887K25l52296N1081J27634p419n5259
20879b45360Q8549j15114k40313J88880K11014J04189p6596R663J46864P7655
20869A49431n5545j00202j59451k05606r127J45885Q3356J71776K76705n6157
$$ plain form
20859 241065 23226 -233228 -411948 -523320 -392598 -409490 -353687 -128500 72706 221269
20849 221269 90382 21867 105096 137728 -130893 17795 154125 7710 268589 301360
20839 301360 43629 -151722 -380333 -268246 -108560 76458 -49431 30515 200246 236692
20829 236692 259005 242675 388235 881394 987579 969152 1160968 1500588 1924627 2271379
20819 2271379 2362018 2331257 2376967 2177655 2104838 2187695 2128853 2073751 2101215 1694884 1346227
20808 1346227 1194533 994995 783239 641441 311874 123753 -59195 39293 195677 489053
20798 489053 488706 549565 429917 295307 441755 38901 -295898 -225349 92423 270603
20788 270603 91287 45540 172306 229267 310690 93111 71157 302761 394802 40203
$$ packed form
20859B41065k17839k56454j78720j11372J30722j6892N5803K25187K01206J48563
20849B21269j30887o8515Q3229L2632k68621J48688J36330j46415K60879L2771
20839C01360k57731j95351k28611J12087J59686J85018j25889P9946J69731L6446
20829B36692K2313j6330J45560M93159J06185j8427J91816L39620M24039L46752
20819B271379R0639l0761M5710j99312p2817Q2857n8842n5102K7464m06331l48657
20808A346227j51694j99538k11756j41798l29567j88121j82948R8488J56384K93376
20798D89053l47O0859j19648j34610J46448m02854l34799P0549L17772J78180
20788B70603j79316m5747J26766N6961Q1423k17579k1954K31604R2041l54599
$$ plain form
20778 40203 -268847 -247670 -130842 -72785 -248028 -167716 -14763 -68505 -187125 -175164 -151147
20767 -151147 -96998 93849 100901 50913 113650 -164793 -233147 -257214 -215436 -167856 -195418
20756 -195418 -361287 -286554 -98615 -32713 56293 161390 52469 24174 182886 286176
20746 286176 325399 258885 238562 -73734 -51420 -248673 -211046 -172604 -215320 -270949 -188795
20735 -188795 -32200 -27474 -272253 -447545 -265086 -91771 -284489 -346365 -463916 -254819
20725 -254819 -178175 -373292 -379988 -458568 -26450 142196 34464 -31265 -279631 -261570 -110202
20714 -110202 -185461 -20158 -245019 -360181 -233109 -242799 -354309 -160380 -29707 -41097
20704 -41097 22275 76307 -46971 -57002 -17776 129872 -104133 -155119 -154305 -89828 -189015
$$ packed form
20778D0203l09050K1177J16828N8057j75243Q0312J52953n3742j18620J1961K4017
20767a51147N4149J90847P052m9988O2737k78443o8354k4067M1778M7580k7562
20756a95418j65869P4733J87939O5902Q9006J05097j08921k8295J58712J03290
20746B86176L9223o6514k0323l12296K2314j97253L7627L8442m2716n5629Q2154
20735a88795J56595M726k44779j75292J82459J73315j92718o1876j17551K09097
20725b54819P6644j95117o696p8580M32118J68646j07732o5729k48366J8061J51368
20714a10202p5259J65303k24861j15162J27072r690j11510J93929J30673j1390
20704d1097O3372N4032j23278j0031L9226J47648k34005n0986Q14O4477r9187
$$ plain form
20693 -189015 -264592 -156985 -335546 -335962 -123847 -215067 27765 -78637 36084 339457
20683 339457 42166 -459955 -449231 -317462 -302385 -526561 -519328 -361792 -261806 -354782 -212416
20672 -212416 -174909 -312194 -315827 -58729 -33817 -70296 -47593 -13161 -45734 -356779 -412568
20661 -412568 -425419 -360019 -357729 -557766 -460805 -301586 -285893 -180505 104689 -26389 -60551
20650 -60551 -232717 -191862 -308258 -294404 -287350 -157097 -353354 -437400 -339747 -219827 -266240
20639 -266240 -433185 -423366 -507239 -587219 -546656 -202292 -172853 -91495 115425 262712 411106
20628 411106 582781 312174 70746 3477 -83561 -102209 2327 16082 11072 244400 324850
20617 324850 168421 -100713 -498493 -672222 -380070 -124885 -161924 -171226 -49549 -84529
$$ packed form
20693a89015p5577J07607j78561m16K12115r1220K42832j06402J14721L03373
20683C39457k97291n02121J0724J31769J5077k24176P233J57536R9986r2976J42366
20672b12416L7507j37285l633K57098K4912l6479K2703L4432l2573l11045n5789
20661d12568j2851O5400K290k00037R6961J59219J5693J05388K85194j31078l4162
20650f0551j72166M0855j16396J3854P054J30253j96257q4046R7653J19920m6413
20639b66240j66945R819q3873p9980M0563L44364K9439Q1358K06920J47287J48394
20628D11106J71675k70607k41428o7269q7038j8648J04536J3755n010K33328Q0450
20617C24850j56429k69134l97780j73729K92152K55185l7039r302J21677l4980
$$ plain form
20607 -84529 8229 382948 566980 398333 492278 403161 282925 188710 179815 216930 396361
20596 396361 103764 26684 108628 190293 101199 -9087 -121 109855 -92037 -96029 -225577
20585 -225577 31814 203641 39685 -50962 -192103 -363037 -338520 -166291 -167787 -114168
20575 -114168 -66135 -226525 -385558 13208 -373240 -891092 -1102272 -848814 -674704 -398259
20565 -398259 -301977 -124190 197276 52922 -125103 51589 214002 269980 278525 83296
20555 83296 -186898 -232760 -178424 -118016 -110339 62446 386957 342827 225018 476605 459109
20544 459109 443248 416649 299231 128625 147411 310398 217229 126634 128162 -37759 -124502
20533 -124502 -160128 -64826 -11833 65323 35828 35808 108894 208446 419782 707499 595558
$$ packed form
20607h4529R2758L74719J84032j68647R3945q9117j20236r4215q895L7115J79431
20596C96361k92597p7080Q1944Q1665q9094j10286Q966J09976k01892l992j29548
20585b25577K57391J71827j63956r0647j41141j70934K4517J72229j496N3619
20575a14168M8033j60390j59033L98766l86448n17852k11180K53458J74110K76445
20565c98259R6282J77787L21466j44354j78025J76692J62413N5978Q545j95229
20555H3296k70194m5862N4336O0408P677J72785L24511m4130j17809K51587j7496
20544D59109j5861k6599j17418j70606J8786J62987r3169r0595J528j65921q6743
20533a24502l5626R5302N2993P7156k9495k0P3086R9552K11336K87717j11941
$$ plain form
20522 595558 277777 152759 174072 271724 518589 572234 441221 527855 361620 580594
20512 580594 735674 649413 332332 525660 458956 342950 198332 147763 21320 -109120
20502 -109120 -106537 -50347 -76966 -69164 9678 57041 -292015 -165457 -60696 -101432 -79185
20491 -79185 -144834 -283299 -222737 -192635 -183337 161014 472830 396065 291585 193576 58089
20480 58089 259775 215718 40080 2259 -205111 -212647 -32792 57430 144207 94987 -175656
20469 -175656 -394397 -431758 -468631 -171628 227102 593119 474860 379488 399647 170444
20459 170444 88915 98285 188015 476991 640366 522307 549477 552731 508607 403753 133599
20448 133599 24764 89287 80724 325289 377828 343277 210838 151096 204628 396784 322543
$$ packed form
20522E95558l17781j25018K1313R7652K46865N3645j31013Q6634j66235K18974
20512E80594J55080q6261l17081J93328o6704j16006j44618n0569j26443j30440
20502a09120K583N6190k6619P802P8842M7363l49056J26558J04761m0736K2247
20491g9185o5649j38465O0562L0102R298L44351L11816p6765j04480r8009j35487
20480E8089K01686m4057j75638l7821k07370p536J79855R0222Q6777m9220k70643
20469a75656k18741l7361l6873K97003L98730L66017j18259r5372K0159k29203
20459A70444q1529R370Q9730K88976J63375j18059K7170L254m4124j04854k70154
20448A33599j08835O4523q563K44565N2539l4551j32439n9742N3532J92156p4241
$$ plain form
20437 322543 244027 383084 385085 276001 385126 651442 681801 396175 128181 170429
20427 170429 388836 283517 161391 494554 732785 757877 657875 831649 1061835 1187512
20417 1187512 1438728 1280665 1260063 1255344 1337213 1299469 1485530 1500846 1338260 1167606
20407 1167606 1292900 1320125 1217815 1135032 932561 865591 983884 938129 891697 1147748
20397 1147748 1486452 1621766 1358828 1306542 1332799 1339479 1417985 1451834 1305514 1268915 1221520
20386 1221520 1062380 841944 785774 918324 1123098 1314940 1404744 1386185 1461954 1329473
20376 1329473 1359630 1555838 1665884 1723906 1721773 1768776 1751257 1713870 1446371 1234695 1302475
20365 1302475 1319521 1578777 1699828 1586478 1453073 1617365 1440195 1609281 2219063 2636693
$$ packed form
20437C22543p8516J39057K001j09084J09125K66316L0359k85626k67994M2248
20427A70429K18407j05319j22126L33163K38231K5092j00002J73774K30186J25677
20417A187512K51216j58063k0602m719Q1869l7744J86061J5316j62586j70654
20407A167606J25294K7225j02310q2783k02471o6970J18293m5755m6432K56051
20397A147748L38704J35314k62938n2286K6257O680P8506L3849j46320l6599m7395
20386A221520j59140k20436n6170J32550K04774J91842Q9804j8559P5769j32481
20376A329473L0157J96208J10046N8022k133M7003j7519l7387k67499k11676O7780
20365A302475J7046K59256J21051j13350j33405J64292j77170J69086O09782M17630
$$ plain form
20355 2636693 2673962 2566694 2552019 2751460 2988269 3240819 3165732 3182874 2962387 2735513
20345 2735513 2722932 2825175 2920658 3146407 3394049 3693127 3583541 3564680 3482122 3859013
20335 3859013 4076765 3972998 4326089 4439655 4423730 4980967 5403860 5551357 5943886 6443321
20325 6443321 6800307 7232761 7507416 7771739 8614880 9467909 9882819 10674865 11985295
20316 11985295 13446491 15050334 16829181 19137744 21754430 24633643 27946321 32105697
20308 32105697 38014718 46253340 58000783 74057225 95293350 121015042 148811113
20301 148811113 178488620 213076417 258256187 315280658 373986593 418408892 445760624
20294 445760624 463488762 482280591 510245492 535315429 536879829 512041210 468708601
$$ packed form
20355B636693L7269j07268j4675J99441K36809K52550p5087J7142k20487k26874
20345B735513j2581J02243R5483K25749K47642K99078j09586j8861q2558L76891
20335C859013K17752j03767L53091J13566j5925N57237M22893J47497L92529M99435
20325F443321L56986M32454K74655K64323Q43141Q53029M14910P92046J310430
20316A1985295J461196J603843J778847K308563K616686K879213L312678M159376
20308C2105697N909021Q238622J1747443J6056442K1236125K5721692K7796071
20301A48811113K9677507L4587797M5179770N7024471N8705935M4422299K7351732
20294D45760624J7728138J8791829K7964901K5069937J564400k4838619m3332609
$$ plain form
20287 468708601 418729886 376201134 342690741 309414312 272100647 231887232 192256745
20280 192256745 158196779 132473565 113999745 100800522 90927104 83062652 76519446
20273 76519446 70725768 65908562 61558818 57834309 54294499 51320428 48839328 46364652
20265 46364652 44105375 42233397 40522147 38818341 37065652 35163549 33640775 32636113
20257 32636113 31410978 29906977 28638101 27772001 26789464 25952273 25145324 23922023 22954690
20248 22954690 22184077 21492173 20963221 20564823 20136167 19302411 18767913 18311478 17845444
20239 17845444 17642169 17466094 17017123 16093927 15438762 14963221 14572956 14251449 14021780
20230 14021780 13701789 13314693 12904109 12500882 12271284 12153818 11938648 11552981 10940694
$$ packed form
20287D68708601m9978715m2528752l3510393l3276429l7313665m0213415l9630487
20280A92256745l4059966k5723214j8473820j3199223r873418p864452o543206
20273G6519446n793678m817206m349744l724509l539810k974071k481100k474676
20265D6364652k259277j871978j711250j703806j752689j902103j522774j004662
20257C2636113j225135j504001j268876q66100r82537q37191q06949j223301r67333
20248B2954690p70613o91904n28952l98398m28656q33756n34498m56435m66034
20239A7845444k03275j76075m48971r23196o55165m75541l90265l21507k29669
20230A4021780l19991l87096m10584m03227k29598j17466k15170l85667o12287
$$ plain form
20221 10940694 10652141 10519081 10042685 9702868 9417800 9349460 9075387 9078671 9033505 9027002
20211 9027002 8744530 8349927 8210222 7941520 7572675 7323501 7206322 6990151 7003742 7046678
20201 7046678 6862142 6593751 6076093 5689494 5604816 5479184 5428236 5405642 5312475 5039968
20191 5039968 4734826 4830808 4876907 4944892 4694126 4366458 4314683 4255652 4173955 4012899
20181 4012899 3896239 3961166 4052808 3723218 3592794 3561245 3614119 3635068 3682476 3623239 3460693
20170 3460693 3467862 3479344 3662199 4038377 4218121 4018682 3851469 3713624 3672604 3480606
20160 3480606 3306208 3349327 3387205 3341957 3413905 3330423 3276443 3307433 3177728 3015605 2791776
20149 2791776 2733934 2671747 2604215 2553368 2294713 2343049 2462067 2471879 2540365 2452894 2202054
$$ packed form
20221A0940694k88553j33060m76396l39817k85068o8340k74073L284m5166o503
20211I027002k82472l94603j39705k68702l68845k49174j17179k16171J3591M2936
20201G046678j84536k68391n17658l86599q4678j25632n0948k2594r3167k72507
20191E039968l05142R5982M6099O7985k50766l27668n1775n9031q1697j61056
20181D012899j16660O4927R1642l29590j30424l1549N2874K0949M7408n9237j62546
20170C460693P169J1482J82855L76178J79744j99439j67213j37845m1020j91998
20160C480606j74398M3119L7878m5248P1948q3482n3980L0990j29705j62123k23829
20149B791776n7842o2187o7532n0847k58655M8336J19018R812O8486q7471k50840
$$ plain form
20138 2202054 2113038 2228365 2327380 2226655 2304806 2291591 2353132 2485137 2518002 2401510
20128 2401510 2455935 2643146 2400712 2139837 2161804 2418740 2115302 1751022 1719151 1648089
20118 1648089 1338991 1537483 1694133 1630759 1464714 1454927 1517636 1257807 1156321 1149360
20108 1149360 1108913 1240901 1175513 940949 759106 974632 1206542 1046454 858158 884892
20098 884892 921074 841028 1091432 1287662 1133381 1117214 927155 1023438 1311782 1343935
20088 1343935 1249992 1313283 1442797 1541949 1409435 1122428 1028148 1302306 1377576 1313401
20078 1313401 1277054 988046 818181 908517 759036 550212 565656 490547 528667 474602
20068 474602 659164 623751 533373 634755 721991 609373 372999 638497 749875 456388
$$ packed form
20138B202054q9016J15327R9015j00725P8151j3215O1541J32005L2865j16492
20128B401510N4425J87211k42434k60875K1967K56936l03438l64280l1871p1062
20118A648089l09098J98492J56650o3374j66045r787O2709k59829j01486o961
20108A149360m0447J31988o5388k34564j81843K15526K31910j60088j88296K6734
20098H84892L6182q0046K50404J96230j54281j6167j90059R6283K88344L2153
20088A343935r3943O3291J29514R9152j32514k87007r4280K74158P5270o4175
20078A313401l6347k89008j69865R0336j49481k08824J5444p5109L8120n4065
20068D74602J84562l5413r0378J01382Q7236j12618k36374K65498J11378k93487
$$ plain form
20058 456388 327480 264118 146126 325154 448703 571027 527724 401219 493947 431852
20048 431852 753609 807763 779290 679186 549674 327987 479037 739318 728878 542056
20038 542056 219925 206537 449042 546355 483366 457629 420523 615973 914291 708009
20028 708009 826976 727382 460753 146299 36383 17639 168315 225920 252174 175607
20018 175607 259284 204752 83579 3722 4458 -8117 -107977 -273720 -178523 -60934 -136832
20007 -136832 -268650 10396 200499 249189 152555 18912 172754 480464 1026110 887046
19997 887046 575759 698787 437690 -8531 -334801 -369144 -377601 -310120 -21792 -65421
19987 -65421 -54504 144143 186169 57560 -62526 13336 272680 -8492 -77688 37242
$$ packed form
20058D56388j28908o3362j17992J79028J23549J22324m3303j26505R2728o2095
20048D31852L21757N4154k8473j00104j29512k21687J51050K60281j0440j86822
20038E42056l22131j3388K42505R7313o2989k5737l7106J95450K98318k06282
20028G08009J18967r9594k66629l14454j09916j8744J50676N7605K6254p6567
20018A75607Q3677n4532j21173p9857P36j2575r9860j65743R5197J17589p5898
20007a36832j31818K79046J90103M8690r6634j33643J53842L07710N45646j39064
19997H87046l11287J23028k61097m46221l26270l4343q457O7481K88328m3629
19987f5421J0917J98647M2026j28609j20086P5862K59344k81172o9196J14930
$$ plain form
19977 37242 -43764 -88048 -104876 -129131 -112709 -50067 136892 248720 488920 509448 552522
19966 552522 717431 719352 575516 552675 338835 302968 346168 370696 263179 323279 539049
19955 539049 668445 633329 582347 730149 457498 333715 254361 567157 888646 925445
19945 925445 664566 427899 393151 437922 373363 384879 429856 442948 739862 988273 992933
19934 992933 969253 835904 694224 608212 433799 443141 428068 366611 358093 345446 389474
19923 389474 524261 663555 538204 527990 428981 228788 305402 519964 653913 796323
19913 796323 721816 377897 453128 516713 494933 917016 1077726 719254 583060 560822
19903 560822 527227 467762 397170 652427 615951 614065 711956 590800 691522 724718 717314
$$ packed form
19977C7242q1006m4284j6828k4255J6422O2642J86959J11828K40200K0528M3074
19966E52522J64909J921j43836k2841k13840l5867M3200K4528j07517O0100K15770
19955E39049J29396l5116n0982J47802k72651j23783p9354L12796L21489L6799
19945I25445k60879k36667l4748M4771o4559J1516M4977J3092K96914K48411M660
19934I92933k3680j33349j41680q6012j74413R342j5073o1457q518j2647M4028
19923C89474J34787J39294j25351j0214r9009k00193P6614K14562J33949J42410
19913G96323p4507l43919P5231O3585k1780M22083J60710l58472j36194k2238
19903E60822l3595n9465p0592K55257l6476j886R7891j21156J00722L3196p404
$$ plain form
19892 717314 619068 502960 537495 567241 765428 832301 901813 1058267 810961 665710
19882 665710 882370 920746 895878 815122 598161 558754 550062 695736 1090704 1269221 1183004
19871 1183004 1174893 990464 787718 987090 1037669 858040 812455 945362 1099324 816597
19861 816597 952769 950477 799403 414700 591390 738786 720366 803246 795885 973292 1023301
19850 1023301 758297 720293 522630 180418 105758 225871 571528 895779 1072493 1004348
19840 1004348 1108220 1067634 1058384 1173457 1165921 1279187 1113930 986160 1065960 1008257 931814
19829 931814 1072431 1197941 1264259 1118176 1051872 1274402 1327228 1256014 1170256 1052674
19819 1052674 1211812 1382052 1067281 1043020 895500 994382 1174468 1164280 1122727 966481
$$ packed form
19892G17314r8246j16108L4535K9746J98187O6873O9512J56454k47306j45251
19882F65710K16660L8376k4868q0756k16961l9407q692J45674L94968J78517q6217
19871A183004q111j84429k02746J99372N0579j79629m5585J32907J53962k82727
19861H16597J36172k292j51074l84703J76690J47396j8420Q2880p361J77407N0009
19850A023301k65004l8004j97663l42212p4660J20113L45657L24251J76714o8145
19840A004348J03872m0586r250J15073p536J13266j65257j27770P9800n7703p6443
19829I31814J40617J25510O6318j46083o6304K22530N2826p1214q5758j17582
19819A052674J59138J70240l14771k4261j47520R8882J80086j0188m1553j56246
$$ plain form
19809 966481 1093626 1383197 1455363 1525865 1225561 1220756 1418353 1411076 1444368 1278368 1174325
19798 1174325 1300126 1287086 1147997 1122436 1266427 1326398 1284093 1252753 1291931 1641653
19788 1641653 1830026 2280504 2455566 2331501 2257738 2049590 2171476 2368317 2499892 2480026
19778 2480026 2396735 2503537 2388306 2542586 2884432 2847173 2758025 3026310 3434316 3762966
19768 3762966 3890850 3940483 4428944 4824645 5000827 5199342 5575126 5589321 5662274 5622910
19758 5622910 5296573 5106140 4973027 4661760 4764468 4938304 4918414 5055560 4885719 4826661
19748 4826661 5258612 5809726 5836890 6050622 6171872 6431309 6835631 7205807 7525968 7870123
19738 7870123 7673961 7466137 7569700 7977177 8395036 8468009 8202692 8290606 8485811 8514538
$$ packed form
19809I66481J27145K89571P2166P0502l00304m805J97597p277L3292j66000j04043
19798A174325J25801j3040j39089k5561J43991N9971m2305l1340L9178L49722
19788A641653J88373M50478J75062j24065p3763k08148J21886J96841J31575j9866
19778B480026q3291J06802j15231J54280L41846l7259q9148K68285M08006L28650
19768C762966J27884M9633M88461L95701J76182J98515L75784J4195P2953l9364
19758E622910l26337j90433j33113l11267J02708J73836j9890J37146j69841n9058
19748D826661M31951N51114K7164K13732J21250K59437M04322L70176L20161L44155
19738G870123j96162k07824J03563M07477M17859P2973k65317Q7914J95205K8727
$$ plain form
19728 8514538 9085203 9620522 10025918 10590931 11293059 12215241 13286294 14279411 15779447
19719 15779447 17827487 20583571 24326608 29087713 34821586 41617542 49449878 58627176
19711 58627176 69750459 83423262 98396275 111858822 121963674 131257723 142611672
19704 142611672 155931677 166578869 169941302 167582056 165009051 166621609 169181813 167444875
19696 167444875 160756126 151249275 143759309 140105077 137711882 135651365 132941733 127533561
19688 127533561 119699694 110147910 101215434 95358755 91773188 87269520 80437109 72266681
19680 72266681 63948693 56873829 51909415 48686471 46216068 44601891 43776067 43553014
19672 43553014 43705640 44312210 45705374 47831390 50994560 55689492 62560685 72410471
$$ packed form
19728H514538N70665N35319M05396N65013P02128R22182J071053R93117J500036
19719A5779447K048040K756084L743037M761105N733873O795956P832336R177298
19711E8627176J1123283J3672803J4973013J3462547J0104852R294049J1353949
19704A42611672J3320005J0647192L362433k359246k573005J612558K560204j736938
19696A67444875o688749r506851p489966l654232k393195k060517k709632n408172
19688A27533561p833867r551784q932476n856679l585567m503668o832411q170428
19680G2266681q317988p074864m964414l222944k470403j614177q25824k23053
19672D3553014J52626O06570J393164K126016L163170M694932O871193R849786
$$ plain form
19664 72410471 84788837 97797726 110215541 123213048 139274870 159495707 180012049
19657 180012049 194468311 198967419 197688235 198296681 202952797 207941093 208875280 206494490
19649 206494490 203608629 201539590 198840160 195415317 194712332 198327391 201222742 198402394
19641 198402394 188282785 175057769 165402967 160264029 156531860 152011564 147906618 147195040
19633 147195040 150914527 156632223 161152420 165291969 170100484 176577421 183242754 186740388
19625 186740388 188226230 188852364 188443116 188668125 190012901 193573345 199598935 203772217
19617 203772217 202156637 195406392 185965553 176729744 167527383 156243832 141615566 124969164
19609 124969164 108645756 94586109 84416296 77091462 71370538 67231682 63989645
$$ packed form
19664G2410471J2378366J3008889J2417815J2997507J6061822K0220837K0516342
19657A80012049J4456262M499108j279184O08446M656116M988296R34187k380790
19649B06494490k885861k069039k699430l424843p02985L615059K895351k820348
19641A98402394j0119609j3225016r654802n138938l732169m520296m104946p11578
19633A47195040L719487N717696M520197M139549M808515O476937O665333L497634
19625A86740388J485842O26134m09248K25009J344776L560444O025590M173282
19617B03772217j615580o750245r440839r235809r202361j1283551j4628266j6646402
19609A24969164j6323408j4059647j0169813p324834n720924m138856l242037
$$ plain form
19602 63989645 61463015 59965602 58714125 57376224 56382084 55583776 55359167 56196666 58178801
19593 58178801 61459183 66013011 70855432 76149882 82544547 90427721 100156506 110017181
19585 110017181 118389481 126554573 134737757 141516160 147887713 155033332 163190525 173828057
19577 173828057 183845076 190363959 196778823 204752341 211940671 218759511 224146743 226646505
19569 226646505 225395859 219709964 211102843 200849538 189785494 175614461 157384890
19562 157384890 139871335 125450761 112906420 100380116 87620039 76157469 67500790
19555 67500790 60790986 55760641 51979477 48823756 45801978 43308249 40954472 38896434
19547 38896434 37280993 35482423 34122668 33075453 31668764 30490169 29756213 28644312
$$ packed form
19602F3989645k526630j497413j251477j337901r94140p98308k24609Q37499J982135
19593E8178801L280382M553828M842421N294450O394665P883174R728785R860675
19585A10017181Q372300Q165092Q183184O778403O371553P145619Q157193J0637532
19577A73828057J0017019O518883O414864P973518P188330O818840N387232K499762
19569B26646505j250646n685895q607121j0253305j1064044j4171033j8229571
19562A57384890j7513555j4420574j2544341j2526304j2760077j1462570q656679
19555F7500790o709804n030345l781164l155721l021778k493729k353777k058038
19547C8896434j615441j798570j359755j047215j406689j178595p33956j111901
$$ plain form
19539 28644312 27965116 27685663 27308971 26809138 26267001 25463134 25023709 24241405 23364436
19530 23364436 22576989 21940355 21023397 20337360 19630436 18899619 18533896 17795506 16594676
19521 16594676 15835875 15196887 14743102 14123981 13566993 13143451 12759178 12350193 11633020
19512 11633020 11436366 11185708 10645263 10598276 10643148 10475827 10319569 9940662 9811886 9510828
19502 9510828 9158397 8818804 8831599 8831816 8601528 8457166 8741113 8730481 8419159 7947219
19492 7947219 7642686 7499391 7411566 7056269 6637378 6450039 6399648 6169625 5843135 5787976
19482 5787976 5789947 5693037 5537054 5315782 5039569 4804539 4654396 4675999 4400129 4264121
19472 4264121 4393434 4398191 4199402 3974630 3790244 3705264 3832174 3762941 3531860 3442068
$$ packed form
19539B8644312o79196k79453l76692m99833n42137q03867m39425p82304q76969
19530B3364436p87447o36634r16958o86037p06924p30817l65723p38390j200830
19521A6594676p58801o38988m53785o19121n56988m23542l84273m08985p17173
19512A1633020j96654k50658n40445m6987M4872j67321j56258l78907j28776l01058
19502I510828l52431l39593J2795K17k30288j44362K83947j0632l11322m71940
19492G947219l04533j43295q7825l55297m18891j87339n0391k30023l26490n5159
19482E787976J971r6910j55983k21272k76213k35030j50143K1603k75870j36008
19472D264121J29313M757j98789k24772j84386q4980J26910o9233k31081q9792
$$ plain form
19462 3442068 3361881 3246524 3028078 3124407 3205183 3048421 2721397 2658821 2602565 2842305
19452 2842305 2870054 2767921 2574989 2637467 2463258 2373771 2422283 2439297 2224304 2361713
19442 2361713 2372368 2272370 2220550 1976270 1852797 1766555 1700113 1377403 1418871 1473354 1295830
19431 1295830 1274858 1528608 1379499 1571816 1470965 1384754 1420346 1401097 1498767 1599321
19421 1599321 1740335 1763498 1285232 1049313 1041913 942161 1168925 1313795 1215764 1283341
19411 1283341 1119112 1156064 1221169 1015447 845865 891642 732972 913186 1307397 1231547
19401 1231547 1076673 1174749 1174327 1076555 1037516 853948 798628 886921 780886 758134 739153
19390 739153 868872 870868 891051 810515 761287 875854 1200068 1266804 1350059 1336867 1388528
$$ packed form
19462C442068q0187j15357k18446R6329Q0776j56762l27024o2576n6256K39740
19452B842305K7749j02133j92932O2478j74209q9487M8512J7014k14993J37409
19442B361713J0655r9998n1820k44280j23473q6242o6442l22710M1468N4483j77524
19431A295830k0972K53750j49109J92317j00851q6211L5592j9249R7670J00554
19421A599321J41014K3163m78266k35919p400r9752K26764J44870r8031O7577
19411A283341j64229L6952O5105k05722j69582M5777j58670J80214L94211p5850
19401A231547j54874R8076m22r7772l9039j83568n5320Q8293j06035k2752j8981
19390G39153J29719J996K0183q0536m9228J14567L24214O6736Q3255j3192N1661
$$ plain form
19379 1388528 1293982 1142702 1011494 932571 1026399 996970 932757 1014601 961191 926452 820705
19368 820705 893019 1100176 1134963 867992 461623 553124 636636 494871 285088 356455
19358 356455 446068 437885 356527 182299 271909 327371 401833 513565 657152 727258 912055
19347 912055 798101 381223 298847 332882 247715 427664 536286 582180 504508 517212 427251
19336 427251 363961 696269 839625 808713 512251 322419 413231 562792 828340 670782
19326 670782 602273 854733 1047920 866365 454095 358221 523939 839619 1078871 938621
19316 938621 649561 320952 154952 299441 408661 466988 242475 137293 36616 136933
19306 136933 90334 68639 203957 196630 142404 348869 525856 291434 377580 584402 652564
$$ packed form
19379A388528r4546j51280j31208p8923R3828k9429o4213Q1844n3410l4739j05747
19368H20705P2314K07157L4787k66971m06369R1501Q3512j41765k09783P1367
19358C56455Q9613q183q1358j74228Q9610N5462P4462J11732J43587P0106J84797
19347I12055j13954m16878q2376L4035q5167J79949J08622M5894p7672J2704q9961
19336D27251o3290L32308J43356l0912k96462j89832R0812J49561K65548j57558
19326F70782o8509K52460J93187j81555m12270r5874J65718L15680K39252j40250
19316I38621k89060l28609j66000J44489J09220N8327k24513j05182j00677J00317
19306A36933m6599k1695J35318p327n4226K06465J76987k34422Q6146K06822O8162
$$ plain form
19295 652564 632575 517573 534721 603410 1068873 1222399 1082365 816878 825253 872649 877207
19284 877207 745034 640790 738106 944107 874652 649218 743170 1121805 1307100 1174036
19274 1174036 1258085 1077691 845849 597917 488060 407808 412480 378335 551715 713458
19264 713458 774857 936153 872252 862688 815641 892382 978342 1067843 1145340 1062684 1066886 998864
19252 998864 956339 808062 910109 1044646 1037644 1211197 1208466 1207006 1249147 1226725 1241324
19241 1241324 1439365 1446198 1384427 1372381 1242470 1381225 1593154 1475412 1490600 1567876
19231 1567876 1625184 1547260 1441804 1165671 1275506 1662837 1429566 1489978 1532344 1414695
19221 1414695 1346351 1663845 1856770 1934892 1853416 1661590 1533500 1728758 1810578 1880008
$$ packed form
19295F52564j9989j15002J7148O8689M65463J53526j40034k65487Q375M7396M558
19284H77207j32173j04244R7316K06001o9455k25434R3952L78635J85295j33064
19274A174036Q4049j80394k31842k47932j09857q0252M672l4145J73380J61743
19264G13458O1399J61296o3901r564m7047P6741Q5960Q9501P7497q2656M202o8022
19252I98864m2525j48277J02047J34537p002J73553k731j460M2141k2422J4599
19241A241324J98041O833o1771j2046j29911J38755K11929j17742J5188P7276
19231A567876N7308p7924j05456k76133J09835L87331k33271O0412M2366j17649
19221A414695o8344L17494J92925P8122q1476j91826j28090J95258Q1820O9430
$$ plain form
19211 1880008 1893922 1747676 1784163 1899721 2038393 2245759 2572926 2691120 2786410 2813704
19201 2813704 3140975 3137133 3001871 3191466 3645150 3882016 4024698 4329193 4366466 4647368
19191 4647368 4909208 5290506 5776065 5972842 6148379 6694177 7206348 7479788 7844999
19182 7844999 8651735 9577637 10292103 11590911 13562261 16915502 21863529 28149426 34721565
19173 34721565 39938405 43945684 48322428 54264521 61777536 67439239 67769652 65072215
19165 65072215 63927610 65425351 67740914 68918748 70598128 74829439 80804566 83874481
19157 83874481 78939906 66586496 53091910 42773490 36002857 31789697 29161803 27242333
19149 27242333 25760892 24638200 23741797 23132862 22707350 22626614 22984449 23475218 24153711
$$ packed form
19211A880008J3914j46246L6487J15558J38672K07366L27167J18194R5290K7294
19201B813704L27271l842j35262J89595M53684K36866J42682L04495L7273K80902
19191D647368K61840L81298M85559J96777J75537N45798N12171K73440L65211
19182G844999Q06736R25902P14466J298808J971350L353241M948027O285897O572139
19173C4721565N216840M007279M376744N942093P513015N661703L30413k697437
19165F5072215j144605J497741K315563J177834J679380M231311N975127L069915
19157H3874481m934575j2353410j3494586j0318420o770633m213160k627894j919470
19149B7242333j481441j122692q96403o08935m25512q0736L57835M90769O78493
$$ plain form
19140 24153711 25254437 26668933 28401644 30597635 34157746 39617607 47457740 58207135
19132 58207135 73430194 92385125 112003425 128327316 140792614 154120773 172012774
19125 172012774 192417511 204978615 200918673 186016989 173275680 166610169 163455917
19118 163455917 161951577 163580670 170501652 180670693 186137536 178523780 158798246 137479783
19110 137479783 122076432 113430096 108384055 101710799 90863162 79494113 70759629
19103 70759629 64851423 60879229 58021939 55949088 54806705 54547871 55311037 56860465
19095 56860465 59657978 64726092 72639441 83934774 100438458 121527050 143989343
19088 143989343 163835730 181970968 205632870 239431061 278239195 303216623 301312657
$$ packed form
19140B4153711J100726J414496J732711K195991L560111N459861P840133J0749395
19132E8207135J5223059J8954931J9618300J6323891J2465298J3328159J7892001
19125A72012774K0404737J2561104m059942j4901684j2741309o665511l154252
19118A63455917j504340J629093O920982J0169041N466843p613756j9725534k1318463
19110A37479783j5403351q646336n046041o673256j0847637j1369049q734484
19103G0759629n908206l972194k857290k072851j142383k58834P63166J549428
19095E6860465K797513N068114P913349J1295333J6503684K1088592K2462293
19088A43989343J9846387J8135238K3661902L3798191L8808134K4977428j903966
$$ plain form
19081 301312657 286487377 280135658 289813174 307593444 314003487 302787629 285455174
19074 285455174 270801773 264835004 272821859 294049622 314337784 310522155 281707492
19067 281707492 250725264 232247613 226036687 223113460 209892909 183000037 152733787
19060 152733787 128441887 111138033 98411100 88939017 81712328 76171652 71809121
19053 71809121 68876326 67100512 66121058 66119240 67443349 70360313 75064787 81508250 88561442
19044 88561442 94951199 102334166 113275656 129219326 147802253 161377119 164403331
19037 164403331 162545736 164525231 173746433 185925958 191739564 188441947 182715435 179775929
19029 179775929 177592847 174955989 175204196 181124345 189532831 189989069 172831437 143716936
$$ packed form
19081C01312657j4825280o351719R677516J7780270O410043j1215858j7332455
19074B85455174j4653401n966769P986855K1227763K0288162l815629k8814663
19067B81707492l0982228j8477651o210926k923227j3220551k6892872l0266250
19060A52733787k4291900j7303854j2726933r472083p226689n540676m362531
19053G1809121k932795j775814r79454j818J324109K916964M704474O443463P053192
19044H8561442O389757P382967J0941490J5943670J8582927J3574866L026212
19037A64403331j857595J979495R221202J2179525N813606l297617n726512k939506
19029A79775929k183082k636858K48207N920149Q408486M56238j7157632k9114501
$$ plain form
19021 143716936 115811801 94819853 80202857 70305727 62888040 57299281 52998930
19014 52998930 49374431 46501563 44401187 42756140 41060101 39497411 38097183 36875175
19006 36875175 35828139 34775356 33910706 33267920 32983507 33315570 34237841 36306299 39786826
18997 39786826 45109386 51607348 57595974 61494703 64223490 68320305 74957422 82048628
18989 82048628 83564062 78352162 71420768 67031851 64152577 61703728 60535856 61197491
18981 61197491 63816262 64702803 59659081 49989223 40943515 34451177 29932346 26710517
18973 26710517 24154616 22191427 20719535 19468322 18311277 17175128 16308621 15576570
18965 15576570 15130876 14868090 14651869 14302393 13564937 13049077 12586501 12353507 12012618
$$ packed form
19021A43716936k7905135k0991948j4616996r897130p417687n588759m300351
19014E2998930l624499k872868k100376j645047j696039j562690j400228j222008
19006C6875175j047036j052783q64650o42786k84413L32063R22271K068458L480527
18997C9786826N322560O497962N988626L898729K728787M096815O637117P091206
18989H2048628J515434n211900o931394m388917k879274k448849j167872O61635
18981F1197491K618771Q86541n043722r669858r045708o492338m518831l221829
18973B6710517k555901j963189j471892j251213j157045j136149q66507p32051
18965A5576570m45694k62786k16221l49476p37456n15860m62576k32994l40889
$$ plain form
18956 12012618 11522496 10919737 10538233 10134011 9790346 9150998 8843564 8717118 8542335
18947 8542335 8171090 7955107 7836882 7690276 7471264 7421451 7373597 6817365 6479273 6460354
18937 6460354 6447393 6446620 6066706 5760973 5843540 5610694 5356949 5181800 5038063 4941868
18927 4941868 4692342 4487565 4310590 4095497 3950020 3955797 3918151 3952705 3772016 3743582
18917 3743582 3616494 3425988 3558422 3763528 3788594 3873573 3652835 3507150 3218704 3082686
18907 3082686 2868234 2910238 2974267 2624529 2700446 2688126 2642064 2739838 2469807 2213101
18897 2213101 2183791 2233457 1942041 1693228 1682049 1795937 1887731 1858942 1765707 1659852
18887 1659852 1353611 1281179 977585 1068959 1430530 1408721 1223767 1230147 1189721 1155766 1043117
$$ packed form
18956A2012618m90122o02759l81504m04222l43665o39348l07434j26446j74783
18947H542335l71245k15983j18225j46606k19012m9813m7854n56232l38092j8919
18937F460354j2961p73l79914l05733Q2567k32846k53745j75149j43737r6195
18927D941868k49526k04777j76975k15093j45477N777l7646L4554j80689k8434
18917C743582j27088j90506J32434K05106K5066Q4979k20738j45685k88446j36018
18907C082686k14452M2004O4029l49738P5917j2320m6062R7774k70031k56706
18897B213101k9310M9666k91416k48813j1179J13888R1794k8789r3235j05855
18887A659852l06241p2432l03594R1374L61571k1809j84954O380m0426l3955j12649
$$ plain form
18876 1043117 776269 793418 692312 802614 1103537 1159488 1188319 925603 740802 675314
18866 675314 586433 528732 459409 654408 693634 318648 109715 214609 -2121 -230472
18856 -230472 -109537 -52791 95236 127706 406441 609038 646753 415414 403896 622941
18846 622941 464033 37620 -263890 -192876 -60512 18794 287101 328231 370732 294013
18836 294013 324946 58254 -234833 60249 375512 333629 280287 169172 -121668 -198039
18826 -198039 -83871 38559 -35005 36526 259501 456469 237299 -50990 -20521 -131555
18816 -131555 -125932 -100800 -43393 -215201 -334663 -429415 -462043 -438359 -346735 -451884 -479723
18805 -479723 -288192 -272058 -287622 -380174 -586246 -305155 -111844 -268197 -258698 -167781 -216463
$$ packed form
18876A043117k66848J7149j01106J10302L00923N5951K8831k62716j84801o5488
18866F75314q8881n7701o9323J94999L9226l74986k08933J04894k16730k28351
18856b30472J20935N6746J48027L2470K78735K02597L7715k31339j1518K19045
18846F22941j58908m26413l01510P1014J32364P9306K68307M1130M2501p6719
18836B94013L0933k66692k93087K95082L15263m1883n3342j11115k90840p6371
18826a98039J14168J22430p3564P1531K22975J96968k19170k88289L0469j11034
18816a31555N623K5132N7407j71808j19462r4752l2628K3684R1624j05149k7839
18805d79723J91531J6134j5564r2552k06072K81091J93311j56353R499R0917m8682
$$ plain form
18794 -216463 -112747 -122412 -11893 -95006 -310307 -670257 -899451 -807467 -702495 -648241
18784 -648241 -329977 -338469 -399490 -290358 -431955 -503940 -430867 -334655 -450397 -638922 -591398
18773 -591398 -642777 -766384 -1084999 -907210 -595586 -384070 -364802 -468160 -493554 -288456
18763 -288456 -83099 -143750 -338996 -414873 -649854 -684268 -453410 -620378 -668966 -663659 -608128
18752 -608128 -562122 -486143 -521268 -492724 -479192 -426660 -297748 -416504 -634624 -651077 -468309
18741 -468309 -552177 -416759 -421424 -479026 -617794 -691595 -823783 -531976 -475832 -410469 -325375
18730 -325375 -440408 -553762 -610013 -450936 -93176 199469 215260 -151267 -522154 -745834
18720 -745834 -605405 -420234 -348789 -349437 -237662 -537382 -698158 -689618 -603492 -730711 -812643
$$ packed form
18794b16463J03716r665J10519q3113k15301l59950k29194R1984J04972N4254
18784f48241L18264q492o1021J09132j41597p1985P3073R6212j15742j88525M7524
18773e91398n1379j23607l18615J77789L11624K11516J9268j03358k5394K05098
18763b88456K05357o0651j95246p5877k34981l4414K30858j66968m8588N307N5531
18752f08128M6006P5979l5125K8544J3532N2532J28912j18756k18120j6453J82768
18741d68309q3868J35418m665n7602j38768p3801j32188K91807N6144O5363Q5094
18730c25375j15033j13354n6251J59077L57760K92645J5791l66527l70887k23680
18720g45834J40429J85171P1445o48J11775k99720j60776Q540Q6126j27219q1932
$$ plain form
18709 -812643 -871639 -794522 -696815 -783863 -844581 -590985 -188338 -330831 -378256 -610819 -841484
18698 -841484 -912822 -693057 -489355 -647749 -668062 -577343 -504695 -463670 -755864 -963031
18688 -963031 -822799 -620393 -603009 -508717 -728529 -698357 -588807 -543685 -404792 -306701
18678 -306701 -287706 -143862 -179151 -478047 -791479 -717304 -330440 -33385 -145332 -687150
18668 -687150 -762155 -527330 -267231 -277625 -279852 -88313 -370 41565 -114045 -236790 -324175
18657 -324175 -184136 -249367 -265183 -40184 -285902 -180778 -149815 -238851 -302993 -91237
18647 -91237 -176046 -6455 381213 262665 186670 190497 426588 779160 626953 414802
18637 414802 281316 285215 4185 -169197 -55989 103407 122807 -215166 -464873 -665644
$$ packed form
18709h12643n8996P7117R7707q7048o0718K53596M02647j42493m7425k32563k30665
18698h41484p1338K19765K03702j58394k0313R0719P2648M1025k92194k07167
18688i63031J40232K02406J7384R4292k19812L0172J09550M5122J38893R8091
18678c06701J8995J43844l5289k98896l13432P4175L86864K97055j11947n41818
18668f87150p5005K34825K60099j0394k227J91539Q7943M1935j55610j22745q7385
18657c24175J40039o5231j5816K24999k45718J05124L0963q9036o4142K11756
18647i1237q4809J69591L87668j18548p5995L827K36091L52572j52207k12151
18637D14802j33486L899k81030j73382J13208J59396J9400l37973k49707k00771
$$ plain form
18627 -665644 -872411 -657529 -188611 2885 -277873 -162408 47668 49292 -60723 -320333
18617 -320333 -477370 -343044 -232433 -277888 -318435 -364466 -179877 -166843 107238 158806
18607 158806 -39644 -93441 -274625 -21758 470289 448581 416323 453837 311819 461069
18597 461069 661270 864258 1058109 986847 1035943 790617 301852 273983 372510 269016
18587 269016 281056 109783 -216496 -329397 -404076 -354804 -145719 77650 238013 274630
18577 274630 301966 300058 414155 311048 158085 186715 309850 182429 -172548 -114584
18567 -114584 56734 183333 2582 35815 2047 -179918 -306503 -345338 -16789 -40278
18557 -40278 -113433 -91907 52103 -199114 -20382 225445 579258 575404 287212 209776 425117
$$ packed form
18627f65644k06767K14882M68918J91496k80758J15465K10076J624j10015k59610
18617c20333j57037J34326J10611m5455m0547m6031J84589J3034K74081N1568
18607A58806j98450n3797j81184K52867M92047k1708l2258L7514j42018J49250
18597D61069K00201K02988J93851p1262M9096k45326m88765k7869R8527j03494
18587B69016J2040j71273l26279j12901p4679M9272K09085K23369J60363L6617
18577B74630K7336j908J14097j03107j52963K8630J23135j27421l54977N7964
18567a14584J71318J26599j80751L3233l3768j81965j26585l8835L28549k3489
18557d0278p3155K1526J44010k51217J78732K45827L53813l854k88192p7436K15341
$$ plain form
18546 425117 394870 503109 465022 243865 65533 -195980 -184906 -120396 -56464 175407
18536 175407 570794 418630 67464 -305888 -257263 -54860 223684 393498 426300 616018
18526 616018 618074 622438 824279 823655 862580 789504 622197 348212 279839 360290 294998 289109
18514 289109 123256 227684 280442 -52287 -213803 -137983 -699 69271 92731 -171533
18504 -171533 -124968 -190827 -562275 -720753 -842315 -715451 -781597 -936020 -674078 -458456
18494 -458456 -481435 -389790 -378958 -373798 -400575 -504420 -563391 -416788 -115026 62528 213598
18483 213598 358623 437981 344023 290316 153528 152971 59583 903 255413 465938 718443
18472 718443 904644 921784 775428 617805 453581 599772 260014 -11607 -80678 -124338
$$ packed form
18546D25117l0247J08239l8087k21157j78332k61513J1074O4510O3932K31871
18536A75407L95387j52164l51166l73352M8625K02403K78544J69814L2802J89718
18526F16018K056M364K01841o24L8925p3076j67307k73985o8373Q0451o5292n889
18514B89109j65853J04428N2758l32729j61516P5820J37284O9970K3460k64264
18504a71533M6565o5859l71448j58478j21562J26864o6146j54423K61942K15622
18494d58456k2979R1645J0832N160k6777j03845n8971J46603L01762J77554J51070
18483B13598J45025P9358r3958n3707j36788n57r3388n8680K54510K10525K52505
18472G18443J86201J7140j46356j57623j64224J46191l39758k71621o9071m3660
$$ plain form
18462 -124338 66395 13730 19425 -182100 -172186 -312954 -130782 -244100 -342094 -525899 -338089
18451 -338089 -46040 67651 -106038 -72960 -213430 -104417 -198877 -393538 -469436 -536016
18441 -536016 -442158 -392848 -579548 -731878 -706398 -519102 -348070 -289557 -194676 -320440
18431 -320440 -262805 -476321 -534289 -286270 -274979 -242788 -236287 -144352 -156034 -189213 -418746
18420 -418746 -231825 -185865 -422659 -345115 -92615 -79137 -326 129904 4177 -179645
18410 -179645 206453 36622 -521453 -771073 -762511 -418790 -218781 -367006 -373044 -284663
18400 -284663 -241632 -418421 -559740 -386725 -290473 -414177 -529898 -422618 -175065 -6061
18390 -6061 -94635 -209515 -476853 -595739 -713930 -507815 -372025 -297064 -371612 -875244
$$ packed form
18462a24338J90733n2665N695k01525R914j40768J82172j13318r7994j83805J87810
18451c38089K92049J13691j73689L3078j40470J09013r4460j94661p5898o6580
18441e36016R3858M9310j86700j52330K5480J87296J71032N8513R4881j25764
18431c20440N7635k13516n7968K48019J1291L2191O501R1935j1682l3179k29533
18420d18746J86921M5960k36794P7544K52500J3478P8811J30230j25727j83822
18410a79645L86098j69831n58075k49620Q562L43721K00009j48225o038Q8381
18400b84663M3031j76789j41319J73015R6252j23704j15721J07280K47553J69004
18390f061q8574j14880k67338j18886j18191K06115J35790P4961p4548n03632
$$ plain form
18380 -875244 -770295 -536089 -420254 -416460 -367094 -287196 -307309 -335494 -400732 -413980 -394340
18369 -394340 -192057 -282587 -275422 -126202 -130055 -360811 -587047 -668028 -724441 -712982 -769805
18358 -769805 -692597 -402229 -299178 -260618 -269328 -151673 -318255 -279983 -486759 -762169
18348 -762169 -739224 -459664 -453335 -804928 -730646 -661376 -507623 -291362 -327797 -576373 -683248
18337 -683248 -642260 -540112 -629563 -677963 -561828 -594395 -576067 -532204 -528418 -520881 -642888
18326 -642888 -585324 -458755 -419358 -222143 -184715 -251295 -47930 261347 44446 -79457
18316 -79457 -383327 -316783 -294694 -449463 -491856 -604317 -906277 -818518 -799322 -786027 -468951
18305 -468951 -572152 -561308 -489864 -312543 -359111 -392586 -214464 -78511 -98292 -41922 -182076
$$ packed form
18380h75244J04949K34206J15835L794M9366P9898k0113k8185o5238j3248J9640
18369c94340K02283r0530P165J49220l853k30756k26236q0981n6413J1459n6823
18358g69805P7208K90368J03051L8560q710J17655j66582L8272k06776k75410
18348g62169K2945K79560O329l51593P4282O9270J53753K16261l6435k48576j06875
18337f83248M0988J02148q9451m8400J16135l2567J8328M3863L786P537j22007
18326f42888N7564J26569L9397J97215L7428o6580K03365L09277k16901j23903
18316g9457l03870O6544K2089j54769m2393j12461l01960Q7759J9196J3295L17076
18305d68951j03201J0844P1444J77321m6568l3475J78122J35953j9781N6370j40154
$$ plain form
18294 -182076 -194790 -316814 -500114 -558943 -378548 -274188 -133936 -207875 -459537 -463926
18284 -463926 -217889 -217665 -531853 -648382 -340924 -121268 -55826 -145646 -270039 -403451
18274 -403451 -620742 -749915 -649500 -632512 -447971 -358858 -213144 -381218 -620521 -750607
18264 -750607 -1093563 -1175257 -901487 -716103 -672668 -519362 -267186 -150271 -74738 -123794
18254 -123794 -163849 -203031 -280666 -212282 -310104 22239 -3214 -233017 -250392 -174560 -36013
18243 -36013 -262304 -81637 -24901 -144051 -108235 -197663 -466759 -547553 -382837 5692
18233 5692 53933 -165006 -324893 -436803 -355232 -374247 -326022 -245280 -100388 -232124 -271492
18222 -271492 23677 159515 137903 149705 118739 137060 -12887 -320184 -435525 -522078
$$ packed form
18294a82076j2714j22024j83300n8829J80395J04360J40252p3939k51662m389
18284d63926K46037K24l14188j16529L07458K19656O5442q9820j24393j33412
18274d03451k17291j29173J00415J6988J84541Q9113J45714j68074k39303j30086
18264g50607l42956q1694K73770J85384M3435J53306K52176J16915P5533m9056
18254a23794m0055l9182p7635O8384r7822L32343k5453k29803j7375P5832J38547
18243c6013k26291J80667N6736j19150L5816q9428k69096q0794J64716L88529
18233E692M8241k18939j59887j11910Q1571j9015M8225Q0742J44892j31736l9368
18222b71492K95169J35838k1612J1802l0966J8321j49947l07297j15341q6553
$$ plain form
18212 -522078 -519952 -452282 -357780 -339477 -242654 -324928 -512889 -736054 -746820 -735839 -701416
18201 -701416 -577528 -517458 -314636 -67403 -76367 -18219 -165838 -377075 -294370 -240285 -346197
18190 -346197 -280540 -146316 -174923 -311994 -341413 -484450 -695731 -580005 -570763 -829472
18180 -829472 -1031437 -1136040 -814298 -657082 -540041 -433774 -100075 -222612 -114143 -169014
18170 -169014 -503264 -579892 -501134 -243563 -328724 -648605 -738556 -535751 -307991 -273148
18160 -273148 -245813 -390680 -359701 -403726 -317598 -166029 -99730 -373875 -442406 -276609 -255586
18149 -255586 -355465 -345681 -112611 -190390 -583689 -897814 -710710 -670644 -629169 -343834 -467331
18138 -467331 -834767 -799407 -384076 -86533 -501122 -672565 -624467 -217212 126289 -89195
$$ packed form
18212e22078K126O7670R4502J8303R6823q2274j87961k23165j0766J0981L4423
18201g01416J23888O0070K02822K47233q964N8148j47619k11237Q2705N4085j05912
18190c46197O5657J34224k8607j37071k9419j43037k11281J15726R242k58709
18180h29472k01965j04603L21742J57216J17041J06267L33699j22537J08469n4871
18170a69014l34250p6628P8758K57571q5161l19881q9951K02805K27760L4843
18160b73148K7335j44867L0979m4025Q6128J51569O6299k74145o8531J65797K1023
18149b55586r9879R784K33070p7779l93299l14125J87104M0066M1475K85335j23497
18138d67331l67436L5360M15331K97543m14589j71443M8098M07255L43501k15484
$$ plain form
18128 -89195 -201141 -405284 -460370 -208513 -207019 -233610 -194273 -173020 -86627 -63840 -363353
18117 -363353 -366431 -225966 -76942 -116239 202273 58345 -160153 -34737 -86666 -172169
18107 -172169 -139605 101158 1811 -258666 -248512 -12348 60433 -349092 -495565 -484076
18097 -484076 -289663 -122570 -85153 -395107 -462921 -584834 -676481 -680375 -834424 -623354
18087 -623354 -348576 -284118 -296433 -238773 -39462 -59628 -109722 -63229 -39971 194524 -133613
18076 -133613 -406648 -466909 -427703 -552388 -529491 -374948 -334121 -544735 -531918 -265900
18066 -265900 -82199 30522 200001 150660 45117 123677 19672 -76434 -97566 -15378
18056 -15378 -186648 -304092 -183162 -208577 -226917 -96644 -267382 -495665 -755200 -650113
$$ packed form
18128h9195j11946k04143n5086K51857J494k6591L9337K1253Q6393K2787k99513
18117c63353l078J40465J49024l9297L18512j43928k18498J25416n1929q5503
18107a72169L2564K40763r9347k60477J0154K36164P2781m09525j46473J1489
18097d84076J94413J67093L7417l09954o7814j21913r1647l894j54049K11070
18087f23354K74778O4458j2315N7660J99311k0166n0094M6493K3258K34495l28137
18076a33613k73035o0261L9206j24685K2897J54543M0827k10614J2817K66018
18066b65900J83701J12721J69479m9341j05543P8560j04005r6106k1132Q2188
18056a5378j71270j17444J20930k5415j8340J30273j70738k28283k59535J05087
$$ plain form
18046 -650113 -635589 -572730 -474419 -243291 -87271 -284840 -319987 -186212 -209027 -295034 -434848
18035 -434848 -539160 -538338 -462285 -225259 -122924 -349237 -365682 -184110 -147765 -172008 -131773
18024 -131773 -470502 -639310 -674772 -723299 -635855 -476186 -378231 -522931 -452697 -391368 -478878
18013 -478878 -529931 -439352 -407690 -381973 -320518 -281575 -394174 -621653 -655230 -629058 -354573
18002 -354573 -315495 -677500 -736163 -782444 -738270 -534928 -302594 26841 -179079 -438661
17992 -438661 -413704 -444084 -578669 -614535 -532538 -510463 -172940 82731 -162656 -45981
17982 -45981 -341467 -609300 -478021 -232985 76930 -168810 -489356 -564107 -169109 -219538
17972 -219538 -412207 -563306 -587278 -590762 -758143 -623370 -259623 -370603 -454992 -446300 -533966
$$ packed form
18046f50113J4524O2859R8311K31128J56020j97569l5147J33775k2815q6007j39814
18035d34848j04312Q22P6053K37026J02335k26313j6445J81572L6345k4243M0235
18024a31773l38729j68808l5462m8527Q7444J59669R7955j44700P0234O1329q7510
18013d78878n1053R0579L1662K5717O1455L8943j12599k27479l3577K6172K74485
18002c54573L9078l62005n8663m6281M4174K03342K32334L29435k05920k59582
17992d38661K4957l0380j34585l5866Q1997K2075L37523K55671k45387J16675
17982d5981k95486k67833J31279K45036L09915k45740l20546p4751L94998n0429
17972b19538j92669j51099k3972l484j67381J34773L63747j10980q4389Q692q7666
$$ plain form
17961 -533966 -293038 -475396 -632775 -642379 -215204 -148631 -136858 -61952 -208570 -380204
17951 -380204 -649644 -728377 -805497 -918919 -780996 -852240 -636849 -295826 73466 -16193
17941 -16193 -23063 204225 326910 102444 -129107 -276005 -287816 -397444 -369587 -285334 -308505
17930 -308505 -330835 -431374 -273746 -400969 -366187 -269424 -412985 -539510 -461950 -214860
17920 -214860 -275118 -497423 -539588 -662085 -551578 -386333 -668145 -754320 -524142 -408419
17910 -408419 -473214 -772906 -770343 -729830 -579316 -412668 -222661 -237633 -190384 -166493 -193130
17899 -193130 -269792 -188987 8337 -137119 -412623 -361044 -372761 -495100 -260302 -335109
17889 -335109 -255312 -169809 -209466 -212084 -424149 -391035 -386104 -308946 -158508 -138911 -212675
$$ packed form
17961e33966K40928j82358j57379r604M27175O6573J1773P4906j46618j71634
17951c80204k69440p8733p7120j13422J37923p1244K15391L41023L69292q9659
17941a6193o870K27288J22685k24466k31551j46898j1811j09628K7857Q4253k3171
17930c08505k2330j00539J57628j27223L4782R6763j43561j26525P7560K47090
17920b14860o0258k22305m2165j22497J10507J65245k81812q6175K30178J15723
17910d08419o4795k99692K563M0513J50514J66648J90007j4972M7249K3891k6637
17899a93130p6662Q0805J97324j45456k75504N1579j1717j22339K34798p4807
17889c35109P9797Q5503l9657k618k12065L3114M931P7158J50438J9597p3764
$$ plain form
17878 -212675 -289302 -415074 -292843 -152839 -16374 -4615 -39150 -214730 -365234 -473639
17868 -473639 -473720 -533227 -557422 -408621 -291154 -164720 -150977 -106218 95064 2206 -41670
17857 -41670 -90028 -376721 -273226 -83895 -105632 -332930 -637738 -450866 -309144 -523944
17847 -523944 -535259 -562999 -295663 -281788 -414595 -442166 -433497 -455008 -359707 -464708 -418217
17836 -418217 -495760 -619474 -805217 -625707 -473890 -345556 -251991 -130204 -229427 -435322
17826 -435322 -594958 -540749 -258059 80283 346390 378587 85193 -207334 -101419 -169758
17816 -169758 -212046 -387211 -409029 -357440 -262156 -240350 25872 141153 -102382 -279071
17806 -279071 -99908 -116674 -343116 -545971 -637973 -532315 -673724 -583086 -594400 -435750
$$ packed form
17878b12675p6627j25772J22231J40004J36465J1759l4535j75580j50504j08405
17868d73639q1n9507k4195J48801J17467J26434J3743M4759K01282r2858m3876
17857d1670m8358k86693J03495J89331k1737k27298l04808J86872J41722k14800
17847e23944j1315k7740K67336J3875j32807k7571Q669k1511R5301j05001M6491
17836d18217p7543j23714j85743J79510J51817J28334R3565J21787r9223k05895
17826d35322j59636N4209K82690L38342K66107L2197k93394k92527J05915o8339
17816a69758m2288j75165k1818N1589R5284K1806K66222J15281k43535j76689
17806b79071J79163j6766k26442k02855r2002J05658j41409R0638j1314J58650
$$ plain form
17796 -435750 -420460 -160121 47999 140757 -47490 -82342 126920 -50806 -83419 -4233
17786 -4233 77879 200901 325606 268296 -164729 -569825 -694751 -540224 -222320 20278
17776 20278 -79223 -124452 -332031 -475875 -700727 -719323 -460056 -317893 -391268 -275065
17766 -275065 -169578 -189175 -311855 -450987 -476989 -347518 -328364 -162497 118746 -13768
17756 -13768 -131794 -401247 -575760 -473651 -253803 -121137 24347 303285 436400 244183
17746 244183 59347 145695 185055 340831 252103 349196 383550 330278 314667 -29154 -220371
17735 -220371 -360944 -389047 -524761 -456000 -387809 -139964 43539 66642 -277399 -494469
17725 -494469 -141141 -151049 -173708 -247418 -276058 -338768 -127479 -42546 -319418 -359161 -401333
$$ packed form
17796d35750J5290K60339K08120R2758j88247l4852K09262j77726l2613P9186
17786d233Q2112J23022J24705n7310m33025m05096j24926J54527L17904K42598
17776B0278r9501m5229k07579j43844k24852j8596K59267J42163p3375J16203
17766b75065J05487j9597j22680j39132k6002J29471J9154J65867K81243j32514
17756a3768j18026k69453j74513J02109K19848J32666J45484K78938J33115j92217
17746B44183j84836Q6348L9360J55776q8728R7093L4354n3272j5611l43821j91217
17735b20371j40573k8103j35714O8761O8191K47845J83503K3103l44041k17070
17725d94469L53328r908k2659p3710k8640o2710K11289Q4933k76872l9743m2172
$$ plain form
17714 -401333 -695021 -530619 -565619 -601838 -536507 -420298 -345168 -249140 -291573 -191134 -284360
17703 -284360 -355831 -109442 -444432 -498715 -377096 -260466 -135480 -88634 47754 278126
17693 278126 416516 224035 -59148 88931 95466 137519 -17909 -4080 136383 101268
17683 101268 -172888 -146713 304953 261114 -279838 -582373 -602219 -581729 -437650 -191106
17673 -191106 -98385 92042 302099 429185 462965 66328 8699 -329362 -104210 -116690
17663 -116690 -189825 -384066 -430758 -480668 -404550 -436849 -379769 -441160 -440316 -323502 -274875
17652 -274875 -216898 -18682 251779 106530 -267709 -508283 -149276 116668 147147 63539
17642 63539 177304 343986 371376 359943 386231 322274 268637 331430 124095 -13278 -40382
$$ packed form
17714d01333k93688J64402l5000l6219O5331J16209P5130R6028m2433J00439r3226
17703b84360p1471K46389l34990n4283J21619J16630J24986M6846J36388K30372
17693B78126J38390j92481k83183J48079O535M2053j55428J3829J40463l5115
17683A01268k74156K6175M51666m3839n40952l02535j9846K0490J44079K46544
17673a91106R2721J90427K10057J27086L3780l96637n7629l38061K25152j2480
17663a16690p3135j94241m6692m9910P6118l2299N7080o1391Q44J16814M8627
17652b74875N7977J98216K70461j45249l74239k40574L59007K65944L0479q3608
17642F3539J13765J66682K7390j1433K6288o3957n3637O2793k07335j37373k7104
$$ plain form
17631 -40382 2938 -151187 -149176 -177013 -127405 -137539 -205362 -190498 -244244 -449261 -246001
17620 -246001 -107640 -213059 -151035 -2413 -119534 -382050 -383733 -426067 -458265 -622321
17610 -622321 -843189 -825125 -827055 -747650 -510127 -313177 26081 122597 -198057 -262501 -300189
17599 -300189 -135754 29219 88078 41160 -78628 11589 40082 24755 21645 21381 -375558
17588 -375558 -562982 -276439 -150454 -156970 -160018 -325550 -302239 -121533 -117117 -241192 -321497
17577 -321497 -85092 -58019 -221902 -337854 -477037 -373915 -316666 -171988 -227819 -167970
17567 -167970 -239993 -261100 -287807 -127482 -67078 67965 -219585 -310046 -214063 -282467 -77473
17556 -77473 -182802 -233365 -354984 -461175 -110610 239810 237214 42466 -91131 -249565
$$ packed form
17631d0382M3320j54125K011k7837M9608j0134o7823J4864n3746k05017K03260
17620b46001J38361j05419O2024J48622j17121k62516j683m2334l2198j64056
17610f22321k20868J8064j930P9405K37523J96950L39258R6516l20654o4444l7688
17599c00189J64435J64973N8859m6918j19788R0217K8493j5327l110k64l96939
17588c75558j87424K86543J25985o516l048j65532K3311J80706M416j24075q0305
17577c21497K36405K7073j63883j15952j39183J03122N7249J44678n5831N9849
17567a67970p2023k1107k6707J60325O0404J35043k87550r0461R5983o8404K04994
17556g7473j05329n0563j21619j06191L50565L50420k596j94748j33597j58434
$$ plain form
17546 -249565 -223431 -349867 -530942 -701019 -601916 -364836 -381623 -638066 -607745 -212666
17536 -212666 -185538 -376011 -460516 -299077 -257843 -505421 -407081 42033 -79876 -140926
17526 -140926 -149520 -236416 -140957 -25453 -1882 -43565 -189195 -379617 -445682 -262368 -23930
17515 -23930 46785 103755 -32283 -67795 -85362 8883 -49016 -281608 -280332 -191430 -27725
17504 -27725 141169 38372 -141109 -144019 46405 -84739 -21036 10100 -162081 -53070
17494 -53070 -31280 -195444 -344197 -430988 -502350 -407509 -364172 -289938 -232514 -4477 -7598
17483 -7598 -194263 -289594 -566123 -881201 -826729 -473762 -574674 -857998 -649114 -389705
17473 -389705 -590859 -392437 -95787 107410 121757 -166978 -290260 -93980 98848 162198
$$ packed form
17546b49565K6134j26436j81075j70077R9103K37080j6787k56443L0321L95079
17536b12666K7128j90473q4505J61439M1234k47578R8340M49114j21909o1050
17526a40926q594q6896R5459J15504K3571m1683j45630j90422o6065J83314K38438
17515b3930P0715N6970j36038l5512j7567R4245n7899k32592J276Q8902J63705
17504b7725J68894j02797j79481k910J90424j31144O3703L1136j72181J09011
17494e3070K1790j64164j48753q6791p1362R4841M3337P4234N7424K28037l121
17483g598j86665r5331k76529l15078N4472L52967j00912k83324K08884K59409
17473c89705k01154J98422K96650K03197J4347k88735j23282J96280J92828O3350
$$ plain form
17463 162198 119826 378238 296322 264333 220559 79503 36442 -170680 -102139 94598 33566
17452 33566 29655 -45977 -216293 -290399 -65112 -252288 -247740 -414007 -366849 -230728 -120585
17441 -120585 -304078 -318599 -471550 -405019 -232042 -128000 -52059 -19569 95034 -56268
17431 -56268 -254860 -334469 -367365 -606633 -621299 -500083 -662921 -782229 -793329 -530442
17421 -530442 -236637 -345673 -296066 -174347 -79004 -65739 -341650 -412558 -21190 279974
17411 279974 483488 268316 26860 -208316 -243101 -165088 -210734 -220511 55381 127348 -175877
17400 -175877 -153081 -158963 -10100 -84066 -461826 -752761 -696225 -574566 -571110 -516834 -204772
17389 -204772 10554 19951 44377 79913 28564 50874 358545 526054 513183 496235 530513
$$ packed form
17463A62198m2372K58412q1916l1989m3774j41056m3061k07122O8541J96737o1032
17452C3566l911p5632j70316p4106K25287j87176M548j66267M7158J36121J10143
17441a20585j83493j4521j52951O6531J72977J04042P5941L2490J14603j51302
17431e6268j98592p9609l2896k39268j4666J21216j62838j19308j1100K62887
17421e30442K93805j09036M9607J21719R5343J3265k75911p0908L91368L01164
17411B79974K03514k15172k41456k35176l4785P8013m5646r777K75892P1967l03225
17400a75877K2796n882J48863p3966l77760k90935N6536J21659L456N4276L12062
17389b04772K15326R397K4426L5536n1349K2310L07671J67509j2871j6948L4278
$$ plain form
17378 530513 167700 -36527 -77051 -214356 -416582 -99825 110522 87549 34408 -246067
17368 -246067 -136563 -38766 19276 153694 213401 4463 -180569 -214466 -137487 -186957 -106600
17357 -106600 -74727 -315408 -559103 -126398 -51474 -91464 193261 249250 -160989 -323728
17347 -323728 -61972 -79462 -150573 -156078 -435214 -428808 -12875 321212 125198 -82821 -122998
17336 -122998 -149996 -220735 -292981 -292011 -154348 -55934 -308721 -283153 -216139 -174814 -227676
17325 -227676 -344718 -388172 -632380 -467570 -310718 -32521 -53152 -78717 -64789 -22084
17315 -22084 -167618 -558264 -773467 -516305 -88262 20478 -111557 -374128 -699395 -708065
17305 -708065 -648424 -566023 -562401 -409510 -271311 -75521 -230451 -307414 -379382 -362880 -117520
$$ packed form
17378E30513l62813k04227m0524j37305k02226L16757K10347k2973n3141k80475
17368b46067J09504R7797N8042J34418N9707k08938j85032l3897P6979m9470Q0357
17357a06600L1873k40681k43695M32705P4924l9990K84725N5989m10239j62739
17347c23728K61756j7490p1111n505k79136O406M15933L34087j96014k08019m0177
17336a22998k6998p0739p2246R70J37663R8414k52787K5568O7014M1325n2862
17325b27676j17042m3454k44208J64810J56852K78197k0631k5565J3928M2705
17315b2084j45534l90646k15203K57162M28043J08740j32035k62571l25267q670
17305g08065N9641Q2401L622J52891J38199J95790j54930p6963p1968J6502K45360
$$ plain form
17294 -117520 48000 58988 -189403 -111267 -8632 -124970 -71909 24933 122179 -168303
17284 -168303 -421835 -271069 -260453 -335884 -260075 -236571 -428048 -560039 -535056 -539937 -676184
17273 -676184 -567196 -440241 -93413 96786 186924 193403 51463 -110704 -35771 11041
17263 11041 78994 57908 -43596 34018 -133141 -179207 -66553 199286 416919 369958 114819
17252 114819 171714 130599 27934 -43004 -207174 -356807 -331153 -164684 125367 4983
17242 4983 86955 -46889 -105195 -121385 -288839 -617699 -515089 -286031 20543 -90314
17232 -90314 -354413 -213337 -162619 -234490 -244924 -283518 -107221 74910 95591 -82403 105737
17221 105737 143127 -189223 -329432 -101219 -322481 -391945 -95435 -209853 -22144 65958
$$ packed form
17294a17520J65520J0988k48391P8136J02635j16338N3061R6842R7246k90482
17284a68303k53532J50766J0616p5431P5809K3504j91477j31991K4983m881j36247
17273f76184J08988J26955L46828J90199R0138O479j41940j62167P4933M6812
17263A1041O7953k1086j01504P7614j67159m6066J12654K65839K17633m6961k55139
17252A14819N6895m1115j02665p0938j64170j49633K5654J66469K90051j20384
17242D983Q1972j33844n8306j6190j67454l28860J02610K29058L06574j10857
17232i0314k64099J41076N0718p1871j0434l8594J76297J82131K0681j77994J88140
17221A05737L7390l32350j40209K28213k21262o9464K96510j14418J87709Q8102
$$ plain form
17211 65958 -154718 -153493 -315506 -329696 -302618 -456108 -638183 -454024 -74695 84364
17201 84364 -49508 17328 131901 -53622 -87363 -263564 -375384 -536975 -391591 -135608
17191 -135608 -80078 -224313 -168368 -242419 -253147 -112673 -126650 -158091 -196006 -109575 -80490
17180 -80490 -22164 108856 160872 107002 71828 244791 375860 315707 503193 349735 168786
17169 168786 244081 138347 -81237 -135751 -55746 49296 -75717 -130565 76091 157388
17159 157388 258882 208768 58353 -176737 -105894 -8270 52660 151756 -40821 -155959
17149 -155959 -239658 -181096 13474 286772 40823 -224914 -468639 -313230 -103746 -122895
17139 -122895 -292700 -404188 -211498 -160838 -186692 -219148 -224580 -238582 -241837 -385377 -258165
$$ packed form
17211F5958k20676J225j62013j4190K7078j53490j82075J84159L79329J59059
17201H4364j33872O6836J14573j85523l3741j76201j11820j61591J45384K55983
17191a35608N5530j44235N5945p4051j0728J40474j3977l1441l7915Q6431K9085
17180h0490N8326J31020N2016n3870l5174J72963J31069o0153J87486j53458j80949
17169A68786P5295j05734k19584n4514Q0005J05042j25013n4848K06656Q1297
17159A57388J01494n0114j50415k35090P0843R7624O0930R9096j92577j15138
17149a55959q3699N8562J94570K73298k45949k65737k43725J55409K09484j9149
17139a22895j69805j11488J92690N0660k5854l2456n432j4002l255j43540J27212
$$ plain form
17128 -258165 -212984 -324382 -350813 -61565 84788 -65357 -149406 -217698 -83342 -47045
17118 -47045 -100587 -205879 -249181 -65660 -85001 -140310 -184335 -139033 103023 351196 480739
17107 480739 525819 540347 332987 512567 453368 82265 -141163 -64226 204194 163514
17097 163514 124404 10787 158456 361308 190258 -80982 -461700 -400075 -167463 260265
17087 260265 405838 191397 -36564 54712 66950 -114956 -267534 -125184 -53432 19630
17077 19630 -202353 -253168 -258147 -274660 -54464 -254025 -405086 -260351 -387871 -351903 -180360
17066 -180360 147432 65207 130128 251856 23589 141653 118883 158304 114071 138859 131754
17055 131754 96310 308897 375623 146744 237182 135780 -224245 -197171 -190548 -143107 52381
$$ packed form
17128b58165M5181j11398k6431K89248J46353j50145q4049o8292J34356L6297
17118d7045n3542j05292m3302J83521j9341n5309m4025M5302K42056K48173J29543
17107D80739M5080J4528k07360J79580n9199l71103k23428P6937K68420m0680
17097A63514l9110j13617J47669K02852j71050k71240l80718O1625K32612M27728
17087B60265J45573k14441k27961R1276J2238j81906j52578J42350P1752P3062
17077A9630k21983n0815m979j6513K20196j99561j51061J44735j27520L5968J71543
17066a80360L27792q2225O4921J21728k28267J18064k2770L9421m4233K4788p105
17055A31754l5444K12587O6726k28879R0438j01402l60025K7074O623M7441J95488
$$ plain form
17044 52381 -91911 -312282 -254150 -340691 -193606 -19644 206850 281383 163955 40318
17034 40318 -238704 44597 366230 368707 206774 388879 438984 463045 344075 196403
17024 196403 -128835 -381150 -206470 -4034 -93171 122359 288109 119314 4096 -128643
17014 -128643 -571006 -288212 -180679 -2757 79948 46867 -1197 31928 149194 -50231
17004 -50231 88415 74315 237927 378186 404886 245523 -14978 -126073 -267368 -188457
16994 -188457 -122489 -57629 82935 67711 -70428 -191072 -223187 59606 426470 287078
16984 287078 -44880 -181982 -294857 -458399 -346968 -6593 105405 82539 48178 180659
16974 180659 308034 328962 111795 -173367 -456291 -480732 -147093 199840 139509 -191366
$$ packed form
17044E2381j44292k20371N8132q6541J47085J73962K26494P4533j17428j23637
17034D0318k79022K83301L21633K477j61933J82105N0105K4061j18970j47672
17024A96403l25238k52315J74680K02436q9137K15530J65750j68795j15218j32739
17014a28643m42363K82794J07533J77922Q2705l3081m8064L3125J17266j99425
17004e0231J38646j4100J63612J40259K6700j59363k60501j11095j41295P8911
16994a88457O5968O4860J40564j5224j38139j20644l2115K82793L66864j39392
16984B87078l31958j37102j12875j63542J11431L40375J11998k2866l4361J32481
16974A80659J27375K0928k17167k85162k82924k4441L33639L46933o0331l30875
$$ plain form
16964 -191366 -302815 -182658 -504924 -935599 -817569 -699591 -577975 -405184 -94964 -33672
16954 -33672 10377 -163472 -497924 -545160 -269914 -132678 -271252 -317236 56110 93367
16944 93367 -12626 -279811 -265485 -17856 -230439 -323042 -189991 -149697 -306770 -219277
16934 -219277 -249302 -238448 -617171 -797762 -503622 -293670 -435078 -637397 -536967 -250385
16924 -250385 -135906 -93855 42299 -54877 -137797 -12882 62319 -289418 -629147 -695174
16914 -695174 -801700 -368423 -91278 -39328 -205167 -292511 -213118 69898 160976 23236
16904 23236 -154206 -110924 -127899 -120248 -233243 -381527 -119578 38469 -279418 -751441
16894 -751441 -518215 -167167 33869 222734 164353 -177063 -406791 -244526 -246108 -254327
$$ packed form
16964a91366j11449J20157l22266m30675J18030J17978J21616J72791L10220O1292
16954c3672M4049j73849l34452m7236K75246J37236j38574m5984L73346L7257
16944I3367j05993k67185J4326K47629k12583r2603J33051M0294j57073Q7493
16934b19277l0025J0854l78723j80591K94140K09952j41408k02319J00430K86582
16924b50385J14479M2051J36154r7176q2920J24915P5201l51737l39729o6027
16914f95174j06526M33277K77145N1950j65839q7344P9393K83016R1078j37740
16904B3236j77442M3282j6975P651j12995j48284K61949J58047l17887m72023
16894g51441K33226L51048K01036J88865n8381l41416k29728J62265j582q219
$$ plain form
16884 -254327 -399101 -266108 -308449 -234954 -253087 -313649 -349514 -275216 -286206 -449897 -407606
16873 -407606 -62383 45580 27557 -298786 -236067 -86373 -141163 -95480 -42098 -161977
16863 -161977 -209918 -226203 67581 56978 106238 -103519 -357812 -647457 -419595 -329786
16853 -329786 146028 252268 236357 352007 321107 221361 289277 178101 176827 -47330 -202229
16842 -202229 -119100 -4148 -240705 -179332 -211531 -111827 -265935 -147724 79740 -239373
16832 -239373 -485693 -249465 -98097 -156668 -86246 -220085 -392086 -441341 -268088 -32184
16822 -32184 65366 -255598 -342261 -175613 -126698 -280765 -94639 -179601 -41214 151072
16812 151072 126045 35132 171196 255046 105126 32452 172623 432095 171391 -121434
$$ packed form
16884b54327j44774J32993m2341P3495j8133o0562l5865P4298j0990j63691M2291
16873d07606L45223J07963j8023l26343O2719J49694n4790M5683N3382j19879
16863a61977m7941j6285K93784j0603M9260k09757k54293k89645K27862Q9809
16853c29786M75814J06240j5911J15650l0900r9746O7916j11176j274k24157j54899
16842b02229Q3129J14952k36557O1373l2199R9704j54108J18211K27464l19113
16832b39373k46320K36228J51368n8571P0422j33839j72001m9255J73253K35904
16822c2184R7550l20964q6663J66648M8915j54067J86126q4962J38387J92286
16812A51072k5027r0913J36064Q3850j49920p2674J40171K59472k60704k92825
$$ plain form
16802 -121434 -489782 -466194 -265659 -64193 36062 95015 114628 357746 342820 32023
16792 32023 -57384 -110611 -46623 90278 -95623 -392174 -509122 -346988 80282 207216
16782 207216 -4909 -264448 -362814 -714721 -730893 -426743 -318107 -50088 -361153 -244568
16772 -244568 -318422 -636773 -452330 -107825 -111768 -254563 -343533 -457134 -706453 -398098
16762 -398098 -290648 -182527 -223435 -260065 -87232 -10801 -53454 -336425 -251405 -171077 -222176
16751 -222176 -423339 -376986 -270654 28677 255562 404568 482301 287411 263379 374182
$$ packed form
16802a21434l68348K3588K00535K01466J00255N8953J9613K43118j4926l10797
16792C2023q9407n3227O3988J36901j85901k96551j16948J62134M27270J26934
16782B07216k12125k59539r8366l51907j6172L04150J08636K68019l11065J16585
16772b44568p3854l18351J84443L44505l943j42795q8970j13601k49319L08355
16762c98098J07450J08121m0908l6630J72833P6431m2653k82971Q5020Q0328n1099
16751b22176k01163M6353J06332K99331K26885J49006P7733j94890k4032J10803
$$ [...]
##END NTUPLES=NMR SPECTRUM
##END=
