##TITLE=Analysis number 322084
Compound Code cc 23508
Project Code adrs
Chemist Name fudan
##JCAMPDX= 6.0         $$ Bruker NMR JCAMP-DX V2.0
##DATA TYPE= NMR SPECTRUM
##DATA CLASS= NTUPLES
##ORIGIN= Bruker BioSpin GmbH
##OWNER= nmr
$$ XWIN-NMR		Version 3.5
$$ Tue Sep 12 12:44:56 2006 GMT Daylight Time (UT+1h)  MAYBRIDGE\nmr@NMR_250MHZ
##.OBSERVE FREQUENCY= 250.131544655141
##.OBSERVE NUCLEUS= ^1H
##.ACQUISITION MODE= SIMULTANEOUS (DQD)
##.ACQUISITION SCHEME= undefined
##.AVERAGES= 16
##.DIGITISER RES= 18
##SPECTROMETER/DATA SYSTEM= dpx250
##.PULSE SEQUENCE= zg30
##.SOLVENT NAME= CDCl3
##.SHIFT REFERENCE= (INTERNAL, CDCl3, 0, 16.4529)
##AUDIT TRAIL= $$ (NUMBER, WHEN, WHO, WHERE, WHAT)
$$ ##TITLE= Audit trail, XWIN-NMR		Version 3.5
$$ ##JCAMPDX= 5.01
$$ ##ORIGIN= Bruker BioSpin GmbH
$$ ##OWNER= nmr
$$ C:\u/data/dgb/nmr/ADRS/630/pdata/1/auditp.txt
$$ ##AUDIT TRAIL=  $$ (NUMBER, WHEN, WHO, WHERE, WHAT)
(   1,<2006-09-12 12:44:25.22 +100>,<MAYBRIDGE\nmr>,<NMR_250MHZ>,
      <created by zg, POWCHK disabled, PULCHK disabled
       configuration hash MD5:
       E2 DF 36 D8 04 B2 41 60 5A D7 A3 38 5A 4B D0 FE
       data hash MD5: 64K
       66 7C 6C 8B BB 2B 27 E2 E8 23 B3 19 50 47 A9 62>)
(   2,<2006-09-12 12:44:44.00 +100>,<MAYBRIDGE\nmr>,<NMR_250MHZ>,
      <Start of raw data processing
       ef LB = 0.3 FT_mod = 6 PKNL = 1 SI = 32K 
       data hash MD5: 32K
       2F 9C 72 CD 85 E7 E1 67 32 05 94 C2 A1 A7 8A 12>)
(   3,<2006-09-12 12:44:45.97 +100>,<MAYBRIDGE\nmr>,<NMR_250MHZ>,
      <apk 
       data hash MD5: 32K
       B9 EB 7D D4 8A FD B9 42 58 20 60 11 7E 51 2F B9>)
(   4,<2006-09-12 12:44:46.75 +100>,<MAYBRIDGE\nmr>,<NMR_250MHZ>,
      <abs ABSG = 5 
       data hash MD5: 32K
       FA 77 F1 7A 27 24 92 EE 48 A2 FC 7D D9 76 4B A3>)
$$ ##END=
$$ 
$$ hash MD5
$$ D2 4C 61 D7 5C F0 33 74 AA EF C7 11 A8 0F 7B 78
##$RELAX= 
##$RELAX= 
##$RELAX= 
##$RELAX= 
##$RELAX= 
##$RELAX= 
##$RELAX= 
$$ Bruker specific parameters
$$ --------------------------
##$DU= <C:\u>
##$EXPNO= 630
##$NAME= <ADRS>
##$PROCNO= 1
##$TYPE= <nmr>
##$USER= <dgb>
##$AMP= (0..31)
100 100 100 100 100 100 100 100 100 100 100 100 100 100 100 100 100 100 
100 100 100 100 100 100 100 100 100 100 100 100 100 100 
##$AQSEQ= 0
##$AQ_mod= 3
##$AUNM= <au_zg>
##$AUTOPOS= <49 >
##$BF1= 250.13
##$BF2= 250.13
##$BF3= 250.13
##$BF4= 250.13
##$BF5= 500.13
##$BF6= 500.13
##$BF7= 500.13
##$BF8= 500.13
##$BYTORDA= 1
##$CFDGTYP= 0
##$CFRGTYP= 5
##$CHEMSTR= <none>
##$CNST= (0..31)
1 1 145 1 1 1 1 1 1 1 1 1 1 1 1 1 1 1 1 1 1 1 1 1 1 1 1 1 1 1 1 1 
##$CPDPRG= <>
##$CPDPRG1= <>
##$CPDPRG2= <>
##$CPDPRG3= <>
##$CPDPRG4= <mlev>
##$CPDPRG5= <mlev>
##$CPDPRG6= <mlev>
##$CPDPRG7= <mlev>
##$CPDPRG8= <mlev>
##$CPDPRGB= <>
##$CPDPRGT= <>
##$D= (0..31)
0 1 0 0 0 0 0 0 0 0.06 0 0 0 0 0 0 0.0002 0 0 0 0 0 0 0 0 0 0 0 0 0 0 
0 
##$DATE= 1158061461
##$DBL= (0..7)
120 120 120 120 120 120 120 120 
##$DBP= (0..7)
150 150 150 150 150 150 150 150 
##$DBP07= 0
##$DBPNAM0= <>
##$DBPNAM1= <>
##$DBPNAM2= <>
##$DBPNAM3= <>
$$ [...]
##$SUBNAM7= <"">
##$SUBNAM8= <"">
##$SUBNAM9= <"">
##$SW= 20.6930455092707
##$SWIBOX= (0..15)
0 0 3 0 0 0 0 0 0 0 0 0 0 0 0 0 
##$SW_h= 5175.983436853
##$TD= 65536
##$TD0= 1
##$TE= 296.16
##$TE2= 300
##$TE3= 300
##$TEG= 300
##$TL= (0..7)
0 120 120 120 120 120 120 120 
##$TP= (0..7)
150 150 150 150 150 150 150 150 
##$TP07= 0
##$TPNAME0= <>
##$TPNAME1= <>
##$TPNAME2= <>
##$TPNAME3= <>
##$TPNAME4= <>
##$TPNAME5= <>
##$TPNAME6= <>
##$TPNAME7= <>
##$TPOAL= (0..7)
0.5 0.5 0.5 0.5 0.5 0.5 0.5 0.5 
##$TPOFFS= (0..7)
0 0 0 0 0 0 0 0 
##$TUNHIN= 0
##$TUNHOUT= 0
##$TUNXOUT= 0
##$USERA1= <user>
##$USERA2= <user>
##$USERA3= <user>
##$USERA4= <user>
##$USERA5= <user>
##$V9= 5
##$VALIST= <valist>
##$VCLIST= <CCCCCCCCCCCCCCC>
##$VD= 0
##$VDLIST= <DDDDDDDDDDDDDDD>
##$VPLIST= <PPPPPPPPPPPPPPP>
##$VTLIST= <TTTTTTTTTTTTTTT>
##$WBST= 1024
##$WBSW= 4
##$XGAIN= (0..3)
0 0 0 0 
##$XL= 0
##$YL= 0
##$YMAX_a= 424859
##$YMIN_a= -507226
##$ZGOPTNS= <>
##$ZL1= 120
##$ZL2= 120
##$ZL3= 120
##$ZL4= 120
##$ABSF1= 16.45285
##$ABSF2= -4.240322
##$ABSG= 5
##$ABSL= 3
##$ALPHA= 0
##$AQORDER= 0
##$ASSFAC= 0
##$ASSFACI= 0
##$ASSFACX= 0
##$ASSWID= 0
##$AUNMP= <proc_1d>
##$AZFE= 0.1
##$AZFW= 0.1
##$BCFW= 0
##$BC_mod= 0
##$BYTORDP= 0
##$COROFFS= 0
##$CY= 12.5
##$DATMOD= 1
##$DC= 0
##$DFILT= <>
##$DTYPP= 0
##$F1P= 14.0000005364418
##$F2P= -0.99999901652339
##$FCOR= 0.5
##$FTSIZE= 32768
##$FT_mod= 6
##$GAMMA= 0
##$GB= 0
##$INTBC= 1
##$INTSCL= 1
##$ISEN= 128
##$LB= 0.3
##$LEV0= 0
##$LPBIN= 0
##$MAXI= 10000
##$MC2= 0
##$MEAN= 0
##$ME_mod= 0
##$MI= 0
##$NCOEF= 0
##$NC_proc= -3
##$NLEV= 6
##$NOISF1= 0
##$NOISF2= 0
##$NSP= 0
##$NTH_PI= 0
##$NZP= 0
##$OFFSET= 16.45285
##$PC= 1
##$PHC0= 144.5154
##$PHC1= 13.18611
##$PH_mod= 1
##$PKNL= yes
##$PPARMOD= 0
##$PSCAL= 4
##$PSIGN= 0
##$REVERSE= no
##$SF= 250.130017295877
##$SI= 32768
##$SIGF1= 0
##$SIGF2= 0
##$SINO= 400
##$SIOLD= 32768
##$SREGLST= <1H.CDCl3>
##$SSB= 0
##$STSI= 32768
##$STSR= 0
##$SW_p= 5175.98343685301
##$SYMM= 0
##$S_DEV= 0
##$TDeff= 65536
##$TDoff= 0
##$TI= <Analysis number 999999
Compound Code 99
Book Reference 9
Project Code 9>
##$TILT= no
##$TM1= 0
##$TM2= 0
##$TOPLEV= 0
##$USERP1= <user>
##$USERP2= <user>
##$USERP3= <user>
##$USERP4= <user>
##$USERP5= <user>
##$WDW= 1
##$XDIM= 32768
##$YMAX_p= 417714500
##$YMIN_p= -201744
$$ End of Bruker specific parameters
$$ ---------------------------------
##NTUPLES= NMR SPECTRUM
##VAR_NAME=  FREQUENCY,     SPECTRUM/REAL,   SPECTRUM/IMAG
##SYMBOL=    X,             R,               I
##VAR_TYPE=  INDEPENDENT,   DEPENDENT,       DEPENDENT
##VAR_FORM=  AFFN,          ASDF,            ASDF
##VAR_DIM=   32768,         32768,           32768
##UNITS=     HZ,            ARBITRARY UNITS, ARBITRARY UNITS
##FACTOR=    0.157963299565203, 1,           1
##FIRST=     4115.35174056013, 0,            0
##LAST=      -1060.63169629288, 0,           0
##MIN=       -1060.63169629288, -201744,     0
##MAX=       4115.35174056013, 417714500,    0
$$ Real data points
##PAGE= N=1
##DATA TABLE= (X++(R..R)), XYDATA
$$ [...]
19069C39686N4474M7212o536O4200L5556j5758L5592n568m2377j01100k2285J1897
$$ 339686 394160 441372 434836 499036 534592 518834 554426 548858 506481 405381 383096 394993
19057C94993n2945k8233k888r8818n3380L7096j0925o5323k2105k6972J8617k0156
$$ 394993 342048 313815 310927 212109 158729 195825 184900 119577 97472 70500 89117 68961
19045F8961j5136M6605q259K5259K0807J598K8908K5216k3057K47M467j4895p190
$$ 68961 53825 100430 92171 117430 138237 139835 168743 193959 170902 171149 175616 160721 153531
19032A53531O193J5928j6551K470j0558J2490J6167m7322o197L3638j5842n08
$$ 153531 159724 175652 159101 161571 151013 163503 179670 132348 126151 159789 143947 143439
19020A43439k2520m5540J2832L7037J3221m159J3810R975K5259K2569Q5269N5186
$$ 143439 120919 75379 88211 125248 138469 134310 148120 158095 183354 205923 291192 346378
19008C46378q038L6162k8559p2716k912K5031j7220j21755j37571j9638M488m165
$$ 346378 338340 374502 345943 273227 270315 295346 278126 156371 18800 -838 3650 -515
18996e15K3078J790l9158L4984N9754j7435n103j6394J4582k8121l5588k1838
$$ -515 22563 24353 -14805 20179 79933 62498 57395 41001 55583 27462 -8126 -29964
18984b9964j9206l757M7753M5849k2245J323K94l3673k2959k296P2910M3549M4614
$$ -29964 -49170 -52927 -5174 40675 18430 19753 20047 -13626 -36585 -38881 34029 77578 122192
18971A22192O776n0372J7039k5651l8703J2011j6602K5052P06m459j3227j2066
$$ 122192 128968 78596 95635 69984 31281 43292 26690 51742 52448 47989 34762 22696
18959B2696j0870J0108M6137P8060J5645n3900m5012k0669K849M265J9017l3813
$$ 22696 11826 21934 68071 146131 161776 107876 62864 42195 45044 49309 68326 34513
18947C4513j5037o474R588L0507L2802j1584j7251j8501m2234J8081M9860N641
$$ 34513 19476 13002 22590 53097 85899 74315 57064 38563 -3671 14410 64270 69911
18935F9911P4J3725l4028l0499j1221J9054o4192j7658L0738Q059l9620J7348
$$ 69911 69985 83710 49682 19183 7962 27016 -37176 -54834 -24096 -16037 -55657 -38309
18923c8309P7735L9031k0023o988K9157M2366Q253n638o9039m1650J0273K140
$$ -38309 39426 78457 58434 51446 80603 122969 131222 125584 56545 14895 25168 27308
18911B7308N820K8056R643k7431R438K6800K6363N572l7301l2170J0469j2855
$$ 27308 33128 61184 70827 43396 52834 79634 105997 111569 74268 42098 52567 39712
18899C9712Q6398j8113M74j6362k2835j3261k2852j6971M0882j4494k6154J730
$$ 39712 126110 107997 108471 92109 69274 56013 33161 16190 57072 42578 16424 18154
18887A8154K6707l233L104p659n8804J079m146l290K9934N9985r143M2004l9964
$$ 18154 44861 41628 44732 37073 -21731 -20652 -24798 -28088 1846 61831 52688 94692 54728
18874E4728J1951K1470J4974j9958K194J2570j7954k2992j08o4770k7974l96O309
$$ 54728 66679 88149 103123 83165 85359 97929 79975 56983 56875 -7895 -35869 -36265 -29956
18861b9956J2952K2363k759J3442L4723P063k2325J1101M565J5788L6061m5061
$$ -29956 -17004 5359 2600 16042 50765 57828 35503 46604 51169 66957 103018 57957
18849E7957n2065m733J1844j4106L0702J6792R504J8446k6433K2197O1522K5182
$$ 57957 5892 1159 13003 -1103 29599 46391 55895 74341 47908 70105 131627 156809
18837A56809L5076Q667J8783M3153J2852N1229N9863K9628P219J7838K8171R057
$$ 156809 191885 200552 219335 262488 275340 326569 386432 416060 423279 441117 469288 478345
18825D78345j9597n204K7301J5122j6489j8810J070k4728n7725k7995O750K685
$$ 478345 458748 453544 480845 495967 479478 460668 461738 437010 379285 351290 358040 360725
18813C60725r0450k5586J8913L462n4180k1870O046K2398L1746m7760k3989K3783
$$ 360725 270275 244689 263602 267064 212884 191014 197060 219458 251204 203444 179455 203238
18801B03238J8556j9648j9061J6682k6146j0737L7862M1278l3084j3903J1025
$$ 203238 221794 202146 183085 199767 173621 162884 200746 242024 208940 195037 206062
18790B06062k0561L3498P576K1738J9632m804j6793l8584k8386k710R82m2695
$$ 206062 185501 218999 226575 248313 267945 263141 246348 207764 179378 176668 177650 134955
18778A34955K8070J5422k7036k863n03K3282K0106O3483M1432k467J3622K2143
$$ 134955 163025 178447 151411 148548 148045 171327 191433 254916 296348 293881 307503 329646
18766C29646N1903o58p7564n1471Q99j6231J9387m1322j2496k307j8011N3857
$$ 329646 381549 380891 303327 251856 252755 236524 255911 214589 202093 199786 181775 235632
18754B35632L0151J7060Q361J0129o79n280p263j0351K6928j7677J5898K0992
$$ 235632 265783 282843 291204 301333 300654 295374 288111 277760 304688 287011 302909 323901
18742C23901l9048K83J3498Q876n7602L4500M2759p841j147k5935P711j1125J8589
$$ 323901 284853 285136 298634 307510 249908 284408 327167 319326 318179 292244 299955 288830 307419
18729C07419j9702k1369L4190J252p4772k6755j4979j625K5235J680O784P590
$$ 307419 287717 266348 300538 301790 227018 200263 185284 183659 208894 210574 217358 224948
18717B24948k7883j3315R91N7309O6162J7250m8467m3953j6363J214Q787K0274
$$ 224948 197065 183750 184741 242050 308212 325462 276995 233042 216679 217893 226680 246954
18705B46954M3989N1447L0070k8505p281n474j1422o2737o505O2893L2574q676
$$ 246954 290943 342390 372460 343955 336674 331200 319778 257041 250536 313429 346003 337327
18693C37327m2159k304L1596N3162L682Q657M2366j0738J2804l0468l554l8447
$$ 337327 295168 292864 324460 377622 381304 389961 432327 421589 434393 403925 400371 361924
18681C61924M493j8015K3039L4330j1351j7510Q089L1995J2301j6695k4175L6485
$$ 361924 366417 348402 371441 405771 394420 376910 384999 416994 429295 412600 388425 424910
18669D24910O2132p118Q786L1272L8291j2420J7246J835K6864R036M5141K9331
$$ 424910 487042 479924 488710 519982 558273 545853 563099 564934 591798 600834 645975 675306
18657F75306L5064K2070J6624O6326k2280J8802M0235M0881Q5703L9538O9383
$$ 675306 710370 732440 749064 815390 793110 811912 852147 893028 978731 1018269 1087652
18646A087652P1926P7435L7041Q9172J77743J57892K25994L63406M92658O86932
$$ 1087652 1159578 1237013 1274054 1363226 1540969 1698861 1924855 2288261 2780919 3467851
18636C467851J029517J516027J853231J891141J666285J497322J564722J615781
$$ 3467851 4497368 6013395 7866626 9757767 11424052 12921374 14486096 16101877
18628A6101877J043525m00057j611561j216921l03770K73278M43774O57258Q37303
$$ 16101877 17145402 16745345 15133784 13916863 13613093 13886371 14330145 14987403 15824706
18619A5824706N71056o00809k351403k925325k323706j488219r35171o77603m68042
$$ 15824706 16395762 15794953 13443550 10518225 8194519 6706300 5771129 5093526 4625484
18610D625484k15273k30980j69516j16598q9590j33210j22709m6515o2397r4949
$$ 4625484 4410211 4179231 4009715 3893117 3803527 3670317 3547608 3501093 3438696 3343747
18600C343747l5916Q1023R0018R4437J07756L7957O762R3967J51665J16993J64166
$$ 3343747 3307831 3388854 3478872 3573309 3681065 3719022 3725784 3819751 3971416 4088409 4252575
18589D252575L49058M42394N27293O92523R77454J366108K051299L122357M528239
$$ 4252575 4601633 5044027 5571320 6263843 7241297 8607405 10658704 13781061 18309300
18580A8309300N886999O402648N913244N204599N196142N518352M461048Q32834
$$ 18309300 24196299 30598947 36512191 41716790 46912932 52431284 56892332 57725166
18572E7725166l965283m599350j958408N55990J472968J955704K654618K486841
$$ 57725166 53759883 49160533 47202125 47758115 49231083 51186787 53841405 56328246
18564E6328246j68204n858132j0063786r399829o521983m133205k798287j932374
$$ 56328246 56160042 50301910 40238124 30838295 24316312 20183107 17384820 15452446
18556A5452446j320296q84600o54544m31670k89782k07864j41986j51294j33180
$$ 15452446 14132150 13247550 12593006 12161336 11871554 11663690 11521704 11370410 11237230
18547A1237230j70979j09842j5612P9060J73680K06318M35503Q40364J373504
$$ 11237230 11066251 10956409 10940797 11019857 11193537 11399855 11835358 12675722 14049226
18538A4049226K253056L493775M952325O246902O772717O751810O984668Q110062
$$ 14049226 16302282 19796057 24748382 30995284 37768001 44519811 51504479 59614541
18530E9614541R055573P721850K970965k933581m857636l360748j926425l406711
$$ 59614541 68670114 76391964 79362929 76429348 71571712 68210964 66284539 62877828
18522F2877828p739369j0785154j0000782p287651m829160l318609k317757j656756
$$ 62877828 55138459 44353305 34352523 27064872 22235712 18917103 16599346 14942590
18514A4942590j181613r23006p45976o48345n19917m47192m30521m14749m18147
$$ 14942590 13760977 12837971 12091995 11443650 10923733 10476541 10046020 9631271 9213124
18505I213124l88649l68327l55070l20311l09938k77019k24980k26930k23949
$$ 9213124 8824475 8456148 8101078 7780767 7470829 7193810 6968830 6741900 6517951
18496F517951j61868j31052j53609j62349j54964r0795o1708M917J04214R9636
$$ 6517951 6356083 6225031 6071422 5909073 5754109 5663314 5601606 5606523 5710737 5810373
18486E810373J93825L41950N25558P93237J228890J656704J942240J944263J949929
$$ 5810373 6004198 6346148 6871706 7664943 8893833 10550537 12492777 14437040 16386969
18477A6386969K130471K456364K413310J413899n90076j613046j385346o96090
$$ 16386969 18517440 20973804 23387114 24801013 24210937 22597891 21212545 20516455
18469B0516455p01569j741491l019198l074590k444988j660226j084117p14441
$$ 20516455 19814886 18073395 15054197 11979607 9534619 7874393 6790276 6075835
18461F075835n26401m01338k93589k36384k36942j73497j76412j34387j33763
$$ 6075835 5549434 5148096 4854507 4618123 4381181 4207684 4031272 3896885 3763122
18452C763122j73996j18214j21699n1897j47048j16402r7594j35436j51311j03843
$$ 3763122 3589126 3470912 3349213 3297316 3150268 3033866 2936272 2800836 2649525 2545682
18442B545682k9124k1294j46028j51307q5223n0546p2905o3942o6193m8615n4392
$$ 2545682 2516558 2495264 2349236 2197929 2112706 2062160 1989255 1925313 1859120 1810505 1756113
18431A756113k5682k6184q8697r6154m6897k2645o8781m097j762l4080m6834l8062
$$ 1756113 1730431 1704247 1615550 1519396 1472499 1449854 1381073 1376976 1375214 1341134 1294300 1256238
18419A256238j4542m0058j8338j7349n191j9350l4650o2092q2036o352m8920l9174
$$ 1256238 1241696 1201638 1183300 1165951 1160760 1141410 1106760 1044668 962632 956280 907360 868186
18407H68186k8707q600M4715J8580k1158m3595n4375k1546L4740l7464m0729k9223
$$ 868186 839479 830879 875594 894174 873016 829421 775046 753500 788240 750776 710047 680824
18395F80824k6103l746l5669j3584k0018l6209L2959K3827J7507m3659P204O2713
$$ 680824 654721 650975 615306 601722 581704 545495 578454 602281 619788 576129 583333 646046
18383F46046j4423r0375n8289j8818j6069O6037l7413l805j7698k8144k0822j3461
$$ 646046 631623 541248 482959 464141 448072 514109 476696 472891 455193 427049 406227 392766
18371C92766j2902m560m1315j8244k0208n6492J6746L9846L4901k9230L2063O812
$$ 392766 379864 375304 333989 315745 295537 239045 255791 295637 330538 301308 333371 340183
18359C40183n3884j031j3208l5499M525M4046j8539r6215M863K2946j014L5463
$$ 340183 286299 285268 272060 236561 241086 285132 266593 170378 175241 198187 197173 232636
18347B32636k8499j8101J9948o67L144k4064k0222m0681J6100N625K6451N3087
$$ 232636 204137 186036 205984 205317 208461 184397 164175 123494 139594 145219 171670 224757
18335B24757K9354m1230p7861Q64J4149r260J0868j3444m3860k7372K8467K1991
$$ 224757 254111 212881 135020 135884 150033 140773 151641 138197 94337 66965 95432 117423
18323A17423J0611p179m3748o162k2120k8686J7394N2499O1655k740k4771l3406
$$ 117423 128034 120855 77107 70945 48825 20139 37533 90032 151687 148947 124176 90770
18311I0770m5133Q038O2470J1547j0642l455l7610J4272K4761k3402k7656q669
$$ 90770 45637 53675 116145 127692 117050 113595 75985 90257 115018 91616 63960 55291
18299E5291q11N516K6748Q225q083k0580j1531j7210N002l5096N542K8375l230
$$ 55291 54480 59996 86744 94969 86886 66306 54775 37565 42567 7471 13013 41388 38158
18286C8158P834J3033k3638K9442L8852j5l2655J2827J1290m5277J9050L3988
$$ 38158 45992 59025 35387 64829 103681 103666 71011 83838 95128 49851 68901 102889
18274A02889K911l4680J8126J7448m0700j7953K0347K1686k3143r844j282l9186
$$ 102889 105800 71120 89246 106694 65994 48041 68388 90074 66931 57087 55805 16619
18262A6619m314L652M732o561Q13J133J9546N3231N3759l445l3767j6989M542
$$ 16619 12305 15957 20689 14128 14941 16074 35620 88851 142610 139165 105398 88409 92951
18249I2951l721p633j9021Q258p580m8574k4990M101L8731J2695j3795O4035K4527
$$ 92951 89230 81597 62576 70834 63254 14680 -10310 -6209 32522 45217 31422 95457 119984
18236A19984l7589M5189l2298q3114p3278J637j4459J7042L6435L1945J1116l0706
$$ 119984 82395 127584 95286 12172 -61106 -59469 -73928 -56886 -20451 11494 22610 -8096
18224h096k728M8633K082j5427L9466L6438m7568p0597K9106J2718j0359n1509
$$ -8096 -10824 37809 39891 24464 63930 100368 52800 -17797 11309 24027 13668 -37841
18212c7841n6700M5333N0611M219q758P0481K9341j7493k4555n0500L550J6785
$$ -37841 -94541 -49208 1403 5622 -3136 67345 96686 79193 54638 4138 7688 24473
18200B4473k8624j0445L2955R897L6305J2470n2244k4274M432l5591j3305k0903
$$ 24473 -4151 -14596 18359 28256 64561 77031 24787 513 4945 -30646 -43951 -64854
18188f4854L8034N9004k308k0409k0946L8566M6413L6870l8l1058j4197l0459
$$ -64854 -26820 32184 29876 9467 -11479 27087 73500 110370 110332 79274 65077 34618
18176C4618n6988j0548K3793M4374k5575l6296L5165J4210k9041J1878O7801O7947
$$ 34618 -22370 -32918 -9125 35249 9674 -26622 8543 22753 -6288 5590 73391 141338
18164A41338q138m8053K834r888K3079M7291j3456J1656K7973j476j5589J4342
$$ 141338 133200 85147 87981 78093 101172 148463 135007 146663 174636 173160 157571 171913
18152A71913J1554l2840m3981L0490J8621j1999K572J3994M9605M8854O8991P726
$$ 171913 183467 150627 106646 137136 155757 143758 146330 160324 209929 258783 327774 335500
18140C35500m2578K0882J420l5565M959L6388L9738M2191M5412N7422O1856O0474
$$ 335500 292922 313804 315224 279659 284618 321006 360744 402935 448347 505769 567625 628099
18128F28099R5226J32894J32497R7907K03810K46934K48342L12632M33650O18310
$$ 628099 723325 856219 988716 1086623 1290433 1537367 1785709 2098341 2531991 3150301
18118C150301Q84512J392426K242806L697858N634443O323622M730290L145553
$$ 3150301 4034813 5427239 7670045 11367903 17002346 23325968 28056258 31201811
18110C1201811L791412M333519N231294J231597j2593586j1484532o310731l780433
$$ 31201811 34993223 39326742 44558036 45789633 33196047 21711515 15400784 11620351
18102A1620351k422536j644870j147456q41890n62309m07724l62393k21333j69630
$$ 11620351 9197815 7552945 6405489 5563599 5001290 4593566 4231173 4009840 3840210
18093C840210j40964j69133j92596j83446j92222k21488j78881p7114p7605j26738
$$ 3840210 3699246 3530113 3337517 3154071 2961849 2740361 2561480 2484366 2406761 2280023
18083B280023j57429q4345m9151r7285r3509o1943m1498m5913n3461l7965r7447
$$ 2280023 2122594 2038249 1989098 1891813 1798304 1736361 1694863 1648950 1595489 1557524 1460077
18072A460077p6196k9181m0232j4885n6348o1879l6858j2407K0670o804o6356
$$ 1460077 1383881 1354700 1314468 1299583 1243235 1181356 1144498 1132091 1152761 1145957 1079601
18061A079601Q775J782m1774o1711p078L0434K2230l9054p0800m6780o6205L411
$$ 1079601 1088376 1090158 1048384 986673 979595 1010029 1032259 993205 922405 875625 809420 812831
18049H12831J3658K6762J7336M824k0503j4194j2077q5948r5540n4062l8114o2736
$$ 812831 826489 853251 870587 875411 854908 840714 828637 742689 647149 593087 554973 492237
18037D92237j6713r8763M548J2776Q691M5708L1081n973m0403o445n2025n3246
$$ 492237 475524 376761 381309 394085 402776 448484 479565 473592 433189 426744 374719 321473
18025C21473L9820K29o1161k7116Q189M644K605J8262p9671J5767K4641K8739
$$ 321473 361293 361522 300361 273245 281434 286078 288683 306945 227274 243041 267682 296421
18013B96421J1700l3001K8651O2949L0340K6590K60L1154M5847j0585M6298m888
$$ 296421 308121 275120 303771 366720 397060 423650 423910 455064 500911 490326 536624 531736
18001E31736p4419o8646m0767l4772l8614k5785j7293K8749K5221P382m8705l6340
$$ 531736 457317 388671 347904 313132 274518 248733 231440 260189 285410 292792 244087 207747
17989B07747P4308l812l4107O0325K8919j6613J5649j1888k0191P011j9844m0588
$$ 207747 282055 278243 244136 304461 333380 316767 332416 320528 300337 307348 287504 246916
17977B46916K1314M8524j1326l8101n6307n2486k0950o0953m5852j214O8678O0392
$$ 246916 268230 316754 305428 267327 211020 158534 137584 76631 30779 29565 98243 158635
17965A58635j2332k6103l4k3724j2913M1586O6315K2672J0817K5399q481O9790
$$ 158635 146303 120200 120166 96442 83529 125115 191430 214102 224919 250318 241837 311627
17953C11627M9091m5583k0309J3779N048l708J7994k7366m4602l4392l6752l0720
$$ 311627 360718 315135 294826 308605 313653 309945 327939 300573 255971 221579 184827 154107
17941A54107m0173q637K264k557K2870M2028m9876n0112j3769L992K59K0931j6531
$$ 154107 113934 105297 107561 105004 127874 169902 120026 69914 56145 60137 60396 81327 64796
17928F4796m931k2356k7449M3508N657l66O010k0863q5222m9401K0620M4316J9565
$$ 64796 59865 37509 10060 53568 59225 58859 64869 44006 -41216 -90617 -69997 -25681 -6116
17915f116J8205m7635m3791k0731M8569J7445k7861n7589k0110N7664J8607j746
$$ -6116 12089 -35546 -79337 -100068 -51499 -34054 -61915 -119504 -139614 -81950 -63343 -65089
17903f5089L4376K5029k3993K562K7366k9923k1341K7596M382J3685k9539L0460
$$ -65089 -30713 -5684 -29677 -27115 251 -29672 -51013 -23417 -19035 -5350 -34889 -4429
17891d429j8832o0339L4656J4461N051l0490k7871R452m225Q22l5883k1447J676
$$ -4429 -23261 -83600 -48944 -34483 -29432 -59922 -87793 -78341 -82566 -81744 -117627 -139074 -137398
17878a37398J2869L4166L8262K7815k0019J9802r902j5706N938J8025J9792K5760
$$ -137398 -124529 -90363 -52101 -24286 -44305 -24503 -34405 -50111 -44173 -26148 -6356 19404
17866A9404j3955l413l092K9936J3524n4350k2273L8908J6351R939m7851l1760
$$ 19404 5449 2036 -1056 28880 42404 -11946 -34219 4689 21040 30979 -16872 -48632
17854d8632K5090p002j3793L1992n612J5947j994m138J9098M4077K178l9647m264
$$ -48632 -23542 -30544 -44337 -12345 -17957 -2010 -4004 -8142 10956 55033 57211 17564 13300
17841A3300m2939m2321r297l0195J4946K4206m6906j2027o195L859L7074N109
$$ 13300 -29639 -71960 -81257 -111452 -96506 -72300 -119206 -131233 -137428 -133569 -96495 -91386
17829i1386K3999m1270M585K9397K5857J2159k9017J4280L8256K9387K9368l9893
$$ -91386 -67387 -108657 -104072 -74675 -48818 -36659 -65676 -51396 -13140 16247 45615 5722
17817E722K349k2880l6803K6011l405j8272k8493l5866L3870L5256k230m2570
$$ 5722 8071 -14809 -51612 -25601 -29006 -47278 -75771 -111637 -77767 -42511 -44741 -87311
17805h7311K0350L2651J8413O98J1724j8628j4713j4463j3517J672O1230J9113
$$ -87311 -66961 -34310 -15897 -15199 -3475 -22103 -36816 -51279 -64796 -63124 -1894 17219
17793A7219o39m6084m4942j186K775K1509O322K4214L8863M7038K0431l47n1909
$$ 17219 16580 -29504 -74446 -75632 -72857 -51348 -45026 -20812 18051 65089 85520 85173 33264
17780C3264l958k606j1977m8l30J4945M6655p873n4737l5403J6579K1797P12l2351
$$ 33264 29306 26700 14723 14675 14345 29290 75945 68072 13335 -22068 -5489 16308 17020 -15331
17766a5331n2321n4432K1096M7510l0061o5365K967M1917K4573j3409L2414O41
$$ -15331 -67652 -122084 -100988 -53478 -83539 -148904 -145937 -104020 -79447 -92856 -60442 -59801
17754e9801L3965K8859l497j2541o794k2992k2323J0497N050M4756R848n6807
$$ -59801 -25836 3023 -474 -13015 -19809 -42801 -65124 -54627 -49577 -4821 5027 -51780
17742e1780q208J5074M3874l4890m7285l5812J7188j187J6028l746k566L0429
$$ -51780 -59988 -44914 -1040 -35930 -83215 -119027 -101839 -103026 -86998 -90744 -93310 -62881
17730f2881N0122j371m1368J4997m3487l7455q245O1820J1623j42L1669J106q061
$$ -62881 -12759 -14130 -55498 -40501 -83988 -121443 -129688 -67868 -56245 -56387 -24718 -23612 -31673
17717c1673p129k7071j6044k0558L2506O3515j7851m1765L2815K6034j7875n288
$$ -31673 -38802 -65873 -81917 -102475 -69969 -6454 -24305 -66070 -33255 -7221 -25096 -30384
17705c0384R355P654K7887r17m357J2463j1658j2526M614k4360J0392J4289L5481
$$ -30384 -21029 -13375 14512 13595 9238 21701 10043 -2483 2131 -22229 -11837 2452 37933
17692C7933r277r252J6704M3561m747j6208n8869r243Q246K1019N9588n4311l0550
$$ 37933 28656 19404 36108 79669 74922 58714 -155 -9398 -1152 19867 79455 25144 -5406
17679e406k3196J2103P811k1179j9444L5327j8429n4538J0458L4340L1776K9126
$$ -5406 -28602 -16499 -8688 -29867 -49311 -13984 -32413 -86951 -76493 -42153 -10377 18749
17667A8749j7133l1940j83L3006r251o538n6948p3740n3722m044O0971L0285m969
$$ 18749 1616 -30324 -30507 2499 -6752 -13290 -70238 -143978 -197700 -201744 -140773 -110488 -115457
17654a15457M9692L3200l3896j1271P1787L6567M1072J8278o8070q0020k1292
$$ -115457 -65765 -32565 -66461 -77732 -5945 30622 71694 89972 21902 -58118 -79410
17643g9410M2142O0378n1979K6280K7905L6279k8070n4852k4863p123j3402N331
$$ -79410 -37268 23110 -28869 -2589 25316 61595 33525 -21327 -46190 -53313 -66715 -61384
17631f1384M1912k3198k9741k9986J0318j1570J67N0762j2063R255L2318M5949
$$ -61384 -19472 -42670 -72411 -102397 -92079 -103649 -103482 -52720 -64783 -55528 -23210 22739
17619B2739j319q237J5603k958q141k2775j5708j293k5431m8301J3689p707k5333
$$ 22739 21420 13183 28786 25828 17687 -5088 -20796 -22089 -47520 -95821 -82132 -89839 -115172
17606a15172L6727M1054J3367J1379Q685p373k7333k410j0302m2508m0136J1030
$$ -115172 -78445 -37391 -24024 -12645 -3960 -11333 -38666 -41076 -51378 -93886 -134022 -122992
17594a22992R2936M0415m2843J3674L2209p910k3268o5057J2688J3871m1768j0359
$$ -122992 -30056 10359 -32484 -18810 13399 5489 -17779 -82836 -70148 -56277 -98045 -108404
17582a08404N2324L7940p862m5930n8825J7450P0876L3307K5187K6632k434J0291
$$ -108404 -56080 -18140 -26002 -71932 -130757 -113307 -42431 -9124 16063 42695 40261 50552
17570E0552J0566j8573l452k4754k0392k727K8872J7618P571O531o1298M342p132
$$ 50552 61118 42545 39093 14339 -6053 -8780 20092 37710 45281 51812 -9486 -5144 -12276
17557a2276N287m2569L001O5336L3919l3019r699J8376K1160N364l1518R450J3352
$$ -12276 -6989 -49558 -46557 18779 52698 19679 9980 28356 49516 54880 23362 32812 46164
17544D6164p1934n7854m5235l2580M5050M0099k3220j015L88J414l9P3972K5006
$$ 46164 -25770 -83624 -128859 -161439 -116389 -76290 -99510 -100525 -100137 -98723 -98762 -24790 216
17531B16K2525L9579k5836P055n1065p7647J6329M2942j5837L626J2967M6882
$$ 216 22741 62320 36484 43539 -7526 -85173 -68844 -25902 -41739 -38113 -25146 21736
17519B1736L9622j19m2084j0694j6365k1411j1182j2953p510O3301N0758M7268
$$ 21736 61358 61239 19155 8461 -7904 -29315 -40497 -53450 -60960 2341 53099 100367
17507A00367m071o6398j0514K703l2940l4373K4943J2188n5483j7814q167P4227
$$ 100367 96296 29898 19384 22087 -10853 -45226 -20283 -8095 -63578 -81392 -89559 -15332
17495a5332k189L979K7630N2042k9375o7975k8311l2814j0261O1043K5248l030
$$ -15332 -17521 -13542 14088 66130 36755 -31220 -59531 -92345 -102606 -41563 -16315 -19345
17483a9345J4796N3105J7943l1601k7385J8785m1637k3013P4559M8118K1944n0272
$$ -19345 -4549 48556 66499 34898 7513 26298 -15339 -38352 36207 84325 106269 55997
17471E5997m0475n4732O022R528k3835k3981K7855j8724J2154P4536Q564Q85j4441
$$ 55997 15522 -39210 -33188 -23660 -47495 -71476 -43621 -62345 -50191 24345 32909 33794 19353
17458A9353N8751j9480p9239O546J4769k9208m047M680K2015l9322J2573N0078
$$ 19353 78104 58624 -20615 -14069 700 -28508 -32555 -27875 -5860 -45182 -32609 17469
17446A7469M9183L7764M610J4428L3969M1819p252o2657p1393m6208M0706Q230
$$ 17469 66652 104416 109026 123454 157423 199242 191990 129333 57940 11732 52438 60668
17434F0668m9220k2118L9880M9351L091k2515M604j6200k1997j2047K1027j789
$$ 60668 11448 -10670 29210 78561 81652 59137 63741 47541 25544 13497 34524 32735
17422C2735K616l910O048n324L5387J1291m2276n1064o040k9068j3229M4155M3292
$$ 32735 35351 31441 37489 32165 67552 78843 36567 -14497 -20537 -49605 -62834 -18679 24613
17409B4613M454N566P020k2906k5065K0454K3267m7673l5226r150k926M4085k4739
$$ 24613 29067 34633 41653 18747 -6318 14136 37403 -10270 -45496 -54646 -57572 -13487 -38226
17396c8226k7328m2084O879L5087M2333K6961n5058l2761M7798J3136L6383K5871
$$ -38226 -65554 -107638 -100759 -65672 -23339 3622 -51436 -84197 -36399 -23263 13120 38991
17384C8991J8973o468l2218p931p754p915L9370k4431m4472k4898K17J2080l0640
$$ 38991 57964 51496 19278 11347 3593 -4322 35048 10617 -33855 -58753 -58536 -46456 -77096
17371g7096l1290l1274M8930P2899O2554J0990l0899j7767J450J9260j3586l1281
$$ -77096 -108386 -139660 -90730 -17831 44723 55713 24814 7047 8497 27757 14171 -17110
17359a7110K1244M3951O507l0095j8067K0967P026j1237n0643n8446M0882p818
$$ -17110 4134 48085 54592 24497 6430 27397 34423 23186 -27457 -85903 -45021 -52839
17347e2839m7236K0136J1237N014L4634K0332k202K0804r630m2091j6828J6112
$$ -52839 -100075 -79939 -68702 -63688 -29054 -8722 -10924 9880 250 -41841 -58669 -42557
17335d2557K3278n9045j7888J9899P713K6904J4981j2403N5976J5722n0892J0198
$$ -42557 -19279 -78324 -96212 -76313 -68600 -41696 -26715 -39118 16858 32580 -18312 -8114
17323h114J4231K3065L1495m2927o5740r422J8995l4665N979O515L2222J2296
$$ -8114 6117 29182 60677 17750 -47990 -57412 -38417 -73082 -67103 -60588 -28366 -16070
17311a6070j2280K7382j5868m184J5010o282p927M1873k9010m5066J6949J4571
$$ -16070 -28350 -968 -16836 -21020 -6010 -12292 -20219 21654 -7356 -52422 -35473 -20902
17299b0902J2241m0693j2163k7968K7852K6716r87l1113q76Q838J8356J5865n201
$$ -20902 -8661 -49354 -61517 -89485 -61633 -34917 -35904 -67017 -67893 -59055 -40699 -24834 -30035
17286c0035K4335j2438m0429M8516O4609O810j8278R707k6334j3488M0947j0831
$$ -30035 -5700 -18138 -58567 -10051 54558 61368 43090 52797 26463 12975 53922 43091
17274D3091l2336N298O108N2398N2249j7779n8536n3121K1212K7682o710N2433
$$ 43091 10755 16053 22161 74559 126808 109029 50493 -2628 18584 46266 39556 91989
17262I1989k1520o020K7905j5049k1392j6487k8288R762k6727K7618P676o920
$$ 91989 70469 64449 92354 77305 55913 39426 11138 20900 -5827 21791 29467 22547
17250B2547j1630n2475m0974L1618O2886N6045K1547n5146l6536j6319K9660R010
$$ 22547 10917 -41558 -82532 -50914 11972 68017 89564 34418 -2118 -18437 11223 20233
17238B0233R627L1962m2806m495j7266j2446K0310j637p042K2031L7361l896J3414
$$ 20233 29860 61822 19016 14521 -2745 -15191 5119 3482 -3560 18471 55832 51936 65350
17225F5350m5463m1013m530L1231M5184K981j3374l6218K7182J0198p6179l7458
$$ 65350 19887 -21126 -25656 5575 50759 53740 40366 4148 31330 41528 -34651 -72109
17213g2109K0588M5160j2694K0214K0430m5061j0522j5903K723K8222k4365L3087
$$ -72109 -51521 -6361 -19055 1159 21589 -23472 -33994 -49897 -47174 -18952 -43317 -10230
17201a0230M0854j9369m248m2598r927j1248m1500K1031K0952k4714k6858N0816
$$ -10230 30624 11255 7007 -35591 -45518 -56766 -98266 -77235 -56283 -80997 -107855 -57039
17189e7039j6413K5361R347R82J9511j6509L2215L7760j4245L9338l9324m5662
$$ -57039 -73452 -48091 -38744 -37762 -18251 -34760 -2545 35215 20970 60308 20984 -24678
17177b4678k0994J8114J5058M9323k2732m4001k2537J2471M389j4842J3851J5075
$$ -24678 -45672 -27558 -12500 36823 14091 -29910 -52447 -39976 -35587 -50429 -36578 -21503
17165b1503j2679J2517o72l3150j1727k3556J4771j0318K1356M5689K105l6314
$$ -21503 -34182 -21665 -22337 -55487 -67214 -90770 -75999 -86317 -64961 -19272 -17167 -53481
17153e3481M8867k6741k2087O2428N7576L198l9012j7123J4083l0537J7150o680
$$ -53481 -4614 -31355 -53442 8986 66562 69760 30748 13625 27708 -2829 14321 7641
17141G641l7316K5840k5962m8267k48Q062K8278K6487J9340l3160q463K5194k7425
$$ 7641 -29675 -3835 -29797 -78064 -78312 -70250 -41972 -15485 3855 -29305 -37768 -12574 -39999
17128c9999L2711k4280n970m0993P470K4677K3179j3084j1409L2867L7774k8869
$$ -39999 -7288 -31568 -37538 -78531 -71061 -46384 -23205 -36289 -47698 -14831 22943 -5926
17116e926k0737K7241j0032J2517q422j7876l3251O518M2976J0213n0290l2392
$$ -5926 -26663 578 -9454 3063 -5359 -23235 -56486 -49968 -6992 3221 -47069 -79461
17104g9461N3234K3409J0906l2668N32Q148J3823O193O7796K2311n849m7939l0040
$$ -79461 -26227 -2818 8088 -24580 -24048 -15900 -2077 4116 71912 94223 88374 40435 10395
17091A0395J4444J9343J5672J6732o034m9228k7777M6523M8616q515n3216j9823
$$ 10395 24839 44182 59854 76586 70552 21324 -6453 40070 88686 80171 26955 7132
17079G132J0209R633K0693Q855M599j883K3771K2143N4467j8510k7802j9749M9691
$$ 7132 17341 26974 47667 56522 61121 59238 83009 105152 159619 141109 113307 93558 143249
17066A43249L4983L5089M7857J6958K2364M7730O043l7317l8702m0785l0580o4830
$$ 143249 178232 213321 261178 278136 300500 348230 354273 316956 278254 237469 206889 142059
17054A42059l9475J760J0933k4358l213m257o642P640k3299L0414p0481n4597
$$ 142059 102584 104344 115277 90919 87706 83449 76807 84447 61148 91562 21081 -33516
17042c3516l864M710m0490P066L5433P5333L3084j4901o2835l004J2031l0240
$$ -33516 -37380 -32670 -73160 -66094 -30661 44672 77756 62855 20 -2984 9047 -21193
17030b1193o3221k0438J6380K434K7590K0853K8692M4869J0525n1172J3377j9512
$$ -21193 -84414 -104852 -88472 -86038 -58448 -37595 -8903 35966 46491 -4681 8696 -10816
17018a0816m1191K0968K7321q461l5415k0233l8809O4396P2326K758j5885k9363
$$ -10816 -52007 -31039 -3718 -12179 -47594 -67827 -106636 -42240 30086 32844 16959 -12404
17006a2404R675q338O699L7243j1573l277J0814L3753j6191j098l1719o7573L15
$$ -12404 -2729 -11067 -4368 32875 21302 18025 28839 62592 46401 45303 13584 -53989 -53674
16993e3674K5905K0917N813J0639J4463m163n1081m3711j5792J4455M4019L3853
$$ -53674 -27769 -6852 -1039 9600 24063 19900 -31181 -74892 -90684 -76229 -32210 1643
16981A643L9003j9962k9433r782k5309n291M1411j3414k0848K3137m523J6309
$$ 1643 40646 20684 -8749 -18531 -43840 -49131 -7720 -21134 -41982 -18845 -23368 -7059
16969g059Q388k3172j7116k8394K6215J804L020p004p339L2485N8388k3301j3081
$$ -7059 1329 -21843 -38959 -67353 -41138 -39334 -36314 -43318 -50657 -18172 40216 16915 3834
16956C834j728L9515k6910l4028n6608P314O2595L4262K6284q383l6599j0286
$$ 3834 2106 41621 14711 -19317 -75925 -68611 -6016 28246 54530 46147 9548 -738
16944g38K6723P0814N1836k0880p7234n5292L7688m8267q130M4173O210M6692
$$ -738 25985 96799 148635 127755 50521 -4771 32917 -15350 -23480 20693 26903 73595
16932G3595l992J4299o511l8686k7661m57L7734k0434o9483m1298L0292K9039
$$ 73595 69603 83902 77391 38705 11044 10587 48321 27887 -41596 -82894 -52602 -23563
16920b3563j8422m9986N461O8364p38n8470N223M9684K9361n434L1534J9005P170
$$ -23563 -41985 -91971 -86510 -18146 -18884 -77354 -72131 -22447 6914 1480 33014 52019 59189
16907E9189j8579j6045o456l3400p783q27j4047n0789K5217Q511o62M7199q780
$$ 59189 40610 24565 18109 -15291 -23074 -23901 -37948 -88737 -63520 -55009 -55671 -8472 -17252
16894a7252j7242K2229r953m0091l5222l902L6485J8179O066k6694q791J0474
$$ -17252 -34494 -12265 -22218 -62309 -97531 -101433 -64948 -46769 -40703 -67397 -76188 -65714
16882f5714k019k2414P0838N1817J4175J4048m4151n8233N168m9038k3541M3083
$$ -65714 -67733 -90147 -19309 32508 46683 60731 16580 -41653 -36485 -85523 -109064 -65981
16870f5981M7070l0424L7605J4539m2287j8368L0517K3501J0718o711r72n0086
$$ -65981 -18911 -49335 -11730 2809 -39478 -57846 -27329 -3828 6890 179 -793 -50879
16858e0879M4528Q429l6721j5187q375L7564j2519l7156L1203j3800P579L1538
$$ -50879 -6351 2078 -34643 -49830 -58205 -20641 -33160 -70316 -39113 -52913 -45334 -13796
16846a3796j134J6595J658k7594o717l4482q223n470P867N5131k3196M10K3027
$$ -13796 -14930 1665 3323 -24271 -30988 -65470 -73693 -79163 -71296 -16165 -39361 -38951 -15924
16833a5924k234K2288p109k3781J5546r886J4101J6074m0065k6143l520K5858
$$ -15924 -18158 4130 -2979 -26760 -11214 -21100 -6999 9075 -30990 -57133 -60653 -34795
16821c4795J9735M322n867K9881N4598N727k9788l3967r820k7498K0054K5459
$$ -34795 -15060 -10738 -16605 13276 67874 73601 43813 9846 26 -27472 -7418 18041
16809A8041L6852q450q2978J8044j6039M01K9943J7080k1216k0958q757K531L2564
$$ 18041 54893 46443 -36535 -18491 -34530 -34129 -4186 12894 -8322 -29280 -38037 -35506 -2942
16796b942K4681k0183k7501n143R145k6580L2467R340J0560M2414r807k7374J4112
$$ -2942 21739 1556 -25945 -31088 -21943 -48523 -16056 -6716 3844 46258 36451 9077 23189
16783B3189K6024m7970j1436M2185j3097n3207Q094K9857j899J41j5230K3978
$$ 23189 49213 1243 -10193 31992 18895 -34312 -26218 3639 1740 1881 -13349 10629
16771A0629K2479p592k3800j6046J4309K7584K612o2425K5413N3114r1J3571k1395
$$ 10629 33108 25516 1716 -14330 -21 27563 30175 -32250 -6837 46277 46186 59757 38362
16758C8362q779K5463k5722M328l0011m1647K6371q380j6798L8775J857j4303
$$ 38362 29583 55046 29324 33652 3641 -38006 -11635 -20015 -36813 1962 3819 -10484
16746a0484p703j1084N618Q968M175J9688q097M2L8496L6047k7428j8775k124
$$ -10484 -18187 -29271 -23653 -14685 -10510 9178 1081 1123 39619 75666 48238 29463 27339
16733B7339o374k7154n9652k2185J5419M6748j1879k0488Q199J7674n0174n3471
$$ 27339 20965 -6189 -65841 -88026 -72607 -25859 -37738 -58226 -50027 -32353 -82527 -135998
16721a35998K7790K6872P2295L5958K6515K9105n7071p7931m627m1405M1053l511
$$ -135998 -108208 -81336 -9041 26917 53432 82537 25466 -52465 -57092 -98497 -57444 -60955
16709f0955k3165J771Q067n8522j8247K6998L8786k8822n041k7929n41K1895Q986
$$ -60955 -84120 -82349 -74282 -132804 -151051 -124053 -85267 -114089 -119130 -147059 -147600 -125705 -116719
16696a16719k00J7518K0080K3285R265l2285r727N5614L4111R365N562k7785K4359
$$ -116719 -116919 -99401 -79321 -56036 -46771 -79056 -88783 -33169 942 10307 15869 -11916 12443
16683A2443m1986m8061n2252r504N2394j7681K045J2551K5731Q887j04k6641J8606
$$ 12443 -29543 -77604 -129856 -139360 -86966 -104647 -102602 -90051 -64320 -55433 -55537 -82178 -63572
16670f3572j7831k7375L8791M258K855L1838n063k912M8515n7445o9521J7902
$$ -63572 -81403 -108778 -69987 -65729 -62874 -31036 -36099 -39011 9504 -47941 -117462 -99560
16658i9560L851J243j0070m2162N2243O7488J909L2725K0505L2995J2552n4734
$$ -99560 -95709 -94466 -104536 -146698 -94455 -26967 -25058 7667 28172 61167 73719 18985
16646A8985m8169n3112O3515N0734j5133L5077J5324k0023J2080o468k7361j4601
$$ 18985 -29184 -82296 -18781 31953 16820 51897 67221 47198 59278 52810 25449 10848
16634A0848m4150l3767Q064K4923N4867p484j3565j950k4531J0491j8859M0014
$$ 10848 -33302 -67069 -59005 -34082 20785 13301 -264 -2214 -26745 -16254 -35113 4901
16622D901m019m9650k0222L9226K2068j8178k3165K0638N209k3286J4462L0913
$$ 4901 882 -48768 -68990 -29764 -7696 -25874 -49039 -28401 -23192 -46478 -32016 -1103
16610a103P183l5971k4354j8625l8957J7570M5270K9421L5448J5929n6218n1068
$$ -1103 6080 -29891 -54245 -72870 -111827 -94257 -48987 -19566 15882 31811 -24407 -75475
16598g5475j8467J8786J6446j9928K1784L7846K2073n5825M208J044K7587O3625
$$ -75475 -93942 -75156 -58710 -78638 -56854 -19008 3065 -52760 -48552 -47508 -19921 43704
16586D3704k3735p0734l5243l618K3063K0650N809J4588k1316k6091k3679N1044
$$ 43704 19969 -50765 -86008 -89626 -66563 -45913 -40104 -25516 -46832 -72923 -96602 -45558
16574d5558L47j9131K8997K4785k1601j1483K4568j4694l7820M8945O5455j9679
$$ -45558 -45211 -64342 -35345 -10560 -32161 -43644 -19076 -33770 -71590 -22645 42810 23131
16562B3131j1732n3566l1941m37K5202k0652j7104N4453k7273q1496K7159N7062
$$ 23131 11399 -42167 -74108 -74545 -49343 -69995 -87099 -32646 -59919 -141415 -114256 -57194
16550e7194M1393J3021m3461P789r14J779m8178m4921j519K5776l0634K1080P2351
$$ -57194 -15801 -2780 -46241 -38452 -39366 -37587 -85765 -130686 -132205 -106429 -137063 -115983 -43632
16537d3632J2546j2189m3790L9614O4862l5283J2055L1026L4749l6252j4549R485
$$ -43632 -31086 -43275 -87065 -47451 17411 -17872 -5817 25209 59958 23706 9157 18642
16525A8642m108l0969m9390L6340R396Q350L204J9056j7446k1034k6119M3179
$$ 18642 14534 -16435 -65825 -29485 -20089 -11739 -8535 10521 -6925 -27959 -54078 -10899
16513a0899N610k4336J6107r2382o9626O1618j4222M9870L7600K8556m0508l3025
$$ -10899 -5289 -29625 -13518 -105900 -175526 -113908 -128130 -78260 -40660 -12104 -52612 -85637
16501h5637N3065j135N8810M8434k8520o2852j8648l465J2690k0430L9735O2738
$$ -85637 -32572 -33707 25103 73537 45017 -17835 -36483 -39948 -27258 -47688 -7953 54785
16489E4785o2067n2118l1943O0750L644j4024l13l1724l885k7626L6347J1128
$$ 54785 -7282 -59400 -91343 -30593 -26949 -40973 -41286 -73010 -76895 -104521 -68174 -57046
16477e7046L6214R4573L6746m7017n2733j9713k9100O266k7104L5353Q676J5087
$$ -57046 -20832 73741 110487 63470 10737 -8976 -38076 -31810 -58914 -23561 -14885 202
16465B02O062J3435l0842K3466n533P30k9014k9580j1910J0567m3804O076L9008
$$ 202 6264 19699 -11143 12323 6790 7520 -21494 -51074 -62984 -52417 -96221 -90145 -51137
16452e1137J4751K3847k7237k9918R969j0807n9843J2311m572j3279J9908L2210
$$ -51137 -36386 -12539 -39776 -69694 -59725 -70532 -130375 -118064 -122636 -135915 -116007 -83797
16440h3797J7914L0630N440K811l0448p851L2648L0876J1243o052n5537n0242
$$ -83797 -65883 -35253 -29813 -27002 -57450 -65301 -32653 -1777 9466 3414 -52123 -102365
16428a02365k1678P9951M3779k5453m5958N906J971k1235m1050n747k6733l168
$$ -102365 -124043 -44092 -313 -25766 -71724 -65818 -63847 -85082 -126132 -131879 -158612 -161780
16416a61780N1307j8523K9352Q2017N03m6962j7817o842K9164K3099m5431K7792
$$ -161780 -110473 -128996 -99644 -17627 -17124 -64086 -81903 -88745 -59581 -36482 -81913 -54121
16404e4121J5942k7715j1135j5114L1667K1585P058k9988M062J6329j6488n1118
$$ -54121 -38179 -65894 -77029 -92143 -60476 -38891 -31833 -61821 -57759 -41430 -57918 -109036
16392a09036k019O1179P879K223Q006J332J2831j7981L4068r046K070K3994M0590
$$ -109036 -111055 -49876 -41997 -39774 -31768 -30436 -17605 -35586 -1518 -10564 -8494 15500 56090
16379E6090p169k8136m4219k1388J0973L3077J0462j0598K656J1565j5022j5437
$$ 56090 48921 20785 -23434 -44822 -33849 -772 9690 -908 1748 13313 -1709 -17146
16367a7146j0800j2321m437P796r892M2916j3621k6671J0317K2187J3681L9579
$$ -17146 -27946 -40267 -44704 -36908 -46800 -3884 -17505 -44176 -33859 -11672 2009 41588
16355D1588L4734k9760p5012j3630j6652M4619k120J757J9626J4175l3988k7330
$$ 41588 76322 46562 -28450 -42080 -58732 -14113 -16233 -14476 5150 19325 -14663 -41993
16343d1993J3837K1461L7352o5544J5692M2402l6554k1028K7811N0877o1085l4425
$$ -41993 -28156 -6695 30657 -34887 -19195 23207 -13347 -34375 -6564 44313 -16772 -51197
16331e1197J1796M7898M1936J2987k8497o9005N251j2795J1197P354m1528j5749
$$ -51197 -39401 8497 50433 63420 34923 -34082 -28831 -41626 -30429 -23075 -64603 -80352
16319h0352k4406K9927J9422J7649l9943o5890l668k8689J8451O6639L9864j5461
$$ -80352 -104758 -74831 -55409 -37760 -77703 -143593 -147261 -175950 -157499 -90860 -50996 -66457
16307f6457L164p448j7736j6537M5707N7954L549l2400o045m7031N671K8129K2840
$$ -66457 -63293 -70741 -88477 -105014 -59307 -1353 2196 -30204 -36249 -83280 -77609 -49480 -26640
16294b6640j2730J214m3664l6344L1982n707l7181L2146m47n007K5660k0334m1179
$$ -26640 -39370 -38156 -81820 -118164 -86182 -91889 -129070 -96924 -97371 -102378 -76718 -97052 -138231
16281a38231K4066N2382k8677o114K1649q82K903o539K2615K8668j8924M297K3299
$$ -138231 -114165 -61783 -90460 -96574 -74925 -75807 -72904 -79443 -56828 -28160 -47084 -42787 -19488
16268a9488j6620k1791J5302j9488k0899r569n386M1581L5958J4948L0258k7632
$$ -19488 -36108 -57899 -42597 -62085 -82984 -92553 -97939 -56358 -20400 -5452 24806 -2826
16256b826l2809l1512L8548K1259m1945m4737n2213J0169l560J5928L4544J1213
$$ -2826 -35635 -67147 -28599 -7340 -49285 -94022 -146235 -136066 -139626 -123698 -89154 -77941
16244g7941K426l3516Q6988N4345j0317n3440P170k8305p2192M1964L3711N6928
$$ -77941 -75515 -109031 -22043 32302 21985 -31455 -24285 -52590 -124782 -82818 -49107 7821
16232G821K3304n1442K0344M3633J4698l4191o2892n279K0992J4207K167L3127
$$ 7821 31125 -20317 27 43660 58358 24167 -38725 -44004 -23012 -8805 -6638 26489
16220B6489J2436J6192n0312k5896j3409j9891j2428k976K443L9223K7739K1494
$$ 26489 38925 55117 4805 -21091 -34500 -54391 -66819 -69795 -67352 -28129 -390 21104
16208B1104j7257K5662j8862p0456J1075J0933J6P956K2644K6091m6297k8703
$$ 21104 3847 29509 10647 -59809 -48734 -37801 -37785 -29829 -7185 18906 -27391 -56094
16196e6094l4679j3286K062j9020K6313j567L8129K2032k1389K7833M8528j836
$$ -56094 -90773 -104059 -101997 -121017 -94704 -96271 -58142 -36110 -57499 -29666 18862 17026
16184A7026l7568j7226j2931o3643r792N3464m2605r938P8118k0415m5695L7061
$$ 17026 -20542 -37768 -50699 -114342 -124134 -70670 -113275 -123213 -45095 -65510 -111205 -74144
16172g4144K7350K861J9627k555m426j841N0839q341l3114J8359r667n7325M7619
$$ -74144 -46794 -43933 -24306 -26861 -31287 -33128 17711 9370 -23744 -5385 -15052 -72377 -24758
16159b4758K6109K2252k3378l8445J0603l8700P03j3820n3K6348K6851j9217J9735
$$ -24758 1351 23603 225 -38220 -27617 -66317 -65614 -79434 -79487 -53139 -26288 -45505 -25770
16146b5770K3896K5959O113n8669K1349K0956Q537l3572r234k5440l4443K687
$$ -25770 -1874 24085 30198 -28471 -7122 13834 22371 -11201 -20435 -45875 -80318 -77631
16134g7631L5491k0730o893J9133L469p993L749J7357L1348r720K7840L2279k3404
$$ -77631 -42140 -62870 -69763 -50630 -47161 -55154 -51405 -34048 -2700 -12420 15420 47699 24295
16121B4295k7812n0714L4732P5842k2488n4122N5856P2454n2069p4479j3072o688
$$ 24295 -3517 -54231 -19499 56343 33855 -20267 35589 108043 55974 -18505 -31577 -38265
16109c8265J1710j7685k2711k9247M3950J8911q800m135N7451K6524M7984j30
$$ -38265 -26555 -44240 -66951 -96198 -52248 -33337 -42137 -46272 11179 37703 85687 85557
16097H5557o1572n8138m5659L306L3015K1150n219K1870k2109k546j07n3434K5406
$$ 85557 23985 -34153 -79812 -76506 -43491 -22341 -27560 -5690 -27799 -30345 -30452 -83886 -58480
16084e8480M2864P745o1135J9144P9024r421p2739K059K9730K8173r319m6020
$$ -58480 -15616 -7871 -69006 -49862 29162 19741 -52998 -50939 -21209 6964 -2355 -48375
16072d8375K3957K1004L7254l4350j4965l0806k3816K7300J9680P558j6229j321
$$ -48375 -24418 -3414 33840 -510 -15475 -46281 -70097 -42797 -23117 -15559 -31788 -33109
16060c3109m898K6003O580k3418o2013J2038p645M659M0637O553N1998J4970k8155
$$ -33109 -38007 -12004 -5424 -28842 -90855 -78817 -86462 -81803 -41166 -34613 17385 32355 4200
16047D200M6258j8911l0522J3863K7410N0646l4764m2020J1343J35J8551l5413
$$ 4200 50458 31547 1025 14888 42298 92944 58180 16160 27503 27638 46189 10776
16035A0776m1535m402J4244J795O186o036M6596J1354m2791n2842k4784j8017
$$ 10776 -30759 -35161 -20917 -19122 -12936 -18972 27624 38978 -3813 -56655 -81439 -99456
16023i9456m8937J8562K6263l6171L0694N9549J2758L063L7981M3631L0107n5385
$$ -99456 -148393 -129831 -103568 -139739 -109045 -49496 -36738 -33675 4306 47937 78044 22659
16011B2659m1476R79J5366l0098l2961M2404J6334N6526j9007N591l7049m685
$$ 22659 -18817 -17838 -2472 -32570 -65531 -23127 -6793 49733 30726 36317 -732 -5417
15999e417J8130r401k9678j1223K8023M2241J9457O5434K8876r4273p7918J4371
$$ -5417 12713 3312 -26366 -37589 -9566 32675 52132 117566 146442 52169 -25749 -11378
15987a1378K3113j9913k4346K726J2079l5054j9891j2115r014J9048O535K178
$$ -11378 11735 -8178 -32524 -29798 -17719 -52773 -72664 -84779 -93793 -74745 -68210 -66032
15975f6032n307J97N486R55l6903j9215L2968O4341O5856K599K8040k2252n1397
$$ -66032 -71339 -71142 -65656 -64701 -101604 -120819 -87851 -23510 42346 44945 72985 50733 -664
15962f64j1161n7932l3034J2664M0407P1402K3380j4615k5978M050K1676L9978
$$ -664 -11825 -69757 -102791 -90127 -49720 21682 45062 30447 4469 8519 30195 70173
15950G0173k2410j2583J9451k896l7684l0920n630n0416P633N0375j5737r074
$$ 70173 47763 35180 54631 51735 14051 -16869 -22499 -72915 -65282 -14907 -30644 -39718
15938c9718m6312J1439M1862L7678m576l7221k4999K3413L4061r806j7467L343
$$ -39718 -86030 -74591 -32729 4949 373 -36848 -61847 -38434 -4373 -14179 -31646 -28303
15926b8303l0254O50M860k694K9187N0054j1283J8647n34l7712j831l8059m4858
$$ -28303 -58557 -57907 -53047 -55741 -26554 23500 12217 30864 30330 -7382 -9213 -47272 -92130
15913i2130l3642K3779Q5456K7653K0755K7396m4961k2277j9288j0245j128K4491
$$ -92130 -125772 -101993 -16537 11116 31871 59267 14306 -7971 -27259 -37504 -38632 -14141
15901a4141J3215j7569l1446j1753K6944N1079q902o3129J7792P2372l9562k377
$$ -14141 -926 -18495 -49941 -61694 -34750 16329 7427 -55702 -37910 34462 -5100 -7477
15889g477K0636k9497j3907K5695l503l7077j4303r590k28l9078p517N3783N2429
$$ -7477 13159 -16338 -30245 -4550 -8053 -45130 -59433 -69023 -69251 -108329 -115846 -62063 -9634
15876i634r559M798P5519J3103l6903k0901l8717n1919k842J9523L8003k7204
$$ -9634 -19193 -14395 61124 74227 37324 16423 -22294 -74213 -77055 -57532 -19529 -46733
15864d6733J330P312K6003j8830j1816O221j2773o250m090L5733L0620l7628j6685
$$ -46733 -45403 -38091 -12088 -30918 -42734 -36513 -49286 -55536 -59626 -23893 6727 -30901 -47586
15851d7586J8487K910M9469K4160l4951J936k254L2633k7969o0574p0350J8712
$$ -47586 -29099 -26189 23280 47440 12489 14425 12171 44804 16835 -43739 -114089 -95377
15839i5377L8950M1247N064L231j0112k43r6329l5901M4765k0267M430L4686L9957
$$ -95377 -56427 -15180 -10116 -6885 -16997 -17240 -113569 -149470 -104705 -124972 -120542 -85856 -45899
15826d5899L2934l646l0224l7066L3458K5260J4565p562n81j6406n1986j1223
$$ -45899 -12965 -16611 -46835 -83901 -50443 -25183 -10618 -18180 -18761 -35167 -87153 -98376
15814i8376L4444o482j0579k4180p451K2367N2934K6516L0340K5529m7087o3896
$$ -98376 -63932 -70414 -80993 -105173 -112624 -90257 -37323 -10807 19533 45062 -2025 -65921
15802f5921k4507N2065O6777K1589k196k4912n0385R869M8448q729n6158l859
$$ -65921 -90428 -38363 28414 50003 47807 22895 -27490 -17621 30827 22098 -34060 -37919
15790c7919k2523k0312j0778M7567m290n887k536p477l1298J2211q702K1855K894
$$ -37919 -60442 -80754 -91532 -43965 -48255 -54142 -56678 -64155 -95453 -83242 -91944 -70089 -67195
15777f7195l2942J6047j8929l958L1961M9705N5384m2402m1624L0098P6979m1837
$$ -67195 -100137 -84090 -103019 -106977 -75016 -25311 30073 -12329 -53953 -23855 53124 11287
15765A1287o8014K172J4117k3283j4366o141M3701M226j6607J2841J7690K5419
$$ 11287 -56727 -54555 -40438 -63721 -78087 -84228 -40527 -36301 -52908 -40067 -22377 3042
15753C042O933J9565L866p153n8278L296N6686J5015q860m3362j0436n1090j4045
$$ 3042 9975 29540 33406 26253 -32025 -28729 27957 42972 34112 -9250 -19686 -70776 -84821
15740h4821L0986J4535M716l0817n0635J5531Q5613K1522j6163j0844j2334o193
$$ -84821 -53835 -39300 -34584 -65401 -116036 -100505 -14892 6630 -9533 -20377 -32711 -38904
15728c8904L674k6232K2657L9306o2212l5316q674L2124M4010L5933o439j794
$$ -38904 -35230 -61462 -38805 501 -61711 -97027 -105701 -73577 -29567 6366 -73 -1867
15716a867Q2937L6803j6195n5690p3560k3187m9043k0695j7693J0988Q5251N1294
$$ -1867 81070 117873 101678 45988 -27572 -50759 -99802 -120497 -138190 -127202 -41951 9343
15704I343P139k4101n2588k1636K917k6802O766R898L9263P3852q555n3233j4277
$$ 9343 16482 -7619 -60207 -81843 -78926 -105728 -98962 -89064 -49801 24051 15496 -37737 -52014
15691e2014K7664j3017l6721N8921k8376r27k2829N4008M4891j3541m2255J6691
$$ -52014 -24350 -37367 -74088 -15167 -43543 -44470 -67299 -13291 31600 18059 -24196 -7505
15679g505L3653K8375M616n0511J4444n7457l9413M712o865K0906L116j0287M706
$$ -7505 26148 54523 59139 8628 23072 -34385 -73798 -69086 -75951 -55045 -51929 -62216 -57510
15666e7510m435R598M9013j7466l8696M004k2922p705M5512L6511L0687j394n5728
$$ -57510 -61945 -52347 -3334 -20800 -59496 -55492 -78414 -86119 -40607 -4096 26591 25197 -30531
15653c0531J4482J0752l7134J1366j0300r542o709K2228N7204o807m2273J046
$$ -30531 -16049 -5297 -42431 -31065 -41365 -50907 -57616 -35388 21816 15009 -27264 -26218
15641b6218K5428L0427l6777n4898j5586O813K3419O1503j415k3750p185q044
$$ -26218 -790 29637 -7140 -62038 -77624 -70811 -47392 14111 12696 -11054 -18239 -26283
15629b6283q079k0416m7024k8353l5905J0005K7277L8888M2261L6058K3954n0178
$$ -26283 -34362 -54778 -101802 -130155 -166060 -156055 -128778 -89890 -47629 -11571 12383 -37795
15617c7795p8082K1947M4344Q6104l5068k0671m335N666L0269p174l2364J4294
$$ -37795 -115877 -93930 -49586 36518 1450 -19221 -23556 -17890 12379 5205 -27159 -12865
15605a2865K0530J5014j1965q869o118k9748M6407M1528m684j7385o995k3891
$$ -12865 7665 22679 10714 1845 -4273 -34021 12386 53914 49230 31845 24850 959
15593I59k2558l2688L0031Q6287N5771m968n2266j2950k1567q0805m4738O275
$$ 959 -21599 -54287 -24256 62031 117802 112834 60568 47618 26051 -54754 -99492 -93217
15581i3217J8021j7928l6000l0735J0349J8116P1223K0517o502J6663O4882L7535
$$ -93217 -75196 -93124 -129124 -159859 -149510 -131394 -60171 -39654 -46156 -29493 35389 72924
15569G2924k3590l4013J1020j0095q0229k4378L287M7456k1239k3648l2161o687
$$ 72924 49334 15321 26341 16246 -63983 -88361 -85074 -37618 -58857 -82505 -114666 -121353
15557a21353N9611K8090J1383L8117N964q251j1296j8586k883o679m3195k648
$$ -121353 -61742 -33652 -22269 15848 21812 13561 2265 -16321 -19204 -25883 -69078 -71726
15545g1726l589k8532J5196L7531j492L3115J4567M716k232n390J6778m6308l107
$$ -71726 -75315 -103847 -88651 -51120 -52612 -19497 -4930 -214 -2446 -7836 8942 -37366 -40473
15532d0473p187o556M6527m6348j4030L3794K9791J5008k6737l2127l100M9671
$$ -40473 -47660 -54216 -7689 -54037 -68067 -34273 -4482 10526 -16211 -48338 -51438 -1767
15520a767l828o8172m0639L1943K4394k319M661L1770K8583p475Q100j228j03264
$$ -1767 -5595 -73767 -114406 -82463 -58069 -60388 -55727 -23957 4626 -2849 5251 4023 -99241
15507i9241k5425J2817P4565M3305j0806m6643O318j541m2307k4191L5388N851
$$ -99241 -124666 -111849 -37284 6021 -4785 -51428 -45110 -46651 -88958 -113149 -77761 -71910
15495g1910j5093Q094j306k5192R336m8824N0300J4070J9785l1480M771k967l3701
$$ -71910 -87003 -78909 -80215 -105407 -96071 -144895 -94595 -80525 -60740 -92220 -87449 -90416 -124117
15482a24117L0154Q2748J023n1445K5029Q607J4243J5517r063J6730K9107L6352
$$ -124117 -93963 -11215 -10192 -61637 -36608 -28001 -13758 1759 -7304 9426 38533 74885
15470G4885j7380J753k0695k9616l0496K9165O147l9740J36M6585L325o2321l376
$$ 74885 57505 59258 38563 8947 -21549 7616 13763 -25977 -25841 20744 24069 -38252 -41628
15457d1628L5848Q9570j7992j00987k5296K1659L3987O341j9270J4494m8145j9103
$$ -41628 -5780 83790 65798 -35189 -60485 -38826 -4839 1502 -17768 -3274 -51419 -70522
15445g0522Q3337j1914m8893O6739j9915L748j8039m0168j8720J3845J4347M8457
$$ -70522 12815 901 -47992 18747 -1168 2580 -15459 -55627 -74347 -60502 -46155 2302
15433B302k7361j5724L3878K6173J8985k0000o1477p474K6471r948k8615p801
$$ 2302 -25059 -40783 -6905 19268 38253 18253 -43224 -50698 -24227 -34175 -62790 -70591
15421g0591j7711K8769L3410o938l3585K140N100k650n0538M7199K0558J044J7280
$$ -70591 -88302 -59533 -26123 -33061 -66646 -64506 -59406 -62056 -112594 -65395 -44837 -43793 -26513
15408b6513J6664K4107J5472n5557l188N064l9971j1593m6874P0141P3006n3394
$$ -26513 -9849 14258 29730 -25827 -29015 -23951 -63922 -75515 -122389 -52248 20758 -32636
15396c2636o2461n019J9119J4566M2150p126o404L0465k4315l0911M1358K7659
$$ -32636 -95097 -100116 -80997 -66431 -24281 -31407 -37811 -7346 -31661 -62572 -21214 6445
15384F445K913j38J6299J4238o2734k7718K2332N06N885J6820J0896J1687j1825
$$ 6445 9358 9220 25519 39757 -22977 -50695 -28363 -27857 -21972 -5152 5744 17431 5606
15371E606l5716k3814L6748m4700L0722L8366j891l590n326K6739J5375L657l6747
$$ 5606 -30110 -53924 -17176 -61876 -31154 7212 5321 1731 -3595 23144 38519 42176 5429
15358E429l1964k2387k6105N052K6976J1763j7320n852R19K0577J8109J4316m0390
$$ 5429 -26535 -48922 -75027 -69975 -42999 -31236 -48556 -54408 -53489 -32912 -14803 -487 -40877
15345d0877K8993N7488l7249J7563R054j948K0843r315J297k1612k4876o2216
$$ -40877 -11884 45604 8355 25918 34972 33024 53867 44552 45849 24237 -639 -62855
15333f2855K5641L3056J9636m8607m6512K153N1900L1530K7430M902r880l6406
$$ -62855 -37214 -4158 15478 -33129 -79641 -77488 -25588 5942 33372 38274 28394 -8012
15321h012m6743K9008K4831j5396l7748Q339M8665M5199j7845m0746k3662P032
$$ -8012 -54755 -25747 -916 -16312 -54060 -45721 2944 48143 30298 -10448 -34110 -27078
15309b7078K7014q622j9365J1126J8442L2484J4810K869r1854K5392M2119l1349
$$ -27078 -64 -8686 -28051 -16925 1517 34001 48811 51680 -40174 -14782 27337 -4012
15297d012l2102K6207k0959l0603j1397K3568P8147m427m8636k4660j0089J9498
$$ -4012 -36114 -9907 -30866 -61469 -72866 -49298 28849 24422 -24214 -48874 -58963 -39465
15285c9465l670R602L3397J961N1883k7721j1480P125k4727n237k5923n1472m0810
$$ -39465 -43135 -33533 -136 1825 53708 25987 14507 21632 -3095 -8332 -34255 -85727 -126537
15272a26537K5658P6711K7871j9961J9663K8042l9388m1334J0926J2639K9958
$$ -126537 -100879 -24168 3703 -16258 3405 31447 -7941 -49275 -38349 -25710 4248
15261D248j0381l0744L4915K673L702L7616k7668m0281l3248n070j6890j7367
$$ 4248 -6133 -36877 -1962 711 4413 42029 14361 -25920 -59168 -64238 -81128 -98495
15249i8495L1206M0689L6490k8990m994J9988J4118K521j4754M967k2141L790
$$ -98495 -67289 -26600 9890 -19100 -24094 -4106 10012 12533 -2221 2746 -19395 -15605
15237a5605m9353J3419K6458O0558J4323m5200l3727k2627L3717j1652p8817k2282
$$ -15605 -64958 -51539 -25081 35477 49800 4600 -29127 -51754 -18037 -29689 -108506 -130788
15225a30788J031L4325N2546R695l0927k698L5823K462n301l4319K4681M4055
$$ -130788 -129757 -95432 -42886 -33191 -64118 -66816 -30993 -28531 -33832 -68151 -43470 585
15213E85J6488j8407J2406l82O0318k9004r598j4199k8509K7422M417k0967k1028
$$ 585 17073 -1334 11072 10690 71008 42004 32406 18207 -10302 17120 21537 570 -20458
15200b0458Q6677L5801l9821m3436m40N1093K5323k9368n2516l791L5834k429
$$ -20458 66219 102020 62199 18763 18323 69416 94739 65371 12855 9064 44898 42469
15188D2469j5786l0202k6108k1902J3603O8329j4109l0970l5642j7355n438Q017
$$ 42469 26683 -3519 -29627 -51529 -37926 30403 16294 -14676 -50318 -67673 -73111 -65094
15176f5094O670L1540Q3165K442R832n303k0097j4441j688K4501J38m0195o2209
$$ -65094 -58424 -26884 56281 58723 68555 63252 43155 28714 27026 51527 51665 11470 -50739
15163e0739l104j0115l856K1872R668k1114l9953j9535M6789N6346N1879k9511
$$ -50739 -53843 -63958 -67814 -45942 -36274 -57388 -97341 -116876 -70087 -13741 38138 8627
15151H627o2028o034M8420L2212r927j1085q117L4890J2287o9723J8971J348J415
$$ 8627 -53401 -59435 -11015 21197 11270 185 -7932 26958 39245 -30478 -11507 -10159 -8744
15138h744K483j9842j4884K056L2922k636k9534k3808K2086n757j8474K715N1817
$$ -8744 -6261 -26103 -40987 -38931 -6009 -8645 -38179 -61987 -39901 -45658 -64132 -61417 -9600
15125i600l7199m9527K0679O1061K0399j7223k1497j2568o874p35o656r871l0681
$$ -9600 -46799 -96326 -75647 -14586 5813 -11410 -32907 -45475 -52349 -53084 -59740 -69611 -100292
15112a00292L3966L674L100N9984M6003J292J1367m1991Q845J2049O6992L421
$$ -100292 -66326 -62652 -59552 432 46435 47727 59094 17103 25948 37997 104989 108410
15100A08410k5853n1132k5340q986n262k3423L6172o319l2725o331m5351n3609
$$ 108410 82557 31425 6085 -2901 -8163 -31586 4586 -1733 -34458 -40789 -86140 -139749
15088a39749O9827L5552k883K866K2378R844n5798j3795M5432L3542k2752m0020
$$ -139749 -69922 -34370 -37253 -34387 -12009 -2165 -57963 -71758 -26326 7216 -15536 -55556
15076e5556m7551k2062j747r685M3995Q7414R300o0682o333R033K6118o5432m4159
$$ -55556 -103107 -125169 -126916 -136601 -92606 -5192 4108 -56574 -62907 -53874 -27756 -93188 -137347
15063a37347P3224K0183l3056K8056M3996j3354m0522L344P927J7430o355R566
$$ -137347 -64123 -43940 -76996 -48940 -4944 -18298 -58820 -55476 -47549 -30119 -36474 -26908
15051b6908q203K9654Q693l3000L2846r09J870J0913j4682k3675m5300P309L6473
$$ -26908 -35111 -5457 3236 -29764 3082 2173 4043 14956 274 -23401 -68701 -61392 -24919
15038b4919L0284K652J045n519l3115o9886o148N5932K995m6602m960L8470L3160
$$ -24919 5365 8017 9062 3543 -29572 -99458 -105606 -49674 -46679 -93281 -98241 -59771 -26611
15025b6611M748o662J4977L800j2776l5688k2523K4177L087J2146O5448M8969
$$ -26611 -21863 -28525 -13548 -9748 -22524 -58212 -80735 -56558 -53471 -41325 24123 73092
15013G3092j8873l2532j2570L8529j0206K821O1934J7924O9332J04123J54592
$$ 73092 54219 21687 9117 47646 37440 40261 102195 120119 189451 293574 448166
15002D48166J95867K49693J99188J41689J88042J81548K38892J6456n43248m66305
$$ 448166 644033 893726 1092914 1234603 1422645 1604193 1843085 1859541 1316293 849988
14992H49988k96724j29985n5183o6966o4769p4196l1181k1169j6838n710R936
$$ 849988 553264 423279 368096 301130 236361 162165 130984 109815 92977 87267 97203
14981I7203l3471l4650K3741M9194M4566K0206l8507k8671l6910j5883K480K4001
$$ 97203 63732 29082 52823 102017 146583 166789 128282 99611 62701 46818 49298 73299
14969G3299j0466M4394m978j3118N392l206o818m6079l8951J4003R653j2908J3028
$$ 73299 62833 107227 102249 89131 94523 91317 84499 38420 -531 13472 23125 10217 23245
14956B3245j4832L3719L2004Q51K5111L038p0207m9021n591J3983K2454k0373
$$ 23245 8413 42132 74136 74987 100098 103136 32929 -16092 -21683 -7700 14754 -5619
14944e619O449L253J4582K2132K1221j7324j3462L2301J3765L0964j4691k7380
$$ -5619 830 4083 18665 40797 62018 44694 31232 63533 77298 108262 93571 66191
14932F6191n3328j1970j7578J2582L4009M5548j0647r4898o523L5477p034k1561
$$ 66191 12863 893 -16685 -4103 29906 75454 64807 -30091 -36614 -1137 -8171 -29732
14920b9732J5993K4038j1352j9974j0158j46N8119L3033j0930k0483q629k3112
$$ -29732 -13739 10299 -1053 -21027 -31185 -31331 26788 59821 48891 28408 19779 -3333
14908c333k9208p381M948j1679r076O064K0149P2418l9978l7200J6277k7045j1356
$$ -3333 -32541 -39922 -34974 -46653 -55729 -49665 -29516 42902 2924 -34276 -17999 -45044 -56400
14895e6400M3675q767K1748J5299J4314J6466r45k7336J4146M255m821M593o8391
$$ -56400 -12725 -21492 256 15555 29869 46335 45390 18054 32200 36455 31634 36227 -32164
14882c2164p1343J0919M2201l2287l3407L2236J7002j5460n6555k6322J2582O8630
$$ -32164 -103507 -92588 -50387 -82674 -116081 -83845 -66843 -82303 -138858 -165180 -152598 -83968
14870h3968R6838N576n8730n4191M9466N1690k9530M981j6281k6580L7696q635
$$ -83968 12870 18446 -40284 -94475 -45009 6681 -22849 -17868 -34149 -60729 -23033 -31668
14858c1668J3559K8326k4638j9125n426K1294M6771J9496l6757m0590p97L5341
$$ -31668 -18109 10217 -14421 -33546 -38972 -17678 29093 48589 11832 -28758 -29555 5786
14846E786k7110P109j6586m3496J6116L5559Q3460K9046l8347l4898q139J5529
$$ 5786 -21324 -14215 -30801 -74297 -58181 -22622 60838 89884 51537 16639 8500 24029
14834B4029l792m3723p386O026J1966k2330L1808M7525K289m8652j1391M9815
$$ 24029 20237 -23486 -30872 -24846 -12880 -35210 -3402 44123 46412 -2240 -13631 36184
14822C6184R443k1595j5507m1198k0172L4093K538J3659N118k2022M8768j9405
$$ 36184 45627 24032 8525 -32673 -52845 -18752 -16214 -2555 2563 -19459 29309 9904
14810I904q53J3892k4314r0383m9763O460O4424N2137j7515n1261q401N4192K827
$$ 9904 9051 22943 -1371 -91754 -141517 -135057 -70633 -18496 -36011 -87272 -95673 -41481 -38654
14797c8654n040M1286L5522k2603m5265j6149M3973L7526O514j7840N3336N8245
$$ -38654 -43694 -2408 33114 10511 -34754 -50903 -6930 30596 37110 19270 72606 130851
14785A30851L524j6145K1907P3162N7184K525J5863m0707r3891j25003o2678R315
$$ 130851 134375 118230 140137 213299 270483 273008 288871 248164 154273 29270 -33408 -24093
14773b4093n718J3436L0154L542K648J5642m0860O460J5448N2053j5104n1242
$$ -24093 -29811 -16375 13779 17321 19969 35611 -5249 1211 16659 68712 53608 2366
14761B366k4358J4859J0041k7403l2497P0682o796k4568J2143j9760p151Q882
$$ 2366 -21992 -7133 2908 -24495 -56992 13690 6894 -17674 -5531 -25291 -32442 -23560
14749b3560j2188l3396L8853L9365j9258j1470M5333N2717m6869m8541k5765k3670
$$ -23560 -35748 -69144 -30291 9074 -10184 -21654 23679 76396 29527 -19014 -44779 -68449
14737f8449J2154K7885l5619J7587K8633j393L2692j7605n874l5855R059M3657
$$ -68449 -56295 -28410 -64029 -46442 -17809 -19202 13490 -4115 -9989 -45844 -36785 6872
14725F872J8899k0773k6701j3321l3742K525M437N192O763L9331N2825L2876n0236
$$ 6872 25771 4998 -21703 -35024 -68766 -66241 -61804 -56612 -49849 -10518 42307 75183 24947
14712B4947j00302J4253N3780o298L691m4490k5145j8170O1691Q0325K8603j3111
$$ 24947 -75355 -61102 -7322 -13620 -9929 -54419 -79564 -97734 -36043 44282 72885 59774
14700E9774l5077k4483O481m0121k5085Q240N0127m510J1806j6218O76j1510n5370
$$ 59774 24697 214 6695 -33426 -58511 -50271 -144 -4654 7152 -9066 -8390 -19900 -75270
14687g5270L4870N5949j9365k7595o171Q33j7051j463k132O239P1047K6813q684
$$ -75270 -40400 15549 -3816 -31411 -37582 -36749 -53800 -55263 -57395 -51156 19891 46704 38020
14674C8020n0057K2230R779j8835R906J6433o513l476l4842k9082M267j2168p188
$$ 38020 -12037 10193 19972 1137 11043 27476 20963 17487 -17355 -46437 -42170 -54338 -61526
14661f1526K0871j8259J811O0258L9169O1994o0634o7764j5800L0968J2435O1245
$$ -61526 -40655 -58914 -57103 3155 42324 104318 43684 -24080 -39880 -8912 3523 64768
14649F4768K6439J4096l0482l6019n2138k4850J4552J2841M7846L4737j5509k6458
$$ 64768 91207 105303 74821 38802 -13336 -38186 -23634 -10793 37053 71790 56281 29823
14637B9823o666k0460K0215K3852o0669j6261J8381J852J5595j3044k5494p773
$$ 29823 23157 2697 22912 46764 -13905 -30166 -11785 -9933 5662 -7382 -32876 -40649
14625d0649O1679k0574k710P485q775j6404l6741l82J4956K8266J3014K3243k2235
$$ -40649 21030 456 -2254 5231 -3544 -19948 -56689 -57071 -42115 -13849 -835 22408 173
14612A73J9808J5792j041j7731N10k8192k5142Q973J9574k18k3242K8335j2590
$$ 173 19981 35773 34732 17001 17511 -10681 -35823 -26850 -7276 -7494 -30736 -2401 -14991
14599a4991n7931K1838R425N2388K7410P888j4456j7820j6509l718J8790J4233
$$ -14991 -72922 -51084 -41659 10729 38139 46027 31571 13751 -2758 -6476 12314 26547
14587B6547o1896l7555J1598L7709N1245j7093l0017j0714l9157K3584J1013P581
$$ 26547 -35349 -72904 -61306 -23597 27648 10555 -19462 -30176 -69333 -45749 -34736 -27155
14575b7155K1355J6024k0817L6172q654l9837q516o112M4651n545k5987k807K20
$$ -27155 -5800 10224 -10593 25579 16925 -22912 -31428 -37540 7111 1566 -24421 -27228 -27008
14562b7008P4188K8740l9529J5460M2659j3684j1237l2931l7099k691o926J527
$$ -27008 47180 75920 36391 51851 94510 80826 69589 36658 -441 -3132 -10058 -8531
14550h531j2247k8050J8373L9841o030m5530M140m94L3587m749k6435k9139l6181
$$ -8531 -20778 -48828 -30455 9386 3356 -42174 -38034 -38528 -4941 -9690 -36125 -65264 -101445
14537a01445k3662K4910O7939K2463k6212j9950o543K7513N947j2473k4244o63
$$ -101445 -125107 -100197 -32258 -9795 -36007 -55957 -62500 -34987 -29040 -41513 -65757 -66420
14525f6420k3738k5419K8917R975K4094O2425Q0898O3806n6322m8178l6415k209
$$ -66420 -90158 -115577 -86660 -76685 -52591 9834 90732 154538 98216 50038 13623 11414
14513A1414k766l768J6831j1530l6236K855J4712r806L6986L9807Q586n031K4001
$$ 11414 8648 4880 21711 10181 -26055 -23200 -8488 -18294 18692 58499 67085 62054 86055
14500H6055N6799o6440q143Q3906M3832N4478J23537J52943J40896J19927J31941
$$ 86055 142854 76414 68271 152177 196009 250487 374024 526967 667863 787790 919731
14489I19731J63011J18274L9933k7179r4588j57724j59627j00440j58315r9494
$$ 919731 1082742 1201016 1240949 1213770 1119182 961458 801831 701391 543076 443582
14479D43582o9208m8752l282j6945k7663k9247j0419j0553j8277n4872m6565K6313
$$ 443582 374374 325622 322340 305395 277732 248485 238066 227513 209236 154364 107799 134112
14467A34112j5484m0405j5662J9437K2947j209q457l031J1727M307r673K0576
$$ 134112 118628 78223 62561 81998 104945 103736 95279 92248 103975 108282 98609 119185
14455A19185L4290r454k6896J0604l810K9429l1382m1322L8584k6641l9743J332
$$ 119185 153475 144021 117125 127729 123919 153348 121966 80644 119228 92587 52844 54176
14443E4176j6601M964O3502p906K97J0391J8177p396J8843j8160o8600K2136L6324
$$ 54176 37575 42539 106041 98135 98432 108823 127000 119604 138447 120287 51687 73823 110147
14430A10147R45n484j3663J903k09o222P841m853l5315o904K0773l1445n5743
$$ 110147 111092 105608 91945 93848 93639 87417 95258 90405 55090 48186 68959 37514 -18229
14417a8229J5949o56M7024L3208o8259j7868K3736l7590l2006O8568O2634j5813
$$ -18229 -2280 -2936 44088 77296 9037 -8831 14905 -22685 -54691 13877 76511 60698
14405F0698O494l2882k6977m8567k2707j6762l9926K5676P2285L477L9784O536
$$ 60698 67192 34310 7333 -41234 -63941 -80703 -120629 -94953 -22668 -19191 20593 27129
14393B7129k7234j5975K0627N4729J4144j9302j8297J2038K9911k5311o8883K1894
$$ 27129 -105 -16080 4547 59276 73420 54118 35821 47859 77770 52459 -16424 5470
14381E470K2251J0793O705k8767R250J8514l2948k0185O0801J4251j1625k0043
$$ 5470 27721 38514 45219 16452 25702 44216 11268 -8917 51884 66135 54510 34467
14369C4467m4041j2043k63R256M4036m386q9992k4417k923j4631O9920Q6892N975
$$ 34467 -9574 -21617 -21880 -12624 31412 27026 -62966 -87383 -90306 -104937 -35017 51875 57850
14356E7850q956k1204k4403K359K4462J4842k4865r864j0459J6633N2943M9588
$$ 57850 48894 27690 3287 5646 30108 44950 20085 10221 -238 16395 69338 118926
14344A18926K3557O157n215o5643j4661k2850q516k5558q598l8691Q189M0229
$$ 118926 142483 148640 143425 77782 63121 40271 31755 6197 -2401 -41092 -32903 7326
14332G326L9899k3441j229Q7546R1683M5730k0016n9162j3785j9668R180L6217
$$ 7326 47225 23784 22555 110101 201784 247514 227498 168336 154551 134883 144063 180280
14320A80280J7168K7400m5044k0729n3774k8083L6840m262k7975j1417P698P973
$$ 180280 197448 224848 179804 159075 105301 77218 114058 109796 81821 70404 78102 86075
14308H6075K2391k876R849l6041l1994k8138J6659J1674k4332k8748M2320N0923
$$ 86075 108466 105590 115439 79398 47404 19266 35925 47599 23267 -5481 36839 87762
14296H7762Q207r582K0556M3586m5807K7897J5072m1510j2739P908o478j2928
$$ 87762 95969 86387 106943 150529 104722 132619 147691 106181 93442 101350 94872 81944
14284H1944J2059N3097j8584J457K7733K7354j4827m6051l7029l767k5431P090
$$ 81944 94003 147100 128516 129973 157706 185060 170233 124182 87153 83386 57955 65045
14272F5045O9127K7175j3659l404j6465j320L379j4438k5804j9310K7926L2402
$$ 65045 134172 161347 147688 144284 127819 126499 129878 115440 89636 70326 98252 130654
14260A30654l3976j097J9028O475K9504M7314j0995p1545k7129K0657o7428l6290
$$ 130654 96678 95581 114609 121084 150588 197902 186907 115362 88233 108890 41462 5172
14248E172L7497L5873N2524J8571q837o1451J0953l1018n7959K1345L8074j6041
$$ 5172 42669 78542 131066 149637 140800 79349 90302 59284 1325 22670 60744 44703
14236D4703q768O3297R747j4821l8121j5588K1294M7873j2449j00019k3995M4289
$$ 44703 35935 99232 108979 94158 56037 40449 61743 109616 97167 -2852 -26847 17442
14224A7442J0529m9336n0323r895M3088O0445m929L2374k0105M4867M4563k382
$$ 17442 27971 -21365 -71688 -81583 -38495 21950 17021 49395 29290 74157 118720 116338
14212A16338j0971k936O769J351K0790K9399p145j9227J8448N8663Q224j9164
$$ 116338 105367 102431 109200 110551 131341 160740 153595 134368 152816 211479 219703 200539
14200B00539k5592k6842o4710m6311o147l4713j1247K5248J6209o3491K6320L1361
$$ 200539 174947 148105 83395 37084 30937 -3776 -15023 10225 26434 -37057 -10737 20624
14188B0624M5131j4338k3552N1604N6206k0693O41K2641k2886l3655K4597k6033
$$ 20624 65755 51417 27865 79469 135675 114982 115623 138264 115378 81723 106320 80287
14176H0287K7071J1933k5083j0499P5678K0587J4278k6256L0444K5414L1627Q309
$$ 80287 107358 119291 94208 83709 159387 179974 194252 167996 198440 223854 255481 263790
14164B63790k497K791L6078l1155k4990r888J02588R8639P9100J52919J73931
$$ 263790 261293 264084 300162 269007 244017 234129 336717 435356 514456 667375 841306
14153H41306K05212K46491K90418K98624L66933L13195K05685J25307J9526j42948
$$ 841306 1046518 1293009 1583427 1882051 2248984 2562179 2767864 2893171 2912697 2769749
14143B769749k43826k27701k94597l83053l92007k21458p2022o8513m0471k6398
$$ 2769749 2525923 2298222 2003625 1620572 1228565 1007107 935085 866572 826101 799703
14133G99703p2621m6728o167m2764k9811m0349p2976k8274M7572o4622p0715K290
$$ 799703 727082 680354 674187 631423 601612 561263 488287 460013 507585 442963 372248 374538
14121C74538O2848j850k2122L8068K5299o30O267l6504n86j23O803m4275l7328
$$ 374538 437386 435536 413414 451482 476781 476151 482418 445914 445328 445205 452008 407733 370405
14108C70405K6669M6904j0328l7959l7723j7462L6087M7739l2635K2211O78j7266
$$ 370405 397074 443978 433650 395691 357968 340506 376593 424332 391697 413908 414586 397320
14096C97320j1552N2625R871J2367m926m8285m0772k8208K0428M6616L1542O819
$$ 397320 385768 438393 448264 460631 455705 407420 366648 338440 358868 405484 437026 443845
14084D43845O5837L9613J3109j6037k1313J5425M0777M8027J2907N5608k4941
$$ 443845 509682 549295 562404 546367 525054 540479 581256 629283 642190 697798 672857
14073F72857n9598m4613l6516j6413r97J7569p95P774K7849M3850M1370j1104
$$ 672857 613259 568646 532130 515717 514720 532289 531494 539268 567117 610967 652337 641233
14061F41233j0398o697k1418k9272r594K2396L5352Q9805K5647K9929K8018O4300
$$ 641233 630835 624138 602720 573448 563854 586250 621602 711407 737054 766983 795001 859301
14049H59301M5210Q2725M3064n1112r082L6445P8476O2914J30044J01494O8783
$$ 859301 904511 987236 1030300 979188 970106 1006551 1085027 1147941 1277985 1379479 1448262
14038A448262P5985J39126J93679J27862J77953K32770K52237L20361M39411M41327
$$ 1448262 1524247 1663373 1857052 1984914 2162867 2395637 2647874 2968235 3407646 3848973
14028C848973N32746O40363P34251Q38920R17735J034092J023508J154109J351041
$$ 3848973 4381719 5022082 5756333 6595253 7512988 8547080 9570588 10724697 12075738
14019A2075738J698467K142086K924109M253682O418172R800718J4262121J8973049
$$ 12075738 13774205 15916291 18840400 23094082 29512254 39312972 53575093 72548142
14011G2548142K2528329K4612594K6040452K7054326K6152867J9193281P010944
$$ 72548142 95076471 119689065 145729517 172783843 198936710 218129991 225140935
14004B25140935o897689j6471769k2569033k9390793l3122461k8519381j9745725
$$ 225140935 218243246 201771477 179202444 149811651 116689190 88169809 68424084
13997F8424084j2854142q586463n991739m219122l048202k279543j729251j421121
$$ 68424084 55569942 46983479 40991740 36772618 33724416 31444873 29715622 28294501
13989B8294501j360786j414180j319458j280992j336543j316730j302964j211765
$$ 28294501 26933715 25519535 24200077 22919085 21582542 20265812 18962848 17751083
13981A7751083j014685q39216p25797o79129o35164o19201o11232n33941m72759
$$ 17751083 16736398 15897182 15171385 14492256 13857092 13237891 12626659 12092718 11619959
13972A1619959m51274m53422l48413l33178l45563l56752l09807k38419k72962
$$ 11619959 11168685 10715263 10366850 10033672 9688109 9331357 9021550 8783131 8510169
13963H510169l26940k69656k23802k42729l17780k31390j74141k05215k09977
$$ 8510169 8183229 7913573 7689771 7447042 7129262 6897872 6723731 6518516 6308539
13954F308539j94569j91241j98974j09752j38029j95558j43819j50286j42902
$$ 6308539 6113970 5922729 5723755 5614003 5475974 5280416 5136597 4986311 4843409
13945D843409j17524j16183j79746j31189r0654j66158j81826j13855r9624j02583
$$ 4843409 4725885 4609702 4429956 4298767 4208113 4041955 3860129 3746274 3646650 3544067
13935C544067j20893m3470p6873j32802q6996p1220j13416k9534m7986m6527q644
$$ 3544067 3423174 3379704 3302831 3170029 3083033 3011813 2898397 2868863 2820877 2774350 2765706
13924B765706k0741j03645j21275p2237n8014p8508n0130o1743j5994n5276r3535
$$ 2765706 2744965 2641320 2520045 2447808 2389794 2311286 2261156 2199413 2183419 2128143 2034608
13913B034608p0477o7816l8518q0344m6350l1744l6406l5797o543P628n1827l8648
$$ 2034608 1964131 1896315 1857797 1777453 1731103 1699359 1662953 1627156 1620613 1628241 1576414 1537766
13901A537766j7897m7365k5228l2929l0366k3106l6034m271K5274O670k2466n3849
$$ 1537766 1519869 1472504 1447276 1414347 1383981 1360875 1324841 1320570 1345844 1352514 1330048 1276199
13889A276199k662k7647l2032l9468q440J6930N8590j6717j0151k1923n5596l2238
$$ 1276199 1273537 1245890 1213858 1174390 1165950 1182880 1241470 1224753 1214602 1192679 1137083 1104845
13877A104845J5550j3068J820m0423j8307K5724J5898R479j4418K0920O5985Q1390
$$ 1104845 1120395 1107327 1109147 1068724 1050417 1076141 1092039 1101518 1087100 1108020 1174005 1255395
13865A255395J33824K09489L06570K08466J56263K13814K29154J57009R9938l29165
$$ 1255395 1389219 1598708 1905278 2113744 2270007 2483821 2712975 2869984 2969922 2640757
13855B640757n15903m06234k65671k05590j16363r8981q8269k7116n5442q4836
$$ 2640757 2124854 1718620 1452949 1247359 1130996 1032015 943746 916630 861188 776352
13845G76352l0692j8494o2781j1287l0531l9404k0566o7826K3123N4782k3027
$$ 776352 745660 727166 664385 653098 622567 583163 562597 494771 517894 572676 549649
13834E49649o2927m5980n2716L6864K3355o3644N267K5949P163j9927k3581K0636
$$ 549649 486722 440742 388026 424890 448245 384601 389868 415817 422980 403053 379472 400108
13822D00108m6538l5644j3495K3306j2079n5168O428n709L0168L2621j9556m5276
$$ 400108 353570 317926 304431 327737 315658 260490 266918 261209 291377 323998 304442 259166
13810B59166k1379n5161m6189J5528O5446P989j7751J8609k0378k6881o94L6348
$$ 259166 237787 182626 136437 151965 217411 225400 207649 226258 205880 178999 178305 214653
13798B14653J7184o359k0621k2216O0545Q255q77L8834l3268m1971k1190K9098
$$ 214653 231837 225478 204857 182641 243186 251441 250564 289398 256130 214159 192969 222067
13786B22067J1208j447l4182j8331L2729j1628j8353L0385K2080j7449m4080k7430
$$ 222067 233275 231828 197646 179315 212044 200416 182063 212448 234528 217079 172999 145569
13774A45569P3428R386m1005l5536R863J1881J5850K6575m104M952j750j430o286
$$ 145569 218997 228383 187378 151842 161705 173586 189436 216011 211907 216859 215109 213679 207393
13761B07393m4926L4578j6467l534J3750k1803J4618k547k4999J2935J3143K5302
$$ 207393 162467 197045 180578 177044 190794 168991 183609 181062 156063 168998 182141 207443
13749B07443J4031P970k2110k4567l6338R577N4825j8972j7874n6194o0454j237
$$ 207443 221474 229444 207334 182767 146429 156006 210831 191859 173985 117791 57337 56100
13737E6100K9308Q910L6543L4317n535l9293k4755R611k1692l662k0515j3533
$$ 56100 85408 94318 130861 165178 159643 120350 95595 105206 83514 79852 59337 45804
13725D5804j5311J0291J4800J9756L9449K1512m0747J6979K1092j8942m3571m489
$$ 45804 30493 40784 55584 75340 114789 136301 95554 112533 133625 114683 71112 66623
13713F6623m0052m3469Q7798L1981n839L9656P536j0569n2573k051J2931j6338
$$ 66623 26571 -16898 70900 102881 97042 136698 144234 133665 81092 79041 91972 75634
13701G5634o990k0525N8183J0215r291j3790j2092J8405n38J733P605k2771k7904
$$ 75634 68644 48119 106302 116517 107226 93436 81344 99749 99211 100944 108549 85778 57874
13688E7874j4j654J5596M0137K935J8991J230K1776j5315k2955k4674J6617J620
$$ 57874 57860 56206 71802 111939 114874 133865 135095 156871 141556 118601 93927 110544 112164
13675A12164K191N313J1583J0809p071J7953P3478L6381p811O249l1295j10142
$$ 112164 114355 119668 131251 142060 134989 152942 226420 262801 254990 261239 229944 119802
13663A19802n3369m626l7896k5644k4045J3932O1837L0626o6108j626l803o267
$$ 119802 66433 61807 23911 -1733 -25778 -11846 49991 80617 14509 12883 9080 2813
13651B813J5110L9844K5392k8511o018K3462J1167K1509J0432K4877k8284l0265
$$ 2813 17923 57767 83159 54648 48630 72092 83259 104768 115200 140077 111793 81528
13639H1528k6824o7415k6198M4317r730K7121J1443j8422M1825J4588L7211O9214
$$ 81528 54704 -12711 -38909 5408 -4322 22799 34242 15820 57645 72233 109444 178658
13627A78658J3616r278k5526l7904r3017n2642r640L0262M2772M4579M1722m2080
$$ 178658 192274 182996 157470 119566 26549 -26093 -35733 -5471 37301 81880 123602 81522
13615H1522m1215m8886K233O0894L2715m5006k7088L2519k8064n5173k0886J3743
$$ 81522 40307 -8579 -6346 54548 87263 42257 15169 47688 19624 -35549 -56435 -42692
13603d2692k9661l4945M9826N3759N6754n433L803m201k011l9841L7418N9177
$$ -42692 -72353 -107298 -57472 -3713 53041 47608 51411 47210 45199 5358 42776 101953
13591A01953L4588r980m6577k1840r434L0120M6705k2290j2673o305K209N8314
$$ 101953 136541 126561 79984 58144 48710 78830 125535 103245 90572 84267 86476 144790
13579A44790L6550j6948p2262o5038O476J3223m573n63l9192m785K6551O1806
$$ 144790 181340 164392 92130 27092 33568 46791 42218 41655 2463 -2322 24229 86035
13567H6035K127l601m6055k2396J6832K6265K1016K5914L588K215l3055r453K1467
$$ 86035 88162 84561 38506 16110 32942 59207 80223 106137 109725 111940 78885 69432 90899
13554I0899L2571K4785K8297J3350K3753J8933M0383M5719M1911l748Q2956O3114
$$ 90899 123470 148255 176552 189902 213655 232588 272971 318690 360601 356853 439809 502923
13542E02923L4030N843K3443k7733o1404J8997N9461J8851j4461k2378m8191o5180
$$ 502923 536953 542796 566239 538506 477102 496099 555560 574411 559950 537572 489381 424201
13530D24201j6283j608l0110M773K3920K0897J12184J43904J29319J65826J68896
$$ 424201 407918 406310 376200 380973 404893 425790 537974 681878 811197 977023 1145919
13519A145919J71077R9405P5190K4484j4631p9967j32570j17766j27959j38547
$$ 1145919 1316996 1416401 1491591 1516075 1501444 1421477 1288907 1171141 1043182 904635
13509I04635p2431l2632Q613k1585m1209r1353l4129J5484K833k719q4k3092m3220
$$ 904635 832204 799572 808185 786600 745391 654038 619909 635393 638226 635507 635423 612331 569111
13496E69111J7715J9746L7240K2631K1517M2433M0130K7696k2346O8056M9214
$$ 569111 586826 606572 643812 666443 687960 730393 770523 798219 775873 843929 893143
13485H93143J0945k1502o0097m394q1588n8393J2590P902L0512K4009j0281j4200
$$ 893143 904088 882586 822489 818095 736507 678114 690704 698606 729118 753127 742846 728646
13473G28646J9805O9872j041p3011n6892k4501O0875P4289J0880O9592Q0305K8882
$$ 728646 748451 818323 817282 744271 687379 662878 723753 798042 808922 878514 958819 987701
13461I87701K6752O3518R7357J15221O4968k7030j2122p615M9407J07368R9535
$$ 987701 1014453 1077971 1175328 1290549 1355517 1328487 1316365 1308750 1358157 1465525 1565060
13450A565060R9953J09536J05539J50033K03169J79520K33378K62367K81471L22941
$$ 1565060 1665013 1774549 1880088 2030121 2233290 2412810 2646188 2908555 3190026 3512967
13440C512967M58860M90108O17947O90692P59043Q74027J072543J385851J773419
$$ 3512967 3971827 4461935 5079882 5770574 6529617 7403644 8476187 9862038 11635457
13431A1635457J883394J955373K235923K980422M031699N214059N751373P254553
$$ 11635457 13518851 15474224 17710147 20690569 24722268 29936327 35687700 42942253
13423D2942253J1608563J9103325L1154127M6931898N5409414M6204479L1719346
$$ 42942253 54550816 73654141 104808268 151740166 207149580 253354059 285073405
13416B85073405L2152467L8048845M1736652K0703131p7381635j04524015o7110841
$$ 285073405 317225872 355274717 397011369 417714500 340332865 235808850 168698009
13409A68698009m0232767k6138616j8165059j3007192r771778p304420n233056
$$ 168698009 128465242 102326626 84161567 71154375 61382597 54078177 48845121
13402D8845121l830496k927488k406261j936796j757820j905130j912595j757360
$$ 48845121 45014625 42087137 39680876 37744080 35986260 34081130 32168535 30411175
13394C0411175j596816j426670j222618j123274j076229j023011r34043q37660
$$ 30411175 28814359 27387689 26165071 25041797 23965568 22942557 22008514 21170854
13386B1170854q41208q21658q93232q66245p49549o35519n79497n66303m81705
$$ 21170854 20329646 19507988 18614756 17748511 16998962 16363443 15783946 15217643 14735938
13377A4735938l89413m59005m67851m72208m57522m23543l85268m26427l24331
$$ 14735938 14346525 13887520 13419669 12947461 12489939 12066396 11681128 11254701 10930370
13368A0930370k63848k97993k61940k22829l08744l72173l50252k61065k43148
$$ 10930370 10666522 10368529 10106589 9883760 9575016 9202843 8852591 8591526 8348378
13359H348378j56878k58220k96455k46777k01544j68758j59915j53374j60820
$$ 8348378 8191500 7933280 7636825 7390048 7188504 7019746 6859831 6706457 6545637
13350F545637j62952k52068k57105k38719j73424j83762j30755j13686j28752
$$ 6545637 6382685 6130617 5873512 5634793 5461369 5277607 5146852 5033166 4904414
13341D904414j33138j00053p8782k4452l7176j26580r7713n3158j35534j58538
$$ 4904414 4771276 4671223 4592441 4567989 4530813 4404233 4306520 4253362 4117828 3959290
13331C959290j02716j04677r4217p4819j27554j17002q6791n1594n0146o5057
$$ 3959290 3856574 3751897 3657680 3582861 3455307 3338305 3251514 3199920 3149774 3084717
13321C084717o5949j50184j35710o2333N987k4285r7876p3766n6204o7401o6758
$$ 3084717 3018768 2868584 2732874 2670541 2676528 2652243 2554367 2480601 2424397 2356996 2290238
13310B290238L6415Q015l1422n0913q3678r558n956o7295k6837p2094m9799p3986
$$ 2290238 2326653 2334668 2303246 2252333 2168655 2159097 2153141 2085846 2059009 1986915 1937116 1863130
13298A863130k5000l3587p5774k768K4697k6554j1746j825O9885R0425k7082j01776
$$ 1863130 1838130 1804543 1728769 1726001 1750698 1724144 1712398 1710573 1780458 1870883 1843801 1742025
13286A742025o540n7365o3949l8818k4611l4866o8403j03005n1615m2409k3731
$$ 1742025 1735485 1678120 1614171 1575353 1550742 1515876 1447473 1344468 1292853 1250444 1226713
13275A226713k4708L1956n818l7493K0604O0446q84j1719K1501j9381m7192l1019
$$ 1226713 1202005 1233961 1228143 1190650 1211254 1271700 1270816 1259097 1280598 1261217 1214025 1183006
13263A183006m8185o6352j1310k7060r400l5418j14508p6075R037j3134m5337
$$ 1183006 1134821 1068469 1057159 1030099 1020699 985281 870773 794698 803735 790601 745264
13252G45264k0525L072j1188j6511m1764j3777o7506m6573p739l5069M241j1098
$$ 745264 724739 727811 716623 700112 658348 644571 577065 530492 522753 487684 491925 480827
13240D80827k093L625L511l3665n1993j7298J3024K3990L0230K3863K7393j2567
$$ 480827 478734 482359 485870 452205 400212 382914 395938 419928 450158 474021 501414 488847
13228D88847m6073J8288l328j4229n2534k8063j333n051J8518R808j9065l0919
$$ 488847 442774 461062 457734 443505 390971 362908 361575 356524 375042 384850 365785 334866
13216C34866n7731M3836l532K747j8220j9451O479Q3485L8788l4886l002J0061
$$ 334866 277135 320971 317439 320186 301966 282515 288994 372479 411267 376381 373379 383440
13204C83440o9434o5125j2596K3880N1692K8100j8904N01m0510k0273J3679L3564
$$ 383440 314006 248881 236285 260165 311857 339957 321053 321554 281044 260771 274450 308014
13192C08014J6178L8044k0599n8362l9979K4336k2427N770K3188j2343P4996l2532
$$ 308014 324192 362236 341637 283275 243296 267632 245205 250975 274163 261820 336816 304284
13180C04284n1220k682J5814P3663N6609K4149J1539l6206k0438l4864l4956L8848
$$ 304284 253064 250382 266196 339859 396468 420617 432156 395950 375512 340648 305692 344540
13168C44540M18l3978N8773K6734j9488k0916j3629l073n6019l6990m3040K4958
$$ 344540 344958 310980 369753 396487 376999 356083 342454 339381 283362 246372 203332 228290
13156B28290M5492M3710m912J8602K9696k0219n4443j6963p4223n588L6981L5372
$$ 228290 273782 317492 312580 331182 360878 340659 286216 269253 195030 189442 226423 261795
13144B61795k2183m1710j1078k023j406K0599J4601L5127m4000l8685K292r967
$$ 261795 239612 197902 186824 184801 183395 203994 218595 253722 209722 171037 173329 163362
13132A63362K4431J6678j7405M7601J1889j324p7126m752q250k5063o989O6416
$$ 163362 187793 204471 187066 234667 246556 245232 168106 163354 155104 130041 123052 189468
13120A89468K9961p797o4361J1496K482O429j9866l8296j771M2175M2998l8123
$$ 189468 219429 211632 147271 158767 161249 167678 147812 109516 107745 149920 192918 154795
13108A54795m8918J7830K683J1321L2183J5712j9335n6666N370M0110K1288k3557
$$ 154795 105877 123707 126390 137711 169894 185606 166271 109605 114975 155085 176373 152816
13096A52816j1599L2467k451j9632p124l0851J7120o638n5227j2297Q145J7245
$$ 152816 141217 173684 171233 151601 144477 113626 130746 124108 68881 56584 64729 81974
13084H1974M6153P6844M8232k6258q221k9214l0005O388l0121m9521M427k1625
$$ 81974 128127 204971 253203 226945 218724 189510 159505 165893 135772 86251 90678 69053
13072F9053j6936M0526L1437K2365J2632o3983n2612K9664L3065r075j9638j552
$$ 69053 52117 92643 124080 146445 159077 95094 42482 72146 105211 96136 76498 74946
13060G4946j9973k6039J6111M2115R0695j9947j5754m0071l818k3236j3884n3811
$$ 74946 54973 28934 45045 87160 177855 157908 142154 102083 98265 75029 61145 7334
13048G334j4885R6286M5178j1716l6978k367J7988o811n4896o1969K7846J5539
$$ 7334 -7551 88735 133913 122197 85219 82852 100840 94029 39133 -22836 5010 20549
13036B0549k9565p658K9810l894K7417n3105n788N6748J9969M2335N5943K9186
$$ 20549 -9016 -16674 13136 9242 36659 -16446 -22234 34514 54483 96818 152761 181947
13024A81947R950m3727k3891l7938L9580k1075l4794O253K1530q406J320J0598
$$ 181947 191897 148170 124279 86341 125921 104846 70052 76305 97835 89429 90749 101347
13012A01347M2381J2220n4837k0561m413M8172l2738O777m802p4409K398m149
$$ 101347 143728 155948 101111 80550 76137 124309 91571 98348 93546 19137 21535 17386
13000A7386L6596K3475j0672j7566n69m5699k3159K0848p214Q7033p700r912L4972
$$ 17386 53982 77457 66785 49219 48650 2951 -20208 640 -6574 80459 72759 62847 97819
12987I7819J7970J3428k4557N714P217L618M4644Q705m2326j7492k6324M6270
$$ 97819 115789 129217 104660 110374 117591 121209 165853 174558 132232 114740 88416 134686
12975A34686R3073N3971K5689O1601J26133K39461K40641K75373K07111J65750
$$ 134686 227759 281730 307419 369020 495153 734614 975255 1250628 1457739 1623489
12965A623489K09006K08215K16856K6321m30023m97463l44479k43229j68271j24378
$$ 1623489 1832495 2040710 2257566 2283887 1853864 1356401 1011922 768693 600422 476044
12955D76044o8656N175M47l7118m4759l0882l8892m2360J8824O837k3760l4173
$$ 476044 407388 412563 413010 375892 331133 300251 261359 218999 237823 244660 220900 186727
12943A86727m3107j6724K3196l6216O869m0577k4346K974K2467J1143m7943l0141
$$ 186727 143620 126896 150092 113876 120745 80168 55822 58796 81263 92406 44463 14322
12931A4322L0961L6303R6796o639l6399l2579M6722K0887j9839k6482l9450p922
$$ 14322 45283 81586 178382 171743 135344 102765 149487 170374 150535 124053 84603 76681
12919G6681o7324l61L7650M996k3426K5512K5170K8842j7555k8064l9683r417
$$ 76681 9357 8996 46646 51642 28216 53728 78898 107740 90185 62121 22438 13021
12907A3021L8229L4284k2439N4025J2429j7359o552L8397j4038l3932o5637N094
$$ 13021 51250 85534 63095 117120 129549 112190 105638 144035 129997 96065 30428 35522
12895C5522J6794N1212N2898P611k7183m6005l5311l9543j8230M1040N0258n0023
$$ 35522 52316 103528 156426 164037 136854 90849 55538 15995 -2235 38805 89063 39040
12883C9040k0182q347P980J2472J733j3859K5184N3957l0879n4765o2216j383
$$ 39040 18858 10511 18491 30963 32696 18837 44021 97978 67099 12334 -49882 -51265
12871e1265N0459K7699l2344l199K5821j409n965L6396K0981n6220m8019M2193
$$ -51265 -806 26893 -5451 -8650 17171 15762 9797 46193 67174 10954 -37065 5128
12859E128M0232J9687K7970N6728J5229k5603n5181J7306J7645k2707m1184K5108
$$ 5128 45360 65047 93017 149745 164974 139371 84190 101496 119141 96434 55250 80358
12847H0358j168n4282l4719J1266K8434k1722l9859K4989K8302J1886n2088o426
$$ 80358 79190 24908 -9811 1455 29889 8167 -31692 -6703 21599 33485 -18603 -25029
12835b5029J5993N3181j144J452K6560J1697j0992j5027P588N5687l8695L037
$$ -25029 -9036 44145 43001 44453 71013 82710 71718 56691 64279 119966 81271 84308
12823H4308K362p65p9159L6821N5039k6272n3623l3416j4209L4206O9700k3053
$$ 84308 86670 85905 6746 43567 98606 72334 18711 -14705 -28914 5292 74992 51939
12811E1939n1025k9231K1073J2812l5147k4052N0542O9803M0717n022j1337m5708
$$ 51939 914 -28317 -7244 5568 -29579 -53631 -3089 66714 107431 102409 91072 45364
12799D5364l5280L3674J5957l2117J1938l710m4661k0328l1718J0757L3488K4085
$$ 45364 10084 43758 59715 27598 39536 35826 -8835 -29163 -60881 -50124 -16636 7449
12787G449M5916M3479j6071j2314j5640J5065j9353M7769L4920K37M382m4909
$$ 7449 53365 96844 80773 68459 52819 67884 48531 96300 131220 131457 135839 90930
12775I0930k825L3912R927o508k6593J491m112r936p322l9122k8911L5899L4610
$$ 90930 88105 122017 131944 125436 98843 100334 96222 86286 78964 39842 10931 46830 81440
12762H1440j1616R89K4534j9938l4883q050L2750K3066m7942k6200k4462l0943
$$ 81440 69824 70813 95347 75409 40526 32476 65226 88292 40350 14150 -10312 -41255
12750d1255j2540J8304Q1252j4374k1537Q815J3847k6550j352M3769Q206j0900
$$ -41255 -53795 -35491 45761 31387 9850 18665 32512 5962 4610 48379 56585 45685
12738D5685M562k4678k0908n030q423M813K0927j2091l1235K9604J4655n816L157
$$ 45685 50247 25569 4661 -369 -8792 -3979 16948 4857 -26378 3226 17881 12065 15222
12725A5222J0380l137j7942j1951q91n587J8355m713J8155K637L7675k241j4937
$$ 15222 25602 22465 4523 -7428 -8319 -13906 4449 -264 17891 20528 58203 55962 41025
12712D1025l6647J7975L0237l2265o0814l6506k809M3033K6792p68J6737O102
$$ 41025 4378 22353 52590 20325 -40489 -76995 -79804 -36771 -9979 -10747 5990 12092
12700A2092M0140J8478l3818n0906K191Q014K7013J3298M6904L4432Q602M84k7702
$$ 12092 52232 70710 36892 -14014 -11823 -3809 23204 36502 83406 117838 126440 126924 99222
12687I9222k4881j8568l8432L0421K128k8283J8653J6807j2209R19m6442m3856
$$ 99222 74341 55773 17341 47762 49890 21607 40260 57067 44858 45777 -665 -44521
12675d4521L9490J9955L22l6872j6510N5605J466j2024j735J4339k5656L6165
$$ -44521 -5031 14924 15246 -21626 -38136 17469 18935 6911 5176 19515 -6141 30024
12663C0024M3095j5212o410m4093n6006L0550j2893M0725k3315j6180k1960L0814
$$ 30024 73119 57907 51497 7404 -48602 -18052 -30945 9780 -13535 -29715 -51675 -20861
12651b0861K3577l4272j6551J4220k0030q71J2581J9464L6969K3209P715q697
$$ -20861 2716 -31556 -48107 -33887 -53917 -54788 -42207 -22743 14226 37435 45150 36453
12639C6453K809K3943j2744j7189j2846j1591k5587k3688K1010N1573M2619P852
$$ 36453 39262 63205 50461 33272 20426 8835 -16752 -40440 -19430 32143 74762 82614
12627H2614j0548J6141o28J7110m444p358J737l0214o8289k1002L8662R054M3029
$$ 82614 72066 88207 87579 104689 100245 92887 94624 64410 -3879 -24881 13781 22835 65864
12614F5864o786l3011j571K8745k8779p3169p027O2368m151k8147k5203K7148
$$ 65864 59078 26067 24496 53241 24462 -48707 -55734 6634 2483 -25664 -50867 -23719
12602b3719K3755l6258J8786O303K4546P9609L0516m7362r719l8234Q565k2982
$$ -23719 36 -36222 -17436 -11133 13413 93022 123538 76176 66457 28223 36788 13806
12590A3806p748K3428J0381j1962J2048M310m9194P117K5923K5853J836j0096
$$ 13806 6058 29486 39867 27905 39953 44263 -4931 2186 28109 53962 55798 45702
12578D5702m722l0493m3270J1552L5021j4999j7108j7132j7538L9543j68o0019
$$ 45702 40980 10487 -32783 -21231 13790 -1209 -18317 -35449 -52987 -13444 -13612 -73631
12566g3631j7519K2779L2894O1252m0975J788J4447P791m1100L5329L7179m443
$$ -73631 -91150 -68371 -35477 25775 -15200 -13412 1035 8826 -32274 3055 40234 35791
12554C5791J9590K8741j1473o293P824j1397m5875j20783J9381L8238j4437p092
$$ 35791 55381 84122 72649 66356 74180 62783 16908 -103875 -84494 -46256 -60693 -67785
12542f7785j5338M4529O2483J6190J0299q864L6742j1563q0086p0443l6703P5879
$$ -67785 -83123 -38594 23889 40079 50378 41514 78256 66693 -13393 -83836 -120539 -44660
12530d4660L8748K1725n608K4178m6487j2827K3440K4107n479k5284M8871K1424
$$ -44660 -5912 15813 10205 34383 -12104 -24931 -1491 22616 17137 -8147 40724 62148
12518F2148j6297j2305j4479J5630J2069K0061K3607l2227l3758k7668M736K048
$$ 62148 45851 33546 19067 34697 46766 66827 90434 58207 24449 -3219 1517 3565
12506C565j730n184K9946N6942n859j5030L626l96O923K8891n8150n4815k6067
$$ 3565 1835 -3349 26597 83539 77680 62650 66276 65880 72803 101694 43544 -11271 -37338
12493c7338n6080K7585L7268q400o046P9807k91m0475N090j6060J1444l329J3576
$$ -37338 -93418 -65833 -28565 -36965 -43011 36796 36505 -3970 1120 -14940 -3496 -6825 6751
12480F751N2027K3582l2712k8014K5485j2691Q315L5796j5933O000M5636j2293
$$ 6751 58778 82360 49648 21634 47119 34428 42743 78539 62606 68606 114242 101949
12468A01949j9229l0802O378o059j3607L0129m5111m5920R861M4959K2435n8708
$$ 101949 82720 51918 58296 52237 38630 68759 23648 -22272 -12411 32548 54983 -3725
12456c725O159K796M9269J9198k2723j7200j0758K7159n5o4237m6600P627J6737
$$ -3725 2434 5230 54499 73697 50974 33774 23016 50175 50120 -14117 -60717 -53090 -36353
12443c6353J7912O001n2437N976P5067K7988l7497k5398L1290N1067l9532n8447
$$ -36353 -18441 -12440 -64877 -58901 16166 44154 6657 -18741 12549 63616 24084 -34363
12431c4363j5008J9565K0745K7019r18M81n353L4174R822l3394n750m0936k1383
$$ -34363 -49371 -29806 -9061 17958 17040 17521 12168 46342 56164 22770 17020 -23916 -45299
12418d5299n860j0749J6886M2945L651P392K460J4823m874j6043l8382J3972K7155
$$ -45299 -51159 -61908 -45022 -2077 1574 8966 11426 26249 21375 5332 -33050 -19078 8077
12405H077J3660N181K9070N2265l133n7827m6737Q603J2250R010J6022k288K5453
$$ 8077 21737 26918 55988 108253 105120 47293 556 9159 21409 30419 46441 44153 69606
12392F9606J837m463K135L3164K4364m9255m4489l2123r382j5610M773r496J2949
$$ 69606 71443 66980 69115 102279 126643 77388 32899 776 -8606 -24216 -19443 -28939 -15990
12379a5990n796K843L3824M0269k7599q195K8677K697K2820O821l1386K3676L7199
$$ -15990 -21786 -18943 14881 55150 27551 19356 48033 50730 73550 80371 48985 72661 109860
12366A09860j114n4370k5009l855J1918M4162P073L831J5319l2307j7494o0937
$$ 109860 108746 54376 29367 25512 37430 81592 88665 92496 107815 75508 58014 -2923
12354b923l9524r482l4983J9215K0583k1942m733N076L3728M7556k9883j84l701
$$ -2923 -42447 -51929 -86912 -67697 -47114 -69056 -73789 -68713 -34985 12571 -17312 -17496 -21197
12341b1197p7580l922P2725O5708j0266o5377j8610P501K0743J8978L2836l4307
$$ -21197 -98777 -102699 -29974 35734 25468 -39909 -58519 -51018 -30275 -11297 21539 -12768
12329a2768K8620L8581n2512p6328r553L8975O8520p740k0832k3806K0478k5517
$$ -12768 15852 54433 1921 -74407 -83960 -44985 23535 15795 -5037 -28843 -8365 -33882
12317c3882L246m2931K0039M2994J6294n1310k9197L1896M8395k149K4135O925
$$ -33882 -30636 -73567 -53528 -10534 5760 -45550 -74747 -42851 5544 3395 27530 34455
12305C4455k7007n0690r307M477M4670M3235l7504K6492J9081m1360O9174J5373
$$ 34455 7448 -43242 -52549 -48072 -3402 39833 2329 28821 47902 6542 75716 91089
12293I1089n6486N717J887r102j2927K4991J050k5138q87j2573J2245Q301k856
$$ 91089 34603 40320 42207 33105 20178 45169 46219 21081 20194 7621 19866 28167 25311
12280B5311m10o8396R617J02n068M2683L5484M454m137K6088k1301l9715p2802
$$ 25311 24901 -43495 -33878 -33776 -38844 3839 39323 43777 39640 65728 44427 4712 -68090
12267f8090J7656O5366p556m4753m482J2998k3192J7173Q4125M5910o254m8993
$$ -68090 -50434 14932 7376 -37377 -41859 -28861 -52053 -34880 49245 95155 88901 39908
12255C9908l4538k7767l7622m8299n6921K5987N5703M5648J6137J1250j4445r574
$$ 39908 5370 -22397 -60019 -108318 -165239 -139252 -83549 -37901 -21764 -10514 -24959 -34533
12243c4533J3786K5624N941j1025L8335K4452m3905l9219K6621L9989L9268m0054
$$ -34533 -20747 4877 10818 -207 38128 62580 18675 -20544 6077 46066 85334 45280
12231D5280m6410p1091J9759M5695K054N772M555k0693j7741k4064k2465M770
$$ 45280 -1130 -72221 -52462 -6767 -4713 1059 5614 -15079 -32820 -56884 -79349 -74579
12219g4579M4411l08J8148j4442K8104K2922l748l4744j4462k4334J913m8779
$$ -74579 -30168 -30476 -12328 -26770 1334 24256 20508 -14236 -28698 -53032 -51119 -99898
12207i9898o606J09480K9975n4032l6451M8446K99k3074M402K2601j5984K226
$$ -99898 -106504 2976 32951 -21081 -57532 -9086 -8787 -31861 -27459 -4858 -20842 -18616
12195a8616q027K7594R2972m805n6507n767P368Q204j979j5659k1547n6033q44
$$ -18616 -26643 951 93923 89118 32611 26844 34212 42416 40437 24778 3231 -52802 -53646
12182e3646O182j2040K9922J6185j8435k3910o523L1222L0720k1071j4730k7480
$$ -53646 -47464 -59504 -29582 -13397 -31832 -55742 -62265 -31043 -323 -21394 -36124 -63604
12170f3604M6166M5813J8470j3775K8202j5409l2404M1059j3361o1564j4346O3466
$$ -63604 -17438 28375 46845 33070 61272 45863 13459 54518 41157 -20407 -34753 28713
12158B8713j7832m9502K1826J7525l8746M814j7007K4836K7857M5634j6053n5474
$$ 28713 10881 -38621 -16795 730 -38016 -33202 -50209 -25373 2484 48118 32065 -23409
12146b3409l3231J0923k46J2061J4378O879l2769L4041k2205j3736M4649j876
$$ -23409 -56640 -45717 -45963 -33902 -19524 -12645 -45414 -11373 -33578 -47314 -2665 -4541
12134d541j8085P664R655p826K0827j2197L3410N720k0937m9733o706K0643L1098
$$ -4541 -22626 -14962 -5307 -13133 7694 -4503 28907 34627 13690 -36043 -42749 -22106 8992
12121H992M562M535j5094l5632k6402j1851K694m8807J1916J18037j0952p146
$$ 8992 13554 18089 2995 -32637 -59039 -70890 -68196 -117003 -105087 12950 1998 -5148
12109e148r885O647o599j9006j4101J0016J5539J3459M3598l3607k6447j293Q835
$$ -5148 -15033 -8386 -14985 -33991 -48092 -38076 -22537 -9078 34520 913 -25534 -26827 -17992
12096a7992K6762p815k9744l1800J2310N3317K0286O695J7293l005k378l1382
$$ -17992 8770 955 -28789 -60589 -48279 5038 25324 32019 49312 46307 43929 12547
12084A2547m1522K2925q69l7024O982M2263m931K6549J3728o0554l867j009L3484
$$ 12547 -28975 -6050 -6919 -43943 -36961 5302 371 26920 40648 -19906 -23773 -24782 8702
12071H702L1625n2550j2590J9104J3164k8724j3766P949J3677M5334M645l0004
$$ 8702 40327 -12223 -24813 -5709 7455 -21269 -35035 -27086 -13409 31925 36570 6566
12059F566K564K4886o258j5255l1027K9491q294j0981M0669M2103L5646p2034
$$ 6566 9130 34016 27758 12503 -18524 10967 2673 -8308 32361 74464 110110 38076
12047C8076n146M1622l7010q1839M0178M4652k5837l0884O1165J5586K1939L504
$$ 38076 32930 74552 37542 -44297 -4119 40533 14696 -16188 44977 60563 82502 86006
12035H6006j2544k1855L0408l7938o0668p744J5650K6627J453p8123l4534J7511
$$ 86006 73462 51607 82015 44077 -16591 -24335 -8685 17942 19395 -58728 -93262 -75751
12023g5751M5066K5358j0327J1939K6816n1561m6234N8773K4640l8096n719M899
$$ -75751 -30685 -5327 -15654 -3715 23101 -28460 -74694 -15921 8719 -29377 -35096 -30197
12011c0197r102L6302L1029J7908r898k2978k788K7831m5275n205n253K6501R78
$$ -30197 -39299 -2997 28032 45940 36042 13064 10276 38107 -7168 -12373 -17626 8875 9853
11998I853m3852j6167J6763L9599k0791j6124j7944m264J6643k8654j3900J5745
$$ 9853 -33999 -50166 -33403 6196 -14595 -30719 -48663 -52927 -36284 -64938 -78838 -63093
11986f3093K2526n421J0643K2145K9771Q768M271M559J7348q397k9700l3705J3739
$$ -63093 -40567 -45988 -35345 -13200 16571 25339 29610 34169 51517 43120 13420 -20285 -6546
11973f546O73j1301M2168l3949P631J9995J2038m686J9682K7406n4259m4382P778
$$ -6546 -5873 -17174 24994 -8955 -1324 18671 30709 26023 45705 73111 18852 -25530 -17752
11960a7752k778K5926J1769Q7198J2293k0816j4360m7858r567J660j2080n287
$$ -17752 -20530 5396 17165 104363 116656 95840 81480 33622 24055 25715 13635 8348
11948H348m740K0009j5145Q039l5338q340L8688M3180q364l2713k9638K281r572
$$ 8348 3608 23617 8472 16511 -18827 -27167 11521 54701 46337 13624 -16014 -13733 -23305
11935b3305Q726L9691N760k4289n7799L6525M4102j5614M348L886j3112O847M4070
$$ -23305 -14579 25112 30872 6583 -51216 -14691 29411 13797 18145 22031 8919 15766 59836
11922E9836L8578m8366p938Q711p905l4024L558J958j0595l9673q014M0206L2192
$$ 59836 98414 50048 42110 50821 42916 8892 12450 14408 3813 -35860 -43874 -3668 28524
11909B8524l481M6130J3359n4058K4534m7141n0886k8094m067O7766M984l1058
$$ 28524 25043 71173 84532 30474 55008 7867 -43019 -71113 -75180 -7414 -2430 -33488
11897c3488Q809J4649L0734L2080l0352J4762k3460j1092J5448j1734K0180J7804
$$ -33488 -24679 -10030 20704 52784 22432 37194 13734 2642 18090 6356 26536 44340
11885D4340p8537j4001K8788m6672j6071K63m0102L795K5534k522R7360k3971
$$ 44340 -34197 -48198 -19410 -66082 -82153 -81890 -121992 -118197 -92663 -95185 2175 -21796
11873b1796n8280K5655L7423L7175j7145J6415l6818k8564m5635K5739L5040M605
$$ -21796 -80076 -54421 -16998 20177 3032 19447 -17371 -45935 -91570 -65831 -30791 -26186
11861b6186J209m1892P2923L5036l9445o5811J3961L8822K7669j2732k9271l1490
$$ -26186 -24977 -66869 6054 41090 1645 -64166 -50205 -11383 16286 3554 -25717 -57207
11849e7207l4183p906R728n567J8567M2160p268m6534J4608J0405N0317J7112
$$ -57207 -91390 -99296 -89568 -95135 -76568 -34408 -41676 -88210 -73602 -63197 -12880 4232
11837D232l4122q072p914J7563L6619L6510k386m4076l4034l800L6505K098k7306
$$ 4232 -29890 -37962 -45876 -28313 8306 44816 42430 -1646 -35680 -39480 -2975 -877 -28183
11824b8183J6353J1685k156k7567L143j6668l2258j1769K7525K7083N4525m7313
$$ -28183 -11830 -145 -2301 -29868 -26725 -43393 -75651 -87420 -59895 -32812 21713 -25600
11812b5600m4011j7845M2525K6745K9372m978K4061J5669K867l353k2870j2842
$$ -25600 -69611 -87456 -44931 -18186 11186 6208 30269 45938 48805 45452 22582 9740
11800I740K6842J9752m6647N049K393o641n2256k2291K1480m267N0972N8540k1139
$$ 9740 36582 56334 9687 14736 17129 10488 -41768 -64059 -42579 -46846 4126 62666 41527
11787D1527k0260j2418o687l0915M1629k7473k5666M300J6826K7092J772j6211
$$ 41527 21267 8849 2162 -28753 12876 -14597 -40263 -35963 -19137 7955 9727 -6484
11775f484p244M0856L5887M6966J0780p8426k9245m9490J9674M4515l8322l7312
$$ -6484 -13728 27128 63015 109981 120761 42335 13090 -36400 -16726 27789 -10533 -47845
11763d7845J7539K9057N725N273K4744M4818M5750j8616n1747m4495j8470n847
$$ -47845 -30306 -1249 4476 9749 34493 79311 125061 106445 54698 10203 -8267 -14114
11751a4114L2086Q494L4170q856p6952L393k3950k2529l1096J0267M5542J8592
$$ -14114 17972 26466 60636 51780 -25172 -21779 -45729 -68258 -99354 -89087 -43545 -24953
11739b4953k4889O3288L7218l232K9052J5727l069l4190j5471j9471p5532K246
$$ -24953 -49842 13446 50664 47432 76484 92211 89142 54952 39481 20010 -55522 -53276
11727e3276J8046J6789L3347N7059k72n3465j4945j0751j4544K4127j4022j0627
$$ -53276 -35230 -18441 14906 71965 71693 18228 3283 -7468 -22012 2115 -11907 -22534
11715b2534P603J3985K4831L4586K8664l0988o6566n316l0624j9802J0510k865
$$ -22534 -14931 -946 23885 58471 87135 56147 -10419 -15735 -46359 -66161 -55651 -58516
11703e8516N7895K0898L5095j6408n9304j4628j4452J9442J4047k5136N3477p398
$$ -58516 -621 20277 55372 38964 -20340 -34968 -49420 -29978 -15931 -41067 12410 5012
11691E012l1460k535J0497p035q553m6640k516M6692J8675J1637M0560j7720j9267
$$ 5012 -26448 -28983 -18486 -25521 -34074 -80714 -83230 -36538 -17863 -6226 34334 16614 -2653
11678b653N5690L6969J4854J5942k1976k9886O001N248k4398l5905n5622L5539
$$ -2653 53037 90006 104860 120802 98826 68940 74941 80189 55791 19886 -35736 -197
11666a97O0985O7141L6437k316j3609L4917L2919L848m275k4501j1810O987j6536
$$ -197 60788 127929 164366 162050 148441 183358 216277 220125 215850 191349 179539 186526 169990
11653A69990K324o6k1535p4405n5599r155K7502q90j3300j7331K6902K641J3208
$$ 169990 172314 172248 150713 76308 20709 11554 39056 38166 24866 7535 34437 37078 50286
11640E0286K9198J3816l0045J1923n4294o4689j0378K8410K764j9431k1104R157
$$ 50286 79484 93300 63255 75178 20884 -43805 -54183 -25773 -23009 -42440 -63544 -54387
11628e4387P131Q1293k468j4298l3808o574R343r068l761J3829L2420J2054l869
$$ -54387 -47256 34037 31569 17271 -16537 -23111 -13768 -22836 -26597 -12768 19652 31706 27837
11615B7837J3651J2944J0165j6972l508m7061k8519k144K3006J4500k843Q358
$$ 27837 41488 54432 64597 47625 44117 -2944 -31463 -33607 -10601 3899 1056 9414
11603I414l3711K9571K4667n015l800m6256n7570K3562J3015l869P433J5766K0666
$$ 9414 -24297 5274 29941 24926 21126 -25130 -82700 -59138 -46123 -49992 -42559 -26793 -6127
11590f127k3064l889k06K2225J8241k729K960m8691J7743p248l1925K2460M3706
$$ -6127 -29191 -33080 -33286 -11061 7180 4451 7411 -41280 -23537 -30785 -62710 -40250 3456
11577C456K9846K4606K282j8775l1069l4303M6721K9742r177j9495J1548o611
$$ 3456 33302 57908 60190 41415 10346 -23957 22764 52506 43329 23834 35382 28771
11565B8771r77K8347K463m2533j5531n984j2307J4031N3764K8190j7932K6140
$$ 28771 27794 56141 58604 16071 540 -5444 -17751 -3720 50044 78234 60302 86442
11553H6442M05j2265k8142n2769o2600j1414R151N5641J3419k8911j0492J242
$$ 86442 86847 74582 46440 -6329 -68929 -80343 -71192 -15551 -2132 -31043 -41535 -40293
11541d0293N9564M0624J1667l4547q84J011l292m3768l3345j1543J0243R084L1181
$$ -40293 19271 59895 71562 37015 36131 37142 33850 -9918 -43263 -54806 -44563 -35479 -4298
11528d298L4106J6415J0975k1680P371K3073k3730K0321j1040M4621l2242l2673
$$ -4298 29808 46223 57198 35518 42889 65962 42232 62553 51513 96134 63892 31219
11516C1219K992j8764K6682O311m1651o222M5525J5581k2054R067J366l593q55
$$ 31219 34211 15447 42129 48440 6789 567 46092 61673 39619 48686 50052 46459 45604
11503D5604n599o4537n9726M8003N5202J7364l9760K6240K0359j4490k1256j756
$$ 45604 40005 -24532 -84258 -36255 18947 36311 -3449 22791 43150 28660 7404 5648
11491E648l0178K7528k236J37k852j851k9815m391K8724J4517k585k6597N320
$$ 5648 -24530 2998 762 899 -1953 -3804 -33619 -38010 -9286 5231 2646 -23951 -18631
11478a8631L7022M1887L6489l2706l2978k3362J5259j4836m1795j1125j4179J3505
$$ -18631 18391 60278 96767 64061 31083 7721 22980 8144 -33651 -44776 -58955 -45450
11466d5450K0052K6996K9939l086L2431l6915l8112J5277J7398l1615J9160N7368
$$ -45450 -25398 1598 31537 28451 60882 23967 -14145 1132 18530 -13085 6075 63443
11454F3443k0018m9199l2596M0842K7222P514k72n6395k6353j0950k8368K6890
$$ 63443 43425 -5774 -38370 2472 29694 37208 36936 -19459 -45812 -56762 -85130 -58240
11442e8240M3788l5610l1580j3957N7775L3701J2075k5191P432q733j8165k7438
$$ -58240 -14452 -50062 -81642 -95599 -37824 -4123 7952 -17239 -9807 -18540 -36705 -64143
11430f4143N262M509O7582p808J1514k604l4948k385K6626M8680j0899k3793k7104
$$ -64143 -58881 -54372 13210 5402 16916 14312 -20636 -23021 3605 52285 41386 17593 -9511
11417i511l5140k058J2924k5599K425J5801m0805j0371L0926K3958L820r167R57
$$ -9511 -44651 -46709 -33785 -59384 -56959 -41158 -81963 -92334 -61408 -37450 -33630 -42797 -41840
11404d1840j1199J1530K8845L4576K6770l1858J3879j2584J3203k631j4188P251
$$ -41840 -53039 -41509 -12664 21912 48682 16824 30703 18119 31322 28691 14503 21754
11392B1754K2452q191n9428M1562R73m4278j4361j9773L6534K9691l321J8204
$$ 21754 44206 36015 -23413 18149 19122 -25156 -39517 -59290 -22756 6935 3614 21818
11380B1818K0221n3900m1573L8910J6924l4364j4795P060q229o073o294j5831
$$ 21818 42039 -11861 -53434 -14524 2400 -31964 -46759 -39699 -47928 -54001 -60295 -76126
11368g6126K1588J0771N935q30K8344Q405j1638K576p980M8696J8389l9587J325
$$ -76126 -54538 -43767 -37832 -38662 -10318 -1913 -13551 -10975 -18955 29741 48130 8543 9868
11355I868N6338m2051q5070N1692M7803R691k7542j9855j6414R220q572K0747
$$ 9868 66206 24155 -60915 -9223 38580 48271 20729 874 -15540 -6320 -14892 5855
11343E855K5733K8527j0123n0304m3429J1356K0252k5548k8609N0128J9772o6695
$$ 5855 31588 60115 49992 -312 -43741 -32385 -12133 -37681 -66290 -16162 3610 -63085
11331f3085M7187K6259L5311K0063j0967l980k6723n4748j47J1314J2105K6298
$$ -63085 -15898 10361 45672 65735 54768 50788 24065 -30683 -30830 -19516 -7411 18887
11319A8887P941j4134K5801k3364n4493p221M6728N5790j2220p3490k2787J1188
$$ 18887 26828 12694 38495 15131 -39362 -46583 145 55935 43715 -29775 -52562 -41374
11307d1374P6079q853p351k5626l9051N1050K5902J3673K8410l8735R0O1924m6406
$$ -41374 34705 25852 18501 -7125 -46176 4874 30776 44449 72859 34124 34214 96138 49732
11294D9732o7066M1149N5145j8544K8687N509p433m7411m9151k9316L3713l952
$$ 49732 -17334 23815 78960 60416 89103 94612 87179 39768 -9383 -38699 -4986 -8938
11282h938o5177k5346P643K6687O3750K1008J5043k4658j4570P481J5334j8082
$$ -8938 -74115 -99461 -91818 -65131 -1381 19627 34670 10012 -4558 2923 18257 175
11270A75m9811j4292k2152K049L9774J9235M9833o1287J1624m37j7886Q61J9765
$$ 175 -49636 -63928 -86080 -84031 -44257 -25022 24811 -36476 -24852 -25289 -43175 -42314 -22549
11257b2549M075l4227m861j1319r200O342r02l3815J0048L664l805M1793J3834
$$ -22549 -18474 -52701 -57562 -68881 -78081 -71739 -72641 -106456 -96408 -92744 -96549 -54756 -40922
11244d0922K2619J3182j7620r281M5566L1783Q218j525l2286m1029l659O4643
$$ -40922 -18303 -5121 -22741 -32022 13544 45327 53545 52020 19734 -21295 -24954 39689
11232C9689L0378k2022m2220m3605j4958J2869P850P363k2153l816P7170J5546
$$ 39689 70067 48045 5825 -37780 -52738 -39869 -32019 -24656 -46809 -50625 26545 42091
11220D2091n3052J8363J8262j6382l8662N5670j673l5731J9099J4608k0502K1086
$$ 42091 -10961 7402 25664 9282 -29380 26290 24617 -11114 7985 22593 2091 23177
11208B3177m7855l9041L6236m229J9763L296K8762K1542M2418j3366l2978j7642
$$ 23177 -24678 -63719 -27483 -31712 -11949 -8653 20109 41651 84069 70703 37725 20083
11196B0083k1019k1224n9601L084L5965q185n615K3880K6297M910j6492j7276
$$ 20083 -936 -22160 -81761 -78677 -42712 -50897 -56512 -32632 -6335 -1425 -17917 -35193
11184c5193k320L2128j4298Q79k422L965j7680N0535l742o2853r308K4493K2598
$$ -35193 -37513 -5385 -19683 -18804 -21226 -17261 -34941 15594 11852 -51001 -60309 -35816 -13218
11171a3218K5127N1633j8881n9541j5745q886K0623M8485M1367L1968n5641o2048
$$ -13218 11909 63542 44661 -14880 -30625 -39511 -18888 29597 70964 102932 47291 -14757
11159a4757o0472l1164o50L7487L3321J4461Q012K506J3217N712j5257m0517j1584
$$ -14757 -75229 -106393 -107043 -69556 -36235 -21774 -13762 -11256 1961 7673 -7584 -48101 -59685
11146e9685J4345K9368K4164J9041N125J080Q100n0186k7419L924N6571K08J5006
$$ -59685 -45340 -15972 8192 27233 32358 33438 41538 -8648 -36067 -32143 24428 24636 39642
11133C9642J3975k1930o4982N7186N0361m8316l9737p116N103J9737k5643j2831
$$ 39642 53617 31687 -33295 23891 74252 25936 -13801 -20917 -15814 3923 -21720 -34551
11121c4551k8687P781L4288K7459l3185j4842M6893J901q562J8622j7559m128
$$ -34551 -63238 -55457 -21169 6290 -26895 -41737 5156 7057 -1505 17117 -442 -4570
11109d570m0513j4860R80K9200K8031n6181l8151L7054J310k1357J862K5358L8462
$$ -4570 -45083 -59943 -58963 -29763 -1732 -57913 -96064 -59010 -57700 -79057 -77195 -51837 -13375
11096a3375k7660K700M0899j2871l0418j8031m052J9457k0506m1225J5788L5577
$$ -13375 -41035 -38335 2564 -10307 -40725 -58756 -62808 -43351 -63857 -105082 -89294 -53717
11084e3717L3917R450J1050K1389K8680m7889l5222P296L7980Q862j0466j8789
$$ -53717 -19800 -10350 700 22089 50769 2880 -32342 -25046 12934 21796 11330 -7459
11072g459K5367P158q576l3228j1297r991L6356l00p6064n5114M2503P6246L7370
$$ -7459 17908 25066 16490 -16738 -28035 -38026 -1670 -1970 -78034 -133148 -90645 -14399 22971
11059B2971J1601k4788o3010L8792L9884K2186k4319m883j4297Q316N270m4069
$$ 22971 34572 9784 -53226 -14434 25450 47636 23317 18434 4137 12453 17723 -26346
11047b6346n896p078K4108k791P064K3302K170J2506j4956P117K6666J5973N902
$$ -26346 -32242 -39320 -15212 -18003 -10939 12363 14533 27039 12083 19200 45866 61839 67741
11034F7741P1224q4686m6817L974K596k2426Q25L6080K4305J6113N943K3701K5296
$$ 67741 138965 54279 7462 11436 14032 -8394 -7569 28511 52816 68929 74872 98573 123869
11021A23869l6679n4141m9253M0722r711l6606k4323n696k1739L185L027P119
$$ 123869 87190 33049 -16204 24518 14807 -21799 -46122 -51818 -73557 -70372 -67345 -60226
11009f0226M0270L0723J0786j5389m8105k7467o676j758l993j2709L3151J0738
$$ -60226 -19956 10767 21553 6164 -41941 -69408 -76084 -77842 -81835 -94544 -61393 -50655
10997e0655L0715L2906k9109m5866O486J5318l5413K5075K0109j7501l1707K6897
$$ -50655 -19940 12966 -16143 -62009 -55523 -40205 -75618 -50543 -30434 -47935 -79642 -52745
10985e2745R972K8447L9969l001n4465m2532J2128L6040L2337J6362l3197l3402
$$ -52745 -42773 -14326 25643 22642 -31823 -74355 -62227 -26187 6150 22512 -10685 -44087
10973d4087j4831r782L615m8340j4478L4426O1933O4143j63Q256j4407o1842l8502
$$ -44087 -58918 -68700 -65085 -113425 -127903 -93477 -31544 32599 32436 40692 26285 -35557 -74059
10960g4059O60M5951P6078j4907q4733k284K6800L2858j7620k9542l6845n1737
$$ -74059 -73399 -27448 48630 33723 -51010 -53294 -26494 6364 -11256 -40798 -77643 -129380
10948a29380L1664P8670M0739K3538L8685r39Q145j8883j5325o170J9138l1427
$$ -129380 -97716 -19046 21693 45231 83916 82977 91122 72239 56914 50744 69882 38455
10936C8455k7659o9171L264Q27K4537k8624J965P2171J6673J605M3650k4309j1025
$$ 38455 10796 -58375 -55111 -54284 -29747 -58371 -56406 15765 32438 34043 77693 53384 42359
10923D2359m2970l8639K5394j5131j9952k954L4766P121l1224j2909L733N0581
$$ 42359 -611 -39250 -13856 -28987 -48939 -51893 -17127 -10006 -41230 -54139 -50406 175
10911A75r978j8085M293l388l023l810p144P501J3649K2595J1690j7043m7499
$$ 175 -9803 -27888 -23595 -26983 -30006 -33816 -40960 -33459 -19810 2785 14475 -2568 -50067
10898e0067j6851K7228j789J8181L3960M3969M2584l7354k6591o470j2930o7300
$$ -50067 -66918 -39690 -41479 -23298 10662 54631 97215 59861 33270 26800 13870 -53430
10886e3430l6987L2676l160j9251l0217K7744M032l6675j9167K0907N6379M6748
$$ -53430 -90417 -57741 -60901 -80152 -110369 -82625 -78593 -115268 -134435 -113528 -57149 -10401
10874a0401l631M0719R109m0479R400N5796o011l525l9467j3391N9269q856k9846
$$ -10401 -14032 26687 35796 -4683 4717 60513 54502 50977 11510 -1881 57388 48532 18686
10861A8686o5401n0468K6163M3577L8863K441M986k892j6579k6577k3083J3273
$$ 18686 -46715 -97183 -71020 -27443 11420 13861 18847 15955 -624 -27201 -50284 -37011
10849c7011q967j0723m41J5216J1130j3406L5699K7883j9674o1444n0957n735
$$ -37011 -45978 -56701 -57142 -41926 -30796 -44202 -8503 19380 -294 -61738 -112695 -118430
10837a18430M7980J6233M3458M2982J2962K2709q258j6339q3238n8134N402J4913
$$ -118430 -70450 -54217 -10759 32223 45185 67894 59636 43297 -39941 -98075 -92673 -77760
10825g7760K801O2256O1665M23m8524j4031o330k753M411J1188m826l7223k4590
$$ -77760 -74959 -12703 48962 49385 861 -13170 -19500 -22253 -17842 -6654 -11480 -48703 -73293
10812g3293K3352L4732M5364L7467j619J9221l0407n9760k7908M1282N8639o7258
$$ -73293 -49941 -15209 30155 67622 66003 85224 54817 -4943 -32851 8431 67070 -188
10800a88l2082K0093K361P881J5983M38j8514K0894k7417k1504J6142K1238R8951
$$ -188 -32270 -12177 -9816 -1935 14048 14486 -4028 16866 -10551 -32055 -15913 5325 104276
10787A04276K054m3839r773O617j2453J7694k0864j9324k5908j9154R039N1249
$$ 104276 106330 62491 52718 59335 46882 64576 43712 24388 -1520 -20674 -11635 39614
10775C9614n740P2032l7699r7362L5550L1624L3311p998P49j3531m3268p9107
$$ 39614 33874 105906 68207 -29155 6395 38019 71330 63332 64081 50550 7282 -71825
10763g1825K2432J2604k2761j1409O9149L2367J3907J4076N152M2680L1473j2441
$$ -71825 -49393 -36789 -59550 -70959 -1810 30557 44464 58540 63692 106372 137845 125404
10751A25404m0929K232j1874l9281j1323L6148l7556o9724K5570P234j801j5318
$$ 125404 84475 86707 74833 35552 24229 60377 22821 -46903 -21333 -14099 -15900 -31218
10739c1218J1195M3807M7463L9498o8086q5928J4111m4808p737P038O9420L6950
$$ -31218 -20023 23784 71247 110745 42659 -43269 -29158 -73966 -81703 -74665 -5245 31705
10727C1705K1467R952J792j4218O1641J7803o2941k3451K1595o940k8705n5766
$$ 31705 53172 63124 64916 50698 112339 130142 67201 43750 65345 58405 29700 -26066
10715b6066n7674l3392J6148P2907L1202J6641n5754l8951M0206L5492Q704J782
$$ -26066 -83740 -117132 -100984 -28077 3125 19766 -35988 -74939 -34733 759 9463 11245
10703A1245K3828j8799k9132M424k1768M516J7355O375O2617K7578k4383n5430
$$ 11245 35073 16274 -12858 -8434 -30202 -25686 -8331 -1956 60661 88239 63856 8426
10691H426k3913P5556J1307j9165q0515k3781j0597Q89P9749r244m8955j8575
$$ 8426 -15487 60069 71376 52211 -28304 -52085 -62682 -61793 17956 8712 -40243 -58818
10679e8818m562P3370O0830k1550o5205k7230o987k3007K2101L2294L1985N73
$$ -58818 -63380 9990 70820 49270 -15935 -43165 -50152 -73159 -51058 -18764 13221 13794
10667A3794K5979l1051j9168Q579J6240P627K3034n5785j3294K4259J5808j3952
$$ 13794 39773 8722 -10446 -1867 14373 22000 45034 -10751 -24045 214 16022 2070
10655B070l8114j2726k061M4160k0642M0793N5584M0494J5608k1639m0420J3890
$$ 2070 -36044 -48770 -50831 -6671 -27313 13480 69064 109558 125166 103527 63107 76997
10643G6997J4688L240j5748j7414M0374J6455j0847j2673k223j0577K4137l2393
$$ 76997 91685 94925 79177 61763 102137 118592 107745 95072 92849 82272 106409 74016
10631G4016r422j2956k0070n153j5670q35K1502o2849p14L2976M1338l0751m3623
$$ 74016 64594 51638 31568 26415 10745 9910 31412 -31437 -32151 825 42163 11412 -32211
10618c2211J3906K8044K6125m8319R893K5825k1276j8868K137M4107k5541k3655
$$ -32211 -18305 9739 35864 -12455 -2562 23263 1987 -16881 -14744 29363 3822 -19833
10606a9833M9179j0115j3922L1881o111k8489N133j7225j0288L248q410N722J8326
$$ -19833 29346 19231 5309 37190 31079 2590 7723 -9502 -19790 -16542 -24952 -19230 -904
10593i04m345j874n549R57k0057J1221L7782j3692Q006Q349m5791P692J3926K3813
$$ -904 -5249 -7123 -12672 -11715 -31772 -20551 17231 3539 11545 19894 -25897 -18205 -4279 19534
10579A9534l5976m0960R020J7386j7007K8384L0853P173k1697j9261J8870O490
$$ 19534 -16442 -57402 -48382 -30996 -48003 -19619 11234 18407 -3290 -22551 -3681 2809
10567B809l3012j5687n935J0403K4297N3753l3705r314k0435K5599M944l6413
$$ 2809 -30203 -45890 -51825 -41422 -17125 36628 2923 -6391 -26826 -1227 3717 -32696
10555c2696k7591j294P052O887k5955j2085k7688K8688K2067M8520K9989j5465
$$ -32696 -60287 -61581 -54529 -47642 -73597 -85682 -113370 -84682 -62615 -14095 15894 429
10543D29k3991J9535k5988J1432p228P089P1705P596m7893K6789J4716L709J1029
$$ 429 -23562 -4027 -30015 -18583 -25811 -18722 52983 60579 12686 39475 54191 57900 68929
10530F8929q4212p6425J27J8435j9802K2947K8199r510m498J7092M8154K6028
$$ 68929 -15283 -91708 -91581 -73146 -92948 -70001 -41802 -51312 -55810 -38718 9436 35464
10518C5464l9504m1834k4893J2682J741l813J2427L3619N2149l3147q1412r517
$$ 35464 -4040 -45874 -70767 -58085 -56344 -60157 -47730 -14111 38038 4891 -76521 -86038
10506h6038O406K1428J2714L1472J325k126l4939k6206l300J6074M6390K8406
$$ -86038 -79632 -58204 -45490 -14018 -12693 -14819 -49758 -75964 -79264 -63190 -16800 11606
10494A1606k3861j8984J3537k2243k4670J2869k4312m7622k7306M1249K8723k0415
$$ 11606 -12255 -31239 -17702 -39945 -64615 -51746 -76058 -123680 -150986 -109737 -81014 -101429
10482a01429J7213J6159J3390j0409O28L3818N5401l349l3863m917j1533K7206
$$ -101429 -84216 -68057 -54667 -65076 -64448 -30630 24771 21422 -12441 -17358 -28891 -1685
10470a685J4978l5061j7144O0131L346J3425O1883M1526o0279j9773k1620l1060
$$ -1685 13293 -21768 -38912 21219 24565 37990 99873 141399 81120 61347 39727 8667
10458H667j4118L3924J8097m790K3149M3407L828M466o0877p6812m2789k8259
$$ 8667 -5451 28473 46570 41780 64929 108336 112164 116630 55753 -21059 -63848 -92107
10446i2107m0334J3923J9585L6374K1987J4997J0953O3827j5862j7854M277j2332
$$ -92107 -132441 -118518 -98933 -62559 -40572 -25575 -14622 49205 33343 15489 19766 7434
10434G434j6547k9474j6464J1895N2831k3730k7699Q118m2923k2619K5301P2218
$$ 7434 -9113 -38587 -55051 -43156 9675 -14055 -41754 -33636 -76559 -99178 -73877 -1659
10422a659O4759l5728m2673l387J9503O230m1736O5968N3132j9754m1300k2684
$$ -1659 63100 27372 -15301 -18688 815 7045 -34691 31277 84409 64655 23355 671
10410F71l0953Q246J3907j804J0936j5384j7801j7781L2363j2360k4480j5023
$$ 671 -30282 -22036 -8129 -9933 1003 -14381 -32182 -49963 -17600 -29960 -54440 -69463
10398f9463n3681L9464M9686j787k8471R741n194j4299R3055L3720j2358m108
$$ -69463 -123144 -83680 -33994 -35781 -64252 -54511 -59705 -74004 19051 52771 40413 36305
10386C6305N203K7055j2900k4813l7712Q364L758R713J1697j0905j9197J2496
$$ 36305 41508 68563 55663 30850 -6862 1502 5260 14973 26670 15765 -3432 9064
10374I064m6766l5962j2936R406J1900J2692L8633O6161j4210o8N860l1278q630
$$ 9064 -37702 -73664 -86600 -77194 -65294 -52602 -13969 52192 37982 37914 43774 12496 3866
10361C866J2223j8358k3717N583N618J8213J4436J0071l9843k100M2692l118k7839
$$ 3866 16089 -2269 -25986 -20403 -14785 3428 17864 27935 -11908 -14008 28684 25566 -2273
10348b273j8799J3377k5265l0687R265M3239K6431j0032L4375N8582K4889Q393
$$ -2273 -21072 -7695 -32960 -63647 -54382 -11143 15288 5256 39631 98213 123102 131495
10336A31495N7465O2286K2955J3561N8923N0988J7896k8743p5978q4507n1081
$$ 131495 188960 251246 274201 287762 346685 397673 415569 386826 310848 226341 175260
10325A75260r5168r258M7125J5207P850j0147l6720n9071l2705J1962K1978K7069
$$ 175260 80092 70834 117959 133166 141016 130869 94149 35078 2373 14335 36313 63382
10313F3382J0155L0890l5465p3298o9348M332O7123M3120m6393k6895K6469m6214
$$ 63382 73537 104427 68962 -4336 -73684 -69352 -2229 40891 -5502 -32397 -5928 -52142
10301e2142n7117O0629M6158K6559K9890L2179k9593p0958J6722L9849l8888l7530
$$ -52142 -109259 -48630 -2472 24087 53977 86156 56563 -14395 2327 42176 3288 -34242
10289c4242M2585M9313K5437j2572p926J0437l5784m7613j2925J4058L0551N3817
$$ -34242 8343 57656 83093 70521 62595 73032 37248 -10365 -23290 -9232 21319 75136
10277G5136L3709j4718n5225o7416p558l3859K2630K7519n2641j2630l248L7942
$$ 75136 108845 94127 38902 -28514 -36072 -69931 -47301 -19782 -72423 -85053 -88301 -50359
10265e0359K2727m1741k7200K9768J5524k2732o806L6601P6249K6101k4887j0772
$$ -50359 -27632 -69373 -96573 -66805 -51281 -74013 -80819 -44218 32031 58132 33245 22473
10253B2473k8034L4351O2356k639n5125j4953K1210j530m931l3965j6665K3176
$$ 22473 -5561 28790 91146 88507 33382 18429 39639 38109 33178 -787 -17452 5724
10241E724l7706n5780j4340O0416L1240N0338K0158J5765p5337k2258L0615J2766
$$ 5724 -31982 -87762 -102102 -41686 -10446 39892 60050 75815 478 -21780 8835 21601
10229B1601J7524K5198m326k0745l6237L6692O1641L2458p5947m7586J9547K0384
$$ 21601 39125 64323 59997 39252 3015 39707 101348 133806 57859 10273 29820 50204
10217E0204k5412P808j4022q06L2700N1534j9260k5658n9162k554J2469K3253
$$ 50204 24792 32600 18578 17772 50472 102006 82746 57088 -2074 -4628 7841 31094
10205C1094L993p7122m965L1797L1934n567j3190L309n1666l150J7867n078J0298
$$ 31094 35087 -42035 -47000 -15203 16731 11164 -2026 1283 -50383 -53533 -35666 -40744 -30446
10192c0446K1957K0725Q406R075k4119j0664M1170L4072L4756p873r175k9994
$$ -30446 -8489 12236 20642 29717 5598 -5066 36104 70176 104932 97059 87884 57890
10180E7890k5208j1089l5650o197K5538J6171r514m3264L0991L3668n3890o415
$$ 57890 32682 21593 -14057 -20254 5284 21455 11941 -31323 -332 33336 -20554 -26969
10168b6969o459K9723M5879k5728q1586p565L556M0045j4421n068M8508L8849
$$ -26969 -33428 -3705 42174 16446 -65140 -72705 -69149 -29104 -43525 -48593 -85 38764
10156C8764J0906p310l2139j2810p394K4070k731j2993P545N2368J150m3550l8779
$$ 38764 49670 42360 10221 -2589 -9983 14087 11356 -1637 5908 58276 59426 15876 -22903
10143b2903o391o288N7694K3060k2044j8454J8884j6162J8386l06k9441k1714
$$ -22903 -29294 -35582 22112 45172 23128 4674 23558 7396 25782 25476 -3965 -25679
10131b5679K0337l23r0403R13K4370k1647K4839L9132M0704j0265r673K1500J8506
$$ -25679 -5342 -5665 -96068 -95155 -70785 -92432 -67593 -28461 12243 1978 -7695 13805 32311
10118C2311L3078L197l2827K9393J3709o7351o7427J4073M7414K666j4296L8536
$$ 32311 65389 68586 35759 65152 78861 11510 -55917 -41844 5570 8236 -6060 32476
10106C2476M9110M4746k6441k1861n7134j4649N867K6943j637j6904k7923L4941
$$ 32476 81586 126332 99891 78030 20896 6247 12114 39057 37420 20516 -7407 27534
10094B7534L0159l4973n060r05k8758K0789K3745j3290J9597J5960o4756k0752
$$ 27534 57693 22720 17660 16755 -12003 8786 32531 19241 38838 54798 -9958 -30710
10082c0710J2794n2619j3487J7702j6080J8952O004J5718R391J5550M1823o342
$$ -30710 -17916 -70535 -84022 -66320 -82400 -63448 -57444 -41726 -32335 -16785 25038 18696
10070A8696O512j1662p4995L4413J7395j4939k5094P531M3871m142k8535L8772
$$ 18696 25208 13546 -61449 -27036 -9641 -24580 -49674 -42143 1728 -2414 -30949 7823
10058G823K7642o589J8672j0844j7713P818N3993L329r087k7431L68O322K8032
$$ 7823 35465 28876 47548 36704 18991 26809 80802 84131 75044 47613 47981 54303 82335
10045H2335M6342N380j9587M1567l2231J6540l4131q093k9082j8345O529j5304
$$ 82335 128677 134057 114470 156037 123806 140346 106215 98122 69040 50695 57224 41920
10033D1920k1433q677K5110j9969l22m683j6353J4733l5032j7897l230k40L2132
$$ 41920 20487 11810 36920 16951 16629 11946 -4407 10326 -24706 -42603 -45833 -46073 -13941
10020a3941k7856j2104L3855L3418L7233j7802k3095k5791N2906J3959k9300o935
$$ -13941 -41797 -53901 -20046 13372 50605 32803 9708 -16083 36823 50782 21482 14547
10008A4547J9387J1956m4688l9225J3382r160J823K3193O711p552L5830J5781
$$ 14547 33934 45890 1202 -38023 -24641 -33801 -31978 -8785 -2074 -9626 26204 41985
9996D1985l3087O0692k1853m1846k0445M0221M5395n8679J132j8784j0952k5363
$$ 41985 8898 69590 47737 5891 -14554 25667 71062 12383 13515 -5269 -16221 -41584
9984d1584K4179J6152k9601k7794N1465Q124J0001k4005j5639j3035J570l9285
$$ -41584 -17405 -1253 -30854 -58648 -7183 941 10942 -13063 -28702 -41737 -40167 -79452
9972g9452k8904L9683L6011Q0828K5571k8843j6477m5999j5353J8375N4127J5056
$$ -79452 -108356 -68673 -32662 48166 73737 44894 28417 -17582 -32935 -14560 39567 54623
9960E4623K8866P279K747K0159j3613k2165o0214J9675J9849m0767N590j5883
$$ 54623 83489 90768 93515 113674 100061 77896 17682 37357 57206 16439 22029 6146
9948F146n453m492K5193k1475l8438R590L5614M1685j1226m3466K299N2313K4364
$$ 6146 693 -3799 21394 -81 -38519 -28929 6685 48370 37144 -6322 -4023 48290 72654
9935G2654J5126N858j0168m807q2754m6347J8667L1032J3755K2916J7177j4674
$$ 72654 87780 93638 83470 78663 -4091 -50438 -31771 -739 13016 35932 53109 38435
9923C8435m2018l8580K0311L7366j3489p703j1744M620o757J273j3475J3894k924
$$ 38435 -3583 -42163 -21852 15514 2025 -5678 -17422 -12802 -19559 -18286 -31761 -17867 -20791
9910b0791L1100l2098n140J7585j8550O4158K3768l0726k7491N0079j608l4827
$$ -20791 10309 -21789 -26929 -9344 -27894 36264 60032 29306 1815 51894 50286 15459
9898A5459q162n380K6754k651L5465K0172o9968o1238l1072j4510N4524N3139
$$ 15459 7297 1917 28671 26020 61485 81657 11689 -49549 -80621 -95131 -40607 12532
9886A2532J961P435j0686O221k1507N641j0966k9214J404R838n782k4852l962
$$ 12532 14493 21928 11242 17463 -4044 1597 -9369 -38583 -37179 -27341 -33123 -57975 -61937
9873f1937L4640L1052J53O395O9508j3845k3323N780J8351j832n4682n0956l4974
$$ -61937 -27297 3755 3908 10303 79811 65966 42643 48423 66774 64942 10260 -40696 -75670
9860g5670N1021L0887L9025k8770q3367k1150J9873K7090N1237q6258R210M1111
$$ -75670 -24649 6238 45263 16493 -66874 -88024 -68151 -41061 10176 -76082 -66872 -25761
9848b5761K1957K2588L2529j8595l3145O3763K8683l5318k8509j4691Q236K6876
$$ -25761 -3804 18784 51313 32718 -427 63336 92019 56701 28192 13501 21737 48613
9836D8613Q978M7072q385j9505M1213L3696r092m395N6046M4900o689l6885o8309
$$ 48613 57591 104663 96278 76773 117986 151682 142590 138195 194241 239141 232452 195567 127258
9823A27258k549l9023k9474K5808L0194q366Q044k3322K7152N4273k4657l2602
$$ 127258 124709 85686 56212 82020 112214 103848 111892 88570 115722 169995 145338 112736
9811A12736l2535m1486k2263J3530j7957k889o564N0312P199m9335p245O3280
$$ 112736 80201 38715 16452 29982 12025 9136 2572 52884 60083 10748 3503 66783
9799F6783j6964k3499N226J8937n318L793k4402J2369J7762L4172p19m7484q800
$$ 66783 49819 26320 31546 50483 45165 48958 24556 36925 54687 88859 88140 40656 31856
9786C1856K4526l5128j368Q985J1165R973M189k5118j2914K5239q124k0984j7111
$$ 31856 56382 21254 19886 28871 40036 50009 54198 29080 16166 41405 33281 12297 -4814
9773d814o380N3009K3111m9235m5328K7564j457Q566k634R154L6422K0641m7153
$$ -4814 -11194 41815 64926 15691 -29637 -2073 -3530 5036 2402 11556 47978 68619 21466
9760B1466K3968o359m5547o219M3020M9067Q568j0533m713N552n8268m899L2197
$$ 21466 45434 39075 -6472 -12691 30329 79396 87964 77431 72718 78270 20002 15103 47300
9747D7300j8748m5277m9441J9497L4352Q203M3497K0261M0248R064j6366k9492
$$ 47300 28552 -16725 -66166 -46669 -12317 -4114 39383 59644 99892 108956 92590 63098
9735F3098k648j6084k1788J6447M5325J4237L189l5650n8459l6793O6918K7044
$$ 63098 60450 44366 22578 39025 84350 98587 101776 66126 7667 -29126 37792 64836
9723F4836l4327m28j5930k9332R053O3975P651n9490l4886O760M9291K9222j7536
$$ 64836 30509 30081 14151 -15181 -6128 57847 65498 6008 -28878 -22118 27173 56395 38859
9710C8859l6240L049L5373N2311N572K4681N4627n1948o4003k9934j0264J6477
$$ 38859 2619 5668 41041 93352 98924 123605 178232 126284 62281 32347 22083 38560
9698C8560j2922j2311n976j157L6902J7403J1189P763n7175l047L939L6964K955
$$ 38560 25638 13327 7351 6194 43096 60499 71688 79451 22276 19229 23168 60132 63087
9685F3087K7263J4311l5210l7206N6428l26l2316k6339k2338J9136K9742k529
$$ 63087 90350 104661 69451 32245 88673 88347 56031 29692 7354 26490 56232 53703
9673E3703j3059q9q405l2836R239q407K1525n166J8236J8160J4152j3710l9371
$$ 53703 40644 40555 32150 -686 8553 146 21671 16505 34741 52901 67053 53343 13972
9660A3972K5091k6541k9246L6059K7396O79k0361n7517K0328P3412Q5459n533
$$ 13972 39063 12522 -16724 19335 46731 47410 27049 -30468 -10140 63272 148731 143198
9648A43198n3902p309K6079r542m5488L5249J8440k8136j0914O279L2899J545
$$ 143198 89296 81987 108066 98524 53036 88285 106725 78589 67675 73954 106853 108398
9636A08398n9701k8098N7017M1121Q225q6889m5998N6298L581M399J6109O3089
$$ 108398 48697 20599 77616 118737 126962 40073 -5925 50373 53954 58353 74462 137551
9624A37551N0962n4411j02128m6895L7092J3370n3474N4935L0835K3083k8100
$$ 137551 188513 134102 31974 -14921 22171 35541 -17933 37002 67837 90920 62820
9613F2820P739K6177K835Q9974P935m5257o3190l2844L236L264k952j9320P1200
$$ 62820 70559 96736 99571 189545 197480 152223 89033 56189 59425 62689 59737 40417 111617
9600A11617M8950J4547j9564j8749n2927o4628l3434N6717M8658K6245j5649q361
$$ 111617 160567 175114 155550 136801 83874 19246 -14188 42529 91187 117432 101783 93422
9588I3422P827k4K9743L5859j211k6579l8141j8119J4140J9083K0858m2781k0910
$$ 93422 101249 101225 130968 166827 165616 139037 100896 82777 96917 116000 136858 94077 73167
9575G3167K016J1823K8369P0455Q190M4368l5982o2303j4916L5081k8480M206
$$ 73167 75183 87006 115375 185830 194020 238388 202406 140103 125187 160268 131788 135994
9563A35994L833P574O065j6681K3319J0624O858J0838j1882J8686L8096J1647
$$ 135994 139827 147401 153466 136785 160104 170728 177586 188424 176542 195228 233324 244971
9551B44971j3078N454k6166o105J0777L7273j1849o5480k4929M4924k728K3541
$$ 244971 231893 237347 211181 205076 215853 253126 241277 175797 150868 195792 193064 216605
9539B16605K0334k7067l756p082K9168J7132j0636n2378j6363K0026N0549N4220
$$ 216605 236939 209872 206116 199034 228202 245334 234698 182320 165957 185983 236532 290752
9527B90752J822m9868K6329L9129K1968j5648M2817J5230L000m4121n1028Q157
$$ 290752 292574 242706 269035 308164 330132 314484 357301 372531 375531 331410 280382 288539
9515B88539q93m1613j8914M3134N164k4245j0504L1493M6029k0715j8265J0190
$$ 288539 287646 246033 227119 270253 275417 251172 240668 272161 318190 297475 279210 289400
9503B89400M8663L9092m484L2577J9671l6261k3247K4866K5771r774N371K8184
$$ 289400 338063 377155 372671 405248 424919 388658 365411 390277 416048 406274 411645 439829
9491D39829M8324J9943J9814k3358l3649J5904j8283O111J0694K6176O2177L9038
$$ 439829 488153 508096 527910 504552 470903 486807 468524 474635 485329 511505 573682 612720
9479F12720L5037N1700Q218k6281J1575J2996J7272O8588j8038J7917K9730J245
$$ 612720 647757 699457 707675 681394 692969 705965 723237 791825 773787 791704 821434 822679
9467H22679P0361O4853k1335q38j6255O5738P7783J7194K8945P1600J433M6935
$$ 822679 893040 957893 936558 935720 919465 985203 1062986 1080180 1109125 1180725 1182158 1229093
9455A229093R9212K9430j54P4694O3329Q1848N1785K8980N9577R5450Q6686Q2771
$$ 1229093 1328305 1357735 1357581 1432275 1495604 1577452 1629237 1658217 1717794 1813244 1899930 1982701
9443A982701J23036M8510L9696J04711Q0792J12233J13457J78634J78129J64917
$$ 1982701 2105737 2154247 2193943 2298654 2379446 2491679 2605136 2783770 2961899 3126816
9433C126816J63446R4720J39696J57911J92471K35251K56269K42422J93225K34642
$$ 3126816 3290262 3384982 3524678 3682589 3875060 4110311 4366580 4609002 4802227 5036869
9423E036869K58630L00988K45386K24761J94419J90648K37167K38448K36236J53750
$$ 5036869 5295499 5596487 5841873 6066634 6261053 6451701 6688868 6927316 7163552 7317302
9413G317302J86034J68213Q0925J23579R7963k5623m3469l4889l9008j25831j87821
$$ 7317302 7503336 7671549 7752474 7876053 7974016 7948393 7904924 7870035 7831027 7705196 7517375
9402G517375j24532j51459j70066j82581k25969j73034j88866k04295j29772j88588
$$ 7517375 7392843 7241384 7071318 6888737 6662768 6489734 6300868 6096573 5966801 5778213
9392E778213j91165k04155k41032j56572j73553j93168j40316j42783j38001j34273
$$ 5778213 5587048 5382893 5141861 4985289 4811736 4618568 4478252 4335469 4197468 4063195
9382D063195j56504j25937j20591j61748j41274q1881j22513m6848m8656q2789
$$ 4063195 3906691 3780754 3660163 3498415 3357141 3275260 3152747 3105899 3057243 2974454
9372B974454j02832j18425q8351r1552j15452r8211q7065q2023m8476m9749J9113
$$ 2974454 2871622 2753197 2664846 2573294 2457842 2359631 2272566 2190543 2142067 2092318 2111431
9361B111431K6997l0383j05642j06978m1699k4114n4069j24083n4977K3300k5888
$$ 2111431 2138428 2108045 2002403 1895425 1853726 1829612 1775543 1651460 1596483 1619783 1593895
9350A593895o8535k6287m8307L832N877j2474p4061o4132L054k3600l8222J946
$$ 1593895 1525360 1499073 1450766 1454598 1460475 1448001 1373940 1309808 1312862 1289262 1251040 1252986
9338A252986m8823p3532K1650L8266m0080m4609n8834p6342J1728K4144j4489
$$ 1252986 1204163 1130631 1152281 1190547 1150467 1105858 1047024 970682 982410 1006554 992065
9327I92065q5921m3882j4773Q963o5989m9794O048M8897k1077q944P607K0763
$$ 992065 906144 862262 847489 856452 790463 740669 746717 795614 774537 765593 773200 793963
9315G93963j1727p2334n414r113o9985l1164L950L950k9483k5514k4854q278K7931
$$ 793963 782236 709902 704488 695375 625390 594226 598176 602126 572643 547129 522275 513997 541928
9302E41928j4017p797P318l940K6170n702J4495J6895k9666o0549Q965K7620k3186
$$ 541928 527911 520114 527432 523492 549662 543960 558455 575350 545684 485135 494100 521720 498534
9289D98534n9501o2088j0020K5951J7405l705K9125N465J5853J1652j3358J9238
$$ 498534 439033 376945 366925 392876 410281 406576 435701 441166 457019 468671 455313 474551
9277D74551J6556M210n287j6036j6899o4236l7281p990N783M1401J731N46N1993
$$ 474551 491107 495317 490030 473994 457095 392859 355578 347588 353371 394772 396503 397049 449042
9264D49042L0477k5585k7756M7556K623n9660k8538J2832K3913l2852k3102k5811
$$ 449042 479519 453934 426178 473734 476357 416697 388159 400991 424904 392052 368950 343139
9252C43139l0159R551L6525J858l5404m2176L2202M4923l939N085l8942k9808
$$ 343139 312980 322531 359056 360914 325510 283334 315536 360459 356520 361605 322663 292855
9240B92855p12j00082m8584J2984O1165j5646O4108L7331l2828l3954J5888k755
$$ 292855 292143 192061 143477 156461 217626 201980 266088 303419 270591 236637 252525 249770
9228B49770j4994k8862Q01k326j0506O4774N1654l7574k2839N236J5168k3961
$$ 249770 234776 205914 206715 204389 193883 258657 310311 272737 249898 255134 270302 246341
9216B46341m1272l6608k5666O8721O773m2351j3623Q0870L6289l5869k092j8815
$$ 246341 205069 168461 142795 211516 218289 175938 162315 243185 279474 243605 241513 222698
9204B22698j06159n8555M0534K2487R541L6557J9137j2801k895j4424j1474j619
$$ 222698 116539 57984 98518 121005 130546 167103 186240 173439 170544 156120 144646 143027
9192A43027L5184J5244K9062L1860l5758O24j3140K75Q457j2412K538k3786r865
$$ 143027 178211 193455 222517 254377 218619 219243 206103 206378 214835 202423 204961 181175 171310
9179A71310J1421J0176j6771m6342j6927L985J4574L2144o60l187R76O409J2555
$$ 171310 182731 192907 176136 129794 112867 116852 131426 163570 162910 159723 160699 167108 179663
9166A79663M034q969l1266o7886j9437O4371Q0817j2106m5150l5015m463j063
$$ 179663 183697 174728 143462 75576 56139 120510 201327 189221 144071 109056 104593 103530
9154A03530J8726m557N844M1303n063k8046l5965j1839J5164n199M9504L55m097
$$ 103530 122256 117699 123543 164846 159783 131737 95772 83933 99097 93898 143402 143757 139660
9141A39660L5612q146n1296P930j8921j1715q109j5678J0740k6204J6542P7763
$$ 139660 175272 167126 115830 123760 104839 93124 85015 69337 80077 53873 70415 148178
9129A48178J6476k2251J285L9521j6866l3911l5295m5355m3991J6741M2002O576
$$ 148178 164654 142403 143688 183209 166343 132432 97137 51782 7791 24532 66534 73110
9117G3110Q830K9955M524k3117k6729O966k4695L729l3515o65j5694L1161Q3149
$$ 73110 81940 111895 116419 93302 66573 73539 48844 52573 19058 18393 2699 33860 117009
9104A17009K2353l7760n4719l340Q005j3936k5518K2341P292J5352M5570J3799
$$ 117009 139362 101602 46883 43543 51548 37612 12094 34435 41727 57079 102649 116448
9092A16448k9985Q121L440K3973p22j6595K083k1922l1699m9999j141K0023J5471
$$ 116448 86463 94584 98024 121997 121275 104680 106763 84841 53142 3143 2002 22025 37496
9079C7496j2633J3080M8455R043j6467M399m9110l6826N2988O409o07J8289J6951
$$ 37496 24863 37943 86398 95441 78974 83373 34263 -2563 50425 56834 56227 74516 91467
9066I1467P568j9128q1283L0856K6543j5182j0148K9501M211j929J4103n043R377
$$ 91467 99035 79907 -1376 29480 56023 40841 30693 60194 64405 62476 76579 71536 80913
9053H0913L608J2760j9570P262M3660N525l4728J732K3763k7972n911R575R204
$$ 80913 84521 97281 77711 84973 128633 134158 99430 101162 124925 96953 91042 100617 109821
9040A09821k448k3872K1603k887m4478k5934m5755K3192N9771L45J5488m789n6394
$$ 109821 107373 83501 105104 102217 57739 31805 -13950 9242 69013 69358 84846 80057 23663
9027B3663J2815K8824j9837j6197J2527J1136l3848l4118M4754L6008l2373l3094
$$ 23663 36478 65302 45465 29268 41795 52931 19083 -15035 29719 65727 33354 260
9015B60k471j1244M8732l177n2399l0410M6863J4280J9537o5394O790Q867J0956
$$ 260 -2211 -13455 35277 32100 -20299 -50709 -3846 10434 29971 -35423 -28633 -19766 -8810
9002h810P019j4298L8156M4645N1967J357j2852k175o7602k2231J3868P86K5207
$$ -8810 -1791 -16089 22067 66712 118679 120036 107184 105009 37407 15176 29044 29830 55037
8989E5037J1893J6735L8735p654j9594k3532l1486J4346M0044L096J2550m2668
$$ 55037 66930 83665 122400 114746 95152 71620 40134 54480 94524 97620 110170 67502
8977F7502l2970J6771L160L9554q503m037l1131l3153N3591q588N52J3778o8839
$$ 67502 34532 51303 54463 94017 85514 81477 50346 17193 70784 62196 62748 76526 7687
8964G687k9311L7411k512k6682j0773N3030L4062K7602J6639R897j1405k7486
$$ 7687 -21624 15787 13275 -13407 -24180 28850 62912 90514 107153 117050 105645 78159
8952G8159n981o1213l0452O2791l986m2105J5431M9297J4195M0004O3864m811
$$ 78159 72178 10965 -19487 43304 39318 -2787 12644 61941 76136 116140 180004 175193
8940A75193l3533n3282j535n13m9319k3248L7342J8611K3913m833P763J0877M842
$$ 175193 141660 88378 86843 86330 37011 13763 51105 69716 93629 88796 96559 107436 112278
8927A12278K268k6224l0317K9118n8892k8934L4054N608K9646K4904l2079m0861
$$ 112278 114546 88322 58005 87123 28231 -703 33351 38959 68605 93509 61430 20569
8915B0569J3668J9225o941J1705o27j5595j7040L3717L0564K4061n171l1088l20
$$ 20569 34237 53462 46521 58226 57599 42004 24964 58681 89245 113306 108135 77047 76727
8902G6727K2520k5475m7693j2585L2429L647j9676J256m1960R240l4165j0653
$$ 76727 99247 73772 26079 13494 45923 49570 29894 31150 -10810 -1570 -35735 -46388
8890d6388R6195k9699j0191P607P7767L0341k3315k7395j9000L3023j0128l277
$$ -46388 49807 20108 9917 17524 95291 125632 102317 74922 55922 88945 78817 75540
8878G5540j3648j8124J0492j7066l4010l502K0365q732L435L6556M752K2372J3798
$$ 75540 61892 43768 54260 37194 3184 -318 20047 11315 14750 51306 56058 78430 92228
8865I2228k4565m1901k3452o720K1666N2215N3801j7726k9711J0409N8310J4989
$$ 92228 67663 25762 2310 -4410 17256 69471 123272 105546 75835 86244 144554 159543
8853A59543J4645n2198o4701M384m829q313q91L6926K984l2909k7025M1368p562
$$ 159543 174188 121990 57289 61673 56844 48531 47640 84566 87550 54641 27616 68984 61422
8840F1422l1573k99j7074k1823j1149L0678M561M685j4798j3330J423O9295j7835
$$ 61422 29849 29550 12476 -9347 -20496 10182 14743 19428 4630 -8700 -7277 62018 44183
8827D4183k0403q611J5835L8588N0814j1833q604j566K0392o3895m2324o315J0385
$$ 44183 23780 15169 31004 69592 120406 108573 99969 98403 118795 54900 12576 6261 16646
8814A6646j4623R175q79L561J14339J8601k3697n6012j6773m8318n005N087M826
$$ 16646 2023 11198 10319 13880 128219 146820 123123 67111 50338 2020 -2985 2102 6928
8801F928J3880J048J71P071j0626k4196R063j4867M774R1096L2423l8486k450
$$ 6928 20808 21856 22027 29098 18472 -5724 3339 -11528 -6754 84342 116765 78279 75829
8788G5829j080j1292K2205M648j3289l735J6042k2892K7483M008m755j3198j2228
$$ 75829 74749 63457 85662 90310 77021 73286 89328 66436 93919 97927 93172 79974 67746
8775F7746O568K8269j4040l8210O768l694L51K2223K1062J6792l2551K5424J8826
$$ 67746 74314 102583 88543 50333 57101 53407 53758 75981 97043 113835 81284 106708 125534
8762A25534j3372L306j9671K6725P985j2774J4398k8824o807J9566K7611L3792
$$ 125534 112162 115468 95797 122522 130507 117733 132131 103307 96500 116066 143677 177469
8750A77469j8306m7568k3792K7432j9161j2460k9198m3426j491J7542K2816M7684
$$ 177469 159163 111595 87803 115235 96074 83614 54416 10990 9499 27041 49857 97541
8738I7541m922J7056L1183R02j7039j3956N979k7832K9071M3356M0066o0708L5697
$$ 97541 92619 109675 140858 141760 124721 110765 116744 88912 117983 161339 201405 140697 176394
8725A76394K0327j2138j6545j5237l4311j2563L4146M0651N5322N2535j7940j226
$$ 176394 196721 184583 168038 152801 118490 105927 140073 180724 236046 288581 270641 269415
8713B69415K7666m3162m500l2866n4157J189L962k7004j5399n494m5643P378N9793
$$ 269415 297081 253919 249419 216553 162396 163585 167547 140543 125144 119650 74007 81385 141178
8700A41178J9052L1815O9410O323n8150q5050L5939J8198K1493M9508k7858k1888
$$ 141178 160230 192045 261455 267778 209628 124578 160517 178715 200208 249716 221858 199970
8688A99970K9693j9524j8618l8348J0724j273K014K096o2103K7652O7432j6135
$$ 199970 229663 210139 191521 153173 163897 162624 164638 166734 104631 132283 199715 183580
8676A83580q271k3478q518J9046K3493m6534m6624j1235K5860J6377L3223l261
$$ 183580 175309 151831 143313 162359 185852 139318 92694 81459 107319 123696 156919 153658
8664A53658K4209K5756L3389M4164o0418k3294p677J9669M1085J6176m597k0263
$$ 153658 177867 203623 237012 281176 220758 197464 189787 209456 250541 266717 262120 241857
8652B41857J5649J2820J3211M4590J9656O3599j4438l4892K963K7617J3034k1109
$$ 241857 257506 270326 283537 328127 347783 411382 396944 362052 365015 392632 405666 384557
8640C84557k5788M3219O0357j1024O755P5729o871p4673J1198P49j7093k5101
$$ 384557 358769 401988 462345 451321 458076 533805 526934 452261 463459 464208 447115 422014
8628D22014M2998k4181o378J4131j6213M9758P485k5963j8539j5126N1815N478
$$ 422014 465012 440831 434453 448584 432371 482129 489614 463651 445112 429986 481801 487279
8616D87279M4049K5185Q224P0807J2525J6852r754O3061O2066K6621L322j373
$$ 487279 531328 556513 564737 635544 648069 664921 655167 718228 780294 806915 810237 808864
8604H08864M9074R7136J29629J36384J33152Q8993J11616J70751K09842K17037
$$ 808864 857938 955074 1084703 1221087 1354239 1443232 1554848 1725599 1935441 2152478
8594B152478K36620K51061K09656K10955J54384J01497L1730o6443j40626j61443
$$ 2152478 2389098 2640159 2849815 3060770 3215154 3316651 3348381 3281938 3141312 2979869
8584B979869k21979l11345l30250l12275k02976j42365j18131j28381j18113j02777
$$ 2979869 2757890 2446545 2116295 1804020 1601044 1458679 1340548 1212167 1094054 991277
8574I91277r1766m8689J4776l5951l7996l0005q216l767l6713l4565m3921l9600
$$ 991277 899511 850822 865598 829647 791651 761646 753430 749663 712950 678385 634464 594864
8562E94864j931L2797p685N3l7785m4755n327l038k8158k2509j6917k5816P20
$$ 594864 592933 625730 618045 618098 580313 535558 530231 527193 499035 476526 459609 433793 434513
8549D34513J8913J878L3942K1297j5974O33k0796j0119j6693m3292n6116l8457
$$ 434513 453426 455304 489246 510543 494569 495202 474406 464287 447594 404302 348186 309729
8537C09729M4606L6719L711q736M65L4741K1138r852l3338m9830l8995n741L735
$$ 309729 354335 391054 394765 386029 386494 421235 442373 432521 399183 349353 310358 304617 308352
8524C08352N231m8763K8565m3248k5540j1228n079J9566M8829J2646p2305J2446
$$ 308352 313583 264820 293385 250137 224597 213369 208290 227856 276685 289331 217026 229472
8512B29472N169k7191l2991k4098J6018j6218j1759K447j5998J8451L861l292
$$ 229472 234641 207450 174459 150361 166379 150161 138402 140849 124851 143302 147163 143871
8500A43871M1498L5585k4422q797R91Q537R593J3764j4362m2087P364K3898l685
$$ 143871 185369 220954 196532 187735 188726 197263 206856 220620 206258 164171 171535 195433 191748
8487A91748k4488K0778J3366K1487m7397p077L5199k0190m6709N6273L4899m1915
$$ 191748 167260 188038 201404 222891 175494 168417 203616 183426 136717 192990 227889 185974
8475A85974o895M3099J0830l5916L1880O1421o4224p1474j0480q861k5675l9424
$$ 185974 179079 222178 233008 197092 228972 290393 226169 154695 144215 135354 109679 70255
8463G0255J5127K5490j931M9164L4813l8493k8707J9794r758L3025K5069J5770
$$ 70255 85382 110872 108941 158105 192918 154425 125718 145512 135754 168779 193848 209618
8451B09618j3867j4228l672k3077o6656k7860K6542K6095K5191K8014M733k1460
$$ 209618 195751 181523 177851 154774 88118 60258 86800 112895 138086 166100 170833 149373
8439A49373M4719J4475p1197o7163N841K27m7592m1340M9606O9024k5166m4875
$$ 149373 194092 208567 137370 70207 76048 76275 28683 -12657 36949 105973 80807 35932
8427C5932m747M5469R650k0931L8913Q733K5742Q06P0280k9757m7760K7621k5639
$$ 35932 31185 76654 86304 65373 104286 113019 138761 139567 209847 180090 132330 159951 134312
8414A34312l6585m0073J0758J7144J3704k3678N0442J6064l706k2561m6968j869
$$ 134312 97727 57654 68412 85556 99260 75582 126024 142088 138382 115821 68853 66984
8402F6984K5333j0510j6297R765Q445j620K5477K7598n7933l0161L1180N2242
$$ 66984 92317 81807 65510 75275 83720 82100 107577 135175 77242 47081 78261 130503
8390A30503j6460K5072K9445m2252k423Q96L21J8697ll4814K6283k0434p153k2233
$$ 130503 114043 139115 168560 126308 123885 124781 125102 143799 143796 108982 135265 114831 107678 85445
8376H5445m4161k1785l6894K7457M2796L0384L6883k0696K8845j5914n7747j0724
$$ 85445 41284 19499 -17395 10062 52858 83242 120125 99429 128274 112360 54613 43889
8364D3889M6488K5913K1700j3452O605K5780k550j7448n1775j8114j5203M3784
$$ 43889 90377 116290 137990 124538 131143 156923 154373 136925 85150 67036 51833 95617
8352I5617l1871n0775j4834O270M3135M7022k2472q623k4147j6299N473J6892
$$ 95617 63746 12971 -1863 4407 47542 94564 72092 63469 39322 23023 28496 45388
8340D5388k5952k0760j845K2295l1199J8570Q810N0018O1243m3805l4357k009
$$ 45388 19436 -1324 -3169 19126 -12073 6497 15307 65325 126568 82763 48406 46397
8328D6397K8309j2131k6051O9806Q4474l794n7919j9894n325j7707K6221k5373
$$ 46397 74706 62575 36524 106330 190804 187010 129091 109197 103872 86165 112386 87013
8316H7013l6485J2065J8149j1351l460K1557j0759l4031K406j876j1046o2967
$$ 87013 50528 62593 80742 69391 65931 87488 76729 42698 45104 43228 32182 -30785
8304c0785J7656J5631j693O7778J8073j0183K3286J169N2576p8572r9147p330
$$ -30785 -13129 2502 809 68587 86660 76477 99763 100932 153508 74936 -24211 -31541
8292c1541K5409N1837J762j6443N1281L5087J3409L0709k8425p823k4610r243
$$ -31541 -6132 45705 47467 31024 82305 117392 130801 161510 133085 125262 100652 91409
8280I1409m1511J0418J4920m9903J1627j7156q969M013l5663M2384L6768L4795
$$ 91409 49898 60316 75236 25333 36960 19804 10835 14848 -20815 21569 58337 93132
8268I3132M3269K0894k0661j2722l6963j8921k2485M903m4508J6512O2384L219
$$ 93132 136401 157295 136634 123912 86949 68028 45543 50446 5938 22450 84834 88053
8256H8053O956R232r595m1428n1887n2237m509O277k469J5979O0230M1274r766
$$ 88053 95009 104241 94646 53218 1331 -50906 -55415 -49138 -51607 -35628 24602 65876 56110
8243E6110k5369l3419K3010r367P377N295m82n5760k366M2718K3414J1779J6629
$$ 56110 30741 -2678 20332 10965 18342 23637 23155 -32605 -34971 7747 31161 42940 59569
8230E9569J2012k7877k1436k3276K9711Q99j9046Q412M7772M6789m6900n1156
$$ 59569 71581 43704 22268 -1008 28703 29602 10556 18968 66740 113529 66629 15473
8218A5473l2791k8461L7984M4372P84m9568k8679L9096J4143M4093J3594J8153
$$ 15473 -17318 -45779 -7795 36577 37361 -12207 -40886 -1790 12353 56446 70040 88193
8206H8193m7646n8511K7681K1955K2821k6086L809K1645l9012j2673L1402l648
$$ 88193 40547 -17964 9717 31672 54493 28407 32216 53861 14849 2176 33578 29930
8194B9930J8654j505j9293O05K8756M3813o490K5810o088R691k7477m4040o002
$$ 29930 48584 47079 27786 28391 57147 100960 94470 120280 114192 123883 96406 52366 46364
8181D6364j7570J7372o601M352l7635k3183J0566j2481O284L5830J3226o854k0815
$$ 46364 28794 46166 39565 43917 6282 -16901 -6335 -18816 -12532 23298 36524 29670 8855
8168H855J2366K5479J9294j6089j3594l5050m565J3824N2817j8102l1643l6548
$$ 8855 21221 46700 65994 49905 36311 1261 -3304 10520 63337 45235 13592 -22956
8156b2956J6153K3926J7435m003j0296l3688K9344N1735k7363k6360l203j1368
$$ -22956 -6803 17123 34558 30555 20259 -13429 15915 67650 40287 13927 10724 -644
8144f44k4518J3445M6612l1411j895P0738L6325m495L8884k9608l9511m5512l2811
$$ -644 -25162 -11717 34895 3484 1589 72327 108652 104157 143041 113433 73922 28410 -4401
8131d401M5598L2352n6714k9944k3936K8069J18k912L0199L576K6525P3840P0893
$$ -4401 41197 73549 16835 -13109 -37045 -8976 -8858 -11770 18429 22005 48530 122370 193263
8118A93263m1720q3573l5375J9304L9590j0508k5007J2468K6730m2235L1339j6253
$$ 193263 151543 67970 32595 51899 91489 80981 55974 68442 95172 52937 84276 68023
8106F8023j0524L0981L5692l7432n7602l6483L200O443M8860J7348L1654k310
$$ 68023 57499 88480 124172 86740 29138 -7345 -4145 2298 51158 68506 100160 97850
8094I7850n6424k5446K9609M7012k4949j067P659k4430k8213l3368L670l0054
$$ 97850 41426 15980 45589 92601 67652 66585 74244 49814 21601 -11767 -8097 -38151
8082c8151k233L4594K4302K7129L1691K9497o352j9508J681J7250l862l1730j4000
$$ -38151 -40384 -5790 18512 45641 77332 106829 100477 80969 82650 99900 96038 64308 50308
8069E0308j1016J1396N3231R724l4310j5093l030k9516l2046J6046Q707p67J0742
$$ 50308 39292 50688 103919 113643 79333 64240 61210 31694 -352 15694 24401 23634 34376
8056C4376J2178J1385L766k5425j1948J8286J3418L3525K3048J0428j730j231
$$ 34376 46554 57939 61705 36280 24332 42618 56036 89561 112609 123037 121307 120076
8044A20076N381K5390Q576J3667J7873o206n442n932J5267J9502L422J5567K968
$$ 120076 125457 150847 159423 173090 190963 184757 179315 173383 188650 208152 211574 227141 230109
8031B30109J2410r680j3385n2396m5365J1808L7464L9002l4256m9810M3669N2297
$$ 230109 242519 232839 219454 167058 121693 133501 170965 209967 175711 125901 169570 221867
8019B21867k0350m9650k6M8983j4544j0648j053j7057O94K8922L1405K6020O3554
$$ 221867 201517 151867 151841 200824 186280 175632 174579 157522 158216 187138 218543 244563 308117
8006C08117M3849j4479N875m5204o4613L6551O5590O1055M7509j0496p0250q380
$$ 308117 351966 337487 343362 298158 233545 270096 335686 396741 444250 433754 363504 355124
7994C55124l6262n2130N966K5224N625j2816n791M4685k9978l938J517r638R25
$$ 355124 318862 266732 272698 297922 303547 290731 284940 329625 299647 295709 297226 287588 288513
7981B88513p281l1324l4996k0425K4578M3251j4683o6960M2666L116o662j5088
$$ 288513 281232 249908 214912 194487 219065 262316 247633 180673 223339 226455 219793 204705
7969B04705l117o031q141j9719N2565P6464M5970j3177j854J0061P5823R014j6718
$$ 204705 201588 195557 187416 167697 220262 296726 342696 329519 327665 337726 413549 422563 405845
7956D05845l337K537P801j6930j010l6451k3904J6185j5178l0452j3724m0130
$$ 405845 402508 405045 412846 395916 394906 358455 334551 350736 335558 305106 291382 251252
7944B51252K1499J7968R33K7704k0089N241k4831l1967Q75P940j3806m9485n4641
$$ 251252 272751 290719 291652 319356 299267 304508 279677 247710 248585 256525 242719 193234 138593
7931A38593J02521J383k7647k2536k0439J5030L6100J8287k2098J3596K7971J1891
$$ 138593 241114 242497 214850 192314 171875 186905 223005 241292 219194 232790 260761 272652
7919B72652j2157j2202L7939J5725q0606P557O833J7526j0045l6560J6169j4624
$$ 272652 260495 248293 286232 301957 221351 228908 235741 253267 243222 206662 222831 208207
7907B08207n261k7862q032J6021o3420J1112K4549m0800k1084M5291J1015J5772
$$ 208207 202946 175084 167052 183073 119653 130765 155314 114514 93430 138721 149736 165508
7895A65508k4279K4245n164n9726j0901R2545L9614m9018M192J533k5936L166
$$ 165508 141229 165474 160310 100584 89683 182228 221842 172824 177016 178549 152613 155779
7883A55779O770J7821p5807m4089j8539J0380K4668o610l8293K5175L1312P649
$$ 155779 162549 180370 104563 60474 41935 52315 76983 70373 32080 57255 88567 96216
7871I6216L5740J174n7610K988K7111l5812n9692K2405J04099L9135l6822n080
$$ 96216 131956 133130 75520 78508 105619 69807 10115 32520 136619 175754 138932 133852
7859A33852j6973l4893k3355J5108L4129J7662j0879j6702k2232L1295O033l1531
$$ 133852 116879 81986 58631 73739 107868 125530 114651 97949 75717 107012 113045 81514
7847H1514J4810m2637L9090K9444r577m98k0654j7788m2573k3767j0737O0224
$$ 81514 96324 53687 92777 122221 112644 112146 91492 73704 31131 7364 -3373 56851
7835E6851J2090K8180O3121l4547l4183l4074J8876l0147R135K7859L0306o067
$$ 56851 68941 97121 160242 125695 91512 57438 76314 46167 55302 83161 113467 107400
7823A07400l3196J2321J5101j0107j4833j3688j9956l3398m2895j930N7070J3078
$$ 107400 74204 86525 101626 91519 76686 62998 43042 9644 -33251 -35181 21889 34967
7811C4967k8982j3499N7269M625m4920J6768p294l7276J9251M3913N071j985p512
$$ 34967 5985 -7514 49755 54380 9460 26228 18934 -18342 909 44822 49893 47908 40396
7798D0396L0539j1197l9628N344K615k3262K5498J6796r303L7603K3626o3545
$$ 40396 70935 59738 20110 25454 28069 4807 30305 47101 37798 75401 99027 35482
7786C5482n0166k400M3864J8764k2934R452K1094j3379J0297j1318j7720k1198
$$ 35482 -14684 -17084 26780 45544 22610 32062 53156 39777 50074 38756 21036 -162
7774a62k5006q70l860j938j945K0527L047K3957k5879m2864J4704M2932K9189
$$ -162 -25168 -26038 -29898 -31836 -33781 -13254 -10207 13750 -12129 -54993 -40289 2643 31832
7761C1832P3366n538o6031l2055l5807j3J0148O0575l9188l6930K0242M8423L7750
$$ 31832 105198 99660 33629 1574 -34233 -34246 -24098 36477 -2711 -39641 -19399 29024 66774
7748F6774m389k72m0770j9329K5025j2654j2094n0462l921M9032M6585k055k9906
$$ 66774 62385 62113 21343 2014 27039 14385 2291 -48171 -52092 -3060 43525 41470 11564
7735A1564J2032m4135k3936M2596J9369k4177J5630n052P772K0482K8138q777
$$ 11564 23596 -20539 -44475 -1879 17490 -6687 8943 3891 11663 32145 60283 51506
7723E1506o1352K6354m6144J8891K5149k1874P342O667l1922K157K4130P565j4035
$$ 51506 -9846 16508 -29636 -10745 14404 -7470 -128 6539 -25383 -23226 904 8469 -5566
7710e566L1338O6704M41m0971m7863j2641k7427n600J0013p311l257J048N2922
$$ -5566 25772 92476 92917 51946 4083 -8558 -35985 -41585 -31572 -38883 -42140 -41092 11830
7697A1830K2528k9407J2140J3026O508k436J6750O788n6545j5839J7864j9419
$$ 11830 34358 4951 17091 30117 36625 34189 50939 57727 1182 -14657 3207 -16212
7685a6212P434K9162q91l334K6228j635j6034k1984L3647J29l4030L13L1713J2055
$$ -16212 -8778 20384 19493 16159 42387 40752 24718 2734 36381 36510 2480 2793 34506 46561
7671D6561n698J0282J8096J5729q9599p3701k6845J4157N142O2166L4121O1430
$$ 46561 40863 51145 69241 84970 -4629 -78330 -105175 -91018 -85876 -23710 10411 71841
7659G1841k0130p4082k9003m804p99J4287k6839j2842k02K0954M5628j4293k9286
$$ 71841 51711 -22371 -51374 -56178 -56977 -42690 -69529 -82371 -82573 -61619 -15991 -30284 -59570
7646e9570M0876N1072o243r769k5869Q413M0025K6747q945m2733J9291K0924l5215
$$ -59570 -18694 32378 26135 16366 -9503 -1090 38935 65682 56737 14004 33295 54219 19004
7633A9004k2794k9868N3414J1801o0881M2662k8947j4855O5050K7244k3657M2332
$$ 19004 -3790 -33658 19756 31557 -29324 13338 -15609 -30464 34586 61830 38173 80505
7621H0505J9351o9820k6425j9789j5914J6610J1895l8898j2674L4348M0939m2858
$$ 80505 99856 30036 3611 -16178 -32092 -15482 -3587 -42485 -55159 -20811 20128 -22730
$$ [...]
##END NTUPLES=NMR SPECTRUM
##END=
