##TITLE=Analysis number 322175
Compound Code cc 47702
Book Reference 494/52
Project Code adrs
Chemist Name craigr
##JCAMPDX= 6.0         $$ Bruker NMR JCAMP-DX V2.0
##DATA TYPE= NMR SPECTRUM
##DATA CLASS= NTUPLES
##ORIGIN= Bruker BioSpin GmbH
##OWNER= nmr
$$ XWIN-NMR		Version 3.5
$$ Fri Sep 15 10:50:00 2006 GMT Daylight Time (UT+1h)  MAYBRIDGE\nmr@NMR_250MHZ
##.OBSERVE FREQUENCY= 250.131544655141
##.OBSERVE NUCLEUS= ^1H
##.ACQUISITION MODE= SIMULTANEOUS (DQD)
##.ACQUISITION SCHEME= undefined
##.AVERAGES= 16
##.DIGITISER RES= 18
##SPECTROMETER/DATA SYSTEM= dpx250
##.PULSE SEQUENCE= zg30
##.SOLVENT NAME= CDCl3
##.SHIFT REFERENCE= (INTERNAL, CDCl3, 0, 16.522)
##AUDIT TRAIL= $$ (NUMBER, WHEN, WHO, WHERE, WHAT)
$$ ##TITLE= Audit trail, XWIN-NMR		Version 3.5
$$ ##JCAMPDX= 5.01
$$ ##ORIGIN= Bruker BioSpin GmbH
$$ ##OWNER= nmr
$$ C:\u/data/dgb/nmr/ADRS/770/pdata/1/auditp.txt
$$ ##AUDIT TRAIL=  $$ (NUMBER, WHEN, WHO, WHERE, WHAT)
(   1,<2006-09-15 10:49:38.05 +100>,<MAYBRIDGE\nmr>,<NMR_250MHZ>,
      <created by zg, POWCHK disabled, PULCHK disabled
       configuration hash MD5:
       E2 DF 36 D8 04 B2 41 60 5A D7 A3 38 5A 4B D0 FE
       data hash MD5: 64K
       5C 08 8F 4E C8 8F 8A 38 23 92 FD 37 BA A8 A2 94>)
(   2,<2006-09-15 10:49:51.61 +100>,<MAYBRIDGE\nmr>,<NMR_250MHZ>,
      <Start of raw data processing
       ef LB = 0.3 FT_mod = 6 PKNL = 1 SI = 32K 
       data hash MD5: 32K
       22 C3 AD FC E5 17 E8 0F 54 BB 39 75 3E B6 D4 1B>)
(   3,<2006-09-15 10:49:53.14 +100>,<MAYBRIDGE\nmr>,<NMR_250MHZ>,
      <apk 
       data hash MD5: 32K
       DC 3E B6 41 02 A8 4D 6D 4B DE 68 D7 6C CE FE AF>)
(   4,<2006-09-15 10:49:53.97 +100>,<MAYBRIDGE\nmr>,<NMR_250MHZ>,
      <abs ABSG = 5 
       data hash MD5: 32K
       76 B2 C2 E6 5E 43 CC 61 F6 31 B7 5A 1B E4 11 52>)
$$ ##END=
$$ 
$$ hash MD5
$$ 07 10 EA C5 F2 06 24 19 38 EB AC 5A 7E 53 30 2D
##$RELAX= 
##$RELAX= 
##$RELAX= 
##$RELAX= 
##$RELAX= 
##$RELAX= 
##$RELAX= 
$$ Bruker specific parameters
$$ --------------------------
##$DU= <C:\u>
##$EXPNO= 770
##$NAME= <ADRS>
##$PROCNO= 1
##$TYPE= <nmr>
##$USER= <dgb>
##$AMP= (0..31)
100 100 100 100 100 100 100 100 100 100 100 100 100 100 100 100 100 100 
100 100 100 100 100 100 100 100 100 100 100 100 100 100 
##$AQSEQ= 0
##$AQ_mod= 3
##$AUNM= <au_zg>
##$AUTOPOS= <41 >
##$BF1= 250.13
##$BF2= 250.13
##$BF3= 250.13
##$BF4= 250.13
##$BF5= 500.13
##$BF6= 500.13
##$BF7= 500.13
##$BF8= 500.13
##$BYTORDA= 1
##$CFDGTYP= 0
##$CFRGTYP= 5
##$CHEMSTR= <none>
##$CNST= (0..31)
1 1 145 1 1 1 1 1 1 1 1 1 1 1 1 1 1 1 1 1 1 1 1 1 1 1 1 1 1 1 1 1 
##$CPDPRG= <>
##$CPDPRG1= <>
##$CPDPRG2= <>
##$CPDPRG3= <>
##$CPDPRG4= <mlev>
##$CPDPRG5= <mlev>
##$CPDPRG6= <mlev>
##$CPDPRG7= <mlev>
##$CPDPRG8= <mlev>
##$CPDPRGB= <>
##$CPDPRGT= <>
##$D= (0..31)
0 1 0 0 0 0 0 0 0 0.06 0 0 0 0 0 0 0.0002 0 0 0 0 0 0 0 0 0 0 0 0 0 0 
0 
##$DATE= 1158313777
##$DBL= (0..7)
120 120 120 120 120 120 120 120 
##$DBP= (0..7)
150 150 150 150 150 150 150 150 
##$DBP07= 0
##$DBPNAM0= <>
##$DBPNAM1= <>
$$ [...]
##$SUBNAM7= <"">
##$SUBNAM8= <"">
##$SUBNAM9= <"">
##$SW= 20.6930455092707
##$SWIBOX= (0..15)
0 0 3 0 0 0 0 0 0 0 0 0 0 0 0 0 
##$SW_h= 5175.983436853
##$TD= 65536
##$TD0= 1
##$TE= 295.16
##$TE2= 300
##$TE3= 300
##$TEG= 300
##$TL= (0..7)
0 120 120 120 120 120 120 120 
##$TP= (0..7)
150 150 150 150 150 150 150 150 
##$TP07= 0
##$TPNAME0= <>
##$TPNAME1= <>
##$TPNAME2= <>
##$TPNAME3= <>
##$TPNAME4= <>
##$TPNAME5= <>
##$TPNAME6= <>
##$TPNAME7= <>
##$TPOAL= (0..7)
0.5 0.5 0.5 0.5 0.5 0.5 0.5 0.5 
##$TPOFFS= (0..7)
0 0 0 0 0 0 0 0 
##$TUNHIN= 0
##$TUNHOUT= 0
##$TUNXOUT= 0
##$USERA1= <user>
##$USERA2= <user>
##$USERA3= <user>
##$USERA4= <user>
##$USERA5= <user>
##$V9= 5
##$VALIST= <valist>
##$VCLIST= <CCCCCCCCCCCCCCC>
##$VD= 0
##$VDLIST= <DDDDDDDDDDDDDDD>
##$VPLIST= <PPPPPPPPPPPPPPP>
##$VTLIST= <TTTTTTTTTTTTTTT>
##$WBST= 1024
##$WBSW= 4
##$XGAIN= (0..3)
0 0 0 0 
##$XL= 0
##$YL= 0
##$YMAX_a= 186153
##$YMIN_a= -322604
##$ZGOPTNS= <>
##$ZL1= 120
##$ZL2= 120
##$ZL3= 120
##$ZL4= 120
##$ABSF1= 16.522
##$ABSF2= -4.171173
##$ABSG= 5
##$ABSL= 3
##$ALPHA= 0
##$AQORDER= 0
##$ASSFAC= 0
##$ASSFACI= 0
##$ASSFACX= 0
##$ASSWID= 0
##$AUNMP= <proc_1d>
##$AZFE= 0.1
##$AZFW= 0.1
##$BCFW= 0
##$BC_mod= 0
##$BYTORDP= 0
##$COROFFS= 0
##$CY= 12.5
##$DATMOD= 1
##$DC= 0
##$DFILT= <>
##$DTYPP= 0
##$F1P= 14.0000005364418
##$F2P= -0.99999901652339
##$FCOR= 0.5
##$FTSIZE= 32768
##$FT_mod= 6
##$GAMMA= 0
##$GB= 0
##$INTBC= 1
##$INTSCL= 1
##$ISEN= 128
##$LB= 0.3
##$LEV0= 0
##$LPBIN= 0
##$MAXI= 10000
##$MC2= 0
##$MEAN= 0
##$ME_mod= 0
##$MI= 0
##$NCOEF= 0
##$NC_proc= -5
##$NLEV= 6
##$NOISF1= 0
##$NOISF2= 0
##$NSP= 0
##$NTH_PI= 0
##$NZP= 0
##$OFFSET= 16.522
##$PC= 1
##$PHC0= 150.612
##$PHC1= 13.28119
##$PH_mod= 1
##$PKNL= yes
##$PPARMOD= 0
##$PSCAL= 4
##$PSIGN= 0
##$REVERSE= no
##$SF= 250.13
##$SI= 32768
##$SIGF1= 0
##$SIGF2= 0
##$SINO= 400
##$SIOLD= 32768
##$SREGLST= <1H.CDCl3>
##$SSB= 0
##$STSI= 32768
##$STSR= 0
##$SW_p= 5175.98343685301
##$SYMM= 0
##$S_DEV= 0
##$TDeff= 65536
##$TDoff= 0
##$TI= <Analysis number 999999
Compound Code 99
Book Reference 9
Project Code 9>
##$TILT= no
##$TM1= 0
##$TM2= 0
##$TOPLEV= 0
##$USERP1= <user>
##$USERP2= <user>
##$USERP3= <user>
##$USERP4= <user>
##$USERP5= <user>
##$WDW= 1
##$XDIM= 32768
##$YMAX_p= 368934933
##$YMIN_p= -1262425
$$ End of Bruker specific parameters
$$ ---------------------------------
##NTUPLES= NMR SPECTRUM
##VAR_NAME=  FREQUENCY,     SPECTRUM/REAL,   SPECTRUM/IMAG
##SYMBOL=    X,             R,               I
##VAR_TYPE=  INDEPENDENT,   DEPENDENT,       DEPENDENT
##VAR_FORM=  AFFN,          ASDF,            ASDF
##VAR_DIM=   32768,         32768,           32768
##UNITS=     HZ,            ARBITRARY UNITS, ARBITRARY UNITS
##FACTOR=    0.157963299565203, 1,           1
##FIRST=     4132.6476996994, 0,             0
##LAST=      -1043.33573715361, 0,           0
##MIN=       -1043.33573715361, -1262425,    0
##MAX=       4132.6476996994, 368934933,     0
$$ Real data points
##PAGE= N=1
##DATA TABLE= (X++(R..R)), XYDATA
$$ [...]
27002 80878 115930 272686 436442 309118 55329 96935 361272 465736 621675 319813
26992 319813 164685 35258 -148276 -17763 173420 211264 9741 -104202 -300268 -450832
26982 -450832 -309008 -551340 -418415 -186423 -490818 -789407 -544636 -296439 -530414 -410927
26972 -410927 17052 196876 -76229 -57894 -84296 -444689 -812556 -844638 -556769 -92886
26962 -92886 95343 94430 257521 531859 409448 225994 44147 149357 -22042 170834
26952 170834 11564 -228588 270747 419434 294253 90914 -112433 -143004 -222822 -45863
26942 -45863 282907 619516 378479 225445 68478 23422 33274 -179121 -51336 30123
26932 30123 -19972 292795 214352 27836 6115 73807 66099 -13282 -67528 -17215 105552
26921 105552 28055 13714 -109870 -336409 -240221 48417 17535 100202 -224010 -282360 -220973
26910 -220973 231419 545519 471164 261138 155670 216359 149557 571859 574605 449781
26900 449781 -37845 -244542 73276 106222 198056 250845 -309596 -460166 98675 247095
26890 247095 43275 -16720 -105512 -635851 -526269 -177277 -156609 -475467 -375968 250014
26880 250014 249272 -336601 -528084 -298691 -22283 202713 72673 61054 153085 42952
26870 42952 -121905 -233031 9177 178292 75576 162509 14996 -29219 90383 139331
26860 139331 74205 -12149 -302374 -423237 -72725 41987 130814 -308878 -560926 -79342
26850 -79342 177648 402861 398793 193440 9612 -205900 -4214 215889 385541 395336
26840 395336 590987 541380 427592 316355 -114239 -170688 -13082 170180 115897 -311573
26830 -311573 -414287 -173096 -92391 72672 -29679 -59878 63709 198051 -31508 78733
26820 78733 253939 345541 292554 369042 204689 318020 547403 428593 121682 281187
26810 281187 109091 -370527 -210225 61744 251121 -19561 -39319 -633 337232 522258
26800 522258 33300 -167450 -134842 90911 167114 -370630 -942266 -871574 -369889 -264467
26790 -264467 -133706 -156624 -208686 -362298 -659521 -612445 -396121 -279387 -269543 -238009 5581
26779 5581 107040 -185905 -574067 -467817 -170834 109200 285257 367281 148006 375361
26769 375361 460852 272037 -116763 -385523 -593605 -601936 -494073 -377347 -286872 -69714
26759 -69714 142430 57715 -49047 -48051 96035 -60095 -28347 448418 626545 885855 1120921
26748 1120921 847826 428764 289562 -140350 -91484 -6175 -7654 -78791 -153232 -211375 -196423
26737 -196423 174346 751665 808957 742347 534833 348838 299090 228261 543927 763464
26727 763464 233799 -301601 -324714 -149445 87871 4150 281515 354471 287469 156255
26717 156255 117858 3220 -176412 2274 -50650 -375227 -505729 -223699 132176 370980
26707 370980 683741 537212 468158 -10108 -348151 -102350 -36 -123370 -290306 -707691
26697 -707691 -320975 20808 295603 547260 643400 636606 354995 359373 856658 745972
26687 745972 324038 48863 168175 -22708 222424 652534 429844 193618 353819 668459
26677 668459 308293 224637 679074 455825 283525 513165 652204 527456 593943 563094
26667 563094 240593 -85431 -270680 -75686 126966 185420 152751 11739 -162806 79319
26657 79319 -175515 52898 209733 121585 544197 457165 428559 389627 188337 -25220
26647 -25220 111905 -9364 -119029 -60199 -181163 -410680 -411930 -3256 -33234 176737
26637 176737 261919 68994 -172585 -115781 -163600 -267835 -422748 -525924 -558836 -427437
26627 -427437 -43243 108213 147959 10416 -136243 -46245 -68302 -260133 -555246 -2267
26617 -2267 408245 309688 -87241 -375572 -129063 -130697 -192921 -25743 136106 -207889 -188991
26606 -188991 5159 132015 -31076 90341 -43114 -301129 -219320 -223474 13476 -212081
26596 -212081 -343219 -204130 -512695 -235627 1425 -185896 144202 155426 78858 504
26586 504 169590 227045 302044 57396 60952 211742 466388 526739 157337 -1260 -84458
26575 -84458 60658 254620 319052 210777 102043 379998 479644 108014 31686 359093
26565 359093 618842 267746 -25100 9585 56888 34879 150547 -51314 -187186 206945
26555 206945 408402 545852 505516 421128 156215 -2641 -73202 30592 171720 -114044
26545 -114044 -539134 -370380 -389214 -281566 79039 391524 537940 640286 634465 647573
26535 647573 119792 59457 412850 571119 713973 277590 -116864 -18552 1221 -41888
26525 -41888 23939 218235 183384 138969 368525 443825 435601 458604 654841 809738 621998
26514 621998 614279 231900 516854 368702 87995 8544 -74280 -251978 -388805 -233611
26504 -233611 63055 242789 419560 59290 -122124 -163737 30424 91312 66221 130616
26494 130616 177467 25166 191222 255147 138679 311373 337023 195252 -95797 -56363
26484 -56363 156099 342091 38354 -50249 -161913 -156683 -118515 -289826 -641266 -719803 -122108
26473 -122108 329069 35904 -100158 -510760 -447221 -450379 -32681 367079 259168 5064
26463 5064 -405407 -102638 232801 123307 -174442 -96114 -304869 -394817 -461763 -378508 -348291
26452 -348291 -331482 -296163 -149828 109704 387212 463587 339710 369002 243892 -34510
26442 -34510 -140933 -231069 13524 -35522 17423 155735 292533 133864 -311049 -50422
26432 -50422 225005 92581 -331807 -427440 -146931 -29140 -139809 69822 213051 181153
26422 181153 217183 751724 1095972 1047701 716002 448330 393036 12075 171947 562766
26412 562766 657200 444133 227688 357698 580494 381550 579601 717980 415600 388494
26402 388494 439445 295128 451407 345519 343106 456682 370734 474015 452600 314359
26392 314359 77496 40808 151389 333717 351089 65220 234167 453179 286485 -106851
26382 -106851 161507 414973 267992 299423 202887 119716 108921 299693 254535 -140445
26372 -140445 -267127 -358313 -534594 -560763 -565047 -118669 -21027 44201 -373324 -660778 -215119
26361 -215119 142491 -99321 -391005 -317023 -107659 -364100 -593076 -163235 -67423 -187451
26351 -187451 -157159 -413900 -467587 -243683 -129688 -86823 -130128 109057 212180 -67666
26341 -67666 -380825 -358013 -180736 -219140 -64267 -254723 13915 -165185 -484308 -463413
26331 -463413 -3387 248168 188413 466025 543109 339179 -229169 -556182 -403360 -49900
26321 -49900 109142 -159742 -255114 -254318 -197985 99530 -9036 -247409 -188174 -121994 -11937
26310 -11937 284203 260773 31770 66026 82505 9303 61377 104774 3474 -76976 348197
26299 348197 558390 555061 339421 -4833 -3811 -87549 -449555 -487574 -669804 -379445 -118798
26288 -118798 57635 334777 131381 -60952 -227655 -811262 -595615 -194460 122517 277413
26278 277413 298342 249762 53278 176426 363079 583191 484630 180263 71789 12468
26268 12468 116792 57529 -61584 -42188 -20520 116597 337350 485308 342253 91246
26258 91246 102460 -235434 -261541 -39451 183253 421748 373545 157538 211662 151351 159386
26247 159386 63782 -373522 -501076 -161736 -425222 -286200 347005 781943 833018 606176
26237 606176 684995 313286 401523 782764 692806 356987 125127 -123225 -311521 -41854
26227 -41854 48929 -159223 -175644 239013 595709 419290 -117133 -264210 -175426 -200263
26217 -200263 -364880 -128111 -412388 -399792 -211463 -3529 202252 -19745 133186 86067
26207 86067 -36608 313671 399985 463238 543893 846021 932542 225729 -158708 165678
26197 165678 53914 -103144 134942 91050 50017 15920 -181989 -10529 -189445 -566332
26187 -566332 -688035 -695904 -442017 -236528 -245466 -281407 -28313 -166158 -247188 -565552 -911646
26176 -911646 -812117 -341916 -220274 -272757 -35022 67213 152074 82693 -114860 15333
26166 15333 364773 467356 -70224 -317938 -104694 56603 -161985 -172382 -158054 158201
26156 158201 208588 -100700 -234793 -49857 271251 301671 305025 78887 -181121 -557435
26146 -557435 -532336 -124634 333595 212244 381238 342625 85474 -292483 -171293 70110
26136 70110 224680 389842 141894 35123 79190 49755 112539 319911 97863 -101681
26126 -101681 133047 213255 107420 -162417 -276412 -176570 -243638 -432089 -358552 252607
26116 252607 402508 426726 605480 716739 534033 210920 157317 253408 56483 -377486
26106 -377486 -338916 -168406 -86934 -125915 -132065 48312 3091 -1136 -74209 20155 21572 -120188
26094 -120188 155990 463020 456700 261140 93576 -71136 64514 13945 -83591 -48340
26084 -48340 16644 -213079 -661311 -378145 26549 -13324 -122357 188451 -12327 -416448
26074 -416448 -639916 -544801 -597634 -325213 -237702 -102039 -34414 -137148 -247371 -178409
26064 -178409 -94365 -91189 -13184 66317 -70745 -108084 -158689 -250804 -300828 -508949 -667710
26053 -667710 -541857 -746959 -485501 -355178 -705031 -810753 -905826 -632044 -487865 159711
26043 159711 292969 350671 360999 -51140 -259095 -236583 -382467 -500763 -544305 -467333
26033 -467333 -29317 337251 237352 -3647 -5385 -120649 -136007 -84874 460888 612707
26023 612707 235675 -184612 -259121 -175705 -149731 172832 309409 150612 399663 218694
26013 218694 162316 133400 -69018 -30654 385710 584607 582752 477541 303471 76768
26003 76768 -83136 -402393 -308771 198510 261851 25424 -88027 -283556 -237206 -317330
25993 -317330 -249515 49334 154672 156876 426720 264904 88381 -176717 -370535 -193306
25983 -193306 -237761 -535547 -374178 -10693 126924 19912 113780 594762 551381 296832
25973 296832 307684 424462 377768 178655 142580 -51282 -212141 74699 127448 -22367
25963 -22367 -218157 -108964 248680 186205 202466 -319148 -734921 -680944 -528478 -580413
25953 -580413 -233212 60921 131277 220158 114880 116378 236846 218605 511015 635334
25943 635334 289167 -171474 -148921 129877 350956 255695 222793 223608 239663 295735 205203
25932 205203 14715 75609 -31813 -169721 -309140 -633987 -1022632 -970448 -339189 216704
25922 216704 279571 226371 263154 185682 410913 372615 290767 150236 164904 171682 -173865
25911 -173865 138794 83891 -17065 107971 253094 89382 -244288 -184150 -153088 171865
25901 171865 -117676 -20377 1679 20074 -73674 62854 43039 -81655 -135320 -532955 -654485
25890 -654485 -466946 -478073 -166645 -106344 -336196 -432032 -470899 -337900 -12021 7754
25880 7754 25246 -139255 -200183 -86957 101356 351196 178564 118456 270337 396930
25870 396930 338147 -29703 310339 493530 355663 214179 143248 270460 431038 528554
25860 528554 463266 287190 48068 -101668 -259055 -512835 -368901 -528004 -911923 -994135
25850 -994135 -852724 -945503 -1234218 -1262425 -860292 -529882 -606871 -551444 -562139 -373313
25840 -373313 -271978 -265363 68862 234048 204893 127775 271179 284780 488066 748568
25830 748568 739468 660050 201961 183368 -57201 -204706 -196596 -104558 6841 44867 -172313
25819 -172313 -232821 -210341 -338832 -586660 -452787 -328023 -364162 -370474 -269095 -42323
25809 -42323 -286 -32092 136745 450716 504166 599915 298812 226392 382432 180045 70151
25798 70151 -235074 -109423 266222 522669 564626 123252 33945 200505 105340 -136508
25788 -136508 33241 358139 643770 696795 589427 345639 -32335 -250172 -128416 -133750
25778 -133750 -229319 -254660 -292100 -439938 -160560 37727 99164 79363 48424 -355492 -509767
25767 -509767 -533376 -42090 462600 408479 77072 -144425 219400 147644 -353135 -579953
25757 -579953 -592770 -496200 -103811 234122 186390 -59767 -217403 -99849 -128418 -386013
25747 -386013 -783263 -353414 108303 -62072 -367456 -244754 54693 270215 200314 206528
25737 206528 302581 430569 508385 544049 584566 625011 353555 -111109 -142897 -174533 -323676
25726 -323676 -130812 175692 172506 -159498 -206581 -317086 -219224 40396 99349 108608 181829
25715 181829 63079 -80140 -40824 -84075 3785 -107256 -36698 133520 55204 -241868
25705 -241868 -380118 -64723 2726 -113018 -262183 -344628 -132783 -96192 50252 107705
25695 107705 -88333 -394762 -621919 -452948 -215874 -285868 -615021 -826481 -557627 -417341
25685 -417341 -99417 375181 414872 279221 55724 -22549 96996 320169 24425 13526
25675 13526 -33926 -8082 43960 188680 245650 63254 -254549 95219 292633 184284
25665 184284 164297 159091 133513 137353 282200 558623 305586 46713 -84170 366461 669797
25654 669797 452198 419193 546818 300407 -116015 -303960 -394163 -393510 -113482 283252
25644 283252 51204 -138725 -187035 29274 159652 607344 590183 388663 440547 68494
25634 68494 -22315 -136067 -123198 5426 -53451 158787 402182 592479 656558 685406 442453
25623 442453 97944 48215 44956 226046 104996 234220 99650 31368 -103473 -118140
25613 -118140 79518 35367 -168226 -507444 -314648 -310153 -514323 -503239 -513076 -316770 -79527
25602 -79527 171471 388540 461628 525293 238721 281033 113181 -22857 62173 249848
25592 249848 543380 208396 281925 286221 2842 -363179 -95933 250912 471218 423394
25582 423394 320998 210373 197823 194721 187369 157439 95455 314055 -150333 -32434 262731
25571 262731 330895 -17788 -399100 -487493 -582249 -692580 -205963 412632 239349 224656
25561 224656 186230 -41319 -212216 -169166 -217162 -16760 -225655 -419630 -412304 120690
25551 120690 -48595 -313207 -184232 -36743 324750 216020 -78945 136483 59082 -271025
25541 -271025 -390080 -631458 -519606 -95427 -21527 -335925 -695305 -440297 -402492 -245577
25531 -245577 -16611 96739 262379 241972 210357 390125 180841 162058 -28505 -240246
25521 -240246 -252022 -245696 -95048 -201927 14077 191051 -304916 -69087 43118 -117835
25511 -117835 -403932 -321682 13353 202011 362561 277228 -45903 -171956 -268297 -506782
25501 -506782 -614347 -293759 119899 238269 17751 -207912 -330457 -103454 -15015 56708
25491 56708 265789 369683 93331 101375 -53062 -183613 -154703 -574440 -585599 -677363 -711013
25480 -711013 -792153 -473694 -262190 141243 96839 108815 -37266 -423918 -517821 -440093
25470 -440093 -283155 -147288 -140904 151955 228081 99555 29821 -61666 -187086 -295503
25460 -295503 -482962 4260 -47106 -213453 -295598 -280351 -340107 -429612 -333875 -151799 206579
25449 206579 526754 479367 226783 -11641 193278 699924 363492 586680 741686 661936
25439 661936 313454 302144 329671 -54416 -221670 -180668 39337 121548 292063 252201
25429 252201 147998 77790 184722 329811 95824 -139319 -392612 -512522 -205768 -50364
25419 -50364 -265086 -223966 -78244 -18006 -16617 207029 102789 -159169 -44609 172887
25409 172887 233982 198055 139817 112563 235712 329451 425109 556636 434727 350598 56656
25398 56656 -71937 64854 59955 -36431 -237565 28245 184227 161400 100877 132155 24393
25387 24393 -42517 59743 444382 305404 -3935 382192 830576 802737 270638 -1602
25377 -1602 -19836 201784 313398 535883 528734 430165 220668 267045 359524 716680 571764
25366 571764 410102 771111 628752 506006 177959 -77617 103793 405015 377862 316598
25356 316598 4487 -7424 321212 -60870 -264928 -132207 -110230 30882 -75582 -353400
25346 -353400 -419379 -448381 -468981 -422205 90794 661318 721734 415306 473807 333182 121250
25335 121250 316773 551980 342698 -9337 -259462 -156632 -3041 8220 -221178 -219363
25325 -219363 -17523 -79305 49328 -211464 -82523 -191832 -62798 209791 53116 -173241
25315 -173241 -216106 -9671 -355975 -286248 -488004 -584589 -358686 -169449 38275 151318
25305 151318 -48733 63563 138855 134719 118550 431526 111849 -32566 -142067 -262174
25295 -262174 -187348 -203306 8654 44692 263783 -111030 -551837 -441582 -204066 139345
25285 139345 157178 -198411 -251787 -73076 23898 -229443 -375509 -160369 108119 306012
25275 306012 458329 227564 -130862 151164 410768 457489 240359 229909 170929 294620
25265 294620 3911 61431 278326 116691 -201771 236006 518834 542100 449237 35706
25255 35706 -25389 -162078 -584018 -649906 -331788 -7842 -112239 -196227 -49884 -245660
25245 -245660 -74526 226994 38249 -45686 -311920 -524940 -739666 -582070 -414527 -274106
25235 -274106 -180208 288045 477997 273081 333860 177837 226310 392351 418212 224443
25225 224443 131362 60774 307937 103972 -46514 20051 40681 8211 8964 65021 284865
25214 284865 468512 450714 402835 409162 590845 650207 236463 212879 18792 -48825 -73973
25203 -73973 -24255 458862 426200 133636 -221512 -207290 157392 155516 -53804 -308891 -192577
25192 -192577 -137426 -27521 -19550 2974 -98198 20964 196888 145081 257966 18539
25182 18539 -220718 -292986 -72444 -13379 -119939 -257130 -138981 -182430 -399893 -284455
25172 -284455 -202722 -519418 -502054 -76389 241785 377834 484246 367882 288781 427543
25162 427543 338284 -68234 -352359 130960 244021 266361 473200 532352 735465 748775
25152 748775 775590 629401 313741 69314 73595 -136156 -429601 -291957 167563 59022
25142 59022 -330242 -615800 -1031988 -714983 -111740 70323 164245 41766 153734 505788
25132 505788 396883 346978 632895 770446 432610 307225 602874 598939 344913 459443
25122 459443 633524 930208 573914 226088 272293 439753 345444 114038 -97346 -4925
25112 -4925 -163461 16250 151039 -146741 -132745 60872 20808 -40638 85440 76512 131704
25101 131704 416450 395507 299417 114271 353251 -131334 30666 314982 398161 369079
25091 369079 -48931 -601027 -530013 -261746 -401238 -593191 -601726 -305151 -60540 57587
25081 57587 -211846 -376772 -456808 -296884 -411891 -196802 -21474 73877 -8708 242309
25071 242309 127223 -378699 -799477 -888169 -628110 -296939 101731 338890 -35003 -211602
25061 -211602 -381983 -512282 -379250 -64429 20994 98617 200088 328918 -1639 -319667
25051 -319667 -507454 -296518 272954 384623 98319 66787 300345 303645 330503 416567
25041 416567 -85915 -70420 35060 -112660 -39960 90879 215628 349056 526880 542943
25031 542943 394671 187561 188949 509607 411684 569887 722552 478543 287181 236936
25021 236936 161092 -413215 -330603 -289112 -431071 -497869 -744384 -324872 -107523 6240
25011 6240 -189493 -411855 -441113 -112235 199848 86353 205343 238501 82585 -4620
25001 -4620 -248227 -53385 271283 74003 -183607 -156831 -40121 175063 -24085 -77296
24991 -77296 -49190 -59357 -276332 -734086 -994906 -501911 -101156 -266649 -159748 -107694
24981 -107694 -355858 -221318 77854 109933 149256 243055 57272 173965 97895 103405 -215487
24970 -215487 -255053 -155364 32109 67776 -42212 52930 391521 368059 391108 187891 94747
24959 94747 158935 100091 155341 -161426 -197243 -335832 -383431 -469590 -747310 -562209 -41006
24948 -41006 322691 7697 -202995 -376008 -424243 -454917 -425549 -263750 -234481 -58815
24938 -58815 -40181 -277105 -66489 -41627 668 -126953 -292226 -317339 -201247 44043
24928 44043 73576 -48175 -34291 36558 263579 512179 663825 937942 1056031 682251
24918 682251 208505 -155470 -151078 -129986 210867 155525 211828 221678 70432 112035 812673
24907 812673 903744 740154 954040 353411 -156114 -85528 -187032 -412892 -186864 48442
24897 48442 9823 155301 18747 -113773 -144009 176541 173819 207193 166611 244379 -42964
24886 -42964 -446786 -683890 -386574 75750 484185 583404 291640 163903 246815 300461
24876 300461 292634 134966 -348937 -650472 -778239 -450832 -398234 -169340 26449 81725
24866 81725 113478 124974 -12814 -198319 -355368 -503466 -232420 39477 -50131 -238930
24856 -238930 -192042 -28571 6562 -244107 -346054 -147839 39234 56506 112575 -81393
24846 -81393 -328575 -202084 -143773 -222818 -174330 -28215 -75042 58016 173525 -63147
24836 -63147 32177 -237813 -185978 -119696 -161311 -317814 -282273 -353064 -491598 -444936 -577223
24825 -577223 -559971 -382488 -334791 22389 36952 -403487 -488008 -628413 -647245 -550250 -398805
24814 -398805 -194533 127508 376184 437939 346798 380483 251837 223652 182345 11117
24804 11117 253861 406246 338348 183818 -154102 -452826 -374796 -117091 -318245 -426820
24794 -426820 -245740 -175186 -523597 -564694 -330973 -97576 254532 104303 -53098 -137842
24784 -137842 -172978 -242131 -159529 310404 321070 -78089 -190316 -173301 104695 282436
24774 282436 285769 206777 408590 514599 458240 658917 508652 180707 121197 70443 3430
24763 3430 233480 432407 465978 286355 53178 -23294 -196005 -146032 9228 165449
24753 165449 240581 -20568 67237 9307 5179 -91597 141233 435535 478011 314648 -66517
24742 -66517 79818 82849 -253649 -431979 -237879 117929 214071 -293770 -633007 -310070
24732 -310070 -71630 -255950 -53588 247625 73988 103037 220383 -12375 -157535 -239837
24722 -239837 -177481 -173605 -82157 398204 934025 932595 497959 113714 241621 426094 298972
24711 298972 81931 123843 411296 292880 205035 86343 -264477 -172983 -200804 -156648
24701 -156648 -54597 22953 -161827 91232 373061 257956 129373 -22765 324658 324078
24691 324078 227116 351809 297891 -10482 -254023 -60257 242712 398907 404382 426918
24681 426918 376093 52182 -267410 -235691 300386 503279 462151 481201 342498 167906
24671 167906 175240 -101131 -293000 -59674 244052 426067 110460 -29064 -113665 -242659
24661 -242659 -240902 -209047 -95602 -67860 196533 234976 215854 317736 508637 386579 281325
24650 281325 240614 437615 402728 268700 138003 301584 5774 -78986 140760 80251
24640 80251 -167493 -417075 -515728 -257015 -75119 -155387 -30724 466807 386284 361355
24630 361355 189711 318099 49979 -10660 5995 3823 -79600 27620 191403 225027 476111
24619 476111 663479 474008 537433 587454 337147 2579 123780 95038 203772 178742
24609 178742 -257747 -451799 -521301 -200452 -112771 -296522 -341468 -599166 -362149 -277129
24599 -277129 -104507 90761 -362679 -521921 -223289 -75011 -9979 98307 -90588 -380971
24589 -380971 -626243 -180937 -311958 -526807 -646798 -525956 -219022 -57748 -25874 351053
24579 351053 279986 317810 98553 -63258 119571 99985 26709 -186553 -565404 -692287
24569 -692287 -696340 -772555 -764360 -693799 -370215 -122369 139555 -19810 -158353 -237450 -297401
24558 -297401 -60442 -326963 -345766 -86497 179614 72663 -1163 -365502 -71871 310616
24548 310616 383813 274689 97117 19627 -28875 123447 -83783 -239855 -433181 -305894
24538 -305894 -41291 69855 181976 63543 -14605 -29670 9768 53793 440796 325244
24528 325244 -13361 56371 279159 39493 -180840 89413 411555 508547 476810 249220
24518 249220 -258243 -651208 -745885 -605018 -511576 -474492 -4011 136253 -238435 -252345
24508 -252345 -338351 -425021 -425158 -306265 -460787 -364691 -137855 -53215 95898 330395 93083
24497 93083 95169 -36981 -367682 -387577 -368637 -28564 159661 86550 130083 -46301 228709
24486 228709 269616 97028 -199460 -415626 -363843 -144675 43831 -313693 -529907 -401485
24476 -401485 -453970 -209931 34702 -65593 -412579 -433064 -183884 -40377 -62511 227393
24466 227393 228214 408713 212784 -247405 -226423 -127528 -32489 49443 20764 -163650 -523506
24455 -523506 -393757 -277009 -76271 -52753 -137120 -64756 -186951 -286331 46332 166088
24445 166088 279599 200185 85345 -35852 -30696 -69157 -111247 -538767 -731819 -407101
24435 -407101 -272298 -131649 -44175 80480 275667 151267 -14063 -60145 13217 -6140
24425 -6140 205412 392973 256690 305215 278055 226948 131156 210540 291625 148246 398416
24414 398416 361172 93728 250296 665790 512525 -18900 -287623 -28136 -165515 -101835
24404 -101835 276983 483781 490641 150596 -116632 -43466 -231077 -223251 -384237 -248915
24394 -248915 306262 474034 469099 797965 528606 216636 -359426 -384930 -421074 -639377
24384 -639377 -857809 -771889 -863622 -358492 -129807 -35168 -138925 -248425 244642 762963
24374 762963 562994 174480 146382 385054 83736 -100984 -66196 49517 512634 799128
24364 799128 713055 481774 88856 76476 -86788 -117230 -95855 18990 -80979 125249
24354 125249 152995 -225713 -518153 -213837 50609 -512751 -477200 -141998 169891 -68163
24344 -68163 -89962 90747 1182 215435 -29636 103552 82832 27187 148608 309478
24334 309478 493431 600432 205882 -136044 -314003 -318493 -280445 -195537 -286952 -263240 -219880
24323 -219880 -5162 69155 158677 -133739 -596253 -295374 -230152 -264554 24646 66924
24313 66924 311938 152649 152193 258498 165762 -210799 -104722 -115585 -444333 -399165 -72712
24302 -72712 -20027 -91142 -352172 -510709 -577212 -456581 -696329 -637734 -344362 -141180
24292 -141180 -321324 -186004 -402516 -450301 -284096 -499520 -628232 -414252 -273036 -302801
24282 -302801 -425088 -288960 -260053 -286516 -122425 -241815 -286944 -462776 -532127 -729779
24272 -729779 -724345 -551404 -552115 -935359 -772528 -446194 -342761 -51165 54154 195325
24262 195325 224170 313732 710354 509732 147487 174187 182588 1700 -417155 -416176 -321509
24251 -321509 -490978 -525180 -105286 77257 235187 363500 -33306 -372708 -15668 52762
24241 52762 -57535 77472 5012 -277463 60781 819884 605616 277188 329308 74101
24231 74101 -34978 57727 90810 354688 184233 186703 -367217 -469470 -334813 -115374
24221 -115374 -35958 -6055 -112753 44780 269561 477169 331471 308619 30240 -76905
24211 -76905 -238273 -19221 257287 83444 -24066 -172520 -427828 -267544 -245310 -27049
24201 -27049 554442 796914 567343 380863 387631 122729 83188 277878 357812 210487
24191 210487 -152439 -298902 13162 46664 -133416 -174919 -226802 -61568 -186539 -428451
24181 -428451 -708542 -429963 -302317 -222662 -11442 189444 45780 168255 461997 320390
24171 320390 339548 -19014 -478409 -472636 -397467 -247815 288389 774202 924725 816034
24161 816034 198422 -103667 -86676 147126 65585 58339 -181196 -4221 149913 -121012
24151 -121012 -305028 -58524 324713 536636 275143 120523 71498 -187891 -616026 -518830
24141 -518830 -306119 -62060 -110393 -159918 -42356 115915 409216 359312 105105 31489
24131 31489 277418 394316 412345 444088 524963 459529 198288 510896 633233 659893 366097
24120 366097 281322 180940 7456 -85824 151465 173892 71056 -93975 -196017 -520743
24110 -520743 -360959 -175112 -129730 55996 38008 130706 131270 36965 77359 443866 308724
24099 308724 67213 56934 152162 -196752 -385086 -102135 5910 -22256 -196039 -562711
24089 -562711 -217658 -74806 -14141 46895 12040 -409741 -990254 -1090618 -1059687 -890048
24079 -890048 -559449 -267285 -120069 -1461 333985 314399 -75358 -388130 -189045 -164907
24069 -164907 -252513 -277140 -186308 -114965 293581 337503 237668 81077 430184 464109 439745
24058 439745 345493 172401 -251355 -508918 -633648 -678066 -489227 -763755 -694424 -481110
24048 -481110 -179238 151994 290311 -90636 -358507 -281870 -124163 189243 49105 -81594
24038 -81594 -13089 151928 130833 311907 401789 209044 513468 539921 202135 -76418
24028 -76418 -387171 -316582 -156864 -181494 -154685 -219938 -438943 -384736 -251369 -315256 235852
24017 235852 182354 -264117 -579971 -491457 -322874 -535465 -177712 363032 165553 233449
24007 233449 411726 275138 283426 295994 61473 148650 188013 37309 104227 52597 46376
23996 46376 -98478 -284491 -412730 -445993 -506699 -23978 -104076 -387615 -615301 -320189
23986 -320189 -170278 131442 54042 -95467 -196167 -394535 -239156 -315153 -438256 -359601
23976 -359601 -146048 67143 -99106 4221 -379443 -96690 1081 -263951 -385064 -318773
23966 -318773 -248490 -93052 -120062 23358 373099 381234 214427 185643 237188 233256 313740
23955 313740 301542 179330 -102551 47424 554584 409287 -52663 87231 368771 262146
23945 262146 251498 46326 -176037 -541732 -482579 -314336 -341120 79021 222347 281365
23935 281365 203354 217119 100656 55497 -56321 234322 342220 300014 194343 509601
23925 509601 520720 296905 286646 340029 22742 -268614 -315467 140057 536462 688243
23915 688243 591938 187672 -100100 27671 -81654 -91318 75294 -40437 -410480 -317811
23905 -317811 -63841 -30625 -230047 -604926 -512566 -93271 209304 2195 212287 434719
23895 434719 222598 -363975 -447747 -10972 216155 207209 179132 -124379 -159280 -186331 -193406
23884 -193406 122124 331741 -69102 -210571 -49749 -98575 -101901 77485 187835 292766
23874 292766 133152 38909 48853 -25554 -48099 -256122 -263711 -37524 -28492 106974 153043
23863 153043 185359 245865 444619 369300 -168157 -310366 -238996 -188253 -251785 -128440 44799
23852 44799 214890 141834 -48795 -7011 -277828 -123997 70911 -44753 93128 523157
23842 523157 193385 -41401 -68876 -142829 91451 239201 225772 76448 -116352 -154684
23832 -154684 -120146 97023 14112 74478 -2009 -188128 -411793 -396456 -711925 -944652
23822 -944652 -886102 -699074 -573903 58434 617634 637513 521410 156173 -15690 331543
23812 331543 364099 221950 391325 316699 336588 256746 287397 517484 89843 -95127
23802 -95127 -132636 49050 28462 51652 118076 251524 538560 513492 101757 -121087 -268558
23791 -268558 -177476 -101002 -127278 -299515 -192429 23631 -60443 -210347 -62453 131155
23781 131155 208726 -249166 -1744 516176 493934 -20600 67329 343528 588830 119838
23771 119838 -249402 -193035 -115934 -58666 146923 363301 70362 -211834 -30125 19927
23761 19927 -98223 -138557 -306926 -266079 -157236 -94918 -90151 -306370 -343520 -415645 -306972
23750 -306972 43820 -42804 -389694 -338712 -154440 51500 99282 -197561 -81518 271041
23740 271041 179283 192516 -44620 -101793 -59727 40409 158270 100591 -267926 -455449
23730 -455449 -103912 -113895 -394620 -477778 -339535 -216860 -315056 -457205 -556483 -516760 -218981
23719 -218981 -96257 2348 -333972 -574355 -599769 -299946 38793 142796 -203889 -290055
23709 -290055 -300773 -19657 243994 387311 48292 134567 403797 292082 30453 -211918
23699 -211918 -327486 -205450 -44078 -1084 8022 133351 241296 -49120 -462709 -905772
23689 -905772 -802506 -345830 -629592 -675800 -516086 -510062 -350754 -524403 -493980 -202821
23679 -202821 206812 382378 545527 332811 -76489 -48121 66009 18778 -215264 -357682
23669 -357682 -372009 -699106 -975555 -852787 -408769 -198851 -201294 -312165 -120556 366147
23659 366147 273019 112575 -117323 -660077 -554558 -253941 -807509 -1042424 -922073 -717345
23649 -717345 -433904 -136107 15797 106739 38249 367805 296365 123041 -288341 -500356
23639 -500356 -675575 -709520 -509570 -544854 -391278 -179288 -439593 -296215 -212863 -288179
23629 -288179 70855 118797 -111015 -409986 -330477 -180132 -144853 -52737 8531 -79678 108270
23618 108270 126773 -188220 -103595 -222971 -245773 -139243 14514 87458 70461 56702 308638
23607 308638 295628 171834 53765 567439 682880 580125 227340 24733 -70100 135856
23597 135856 -170694 -290618 -64301 338158 174604 -30617 3679 9353 388713 266770
23587 266770 -98573 -472728 -818482 -660330 -327858 -248036 -315680 -296353 -239188 57562
23577 57562 -29609 68484 512129 693917 482828 39825 -432366 -496586 -274033 -294713
23567 -294713 -290404 -166742 10359 57524 -59373 -395291 -377121 -3887 -105097 -169821
23557 -169821 -241063 -310657 -158172 -193144 -254305 -89484 102965 225974 465931 394958
23547 394958 374691 95593 -68251 -280163 62929 490411 548302 355836 269059 247278
23537 247278 337226 255682 334882 47046 -508016 -651651 -673364 -540965 -571784 -353377
23527 -353377 -377001 -514484 59792 -8698 -284290 -75263 21975 -85523 82526 104419
23517 104419 65550 -126949 -353260 -130091 -133682 -104249 -280870 -580735 -275282 -35143
23507 -35143 -25150 -502264 -688762 -307795 -197278 -205732 -197374 165777 46960 147063 476993
23496 476993 354148 388340 111399 -132158 -37906 -413412 -490552 -179381 -146125 -202060
23486 -202060 -306568 -487491 -418409 -141855 -248536 -132103 -235016 -370180 -257882 250486
23476 250486 446876 281228 126645 207205 37857 145585 126233 129046 87334 206946
23466 206946 94163 143342 174885 313756 306424 209401 41560 -37150 -34557 84881 119537
23455 119537 -11143 319453 240914 -51348 155880 81269 211859 42043 -150839 177688
23445 177688 165493 160547 376063 429193 236317 262449 182640 -75590 -357512 -101751 146959
23434 146959 -27652 59343 257822 122536 -210168 -356856 -169643 -96856 35541 361954
23424 361954 193871 74440 214102 -26084 112705 -24908 -207567 94409 493847 265030
23414 265030 213163 195733 113783 176247 116898 376573 122289 26219 180600 -37825 246593
23403 246593 251461 344446 291285 26312 615 7355 -277729 -91571 25560 -21111 116908
23392 116908 -258096 -346580 -589907 -317140 -22954 -60844 -262748 -188007 -373717 -221108
23382 -221108 44612 201834 54621 -109932 -165665 21942 370249 135408 -113599 -72506
23372 -72506 -265676 -121560 -247290 -395721 -258339 -8700 208477 -95814 -225016 -386374
23362 -386374 -301907 -193755 -202802 -46351 -3965 118998 112617 70838 138772 15417 -392685
23351 -392685 -212410 -87573 94494 405540 626560 451824 -50175 -269610 -243187 -358321
23341 -358321 -167706 135154 195077 -161819 -443424 -483970 -116682 -81590 -40813 274994
23331 274994 124917 -347777 -808035 -989975 -707550 -581807 -635348 -506549 -251317 141684
23321 141684 285175 384847 253200 136307 265762 224943 295426 375252 198792 -28485
23311 -28485 -128842 -83861 -147821 -134511 -286026 -253021 -22647 248814 308768 64323 -54273
23300 -54273 87061 295108 -19343 -161727 45731 -3617 -265532 -25440 -151453 -146220
23290 -146220 -239370 -112672 131080 416864 388972 357968 415345 272209 217776 158288 -83377
23279 -83377 -466283 -560734 -435817 -183122 96054 -36703 -188550 -99652 -424932 -641035
23269 -641035 -408123 -305410 -29917 181521 565084 386910 469424 273378 104380 -70978
23259 -70978 -144326 -151129 -225693 -36591 169138 27629 70554 -723 80569 113371 168048
23248 168048 302399 -30815 -363665 -276503 -244694 -130848 -346107 -238034 19711 36291
23238 36291 -178553 -488525 -550406 -313323 -218824 -128462 -398326 -522464 -601779 -642227 -777006
23227 -777006 -385144 -73516 371920 -103921 -417542 -246265 93209 366258 235376 -9513
23217 -9513 81063 -226340 -610881 -844506 -677645 -588961 -667850 -267491 319266 552479
23207 552479 271740 -75039 -181290 53530 42462 45341 129024 -63478 -235580 -260696
23197 -260696 -256943 -228318 -48536 -91801 112579 -182372 -289516 -163623 -2680 236977
23187 236977 183023 50991 -222997 -377379 -96751 158513 4226 -241522 -175183 -217026
23177 -217026 28588 203161 497494 589224 145747 -7071 -321805 -335708 -163945 -105349
23167 -105349 -81783 -58588 -63881 194502 489124 480428 333983 82302 -228606 -365985 -381618
23156 -381618 -16842 89835 44597 -120301 -34721 -85522 -212199 -252379 -333446 -250021 63383
23145 63383 552749 449310 -215756 -343973 -233121 -157517 -198366 -534262 -419548 -344650
23135 -344650 -169244 -130784 -203127 -282588 -160390 -233467 -594980 -463585 -253158 136552
23125 136552 568124 682167 240020 129717 -23783 15821 -3950 -134029 141997 -175368
23115 -175368 -412190 -138898 22981 135358 234053 -65467 -371584 -404282 -207058 -101071
23105 -101071 -181169 135879 127850 -163974 -235569 -45449 -23316 84164 56200 -103097 99152
23094 99152 -144892 42236 232964 44520 52493 219235 263038 228639 247609 54580 188083
23083 188083 118405 92657 487681 394886 371105 332108 256452 254365 429663 460710 367239
23072 367239 109196 18601 -56757 227008 267141 -126435 -633022 -1082618 -1014754 -727343
23062 -727343 -319055 -53512 221080 54489 86939 130078 96662 100291 278892 -3859
23052 -3859 -150544 80072 207358 252922 -75197 -246492 -465475 -290528 -184446 25831
23042 25831 156063 76055 -22070 -403840 -625974 -489742 -198055 -69897 -19607 147347
23032 147347 208129 209500 264466 314740 306041 -646 -1685 354505 965156 909598 694476
23021 694476 162905 -73213 -124331 289591 526604 480907 325510 195780 89981 416489
23011 416489 369180 155834 187575 57863 -136848 92443 -260122 -429931 -105838 320205
23001 320205 -17583 -19220 210088 465207 270363 158812 146070 -34570 -279572 -70115
22991 -70115 -121121 -110398 -68460 -142417 -35301 150126 -82875 -293760 -239601 24541 225880
22980 225880 -126798 -538189 -350105 -148184 64132 161238 -72408 -494851 -906247 -744299
22970 -744299 -679488 -926877 -500098 -63912 -34690 -217568 -525539 -302607 -122568 9798
22960 9798 81490 -52256 -229914 -157527 -116794 6422 141017 -282756 -820781 -597011
22950 -597011 51003 333044 240218 82209 -306054 -534128 -550595 -391208 -343754 -162799
22940 -162799 15710 475216 605582 484673 415927 517486 741124 588239 559268 219618
22930 219618 20084 253529 303190 64301 -244197 -227370 -175140 -304627 -260482 -460470
22920 -460470 -314765 132879 -32598 42245 200244 -138193 -290325 -99245 53864 340938
22910 340938 170065 12458 -365476 -388202 -321478 -237200 -40777 108206 -173332 -257356
22900 -257356 -88457 29516 125779 247890 177470 -82596 -237100 -257222 47662 124742
22890 124742 178285 -82478 -416881 -329338 -245745 -212250 -83430 149872 151381 148092 253680
22879 253680 42610 386450 422516 140396 51421 198609 -62104 35505 30687 -261158
22869 -261158 -280824 -128834 -154688 4877 85375 23840 -149728 -30801 190596 436536
22859 436536 491194 501908 459304 -127451 -611678 -561843 -591736 8289 309871 475948
22849 475948 577357 473507 466968 115041 55158 283963 551484 694140 485668 221922
22839 221922 -49208 -89393 -164947 -327913 26147 27763 -256110 -228021 -271906 -183525 -241825
22828 -241825 -476828 -709283 -720240 -644915 -459586 -84296 104372 -14321 -446895 -204360
22818 -204360 -362114 -49179 245339 266858 320696 377527 303607 457595 710415 142485
22808 142485 -20733 165229 331764 107289 -71194 -40967 30917 -135602 -308016 -326891
22798 -326891 -327017 -32402 -38898 -105136 -52944 290598 459716 281358 204687 9082 114570
22787 114570 -117585 -90585 140294 317307 528370 99177 122864 -81572 -374562 -645397
22777 -645397 -270429 -206508 -109712 -9734 18909 -225212 -600506 -476417 -174246 -276049
22767 -276049 -353502 -172189 116834 215031 150749 76360 54846 -298359 -230213 79080 502235
22756 502235 593407 661328 485570 358740 103831 291439 548883 530920 229079 -32131
22746 -32131 -92987 -87100 165498 -124174 -538724 -123382 591204 421219 72209 216253
22736 216253 403824 621646 261202 175858 498440 641080 330288 363948 402580 410726
22726 410726 482364 210512 39140 -178981 -86520 397751 634030 129026 -183909 -127053
22716 -127053 -371431 -173984 -128114 -314718 -722488 -576012 -399799 -276913 -92854 -136461
22706 -136461 -17305 -128740 -142307 -161159 -315322 -517233 -532260 -607411 -467431 -323916
22696 -323916 -362074 -441947 -409233 -60136 56544 141583 -93332 182646 390371 228543
22686 228543 -168 -261948 -404252 -248068 -264482 -475828 -497655 -546123 -756096 -572308
22676 -572308 -723834 -739779 -200686 -72721 -227012 -256268 -417575 -446144 -451976 -480802 -184502
22665 -184502 141752 48125 -212436 -332241 -313034 -526585 -616564 -410343 -193842 42728
22655 42728 -143047 -320380 -582189 -521597 -490263 -577988 -490396 -461558 -725760 -643052 -466716
22644 -466716 -165287 -57805 -250814 -159721 -24372 -106668 -392771 -593631 -450039 -153705
22634 -153705 117132 211811 65458 -549097 -783552 -681645 -698201 -606297 -521399 -317521
22624 -317521 -171446 -106248 -207291 267091 233475 -279231 -363347 -484432 -275145 -200040
22614 -200040 -246963 -77259 597 -75840 -289361 -307342 -486759 -404066 -412014 -183164 -227890
22603 -227890 -202446 -369348 -566466 -252785 -225423 -122491 6822 -104742 -35786 79780
22593 79780 154730 141303 489006 568136 373602 -171034 -523657 -696851 -545733 -1030643
22583 -1030643 -919150 -474102 -359046 -277013 -14792 -70850 -485639 -634215 -836242 -617171
22573 -617171 -82655 117907 -76977 -134501 -61401 130471 217065 116693 -252087 -194027
22563 -194027 -12282 381140 651564 626968 368898 -13433 258207 573841 217751 -141261
22553 -141261 -481808 -733943 -333654 -109924 121464 189120 -39108 122103 383412 279608
22543 279608 180280 -34006 -4205 140370 69505 92086 45383 -102394 -479273 -688124
22533 -688124 -733454 -686736 -320007 -356382 -540274 -351529 -187764 -259312 -650921 -605547
22523 -605547 -669754 -463618 -282071 -198043 -75131 -98009 -36935 -34518 -139642 141869 111369
22512 111369 -4182 -51261 3475 -129183 -114355 38020 -440597 -536316 -279058 -203220
22502 -203220 -214395 -13274 -66665 21781 291043 122870 -267126 -193740 -352 -3105 244205
22491 244205 354919 218557 405342 256408 55197 190374 181633 -197269 -53652 199236
22481 199236 182570 182149 271421 66905 -158387 108958 375613 44694 74373 17800 -100887
22470 -100887 -266882 -259001 -354868 -306044 -326461 -170944 -34072 -242384 -515987 -313492
22460 -313492 -255896 9199 380956 205417 -124015 -13629 128858 -51275 123881 69230
22450 69230 418353 667713 424111 232736 87465 187082 105823 194857 -3123 -19379
22440 -19379 -51736 -6519 -72667 -65418 -38222 -62549 -18975 -112131 -254593 -154185 139495
22429 139495 511949 734474 903383 390183 -63019 -226090 -317325 -292395 97262 108652
22419 108652 -137879 -187377 -145008 -341653 -347855 -462049 -624800 -694959 -619153 -367323 -480163
22408 -480163 -386134 -451411 -554955 -712501 -131510 364853 351991 -54355 -240791 -167445
22398 -167445 167572 -241304 -289802 -333150 -758915 -703757 -316532 -224525 -202064 -292706 -287813
22387 -287813 -152668 7904 453893 307799 186709 -53667 1599 -192522 -1431 177660
22377 177660 -58427 -443405 -168615 -61084 -445295 -403655 -126713 -403896 -410019 -446407
22367 -446407 -54178 571724 273878 -344028 -306180 -213840 -216253 -64729 -31284 3772 31259
22356 31259 9263 22579 -41203 -198050 -489458 -473305 -4037 357293 618981 261869
22346 261869 -128749 -204056 -92201 11246 93400 -55519 -127570 170877 325376 251967
22336 251967 329306 286399 -9033 200700 263178 -177886 -521149 -555825 -253001 313924
22326 313924 531004 316044 47958 -125028 -367360 -435930 -625132 -725866 -383164 -51399
22316 -51399 178012 27903 -131206 -58097 -81909 283843 416939 393257 139946 -81376
22306 -81376 133918 621134 624564 422031 206341 426089 761457 541363 182618 -201873
22296 -201873 -194885 64958 444630 280794 167670 -14266 -189099 -25993 -13668 -182078
22286 -182078 -259506 -97252 90636 210487 433687 189440 21418 -187642 -78013 -41697
22276 -41697 125121 183676 111218 -239460 -258552 -320349 -743673 -740595 -419140 -13277 4440
22265 4440 -376702 -226666 -94440 -74082 -177827 -174441 119896 546953 518407 425339 635075
22254 635075 654970 299587 398440 463014 146654 -314385 -446449 -481910 -180107 110985
22244 110985 455851 453835 220467 102193 78455 -312303 -670254 -339434 -49249 -181718
22234 -181718 -488935 -430123 -502192 -493456 -444259 -114758 -89570 -268906 -198491 -313097 -151911
22223 -151911 291002 563809 364839 -220562 -381802 -225479 -26531 63961 -88890 -443522
22213 -443522 -565147 -233437 -87863 -135890 -356569 -492428 -621823 -603758 -363059 -634598
22203 -634598 -444888 106340 409148 276465 71591 -320096 -231513 280791 323970 346760
22193 346760 132855 249762 -62540 -305625 -109824 215036 586900 485240 131682 99729
22183 99729 168761 -75457 -269028 -73930 -146195 -13592 345850 299079 372618 -19292
22173 -19292 -381535 -674117 -393725 -170374 -285099 -265592 -110794 -338662 -448964 -188865
22163 -188865 -20773 -37062 -121685 -142165 -131541 -244787 -156997 -190409 -352717 -317162 92335
22152 92335 62900 -161143 -188165 -265975 -125123 67514 -30998 -194383 -80938 257570
22142 257570 -27194 -142968 -16308 75116 35070 465564 372607 227319 180226 164333
22132 164333 192818 371327 118562 38349 101206 114988 524164 191981 -416453 -343787
22122 -343787 -244972 302290 490569 209871 -216800 -184863 -45899 53913 -77366 -99549
22112 -99549 534191 744699 605823 414809 358188 98762 -338421 -404568 -157393 -184486
22102 -184486 -318189 -227707 -234374 -365242 -645493 -847819 -560580 -195131 44904 18436
22092 18436 121050 80415 -262827 -335048 -286514 -46467 198231 155524 52630 -93194
22082 -93194 -360153 -210056 -168 119367 258216 49590 122267 209603 -19830 -14345
22072 -14345 148679 103418 14723 15953 163829 278292 335268 474485 506205 339752 248505
22061 248505 8735 -419224 -35158 243246 94084 164734 98111 -101168 -159049 -226083
22051 -226083 -215718 -136973 -108821 120439 -69877 -438073 -467120 -450575 -80090 197215
22041 197215 456788 316963 -15449 -137483 -302869 766 271 -18825 -225215 -309306
22031 -309306 -516547 -449879 -112246 111462 -154175 -358783 -150068 -106822 10792 -208136
22021 -208136 -459409 -320948 -123641 -324953 -490399 -536327 -271186 -246285 -210833 -176284
22011 -176284 -117889 -314948 -206420 -413337 -263617 -66072 -39255 -69368 68677 382519
22001 382519 369288 860963 982428 308292 209731 367574 343783 281085 118399 59030
21991 59030 33631 9504 183929 313998 -108257 -324872 -105342 -72819 119937 507855
21981 507855 603452 513849 290923 211845 16294 -362773 -501548 -457935 -106357 126570
21971 126570 511571 272598 -58927 85418 135330 245239 252324 258553 183414 163434 555930
21960 555930 614013 520070 548702 600156 348893 111856 -46901 -34875 88011 -168212
21950 -168212 -282376 -199486 -36740 -235933 -167746 61208 -297019 -484454 -547067 -474201
21940 -474201 -180561 93886 -2690 34216 -49777 -327430 -330118 -232850 -281664 -320008 -161565
21929 -161565 188171 -16117 69330 308353 123846 -88824 -82926 -47662 26879 262502
21919 262502 598897 622361 590004 587772 532553 354635 -92006 -94654 16629 -35848 112068
21908 112068 287791 212656 18237 -226877 -239377 -259618 -401595 -215493 -228623 -393386
21898 -393386 -277171 -157984 -104672 -98598 44519 31140 106450 238884 340245 350252 138807
21887 138807 -28964 158109 92247 -336505 -470489 -525187 -439279 -28936 -101713 -406062
21877 -406062 -210071 -92389 -43442 -205228 -168267 27861 289757 253445 340457 515235
21867 515235 388638 152688 43246 349223 536287 406842 370551 191389 -73223 -107245
21857 -107245 -144635 -222200 -180824 154305 89857 -179612 11101 306634 442678 125893
21847 125893 -69400 -167379 42460 35114 -108559 -271929 -103373 -49993 301734 314624
21837 314624 352272 451180 608300 99678 -37752 -6056 -267749 -172368 279746 4862
21827 4862 -384999 -273637 35445 47135 -126146 71507 134284 -380254 -326810 -252445 -411443
21816 -411443 -92940 -49437 158767 70555 -183391 -272453 -157046 -109202 -355844 -389413
21806 -389413 -309098 -378674 -450938 -518637 -372423 -143008 -167970 -216225 -97948 -192156 -191178
21795 -191178 -128522 47110 155063 88128 147162 417035 132141 -221276 -4525 132735
21785 132735 17820 210810 362060 323835 310203 168954 35483 31593 254784 423686
21775 423686 74100 -371912 -758690 -276396 320457 486998 500600 566423 473257 204338
21765 204338 -223178 -423162 -243877 -156372 20744 237480 189112 -49309 62013 96376
21755 96376 12919 177753 343905 614465 220463 68899 72434 -2871 -347291 -121838
21745 -121838 99688 274311 87357 -201546 -333054 -155227 46163 -185493 -603141 -657552
21735 -657552 -489049 -107957 -131041 -327448 -351146 91948 408157 405626 200269 58527
21725 58527 42110 -230056 -61987 53169 495178 566737 369926 48856 -170966 98863
21715 98863 75354 -205967 -193116 -242927 -489475 -605114 -620182 -586655 -632597 -525390 -546243
21704 -546243 -514685 -981575 -901705 -1015655 -999463 -949704 -485403 -472809 -528389 -457727 -139472
21693 -139472 -326076 -304621 -38042 -116862 -188413 -281242 -456152 -663505 -615372 -205623
21683 -205623 -179465 -51869 -148041 35148 282542 660725 564627 215939 40360 -70907
21673 -70907 -219033 81981 141935 140262 -278562 -453364 -189453 -136085 -157832 93200 152181
21662 152181 455395 370217 85586 200180 255852 114686 -259364 -187469 -172940 -479083
21652 -479083 -428441 -239563 -44752 280214 42711 -106267 -486501 -134624 401668 510254
21642 510254 588091 658591 282506 -251216 -315099 -221137 -84506 64490 138078 13422
21632 13422 152184 120934 406798 638355 488083 257055 175231 -112806 -257359 -298146
21622 -298146 -181200 -522526 -821887 -660999 -347368 -264236 -305846 96522 218404 72091
21612 72091 -226098 178611 315264 -155122 -333530 -480552 -93627 -263192 -564103 -6467
21602 -6467 318597 227758 -113379 -171941 -131987 28100 -28332 19298 291730 62509 -427914
21591 -427914 -352897 -89887 -285381 -488154 -528734 -346680 -147734 -180992 33949 -130448
21581 -130448 -680131 -1077077 -1148235 -975771 -206023 189978 185884 257973 368083 434503
21571 434503 665010 569232 267211 334545 391350 -51170 -349169 -372064 -126138 -62934
21561 -62934 -307430 -336590 -140576 111831 111785 38312 285341 47621 57188 107093 398288
21550 398288 162274 -190705 -402142 -623599 -318791 -112775 -74676 101866 135788 207680
21540 207680 196072 -283222 -301082 68786 -129629 -190511 -60440 -36566 -53671 164195
21530 164195 -55927 -266978 -385426 -229681 -519880 -946517 -1192803 -1144007 -1056815 -923109
21520 -923109 -363152 41826 72358 217568 380425 371779 399416 419982 569405 639127 631158
21509 631158 369070 -107683 -252127 -242641 -334792 -28441 11200 -301160 -259096 -161403 -250297
21498 -250297 -296779 -259199 -78835 -19195 20494 2869 87078 -302949 -350443 -143664 -103088
21487 -103088 -47141 -82686 95582 225940 281078 313537 303423 151241 -69248 -191616
21477 -191616 -1945 -236263 -263599 -94554 -125407 -144260 8230 -203905 -378368 -240518
21467 -240518 -226867 67854 106635 79622 -128737 -164491 258534 260410 398735 609044 454157
21456 454157 278949 194350 141631 3345 -228332 -182166 -165960 -221435 -299892 -361768 -239397
21445 -239397 113787 595800 647867 30996 -328040 -302028 388873 467304 371737 139251
21435 139251 165409 148691 268824 173541 -35658 -326467 -144490 -240101 -271770 -45664
21425 -45664 140756 51215 12493 -74047 -268138 -215086 -254392 -317412 -145358 -131472 -111570
21414 -111570 -241927 -333342 -94389 -48217 -168166 131392 394642 107680 16260 320053
21404 320053 296063 341353 473234 396948 -105922 -372913 -412084 -315669 -10438 -100694 -144173
21393 -144173 271952 260639 3148 192283 722108 695552 394634 216239 135095 210567
21383 210567 320410 223301 -204318 -308165 -48749 127745 -124695 158254 145927 -58676
21373 -58676 -407110 -542292 -868307 -675007 -147034 25652 219142 146649 -43167 -369358
21363 -369358 -483219 -253846 -593 550756 589986 543782 395098 167944 -130447 -388782
21353 -388782 -474031 -386479 -266546 -400567 -273351 -314383 -490718 -469809 -381254 -367603 -247310
21342 -247310 -349766 -385835 -305470 -642325 -732108 -593849 -301620 -159309 -60064 -283225
21332 -283225 -498462 -147919 -17157 -447830 -411914 -74739 176802 -201098 -104973 215497
21322 215497 241067 -25173 -171942 -403166 -514353 -512745 -89117 -17392 96884 212524
21312 212524 116643 -1130 -322874 -534513 -482812 -428118 -521383 -509137 -506284 -375150 -497095
21301 -497095 -568690 -163297 51634 91206 -43564 -216418 -323819 10781 246510 189192
21291 189192 77017 -16703 123358 222839 358637 -27340 -128252 -80955 127150 231860
21281 231860 188089 404991 211011 32789 -187108 -58828 70919 33887 87096 -86117
21271 -86117 -403124 -284270 -389928 -170558 31849 63046 -85972 -233798 -422148 -348629
21261 -348629 -486578 -671608 -737074 -707302 -377811 -311888 -15074 -47592 -12032 7301 -274385
21250 -274385 -428113 -323591 -104330 20775 -83559 21536 -74695 -151565 139044 138258
21240 138258 -113258 -144574 153458 36933 -310821 -513182 -384418 -39099 134775 -55641
21230 -55641 -79142 -129556 -177086 -273248 -246206 -205233 -54379 -90840 -155745 -158863 -264618
21219 -264618 -479365 -269477 31803 140660 403459 368285 281096 -280727 -319566 -275718
21209 -275718 -396972 -87104 150965 27305 -145704 -231837 123000 276045 189907 -199545
21199 -199545 -316400 -111881 85102 -236513 -371885 -278289 -260289 -235752 -59724 -314011
21189 -314011 -207676 -227431 -420515 -387924 -388151 -423477 -126968 -282671 -221647 72986 -95739
21178 -95739 83034 382156 727399 580776 105285 -13519 -250078 -318830 -471185 -555707
21168 -555707 -377364 -25210 -157666 28341 244501 68685 -6267 -52878 -70908 -129849
21158 -129849 -166819 -384526 -605175 -640830 -369657 -536934 -488970 -339530 29434 436835
21148 436835 693329 312407 -256224 -67898 224188 39268 -210832 -316977 -361391 -281199
21138 -281199 -620870 -515518 -195613 77572 235563 285030 451362 582554 776113 754758
21128 754758 576441 586640 586156 236872 -101202 -222902 -386027 -130953 -130276 -474357 -512109
21117 -512109 -261977 -330910 -321442 -429451 -494904 -446503 -259157 -5271 94672 33651 14426
21106 14426 284335 507350 268434 -94218 109460 390886 257047 258392 123673 169375
21096 169375 -283536 -158681 83308 -60791 -156401 137333 303457 197851 -131181 -328333
21086 -328333 -53678 -48644 42726 27229 -17120 -147588 92752 195012 61288 42855 41408
21075 41408 -58116 2158 -23978 26249 -28254 -13230 -218065 -248552 -266414 -75971 25168
21064 25168 313580 546635 541242 336921 151290 -20800 -194517 -206546 119596 220637
21054 220637 121523 -43177 -485281 -612014 -249901 93777 246112 201862 134519 -22874
21044 -22874 -261194 -417314 15313 14760 -283033 -283986 -23406 94680 449977 455191 470466
21033 470466 277801 368346 99908 132262 163637 17715 -204666 -54758 -128248 9955
21023 9955 148442 170274 301181 93382 -39034 -54129 -412795 -507573 -383654 -12721
21013 -12721 153157 213135 -58574 -281591 13087 14548 -265275 -310199 -440268 -475728 -339386
21002 -339386 -336218 -556398 -610082 -567677 -150783 133559 57405 6743 -134153 -412397 -470077
20991 -470077 -458487 -463112 -293246 -85136 -338665 -510760 -511201 -400565 -506421 -209433 243770
20980 243770 363442 -122865 -370418 -372287 99929 -211619 -499302 -51995 521673 457780
20970 457780 272922 -47611 133858 -67132 -118455 109893 -107351 -585781 -559523 -161293
20960 -161293 118083 34658 -45298 -194046 -67351 -17954 -5937 -21758 -127628 -126404 -489680
20949 -489680 -684148 -642321 -870364 -692840 -474146 -117970 27064 21305 419487 520998
20939 520998 -142602 -304585 -383593 -623461 -442458 -389660 -481977 -590463 -278250 105746
20929 105746 7232 1153 240215 115333 163216 3413 -402097 -186328 -813 -20066
20919 -20066 -269532 -332697 -410768 -299012 -176822 -105737 -2390 -1119 -155205 18166 168612
20908 168612 78169 -26651 197801 -32439 -122334 -130332 -189141 89898 -1043 -281109 -165669
20897 -165669 58383 34297 -118692 25371 306038 17303 -223022 -351726 -43797 229112
20887 229112 163103 -31881 213854 400701 -141546 -591166 -564604 -120583 -114953 -157373
20877 -157373 -5831 147713 28273 -392995 -394870 -111075 -23726 205255 269084 129640
20867 129640 -7421 -71134 -303042 -422295 -410960 -474810 -234806 -74650 394501 327990
20857 327990 344439 326228 137527 -210537 28717 43222 98670 -293422 -387643 -312177 -584847
20846 -584847 -595009 -361381 -589280 -629633 -386437 -389641 -638823 -515110 -325057 -135293
20836 -135293 -400 -242016 -491757 -451676 -348794 -75871 -16900 -156296 -211157 271261
20826 271261 317097 -162694 -183227 -228842 -345913 -587672 -511529 -204929 170117 138159
20816 138159 -149721 -247834 -188594 -104526 -203737 -651984 -635099 -390629 -156159 -309682
20806 -309682 -332006 -344188 222605 429375 433497 522303 509610 330539 240020 329769 472880
20795 472880 383386 287788 316878 224358 61492 -235679 -195056 -384906 -401037 -234339 82117
20784 82117 215340 130584 270073 326642 209569 224460 93799 -22594 -132741 -236570
20774 -236570 90344 370201 26911 77034 361281 180626 112219 -214093 -468404 -428972
20764 -428972 -68820 248945 465383 524200 358262 109426 -344845 -265973 -26 119736
20754 119736 209880 255313 349267 223519 409786 503190 -158967 -347759 -388567 -356381 -460288
20743 -460288 -179256 145262 200385 -97542 -288505 -411523 -336873 -96795 69657 94119
20733 94119 374566 500328 497054 444834 121084 -146500 -227193 -202979 -365397 -613165 -552079
20722 -552079 44551 332404 175582 84656 -20594 -112463 -64292 64909 -81513 -440691
20712 -440691 -471107 -146316 42198 -138016 121348 150558 -22155 -95422 104645 220695
20702 220695 68596 -164597 -32928 205452 148296 317271 266033 223854 376826 377529 269192
20691 269192 -25715 -104690 49710 493969 473230 202626 91584 -105338 -383049 -569579
20681 -569579 -471755 -398905 -368124 -496621 -485116 -579449 -555989 -492110 -358489 -181046 -461129
20670 -461129 -553747 -231034 73766 667923 778114 361378 165943 179502 91937 -105055
20660 -105055 -119441 40411 147964 -36537 -305852 -473704 -233770 313176 272296 16093
20650 16093 -133204 -655873 -441478 -66346 -345737 -414386 -387666 -502672 -669755 -361177
20640 -361177 44322 196267 238541 417133 337003 64473 -443857 -586251 -312151 -355284
20630 -355284 -67137 -213115 -186194 -384220 -609722 -335202 -30692 96818 263347 -27967
20620 -27967 -274946 -330379 -474393 -438498 -347766 -170394 24925 169665 97274 -332400
20610 -332400 47001 134185 -446850 -399994 -581318 -516433 -672402 -558325 -401346 -610914
20600 -610914 -331152 6710 150705 426635 551514 175182 68133 105600 -87843 -9268
20590 -9268 -8575 -312441 -641894 -519591 28201 176166 -5465 -507301 -116709 147416
20580 147416 256932 48800 -322002 -521408 -355189 -347238 -583402 -734183 -842117 -490427
20570 -490427 -400051 -410905 -541976 -533666 -305318 -155171 -280132 -220717 -39628 383183
20560 383183 893142 803951 412572 341353 53925 -182429 -352841 -199674 102226 370372
20550 370372 427353 304528 -111584 -289354 -163004 202503 444669 324928 -70605 -136350
20540 -136350 79615 349493 260537 -310100 -713409 -532581 -592275 -716623 -600390 -747325
20530 -747325 -461889 -464360 -182929 58339 277729 -68023 -497580 -643632 -491832 -333846
20520 -333846 -260930 -302902 -32446 -17414 -104365 -574417 -346217 14324 181420 -276463
20510 -276463 -429079 -364212 -32592 -48403 -80931 -299944 -199960 -678328 -944490 -989363
20500 -989363 -674027 -573294 -298924 -205015 -715818 -722900 -643075 -546567 -257096 -90206
20490 -90206 -135625 29861 115554 -127846 -114854 101750 429661 83543 185492 327060
20480 327060 362507 288910 515711 455438 282440 -388968 -442915 -360667 -816426 -609367
20470 -609367 -158841 49201 99151 79095 -263726 -416435 -219119 220062 190358 152827
20460 152827 -41984 -62774 133075 165860 147476 -15312 68470 365876 597092 276270
20450 276270 -114721 -15846 10248 -367737 -610411 -377561 -53768 138932 -89382 -74529
20440 -74529 4783 44540 117478 256394 288540 233082 -75330 -112767 -184265 -379628 -540068
20429 -540068 -589180 -604856 -271480 -135395 -150794 21310 132381 186895 33080 -302005
20419 -302005 -349064 -31225 -28168 -229018 -13769 185962 13858 16859 -27742 -185206 -23230
20408 -23230 -35783 -347616 -437692 -403066 -377607 -297981 -281525 -340258 43348 382481 284550
20397 284550 -420093 -659285 -351930 -210172 -202106 -53331 139711 34044 288374 200655
20387 200655 -179964 -10075 154274 518742 372778 100737 105630 -349360 -348802 -544037
20377 -544037 -911345 -772694 -175387 12628 -286519 -321966 -425141 -535394 -463773 -340015
20367 -340015 -171785 75765 429216 478209 96053 40287 -38443 -34181 -323615 -198670
20357 -198670 -2980 74249 -24762 103152 116623 244391 284197 65742 93467 -134330
20347 -134330 -144969 -101470 -570994 -654940 -286523 72557 164905 -8819 -294245 -502482
20337 -502482 -616837 -636257 -626616 -442451 -86436 95041 52024 -212190 -282124 -140708
20327 -140708 -24015 103436 470069 591565 513555 414781 178699 24042 -192311 -129013
20317 -129013 -99134 -277678 -83786 22764 -209781 -421556 -468662 -363287 -163062 -137634
20307 -137634 -102568 98550 227044 -27065 128720 -195960 -191319 18097 29729 -41207
20297 -41207 -148408 -146527 75363 180669 38607 23274 176075 89259 -209270 -412357
20287 -412357 -307635 -255289 -222335 -82170 -216920 -404652 -352130 -567909 -273383 -55751
20277 -55751 22546 84853 274527 206709 -47413 -234452 -299222 -263692 -276018 -130410 -40528
20266 -40528 155927 295254 180264 -131863 -170077 -162001 -7968 -337010 -169019 2213
20256 2213 73790 -41455 -168569 -353414 -286461 -253381 -244307 -14765 260836 579107 519459
20245 519459 417226 168854 -16795 119796 11203 -212829 -249487 -339771 -438247 -176472
20235 -176472 -290247 -553083 -255681 -60128 -108212 229722 274023 82465 -8603 -329968
20225 -329968 -320562 31119 99269 88118 308348 83715 -3093 237503 560858 362641
20215 362641 -6300 -197548 -277476 -265346 -318136 -443039 -397069 -144588 99638 396881
20205 396881 108831 -222171 -88402 -24993 -175034 17953 58895 -5115 -225100 -220070
20195 -220070 -19571 101513 357579 107879 40520 69653 377143 546948 115792 -59577
20185 -59577 -203100 -343502 -361102 -398983 -460901 -130012 227365 88112 275742 374925
20175 374925 287912 6175 -191698 -26913 43976 348927 191121 88594 -91489 -133369
20165 -133369 -158361 -370467 -353303 -286594 -458452 -364076 -261864 -64491 -28196 -339279
20155 -339279 -83063 167441 117938 206484 14595 3493 102731 228309 398273 192418
20145 192418 -37201 -61242 -184761 -233614 -349320 -577384 -397036 200648 175426 -170333
20135 -170333 -210192 240196 87755 -206285 -103573 -170110 -175327 -189163 -37035 -56268 -386805
20124 -386805 -604389 -401536 -215892 -272381 -465938 -248667 -550701 -663537 -796496 -894079
20114 -894079 -764114 -447257 -199496 -33503 -47844 -54321 -41466 130576 254329 43881
20104 43881 145420 -76331 -36835 244311 87231 -538959 -720533 -648451 -634414 -170986
20094 -170986 94705 240245 193523 305411 227511 -291869 -406504 84937 741791 705305
20084 705305 532897 441106 669978 749689 408388 146667 168830 141880 -32835 -27777 -115973
20073 -115973 367750 80423 -382184 -236715 -146681 -484564 -735489 -678420 -562512 -887571
20063 -887571 -782372 -957289 -553535 -317456 -249724 -276390 -220989 -249827 56279 22682
20053 22682 -291456 -637202 -622618 -691822 -1064777 -987311 -630199 -411453 5140 -79938
20043 -79938 -300925 -47703 83993 99628 117335 201820 476861 382970 250766 -93596
20033 -93596 -136511 -112646 -32873 -187654 7665 -227902 -473715 -555968 -567158 -402937 -283704
20022 -283704 -59278 -165733 -296904 -364743 -89500 151400 -93957 -237701 264571 510203
20012 510203 461208 203280 372493 519864 581887 631885 810516 593345 151950 -70076
20002 -70076 -123228 -189753 -160748 -267952 -462733 -620211 -736649 -623105 -496679 -451644
19992 -451644 -193242 -180628 -12784 153216 156205 -85913 -207131 -187030 141549 120114
19982 120114 -128362 -165454 28716 75021 -347929 -190008 -290672 -498237 -364221 -224835
19972 -224835 -1130 99591 312212 632697 419205 41059 4157 11567 -243691 -108668
19962 -108668 14730 109207 54009 -366800 -343195 -177741 -348839 -358764 -160461 -6416
19952 -6416 26329 -119602 212327 195425 -138030 -323032 -58445 277844 300683 282807 188761
19941 188761 71693 32170 104336 398800 724820 1038504 715481 -127983 -546562 -397766
19931 -397766 191362 69262 -132631 -294091 -294616 -396425 -300213 -495963 -639729 -659596
19921 -659596 -200734 634257 727130 45725 -233345 -176290 -96474 86448 -212811 -388884
19911 -388884 -657727 -177228 115045 -130698 -355483 -525768 -199940 -41173 -74299 -506874
19901 -506874 -333050 10012 -14943 113425 205238 368836 245395 58864 -37442 224436
19891 224436 132978 -15195 -345934 -323324 -267722 93620 276738 376763 335357 268320
19881 268320 109816 -53213 -41082 -219828 66904 240363 367275 749751 789012 562821
19871 562821 509398 769959 787019 755804 871454 642385 418589 494188 546667 469624 136960
19860 136960 -80510 76639 21565 -17443 -257825 -80388 1414 58033 122714 48404 -216613
19849 -216613 -357712 -404560 -495654 -421012 -117213 10102 141799 135449 183499 -129249 -186966
19838 -186966 59440 126778 21480 219009 420830 232112 -149739 -132645 -259181 -1110
19828 -1110 470927 266343 139253 304069 118113 110779 154268 404412 53220 -43203 50496
19817 50496 154348 44050 -108813 -216468 98081 309072 179135 81412 139383 -26235
19807 -26235 -127249 -92812 29968 -162210 -133245 96633 124542 -34037 -199957 -95470
19797 -95470 339036 384 -118487 -34174 334446 258929 80895 226418 87177 193936
19787 193936 268471 203383 70918 -307516 -170457 45801 260444 49298 -363614 -568217
19777 -568217 -123153 295512 -260593 -717933 -741328 -393406 -85669 129397 226966 172432
19767 172432 170928 234635 377525 158564 -179268 -468407 -221433 -1222 -2591 -93158 -57750
19756 -57750 28327 -166285 -446586 -116369 157340 183501 324704 359000 273232 433845
19746 433845 567527 154769 -290931 -463543 -467733 -507291 -352513 -31262 97880 -290037
19736 -290037 -362495 -74082 147179 -57293 -434864 -582818 -126896 427120 247473 187541
19726 187541 100292 -34014 -177306 -227218 -257215 -231310 -197693 -175394 26382 141425 458690
19715 458690 512286 207983 233735 355380 264117 111693 -183819 -405238 -180239 -220626
19705 -220626 118757 381552 -65709 -99559 104629 423376 522240 552809 390719 41467
19695 41467 -439525 -283661 -34533 14588 -38898 93617 147496 213730 363577 263232
19685 263232 -191493 -484288 -387859 -379354 -454464 -420869 -508738 -547413 -442534 -183579 50505
19674 50505 234970 520445 612352 656465 610622 1008752 864319 966821 687827 488549
19664 488549 275687 363127 -103800 -290385 170607 554018 549461 381089 407876 135905
19654 135905 153165 149138 439299 339445 112035 -10779 281051 663990 1016225 1070404
19644 1070404 1295167 1658016 1694104 1690853 1457924 1143265 552911 130295 209717 -238275
19634 -238275 -144509 40452 -52384 -76114 -316875 115813 132350 37848 73226 -73310 -123271
19623 -123271 -261046 -450994 -216914 -67791 7661 187508 -58381 73490 217600 57358
19613 57358 -180105 -276484 -211855 -105385 -488263 -393187 122536 224772 340734 611988
19603 611988 323846 -8955 243656 291365 230615 122501 160845 288347 266036 94942
19593 94942 -64112 -316974 -231188 -326460 -514591 -28607 132153 -9149 -144944 -309756
19583 -309756 -364287 -474444 -375264 183633 51607 -43895 49872 165198 123055 -226337
19573 -226337 -214229 251943 129294 -289120 -377545 -540951 -767217 -578362 -503612 -229194
19563 -229194 -152477 -40140 503686 855438 446101 173115 76880 -436151 -516722 -506840
19553 -506840 -479441 -653866 -667827 -241434 -16836 101710 -306397 -654166 -233608 -227848
19543 -227848 -36191 -43380 2427 220680 91710 -37085 -153085 -370775 -360681 -390712
19533 -390712 -159373 151097 497040 313060 334266 230791 109123 101319 -67757 -302795
19523 -302795 -440228 -507876 66600 196389 206456 291547 17957 48537 214433 49556
19513 49556 -15953 17952 -173557 -369881 -465139 -569868 -471507 -272102 -301036 -660715 -836075
19502 -836075 -860060 -786248 -422413 -266649 -149012 179758 198989 210963 114969 -196799
19492 -196799 -333015 -203331 -295182 -440025 -242904 -305191 -136673 -13946 -8167 -72035
19482 -72035 -104358 -496165 -255901 -229770 -621576 -714116 -498676 253692 348331 121303
19472 121303 44416 134552 126179 4802 -203366 -376005 -377933 -251772 -434265 -386495 -114003
19461 -114003 -83007 150936 168787 393371 304686 204849 -155228 -258324 -266178 -70434 230100
19450 230100 344957 237316 397945 536913 347345 281917 319687 271872 73606 277925
19440 277925 106286 -101521 -404573 -566602 -330636 101054 493705 343529 36552 -310256
19430 -310256 -415003 -44603 134985 -149906 -288734 43663 131498 95629 -223054 -201042
19420 -201042 -102490 -82261 -272591 -144389 -406691 -476551 -403338 -382037 -515159 -468921 -197428
19409 -197428 -247377 50291 307425 109664 146321 151913 -123757 -400755 -470849 -445281 -602922
19398 -602922 -431734 -431894 -361050 -398800 -526644 -535787 -433926 -589585 -559913 -80834 274445
19387 274445 362398 136001 -76860 -113643 -111123 85498 135900 252812 484040 324727
19377 324727 -341051 -293717 -223406 -221032 -297073 -6336 223384 215618 247629 228834 262140
19366 262140 379146 252550 208588 102551 142469 112145 311427 625429 368983 -101627
19356 -101627 -38239 -48787 -248453 7690 106497 1047 179496 396426 470063 361698
19346 361698 308923 821779 506321 142075 241777 210432 132612 180410 434109 560312
19336 560312 235599 -111538 -73420 -252676 -232679 -148567 -206001 10963 299711 269373
19326 269373 236377 309875 117220 -350099 -363996 -200471 128209 81738 295230 277683
19316 277683 214468 179377 -13016 31574 -48077 -2974 -34089 107637 -220151 -96899 25192
19305 25192 173009 25289 -248060 -550924 -226324 -39745 123983 236461 109260 -27239
19295 -27239 188441 528209 691976 597331 786765 543218 126090 108002 172880 473443
19285 473443 578674 348131 595648 484845 300949 -295179 -571087 -254731 222178 471178
19275 471178 661961 331790 -326003 -554178 -495788 -159755 97785 207673 290573 -205107
19265 -205107 -444815 -255146 272795 187134 344129 211344 171176 245643 492467 143648
19255 143648 -209 235505 360036 356874 617329 894007 696853 304864 145525 151599
19245 151599 622931 968117 1058413 934948 892782 919281 607951 544265 482149 345014
19235 345014 221641 303379 302812 349179 -16900 -89603 -129397 -250300 -292497 -128344 62558
19224 62558 -30542 -175987 127531 473551 657477 934030 1140785 975991 952143 858013
19214 858013 870711 662703 378574 234438 218603 693893 777062 568698 675185 371410
19204 371410 372015 195246 317782 591785 534419 638695 735895 591989 575772 306030 349271
19193 349271 336389 531139 745052 442094 344728 708203 814759 1046549 1213786 1206125
19183 1206125 1151091 1058318 863981 860172 1034642 1251845 1399476 1773602 1761594 1370534
19173 1370534 1133721 1003709 1229422 1550803 1808345 1634233 1978231 2513700 3021448
19164 3021448 3140672 2988878 3264433 3800999 4292715 4287611 4183554 3796058 3762666 3849807
19154 3849807 4060089 4472474 4386821 4169568 3685949 3752209 3926082 4452891 4992347 5582268
19144 5582268 6106046 6494590 6947859 8099281 9179330 10795291 12357572 13669235 15472668
19135 15472668 18093556 22232381 28106629 38581566 57705476 88456624 125297620
19128 125297620 153781302 173883294 206157270 246128424 257989404 206058300 139544157
19121 139544157 98268729 75000388 61105076 52299433 46476041 42714215 39759405
19114 39759405 38120374 37716483 37352700 36589160 36545627 37078232 38938203 42369623 49573104
19105 49573104 63364988 88291099 124628693 160321732 183500468 207347793 247059867
19098 247059867 279984402 263070719 190530736 130795124 96624102 76788033 64473318
19091 64473318 56055960 49510854 44699662 41236578 38211963 35404448 33107189 31585021
19083 31585021 30211700 28826803 26984361 25240230 23619275 22251251 21208638 20549773
19075 20549773 19585496 18388796 17590125 16922146 16366314 15628537 15184870 14784061 14379056
19066 14379056 14626411 14479925 14164835 14003321 13816473 13560652 13089384 12410980 11823396
19057 11823396 11562116 10902948 10733474 10879913 10530513 9987222 9295255 8632206 7987774
19048 7987774 7957471 8145524 8381054 8194716 7618554 6960775 6792271 6856603 6881589 6598654
19038 6598654 6080157 5760070 5623862 5279004 5452138 5780919 5734890 5875422 5928098 5785859
19028 5785859 5158818 4450050 4159111 3988624 3758211 3698930 3823550 3815471 3910350 3938721
19018 3938721 3988295 3897675 3699976 3722617 3738029 3669860 3020668 3096370 3178837 3018923 2835054
19007 2835054 2608674 2664980 2674348 2340067 2208549 2110191 2125148 2284600 2131441 2051904
18997 2051904 2321235 2257109 2010370 2142304 2202061 2371790 2242981 1884174 1262625 1127396
18987 1127396 1468363 1525234 1609981 1680079 1769470 1734968 1767924 1559879 1130684 1001991
18977 1001991 1272017 1687215 1552954 1353102 1626325 1483515 1321483 1153042 1192117 1175872
18967 1175872 1361935 1538323 1145397 959674 829319 802872 752905 801034 843875 887351
18957 887351 1520991 1514065 1256189 1134591 1256144 996886 927677 1385390 1500635 1076006
18947 1076006 833071 657841 607225 462883 548625 1030521 1059914 970274 875669 840074
18937 840074 638241 794578 824156 971839 946693 816046 507252 353483 267191 609541
18927 609541 1022294 1033697 843564 592310 225139 27436 -58414 -35738 -153001 61211
18917 61211 262354 323887 244978 9547 -226613 -270891 -217045 108847 341061 442078
18907 442078 626298 824787 778614 589306 620820 626007 631912 652987 448626 347418 433547
18896 433547 273343 114858 93522 -38758 83972 454569 487731 242569 69016 206789
18886 206789 353036 123475 -262269 60730 325290 190405 -17729 -158938 -129491 -93039
18876 -93039 -50800 183613 212098 451803 621133 516760 276453 79674 83020 97129 367670
18865 367670 306207 -136612 -142986 23530 167422 272214 115003 -135451 -208851 111618
18855 111618 45981 -41776 180101 253360 217910 347924 174653 196919 621451 656911 501510
18844 501510 786014 877885 682496 605145 473815 280274 691873 796626 746099 584300
18834 584300 346230 -12686 23595 200681 248875 385211 364814 183130 443758 525461
18824 525461 173432 26308 -95278 -90839 35776 -31963 -267109 152922 393135 614382
18814 614382 384589 186199 94388 109608 88563 73654 -154633 -60945 -169205 -284329
18804 -284329 -362847 -592770 -562410 -231761 14014 -14171 -651350 -516240 -144702 -43294
18794 -43294 -14556 54104 13534 236239 191806 -206375 -472261 -377736 -465159 -568475 -82853
18783 -82853 181389 23863 -224459 92573 466288 347340 287020 513732 596024 818942
18773 818942 1298747 1559339 1842733 2016346 1994857 2008677 2272751 2694214 2718124 1990132
18763 1990132 1761308 1503017 1026377 559526 801941 928593 967918 770168 756143 623785
18753 623785 661346 828414 704225 577797 118180 -131460 -217758 -217264 -132366 161514 371617
18742 371617 296846 68464 172128 503670 872874 633337 397310 505675 128761 2009
18732 2009 -168100 -390005 -156293 155235 172138 148095 127101 -29100 -370864 -312047 -4390
18721 -4390 205710 352957 14085 -326629 -410076 -307068 -33366 -99073 185856 345967
18711 345967 5417 362 -123256 108517 128404 217679 257431 474901 537838 508143 610461
18700 610461 708192 656094 585291 486680 654949 622146 634030 501318 436473 782852 1081544
18689 1081544 1164106 626953 374394 492803 112717 -92257 -60218 -15627 -95214 20819
18679 20819 354905 313115 423306 308757 77979 83997 -30179 -187985 66106 171358
18669 171358 182651 475383 672863 841139 951525 1261821 1117706 685281 291204 -303268
18659 -303268 -313573 -1358 -6832 63827 176178 50097 -162164 -335225 -198311 -389534
18649 -389534 -115918 112269 331106 481872 669205 597635 268074 246054 287512 80861
18639 80861 34187 66966 -66192 -338186 -412352 -182392 -29143 30012 229029 114276
18629 114276 -21850 107356 357001 549031 325471 175337 156895 164229 470757 478708
18619 478708 744781 982847 852476 443535 328685 195346 142720 387936 557289 224139
18609 224139 -165573 -161787 199715 151981 118262 211233 253691 140367 126005 6382 -157094
18598 -157094 -117040 173277 -3602 -389175 -529456 -538107 -424598 -125420 17917 115367
18588 115367 225734 502607 562112 454580 282878 370533 318562 809824 1241972 1368825
18578 1368825 1136990 1565645 1738546 2015945 1632307 1694834 1616127 1225940 917424 1048040
18568 1048040 1331025 1955777 2350197 2565905 2367839 2636663 2565104 2180422 1951219 2078664
18558 2078664 2487907 2611772 2609049 2506306 2660001 2772017 3346559 3928999 4722284 5340183
18548 5340183 5410441 5077383 5168745 5366110 5336796 5359364 5586696 6372355 6990718 7054593
18538 7054593 7215528 7540936 8173871 9205231 10375379 12119072 14231949 17144701 21470660
18529 21470660 28112297 39236427 55724128 75871231 95561057 116720006 145433756
18522 145433756 179530975 201306433 199178504 187799872 187408558 194338082 191566581 178556303
18514 178556303 167099330 165553906 176117216 199171426 223198268 227211754 211373619
18507 211373619 195908743 191098897 181828470 155120023 120031284 91547071 73618922
18500 73618922 62246070 54582611 49428471 45049553 41457584 38073937 35508767 33644580
18492 33644580 32005087 30372665 28959375 27272727 26124713 25455702 24833624 23972199
18484 23972199 22976299 22095644 21084984 20405454 19946450 19580750 19211827 18739702 17844071
18475 17844071 17018634 16653090 16048205 15365259 14904679 14461200 14235935 14407286 14542068
18466 14542068 14361211 13591326 13412946 12881464 12218302 11521944 10934997 10396530 9940411
18457 9940411 9667026 9530938 9031177 8447367 8059821 8001764 8055192 8031205 7500053 7392365
18447 7392365 7298179 6997415 6914970 6755914 6510968 6293893 5985970 5860409 5768958 5905241
18437 5905241 5844195 5451339 5452694 5457727 5124100 4721076 4430617 4381255 4183492 4023275
18427 4023275 3802776 3592059 3597031 4060403 3874609 3456141 3443709 3499388 3916121 4000029
18417 4000029 3712735 3290675 3172726 3231520 3171402 3180352 3233818 3179948 3051567 2885628
18407 2885628 3011278 2826753 2915608 3077089 2818942 2442227 2395820 2319774 2354581 2374334
18397 2374334 2212799 2509948 2522162 2489982 2419054 2505963 2409465 2257345 1991976 1758169
18387 1758169 1859346 1997367 1988240 1784149 1290135 1331305 1689222 1706982 1513621 1662412
18377 1662412 1554243 1435674 1606593 1494861 1388577 1346726 1029204 1027956 983627 849815
18367 849815 568538 757682 941465 787177 1214315 1628207 1745087 1433959 1407702 1328512
18357 1328512 1505422 1404458 1145424 842201 1014159 815931 1092723 1095404 950986 704980
18347 704980 611565 446103 469647 415961 857684 706838 344417 36132 -204300 -97366
18337 -97366 -15498 549236 560078 562555 785079 869086 635261 459137 610284 706329 472358
18326 472358 608524 780437 684105 781224 843464 651214 502584 389452 399813 509856
18316 509856 492245 131245 347377 753249 801951 693879 864898 1059614 874419 596187
18306 596187 352958 415434 389234 219092 137570 408966 587588 518065 342182 72431
18296 72431 -66760 319981 292647 125116 78004 147192 302491 329254 143518 262191
18286 262191 436752 278176 311317 415818 360989 323438 65825 118587 573701 686575
18276 686575 514355 212283 376906 590026 572635 833622 829286 852096 852741 573341 569842
18265 569842 495715 598656 410156 230545 28327 -44513 315974 483153 312903 354113
18255 354113 115199 249674 286784 685251 859925 818338 427161 147255 362884 201034
18245 201034 355282 530979 695820 688630 558225 643440 630838 181481 421308 704999
18235 704999 716658 653119 655813 727334 823209 754395 388277 475510 902390 979672 836530
18224 836530 500783 413491 703348 1186255 881928 586634 286579 596209 687314 542335
18214 542335 441563 590660 671442 647878 450570 473876 573737 691938 1173100 907130
18204 907130 651368 763536 558624 719660 675506 627347 583946 821930 918464 845445
18194 845445 1029963 1230304 1157600 1291598 1261570 1167681 1273573 1327469 1486800 1901029
18184 1901029 2591828 2862207 2740331 2508265 2135048 1657706 1961149 2317574 2873100
18175 2873100 3063311 3268321 3447846 4087294 4917080 5411964 6192379 6805710 7562427
18166 7562427 8413536 9390069 10583520 11967212 13281598 15320011 18334159 23274042
18158 23274042 31378074 44807366 65969419 94622969 126431167 157246661 187042314
18151 187042314 217936500 242380912 244073683 214485136 166669704 120705533 89760768
18144 89760768 71463499 60171202 52446379 47360932 43269882 40389586 38443954 37241193
18136 37241193 36808018 36808748 38122965 40955786 46200850 54899887 69999822 92802594
18128 92802594 121676523 151241004 178953025 207630261 236273271 250798724 238681216
18121 238681216 200368595 155986039 121235211 102193849 94165601 95674982 108823673
18114 108823673 138556693 182824141 222642250 245428352 277419425 331701770 368934933
18107 368934933 328056375 228632838 160754422 122802824 100150065 85522569 74228608
18100 74228608 65720040 59076621 53396248 48925535 45604865 42756687 40529184 38643887
18092 38643887 36511682 34660130 33486088 32271512 31490558 30586892 29672794 28510533
18084 28510533 27050929 25880157 24867387 23855815 23174499 22602202 21710617 20819107 20131233
18075 20131233 19692524 19480845 18711013 18182873 17922540 17583571 17169404 16687375 16256246
18066 16256246 15857194 15425405 14956074 14408836 14106610 13609756 13021378 12883529 12451115
18057 12451115 11789544 11459758 11146108 10747937 10546780 10311476 9621636 9363411 9241219
18048 9241219 8833974 8407200 8500351 8532892 8104239 7817902 7880170 7725639 7775741 7761595
18038 7761595 7371378 6986034 6965190 6840764 6859860 6525631 6478264 6461652 6276422 6002843
18028 6002843 5574647 5266332 5206454 5455430 5838384 6168248 5900804 5085344 4479005 4184721
18018 4184721 4194251 4120579 4447350 4489894 4354873 4384931 4437187 4258881 4115033 4205077 4153032
18007 4153032 3931777 3683812 3413975 3528490 3448179 3344539 3277679 2952575 2738079 3384093
17997 3384093 3448772 3393093 3198993 2918392 2752330 2714285 2663279 2832016 2885325 2708925
17987 2708925 2639093 2621203 2605017 2949449 3096719 2842012 2375260 2137815 2247477 2102310
17977 2102310 1853505 1882797 2116737 2459041 2183858 2029633 2158168 2004043 1700371 1308047
17967 1308047 1413401 1485454 1331572 1597835 1898176 2132816 1894657 1906961 1769344 1478831
17957 1478831 1300321 1178890 1018884 1263512 1728015 1721655 1327499 1073258 886577 788588
17947 788588 743426 661632 540340 452346 666404 531298 451194 484769 621138 880778
17937 880778 1370345 1257546 1044438 843580 764553 638413 406094 424463 288742 387531
17927 387531 629733 577875 493289 779456 918820 672098 326535 404834 745759 768430
17917 768430 895859 827466 1100145 1563895 2000908 1999670 1941028 1746470 1624939 1492665
17907 1492665 1435267 1106498 1205956 1515726 1279394 1304339 1206195 640380 505284 665323
17897 665323 578580 688945 1040436 1057122 974123 626304 856469 1536699 1761763 1443188
17887 1443188 1317047 1543956 1420098 1284963 1154097 944294 984790 975017 929921 728561
17877 728561 538085 631681 765154 905783 883350 712324 930290 939177 1436456 1544088
17867 1544088 1642638 1791769 1596024 1380696 1366442 1351769 1528594 1942785 2161679 2156537
17857 2156537 1679636 1402493 963828 720742 647993 593977 613067 736567 1058528 1250198
17847 1250198 998665 575288 441974 162182 -215002 -246943 -27105 164397 -36652 583725
17837 583725 862537 765808 559559 421903 225830 481610 402037 2039 -28695 97934
17827 97934 159440 108695 226440 100930 81078 82860 -63983 -306598 -142869 -45728 24204
17816 24204 158093 283913 380606 793280 875794 906032 689217 -15014 -249690 -55624
17806 -55624 -110644 -99296 103089 -11246 -15772 126958 121549 163577 328134 535646 830698
17795 830698 862484 468234 202352 39982 -76305 92256 602276 610784 372685 667552
17785 667552 661996 530588 485815 130074 179934 386876 493839 526404 605342 160484 152993
17774 152993 319339 481341 546708 513774 662515 777962 480345 455071 505757 677966
17764 677966 369552 521705 232582 -75447 -25435 -74644 -202565 31417 205746 128154
17754 128154 -72938 -113021 -167623 -87184 79944 366317 630511 606757 331081 448409
17744 448409 506988 244519 -150090 -262733 -191535 119212 -67988 -382333 -367973 -401946
17734 -401946 -82073 166631 243508 -160797 -305120 -48596 63468 290861 193948 144765
17724 144765 510149 419056 202145 519392 892909 1005814 577896 -11402 21699 -37668
17714 -37668 39032 303341 514885 212189 -165441 201850 392233 273000 209143 -273807
17704 -273807 -841746 -914140 -470969 -203379 -25943 80052 -295590 -286290 -156595 4043
17694 4043 94214 81914 201515 286342 436190 313536 393710 398774 411460 236998 -151805
17683 -151805 -422673 -829069 -621969 -289691 -231195 68295 256259 61888 -227897 -41603
17673 -41603 371971 463007 617889 555488 464702 -181668 -245024 -68008 -13891 -167984 -328664
17662 -328664 -127006 73876 289960 318440 188008 190761 72518 24162 293885 491215
17652 491215 562568 539050 392806 105460 -61787 -37812 -103132 -60256 215986 237898 73392
17641 73392 29703 265164 262313 362068 249169 63531 306830 278952 -7819 -106631 -5653
17630 -5653 -135345 -22740 -302921 -536683 -483208 -461721 -327638 -184940 -159184 -167524 -175417
17619 -175417 -229823 -515748 -294765 -95579 181266 191607 -3378 -466770 -471001 -94187
17609 -94187 130410 486451 790109 1163724 1311689 1328946 1437093 1403201 1180050 1063068
17599 1063068 936731 672279 369110 253875 384135 527842 359921 217289 461376
17590 461376 389208 518217 533757 779549 936431 1000200 569435 788081 933915 735981
17580 735981 487068 456205 657428 866667 1374677 1591664 1548230 1192851 891905 939037
17570 939037 498272 453305 682376 416624 320209 178211 -8645 -182204 -83516 -263775
17560 -263775 18396 135501 -12043 1110 -93211 -103124 -48671 193901 65624 248900
17550 248900 -78449 -303954 917 426037 254796 118861 424545 883356 898393 678976
17540 678976 332225 277109 389875 290400 88813 237300 427194 518654 101890 -152387
17530 -152387 22526 203718 387210 459323 434437 512433 745655 596135 483032 495693
17520 495693 497624 389859 505192 798116 915528 1064228 893907 734660 502556 650594
17510 650594 570792 338271 84245 121596 372891 601884 602689 647931 902854 1291810 1118645
17499 1118645 611587 223756 33058 202875 586561 634238 525224 761199 1384342 1462162
17489 1462162 1055680 597747 641374 808500 992681 803638 336511 370446 103826 128256
17479 128256 210301 258026 367156 226697 450578 823702 1037312 835328 640008 924383
17469 924383 878026 509095 15172 -159099 -97098 359504 529096 695212 742828 415053
17459 415053 268144 205846 94207 379660 678053 1038599 987426 746600 262333 -75787
17449 -75787 -60700 142883 636167 1073315 914763 1060294 1904085 1909898 1478249 1311933
17439 1311933 1123237 742263 435800 605474 480893 163064 -143737 124804 375127
17430 375127 434377 503565 547611 808046 854172 703614 468722 327722 20041 -545992
17420 -545992 -459008 69819 497042 715808 787615 934555 975129 705031 433043 7670
17410 7670 137449 443804 600954 699198 485613 410448 486955 1049597 1217665 1138841 910422
17399 910422 443080 29181 185328 770138 1048028 753489 767347 975903 1129968 1542143
17389 1542143 1773096 2391583 2606733 2357218 2517654 2933525 3358472 3821664 3837461 3539501
17379 3539501 3223775 3775538 4224209 4253327 4453786 4753503 5346341 6183956 7159083 8477271
17369 8477271 10155906 12485535 15738848 20552714 28792577 41717056 58599615 77173115
17361 77173115 96237827 119457675 147516525 172984755 182667304 178629932 168256960
17354 168256960 162681028 154968340 135714598 108452014 82492369 65478670 55367778
17347 55367778 49774499 47193489 46263068 47712228 53698284 65490299 82277734 101220436
17339 101220436 120790682 144724138 174751968 204101226 216007685 210979836 198426686
17332 198426686 190305737 181191914 159922339 129193466 98096918 76787618 63625416
17325 63625416 54872272 48768594 44015387 39962824 36729834 33993351 31843605 30006631
17317 30006631 28357349 27154568 26114225 24973667 24225454 23300462 22630286 21510958
17309 21510958 20685785 19880048 19290566 18931737 18191395 17380799 17027964 16740068 16280466
17300 16280466 15809569 15030529 14302969 14005161 13707508 13321403 12985767 12596349 12019238
17291 12019238 11377425 11161572 10800426 10592318 10117416 9389570 8830392 8851846 8883569 8742305
17281 8742305 8446582 8109353 7697919 7693117 7918323 7819768 7576315 7283118 6992058 6489784
17271 6489784 6215814 6358125 6099478 5821446 5907270 5662795 5760668 5366524 5258072 4981545
17261 4981545 4742923 4854606 5096749 5187306 4893188 4462044 4460711 4442997 3972787 3792965
17251 3792965 3967525 3776897 3516445 3384726 3246587 3290140 3148194 3309573 3532610 3385130
17241 3385130 3020029 2527318 2664012 2899420 2731111 2616899 2192864 2119530 2169584 2001259
17231 2001259 1827800 1990486 2160970 2358040 2324796 2060325 1773235 1739156 1806424 2055980
17221 2055980 2277172 2120235 2003264 1888139 2061443 2251970 2296105 2481030 2203724 2198215
17211 2198215 1930528 2163133 2263582 2211424 1951527 1728427 1465083 1102941 1310077 1867719
17201 1867719 1718750 1480927 1571297 1708942 1636425 1422187 1677200 1720524 1322763 1077682
17191 1077682 1105438 1180138 1379383 1350288 1007732 838442 1070348 929530 966270 590790
17181 590790 320770 602382 329281 94935 164078 496116 336852 498638 732675 826402
17171 826402 794892 702113 668522 349682 443630 320071 264903 169377 372151 212872 -177606
17160 -177606 -101287 203462 306426 355067 652170 611158 427719 506298 132790 52410
17150 52410 206366 225768 274267 462930 383656 296553 222851 244209 191427 208671 144602
17139 144602 270796 553226 502055 378560 499459 642939 463870 69468 -65984 32361
17129 32361 103562 101419 127153 109367 192293 41532 21902 178018 456796 95163 95822
17118 95822 129635 222740 368865 450188 459836 224247 -72225 -13476 148071 254058 250790
17107 250790 214395 487827 466207 120800 -215267 -422651 -289019 253970 197166 46961
17097 46961 459415 678293 606175 -150256 -619021 -363622 377199 568134 -54693 145087
17087 145087 194431 -37588 -125817 -170315 -1591 297208 154778 176797 241919 136181
17077 136181 133187 -1386 -61783 -172781 -421801 -444287 171209 190421 9661 92862 56739
17066 56739 84250 224741 -64533 -232436 -88160 -124393 59732 147110 213210 611737
17056 611737 515071 387578 468731 239123 176241 156441 -1958 -13206 187611 197928 352253
17045 352253 462888 754637 730097 600165 532744 197713 307292 727086 593559 631860
17035 631860 805952 491040 289395 45358 -265257 -175809 243137 449849 380365 378440
17025 378440 109806 153618 258566 470213 656096 569743 316252 284888 626563 637662
17015 637662 496813 405062 309016 536338 700363 718823 547702 978722 919587 583938
17005 583938 422308 706545 815702 1075298 1012879 1014003 921721 1297036 1522917 1745239
16995 1745239 1722799 1664361 1791141 2385479 2663026 2801614 3291216 3427327 3538278 3506706
16985 3506706 3702154 3932711 4251791 4429130 4783071 5423981 6372159 7715327 9098446
16976 9098446 10326815 12143624 15043660 20039188 28651872 43066065 63325177 82283629
16968 82283629 94952283 110170737 133514838 149945088 137883145 103146060 78985911
16961 78985911 69225327 70830726 81892807 97843860 110469244 119389892 135421953
16954 135421953 155459543 160695661 133882684 102015887 86749378 85821973 95259540
16947 95259540 106946733 114252220 123317767 140729505 154523824 145473319 113407102
16940 113407102 88895120 77421467 76219823 84075946 97508028 108329874 114833476
16933 114833476 127029878 144201287 150026857 125756906 91515171 69078193 55846573
16926 55846573 47326546 41584140 37724139 34649918 31986677 29588729 28026969 26933376
16918 26933376 25749280 24284853 22594438 21344921 20248321 19419961 19075008 18800005
16910 18800005 18436532 17916067 17324776 16934905 16098203 15249765 14684281 14619187 14154380
16901 14154380 13581187 12865172 12308303 12021572 12168833 11991728 11762171 11439933 10799389
16892 10799389 10268766 9919564 9555410 9294628 9229367 8964620 8486791 8432452 8523383 8286949
16882 8286949 7699365 7445687 7212263 6544194 6058008 6092020 6079904 6004404 5925704 6199540
16872 6199540 6194721 6086303 5559557 5259799 5383697 5322356 5177061 4591583 4226896 4106551
16862 4106551 4074831 4040289 3875984 4021222 4040034 3963621 4014082 3963227 3905805 3955620 3887376
16851 3887376 3781571 3673922 3502912 3308341 3393616 3207495 3049936 3303517 2956122 2815718
16841 2815718 2541515 2602417 2550029 2502587 2708081 3165261 2895919 2680602 2601900 2892443
16831 2892443 2513509 2211263 2358543 2425886 2467492 2393267 2356850 2321892 2252991 2080890
16821 2080890 1783711 1651832 1570266 1228344 1578793 1845554 1788678 1687571 1630239 1923960
16811 1923960 1980734 1755337 1528831 1223745 1322158 1525123 1347986 1326427 1328051 1621986
16801 1621986 1893907 1694934 1684145 1610454 2015649 1891438 1731645 1805814 1815184 1977158
16791 1977158 2266190 2140950 1876199 1519682 1106647 1310921 1246499 991264 1087504 1574195
16781 1574195 1648925 1526437 1493584 1693521 1627595 1558535 1687185 2130273 2266142 2251252
16771 2251252 1922767 1798122 1378700 1221553 974310 1029253 870349 839034 1287748 1475919
16761 1475919 1242031 890482 920430 864274 832145 791120 603413 628535 768962 720370
16751 720370 309557 184906 385088 693762 1093767 1201326 803879 409867 358373 315236
16741 315236 361235 161929 191522 306142 404925 560518 872903 921682 650963 597644
16731 597644 550995 324823 565976 328017 74557 313556 575880 924980 864146 895696
16721 895696 647472 165030 207391 219849 -11112 134269 156993 243667 507588 308146
16711 308146 182869 -26579 45021 236287 553193 606724 787897 870969 444265 141111
16701 141111 -278181 -323351 -391679 -4811 186275 269139 849150 872487 1032213 1200734
16691 1200734 1452981 1293949 772606 242301 107278 -91831 228827 539610 579794 408995
16681 408995 -16964 73477 448679 394573 53174 237952 99463 57184 336215 485885
16671 485885 251532 331776 99180 48106 243659 471961 471010 175986 96642 99358 -63718
16660 -63718 -121072 -18224 -62119 -44126 107767 219630 167948 -46093 27737 314785 615457
16649 615457 568021 467021 222988 -108890 -111731 178494 164307 210969 87050 12045 280150
16638 280150 -156297 -531701 -278998 -388103 -212807 -222353 42664 117837 24869 -225082
16628 -225082 -222605 23 -50528 -37124 -11777 -94550 29623 230238 453841 239197 24993
16617 24993 264128 611114 554978 167401 -159637 -145129 98558 390719 286873 357491
16607 357491 273293 250700 436833 466565 35539 -35921 246109 188688 240305 661656 636160
16596 636160 437731 100103 39281 337338 259306 -17138 75002 237029 328248 4087
16586 4087 318269 220622 -196956 -133888 -51350 -77588 -96371 -290077 -744220 -833042 -454760
16575 -454760 -74469 -153789 95326 61494 -198147 -499888 -401076 -46220 73913 153802
16565 153802 309446 139745 -112250 231861 539002 422785 126502 204921 63249 245705
16555 245705 415700 211613 87895 -205992 -45259 123009 124810 228523 469401 405860
16545 405860 252697 278328 667911 671316 528429 585597 444655 281863 344690 541599
16535 541599 446509 95228 103492 203361 545829 619155 445863 365664 331108 -44802 -193101
16524 -193101 -236341 -55068 153877 224747 260990 282664 173102 132415 132673 241086 259184
16513 259184 338453 23512 -157632 -214672 -328308 -386320 -140350 -173374 -118233 90941
16503 90941 -98 -143478 -155619 -58096 -63652 -283892 -520583 -257855 -144050 89468 621581
16492 621581 758093 340930 543200 747515 743549 722558 871506 779945 486559 136155
16482 136155 136090 326908 305459 470996 234259 267640 118573 261754 569833 382957 393157
16471 393157 345250 180504 244917 370754 469377 481933 409279 321581 -197353 -160739 351844
16460 351844 225976 15982 106564 341843 336628 370645 156756 118854 -98497 -375765
16450 -375765 -314250 -220156 167874 394693 445843 582978 604933 180983 -257235 -251159 -304947
16439 -304947 -165271 272951 335808 -109704 -364487 -555010 -580808 -366022 -219812 -281770
16429 -281770 -326227 -295775 -103711 71784 7551 23225 225803 346896 452513 242418
16419 242418 -19361 70542 125899 231274 516219 339002 92169 -125144 -117086 -6633
16409 -6633 -15252 223470 128245 -27663 304221 640556 515835 305427 91387 23263 140165
16398 140165 46044 -116191 -216678 -199459 116907 425262 1000842 944331 1001403 946348
16388 946348 441135 463474 155730 131621 330719 574849 483279 468831 671982 981892
16378 981892 981789 784384 752405 1027408 597786 680825 814497 798393 760688 656601 832837
16367 832837 896078 686285 329590 87616 158577 476381 577348 334416 430328 483172
16357 483172 419872 350525 395545 363061 294113 207439 125678 175488 77073 -202786 -185401
16346 -185401 -220358 -249793 -368988 -580777 -301848 12829 -105431 151026 427401 419960
16336 419960 304416 -84186 -370202 -291960 177767 74675 -68836 -225741 -304877 -122653
16326 -122653 -133131 -338528 -420719 -51092 79871 47110 -76164 -36869 153634 264947
16316 264947 -12503 -373058 -153952 61203 59675 111616 16907 -135610 -335727 -335119 -314071
16305 -314071 -322443 -559868 -618881 -360388 -97985 185720 237656 -92955 -291267 -14687
16295 -14687 128721 125806 -75100 -19744 -65529 -223234 -154155 74919 160707 178292 267209
16284 267209 178453 -58110 -12944 88585 195560 184567 309989 498714 421346 328214
16274 328214 332909 292427 207445 171394 178863 537651 577960 537918 336411 341807 414298 330502
16262 330502 349467 -26636 -97666 159170 102339 281932 195700 211322 318138 394900 271277
16251 271277 118678 213054 227893 264612 29133 -115008 -201252 -254364 -47366 -36540 101410
16240 101410 443384 322231 354555 -159585 -374627 -338871 -199687 -49606 -41091 -288007
16230 -288007 -248692 -34902 -4233 95070 -277461 -228467 -15402 -218613 63204 111928
16220 111928 -203037 -54325 -140197 -15834 -179654 -344507 -83163 121097 262683 237165
16210 237165 294599 525092 398024 -158653 -473747 -348447 220837 405210 328478 -9314
16200 -9314 115617 65263 73195 212644 183533 224566 219329 149962 151745 507575 710424 491533
16188 491533 490671 404662 -236891 -684818 -434851 -309678 -370013 -412571 -276519 34133 150762
16177 150762 712459 622953 241754 242615 190455 -29132 -127052 88560 228547 -4637 -79693
16166 -79693 -224432 1867 480 -48286 -97193 100493 -136481 -55612 -267098 -309725 -225125
16155 -225125 -133848 41230 407953 580410 511946 425385 431697 429105 140015 -47653 12010
16144 12010 259616 456570 417019 225701 619861 507482 90160 193383 472141 363578
16134 363578 206942 99312 -203668 -144323 -16943 -207373 43753 54893 -50460 453532
16124 453532 436220 200810 333132 220871 -220814 -372134 -155612 39538 -47314 336674
16114 336674 264047 -123997 -278891 -220937 49209 344629 207513 156624 10048 -118248
16104 -118248 363387 490957 398207 690002 753391 543820 172408 -18006 -12212 -40172
16094 -40172 116185 -99362 -607739 -461831 -85827 214758 669488 832105 905983 533664
16084 533664 213166 157719 314701 261497 179857 265600 103578 27898 110277 -65922 -196186
16073 -196186 -207555 -220948 56959 471590 477402 432292 62610 -15170 -185865 -222594 -109488
16062 -109488 -107677 76618 152770 -109597 -40159 191333 492549 194784 74445 204372
16052 204372 29710 -122966 -49756 -267667 -302774 -213545 23179 -68528 -149040 -162453 -171481
16041 -171481 -196378 -419237 -641423 -526146 -620921 -686653 -506391 -734076 -324940 289572
16031 289572 374719 82693 -8432 -119195 207902 249045 30062 -173919 20508 78839
16021 78839 -55394 -95997 -53567 75750 -117534 238221 97662 -226261 -76349 245258
16011 245258 -44852 -334053 -372733 -556637 -538802 -535735 -439214 25329 -12434 217588 108266
16000 108266 -475360 -640129 -506065 -16685 409032 244003 385991 345257 343954 281696
15990 281696 214831 -17160 -439469 -766277 -517737 93991 304954 498951 362598 281146
15980 281146 9874 -204857 -168750 -38365 20526 175332 -16964 35628 9212 -310405
15970 -310405 -132750 -198332 -168262 -196654 -291434 19567 355018 664029 593177 113988
15960 113988 -25354 -411627 -227390 20581 -49062 -247174 -533107 -631564 -346397 -563663
15950 -563663 -239082 -203507 -107494 186385 386079 199052 -134188 -425185 -466145 -142614
15940 -142614 -173910 46383 221683 130631 126474 343879 315012 124081 63517 -149370 148666
15929 148666 383819 331970 166019 -31734 15557 488042 432379 312993 169985 119582
15919 119582 200602 295757 90614 -26144 -11147 110699 86108 212840 70788 61546 -127937
15908 -127937 -195720 -33946 179456 -385151 -215477 161083 150327 -34731 47642 -65547
15898 -65547 -153252 35671 -56566 -152052 330899 409539 118501 20225 -197442 118127 163149
15887 163149 -51275 39071 -129731 -431924 -143290 -175121 -64815 102495 60150 -276097
15877 -276097 -277652 -440695 -495174 -472781 -503968 -608149 -387849 -310118 -219985 -72031 -254635
15866 -254635 -189797 -73990 -72077 -41884 201261 192842 176983 379225 431487 639839 497542
15855 497542 515593 355410 -35822 -347440 -322067 203067 376484 314983 263265 285676
15845 285676 186085 37837 166246 55466 -31999 135397 -330664 -395106 196215 447389
15835 447389 318674 53004 41369 -121604 89496 408856 322740 49473 24 13318
15825 13318 -313406 -713155 -724460 -556775 -344954 105055 484819 255070 347963 426698
15815 426698 381031 110201 183306 98834 -393741 -536768 -269625 -568452 -593806 -605738
15805 -605738 -240087 -319288 -253521 -47821 154929 223369 51329 295995 483240 210862
15795 210862 -71480 157947 201519 237586 378715 331849 -80667 -182253 286667 504594
15785 504594 536128 179559 85265 310112 493506 202497 53820 -59111 84976 329789
15775 329789 483854 224194 59828 318947 529436 22335 -323417 -9439 218950 135389
15765 135389 -29963 -87250 -35982 303726 397340 308740 191838 207559 38844 -58403 -90215
15754 -90215 210855 361127 557290 6683 -541627 -390768 -83336 -114495 126593 203235
15744 203235 140617 24994 208033 137526 -62460 -581071 -146265 231426 338880 194924
15734 194924 7149 -48334 -12992 -13024 -345550 -282209 -405224 -299081 -39990 -197592 -41961
15723 -41961 234555 483365 610775 638434 484112 218866 293365 361008 244802 306230
15713 306230 505432 714921 485308 306593 242251 380106 227468 48438 -239769 -126531
15703 -126531 465024 433468 112338 -218910 -490999 -173624 -268342 -440107 -385680 -555949
15693 -555949 -479695 -84283 101239 144047 123735 10742 -131456 -292541 41595 224524
15683 224524 -59483 -23006 -129367 -213058 172765 -68823 113865 422501 348757 344596
15673 344596 429336 -39213 -266466 -203398 -163748 -380859 -297484 -211843 -599956 -382174
15663 -382174 -282912 -24050 14748 130503 96459 -89343 -173876 -142983 -194223 -233808 162009
15652 162009 236250 77159 74194 -976 83160 82585 322474 278023 305492 292044 305220 42995
15640 42995 -89088 -248561 -157646 -195812 -458346 -370232 -398256 47322 125855 262208 275298
15629 275298 449171 249083 -2431 199083 499567 686384 741896 650575 686992 750513
15619 750513 619886 142959 -238380 -302158 88787 162557 48004 -142719 -107597 -130696
15609 -130696 108737 138647 323178 497032 259623 -8627 -302022 -254678 -370060 -397064
15599 -397064 140988 230943 268851 271287 275423 -29067 -302221 -74404 -186335 -87727 34520
15588 34520 201596 229511 175718 255473 -57841 -408709 -419512 -593089 -686163 -273775 -99169
15577 -99169 -327595 -201778 -124093 -12175 582030 658156 467656 296824 -110985 -120931
15567 -120931 99718 -44502 -112611 -298165 -429241 -436478 62958 199052 134615 238061
15557 238061 7246 -255240 -458793 -303457 -450354 -681913 -188166 92928 509489 883533
15547 883533 575940 471285 339933 348844 232399 430534 468620 144939 77957 46489
15537 46489 200996 328764 146818 -111796 -146445 43394 121387 272849 -11466 -438942
15527 -438942 -253299 -145642 -37286 -66760 -162123 -150206 -161670 -198863 -284260 -526369 -599922
15516 -599922 -463791 -478768 -518251 -559340 -524895 -357229 -31912 -39020 75170 91229 83093
15505 83093 201748 169381 -54401 42181 110700 36483 -57716 -119616 12130 225759 70861
15494 70861 13834 202708 453245 311881 -121505 -401193 -473603 -657058 -548233 -193963
15484 -193963 -5394 3403 408759 61312 -238611 -312788 -177375 -244189 -329785 -271882 75812
15473 75812 341515 203518 265107 294174 361489 -39760 -229578 193411 304387 250855
15463 250855 392608 656386 680598 454173 332178 429449 293642 -271886 -384000 -44320
15453 -44320 29542 430485 386584 13412 -156604 -147353 -478646 -446354 -240752 89642 305287
15442 305287 40428 81189 258012 124575 -220530 -333517 -155380 -45646 -14852 -232063
15432 -232063 -401000 -420031 -34782 410713 112164 -285767 -534401 -303717 -192784 -317270
15422 -317270 -659744 -580589 -352517 -52067 180804 68073 -10815 -3132 -13535 331244
15412 331244 742806 729878 350401 524791 480036 233412 192752 264238 347913 248086 222529
15401 222529 82201 153509 297862 108100 126309 132357 106416 36006 -71190 -67714 -136109
15390 -136109 -188276 169870 147842 131019 309211 568712 466643 357076 150731 -195988
15380 -195988 -317941 -344044 -308213 -160890 -88947 56704 152691 456200 326512 96975
15370 96975 255565 -229 168210 358367 174008 385363 481904 132768 93355 383753
15360 383753 137146 -252030 -440 214832 336943 173022 -308844 926 146506 -110021
15350 -110021 -246844 -256327 -272977 -55287 -99719 107332 138040 -57606 -467898 -498001 -503021
15339 -503021 -333921 -614713 -647947 -443249 -569085 -216305 67854 -351122 -358069 -198041
15329 -198041 -52673 44126 60687 417482 899874 542559 124238 175535 82251 -124062
15319 -124062 -209407 185701 246157 293343 552747 289289 80509 145513 77630 24223 -452529
15308 -452529 -551529 -175297 50141 197418 182680 41382 82778 499630 470277 228811
15298 228811 -75914 -69597 -480242 -441314 -4293 -82644 -195903 35158 143228 344899
15288 344899 122389 31755 -283824 -103252 60122 314015 234405 -197968 243442 379540
15278 379540 -116610 -232741 -298551 -417629 -399225 -322390 -157745 -84882 -31347 -294259
15268 -294259 -278248 -360405 -443494 -341045 -311558 -214700 -155812 44489 474132 338904 -129230
15257 -129230 -319118 -345872 -116345 -270635 -157469 -340919 -443088 -456632 -633576 -396902
15247 -396902 -198142 127282 276093 24399 -128952 -65286 83455 263944 124719 -378331
15237 -378331 -464976 -339728 58404 -67353 -260278 -343665 -19412 41989 -237203 -370363
15227 -370363 -165347 169073 -86629 -324830 -41239 196322 368596 498038 283046 241516
15217 241516 206643 39735 -21456 -106171 -266257 47390 340118 446750 310405 71671
15207 71671 -172752 -280076 -116419 151997 483692 633251 367522 230551 574829 526204
15197 526204 26082 -250881 -300753 -393896 -95618 -92489 -293577 -127454 -69312 116562
15187 116562 -73418 -534669 -297182 -110552 -68837 20874 -281025 -386390 -305272 -61636
15177 -61636 94213 177832 201176 115369 -106550 -80443 -579513 -579182 -244671 -48206 -16747
15166 -16747 -327929 -16404 -213286 -396391 -93716 561453 489770 104671 149032 -80540
15156 -80540 46682 3802 417545 446892 11795 -153424 -269088 -142809 -16502 2651
15146 2651 -136987 -263161 -195111 -26508 -114643 8077 192662 296601 243428 325582 246743
15135 246743 9942 -244722 -505462 -343973 -488086 -431045 -325894 -397978 -514467 -214540
15125 -214540 117782 305780 434051 560916 113824 184138 77161 -215329 -229862 -135030
15115 -135030 -421811 -245434 -104319 -227643 -391259 -351976 -344206 -112196 127506 396621
15105 396621 480218 362215 375439 438307 315521 -205006 -179973 161259 342533 367036
15095 367036 103898 -102460 -144108 -115755 -171927 -110036 -322927 -349393 -203580 -66167
15085 -66167 139895 248943 299542 181525 320840 23446 66964 199001 299052 642178
15075 642178 666995 423410 -45440 47865 35860 -94257 -19198 92296 135878 -111801
15065 -111801 -626821 -576442 -320460 -241612 -451355 -779577 -730786 -505185 -671353 -625222
15055 -625222 -355653 -478171 -206018 -145136 -417113 -479173 -342404 -657894 -723777 -528779
15045 -528779 -181776 32697 226870 261025 -7594 61331 285925 172804 -286228 -188012
15035 -188012 -324399 -637630 -797186 -903007 -773460 -628882 -813571 -326321 -97918 162164
15025 162164 267026 139463 -165770 -189014 137146 -102581 4652 -15696 -207490 -116966
15015 -116966 326497 115659 162671 283223 422991 278498 28602 -252420 -636210 -705445
15005 -705445 -317730 -126152 143185 270414 472013 714952 540849 105114 21855 390563
14995 390563 394922 195494 224986 3709 -278057 -374190 106017 226286 110360 -213443
14985 -213443 -167874 -98929 -291170 -325189 -237801 -374419 -306659 -360415 -58431 95673 -219029
14974 -219029 -236166 -119115 595836 696567 366077 440800 505247 27172 -21053 344792
14964 344792 414707 413708 90175 -227025 -429236 -503416 -597993 -690601 -355933 -166234 -550681
14953 -550681 -642532 -375178 -267380 156409 440470 532581 258195 199446 208600 347671
14943 347671 211208 301132 80156 -111228 -134643 -7312 94447 280585 24471 -125100
14933 -125100 -295183 -238690 -45695 -145393 14252 -138882 233629 295674 463437 308540
14923 308540 -106733 -137329 -130292 -364876 -393958 -516038 -457191 -1486 196217 154242 322758
14912 322758 439870 59929 -64549 -162501 -295644 195603 522554 354873 99798 -161467
14902 -161467 -36664 131910 318564 276608 -13705 -75173 -118817 -5688 164492 422646
14892 422646 243912 71992 129931 195307 -33005 -119287 -327424 -270909 -36997 149945
14882 149945 459856 500854 331081 180244 63289 -145020 -222031 -80029 -368981 -116257
14872 -116257 -79017 -299740 -107439 315458 592706 262696 -208122 -208926 -206585 -128890 152613
14861 152613 375730 488832 437108 326050 174545 118244 -52174 5991 97427 37724
14851 37724 -48900 -359897 -102921 95973 -22672 -42755 -184255 18597 412481 299600
14841 299600 480296 337796 128287 488610 1045115 956846 916979 593788 576792 551499
14831 551499 320168 413391 395293 657493 655750 513555 395016 560993 619542 94003
14821 94003 5071 -222273 -156009 -217173 -434614 -619567 -413952 -336861 -394412 -387496 37699
14810 37699 266090 395897 187547 -229144 -299679 -234031 -405416 -577887 -192456 -123346
14800 -123346 -424768 -243120 -366545 69601 468331 307343 -58842 -230930 38758 479546
14790 479546 304316 7637 -304164 -377222 -675731 -376529 57173 99609 139746 128890
14780 128890 412092 289548 -252077 -596110 -474558 5398 43899 -66826 -34130 41930
14770 41930 153138 -114624 -342111 -205143 -18775 -31473 8416 110239 44819 354652
14760 354652 594456 478131 -35883 -453334 -581333 -395306 -444412 -618928 -155585 161944
14750 161944 -188595 -373339 -333816 -81276 292188 209951 63398 -78587 149847 291063
14740 291063 457340 348900 710720 488819 64712 -5856 -13614 40801 -179647 -258651
14730 -258651 -118082 70220 291729 456021 435009 214244 -77984 -86191 -145855 77265
14720 77265 199665 130985 -117752 -475836 -278988 -162488 -139745 -73408 326697 569806
14710 569806 747479 556431 226132 340620 377818 331230 -126729 -44601 -144074 20446
14700 20446 377964 382746 320616 659198 435221 95305 438935 342510 124152 -445
14690 -445 -56351 -359054 -667624 -610754 12213 23437 -15853 257661 177802 -214673 -322849
14679 -322849 -389038 -564719 -676294 -669138 -613288 -375687 -180728 -109805 -317076 -99682
14669 -99682 46062 130439 4710 -29374 -61452 135886 -35689 -270245 -148269 -174383
14659 -174383 -77199 145676 353557 467904 242108 -155604 -430345 -511216 -351100 -437793
14649 -437793 -430551 -267914 -638030 -178455 138155 294896 444901 475907 354492 469615
14639 469615 338137 597695 724194 658754 318370 -58035 280722 357429 534601 374499
14629 374499 451722 484822 -197905 111461 404377 584216 488440 235192 131117 140618
14619 140618 100190 -290328 -109349 42458 -273230 78725 18144 -139383 -107350 -296866
14609 -296866 -511510 -504708 -47368 -115798 -589941 -574280 -484826 -518603 -358194 -275456 90493
14598 90493 418768 226299 124879 258504 703862 585313 168297 -82312 -350980 -530220
14588 -530220 -335417 119597 378380 -38540 -38795 84613 -84789 -50996 -115087 -90790 83840
14577 83840 77503 282288 344275 679957 357982 400683 211818 20464 324084 428614
14567 428614 399832 212267 177295 340447 393858 298060 390184 614140 592903 358590 240467
14556 240467 13197 276896 532705 762013 765585 787056 812779 523396 296169 59668
14546 59668 -53544 -77472 31732 220108 -34829 -30385 33836 124232 177725 136451 406672
14535 406672 390456 344917 205710 305245 529488 401435 125875 -349198 -333102 -392994
14525 -392994 -557465 -208931 -6167 -163724 45694 197853 236791 218964 -47698 -47691 136141
14514 136141 191611 237292 299950 269692 338290 472108 480997 99047 -111441 -317615 -382447
14503 -382447 -400684 -222893 243569 523140 423383 296151 -35080 -109977 -12409 440534
14493 440534 617990 373878 589116 439180 341302 275583 241806 161336 -17166 120176
14483 120176 135694 46265 148405 213091 445919 672017 693171 567229 334262 -59827
14473 -59827 -191840 133721 371196 399933 280417 171355 -220796 -311154 132508 366780
14463 366780 350671 387230 -6175 -214025 -130779 91760 -48831 -90239 -103139 -157413 -332119
14452 -332119 -183106 -105882 -21365 72616 216931 78759 96395 115374 -49956 4087 60537
14441 60537 299473 202158 -113622 -64319 -149825 -29871 117703 119736 303496 51941 2803
14430 2803 -62284 27669 -127642 -39682 239105 -118655 -228867 471569 728738 319649
14420 319649 23981 18010 46100 -128115 24761 39046 3315 -106426 -42584 99504 106333
14409 106333 -51996 -243284 -170231 268082 322854 481591 187243 16755 3425 61506
14399 61506 26580 111554 250113 -59221 -307287 -145100 -212077 -209157 -396972 -239511 11353
14388 11353 -57438 -94782 105685 219811 22801 -321392 -286387 -97818 -126400 -321792
14378 -321792 -318143 -332456 -166426 76700 39958 -202338 -151296 137981 36653 -95323
14368 -95323 -215090 -373022 -457724 -708290 -556764 -321528 -92275 -111027 -136331 77765
14358 77765 267353 51347 -525926 -634108 -410011 -79638 -14267 -94248 -458333 -296583
14348 -296583 -1660 -26568 64015 220699 278842 -124350 45243 169080 110612 -376181
14338 -376181 -292875 -326319 -349424 -346497 -333821 108396 403083 486642 491709 452384 545358
14327 545358 532003 160155 -50938 35343 443364 666555 565749 473852 421300 497442
14317 497442 385359 124088 95575 205973 -66314 183233 412862 384165 506366 770204
14307 770204 854283 627225 318075 117305 -110308 -45720 88704 -19516 -804 86157
14297 86157 79460 34510 47040 -237349 -369221 3474 120082 279288 508106 74243
14287 74243 -406151 -643215 -339716 102018 188008 -259795 -40181 148133 -29105 -164715
14277 -164715 -260630 -194714 -134229 -143568 -75078 -125242 -270629 -209864 -461667 -512445 -301849
14266 -301849 -302971 9654 84102 -29960 -34376 -210624 -255954 -12830 73886 87159 -43305
14255 -43305 119080 247974 290693 115534 175443 207777 -63741 -162164 -201282 -56943 -9011
14244 -9011 129823 202888 477824 163370 -132553 -519457 -454242 -173774 -322978 -559982
14234 -559982 -379564 -68031 146872 286513 246511 -436845 -607058 -204186 194048 293077
14224 293077 63515 -263283 138386 50302 -75680 108658 173000 292568 273662 232769
14214 232769 347252 560254 374540 -33078 74622 124047 157170 39349 -178989 -59392
14204 -59392 192911 391332 290595 100864 225634 -57106 -43313 -2997 106146 308128
14194 308128 510235 464097 517640 165655 131923 217558 10342 -7187 50202 192214 34987
14183 34987 17705 75364 -153 -453106 -590736 -310562 -435227 -683436 -543946 -356017
14173 -356017 -95983 -146353 -126973 -250109 -451693 -270732 -59923 -58398 26502 267713
14163 267713 480011 481422 567420 720108 670618 827147 744702 451448 327501 265030 79462
14152 79462 55260 -60883 -74817 -283231 -425121 -481153 -758676 -814720 -157143 321947
14142 321947 185775 -231881 -218231 16528 82142 24832 -85636 -424981 -319345 -9208
14132 -9208 -63100 -32701 2406 -53364 -181508 -158395 223600 143419 158412 530337 782974
14121 782974 668677 402715 163585 -29503 -240025 -188502 -229946 -48292 288322 475022
14111 475022 455026 402607 320617 -162899 -164108 -107614 246219 703168 661213 555042 -159040
14100 -159040 -319181 38786 25545 -199085 -304738 -229440 21252 -19391 -134471 -368439
14090 -368439 -389158 -327005 -426835 -641766 -616646 -519478 -622705 -444251 -235695 -86739
14080 -86739 361760 339730 377249 556367 734375 416996 -98008 -411380 -315499 180017
14070 180017 687441 642777 235666 89606 -12095 38922 -91965 -214149 147261 -93439
14060 -93439 -373496 -317130 -257406 -214293 223921 544961 648900 472736 177081 103934
14050 103934 -59414 -326640 25308 267502 129331 280820 495827 464824 249998 268833
14040 268833 266308 296171 110716 -137940 -377532 -109025 8714 245942 228267 46945
14030 46945 -35242 -441018 -728431 -833429 -786591 -548061 -35893 114412 300809 480886
14020 480886 307212 199393 124845 144065 370497 535904 708120 539850 404583 104374
14010 104374 10977 226036 313852 -133016 -175965 -119480 -9809 -289980 -806107 -393486
14000 -393486 125655 346943 88868 -109056 -177138 -290396 -92185 289241 366359 -203375
13990 -203375 -741636 -718907 -600730 -175860 258905 256613 67727 167390 180273 -32622
13980 -32622 -173600 157706 154258 -80686 -395674 -256509 -259347 -397076 -158483 26583
13970 26583 268394 548603 424193 411902 316751 328471 446783 575835 489825 379750
13960 379750 282213 125732 60156 150472 48824 177029 198858 -88152 33836 261211
13950 261211 117161 265299 337461 416027 225731 -172069 -304307 -205323 -60658 1700
13940 1700 19084 438053 686927 641737 1059291 763334 274986 476396 626419 193569
13930 193569 -243474 -130354 300160 554586 165397 -19508 96068 591877 412304 111356
13920 111356 -22011 -491036 -478684 -148708 44917 36418 -206685 -64216 154087 150126
13910 150126 234624 197014 345245 241385 -87376 -200421 -297523 -21916 163548 485464
13900 485464 351617 213968 174185 198898 345924 483584 152386 120837 472811 506676
13890 506676 204205 -142515 -268636 -45966 162958 157060 170780 424442 116794 67582
13880 67582 585469 563497 294857 480647 308347 169884 48869 -130862 -152157 -93058
13870 -93058 -242316 -471346 -447907 -94896 -150261 -194723 -24613 -97455 181081 210826 293415
13859 293415 207213 112894 77114 -81307 -107884 -73884 -187598 -274791 -208004 -137322 2230
13848 2230 52495 140369 5857 -249426 -220337 -411090 -169317 218011 60737 -71893
13838 -71893 -89429 284295 623867 383177 491365 376180 37384 -97137 -206497 -60929
13828 -60929 149003 75302 -36666 166399 234798 233737 214418 297560 206123 199968 65817
13817 65817 -57441 -238002 -254086 -437736 -495041 -307415 -367137 224768 324347 283413 279366
13806 279366 334029 484527 531238 427517 164978 131749 488413 743177 489553 301151
13796 301151 489534 244956 200692 178423 -301235 -455016 -363930 -246887 -302525 -423820
13786 -423820 -557255 -304133 49140 29635 -67536 -12298 -13303 -105998 7469 -17593 70605
13775 70605 45339 45920 -156823 -106583 243919 35393 -272982 -223966 -343706 -425416 -113795
13764 -113795 454767 396051 -121340 -218061 -11946 230507 439498 231003 304753 482280
13754 482280 102008 57091 431305 773702 725929 192685 125695 428236 424051 382851 110085
13743 110085 -257141 -32772 9430 214408 319846 163751 46661 -193255 -91803 -388580
13733 -388580 -256535 215571 337531 227737 231439 433899 539494 389542 204490 84715
13723 84715 442918 662982 588873 417339 461233 469127 338470 482116 555995 174736 -48038
13712 -48038 40345 263749 530191 449334 251722 275139 749143 685873 325326 212820
13702 212820 -286092 -542114 -481575 -159099 9597 248357 127372 -169165 -95359 97705
13692 97705 -19542 -164147 -140306 40505 154777 405797 544751 356357 136965 -241575
13682 -241575 -395836 -248451 -207887 -184611 -386440 -471022 -298089 -362179 -270572 -235003 -276542
13671 -276542 -36826 83966 -201326 -366817 -304249 -48481 -12188 -292012 -199690 -49485
13661 -49485 94733 145294 47576 -21963 351617 339777 186886 -19386 -170978 -386393
13651 -386393 -631248 -497119 -475553 -335517 -275056 -17123 -181185 54392 174615 -15457
13641 -15457 -130492 -54713 -43742 -48719 4187 232614 181157 51892 40038 185192 -124844
13630 -124844 -411766 -343707 -6115 386956 242406 -110584 -391639 -732848 -712754 -580715
13620 -580715 -323199 -238257 -288792 -255423 52533 -45765 -93744 454152 529079 314603 69806
13609 69806 218502 376343 368025 123610 295533 41590 -143463 83226 301013 294044
13599 294044 137421 -94986 -76554 -368164 -128901 -124293 414841 263810 -44294 -22062
13589 -22062 43517 -97654 -199889 -107729 -180020 62376 508474 636040 500055 419055
13579 419055 448935 246656 130404 102533 233958 251374 287415 306270 236489 -319408 -288000
13568 -288000 -131317 -71429 -314845 -239618 -16799 -21324 -216286 -68332 -139820 -55619 129995
13557 129995 9523 139072 -246271 -69370 47557 -25772 -45150 -295730 -347997 -76344
13547 -76344 305027 197373 -36127 -136432 -109464 -125542 -380720 -538782 -355213 -183118
13537 -183118 2597 -44024 -188903 -107509 -15385 73979 -67786 -109367 -225914 -354093
13527 -354093 -239623 -96979 -100498 -95464 -136873 -360359 -384401 -228247 -65147 212620 116726
13516 116726 -173083 -194285 -59982 -116050 63673 232767 -190738 -202927 -45949 61512
13506 61512 165528 -44580 -76545 -140571 -114174 68737 291078 349627 371734 339385 67470
13495 67470 -92891 -243956 -552558 -545284 -437185 -313003 291 -87718 -99528 294384
13485 294384 469875 613228 268809 -328221 -31471 249055 221775 141127 132080 -28759
13475 -28759 -116812 -52581 -302637 -395050 -389663 85533 320177 127655 40083 91624 254451
13464 254451 114685 26333 -22231 -36316 126520 442527 398604 352741 -99189 -136525 355292
13453 355292 441466 247984 82770 139613 339704 337347 113340 -148542 -186459 179650
13443 179650 376263 14842 24489 432147 553815 242256 95825 61951 314811 306774
13433 306774 81173 -231032 -301370 -274182 -144495 384471 318364 108937 -126626 -629037
13423 -629037 -484871 -364257 -491173 -290915 133200 63434 -268215 -494349 -366368 284053
13413 284053 379926 247850 361023 520464 499012 302873 -203681 -711970 -364542 -102411
13403 -102411 -162363 -287896 -362485 -412247 -308661 -149825 -64208 -4749 438932 488114 248447
13392 248447 380642 326556 41141 -72129 -179081 -478022 -295911 68906 26811 -90938
13382 -90938 -268184 -340979 -219611 -541372 -708656 -566682 -598975 -577589 -381426 -251485
13372 -251485 -51520 -401992 -426967 -349436 -159192 -238803 -261033 -404040 -253291 63503
13362 63503 261503 314039 373401 842615 816888 721387 694569 373421 -151594 -444608 -212616
13351 -212616 -43204 -159773 -327317 -206679 -31297 -52923 77354 220880 90022 -68714
13341 -68714 96890 -167898 -252116 91643 394611 407809 283090 -28447 -210206 -237172
13331 -237172 -30520 -987 -5226 -13268 8277 -234091 -161702 248980 315950 390241 -28213
13320 -28213 -468003 -361394 -384802 -344272 -172996 116027 62723 -229645 -101283 104529
13310 104529 339812 155926 -191372 76204 390828 398299 202867 318695 586848 254895
13300 254895 -218571 -472797 -365155 -47519 115361 220867 147779 318558 469625 687453
13290 687453 689648 614759 471268 426712 497405 426027 283631 130137 -94791 -194153 -503428
13279 -503428 -724672 -560454 -296851 -106420 405661 423310 325519 556179 660854 236435
13269 236435 47425 295547 318406 90376 -182807 -30455 226420 222895 -56508 -23251
13259 -23251 39419 -33385 -135618 -496154 -261909 -352125 -82909 -2551 96504 -135405 -435590
13248 -435590 -238953 236425 133555 -183915 -398114 -448359 -218473 55253 491939 157026
13238 157026 -200669 -59875 222496 525492 167244 -162864 -42412 -124905 -159139 42993
13228 42993 110027 102045 109195 -92560 -364799 -304585 -72462 212121 429046 656606 605265
13217 605265 509334 88149 100145 74753 120437 314221 340251 158698 -355419 -796508
13207 -796508 -679409 -643780 -509057 -589854 -607125 -484621 -416592 -400260 -147115 174529
13197 174529 -45389 -114852 57018 283359 -2477 -178419 -386808 -450659 -286947 -145044
13187 -145044 152044 -46252 -14044 355838 177804 37205 2895 -37982 965000 1234320
13177 1234320 894134 542458 299295 51702 -167921 -39582 -74456 -52627 -135137 -220228
13167 -220228 -543976 -390823 63106 47364 -5840 279620 459569 490422 600066 458016
13157 458016 468470 548083 222232 15616 75464 -82659 -162823 -93231 -153796 -120219 1953
13146 1953 -51728 129734 -216163 -327696 -134181 108862 152361 83919 126853 57355 15542
13135 15542 95316 150532 -14095 -162770 32858 171225 196450 14206 225595 408209
13125 408209 308379 2219 70540 32403 -195885 -171135 -133810 -58420 62401 -323339 -684737
13114 -684737 -829543 -655364 -270618 -86630 -337129 -193313 316112 445188 440983 -111786
13104 -111786 -549994 -235561 11538 122098 204360 142490 148917 74693 265581 319664 -35814
13093 -35814 -216631 -301348 -480698 -398096 -158286 -6365 64817 -125736 17810 8259 -344370
13082 -344370 -421475 -387692 -256958 16246 79911 -229108 -547956 -676543 -547214 -484412
13072 -484412 -571466 -720492 -778683 -686801 -729463 -477883 -137964 -18358 -232775 -409947
13062 -409947 -367505 -333314 -324818 -331269 -217635 -206015 -11317 -21805 27108 -81383 -46588
13051 -46588 276720 321278 385358 265808 37268 -129404 -129297 -161838 -385945 -698261 -282091
13040 -282091 -25020 -133684 17417 218836 -62431 -12527 -287371 -303212 60937 111168
13030 111168 134239 94514 263458 644609 360907 337660 556861 527522 140844 6785
13020 6785 -76369 -140883 84997 170975 182389 196556 462539 234660 -13589 -192160 -271168
13009 -271168 -451395 -399526 -202781 63723 285106 290415 83146 133568 203869 110528 79141
12998 79141 189480 60988 157804 -77735 -282280 -358694 -308752 -373443 -299873 -196126 234472
12987 234472 245464 119797 -281469 -576763 -449110 -116815 177283 277002 88081 6502
12977 6502 56864 337074 570532 437067 332323 466114 630570 161196 179688 38122
12967 38122 -203037 -175900 66019 19257 299866 498205 356797 123159 -189368 -265745
12957 -265745 -46895 28019 89929 -3125 302163 321575 202876 181442 228293 82281 9728
12946 9728 -13841 -162280 -213482 -48752 154063 213878 69272 14963 -176221 -341594 -682811
12935 -682811 -496455 -136142 182361 222966 -135136 -314516 -355381 69523 182981 116869
12925 116869 -107365 -271998 -427776 -258424 397616 471779 229405 41642 37565 342331
12915 342331 619624 360659 90429 -26687 -188935 -257871 -436822 -787152 -677229 -300848
12905 -300848 -239251 -67188 -51571 -157240 -359701 33437 337195 277595 552831 531876
12895 531876 -40165 -413868 -358472 -237472 312730 679908 157250 149114 289997 -29200
12885 -29200 -197269 -123712 26666 -207563 -178815 -272072 86841 332225 209125 207713 -14772
12874 -14772 -359033 -212158 -415204 -365041 -678921 -640168 -376986 -202568 -367890 -126901
12864 -126901 121052 253066 375474 286932 127680 -120240 -271804 -202919 -316908 -140142
12854 -140142 -132611 -232185 -327810 -313369 -299164 -389824 -137263 61834 91988 15578 234593
12843 234593 150535 181496 196185 -55461 -45388 109854 176789 263584 193626 222695 466538
12832 466538 583302 499102 255341 184665 -416310 -663987 -395407 40940 -43595 -350599
12822 -350599 16272 209332 109098 -162347 -192456 -103417 -184870 -284850 -248362 -390465
12812 -390465 -226520 -57072 -17329 -110339 -294499 33775 330448 416765 244737 52329
12802 52329 -56408 -9029 8050 -104625 -150298 -154573 -172502 -47764 158188 220963 -295927
12791 -295927 -455494 -78946 74149 -62286 -246664 -504757 -625924 -588600 -443721 -604632
12781 -604632 -784617 -663375 -381780 -286600 -348404 -173926 -146828 -189044 -290847 -437934
12771 -437934 -349538 -72718 -312014 -466247 -357256 -164956 -71744 14510 -217379 -364124
12761 -364124 -629406 -731701 -562740 -490233 -319151 -550619 -310751 -377182 -148421 -91810
12751 -91810 15561 -78485 41068 42319 -227859 -450252 -552618 -602753 -502494 -470044 -330730
12740 -330730 276742 359993 282241 161312 -96437 36204 33252 311686 350098 98434
12730 98434 107431 250819 173255 374704 533912 325478 286914 641715 880431 543848
12720 543848 311811 50723 3908 317300 367630 252147 278854 12783 131405 527106
12710 527106 437995 273723 377180 468266 566582 396037 207240 -9030 -161310 -96626
12700 -96626 -159392 -259585 -567689 -697641 -801433 -368036 -119663 -416940 -547654 -297640
12690 -297640 -134208 62565 137337 240816 368766 92712 85898 -59833 65392 -205945
12680 -205945 -467533 -789981 -513441 -176030 -248587 138594 679373 465491 278245 52570
12670 52570 -486645 -507246 -613800 -630952 -328941 -194877 169633 429189 317306 -148471
12660 -148471 -265894 -295757 -135542 71785 -54637 -282167 -537200 -447524 -342677 -387004
12650 -387004 5918 -208544 -245251 51935 292057 221407 490390 495784 672110 519349
12640 519349 -80541 -396739 -256318 -490869 -672297 -603427 -429840 -253076 -42053 47435
12630 47435 42881 374252 232043 -80911 -449304 -456456 -190629 -151814 -401792 -408457 -447528
12619 -447528 -346053 -295725 -41683 -285090 -411297 -362047 4378 -178859 -558263 -388769
12609 -388769 -242614 -140493 13717 14753 -111424 222223 258265 288682 607576 719362
12599 719362 1028363 803906 169849 168586 40786 380218 535291 494737 102893 -159825
12589 -159825 155158 311892 333544 365917 148306 -88353 131410 38205 -100967 -133419
12579 -133419 -497480 -475988 -26928 -164210 -213924 -128161 -212408 -375696 60107 586002
12569 586002 594240 370626 56397 311326 187015 -9049 -207347 -203796 35878 -62770
12559 -62770 159016 459385 422824 293958 143490 -160634 -49605 123951 140468 19004
12549 19004 43876 -20739 -309504 -90652 89639 372019 419223 84814 -209827 -561300
12539 -561300 -549112 -414925 -205343 -271194 -216188 203747 -42349 -303369 -416904 -508528
12529 -508528 -425784 -292778 159397 364154 321394 254779 214354 358783 246736 30183
12519 30183 87987 -51113 -278922 -351852 -98164 -125946 -161749 -180182 -189302 55618 -122564
12508 -122564 -440572 -305912 -145656 104512 -58212 -207767 -276363 -394268 -359346 -129713
12498 -129713 -73948 63611 285092 359611 54696 86155 -33550 -223363 -199225 -69819
12488 -69819 -51672 -100243 -116454 -181339 314737 384063 103910 44147 177247 234462 -4046
12477 -4046 84228 113678 -2899 24910 50432 111566 307884 206662 -121934 -761731 -766872
12466 -766872 -472666 -433541 -25533 188600 362339 164896 -108450 -407939 -302464 -144193
12456 -144193 -67628 50873 180086 334854 306474 291729 59134 -403679 -552492 -155084
12446 -155084 230127 337045 331004 269862 89169 125712 457356 646673 683823 541384
12436 541384 421786 267711 70708 -162564 -233218 -238477 -32158 -69861 -204674 -154968
12426 -154968 259910 408177 267127 175530 -28871 -174818 -58098 -62262 -187581 136806
12416 136806 109259 170678 191162 182199 207624 224392 245387 288370 331731 444754 320073
12405 320073 -12109 -34404 -28563 -212878 -102911 312265 398793 420498 533863 562651 428945
12394 428945 349540 413683 43622 190485 371437 280634 355606 -7908 -14688 403356 425800
12383 425800 54400 154000 272248 -17762 105322 441899 219308 173053 -78063 -129243
12373 -129243 -181652 -82010 264930 505287 593393 240090 8335 -11860 -279007 -416639
12363 -416639 -344920 -268305 -519826 -44850 322931 414973 471943 211307 258500 261463 35641
12352 35641 -271886 -129366 -147636 -154491 -141446 45432 -199161 -79553 75037 198863
12342 198863 -47296 -83607 -182537 -153410 -45395 178226 313927 390655 347959 181097
12332 181097 -190025 -437230 -212185 -420462 -190207 2778 -125029 -199185 -281860 -266283
12322 -266283 -409249 -488117 -196305 136880 -36349 -131823 -367117 -301545 -310461 -438934
12312 -438934 -319121 -489678 -474306 -84865 62440 -76951 -96075 -50125 -238387 -461009
12302 -461009 -285023 -8722 346488 197483 225205 91623 114747 207645 441146 359225
12292 359225 299538 501375 110555 -225824 -249839 -163925 -234746 -228621 -32366 179292 300760
12281 300760 294086 235544 77700 -30366 -359322 -259255 -137362 -367454 -551000 -392616
12271 -392616 -483350 -405009 17284 337753 461210 654746 563024 202794 137139 260689
12261 260689 112943 327849 505754 631985 522611 209529 -311176 -644952 -650177 -332309
12251 -332309 -55661 281012 377473 392903 224795 669303 550934 386855 -10279 -99719
12241 -99719 69079 -35219 -95083 -187182 -321837 -175959 -200882 -132117 -163896 -2110 186978
12230 186978 303851 516837 308436 327521 -177256 -645586 -598223 -481863 -287872 -410686
12220 -410686 -301199 -270803 -282059 -117970 -46454 -270195 333054 358351 455669 204530
12210 204530 -103265 -289716 -212576 -158343 -155517 5185 63999 -114164 -415473 -625357
12200 -625357 -402191 -105590 -169643 -129103 -109997 -79161 -182065 -85270 347368 591732
12190 591732 611517 354478 216959 72326 360495 378147 131548 -302632 -472028 -134235
12180 -134235 -148155 -232245 -85970 -66967 -325106 -470717 -533819 -548750 -572502 -373705 -137747
12169 -137747 -271925 -350493 -409191 -445252 -337033 -237631 -299702 -302669 -114908 -67581 -364290
12158 -364290 -538833 -533265 -633912 -675695 -357276 -4963 54376 -132910 -476738 -513638
12148 -513638 -290668 -145061 -142906 -110379 -246674 -410096 -601363 -392376 -333947 -459184
12138 -459184 -643783 -503293 -280241 -201623 91308 195313 -33323 -278315 -325417 -311994
12128 -311994 -404900 -523791 -699871 -370357 153596 -10433 -306914 -526272 -414899 -351963
12118 -351963 -234455 -249071 -446393 -933432 -771472 -434925 -252844 -211787 -399502 -231289
12108 -231289 -49953 82955 -21512 -90783 -122031 -181919 -4439 254880 400042 334313
12098 334313 444231 295127 67160 -381857 -412685 -202231 -288653 -562132 -479407 -489697
12088 -489697 -402624 -326277 -201111 -223068 20924 92564 -109152 80308 -273498 -662505
12078 -662505 -473920 -615772 -553904 -432940 -254942 -250114 -436831 -89083 112329 228129
12068 228129 366991 446397 435249 589092 257256 -301909 -442794 -443972 -170994 -134637
12058 -134637 -333653 -389738 75224 253808 906514 915982 404570 356291 301758 297666 435463
12047 435463 275942 75972 -66202 -210996 -440925 -266322 -204401 -130595 -30036 -1078
12037 -1078 -62709 -396303 -224891 18514 327921 209874 154288 170272 282361 -25573
12027 -25573 197838 26335 131696 61679 267980 310874 42472 -424109 -274068 -90058
12017 -90058 -379463 -630981 -603523 -287164 144236 392101 222559 85354 -267401 -495704
12007 -495704 -479024 -321448 -165813 -275271 -416273 -333042 -336451 -325310 -160269 -33925
11997 -33925 154462 385231 137193 -97722 -133810 125256 189778 200971 -56581 21842
11987 21842 -299869 -59361 189334 280350 210321 35676 20707 141379 285758 11446
11977 11446 -74588 -144715 -238989 -118488 -232069 -127496 28916 -18361 139143 178472 -91166
11966 -91166 -104977 -189182 -73926 105784 211512 411272 620358 622435 424375 209703
11956 209703 59964 133705 139774 -92047 -413709 -246776 -331192 -419640 -273828 -313694 -573090
11945 -573090 -803430 -744911 -828952 -638007 -408370 -249709 230771 591082 820552 727461
11935 727461 508626 126078 -371778 -191854 -87832 78751 346806 85613 -163114 48471
11925 48471 224588 -9033 -122975 -424684 -117104 4194 -154562 -107274 -14387 -28049
11915 -28049 -353931 -400879 -582317 -366386 -399682 -565293 -386768 -531632 -476673 -274627
11905 -274627 -255937 -188159 114028 24871 172543 189 -92758 130628 90891 -202357
11895 -202357 -567752 -784892 -225834 109176 8685 -387007 -465784 -204425 -113909 -184285
11885 -184285 -105399 222812 409078 390627 20308 105751 210811 -212201 -311303 -281055
11875 -281055 -409992 -238153 -351338 -362690 -194731 -360419 -670925 -430583 -149204 -37892
11865 -37892 139805 142452 233050 276648 114431 -183452 -281328 -233030 -349035 -497771 -432542
11854 -432542 -354810 -344014 -120924 -171369 -108091 381505 558771 101831 -17708 106405
11844 106405 -119005 -151588 -318102 -24291 211705 370639 462074 154224 -247989 -185485
11834 -185485 79192 185753 -20045 -88624 28003 -132115 -10131 -32624 195167 395150
11824 395150 246544 55403 -150581 -198568 -376146 10858 422422 343955 314363 172126
11814 172126 -268119 -293290 -117081 317540 427105 570425 459952 522010 408943 147465
11804 147465 280035 69149 -24245 51470 -362659 -367092 -74037 -223498 -436653 -547394
11794 -547394 -457863 -325377 -181357 -106494 8001 117970 337679 718180 458760 388031
11784 388031 323179 177111 -94096 186872 204881 159993 132498 128769 -618905 -623169 -527194
11773 -527194 -323000 -252849 -180118 -436957 -164483 212225 377244 117954 22861 306963
11763 306963 532197 374355 194573 -114600 -70427 203519 223146 111541 173659 115029
11753 115029 -90067 -15485 271406 536096 701503 538471 331986 7943 -167899 37990
11743 37990 176123 19088 -145998 -431220 -451063 -358661 -330586 -135049 -45872 42332 221177
11732 221177 367457 331025 286255 227291 369332 494635 675643 494315 142638 305876
11722 305876 149519 -284616 -469003 -479249 -420090 -152278 5102 -204605 -227031 -182844
11712 -182844 36566 -50872 116753 288653 317903 722018 943106 369157 21970 -20131
11702 -20131 60905 -68651 42841 200453 198483 136675 64966 31240 157227 341216 452622
11691 452622 408192 121508 255635 -192046 -227730 164468 433717 333566 377021 264201
11681 264201 158953 6844 -323513 -586929 -183146 -133733 33105 293894 355732 390433
11671 390433 211041 -254688 -144052 79701 -22266 -81220 1673 235695 368209 336257
11661 336257 172334 -35334 -232773 -290867 -75050 -70727 223840 325574 95828 -25174
11651 -25174 495472 645093 669666 707337 491875 258185 19870 -244740 61163 200104
11641 200104 256829 361230 283004 312083 88792 -380332 -411339 106811 285211 327959
11631 327959 492240 558350 473648 270564 193487 106507 227069 34880 -73145 -170717
11621 -170717 274809 632285 978790 630288 297571 204709 108359 29084 107619 455556
11611 455556 776180 779045 497258 -150385 -27768 110207 28442 -97507 -501791 -118126
11601 -118126 -386289 -528890 -605652 -580675 -456763 -296944 -393137 -359040 -448203 -83418
11591 -83418 89773 296117 371400 -249557 -635483 -440393 -531238 -363252 191608 415756
11581 415756 155118 -1647 -192138 -116691 168273 348253 271338 114518 -199179 -547570
11571 -547570 -341571 56273 40467 -196248 -315765 -1272 -62092 -223442 -127413 56889
11561 56889 312639 160926 -147394 -293838 -218490 73531 171700 267786 457310 293490
11551 293490 446576 592284 507475 180557 -67309 -125567 -146833 -144340 -182628 -271356 -31855
11540 -31855 211696 168858 234640 -93399 -228487 -6576 -41596 -208344 -62464 101913
11530 101913 11676 198032 292933 177431 338059 489952 106489 88547 251316 -177965
11520 -177965 -307883 -288851 -213612 -222065 -219222 -350915 -338073 -193292 -71161 -175665 -89997
11509 -89997 96908 -125952 -472763 -657315 -149421 281880 239191 124603 -37528 -79950
11499 -79950 -103559 -97177 -84304 -79415 -158017 -383864 -288356 96840 428793 268536 165217
11488 165217 19926 -250088 -208703 -48144 -127943 -169133 -306650 -308381 -245909 -462539 -333948
11477 -333948 130711 546152 650691 592132 578223 277537 198372 66481 201941 273026
11467 273026 341346 619172 361734 131353 -100204 -425290 -109889 -75203 -135981 -102506
11457 -102506 -129214 -16720 -96231 -103156 33012 70911 -72926 -84973 -99315 -223433 -113553
11446 -113553 -31964 253474 40133 -127125 -129549 46951 6834 -131820 -315834 -224500
11436 -224500 -239692 -61843 1591 -163566 -80240 -113759 -46226 -82373 59950 -178384 -161275
11425 -161275 241847 428792 352329 27811 -263528 -158372 71398 192374 273435 612226
11415 612226 857779 849295 71658 -673508 -505838 -185287 -100977 -24122 -241667 -425532
11405 -425532 -341041 -328139 -523466 -430519 -373881 -440549 -180681 -86571 -17437 295282 78018
11394 78018 -248888 -112925 -71853 -13523 -234337 -662381 -528114 -412874 -558386 -548898
11384 -548898 -366333 -51350 -259191 -738008 -617331 -343288 -113381 -303019 -295773 46602
11374 46602 307380 167383 488139 365194 37611 55677 19837 -148067 -275703 -496662
11364 -496662 -207392 -124168 -89265 -195796 -457982 -394432 -389494 -185366 217629 669167
11354 669167 783624 719181 170184 154803 99649 87255 -89813 -67260 -137752 -126429 -173669
11343 -173669 -93643 -20649 -129030 -354709 -581445 -252888 -47609 -96523 -118730 32842
11333 32842 110695 488013 409769 33416 -123966 -266413 -298646 -444051 -331311 -254344
11323 -254344 -308469 -558357 -482524 -241449 55532 -134267 -429412 -321988 -418772 -44468
11313 -44468 221200 405895 188609 -65757 453376 572498 435749 343298 319074 356255
11303 356255 351290 237535 -56564 -277110 -366494 -408067 -193485 -53541 11685 310136
11293 310136 635235 522035 91600 216359 522982 515022 647587 276357 231220 310860
11283 310860 293827 214112 18522 -111179 65219 252868 222886 -103891 95839 170517
11273 170517 60710 138082 159740 684820 1127463 971159 674841 762718 613429 81508
11263 81508 185298 168014 97266 -146437 89513 619193 639778 315568 338706 429324 203139
11252 203139 417474 490802 334787 -27013 -59138 43319 178236 350441 563483 579916
11242 579916 433129 197841 -84526 -530482 -609759 -500843 -322673 -160829 -76563 -201528
11232 -201528 -289492 -103656 -202712 -194459 313 151010 7641 -219313 -621747 -557446
11222 -557446 -386153 -343572 -160709 211000 375480 113190 -2964 -10293 -513549 -775897
11212 -775897 -401441 -176231 -126648 119290 155706 126718 -319649 -481621 -484620 -306825
11202 -306825 -150442 -106261 -36042 -85826 -208723 -164678 -257805 -495487 -597971 -419347
11192 -419347 -261787 -368432 -474796 -327966 -51798 438903 208239 9444 -29307 102127
11182 102127 -46950 -414362 -476726 -245907 52498 230761 202027 -161575 -335692 -219311
11172 -219311 -48242 -44918 -72010 -279012 -497354 -325119 -208749 -311758 -596417 -428820
11162 -428820 -302250 -127767 349123 446206 249156 71132 72030 -44876 -87000 47448
11152 47448 311460 172261 -92611 -53505 -131380 -384495 -453147 -596452 -819019 -917306
11142 -917306 -389951 156573 217114 397274 265140 47070 -93921 -259945 -334563 64252
11132 64252 63557 -149309 -237530 -274734 -287242 -537543 -771379 -202868 198515 -272343 -562205
11121 -562205 -219244 -198661 2892 374736 280493 257854 415551 669741 644488 729677
11111 729677 777699 690912 157084 421058 424977 349944 86796 -192765 -33477 231682
11101 231682 301355 214597 165808 411652 81966 -165820 2740 -354856 -487673 -396941
11091 -396941 -567193 -653436 -642433 -815234 -717812 -361076 -54304 155094 -98292 -183763
11081 -183763 -52830 -226222 -213593 -69876 -7786 211345 120946 186105 178211 -83942 125177
11070 125177 -103491 -7400 386342 502675 497965 530860 448114 -75015 -478490 -406272 -348767
11059 -348767 -376012 -164803 -259852 -175489 -79851 -14337 -265850 -465805 -385203 -349242 -788150
11048 -788150 -670462 -357507 6989 406262 41158 -153152 -442273 -560688 -642202 -536037
11038 -536037 -374116 -510676 -360536 -213610 -419410 -390030 -157924 88550 475153 205238
11028 205238 -159064 82524 18861 -247055 -183983 -93331 -43462 -254949 -606412 -799675
11018 -799675 -568815 60291 -43876 -179517 -451063 -425218 -267344 -431543 -691667 -850277
11008 -850277 -463192 246105 366015 4324 -24289 19994 97164 -121378 -298166 30425
10998 30425 -214682 -375998 -249011 -160559 -218531 -284354 -310116 -434461 -313150 -99582
10988 -99582 -75816 -258623 -131510 177173 91700 -37348 256640 90198 2551 -58932
10978 -58932 -293170 -364988 -309979 -153552 83782 -127088 53046 213681 398314 494997
10968 494997 391988 198098 88385 4650 115816 195870 342243 160339 327854 527090
10958 527090 263637 213111 204877 -128655 -32093 -184374 -669379 -475954 -464891 -394868 -524193
10947 -524193 -732996 -522055 -163678 -334809 -473557 -611090 -601133 -750882 -897044 -958864
10937 -958864 -495235 -587712 -580086 -683160 -359626 63226 256122 -76022 -375230 -550686
10927 -550686 -254186 -17432 -79332 -158020 -139405 -119248 -67063 -54702 -329693 -511276 -162042
10916 -162042 50415 189645 293470 195224 229353 81112 -162526 -292779 -116119 -113605
10906 -113605 -334008 -409269 -254236 -136297 143829 313878 135972 -253262 -533941 -517629
10896 -517629 -472758 -623066 -880099 -343548 44442 157825 209858 155545 128392 53374
10886 53374 -137305 -431985 -358155 -177424 -249854 -182644 -308461 -562101 -612067 -341651
10876 -341651 -488099 -394466 18230 193388 -87487 7858 -122165 -363383 -282909 -232425
10866 -232425 -290861 -339720 -460346 -402223 -244267 -226489 -386689 -249732 -373809 -467348
10856 -467348 -82494 -66684 -370070 -791047 -896128 -640164 -440696 -460300 -560780 -735579
10846 -735579 -432026 -123158 -78431 28479 474467 198773 -473824 -353287 -172118 -379597
10836 -379597 -700482 -672034 -539514 -389183 -293652 -363733 -382831 -425929 -253506 -115247
10826 -115247 -480475 61474 645208 571364 339667 321604 31539 -144165 -227266 -65082
10816 -65082 -277303 -240874 -304542 -466241 -327783 -346418 -353768 -356980 -345295 -226723 -211563
10805 -211563 -69578 -58414 -25581 98013 341847 381361 119273 133452 201651 -18079
10795 -18079 -255390 -606528 -713149 -534903 -415392 -240019 315472 894095 825717 535341
10785 535341 102985 104008 92423 135657 -58099 -244685 -336833 -512938 -637806 -356067
10775 -356067 -961 102916 -12871 92399 10399 -319716 -577086 -507127 -369311 -99120
10765 -99120 -89872 -196445 -419216 -743718 -616240 -551076 -688486 -697801 -485565 -134183 -65738
10754 -65738 -312975 -519395 -583590 -651543 -691177 -831908 -560744 -551464 -323620 40058 62594
10743 62594 108135 -96373 -97079 -87258 87281 377153 369962 270398 9386 -284390 -71607
10732 -71607 173304 85099 -331469 -701965 -547748 -228855 -105873 -392534 -492806 -307680
10722 -307680 -552102 -581677 -58211 143307 188208 -13287 119378 -117891 -137765 174393
10712 174393 145930 -200110 -416880 -235882 32469 10627 -198741 -99508 -86157 -177556
10702 -177556 -336031 -328089 23589 238648 -108767 26730 314028 267607 342183 202394
10692 202394 314384 192780 126726 208090 210416 27285 -437645 -366419 -89928 -178071 -545535
10681 -545535 -571070 -215017 28749 322566 307981 -75147 -278741 -174827 136695 103403
10671 103403 -64607 -191015 -562794 -661097 -418835 -366168 -477958 -254084 23884 37501
10661 37501 109477 -175851 -156257 -114805 146961 194600 109277 1593 -81180 -270562 -306898
10650 -306898 -521822 -194413 6799 -47825 -71591 36542 225750 291381 162217 151528
10640 151528 115598 29724 -197997 -487192 -627601 -835306 -773318 -390015 -61666 -218126
10630 -218126 -197073 -171334 17064 184879 376749 187080 -197934 -606661 -478930 -410575
10620 -410575 -487185 -189600 23951 -197409 -91210 89523 265127 178996 159510 273965
10610 273965 165285 -158951 -87748 -95511 -424006 -497475 -718274 -670695 -676198 -740405 -580417
10599 -580417 -236349 -93995 187732 340204 292695 -22882 -305979 -181380 41300 94126
10589 94126 -242324 -315331 -335784 -157838 -103451 -90757 -426732 -546150 -371356 -271855 -240244
10578 -240244 -390861 -327879 -185298 -520406 -542271 -1600 261848 -23934 -168420 -155767
10568 -155767 26413 -130965 -310106 -219029 118058 115710 -70047 -226295 -406071 -121149
10558 -121149 146502 26309 -153519 -145068 -52305 -76819 -45409 -294535 -301921 201641 433722
10547 433722 141232 -211433 -533950 -611261 -657923 -624012 -428125 -107090 80809 186035
10537 186035 167648 -20578 -277813 -260141 -59084 195009 437099 628641 155638 -511455
10527 -511455 -412209 -39074 -16326 -162227 43408 -66447 -103108 -49094 -70690 35640
10517 35640 -66203 53695 155825 215169 101288 229580 763746 706906 260281 138832
10507 138832 -83007 84201 105444 160265 -148648 -438412 1049 295521 621619 529389
10497 529389 431232 302322 116440 -30882 126292 175902 499814 452350 336254 274305
10487 274305 199446 -47940 -9676 -181736 -444380 -407506 -454031 -461358 -96853 171840 400334
10476 400334 295300 354370 329864 128721 -143690 -15534 -62422 -319816 -454931 -681643
10466 -681643 -513571 -406755 -336438 -388288 -396515 -282507 -426805 -641660 -710913 -380198
10456 -380198 -294000 -253603 100119 224846 19348 -168802 -89667 30120 60793 67282 193045
10445 193045 181376 -19366 -80390 -184997 -197765 72912 325928 232554 527511 209692
10435 209692 -433108 -263607 79412 411167 399199 224675 -49356 54433 292835 47279
10425 47279 49967 78865 -13431 -406853 -787958 -899196 -795899 -613490 -420555 -360256 -569961
10414 -569961 -369468 -211327 -99449 -215144 184543 219245 -4149 148985 72569 -179622
10404 -179622 -1219 46247 341355 517789 179212 -69396 -20676 77052 19779 -67556
10394 -67556 -63705 -103504 123448 38814 -244825 -376826 -305615 -75057 73758 257686 212250
10383 212250 271838 195667 190417 332189 122096 -152673 -490503 -741574 -649573 -278452
10373 -278452 288569 294791 168456 -188785 -350607 171203 316167 -133407 -223478 -166779
10363 -166779 -1882 253147 30660 -73857 47417 -37347 -144868 -3862 249629 386237
10353 386237 -151596 -304669 -122850 -251376 -338189 -395228 -714197 -881012 -696061 -297782
10343 -297782 -295859 -311414 31205 143066 286279 65680 -133080 -137248 -343661 -301203 -366232
10332 -366232 -195854 -162066 -285025 -536257 -572195 -719378 -785576 -778003 -831562 -387000 -206128
10321 -206128 96607 159434 -20678 -191166 -411731 -156564 -89869 -348637 -335536 -111812
10311 -111812 27244 -86456 -93427 -178530 121386 58896 240449 305036 100858 141874 178726
10300 178726 268835 -154481 -153326 -159961 -83149 201083 -62265 57571 117658 -234948 -258158
10289 -258158 -49490 252451 321560 330684 32874 -43259 -121414 -399473 -418560 -489956 -603709
10278 -603709 -556162 -454838 -410441 -238808 -376230 -454529 -235701 100698 138167 -252230
10268 -252230 -426579 -191667 -452745 -774480 -735880 -533823 -461947 -328746 -1708 10112
10258 10112 222513 179319 -8496 71009 155886 215087 16312 -89730 43951 -187931
10248 -187931 111858 -2104 -67861 111885 134789 98562 368024 173160 -54720 222500
10238 222500 189756 -82767 65183 277583 461762 385190 177190 174945 191713 61669
10228 61669 -34093 35114 -75037 -243861 40697 345432 150352 -317977 -145226 -51387
10218 -51387 -433023 -643426 -456648 -147131 -65400 -367618 -567700 -505357 87841 477419
10208 477419 343695 321263 415339 398111 358510 160837 -198758 -190518 240074 424547 155360
10197 155360 154797 33852 -907 62263 -60834 -251647 -337437 -523280 -452294 -531397 -371304
10186 -371304 -315152 12371 -62856 -172433 -375478 -443995 -364780 -260215 -7691 -430688
10176 -430688 -606985 -406390 -536200 -396478 -131764 -139904 -397017 -423389 -336752 -243059
10166 -243059 -361130 -547284 -394742 -389426 -339701 -324624 -101761 179423 239719 -96361
10156 -96361 -287458 -147378 536498 667803 333788 -45386 -89565 -117290 -120278 156980
10146 156980 77024 -469672 -489908 -360247 -319333 -325414 -239299 -218763 -305764 -284707 -183553
10135 -183553 -359030 -374391 -93966 -30044 -64641 -72164 132911 -220075 -285160 2562 272486
10124 272486 72049 63683 35142 250554 485240 275006 235327 76320 -117 -2260 -141549
10113 -141549 53109 -82000 -363710 -231666 20080 -11297 -132490 -45039 -135659 -203214
10103 -203214 -238562 -94039 -214792 -230635 -333651 -414137 -624982 -605406 -686013 -604317 -451712
10092 -451712 -386445 35667 224857 174963 -88986 2517 78498 -75047 -630282 -730460
10082 -730460 -249220 324417 315330 338446 511584 504117 473183 408886 345764 536224 344503
10071 344503 252968 124737 26138 248499 -1509 291129 647003 569582 177978 551933
10061 551933 1108700 1875176 3088325 4758750 6155423 6840544 7538044 10015008 11974416
10052 11974416 11445680 8116614 5463116 3986667 3066128 2829862 2480996 1843444 1437013
10043 1437013 1396044 1108994 925417 935457 777721 648818 611067 713703 877537 759490
10033 759490 789313 690826 475014 622461 800921 877967 949904 1041336 985235 470195 -79620
10022 -79620 -50306 135333 454824 473502 -99945 41793 83662 178695 530709 198888
10012 198888 104750 355427 452499 462662 319466 452151 416883 290052 394995 124776
10002 124776 -120760 -280604 -149703 54224 -52717 14255 373692 187110 -43171 298
9992 298 221090 229841 59989 61687 -10451 40046 151836 215305 81890 94615 214869 324562
9980 324562 380071 263573 -12330 -234696 -289751 -160901 -42217 -151926 -367490 -473009
9970 -473009 -384892 -93903 -152772 -149068 -191275 -238970 -62555 -46621 -158098 -139038 -49209
9959 -49209 -353862 -540745 -31769 337302 -82709 -420285 -311303 209971 452169 345671
9949 345671 588080 343341 406485 497222 171140 49347 -191314 -341880 -258951 -65855
9939 -65855 228745 127513 215467 193568 150360 129529 138421 -201076 -291594 -158764 -117216
9928 -117216 301268 96814 244122 265564 351467 407910 741295 708677 250119 115292
9918 115292 177152 402266 373934 446643 265078 291158 346431 142779 179925 320777 449927
9907 449927 286969 68283 334299 226563 -142361 -143414 -89858 317471 263297 -295631
9897 -295631 -616321 -459947 -358822 -223685 -44301 7174 -97867 -18467 -21828 152412
9887 152412 246791 76059 -411670 -215261 157111 192954 -158227 -297843 -88817 16858
9877 16858 250763 383922 497248 57804 -314942 -417590 -473194 -297259 -263423 -163556
9867 -163556 84374 132018 -2674 -328605 -183002 -104092 178025 -154501 -276532 -55932
9857 -55932 6399 134248 -143759 -314631 -220559 -284005 -397611 -263977 -215987 -264011 -473633
9846 -473633 -880680 -1018690 -770093 -261206 234318 717403 472705 120300 -30277 -185865
9836 -185865 -188862 176735 127936 -99948 -113560 -35815 -492710 -330342 29585 180113 109406
9825 109406 -84399 93993 301017 62751 127968 192526 448104 267088 -102318 -127739
9815 -127739 -148231 -337990 -444825 -381118 -39651 -8009 -109945 -269571 -394977 -305242
9805 -305242 -381067 -438980 -374386 -436143 -455259 -649594 -347863 -21013 -145942 -496094 -794614
9794 -794614 -696844 -180852 -92682 56121 50958 -85343 -154397 30355 167374 50572 -244760
9783 -244760 -483231 -448880 -77494 135167 -55167 -64496 -74963 -88448 58157 386456 534536
9772 534536 489993 672635 641648 736241 715953 554453 452129 141118 72962 511374 611263
9761 611263 93982 -116157 -65967 83675 -116634 -19056 22704 122680 161960 3414 -107040
9750 -107040 316648 436007 459701 452887 363468 -141370 -380188 -357639 -265622 314763 566860
9739 566860 464684 390230 -29867 -438717 -374519 -242331 -383805 -226867 -459658 -249507
9729 -249507 -55992 -345637 -540623 -755638 -566784 -529483 -496377 -483018 -268540 344013
9719 344013 362524 -14738 70921 -65016 -432888 -386393 -154200 113531 57452 7333 349454
9708 349454 613499 221211 -226598 -132928 -10065 140515 280588 314234 4694 -295573
9698 -295573 -274970 -116728 21490 36514 228571 221363 218012 452256 295385 217580 479814
9687 479814 210885 -431167 -177748 -23763 8052 137592 7496 -484954 -816366 -637218
9677 -637218 -492134 -440120 82844 563394 485317 624793 502314 -21939 -191291 89274
9667 89274 397673 316408 367886 448900 527515 295014 473167 414279 232841 188246 329412
9656 329412 252098 594820 451230 59482 -191645 -570992 -453606 -520737 -440019 -178946
9646 -178946 -61861 144469 -206330 -402597 -220524 -74017 -145099 -257234 -159072 77290
9636 77290 -15591 -93508 185816 306288 199751 210521 210224 57819 -92913 -358388 -321292
9625 -321292 -495828 -363548 -723988 -790009 -361544 -299681 -581390 -709332 -692633 -365345
9615 -365345 -432177 -455446 -318619 -120138 -165467 -248130 66745 288019 111762 31720 -38008
9604 -38008 -338151 -554100 -422705 -251750 -428985 -417174 -5915 549681 688350 664607
9594 664607 355784 95919 -179795 -120351 2732 277509 271934 136300 163333 47285
9584 47285 140912 -261404 -515708 -847180 -966740 -842296 -612291 -342198 -134914 -298918
9574 -298918 -93538 97200 -11012 188090 372445 289114 -124590 -175533 -72473 -46097
9564 -46097 -241645 -91483 86313 32011 -171389 -444031 -196014 -85192 68134 -53563
9554 -53563 -152700 -285874 -257600 -58580 210783 410852 359343 441570 267416 82833 177256
9543 177256 68335 292612 323968 38562 230431 226255 384520 228403 -363106 -774728
9533 -774728 -458216 -247872 -126249 352 -52585 128623 191892 146550 -333783 -380949
9523 -380949 -200494 -14251 -14666 44451 306504 -97331 -422327 -481122 -771001 -916228 -392196
9512 -392196 88976 157282 259741 92726 20693 125423 252961 279571 69045 -20400
9502 -20400 203548 383517 188362 -299353 -500928 -238868 -127408 -142998 -60844 17293
9492 17293 -94540 32754 50605 -281938 -572688 -404159 -226470 -21542 45644 -174987
9482 -174987 -294983 -407191 -480870 -120959 179607 370704 173706 -211807 -10441 103435
9472 103435 -50183 -3394 255750 141130 76930 496456 594275 269704 -35640 -134460
9462 -134460 114523 361757 -76507 -33419 200872 125279 323024 -38508 -494648 -456722
9452 -456722 -229666 140833 125133 -227510 -321556 -185817 -214332 -60995 24243 -222021
9442 -222021 -146065 214195 71232 -213654 -192050 -59150 -47007 -225873 -72525 132839
9432 132839 396268 89294 42455 -42581 -79329 45164 -414279 -431031 -85248 37393
9422 37393 -135485 -365862 -743597 -679347 70960 317415 312935 146758 -356962 -239685
9412 -239685 65684 -364678 -630872 -635957 -442150 -200152 -446877 -428598 -663468 -570035
9402 -570035 73849 214740 -37391 40529 -15085 -283581 -456433 -206751 353790 427625
9392 427625 442326 247492 39506 393241 501993 260709 -88184 -425222 -506754 -409023
9382 -409023 -85894 182259 335080 348067 420583 349890 321431 248798 221431 129831 299749
9371 299749 228427 107921 37551 -125018 -73288 371157 306231 554373 587222 83818 -449383
9360 -449383 -723070 -511443 -136294 -243120 -289259 -243788 38765 387560 85057 -392304
9350 -392304 -494344 -224726 -215966 -518780 -592260 -175127 -250966 -275153 -134697 -120525 -188655
9339 -188655 -555477 -565373 -530709 -443260 -200589 -582426 -431814 -466750 -684314 -699720 -544639
9328 -544639 -126893 -26236 -517932 -466607 -156063 -159843 -436061 -513407 -528501 -503729 -158703
9317 -158703 -281447 -215625 67031 169464 -77505 -198450 68511 85240 -43686 -251024
9307 -251024 22969 360270 -69611 -353443 -160234 -89775 -104288 153441 101626 -310617
9297 -310617 -462718 -486135 -617731 -571540 -617969 -468496 -155036 -313417 -442300 -501153
9287 -501153 -771677 -920729 -775018 -749966 -527448 -200041 32534 324977 392719 312935
9277 312935 376858 136616 -86981 -87365 -66795 85444 70732 -290390 -557027 -436935 -197098
9266 -197098 -366721 -203633 -143806 259628 561951 574274 295013 226773 255152 173262 50882
9255 50882 58098 30268 -56063 -440591 -409010 -483974 -483345 -415255 -123911 123776 390251 298828
9243 298828 -56156 -182787 -209603 -253726 -373997 -793765 -992233 -1018425 -945413 -617174
9233 -617174 -396777 -340683 -463460 -591587 -445824 125172 191659 -71716 -286207 -737768
9223 -737768 -769319 -594682 -460090 -294262 -303132 -541443 -347963 88422 261363 229591
9213 229591 24279 -2066 -286003 -169179 2359 -206267 -301663 -314204 -153737 -204147
9203 -204147 -142618 -117311 -25482 17849 -113105 -304416 -215398 -164698 -205522 -331278 -262761
9192 -262761 -187555 -215283 -282176 -57966 258554 261369 511661 501665 159719 -143660 23442
9181 23442 17400 -243374 -172174 -47855 142632 256141 537606 555259 264952 152062 -124
9170 -124 -64583 -8193 228506 430131 199968 -83274 -148841 30773 278813 429227 45768
9159 45768 -180383 -36960 390037 794264 547991 147997 297011 490042 501071 286626
$$ [...]
##END NTUPLES=NMR SPECTRUM
##END=
