##TITLE=Analysis number 322170
Compound Code cc 50210
Book Reference 464/56/4
Project Code adrs
Chemist Name chrisr
##JCAMPDX= 6.0         $$ Bruker NMR JCAMP-DX V2.0
##DATA TYPE= NMR SPECTRUM
##DATA CLASS= NTUPLES
##ORIGIN= Bruker BioSpin GmbH
##OWNER= nmr
$$ XWIN-NMR		Version 3.5
$$ Fri Sep 15 08:34:02 2006 GMT Daylight Time (UT+1h)  MAYBRIDGE\nmr@NMR_250MHZ
##.OBSERVE FREQUENCY= 250.131544655141
##.OBSERVE NUCLEUS= ^1H
##.ACQUISITION MODE= SIMULTANEOUS (DQD)
##.ACQUISITION SCHEME= undefined
##.AVERAGES= 16
##.DIGITISER RES= 18
##SPECTROMETER/DATA SYSTEM= dpx250
##.PULSE SEQUENCE= zg30
##.SOLVENT NAME= CDCl3
##.SHIFT REFERENCE= (INTERNAL, CDCl3, 0, 16.522)
##AUDIT TRAIL= $$ (NUMBER, WHEN, WHO, WHERE, WHAT)
$$ ##TITLE= Audit trail, XWIN-NMR		Version 3.5
$$ ##JCAMPDX= 5.01
$$ ##ORIGIN= Bruker BioSpin GmbH
$$ ##OWNER= nmr
$$ C:\u/data/dgb/nmr/ADRS/760/pdata/1/auditp.txt
$$ ##AUDIT TRAIL=  $$ (NUMBER, WHEN, WHO, WHERE, WHAT)
(   1,<2006-09-15 08:33:43.13 +100>,<MAYBRIDGE\nmr>,<NMR_250MHZ>,
      <created by zg, POWCHK disabled, PULCHK disabled
       configuration hash MD5:
       E2 DF 36 D8 04 B2 41 60 5A D7 A3 38 5A 4B D0 FE
       data hash MD5: 64K
       C7 52 82 7E 24 66 35 5C 5B 22 13 84 4F 4C 6E 55>)
(   2,<2006-09-15 08:33:54.39 +100>,<MAYBRIDGE\nmr>,<NMR_250MHZ>,
      <Start of raw data processing
       ef LB = 0.3 FT_mod = 6 PKNL = 1 SI = 32K 
       data hash MD5: 32K
       F7 18 B8 47 04 DD 52 31 0A 17 E7 FD D7 05 83 56>)
(   3,<2006-09-15 08:33:56.03 +100>,<MAYBRIDGE\nmr>,<NMR_250MHZ>,
      <apk 
       data hash MD5: 32K
       0D FC 5F D5 18 FC 4B 97 46 96 B6 3E 5F 9E FC 3A>)
(   4,<2006-09-15 08:33:56.74 +100>,<MAYBRIDGE\nmr>,<NMR_250MHZ>,
      <abs ABSG = 5 
       data hash MD5: 32K
       12 71 3C 6F CF 05 5F 66 1A 4A C9 DD 92 35 3B D9>)
$$ ##END=
$$ 
$$ hash MD5
$$ 10 2A 7C 8B 6B EB A8 C9 AB A0 F6 59 F4 2F 02 57
##$RELAX= 
##$RELAX= 
##$RELAX= 
##$RELAX= 
##$RELAX= 
##$RELAX= 
##$RELAX= 
$$ Bruker specific parameters
$$ --------------------------
##$DU= <C:\u>
##$EXPNO= 760
##$NAME= <ADRS>
##$PROCNO= 1
##$TYPE= <nmr>
##$USER= <dgb>
##$AMP= (0..31)
100 100 100 100 100 100 100 100 100 100 100 100 100 100 100 100 100 100 
100 100 100 100 100 100 100 100 100 100 100 100 100 100 
##$AQSEQ= 0
##$AQ_mod= 3
##$AUNM= <au_zg>
##$AUTOPOS= <33 >
##$BF1= 250.13
##$BF2= 250.13
##$BF3= 250.13
##$BF4= 250.13
##$BF5= 500.13
##$BF6= 500.13
##$BF7= 500.13
##$BF8= 500.13
##$BYTORDA= 1
##$CFDGTYP= 0
##$CFRGTYP= 5
##$CHEMSTR= <none>
##$CNST= (0..31)
1 1 145 1 1 1 1 1 1 1 1 1 1 1 1 1 1 1 1 1 1 1 1 1 1 1 1 1 1 1 1 1 
##$CPDPRG= <>
##$CPDPRG1= <>
##$CPDPRG2= <>
##$CPDPRG3= <>
##$CPDPRG4= <mlev>
##$CPDPRG5= <mlev>
##$CPDPRG6= <mlev>
##$CPDPRG7= <mlev>
##$CPDPRG8= <mlev>
##$CPDPRGB= <>
##$CPDPRGT= <>
##$D= (0..31)
0 1 0 0 0 0 0 0 0 0.06 0 0 0 0 0 0 0.0002 0 0 0 0 0 0 0 0 0 0 0 0 0 0 
0 
##$DATE= 1158305622
##$DBL= (0..7)
120 120 120 120 120 120 120 120 
##$DBP= (0..7)
150 150 150 150 150 150 150 150 
##$DBP07= 0
##$DBPNAM0= <>
##$DBPNAM1= <>
$$ [...]
##$SUBNAM7= <"">
##$SUBNAM8= <"">
##$SUBNAM9= <"">
##$SW= 20.6930455092707
##$SWIBOX= (0..15)
0 0 3 0 0 0 0 0 0 0 0 0 0 0 0 0 
##$SW_h= 5175.983436853
##$TD= 65536
##$TD0= 1
##$TE= 295.16
##$TE2= 300
##$TE3= 300
##$TEG= 300
##$TL= (0..7)
0 120 120 120 120 120 120 120 
##$TP= (0..7)
150 150 150 150 150 150 150 150 
##$TP07= 0
##$TPNAME0= <>
##$TPNAME1= <>
##$TPNAME2= <>
##$TPNAME3= <>
##$TPNAME4= <>
##$TPNAME5= <>
##$TPNAME6= <>
##$TPNAME7= <>
##$TPOAL= (0..7)
0.5 0.5 0.5 0.5 0.5 0.5 0.5 0.5 
##$TPOFFS= (0..7)
0 0 0 0 0 0 0 0 
##$TUNHIN= 0
##$TUNHOUT= 0
##$TUNXOUT= 0
##$USERA1= <user>
##$USERA2= <user>
##$USERA3= <user>
##$USERA4= <user>
##$USERA5= <user>
##$V9= 5
##$VALIST= <valist>
##$VCLIST= <CCCCCCCCCCCCCCC>
##$VD= 0
##$VDLIST= <DDDDDDDDDDDDDDD>
##$VPLIST= <PPPPPPPPPPPPPPP>
##$VTLIST= <TTTTTTTTTTTTTTT>
##$WBST= 1024
##$WBSW= 4
##$XGAIN= (0..3)
0 0 0 0 
##$XL= 0
##$YL= 0
##$YMAX_a= 324721
##$YMIN_a= -524222
##$ZGOPTNS= <>
##$ZL1= 120
##$ZL2= 120
##$ZL3= 120
##$ZL4= 120
##$ABSF1= 16.522
##$ABSF2= -4.171173
##$ABSG= 5
##$ABSL= 3
##$ALPHA= 0
##$AQORDER= 0
##$ASSFAC= 0
##$ASSFACI= 0
##$ASSFACX= 0
##$ASSWID= 0
##$AUNMP= <proc_1d>
##$AZFE= 0.1
##$AZFW= 0.1
##$BCFW= 0
##$BC_mod= 0
##$BYTORDP= 0
##$COROFFS= 0
##$CY= 12.5
##$DATMOD= 1
##$DC= 0
##$DFILT= <>
##$DTYPP= 0
##$F1P= 14.0000005364418
##$F2P= -0.99999901652339
##$FCOR= 0.5
##$FTSIZE= 32768
##$FT_mod= 6
##$GAMMA= 0
##$GB= 0
##$INTBC= 1
##$INTSCL= 1
##$ISEN= 128
##$LB= 0.3
##$LEV0= 0
##$LPBIN= 0
##$MAXI= 10000
##$MC2= 0
##$MEAN= 0
##$ME_mod= 0
##$MI= 0
##$NCOEF= 0
##$NC_proc= -5
##$NLEV= 6
##$NOISF1= 0
##$NOISF2= 0
##$NSP= 0
##$NTH_PI= 0
##$NZP= 0
##$OFFSET= 16.522
##$PC= 1
##$PHC0= 148.7724
##$PHC1= 17.31747
##$PH_mod= 1
##$PKNL= yes
##$PPARMOD= 0
##$PSCAL= 4
##$PSIGN= 0
##$REVERSE= no
##$SF= 250.13
##$SI= 32768
##$SIGF1= 0
##$SIGF2= 0
##$SINO= 400
##$SIOLD= 32768
##$SREGLST= <1H.CDCl3>
##$SSB= 0
##$STSI= 32768
##$STSR= 0
##$SW_p= 5175.98343685301
##$SYMM= 0
##$S_DEV= 0
##$TDeff= 65536
##$TDoff= 0
##$TI= <Analysis number 999999
Compound Code 99
Book Reference 9
Project Code 9>
##$TILT= no
##$TM1= 0
##$TM2= 0
##$TOPLEV= 0
##$USERP1= <user>
##$USERP2= <user>
##$USERP3= <user>
##$USERP4= <user>
##$USERP5= <user>
##$WDW= 1
##$XDIM= 32768
##$YMAX_p= 516544545
##$YMIN_p= -599550
$$ End of Bruker specific parameters
$$ ---------------------------------
##NTUPLES= NMR SPECTRUM
##VAR_NAME=  FREQUENCY,     SPECTRUM/REAL,   SPECTRUM/IMAG
##SYMBOL=    X,             R,               I
##VAR_TYPE=  INDEPENDENT,   DEPENDENT,       DEPENDENT
##VAR_FORM=  AFFN,          ASDF,            ASDF
##VAR_DIM=   32768,         32768,           32768
##UNITS=     HZ,            ARBITRARY UNITS, ARBITRARY UNITS
##FACTOR=    0.157963299565203, 1,           1
##FIRST=     4132.6476996994, 0,             0
##LAST=      -1043.33573715361, 0,           0
##MIN=       -1043.33573715361, -599550,     0
##MAX=       4132.6476996994, 516544545,     0
$$ Real data points
##PAGE= N=1
##DATA TABLE= (X++(R..R)), XYDATA
$$ [...]
23336B5140k2019q4N121j31234J5380M021M5995m719j54658n4406J6928M5054
$$ 25140 3121 3037 8158 -123076 -107696 -103675 -57680 -62399 -217057 -271463 -254535 -209481
23324b09481J35910K868Q5388Q3839n0804j58207k9844K18869N3825j01693j64984
$$ -209481 -73571 -70703 14685 98524 47720 -110487 -140331 78538 132363 30670 -134314
23313a34314j29413R7161M5897R5782Q0306k21832L5866K78839k2313j82146j85003
$$ -134314 -263727 -166566 -120669 -24887 55419 -166413 -130547 148292 125979 -56167 -241170
23302b41170P9010J35876J2333R2459L5590k8117j07131k17970O8623P4953j30708
$$ -241170 -162160 -26284 -13951 78508 114098 85981 -21150 -239120 -170497 -95544 -226252
23291b26252j57247M6316Q0988J44916J88058R8944J1649l0307J02364k15638
$$ -226252 -383499 -337183 -256195 -111279 76779 175723 187372 157065 259429 43791
23281D3791k07077J06999O1346O1651j74264k34178m3045Q6589O3067M5370q828
$$ 43791 -163286 -56287 5059 66710 -107554 -341732 -384777 -298188 -235121 -189751 -198579
23270a98579R0835j4907M9682K42368n0119o6128L3657o9438j17529j76434J1274
$$ -198579 -107744 -122651 -72969 169399 119280 53152 86809 17371 -100158 -276592 -265318
23259b65318J01004r08K07266J43795q4073j34477n8486o9974j2493J60252K3863
$$ -265318 -164314 -165222 42044 185839 101766 -32711 -91197 -161171 -173664 -13412 10451
23248A0451R2960L3331j65002j51597m7354O5933P2497j85856m6418K31858K56621
$$ 10451 103411 136742 -28260 -179857 -227211 -161278 -88781 -274637 -321055 -89197 167424
23237A67424l0630j46314l8224R2564M8442R497P2047K7359j32774p4526K2616
$$ 167424 136794 -9520 -47744 44820 93262 102759 174806 202165 69391 -5135 17481
23226A7481J06397l885l6458j16850q9340j56561J1559J02555l486L092J21769
$$ 17481 123878 119993 83535 -33315 -122655 -279216 -267657 -165102 -168588 -165496 -43727
23215d3727O53l5573j96141q6947J03934l8522J02146N3729Q54J9832j57011o4544
$$ -43727 -43074 -78647 -274788 -361735 -257801 -296323 -194177 -140448 -139594 -119762 -276773 -341317
23203c41317Q4376J48690J25288M5466q0063r9721J02325Q2147O292J492j46485
$$ -341317 -256941 -108251 17037 62503 -17560 -117281 -14956 67191 73483 74975 -71510
23192g1510o9787M7187J09850k376o0045R6170L6152J3792j00859m758o4225J92488
$$ -71510 -141297 -94110 15740 13364 -46681 49489 85641 99433 -1426 -6184 -70409 122079
23180A22079j26197j21805l5713J23196M9046K6083k3732j23664K19Q8819M4013
$$ 122079 -4118 -125923 -161636 -38440 10606 36689 12957 -110707 -110488 -21669 22344
23169B2344m0607j0408p2840r2494k4916m6898p005J36394J23599j39599k53668
$$ 22344 -18263 -28671 -101511 -194005 -218921 -265819 -272824 -136430 -12831 -152430 -406098
23158d06098P7870L04986k2696j45251n807n15L6025P8353k6632Q2745P4762M256
$$ -406098 -328228 -23242 -45938 -191189 -196996 -197511 -161486 -83133 -109765 -27020 47742 51998
23146E1998P0773j52430l9129P4500m5294m5836N6819j58123K1803J48996j8796
$$ 51998 122771 -29659 -68788 5712 -39582 -85418 -28599 -186722 -164919 -15923 -34719
23135c4719Q7962r0220j30696j01067P7630J13488J05256J14908j86748j42477
$$ -34719 53243 -36977 -167673 -268740 -191110 -77622 27634 142542 -44206 -186683
23125a86683R006N7004J04232o0605l9871L5032l7038j5747l5631j02342O6812
$$ -186683 -177677 -120673 -16441 -77046 -116917 -81885 -118923 -134670 -170301 -272643 -205831
23114b05831k157P2037K4665l1184M1368J17822J00326K177r7624o0575J3908
$$ -205831 -207988 -135951 -111286 -142470 -101102 16720 117046 119223 21599 -38976 -25068
23103b5068k3876J16341o5528k31450O5190J18414n098p1788P8542n213M6155
$$ -25068 -48944 67397 1869 -229581 -164391 -45977 -51075 -122863 -44321 -49534 -3379
23092c379N8337O3733N8629j2183m9306o8730m1527j00360m5274J87289J36088
$$ -3379 54958 118691 177320 165137 115831 47101 5574 -94786 -140060 47229 183317
23081A83317j93235q7996o94J83619L5914N344o2087M1830m1701O4716j54339
$$ 183317 -9918 -97914 -98608 85011 120925 126269 64182 106012 64311 129027 -25312
23070b5312k5661O4274J65453L0771k34398N9983P6259P688O5603j8996j06170
$$ -25312 -50973 13301 178754 209525 -24873 35110 111369 119057 184660 165664 59494
23059E9494j05355k306l2777R9177R8637Q6402o4361M5314r760p7906j21013n8767
$$ 59494 -45861 -48167 -80944 18233 116870 203272 138911 184225 174465 96559 -24454 -83221
23047h3221r3591L1666R7675J65164O3446N9091N7230j98680l4196j1414j22762
$$ -83221 -176812 -145146 -47471 117693 181139 240230 297460 98780 64584 53170 -69592
23036f9592j35505J3258J43195O9788m6035o3022j19043M1710K33571J92979j53151
$$ -69592 -205097 -191839 -48644 21144 -24891 -87913 -206956 -165246 68325 261304 108153
23025A08153k38406L1993J18219j26947j10133n5060J77306J38726l6694j3601
$$ 108153 -130253 -98260 19959 -106988 -217121 -272181 -94875 43851 7157 -6444
23015f444K8719p678j68166k983K29659M039J137L1480K6029l2345L6162q1169
$$ -6444 22275 14597 -153569 -156552 73107 77146 78283 109763 135792 103447 139609 58440
23003E8440p7683K7265j13917o5462p4160k9224R5111K83939j5929n2607m6480
$$ 58440 -19243 8022 -105895 -171357 -245517 -274741 -179630 104309 88380 35773 -10707
22992a0707l1879R6416P0982m5725n3137l881r4661j06792J17025K75506M6917
$$ -10707 -42586 53830 124812 79087 25950 22069 -72592 -179384 -62359 213147 260064
22981B60064j09483j0352n7335q1180r2513J1845j3158j39479L3957M8697J04081
$$ 260064 150581 140229 82894 1714 -90799 -78954 -92112 -231591 -197634 -148937 -44856
22970d4856J40576O7378L0399j6213o974l265p2523o8102J5705O4752j00048q6136
$$ -44856 95720 163098 193497 177284 170310 167045 94522 26420 42125 106877 6829 -79307
22958g9307p7449j34339k773O5946R3265r4015O6765K1056R1452o8890Q3032K8465
$$ -79307 -156756 -291095 -293868 -227922 -134657 -228672 -161907 -140851 -49399 -118289 -35257 -6792
22946f792l9436o2495j1449l2724j67366p7424J19928L0272j0354j12304J11018
$$ -6792 -46228 -108723 -120172 -152896 -320262 -397686 -277758 -247486 -257840 -370144 -259126
22935b59126J82452J46950n2947L294m3415j13276N2624J44706m2171j01609j1350
$$ -259126 -76674 70276 17329 20623 -22792 -136068 -83444 61262 19091 -82518 -93868
22924i3868J0212P8090j24694j3483J65496N6305Q3292N1811n1970l9107r2102
$$ -93868 -83656 -5566 -130260 -143743 21753 78058 161350 213161 161191 122084 29982
22913B9982N3470J9146K35263m6271j83514k0530N6074O5889n2302q9622K4507
$$ 29982 83452 102598 337861 291590 108076 87546 143620 209509 157207 67585 92092
22902I2092l2899m1914j32328j09853N5377J13875R0157m3856j07092k5308j500
$$ 92092 59193 17279 -115049 -224902 -169525 -55650 34507 -9349 -116441 -141749 -143249
22891a43249N123J08159J6013L5103J07887O3265r9547r8250R417O4890j312o0987
$$ -143249 -138126 -29967 -13954 21149 129036 192301 92754 -5496 3921 68811 67499 6512
22879F512r5759L3619K4300P0279j5369O533M5533j37819K3899J15930p6566K4225
$$ 6512 -89247 -55628 -31328 38951 23582 30115 75648 -62171 -38272 77658 1092 25317
22867B5317L1600q163n5366M103j6799J9980J9230o6306o9598j19748m7683J35191
$$ 25317 56917 48754 -6612 -2509 -19308 672 19902 -46404 -116002 -235750 -283433 -148242
22855a48242n6162l8477j1929M3798K8616M0520O1601O2280j3406l2402L5012
$$ -148242 -204404 -242881 -254810 -211012 -182396 -141876 -80275 -17995 -31401 -63803 -28791
22844b8791J28582R4862k6957k93013N2071j54470j80386P0184l5509L1891J43834
$$ -28791 99791 194653 167696 -125317 -73246 -227716 -408102 -337918 -373427 -341536 -197702
22833a97702J67846L1233O3581r0686j49589N0012m2713J62053j19353l8818R0776
$$ -197702 -29856 1377 64958 -25728 -175317 -125305 -168018 -5965 -125318 -164136 -73360
22822g3360R899p214n4480M0854J02375J85484R5209q4137j19457R501K17982
$$ -73360 -63461 -70675 -125155 -84301 18074 203558 298767 214630 95173 104674 322656
22811C22656j88118j10399p4310j91246K3938J05726r0650k6314o099Q6694q6860
$$ 322656 134538 24139 -50171 -241417 -217479 -111753 -202403 -228717 -234816 -148122 -234982
22800b34982K7884J05808m8149R5406n3098q7863P3049J71858K29555O8656l08855
$$ -234982 -207098 -101290 -149439 -54033 -107131 -194994 -121945 49913 279468 348124 39269
22789C9269j71915J43296N0476m9154L341N0601N5244P3387M7705O1734j80509
$$ 39269 -132646 10650 61126 11972 15313 65914 121158 194545 242250 303984 123475
22778A23475q2848N4559j62177Q2565j53061R0151J32501L4232j07078j87875
$$ 123475 40627 95186 -66991 15574 -137487 -47336 85165 119397 12319 -175556
22768a75556j16136J38708J40475n5126P7127J32184L7458L7986j14550r5206
$$ -175556 -291692 -152984 -12509 -67635 9492 141676 179134 217120 102570 7364
22758G364j52612m9327J57432j02865L5635J36626p0339k14211m2939J85368M0329
$$ 7364 -145248 -194575 -37143 -140008 -104373 32253 -38086 -252297 -295236 -109868 -69539
22747f9539N703K4533R4593j24239k8258j15572J0866p2696j37806o4133K17109
$$ -69539 -63836 -39303 55290 -68949 -97207 -212779 -201913 -274609 -412415 -476548 -259439
22736b59439J50575L5457J4866q5345p7885O9350L0625j17382p2205j8534o1815
$$ -259439 -108864 -73407 -58541 -143886 -221771 -152421 -121796 -239178 -311383 -329917 -391732
22725c91732J31079K02939N3707l7286N65j7162j47171K5664J2074M0067P3406
$$ -391732 -260653 -57714 -4007 -41293 -40728 -57890 -205061 -179397 -167323 -127256 -53850
22714e3850p6769l1352K9013n6726J9000J50923O3390n3704j19842j75790q7340
$$ -53850 -130619 -161971 -132958 -189684 -170684 -19761 43629 -10075 -129917 -305707 -393047
22703c93047K13789K72768P6011P1289K644M4959j97146P4386J3038L234J75321
$$ -393047 -179258 93510 169521 240810 243454 288413 91267 165653 178691 181925 357246
22692C57246J4879J0661k27690k32534j24253M389j12916K1141J8795N012J60590
$$ 357246 372125 382786 155096 -77438 -201691 -197302 -310218 -289077 -270282 -265270 -104680
22681a04680J57779j06275K1020r7958m4421l708J91210J18425M3741J23250n3
$$ -104680 53099 -53176 -32156 -130114 -174535 -178243 12967 131392 175133 298383 298330
22670B98330R6413j01949j75894M059j369k1975r8100J19626J79714j01552k2455
$$ 298330 394743 292794 116900 120959 119590 97615 -485 119141 298855 197303 174848
22659A74848n9276k64052j06454K575J2320l421J25228j0379n5341L5430o5141
$$ 174848 115572 -148480 -254934 -252359 -240039 -243460 -118232 -128611 -183952 -148522 -213663
22648b13663n1607k8482R4223J55423q6011l9783O2599r8069j9166l3594J36525
$$ -213663 -265270 -293752 -199529 -44106 -130117 -169900 -107301 -205370 -224536 -258130 -121605
22637a21605J24439p431m2970k8326Q0733N3594m1200N3839k786j37463J801N2811
$$ -121605 2834 -4597 -47567 -75893 4840 58434 17234 71073 68287 -69176 -67375 -14564
22625a4564K11086p8880j82939n521N4610J4328j57818J9783K7029J4926L37798
$$ -14564 196522 117642 -65297 -70818 -16208 -1880 -159698 -139915 -112886 -97960 239838
22614B39838J48815o6002l5836l5514k8368j28176o6442j6820J041j35696r1208
$$ 239838 388653 322651 286815 251301 222933 94757 28315 11495 12536 -123160 -214368
22603b14368M3434J04449J14199M6073l7530O447j35752J1734J16291n4509k9032
$$ -214368 -170934 -66485 47714 93787 56257 62704 -73048 -61314 54977 468 -28564
22592b8564O6372J26577q227m2330j21620m6717q5039m3701K2981R6222J54581
$$ -28564 37808 164385 156158 113828 -7792 -54509 -139548 -183249 -160268 -64046 90535
22581I0535J05478n5168p4163p2146m8595Q078p3779K45023J28145q2949k38745
$$ 90535 196013 140845 66682 -5464 -54059 -45981 -119760 125263 253408 170459 -68286
22570f8286j38957P4357L3873Q8311L1524N2339k05629J43249J88740k2466j7684
$$ -68286 -207243 -132886 -99013 -10702 20822 73161 -132468 10781 199521 177055 159371
22559A59371J3201m9513L1588j55333m7582P1963P317N0594M859L6151k2850k1670
$$ 159371 172572 123059 154647 -686 -48268 23695 31012 81606 86465 122616 99766 78096
22547G8096J08448L5322j6497k598n6435l9972m134k48258k020L6796j70077k9025
$$ 78096 186544 221866 205369 202771 146336 106364 102230 -146028 -148048 -111252 -281329 -310354
22535c10354J43926L2327Q5617J69835Q8599q9171p84q410j67637k9247m5900
$$ -310354 -166428 -134101 -48484 121351 209950 120779 119995 111585 -56052 -85299 -131199
22524a31199J33127O7270J1195J35901o635K7574L7897o1085r5875N5410O9722
$$ -131199 1928 69198 80393 216294 209659 237233 275130 214045 118170 173580 243302
22513B43302K5560o3180j02508r5325j65047l1622l9297o6204K03401K01816O2395
$$ 243302 268862 205682 103174 7849 -157198 -188820 -228117 -294321 -90920 110896 173291
22502A73291l4410k11538P4240J74346J62238l3320k31311r4029J4442j30028
$$ 173291 138881 -72657 1583 175929 338167 304847 73536 -20493 -6051 -136079
22492a36079J32295J29637n245n0921j80997k5611O1113J19543K2241m2778J06069
$$ -136079 -3784 125853 120608 69687 -111310 -136921 -75808 43735 65976 23198 129267
22481A29267j66005j30162P5442J5091Q5391K981k914r1184k4917L5820J37058
$$ 129267 -36738 -166900 -91458 -76367 9024 12005 9091 -82093 -107010 -71190 65868
22470F5868N6222l02O4673q458n2985j39472R0806l3984J9795M2669n0043L0848
$$ 65868 122090 121788 186461 178003 125018 -14454 76352 42368 62163 104832 54789 85637
22458H5637M501K1904J00307r1977j03279J8989q0735l0849J91460j4247P249
$$ 85637 90138 112042 212349 120372 17093 36082 -44653 -75502 115958 101711 108960
22447A08960J6822j90358j4509J4543J16389Q5245j58899j52574l6433K4826K08862
$$ 108960 125782 -64576 -79085 -64542 51847 137092 -21807 -174381 -210814 -185988 22874
22436B2874M8371O1727j46708J2028k7146r5889p561n2944J11297J72218k4933
$$ 22874 71245 132972 -13736 -1708 -28854 -124743 -132304 -185248 -73951 98267 73334
22425G3334Q5856p1727o3749p6767o4942j22502p7157p3998l3237L794j1939J69115
$$ 73334 159190 87463 23714 -53053 -117995 -240497 -317654 -391652 -424889 -421095 -433034 -263919
22413b63919J91516o7511K328J05362o769j57777k09323m0881k2097K8448J74330
$$ -263919 -72403 -139914 -137586 -32224 -38993 -196770 -406093 -446974 -469071 -440623 -266293
22402b66293J91819K3204J38307N1563L2009P324K5814L7471R4292r0316q2357
$$ -266293 -74474 -51270 87037 138600 170609 177933 203747 241218 335510 245194 162837
22391A62837O0987j15046L7080r5193o994J3949R051j52714N5408J53911k7488
$$ 162837 223824 108778 145858 50665 43671 57620 66671 -86043 -30635 123276 95788
22380I5788m3440k610P7007j44814k0848P6908P6843j17632J08827j2389P7033
$$ 95788 52348 49738 126745 -18069 -38917 37991 114834 -2798 106029 93640 170673
22369A70673N4637m941k12853j55490J50326J24124O8226j9526L6673M0148m9890
$$ 170673 225310 220369 7516 -147974 2352 126476 194702 175176 211849 251997 202107
22358B02107o9459R4197O3089j9327j59989k63837j04521R759J79245R7979n7724
$$ 202107 132648 226845 289934 270607 110618 -153219 -257740 -247981 -68736 29243 -28481
22347b8481M7131O4502P920o7213j79571n6488J37242Q2060j3359k7966l4493
$$ -28481 18650 83152 91072 23859 -155712 -212200 -74958 7102 -6257 -34223 -68716
22336f8716K205J85736j20692k7190q9375k24990J30074K29387p9367j92506O7483
$$ -68716 -66511 119225 -1467 -28657 -118032 -343022 -212948 16439 -62928 -255434 -187951
22325a87951J35734j298j612j09515j42779J45983J36367r3040o3915j1334M7512
$$ -187951 -52217 -53515 -55127 -164642 -307421 -161438 -25071 -118111 -182026 -193360 -145848
22314a45848M407J62066M2657j05182k09648n1425R9204p4499J8379J34788J39461
$$ -145848 -141441 20625 63282 -41900 -251548 -302973 -203769 -278268 -259889 -125101 14360
22303A4360N3130P1274O0853p0462m4797m7183m9796M3822N7350q6446m9977K2771
$$ 14360 67490 138764 199617 129155 84358 37175 -12621 31201 88551 2105 -47872 -25101
22291b5101Q834J56900Q9425M0734O3899P8759o8941j00618j3988R5914n3049
$$ -25101 -16267 140633 230058 270792 334691 413450 344509 243891 229903 325817 272768
22280B72768p0627k20583j51361J50927Q8448j70112O5907J51668Q6859r1574
$$ 272768 202141 -18442 -169803 -18876 69572 -100540 -34633 117035 203894 112320
22270A12320j24956j24859J9198q082j17954L987p6699J54528J49722m6788o3396
$$ 112320 -12636 -137495 -118297 -126379 -244333 -240346 -317045 -162517 -12795 -59583 -122979
22259a22979n7265R7369J0613j05871j80330J37558R8191J07973j20758P7485
$$ -122979 -180244 -82875 -72262 -178133 -358463 -220905 -122714 -14741 -135499 -58014
22249e8014Q1955K5703j02846P231J5925J1363j15710l9670M5547o9464J47310
$$ -58014 23941 49644 -53202 -45971 -30046 -18683 -134393 -174063 -128516 -197980 -50670
22238e0670N6209j08134o896J82099r785j22372O1261l1579j15650O4421K11669
$$ -50670 5539 -102595 -109491 72608 62823 -59549 1712 -29867 -145517 -81096 130573
22227A30573J60226j13538j81759j77848n6087o413m0613l6067J79692K17470
$$ 130573 290799 177261 -4498 -182346 -238433 -244846 -285459 -321526 -141834 75636
22217G5636J46776k849j964m2838r1892k87584j84092R4148J59209J13418q492
$$ 75636 222412 219563 217599 174761 82869 -204715 -388807 -294659 -135450 -22032 -30524
22206c0524K3697K03659M7085n3530m2086j95685j34858j05492J21699J16382
$$ -30524 -6827 196832 243917 190387 148301 -47384 -182242 -287734 -166035 -49653
22196d9653N6410J01250R4233K0785j8615l5303o0094q403J68898J49727m0418
$$ -49653 6757 108007 202240 223025 204410 169107 109013 100610 269508 419235 378817
22185C78817r9870j41509j98527j9005O9404o6796O2658Q4337L1038p3120J03405
$$ 378817 278947 137438 -61089 -80094 -10690 -77486 -14828 69509 100547 27427 130832
22174A30832n8365n0061j48665J66974P2525J43716R2664j27402j63298j45502
$$ 130832 72467 22406 -126259 40715 113240 256956 349620 222218 58920 -86582
22164h6582J01146J6523r0461J40356J49440k14315j70049J24249K0610r1995
$$ -86582 14564 31087 -59374 80982 230422 16107 -153942 -29693 -9083 -101078
22154a01078J84004l8156j71112j75756J15286J45320J724o7492j08227k3951
$$ -101078 82926 44770 -126342 -302098 -186812 -41492 -39768 -107260 -215487 -239438
22144b39438K52336J36557q4051j11775R7958J81377n8852k41122k723Q8249J27451
$$ -239438 12898 149455 65404 -46371 51587 232964 174112 -67010 -69733 18516 145967
22133A45967M0871j65509j46935j16210J251O1996l8967k313m4880q2584J48745
$$ 145967 186838 21329 -125606 -241816 -240565 -178569 -217536 -219849 -264729 -347313 -198568
22122a98568J1574l7969J14160O2865r2783M7232K0297Q454J7667M9107p0044
$$ -198568 -186994 -224963 -110803 -47938 -140721 -93489 -73192 -64738 -47071 2036 -68008
22111f8008p3949L1093k8656j85287Q1874K96020J08218P3662q2788j39918p5420
$$ -68008 -141957 -110864 -139520 -324807 -242933 53087 161305 234967 152179 12261 -63159
22100f3159q2560j21691J11270K75647R6423R0741M924R0616K9536j654q3887
$$ -63159 -145719 -267410 -156140 119507 215930 306671 311595 402211 431747 430093 346206
22089C46206l55573k13353j18629p2670P1092K30221J58397j00294j62708M6447
$$ 346206 -9367 -222720 -341349 -414019 -342927 -112706 45691 -54603 -217311 -170864
22079a70864R8427q7783N4194j5712N7585J31361L421o4237J8952J52462J72198
$$ -170864 -72437 -160220 -106026 -121738 -64153 67208 70629 6392 25344 177806 350004
22068C50004L8891k11602j78910q5125j46300L5157K77071M8668p8882n4692J11753
$$ 350004 388895 177293 -1617 -86742 -233042 -197885 79186 127854 48972 -5720 106033
22057A06033R5906m7384j03727m5734k491J0382q331r1233J20579Q5734j81670
$$ 106033 201939 154555 50828 5094 2603 12985 4654 -86579 34000 119734 -61936
22046f1936J60109n0085m8348K6391K1870j07930J72099M966p8296n475k1942
$$ -61936 98173 48088 -260 26131 48001 -59929 112170 117136 38840 33365 11423
22035A1423L7186j80882j9554J14988M7127q3849n2172l7126N6351p6805p3736
$$ 11423 48609 -132273 -151827 -36839 10288 -73561 -125733 -162859 -106508 -183313 -257049
22024b57049J63104J8872J49490J6557J0619m008O0446j21507j15956p8791q117
$$ -257049 -93945 -75073 74417 90974 101593 97585 158031 36524 -79432 -158223 -166340
22013a66340m2060O5899J25962m4495n985QJ97253J35726n2529j53801j247O9417
$$ -166340 -208400 -142501 -16539 -61034 -67019 -67011 130242 265968 213439 59638 58391 127808
22001A27808l3368p5462j42775j00177Q8426J9139J5809k9187L7224M5225p9152
$$ 127808 94440 18978 -123797 -223974 -135548 -116409 -100600 -129787 -92563 -47338 -126490
21990a26490k0400J19762J24236m7420L3926K5947L2687J50630Q5138j72470j30494
$$ -126490 -146890 -27128 97108 49688 83614 109561 142248 292878 378016 205546 75052
21979G5052M7211j34439o4494L6368Q9971j40313O9775K5660k7932m6065Q7860
$$ 75052 122263 -12176 -76670 -40302 49669 -90644 -20869 4791 -23141 -69206 18654
21968A8654J5353n5989m9710N3806j2916j76221j870Q0626n0964l6399M9033Q6337
$$ 18654 34007 -21982 -71692 -17886 -30802 -207023 -208893 -128267 -179231 -215630 -166597 -80260
21956h0260K11384L1084p1946o8400o4825r3992N0345K11453R6640n1781p5756
$$ -80260 131124 162208 90262 21862 -42963 -136955 -86610 124843 221483 169702 93946
21945I3946P789l9434l0688K9404N245K14096K7221q158k47444k7322J65782J07317
$$ 93946 101735 62301 31613 61017 66262 280358 307579 299421 51977 24655 190437 297754
21933B97754l6209m358j29429q438n9068L7971K6731K3264M5221r8588k31195
$$ 297754 261545 257187 127758 119320 60252 98223 124954 148218 193439 94851 -136344
21922a36344p3052n2265p0044J19878q8176J54564Q3988Q5333P0981J47564K07540
$$ -136344 -209396 -261661 -331705 -211827 -300003 -145439 -61451 23882 94863 242427 449967
21911D49967j00796q3340k9209R6743j13985Q9033p6886k19459j99203J18472
$$ 449967 349171 265831 236622 333365 219380 308413 231527 12068 -187135 -68663
21901f8663J05920p0176m3140R306k4109J2343Q6133J6959j05164q3296j6693
$$ -68663 37257 -32919 -76059 -66753 -90862 -78519 7614 24573 -80591 -163887 -180580
21890a80580k5339O2971J18137m3593j5928J82M9160q6202n1797j01382M7301
$$ -180580 -205919 -142948 -24811 -68404 -84332 -84150 -34990 -121192 -172989 -274371 -227070
21879b27070J04508J64594n789p2360R4859R6500J41471q2023k59508j00447O7622
$$ -227070 -122562 42032 36243 -36117 58742 155242 296713 214690 -44818 -145265 -77643
21868g7643M8673O6390l6736P7470Q8293J76187P7343j47079j43968q7030n9547
$$ -77643 -28970 37420 684 78154 166447 342634 419977 272898 128930 41900 -17647
21857a7647j41288j36955n4340L03009K12851j47233R2542j34505R8184L562J5183
$$ -17647 -158935 -295890 -350230 -47221 165630 18397 110939 -23566 74618 78180 93363
21846I3363j7018p1922J7492L7235l3147k42790j15902J68026J5153J58989P062
$$ 93363 76345 4423 21915 59150 26003 -216787 -332689 -164663 -149510 9479 16541
21835A6541J6657O948M8209M6795m3348k34439j32301N0143L4097P5217j70133
$$ 16541 33198 40146 88355 135150 91802 -142637 -274938 -224795 -190698 -115481 -285614
21824b85614p4095m6790J03727J43788O7724n1792j0585K12748J7060k705k0585
$$ -285614 -359709 -406499 -302772 -158984 -91260 -143052 -153637 59111 76171 73466 52881
21813E2881p3075O1805M3057j6104J19601P2620p5168p1025k16233K4481l6523
$$ 52881 -20194 41611 84668 68564 188165 260785 185617 114592 -101641 -77160 -113683
21802a13683j39204Q2538R5818j05632L8303P0268J44566Q4281q7600j1012P8264
$$ -113683 -252887 -170349 -74531 -180163 -141860 -71592 72974 157255 69655 58643 136907
21791A36907P8815j32427m0983O6143r4309k602K13193Q2047j19585r5316p0636
$$ 136907 215722 83295 42312 108455 14146 11544 224737 306784 187199 91883 21247
21780B1247J14933J62372O2699j62547k63452p7525K8630n5536K1773Q3035L2287
$$ 21247 136180 298552 361251 198704 -64748 -142273 -113643 -169179 -147406 -64371 -32084
21769c2084j88275J48777J82801l9591p1449L0916j87958K5967j5138J09335r7628
$$ -32084 -220359 -71582 111219 71628 179 31095 -156863 -130896 -146034 -36699 -134327
21758a34327j68767Q4002J18732N1767m836P800P3452j39729k0675J73m5473j63759
$$ -134327 -303094 -219092 -100360 -48593 -53429 -45629 27823 -111906 -132581 -132408 -177881 -341640
21746c41640j16796o976R0395J02434Q0307J1355M778M8646q1131K36463J85585
$$ -341640 -458436 -465412 -375017 -272583 -192276 -180921 -176143 -127497 -208628 27835 213420
21735B13420q2204n8421p581j58576q7124q5642m6328J82749J76689N3900M1341
$$ 213420 131216 72795 65214 -93362 -180486 -266128 -312456 -129707 46982 100882 142223
21724A42223k5862k49354k6403r177l6476o6287O3165R5959P7999J33786j7044
$$ 142223 116361 -132993 -159396 -168573 -205049 -271336 -208171 -112212 -34213 99573 82529
21713H2529P4739q7939k05712m6802J18913l1679j0503l844N9531L2615L1434
$$ 82529 157268 69329 -136383 -183185 -64272 -95951 -106454 -110298 -50767 -18152 13282
21702A3282j16257p1930M7490J15572K32588j6039j74651j44684J76107K4360
$$ 13282 -102975 -174905 -127415 -11843 220745 204706 30055 -114629 61478 85838
21692H5838k6347J61504N8783K8587m1214k4122m9708j00411m5045J602r8492
$$ 85838 59491 220995 279778 308365 267151 243029 193321 92910 47865 49467 -49025
21681d9025p5773L7784P7237j4477k00392J6529K10865k4476J65864J20057P9015
$$ -49025 -124798 -87014 -9777 -24254 -224646 -208117 2748 -21728 144136 264193 343208
21670C43208o9966j60338m4569Q0878L1290j14055j33755J10528R2153M5146j35736
$$ 343208 273242 112904 68335 149213 180503 66448 -67307 43221 135374 180520 44784
21659D4784j83537j1604l7379m7917Q7338o7808k3434O8686N264J2524j0131m4654
$$ 44784 -138753 -150357 -187736 -235653 -148315 -216123 -239557 -170871 -165607 -153083 -163214 -207868
21647b07868J69198n8824l8035J69493j99601k32518J19911J97278n4010j11097
$$ -207868 -38670 -97494 -135529 33964 -165637 -398155 -278244 -80966 -134976 -246073
21637b46073R5145O5952p8222J65597q8246M512L7376p299p6964Q7061R054L278
$$ -246073 -150928 -84976 -163198 2399 -85847 -81335 -43959 -51258 -128222 -41161 -32107 -28829
21625b8829R759R1665j35293L7621p2875k26050p5689m6502R055J68158Q1891
$$ -28829 -19070 72595 -62698 -25077 -97952 -324002 -399691 -446193 -437138 -268980 -187089
21614a87089P7179n0008j31346L4983J79052J00863q0237p6104l7890j65553l4793
$$ -187089 -109910 -159918 -291264 -256281 -77229 23634 -56603 -132707 -170597 -336150 -370943
21603c70943J63116L32336K9602J1936N2725N3239r5475j47760j39554R6944J56647
$$ -370943 -207827 124509 154111 166047 218772 272011 176536 28776 -110778 -13834 142813
21592A42813j2410M4967l4676j09524k20358o6630P2760Q2738L6666P1951l3738
$$ 142813 130403 175370 140694 31170 -189188 -255818 -183058 -100320 -63654 8297 -25441
21581b5441R3430M5331L9901j15886j02668j48454J25390j0714j23775p5123L1455
$$ -25441 67989 113320 153221 37335 -65333 -213787 -88397 -99111 -222886 -298009 -266554
21570b66554J27448J72753J44106m4120k47136n1981N6554J58455Q4524q1664
$$ -266554 -139106 33647 177753 133633 -113503 -165484 -108930 49525 134049 52385
21560E2385m7663m2414m2291J70673J27937l4824j33209o9568j21775J52601K1922
$$ 52385 4722 -37692 -79983 90690 218627 183803 50594 -18974 -140749 11852 33774
21549C3774j1286j00097J1419j39007l5254J47308J74225N6518m5773n7018O0543
$$ 33774 22488 -77609 -66190 -205197 -240451 -93143 81082 137600 91827 34809 95352
21538I5352j53682N8862M6104j37588n830J10074j44287p7616J09503q6884j3672
$$ 95352 -58330 532 46636 -90952 -96782 13292 -130995 -208611 -99108 -185992 -199664
21527a99664K18700J8363N018n8452q0193j0107n2279J66839l3891j28271k1885
$$ -199664 19036 37399 42417 -16035 -96228 -106335 -158614 8225 -25666 -153937 -175822
21516a75822j8792O1823m9169j94307J59036N9729R2658J89826j601l1469r941
$$ -175822 -194614 -132791 -181960 -376267 -217231 -157502 -64844 124982 123381 91912 81971
21505H1971K8459j10513q5557j02217M5584j88343q8358J66896J53167r8219n6540
$$ 81971 110430 -83 -85640 -187857 -142273 -330616 -418974 -252078 -98911 -197130 -253670
21494b53670K9834k52171J57808K12713J60364M1114M3769n3217j10999m5484
$$ -253670 -223836 -476007 -318199 -105486 54878 95992 139761 86544 -24455 -69939
21484f9939q5593j85068j80387J22910l921J12091n5966j6899J75712R6591j1864
$$ -69939 -155532 -340600 -520987 -398077 -401998 -289907 -345873 -362772 -187060 -90469 -102333
21473a02333m6508m0358J5573j3624r8724K8782K1351J76598R4181O3722j32218
$$ -102333 -148841 -189199 -173626 -187250 -285974 -257192 -235841 -59243 34938 98660 -33558
21462c3558j96752n8075L0634o0935j2933K34036K75677j25456k65578N3953Q8798
$$ -33558 -230310 -288385 -257751 -318686 -331619 -97583 178094 52638 -212940 -158987 -70189
21451g0189r5939K9688J66733J76324R7127k1074j6837k09549j03536J87677J33249
$$ -70189 -166128 -136440 30293 206617 303744 282670 265833 56284 -47252 140425 273674
21440B73674j8955k17116j82435k9976n3418L3088O9772M0036j23744o7510J19196
$$ 273674 254719 37603 -144832 -174808 -228226 -195138 -125366 -85330 -209074 -276584 -157388
21429a57388J13114J3022l5438N9012J41445R8530j94323o2392P9443J30778r3245
$$ -157388 -44274 -31252 -66690 -7678 133767 232297 37974 -24418 55025 185803 92558
21418I2558r7909R531o243o94P2396m811Q8212l1099l0903K2077j46106o0732
$$ 92558 -5351 4180 -2063 -2757 69639 64828 153040 121941 91038 113115 -32991 -93723
21406i3723Q9760O3498J292q0650o5871J58852N2921J30535j57070o4689J14883
$$ -93723 -3963 59535 60827 -19823 -85694 73158 126079 256614 99544 34855 149738
21395A49738L6883p6408M3255q7974o4144j1318P6892m4562J9306p5166N1223
$$ 149738 186621 110213 153468 65494 1350 -9968 66924 22362 41668 -33498 17725
21384A7725k7173l554q6528j21130N7608M3094J06192n0362M767o9165r5750l6755
$$ 17725 -9448 -13002 -99530 -220660 -163052 -119958 -13766 -64128 -59361 -128526 -224276 -261031
21372b61031k8601R8406M9613J1802J85187J26127j25037j51829R2579P5542P518
$$ -261031 -289632 -191226 -141613 -129811 55376 181503 56466 -95363 -2784 72758 80276
21361H0276J7105L4898j54666J78Q0251j54j32663j7244R3730K3336k5086K5015
$$ 80276 97381 132279 -22387 -22209 58042 57888 -74775 -92019 1711 25047 -39 24976
21349B4976O6173O1081j32571j9490O88L7649N1107J55291k07K2188o5054k04177
$$ 24976 91149 152230 19659 169 857 38506 89613 244904 244697 266885 201831 -2346
21337b346j27034J93895O8101O3378m5983n1512o1385j22766j30010M5223k65372
$$ -2346 -129380 64515 132616 195994 150011 98499 37114 -85652 -215662 -170439 -435811
21326d35811k4896L22873L09467q2518M2301M3788k9578k19695P0448P5821o7653
$$ -435811 -460707 -137834 171633 89115 131416 175204 145626 -74069 -3621 72200 4547
21315D547p7554j47096m7339l7245O6778J03780L6022J66447J28138O4247j21164
$$ 4547 -73007 -220103 -267442 -304687 -237909 -134129 -98107 68340 196478 260725 139561
21304A39561k19557o3653j30547J54800K75467O2680j94874o8570J38834r2325
$$ 139561 -79996 -143649 -274196 -119396 156071 218751 23877 -44693 94141 1816
21294A816j08727J51384k9304J39426p0628p2663n7278r6776Q8068J62952J12094
$$ 1816 -106911 44473 15169 154595 83967 11304 -45974 -142750 -54682 108270 220364
21283B20364j66921r429J19440J02698n2201j34292k9537o3415M8233j0574O6589
$$ 220364 53443 44014 163454 266152 213951 79659 50122 -13293 34940 24366 90955
21272I0955l6378k46903r3438J00446N8858J44810J82689J19488j60018j12523
$$ 90955 54577 -192326 -285764 -185318 -126460 18350 201039 320527 160509 47986
21262D7986Q886j14658j06806J60379o705j46960J7141J21196K35985J1835j77025
$$ 47986 56872 -57786 -164592 -4213 -10918 -157878 -140737 -19541 216444 228279 51254
21251E1254k3607j4430j22699j14641n0723J2316L2103j0389M8600P5840q0513
$$ 51254 27647 13217 -109482 -224123 -274846 -262530 -230427 -240816 -192216 -116376 -196889
21240a96889K5635r1856Q6232J50456l4251o5852R6143M4114l9461q485K11580
$$ -196889 -171254 -263110 -176878 -26422 -60673 -126525 -30382 13732 -25729 -34214 177366
21229A77366k9288l8092O658O4037r7885j91188j05920L3938K76988O8274p4430
$$ 177366 148078 109986 116644 180681 82796 -108392 -214312 -180374 96614 164888 90458
21218I0458r0954n6167j0408o4936j10620j09046P3408J06828q0474l0105J53292
$$ 90458 -496 -56663 -67071 -132007 -242627 -351673 -278265 -171437 -251911 -282016 -128724
21207a28724K18406Q9224k71552l1396N2770K2720q1367m9612Q9988j35943k1166
$$ -128724 89682 178906 -92646 -124042 -71272 -48552 -129919 -179531 -89543 -225486 -246652
21196b46652J30675J24556j24613R5727P4359j38719o6830L5356J33219p3258
$$ -246652 -115977 8579 -116034 -20307 54052 -84667 -151497 -116141 17078 -56180
21186e6180J144L3851j3345M3782P4707q1021j29031m8623L2582O5570J31656
$$ -56180 -55036 -21185 -34530 9252 83959 2938 -126093 -174716 -142134 -76564 55092
21175E5092R4452K4517j13496r118j9188n245j1046M8593j35846K0722J33176
$$ 55092 149544 174061 60565 51447 32259 27014 15968 64561 -71285 -50563 82613
21164H2613N8895p6143k01182K2618K3837r420J17909K3883J84128P7529n2839
$$ 82613 141508 65365 -135817 -113199 -89362 -98782 19127 43010 227138 304667 251828
21153B51828j67210j95380l3149K6145j59499n2007J36320K27713j03124j02745
$$ 251828 84618 -110762 -143911 -117766 -277265 -329272 -192952 34761 -68363 -171108
21143a71108j0311J75830R9704O7072m9771j33786j4961l9320k23222R520o8115
$$ -171108 -181419 -5589 94115 161187 111416 -22370 -37331 -76651 -299873 -290353 -358468
21132c58468L5524R4800O6187P2048J94842J7657j89254M641k2644p210R9094
$$ -358468 -322944 -228144 -161957 -89909 104933 122590 -66664 -62023 -84667 -91877 7217
21121G217o2425j8659N8604l0655P5664J96065J58694j40987j23603p9289N3006
$$ 7217 -55208 -73867 -15263 -45918 29746 225811 384505 243518 119915 40626 93632
21110I3632O3762K9487o8368p3788m3450N3425J51362N6258o0372j21284N4936
$$ 93632 157394 186881 118513 44725 1275 54700 206062 262320 201948 80664 135600
21099A35600j78434J8079J09192l3914j04968q1586j0711R0459J06938J02529
$$ 135600 -42834 -24755 84437 50523 -54445 -136031 -146742 -56283 50655 153184
21089A53184j48399j20874j6152o6177N1558l4475l920j03082J60026O3949L7132
$$ 153184 4785 -116089 -132241 -198418 -146860 -181335 -185255 -288337 -128311 -64362 -27230
21078b7230M2866M547M6693j13038Q7735K70350P2043j65857j01888j14726j09970
$$ -27230 15636 20183 66876 -46162 41573 311923 383966 218109 116221 1495 -108475
21067a08475m675Q3771R2676j06477p3341l6825L5320P2531l0155q4321q7976
$$ -108475 -113150 -29379 63297 -43180 -116521 -153346 -118026 -45495 -75650 -159971 -247947
21056b47947N2595J44838R3915K3151O5538J35980J2267k45268j16502p6546j79217
$$ -247947 -195352 -50514 43401 66552 132090 268070 280337 35069 -81433 -157979 -337196
21045c37196L4717L04019P3864o1968P7179J1015r6875k1698K30049m2874m9746
$$ -337196 -302479 1540 75404 13436 90615 101630 4755 -16943 213106 170232 120486
21034A20486j7649j35854j0522j6863O1020J79664k1110q2624k5122M7042j41064
$$ 120486 102837 -33017 -43539 -60402 618 180282 159172 76548 51426 98468 -42596
21023d2596j22428j29495j19514K1153J60919J35174J33774P3493j40758k2098
$$ -42596 -165024 -294519 -414033 -392880 -231961 -96787 36987 110480 -30278 -52376
21013e2376j23164p9259J5168J31505J18021m4067K2816o1734k45281j91859n4336
$$ -52376 -175540 -254799 -239631 -108126 9895 -34172 -11356 -73090 -318371 -510230 -564566
21002e64566K08123K20430j12899o4184J10282r3870J23149O7988R6844j59007
$$ -564566 -356443 -136013 -248912 -313096 -202814 -296684 -173535 -105547 -8703 -167710
20992a67710j0402J11606J36582N2263m4406j9912j9494n5731L1506j05307j41196
$$ -167710 -178112 -66506 70076 122339 77933 58021 38527 -17204 14302 -91005 -232201
20981b32201L190K00278j8666q6351k7756J0937J53101P4409J59570j4906l6815
$$ -232201 -229011 -28733 -47399 -133750 -161506 -150569 2532 76941 236511 221605 184790
20970A84790m7066j77323r8460m8685R0727m045j04381N0405J18244J1149n2512
$$ 184790 137724 -39599 -138059 -186744 -96017 -100062 -204443 -154038 -35794 -24645 -77157
20959g7157j95560P1756J41148o5302r5119L400J15226K6692M6808m0484p2779
$$ -77157 -272717 -200961 -59813 -125115 -220234 -216834 -101608 -74916 -28108 -68592 -141371
20948a41371o49k5216j5719J12934l1656R5524O4777N1186J52355Q586p9065j07653
$$ -141371 -142020 -167236 -182955 -70021 -101677 -6153 58624 109810 262165 270751 191686 84033
20936H4033j853K10649L5179j09079j97226j08137n1152p1224L8354K5635J1906
$$ 84033 82180 292829 328008 218929 21703 -86434 -137586 -208810 -170456 -144821 -132915
20925a32915p2972j33891P6187J58232q9222J25384J50773l6970o0766J10500
$$ -132915 -205887 -339778 -263591 -105359 -194581 -69197 81576 44606 -16160 94340
20915I4340K3602K3353K5432M4818R1176k0472K7812j21396n7525J74297R7293
$$ 94340 117942 141295 166727 211545 302721 282249 310061 188665 131140 305437 402730
20904D02730q6617k98648k69070J3736J20629r3747j20508K75259j6151M4494
$$ 402730 316113 17465 -251605 -237869 -117240 -210987 -331495 -56236 -72387 -27893
20894b7893J90618N1576j64162r1476J02539R4411J12705j5020j90299q5883L5357
$$ -27893 162725 214301 50139 -41337 61202 155613 268318 253298 62999 -22884 12473
20883A2473O7260j1675n925n6284O7379k5699j35875j17150K053J60389l1207
$$ 12473 79733 68058 62133 5849 73228 47529 -88346 -205496 -203443 -43054 -74261
20872g4261q5007P3070k0169L7382J38355j2092j02091n8997P30J58259N532m8594
$$ -74261 -159268 -86198 -106367 -68985 69370 57278 -44813 -103810 -103080 55179 60711 12117
20860A2117l1188l8854K405j62565K60461M8379j01131n1435K92787K0531j54779
$$ 12117 -19071 -57925 -55520 -218085 42376 90755 -10376 -61811 230976 251507 96728
20849I6728k404k5682j05793j36742j12486K26808J41208m64m0640N3344Q7462
$$ 96728 94324 68642 -37151 -173893 -286379 -59571 81637 81173 40533 93877 181339
20838A81339j34627k38171p6149Q3175M2313K1335O6843n1682k1679o7418m4359
$$ 181339 46712 -191459 -267608 -184433 -142120 -120785 -53942 -105624 -127303 -194721 -239080
20827b39080R9173K56862R7791k28581q3861Q439M7231J26370j12969K2319P188
$$ -239080 -139907 116955 214746 -13835 -97696 -89257 -42026 84344 -28625 -6306 882
20816H82k5402n0081K0459m1951n7430j1183P5130K34477R7369m7362j52071j00675
$$ 882 -24520 -74601 -54142 -96093 -153523 -164706 -89576 144901 242270 194908 42837 -57838
20804e7838L8212O2240o648Q5347N5835j07714r6494k3378n0348j57151L5193
$$ -57838 -19626 42614 35966 121313 177148 69434 -27060 -50438 -100786 -257937 -222744
20793b22744K00941J49461M6708k15955j11399k710m4010J69168K17644k4507
$$ -222744 -21803 127658 174366 -41589 -152988 -155698 -199708 -30540 187104 162597
20783A62597j10144N6239J50317P885m2168O050K15232M0591p7979n2238L0687
$$ 162597 52453 108692 259009 266894 224726 230776 446008 486599 408620 356382 387069
20772C87069j50907k50455j75919j5994R9575J34696q2156N6172m243q4464N7670
$$ 387069 236162 -14293 -190212 -206206 -106631 28065 -54091 2081 -2162 -86626 -28956
20761b8956K0592K0232R9146j47345n2466m0194Q7159K9240j22R0180j37935m787
$$ -28956 -8364 11868 111014 -36331 -88797 -128991 -41832 -12592 -12714 77466 -60469 -65256
20749f5256j08422n7857L6815R4464J16553m448L2425L9845M9098j71071J45821
$$ -65256 -173678 -231535 -194720 -100256 16297 11849 44274 84119 133217 -37854 107967
20738A07967J01470P1212l8461K0478R2728J8599p1180j2952k668k46511q9339
$$ 107967 209437 280649 242188 262666 355394 373993 302813 289861 287193 40682 -48657
20727d8657J9348K8929j9159j61224r7122k4554J7742K26345K1841n0842r2609
$$ -48657 -29309 -380 -19539 -180763 -277885 -302439 -284697 -58352 -36511 -87353 -179962
20716a79962n866r7812J6459J06547J79457Q7908O387R0268j58755p555m763j18241
$$ -179962 -185828 -283640 -267181 -160634 18823 106731 113118 203386 44631 37076 32313 -85928
20704h5928N034J68811P0687L0947j26937N7612j3235J4982o8782K0042o2626
$$ -85928 -80894 87917 158604 189551 62614 120226 106991 121973 53191 73233 10607
20693A0607n309q383j11554P1203n151O2065j60826o8216q9134M8639M5052j21608
$$ 10607 5298 -3085 -114639 -43436 -48587 13478 -147348 -215564 -304698 -256059 -211007 -332615
20681c32615r0576J46050J69138J07498j5320j09213k1305m763J2225n3931M7664
$$ -332615 -423191 -277141 -108003 -505 -15825 -125038 -146343 -151106 -138881 -192812 -145148
20670a45148J82793p6546l8357l2285J35564J32703J02835M0232j47851j12536
$$ -145148 37645 -38901 -77258 -109543 26021 158724 261559 301791 153940 41404
20660D1404j7932K13834K2578p6614j32068J18840n0595j33935K5303P1094R2339
$$ 41404 23472 237306 259884 183270 51202 170042 119447 -14488 10815 81909 174248
20649A74248j08638k22211q920l1873p6595J47243K06352k50318l9717K01400
$$ 174248 65610 -156601 -165521 -197394 -273989 -126746 79606 -170712 -210429 -9029
20639i029r998N8837K7124o7125j83087N8742o5747j0690k278j11178o4026j09558
$$ -9029 -19027 39810 66934 -191 -183278 -124536 -190283 -200973 -203251 -314429 -378455 -488013
20627d88013K43337J01946k6478j12517p9073M8545K67508l53q0272l5385P2680
$$ -488013 -244676 -142730 -169208 -281725 -360798 -312253 -44745 -45098 -125370 -160755 -88075
20616h8075J27924K36434O8767l35533k76630P9235O0985j2161R2906K9605j48311
$$ -88075 39849 276283 345050 9517 -267113 -187878 -126893 -139054 -46148 -16543 -164854
20605a64854q4563J39905j3887N5670Q6911j09606K7721J01520Q2544j52032O1690
$$ -164854 -249417 -109512 -123399 -67729 19182 -90424 -62703 38817 121361 -30671 31019
20594C1019N804O6245o9360K0528J5354r5478k1316K9665J02774K2135j32036
$$ 31019 36823 103068 33708 54236 69590 -25888 -47204 -17539 85235 107370 -24666
20583b4666j04038J72961m3758j19053k1256K6487Q537p9956J01718P2824j2488
$$ -24666 -128704 44257 499 -118554 -139810 -113323 -104786 -184742 -83024 -10200 -22688
20572b2688k9720P5252J45962R4682j07001J1494j33424j22059r6066N1834m7575
$$ -22688 -52408 22844 168806 263488 156487 167981 34557 -87502 -183568 -131734 -179309
20561a79309R0961K3426L72n2145j29225M2548m8451o611J54337P6492J05095
$$ -179309 -88348 -64922 -64550 -116695 -245920 -203372 -251823 -258434 -104097 -27605 77490
20550G7490O3869j29718m1755j08112Q4221J41804N5034p5694k1927k9694J7841
$$ 77490 141359 11641 -30114 -138226 -54005 87799 142833 67139 45212 15518 33359
20539C3359r559o6743J5697k7353j16248j72957R0925R998K1098J03132M4332
$$ 33359 23800 -42943 -27246 -54599 -170847 -343804 -252879 -242881 -221783 -118651 -74319
20528g4319j5074j44689O6167P4941J6345k1081j11860L0939J55862J795J2088
$$ -74319 -89393 -234082 -167915 -92974 -76629 -97710 -209570 -178631 -22769 -20974 -8886
20517h886J37688j6377m3004K09183m4128j33275m606j7128M748P9647N4121k5133
$$ -8886 128802 112425 69421 278604 234476 101201 96595 79467 84215 163862 217983 192850
20505A92850k7857j1509p0096j55639n7223P1100j6344J05657R6878o9776Q732
$$ 192850 164993 153484 83388 -72251 -129474 -58374 -74718 30939 127817 58041 66773
20494F6773J10377J5743j7727O7289j7124j05099l5222m5933L3662n6557o8052
$$ 66773 177150 192893 175166 242455 225331 120232 85010 39077 72739 16182 -51870
20483e1870N0946L9925O5061p4802j42667n5004L3094R9058J37986j16717Q7070
$$ -51870 -924 39001 104062 29260 -113407 -168411 -135317 -36259 101727 -14990 72080
20472G2080J01519R3250J9019j68389k21032M7610L4919j53553k1087J35803K12264
$$ 72080 173599 266849 285868 117479 -103553 -55943 -21024 -174577 -195664 -59861 152403
20461A52403J06077r9111R837j47045p1366p4671N8616K86698k0713l3692N4427
$$ 152403 258480 159369 169206 22161 -49205 -123876 -65260 221438 200725 167033 221460
20450B21460L1018k74357j44884J21871J90807J4869m3026r8871K0635J4087Q0907
$$ 221460 252478 -21879 -166763 -44892 145915 160784 117758 18887 39522 53609 134516
20439A34516J2223l3164r6909J29436L8743k32951n8091J03410o1338m2667n286
$$ 134516 146739 113575 16666 146102 184845 -48106 -106197 -2787 -64125 -106792 -112078
20428a12078k4427k326M4460J36528M2015j08169N1515r3249m3368O1721J90732
$$ -112078 -136505 -138831 -94371 42157 84172 -23997 27518 -65731 -109099 -47378 143354
20417A43354J44765k1994k7600k7552q7302N2311P50r9605P174M681j52838n9981
$$ 143354 288119 266125 238525 210973 123671 175982 176732 77127 84301 88982 -63856 -123837
20405a23837j08566O3764J42784o8717N5716l2072J00235K1330L1249J27032j56843
$$ -123837 -232403 -168639 -25855 -94572 -38856 -70928 29307 50637 81886 208918 52075
20394E2075j00899K2909M5601J80293K30739J11917q5269j72448r5481j38232
$$ 52075 -48824 -25915 19686 199979 430718 542635 457366 284918 189437 51205
20384E1205p1013p2144J08093j23896n8988n3772l3834P8412J43321N3564k4291
$$ 51205 -19808 -91952 16141 -107755 -166743 -220515 -254349 -175937 -32616 20948 -3343
20373c343j1286L8979k0103r4027o6810L1214M8228Q2174j02813j43014J36040
$$ -3343 -14629 24350 4247 -89780 -156590 -125376 -77148 5026 -97787 -240801 -104761
20362a04761J62171q4786p9105J12107r4417L8841K344J52621O8237N4817j65874
$$ -104761 57410 -27376 -106481 5626 -88791 -49950 -47606 105015 173252 228069 62195
20351F2195l53M5160R7584P2623J38258O6998j71118k39736k41151r8334M8885
$$ 62195 61842 107002 204586 277209 415467 482465 311347 71611 -169540 -267874 -218989
20340b18989J7015J95011J55538M312O280K5347q9341O9590L5022K8084k1646
$$ -218989 -201974 -6963 148575 152887 159167 184514 95173 164763 199785 227869 206223
20329B06223j47528o9921o0900l8313j9073k8693J54915J54010n8165O0390J41212
$$ 206223 58695 -11226 -72126 -110439 -129512 -158205 -3290 150720 92555 152945 294157
20318B94157J24268L2801l4028k36736j10506j7238Q4575k30922j07055R580Q5754
$$ 294157 418425 451226 417198 180462 69956 52718 137293 -93629 -200684 -191104 -105350
20307a05350L9243O4333O1170j33739l9668m98O0214l3848j81737N2174J03292
$$ -105350 -66107 -1774 59396 -74343 -114011 -114509 -54295 -88143 -269880 -217706 -114414
20296a14414L8066j6468L1569J63541J74402J7344o6938j10383j29055j04875
$$ -114414 -76348 -92816 -61247 102294 276696 294040 227102 116719 -12336 -117211
20286a17211M3474m7048P8238m2452n909J4519N8587J60886o6479j05760R8779
$$ -117211 -73737 -120785 -42547 -84999 -90908 -76389 -17802 143084 76605 -29155 69624
20275F9624m6129m8849k5777K3322M9499J38525k46175l1016J74900o6932J9964
$$ 69624 23495 -25354 -51131 -27809 21690 160215 -85960 -116976 57924 -9008 10956
20264A0956p1968n3760n046N7610P2436O7756n5484m2885K8612Q380m3350P2238
$$ 10956 -61012 -114772 -119818 -62208 10228 77984 22500 -20385 8227 16607 -26743 45495
20252D5495L229n1978K6534r4214l5846L3226J63539j9733J24912Q7688q7057
$$ 45495 48724 -3254 23280 -70934 -106780 -73554 89985 70252 195164 282852 195795
20241A95795j30604J18695Q1165j6795K2433j83179r9375J65289Q6372j25875
$$ 195795 65191 183886 265051 248256 270689 87510 -11865 153424 239796 113921
20231A13921j8438j70485M634l1591q2282K5715j09719R7826K74541J10106l6496
$$ 113921 95483 -75002 -70368 -101959 -184241 -158526 -268245 -170419 104122 214228 177732
20220A77732j61862J4906M7418r9559O4928J38039j8082m8227k4029m863J58740
$$ 177732 15870 30776 78194 -21365 43563 181602 163520 115293 91264 86401 245141
20209B45141J55135o7542j93730Q118O8128q8638Q8837J23811j44276R4572K61461
$$ 245141 400276 332734 139004 147122 215250 126612 215449 339260 194984 289556 551017
20198E51017Q6618N8279K25483K8264k19556j35996K8060j0945j65353O1983J07327
$$ 551017 637635 695914 921397 949661 730105 594109 622169 611224 445871 507854 615181
20187F15181J99660O5560O3149l2880j35683j49505J0039p9090J4616O3274R2140
$$ 615181 814841 880401 943550 910670 774987 625482 635521 556431 571047 634321 726461
20176G26461m1401j12214q8291q3885N9244J07960R9670N5023l6694j51205m3334
$$ 726461 685060 572846 484555 400670 459914 567874 667544 722567 685873 534668 491334
20165D91334Q1213J83814J83996Q9387P6430M4250l2930M8069M650m5865r6837
$$ 491334 572547 756361 940357 1029744 1106174 1150424 1117494 1165563 1170213 1124348 1027511
20154A027511q2768r8447j75464M3155M4353j45588j24208L2186L9295n1920o6807
$$ 1027511 944743 846296 670832 713987 758340 612752 488544 520730 560025 508105 441298
20143D41298k9726L9869q4544J22206K4889n2567j17130j9241J1812P27P4476
$$ 441298 411572 451441 366897 489103 513992 461425 344295 325054 336866 337593 412069
20132D12069k2287q3866J11477J02990j35103j35670k7429P4136N6549p2889o1043
$$ 412069 389782 305916 417393 520383 385280 249610 222181 296317 352866 279977 218934
20121B18934K01897o8537r0122q1949K0329J8570J31053K7116o8676n2930n3511
$$ 218934 420831 352294 262172 180223 200552 219122 350175 377291 308615 255685 202174
20110B02174q2782l6276j15930J12992M474k2400j7313J77649J87944J28349j345
$$ 202174 119392 83116 -32814 80178 84652 62252 44939 222588 410532 538881 537536
20099E37536k0228n2479o3287r1560k04651n5096Q1905k3606o6740p8190j033
$$ 537536 517308 464829 401542 309982 105331 50235 132140 108534 41794 -36396 -37429
20088c7429M4333J45675K3683J41791M9311Q258J82151O2617j28824l12679M1144
$$ -37429 6904 152579 176262 318053 367364 375622 557773 620390 491566 178887 220031
20077B20031j7948k64080p4733J16265l2790j39480J32990O1977M9854M8125j41804
$$ 220031 202083 -61997 -136730 -20465 -53255 -192735 -59745 2232 52086 100211 -41593
20066d1593n2597K66708L446k79813J69614J32079q3380j29010j06472k9253K0832
$$ -41593 -94190 172518 175964 -103849 65765 197844 114464 -14546 -121018 -150271 -129439
20055a29439J64746l7723j05375J7382K9198P4564K1088J07027J01416J20471
$$ -129439 35307 -2416 -107791 -90409 -61211 13353 34441 141468 242884 363355
20045C63355L248j34504j23246N3503J24463j45020j37163J1394m1396K5149J5517
$$ 363355 366603 232099 108853 162356 286819 141799 4636 16030 -25366 -217 15300
20034A5300p9703q747J56931K2174k679o9160N7135p4687j70068j8466p4709J13325
$$ 15300 -64403 -73150 83781 105955 103276 34116 91251 16564 -153504 -171970 -246679 -133354
20022a33354O2083J36144J28550R395n556m4947m4409Q3262j49953j64065j17917
$$ -133354 -71271 64873 193423 202818 197262 152315 107906 191168 41215 -122850 -240767
20011b40767P604Q9832J49663P3222P2502j31442N0602J68694j12883P6270q2913
$$ -240767 -233163 -143331 6332 79554 152056 20614 71216 239910 127027 203297 120384
20000A20384N212N8843N2815j40305k51543N6613m0834r6315K8141P7232M6444
$$ 120384 125596 184439 237254 96949 -154594 -97981 -138815 -235130 -206989 -129757 -83313
19989h3313O2389J0571M8800n1197K7285L2372L8945K8365Q914k9216j61089j11405
$$ -83313 -20924 -10353 38447 -12750 14535 46907 85852 114217 123131 93915 -67174 -178579
19977a78579J48810n0347o5867j2114J21609R7422J39292q9606n0565O8559J75822
$$ -178579 -29769 -80116 -145983 -158097 -36488 60934 200226 110620 60055 128614 304436
19966C04436n7668l8106j33370J28986K4830L5774j0257j07576p2971m9055q65
$$ 304436 246768 208662 75292 204278 229108 264882 254625 147049 74078 25023 24158
19955B4158K0575n4562J52535J96689l0970j72288j28608q1961o3872J5834p8147
$$ 24158 44733 -9829 142706 339395 308425 136137 7529 -74432 -138304 -122470 -200617
19944b00617J23974J01288l4382J81952J84816J08598m9452K0719n5267m5026
$$ -200617 -76643 24645 -9737 172215 357031 465629 416177 436896 381629 336603
19934C36603k6170J18503M5881p7400j60460r3723L5959J3731L5803R3595q0462
$$ 336603 310433 428936 474817 397417 236957 143234 179193 192924 228727 322322 241860
19923B41860r5384l7834j90025j12236J69814R0725J8058k9892N3690J34230j21334
$$ 241860 146476 108642 -81383 -193619 -23805 66920 84978 55086 108776 243006 121672
19912A21672O9733J62192j3299N5090L2927N5187j39730l1418K2923r5686j24068
$$ 121672 191405 353597 340298 395388 428315 483502 343772 312354 335277 239591 115523
19901A15523R6763j30872L6963J26374j2327l841N7181J20296M4106n8136J2507
$$ 115523 212286 81414 118377 244751 232424 228583 285764 406060 450166 392030 404537
19890D04537M2214j55086K4491P8257N451O259q9112j88406o4182j02613J27280
$$ 404537 446751 291665 316156 394413 399864 406123 317011 128605 64423 -38190 89090
19879H9090J51846o6189p9529J19679L4829M602K7060j75009q0414l630R5415
$$ 89090 240936 174747 95218 214897 249726 254328 281388 106379 25965 22335 117750
19868A17750P591J6898M5224j5419J02960M1211j7407J72171K07266M8559j57664
$$ 117750 125341 142239 187463 172044 275004 316215 298808 470979 678245 726804 569140
19857E69140k18521j19867J7273P6038O3949m510N5103M7550J41088j88193N2259
$$ 569140 350619 230752 248025 324063 388012 383502 438605 486155 627243 439050 491309
19846D91309n2451j05332q9018o5086M7949n1693l4594J95925J32232m1790l0414
$$ 491309 438858 333526 244508 179422 227371 175678 141084 337009 469241 427451 397037
19835C97037j13592j3797n0006L6530J28640N4433j93988q4786L2123p2021M0287
$$ 397037 283445 269648 219642 256172 384812 439245 245257 160471 192594 120573 160860
19824A60860k48584r4060J76746J00727J69302J25376Q6405j67083k70716j00551
$$ 160860 -87724 -181784 -5038 95689 264991 390367 476772 309689 38973 -61578
19814f1578J49086J70994M148j57868K12939J19482N1115j02238J10126P452j72835
$$ -61578 87508 258502 262650 104782 317721 437203 488318 386080 496206 503658 330823
19803C30823j47250r4104M5665Q0975l658q7378J13574K01397M4143K1573r7216
$$ 330823 183573 89469 135134 216109 212451 125073 238647 440044 484187 505760 408544
19792D08544O6663k7165j19635m1307L07Q637Q6309r1475o159J6364j33559P6507
$$ 408544 475207 448042 328407 287100 287407 296044 382353 290878 284719 301083 167524 244031
19780B44031Q3679L9377J0694j09869K6775q5951l2384o0463L5989P0192Q2117
$$ 244031 327710 367087 377781 267912 294687 208736 176352 115889 151878 222070 304187
19769C04187O1665J04506J11951p1816l1131n5482J72180J87297k0256J6324j0969
$$ 304187 365852 470358 582309 510493 479362 423880 596060 783357 763101 779425 768456
19758G68456J8864k07619j17036J13816J47294J35460K1299O4354O7480O5565
$$ 768456 787320 579701 462665 576481 723775 859235 880534 944888 1012368 1077933
19748A077933N7158o7843j68098j19018M1550j9050o4310j10614j9301k262j844
$$ 1077933 1135091 1067248 899150 780132 821682 802632 738322 627708 608407 606145 604301
19737F04301J03519J16428J64621j27418j73133m5633J03P2845l8368O5605K14290
$$ 604301 707820 824248 988869 861451 688318 642685 642788 715633 677265 742870 957160
19726I57160j1494J79193M3519O4693r2317k6011k8303j5757r9234j3783j7326
$$ 957160 945666 1124859 1168378 1233071 1140754 1114743 1086440 1070683 971449 957666 940340
19715I40340q0491J5430J53406K3897J07981N6799p0605n9262N211J90194j47039
$$ 940340 859849 875279 1028685 1052582 1160563 1217362 1146757 1087495 1092706 1282900 1135861
19704A135861k03445j555j21910k9751J32957R2816J26217R0443J01671q8758
$$ 1135861 932416 930861 808951 779200 912157 1004973 1131190 1221633 1323304 1234546
19694A234546q8194l569K6815o6625J36807P2312m2468n1863l0497r683l3423
$$ 1234546 1146352 1142783 1169598 1102973 1239780 1312092 1269624 1217761 1187264 1177581 1144158
19683A144158Q7509J86310L1086k8541J1974K075J43099P2517J71379R8344J26707
$$ 1144158 1231667 1417977 1449063 1420522 1432496 1434571 1577670 1650187 1821566 1919910 2046617
19672B046617p294J26729L535J69625J43515j9849R2522J16291Q4975J03331K55729
$$ 2046617 2039323 2166052 2169587 2339212 2482727 2462878 2555400 2671691 2756666 2859997 3115726
19661C115726L74683J98501m1410N5429K97495L24440K64018M32708L62479J87595
$$ 3115726 3490409 3688910 3647500 3702929 4000424 4324864 4588882 5021590 5384069 5571664
19651E571664K97642K01184K76955L34561K15998K93854O36940P84802P47188
$$ 5571664 5869306 6070490 6347445 6682006 6898004 7191858 7828798 8613600 9360788
19642I360788R41028J469753J967922K679269M013631N990487Q184461J0006305
$$ 9360788 10301816 11771569 13739491 16418760 20432391 26422878 34607339 44613644
19634D4613644J0016046Q680577Q872819J0869376J2580950J2958998Q998041
$$ 44613644 54629690 63310267 72183086 83052462 95633412 108592410 117590451
19627A17590451j005880o106880k746719L055840O400644J223994n101218m261901
$$ 117590451 116584571 110477691 107730972 110786812 117187456 118411450 113310232 109048331
19619A09048331L15589N135686Q166460Q569978M037268o751122j0985778p680317
$$ 109048331 109363920 114499606 122666066 131236044 135273312 128522190 117536412 109856095
19611A09856095l312952l001145j0320090j4138781r775866m284338Q22255M910395
$$ 109856095 106543143 103541998 93221908 79083127 69307261 65022923 65845178 70755573
19603G0755573O951445O950227O480386Q037158J0531229J2396561J1213442L784989
$$ 70755573 77707018 84657245 91137631 99174789 109706018 122102579 133316021 137101010
19595A37101010o204816o286194r02044M640622M534611l567151o590963l361763
$$ 137101010 130896194 124610000 123707956 128348578 132883189 129316038 122725075 119363312
19587A19363312J626761O056770Q196288P000062j480410j1440167j1067399o716265
$$ 119363312 120990073 127046843 135243131 142243193 140762783 129322616 118255217 111538952
19579A11538952l741240p273748j6012986j6391673j2015327q082076n795084
$$ 111538952 107797712 100523964 84510978 68119305 56103978 48021902 42226818
19572D2226818m651092l595698k792139k273158j866776j523191j326057j057435
$$ 42226818 37575726 33980028 31187889 28914731 27047955 25524764 24198707 23141272
19564B3141272j031420r25928q29436o51646m85293n70931o06909o53611p39328
$$ 23141272 22109852 21183924 20354488 19702842 19217549 18646618 18039709 17386098 16646770
19555A6646770p33190p09158m72174l02912n66122o14632m93475m02094l75664
$$ 16646770 15913580 15204422 14732248 14429336 13863214 13248582 12755107 12353013 11977349
19546A1977349j22638k15069l74549m54850m89225l35966l05433n02630m18333
$$ 11977349 11854711 11639642 11265093 10810243 10321018 9985052 9679619 9176989 8758656
19537H758656k04576k03740k83167l40898k79436p6941k53237p9898j83885n60046
$$ 8758656 8554080 8350340 8067173 7726275 7446839 7369898 7116661 7036763 6852878 6292832
19527F292832j85005N142j45384j28459j23199j69148m8253k76029l07370j97521
$$ 6292832 6107827 6112969 5967585 5839126 5715927 5546779 5498526 5222497 4915127 4717606
19517D717606M823o8388q6039j70458k01525n0925J6828p5875k47158j51318p8921
$$ 4717606 4722429 4654041 4568002 4397544 4196019 4145094 4161922 4086047 3838889 3687571 3608650
19506C608650K462j38010p0559m7945j69416l41121o133n7851q9930j23862k5198
$$ 3608650 3611112 3473102 3402543 3354598 3185182 2844061 2837928 2780077 2690147 2566285 2541087
19495B541087L4896j7065j54030k42200k03679j54013M1731N0610k8098j79970
$$ 2541087 2575983 2558918 2404888 2162688 1959009 1804996 1846727 1897337 1869239 1689269
19485A689269p0072Q8306J06715L5264p7290l9896k16535o1749m4086M8669j27801
$$ 1689269 1619197 1707503 1814218 1849482 1772192 1732296 1515761 1454012 1409926 1458595 1330794
19474A330794k06375K9628k5290M2483R9002J1279j0397j15655l40225j42179
$$ 1330794 1124419 1154047 1128757 1171240 1270242 1281521 1271124 1155469 815244 673065
19464F73065K4352J09257j1527j02801P5599L6686j83510J4268J01147M2990j56562
$$ 673065 697417 806674 795147 692346 767945 804631 621121 635389 736536 779526 622964
19453F22964k23119K4589J53468M7782p4904k31092L2206N6710j59919J26424
$$ 622964 399845 424434 577902 625684 550780 319688 351894 408604 248685 375109
19443C75109J70194j03875p4714P474m3450O5470O4756q2591J33506J1884n8863
$$ 375109 545303 441428 366714 374188 330738 396208 460964 378373 511879 523763 464900
19432D64900j72987O9223J03938j01864j11941O0666N4756m8512L4803N0529P173
$$ 464900 291913 361136 465074 363210 251269 311935 366691 318179 352982 403511 410684
19421D10684j2243l5195J71512L8001j8501r6559k55242j33770q522J34547O9099
$$ 410684 398441 363246 534758 572759 554258 457699 202457 68687 60165 194712 263811
19410B63811J58474p3850q1867P8611l6008Q1619P2314p1377o6531Q5824o3350
$$ 263811 422285 348435 266568 345179 309171 390790 463104 391727 325196 411020 347670
19399C47670r3327Q4106J2250j13401l0294O5439K31439L3074K224k6685J40573
$$ 347670 254343 338449 350699 237298 207004 272443 503882 536956 539180 512495 653068
19388F53068J51637q1922j39802n0799K3754o6566o4499M9455P1347j44484j95172
$$ 653068 804705 722783 582981 532182 555936 489370 424871 474326 545673 401189 206017
19377B06017k4008L6461N1791J18645J14987k5579N5580j6696k92869m0271K01
$$ 206017 182009 218470 270261 388906 503893 478314 533894 517198 224329 184058 184259
19366A84259N0097R7660l9959j89125j75052J89360M4741m1057l095P7435Q4062
$$ 184259 234356 332016 292057 102932 -72120 117240 161981 120924 117829 195264 279326
19355B79326k2753K34463n1267j20025Q9230J89985Q0856N8069J64369k4626j19549
$$ 279326 256573 491036 439769 319744 408974 598959 679815 737884 902253 877627 758078
19344G58078R7894J52399l1995l7835q80j07551p8517M9456l3974j88510L3031
$$ 758078 855972 1008371 976376 938541 937661 830110 751593 801049 767075 578565 611596
19333F11596q0316M2445O3469o1423k19904O0704J08017M6201n9255J9171l4003
$$ 611596 531280 573725 637194 575771 355867 416571 524588 570789 511534 530705 496702
19322D96702k9599q1754N7188j11634J2014j78429k28088p9334L8586J33702j33538
$$ 496702 467103 385349 442537 330903 342917 164488 -63600 -142934 -104348 29354 -104184
19311a04184O3353P7208m7672J3286J909p1969R2672P1634r6456Q1553J39740
$$ -104184 -40831 36377 -11295 1991 3900 -68069 24603 96237 -219 81334 221074
19300B21074J14442J273j15141j27103k1790J60693J65443J88834J94541L9362
$$ 221074 335516 336789 221648 94545 72755 233448 398891 587725 782266 821628
19290H21628l17403l0583K60346p339l08160k07422J280O9522N9141J19186n0246
$$ 821628 504225 473642 733988 726649 418489 211067 212347 281869 341010 460196 409950
19279D09950n7714K2672r0914j6271m0833j49728p9615R659J17707K2886J9145
$$ 409950 352236 374908 283994 267723 226890 77162 -2453 7206 124913 147799 166944
19268A66944J5779k5765j31402j42611j04454J64228P7458L4726J06819p0879
$$ 166944 182723 156958 25556 -117055 -221509 -57281 20177 54903 161722 90843
19258I0843j64016j74450n8634j7856R1470J26686Q0063J60663N4178n8841p7693
$$ 90843 -73173 -247623 -306257 -324113 -232643 -105957 -25894 134769 188947 130106 52413
19247E2413R1942N5816J96662L9083k04122p1425O0233R6851r9478j99380J3294
$$ 52413 144355 200171 396833 435916 231794 160369 220602 317453 217975 18595 31889
19236C1889Q9749j6254q2752J30214J01780J40364j85129P2168n6641j8412O8558
$$ 31889 121638 105384 22632 152846 254626 394990 209861 282029 225388 206976 275534
19225B75534O8999O6055r1948m3258n0919j12427R9877p3228K6027R8369r9139
$$ 275534 344533 410588 318640 275382 224463 112036 211913 138685 164712 263081 163942
19214A63942m9104J12918J09151J7150p0210q9158r3749j5341Q569r423J17746
$$ 163942 114838 227756 336907 354057 283847 194689 100940 85599 94168 84745 202491
19203B02491j46293r6060n3611j67708K32101K52123K12518k205j17778p236o4526
$$ 202491 56198 -39862 -93473 -261181 -29080 223043 435561 433356 315578 308342 243816
19192B43816j10751r9968J46294K9066j50567J18088J22810m2939m5155j46736
$$ 243816 133065 33097 179391 208457 57890 175978 298788 255849 210694 63958
19182F3958j80650j1246M4227K06500l447j34112M2220R7604J1771j2167K4397
$$ 63958 -116692 -127938 -83711 122789 119342 -14770 27450 125054 136825 124658 149055
19171A49055K4547K5315j02160n6510l425k6632N3342j8766m5915l6447J29611
$$ 149055 173602 198917 96757 40247 36822 10190 63532 44766 -1149 -37596 92015
19160I2015O7973j30162j23448M4787M3772m3866m7651r5387k0931J50656j6578
$$ 92015 159988 29826 -93622 -48835 -5063 -48929 -96580 -191967 -212898 -62242 -78820
19149g8820J27031O4205K79531j68340l46573j4363q3818J6902J23664J40858
$$ -78820 48211 112416 391947 223607 -122966 -137329 -221147 -204245 -80581 60277
19139F0277P8126j20983J21635m1566k9265l1815j13206J02890K6493P8246k5217
$$ 60277 138403 17420 139055 97489 68224 36409 -76797 26093 52586 130832 105615
19128A05615J1570n8144J02537N7370J8829K9020O5251K1382K6090M0864p7397
$$ 105615 117185 59041 161578 218948 237777 266797 332048 353430 379520 420384 342987
19117C42987j93014j77359J97821L1014m0398K0228q9957R967k758j32255l9868
$$ 342987 149973 -27386 170435 201449 161051 181279 91322 101289 98531 -33724 -73592
19106g3592N5110M2814Q7481j6774n6269o340L1322K09883q8896q7711L2966j26415
$$ -73592 -18482 24332 111813 95039 38770 32430 63752 273635 184739 97028 129994 3579
19094C579J30340K38229J46699k7159j53452o2930j63728J06311k0860j66818
$$ 3579 133919 372148 518847 491688 338236 275306 111578 217889 197029 30211
19084C0211J29564J79169N5281m3585J79938R5991k9482j53380k8447n6453J305
$$ 30211 159775 338944 394225 350640 530578 626569 597087 443707 415260 358807 360112
19073C60112p1512r1217N7914Q9166m6991N0619N5100N7066Q2152j63088j6221
$$ 360112 288600 197383 255297 344463 297472 348091 403191 460257 542409 379321 363100
19062C63100R7971n2022R7796P5624N1722L1582J04751O0951K5237L7798J6159
$$ 363100 461071 409049 506845 582469 634191 665773 770524 831475 856712 894510 910669
19051I10669k2582j18834J38560K7503j37725L3412n8679K8671L4672J38459J71116
$$ 910669 888087 769253 907813 935316 797591 831003 772324 800995 835667 974126 1145242
19040A145242j7374l57795j0027L4151j86982o8201J74381L3687k1028j9214q9845
$$ 1145242 1127868 770073 760046 794197 607215 539014 713395 747082 726054 706840 616995
19029F16995m603Q7060Q1634n1532m176j20265J59907l047j46338J05535P2794
$$ 616995 612392 699452 781086 729554 725378 605113 765020 761973 615635 721170 793964
19018G93964J31711Q0836Q6849j25075k1333N8301r9131J8597L92275J0522o6559
$$ 793964 925675 1006511 1093360 968285 946952 1005253 906122 924719 1316994 1327516 1260957
19007A260957K8337l5961p1985k29339p2201o6718j20014j17114j76901q9632
$$ 1260957 1289294 1253333 1181348 952009 879808 813090 693076 575962 399061 309429
18997C09429N4513j809J05003M541O8245j3020k3230j0053l3589Q9842M1608j86186
$$ 309429 363942 362133 467136 471677 539922 526902 503672 493619 460030 549872 591480 405294
18985D05294j83584j41632J92173K24447J1610j17496J38439n3389l3823p6346
$$ 405294 221710 80078 272251 496698 508308 390812 529251 475862 442039 365693
18975C65693k7184Q3644j48021J6926J75414J42955j25698n7625o2048R7888K20373
$$ 365693 338509 422153 274132 291058 466472 609427 483729 426104 364056 461944 682317
18964F82317J70380L0490p331P6122K7269l72440l3438K36806J29387j2902j07780
$$ 682317 852697 883187 875856 951978 979247 606807 573369 810175 939562 926660 818880
18953H18880j370j22046P8884J10147j01352l2159J21298J38839K284k20654R1481
$$ 818880 817510 695464 774348 884495 783143 750984 872282 1011121 1013405 792751 884232
18942H84232N3658m641j02617j18433j13833O9138O3824L9045q078m6350J07838
$$ 884232 937890 933249 830632 712199 598366 667504 731328 770373 762295 715945 823783
18931H23783N9063o4082j1439l1289K6139Q0865R8722j42509J08125J09735k9149
$$ 823783 882846 818764 807325 776036 802175 883040 981762 839253 947378 1057113 1027964
18920A027964j1802O8668L1097J75407J67588j05117J03085M9618J50419J18754
$$ 1027964 1016162 1084830 1115927 1291334 1458922 1353805 1456890 1506508 1656927 1775681
18910A775681K75535J45939o534K0652l3941j8503K55000J82996K8374k4587K14734
$$ 1775681 2051216 2197155 2190621 2211273 2177332 2158829 2413829 2596825 2625199 2600612 2815346
18899B815346J10240K63861L05331J76636K72564K95367N77804Q52745R83662
$$ 2815346 2925586 3189447 3494778 3671414 3943978 4239345 4817149 5669894 6653556
18890F653556J425712K375198M371209P288880R956420R823093O251974L947498
$$ 6653556 8079268 10454466 14825675 22114555 32070975 41894068 48146042 52093540
18882E2093540M153717M279238N425785P716994m169048j6679329j0799459l353406
$$ 52093540 56247257 60526495 65952280 73669274 69500226 52820897 42021438 38668032
18874C8668032K851272O590499O521253L404629J675815K279807K900450M659824
$$ 38668032 41519304 48109803 54631056 58035685 59711500 61991307 64891757 69551581
18866F9551581N699992q316234j8517979j2563199p118457m274576l065463k184727
$$ 69551581 75251573 66935339 48417360 35854161 28735704 24461128 21395665 19210938
18858A9210938j531403j183297j110787p03752n50645l22782k32258j93277j01859
$$ 19210938 17679535 16496238 15385451 14681699 14131054 13808272 13576014 13382737 13280878
18849A3280878N6744N16188O44122R19652J239003J727651L286903O019116R409420
$$ 13280878 13337622 13853810 14497932 15417584 16656587 18384238 21671141 27690257 37099677
18840C7099677J1794680J0386232O872860O085001Q403818J1353253J6656260
$$ 37099677 48894357 59280589 66153449 72238450 80642268 91995521 108651781
18833A08651781J7757788k370109j3225845n704159K938356R345329J4846548
$$ 108651781 126409569 124039460 110813615 105109456 108047812 117393141 132239689
18826A32239689Q394886j2795916j3199868l744821L777220J1331782J1017718
$$ 132239689 140634575 127838659 114638791 110893970 114671190 126002972 137020690
18819A37020690r296416j6612168r705407m161371o19899L411825l832390k0708007
$$ 137020690 127724274 111112106 101406699 97245328 96625429 100037254 96204864 75496857
18811G5496857j8151085j0878646o582734m722291l794847k783404k083351j662573
$$ 75496857 57345772 46467126 39884392 35162101 31367254 28583850 26500499 24837926
18803B4837926j132002r51430r63885p54894n66679m55947j84572o84J88464J95490
$$ 24837926 23705924 22754494 21790609 21035715 20469036 20013089 19828517 19827833 20016297 20211787
18793B0211787O70338J319928K464741M586724Q149804J1222345J1145428P407141
$$ 20211787 20882125 22202053 24666794 29253518 37403322 48625667 59771095 67178236
18785F7178236M450853M544549M847163N733511Q565772l148426k0016911j3914975
$$ 67178236 71629089 76173638 81020801 86754312 95320084 92171658 72154747 58239772
18777E8239772m613121K424412P025548P498403L961883J931455K826570L169382
$$ 58239772 53626651 56051063 63076611 70575014 74536897 76468352 79294922 82464304
18769H2464304M451133O411855p848989k1941037j5864894r524942n994925m305013
$$ 82464304 86915437 93327292 85478303 63537266 47672372 38147430 32152505 27847492
18761B7847492l377832k594614j984653j443350j228905j111196j061789j024966
$$ 27847492 24469660 21875046 19890393 18447043 17218138 16106942 15045153 14020187
18753A4020187o68584m68779m16493l27650m83893n20300l17586l44244k50849
$$ 14020187 13351603 12882824 12466331 12138681 11654788 11134488 10816902 10472658 10221809
18744A0221809J5507n1109l46863l42470k94459k29622j12473Q3462l7216j55364
$$ 10221809 10237316 10186207 9839344 9496874 9202415 8972793 8860320 8943782 8906566 8751202
18734H751202j50934l3385l70561k77124k80659r1660r0418O9943k4452p2713
$$ 8751202 8600268 8566883 8196322 7919198 7638539 7546879 7456461 7526404 7501952 7429239
18724G429239o9984k6011m0429k27591j00051l13198k00590l14618j80542j61070
$$ 7429239 7359255 7333244 7292815 7065224 6965173 6651975 6451385 6136767 5956225 5795155
18714E795155l24142l37626j41236l17821k44537P242r5152j30084m28470l88952
$$ 5795155 5471013 5133387 4992151 4674330 4429793 4437035 4341883 4211799 3783329 3394377
18704C394377k25877j24856o7445j14499K1790M2103k64329j53182j81496j06496
$$ 3394377 3168500 3043644 2976199 2861700 2883490 2925593 2661264 2508082 2326586 2220090
18694B220090q6110o1993R8515Q7412N9016j82769J84455K20704j17077j64966
$$ 2220090 2133980 2071987 2170502 2257914 2316930 2134161 2318616 2539320 2422243 2257277
18684B257277R9806J16483j6273m5465P0839j37465k09368j48157k39420r3851
$$ 2257277 2357083 2473566 2457293 2411828 2482667 2345202 2135834 1987677 1748257 1654406
18674A654406Q5933k40166j99017J380j1184q1130l194k2280J04037k9621L4953
$$ 1654406 1740339 1500173 1301156 1302536 1291352 1210222 1207028 1184748 1288785 1259164 1294117
18663A294117L1168j11807k3523j36821j27402O0289N0153j23827M2712n3262
$$ 1294117 1325285 1213478 1189955 1053134 925732 986021 1036174 912347 955059 901797
18653I01797p9710J46507k015N8038j41816j18470q9859K415P1406N8722n6260
$$ 901797 822087 968594 966579 1024617 882801 764331 674472 676887 748293 807015 750755
18642G50755O095R4295j27791j6579J00226M7313P6430J48360J64172Q6169j87802
$$ 750755 756850 851145 723354 706775 807001 854314 930744 1079104 1243276 1329445 1141643
18631A141643j36252K38555J21096J67794J42688K28414Q7020l2805k98129k63662
$$ 1141643 1005391 1243946 1365042 1532836 1675524 1903938 1990958 1958153 1660024 1396362
18621A396362j73000k1178J14633m5063l27097q0798P9254J3443l3391J9323n5994
$$ 1396362 1223362 1202184 1316817 1271754 944657 863859 943113 956556 923165 942488 886494
18610H86494j94981k2015j14068r988N4724Q9560q011O2019J2044k910j59259
$$ 886494 691513 669498 555430 545442 600166 689726 681715 743734 755778 752868 593609
18599E93609j1672p4440j3386k29139k4692n434N5404O922p5842J29881j5212
$$ 593609 581937 507497 494111 264972 240280 234846 290250 297172 221330 351211 335999
18588C35999J11987p6769R7808J50794J20437K37001j37069j42878Q1686K8801
$$ 335999 447986 371217 469025 619819 740256 977257 840188 697310 778996 807797
18578H07797l526R6826n8307j12046J10758J539j52462K3783J09050J05365J25482
$$ 807797 804271 901097 842790 730744 841502 843041 690579 714362 823412 928777 1054259
18567A054259j28596j94775j2220j73124r5969r0883j37945j18436l5437O2639
$$ 1054259 925663 730888 718668 545544 449575 358692 220747 102311 66874 129513
18557A29513J39306L8052R3109L3324j1349R0800Q3037o0020l5512q5494j39535
$$ 129513 268819 306871 399980 433304 421955 512755 595792 535772 500260 414766 275231
18546B75231n929R4575K10250M3789r4711j4246L2779o2835J2007o4969K4435
$$ 275231 269302 363877 574127 617916 523205 508959 541738 478903 490910 425941 450376
18535D50376q9132L2221j45882Q1445P2516M2064j82733k22077o0086P0417K12063
$$ 450376 361244 393465 247583 329028 401544 443608 260875 38798 -21288 49129 261192
18524B61192J30514J01104P6369j94330j28123O6379O3129J9170O1605R2841K28432
$$ 261192 391706 492810 569179 374849 246726 313105 376234 395404 457009 549850 778282
18513G78282N1312Q2801K1322o8756r2596j499L2251l7883j17861n1255l4831
$$ 778282 829594 912395 933717 864961 772365 770866 803117 765234 647373 596118 561287
18502E61287o4355M3751M9857P7430j05925M6548l3753r3326n203J27107n6927
$$ 561287 496932 540683 590540 667970 562045 608593 574840 481514 476311 603418 546491
18491E46491k27226j35528l3659J22436K35627Q1300m2950j06652o8400m5122
$$ 546491 319265 183737 150078 272514 508141 589441 546491 439839 371439 326317
18481C26317J26502J10497k00648j34980J23529J31944k2273j13286m2539P0125
$$ 326317 452819 563316 362668 227688 351217 483161 460888 347602 305063 375188
18471C75188J51493j16541m9646L04833J81187j47125j33466o7463O3456K31641
$$ 375188 526681 410140 360494 665327 846514 699389 565923 498460 561916 793557
18461G93557J70740k3560l1568m4990O2521l1172j41959k8887L8846j28541J0529
$$ 793557 964297 940737 909169 864179 926700 895528 753569 724682 763528 634987 645516
18450F45516M9741Q4889J3855n0733J3148Q093K9614k05132k36541M3140K56720
$$ 645516 695257 780146 794001 743268 756416 764509 794123 588991 352450 395590 652310
18439F52310P0050j4195r2097M404Q0238j42995j34375K4154K2033l2598j0762
$$ 652310 722360 708165 616068 620472 700710 557715 423340 447494 469527 436929 426167
18428D26167p5757M7857j27353K9806K42353P0026K6440o1313p0283j0937Q1901
$$ 426167 350410 398267 270914 300720 543073 613099 639539 578226 507943 497006 578907
18417E78907J1299j3233K26978J01516n3455j83552j2901j879m5299j24299m0381
$$ 578907 590206 576973 803951 905467 852012 668460 655559 653680 608381 484082 443701
18406D43701P5270O025n208j00095o3165R6767J17629k1399K25045L3641R344
$$ 443701 518971 524996 519788 419693 356528 453295 570924 549525 774570 808211 817555
18395H17555J18016R9847J56202J88685N6322J97030J17464R4421J87059K0708
$$ 817555 935571 1035418 1191620 1380305 1436627 1633657 1751121 1845542 2032601 2053309
18385B053309l4651j37903j13467r6503K04416P6287j73486P7299O2445Q3541
$$ 2053309 2018658 1880755 1767288 1670785 1875201 1951488 1778002 1855301 1917746 2001287
18375B001287l3547L2467p6496Q7859p7910r9783J13079M784j25532k42101j39342
$$ 2001287 1967740 2000207 1923711 2011570 1933660 1833877 1946956 1951740 1826208 1584107 1444765
18364A444765l0357K78641K61963n0293j61106j59458j54900K05713J99421J2172
$$ 1444765 1414408 1693049 1955012 1904719 1743613 1584155 1429255 1634968 1834389 1846561
18354A846561R0179j2490J17237K13087j6016K3812J53856J49416P2909K51508
$$ 1846561 1936740 1924250 2041487 2254574 2238558 2262370 2416226 2565642 2638551 2890059
18344B890059O3628O7679K54630J61749K23476L47177L80551O7326K0402M5980
$$ 2890059 2953687 3021366 3275996 3437745 3661221 4008398 4388949 4456275 4476677 4522657
18334D522657M9447K36002r4710k86447j31507k03034m5052j4796N9292n6433
$$ 4522657 4572104 4808106 4713396 4426949 4295442 4092408 4047356 4032560 4091852 4035419
18324D035419r2750R1031J08619j6989j63941j11418o0009Q6311L2937j28109
$$ 4035419 3942669 4033700 4142319 4125330 3961389 3849971 3789962 3876273 3909210 3781101
18314C781101l90652j81114K7765N4271J31240J44914j50211q567P448Q9019J21729
$$ 3781101 3390449 3209335 3237100 3291371 3422611 3567525 3417314 3408747 3416195 3505214 3626943
18303C626943Q8262J73669n2227j01612n227J35163J95710n6688j23113o2195
$$ 3626943 3715205 3888874 3836647 3735035 3729808 3864971 4060681 4003993 3880880 3818685
18293C818685L5746P7956J98530K91341K01504J23620L9583j0852j4464n4305
$$ 3818685 3854431 3932387 4130917 4422258 4623762 4747382 4786965 4776113 4761649 4707344
18283D707344k11167j71629j18722q0867k8808J46523K43198L25404K19582K88747
$$ 4707344 4496177 4324548 4205826 4124959 4096151 4242674 4485872 4811276 5030858 5319605
18273E319605M18872M08528K98770K12163K45619M60636O40783Q36649J587898
$$ 5319605 5738477 6147005 6445775 6657938 6903557 7364193 8004976 8841625 10429523
18264A0429523K663193L918059M080960K876856J805876K211516K815362L689434
$$ 10429523 13092716 17010775 21091735 23968591 25774467 27985983 30801345 34490779
18256C4490779O118166N771551J153776K617996N281046O605706N628813M030917
$$ 34490779 40608945 46380496 47534272 50152268 55433314 62039020 67667833 71698750
18248G1698750N096724N878194j247762j761972N46865o319891m433932j935368
$$ 71698750 76795474 82673668 81425906 79663934 80210799 73890908 69456976 67521608
18240F7521608j772213n91331N50903J954035M946928r37149j5114061j3318519
$$ 67521608 65749395 65158064 65708967 67663002 72609930 71672781 56558720 43240201
18232D3240201p562773m382560k601582j733635j008261n52703l67578O6385L03574
$$ 43240201 35677428 31294868 28693286 26959651 25951390 25398687 25031109 25097494 25401068
18223B5401068N93759Q59597J206294J326665K162794M162365P008024J0553334
$$ 25401068 25994827 26854424 28060718 29387383 31550177 35712542 42720566 53273900
18215E3273900J3153507J2385022R332340R156837J2192558J6816576K7638938
$$ 53273900 66427407 78812429 88144769 97301606 109494164 126310740 153949678
18208A53949678M4069322M5398721M1016881L1869993K3435429K7608567L2562200
$$ 153949678 198019000 243417721 284434602 316304595 339740024 367348591 399910791
18201C99910791M1452992O1360641J3820121p3807324m2149898n848686J0971068
$$ 399910791 441363783 502724424 516544545 442737221 400587323 394738637 405709705
18194D05709705K0091720M112322j3737899l888422J3705317K7236615k398650
$$ 405709705 425801425 429913747 416175848 412287426 425992743 453229358 450830708
18187D50830708n7890263q4082711o0581245l5112746j8943931j3023394k5817590
$$ 450830708 392940445 308857734 248276489 213163743 194219812 181196418 155378828
18180A55378828k6370980j7689659j2123463q772098o272433m893812m003096
$$ 155378828 129007848 111318189 99194726 90422628 84150195 79256383 75253287
18173G5253287l239717j943412K81058K766323N939041R714937J2072744J3723941
$$ 75253287 72013570 70070158 70351216 73117539 79056580 88771517 100844261 114568202
18165A14568202J5714535J4139407Q918758P957813R640296N01596l246896J997327
$$ 114568202 130282737 144422144 153340902 161298715 170939011 171440607 168193711 170191038
18157A70191038j6418758k5190654j6436193j0425025o477043l695335j962512
$$ 170191038 153772280 128581626 112145433 101720408 95243365 91548030 89585518
18150H9585518m89763l360439j1905250j1399017p539737n019465l664625l102275
$$ 89585518 89095755 85735316 73830066 62431049 54891312 49871847 46207222 43104947
18142D3104947k496405k000709j886696j466551j275796j224115j198226j122715
$$ 43104947 40608542 38607833 36721137 35254586 33978790 32754675 31556449 30433734
18134C0433734q47531l76701n2787n4438r5637K80761M94225P87173J436121J938732
$$ 30433734 29586203 29209502 29156715 29102277 29006640 29287401 29781626 30568799 32004920 33943652
18124C3943652L113052N073254P409542Q429714Q206194Q539909J1099589J7153750
$$ 33943652 37056704 42129958 49539500 57969214 66175408 74715317 85814906 102968656
18116A02968656K8364607M0919353M1608107K8356800J4506248J4419042K1617576
$$ 102968656 131333263 172252616 213860723 242217523 256723771 271142813 292760389
18109B92760389K9244973L2895155R531548m5163436o5183951m0932832k5897155
$$ 292760389 322005362 354900517 364432065 319268629 254084678 213151846 187254691
18102A87254691j4260877k3245364l2642925k3851771j5292004j0157596p583041
$$ 187254691 172993814 149748450 117105525 93253754 77961750 67804154 60221113
18095F0221113n696355m570120l731827l225563l044254k519419k153435j810271
$$ 60221113 54524758 49954638 46222811 42997248 39952994 37433575 35280140 33469869
18087C3469869j556609j367851j419151j232152q51160n09627l40398m31297l77462
$$ 33469869 31913260 30545409 29126258 27894106 27042946 26533319 26192921 25761624 25384162
18078B5384162k26044k6052n7891P3611K87024L92477J007486K254032M192534
$$ 25384162 25158118 25132066 25074175 25147786 25434810 25827287 26834773 29088805 33281339
18069C3281339O588857P163323N124402L709451M765822O834806R705208J3232519
$$ 33281339 39870196 47033519 52157921 55867372 60633194 67468000 77173208 90405727
18061I0405727O450988q504656q164276l097214P0459M079628K979279j2329603
$$ 90405727 96856715 88352059 80187783 77090569 77161028 81240656 84219935 71890332
18053G1890332j5014896r137987n270094l491970k032108k387705m912495m304246
$$ 71890332 56875436 47737449 42467355 38975385 36943277 34555572 29643077 25338831
18045B5338831k958644k201117j528667j135480r66670o37673m40162o71197q23923
$$ 25338831 22380187 20179070 18650403 17514923 16548253 15910580 15470418 14799221 13975298
18036A3975298o11043n85687o74191k94243l60447j92368j51525k36767l12574
$$ 13975298 13364255 12778568 12104377 11810134 11449687 11257319 11105794 10869027 10556453
18027A0556453j69217p2109j17774j18767j19682o7135k10890l37974l35628R6569
$$ 10556453 10387236 10315127 10197353 10078586 9958904 9891769 9680879 9342905 9007277 9103846
18017I103846J8673k24448j7421O4098j37328n83263n01777m89311l46586j23994
$$ 9103846 9122519 8898071 8880650 8944748 8807420 8224157 7722380 7233069 6886483 6762489
18007F762489k49561l47876p4633M613j1896k28765N0285J34330k39869o4189
$$ 6762489 6512928 6165052 6090419 6095032 6083136 5854371 5904656 6038986 5799117 5734928
17997E734928O5144j86640j48403l7725r851j75782q7690j52132j86331q5737
$$ 5734928 5800072 5613432 5465029 5427304 5417453 5241671 5153981 5001849 4815518 4729781
17987D729781j27074r8562k1868r0927k53840j73299j02875N5511N5129r6654
$$ 4729781 4602707 4504145 4482277 4391350 4137510 3964211 3861336 3916847 3971976 3875322
17977C875322k45188j47694K2775J97317J47232J61109p0485j49903o2887K10476
$$ 3875322 3630134 3482440 3505215 3702532 3849764 4010873 3940388 3790485 3727598 3938074
17967C938074J80466K04552J45995J71868k0846K3352K02883J56472p5755k91802
$$ 3938074 4118540 4323092 4469087 4640955 4620109 4643461 4846344 5002816 4927061 4635259
17957D635259k3836M9225J35482k2431K13203K95830J84307K85134L83677K13938
$$ 4635259 4611423 4660648 4796130 4773699 4986902 5282732 5467039 5752173 6135850 6349788
17947F349788l04738L9805p4187j27347N3194K61578K24032l02681m71108j2631
$$ 6349788 6045050 6084855 6010668 5883321 5936515 6198093 6422125 6119444 5648336 5635705
17937E635705k41588l47769l47018j93934j85048j30905J5431K1767k17454k09527
$$ 5635705 5394117 5046348 4699330 4505396 4320348 4189443 4204874 4226641 4009187 3799660
17927C799660k95735q6876k43729k01523k08169j11389p2685L9694N3889l1666
$$ 3799660 3503925 3417049 3173320 2971797 2763628 2652239 2579554 2619248 2673137 2641471
17917B641471j9986J33581l7510O5467O2165J02328J70673l224l5367J92965K85587
$$ 2641471 2621485 2755066 2717556 2783023 2845188 2947516 3118189 3114965 3079598 3272563 3558150
17906C558150J54030n82m2069K35707L54104L44869m5553J78003K83173l822L89515
$$ 3558150 3712180 3711598 3669529 3905236 4259340 4604209 4558656 4736659 5019832 5016010 5405525
17895E405525O85470M86875K9224o0271l2357J76250N30064N32870O31441N71948
$$ 5405525 6090995 6577870 6607094 6546823 6514466 6690716 7220780 7753650 8385091 8957039
17885H957039M71630P35205J411748K059822L003622N062719Q729085J2742936
$$ 8957039 9428669 10163874 11575622 13635444 16639066 21701785 30430870 43173806
17877D3173806J3881310J0487705O713611O300561P596407R791794J5908291J2394412
$$ 43173806 57055116 67542821 74256432 80556993 88153400 97945194 113853485 126247897
17869A26247897p083130q003545l939110J46802O067821J1649527J7222695J7544657
$$ 126247897 119164767 111161222 107222112 107368914 113436735 125086262 142308957 159853614
17861A59853614p051859k0932688j0918321k848311M569461P691695p358191j1920576
$$ 159853614 152801755 131869067 120950746 118102435 122671896 130363591 123005400 111084824
17853A11084824o427217m906187l032591n26749J024588M895434L275640j8358925
$$ 111084824 104657607 99751420 96718829 96192080 97216668 102112102 105387742 87028817
17845H7028817k2077118j3549363q058713n264855l774884k945503k086460j348512
$$ 87028817 64951699 51402336 43343623 38078768 34303884 31358381 29271921 27923409
17837B7923409r68397n90036l41004l88158Q8475P17056J713886L091040N680225
$$ 27923409 26955012 26364976 26023972 25635814 25724289 26441345 28155231 31246271 36926496
17828C6926496Q526780R329026O690127L964919L736307M410584N457411Q217245
$$ 36926496 45453276 54782302 61472429 65437348 69173655 73584239 79041650 87258895
17820H7258895L362340r693556n122302N016920R567471Q372201N634030M400574
$$ 87258895 90621235 80927679 75805377 80822297 90389768 98761969 104395999 108796573
17812A08796573M479217O819506Q450872k911317j5511689k0242047j2346328
$$ 108796573 113275790 120095296 128546168 125634851 110123162 89881115 77534787
17805G7534787l058836J015841M28097l63613M10716J244952K504287M958536
$$ 77534787 74475951 75491792 75919889 75556276 75966992 77211944 79716231 84674767
17797H4674767l421601j5706716j1671669n092737n27804M045369Q437999R952750
$$ 84674767 81253166 65546450 53874781 48782044 48254240 52299609 60737608 70690358
17789G0690358P489347N695459P390849J1108522J5920852J8680663N185537j4872907
$$ 70690358 78179705 83875164 91266013 102374535 118295387 136976050 142161587 127288680
17781A27288680j2393046n492342p88722L973799n382648k3361972j9542533j1858461
$$ 127288680 114895634 109403292 108614570 112588369 107205721 83843749 64301216 52442755
17773E2442755p374253m933611l699078k674917j951020j420828j144773o11873
$$ 52442755 45068502 40134891 36435813 33760896 31809876 30389048 29244275 28632402
17765B8632402K42570Q21004J462276K839795N014017Q447213J0933214J0134359
$$ 28632402 28874972 29695976 31158252 33998047 39012064 47459277 58392491 68526850
17757F8526850P099538O657919R610316J3419549J7858653J5552661m688395j3391084
$$ 68526850 75626388 82284307 91894623 105314172 123172825 138725486 134037091 120646007
17749A20646007o291902j18450O546086J0758583l975397j2397539p801587k764359
$$ 120646007 114354105 114235655 120781741 131540324 127564927 115167388 107365801 104601442
17741A04601442K563282P781527J2962220J4043542l901514j6729817j0515682
$$ 104601442 107164724 114946251 127908471 141952013 138050499 121320682 110805000
17734A10805000m606291k82815K364016j0956346k1673537j5279124r525485o080945
$$ 110805000 106198709 105915894 108279910 97323564 75650027 60370903 50845418 44764473
17726D4764473m508780l194346k125005j737379j480522j040306o76348j65963
$$ 44764473 40255693 37061347 34936342 33198963 31718441 30678135 30001787 29835824
17718B9835824O51866J441902K921556N461080Q439110J0363989Q361355N774783
$$ 29835824 30487690 31929592 34851148 40312228 48751338 59115327 67476682 73251465
17710G3251465N932557Q894273J2794400J6849277J0253679j1167782j3594013
$$ 73251465 79184022 88078295 100872695 117721972 127975651 116807869 103213856
17703A03213856o572259k007278K686590n61754j8330384j9522363j1866950p170390
$$ 103213856 96641597 94634319 97320909 96759155 78428771 58906408 47039458 39869068
17695C9869068m804366l479800l006055k488180j978138j597795j198703r65048
$$ 39869068 35064702 31584902 28578847 26090667 24112529 22514734 21316031 20350983
17687B0350983r72505o82248o88362o85536n50159n71894o22585l70857l18274
$$ 20350983 19378478 18696230 18007868 17322332 16772173 16200279 15577694 15206837 14888563
17678A4888563j24995m11795l81304m46738n03975m63664k07104j66284r9587
$$ 14888563 14763568 14351773 13970469 13523731 13019756 12556092 12348988 12182704 12083117
17669A2083117q8615l24378r6839j73148j98724r2446j04760O7432M7741l04622
$$ 12083117 11994502 11670124 11573285 11400137 11201413 11108967 11004207 11071639 11119380 10814758
17659A0814758l90742m11616j03300J7029n46k38923q2324R4589J63960L24355
$$ 10814758 10424016 10012400 9909100 9926129 9925583 9686660 9604336 9698925 9862885 10187240
17649A0187240K39398J52775J75785K43243L92632L41348K46610L70651M77928
$$ 10187240 10426638 10579413 10755198 10998441 11391073 11732421 11979031 12349682 12827610
17640A2827610O69984M50114R30168J630587K598923M642443P862374J1904308
$$ 12827610 13497594 13947708 14877876 16508463 19107386 23749829 31612203 43516511
17632D3516511J4415607J2956650J1184494J4533769K1771530K8112495L0720527
$$ 43516511 57932118 70888768 82073262 96607031 118378561 146491056 177211583
17625A77211583J8777121n297203n335488N732658J5342094J6045808j1299659
$$ 177211583 195988704 190691501 185356013 191088671 206430765 222476573 211176914
17618B11176914l6224965k9345771j6390298o548384m877997k0536710k3308417
$$ 211176914 174951949 145606178 129215880 122667496 117789499 97252789 73944372
17611G3944372j5215318r798102o514953m562212l214021k941850k472844j905062
$$ 73944372 58729054 48930952 42415999 37853787 34639766 31697916 29225072 27320010
17603B7320010j466047j445086j240526r22189r53938q94296n84696q6101N2002
$$ 27320010 25853963 24408877 23168351 22246162 21292224 20397928 19813232 19727131 19779133
17594A9779133K30163n8381k99902k27568J18885Q8175K95359N09756K18079R68059
$$ 19779133 20009296 19950915 19651013 19423445 19542330 19630505 19925864 20435620 20653699 21621758
17584B1621758K132072L233338N614097R363762J2503165J2623959J0425854J1483394
$$ 21621758 23753830 26987168 32601265 41965027 54468192 67092151 77518005 89001399
17576H9001399J7208303K3776908K7891324K4094117K329947p695367J395231
$$ 89001399 106209702 129986610 157877934 181972051 184301998 176606631 178001862
17569A78001862J0895298J7152801J580778k8856093l2189373j9631198r197725
$$ 178001862 188897160 206049961 207630739 178774646 146585273 126954075 117756350
17562A17756350k924043j2857250k3469361j7389612j1030632p169051m920589
$$ 117756350 114832307 101975057 78505696 61116084 50085452 42916401 37995812
17555C7995812l617885k937046k502086k041831j690821j227169j177786j064570
$$ 37995812 34377927 31440881 28938795 26896964 25206143 23978974 22801188 21736618
17547B1736618r74410j028849j036912q31872o66790n31384o49612o54483n03852
$$ 21736618 20762208 19733359 18696447 17864575 17197785 16666401 16016789 15362306 14858454
17538A4858454n42752m05320l93276k61527l58554m10497l84265l36742m67695
$$ 14858454 14315702 13910382 13517106 13255579 12897025 12486528 12102263 11765521 11297826
17529A1297826m24088k67071p6662k51056j91863p0180j7133l1092l8639k06276
$$ 11297826 10873738 10606667 10530005 10278949 10087086 10016906 9999773 9968681 9930042 9723766
17519I723766k60316l36503q1011k6719j01132k30990o47609n81027k27068k45207
$$ 9723766 9463450 9126947 9045936 9019217 8918085 8687095 8039486 7458459 7231391 6986184
17509F986184m29875k93286k53111m32361j59700k46443j23564m8812l6133j27855
$$ 6986184 6556309 6263023 6009912 5577551 5417851 5171408 5047844 4999032 4962899 4835044
17499D835044j97571j45501j82758n0437k5749o8026p9525J60205j92529k34265
$$ 4835044 4637473 4491972 4309214 4258777 4233028 4165002 4085477 4245682 4053153 3818888
17489C818888r55j54573L4166j16075j61394j55666j72067k0863m5154j41856
$$ 3818888 3817933 3663360 3697526 3581451 3420057 3264391 3092324 3071461 3026307 2884451
17479B884451M5749p8552k07427k63089j50328K4846J07479k6862q592j9334r7399
$$ 2884451 2930200 2851648 2644221 2381132 2230804 2255650 2363129 2336267 2327675 2308341 2210942
17468B210942L847j52337j92018l762R4845l1713J41207q4390k34041j84036j8595
$$ 2210942 2214789 2062452 1870434 1866672 1961517 1929804 2071011 1986621 1752580 1568544 1549949
17457A549949n3993j5057j402m0387o1821r6684J16229J18325J70835K32856m1591
$$ 1549949 1495956 1480899 1479497 1439110 1377289 1280605 1396834 1515159 1685994 1918850 1877259
17446A877259J7365k3944l7425N6057Q9179J80012j21565l65360k88073j68366
$$ 1877259 1894624 1870680 1833255 1889312 1978491 2158503 2036938 1671578 1383505 1215139
17436A215139o3764p3322j68289L8637j95550r7506J32092N4268r9370j31477
$$ 1215139 1151375 1078053 909764 948401 752851 655345 787437 841705 742335 610858
17426F10858J52418M682l5409n160J61411J09566R1965Q8636p3435N3962J5510
$$ 610858 763276 767958 732549 727389 888800 998366 1090331 1178967 1105532 1159494 1175004
17415A175004O424L5423J9759O0289m3902k19514J37988J24406p0247j29609j1970
$$ 1175004 1181428 1216851 1236610 1296899 1252997 1033483 1171471 1295877 1225630 1096021 1084051
17404A084051r4797m0926P9101k3118q1254r4592L3298j51134l5535Q4095P0123
$$ 1084051 989254 948328 1027429 1004311 923057 828465 861763 710629 675094 759189 829312
17393H29312J9231K9819n5338J85234K0277o0841j53619j51679J40320r1373j38084
$$ 829312 848543 878362 823024 1008258 1028535 967694 814075 662396 802716 711343 573259
17382E73259l1991M9155r1783k7205o8966M2884J30749J72996n436k78373J953
$$ 573259 541268 590423 498640 471435 402469 445353 576102 749098 743662 465289 467242
17371D67242l5962J09844P2094k2725J73416Q1223k489j4659J47190J946j24434
$$ 467242 431280 541124 613218 590493 763909 845132 842643 827984 975174 977120 852686
17360H52686P8007O2255m6930M5072R6031j44908r2070j5017n1031J77220J18572
$$ 852686 930693 992948 946018 991090 1087121 942213 850143 835126 784095 961315 1079887
17349A079887N3275n5959k8063n9120k26186J28869J88768k7724j15667J0177
$$ 1079887 1133162 1077203 1049140 990020 763834 892703 1081471 1053747 938080 948257
17339I48257p917j14699j0919J41406Q308l9229k2227K5959O8243K9363M327j11208
$$ 948257 940340 825641 814722 956128 964436 925207 902980 928939 997182 1026545 1030872 919664
17327I19664p2477N3180j75291k48891R5958L7971Q7857L2642j39397o7027q9122
$$ 919664 847187 900367 725076 476185 572143 610114 697971 730613 591216 524189 435067
17316D35067K8758n8p8041O3070L4013k1697J75250J06018Q8933j67767o3456
$$ 435067 463825 463767 385726 448796 482809 461112 636362 742380 831313 663546 600090
17305F00090j28062P9740J04977K40092o0511m7388k9634k24930J8021J40423
$$ 600090 472028 551768 656745 896837 836326 788938 759304 534374 552395 692818
17295F92818J36804k0180j7409L4825K389Q0883j03688j15312q3988K2620J23362
$$ 692818 829622 809442 792033 826858 829247 910130 806442 691130 607142 629762 753124
17284G53124j12155j59281O4731M9232l0379r3362J02505K37194P3406k40938
$$ 753124 640969 481688 546419 595651 565272 471910 574415 811609 885015 644077
17274F44077j34052o3967n0504k30725J0783J10658J63025m1440q7336q8066O2044
$$ 644077 510025 446058 395554 164829 175612 286270 449295 407855 320519 232453 294497
17263B94497J2277J80411j9727J74798J07877K8620k7423Q7222n7432j66975j3705
$$ 294497 306774 487185 467458 642256 750133 778753 751330 838552 781120 614145 600440
17252F00440n3872L2039J9024r2970q1081J4410Q5576J25293l0356o0681l6035
$$ 600440 546568 578607 597631 504661 423580 437990 523566 648859 618503 557822 521787
17241E21787p7846q1989q0857K20574K21145J3036j28764j78160P9236N350J10451
$$ 521787 443941 361952 281095 501669 722814 735850 607086 428926 508162 513512 623963
17230F23963M9385n5369O9694j3996J62451Q0172J02056j57947j96731L1671K06047
$$ 623963 673348 617979 687673 673677 836128 916300 1018356 860409 663678 695349 901396
17219I01396k0858p7914K7081q6817k4988N2075K40424J31338Q7730k92812k39709
$$ 901396 880538 802624 829705 742888 717900 769975 1010399 1141737 1229467 936655 696946
17208F96946j9585j515J00179k12317n7359r59l6084k25260k56866J47037R8671
$$ 696946 677361 675846 776025 563708 506349 505390 469306 244046 -12820 134217 232888
17197B32888P1820r1332L6371J21066L2609j09373j63018o9085P5943J45416P7413
$$ 232888 304708 213376 249747 370813 403422 294049 131031 61946 137889 283305 360718
17186C60718O7889n6545n5183O8719K02819K21113L3196n2454r7948p253O1311
$$ 360718 428607 372062 316879 385598 588417 809530 842726 790272 692324 685071 746382
17175G46382N1155o0085q4478k2802o9831r5635j29571j11361K1013Q0310P3121
$$ 746382 797537 737452 652974 630172 560341 464706 335135 223774 244787 325097 398218
17164C98218j6699j80581m5767r2513Q958P1525J44687R1424k9035J60762n0682
$$ 398218 381519 200938 155171 62658 71616 143141 287828 379252 350217 510979 460297
17153D60297k5201j04523r526J403M2721j94324j85653j03295J20361R3946n777
$$ 460297 435096 330573 321047 322450 365171 170847 -14806 -118101 2260 96206 90429
17142I0429p8508m4107O893L0761J86304K2715N5948L5631j63162j82189M2561
$$ 90429 11921 -32186 -25293 5468 191772 214487 270435 306066 142904 -39285 3276
17131C276q3690j79609L2689n5342k0990p856J25581J59007j2852J6731N6677
$$ 3276 -80414 -260023 -227334 -282676 -303666 -311522 -185941 -26934 -39786 -23055 33622
17120C3622N2906l374O2764o045n9736M3506J16830n5510r8423R3900J14784O6135
$$ 33622 86528 83154 145918 139873 80137 123643 240473 184963 86540 180440 295224 361359
17108C61359k00547k08114J56353L1987N7724j2820M8899K68706j04584l872L18384
$$ 361359 160812 -47302 109051 141038 198762 185942 234841 503547 398963 395091 713475
17097G13475J67163O7903K00141R4357j77518R347J00549j10260o8804J17591
$$ 713475 880638 948541 1148682 1243039 1065521 1074868 1175417 1065157 996353 1113944
17087A113944j11519j63848j13437j40517j06158l3771p3856m0363j92751l7018
$$ 1113944 1002425 838577 725140 584623 478465 444694 370838 330475 137724 100706
17077A00706J99665J02922J8917J3630o0183k02235p4104p7451n4396k1827L6035
$$ 100706 300371 403293 422210 435840 375657 173422 99318 21867 -32529 -54356 -18321
17066a8321R507K45648J7265m6737r1006m329Q4607j16846n1155K39341o8959
$$ -18321 -8814 236834 254099 207362 116356 112027 196634 79788 28633 267974 199015
17055A99015m7382J7295Q8564L3040L832J6094k6457o3946J77955O3016J17216
$$ 199015 151633 168928 257492 290532 294364 310458 284001 220055 398010 461026 578242
17044E78242K14064L23960J09923J0027J21047l1627p4111k08772q6015M2783
$$ 578242 792306 1116266 1226189 1236216 1357263 1325636 1251525 1042753 956738 999521
17034I99521j39622q4930j840j93612l8383k40952j01095L0931n0669L2746M8634
$$ 999521 859899 774969 773129 579517 541134 300182 199087 230018 179349 212095 260729
17023B60729j50878j26004Q1859J30127l8968l6514M9725J12976k1496o1590J18530
$$ 260729 109851 -16153 65706 195833 156865 120351 170076 283052 261556 199966 318496
17012C18496k0756J5724N7785j78312j73754R7975J02039m6346o1700j03326Q9172
$$ 318496 297740 313464 371249 192937 19183 117158 219197 172851 111151 7825 96997
17001I6997Q9772k1321Q456Q8575O7276o398m4788o900k1562n1002n093q096K8232
$$ 96997 186769 165448 173904 262479 329755 323357 278569 271669 250107 199105 194012 185916 214148
16988B14148m6212q9182k8051N6168M296m1286j12184N7147J87054o2737n4345
$$ 214148 167936 78754 50703 106871 111167 69881 -42303 14844 201898 139161 84816
16977H4816p5204l6988N9862J62235j10462j10751L5257O3995j24497k00121p5748
$$ 84816 9612 -27376 32486 194721 84259 -26492 8765 72760 -51737 -251858 -327606
16966c27606R8719J62919j23688K3512J65100j8059k2973J79294O72P8760P4543
$$ -327606 -228887 -65968 -189656 -166144 -1044 -19103 -42076 137218 137890 216650 291193
16955B91193n9997j56967j31325J7148J84383J2484J10181N082k02169K9840J91623
$$ 291193 231196 74229 -57096 -39948 144435 156919 267100 272182 70013 99853 291476
16944B91476P9695r9955l59270L8682J0280P3534R8902J08185j71330r3864J056
$$ 291476 371171 271216 -88054 -49372 -39092 34442 133344 241529 70199 -23665 -22609
16933b2609j2797P3848j11571j09543j25208N4722J69130m7379j09593Q5387m4468
$$ -22609 -35406 38442 -73129 -182672 -307880 -253158 -84028 -131407 -241000 -155613 -200081
16922b00081N0910Q1605j21169q5005j57441l6391J46310K06090K20801k7760
$$ -200081 -149171 -67566 -188735 -273740 -431181 -467572 -321262 -115172 105629 77869
16912G7869L2104M8764n360J3964j62887j15926O4909J46641Q0668j18510k52638
$$ 77869 109973 158737 153377 167341 4454 -111472 -46563 100078 180746 62236 -190402
16901a90402j20151J87220J45650N1455m6291o0697k86K2982k5427J27800k880
$$ -190402 -310553 -123333 22317 73772 27481 -33216 -33502 -10520 -35947 91853 88973
16890H8973J69427K9427R004j15380j71802o7317j20715R271k894n0657K5307
$$ 88973 258400 287827 296831 181451 9649 -57668 -178383 -169112 -172006 -222663 -197356
16879a97356K19644K12404O368j94494p0771j70832L2963J83939J3457j98208
$$ -197356 22288 234692 241060 46566 -24205 -195037 -162074 21865 35322 -162886
16869a62886j67303J10752J11675K60601O2311j92230J6564Q6940o3230k39501
$$ -162886 -330189 -219437 -107762 152839 215150 22920 39484 126424 63194 -176307
16859a76307j7803O1403J01172l4129P0147J22783J38298p6783j36785j33808
$$ -176307 -194110 -132707 -31535 -65664 4483 127266 265564 188781 51996 -81812
16849h1812K5624J68389J53305k07793j57735M8982L8705P4606j51594q7878J16619
$$ -81812 -56188 112201 265506 57713 -100022 -51040 -12335 62271 -89323 -177201 -60582
16838f0582K06081M0063O310J4791N843N1494j30584j03482n3073k0950j1169
$$ -60582 145499 185562 191872 206663 212506 264000 133416 29934 -23139 -44089 -55258
16827e5258l258j77724K5740K14716J79n5794N2330j13989J34876r4704j81967
$$ -55258 -58516 -236240 -210500 4216 4395 -51399 931 -113058 21818 -72886 -254853
16816b54853j46007j95914J43345O5787J32613J34732J19059J15448O1118J26325
$$ -254853 -400860 -596774 -453429 -387642 -255029 -120297 -1238 114210 175328 301653
16806C01653O8875n4062j04526m4141n4384p5531J4114J5739j2415j06498L5090
$$ 301653 370528 316466 211940 167799 113415 37884 51998 67737 55322 -51176 -16086
16795a6086P2385J39647L77L241O4277R0529j43876N9223J17254K4295K569Q801
$$ -16086 56299 195946 196323 199564 263841 354370 210494 269717 386971 411266 413835 422636
16783D22636j28845q0586j2343j36658j05813p387J09709O1322J02805L5266j914
$$ 422636 293791 213205 200862 64204 -41609 -48996 60713 122035 224840 260106 258192
16772B58192m4313j01893j05747m6492J38932J55668J47842j50808l57439p4853
$$ 258192 213879 111986 6239 -40253 98679 254347 402189 251381 -106058 -180911
16762a80911P4147J16781j01764J3016K38110P0436j24323j30105r4748r1840
$$ -180911 -106764 10017 -91747 -78731 159379 229815 105492 -24613 -119361 -211201
16752b11201O4754K55911K09307M8561p0361j49321j26945j21257q8897O6967
$$ -211201 -146447 109464 318771 367332 296971 147650 20705 -100552 -189449 -122482
16742a22482Q0630Q3412L9706p564O3453Q2644l9088k22871k86333J20270K12551
$$ -122482 -41852 41560 81266 73702 137155 219799 180711 -42160 -328493 -208223 4328
16731D328j48616l1558j25764j44287J24471P0562j01162J84756J35879J3670
$$ 4328 -144288 -175846 -301610 -445897 -321426 -250864 -352026 -167270 -31391 -17721
16721a7721O3177J64952O5762j48820Q1407j06797l0679k8248P1589K4063j47655
$$ -17721 45456 210408 276170 127350 208757 101960 71281 43033 114622 138685 -8970
16710h970j60390q1068J47526L1103q5828K00771J00735j15554k55517N0920P9287
$$ -8970 -169360 -250428 -102902 -71799 -157627 43144 143879 28325 -227192 -176272 -96985
16699i6985O8518K4631p4171n2496o4784K54948J8918k971P2003J08174n0019
$$ -96985 -28467 -3836 -78007 -130503 -195287 59661 78579 75608 147611 255785 205766
16688B05766j25601K7279j16694J08671J06549j21309p8406p4088r2644o7627
$$ 205766 80165 107444 -9250 99421 205970 84661 6255 -67833 -160477 -228104
16678b28104R6550J53540j29448p2772m3141j4787J57951J06837L2402N2674o1126
$$ -228104 -131554 21986 -107462 -180234 -223375 -238162 -80211 26626 59028 111702 50576
16667E0576r3725L9897K2497r2987n0084N006K3285J07873L3695j28389P5220
$$ 50576 -43149 -3252 19245 -73742 -123826 -118820 -95535 12338 46033 -82356 -7136
16656g136Q126J09368J22092L0471J14930J2511j40784j68114j72207M6746r009
$$ -7136 990 110358 232450 262921 377851 390362 249578 81464 -90743 -43997 -53006
16645e3006l5957N3446j61467j13918O7921J15586J03760l5213J62492L7504J16005
$$ -53006 -88963 -35517 -196984 -310902 -242981 -127395 -23635 -58848 103644 141148 257153
16634B57153j90047k59711j8088J4464J65574m7197P9600O7006o7893j07509j00927
$$ 257153 67106 -192605 -210693 -196229 -30655 -77852 1748 68754 861 -106648 -207575
16623b07575J81210J30551j2010j07546J7597K6714N2136P9452J08704n4949q70
$$ -207575 -26365 104186 92176 -15370 2227 28941 81077 160529 269233 214284 213414
16612B13414q2549k6378K32997J68050j13471j61715j10997q7298J43399j37585
$$ 213414 130865 104487 337484 505534 392063 230348 119351 32053 175452 37867
16602C7867j27058k9922J92682Q2658k5612j2713m2888l6571o2664J0185R9731
$$ 37867 -89191 -119113 73569 156227 130615 117902 75014 38443 -24221 -14036 85695
16591H5695P131M1790j43738j96706J2044O4341Q9550J49694p8435J3010k2407
$$ 85695 92826 134616 -9122 -205828 -193784 -129443 -39893 109801 31366 44376 21969
16580B1969J05590n103O4159k7525r3978P0143N167j36068j55014q5921O786R7139
$$ 21969 127559 122456 186615 159090 65112 135255 140422 4354 -150660 -236581 -229795 -132656
16568a32656R7273j05619K28977N5564O9365l0373o1104r5419k142J53309r3773
$$ -132656 -35383 -141002 87975 143539 212904 182531 121427 26008 23866 177175 83402
16557H3402j46660L1519R1705O4708j6848p291N2665N9218O0988k21284r2933
$$ 83402 -63258 -31739 59966 124674 107826 100535 153200 212418 273406 52122 -40811
16546d0811J34253J42901J8873l394K9806J2650k14621o2680J44249o8866o356
$$ -40811 93442 236343 255216 251822 281628 294278 79657 16977 161226 92360 86004
16535H6004N4725m1291m7813J02778M8162K17342K6605j81259k27912k07198l2925
$$ 86004 140729 99438 51625 154403 202565 419907 446512 265253 37341 -169857 -202782
16524b02782m69J58512P4507r161P2651p5385p2432j99939N4827K14135K07737
$$ -202782 -203251 -44739 29768 20607 93258 17873 -54559 -254498 -199671 14464 222201
16513B22201J52151j33315q8602O0615l2764N5573j06811n7324q2471J3401J21703
$$ 222201 374352 241037 152435 213050 180286 235859 129048 71724 -10747 2654 124357
16502A24357K4928O8366J06221P3064l6189o8020k22725j2224p4590o3166r1404
$$ 124357 149285 217651 323872 396936 360747 292727 70002 57778 -16812 -79978 -171382
16491a71382j06001J79405m2707j8996K252K7637n907O9587l6334J88731O8721
$$ -171382 -277383 -97978 -140685 -159681 -157429 -129792 -135699 -66112 -102446 86285 155006
16480A55006j31822L6364l0022p7765K13231q9504l33257j45520J11510J37659
$$ 155006 23184 59548 29526 -48239 164992 75488 -257769 -403289 -291779 -154120
16470a54120R34P9329q3905O3549N1821N0076Q3029q3009m2327K9671J00523l1476
$$ -154120 -153186 -73857 -157762 -94213 -42392 7684 90713 7704 -34623 -4952 95571 64095
16458F4095j65478L25355J85953k08325j55960l7359q2200n9092m5306k2898m3609
$$ 64095 -101383 223972 409925 201600 45640 8281 -73919 -133011 -178317 -201215 -244824
16447b44824J56027k0305J74476N13o5398j57419J91243J09680j01840j41852
$$ -244824 -88797 -109102 65374 65887 489 -156930 34313 143993 42153 -99699
16437i9699q5692J70876J27838j79100M4387L009k9615N9948m9900k310R6494
$$ -99699 -185391 -14515 113323 -65777 -21390 -18381 -47996 11952 -37948 -40258 56236
16426E6236J7857M5679L9039J77q3705J18945J98493j27445j19173q6281j4773
$$ 56236 74093 119772 158811 158988 75283 194228 392721 265276 146103 59822 45049
16415D5049j76193m9302P8523J37450J38898L4844j56434k19689m4936J26769
$$ 45049 -131144 -180446 -101923 35527 174425 209269 52835 -166854 -211790 -85021
16405h5021J86638K7517p221N4024L1576N296p328j2468j19463K878j4581J22198
$$ -85021 101617 129134 121913 175937 207513 212809 205481 193013 73550 76428 61847 184045
16393A84045j79782k0388J04372J9595l3069p6972j27735q1278P5739P9498j3698
$$ 184045 4263 -16125 88247 107842 74773 -2199 -129934 -211212 -135473 -55975 -69673
16382f9673N4751J60499R0317l9485j08263M350O6882n9481r8810J45833k6809
$$ -69673 -14922 145577 235894 196409 88146 92496 159378 99897 1087 146920 120111
16371A20111j86780q1612J14475J24941q0657J24508m3196j58793P274L9360r3272
$$ 120111 -66669 -148281 -33806 91135 10478 134986 91790 -67003 -59729 -20369 -113641
16360a13641r6735K01110N4041j21595K25863Q3178j35833o9771j79355O4512
$$ -113641 -210376 -9266 44775 -76820 149043 232221 96388 26617 -152738 -88226
16350h8226J81201N2856P2033J29005l6200L1682o0122p1074j46124j62820m1898
$$ -88226 92975 145831 217864 346869 310669 342351 282229 211155 65031 -97789 -139687
16339a39687K6801K4398Q5929J35939j08546j78269r1534J13350j08462J00795
$$ -139687 -112886 -88488 -2559 133380 24834 -153435 -244969 -131619 -240081 -139286
16329a39286K12468o8557q2807R7148m2795j30032J30665r6426j57465P3319L1901
$$ -139286 73182 4625 -78182 18966 -23829 -153861 -23196 -119622 -277087 -203768 -171867
16318a71867o623p6497m2647l048J04998O2153m4172N7716J9937Q0959m654m6680
$$ -171867 -178490 -254987 -297634 -300682 -195684 -133531 -177703 -119987 -100050 -19091 -23745 -70425
16306g0425J09074m8803p7738Q7729L9015L955o6528n0383J386k7072r6188J00786
$$ -70425 38649 -10154 -87892 -163 38852 42807 -23721 -74104 -72718 -99790 -195978 -95192
16294i5192l6271q6545j5845J39868K07227m4235k0956r1512j38047N0194q4750
$$ -95192 -131463 -218008 -233853 -93985 113242 69007 48051 -43461 -181508 -131314 -216064
16283b16064n0858J41959K18823r9860m1922n0730J0610J14230o3372J7351J63530
$$ -216064 -266922 -124963 93860 -6000 -47922 -98652 -88042 26188 -37184 -19833 143697
16272A43697J09305n452j5055p5857r6714j23182L7717O0027o086j68591j09677
$$ 143697 253002 247550 232495 156638 59924 -63258 -25541 34486 28400 -140191 -249868
16261b49868N658M6911J20075J23107l2238j05455j09060Q237J0812N1021M5519
$$ -249868 -244210 -197299 -77224 45883 13645 -91810 -200870 -192633 -181821 -130800 -85281
16250h5281J21134J35518J20142J8664r9017n9414r2232j60553J70802P0325j61375
$$ -85281 35853 171371 291513 310177 211160 151746 59514 -101039 69763 140088 -21287
16239b1287j39056M1222J12697P9574N1555K1169L5227O7621p7289k36588m0594
$$ -21287 -160343 -119121 -6424 73150 124705 145874 181101 248722 171433 -65155 -105749
16228a05749J63850n0505p0716O7233M1665l2411j7050j9488J4838j95297l0766
$$ -105749 58101 7596 -63120 4113 45778 13367 -3683 -23171 -8333 -203630 -234396
16217b34396J11408M2244R9739L81851P0059l48722j60107j15193J7285R7401
$$ -234396 -122988 -80744 18995 400846 470905 122183 -37924 -153117 -135832 -38431
16207c8431P2826J18651j40521r6541R1889Q905m7628k22136n302J29664n653
$$ -38431 34395 153046 12525 -84016 7873 16778 -30850 -252986 -258288 -128624 -134277
16196a34277K13520M6427P8976J7863j20790j52689J9875l2604n8765J76433K3832
$$ -134277 79243 125670 204646 222509 101719 -50970 -31095 -63699 -122464 53969 77801
16185G7801J42277j20908j15750P6289J06141n5327j27163n0720L1019n4836J12377
$$ 77801 220078 99170 -16580 59709 165850 110523 -16640 -67360 -36341 -91177 21200
16174B1200N3748j05823q544k4724J34674M8634j46483O2738J37326J5591j16229
$$ 21200 74948 -30875 -39419 -64143 70531 119165 -27318 35420 172746 188337 72108
16163G2108r3841R1509R3967M2237n5226j99874k23026N6554N2507O9862L2860
$$ 72108 -21733 69776 163743 205980 150754 -49120 -272146 -215592 -163085 -93223 -60363
16152f0363k4489P0522l5069J00192O9747p7931p2347K6836J8903m5613j11421
$$ -60363 -84852 -14330 -49399 50793 120540 42609 -29738 -2902 16001 -29612 -141033
16141a41033j30334j9896J49643K49184r849k7373m5793j3077m9798J3061p9629
$$ -141033 -271367 -291263 -141620 107564 97715 70342 24549 11472 -38326 -25265 -104894
16130a04894k25061K1448J40355J08735J9846m2070r907j14397l8894J95652m9751
$$ -104894 -329955 -308507 -168152 -59417 -39571 -81641 -91548 -205945 -244839 -49187 -98938
16119i8938j72308P3358J64021n4475n0651J12951J19973j36795J03422J28487
$$ -98938 -271246 -197888 -33867 -88342 -138993 -26042 93931 -42864 60558 189045
16109A89045n2110q0398J0413K0119j6759L341Q1571N2697J5228n8280j55415
$$ 189045 136935 56537 66950 87069 70310 73651 155222 207919 223147 164867 9452
16098I452o6313o6844L3413p3909k2489Q2715R9905m3430j12031j16179P5941
$$ 9452 -56861 -123705 -90292 -164201 -186690 -103975 -4070 -47500 -159531 -275710 -199769
16087a99769J01883J4006N8322J18924M9294l9322r6911m703N0816m6704j41640
$$ -199769 -97886 -83880 -25558 93366 142660 103338 6427 1724 52540 5836 -135804
16076a35804L0066n6808J9461J23744M5070L2694J5697R2012N629L7058j21979
$$ -135804 -105738 -162546 -143085 -19341 25729 58423 74120 166132 171761 208819 86840
16065H6840j78702l2052J77963J29148j09979k31695O6216J42335P1566o0536
$$ 86840 -91862 -123914 54049 183197 73218 -158477 -92261 50074 121640 61104
16055F1104O4920q5877n0330q069n4457J50666J22142P019l7873k49454j15332
$$ 61104 126024 40147 -10183 -18252 -72709 77957 200099 207118 169245 -80209 -195541
16044a95541q5597J49870J60529L2363k8923M6025j36918O4808J32715j22365
$$ -195541 -281138 -131268 29261 61624 32701 78726 -58192 6616 139331 16966
16034A6966J3675j6284m6492q1892R9468J30953P0433j92073o2707P4606o111
$$ 16966 30641 14357 -32135 -114027 -14559 116394 186827 -5246 -67953 6653 542
16023E42j95375o1185K297M5119j5686K33561O6166j73251k581j09521N0646J51926
$$ 542 -194833 -256018 -253721 -208602 -224288 9273 75439 -97812 -100393 -209914 -159268 -7342
16011g342L6700j30230J93968J42385j37962r0724L1862n0155P7911R0174J6118
$$ -7342 29358 -100872 93096 235481 97519 6795 38657 -11498 66413 156587 172705
16000A72705j28288N536J20839k048k13633j08230M83K9361J18404O2810J60702
$$ 172705 44417 49953 170792 168744 -44889 -153119 -152636 -123275 -4871 57939 218641
15989B18641J75626j39896N717J37832l0289q4605q9485p7620q1672P6764N6894
$$ 218641 394267 254371 260088 397920 367631 283026 193541 115921 34249 111013 167907
15978A67907r8372o2419J02546J05380M1309j53197j91760l9041n6037J08219
$$ 167907 69535 7116 109662 215042 256351 103154 -88606 -127647 -183684 -75465
15968g5465N7652n7216q145l8221J35855J20067J8159n0968O1316k01894R1664
$$ -75465 -17813 -75029 -83174 -121395 14460 134527 152686 101718 163034 -38860 52804
15957E2804K28819q7670l4708j02103j41868O9092J79206L8335q8384j24416O2156
$$ 52804 281623 193953 159245 57142 -84726 -15634 163572 201907 113523 -10893 51263
15946E1263J37890n1331l9766o9017Q1902N6572L8990m9974N5290j58925l5429
$$ 51263 189153 137822 98056 29039 110941 167513 206503 156529 211819 52894 17465
15935A7465l0026J46090m8531P7100j32249o9100J85274l4531O3970P7667j03321
$$ 17465 -12561 133529 84998 162098 29849 -39251 146023 111492 175462 253129 149808
15924A49808j48004J4815n3569k6332l0993j9319j0249q5789J74587j14390K4655
$$ 149808 1804 16619 -36950 -63282 -94275 -113594 -123843 -209632 -35045 -149435 -124780
15913a24780J39647Q9461l4018k2926j15442J9676Q3955o1583J00395M3070j16441
$$ -124780 14867 104328 70310 47384 -68058 -48382 35573 -26010 74385 117455 1014
15902A014m1870O3692P6332q6680k2782J90269J46630o9849j08374o1399O2583
$$ 1014 -40856 22836 99168 12488 -10294 179975 326605 256756 148382 86983 149566
15891A49566N6670q9278q5194J28784j8154j13624r348O2834M0350k5348K7617
$$ 149566 206236 116958 31764 160548 142394 28770 19422 82256 122606 97258 124875
15880A24875P4368j64258m4038L7100N99j05378p6746J04799L5532M9506J0697
$$ 124875 199243 34985 -9053 28047 28646 -76732 -153478 -48679 -13147 36359 47056
15869D7056R1424j53956j13877j48354J47043O6512m0569l6753J52764m8947j47986
$$ 47056 138480 -15476 -129353 -277707 -130664 -64152 -104721 -141474 11290 -37657 -185643
15858a85643P8006j1405R0420K2867M022L551O007M4511O8548j55258J3182M1814
$$ -185643 -107637 -119042 -28622 -5755 -1733 1818 7825 52336 120884 -34374 -21192 20622
15846B0622j2090l9722l4871N2948J7016J812m9081K2717q0177J36218P0087k3264
$$ 20622 8532 -31190 -66061 -13113 3903 5715 -43366 -20649 -100826 35392 105479 82215
15834H2215M1731j12809r535Q2991L7186j27207p1580n0699q0985p1291M4294
$$ 82215 123946 11137 1602 84593 121779 -5428 -77008 -127707 -208692 -279983 -235689
15823b35689M6112L8681m3022l2644J50698L07668j3400j37335j83l6215j18788
$$ -235689 -189577 -150896 -193918 -226562 -75864 231804 218404 81069 80886 44671 -74117
15812g4117p0689r4669o4285R283J396K2826J56804P5007M3307q8407j86548j03643
$$ -74117 -144806 -239475 -303760 -294477 -293081 -270255 -113451 -38444 4863 -83544 -270092 -373735
15800c73735m6334J48414J04157m6708J47994j13819L165J7447l5012K0519l1820
$$ -373735 -420069 -271655 -167498 -214206 -66212 -180031 -176866 -159419 -194431 -173912 -205732
15789b05732J24214Q5463m7382K1877J1577O572K3177o1468J9904K1415Q8507
$$ -205732 -81518 3945 -43437 -21560 -9983 -3411 19766 -41702 -21798 -383 88124
15778H8124J14713j61438k15299k0187j28129J22234K04496Q1926p6746m3852
$$ 88124 202837 41399 -173900 -194087 -322216 -199982 4514 86440 9694 -34158
15768c4158p158m4938j50546M423J08451N998k4898J40062J07246j14505K8331
$$ -34158 -41316 -86254 -236800 -232377 -123926 -117928 -142826 -2764 104482 -10023 18308
15757A8308P9975O5664O4888j13456j25678p319k1974m1820J00938K37592J90252
$$ 18308 98283 163947 228835 115379 -10299 -17618 -39592 -81412 19526 257118 447370
15746D47370O698j10331j52279j11414j65951k8751J1125j00334j08609l0456
$$ 447370 454068 343737 191458 80044 -85907 -114658 -103533 -203867 -312476 -342932
15736c42932J25598J36854J16707J18043r7675j0266k56p0305l8666j781n5447
$$ -342932 -217334 -80480 36227 154270 56595 46329 46073 -24232 -62898 -64679 -120126
15725a20126N018K4274J32332R6657j5320Q4398R7679J8092j6120j55003k36886
$$ -120126 -115108 -90834 41498 138155 122835 207233 304912 323004 306884 151881 -85005
15714h5005j09393j5064J34174j8255R3387N252K31330O4266j48864p0638l1646
$$ -85005 -194398 -209462 -75288 -93543 -156 5096 236426 300692 151828 81190 49544
15703D9544L5021R082r8546l6224J48065M1586j39459j12824m5749O04o4415o2302
$$ 49544 84565 93647 -4899 -41123 106942 148528 9069 -103755 -149504 -148900 -213315 -275617
15691b75617J14222m7243J11894Q5765J53486q9820o2203J90795M0015j43995
$$ -275617 -161395 -208638 -96744 -10979 142507 52687 -9516 181279 221294 77299
15681G7299j29190o6258K2276M2843J32192K6942K9767J00694J27360J1143k5294
$$ 77299 -51891 -118149 -95873 -53030 79162 106104 135871 236565 363925 375068 349774
15670C49774n7093m2967j64630p2653p6793P3011J16315L0930J6355J15801m8719
$$ 349774 292681 249714 85084 12431 -64362 8649 124964 155894 172249 288050 239331
15659B39331j59937n8203m9343Q0245n841r4976J8706L6832J8963K6482k08014
$$ 239331 79394 21191 -28152 52093 46252 -48724 -30018 6814 25777 52259 -155755
15648a55755k63317q8237L51703J95982q7053q2904k1445q2415J56615o2276M8503
$$ -155755 -419072 -507309 -155606 40376 -46677 -129581 -151026 -233441 -76826 -139102 -90599
15637i0599K40899J2483o1371l0394k16190O0352j4953k7528J8654J14790k9095
$$ -90599 150300 162783 101412 71018 -145172 -84820 -99773 -127301 -108647 6143 -22952
15626b2952p7751k1551J00952N8316J59432J31828j99374j33277J4839J24952
$$ -22952 -100703 -122254 -21302 37014 196446 328274 128900 -4377 10462 135414
15616A35414l0421j90544p9651j35042J56503Q1769P057n5545O2972N9181M1240
$$ 135414 104993 -85551 -165202 -300244 -143741 -61972 -54915 -110460 -47488 11693 52933
15605E2933k80764N9655J97352L9430l9838j72174j39639J12179M4320N9762J22077
$$ 52933 -227831 -168176 29176 68606 28768 -143406 -283045 -170866 -126546 -66784 55293
15594E5293J7846r6315J5127O3934q9592r9997O9779j5406J55907J0330n5956
$$ 55293 73139 -23176 -8049 55885 -33707 -133704 -63925 -79331 76576 86906 30950
15583C0950o2202J97737M4421q9134q3580j00401q627O785J2799L2207j04339
$$ 30950 -31252 166485 210906 121772 38192 -62209 -70836 -64051 -51252 -19045 -123384
15572a23384Q1028j629j83287l4649M2821J1847O2777p105j68695n7789N8970
$$ -123384 -42356 -43985 -227272 -261921 -219100 -207253 -144476 -151581 -320276 -378065 -319095
15561c19095J16215R6732J45448N6447J9801L6146k0244j29036r3997m5818O3679
$$ -319095 -202880 -106148 39300 95747 115548 151694 131450 2414 -91583 -137401 -73722
15550g3722n4540k3599Q2186K39073p4035m8480J03958k64718j7740J58955J46120
$$ -73722 -128262 -151861 -69675 169398 95363 46883 150841 -113877 -131617 27338 173458
15539A73458J1844n6599n9118m7274J3176J96110O7275j46048j79670k220q4944
$$ 173458 185302 128703 69585 22311 35487 231597 298872 152824 -26846 -29066 -114010
15528a14010Q0702j60519n3100m8861J80060J02880j0953n5790n4302N6419m9998
$$ -114010 -33308 -193827 -246927 -295788 -115728 -12848 -23801 -79591 -133893 -77474 -127472
15517a27472o9731J11525K62079O8625k15867j16939J4538l5105l9275o4785r275
$$ -127472 -197203 -85678 176401 245026 29159 -87780 -73242 -108347 -147622 -212407 -221682
15506b21682J05698J49030K70775P2516j81077k14463p0617L5250J13657J02714
$$ -221682 -115984 33046 303821 376337 195260 -19203 -89820 -54570 59087 161801
15496A61801j18177j64633O8207R6197P060L5551L5433k4602j62967P6591K35985
$$ 161801 43624 -121009 -52802 43395 50455 86006 121439 96837 -66130 10461 246446
15485B46446m8646q4247J33188N6694o8197p558j66224J4811L0906o2632j7772
$$ 246446 197800 113553 246741 303435 235238 227680 61456 76267 107173 44541 26769
15474B6769J1693J21355j038j39486q5706J33636J50493j3835P577k03063q1143
$$ 26769 38462 159817 158779 19293 -66413 67223 217716 203881 211458 8395 -72748
15463g2748j5893m6876j16211K0734K551J32410J28570P521O634P5658O4065k582
$$ -72748 -88641 -135517 -251728 -230994 -228443 -96033 32537 40058 46692 122350 186415 183833
15451A83833M6549k11464p5848P0811M4836J3886J6574k7070m5017M4227j2435
$$ 183833 230382 18918 -56930 13881 58717 72603 89177 62107 17090 61317 48882
15440D8882J6514m7385j27892Q8144p9227P559O6538j01715l4649m8054O0594
$$ 48882 65396 18011 -109881 -21737 -100964 -93405 -26867 -128582 -163231 -211285 -150691
15429a50691n5234r7112M9493L5908l3830k7156J79349J0705O4658J73206j62951
$$ -150691 -205925 -303037 -253544 -217636 -251466 -278622 -99273 -88568 -23910 149296 -13655
15418a3655j37835l7142Q0023p4359L7502j8535o6823Q7417M6419N475k1314j22542
$$ -13655 -151490 -188632 -108609 -182968 -145466 -164001 -230824 -143407 -96988 -91513 -112827 -235369
15406b35369j5349J6869J41146J63532O9687j15434p1662l2460J01837J16219
$$ -235369 -250718 -233849 -92703 70829 140516 25082 -46580 -79040 22797 139016
15396A39016J5914p9662j64525k2728J62685J01708m4140k26259J220n332j64798
$$ 139016 154930 75268 -89257 -111985 50700 152408 108268 -117991 -116771 -122103 -286901
15385b86901J47175J96613j73865O8256R8090p014k53931j16588J1630L6138j8974
$$ -286901 -139726 56887 -116978 -48722 49368 42354 -211577 -328165 -316535 -280397 -299371
15374b99371r0125L3970q134N678J40629K0726k5979M5007K36894J05312J66162
$$ -299371 -389496 -355526 -363660 -357982 -217353 -196627 -222606 -177599 59295 164607 330769
15363C30769L2853j08672J37243J44372k81179q4969n1674j41639j08722j3888
$$ 330769 363622 254950 392193 536565 255386 170417 118743 -22896 -131618 -145506
15353a45506m0874R1035N0237J5014j62166O1552J04791k8680j4749J0026P4234
$$ -145506 -186380 -95345 -45108 -30094 -192260 -130708 -25917 -54597 -69346 -59320 14914
15342A4914K4595o6837J25842J47686k9094k21103m458J47385K674R8021j12953
$$ 14914 39509 -27328 98514 246200 217106 -3997 -8455 138930 141604 239625 126672
15331A26672K1619j47100j24279R6020j00156l2412J55192O0322j52685L6842
$$ 126672 148291 1191 -123088 -27068 -127224 -159636 -4444 55878 -96807 -59965
15321e9965J30259O1275l8577J37135J0115j55266M9199Q8936k6336j21931r4514
$$ -59965 70294 131569 92992 230127 240242 84976 134175 223111 196775 74844 -19670
15310a9670J35235M8255j17861j42263o4407Q9255p8603k23366J11999J23849
$$ -19670 115565 163820 45959 -96304 -160711 -71456 -150059 -373425 -261426 -137577
15300a37577J10207R4489o8594m5894p656K6277K9186J8434P4764P5903M8726
$$ -137577 -27370 67119 -1475 -47369 -55025 -28748 438 18872 93636 169539 218265
15289B18265q9428j11861o6747J6349R009k8635J05277J33619L173M5083j4549
$$ 218265 128837 16976 -49771 -33422 -24413 -53048 52229 185848 189021 234104 219555
15278B19555o5667o6408n2534J49471n96j27082l1794O5147M3528j23167l0430
$$ 219555 153888 87480 34946 184417 183821 56739 24945 90092 133620 10453 -19977
15267a9977j37442J21426M2242j65374K8981j15469J66012J60323j45967N56J36474
$$ -19977 -157419 -35993 6249 -159125 -130144 -245613 -79601 80722 -65245 -64689 71785
15256G1785q633n0146K8280O3076j02270j19706L8260J0328r8585J20345L8136
$$ 71785 63152 13006 41286 104362 2092 -117614 -79354 -69026 -167611 -47266 -9130
15245i130J5116K6277k23502j00758J9101j49165K38865J90209L0023n8767o4695
$$ -9130 5986 32263 -191239 -291997 -272896 -422061 -183196 7013 37036 -21731 -86426
15234h6426n3859j11126K1648n1336P832q297J84911M1677J3368N8380J09312
$$ -86426 -140285 -251411 -229763 -281099 -273267 -281564 -96653 -54976 -41608 16772 126084
15223A26084N8797n1360J8333m0454J33019M7558j78052j08334j75294j55093
$$ 126084 184881 133521 151854 111400 244419 291977 113925 5591 -169703 -324796
15213c24796K21101J56919l3592j7180K11536O2196m9838O9105l556r9704N7491
$$ -324796 -103695 53224 19632 2452 213988 276184 226346 295451 291895 192191 249682
15202B49682q4989j35221L597m9791r7328k4116j43208o9524L36879K11890o7403
$$ 249682 164693 29472 33069 -16722 -114050 -138166 -281374 -350898 -14019 197871 130468
15191A30468m9068n1933R184J10785Q837j94540j29490k9704q0240j4798P2313
$$ 130468 81400 29467 38651 149436 158273 -36267 -165757 -195461 -275701 -290499 -218186
15180b18186n2133O4464J69260J2813m5498J11867m1722j14427n977n2072J48078
$$ -218186 -270319 -205855 -36595 -23782 -69280 42587 865 -113562 -119539 -171611 -23533
15169b3533Q5371r289N406k0984q2728k39211j00284o3724J74275k8746O8641
$$ -23533 61838 52549 57955 36971 -45757 -284968 -385252 -448976 -274701 -303447 -234806
15158b34806L88641K01947n4639p7170m1897j41885k16201N8130J23396K44731
$$ -234806 153835 355782 301143 223973 182076 40191 -176010 -117880 5516 250247
15148B50247k8108r4601N0264O9457J21953N5534J17999j523j23944k18428j87613
$$ 250247 222139 127538 177802 247259 369212 424746 542745 541222 417278 198850 11237
15137A1237j60508m5057K24041J03752j4464j45121J11988J08824L0060j5380
$$ 11237 -149271 -194328 29713 133465 119001 -26120 85868 194692 224752 209372
15127B09372p0964j46185O0937J85395l6206j26204j5953R2358L6700N501l2147
$$ 209372 138408 -7777 53160 238555 202349 76145 60192 152550 189250 194751 162604
15116A62604O5876r5072k47759j253O301k4433R9868m7458Q7367P832Q2159n1049
$$ 162604 228480 133408 -114351 -115604 -109303 -133736 -33868 -81326 6041 13873 96032 44983
15104D4983Q8054R9438P9529n6816M8385n8263j35461j61277j93859J2214q8952
$$ 44983 133037 232475 312004 255188 303573 245310 109849 -51428 -245287 -233073 -322025
15093c22025K7998K4362K5827J27333J05171j013R237P2218J35174k40O756J18732
$$ -322025 -294027 -269665 -243838 -116505 -11334 -12347 -3110 69108 204282 204042 210798 329530
15081C29530p0308p1686J02029r3454r4920j05963K8892l49719p5460J49382J37598
$$ 329530 259222 187536 289565 196111 101191 -4772 24120 -325599 -401059 -251677 -114079
15070a14079m0629j39371J37253P1267K32265J18935q3603L377R0422j97829l4585
$$ -114079 -154708 -294079 -156826 -85559 146706 265641 182038 185415 275837 78008 43423
15059D3423q6496o5930P3423J1642N2164M9040M0704j15985l1906J48883j8095
$$ 43423 -43073 -109003 -35580 -23938 28226 77266 117970 1985 -29921 118962 100867
15048A00867j45263Q6240J00900n6566j393j07270n7926j9821J92577J11609o5758
$$ 100867 -44396 41844 142744 86178 84785 -22485 -80411 -100232 92345 203954 138196
15037A38196o2835q0377K9885Q7817J52338R9675m4030j94862k633o4952j20137
$$ 138196 75361 -5016 24869 112686 265024 364699 320669 125807 123174 58222 -61915
15026f1915R019n1605K8373O3183J78818J27722k06259j65048J45100J98197K651
$$ -61915 -52896 -104501 -76128 -12945 165873 293595 87336 -77712 67388 265585 268236
15015B68236k21727J31490J01372k10691m0749m9982j0064Q8051R2213J03064
$$ 268236 46509 177999 279371 68680 27931 -22051 -32115 55936 148149 251213
15005B51213J13170k7914j80783m3033J3362K6923R1681p3073j23994m2724o2832
$$ 251213 364383 336469 155686 112653 126015 152938 244619 171546 47552 4828 -58004
14994e8004J33656O4195j9307p1005r0968L0421o6092K1406R4755n9409j0896
$$ -58004 75652 139847 120540 49535 -41433 -11012 -77104 -55698 39057 -20352 -31248
14983c1248K17599N9364k27597j62085m3942R7444R0147P9994O1772K40970q9291
$$ -31248 186351 245715 18118 -143967 -187909 -90465 -318 79676 141448 382418 293127
14972B93127j63992k31371k0431J75578J5628j7240J14301j13315j53080k5605
$$ 293127 129135 -102236 -122667 52911 68539 51299 165600 52285 -100795 -126400
14962a26400L0127N8104j51176p7955N7154K011O8843K28212K7116j58228k1155
$$ -126400 -96273 -38169 -189345 -267300 -210146 -208135 -139292 88920 116036 -42192 -63347
14951f3347Q4267l6142j37111L1625K18132j19837j10090N7043K99515n4527m465
$$ -63347 20920 -15222 -152333 -120708 97424 -22413 -132503 -75460 224055 169528 165063
14940A65063J4129J3912K9920j01232n8565K070J8050q5206K3820q3817l9356
$$ 165063 179192 193104 223024 121792 63227 65297 83347 -1859 21961 -61856 -101212
14929a01212p5613R7569J50406J00128M5432J42735j24304j1591j8694p6767k76
$$ -101212 -176825 -79256 71150 171278 216710 359445 235141 223550 204856 128089 127813
14918A27813k1561J55654P977r8126j25376p0711o3545K1561K4766q8248o1383
$$ 127813 106252 261906 269883 171757 46381 -24330 -87875 -66314 -41548 -129796 -191179
14907a91179j12594l4051J76285m4607k4151j15193n5976P0295J11236J51943
$$ -191179 -303773 -337824 -161539 -206146 -230297 -345490 -401466 -331171 -219935 -67992
14897f7992R150j18196q1667j16813N6171J74378R017J4653n0640R2640J95075
$$ -67992 -58842 -177038 -258705 -375518 -319347 -144969 -135952 -121299 -171939 -79299 115776
14886A15776j29490j21268k8305k439j08431P4759R2655J39079J4541N6056R6966
$$ 115776 -13714 -134982 -163287 -165726 -274157 -199398 -106743 32336 46877 102933 199899
14875A99899o0142j10480j16560O3931K2531j18755l2532Q6185L0440j47267r2567
$$ 199899 139757 29277 -87283 -23352 -821 -119576 -152108 -65923 -35483 -182750 -275317
14864b75317J04292K24796q6366j20178k7048J11776j9150J7236o302R2509J20645
$$ -275317 -171025 53771 -32595 -152773 -179821 -68045 -87195 -69959 -76261 16248 136893
14853A36893p7291j97153k5094K26736J66173j60505j51465N656P0609p6252J5376
$$ 136893 59602 -137551 -162645 64091 230264 69759 -81706 -76050 -5441 -81693 -66317
14842f6317k797J42431J92467l9144k65768n7355K82724o8470j21756P1821M4105
$$ -66317 -69114 73317 265784 226640 -39128 -96483 186241 117771 -3985 67836 111941
14831A11941p3283O6760K003m7488j12695R9597j84722r3969K71760J20890p6971
$$ 111941 38658 105418 107421 59933 -52762 46835 -137887 -231856 39904 160794 83823
14820H3823p411j5056J78657n7240k44979r6448o2571j64328L2976N0493L2042
$$ 83823 76412 61356 240013 182773 -62206 -158654 -221225 -385553 -352577 -302084 -270042
14809b70042l804J496K02277m5361M1110R6632R644m65K8993N3648k6509Q1002
$$ -270042 -273846 -272350 -70073 -115434 -74324 22308 31952 31487 60480 114128 87619 168621
14797A68621K12556j04755k69886K2070J44824L282j10863J65311M2621n9942
$$ 168621 381177 276422 6536 28606 173430 176712 65849 231160 273781 213839
14787B13839Q4572q7101j18311r6646r0817j73552R2785R7202p7008j0028P9042
$$ 213839 298411 211310 92999 -3647 -94464 -268016 -175231 -78029 -155037 -165065 -86023
14776h6023o6742J21902j6201Q7361P2409q4778j22530J28859M5989o6526P8032
$$ -86023 -152765 -30863 -47064 40297 112706 27928 -94602 34257 80246 13720 91752
14765I1752O9886j02898N5165J09005l2466l4033q3465j75062j282O0635J00395
$$ 91752 161638 58740 113905 222910 190444 156411 72946 -102116 -103398 -42763 57632
14754E7632j29439o8437q7262j21637k6241q9106J90717K24698P1073j65061j33925
$$ 57632 -71807 -140244 -227506 -349143 -375384 -464490 -273773 -49075 21998 -143063 -276988
14743b76988l3017N6452J57904J46151Q3315q5076M7279M1070K9103P088k00451
$$ -276988 -310005 -253553 -95649 50502 133817 48741 96020 137090 166193 173281 -27170
14732b7170n3379m2524j6667P9079K1131L0112Q7753m5956j1790j6761j04114
$$ -27170 -80549 -123073 -139740 -60661 -39530 -9418 78335 32379 20589 3828 -100286
14721a00286p6317k3540K27015l7958k46824J50046k1364k7711L4073J46810j6647
$$ -100286 -176603 -200143 26872 -11086 -257910 -107864 -129228 -156939 -122866 23944 7297
14710G297P3192J57828L5125l30103p2628r196Q7785J16806J2629O614j17691
$$ 7297 80489 238317 273442 -56661 -129289 -138485 -50700 66106 78735 85349 -32342
14699c2342j15739J17498J06069j09633J9992j21389L897N2682l5057n926q343
$$ -32342 -148081 -30583 75486 -34147 -14155 -135544 -131647 -78965 -114022 -119948 -128291
14688a28291J96284M3308q0038j87849n0629N7294L6644J45668j3944K5208m4008
$$ -128291 67993 111301 31263 -156586 -207215 -149921 -113277 32391 18447 43655 -353
14677c53k3682k489p899P0289M6876o364j49501q3858p1880N8328J92693L542
$$ -353 -24035 -26524 -34423 35866 82742 76378 -73123 -156981 -228861 -170533 22160 25702
14665B5702M1656p0239j89298j02294J60879K22837M4175r4416N479j12416J6512
$$ 25702 67358 -2881 -192179 -294473 -133594 89243 133418 39002 44481 -67935 -51423
14654e1423n0189j7577P591M5078L9857L401K53039l3780j07013L4642l2614q871
$$ -51423 -101612 -119189 -111598 -66520 -26663 -23262 229777 195997 88984 123626 91012 82141
14642H2141J3077q664j56268N7636j02192L9389M8830p7359r6764J36874J46339
$$ 82141 95218 86554 -69714 -12078 -114270 -74881 -26051 -103410 -200174 -63300 83039
14631H3039j34917k4654j6956k27981j73327P5146K83659J74840q6808p0999P2747
$$ 83039 -51878 -76532 -93488 -321469 -494796 -419650 -135991 38849 -47959 -118958 -46211
14620d6211r369R6888P3109m7307N1121J23402j12855p6489q8307j50553P363
$$ -46211 -55580 41308 114417 67110 118231 241633 128778 52289 -36018 -186571 -179208
14609a79208l4024M0447O2791o8071q1158J04806J46959M9177J2500j12558p1669
$$ -179208 -213232 -172785 -109994 -178065 -259223 -154417 -7458 41719 54219 -58339 -130008
14598a30008q6099j4796L206O1933J12669R488P637P2994J04424P4686m6185O8636
$$ -130008 -216107 -230903 -227697 -165764 -53095 -43607 -35970 37024 141448 216134 169949 238585
14586B38585P2884N231m1731j79680J7051J02088j13378k11198P4211N9028k13549
$$ 238585 311469 316700 274969 95289 112340 214428 101050 -110148 -35937 23091 -190458
14575a90458O7833J78884o944J00195l8433M72N7109l1125N8091j40790o2082
$$ -190458 -122625 56259 49315 149510 111077 111549 168658 137533 195624 54834 -7248
14564g248p4044j08838K29841k2521K4693j8230j72572l2533l454n7431N5533
$$ -7248 -81292 -190130 39711 17190 41883 23653 -148919 -181452 -184906 -242337 -186804
14553a86804J72085N4916J82233J23479O5443n9486j01706J54269O2861j16003
$$ -186804 -14719 40197 222430 345909 411352 351866 250160 404429 467290 351287
14543C51287k56629p7508n725j4711p7448l8010L5796P9387k9282Q9749N7024
$$ 351287 94658 17150 11425 -3286 -80734 -118744 -82948 -3561 -32843 56906 113930
14532A13930J9868r2545l3260J4215k6235J39645J06811k28364p3431J01589J98476
$$ 113930 133798 41253 7993 22208 -4027 135618 242429 14065 -59366 42223 240699
14521B40699o5554j68734q2798k6374O9774Q8049n842k24313j42204N8092Q3855
$$ 240699 175145 6411 -76387 -102761 -32987 55062 49220 -175093 -317297 -259205 -175350
14510a75350n6279K8768P1121J7852J3512J43082l4971j74281j89786O8876P5367
$$ -175350 -231629 -202861 -131740 -113888 -100376 42706 7735 -166546 -356332 -287456 -212089
14499b12089j30245R7745J10914J05947R395j78597j04434O1182o9717j49489
$$ -212089 -342334 -244589 -133675 -27728 -18333 -196930 -301364 -240182 -309899 -459388
14489d59388K70650P0387J31908K18940R6243j1090k01217j02798O7879j30238
$$ -459388 -188738 -118351 13557 232497 328740 317650 116433 13635 81514 -48724
14479d8724r5075n1416J71153J50543m6687j35064Q801J04023J89436j63394j48909
$$ -48724 -143799 -195215 -24062 126481 79794 -55270 -46469 57554 246990 83596 -65313
14468f5313J50813n7627p6700m0776m3346J17915J68644r5668r3769J20720M6679
$$ -65313 85500 27873 -48827 -89603 -132949 -15034 153610 57942 -35827 84893 131572
14457A31572J00968J28073j81645n8852n2872j00844L7194L6862Q227j4332j20813
$$ 131572 232540 360613 178968 120116 67244 -33600 3594 40456 48683 34351 -86462
14446h6462j01672P4274P3728J69300o9038j61956Q7251n4989p1428R2681J18950
$$ -86462 -188134 -113860 -40132 129168 60130 -101826 -14575 -69564 -140992 -48311 70639
14435G0639q6413j06619J26840k39840j45778R3376J87788J27146J26338P6362
$$ 70639 -15774 -122393 4447 -235393 -381171 -287795 -100007 27139 153477 229839
14425B29839O2017j50623K0256Q2410m3262p4346k02439l9593m2082J25464O8322
$$ 229839 291856 141233 161489 243899 200637 126291 -76148 -115741 -157823 -32359 35963
14414C5963j31804l9508L9020L1357J70413K3654q7898j07550k24548l9810K87501
$$ 35963 -95841 -135349 -96329 -64972 105441 129095 41197 -66353 -290901 -330711 -43210
14403d3210K37502L7804O9723n7618j13491L5043p9851J8948l1600q6837p7825
$$ -43210 194292 232096 301819 244201 130710 165753 85902 104850 73250 -13587 -91412
14392i1412l8954J3439J71769J15546l2593j06234q2496n0241q8770m9158J06537
$$ -91412 -130366 -116927 54842 170388 137795 31561 -50935 -101176 -189946 -239104 -132567
14381a32567K22922J32283l4091n3400j84294k45831J67828J86180J86434L6556
$$ -132567 90355 222638 188547 135147 -49147 -294978 -127150 59030 245464 282020
14371B82020m4836q3038M4143K876k06408n7914q9924M381M20709M4813l5804
$$ 282020 237184 154146 198289 201165 -5243 -63157 -153081 -148700 272009 316822 281018
14360B81018l1781j71694k90333K7169P7154n2708J04359J19383j65436n1747
$$ 281018 249237 77543 -212790 -185621 -108467 -161175 -56816 62567 -102869 -154616
14350a54616L4894n5646m4789j76166L7588J33955j4549m2290J67399l773R173
$$ -154616 -119722 -175368 -220157 -396323 -358735 -224780 -239329 -281619 -114220 -117993 -108820
14339a08820k27336n67J80088N6096R7447K30529j21614j56072j60892p2236J24547
$$ -108820 -336156 -336723 -156635 -100539 -3092 227437 105823 -50249 -211141 -283377 -158830
14328a58830N3543J72450O9655m5324o1145K5694Q7851O0756M104n7485O6690
$$ -158830 -105287 67163 136818 91494 30349 56043 143894 204650 208754 151269 217959
14317B17959k5274k1800j39001j16165p7341J29694Q9751l0940n2840j11317L8335
$$ 217959 192685 170885 31884 -84281 -161622 -31928 57823 26883 -25957 -137274 -98939
14306i8939N9254k5077J15635P7746O0166J9312r1494k8215k6659j7083M9987
$$ -98939 -39685 -64762 50873 128619 188785 208097 116603 88388 61729 44646 94633
14295I4633j22553k83147J10193K6135m336K6795O0734o3312L3799N3609j7099
$$ 94633 -27920 -311067 -200874 -174739 -179075 -152280 -91546 -154858 -121059 -67450 -84549
14284h4549J03480K41869J28070j15756k28656O0065P4293o9625j75612j68524
$$ -84549 18931 260800 388870 273114 44458 104523 178816 109191 -66421 -234945
14274b34945J86541J78464o0176J3046L492p8226M3705M7747k1443p6268j43478
$$ -234945 -48404 130060 69884 82930 86422 8196 51901 99648 78205 1937 -141541
14263a41541J55418J47356r6520j66838o4511j70672J2627P7925j4717J31960
$$ -141541 13877 161233 64713 -102125 -166636 -337308 -324681 -246756 -261473 -129513
14253a29513J1698K9077J7273P204j69424m7534J0616J17286P4590J9131J30943
$$ -129513 -117815 -88738 -71465 -64261 -233685 -281219 -270603 -153317 -78727 -59596 71347
14242G1347J59241j14969j63969N7350n515q9111J78279P730Q582L2436P000N7357
$$ 71347 230588 115619 -48350 9000 3485 -85626 92653 100383 108965 141401 148401 205758
14230B05758k8755R3024r9113L2680k1525j15607K6931j5104Q7673j14918j16022
$$ 205758 177003 270027 170914 203594 182069 66462 93393 78289 165962 51044 -64978
14219f4978j0138N0633O9143r899j05579r0351Q1585K25748p0963q6658K5438
$$ -64978 -75116 -24483 44660 34761 -70818 -161169 -79584 146164 75201 -11457 13981
14208A3981N8197M6776m5004j16543n859J86251N7019l2224L3470L9980m1122
$$ 13981 72178 118954 73950 -42593 -48452 137799 194818 162594 196064 236044 194922
14197A94922O0559o4570j14647O871L0891k3317n3296j98804M5100j01582K7299
$$ 194922 255481 190911 76264 83135 114026 90709 37413 -161391 -116291 -217873 -190574
14186a90574K37935K12025m4340k25618j01587J11571L1894m6741j0819o5908
$$ -190574 47361 259386 215046 -10572 -112159 -588 31306 -15435 -26254 -92162
14176i2162P850n6711J7809J53005R7623o6835K1041J79662k7555n7246j32577
$$ -92162 -84312 -141023 -123214 29791 127414 60579 81620 261282 233727 176481 43904
14165D3904j00802j36175k5428j15275J12398K22372J4292j28781R2579m257p236
$$ 43904 -56898 -193073 -218501 -333776 -221378 994 15286 -113495 -20916 -25173 -32409
14154c2409M7963P5890J60132N6793j22798j6121R5207J22962j45190j05569r9304
$$ -32409 15554 91444 251576 308369 185571 169450 264657 387619 242429 136860 37556
14143C7556o7742M7200j40420j38028j36051o0223o4183N9467K26911J26237k30991
$$ 37556 -30186 17014 -123406 -261434 -397485 -457708 -521891 -462424 -235513 -109276 -340267
14132c40267J80989K31195L0397o6557M7780o039R3232q4764j75155k695J09055
$$ -340267 -159278 71917 102314 35757 83537 77498 170730 85966 -89189 -91884 17171
14121A7171J60412J50708o2932L0591p5769q2965r783j14549M2751J01505l3054
$$ 17171 177583 328291 265359 295950 220181 137216 127433 12884 55635 157140 124086
14110A24086p6893j3523j17035j69181m9808J36090q551m9516N0709P4591J01588
$$ 124086 47193 33670 -83365 -252546 -302354 -166264 -174815 -224331 -173622 -99031 2557
14099B557J12583j51176j13036M0348O7023m6585m7790Q522o5620Q0892J12519
$$ 2557 115140 -36036 -149072 -108724 -41701 -88286 -136076 -127554 -193174 -112282 237
14088B37j2193l4858J68264n691j49579p5179K1058n8042k02j3789O6806J19099
$$ 237 -11956 -46814 121450 115759 -33820 -108999 -87941 -145983 -146185 -159974 -93168 25931
14076B5931n1898j97688Q4604R1330K9547j6345j1068R6169N1122j01670m725
$$ 25931 -25967 -223655 -139051 -47721 -18174 -34519 -45587 50582 101704 34 -4691
14065d691O64j02924M9312n3920J4294N3689L8564P3614L493j41158o5961j27699
$$ -4691 -4027 -106951 -57639 -111559 -97265 -43576 -5012 68602 72095 -69063 -135024 -262723
14053b62723O4556J15436J79082n2664J43460J9671n4791r4761J3516J2084j03306
$$ -262723 -198167 -82731 96351 43687 187147 206818 152027 57266 70782 82866 -20440
14042b0440k5425K12614m5555j86896q8352J05480l3073n8824J85599n7065k0783
$$ -20440 -45865 166749 121194 -65702 -154054 -48574 -81647 -140471 45128 -11937 -32720
14031c2720J86185p487o7363j53333P5151J0208o314J9152k02077o7936J61716
$$ -32720 153465 145978 78615 -74718 433 10641 4327 23479 -178598 -246534 -84818
14020h4818K79863J2069K1077O5407j0589k75937K2701N0426j58483j22656J28782
$$ -84818 195045 207114 228191 293598 283009 7072 29773 80199 -78284 -200940 -72158
14009g2158K7173p0874k6357J08912P2896J60570q5560j49093k3754J35118k5314
$$ -72158 -44985 -115859 -142216 -33304 39592 200162 114602 -34491 -58245 76873 51559
13998E1559k9353j21540Q069M7546o6628R1727K27523Q6867r2117j14614l1900
$$ 51559 22206 -99334 -91265 -43719 -110347 -18620 208903 295770 203653 89039 57139
13987E7139j21480j68401J71748L1185k3853j38101k06823J34776J10877R5904
$$ 57139 -64341 -232742 -60994 -29809 -53662 -191763 -398586 -263810 -152933 -57029
13977e7029J28527K4635L9751J7268J24255Q547J36899K06721k54019j94355q7433
$$ -57029 71498 96133 135884 153152 277407 285954 422853 629574 375555 181200 93767
13966I3767J2049J78082J20389L3788m4300j60769j86594j04305m1368P5420J8514
$$ 93767 105816 283898 404287 438075 393775 233006 46412 -57893 -99261 -23841 -5327
13955e327m442p4097n3611J02387M021j41459j15353P1558K26762J67921M9896
$$ -5327 -9769 -83866 -137477 -35090 -31069 -172528 -287881 -216323 10439 178360 228256
13944B28256p6592k25144n8818J50990K9708L721P372p1235R7698q6811j99184
$$ 228256 151664 -73480 -132298 18692 48400 52121 59493 -11742 85956 -855 -200039
13933b00039l7772M4359l4447K5719Q6547J84267l50j0510Q8476j62796r94N3874
$$ -200039 -237811 -193452 -227899 -202180 -115633 68634 68284 57774 146250 -16546 -17540 36334
13921C6334K4432m1518j28399K771P2100M0721p283r8816n6183M8606P5337J4420
$$ 36334 60766 19248 -109151 -106380 -34280 6441 -842 -99658 -155841 -107235 -31898 -17478
13909a7478n6638J27821O7258J2617Q2747j25039j04124n3808O0270j11810P6253
$$ -17478 -74116 53705 120963 133580 216327 91288 -12836 -66644 -6374 -118184 -41931
13898d1931L3078J02524J34277R365j96272p6532J64271O2793q2944Q9918J19723
$$ -41931 -8853 93671 227948 237313 41041 -35491 128780 191573 108629 198547 318270
13887C18270j79165j78445M6853k0441m1066j13953l5642p7405J6024P8630J97825
$$ 318270 139105 -39340 7513 -12928 -53994 -167947 -203589 -280994 -264970 -186340 11485
13876A1485J53130k14606k51113J56515k1681j45731Q2556N0334J88127J07162
$$ 11485 164615 -49991 -301104 -144589 -166270 -312001 -229445 -179111 9016 116178
13866A16178l6534j84163r5490n9043J40312J74949n6264J0703K3068J36485N6074
$$ 116178 79644 -104519 -200009 -259052 -118740 56209 -55 10648 33716 170201 226275
13855B26275l4116n8278k08070r0129K9783P7954R333j60417J02022J67414J98849
$$ 226275 192159 133881 -74189 -164318 -134535 -56581 -47248 -207665 -105643 61771 260620
13844B60620r5298k00256m772p3715j27339k9329J10331K2054R3839R6442Q229
$$ 260620 165322 -34934 -39706 -113421 -240760 -270089 -159758 -137704 -43865 52577 60806
13833F0806q1283L3783J35649l3126p3230j16263N6577l9092n5736J8884L3893
$$ 60806 -20477 13306 148955 115829 42599 -73664 -17087 -56179 -111915 -93031 -59138
13822e9138N5559L9815n4237j31731K4535j78002o094r727M4942P9572o5436k01150
$$ -59138 -3579 36236 -18001 -149732 -125197 -303199 -309293 -319020 -274078 -194506 -259942 -461092
13810d61092P6805R9487J72445K78425J16488j41802R50j47916l4271l4484M8137
$$ -461092 -384287 -284800 -112355 166070 282558 140756 141706 -6210 -40481 -74965 -26828
13799b6828J12054n2012j20090J16085o8168J22167J42136r5594k33117j29801
$$ -26828 85226 33214 -86876 29209 -38959 83208 225344 129750 -103367 -233168
13789b33168q3532k607J35874K54015J42086k22253l8323P3212j02860o5958N6739
$$ -233168 -316700 -319307 -183433 70582 212668 -9585 -47908 25304 -77556 -143514 -86775
13778h6775L7237j31532J75020Q1518m725j6116l8560j27299J41447L3334j80203
$$ -86775 -49538 -181070 -6050 75468 70743 54627 16067 -111232 30215 63549 -116654
13767a16654n5726K24404K5550j14811j7068J41626O7885M7634j7095j19540p6046
$$ -116654 -172380 52024 77574 -37237 -54305 87321 155206 202840 185745 66205 -9841
13756i841M793J7385o7992P7768Q6033o3320o3666q938P3912K2889J77967j53825
$$ -9841 -5048 12337 -55655 22113 108146 44826 -18840 -27778 46134 69023 246990 93165
13744I3165j77727j346m9395k2056J8277n1932Q6362q878R4011J27419j68059
$$ 93165 -84562 -85908 -135303 -157359 -139082 -191014 -104652 -113530 -19519 107900 -60159
13733f0159K4435L2995j0593L1810J67580J1672l1824j03804p9167M0927R5284
$$ -60159 -35724 -2729 -13322 18488 186068 197740 165916 62112 -17055 23872 119156
13722A19156J52605j58470j43632J28804O8991j25092J8426p1203N9549J99190
$$ 119156 271761 113291 -30341 98463 167454 42362 60788 -10415 49134 248324
13712B48324K11341j17829j92583n6744j03229K3309p3862p534K03285P1369k49424
$$ 248324 459665 341836 149253 92509 -10720 12589 -61273 -68807 134478 205847 -43577
13701d3577k60664k1605J69702N1373J27081P4253R2191L2114n6920j25148r8441
$$ -43577 -304241 -325846 -156144 -104771 22310 96563 188754 220868 163948 38800 -59641
13690e9641r567M2252j83291j43173J72281Q7372J51539j9104p5451N6661P2295
$$ -59641 -69208 -26956 -210247 -353420 -181139 -93767 57772 38668 -36783 19878 92173
13679I2173n1342m2371Q983j16542N3859J75606J2955J2542k1173k20116j8971
$$ 92173 40831 -1540 7443 -109099 -55240 120366 133321 145863 124690 -95426 -114397
13668a14397Q2676P0462p7201K10032L075K2834q9868k8359J55330J46688j60026
$$ -114397 -31721 38741 -38460 171572 174647 197481 107613 79254 234584 381272 221246
13657B21246j35858j06577p0619j57767K3953J72485j0854O4708R4065j72463
$$ 221246 85388 -21189 -91808 -249575 -225622 -53137 -63991 717 94782 -77681
13647g7681r6906Q7415P3541j0352k5514m1534j4062N9591Q4264J42589R8277
$$ -77681 -174587 -87172 -13631 -23983 -49497 -91031 -105093 -45502 38762 181351 279628
13636B79628j0846Q955k14794l8407j29249k99664J6418J66954P4931l836R355
$$ 279628 268782 277737 62943 24536 -104713 -404377 -387959 -221005 -146074 -149910 -140555
13625a40555o8921k31441M7031J88792P1321L6376M7389P0701k8319j09723j42402
$$ -140555 -209476 -440917 -393886 -205094 -133773 -97397 -50008 20693 -7626 -117349 -259751
13614b59751L5560R2592K18240Q5659j16736l8719j955L3457q6496J29334L2112
$$ -259751 -224191 -131599 86641 172300 55564 16845 14890 48347 -38149 91185 123297
13603A23297N3804J9921p9377J4046P6942m2171j7218j92973j96281J4353J02325
$$ 123297 177101 197022 117645 131691 208633 166462 149244 -43729 -240010 -225657 -123332
13592a23332M7002J2874J31365o3717k19694j994K47727J70381k7887n4499j58793
$$ -123332 -76330 -63456 67909 4192 -215502 -217496 30231 200612 172725 118226 -40567
13581d0567k3050J50803j6012m3221m8315j49880j02777J18500P9530k9605L0220
$$ -40567 -63617 87186 71174 27953 -20362 -170242 -273019 -154519 -74989 -104594 -74374
13570g4374n1836k14669L5724J64313J03917J36524P2805j8572l3841j48788j21328
$$ -74374 -126210 -340879 -305155 -140842 -36925 99599 172404 153832 119991 -28797 -150125
13559a50125R5203K34710M9787r7115L4121M9292k0274p4530l1052p2558O3937
$$ -150125 -54922 179788 229575 132460 166581 215873 195599 121069 90017 17459 81396
13548H1396O4214K5119O3082j22540q599K4634J19087m12o4117p0219m0156j03116
$$ 81396 145610 170729 233811 111271 102672 127306 246393 245981 181864 111645 71489 -31627
13536c1627j12553p616p4300O1052N5289r386J51977j168q1993J06753K85004
$$ -31627 -144180 -151796 -226096 -165044 -109755 -119141 32836 31668 -50325 56428 341432
13525C41432k1822j58537L9495K4195j4745J28655N5616l9974n690k2307k10969
$$ 341432 319610 161073 200568 224763 210018 338673 394289 354315 348625 326318 115349
13514A15349j98078j10693m8033J4143O5759j51088K37712R2614l9021o8708J06659
$$ 115349 -82729 -193422 -241455 -227312 -161553 -312641 -74929 17685 -21336 -90044 16615
13503A6615J44210j53083j57955j6414J76009M9098n7108n4809J44244L386j10215
$$ 16615 160825 7742 -150213 -166627 9382 58480 1372 -53437 90807 94193 -16022
13492a6022J74262n7145j78498O8797J40552K7176O4385N3520j33769k53149m4066
$$ -16022 158240 101095 -77403 -8606 131946 159122 223507 277027 143258 -109891 -153957
13481a53957J65528L7468o950j04767R9043J1492l267K6178M6539l8533n2753
$$ -153957 11571 49039 42089 -62678 36365 47857 44590 70768 117307 78774 26021
13470B6021l4592r1624k6063p8762O7489J39132j5373m2369J25854p5175m8039
$$ 26021 -8571 -100195 -126258 -205020 -137531 1601 -13772 -56141 69713 -5462 -53501
13459e3501R362R7263J00247q4779l2927j97019l6761j16312j462J64664m0454
$$ -53501 -44139 53124 153371 68592 35665 -161354 -198115 -314427 -315889 -151225 -191679
13448a91679k5556k1247P8345J02183O8721K06336k100j6576k8629r9046j40943
$$ -191679 -217235 -238482 -160137 -57954 10767 217103 215003 198427 169798 70752 -70191
13437g0191N8024O4153j22365j13861k1776R7655q011l0154p0018J50582K0867
$$ -70191 -12167 51986 -70379 -184240 -206016 -108361 -116372 -146526 -216544 -65962 -45095
13426d5095P8188j40596j36546Q3158L3247L3520J01561J36115n1060j32217Q9001
$$ -45095 33093 -107503 -244049 -160891 -127644 -94124 7437 143552 92492 -39725 49276
13415D9276R2319P1328n6064j42011m0413P1287P5785j15245j63364k8548M8438
$$ 49276 141595 212923 156859 14848 -25565 45722 121507 6262 -157102 -185650 -137212
13404a37212p325J34443L8915L0802Q6814N1893O7841k6355j03407O215r3672
$$ -137212 -144537 -10094 28821 59623 146437 198330 266171 239816 136409 142624 48952
13393D8952J9936r4827j23178n7190J34603J40730J14190q7196j05013R7913j2797
$$ 48952 68888 -25939 -149117 -206307 -71704 69026 183216 96020 -8993 88920 76123
13382G6123j34103k7363J82062L9613P8443r7505k47139j48972K15739J1939m0256
$$ 76123 -57980 -85343 96719 136332 214775 117270 -129869 -278841 -63102 -51163 -91419
13371i1419J28848R999O6095L1019p3395j08365J6165o2723n4149k7998J18227
$$ -91419 37429 47428 113523 144542 71147 -37218 -21053 -83776 -137925 -165923 -47696
13360d7696O8786J36948J2633L0354m2655k55831q7007j057J02521J04601m5304
$$ -47696 21090 158038 170671 201025 158370 -97461 -184468 -185525 -83004 21597 -23707
13349b3707P3048M7879J9212k12865J29678K02741M6985j45740k24539q9806J66149
$$ -23707 49341 97220 116432 -96433 33245 235986 282971 137231 -87308 -177114 -10965
13338a0965Q4845r2701K3647J09267q9197o2618P8915j40140L3802j78136j21802
$$ -10965 73880 -18821 4826 114093 24896 -37722 41193 -98947 -65145 -243281 -365083
13327c65083l9563P9208P8277J5386K1517k664j03175J48875K12299J15018r9138
$$ -365083 -404646 -325438 -247161 -231775 -210258 -212922 -316097 -167222 45077 160095 60957
13316F0957k32070m5507O4191P870q0325J233Q6190J53031k6873M4925O157N7015
$$ 60957 -171113 -216620 -152429 -144559 -224884 -223651 -137461 15570 -11303 33622 39779 96794
13304I6794L132q4646J34808J6097m6801j23485j12971M1123K02186O8341m4076
$$ 96794 99926 15280 150088 166185 119384 -4101 -117072 -75949 126237 194578 150502
13293A50502r5855N7067m9462k943l2798M1902j28550o1057K5234K34978J04739
$$ 150502 54647 111714 62252 59309 26511 68413 -60137 -121194 -95960 139018 243757
13282B43757j09182r6774q3097m7751o3748J04313K3013l7142j14817K8362q7518
$$ 243757 134575 37801 -45296 -93047 -156795 -52482 -29469 -66611 -181428 -153066 -240584
13271b40584J3458J8946J16519R9512R7325j37513j80495j35654K2259J66636
$$ -240584 -227126 -208180 -91661 7851 105176 -32337 -212832 -348486 -326227 -159591
13261a59591q8895j7772j45864M8759K52565Q9943n9176L6082K42875J68311m5750
$$ -159591 -248486 -266258 -412122 -363363 -110798 -20855 -80031 -43949 198926 367237 321487
13250C21487j35440k00558l7710p7609J83556J19195q1470n6992j00290j35779
$$ 321487 186047 -14511 -52221 -129830 53726 172921 91451 34459 -65831 -201610
13240b01610J38331K77855J86226m0658j07296q7871j75457k53Q5189J32693j3884
$$ -201610 -63279 214576 400802 360144 252848 164977 -10480 -10733 74456 207149 193265
13229A93265J7201m9493K8609k0229k59267j79630q8737K33748J65161p5358N3994
$$ 193265 210466 160973 189582 169353 -89914 -269544 -358281 -124533 40628 -34730 19264
13218A9264O1776J43097j25143P240R369j24397J2489j08938m6823J08145M0646
$$ 19264 81040 224137 98994 106234 115603 -8794 3695 -105243 -152066 -43921 -3275
13207c275O2844m3849o0989K730K8397k0249J47143K65268o490k66290j33654
$$ -3275 59569 15720 -45269 -42539 -14142 -34391 112752 378020 371530 105240 -28414
13196b8414q5419j91536J3383P615J52577K29324P7980J8422n0283k27539R2513
$$ -28414 -113833 -305369 -291986 -284371 -131794 97530 175510 193932 143649 -83890 8623
13185H623K15442j41914k63900k6706J58641J42182j62759m948K0919K2045j92786
$$ 8623 224065 82151 -181749 -208455 -49814 92368 -70391 -75339 -54420 -32375 -225161
13174b25161o0048J72140k3197Q658m937o9635p0251k1252J03589P3058l590P4951
$$ -225161 -285209 -113069 -136266 -127608 -132545 -202180 -272431 -293683 -190094 -117036 -120626 -45675
13162d5675j4866j8100K9606K3308J34131L3963j2326p2978m4459M7536M3916
$$ -45675 -60541 -78641 -49035 -25727 108404 142367 130041 57063 12604 60140 104056
13151A04056l4401j89616p1784Q1490l7322O5345M9440Q1972k017j14728n3719
$$ 104056 69655 -119961 -191745 -110255 -147577 -82232 -32792 49180 47163 -67565 -121284
13140a21284M1502N5892j00536J74224J73740j88069N4385j07119o7799J21003
$$ -121284 -79782 -23890 -124426 49798 223538 35469 89854 -17265 -85064 35939
13130C5939j16110j03112K8123J25924L9199j0324J49033r5951j66274j11453
$$ 35939 -80171 -183283 -155160 -29236 9963 -361 148672 52721 -113553 -225006
13120b25006O6691K45832K080n1585k8765k2561J60526M0109j93999k00980P1545
$$ -225006 -158315 87517 89597 38012 9247 -13314 147212 187321 -6678 -207658 -136113
13109a36113J68111J14189Q2669n1244k3844N5878k5801q0791p1748K2386m6188
$$ -136113 31998 146187 228856 177612 153768 209646 183845 103054 31306 53692 7504
$$ [...]
##END NTUPLES=NMR SPECTRUM
##END=
