##TITLE=Analysis number 322223
Compound Code cc 58510
Book Reference 196/188
Project Code adrs
Chemist Name jimp
##JCAMPDX= 6.0         $$ Bruker NMR JCAMP-DX V2.0
##DATA TYPE= NMR SPECTRUM
##DATA CLASS= NTUPLES
##ORIGIN= Bruker BioSpin GmbH
##OWNER= nmr
$$ XWIN-NMR		Version 3.5
$$ Mon Sep 18 09:07:51 2006 GMT Daylight Time (UT+1h)  MAYBRIDGE\nmr@NMR_250MHZ
##.OBSERVE FREQUENCY= 250.131544655141
##.OBSERVE NUCLEUS= ^1H
##.ACQUISITION MODE= SIMULTANEOUS (DQD)
##.ACQUISITION SCHEME= undefined
##.AVERAGES= 16
##.DIGITISER RES= 18
##SPECTROMETER/DATA SYSTEM= dpx250
##.PULSE SEQUENCE= zg30
##.SOLVENT NAME= CDCl3
##.SHIFT REFERENCE= (INTERNAL, CDCl3, 0, 16.522)
##AUDIT TRAIL= $$ (NUMBER, WHEN, WHO, WHERE, WHAT)
$$ ##TITLE= Audit trail, XWIN-NMR		Version 3.5
$$ ##JCAMPDX= 5.01
$$ ##ORIGIN= Bruker BioSpin GmbH
$$ ##OWNER= nmr
$$ C:\u/data/dgb/nmr/ADRS/910/pdata/1/auditp.txt
$$ ##AUDIT TRAIL=  $$ (NUMBER, WHEN, WHO, WHERE, WHAT)
(   1,<2006-09-18 09:07:21.73 +100>,<MAYBRIDGE\nmr>,<NMR_250MHZ>,
      <created by zg, POWCHK disabled, PULCHK disabled
       configuration hash MD5:
       E2 DF 36 D8 04 B2 41 60 5A D7 A3 38 5A 4B D0 FE
       data hash MD5: 64K
       8C 4E 7A A8 90 7C 9C 3E D7 2A 99 BF 9F 92 2D 9D>)
(   2,<2006-09-18 09:07:38.89 +100>,<MAYBRIDGE\nmr>,<NMR_250MHZ>,
      <Start of raw data processing
       ef LB = 0.3 FT_mod = 6 PKNL = 1 SI = 32K 
       data hash MD5: 32K
       35 EF A0 3F E4 9D 38 22 16 BF 88 E7 14 5B 70 C9>)
(   3,<2006-09-18 09:07:40.76 +100>,<MAYBRIDGE\nmr>,<NMR_250MHZ>,
      <apk 
       data hash MD5: 32K
       EE D9 64 EE 7C 1B B6 89 02 37 37 33 06 95 C2 DD>)
(   4,<2006-09-18 09:07:41.51 +100>,<MAYBRIDGE\nmr>,<NMR_250MHZ>,
      <abs ABSG = 5 
       data hash MD5: 32K
       67 57 E3 1C 36 B8 BD AC E5 16 98 0B EF B9 45 6E>)
$$ ##END=
$$ 
$$ hash MD5
$$ A8 32 CC E4 70 ED BE 18 4B 42 5A BE E3 12 45 69
##$RELAX= 
##$RELAX= 
##$RELAX= 
##$RELAX= 
##$RELAX= 
##$RELAX= 
##$RELAX= 
$$ Bruker specific parameters
$$ --------------------------
##$DU= <C:\u>
##$EXPNO= 910
##$NAME= <ADRS>
##$PROCNO= 1
##$TYPE= <nmr>
##$USER= <dgb>
##$AMP= (0..31)
100 100 100 100 100 100 100 100 100 100 100 100 100 100 100 100 100 100 
100 100 100 100 100 100 100 100 100 100 100 100 100 100 
##$AQSEQ= 0
##$AQ_mod= 3
##$AUNM= <au_zg>
##$AUTOPOS= <36 >
##$BF1= 250.13
##$BF2= 250.13
##$BF3= 250.13
##$BF4= 250.13
##$BF5= 500.13
##$BF6= 500.13
##$BF7= 500.13
##$BF8= 500.13
##$BYTORDA= 1
##$CFDGTYP= 0
##$CFRGTYP= 5
##$CHEMSTR= <none>
##$CNST= (0..31)
1 1 145 1 1 1 1 1 1 1 1 1 1 1 1 1 1 1 1 1 1 1 1 1 1 1 1 1 1 1 1 1 
##$CPDPRG= <>
##$CPDPRG1= <>
##$CPDPRG2= <>
##$CPDPRG3= <>
##$CPDPRG4= <mlev>
##$CPDPRG5= <mlev>
##$CPDPRG6= <mlev>
##$CPDPRG7= <mlev>
##$CPDPRG8= <mlev>
##$CPDPRGB= <>
##$CPDPRGT= <>
##$D= (0..31)
0 1 0 0 0 0 0 0 0 0.06 0 0 0 0 0 0 0.0002 0 0 0 0 0 0 0 0 0 0 0 0 0 0 
0 
##$DATE= 1158566839
##$DBL= (0..7)
120 120 120 120 120 120 120 120 
##$DBP= (0..7)
150 150 150 150 150 150 150 150 
##$DBP07= 0
##$DBPNAM0= <>
##$DBPNAM1= <>
$$ [...]
##$SUBNAM7= <"">
##$SUBNAM8= <"">
##$SUBNAM9= <"">
##$SW= 20.6930455092707
##$SWIBOX= (0..15)
0 0 3 0 0 0 0 0 0 0 0 0 0 0 0 0 
##$SW_h= 5175.983436853
##$TD= 65536
##$TD0= 1
##$TE= 295.16
##$TE2= 300
##$TE3= 300
##$TEG= 300
##$TL= (0..7)
0 120 120 120 120 120 120 120 
##$TP= (0..7)
150 150 150 150 150 150 150 150 
##$TP07= 0
##$TPNAME0= <>
##$TPNAME1= <>
##$TPNAME2= <>
##$TPNAME3= <>
##$TPNAME4= <>
##$TPNAME5= <>
##$TPNAME6= <>
##$TPNAME7= <>
##$TPOAL= (0..7)
0.5 0.5 0.5 0.5 0.5 0.5 0.5 0.5 
##$TPOFFS= (0..7)
0 0 0 0 0 0 0 0 
##$TUNHIN= 0
##$TUNHOUT= 0
##$TUNXOUT= 0
##$USERA1= <user>
##$USERA2= <user>
##$USERA3= <user>
##$USERA4= <user>
##$USERA5= <user>
##$V9= 5
##$VALIST= <valist>
##$VCLIST= <CCCCCCCCCCCCCCC>
##$VD= 0
##$VDLIST= <DDDDDDDDDDDDDDD>
##$VPLIST= <PPPPPPPPPPPPPPP>
##$VTLIST= <TTTTTTTTTTTTTTT>
##$WBST= 1024
##$WBSW= 4
##$XGAIN= (0..3)
0 0 0 0 
##$XL= 0
##$YL= 0
##$YMAX_a= 461917
##$YMIN_a= -586493
##$ZGOPTNS= <>
##$ZL1= 120
##$ZL2= 120
##$ZL3= 120
##$ZL4= 120
##$ABSF1= 16.522
##$ABSF2= -4.171173
##$ABSG= 5
##$ABSL= 3
##$ALPHA= 0
##$AQORDER= 0
##$ASSFAC= 0
##$ASSFACI= 0
##$ASSFACX= 0
##$ASSWID= 0
##$AUNMP= <proc_1d>
##$AZFE= 0.1
##$AZFW= 0.1
##$BCFW= 0
##$BC_mod= 0
##$BYTORDP= 0
##$COROFFS= 0
##$CY= 12.5
##$DATMOD= 1
##$DC= 0
##$DFILT= <>
##$DTYPP= 0
##$F1P= 14.0000005364418
##$F2P= -0.99999901652339
##$FCOR= 0.5
##$FTSIZE= 32768
##$FT_mod= 6
##$GAMMA= 0
##$GB= 0
##$INTBC= 1
##$INTSCL= 1
##$ISEN= 128
##$LB= 0.3
##$LEV0= 0
##$LPBIN= 0
##$MAXI= 10000
##$MC2= 0
##$MEAN= 0
##$ME_mod= 0
##$MI= 0
##$NCOEF= 0
##$NC_proc= -4
##$NLEV= 6
##$NOISF1= 0
##$NOISF2= 0
##$NSP= 0
##$NTH_PI= 0
##$NZP= 0
##$OFFSET= 16.522
##$PC= 1
##$PHC0= 144.6534
##$PHC1= 9.095311
##$PH_mod= 1
##$PKNL= yes
##$PPARMOD= 0
##$PSCAL= 4
##$PSIGN= 0
##$REVERSE= no
##$SF= 250.13
##$SI= 32768
##$SIGF1= 0
##$SIGF2= 0
##$SINO= 400
##$SIOLD= 32768
##$SREGLST= <1H.CDCl3>
##$SSB= 0
##$STSI= 32768
##$STSR= 0
##$SW_p= 5175.98343685301
##$SYMM= 0
##$S_DEV= 0
##$TDeff= 65536
##$TDoff= 0
##$TI= <Analysis number 999999
Compound Code 99
Book Reference 9
Project Code 9>
##$TILT= no
##$TM1= 0
##$TM2= 0
##$TOPLEV= 0
##$USERP1= <user>
##$USERP2= <user>
##$USERP3= <user>
##$USERP4= <user>
##$USERP5= <user>
##$WDW= 1
##$XDIM= 32768
##$YMAX_p= 327902229
##$YMIN_p= -207713
$$ End of Bruker specific parameters
$$ ---------------------------------
##NTUPLES= NMR SPECTRUM
##VAR_NAME=  FREQUENCY,     SPECTRUM/REAL,   SPECTRUM/IMAG
##SYMBOL=    X,             R,               I
##VAR_TYPE=  INDEPENDENT,   DEPENDENT,       DEPENDENT
##VAR_FORM=  AFFN,          ASDF,            ASDF
##VAR_DIM=   32768,         32768,           32768
##UNITS=     HZ,            ARBITRARY UNITS, ARBITRARY UNITS
##FACTOR=    0.157963299565203, 1,           1
##FIRST=     4132.6476996994, 0,             0
##LAST=      -1043.33573715361, 0,           0
##MIN=       -1043.33573715361, -207713,     0
##MAX=       4132.6476996994, 327902229,     0
$$ Real data points
##PAGE= N=1
##DATA TABLE= (X++(R..R)), XYDATA
$$ [...]
$$ plain form
20183 -130328 -90989 -37675 -17495 -15392 -68662 -104024 -54220 -28310 13102 36897 -2118 -29426
20171 -29426 -7793 -9203 13709 3324 -31420 -105189 -114150 -90793 -68604 -25604 58344 90541
20159 90541 18100 -85698 -106472 -63322 -30775 -52678 -55753 -19828 -9816 50245 88638 58768
20147 58768 56497 10610 -35095 -27837 -9961 33201 31633 12705 -51835 -82926 -51590 -10519
20135 -10519 19978 -10205 -54864 -28933 36609 -1760 -9098 -4400 -38541 -116821 -101620 -80773
20123 -80773 -113874 -100918 -50145 18308 53032 1058 -12888 23543 22528 18333 66908 105375
20111 105375 21720 -63194 -99082 -81987 -76731 -22742 15913 27404 43091 8533 -43578 -42928
20099 -42928 -57618 -46962 -9379 -14235 -40189 13949 37396 74021 17499 -35168 -81190 -60598
$$ packed form
20183a30328L9339N3314K0180K103n3270l5362M9804K5910M1412K3795l9015k7308
20171b9426K1633j410K2912j0385l4744p3769q961K3357K2189M3000Q3948L2197
20159I0541p2441j03798k0774M3150L2547k1903l075L5925J0012O0061L8393k9870
20147E8768k271m5887m5705P258J7876M3162j568j8928o4540l1091L1336M1071
20135a0519L0497l0183m4659K5931O5542l8369p338M698l4141p8280J5201K0847
20123h0773l3101J2956N0773O8453L4724n1974j3946L6431j015m195M8575L8467
20111A05375q3655q4914l5888J7095N256N3989L8655J1491J5687l4558n2111O50
20099d2928j4690J0656L7583m856k5954N4138K3447L6625n6522n2667m6022K0592
$$ plain form
20087 -60598 -52691 -24854 1198 13975 13069 -7368 -74021 -111105 -37597 -53998 -59654 -58532 7740
20074 7740 58021 112917 65786 16615 6255 12129 -19769 -36584 -43393 -27695 -18098 736
20062 736 45966 42421 -374 50058 51113 14119 44566 -33349 -58039 -55468 -60586 -58156 -67310
20049 -67310 -21797 9694 43285 67127 51142 -471 -37114 -25537 18452 50619 -11892 -68881
20037 -68881 -91402 -59627 -31269 13226 1813 -74269 -110489 -60314 -72618 -79066 -60910 -35114
20025 -35114 48406 89447 81113 40480 60671 4921 -58550 -114005 -118827 -80599 -22672 57610
20013 57610 83270 62960 -13862 -24908 -50253 -102674 -121045 -86818 -15761 13998 25206 -32513
20001 -32513 -89613 -91223 -45015 -14768 -57044 -93044 -106666 -113895 -79977 -111886 -127673 -106487
$$ packed form
20087f0598P907K7837K6052J2777r06k0437o6653l7084P3508j6401n656J122O6272
20074G740N0281N4896m7131m9171j0360N874l1898j6815o809J5698R597J8834
20062G36M5230l545m2795N0432J055l6994L0447p7915k4690K571n118K430r154
20049f7310M5513L1491L3591K3842j5985n1613l6643J1577M3989L2167o2511n6989
20037f8881k2521L1775K8358M4495j1413p6082l6220N0175j2304o448J8156K5796
20025c5114Q3520M1041q334m0633K0191n5750o3471n5455m822L8228N7927Q0282
20013E7610K5660k0310p6822j1046k5345n2421j8371L4227P1057K9759J1208n7719
20001c2513n7100j610M6208L0247m2276l6000j3622p229L3918l1909j5787K1186
$$ plain form
19989 -106487 -56656 146 11259 -9334 -25868 -41084 -48375 -23411 -19426 -54879 -61387 -64163
19977 -64163 -26830 -44423 -70814 -110713 -107837 -48227 -14843 56793 65596 -13175 -28564 33511
19965 33511 28790 25567 20948 33502 66149 100352 52458 -17915 -23526 -15654 -39315 -1113 -25162
19952 -25162 -73669 -44242 -46844 -35235 26596 17411 35609 4294 -79689 -154446 -173675 -101455
19940 -101455 -12781 6090 4377 -61233 -55880 6767 -32914 -62471 -46015 -13503 -23074 -42545
19928 -42545 -64590 -52980 -40713 12743 91659 82743 29521 -8051 -789 -23450 -48040 11985
19916 11985 63004 96066 89052 59428 42656 -51945 -71564 -40782 5377 43838 45331 14050
19904 14050 7978 -22695 9918 32431 26714 75375 66255 -2726 -91487 -88847 -60737 6234
$$ packed form
19989a06487M9831N6802J1113k0593j6534j5216p291K4964L985l5453o508k776
19977f4163L7333j7593k6391l9899K876N9610L3384P1636Q803p8771j5389O2075
19965C3511m721l223m619J2554L2647L4203m7894p0373n611P872k3661L8202k4049
19952b5162m8507K9427k602J1609O1831r185J8198l1315q3983p4757j9229P2220
19940a01455Q8674J8871j713o5610N353O2647l9681k9557J6456L2512r571j9471
19928d2545k2045J1610J2267N3456P8916q916n3222l7572P262k2661k4590O0025
19916A1985N1019L3062p014k9624j6772r4601j9619L0782M6159L8461J493l1281
19904A4050o072l0673L2613K2513n717M8661r120o8981q8761K640K8110O6971
$$ plain form
19892 6234 41442 58024 41769 51119 -8895 -94267 -88902 -138935 -158904 -97026 -47139 -39061
19880 -39061 -27502 -37537 -48947 -72432 -15182 -45130 -102161 -96760 -129556 -111180 -60733 -32007
19868 -32007 20881 36670 48445 2750 -29868 -45730 -21553 -9452 16711 63819 14200 -9099
19856 -9099 -38926 -16564 7746 4979 -15252 -31457 -44706 11838 50257 38734 -13791 -41748
19844 -41748 -10908 1677 -40654 -60714 -17095 29471 34719 67032 60648 -27542 -67384 -37716
19832 -37716 -22807 67348 83738 71464 49537 -672 -37809 51387 102866 33603 7487 12529
19820 12529 65727 92430 73280 55191 61076 47033 4955 23119 23040 9485 20779 -11529
19808 -11529 -100435 -71190 14303 38062 18016 37076 300 -48876 7604 20599 54895 16561
$$ packed form
19892F234L5208J6582j6255R350o0014q5372N365n0033j9969O1878M9887Q078
19880c9061J1559j0035j1410k3485N7250k9948n7031N401l2796J8376N0447K8726
19868c2007N2888J5789J1775m5695l2618j5862K4177J2101K6163M7108m9619k3299
19856i099k9827K2362K4310k767k0231j6205j3249N6544L8419j1523n2525k7957
19844d1748L0840J2585m2331k0060M3619M6566N248L2313o384q8190l9842K9668
19832c7716J4909R0155J6390j2274k1927n0209l7137Q9196N1479o9263k6116N042
19820A2529N3198K6703j9150j8089N885j4043m2078J8164p9j3555J1294l2308
19808a1529q8906K9245Q5493K3759k0046J9060l6776m9176N6480J2995L4296l8334
$$ plain form
19796 16561 12296 102684 94299 7640 -23823 -23266 85234 73249 19463 -15055 3836 9575
19784 9575 -6497 -43069 -499 16082 45319 33920 11293 14399 31685 76082 73377 41782
19772 41782 29655 62428 57660 -12101 8876 9761 38976 47601 47280 -17191 42329 95030 131563
19759 131563 98862 63147 25949 -17087 13910 25450 22830 -5372 -87219 -80539 -87243 -33855
19747 -33855 5127 53019 97536 72150 19444 -38114 -60657 641 10226 -19200 -28337 -69248
19735 -69248 -10192 64775 33892 -16857 -19374 59067 80061 30589 -4068 -20962 -11251 53812
19723 53812 38180 -7394 25005 65930 69514 43946 -13153 -30371 16707 25700 44661 11205
19711 11205 23844 27151 38162 -3645 -54900 -16155 -40220 -75836 722 103221 87926 -7936
$$ packed form
19796A6561m265R0388q385q6659l1463N57J08500j1985n3786l4518J8891N739
19784I575j6072l6572M2570J6581K9237j1399k2627L106J7286M4397k705l1595
19772D1782j2127L2773m768o9761K0977Q85K9215Q625l21o4471N9520N2701L6533
19759A31563l2701l5715l7198m3036L0997J1540k620k8202q1847O680o704N3388
19747c3855L8982M7892M4517k5386n2706n7558k2543O1298R585k9426r137m0911
19735f9248N9056P4967l0883n0749k517P8441K0994m9472l4657j6894R711O5063
19723E3812j5632m5574L2399M0925L584k5568n7099j7218M7078Q993J8961l3456
19711A1205J2639L307J1011m1807n1255L8745k4065l5616P6558J02499j5295r5862
$$ plain form
19699 -7936 -19131 9997 -17853 -98373 -75395 -30755 -4183 45186 70577 6121 36516 24066
19687 24066 -10061 8126 33358 16684 7452 29 1515 32043 20035 26565 6122 -51406
19675 -51406 -52936 -67640 35451 51517 985 13540 9660 77358 85780 116781 84387 79618
19663 79618 69269 8045 -39623 -44387 -29312 28750 44634 41725 -3081 -29258 -48290 -82779
19651 -82779 -56836 -14634 -57017 -79311 -68676 -28641 -68041 -69100 41330 116247 69507 8918
19639 8918 43251 15933 -29496 -32216 1599 -2546 465 -8136 -30376 -47829 -78457 -51858 -45970
19626 -45970 -1807 8254 19530 47800 75406 102614 46806 91829 45201 -28599 -63574 -108684
19614 -108684 -38858 -43298 -84195 -131172 -96509 -68414 -50654 -54244 51454 96960 89121 121440
$$ packed form
19699g936j1195K9128k7850q0520K2978M4640K6572M9369K5391o4456L0395j2450
19687B4066l4127J8187K5232j6674r232p423J486L0528j2008O530k0443n7528
19675e1406j530j4704J03091J6066n0532J2555l880O7698Q422L1001l2394m769
19663G9618j0349o1224m7668m764J5075N8062J5884k909m4806k6177j9032l4489
19651h2779K5943M2202m2383k2294J0635M0035l9400j059J10430P4917m6740o0589
19639H918L4333k7318m5429k720L3815m145L011q601k2240j7453l0628K6599N888
19626d5970M4163J0061J1276K8270K7606K7208n5808M5023m6628p3800l4975m5110
19614a08684O9826m440m0897m6977L4663K8095J7760l590J05698M5506p839L2319
$$ plain form
19602 121440 120018 102904 73172 54798 39462 711 -25366 31289 95688 81173 2439 -53779
19590 -53779 -33767 42922 38751 46887 -4062 -74130 -102455 -20164 1676 26150 -904 19952
19578 19952 31457 67330 49207 33922 26864 30976 28336 51590 85318 72738 -1739 -21690
19566 -21690 -25661 -21634 23809 53460 -4257 -36556 10479 9790 -12090 -31224 -438 67552
19554 67552 38416 56104 35562 -29156 -79825 -28928 -22393 -68623 -72878 -54854 -69117 -90087
19542 -90087 -134313 -106051 -32798 27351 35540 56615 30131 59973 94724 103029 126603 113794
19530 113794 62379 -12329 -36490 5168 -15250 -83441 -153078 -124917 -97515 -59508 -55059 -68050
19518 -68050 -59284 -25926 -22326 -58491 -91730 -66474 37318 100323 62404 54822 32507 90971
$$ packed form
19602A21440j422j7114k9732j8374j5336l8751k6077N6655O4399j4515p8734n6218
19590e3779K0012P6689m171Q136n0949p0068k8325Q2291K1840K4474k7054K0856
19578A9952J1505L5873j8123j5285p058M112k640K3254L3728j2580p4477j9951
19566b1690l971M027M5443K9651n7717l2299M7035o89k1880j9134L0786O7990
19554F7552k9136J7688k0542o4718n0669N0897O535m6230m255J8024j4263k0970
19542i0087m4226K8262P3253O0149Q189K1075k6484K9842L4751Q305K3574j2809
19530A13794n1415p4708k4161M1658k0418o8191o9637K8161K7402L8007M449j2991
19518f8050Q766L3358L600l6165l3239K5256J03792O3005l7919p582k2315N8464
$$ plain form
19506 90971 7369 -35603 -73 30801 33854 12462 -12188 -46820 -35160 13101 20445 40041
19494 40041 -4481 -14633 28863 10275 -21599 -16056 44904 52866 54726 39166 58803 56443
19482 56443 53823 35769 -41248 -53107 -26705 -62605 -75722 -57859 -39821 159 31736 5322
19470 5322 -31835 -14381 18772 38322 -18099 -54755 -13383 33652 514 -37125 -29017 -22822
19458 -22822 73798 100004 95389 54634 38124 42769 46049 73944 56321 34706 44113 28986
19446 28986 40007 14918 30155 33407 56346 108148 102648 80980 37050 28181 11565 15468
19434 15468 22100 65247 7516 -9414 -89400 -85969 -13475 -48717 -54428 -2360 32091 -48926
19422 -48926 -40848 6664 5111 -3258 -31751 -45852 2781 21578 4732 2004 9423 8254 -30052
$$ packed form
19506I0971q3602m2972L5530L0874L053k1392k4650l4632J1660M8261P344J9596
19494D0041m4522j0152M3496j8588l1874N543O0960P962J860j5560J9637k360
19482E6443k620j8054p7017j1859K6402l5900j3117J7863J8038L9980L1577k6414
19470E322l7157J7454L3153J9550n6421l6656M1372M7035l3138l7639Q108O195
19458b2822R6620K6206m615m0755j6510M645L280K7895j7623k1615R407j5127
19446B8986J1021k5089J5237L252K2939N1802n500k1668m3930q869j6616L903
19434A5468O632M3147n7731j6930p9986L431P2494l5242n711N2068L4451q1017
19422d8926Q078M7512j553q369k8493j4101M8633J8797j6846k728P419j169l8306
$$ plain form
19409 -30052 -14451 -2235 -8439 907 10332 65920 10348 -11588 -15628 -8570 -7860 -23579 -40307
19396 -40307 18464 343 -44518 52509 111346 84209 17353 -29754 -27217 -33434 23077 25643
19384 25643 11637 17884 88433 134057 55515 13498 -41819 -53575 -8360 -12284 -37673 -37199
19372 -37199 -86374 -67194 -33659 -3884 46788 73437 118084 158373 210181 194582 94257
19361 94257 18304 -39168 -74653 -45333 -51851 -25973 -18284 -46443 -8260 30437 46970 56258
19349 56258 96441 51912 14749 -2500 -17229 -8480 70479 114144 47750 -26415 -75166 -107134
19337 -107134 -57652 -5535 -31499 -14444 -2479 59075 7686 -5969 3940 4663 -20152 -17956
19325 -17956 -18544 9349 88298 89896 40995 -8964 -21774 17466 9159 10872 12336 -6388 -11922
$$ packed form
19409c0052J5601J2216o204R346R425N5588n5572k1936m040P058P10j5719j6728
19396d0307N8771j8121m4861R7027N8837k7137o6856m7107K537o217N6511K566
19384B5643j4006O247P0549M5624p8542m2017n5317j1756M5215l924k5389M74
19372c7199m9175J9180L3535K9775N0672K6649M4647M0289N1808j5599j00325
19361I4257p5953n7472l5485K9320o518K5878P689k8159L8183L8697J6533R288
19349E6258M0183m4529l7163j7249j4729Q749P8959M3665o6394p4165m8751l1968
19337a07134M9482N2117k5964J7055J1965O1554n1389j3655R909P23k4815K196
19325a7956n88K7893P8949J598m8901m9959j2810L9240q307J713J464j8724n534
$$ plain form
19312 -11922 21452 37101 48933 70795 117274 133703 66277 -5055 -73299 -47981 -40101 -11894
19300 -11894 44560 83344 103452 101765 116668 90363 59186 71867 85872 73394 58497 62430
19288 62430 23883 42560 57953 -8948 -33142 19723 16517 -591 -12822 15875 16775 34454
19276 34454 110599 127623 71684 70848 78023 62490 19228 33488 39881 49705 54136 27469 62119
19263 62119 59644 99825 135471 138409 132839 106183 63563 45967 93281 167917 143370 98047
19251 98047 87837 111385 135514 36816 13441 5272 5472 50448 51360 57067 74631 66170 43480
19238 43480 52106 16135 -19446 17211 13247 43499 111060 161644 154731 49133 45431 65522
19226 65522 52048 27895 29608 -13057 31004 72633 4096 17640 65714 112482 60399 39545
$$ packed form
19312a1922L3374J5649J1832K1862M6479J6429o7426p1332o8244K5318P880K8207
19300a1894N6454L8784K0108j687J4903k6305l1177J2681J4005j2478j4897L933
19288F2430l8547J8677J5393o6901k4194N2865l206j7108j2231K8697R00J7679
19276C4454P6145J7024n5939q36P175j5533m3262J4260O393R824M431k6667L4650
19263F2119k475M0181L5646K938n570k6656m2620j7596M7314P4636k4547m5323
19251I8047j0210K3548K4129r8698k3375q169K00M4976R12N707J7564q461k2690
19238D3480Q626l5971l5581L6657l964L0252O7561N0584o913j05598l702K0091
19226F5522j3474k4153J713m2665M4061M1629o8537J3544M8074M6768n2083k0854
$$ plain form
19214 39545 76878 71618 71400 96721 119743 93283 82077 93691 125432 126707 133350 145529 155074
19201 155074 69892 -1588 43429 163436 231160 254958 233139 242459 321745 376068 426049
19190 426049 460615 515053 543647 522083 535024 524103 519556 517249 472224 404898 397525 313567
19178 313567 290093 258227 161236 119966 117254 168767 167135 159737 191312 185315 110978 37850
19166 37850 58006 106941 107706 67506 95144 90644 44339 45259 60228 121671 121542 80112 49664
19153 49664 77828 82756 108270 110413 172612 190246 203388 257392 329199 374558 442380 451664
19141 451664 453778 516752 582096 620887 658385 668385 699578 717879 731361 679973 618028 655289
19129 655289 612157 538030 463478 394072 358680 329568 307519 335836 374491 350426 362174
$$ packed form
19214C9545L7333n260k18K5321K3022k6460j1206J1614L1741J275O643J2179R545
19201A55074q5182p1480M5017J20007O7724K3798k1819R320P9286N4323M9981
19190D26049L4566N4438K8594k1564J2941j0921m547k307m5025o7326p373q3958
19178C13567k3474l1866r6991m1270k712N1513j632p398L1575n997p4337p3128
19166C7850K0156M8935P65m0200K7638m500m6305R20J4969O1443j29m1430l0448
19153D9664K8164M928K5514K143O2199J7634J3142N4004P1807M5359O7822R284
19141D51664K114O2974O5344L8791L7498J0000L1193J8301J3482n1388o1945L7261
19129F55289m3132p4127p4552o9406l5392k9112k2049K8317L8655k4065J1748
$$ plain form
19118 362174 353303 258080 214569 187232 182351 194477 263796 270208 227277 162714 161046 220604
19106 220604 199525 198194 157688 83136 79991 121122 167668 202239 194811 171596 208255 257013
19094 257013 269376 261757 209377 256263 334077 376871 381970 348379 316534 341657 373639 412011
19082 412011 430820 470197 515837 496334 401332 284007 250912 228344 233824 289685 219369
19071 219369 141368 185292 216623 196120 198690 174312 172374 177420 167965 171823 129641 121191 173338
19058 173338 247558 275922 264686 222069 159248 168584 119622 151853 137519 81049 84691 56217
19046 56217 -4900 9543 41270 94489 96319 98397 107051 74717 63449 31367 37670 79979
19034 79979 102526 94157 91071 96393 94230 61942 11100 87996 169235 169174 158596 192591 180123
$$ packed form
19118C62174q871r5223m3511k7337m881J2126O9319O412m2931o4563j668N9558
19106B20604k1079j331m0506p4552l145M1131M6546L4571p428k3215L6659M8758
19094B57013J2363p619n2380M6886P7814M2794N099l3591l1845K5123L1982L8372
19082D12011J8809L9377M5640j9503r5002j17325l3095k2568N480N5861p0316
19071B19369p8001M3924L1331k0503K570k4378j938N046r455L858m2182q450N2147
19058A73338P4220K8364j1236m2617o2821R336m8962L2231j4334n6470L642k8474
19046E6217o1117J4443L1727N3219J830K078Q654l2334j1268l2082O303M2309
19034G9979K2547q369l086N322k163l2288n0842P6896Q1239o1j0578L3995j2468
$$ plain form
19021 180123 161598 126329 102891 138596 108622 94504 107883 128087 143983 136068 118545 59992
19009 59992 74206 64007 63602 131521 126242 119950 34103 49494 105642 103535 101214 108517 157168
18996 157168 69109 82106 137357 109799 118743 126419 132554 122886 160673 206375 173642 171759
18984 171759 149980 157041 117133 119379 136989 130351 137645 116308 127806 155582 172581 160064
18972 160064 43221 -12267 1596 23617 -13689 -24304 17426 56260 63196 46704 50192 46361
18960 46361 23638 74556 101556 98032 41206 -25012 -27469 -7721 19342 53829 36239 63591
18948 63591 118896 116351 133113 138270 144094 140463 98327 80124 128102 171494 233030 166427
18936 166427 121922 99046 140245 144716 142623 122525 97561 89468 51968 26766 37406 88813
$$ packed form
19021A80123j8525l5269k3438L5705k9974j4118J3379K0204J5896p915j7523n8553
19009E9992J4214j0199m05O7919n279o292q5847J5391N6148k107k321P303M8651
18996A57168q8059J2997N5251k7558Q944P676O135r668L7787M5702l2733j883
18984A71759k1779P061l9908K246J7610o638P294k1337J1498K7776J6999j2517
18972A60064j16843n5488J3863K2021l7306j0615M1730L8834O936j6492L488l831
18960D6361k2723N0918K7000l524n6826o6218k457J9748K7063L4487j7590K7352
18948F3591N5305k545J6762N157N824l631m2136j8203M7978M3392O1536o6603
18936A66427m4505k2876M1199M471k093k0098k4964q093l7500k5202J0640N1407
$$ plain form
18924 88813 72051 108160 93707 41649 62597 18973 -40388 20730 80078 159313 150491 146946
18912 146946 178923 171615 170072 187578 191429 125986 171858 169345 171479 180676 192005 135548 139270
18899 139270 157153 139972 131631 151283 169958 134832 66315 45518 14604 13603 79302 121406
18887 121406 105857 22407 -14221 6681 148937 261550 304611 324707 313435 281886 280871
18876 280871 299482 278820 253228 251143 235951 228507 136692 49350 84459 141964 207571 290866
18864 290866 295542 287734 262170 225339 193431 173486 175387 212623 216278 213986 208173 222925 262743
18851 262743 254474 177637 122568 145131 165983 202316 209067 193301 153216 87999 122163 152439
18839 152439 220062 249973 299273 326641 361114 368787 259358 166156 126326 168266 228881
$$ packed form
18924H8813j6762L6109j4453n2058K0948m3624n9361O1118N9348P9235q822l545
18912A46946L1977p308j543J7506L851o5443M5872k513K134R197J1329n6457L722
18899A39270J7883j7181q341J9652J8675l5126o8517k0797l0914j001O5699M2104
18887A21406j5549q3450l6628K0902J42256J12613M3061K0096j1272l1549j015
18876B80871J8611k0662k5592k085j5192p444r1815q7342L5109N7505O5607Q3295
18864B90866M676p808k5564l6831l1908j9945J901L7236L655k292n813J4752L9818
18851B62743q269p6837n5069K2563K0852L6333O751j5766m0085o5217L4164L0276
18839A52439O7623K9911M9300K7368L4473P673j09429r3202l9830M1940O0615
$$ plain form
18828 228881 278109 279125 228521 226116 217387 238044 328388 322080 251104 211866 284913 325307
18816 325307 259190 225240 234187 224672 237232 245337 300571 367379 450575 488732 473329 430132
18804 430132 452759 443430 458285 496950 525266 542429 575443 623899 597255 612228 639560 623239
18792 623239 582997 589272 562487 482286 489114 477740 438830 446875 455200 421016 429056 452725
18780 452725 435891 379574 361715 391355 391908 391091 458186 442234 533095 657710 696325 748885
18768 748885 779660 849956 878298 829214 743063 693506 736542 825989 851440 906573 997272
18757 997272 1050789 1045058 1001570 967374 1054107 1080523 1153309 1206874 1249517 1309911 1348078 1358018
18745 1358018 1312382 1192062 1065940 1012030 985832 998751 975871 911254 908125 897701 828594
$$ packed form
18828B28881M9228J016n0604k405q729K0657R0344o308p0976l9238P3047M0394
18816C25307o6117l3950Q947r515J2560Q105N5234O6808Q3196L8157j5403m3197
18804D30132K2627r329J4855L8665K8316J7163L3014M8456k6644J4973K7332j6321
18792F23239m0242O275k6785q0201O828j1374l8910Q045Q325l4184Q040K3669
18780D52725j6834n6317j7859K9640N53q17O7095j5952R0861J24615L8615N2560
18768G48885L0775P0296K8342m9084q6151m9557M3036Q9447K5451N5133R0699
18757I97272N3517n731m3488l4196Q6733K6416P2786N3565M2643O0394L8167R940
18745A358018m5636j20320j26122n3910k6198J2919k2880o4617l129j0424o9107
$$ plain form
18734 828594 840987 832678 787050 717528 725331 719686 760234 785359 844674 834515 818707 802413
18722 802413 781161 799135 831769 922721 1026420 1058002 1032167 1048482 1227788 1345858 1454786
18711 1454786 1518012 1567991 1642446 1725351 1779753 1740920 1768106 1810597 1885666 1940695 1964049
18700 1964049 2046297 2141061 2193268 2220487 2169522 2292274 2434527 2510503 2643397 2754089
18690 2754089 2846750 2938896 3039464 3109282 3238612 3439585 3673224 3915866 4166179 4570257
18680 4570257 5166594 5955614 7054782 8727202 11182317 14766468 19460375 25183089
18672 25183089 31459071 38062935 44787563 51218402 56767501 60509564 62154018 61776320
18664 61776320 60131796 58938847 59187617 60536816 61541694 60488554 56694774 50469246
$$ packed form
18734H28594J2393q309m5628o9522P803n645M0548K5125N9315j0159j5808j6294
18722H02413k1252J7974L2634R0952J03699L1582k5835J6315J79306J18070J08928
18711A454786O3226M9979P4455Q2905N4402l8833K7186M2491P5069N5029K3354
18700A964049Q2248R4764N2207K7219n0965J22752J42253P5976J32894J10692
18690B754089R2661R2146J00568O9818J29330K00973K33639K42642K50313M04078
18680D570257N96337P89020J099168J672420K455115L584151M693907N722714
18672B5183089O275982O603864O724628O430839N549099L742063J644454l77698
18664F1776320j644524j192949K48770J349199J004878j053140l793780o225528
$$ plain form
18656 50469246 42196305 33932787 27099521 22160606 18800718 16592501 15117286 14059545
18648 14059545 13359791 12854627 12556893 12379731 12317036 12370906 12589076 12978124 13570370 14463732
18638 14463732 15774062 17584436 19798731 22409859 25716971 29799917 34120538 37824173
18630 37824173 41193920 44624428 48394918 52672811 56615757 61021355 66136965 72393357
18622 72393357 81092645 90913266 99837440 107239114 113676812 120146258 124937739 122662951
18614 122662951 113969215 106298040 102293853 100575115 98933011 95009843 87803076 77525987
18606 77525987 65109244 53158014 43437747 36293477 31408060 28091951 25682733 23983923
18598 23983923 22756505 21791182 21063188 20460840 20139011 20041695 20231643 20849335 21994001
$$ packed form
18656E0469246q272941q263518o833266m938915l359888k208217j475215j057741
18648A4059545o99754n05164k97734j77162o2695N3870K18170L89048N92246Q93362
18638A4463732J310330J810374K214295K611128L307112M082946M320621L703635
18630C7824173L369747L430508L770490M277893L942946M405598N115610O256392
18622G2393357Q699288R820621Q924174P401674O437698O469446M791481k274788
18614A22662951q693736p671175m004187j718738j642104l923168p206767j0277089
18606G7525987j2416743j1951230r720267p144270m885417l316109k409218j698810
18598B3983923j227418r65323p27994o02348l21829r7316J89948O17692J144666
$$ plain form
18589 21994001 23682006 25737150 28263924 31521512 35749211 40732140 45310473 49115587
18581 49115587 52712298 56048574 59424543 62054735 63211296 63794996 63220737 62742350
18573 62742350 63599700 64714620 64996097 64201027 63054868 62550015 62176685 60069230 56697578
18564 56697578 52169748 46728691 41881629 37419430 33140320 28819639 24550720 21131443
18556 21131443 18710584 16959685 15565796 14528809 13743050 13076422 12418504 11901000 11440882
18547 11440882 11026704 10616483 10266014 9894674 9501770 9184261 8894082 8544552 8235163
18538 8235163 7969775 7683161 7421023 7112271 6824815 6523356 6222675 5963388 5711090
18529 5711090 5551864 5411135 5266435 5111954 5000306 4894615 4745366 4659062 4546988 4486619
$$ packed form
18589B1994001J688005K055144K526774L257588M227699M982929M578333L805114
18581D9115587L596711L336276L375969K630192J156561N83700n74259m78387
18573F2742350Q57350J114920K81477p95070j146159n04853l73330k107455l371652
18564E6697578m527830n441057m847062m462199m279110m320681m268919l419277
18556B1131443k420859j750899j393889j036987p85759o66628o57918n17504m60118
18547A1440882m14178m10221l50469l71340l92904l17509k90179l49530l09389
18538H235163k65388k86614k62138l08752k87456l01459l00681k59287k52298
18529E711090j59226j40729j44700j54481j11648j05691j49249q6304j12074o0369
$$ plain form
18519 4486619 4353138 4188456 4043647 3952969 3867928 3799431 3726228 3587573 3477992 3371555
18509 3371555 3326588 3327471 3278384 3187751 3070862 2998774 2906721 2836267 2779248 2723283 2661332
18498 2661332 2560030 2411664 2326570 2288519 2165647 2046595 1976764 1957921 1907084 1875248
18488 1875248 1864934 1790563 1757338 1668847 1560820 1523871 1528432 1545076 1508720 1470967 1398112
18477 1398112 1352313 1310863 1343400 1351139 1366189 1340947 1351199 1386297 1377317 1348332 1314269 1287914
18465 1287914 1294177 1322868 1379993 1330879 1246320 1185264 1174511 1175143 1166379 1101217 1110243 1110606 1091411
18452 1091411 1102823 1096197 1033132 1066820 1038527 955929 906111 882193 873391 837201 866713 897499
18440 897499 870086 819530 775846 721819 666099 635688 647264 645383 712558 747318 727316 752393
$$ packed form
18519D486619j33481j64682j44809r0678q5041o8497p3203j38655j09581j06437
18509C371555m4967Q83m9087r0633j16889p2088r2053p0454n7019n5965o1951
18498B661332j01302j48366q5094l8051j22872j19052o9831j8843n0837l1836
18488A875248j0314p4371l3225q8491j08027l6949M561J6644l6356l7753p2855
18477A398112m5799m1450L2537P739J5050k5242J0252L5098q980k8985l4063k6355
18465A287914O263K8691N7125m9114q4559o1056j0753O32q764o5162R026L63j9195
18452A091411J1412o626o3065L3688k8293q2598m9818k3918q802l6190K9512L0786
18440H97499k7413n0556m3684n4027n5720l0411J1576j881O7175L4760k0002K5077
$$ plain form
18428 752393 707464 698571 680437 694578 720246 699367 653786 626438 689778 720770 743289 714039
18416 714039 672611 670979 708025 630778 615244 623518 590322 597300 654833 688310 766394 792970
18404 792970 750592 718079 694679 685333 690136 739375 741495 685096 727821 741516 769230 831351
18392 831351 776842 713848 686307 720279 748334 795108 854062 825637 763006 789303 763445
18381 763445 719804 811945 883894 923787 895882 875333 849408 890535 860961 823899 828012 889993
18369 889993 933285 953202 895961 901606 899636 854130 826705 864612 887826 918859 935609 873920
18357 873920 837777 860992 868198 850907 867905 874495 932221 952617 949277 963969 1004919 1036034
18345 1036034 1049582 1063834 1076703 1036004 1035062 1067514 1076365 1055782 1074999 1122255 1196719 1264256
$$ packed form
18428G52393m4929q893j8134J4141K5668k0879m5581k7348O3340L0992K2519k9250
18416G14039m1428j632L7046p7247j5534Q274l3196O978N7533L3477P8084K6576
18404G92970m2378l2513k3400r346M803M9239K120n6399M2725J3695K7714O2121
18392H31351n4509o2994k7541L3972K8055M6774N8954k8425o2631K6297k5858
18381G63445m3641R2141P1949L9893k7905k0549k5925M1127k9574l7062M113O1981
18369H89993M3292J9917n7241N645j970m5506k7425L7907K3214L1033J6750o1689
18357H73920l6143K3215P206j7291J6998O590N7726K0396l340J4692M0950L1115
18345A036034J3548J4252J2869m0699r42L2452Q851k0583J9217M7256P4464O7537
$$ plain form
18333 1264256 1269455 1273804 1344067 1390048 1277936 1242583 1313923 1420165 1449965 1441053 1475957
18322 1475957 1532730 1562160 1612436 1671658 1747293 1798623 1794971 1847971 1913123 1990000 2028622
18311 2028622 2022615 2091789 2211151 2351607 2438349 2536749 2726985 2867127 2990607 3271547
18301 3271547 3716042 4276206 5074637 6267615 7989736 10257891 13085384 16258077 19637588
18292 19637588 23129987 26546407 29479058 31899407 33259058 33072571 32656742 32320657
18284 32320657 32201462 32626845 33130558 33066860 31902095 28805863 25137702 21621203 18501765
18275 18501765 16239810 14739005 13871040 13471886 13330440 13008933 12304001 11660656 11398015
18266 11398015 11414687 11714453 12325741 13295004 14816768 17012977 20304474 25188134 31703635
$$ packed form
18333A264256N199M349P0263M5981j12112l5353P1340J06242K9800q912L4904
18322A475957N6773K9430N0276N9222P5635N1330l652N3000O5152P6877L8622
18311B028622o007O9174J19362J40456Q6742R8400J90236J40142J23480K80940
18301C271547M44495N60164P98431J192978J722121K268155K827493L172693L379511
18292A9637588L492399L416420K932651K420349J359651j86487m15829l36085
18284C2320657j19195M25383N03713o3698j164765l096232l668161l516499l119438
18275A8501765k261955j500805q67965l99154j41446l21507p04932o43345k62641
18266A1398015J6672K99766O11288R69263J521764K196209L291497M883660O515501
$$ plain form
18257 31703635 39038008 46188696 53039126 60387475 68514065 74957359 76798123 75861971
18249 75861971 73089661 71634541 73994637 78207566 81324694 83962993 87436094 91644414
18241 91644414 94056021 93378147 90687797 87744100 86175545 85883304 85478930 83906610
18233 83906610 80440474 74396192 66048423 56732930 48698843 42470398 37851923 34421060
18225 34421060 31729091 29732206 28586247 28102741 28308067 29203733 30989059 33809910
18217 33809910 37627630 42246845 47385641 52938980 59047083 66055540 73516211 79853172
18209 79853172 85098251 90049873 94771219 100165407 105928534 110270848 113725339 115926015
18201 115926015 117011894 118918327 120493008 121554049 124642037 130470232 136998362 139575144
$$ packed form
18257C1703635P334373P150688O850430P348349Q126590O443294J840764r36152
18249G5861971k772310j455120K360096M212929L117128K638299L473101M208320
18241I1644414K411607o77874k690350k943697j568555k92241m04374j572320
18233H3906610l466136o044282q347769r315493q034087o228445m618475l430863
18225C4421060k691969j996885j145959m83506K05326Q95666J785326K820851
18217C3809910L817720M619215N138796N553339O108103P008457P460671O336961
18209G9853172N245079M951622M721346N394188N763127M342314L454491K200676
18201A15926015J085879J906433J574681J061041L087988N828195O528130K576782
$$ plain form
18193 139575144 134503166 124724134 112229810 98760624 87311170 79655895 75177310
18186 75177310 72113807 69214164 65021668 59922676 55221147 50347161 44764009 39727560
18178 39727560 36145795 33891366 32671293 32407278 32950179 33913509 34962982 35874501 36956213
18169 36956213 38334768 39245154 38235553 35622768 33174183 31696899 31242224 32087325
18161 32087325 34486369 38259954 42866312 48408003 56183700 67078099 79365023 88818221
18153 88818221 93308071 96193064 100154693 102615226 99735131 90227207 73488592 56876917
18145 56876917 45108114 37323754 32099099 28628482 26418758 25175844 24546286 24203637
18137 24203637 23959838 23913431 24165083 24381855 23657359 21538802 19211089 17435279 16205678
$$ packed form
18193A39575144n071978r779032j2494324j3469186j1449454p655275m478585
18186G5177310l063503k899643m192496n098992m701529m873986n583152n036449
18178C9727560l581765k254429j220073k64015N42901R63330J049473R11519J081712
18169C6956213J378555R10386j009601k612785k448585j477284m54675Q45101
18161C2087325K399044L773585M606358N541691P775697J0894399J2286924R453198
18153H8818221M489850K884993L961629K460533k880095r507924j6738615j6611675
18145E6876917j1768803p784360n224655l470617k209724j242914o29558l42649
18137B4203637k43799m6407K51652K16772p24496k118557k327713j775810j229601
$$ plain form
18128 16205678 15350211 14695044 14234370 13920132 13652396 13347014 13128263 13068133 13130711 13382709
18118 13382709 13851181 14772104 16734372 20458593 26883119 35149171 41913471 45896435
18110 45896435 50311628 57934786 66860795 66019792 50496263 35761868 26772240 21405028
18102 21405028 17982940 15655151 14004753 12740258 11714889 10973394 10410257 10060436
18094 10060436 9727539 9367778 9053202 8785784 8574369 8413463 8239929 8073432 7838108
18085 7838108 7667741 7497103 7297949 7094869 6924449 6736475 6617633 6395729 6244798
18076 6244798 6165108 6065710 5991245 5915533 5897283 5940147 6138297 6370011 6752153 7290892
18066 7290892 8039085 9311480 11096690 13323822 15902651 19037950 22993194 27239107
$$ packed form
18128A6205678q55467o55167m60674l14238k67736l05382k18751o0130O2578K51998
18118A3382709M68472R20923J962268L724221O424526Q266052O764300L982964
18110D5896435M415193P623158Q926009q41003j5523529j4734395q989628n367212
18102B1405028l422088k327789j650398j264495j025369p41495n63137l49821
18094A0060436l32897l59761l14576k67418k11415j60906j73534j66497k35324
18085G838108j70367j70638j99154k03080j70420j87974j18842k21904j50931
18076F244798p9690r9398p4465p5712j8250M2864J98150K31714L82142N38739
18066G290892P48193J272395J785210K227132K578829L135299L955244M245913
$$ plain form
18058 27239107 30743740 33015365 34983371 37309658 38488208 37040815 35180608 34387338
18050 34387338 33935412 33709952 34549728 35922656 36451706 36109561 36055366 36205655 35097642
18041 35097642 31805031 28109961 24877887 21317823 17656918 14886525 13019557 11744475
18033 11744475 10770512 10057282 9611090 9306024 9050126 8812681 8614984 8475639 8408631
18024 8408631 8410156 8462334 8671643 8944769 9467024 10295563 11446882 13027429 15141150
18015 15141150 17816667 21409849 25971291 30897733 35518376 39768745 44184145 48609935
18007 48609935 51361374 51931683 52287184 52081337 50523202 49579228 50081869 50703519 50838210
17998 50838210 51514316 52913753 53370513 51542788 49227126 47181538 43259143 37245231
$$ packed form
18058B7239107L504633K271625J968006K326287J178550j447393j860207p93270
18050C4387338m51926k25460Q39776J372928N29050l42145n4195J50289j108013
18041C5097642l292611l695070l232074l560064l660905k770393j866968j275082
18033A1744475r73963p13230m46192l05066k55898k37445j97697j39345o7008
18024H408631J525N2178K09309K73126N22255Q28539J151319J580547K113721
18015A5141150K675517L593182M561442M926442M620643M250369M415400M425790
18007D8609935K751439N70309L55501k05847j558135r43974N02641O21650J34691
17998E0838210O76106J399437M56760j827725k315662k045588l922395o013912
$$ plain form
17990 37245231 31927995 27797981 23757881 19904530 17035370 15056365 13615134 12502905
17982 12502905 11675028 11066891 10478059 10017729 9639680 9314583 9102087 8974973 8914998
17973 8914998 8844031 8741119 8727149 8878930 9222039 9760986 10584258 11717040 13016658
17964 13016658 14778193 17002713 19402122 21268896 22326370 23296794 24581891 25027229
17956 25027229 23831319 22544249 22095912 21822560 21641954 22020816 22525328 22680543 22690344
17947 22690344 23007094 22937467 21169737 18492436 16377682 14596340 12568444 10623603
17939 10623603 9149996 8085514 7278726 6704694 6281645 5905321 5644109 5393926 5171240
17930 5171240 4967340 4799915 4683676 4566770 4415963 4223176 4031086 3904936 3838425 3732815
$$ packed form
17990C7245231n317236m130014m040100l853351k869160j979005j441231j112229
17982A2502905q27877o08137n88832m60330l78049l25097k12496j27114n9975
17973H914998p0967j02912j3970J51781L43109N38947Q23272J132782J299618
17964A3016658J761535K224520K399409J866774J057474R70424J285097M45338
17956B5027229j195910j287070m48337k73352j80606L78862N04512J55215R801
17947B2690344L16750o9627j767730k677301k114754j781342k027896j944841
17939A0623603j473607j064482q06788n74032m23049l76324k61212k50183k22686
17930E171240k03900j67425j16239j16906j50807j92787j92090j26150o6511j05610
$$ plain form
17920 3732815 3625902 3515391 3386149 3248541 3107068 2984594 2899606 2807615 2695292 2671420
17910 2671420 2550105 2418897 2383821 2308538 2211720 2142079 2149489 2106253 2033590 1951652 1910532
17899 1910532 1870820 1851667 1856833 1867374 1874014 1834422 1756837 1724295 1753282 1716337 1648685 1605692
17887 1605692 1618330 1625975 1643961 1632622 1558022 1548156 1604521 1615771 1490887 1356175 1358612
17876 1358612 1325339 1265373 1268135 1226831 1194798 1199983 1169129 1140310 1163497 1222958 1265496 1252416
17864 1252416 1253490 1250178 1260879 1278882 1292173 1316685 1323035 1324723 1334742 1257293 1266559 1242548
17852 1242548 1171910 1095628 1057108 1018326 980723 978685 1007650 1092788 1122708 1140279 1128250
17841 1128250 1129639 1093997 1047806 980044 974455 966925 1016889 1082388 1123710 1123891 1069970 981156
$$ packed form
17920C732815j06913j10511j29242j37608j41473j22474q4988r1991j12323k3872
17910B671420j21315j31208l5076p5283r6818o9641P410m3236p2663q1938m1120
17899A910532l9712j9153N166J0541O640l9592p7585l2542K8987l6945o7652m2993
17887A605692J2638P645J7986j1339p4600r866N6365J1250j24884j34712K437
17876A358612l3273n9966K762m1304l2033N185l0854k8819K3187N9461M2538j3080
17864A252416J074l312J0701J8003J3291K4512O350J688J0019p7449R266k4011
17852A242548p0638p6282l8520l8782l7603k038K8965Q5138K9920J7571j2029
17841A128250J389l5642m6191o7762n589p530M9964O5499M1322J81n3921q8814
$$ plain form
17829 981156 944843 842516 859076 894731 908765 948548 1016346 1054050 1074479 1064951 1067338 1140967
17817 1140967 1196091 1278917 1273274 1245384 1252926 1261017 1302772 1306707 1311641 1309790 1295532 1305125 1334723
17804 1334723 1327496 1307336 1330341 1371874 1327903 1286405 1291566 1289743 1305599 1261596 1282467 1264988
17792 1264988 1257991 1218087 1184883 1248643 1334898 1282889 1232777 1231967 1367230 1445114 1440124 1461901
17780 1461901 1538416 1596406 1630377 1619006 1572858 1592759 1686610 1807405 1874141 1959126 2094690
17769 2094690 2221040 2308434 2391784 2559347 2676764 2869270 3060865 3293719 3478841 3674365
17759 3674365 3894034 4182137 4428688 4746949 5101840 5618214 6215485 6926952 7911314
17750 7911314 9282904 11054647 12969056 14886195 16918626 19279969 22004105 24467980
$$ packed form
17829I81156l6313j02327J6560L5655J4034L9783O7798L7704K0429r528K387P3629
17817A140967N5124Q2826n643k7890P542Q091M1755L935M934j851j4258R593K9598
17804A334723p227k0160K3005M1533m3971m1498N161j823J5856m4003K0871j7479
17792A264988o997l9904l3204O3760Q6255n2009n0112q10J35263P7884m990K1777
17780A461901P6515N7990L3971j1371m6148J9901R3851J20795O6736Q4985J35564
17769B094690J26350Q7394Q3350J67563J17417J92506J91595K32854J85122J95524
17759C674365K19669K88103K46551L18261L54891N16374N97271P11467R84362
17750G911314J371590J771743J914409J917139K032431K361343K724136K463875
$$ plain form
17742 24467980 25908130 26636185 27869625 30439978 34894200 41716229 51371594 64633478
17734 64633478 82535715 104223850 127596293 151153490 174705759 197476473 214268397
17727 214268397 219430957 213673084 197072614 172685858 148195302 127597458 111190451
17720 111190451 99025992 90142827 82525773 75161452 69217549 65538372 63209748 61044490
17712 61044490 59159123 58157248 57822891 56512067 52713212 47241864 42105101 38276793
17704 38276793 35680875 34025697 32911278 32153909 31652214 31576151 32130892 33428379 35260756
17695 35260756 37289836 39900323 43897274 49957075 58531740 69368076 82762108 97669055
17687 97669055 111942491 125984693 142291907 159944721 170905437 167457623 154258573
$$ packed form
17742B4467980J440150P28055J233440K570353M454222O822029R655365J3261884
17734F4633478J7902237K1688135K3372443K3557197K3552269K2770714J6791924
17727B14268397N162560n757873j6600470k4386756k4490556k0597844j6407007
17720A11190451j2164459q883165p617054p364321n943903l679177k328624k165258
17712F1044490j885367j001875l34357j310824l798855n471348n136763l828308
17704C8276793k595918j655178j114419p57369n01695p6063N54741J297487J832377
17695C5260756K029080K610487L996951O059801Q574665J0836336J3394032J4906947
17687I7669055J4273436J4042202J6307214J7652814J0960716l447814j3199050
$$ plain form
17680 154258573 141934428 134400959 131000727 130375440 131026980 133831154 137751435 138690444
17672 138690444 134818316 126557838 117797395 112905254 111100644 106437166 94337269 78696368
17664 78696368 65545159 56473881 50556487 46407300 42695761 39028203 35967896 33799223
17656 33799223 32342846 31394470 30678874 30183283 30066350 30178341 30423399 30797512 31457224
17647 31457224 32204819 32850177 33721302 35519189 38404665 41136546 41554644 40388026 39224604
17638 39224604 38855802 39922445 42005688 42585607 39159617 34150875 30140756 27581977
17630 27581977 26308943 25698339 24465452 21733557 18711129 16441150 14917018 13773789
17622 13773789 12856198 12107628 11472430 10973251 10598067 10200450 9932519 9620013 9277465
$$ packed form
17680A54258573j2324145p533469l400232o25287O51540K804174L920281R39009
17672A38690444l872128q260478q760443m892141j804610m663478j2099897j5640901
17664G8696368j3151209r071278n917394m149187l711539l667558l060307k168673
17656C3799223j456377r48376p15596m95591j16933J11991K45058L74113O59712
17647C1457224P47595O45358Q71125J797887K885476K731881M18098j166618j163422
17638C9224604l68802J066643K083243N79919l425990n008742m010119k558779
17630B7581977j273034o10604j232887k731895l022428k269979j524132j143229
17622A3773789r17591p48570o35198m99179l75184l97617k67931l12506l42548
$$ plain form
17613 9277465 8996397 8713162 8472584 8226335 8019346 7756624 7455847 7135424 6877595
17604 6877595 6682071 6429050 6195737 5932598 5673425 5465718 5250499 5011136 4803035
17595 4803035 4686751 4628838 4476889 4351812 4252824 4124765 3998348 3912039 3786791 3665711
17585 3665711 3567914 3477339 3416667 3296083 3181471 3061646 3041931 3012247 2943247 2881660 2763730
17574 2763730 2694599 2619330 2551514 2493645 2473915 2375388 2288590 2145464 2111370 2143571 2108206
17563 2108206 2035627 1958954 1917505 1914662 1899779 1872402 1809340 1730574 1710078 1616564 1553779
17552 1553779 1524813 1451637 1388996 1304204 1296991 1318923 1348516 1328339 1282332 1240190 1171130
17541 1171130 1199388 1227266 1127784 1020099 1003173 1046225 1039633 987567 943390 855272 844553
$$ packed form
17613I277465k81068k83235k40578k46249k06989k62722l00777l20423k57829
17604F877595j95524k53021k33313k63139k59173k07707k15219k39363k08101
17595D803035j16284n7913j51949j25077r8988j28059j26417q6309j25248j21080
17585C665711r7797r0575o0672j20584j14612j19825j9715k9684o9000o1587j17930
17574B763730o9131p5269o7816n7869j9730r8527q6798j43126l4094L2201l5365
17563B108206p2579p6673m1449k843j4883k7377o3062p8766k0496r3514o2785
17552A553779k8966p3176o2641q4792p213K1932K9593k0177m6007m2142o9060
17541A171130K8258K7878r9482j07685j6926M3052o592n2066m4177q8118j0719
$$ plain form
17530 844553 790193 842262 852308 772715 756346 743128 812466 844703 775528 740057 754661
17519 754661 775700 738291 741467 682694 679546 618298 563929 578304 627329 658152 584118 562308
17507 562308 579727 565294 584303 550225 561408 586058 559552 573021 594305 638555 673638
17496 673638 693223 702346 731099 736990 692608 679044 676111 694555 697765 655338 642849 606917
17484 606917 595872 595646 560301 588100 560994 600198 655911 626287 564195 474573 405252 435985
17472 435985 480337 456555 422941 455167 482192 386302 325876 346211 408747 433461 420324
17461 420324 376001 362506 318964 259718 246912 265031 286905 295495 288483 323116 340649 354261
17449 354261 376821 465888 533594 566035 595405 585659 633269 718312 735009 675034 493022
$$ packed form
17530H44553n4360N2069J0046p9593j6369j3218O9338L2237o9175l5471J4604
17519G54661K1039l7409L176n8773l148o1248n4369J4375M9025L0823p4034k1810
17507E62308J7419j4433J9009l4078J1183K4650k6506J3469K1284M4250L5083
17496F73638J9585R123K8753N891m4382j3564k933J8444L210m2427j2489l5932
17484F06917j1045k26l5345K7799k7106L9204N5713k9624o2092q9622o9321L0733
17472D35985M4352k3782l3614L2226K7025r5890o0426K0335O2536K4714j3137
17461D20324m4323j3495m3542n9246j2806J8119K1874Q590p012L4633J7533J3612
17449C54261K2560Q9067O7706L2441K9370r746M7610Q5043J6697n9975j82012
$$ plain form
17438 493022 443528 367812 382190 459742 482872 446942 370513 345686 324441 322705 324948 289877
17426 289877 253740 338690 421362 390245 388561 397803 373641 367272 327393 244980 205863 145355
17414 145355 105012 150035 190787 319148 318089 178388 151086 228420 286550 250089 224407
17403 224407 190916 159298 142056 204836 186641 129951 76047 60055 97821 118504 123032 117666
17391 117666 87342 93056 124988 156190 119557 87551 90570 96112 122863 189868 158656 116188
17379 116188 89925 90250 54174 86594 74464 26210 65951 58158 -8344 15639 31391 51214
17367 51214 105528 114262 79984 132180 130540 80438 26119 47968 51329 27746 41770 31275
17355 31275 97439 146504 106553 122295 116867 80853 20884 56601 93886 149468 119123 122542
$$ packed form
17438D93022m9494p5716J4378P7552K3130l5930p6429k4827k1245j736K243l5071
17426B89877l6137Q4950Q2672l1117j684R242k4162o369l9879q2413l9117o0508
17414A45355m0343M5023M0752J28361j059j39701k7302P7334N8130l6461k5682
17403B24407l3491l1618j7242O2780j8195n6690n3904j5992L7766K0683M528n366
17391A17666l0324N714L1932L1202l6633l2006L019N542K6751O7005l1212m2468
17379A16188k6263L25l6076L2420j2130m8254L9741p793o6502K3983J5752J9823
17367E1214N4314Q734l4278N2196j640n0102n4319K1849L361k3583J4024j0495
17355C1275O6164M9065l9951J5742n428l6014n9969L5717L7285N5582l0345L419
$$ plain form
17343 122542 131173 114033 100203 93353 30764 26296 29770 85077 151211 167870 104665 42576
17331 42576 -3608 77535 168973 145061 62489 81514 74381 46824 48514 6090 33850 34439
17319 34439 60059 125615 130272 99561 62926 75678 107074 96341 71010 63730 7100 -12333
17307 -12333 3182 -22005 -18182 -11767 21082 35242 19537 -6263 -8432 -20025 -49536 -1367
17295 -1367 64645 60172 10210 -18325 -55806 -27982 -27958 -30006 -39583 -21899 32662 60987 53261
17282 53261 72303 85166 73531 57559 24119 2971 10022 47617 80373 47414 -18051 -46995
17270 -46995 -23909 -12334 -28736 -64218 -107143 -80875 26399 38460 -38579 -49363 -5135
17259 -5135 49022 40383 38458 10389 -37388 -22411 -14339 8138 -37058 -74511 6754 75000
$$ packed form
17343A22542Q631j7140j3830o850o2589m468L474N5307O6134J6659o3205o2089
17331D2576m6184Q1143R1438k3912q2572J9025p133k7557J690m2424K7760N89
17319C4439K5620O5556M657l0711l6635J2752L1396j0733k5331p280n6630j9433
17307a2333J5515k5187L823O415L2849J4160j5705k5800k169j1593k9511M8169
17295a367O6012m473m9962k8535l7481K7824K4k048r577J7684N4561K8325p726
17282E3261J9042J2863j1635j5972l3440k1148P051L7595L2756l2959o5465k8944
17270d6995K3086J1575j6402l5482m2925K6268J07274J2061p7039j0784M4228
17259e135N4157q639j925k8069m7777J4977Q072K2477m5196l7453Q1265O8246
$$ plain form
17247 75000 55505 25099 -31578 -42055 -23065 35273 53012 46369 26808 115785 213883 243253
17235 243253 268081 406763 443005 500854 508302 495261 502131 432409 439310 510279 631376 711625
17223 711625 714122 659767 642312 683328 713188 722625 749619 722338 699120 715775 685403 614619
17211 614619 555206 505443 565228 522328 485448 433470 378727 327996 264329 231026 209109
17200 209109 174824 42941 83091 172655 203559 302232 320216 291128 193015 114771 87826
17189 87826 104276 206071 306118 305469 296460 330827 369562 502456 638952 637764 689164 741811
17177 741811 792201 850200 853612 765170 763737 816742 773786 738854 666869 650022 661184 618621
17165 618621 542536 499763 499536 570247 601891 666756 676319 637436 578515 562611 487598 506517
$$ packed form
17247G5000j9495l0406n6677j0477J8990N8338J7739o643j9561Q8977R8098K9370
17235B43253K4828J38682L6242N7849P448j3041O870o9722O901P0969J21097Q0249
17223G11625K497n4355j7455M1016K9860R437K6994k7281k3218J6655l0372p0784
17211F14619n9413m9763N9785m2900l6880n1978n4743n0731o3667l3303k1917
17200B09109l4285j31883M0150Q9564L0904R8673J7984k9088r8113p8244k6945
17189H7826J6450J01795J00047o49r009L4367L8735J32894J36496j188N1400N2647
17177G41811N0390N7999L412q8442j433N3005m2956l4932p1985j6847J1162m2563
17165F18621p6085m2773k27P0711L1644O4865R563l8883n8921j5904p5013J8919
$$ plain form
17153 506517 517909 508646 411340 333633 294654 257602 232056 232656 189230 126053 121654 124582
17141 124582 114725 115045 136392 138303 138516 150869 194487 242707 206227 220273 200137 141472 137460
17128 137460 110050 134701 132584 89050 88010 136740 154332 175566 187079 197861 146743 103496
17116 103496 111178 103789 106752 95787 47822 -38404 -48827 -29768 -9756 73290 96664 78151
17104 78151 39574 22005 63418 74446 78650 13285 35618 50679 41274 59345 54083 78614
17092 78614 102441 110346 142003 90163 33233 55848 -13876 -67825 -20635 3317 -30622 34464
17080 34464 63041 73269 53724 5592 11477 44722 89014 53570 21955 54810 23247 32146
17068 32146 59345 63542 63520 56188 61593 40825 51989 101138 124293 114641 92200 30410 -42940
$$ packed form
17153E06517J1392r263r7306p7707l8979l7052k5546O00m3426o3177m399K928
17141A24582r857L20K1347J911K13J2353M3618M8220l6480J4046k0136n8665m012
17128A37460k7410K4651k117m3534j040M8730J7592K1234J1513J0782n1118m3247
17116A03496P682p389K963j0965m7965q6226j0423J9059K0012Q3046K3374j8513
17104G8151l8577j7569M1413J1028M204o5365K2333J5061r405J8071n262K4531
17092G8614K3827P905L1657n1840n6930K2615o9724n3949M7190K3952l3939O5086
17080C4464K8577J0228j9545m8132N885L3245M4292l5444l1615L2855l1563Q899
17068C2146K7199M197k2p332N405k0768J1164M9149K3155r652k2441o1790p3350
$$ plain form
17055 -42940 -33910 29096 18200 18645 19325 17133 11215 7331 -57456 -44081 13432 -10300 -33794
17042 -33794 6638 -900 56925 45677 -8335 2135 -6291 30248 48735 8252 -7054 -2974
17030 -2974 -23916 -34352 -19998 -38496 -10190 35237 58517 82202 88763 60752 53359 1175
17018 1175 -39871 -38129 -49037 -7506 23968 607 3422 43710 53778 31620 33096 55355
17006 55355 90476 63018 -36075 -48347 3986 -18838 31638 14735 -49467 -39560 -2315 31066
16994 31066 1316 -50870 -6034 47389 -20862 -66994 -37578 47663 51435 30774 33248 9369
16982 9369 -4101 -15852 16370 78502 77790 75742 67899 66366 87060 126868 119422 61393 79659
16969 79659 34894 15589 -3528 -13678 31896 30475 34056 -34999 -148209 -185220 -184880 -97609
$$ packed form
17055d2940R030O3006j0896M45O80k192n918l884o4787J3375N7513k3732k3494
17042c3794M0432p538N7825j1248n4012J0470q426L6539J8487m0483j5306M080
17030b974k0942j0436J4354j8498K8306M5427K3280K3685O561k8011p393n2184
17018A175m1046J742j0908M1531L1474k3361K815M0288J0068k2158J476K2259
17006E5355L5121k7458r9093j2272N2333k2824N0476j6903o4202R907L7245L3381
16994C1066k9750n2186M4836N3423o8251m6132K9416Q5241L772k0661K474k3879
16982I369j3470j1751L2222O2132p12k048p843j533K0694L9808p446n8029J8266
16969G9659m4765j9305j9117j0150M5574j421L581o9055j13210l7011L40Q7271
$$ plain form
16957 -97609 -90610 -109092 -67424 -14505 -33285 -56195 -21233 -20653 -10176 -27012 -50761 -62670
16945 -62670 -62038 -52827 -51507 -10095 23405 -32498 -23943 9867 -18694 298 -29837 -72193 -17854
16932 -17854 25302 -35882 -56543 -33788 -32964 -21310 -46392 -23513 -75175 -47412 -58280 -81001
16920 -81001 -44368 -36831 -8409 15752 36609 8336 -39928 10527 28651 35502 45265 4306
16908 4306 8392 28099 35557 6130 -3518 11242 55658 60041 62575 23590 13145 42723 24209
16895 24209 25963 18212 25577 64716 75541 3660 -75357 -109562 -128681 -74343 2355 161
16883 161 -25736 -28448 -18496 -25386 -31352 -50644 -2245 -6306 45227 97250 89216 76221 100609
16870 100609 93177 69422 45153 25923 56629 44647 79625 68340 36441 -20431 -36651 -11668
$$ packed form
16957i7609O999j8482M1668N2919j8780k2910L4962N80J0477j6836k3749j1909
16945f2670O32R211J320M1412L3500n5903Q555L3810k8561J8992l0135m2356N4339
16932a7854M3156o1184k0661K2755Q24J1654k5082K2879n1662K7763j0868k2721
16920h1001L6633P537K8422K4161K0857k8273m8264N0455J8124O851R763m0959
16908D306M086J9707P458k9427r648J4760M4416M383K534l8985j0445K9578j8514
16895B4209J754p751P365L9139J0825p1881p9017l4205j9119N4338P6698k194
16883A61k5897k712R952o890n966j9292M8399m061N1533N2023q034j2995K4388
16870A00609p432k3755k4269j9230L0706j1982L4978j1285l1899n6872j6220K4983
$$ plain form
16858 -11668 70746 81214 69526 23659 891 -22700 -14129 -61591 -75226 -3425 13087 7345
16846 7345 11794 91389 56565 64433 21635 -35950 20941 70310 36611 11265 -31113 -82500
16834 -82500 -77727 -88961 -164723 -174550 -73048 43866 112002 110756 57498 11540 13701 10275
16822 10275 -36042 -24214 -34345 -45378 5816 -60161 -101625 -70032 -49869 -6374 68048 23250
16810 23250 -15589 -65660 -71523 -50418 -67442 -50118 16786 11466 -14333 -11316 15267 -12702
16798 -12702 -38693 -16542 -52722 -21245 -22292 -27573 -70061 -34584 -27051 -59936 -69683 -27394
16786 -27394 -653 -6031 -88692 -44353 -38836 -76770 -37267 -14505 21391 16591 -14951 20806
16774 20806 28890 -25905 -44245 -141808 -149208 -176551 -157442 -107051 -108823 -37669 29028 41794
$$ packed form
16858a1668Q2414J0468j1688m5867k2768k3591Q571m7462j3635P1801J6512n742
16846G345M449P9595l4824P868m2798n7585N6891M9369l3699k5346m2378n1387
16834h2500M773j1234p5762r827J01502J16914O8136j246n3258m5958K161l426
16822A0275m6317J1828j0131j1033N1194o5977m1464L1593K0163M3495P4422m4798
16810B3250l8839n0071n863K1105j7024J7324O6904n320k5799L017K6583k7969
16798a2702k5991K2151l6180L1477j047n281m2488L5477P533l2885r747M2289
16786b7394K6741n378q2661M4339N517l7934L9503K2762L5896m800l1542L5757
16774B0806Q084n4795j8340r7563p400k7343J9109N0391j772P1154O6697J2766
$$ plain form
16762 41794 9754 -13878 -46732 -117101 -126407 -93828 -73864 -94559 -80763 -66333 2297 73358
16750 73358 57199 -25844 -21952 -25990 482 -44856 -129962 -178279 -145073 -100142 -57710 -22349
16738 -22349 -4723 -45404 -29059 -19409 29449 59764 64803 46220 12418 28682 7253 -21388
16726 -21388 -15152 -19663 -66361 -45235 -10588 -4529 -32869 4833 60909 52204 -44954 -55440
16714 -55440 -70017 -36565 -5251 47670 56253 -30918 -26048 21448 3547 -17615 41471 26645
16702 26645 5304 -14554 -35397 -14602 6692 7873 -14596 -6234 -28239 -37263 -26420 -54998
16690 -54998 -73645 -13153 2832 -24587 -7904 59007 44873 6664 9046 -1369 -64516 -18032
16678 -18032 23003 33472 10059 -67847 -95067 -63128 -59086 -15988 -5816 -19428 -20788 6218
$$ packed form
16762D1794l2040k3632l2854p0369r306L2579J9964k0695J3796J4430O8630P1061
16750G3358j6159q3043L892m038K6472m5338q5106m8317L3206M4931M2432L5361
16738b2349J7626m0681J6345R650M8858L0315N039j8583l3802J6264k1429k8641
16726b1388O236m511m6698K1126L4647O059k8340L7702N6076q705r7158j0486
16714e5440j4577L3452L1314N2921Q583q7171M870M7496j7901k1162N9086j4826
16702B6645k1341j9858k0843K0795K1294J181k2469Q362k2005r024J0843k8578
16690e4998j8647O0492J5985k7419J6683O6911j4134l8209K382j0415o3147M6484
16678a8032M1035J0469k3413p7906k7220L1939M042M3098J0172j3612j360K7006
$$ plain form
16666 6218 -35884 -67151 -29373 -36229 -104438 -74981 -40224 -10587 682 7616 48180 65519
16654 65519 78370 65015 32667 -736 5478 32240 53874 26665 16525 -40064 -33269 -2659
16642 -2659 -36544 -75115 -83485 -72392 -90085 -73746 -56530 -76078 -106188 -32858 2407 -30473
16630 -30473 -37661 20608 66294 72992 109304 80065 -10370 -17834 -12854 -50066 -12376 30968
16618 30968 -66267 -136763 -114824 -101600 -58310 -68941 -92989 -90321 -80540 -43112 -16662 13358
16606 13358 -30714 -76032 -67909 14486 40535 46241 -26809 -22503 -2402 4875 21052 -53390
16594 -53390 -124189 -161342 -120213 -83578 -39696 -49987 -121031 -82517 -64950 -54130 -57659 -24140
16582 -24140 -40514 -54387 -47290 -42764 -41116 -25723 -12659 -59 -7728 19711 31583 37939 88210
$$ packed form
16666F218m2102l1267L7778o856o8209K9457L4757K9637J1269O934M0564J7339
16654F5519J2851j3355l2348l3403O214K6762K1634k7209j0140n6589O795L0610
16642b659l3885l8571q370J1093j7693J6339J7216j9548l0110P3330L5265l2880
16630c0473p188N8269M5686O698L6312k9239r0435p464M980l7212L7690M3344
16618C0968r7235p0496K1939J3224M3290j0631k4048K668R781L7428K6450L0020
16606A3358m4072m5318Q123Q2395K6049N706p3050M306K0101P277J6177p4442
16594e3390p0799l7153M1129L6635M3882j0291p1044L8514J7567J0820l529L3519
16582b4140j6374j3873P097M526J648J5393J3064J2600p669K7439J1872O356N0271
$$ plain form
16569 88210 87734 48467 10719 -74904 -81380 -21207 14630 34280 -21284 -44470 -61047 -36641
16557 -36641 33953 72133 42526 -4443 -41162 -22727 -17645 -28595 -10098 -28360 -30696 -9851
16545 -9851 -4484 -13189 -38984 -35796 -57161 -34697 -54283 -91206 7297 79904 59248 -5844
16533 -5844 39402 96990 84251 46991 25985 16374 49401 83940 33825 30852 68287 55498
16521 55498 -2454 -63395 -150067 -140333 -36076 6484 29139 56224 56151 71088 86134 68266
16509 68266 63334 -28209 -99514 -91834 -31329 11443 -34262 -112162 7278 109741 124991 139223
16497 139223 103366 69400 50851 17362 15957 12822 25685 11158 -6595 -3300 64053 -10952
16485 -10952 -33024 -42222 -68915 -89799 -89494 -73426 -75187 -74947 -21887 -16722 -33320 -44331 -38423
$$ packed form
16569H8210m76l9267l7748q5623o476O0173L5837J9650n5564k3186j6577K4406
16557c6641P0594L8180k9607m6969l6719J8435N082j0950J8497j8262k336K0845
16545i851N367q705k5795L188k1365K2464j9586l6923R8503P2607k0656o5092
16533e844M5246N7588j2739l7260k1006r611L3027L4539n0115k973L7435j2789
16521E5498n7952o0941q6672R734J04257M2560K2655K7085p3J4937J5046j7868
16509F8266m932r1543p1305P680O0505M2772m5705p7900J19440J02463J5250J4232
16497A39223l5857l3966j8549l3489j405l135J2863j4527j7753L295O7353p5005
16485a0952k2072r198k6693k0884L05J6068j761K40N3060N165j6598j1011N908
$$ plain form
16472 -38423 -41618 -55518 7871 64482 59908 1511 -34921 -52547 -38155 -67195 -52565 -36991
16460 -36991 -23901 13165 -49401 -77818 -113422 -80177 -24267 51796 18823 -31362 -78039 -101492
16448 -101492 -92222 -96429 -101559 -15180 36860 42556 -10717 -66325 -62746 -57516 -1650 31502 61728
16435 61728 59734 14380 -32093 -27483 -27344 2835 41250 -13884 -8375 -3450 -7310 -23281 -42274
16422 -42274 -21415 -27194 32078 48816 -15777 -41298 6214 43819 99518 102638 81646 24385
16410 24385 -41283 -72884 -51985 11109 42432 58237 22265 12661 37261 25318 -9994 -17904
16398 -17904 -47332 -100940 -151036 -94879 -27975 -60841 -93933 -135393 -106058 -37358 15503 3346
16386 3346 30189 85757 61853 11902 38043 46972 24987 -5502 2733 47272 35572 -15212
$$ packed form
16472c8423l195j3900O3389N6611m574n8397l6432j7626J4392k9040J4630J5574
16460c6991J3090L7066o2566k8417l5604L3245N5910P6063l2973n0185m6677k3453
16448a01492R270m207n130Q6379N2040N696n3273n5608L579N230N5866L3152L0226
16435F1728j994m5354m6473M610J39L0179L8415n5134N509M925l860j5971j8993
16422d2274K0859n779N9272J6738o4593k5521M7512L7605N5699L120k0992n7261
16410B4385o5668l1601K0899O3094L1323J5805l5972r604K4600j1943l5312p910
16398a7904k9428n3608n0096N6157O6904l2866l3092m1460K9335O8700N2861j2157
16386C346K6843N5568k3904m9951K6141Q929k1985l0489Q235M4539j1700n0784
$$ plain form
16374 -15212 -8101 6426 -18153 -13106 17453 30464 39352 8597 -74110 -66739 12570 6846 -46913
16361 -46913 -48722 -110844 -116712 -110791 -14046 55405 65694 51623 -4292 -58483 -57108 -53158 -32593
16348 -32593 44088 64177 78514 72812 118795 92509 67580 44908 38060 26163 25671 17392 -5143
16335 -5143 20993 35224 21164 3740 -73218 -85872 -94259 -111256 -64030 2945 -50893 -90524
16323 -90524 -13199 6425 -25607 -27997 -32835 -46461 -74931 -87318 -40070 -32013 -22217 -97110
16311 -97110 -110391 -70089 -35774 -4860 13347 43841 52405 6784 -11925 -17363 -23932 -53264
16299 -53264 -75356 3205 43497 32455 46155 68819 28434 -3054 -7640 -36472 -26428 38052
16287 38052 56742 31202 35921 42451 17468 -1272 -7146 -23117 -51636 -34114 21101 68872
$$ packed form
16374a5212P111J4527k4579N047L0559J3011Q888l0755q2707P371P9309n724n3759
16361d6913j809o2122n868N921R6745O9451J0289j4071n5915n4191J375L950K0565
16348c2593P6681K0089J4337n702M5983k6286k4929k2672o848j1897m92q279k2535
16335e143K6136J4231j4060j7424p6958j2654q387j6997M7226O6975n3838l9631
16323i0524P7325J9624l2032k390m838j3626k8470j2387M7248Q057R796p4893
16311i7110j3281M0302L4315L0914J8207L0494Q564m5621j8709n438o569k9332
16299e3264k2092P8561M0292j1042J3700K2664m0385l1488m586k8832J0044O4480
16287C8052J8690k5540M719O530k4983j8740n874j5971k8519J7522N5215M7771
$$ plain form
16275 68872 62978 62172 59774 21840 29821 13591 -27941 9442 18084 -3283 -65238 -153302 -132154
16262 -132154 -24849 -29103 -38015 -21993 -2475 -31047 -80982 -35387 -31761 -1099 -470 -12892
16250 -12892 2512 16254 -4736 -18061 -45730 -59648 -4209 15068 -27548 -9664 5178 13834
16238 13834 12312 -51843 -43757 -18210 15652 29574 60099 59565 20836 -22218 -26398 -9118 8372
16225 8372 46803 53641 41213 46387 17353 -6772 -76038 -90061 -54099 -77212 -19198 19276
16213 19276 32504 97267 97524 38941 -6736 -49961 -56145 -58664 -48699 -48674 -111575 -25570 60016
16200 60016 69294 89537 139627 127026 109239 -26893 -112952 -53429 -19395 22232 35667 75169
16188 75169 102867 64409 69139 83129 60381 80236 78243 60467 11107 -1681 -14341 -21999
$$ packed form
16275F8872n894q06k398l7934P981j6230m1532L7383Q642k1367o1955q8064K1148
16262a32154J07305m254q912J6022J9518k8572m9935M5595L626L0662O29j2422
16250a2892J5404J3742k0990j3325k7669j3918N5439J9277m2616J7884J4842Q656
16238A3834j522o4155Q086K5547L3862J3922L0525n34l8729m3054m180J7280J7490
16225H372L8431O838j2428N174k9034k4125o9266j4023L5962k3113N8014L8474
16213A9276J3228O4763K57n8583m5677m3225o184k519R965K5o2901Q6005Q5586
16200F0016R278K0243N0090j2601j7787j36132q6059N9523L4034M1627J3435L9502
16188G5169K7698l8458M730J3990k2748J9855j993j7776m9360j2788j2660p658
$$ plain form
16176 -21999 -32992 -131755 -159383 -135208 -94558 -44920 -64538 -86102 -90879 -126429 -139799 -101360
16164 -101360 -36722 28534 74068 44351 -57906 -32837 -4060 35122 27183 12299 -6501
16153 -6501 -12154 35592 90892 118136 136979 107719 73901 16975 -40516 -77590 -93184 -48739
16141 -48739 -45095 -36822 -63199 20750 20997 -20983 24880 -10167 -67550 -43789 -425 -27492
16129 -27492 -15563 58080 59519 14289 -10839 -52123 -74055 -68513 -67498 -72628 -74996 -58135 -54436
16116 -54436 -43161 -30621 -8477 8850 79642 59222 75420 92213 -37598 -83211 -15726
16105 -15726 -8934 -20941 -63635 -82310 -68887 -17076 39626 83621 79412 31911 1315 -18367
16093 -18367 -37818 -36834 -13350 21772 19333 10464 29474 28593 40585 93156 75166 38049 48155
$$ packed form
16176b1999j0993r8763k7628K4175M0650M9638j9618k1564m777l5550j3370L8439
16164a01360O4638O5256M5534k9717j02257K5069K8777L9182p939j4884j8800
16153f501n653M7746N5300K7244J8843k9260l3818n6926n7491l7074j5594M4445
16141d8739L644Q273k6377Q3949K47m1980M5863l5047n7383K3761M3364k7067
16129b7492J1929P3643J439m5230k5128m1284k1932N542J015n130k368J6861L699
16116e4436J1275J2540K2144J7327P0792k0420J6198J6793j29811m5613O7485
16105a5726O792j2007m2694j8675J3423N1811N6702M3995m209m7501l0596j9682
16093a8367j9451R84K3484L5122k439q869J9010q81J1992N2571j7990l7117J0106
$$ plain form
16080 48155 57316 35746 -25697 -20175 21613 21825 38243 65959 57460 2503 -58061 -91626 -67147
16067 -67147 -33669 49548 41823 -4937 -56399 -81090 -67107 -56369 -37881 52758 99457 135573
16055 135573 149978 127914 120198 99176 56172 41431 34561 -25465 -26454 -3003 -36116 -3926
16043 -3926 36039 32392 -17163 -63586 -68688 -45064 -28353 -29475 -57648 -84369 -58677 -15202
16031 -15202 44807 48381 48788 49905 59643 48103 62241 62995 48733 58369 -5690 -40454 30841
16018 30841 80381 69890 46534 -233 -11530 -78471 -104086 -118052 -68247 4642 -9484 18084
16006 18084 -50378 -69518 -9603 -36061 -38928 59397 117454 99236 52270 20635 -28829 -39504
15994 -39504 -13861 -35314 -38624 -67006 -60683 -25994 -16697 -78167 -71250 -27282 -6154 -39670
$$ packed form
16080D8155R161k1570o1443N522M1788K12J6418K7716q499n4957o0564l3565K4479
16067f7147L3478Q3217p725m6760n1462k4691J3983J0738J8488R0639M6699L6116
16055A35573J4405k2064p716k1022m3004j4741o870o0026r89K3451l3113L2190
16043c926L9965l647m9555m6423n102K3624J6711j122k8173k6721K5692M3475
16031a5202O0009L574M07J117R738j1540J4138P54j4262R636o4059l4764P1295
16018C0841M9540j0491k3356m6767j1297o6941k5615j3966M9805P2889j4126K7568
16006A8084o8462j9140N9915k6458k867R8325N8057j8218m6966l1635m9464j0675
15994c9504K5643k1453l310k8382O323L4689R297o1470O917M3968K1128l3516
$$ plain form
15982 -39670 -27314 -4964 -46198 -68290 -70975 -44093 -49329 -42966 -56417 23473 35508 -11859
15970 -11859 -43623 -48520 -24674 -14704 -57406 -41132 25367 45522 -11064 -37586 -59559 -41249
15958 -41249 -13014 -14574 46453 30371 -34853 -68370 -17703 -3638 -21396 -19790 -4319 -6730
15946 -6730 3359 9770 -816 1693 -11473 -21651 -61513 -68871 -56841 -40777 -39426 -4152 30267
15933 30267 -8715 -48923 -16066 50475 39609 28816 59315 27530 20252 29106 -12952 -5139
15921 -5139 33183 92100 107455 129808 139721 140523 122077 104870 32938 28274 60687 96700 89534
15908 89534 28862 42516 72773 66028 89324 87958 70723 68670 78508 86118 47615 54860 15354
15895 15354 -3765 40609 60957 43063 29554 32803 -34191 -25716 -17083 20233 33991 10118
$$ packed form
15982c9670J2356K2350m1234k2092k685K6882n236O363j3451P9890J2035m7367
15970a1859l1764m897K3846R970m2702J6274O6499K0155n6586k6522k1973J8310
15958d1249K8235j560O1027j6082o5224l3517N0667J4065j7758J606J5471k411
15946f730J0089O411j0586K509j3166j0178l9862p358J2030J6064J351L5274L4419
15933C0267l8982m0208L2857O6541j0866j0793L0499l1785p278Q854m2058P813
15921e139L8322N8917J5355K2353R913Q02j8446j7207p1932m664L2413L6013p166
15908H9534o0672J3654L0257o745K3296j366j7235k053R838P610l8503P245l9506
15895A5354j9119M4374K0348j7894j3509L249o6994Q475Q633L7316J3758k3873
$$ plain form
15883 10118 51186 41390 12033 -14370 -30193 -1520 -10014 -20517 -40369 -46514 -19538 -18723 -26826
15870 -26826 -29909 -23128 24287 33830 561 -15822 -47984 40559 77598 64660 15778 -22660
15858 -22660 -40753 -98867 -58849 -51161 -27781 17374 -22696 -19041 1986 16701 -458 -5994
15846 -5994 -25119 -26315 -76501 -80222 -5381 16218 -43637 -64721 -110323 -58132 -12333 -80610
15834 -80610 -53442 -33245 -46792 -39075 -22754 54110 71006 92587 18710 -11614 -40712 -40080
15822 -40080 -42686 -49559 -69832 -66081 -14497 55870 9050 -25643 -940 108670 129495 71687
15810 71687 91624 60349 61814 2610 13451 13862 -14131 14909 52635 14602 -19790 -1528
15798 -1528 -55839 -73079 -38431 -48635 -82080 -36679 -36805 -1336 -16866 -70963 -123518 -110794
$$ packed form
15883A0118M1068r796k9357k6403j5823K8673q494j0503j9852o145K6976Q15q103
15870b6826l083O781M7415R543l3269j6383l2162Q8543L7039j2938m8882l8438
15858b2660j8093n8114M0018P688K3380M5155m0070L655K1027J4715j7159n536
15846e994j9125j196n0186l721P4841K1599n9855k1084m5602N2191M5799o8277
15834h0610K7168K0197j3547P717J6321P6864J6896K1581p3877l0324k9098O32
15822d0080k606o873k0273L751N1584P0367m6820l4693K4703J09610K0825n7808
15810G1687J9937l1275J465n9204J0841M11k7993K9040L7726l8033l4392J8262
15798a528n4311j7240L4648j0204l3445M5401j26L5469j5530n4097n2555J2724
$$ plain form
15786 -110794 -74731 -70063 -89667 -67520 -29346 -23396 4901 -53539 -52924 -47035 -67589 -88171
15774 -88171 -33684 22031 75474 68694 11898 -26507 -23863 -85754 -98560 -101804 -103906 -54409
15762 -54409 -75128 -127855 -125239 -140258 -138083 -145697 -134688 -78646 -110905 -90412 -18798 -13642
15750 -13642 -21903 -18158 -64017 -70657 -112931 -149971 -87997 -58003 -5606 31401 56030 51403
15738 51403 23811 33947 37152 3638 -9285 1146 54502 22499 -17750 12470 -2743 25112
15726 25112 -12739 8422 19595 -28096 -20475 -32646 -2881 -2206 -40462 4869 47898 52680
15714 52680 -21250 -16002 -39954 -21158 -67260 -103769 -71705 2608 36657 53945 36235 12193
15702 12193 65068 128517 105262 21216 -28745 11306 75688 68313 -1434 24190 42316 -28976
$$ packed form
15786a10794L6063M668j9604K2147L8174N950K8297n8440O15N889k0554k0582
15774h8171N4487N5715N3443o780n6796l8405K644o1891j2806l244k102M9497
15762e4409k0719n2727K616j5019K175p614J1009N6042l2259K0493P1614N156
15750a3642q261L745m5859o640m2274l7040O1974K9994N2397L7007K4629m627
15738E1403k7592J0136L205l3514j2923J0431N3356l2003m0249L0220j5213K7855
15726B5112l7851K1161J1173m7691P621j2171K9765O75l8256M5331M3029M782
15714E2680p3930N248k3952J8796m6102l6509L2064P4313L4049J7288j7710k4042
15702A2193N2875O3449k3255q4046m9961M0051O4382p375o9747K5624J8126p1292
$$ plain form
15690 -28976 -44297 249 9776 -55692 -84671 -129165 -148976 -107837 -64569 -75749 -78081 -44195
15678 -44195 -23347 -65928 -53542 12964 50066 50262 23009 3352 35825 54227 92458 79468
15666 79468 80326 39016 43255 74105 66587 21789 -58670 -54463 35610 -8113 -111739 -60689
15654 -60689 -26818 8048 49247 75402 96888 62457 -30702 -62683 -44151 -79416 -38143 -36335
15642 -36335 7673 -6443 12930 67451 68885 26683 -2995 8842 79084 57232 -12546 -9499
15630 -9499 -12564 -13639 -35091 -29153 -80675 -29104 38804 3636 -21116 3252 -7295 5082
15618 5082 -5309 -45647 -65112 -60623 -70553 -62905 -82933 -113701 -74451 25848 29453 -32938
15606 -32938 -94208 -70631 -44649 -71199 -77428 -20179 -70660 -105340 -58539 1047 -4406 -58322
$$ packed form
15690b8976j5321M4546R527o5468k8979m4494j9811M1139M3268j1180k332L3886
15678d4195K0848m2581J2386O6506L7102J96k7253j9657L2473J8402L8231j2990
15666G9468Q58m1310M239L0850p518m4798q0459M207R0073m3723j03626N1050
15654f0689L3871L4866M1199K6155K1486l4431r3159l1981J8532l5265M1273J808
15642c6335M4008j4116J9373N4521J434m2202k9678J1837P0242k1852o9778L047
15630i499l065j075k1452N938n1522N1571O7908l5168k4752K4368j0547J2377
15618E082j0391m0338j9465M489r930P648k0028l0768L9250J00299L605o2391
15606c2938o1270K3577K5982k6550o229N7249n0481l4680M6801N9586n453n3916
$$ plain form
15594 -58322 -52369 -62061 -48609 -66486 -97160 -72239 -60962 -84647 -30048 1171 -16359 -52334
15582 -52334 -57808 -80339 -63667 -26209 -2478 -39118 -121185 -168897 -139800 -164226 -71786 5000
15570 5000 -3055 12072 29916 -7312 -56794 -41861 -37246 -62870 -97116 -72676 -8846 24978
15558 24978 17440 -21231 -69331 -24934 -22043 15500 54518 13197 -24902 14806 35889 14161
15546 14161 -34136 -51702 -14245 -1867 -8398 41715 61550 30971 12935 -24581 -2205 46592
15534 46592 51187 13328 -5420 20401 38539 56701 96247 104475 75888 -13685 -50629 -80507
15522 -80507 -30065 20586 80572 71450 51071 42069 50631 23536 4792 -29777 -21202 -27931 -82157
15509 -82157 -19096 2395 20579 42540 54771 61281 37580 -1856 -16793 7376 47899 75159
$$ packed form
15594e8322N953r692J3452j7877l0674K4921J1277k3685N4599L1219j7530l5975
15582e2334n474k2531J6672L7458K3731l6640q2067m7712K9097k4426R2440P6786
15570E000q055J5127J7844l7228m9482J4933M615k5624l4246K4440O3830L3824
15558B4978p538l8671m8100M4397K891L7543L9018m1321l8099L9708K1083k1728
15546A4161m8297j7566L7457J2378o531N0113J9835l0579j8036l7516K2376M8797
15534D6592M595l7859j8748K5821J8138J8162L9546Q228k8587q9573l6944k9878
15522h0507N0442N0651N9986r122k0379r002Q562k7095j8744l4569Q575o729n4226
15509h2157O3061K1491J8184K1961J2231O510k3701l9436j4937K4169M0523K7260
$$ plain form
15497 75159 103635 40718 -12904 6785 9486 51482 65288 75601 50542 53507 55484 -3069
15485 -3069 -60086 -52300 -5106 -15464 -67342 -104899 -109465 -64717 -73304 -13156 33312 92880
15473 92880 79643 63648 -32693 -38199 -55260 -111946 -165239 -93962 31257 66144 45592 40171
15461 40171 117327 83292 66643 38535 57554 86419 89423 94572 71271 33906 -18546 -71634
15449 -71634 -142321 -97499 4660 77937 108888 90259 38294 34084 97409 104540 77244 71538
15437 71538 97567 96272 87096 92428 21027 -40989 -39897 4921 41636 93549 114270 114912 101407
15424 101407 123529 120020 82185 23560 -7682 39378 105938 85183 59248 39238 -15108 7875
15412 7875 79892 96626 93884 37178 -11064 12113 28782 -8068 22697 13325 -42712 9290
$$ packed form
15497G5159K8476o2917n3622J9689K701M1996J3806J0313k5059K965J977n8553
15485c069n7017P786M7194j0358n1878l7557m566M4748q587O0148M6468N9568
15473I2880j3237j5995r6341n506j7061n6686n3293P1277J25219L4887k0552n421
15461D0171P7156l4035j6649k8108J9019K8865L004N149k3301l7365n2452n3088
15449g1634p0687M4822J02159P3277L0951j8629n1965m210O3325P131k7296n706
15437G1538K6029j295r176N332p1401o2016J092M4818L6715N1913K0721O42j3505
15424A01407K2122l509l7835n8625l1242M7060O6560k0755k5935k0010n4346K2983
15412G875P2017J6734k742n6706m8242K3177J6669l6850L0765r372n6037N2002
$$ plain form
15400 9290 57117 25694 56117 47952 109739 123615 115882 82608 35148 18171 42891 37952
15388 37952 -13694 -7391 -33347 -31319 -7848 -6055 33061 74967 92649 56758 78665 96263
15376 96263 123649 172773 148611 85055 49774 8670 -47517 -46170 -48515 -5185 14705 12306
15364 12306 23298 13451 -28495 7586 11909 -9031 -70667 -38085 27433 48668 54347 12474
15352 12474 40736 47370 33621 8859 -11963 -18789 12430 32995 7677 4779 29320 4925
15340 4925 20672 -17088 -20844 26085 85190 168775 224073 178823 101731 87395 66476 -1466
15328 -1466 34659 14267 -2616 44444 41313 19044 34409 14355 3103 -31018 -19899 -8532
15316 -8532 8189 27083 117359 121058 66689 46926 35320 16126 19330 35000 65827 20767
$$ packed form
15400I290M7827l1423L0423q165O1787J3876p733l3274m7460j6977K4720m939
15388C7952n1646O303k5956K028K3471J793L9116M1906J7682l5891K1907J7598
15376I6263K7386M9124k4162o3556l5281m1104n6187J347k345M3330J9890k399
15364A2306J0992r847m1946L6081M323k0940o1636L2582O5518K1235N679m1873
15352A2474K8262O634j3749k4762k0822o826L1219K0565k5318k898K4541k4395
15340D925J5747l7760l756M6929N9105Q3585N5298m5250p7092j4336k0919o7942
15328a466L6125k0392j6883M7060l131k2269J5365k0054j1252l4121J1119J1367
15316h532J6721J8894R0276L699n4369j9763j1606j9194L204J5670L0827m5060
$$ plain form
15304 20767 -23230 -39216 -2958 22350 84673 151692 100307 -6532 19820 38275 35664 44178
15292 44178 15823 -30664 -17787 32248 38748 23887 25976 32120 71482 92986 78135 79069 147587
15279 147587 160434 138737 117453 116193 117522 104465 55998 58469 40511 -9973 -49016 -48117
15267 -48117 -64632 -105500 -74314 7196 42372 34247 -30132 26374 67384 67047 31446 65000
15255 65000 75130 82381 128571 187435 190327 100091 50430 51025 751 33374 55566 71478
15243 71478 94060 76180 94559 165272 266865 289228 275811 253257 270641 310073 417023
15232 417023 545938 663089 816947 995376 1188665 1401975 1582294 1661238 1722500 1776094
15222 1776094 1748809 1655289 1490618 1342007 1207132 1083749 925948 785086 653860 584275
$$ packed form
15304B0767m3997j5986L6258K5308O2323O7019n1385j06839K6352J8455k611Q514
15292D4178k8355m6487J2877N0035O500j4861K089O144L9362K1504j4851R34O8518
15279A47587J2847k1697k1284j260J329j3057m8467K471j7958n0484l9043Q99
15267d8117j6515m0868L1186Q1510L5176q125o4379N6506M1010l37l5601L3554
15255F5000J0130P251M6190N8864K892r0236m9661N95n0274L2623K2192J5912
15243G1478K2582j7880J8379P0713J01593K2363j3417k2554J7384L9432J06950
15232D17023J28915J17151J53858J78429J93289K13310J80319P8944O1262N3594
15222A776094k7285r3520j64671j48611j34875j23383j57801j40862j31226o9585
$$ plain form
15212 584275 536155 476906 408731 323060 274957 240782 165008 149326 165251 146002 131960
15201 131960 191391 269574 262803 207441 133543 91822 134553 211176 211468 179752 165025 189749
15189 189749 220642 166457 179828 158299 150675 139593 171542 109678 124467 189331 174697 159452
15177 159452 154305 140682 49899 57408 26549 1822 31474 38896 59492 83118 109908 112400
15165 112400 74992 41553 39741 60565 36693 43648 21888 38247 20287 78317 111494 92125
15153 92125 69353 46236 36964 81383 124151 126917 79689 35153 53474 13818 -26231 -17623
15141 -17623 -3704 -47930 -12824 34363 28706 29267 60143 59629 53460 19554 -33372 -20493 427
15128 427 25956 29700 -27230 -53661 -31619 49236 27335 -21579 -10537 26387 -37932 -67044
$$ packed form
15212E84275m8120n9249o8175q5671m8103l4175p5774j5682J5925j9249j4042
15201A31960N9431P8183o771n5362p3898m1721M2731P6623K92l1716j4727K4724
15189A89749L0893n4185J3371k1529p624j1082L1949o1864J4789O4864j4634j5245
15177A59452n147j3623r0783P509l0859k4727K9652P422K0596K3626K6790K492
15165A12400l7408l3439j812K0824k3872O955k1760J6359j7960N8030L3177j9369
15153I2125k2772k3117r272M4419M2768K766m7228m4536J8321l9656m0049Q608
15141a7623J3919m4226L5106M7187n657N61L0876n14o169l3906n2926J2879K0920
15128D27K5529L744n6930k6431K2042Q0855k1901m8914J1042L6924o4319k9112
$$ plain form
15116 -67044 -46624 -37303 -21236 12670 24049 7221 55821 44329 -41624 6331 63733 22250
15104 22250 -8804 61451 111190 47489 20895 15339 -5301 -36066 -10386 16189 55410 18534
15092 18534 40848 18672 16745 -6788 43196 32585 21238 58880 38529 31307 47591 87174
15080 87174 99561 87113 36077 44166 14332 -86586 -182758 -166821 -115249 -17029 2921 48995
15068 48995 57272 43954 -25696 -78974 -97542 -4738 60404 26205 17054 7904 -11414 -38514
15056 -38514 -10124 7167 -10703 29764 12388 -20086 17661 8016 -4806 7715 27871 -6097
15044 -6097 30835 62213 106159 88912 58927 71065 76021 98961 85812 58285 49213 87976
15032 87976 110167 69836 77271 124395 173360 283260 207942 192958 240169 234247 211004 169578
$$ packed form
15116f7044K0420R321J6067L3906J1379j6828M8600j1492q5953M7955N7402m1483
15104B2250l1054P0255M9739o3701k6594n556k0640l0765K5680K6575L9221l6876
15092A8534K2314k2176j927k3533M9984j0611j1347L7642k0351p222J6284L9583
15080H7174J2387j2448n1036Q089k9834j00918r6172J5937N1572R8220J9950M6074
15068D8995Q277j3318o9650n3278j8568R2804O5142l4199r151r150j9318k7100
15056c8514K8390J7291j7870M0467j7376l2474L7747r645j2822J2521K0156l3968
15044f097L6932L1378M3946j7247k9985J2138M956K2940j3149k7527r072L8763
15032H7976K2191m0331P435M7124M8965J09900p5318j4984M7211n922k3243m1426
$$ plain form
15020 169578 201877 282540 304028 273392 294169 321324 328689 281672 248889 231318 210294 161254
15008 161254 153909 211711 321394 364699 268715 187634 182651 107881 37886 688 19309 19145
14996 19145 -31366 37201 93289 79904 46373 70023 118220 99122 80530 114494 156948 136892
14984 136892 75100 37234 108792 153761 205168 237431 217252 204986 251317 268144 287998
14973 287998 227652 182561 213635 252090 225259 199034 135195 157629 148864 99528 111571 158845
14961 158845 121481 98450 97449 171540 177769 148531 149192 154401 214155 225352 192857 155491
14949 155491 165547 125268 118312 136124 107693 135069 135827 63507 78467 138362 185396 141755
14937 141755 132493 120621 125334 150509 184096 202893 209699 155022 80132 55727 50801 65749
$$ packed form
15020A69578L2299Q0663K1488l0636K0777K7155P365m7017l2783j7571k1024m9040
15008A61254p345N7802J09683M3305r5984q1081m983p4770o9995l7198J8621j64
14996A9145n0511O8567N6088j3385l3531K3650M8197j9098j8592L3964M2454k0056
14984A36892o1792l7866P1558M4969N1407L2263k0179j2266M6331J6827J9854
14973B87998o0346m5091L1074L8455k6831k6225o3839K2434q765m9336J2043M7274
14961A58845l7364k3031j001P4091O229k9238O61N209N9754J1197l2495l7366
14949A55491J0056m0279o956J7812k8431K7376P58p2320J4960N9895M7034m3641
14937A41755r262j1872M713K5175L3587J8797O806n4677p4890k4405m926J4948
$$ plain form
14925 65749 106674 153750 151361 96467 107010 97372 74498 109521 171566 235060 233600 207261
14913 207261 188623 193747 174066 140751 134673 148547 180657 241765 333990 437640 482099 470990
14901 470990 477030 485659 516777 566068 652220 724749 720280 722262 721003 700914 717692 731088
14889 731088 687097 616678 583459 510520 483532 485674 514932 435320 373847 414099 470571 540552
14877 540552 499423 527384 519351 506454 490693 468468 478606 549332 554756 519171 534471 596324
14865 596324 591349 570979 541140 495409 512244 561531 592204 606715 628892 651392 684417 613501
14853 613501 606606 637549 619138 700306 787051 748979 785786 752947 770124 789716 843132 930667
14841 930667 907024 883361 859677 840312 823449 861027 886991 868061 828354 831220 791424 844532
$$ packed form
14925F5749M0925M7076k389n4894J0543r638k2874L5023O2045O3494j460k6339
14913B07261j8638N124j9681l3315o078J3874L2110O1108R2225J03650M4459j1109
14901D70990O040Q629L1118M9291Q6152P2529m469J982j259k0089J6778J3396
14889G31088m3991p0419l3219p2939k6988K142K9258p9612o1473M0252N6472O9981
14877E40552m1129K7961q033j2897j5761k2225J0138P0726N424l5585J5300O1853
14865E96324m975k0370k9839m5731J6835M9287L0673J4511K2177K2500L3025p0916
14853F13501o895L0943j8411Q1168Q6745l8072L6807l2839J7177J9592N3416Q7535
14841I30667k3643k3663k3684j9365j6863L7578K5964j8930l9707K866l9796N3108
$$ plain form
14829 844532 921475 1013350 1072864 1069833 1185971 1221723 1244224 1267718 1247850 1245940 1223031 1251749
14817 1251749 1276224 1268825 1224582 1245753 1330293 1337086 1403500 1455897 1560253 1695595 1775525
14806 1775525 1848632 1924146 2060049 2138169 2246333 2443755 2603461 2775811 2964040 3160519
14796 3160519 3449435 3760995 4057861 4386270 4850264 5340789 5898603 6656200 7579892
14787 7579892 8638534 9871082 11349861 13198933 15400857 17928091 20923880 24706560
14779 24706560 29715066 36417899 45472825 57681767 73862186 94417156 119555411
14772 119555411 149034111 181957004 216579192 250758747 281666226 306337125 322264826
14765 322264826 327902229 323660803 311041959 291066782 264528809 233797974 201864962
$$ packed form
14829H44532P6943R1875N9514l031J16138L5752K2501K3494j9868j910k2909K8718
14817A251749K4475p399m4243K1171Q4540O793O6414N2397J04356J35342P9930
14806A775525P3107P5514J35903P8120J08164J97422J59706J72350J88229J96479
14796C160519K88916L11560K96866L28409M63994M90525N57814P57597R23692
14787G579892J058642J232548J478779J849072K201924K527234K995789L782680
14779B4706560N008506O702833R054926J2208942J6180419K0554970K5138255
14772A19555411K9478700L2922893L4622188L4179555L0907479K4670899J5927701
14765C22264826N637403m241426j2618844j9975177k6537973l0730835l1933012
$$ plain form
14758 201864962 170808598 141854474 116353774 95582224 80015858 68755252 60563753
14751 60563753 54373888 49492867 45538608 42299249 39558739 37141908 35017026 33242727
14743 33242727 31685284 30228014 28881461 27668644 26502323 25373749 24324181 23316725
14735 23316725 22341028 21389534 20465767 19574263 18666495 17843218 17117466 16395315 15747171
14726 15747171 15175738 14596639 14056484 13590479 13155258 12683522 12318646 11961549 11545918
14717 11545918 11213328 10890742 10573058 10310720 10030094 9756747 9450415 9201049 9007414
14708 9007414 8785737 8503820 8202160 7948476 7726970 7498866 7309851 7136716 6875952
14699 6875952 6665393 6537196 6307140 6019631 5817510 5597744 5373574 5228618 5038153
$$ packed form
14758B01864962l1056364k8954124k5500700k0771550j5566366j1260606q191499
14751F0563753o189865m881021l954259l239359k740510k416831k124882j774299
14743C3242727j557443j457270j346553j212817j166321j128574j049568j007456
14735B3316725r75697r51494r23767q91504r07768q23277p25752p22151o48144
14726A5747171n71433n79099n40155m66005m35221m71736l64876l57097m15631
14717A1545918l32590l22586l17684k62338k80626k73347l06332k49366j93635
14708I007414k21677k81917l01660k53684k21506k28104j89015j73135k60764
14699F875952k10559j28197k30056k87509k02121k19766k24170j44956j90465
$$ plain form
14690 5038153 4910325 4805971 4655471 4518535 4397903 4294454 4177513 4024668 3922400
14681 3922400 3752133 3643870 3558630 3535486 3441084 3343117 3313629 3216161 3078518 3065036 3026111
14670 3026111 2947501 2824263 2734857 2716027 2690504 2641161 2530905 2464040 2449841 2409583 2315128
14659 2315128 2254230 2251365 2241245 2214966 2198433 2182950 2113152 1996314 1949073 1931679 1884953
14648 1884953 1871307 1815114 1792279 1735286 1719736 1634615 1594063 1458804 1357334 1347531 1259297
14637 1259297 1181967 1073995 938553 911210 897732 875544 844011 759564 673062 641821 618728
14626 618728 586619 633633 622828 559252 545053 556937 581363 638878 585438 576125 549714 518705
14614 518705 503866 460407 523532 544282 533675 491547 538446 625934 617996 549443 503916 466962
$$ packed form
14690E038153j27828j04354j50500j36936j20632j03449j16941j52845j02268
14681C922400j70267j08263q5240k3144r4402r7967k9488r7468j37643j3482l8925
14670C026111p8610j23238q9406j8830k5523m9343j10256o6865j4199m0258r4455
14659B315128o0898k865j0120k6279j6533j5483o9798j16838m7241j7394m6726
14648A884953j3646n6193k2835n6993j5550q5121m0552j35259j01470r803q8234
14637A259297p7330j07972j35442k7343j3478k2188l1533q4447q6502l1241k3093
14626F18728l2109M7014j0805o3576j4199J1884K4426N7515n3440r313k6411l1009
14614E18705j4839m3459O3125K0750j0607m2128M6899Q7488p938o8553m5527l6954
$$ plain form
14602 466962 433614 423741 418411 474220 559467 549358 525848 585745 638050 645808 598579 590611
14590 590611 575221 621092 636601 621670 540871 436335 403162 405033 395441 362922 385665 396694
14578 396694 354973 287581 323717 378166 375496 383308 409542 359574 335273 338530 324922 333844
14566 333844 328447 280351 285587 348152 391631 356438 288811 253809 287668 313195 301953 296251
14554 296251 347819 409154 410538 423381 375420 364178 347563 400448 436277 449044 401075 396772
14542 396772 365373 314237 268442 268644 311238 325752 322035 329916 291806 293591 304404 313255 328751
14529 328751 355037 328964 304991 297191 282305 286791 314153 313201 276361 299074 301013 338731
14517 338731 358048 353841 306989 291270 298249 263851 259176 317772 398496 347816 303065 243864
$$ packed form
14602D66962l3348r873n330N5809Q5247j0109k3510N9897N2305P758m7229p968
14590E90611j5390M5871J5509j4931q0799j04536l3173J871r592l2519K2743J1029
14578C96694m1721o7392L6136N4449k670P812K6234m9968k4301L257j3608Q922
14566C33844n397m8096N236O2565M3479l5193o7627l5002L3859K5527j1242n702
14554B96251N1568O1335J384J2843m7961j1242j6615N2885L5829J2767m7969m303
14542C96772l1399n1136m5795K02M2594J4514l717P881l8110J785J0813Q851J5496
14529C28751K6286k6073k3973p800j4886M486K7362r52l6840K2713J939L7718
14517C38731J9317m207m6852j5719O979l4398m675N8596Q0724n0680m4751n9201
$$ plain form
14505 243864 226227 204548 217954 223442 177636 209974 219127 217692 219210 229802 188697 147776
14493 147776 169814 147005 104133 121377 152302 193780 183012 135675 160308 161038 181832 188552
14481 188552 184463 198315 175220 172564 185243 216113 178343 131990 177043 119076 74866 53763
14469 53763 99095 122925 90118 58976 71644 106913 128908 129049 179423 232917 263192 227239
14457 227239 163296 172055 192282 168874 147286 154050 158662 157108 161588 176740 195893 193770 181660
14444 181660 206743 237390 207881 187253 195246 172949 112040 133967 128900 152631 119393 66714
14432 66714 80791 99941 61920 62906 108275 156027 191422 158094 117075 72193 41237 1374
14420 1374 21395 42442 -21456 -47343 -55551 -4571 53231 49305 79232 75130 124576 119368 71975
$$ packed form
14505B43864j7637k1679J3406N488m5806L2338R153j435J518J0592m1105m0921
14493A47776K2038k2809m2872J7244L0925M1478j0768m7337K4633P30K0794O720
14481A88552m089J3852k3095k656J2679L0870l7770m6353M5053n7967m4210k1103
14469E3763M5332K3830l2807l1142J2668L5269K1995J41N0374N3494L0275l5953
14457B27239o3943Q759K0227k3408k1588O764M612j554M480J5152J9153k123j2110
14444A81660K5083L0647k9509k0628P993k2297o0909K1927n067K3731l3238n2679
14432F6714J4077J9150l8021R86M5369M7752L5395l3328m1019m4882l0956l9863
14420A374K0021K1047o3898k5887q208N0980N7802l926K9927m102M9446n208m7393
$$ plain form
14407 71975 37356 101675 116870 75615 29136 13168 80905 165658 177685 120579 53934 93422
14395 93422 105687 145089 232518 212379 103617 77893 113834 176940 215280 139960 90525
14384 90525 97085 66146 4076 13588 16503 51360 107477 141173 166890 93781 96369 123945
14372 123945 148836 168919 135985 48822 32521 25102 3577 43903 1176 -20219 -3689 43858
14360 43858 87111 99116 77756 58159 101749 135717 129233 50753 16281 11003 25707 52300
14348 52300 23030 43521 69921 64959 -1812 -38326 10065 45699 15397 13375 -4674 21341
14336 21341 38321 48379 72899 79623 43566 29716 -46726 -70902 14920 13848 41116 43363
14324 43363 31949 39730 42255 83491 107239 90204 76216 70617 120764 128852 140818 192338
$$ packed form
14407G1975l4619O4319J5195m1255m6479j5968O7737Q4753J2027n7106o6645L9488
14395I3422J2265L9402Q7429k0139j08762k5724L5941O3106L8340p5320m9435
14384I0525O560l0939o2070R512K915L4857N6117L3696K5717p3109K588K7576
14372A23945K4891K0083l2934q7163j6301p419k1525M0326m2727k1395J6530M7547
14360D3858M3253J2005k1360j9597M3590L3968o484p8480l4472n278J4704K6593
14348E2300k9270K0491K6400m962o6771l6514M8391L5634l0302k022j8049K6015
14336B1341J6980J0058K4520O724l6057j3850p6442k4176Q5822j072K7268K247
14324D3363j1414P781K525M1236K3748j7035j3988n599N0147Q088J1966N1520
$$ plain form
14312 192338 316080 391667 468047 583525 634400 682678 817129 1015975 1162057 1320398
14302 1320398 1509335 1670404 1750318 1794262 1787424 1728091 1593841 1385192 1230990 1106512
14292 1106512 872876 721784 617479 557475 500979 431675 397404 329390 223679 179912
14282 179912 167135 189325 185624 225979 220257 177929 135070 118796 135588 145823 144697 166215
14270 166215 199573 166836 119688 134601 173916 172370 174962 165985 183308 222000 182814 83187
14258 83187 78650 113897 91725 61152 100680 91048 89856 84610 57645 54507 49977 65986 -524
14245 -524 4798 -16272 -5031 105037 121028 114459 179517 173363 99532 84972 138952 118189
14233 118189 44001 38202 100500 138739 90501 30275 -21779 -3603 48926 12749 -10430 -13095
$$ packed form
14312A92338J23742P5587P6380J15478N0875M8278J34451J98846J46082J58341
14302A320398J88937J61069P9914M3944o838n9333j34250k08649j54202j24478
14292A106512k33636j51092j04305o0004n6496o9304l4271o8014j05711m3767
14282A79912j2777K2190l701M0355n722m2328m2859j6274J6792J0235j126K1518
14270A66215L3358l2737m7148J4913L9315j546K592q977J7323L8692l9186r9627
14258H3187m537L5247k2172l0573L9528r632j192n246k6965l138m530J6009o6510
14245e24N322k1070J1241J10068J5991o569O5058o154p3831j4560N3980k0763
14233A18189p4188n799O2298L8239m8238o0226n2054J8176N2529l6177k3179k665
$$ plain form
14221 -13095 22374 31368 -21152 2482 78911 59374 21091 -12469 65662 123621 143504 176887
14209 176887 123477 135860 78058 69199 168144 189498 167932 173881 124086 -6951 -15971 40175
14197 40175 71779 9505 -13333 -20736 26133 28055 -30580 32808 78474 90944 73111 41676
14185 41676 56991 107797 133668 111153 106114 100567 95196 131746 203563 197023 169276 224043
14173 224043 207059 159977 105169 64447 106039 25226 -3180 17275 32269 126435 127916 123509
14161 123509 81308 16046 29971 67152 50872 14296 52856 36481 21727 -26536 -13799
14150 -13799 -2538 -9779 -16093 -2698 -16133 -29580 -53118 14497 41315 124930 143036 106865
14138 106865 109254 94674 121285 101955 34703 -8416 -22461 33619 18840 -16981 -2764 26326
$$ packed form
14221a3095L5469Q994n2520K3634P6429j9537l8283l3560P8131N7959J9883L3383
14209A76887n3410J2383n7802q859R8945K1354k1566N949m9795j31037r020N6146
14197D0175L1604o2274k2838p403M6869J922n8635O3388M5666J2470j7833l1435
14185D1676J5315N0806K5871k2515n039n547n371L6550P1817o540k7747N4767
14173B24043j6984m7082n4808m0722M1592q0813k8406K0455J4994R4166J481m407
14161A23509m2201o5262J3925L7181j6280l6576L8560j6375j4754m8263J2737
14150a3799J1261p241o314J3395j3435j3447k3538O7615K6818Q3615J8106l6171
14138A06865K389j4580K6611j9330o7252m3119j4045N6080j4779l5821J4217K9090
$$ plain form
14126 26326 76381 61869 11878 68089 54161 15051 -21002 -32475 14831 -11459 -5189 -6746
14114 -6746 22129 -5253 -55264 -57740 -51122 -44558 -14801 -18874 -5027 -6033 -29827 -49704 -35691
14101 -35691 -65207 -42422 54185 99042 30891 -35807 -22811 -10340 -28007 -35838 -52818 -22223
14089 -22223 50100 48652 -27303 -60129 -34833 -52041 -50209 -33647 -26486 34228 56440 26554
14077 26554 15871 33684 13992 58344 58518 66018 77801 58127 65522 45898 23974 16131 70407
14064 70407 52474 39388 57804 91321 99443 73893 13705 -29105 14551 77348 108096 77862
14052 77862 16125 -13154 14246 -35302 -92004 -89010 -34386 -60115 -55097 -1251 28845 43740
14040 43740 66787 20210 -251 -10746 34751 69118 55633 19058 -3853 45607 39243 33829
$$ packed form
14126B6326N0055j4512m9991N6211j3928l9110l6053j1473M7306k6290O270j557
14114f746K8875k7382n0011k476O618O564K9757m073J3847j006k3794j9877J4013
14101c5691k9516K2785R6607M4857o8151o6698J2996J2471j7667p831j6980L0595
14089b2223P2323j448p5955l2826K5296j7208J832J6562P161O0714K2212k9886
14077B6554j0683J7813j9692M4352J74P500J1783j9674P395j9624k1924p843N4276
14064G0407j7933j3086J8416L3517Q122k5550o0188m2810M3656O2797L0748l0234
14052G7862o1737k9279K7400m9548n6702K994N4624k5729N018N3846L0096J4895
14040D3740K3047m6577k0461j0495M5497L4367j3485l6575k2911M9460o364n414
$$ plain form
14028 33829 63567 59020 84845 89965 113855 118193 81356 41706 19108 -90325 -112467 -95853
14016 -95853 -38602 -12533 -37796 5829 -31880 -68794 -81062 -73051 -8820 43249 54752 71926
14004 71926 80068 85287 104002 47175 41733 50959 -33609 -118375 -139467 -147601 -132851 -146031 -129088
13991 -129088 -108041 -61282 -37718 -53857 -13206 52218 43806 37288 32364 62822 77014 63000
13979 63000 -9699 -19988 19425 -21035 -34188 -5155 11651 7333 26237 27900 27709 47224
13967 47224 76168 42191 -13678 42819 101109 92601 72816 69231 43123 39306 66634 85850
13955 85850 58460 76744 99910 49533 11681 2896 -46408 -63533 -32484 3000 -23708 -52575
13943 -52575 -63889 -22961 -17347 -90237 -114732 -60272 -6376 17980 988 12869 -17875 -34255
$$ packed form
14028C3829K9738m547K5825N120K3890M338l6837l9650k2598j09433k2142J6614
14016i5853N7251K6069k5263M3625l7709l6914j2268Q011O4231N2069J1503J7174
14004G1926Q142N219J8715n6827n442R226q4568q4766k1092q134J4750j3180J6943
13991a29088K1047M6759K3564j6139M0651O5424q412o518m924L0458J4192j4014
13979F3000p2699j0289L9413m0460j3153K9033J6806m318J8904J663j91J9515
13967D7224K8944l3977n5869N6497N8290q508j9785l585k6108l817K7328J9216
13955H5850k7390J8284K3166n0377l7852q785m9304j7125L1049L5484k6708k8867
13943e2575j1314M0928N614p2890k4495N4460N3896K4356j6992J1881l0744j6380
$$ plain form
13931 -34255 -52156 570 -16953 3349 18819 -40245 -84678 -111586 -109438 -24066 29252 23016
13919 23016 6401 -7406 -3301 -62437 -57569 -63549 -64610 17424 75240 80622 73956 34095 15972
13906 15972 20376 52785 51928 39942 50953 73802 46219 27884 79044 40052 57452 58450 58641
13893 58641 36232 -26719 -49277 -32698 -71804 -72858 -28213 39318 85204 50444 62370 78051
13881 78051 16793 43408 44986 -64563 -37437 2260 -6385 3973 32826 -33368 -64292 -78285
13869 -78285 -5980 29582 6536 -3748 19286 -35296 -56164 19189 85288 112907 102513 21013
13857 21013 -9914 9289 11891 8846 -144 -23823 -9421 78979 78221 81057 76791 81406 32074
13844 32074 -5592 1311 26337 48861 52713 106802 146417 127182 59977 -10633 -1146 32516
$$ packed form
13931c4255j7901N2726j7523K0302J5470n9064m4433k6908K148Q5372N3318o236
13919B3016j6615j3807M105n9136M868n980j061Q2034N7816N382o666l9861j8123
13906A5972M404L2409q57j1986J1011K2849k7583j8335N1160l8992J7400R98J91
13893E8641k2409o2951k2558J6579l9106j054M4645O7531M5886l4760J1926J5681
13881G8051o1258K6615J578j09549K7126L9697q645J0358K8853o6194l0924j3993
13869g8285P2305L5562k3046j0284K3034n4582k0868P5353O6099K7619j0394q1500
13857B1013l0927J9203K602l045q990k3679J4402Q8400p58K836m266M615m9332
13844C2074l7666O903K5026K2524L852N4089L9615j9235o7205p0610R487L3662
$$ plain form
13832 32516 33010 45374 6224 5341 64835 97087 65363 76423 138324 126385 35851 13267
13820 13267 69416 71785 60414 21792 23552 -3399 36781 42188 25254 36207 39418 -9903
13808 -9903 -64476 -74585 -82698 -43179 -33158 -53483 -73422 3468 4698 428 62155 16768
13796 16768 22586 3820 24438 38167 -2979 -43302 -38139 -2218 14553 24136 49314 14659
13784 14659 6454 20772 28503 28129 -18233 -50986 -77905 -29361 28036 41651 48713 61453 68954
13771 68954 52521 66812 91696 24652 -86511 -35172 39480 101306 95666 38187 64938 125042
13759 125042 74630 12176 -5282 6730 49592 32891 46640 79702 75536 8916 -35084 9706
13747 9706 48356 85688 102063 75962 47366 42624 10437 44226 26494 86758 27233 16901
$$ packed form
13832C2516M94J2364l9150q83N9494L2252l1724J1060O1901j1939r0534k2584
13820A3267N6149K369j1371l8622J760k6951M0180N407j6934J0953L211m9321
13808i903n4573j0109q113L9519J0021k0325j9939P6890J230m270O1727m5387
13796A6768N818j8766K0618J3729m1146m0323N163L5921J6771R583K5178l4655
13784A4659q205J4318P731l74m6362l2753k6919M8544N7397J3615P062J2740P501
13771F8954j6433J4291K4884o7044j11163N1339P4652O1826n640n7479K6751O0104
13759A25042n0412o2454j7458J2012M2862j6701J3749L3062m166o6620m4000M4790
13747I706L8650L7332J6375k6101k8596m742l2187L3789j7732O0264n9525j0332
$$ plain form
13735 16901 23093 -7664 -9390 23743 4004 17166 32334 11646 16156 -33486 -48414 -40088
13723 -40088 32024 30647 39524 10813 31009 13709 46810 110116 75273 -34098 -91940 -101991
13711 -101991 -66266 -75177 -148077 -133948 -11413 54237 64342 38445 1802 1023 -42951 -75309
13699 -75309 -49834 -40165 -57796 -101848 -43494 28183 47199 27793 40629 42716 38543 39304 -6980
13686 -6980 16426 47135 32130 4392 22233 56281 57363 62374 84562 41447 -3364 -852
13674 -852 30254 -22517 -21365 -24319 16502 12225 15934 -7836 -50348 -17926 367 -17530 -87350
13661 -87350 -62890 -21811 -2655 -28029 26850 31536 -12566 4983 33908 47219 16826 -42629
13649 -42629 -110733 -88806 -128538 -118306 -105255 -125552 -71225 -50621 31981 93377 85094 80441
$$ packed form
13735A6901O192l0757j726L3133j9739J3162J5168k0688M510m9642j4928Q326
13723d0088P2112j377Q877k8711K0196j7300L3101O3306l4843j09371n7842j0051
13711a01991L5725q911p2900J4129J22535O5650J0105k5897l6643p79m3974l2358
13699g5309K5475R669j7631m4052N8354P1677J9016j9406J2836K087m173P61m6284
13686f980K3406L0709j5005k7738J7841L4048J082N011K2188m3115m4811K512
13674h52L1106n2771J152k954M0821m277L709k3770m2512L2422J8293j7897o9820
13661h7350K4460M1079J9156k5374N4879M686m4102J7549K8925J3311l0393n9455
13649d2629o8104K1927l9732J0232J3051k0297N4327K0604Q2602O1396q283m653
$$ plain form
13637 80441 54723 -35817 -77324 -106053 -101255 -122499 -97832 -56068 -38526 4723 18555 -15240
13625 -15240 -77845 -49050 -50122 -96045 -68080 2101 -5254 -81039 -59451 -36603 -43752 -46170
13613 -46170 -54742 -63582 -43684 -9023 -21551 -14540 16040 -11381 -35439 -26397 8582 146 -49588
13600 -49588 -74563 -50398 -22765 -43560 -28594 28162 96595 55167 -28437 -32725 17924 51887
13588 51887 46906 45374 129550 136958 83589 21129 -2583 18976 37013 28848 -60063 -89836
13576 -89836 -98516 -84108 -40192 9214 7360 -2987 -21403 -501 10777 19373 47234 69657
13564 69657 -3791 -59074 15290 7342 -31297 -24059 -15168 -20322 -57689 -71050 -11677 -2490 -37121
13551 -37121 8388 24052 7184 35188 69349 82086 4204 -43641 -16227 -34971 -31986 -59419
$$ packed form
13637H0441k5718r0540m1507k8729M798k1244K4667M1764J7542M3249J3832l3795
13625a5240o2605K8795j072m5923K7965P0181p355p5785K1588K2848p149k418
13613d6170q572q840J9898L4661j2528P011L0580k7421k4058R042L4979q436m9734
13600d9588k4975K4165K7633k0795J4966N6756O8433m1428q3604m288N0649L3963
13588E1887m981j532Q4176P408n3369o2460k3712K1559J8037q165q8911k9773
13576h9836q680J4408M3916M9406j854j0347j8416K0902J1278Q596K7861K2423
13564F9657p3448n5283P4364p948l8639P238Q891n154l7367j3361N9373R187l4631
13551c7121M5509J5664j6868K8004L4161J2737p7882m7845K7414j8744K985k7433
$$ plain form
13539 -59419 -3430 83339 65522 47929 2711 -51924 -58308 -123734 -119574 -66475 -35433 -37805
13527 -37805 18003 38691 26212 20490 -19731 -20319 46768 96378 79336 47649 26177 -9801
13515 -9801 -55862 -57343 5078 -14263 -29231 -35025 -42526 -35208 43253 101108 72883 44631 17610
13502 17610 43768 72133 90510 127363 72447 26130 43045 -12830 12469 -1525 -30760 -19911
13490 -19911 -45175 -33184 -17573 4581 34051 42435 65896 46937 12219 -562 -17281 20722
13478 20722 -25874 -53906 -79145 -58788 -11981 -2243 -25177 -25697 -83886 -32591 344 9570
13466 9570 -720 -55745 -57205 -612 25863 48518 34978 -14761 -52214 -38673 -32124 -7402
13454 -7402 25262 39986 101285 97863 70857 54857 -3195 -18439 -9091 -39655 -60813 -37700
$$ packed form
13539e9419N5989Q6769j7817j7593m5218n4635o384o5426M160N3099L1042k372
13527c7805N5808K0688j2479n722m0221n88O7087M9610j7042l1687k1472l5978
13515i801m6061j481O2421j9341j4968n794p501P318P8461N7855k8225k8252k7021
13502A7610K6158K8365J8377L6853n4916m6317J6915n5875K5299j3994k9235J0849
13490a9911k5264J1991J5611K2154K9470Q384K3461j8959l4718j2781j6719L8003
13478B0722m6596k8032k5239K0357M6807R738k2934n20n8189N1295L2935R226
13466I570j0290n5025j460N6593K6475K2655j3540m9739l7453J3541O549K4722
13454g402L2664J4724O1299l422k7006j6000n8052j5244R348l0564k1158K3113
$$ plain form
13442 -37700 -10397 5863 -56080 -15932 43692 24869 -2091 20533 25092 17520 79795 68797
13430 68797 17399 33686 26756 9491 -6607 -22785 -46752 -31501 -12968 27356 -5929 -45165
13418 -45165 17349 23845 7354 -74119 -89852 -49876 -42765 -64508 -74240 -67296 -24016 -16620 -28507
13405 -28507 -45747 -48032 12392 42022 65270 -12043 -61562 -100424 -87282 -100413 -66900 -43112
13393 -43112 -40245 -37608 -50562 -96375 -28081 76352 110588 78103 115579 87177 91652 76386
13381 76386 22671 -19072 -26078 -34667 28508 99181 127261 88979 45352 46286 28556 38110 53119
13368 53119 41946 28854 36478 55455 40171 15132 8202 32872 -4830 27291 44991 -4401
13356 -4401 -30108 -11405 -8431 -47831 -70339 -9243 -2355 14445 25347 -3822 -57521 -30452
$$ packed form
13442c7700K7303J6260o1943M0148N9624j8823k6960K2624M559p572O2275j0998
13430F8797n1398J6287o930j7265j6098j6178k3967J5251J8533M0324l3285l9236
13418d5165O2514O496j6491q1473j5733L9976P111k1743r732O944M3280P396j1887
13405b8507j7240k285O0424K9630K3248p7313m9519l8862J3142j3131L3513K3788
13393d3112K867K637j2954m5813O8294J04433L4236l2485L7476k8402M475j5266
13381G6386n3715m1743p006q589O3175P0673K8080l8282m3627R34j7730R554J5009
13368E3119j1173j3092P624J8977j5284k5039o930K4670l7702L2121J7700m9392
13356d401k5707J8703K974l9400k2508O1096O888J6800J0902k9169n3699K7069
$$ plain form
13344 -30452 -26861 -28557 -64991 -48624 -47595 -22092 -12214 -41144 -90506 -74538 -29803 -5655
13332 -5655 -64664 -104945 -40483 17786 -6076 -5645 8897 -13460 -35586 -85451 -52881 -49635
13320 -49635 -88427 -60879 -36267 -37181 -8800 -62008 -132612 -136189 -207713 -179700 -113914 -45633
13308 -45633 -40992 14127 13083 -1473 18251 -5458 -655 8134 33625 81277 23244 -3992
13296 -3992 -28132 -14569 -10584 9902 84399 106945 77304 87582 20935 12904 37020 37645 63227
13283 63227 103848 178803 191070 127506 84104 71554 65647 64717 106123 140187 122471 174545
13271 174545 131720 99340 130586 144776 97910 72797 22568 10304 34515 58996 69483
13260 69483 35855 15788 54891 51391 53184 40188 72857 91008 30116 -42931 -91160 -37854
$$ packed form
13344c0452L591j696l6434J6367J029K5503R878k8930m9362J5968M4735K4148
13332e655n9009m0281O4462N8269k3862M31J4542k2357k2126m9865L2570L246
13320d9635l8792K7548K4612r14K8381n3208p0604l577p1524K8013O5786O8281
13308d5633M641N5119j044j4556J9724k3709M803Q789K5491M7652n8033k7236
13296c992k4140J3563L985K0486P4497K2546k9641J0278o6647q031K4116O25K5582
13283F3227M0621P4955J2267o3564m3402j2550n907r30M1406L4064j7716N2074
13271A74545m2825l2380L1246J4190m6866k5113n0229j2264K4211K4481J0487
13260F9483l3628k0067L9103l500J793j2996L2669J8151o0892p3047m8229N3306
$$ plain form
13248 -37854 19069 64135 32509 -2305 -10572 29433 57995 26138 -3885 14387 38863 35857
13236 35857 12180 15667 23014 17388 16573 5545 -31510 -5177 46836 52148 13726 36673 47926
13223 47926 32310 4953 -41278 -41670 -91254 -77479 -46933 -16151 38180 80689 115640 67647
13211 67647 5030 -37901 -5831 6756 -3252 -31176 -90062 -78602 -51250 -52572 -22152 -22798
13199 -22798 16102 66853 71275 83682 94821 50454 8565 40627 55002 51782 -8456 -19107
13187 -19107 -30718 -84891 -41379 15411 81073 162889 101599 71808 69769 124861 30984 37296
13175 37296 60979 62631 70047 32016 1784 -34561 -46553 -4063 14862 48881 101082 75091
13163 75091 50479 61660 79947 75852 61317 40535 75414 68982 21187 -24198 -50766 22654
$$ packed form
13248c7854N6923M5066l1626l4814q267M0005K8562l1857l0023J8272K4476l006
13236C5857k3677L487P347n626q15j1028l7055K6333N2013N312l8422K2947J1253
13223D7926j5616k7357m6231l92m9584J3775L0546L0782N4331M2509L4951m7993
13211F7647o2617m2931L2070J2587j0008k7924n8886J1460K7352j322L0420o46
13199b2798L8900N0751M422J2407J1139m4367m1889L2062J4375l220o0238j0651
13187a9107j1611n4173M3512N6790O5662Q1816o1290k9791k039N5092r3877O312
13175C7296K3683J652P416l8031l0232l6345j1992M2490J8925L4019N2201k5991
13163G5091k4612J1181J8287m095j4535k0782L4879o432m7795m5385k6568P3420
$$ plain form
13151 22654 9150 29462 78959 94626 94676 58270 2162 -14986 -9805 24133 -819 -24311
13139 -24311 -81932 -91187 -82138 -83971 -116947 -156379 -98361 -30579 -44085 -28854 -29837 -33631 -46755
13126 -46755 -60098 -96273 -133083 -123413 -95444 -70511 -16945 14472 65712 60782 -19017 -64837
13114 -64837 52551 134262 116979 42494 28663 74555 147684 190213 208033 115318 -32389
13103 -32389 -22662 1209 -10750 -33123 50799 65021 29139 51710 68315 81370 116105 113056
13091 113056 14088 -31668 -38513 -11766 19037 31689 77492 31915 33324 42827 4396 -43793
13079 -43793 -70793 -20298 34207 41752 57637 96536 171513 254601 303756 328341 333907 329333
13067 329333 362857 390767 383567 384946 365809 337421 315977 349875 371144 331918 314628 300395
$$ packed form
13151B2654j3504K0312M9497J5667N0l6406n6108j7148N181L3938k4952k3492
13139b4311n7621r255R049j833l2976l9432N8018O7782j3506J5231r83l794j3124
13126d6755j3343l6175l6810R670K7969K4933N3566L1417N1240m930p9799m5820
13114f4837J17388Q1711j7283p4485j3831M5892P3129M2529J7820r2715j47707
13103c2389R727K3871j1959k2373Q3922J4222l5882K2571J6605J3055L4735l049
13091A13056r8968m5756o845K6747L0803J2652M5803m5577J409R503l8431m8189
13079d3793k7000N0495N4505P545J5885L8899P4977Q3088M9155K4585N566m574
13067C29333L3524K7910p200J379j9137k8388k1444L3898K1269l9226j7290j4233
$$ plain form
13055 300395 318991 322968 317876 260044 253381 291849 227057 216126 183093 110296 97925 84622
13043 84622 56483 117143 115011 117804 148394 133965 88467 84403 90015 106940 118820 105933
13031 105933 88246 35274 79306 65735 14124 -39286 -6840 21951 -18951 294 26499
13020 26499 15796 11567 -3804 -2781 9989 8000 -28566 -74916 -83267 -80499 -29745 -4895 -36759
13007 -36759 -36961 7233 13010 2191 40737 81652 105918 115626 36861 47758 31974 22892 5610
12994 5610 2526 12209 102648 150700 92034 56734 -19926 -13363 51687 37724 40007 56076 35458
12981 35458 -35345 -34895 -34241 -67804 -44906 -39815 -82899 -89638 -122856 -115818 -28271 -26118 -33001
12968 -33001 -3052 69321 71090 55033 54690 11723 -22424 -71456 -83121 -83736 -84153 -38772 32746
$$ packed form
13055C00395J8596L977n092n7832o663L8468o4792j0931l3033p2797j2371j3303
13043H4622k8139O0660k132K793L0590j4429m5498m064N612J6925J1880j2887
13031A05933j7687n2972M4032j3571n1611n3410L2446K8791m0902J9245K6205
13020B6499j0703m229j5371J023J2770j989l6566m6350q351K768N0754K4850l1864
13007c6759k02M4194N777j0819L8546M0915K4266R708p8765J0897j5784r082j7282
12994E610l084R683R0439M8052n8666l5300p6660O563O5050j3963K283J6069k0618
12981C5458p0803M50O54l3563K2898N091m3084o739l3218P038Q7547K153o883
12968c3001K9949P2373J769j6057l43m2967l4147m9032j1665o15m17M5381P1518
$$ plain form
12955 32746 35666 -3895 34557 50719 38683 15116 -76126 -88899 -57023 -46856 -52454 -33396
12943 -33396 -27591 -62487 -49271 -34365 23217 59517 38925 49073 33919 -25072 -56324 -77782
12931 -77782 -50665 -70427 -64118 -51648 -92964 -141623 -115836 -38401 1112 -989 -58578 -50267
12919 -50267 5476 -20589 -88038 -44669 69890 97275 24896 32079 29166 10255 -1809 -17518
12907 -17518 -16527 -54822 -65488 -43337 -47881 -16600 -19563 -48704 -33904 -1153 -27697 -29181 -60095
12894 -60095 -131300 -137604 -49214 32912 114565 60438 -22028 -32629 -27133 37289 93396 42641
12882 42641 -40240 -42807 26474 80132 93578 90107 117856 139500 129846 58686 17359 -6200
12870 -6200 -113895 -84826 16755 57441 76951 93549 89992 90179 85945 103313 62842 2884
$$ packed form
12955C2746K920l9561L8452J6162j2036k3567r1242j2773L1876J0167n598J9058
12943c3396N805l4896J3216J4906N7582L6300k0592J0148j5154n8991l1252k1458
12931g7782K7117j9762O309J2470m1316m8659K5787P7435L9513k101n7589Q311
12919e0267N5743k6065o7449M3369J14559K7385p2379P183k913j8911j2064j5709
12907a7518R91l8295j0666K2151m544L1281k963k9141J4800L2751k6544j484l0914
12894f0095p1205o304Q8390Q2126Q1653n4127q2466j0601N496O4422N6107n0755
12882D2641q2881k567O9281N3658J3446l471K7749K1644r654p1160m1327k3559
12870f200j07695K9069J01581M0686J9510J6598l557J87m234J7368m0471n9958
$$ plain form
12858 2884 -48424 -53879 -35351 -69041 -48850 -24603 9735 17193 81478 143888 169408 157510
12846 157510 152782 112917 104913 104339 154378 161374 103052 29956 18460 39457 85035 122004
12834 122004 69727 26317 32548 17094 -36683 -84432 -147871 -131936 -91055 -42972 -44041 -41345
12822 -41345 -58300 -45099 -7043 21254 37810 17137 -7883 -63374 -139332 -163594 -162254 -96781
12810 -96781 -73642 -71099 -56687 -60229 -28022 9486 -43798 -77653 -79213 -88371 -49857 -40722 2935
12797 2935 14431 -4934 -52928 -111291 -86933 29445 45645 85110 87657 69503 29941 1382
12785 1382 -27471 -4354 23034 58920 76246 88936 52479 -28781 -43577 -57530 -53286 -45425
12773 -45425 -64303 -12553 2541 -21259 -78389 -35597 35681 64330 57797 65373 35066 -36797
$$ packed form
12858B884n1308n455J8528l3690K0191K4247L4338P458O4285O2410K5520j1898
12846A57510m728l9865q004n74N0039O996n8322p3096j1496K0997M5578L6969
12834A22004n2277m3410O231j5454n3777m7749o3439J5935M0881M8083j069K696
12822d1345j6955J3201L8056K8297J6556k0673k5020n5491p5958k4262J340O5473
12810i6781K3139K543J4412l542L2207L7508n3284l3855j560r158L8514R135M3657
12797B935J1496j9365m7994n8363K4358J16378J6200L9465K547j8154l9562k8559
12785A382k8853K3117K7388L5886J7326J2690l6457q1260j4796j3953M244P861
12773d5425j8878N1750J5094k3800n7130M2792P1278K8649o533P576l0307p1863
$$ plain form
12761 -36797 -30643 -17791 -47766 -60766 -66225 -31621 64038 85222 37683 74294 106405 64879
12749 64879 56572 26265 -56276 -96918 -115546 -96620 -102205 -67670 -103590 -106006 -104659 -51941
12737 -51941 -53899 -68727 -17272 -51439 -46582 -54576 -52520 -69570 -58203 -40133 275 -35868
12725 -35868 -40457 9539 24134 -17594 5807 -31759 -115310 -77886 -40073 -57663 -44389 72130
12713 72130 79780 50144 77143 90583 114171 175444 150655 107816 51038 -30398 -65367 -32983
12701 -32983 -13074 6156 -31243 -67149 -35484 -13104 6178 19396 -23164 -123081 -193212 -169910
12689 -169910 -30891 41637 43448 16342 20261 -15781 -15622 -54795 -51941 -19191 42837 66766
12677 66766 56022 11840 23677 41976 111668 96593 50769 -4738 -29981 -17655 19100 89144
$$ packed form
12761c6797O154J2852k9975j3000n459L4604R5659K1184m7539L6611L2111m1526
12749F4879q307l0307q2541m0642j8628J8926n585L4535l5920k416J347N2718
12737e1941j958j4828N1455l4167M857p994K056j7050J1367J8070M0408l6143
12725c5868m589M9996J4595m1728K3401l7566q3551L7424L7813j7590J3274J16519
12713G2130P650k9636K6999J3440K3588O1273k4789m2839n6778q1436l4969L2384
12701c2983J9909J9230l7399l5906L1665K2380J9282J3218m2560r9917p0131K3302
12689a69910J39019P2528J811k7106L919l6042J59l9173K854L2750O2028K3929
12677F6766j0744m4182J1837J8299O9692j5075m5824n5507k5243J2326L6755P0044
$$ plain form
12665 89144 101967 92606 50980 48923 97125 34181 12220 33653 31179 -46314 -82739 -392
12653 -392 -5911 -5403 -45318 -75546 9866 22325 46464 44508 11077 -3032 -21423 -41919 -37558
12640 -37558 -1043 -26601 -64466 22180 74493 53939 50988 42097 51948 44750 -1440 -8282 -13717
12627 -13717 -51947 -28402 -13399 10211 30312 41756 76067 84604 115658 52721 4564 3882
12615 3882 -13351 12198 37813 59038 29381 32467 45575 29023 36647 15006 4341 35001
12603 35001 23402 38569 88112 83577 55527 43344 46704 9121 40434 33305 -60595 -61116 -3312
12590 -3312 21620 -12724 -9032 -469 -12661 20671 129 -2107 -9794 -28769 -65843 -62128 -51303
12577 -51303 -51320 -48610 -100785 -64969 -26605 -50085 -39527 2890 20142 -34905 2917 20194
$$ packed form
12665H9144J2823r361m1626k057M8202o2944k1961K1433k474p7493l6425Q2347
12653c92n519N08l9915l0228Q5412J2459K4139j956l3431j4109j8391k0496M361
12640c7558L6515k5558l7865Q6646N2313k0554k951q891R851p198m6190o842n435
12627a3717l8230K3545J5003K3610K0101J1444L4311Q537L1054o2937m8157o82
12615C882j7233K5549K5615K1225k9657L086J3108j6552P624k1641j0665L0660
12603C5001j1599J5167M9543m535k8050j2183L360l7583L1313p129r3900n21N7804
12590c312K4932l4344L692Q563j2192L3332k0542k236p687j8975l7074L715J0825
12577e1303j7K710n2175L5816L8364k3480J0558M2417J7252n5047L7822J7277
$$ plain form
12565 20194 28355 -3106 -27176 -2838 2284 36533 10683 33987 48550 36210 -10785 -24413
12553 -24413 -9204 -73558 -43920 47197 69833 88071 109208 92222 92877 25269 -6043 4163
12541 4163 52970 48298 78628 43721 42485 4671 -27617 -77090 -58650 -19944 72476 77545
12529 77545 57247 38399 18272 78939 87187 67695 47205 30736 35820 66543 37867 11996
12517 11996 2638 18760 27603 -7468 -27755 5189 36633 17796 7184 -11241 -33189 -57058
12505 -57058 -34754 -9534 -13151 -37338 -41366 -13153 -18390 -21656 24316 69425 121432 103394
12493 103394 58429 29025 41777 53971 73393 19852 -77713 -40089 -10903 -44237 -76418
12482 -76418 -45699 7233 44348 17101 -30046 -113220 -125470 -128070 -77691 -39279 -17996 -33560
$$ packed form
12565B0194Q161l1461k4070K4338N122L4249k5850K3304J4563j2340m6995j3628
12553b4413J5209o4354K9638R1117K2636J8238K1137j6986O55o7608l1312J0206
12541D163M8807m672L0330l4907j236l7814l2288m9473J8440L8706R2420N069
12529G7545k0298j8848k0127O0667Q248j9492k0490j6469N084L0723k8676k5871
12517A1996r358J6122Q843l5071k0287L2944L1444j8837j0612j8425k1948k3869
12505e7058K2304K5220l617k4187m028K8213n237l266M5972M5109N2007j8038
12493A03394m4965k9404J2752J2194J9422n3541r7565L7624K9186l3334l2181
12482g6418L0719N2932L7115k7247m7147q3174j2250k600N0379L8412K1283j5564
$$ plain form
12470 -33560 -15463 38976 45908 25457 37899 50710 63323 26191 -3365 6766 -1479 11372
12458 11372 22080 11805 -55550 -53882 29693 79878 79735 84948 33783 -15952 -17714 11630 15956
12445 15956 30383 34611 44174 88266 104093 94783 85119 88687 47736 -4885 -15936 17088 9888
12432 9888 3278 -9770 12061 -4712 -11680 -16219 -2014 23268 -54979 -117923 -44128 30842
12420 30842 556 -18065 -5064 6303 -29160 -58335 -17983 29825 41317 -7829 -27342 28790
12408 28790 12278 15910 36943 10444 -31927 -19081 30598 23987 9797 41538 15527 6312
12396 6312 16161 56270 94523 14354 -25218 30393 -17418 -67840 -88046 -34092 -8500 9928
12384 9928 72949 72177 -8167 28394 32517 90814 97822 20645 -11841 -2315 56320 58268 51339
$$ packed form
12470c3560J8097N4439O932k0451J2442J2811J2613l7132k9556J0131q245J2851
12458A1372J0708j0275o7355J668Q3575N0185j43N213n1165m9735j762K9344M326
12445A5956J4427M228R563M4092J5827r310r664L568m0951n2621j1051L3024p200
12432I888o610j3048K1831j6773o968m539J4205K5282p8247o2944P3795P4970
12420C0842l0286j8621J3001J1367l5463k9175M0352M7808J1492m9146j9513N6132
12408B8790j6512L632K1033k6499m2371J2846M9679o611j4190L1741k6011r215
12396F312R849M0109L8253q0169l9572N5611m7811n0422k0206N3954K5592J8428
12384I928O3021p72q0344L6561M123N8297P008p7177l2486R526N8635J948o929
$$ plain form
12371 51339 48656 19114 75517 61567 76614 87422 54840 26815 18759 35398 70051 72472
12359 72472 10587 18975 1065 -4277 -11432 -10534 -47378 -42072 -28155 -30306 -77864 -28614 -26954
12346 -26954 -16304 33220 40701 28810 12697 -10734 -32492 27420 76702 50677 28206 -43563
12334 -43563 -49377 -18642 -4154 -15522 -47548 -49240 -47852 10694 -6677 -46035 -40508 -37840 -47049
12321 -47049 -10488 25912 -4386 -10504 -35485 -15072 74807 62864 -1721 -216 23547 47008
12309 47008 93009 73927 66997 45743 63670 97015 86017 41985 65881 73990 59974 84379
12297 84379 96247 31693 -40319 -77887 -40930 -8381 -4287 -35303 -48761 -41112 -3421 -1390
12285 -1390 193 -22809 -25710 -27279 -50801 -56341 -40840 -24627 -21988 -4009 2021 -36073 -81337
$$ packed form
12371E1339k683k9542N6403j3950J5047J0808l2582k8025q056J6639L4653K421
12359G2472o1885Q388j7910n342p155Q98l6844N306J3917k151m7558M9250J660
12346b6954J0650M9524P481j1891j6113k3431k1758N9912M9282k6025k2471p1769
12334d3563n814L0735J4488j1368l2026j692J388N8546j7371l9358N527K668r209
12321d7049L6561L6400l0298o118k4981K0413Q9879j1943o4585J505K3763K3461
12309D7008M6001j9082o930k1254J7927L3345j0998m4032K3896Q109j4016K4405
12297H4379J1868o4554p2012l7568L6957L2549M094l1016j3458P649L7691K031
12285a390J583k3002k901j569k3522n540J5501J6213K639J7979O030l8094m5264
$$ plain form
12272 -81337 -83006 -113330 -50193 22941 3269 -7674 12616 -13912 -103331 -97042 -35396 -35324 -34589
12259 -34589 -39746 -7590 -11587 -25495 -8700 5673 19705 46072 -53737 -95588 -44245 -12854
12247 -12854 -56929 -21657 15509 -6091 -58088 -124605 -65276 50219 48854 22663 5563 -20219
12235 -20219 -22487 15347 8088 -6319 20455 36708 -26353 -50895 -33052 -49612 -48406 -16722
12223 -16722 18056 30912 48279 41612 34958 82723 123966 157931 127429 82444 144425 93183
12211 93183 -5051 -29904 -45348 -33469 13587 -7926 12962 3405 31320 68410 43681 -30694
12199 -30694 -26926 -30459 -31143 -62418 -38134 33871 43149 41686 30356 -28662 -44079 -43334 -27538
12186 -27538 -38101 -77931 -61937 -92602 -88848 -73185 -65034 -19864 4570 20929 -55545 -60823
$$ packed form
12272h1337j669l0324O3137P3134j9672j0943K0290k6528q9419O289O1646P2P35
12259c4589n157L2156l997j3908J6795J4373J4032K6367r9809m1851N1343L1391
12247a2854m4075L5272L7166k1600n1997o6517N9329J15495j365k6191j7100k5782
12235b0219k268L7834p259j4407K6774J6253o3061k4542J7843j6560J206L1684
12223a6722L4778J2856J7367o667o654M7765M1243L3965l0502m4985O1981n1242
12211I3183r8234k4853j5444J1879M7056k1513K0888r557K7915L7090k4729p4375
12199c0694L768l533o84l1275K4284P2005R278j463j1330n9018j5417P45J5796
12186b7538j0563l9830J5994l0665L754J5663Q151M5170K4434J6359p6474n278
$$ plain form
12174 -60823 -21351 19643 34066 14471 -37917 -56447 -66372 -59459 -43187 -26945 33914 16219
12162 16219 21301 45985 68401 25718 32204 51985 15720 -34928 4135 33519 8989 -40136
12150 -40136 -97235 -99491 -51637 -60942 -19036 -12066 -30244 26520 35924 6398 22541 1822
12138 1822 -48192 -67129 -46018 -35801 -12691 -3601 -12791 -64158 -32643 -7719 25309 38795
12126 38795 52061 91713 116266 84234 37101 54887 46189 -14401 -34375 -45479 -2250 31552
12114 31552 57897 56393 47764 19258 32789 -51086 -90133 -51326 -24553 -25936 23745 9969
12102 9969 -32080 -57674 -99807 -123098 -132844 -108399 -123372 -107551 -85108 -85221 -104072 -95329 -134702
12089 -134702 -79148 -19198 -19185 -15712 -17100 -28339 -43925 -54895 -19009 17654 -41681 -8754
$$ packed form
12174f0823L9472M0994J4423j9595n2388j8530r925O913J6272J6242O0859j7695
12162A6219N082K4684K2416m2683O486J9781l6265n0648L9063K9384k4530m9125
12150d0136n7099k256M7854r305M1906O970j8178N6764R404k9526J6143k0719
12138A822n0014j8937K1111J0217K3110R090r190n1367L1515K4924L3028J3486
12126C8795J3266L9652K4553l2032m7133J7786q698o0590j9974j1104M3229L3802
12114C1552K6345j504q629k8506J3531q3875l9047L8807K6773j383M9681j3776
12102I969m2049k5594m2133k3291r746K4445j4973J5821K2443j13j8851Q743l9373
12089a34702N5554N9950J3L473j388j1239j5586j0970L5886L6663n9335L2927
$$ plain form
12077 -8754 57917 107871 95757 70507 70233 98505 57558 22798 45854 36293 9022 -31986
12065 -31986 -32629 -25226 -19658 26659 -35978 -76443 -41400 -34277 21746 32458 -36122 -25665 11663
12052 11663 42223 53194 30152 24932 26624 -2898 28011 23510 -47917 -104117 -95402 -35364
12040 -35364 15097 17523 48159 46585 53852 6572 -2161 27762 41948 48208 48045 47768 24124
12027 24124 -22325 -65765 -36006 -7828 -6609 -57200 -68540 -92781 -69972 -208 21204 14056
12015 14056 17911 83116 115101 83950 19459 -40537 -37870 -48636 -86818 -103834 -48991 -47826
12003 -47826 -55303 -23289 -12693 18707 28115 20123 -35381 -88956 -161249 -117412 -125714 -76269
11991 -76269 -34594 14200 -1681 -16479 51586 40415 31946 23109 33455 34829 32953 -12290
$$ packed form
12077h754O6671M9954j2114k5250k74K8272m0947l4760K3056r561k7271m1008
12065c1986o43P403N568M6317o2637m0465L5043P123N6023J0712o8580J0457L7328
12052A1663L0560J0971k3042n220J692k9522L0909m501p1427n6200Q715O0038
12040c5364N0461K426L0636j574P267m7280q733K9923J4186O260j63k77k3644
12027B4124m6449m3440K9759K8178J219n0591j1340k4241K2809O9764K1412p148
12015A4056L855O5205L1985l1151o4491n9996K667j0766l8182j7016N4843J165
12003d7826p477L2014J0596L1400R408p992n5504n3575p2293M3837q302M9445
11991g6269M1675M8794j5881j4798O8065j1171q469q837J0346J374j876m5243
$$ plain form
11979 -12290 -70397 -52036 11776 27362 -435 -24791 32431 78113 -3404 -14040 45414 78815
11967 78815 79114 94882 45976 -65583 -85456 -82829 -92585 -35527 -26234 -11117 -10010 5216 2969
11954 2969 -9566 -43183 -66932 -86030 -78982 -51331 -69423 -66301 -15354 -24727 -44207 -56691
11942 -56691 -32014 -30462 -23738 5710 23256 -2922 -12833 18308 25717 -54471 -80015 -106711
11930 -106711 -84225 -43295 -70112 -102480 -147623 -100242 -57714 -74529 -77435 17325 14999 -13967
11918 -13967 55723 95022 81718 -10096 -45463 -15340 -19629 -98412 -165890 -131625 -120177 -83195
11906 -83195 -3029 46565 74761 62870 82319 51821 -4540 -33815 -61815 -41312 -47066 1637
11894 1637 -38798 -77848 -75267 -41561 -35171 9345 -894 -55118 -58753 -89779 -96295 -133903 -172309
$$ packed form
11979a2290n8107J8361O3812J5586k7797k4356N7222M5682q1517j0636N9454L3401
11967G8815K99J5768m8906j11559j9873K627r756N7058R293J5117J107J5226k247
11954B969j2535l3617k3749j9098P048K7651j8092L122N0947r373j9480j2484
11942e6691K4677J552O724K9448J7546k6178r911L1141P409q0188k5544k6696
11930a06711K2486M0930k6817l2368m5143M7381M2528j6815k906R4760k326k8966
11918a3967O9690L9299j3304r1814l5367L0123m289p8783o7478L4265J1448L6982
11906h3195Q0166M9594K8196j1891J9449l0498n6361k9275k8000K0503n754M8703
11894A637m0435l9050K581L3706O390M4516j0239n4224l635l1026o516l7608l8406
$$ plain form
11881 -172309 -127524 -80455 -84356 -72021 -51636 -730 21266 -28214 -52575 -24601 3405 54355
11869 54355 48591 74086 60483 5828 -28961 -33516 -25410 -1311 45349 94222 82267 7053
11857 7053 -41231 -28482 20721 -14726 -49587 -34899 -34922 -37446 -35016 -79319 -67273 -104918 -127303
11844 -127303 -84189 -27480 -6645 -28807 -21764 21652 27379 27565 -36756 -112361 -101010 -55253
11832 -55253 -37587 -17470 36519 19690 -18699 -20376 -28529 -20439 -16325 -25103 -23957 21144 40708
11819 40708 6770 8135 -29839 -74206 -5402 -28639 -54496 -46572 -68688 -33362 -60231 -92105
11807 -92105 -76211 10980 23417 41552 53239 42665 24853 75499 84586 59373 22243 -7232
11795 -7232 -9687 -37510 -19188 -13608 -73353 -62592 -45397 -54297 -69240 -19095 -2484 -23182
$$ packed form
11881a72309M4785M7069l901J2335K0385N0906K1996m9480k4361K7974K8006N0950
11869E4355n764K5495j3603n4655l4789m555Q106K4099M6660M8873j1955p5214
11857G053m8284J2749M9203l5447l4861J4688k3k524K430m4303J2046l7645k2385
11844a27303M3114N6709K0835k2162P043M3416N727J86o4321p5605J1351M5757
11832e5253J7666K0117N3989j6829l8389j677q153Q090M114q778J146M5101J9564
11819D0708l3938J365l7974m4367O8804k3237k5857P924k2116L5326k6869l1874
11807i2105J5894Q7191J2437J8135J1687j0574j7812N0646R087k5213l7130k9475
11795g232k455k7823J8322N580n9745J0761J7195q900j4943N0145J6611k0698
$$ plain form
11783 -23182 -34877 8748 21438 103740 117747 135539 135925 99069 94882 50658 13689 25574
11771 25574 -11930 80930 118368 46653 -14064 44 20507 48446 21856 23483 52932 8717
11759 8717 -36211 -16241 13392 10458 33069 50829 -20877 -77647 -51369 -20152 6138 18212
11747 18212 8084 56607 50426 61029 46900 26073 80495 98093 40254 -46161 -105058 -88227
11735 -88227 -18062 8146 -14482 -38960 -56575 -37155 -17224 5359 -36326 -1147 16924 -48432
11723 -48432 -14565 44396 38042 -14586 -40835 18878 8651 -36538 -50417 -39531 -58130 -151633
11711 -151633 -191034 -140682 -97599 -67771 -42316 -57140 -60862 -131050 -112135 7792 74902
11700 74902 11875 -43604 -12798 15210 26129 -16505 -111355 -131741 -48106 13926 79773 67677
$$ packed form
11783b3182j1695M3625J2690Q2302J4007J7792L86l6856m187m4224l6969J1885
11771B5574l7504R2860L7438p1715o0717J4108K0463K7939k6590J627K9449m4215
11759H717m4928J9970K9633k934K2611J7760p1706n6770K6278L1217K6290J2074
11747A8212j0128M8523o181J0603j4129k0827N4422J7598n7839q6415n8897J6831
11735h8227P0165K6208k2628k4478j7615J9420J9931K2583m1685L5179J8071o5356
11723d8432L3867N8961o354n2628k6249N9713j0227m5189j3879J0886j8599r3503
11711a51633l9401N0352M3083K9828K5455j4824l722p0188J8915J19927O7110
11700G4902o3027n5479L0806K8008J0919m2634r4850k0386Q3635O2032O5847j2096
$$ plain form
11688 67677 3009 -10719 10539 29307 88981 61338 63628 34848 32772 -49992 -75987 -85027
11676 -85027 -92267 -122562 -105084 -38634 -22208 -67889 -106305 -78145 -1613 -11627 -74441 -71124
11664 -71124 25919 84573 21703 6758 30805 30726 -13224 -18018 -63522 -85274 -39565 -43963 -36235
11651 -36235 -40962 -5778 -20916 -12479 8786 32717 8168 -67804 -48419 120 -20221 -61455
11639 -61455 -90785 -106384 -107311 -40987 -54807 -55056 -44995 -20774 42328 32013 29134 27602 20910
11626 20910 49017 38766 7615 6748 -63430 -79202 -67574 -26651 -56277 -112111 -100781 -9912
11614 -9912 10362 10617 15697 -36584 -72149 -42308 -44848 -22311 -57982 -13877 6683 7167 -13830
11601 -13830 -47379 21686 43178 28109 28162 14621 8239 182 -15878 -24947 33976 129366 135244
$$ packed form
11688F7677o4668j3728K1258J8768N9674k7643K290k8780k076q2764k5995r040
11676h5027p240l0295J7478O6450J6426m5681l8416K8160P6532j0014o2814L317
11664g1124R7043N8654o2870j4945K4047p9m3950m794m5504k1752M5709m398P728
11651c6235m727L5184j5138Q437K1265K3931k4549p5972J9385M8539k0341m1234
11639f1455k9330j5599r27O6324j3820k49J0061K4221O3102j0315k879j532o692
11626B0910K8107j0251l1151q67p0178j5772J1628M0923k9626n5834J1330R0869
11614i912K0274K55N080n2281l5565K9841k540K2537l5671M4105K0560M84k0997
11601a3830l3549O9065K1492j5069N3j3541o382q057j6060r069N8923R5390N878
$$ plain form
11588 135244 117923 90639 44532 12246 -8401 -2680 29132 70930 78721 56095 14834 18418
11576 18418 -6438 3106 19469 44145 45611 58038 75941 69376 57148 11426 -25840 -1383
11564 -1383 -4831 2423 -35809 -47006 -35493 -38903 -94940 -67199 -55052 -51426 16899 71494 21790
11551 21790 4854 46693 70531 -24107 -71889 -100330 -74656 -17548 -26381 -48270 -85120 -52719
11539 -52719 -9218 -74 -8343 -22812 -16490 -53075 -103154 -18557 31642 13466 33040 -17888
11527 -17888 -57597 -17029 55871 70632 35261 42652 -14496 25546 73177 45348 -35456 -62217
11515 -62217 -60400 -45085 -48331 -43135 -68328 -80375 -9790 21700 -16172 -52826 -28953 28838
11503 28838 29349 -2112 -10550 -6689 10406 35296 8333 -19014 -51550 -61816 -84217 -83162 -72750
$$ packed form
11588A35244j7321k7284m6107l2286k0647N721L1812M1798P791k2626m1261L584
11576A8418k4856R544J6363K4676J466J2427J7903o565j2228m5722l7266K4457
11564a383l448P254l8232j1197J1513l410n6037K7741J2147L626O8325N4595m9704
11551B1790j6936M1839K3838r4638m7782k8441K5674N7108q833k1889l6850L2401
11539e2719M3501R144q269j4469O322l6585n0079Q4597N0199j8176J9574n0928
11527a7888l9709M0568P2900J4761l5371P391n7148M0042M7631k7829q0804k6761
11515f2217J817J5315l246N196k5193j2047P0585L1490l7872l6654K3873N7791
11503B8838N11l1461q438L861J7095K4890k6963k7347l2536j0266k2401J055J0412
$$ plain form
11490 -72750 -12624 -16011 -22018 -58338 -64383 -55515 -48183 -73295 -109335 -48489 -14576 21592 26443
11477 26443 -41718 -11311 42372 12466 10687 40929 66709 35760 37020 32262 42564 27055
11465 27055 43737 83293 39832 -5049 -50473 13159 29355 77270 83788 15820 7652 -436
11453 -436 -15016 -33393 -62646 -69664 -28483 433 -10369 -31068 -38914 -15201 -57714 -66013 -29437
11440 -29437 18562 22922 -15936 -55856 -53672 -66424 -57464 -3472 60540 67234 -3377 -505 10795
11427 10795 12255 50709 30970 -53091 -113231 -45235 -50154 -25877 7435 32860 -16682 8082
11415 8082 90222 55965 -20669 -51810 -31474 -20597 15116 67849 82462 74556 69947 18847
11403 18847 -50279 -101766 -82520 -52723 -27721 -26024 -2130 26834 48507 72200 42262 458
$$ packed form
11490g2750O0126l387o007l6320o045Q868P332k5112l6040O0846L3913L6168M851
11477B6443o8161L0407N3683k9906j779L0242K5780l0949J260m758J0302j5509
11465B7055J6682L9556m3461m4881m5424O3632J6196M7915O518o7968q168q088
11453d36j4580j8377k9253p018M1181K8916j0802k0699p846K3713m2513q299L6576
11440b9437M7999M360l8858l9920K184j2752Q960N3992O4012O694p0611K872J1300
11427A0795J460L8454j9739q4061o0140O7996m919K4277L3312K5425m9542K4764
11415H082Q2140l4257p6634l1141K0336J0877L5713N2733J4613p906m609n1100
11403A8847o9126n1487J9246K9797K5002J697K3894K8964K1673K3693k9938m1804
$$ plain form
11391 458 -7558 -42814 -27775 -48977 -32721 -23093 -57983 -33891 -7959 -1295 -32564 -31834 -39050
11378 -39050 -3864 16833 27915 51759 1611 26036 101459 132594 61989 10933 -44350 -43652
11366 -43652 -41221 39719 46086 -426 -9852 3982 25324 62272 65661 27197 -56827 -81118
11354 -81118 -76984 -55964 4953 13436 30891 7155 3090 -17840 -13741 -24717 -13458 20506
11342 20506 8256 13025 3329 37345 16594 -3783 27549 52504 55702 36368 37707 18577
11330 18577 -9310 -25145 -63423 -3104 53591 84380 101191 -14697 -11248 14335 12854 -10139
11318 -10139 -85293 -135696 -59008 -40165 -468 50423 54750 19363 43672 21543 27241 51863
11306 51863 84568 103514 109745 139298 186126 171403 80430 28503 53853 51240 64244 61251
$$ packed form
11391D58q016l5256J5039k1202J6256R628l4890K4092K5932O664l1269P30p216
11378c9050L5186K0697J1082K3844n0148K4425P5423L1135p0605n1056n5283O98
11366d3652K431Q0940O367m6512r426J3834K1342L6948L389l8464q4024k4291
11354h1118M134K1020O0917Q483J7455k3736m065k0930M099j0976J1259L3964
11342B0506j2250M769r696L4016k0751k0377L1332K4955L198j9334J339j9130
11330A8577k7887j5835l8278O0319N6695L0789J6811j15888L449K5583j481k2993
11318a0139p5154n0403P6688J8843L9697N0891M327l5387K4309k2129N698K4622
11306E1863L2705J8946O231K9553M6828j4723r0973n1927K5350k613J3004k993
$$ plain form
11294 61251 55919 39905 42870 20967 -18946 -24958 -18106 -30297 -60208 -35358 -8387 5120
11282 5120 15322 -18290 -13524 -18961 -61134 -11996 7074 2342 -7182 2591 -53638 -66725 -39634
11269 -39634 -80981 -115552 -99232 -134948 -167664 -169877 -137016 -112575 -73986 -47285 -61307 -30294
11257 -30294 64823 87890 65008 14425 -22599 -21104 -26433 19104 11049 -19909 -52645 -39643
11245 -39643 -43645 -99707 -113925 -90738 -121137 -144474 -96342 1173 44551 39424 2682 -8994
11233 -8994 -2360 -44909 -69018 -80223 -104043 -90467 -19248 20715 54345 59511 46428 65410
11221 65410 99607 67625 14001 -63003 -34278 -53232 -71370 -42431 -15239 54815 99660 126393
11209 126393 55737 46440 47505 28393 13662 33810 61661 32666 50675 76775 59076 113642
$$ packed form
11294F1251n332j6014K965k1903l9913o012O852j2191k9911K4850K6971J3507
11282E120J0202l3612M766n437m2173M9138J9070m732r524R773n6229j3087K7091
11269c9634m1347l4571J6320l5716l2716k213L2861K4441L8589K6701j4022L1013
11257c0294R5117K3067k2882n0583l7024J495n329M5537q055l0958l2736J3002
11245c9643m002n6062j4218K3187l0399k3337M8132R7515M3378n127l6742j1676
11233h994O634m2549k4109j1205k3820J3576P1219L9963L3630N166j3083J8982
11221F5410L4197l1982n3624p7004K8725j8954j8138K8939K7192P0054M4845K6733
11209A26393p0656r297J065j9112j4731K0148K7851k8995J8009K6100j7699N4566
$$ plain form
11197 113642 145487 168175 158703 90149 25954 -25748 -67573 -80520 -69124 -41081 26234 8778
11185 8778 -47415 -49298 -10541 29921 32650 26435 41881 49713 49673 25615 -11980 -7180 59356
11172 59356 49703 26434 2013 -22440 -27154 15251 62585 70280 47584 22504 30488 9865
11160 9865 -2171 -31162 -28983 -33086 9976 -13010 -70421 -65001 3352 47487 104574 103966 66064
11147 66064 -4314 7873 20609 8296 24748 -15843 18739 8150 -47026 -16650 23454 -9130
11135 -9130 -20640 8436 32892 56100 96010 100919 64147 -32514 -67344 -11718 -11864 -13592 -16107
11122 -16107 4321 46822 20268 -21040 -2004 8821 -50713 -23429 1041 40125 40889 4296
11110 4296 -46734 -75226 -73306 -66677 -23261 -12876 1020 16978 3078 -19073 2341 19116
$$ packed form
11197A13642L1845K2688r472o8554o4195n1702m1825j2947J1396K8043O7315j7456
11185H778n6193j883L8757M0462K729o215J5446P832m0k4058l7595M800O6536
11172E9356r653k3269k4421k4453m714M2405M7334P695k2696k5080P984k0623
11160I865j2036k8991K179m103M3062k2986n7411N420O8353M4135N7087o08l7902
11147F6064p0378J2187J2736j2313J6452m0591L4582j0589n5176L0376M0104l2584
11135i130j1510K9076K4456K3208L9910M909l6772r6661l4830N5626j46j728k515
11122a6107K0428M2501k6554m1308J9036J0825n9534K7284K4470L9084P64l6593
11110D296n1030k8492J920O629M3416J0385J3896J5958j3900k2151K1414J6775
$$ plain form
11098 19116 -1580 -3747 38934 27387 13893 -17566 19251 106308 89540 43901 18924 -25459
11086 -25459 -80340 -106293 -48754 81048 93668 76007 89132 83768 47647 48981 61014 14425
11074 14425 -24809 -21971 44384 36366 -4664 -76467 -72488 -83303 -72445 -41727 -4705 -14222
11062 -14222 -40464 -56081 -45210 23379 40105 78724 92921 38382 26970 22763 27493 1581
11050 1581 -84620 -77768 -38061 -12681 -37824 -20702 10687 80948 43169 12400 53142 48897
11038 48897 32546 -14938 -49910 -91828 -21440 -19960 -36469 -5524 -8767 -27189 -52403 -28341
11026 -28341 4647 -18187 -3802 19166 53014 114080 61210 55922 55883 30527 25691 22299 -2721
11013 -2721 -28377 -52766 -17619 -18124 -32095 -49962 -34863 -21052 -69750 -37710 22510 69712
$$ packed form
11098A9116k0696k167M2681j1547j3494l1459L6817Q7057j6768m5639k4977m4383
11086b5459n4881k5953N7539J29802J2620j7661J3125n364l6121J334J2033m6589
11074A4425l9234K838O6355q018m1030p1803L979j0815J0858L0718L7022r517
11062a4222k6242j5617J0871O8589J6726L8619J4197n4539j1412m207M730k5912
11050A581q6201O852L9707K5380k5143J7122L1389P0261l7779l0769M0742m245
11038D8897j6351m7484l4972m1918P0388J480j6509L0945l243j8422k5214K4062
11026b8341L2988k2834J4385K2968L3848O1066n2870n288l9k5356m836l392k5020
11013b721k5656k4389L5147n05j3971j7867J5099J3811m8698L2040O0220M7202
$$ plain form
11001 69712 46600 -37785 -63487 -7746 -37609 -34050 -65327 -96167 -82122 -117568 -147785 -92112
10989 -92112 -91652 -59709 36343 48916 2997 3016 -46610 -80221 -26130 15505 -6428 -31684 -28820
10976 -28820 -6770 9239 -21319 -8773 62291 88193 72628 60460 68497 83075 66188 14796
10964 14796 -4451 1768 29547 94631 102027 60905 66785 -22878 -39787 -61210 -25373 -22102
10952 -22102 -23496 -2177 44220 76020 46146 28718 65329 42895 51186 5793 83257 96297
10940 96297 39234 13501 8016 -23422 -9164 -31541 -54094 -32882 -40990 -38088 -41031 -53468
10928 -53468 -68352 -45552 -15882 -2461 19203 21882 58941 65226 49857 92721 80724 77871
10916 77871 109819 61215 30493 10681 38999 43110 118072 143508 143178 98891 29947 -210
$$ packed form
11001F9712k3112q4385k5702N5741k9863L559l1277l0840J4045l5446l0217N5673
10989i2112M60L1943R6052J2573m5919J9m9626l3611N4091M1635k1933k5256K864
10976b8820K2050J6009l0558J2546P1064K5902j5565j2168Q037J4578j6887n1392
10964A4796j9247O219K7779O5084P396m1122N880q9663j6909k1423L5837L271
10952b2102j394K1319M6397L1800k9874j7428L6611k2434Q291m5393P7464J3040
10940I6297n7063k5733n485l1438J4258k2377k2553K1212q108K902k943j2437
10928e3468j4884K2800K9670J3421K1664K679L7059O285j5369M2864j1997k853
10916G7871L1948m8604l0722j9812K8318M111P4962K5436l30m4287o8944l0157
$$ plain form
10904 -210 -39536 -70456 -36662 2947 22232 1647 -23936 -17118 21647 15100 -11493 23316
10892 23316 32413 -21182 -1320 4041 -14046 9210 39037 57659 -34809 -43734 -43303 -23854 -39322
10879 -39322 -30685 6591 16463 -57622 -114811 -47630 36632 52643 43978 17925 4473 -22564
10867 -22564 -56406 -55963 -5958 5393 -48448 -80841 -24992 16625 -18768 -18331 -82625 -96856
10855 -96856 -107243 -67954 37094 6304 20298 46481 39846 1013 -29641 -18254 3563 18688
10843 18688 13045 34802 113131 57032 9195 6781 33132 41051 27304 -29220 -37973 15396
10831 15396 48157 46176 34104 6874 7541 -24660 -42418 -89599 -140706 -100979 -71823 -35803
10819 -35803 -12413 21652 22772 51422 65730 30968 20687 46494 44729 24664 42924 2489
$$ packed form
10904b10l9326l0920L3794L9609J9285k0585k5583O818L8765o547k6593L4809
10892B3316R097n3595J9862N361j8087K3256K9827J8622r2468q925M31J9449j5468
10879c9322Q637L7276R872p4085n7189O7181Q4262J6011q665k6053j3452k7037
10867b2564l3842M43N0005J1351n3841l2393N5849M1617l5393M37o4294j4231
10855i6856j0387L9289J05048l0790J3994K6183o635l8833l0654J1387K1817J5125
10843A8688n643K1757P8329n6099m7837k414K6351P919j3747n6524q753N3369
10831A5396L2761j981j2072k7230O67l2201j7758m7181n1107L9727K9156L6020
10819c5803K3390L4065J120K8650J4308l4762j0281K5807j765k0065J8260m0435
$$ plain form
10807 2489 -60427 -49684 -5192 -4540 -13538 -3386 -9350 9761 26256 -13657 -375 -11509 -43544
10794 -43544 23319 87347 43215 54312 61126 45490 15947 17622 -7854 -23657 -39499 -81329
10782 -81329 -76418 -109489 -101900 -39889 -42912 -39841 -23725 550 72106 89621 78636 4126
10770 4126 -100479 -90240 -78084 -72588 -35954 -19606 -48166 -61308 -9357 -10647 -11589 7042
10758 7042 33884 53338 37377 3691 14580 23106 2880 -23501 15167 19110 -32914 -28220
10746 -28220 -61918 -70228 -50265 -25717 -62822 -101283 -67911 -7603 2605 -2857 -17305 -44806
10734 -44806 -72653 -68839 -41302 -25123 16233 -7502 -34507 -66822 -106728 -114685 -95481 -99963
10722 -99963 -103796 -69814 -51933 -30231 7237 61945 63620 -3587 -18731 -3800 24436 17663
$$ packed form
10807B489o2916J0743M4492O52q998J0152n964J9111J6495l9913J3282j1134l2035
10794d3544O6863O4028m4132J1097O814j5636k9543J675k5476j5803j5842m1830
10782h1329M911l3071P589O2011l023L071J6116K4275P1556J7515j0985p4510
10770D126j04605J0239J2156N496L6634J6348k8560j3142N1951j290r42J8631
10758G042K6842J9454j5961l3686J0889Q526k0226k6381L8668L943n2024M694
10746b8220l3698q310J9963K4548l7105l8461L3372O0308J0208n462j4448k7501
10734d4806k7847L814K7537J6179M1356k3735k7005l2315l9906p957J9204m482
10722i9963l833L3982J7881K1702L7468N4708J675o7207j5144J4931K8236o773
$$ plain form
10710 17663 61063 54321 -9324 -33574 402 20752 18720 62572 160507 179683 104807 -7104
10698 -7104 583 14915 10128 17531 -26294 5161 62335 99351 114098 58235 16623 27659
10686 27659 10888 4392 43262 29502 20518 -28541 -1161 -7248 -35974 -130902 -164717 -105466
10674 -105466 -91421 -134653 -112353 -85293 -104420 -48898 -7921 6505 26430 87769 110045
10663 110045 44426 30139 -29093 -93056 -83612 -52929 -71126 -73762 -62936 -91113 -36916 -2699
10651 -2699 -45086 -70828 -64761 -106867 -149725 -85748 -10590 88106 68909 11699 -119788 -161006
10639 -161006 -101621 -91789 -98573 -88198 -35496 -55445 -90668 -36834 23419 19176 -30798 -82297
10627 -82297 -58905 -85184 -29933 -29036 -61153 -79450 -44105 42025 40576 -427 -24968 -14475
$$ packed form
10710A7663M3400o742o3645k4250L3976K0350k032M3852R7935J9176p4876j11911
10698g104P687J4332m787P403m3825L1455N7174L7016J4747n5863m1612J1036
10686B7659j6771o496L8870j3760q984m9059K7380o087k8726r4928l3815N9251
10674a05466J4045m3232K2300K7060j9127N5522M0977J4426J9925O1339K2276
10663A10045o5619j4287n9232o3963R444L0683j8197k636J0826k8177N4197L4217
10651b699m2387k5742O067m2106m2858O3977P5158R8696j9197n7210j31487m1218
10639a61006N9385R832o784J0375N2702j9949l5223N3834O0253m243m9974n1499
10627h2297K3392k6279N5251Q97l2117j8297L5345Q6130j449m1003k4541J0493
$$ plain form
10615 -14475 -1113 10396 10086 9919 -3035 -49793 -102240 -67713 -95716 -40903 -40573 -63505 -27602
10602 -27602 65361 59162 4523 -63371 -57920 -66947 -88677 -46541 -60159 -75346 -72103 -45702
10590 -45702 -56526 -21199 -2871 14382 1491 18355 24343 26554 -1212 -46145 -95427 -79384
10578 -79384 -48088 -3371 -18797 -6529 19774 41307 85239 35259 -18431 -2225 -33450 -63540
10566 -63540 -76911 -47218 4514 37554 -5702 -66550 -47262 13862 -57269 -11132 24251 8032
10554 8032 11344 -8607 -62113 -77874 -52509 -29930 -30387 -10428 -27623 -53591 -55676 -44065 -17093
10541 -17093 -43947 -29931 7664 -13751 1142 20701 -50357 -63761 37763 4617 -32234
10530 -32234 -17963 5310 10759 -9238 -7522 -15673 -17786 -16146 -50305 -59599 -72696 -92690 -66985
$$ packed form
10615a4475J3362J1509l10j67j2954m6758n2447L4527k8003N4813L30k2932L5903
10602b7602R2963o199n4639o7894N451r027k1730M2136j3618j5187L243K6401
10590d5702j0824L5327J8328J7253j2891J6864N988K211k7766m4933m9282J6043
10578g9384L1296M4717j5426J2268K6303K1533M3932m9980n3690J6206l1225l0090
10566f3540j3371K9693N1732L3040m3256o0848J9288O1124p1131M6137L5383j6219
10554H032L312j9951n3506j5761K5365K2579m57J9959j7195k5968k085J1611K6972
10541a7093k6854J4016L7595k1415J4893J9559p1058j3404J01524l3146l6851
10530c2234J4271K3273N449j9997J716q151k113J640l4159r294j3097j9994K5705
$$ plain form
10517 -66985 -8352 3756 -41895 -59598 -82887 -97838 -60282 -22362 -30174 2772 -13739 -56345
10505 -56345 -32574 5190 17789 -12702 -18299 -89790 -98115 -38036 -10540 -9315 -8165 -18766
10493 -18766 -47137 -29817 -56330 -57228 -24403 16016 -30419 -43820 6083 5430 11854 14991 15517
10480 15517 -49327 -136371 -157411 -137231 -119161 -68533 -49272 -58450 -20555 -2369 -23707 -72644
10468 -72644 -118967 -76072 -72409 -50301 -53107 -5903 750 -13252 -58730 -88461 -79430 -52932
10456 -52932 -51391 -62835 -37122 -30168 -71567 -55496 -28985 -35222 -15786 3882 -9338 -1448
10444 -1448 -11324 20591 25660 16563 21027 4500 -9783 14491 46827 37899 -6742 27552 48372
10431 48372 -20513 -6823 46813 73044 78032 35970 -5990 -67460 -45201 -62553 -25948 52197
$$ packed form
10517f6985N8633J2108m5651j7703k3289j4951L7556L7920p812L2946j6511m2606
10505e6345K3771L7764J2599l0491n597p1491q325O0079K7496J225J150j0601
10493a8766k8371J7320k6513q98L2825M0419m6435j3401M9903o53O424L137N26
10480A5517o4844q7044k1040K0180J8070N0628J9261r178L7895J8186k1338m8937
10468g2644m6323M2895L663K2108k806M7204O653j4002m5478k9731R031K6498
10456e2932J541j1444K5713O954m1399J6071K6511o237J9436J9668j3220P890
10444a448r876L1915N069r097M464j6527j4283K4274L2336q928m4641L4294K0820
10431D8372o8885J3690N3636K6231M988m2062m1960o1470K2259j7352L6605P8145
$$ plain form
10419 52197 58215 48277 60781 -22631 -90899 -17932 27596 -1216 -57386 -84444 -60550 -77127
10407 -77127 -57674 -78446 -82044 -105037 -97868 -62332 -103368 -124811 -158211 -134692 -49385 -24387
10395 -24387 5257 116217 62610 13046 -9418 18195 45217 39106 9397 30281 29666 26260
10383 26260 30179 8355 -1222 7712 38050 44015 40933 74248 96227 83192 17509 -13602 21607
10370 21607 66717 46436 -11276 -12370 18253 -265 59204 56099 20987 6097 60096 49869
10358 49869 3601 -36939 -11017 16669 24631 -7527 -33116 -41231 -89582 -60332 -14578 28373
10346 28373 7615 9910 -45859 -47633 1964 14033 -27693 -1222 19931 -31602 -6895 38979
10334 38979 -1247 -2342 -24448 -60489 -71791 -54207 -84155 -143107 -101093 -67780 -35964 8674
$$ packed form
10419E2197O018r938J2504q3412o8268P2967M5528k8812n6170k7058K3894j6577
10407g7127J9453k0772l598k2993P169L5536m1036k1443l3400K3519Q5307K4998
10395b4387K9644J10960n3607m9564k2464K7613K7022o111k9709K0884o15l406
10383B6260L919k1824r577Q934L0338N965l082L3315K1979j3035o5683l1111L5209
10370B1607M5110k0281n7712j094L0623j8518N9469l105l5112j4890N3999j0227
10358D9869m6268m0540K5922K7686P962l2158k5589q115m8351K9250M5754M2951
10346B8373k0758K295n5769j774M9597J2069m1726K6471K1153n1533K4707M5874
10334C8979m0226j095k2106l6041j1302J7584k9948n8952M2014L3313L1816M4638
$$ plain form
10322 8674 105 -38987 -76206 -38736 14724 101280 121059 31088 82449 98845 129954 72052
10310 72052 24792 -50071 -158074 -154668 -98521 -62552 -63772 -60173 -48936 -56076 -64850 -76149
10298 -76149 -21467 20389 86034 105730 71032 6796 -21453 36243 19820 -28328 -14672 37360
10286 37360 18854 23732 -21553 -60308 -26122 6401 -31912 -9903 11745 37181 61036 89085
10274 89085 24902 -50978 -62210 -40382 -54700 -114138 -107026 -42019 10507 64020 57448 3595
10262 3595 4671 -70974 -61790 -37525 3919 33118 73790 41831 18819 45233 36532 -84712
10250 -84712 -125183 -96454 -89239 -72827 24816 29031 -8678 -16433 -17581 -19774 -29087 -18384 -17312
10237 -17312 -27537 3838 14543 18582 18069 5664 -23489 -62995 -52264 -8704 -28674 -38142
$$ packed form
10322H674q569l9092l7219L7470N3460Q6556J9779q9971N1361J6396L1109n7902
10310G2052m7260p4863j08003L406N6147L5969j220L599J1237p140q774j1299
10298g6149N4682M1856O5645J9696l4698o4236k8249N7696j6423m8148J3656N2032
10286C7360j8506M878m5285l8755L4186L2523l8313K2009K1648K5436K3855K8049
10274H9085o4183p5880j1232K1828j4318n9438P112O5007N2526N3513o572n3853
10262C595J076p5645R184K4265M1444K9199M0672l1959k3012K6414q701j21244
10250h4712m0471K8729P215J6412R7643M215l7709p755j148k193r313J0703J072
10237a7312j0225L1375J0705M039n13j2405k9153l9506J0731M3560j9970r468
$$ plain form
10225 -38142 -53966 -766 -638 -10595 -20205 -76044 -90924 -73780 -70034 -13886 21481 8271 32901
10212 32901 19287 993 -55916 -71746 -9785 47636 62038 68949 -9524 -31381 32901 73867
10200 73867 70351 33968 33403 17291 -869 -28957 -6283 48531 71324 53980 39367 -7329
10188 -7329 -2701 -18237 47418 65030 73976 114211 146979 69015 -35690 -65642 -110307 -125444
10176 -125444 -99149 -119352 -95274 -63426 -20961 -33365 -31076 -67880 -90906 -98656 -128537 -132519
10164 -132519 -91522 -72633 -48529 -8604 -4709 -38663 -1136 29668 38275 4996 -11634 11693
10152 11693 15418 38760 -11257 -110187 -66710 -34255 -16392 28268 65336 48632 -26522 -87368
10140 -87368 -108002 -126080 -103699 -99150 -123086 -128955 -128506 -45484 42391 24654 -619 -76961
$$ packed form
10225c8142j5824N3200J28r957r610n5839j4880J7144L746N6148L5367j3210K4630
10212C2901j3614j8294n6909j5830O1961N7421J4402O911p8473k1857O4282M0966
10200G3867l516l6383n65j6112j8160k8088K2674N4814K2793j7344j4613m6696
10188g329M628j5536O5655J7612Q946M0235L2768p7964j04705k9952m4665j5137
10176a25444K6295k0203K4078L1848M2465j2404K289l6804k3026p750k9881l982
10164a32519M0997J8889K4104L9925L895l3954L7527L0804Q607l3279j6630K3327
10152A1693L725K3342n0017r8930M3477L2455J7863M4660L7068j6704p5154o0846
10140h7368k0634j8078K2381M549k3936n869M49Q3022Q7875j7737k5273p6342
$$ plain form
10128 -76961 -100150 -95005 -44818 -43368 -7514 9974 21878 37188 83191 65786 10284 9705
10116 9705 33807 30919 68241 106738 109152 157772 118437 84847 73761 44822 -16484 -77432
10104 -77432 -75780 -85912 -100068 -138870 -150773 -115177 -47233 -47651 -118384 -123962 -113610 -167006
10092 -167006 -146579 -45407 21686 21856 -41260 -36950 -34867 -7207 35320 75781 80850 88235
10080 88235 49496 -9835 -30733 29539 -23278 -35147 -2774 67570 107026 54282 41744 37574
10068 37574 73267 45251 29547 65710 97812 158590 156591 134142 78992 37415 36987 31751
10056 31751 38187 56550 76181 107252 76515 45609 81591 85497 100676 54988 52852 8012
10044 8012 -33610 -32614 31020 81211 32952 5816 -68199 -52868 13212 -4987 -62070 -68310
$$ packed form
10128g6961k3189N145N0187J450L5854J7488J1904J5310M6003j7405n5502n79
10116I705K4102k888L7322L8497K414M8620l9335l3590j1086k8939o1306o0948
10104g7432J652j0132j4156l8802j1903L5596O7944m18p0733n578J0352n3396
10092a67006K0427J01172O7093J70o3116M310K083K7660M2527M0461N069P385
10080H8235l8739n9331k0898O0272n2817j1869L2373P0344L9456n2744j2538m170
10068C7574L5693k8016j5704L6163L2102O0778j999k2449n5150m1577m28n236
10056C1751O436J8363J9631L1071l0737l0906L5982L906J5179m5688k136m4840
10044H012m1622R96O3634N0191m8259k7136p4015J5331O6080j8199n7083o240
$$ plain form
10032 -68310 -55185 -55523 -55750 -65322 -58990 -39103 -26897 -17725 31435 49498 -21003 -5333 51634
10019 51634 17712 18420 -1482 -2735 -1106 -1308 -3032 8070 23389 29379 12539 33926 45296
10006 45296 20194 -796 -5426 -6481 29729 25137 9760 -6793 -31091 22042 37123 50934
9994 50934 5864 -42136 -91495 -92395 -62780 -21100 -67950 -84615 -26301 26282 13187 -7146
9982 -7146 -10492 -15918 -17455 -8347 23230 25765 72919 65365 27697 41234 41870 -4554 30589 59383
9968 59383 -9795 -30180 -24831 -65726 -63003 -39084 -11508 -14173 -6152 40207 40751 32160 37322
9955 37322 12245 -21011 -16450 -64272 -46993 -27379 24204 22967 20543 -11800 -8167 -27590 -48970
9942 -48970 -55393 -23491 10454 5942 10395 37301 52039 35582 -19961 -176 53741 56044 16763
$$ packed form
10032f8310J3125l38k27r572O332J9887J2206R172M9160J8063p0501J5670N6967
10019E1634l3922P08j9902j253J629k02j724J1102J5319N990j6840K1387J1370
10006D5296k5102k0990m630j055L6210m592j5377j6553k4298N3133J5081J3811
9994E0934m5070m8000m9359r00K9615M1680m6850j6665N8314N2583j3095k0333
9982g146l346n426j537R108L1577K535M7154p554l7668J3537O36m6424L5143K8794
9968E9383o9178k0385N349m0895K723K3919K7576k665Q021M6359N44q591N162
9955C7322k5077l3256M561m7822J7279J9614N1583j237k424l2343L633j9423k1380
9942d8970o423L1902L3945m512M453K6906J4738j6457n5543J9785N3917K303l9281
$$ plain form
9929 16763 12445 6704 -35710 -54986 -79328 -106492 -117335 -92048 -56457 -69769 -91419 -63902
9917 -63902 -62288 -78013 -87451 -124975 -90064 -67056 -45539 -75334 -99218 -125366 -91800 -76239
9905 -76239 -45249 -58650 -22216 -20039 -48652 -94540 -51123 -38986 -54692 -53257 -61475 -35395
9893 -35395 -39688 -84520 -79464 -45890 -78058 -42086 -8578 9263 8168 -32441 14624 35415
9881 35415 -36048 -78047 -86419 -72159 -33254 -26377 -1101 -20483 -68560 -77899 -95804 -79648
9869 -79648 -58758 -33997 12739 5820 16876 8504 -4208 1422 88353 94353 82191 46922 -12084
9856 -12084 -10388 28391 83145 59380 60827 78053 87479 -6347 -89176 -88537 -98891 -58281 10103
9843 10103 75395 66165 23527 23314 70393 99970 91842 63767 47847 25271 34983 73331 56495
$$ packed form
9929A6763m318n741m2414j9276k4342k7164j0843K5287L5591j3312k1650K7517
9917f3902J614j5725r438l7524L4911K3008K1517k9795k3884k6148L3566J5561
9905g6239L0990j3401L6434K177k8613m5888M3417J2137j5706J435q218K6080
9893c5395m293m4832N056L3574l2168L5972L3508J7841j095m0609M7065K0791
9881C5415p1463m1999q372J4260L8905O877K5276j9382m8077r339j7905J6156
9869g9648K0890K4761M6736o919J1056q372j2712N630Q6931O000j2162l5269n9006
9856a2084J696L8779N4754k3765J447J7226R426r3826q2829O39j0354M0610O8384
9843A0103O5292r230m2638k13M7079K9577q128k8075j5920k2576R712L8348j6836
$$ plain form
9830 56495 47736 66070 55520 32973 3537 27078 71724 45154 -2897 -7753 -39044 108
9818 108 37667 48756 31769 25599 40195 32438 34040 71170 -15842 -34677 -17516 -8674 -18666
9805 -18666 -29588 6166 40785 12755 22283 48241 39516 -39559 -28882 -30130 -81868 -72471 -18649
9792 -18649 23362 11051 -11694 -8557 -44899 -87035 -78391 -37338 3748 12615 22997 76578
9780 76578 123568 115412 83672 21570 -7198 -52309 -60318 -68591 -86883 -1643 17427 33290
9768 33290 50209 49560 57237 38060 66772 84628 44632 24485 -18768 -38116 -23798 -43624
9756 -43624 -56053 -73714 -100711 -69939 -57116 -108647 -58261 25725 54468 59559 14379 -52263
9744 -52263 -97352 -95344 -75469 -91762 -94057 -22764 25541 3918 -24077 -62818 -26360 -10679
$$ packed form
9830E6495q759J8334j0550k2547k9436K3541M4646k6570m8051m856l1291L9152
9818A08L7559J1089j6987o170J4596p757J602L7130q7012j8835J7161Q842r992
9805a8666j0922L5754L4619k8030R528K5958q725p9075J0677j248n1738R397N3822
9792a8649M2011j2311k2745L137l6342m2136Q644M1053M1086Q867J0382N3581
9780G6578M6990q156l1740o2102k8768m5111q009q273j8292Q5240J9070J5863
9768C3290J6919o49P677j9177K8712J7856l9996k0147m3253j9348J4318j9826
9756d3624j2429j7661k6997L0772J2823n1531N0386Q3986K8743N091m5180o6642
9744e2263m5089K008J9875j6293k295P1293M8305k1623k7995l8741L6458J5681
$$ plain form
9732 -10679 -30202 -28890 26682 56927 95607 25481 29234 6877 -38955 -17262 2065 26704
9720 26704 51337 80485 36903 14029 4642 54430 83382 55865 72894 73365 59886 -19649
9708 -19649 8245 28102 34326 30730 -23405 22268 7915 -10075 -1916 -9589 3262 54917 42223
9695 42223 9903 13690 28385 34904 8011 9313 57998 127077 112814 72100 33079 -64786
9683 -64786 -75127 -68560 -58313 -71855 -104366 -80080 -98506 -33105 32412 46346 25810 30871
9671 30871 22370 31479 -10292 -36727 74862 29008 -86554 -148646 -140105 -141601 -151254 -124672
9659 -124672 -50370 -3861 -55304 -38297 -1655 -33488 -8043 -1475 -12205 138 -33397 -22367
9647 -22367 -62765 -70412 -79627 -48071 -13324 -9364 -23923 -92373 -100390 -108351 -113702 -89560 -37686
$$ packed form
9732a0679j9523J312N5572L0245L8680p0126L753k2357m5832K1693J9327K4639
9720B6704K4633K9148m3582k2874r387M9788K8952k7517J7029M71j3479p9535
9708a9649K7894J9857O224l596n4135M5673j4353j7990Q159p673J2851N1655j2694
9695D2223l2320L787J4695O519k6893J302M8685O9079j4263m0714l9021r7865
9683f4786j0341O567J0247j3542l2511K4286j8426O5401O5517J3934k0536N061
9671C0871q501R109m1771k6435J11589m5854j15562o2092Q541j496r653K6582
9659a24672P4302M6509n1443J7007L6642l1833K5445O568j0730J2343l3535J1030
9647b2367m0398p647r215L1556L4747L960j4559o8450q017p961n351K4142N1874
$$ plain form
9634 -37686 -29664 -11706 -37323 1698 90650 90122 52571 50913 29278 6964 -13976 45895 33646
9621 33646 12653 -27274 26811 22313 31693 64011 4065 -14749 44644 44369 -19079 -16688 -66781
9608 -66781 -101472 -104817 -97255 -107830 -68794 5445 14592 9904 32962 34246 29485 20794 32718
9595 32718 63516 59517 2302 -23970 -14683 3185 -12870 -42292 29902 -20150 -52329 -14432
9583 -14432 -25050 -12118 629 -17646 -46117 -97692 -71881 -10246 -41078 -17304 19704 1754
9571 1754 61670 40296 28096 56288 84398 69155 39834 70548 96176 29394 -34706 -19253
9559 -19253 36060 58333 82741 106456 125142 187729 126632 27977 43288 44550 30260 51669
9547 51669 -43518 -58069 -50095 -34051 27703 43536 -7653 -19143 2704 -11091 1033 -61120
$$ packed form
9634c7686Q022J7958k5617L9021Q8952n28l7551j658k1635k2314k0940N9871j2249
9621C3646k0993l9927N4085m498R380L2318n9946j8814N9393k75o3448K391n0093
9608f6781l4691l345P562j0575L9036P4239R147m688K3058J284m761q691J1924
9595C2718L0798l999n7215k6272R287J7868j6055k9422P2194n0052l2179L7897
9583a4432j0618J2932J2747j8275k8471n1575K5811O1635l0832K3774L7008j7950
9571A754N9916k1374j2200K8192K8110j5243k9321L0714K5628o6782o4100J5453
9559a9253N5313K2273K4408K3715J8686O2587o1097r8655J5311J262j4290K1409
9547E1669r5187j4551P974J6044O1754J5833n1189j1490K1847j3795J2124o2153
$$ plain form
9535 -61120 -39473 -5753 40171 76623 67251 -1771 -64617 -26328 66216 81536 72028 10779
9523 10779 21457 -6959 4060 49628 18638 -59978 -64479 -16390 -23936 -12127 20843 17916
9511 17916 42377 42833 26626 44398 141348 97293 33454 -2263 -46625 -58524 -33759 -16843
9499 -16843 -13153 23690 65095 77688 -3288 5640 48742 28723 11942 35942 73779 77877
9487 77877 80564 55004 25590 -4003 4898 25506 6431 -50168 -21186 -16833 -62197 -93183
9475 -93183 -104792 -93026 -55993 -23610 -30507 -49236 -131156 -96848 -39839 -28521 -24181 -41064
9463 -41064 -44083 -88795 -123241 -115945 -75872 -53105 -11293 -21998 -30206 36412 34976 48908 41464
9450 41464 13194 -79339 -86665 -62907 -111610 -109805 -69424 -74276 -71065 -56036 -71253 -138308 -57118
$$ packed form
9535f1120K1647L3720M5924L6452r372o9022o2846L8289R2544J5320r508o1249
9523A0779J0678k8416J1019M5568l0990p8616m501M8089p546J1809L2970k927
9511A7916K4461M56j6207J7772R6950m4055o3839l5717m4362j1899K4765J6916
9499a6843L690L6843M1405J2593q0976Q928M3102k0019j6781K4000L7837M098
9487G7877K687k5560k9414k9593Q901K0608j9075n6599K8982M353m5364l0986
9475i3183j1609J1766L7033L2383o897j8729q1920L4308N7009J1318M340j6883
9463d1064l019m4712l4446P296M0073K2767M1812j0705q208O6618j436J3932p444
9450D1464k8270r2533p326K3758m8703J805M0381m852L211J5029j5217o7055Q1190
$$ plain form
9437 -57118 -36599 -23486 -16179 -70974 -90291 -27688 -47729 -48061 -43513 -17874 -18869 -35707 -44796
9424 -44796 -56938 -33805 -87951 -111953 -128193 -74569 -78218 -122315 -118727 -69968 -44055 -79599
9412 -79599 -78115 -79918 -69025 -60208 -23808 -40302 -30346 -2587 20127 -4498 -10038 24083 21855
9399 21855 -79234 -76684 -20715 -51481 -68917 -81839 -67532 -46682 -38406 -84982 -43958 -39435
9387 -39435 -86300 -101786 -60851 -35684 -44148 -55951 -48425 -23907 1983 4883 12433 6358 -1648
9374 -1648 14094 39341 -17235 11110 -41411 -56214 -27656 -72361 -86862 -36406 -9726 20647
9362 20647 -35720 -57729 -65638 -41344 30481 65189 18252 17776 66365 62280 9669 92988 107683
9349 107683 113889 69680 42172 -1175 -16762 -45855 -61656 -57806 -62654 -41942 -15935 -47318
$$ packed form
9437e7118K0519J3113P307n4795j9317O2603k0041l32M548K5639r95j6838r089
9424d4796j2142K3133n4146k4002j6240N3624l649m4097L588M8759K5913l5544
9412g9599J484j803J0893Q817L6400j6494R956K7759K2714k4625n540L4121k228
9399B1855j01089K550N5969l0766j7436j2922J4307K0850Q276m6576M1024M523
9387c9435m6865j5486M0935K5167q464j1803P526K4518K5890K900P550o075q006
9374a648J5742K5247n6576K8345n2521j4803K8558m4705j4501N0456K6680L0373
9362B0647n6367k2009p909K4294P1825L4708m6937m76M8589m085n2611Q3319J4695
9349A07683O206m4209k7508m3347j5587k9093j5801L850m848K0712K6007l1383
$$ plain form
9337 -47318 -4457 -22076 -21326 -52697 -20200 -19114 -54645 -40168 39846 65741 68607 60189 6799
9324 6799 2949 15787 2101 -34045 -45936 -68711 -75484 -68767 -87425 -93533 -63729 30812 77926
9311 77926 97806 79879 75916 59563 32147 -37549 30468 71624 69605 35999 46285 77646
9299 77646 72081 78615 57800 8670 -14772 -76295 -96445 -73090 -56179 -28777 -31048 -91567
9287 -91567 -113587 -92104 -31568 981 31572 50594 84151 111108 103290 27791 -47103 -69967
9275 -69967 -53985 -73096 -100125 -83413 23020 42778 -2887 1780 52497 64239 67563 36380
9263 36380 24567 29466 16087 27222 19772 -20417 -1017 13927 50121 76054 67530 38657
9251 38657 -23823 -95620 -124374 -84153 -75879 -69014 -23013 7610 -29923 12905 6552 16081 -36581
$$ packed form
9337d7318M2861j7619P50l1371L2497J086l5531J4477Q0014K5895K866q418n3390
9324F799l850J2838j3686l6146j1891k2775o773O717j8658o108K9804R4541M7114
9311G7926J9880j7927l963j6353k7416o9696O8017M1156k019l3606J0286L1361
9299G7646n565O534k0815m9130k3442o1523k0150K3355J6911K7402k271o0519
9287i1567k2020K1483O0536L2549L0591J9022L3557K6957p818p5499p4894k2864
9275f9967J5982j9111k7029J6712J06433J9758m5665M667N0717J1742L324l1183
9263C6380j1813M899j3379J1135p450m0189J9400J4944L6194K5933q524k8873
9251C8657o2480p1797k8754M0221Q274O865M6001L0623l7533M2828o353R529n2662
$$ plain form
9238 -36581 -56406 12844 58956 60898 65750 40644 -5284 12311 58921 21642 -3307 -49461
9226 -49461 -54102 -22115 -50565 -51037 -61246 -49498 -505 78431 125315 89525 81638 76289 52407
9213 52407 53487 46362 2737 -33670 -73661 -33439 -45573 -38811 -52392 -85933 -39809 8867
9201 8867 67301 48502 76265 46699 21776 62615 91379 9143 -20259 11034 10217 61118
9189 61118 114539 128921 37402 61803 113728 111928 75199 50922 48634 4923 34590 13992
9177 13992 -28546 -3132 16622 14307 13037 -38816 -5440 87743 109449 40710 -18511 45542
9165 45542 89141 144192 139446 131836 47028 -60889 -84798 -115243 -79012 2913 30195 -7544
9153 -7544 -15333 -23085 13865 72384 85525 82083 93145 33208 -9369 -8945 -80382 -108912 -49607
$$ packed form
9238c6581j9825O9250M6112J942M852k5106m5928J7595M6610l7279k4949m6154
9226d9461m641L1987k8450m72j0209J1748M8993P8936M6884l5790p887n349k3882
9213E2407J080p125m3625l6407l9991M0222j2134O762j3581l3541M6124M8676
9201H867N8434j8799K7763k9566k4923M0839K8764q2236k9402L1293q17N0901
9189F1118N3421J4382r1519K4401N1925j800l6729k4277k288m3711K9667k0598
9177A3992m2538K5414J9754k315j270n1853L3376R3183K1706o8739n9221O4053
9165D5542M3599N5051m746p610q4808j07917k3909l0445L6231Q1925K7282l7739
9153g544p789p752L6950N8519J3141l442J1062n9937m2577M24p1437k8530N9305
$$ plain form
9140 -49607 -17960 8725 -19490 3538 24088 37975 63122 74891 87764 88688 62183 14075
9128 14075 50892 89483 74651 136864 163998 174744 165147 126816 60388 58308 16583 46662
9116 46662 77716 96893 144569 85165 67464 45023 47081 69466 103686 116923 89566 58413
9104 58413 119984 101400 5792 6809 76164 93761 82528 76041 52599 57611 81489 80213 134232
9091 134232 216383 260841 275052 328831 376617 349298 304272 334493 330166 345264 357486 431048
9079 431048 521972 559892 594992 714809 905313 1026216 1149350 1274544 1434342 1676751
9069 1676751 2005103 2408369 2937190 3833260 5259893 7361161 10174785 13512900 16514625
9060 16514625 18968084 21340874 23967272 25968398 24981116 20794253 15955912 12136774
$$ packed form
9140d9607L1647K6685k8215K3028K0550J3887K5147J1769J2873R24k6505m8108
9128A4075L6817L8591j4832O2213K7134J0746r597l8331o6428k080m1725L0079
9116D6662L1054J9177M7676n9404j7701k2441K058K2385L4220J3237k7357l1153
9104E8413O1571j8584r5608J017O9355J7597j1233o487k3442N012K3878j276N4019
9091A34232Q2151M4458J4211N3779M7786k7319m5026L0221m327J5098J2222P3562
9079D31048R0924L7920L5100J19817J90504J20903J23134J25194J59798K42409
9069A676751L28352M03266N28821Q96070J426633K101268K813624L338115L001725
9060A6514625K453459K372790K626398K001126r87282m186863m838341l819138
$$ plain form
9052 12136774 9472064 7657173 6295245 5322178 4549486 3960484 3507247 3139547 2823667
9043 2823667 2600462 2425359 2320200 2267574 2221014 2115789 1995670 1930792 1854522 1790220
9033 1790220 1705642 1643010 1620602 1606550 1560592 1459897 1410046 1360396 1253107 1155105 1091469
9022 1091469 1109709 1106681 992159 891391 829964 778793 833976 790614 697470 660475 646518
9011 646518 619858 620334 618707 590483 570064 563157 559470 549857 522254 544094 500122 386151 364098
8998 364098 388593 429401 413980 405912 363844 328344 380560 395924 401898 346647 295730 303624
8986 303624 337882 321282 270141 306208 310145 305452 284379 237074 248558 284687 308940 306447
$$ packed form
9052A2136774k664710j814891j361928r73067p72692n89002m53237l67700l15880
9043B823667k23205j75103j05159n2626m6560j05225j20119o4878p6270o4302
9033A790220q4578o2632k2408j4052m5958j00695m9851m9650j07289r8002o3636
9022A091469J8240l028j14522j00768o1427n1171N5183m3362r3144l6995j3957
9011F46518k6660M76j627k8224k0419o907l687r613k7603K1840m3972j13971k2053
8998C64098K4495M0808j5421q068m2068l5500N2216J5364N974n5251n0917P894
8986C03624L4258j6600n1141L6067L937m693k1073m7305J1484L6129K4253k493
$$ [...]
##END NTUPLES=NMR SPECTRUM
##END=
