##TITLE=Analysis number 327914
Compound Code cc 49604
Book Reference 528/22
Project Code adrs
Chemist Name davee
##JCAMPDX= 6.0         $$ Bruker NMR JCAMP-DX V2.0
##DATA TYPE= NMR SPECTRUM
##DATA CLASS= NTUPLES
##ORIGIN= Bruker BioSpin GmbH
##OWNER= nmr
$$ XWIN-NMR		Version 3.5
$$ Wed Apr 18 11:40:50 2007 GMT Daylight Time (UT+1h)  MAYBRIDGE\nmr@NMR_250MHZ
##.OBSERVE FREQUENCY= 250.131544655141
##.OBSERVE NUCLEUS= ^1H
##.ACQUISITION MODE= SIMULTANEOUS (DQD)
##.ACQUISITION SCHEME= undefined
##.AVERAGES= 16
##.DIGITISER RES= 18
##SPECTROMETER/DATA SYSTEM= dpx250
##.PULSE SEQUENCE= zg30
##.SOLVENT NAME= CDCl3
##.SHIFT REFERENCE= (INTERNAL, CDCl3, 0, 16.4577)
##AUDIT TRAIL= $$ (NUMBER, WHEN, WHO, WHERE, WHAT)
$$ ##TITLE= Audit trail, XWIN-NMR		Version 3.5
$$ ##JCAMPDX= 5.01
$$ ##ORIGIN= Bruker BioSpin GmbH
$$ ##OWNER= nmr
$$ C:\u/data/dgb/nmr/ADRS/1630/pdata/1/auditp.txt
$$ ##AUDIT TRAIL=  $$ (NUMBER, WHEN, WHO, WHERE, WHAT)
(   1,<2007-04-18 11:40:15.40 +100>,<MAYBRIDGE\nmr>,<NMR_250MHZ>,
      <created by zg, POWCHK disabled, PULCHK disabled
       configuration hash MD5:
       49 4B E0 1D 92 C2 6B 37 9F E6 65 BC 52 41 86 1D
       data hash MD5: 64K
       35 10 6D 0E 97 C0 27 EA DD CC CE 3F 1D 21 CC 34>)
(   2,<2007-04-18 11:40:32.66 +100>,<MAYBRIDGE\nmr>,<NMR_250MHZ>,
      <Start of raw data processing
       ef LB = 0.3 FT_mod = 6 PKNL = 1 SI = 32K 
       data hash MD5: 32K
       85 FD A9 43 0A C9 CD 44 7F CE E1 68 8A 65 E1 E5>)
(   3,<2007-04-18 11:40:37.68 +100>,<MAYBRIDGE\nmr>,<NMR_250MHZ>,
      <apk 
       data hash MD5: 32K
       93 EB FC 77 6A 4D FE B5 CD 9A D8 6D F9 65 E0 42>)
(   4,<2007-04-18 11:40:39.11 +100>,<MAYBRIDGE\nmr>,<NMR_250MHZ>,
      <abs ABSG = 5 
       data hash MD5: 32K
       D2 96 65 4F 0E 23 B2 2B 6A B7 D2 66 4E 2E A8 F1>)
$$ ##END=
$$ 
$$ hash MD5
$$ 57 EA 31 87 01 61 0A C9 B3 C9 F3 0B 51 BD 44 08
##$RELAX= 
##$RELAX= 
##$RELAX= 
##$RELAX= 
##$RELAX= 
##$RELAX= 
##$RELAX= 
$$ Bruker specific parameters
$$ --------------------------
##$DU= <C:\u>
##$EXPNO= 1630
##$NAME= <ADRS>
##$PROCNO= 1
##$TYPE= <nmr>
##$USER= <dgb>
##$AMP= (0..31)
100 100 100 100 100 100 100 100 100 100 100 100 100 100 100 100 100 100 
100 100 100 100 100 100 100 100 100 100 100 100 100 100 
##$AQSEQ= 0
##$AQ_mod= 3
##$AUNM= <au_zg>
##$AUTOPOS= <11 >
##$BF1= 250.13
##$BF2= 250.13
##$BF3= 250.13
##$BF4= 250.13
##$BF5= 500.13
##$BF6= 500.13
##$BF7= 500.13
##$BF8= 500.13
##$BYTORDA= 1
##$CFDGTYP= 0
##$CFRGTYP= 5
##$CHEMSTR= <none>
##$CNST= (0..31)
1 1 145 1 1 1 1 1 1 1 1 1 1 1 1 1 1 1 1 1 1 1 1 1 1 1 1 1 1 1 1 1 
##$CPDPRG= <>
##$CPDPRG1= <>
##$CPDPRG2= <>
##$CPDPRG3= <>
##$CPDPRG4= <mlev>
##$CPDPRG5= <mlev>
##$CPDPRG6= <mlev>
##$CPDPRG7= <mlev>
##$CPDPRG8= <mlev>
##$CPDPRGB= <>
##$CPDPRGT= <>
##$D= (0..31)
0 1 0 0 0 0 0 0 0 0.06 0 0 0 0 0 0 0.0002 0 0 0 0 0 0 0 0 0 0 0 0 0 0 
0 
##$DATE= 1176892813
##$DBL= (0..7)
120 120 120 120 120 120 120 120 
##$DBP= (0..7)
150 150 150 150 150 150 150 150 
##$DBP07= 0
##$DBPNAM0= <>
##$DBPNAM1= <>
$$ [...]
##$SUBNAM7= <"">
##$SUBNAM8= <"">
##$SUBNAM9= <"">
##$SW= 20.6930455092707
##$SWIBOX= (0..15)
0 0 3 0 0 0 0 0 0 0 0 0 0 0 0 0 
##$SW_h= 5175.983436853
##$TD= 65536
##$TD0= 1
##$TE= 683.16
##$TE2= 300
##$TE3= 300
##$TEG= 300
##$TL= (0..7)
0 120 120 120 120 120 120 120 
##$TP= (0..7)
150 150 150 150 150 150 150 150 
##$TP07= 0
##$TPNAME0= <>
##$TPNAME1= <>
##$TPNAME2= <>
##$TPNAME3= <>
##$TPNAME4= <>
##$TPNAME5= <>
##$TPNAME6= <>
##$TPNAME7= <>
##$TPOAL= (0..7)
0.5 0.5 0.5 0.5 0.5 0.5 0.5 0.5 
##$TPOFFS= (0..7)
0 0 0 0 0 0 0 0 
##$TUNHIN= 0
##$TUNHOUT= 0
##$TUNXOUT= 0
##$USERA1= <user>
##$USERA2= <user>
##$USERA3= <user>
##$USERA4= <user>
##$USERA5= <user>
##$V9= 5
##$VALIST= <valist>
##$VCLIST= <CCCCCCCCCCCCCCC>
##$VD= 0
##$VDLIST= <DDDDDDDDDDDDDDD>
##$VPLIST= <PPPPPPPPPPPPPPP>
##$VTLIST= <TTTTTTTTTTTTTTT>
##$WBST= 1024
##$WBSW= 4
##$XGAIN= (0..3)
0 0 0 0 
##$XL= 0
##$YL= 0
##$YMAX_a= 365587
##$YMIN_a= -392995
##$ZGOPTNS= <>
##$ZL1= 120
##$ZL2= 120
##$ZL3= 120
##$ZL4= 120
##$ABSF1= 16.45767
##$ABSF2= -4.235502
##$ABSG= 5
##$ABSL= 3
##$ALPHA= 0
##$AQORDER= 0
##$ASSFAC= 0
##$ASSFACI= 0
##$ASSFACX= 0
##$ASSWID= 0
##$AUNMP= <proc_1d>
##$AZFE= 0.1
##$AZFW= 0.1
##$BCFW= 0
##$BC_mod= 0
##$BYTORDP= 0
##$COROFFS= 0
##$CY= 12.5
##$DATMOD= 1
##$DC= 0
##$DFILT= <>
##$DTYPP= 0
##$F1P= 14.0000005364418
##$F2P= -0.99999901652339
##$FCOR= 0.5
##$FTSIZE= 32768
##$FT_mod= 6
##$GAMMA= 0
##$GB= 0
##$INTBC= 1
##$INTSCL= 1
##$ISEN= 128
##$LB= 0.3
##$LEV0= 0
##$LPBIN= 0
##$MAXI= 10000
##$MC2= 0
##$MEAN= 0
##$ME_mod= 0
##$MI= 0
##$NCOEF= 0
##$NC_proc= -2
##$NLEV= 6
##$NOISF1= 0
##$NOISF2= 0
##$NSP= 0
##$NTH_PI= 0
##$NZP= 0
##$OFFSET= 16.45767
##$PC= 1
##$PHC0= 231.6149
##$PHC1= 4.631646
##$PH_mod= 1
##$PKNL= yes
##$PPARMOD= 0
##$PSCAL= 4
##$PSIGN= 0
##$REVERSE= no
##$SF= 250.130016090518
##$SI= 32768
##$SIGF1= 0
##$SIGF2= 0
##$SINO= 400
##$SIOLD= 32768
##$SREGLST= <1H.CDCl3>
##$SSB= 0
##$STSI= 32768
##$STSR= 0
##$SW_p= 5175.98343685301
##$SYMM= 0
##$S_DEV= 0
##$TDeff= 65536
##$TDoff= 0
##$TI= <Analysis number 999999
Compound Code 99
Book Reference 9
Project Code 9>
##$TILT= no
##$TM1= 0
##$TM2= 0
##$TOPLEV= 0
##$USERP1= <user>
##$USERP2= <user>
##$USERP3= <user>
##$USERP4= <user>
##$USERP5= <user>
##$WDW= 1
##$XDIM= 32768
##$YMAX_p= 385199445
##$YMIN_p= -411244
$$ End of Bruker specific parameters
$$ ---------------------------------
##NTUPLES= NMR SPECTRUM
##VAR_NAME=  FREQUENCY,     SPECTRUM/REAL,   SPECTRUM/IMAG
##SYMBOL=    X,             R,               I
##VAR_TYPE=  INDEPENDENT,   DEPENDENT,       DEPENDENT
##VAR_FORM=  AFFN,          ASDF,            ASDF
##VAR_DIM=   32768,         32768,           32768
##UNITS=     HZ,            ARBITRARY UNITS, ARBITRARY UNITS
##FACTOR=    0.157963299565203, 1,           1
##FIRST=     4116.55731488797, 0,            0
##LAST=      -1059.42612196504, 0,           0
##MIN=       -1059.42612196504, -411244,     0
##MAX=       4116.55731488797, 385199445,    0
$$ Real data points
##PAGE= N=1
##DATA TABLE= (X++(R..R)), XYDATA
$$ [...]
##PAGE= N=2
##DATA TABLE= (X++(I..I)), XYDATA
16312c22669R317J0575J648J784Q836j75r564K56k222l10J955j405J988O184K710
16297b91092j688k453k089l384k523r51K723n461n364N451Q183L385k573n259
16283c03095J876O62o151J398L671L5M08O705o569n863L363K189M249k582J104
16268b98600M538J504n4m697k091k095J720K477l071N058P78m575M371O9n116
16253b99784m350j181O165O295Q207M027k524M275j06p714l006m505n2J462o420
16238b99211J027M738K19J261r56K589P010Q047k300K013N671M184j0553l434
16224b79695L867P172L550o351R09m596r964n079k641J396O620M819L212M14M73
16209b75894l069r50Q7j0887P67O8K544O998K68R72n313n301l324Q619o836O372
$$ y = [-322669, -313352, -302777, -301129, -299345, -290509, -290684, -300248, -299992, -302214, -302524, -300569, -301974, -299986, -293802, -291092, -292780, -295233, -297322, -300706, -303229, -304180, -301457, -306918, -312282, -306831, -298648, -295263, -297836, -303095, -301219, -300557, -306708, -305310, -301639, -301604, -301196, -294491, -301060, -306923, -303560, -301371, -297122, -299704, -298600, -294062, -292558, -292612, -297309, -299400, -301495, -299775, -297298, -300369, -295311, -294533, -299108, -294737, -294668, -299784, -304134, -305315, -299150, -292855, -284648, -280621, -283145, -278870, -278976, -286690, -289696, -294201, -294253, -292791, -299211, -298184, -293446, -293227, -291966, -292922, -290333, -283323, -275276, -277576, -275563, -269892, -265708, -276261, -279695, -275828, -268656, -265106, -271457, -270548, -275144, -285108, -290187, -292828, -291432, -284812, -279993, -276781, -276367, -275894, -278963, -279913, -279826, -290713, -289946, -289878, -287334, -280336, -280068, -279096, -284409, -289710, -293034, -284415, -291251, -284879]
16193b84879O377L792j137l996P390k465q034m337J387M359j974j869M643l599
16179b84342J410K157m442m278N004K460k051P200K431m688m671j999o850J103
16165b91556P446N332P68K169K591M864K119J641k16k661m779m976j634P13j437
16150b79616K683O880K54n562j181J826J300J054j450K103K572q61l677L57J878
16135b71440l747M009P118k184p257p378j108P297L606L385M218J349J757j7o374
16120b66766j470L2j028q781L196O398J998n329m70O679J543K756k559j456r750
16105b75007l129J995m597j596M876J0783L732N777j650j2397j476P839L349n343
16091b66844J622k166L439N848l291j163J67K781J983J341J905n323o383R108
$$ y = [-284879, -278502, -274710, -275847, -279843, -272453, -274918, -282952, -287289, -285902, -281543, -283517, -285386, -280743, -284342, -282932, -280775, -285217, -289495, -284491, -282031, -284082, -276882, -274451, -279139, -283810, -285809, -292659, -291556, -284110, -278778, -278010, -275841, -273250, -268386, -266267, -264626, -264842, -267503, -272282, -277258, -278892, -278179, -279616, -276933, -270053, -269799, -275361, -276542, -274716, -273416, -272362, -273812, -271709, -269137, -269998, -273675, -273318, -271440, -275187, -271178, -264060, -266244, -273501, -280879, -281987, -274690, -271084, -267699, -263481, -262132, -260375, -260392, -266766, -268236, -268204, -269232, -278013, -274817, -268419, -266421, -271750, -272220, -265541, -263998, -261242, -263801, -265257, -275007, -278136, -276141, -280738, -282334, -277458, -266675, -262943, -257166, -258816, -271213, -272689, -264850, -261501, -266844, -265222, -267388, -263949, -258101, -261392, -262555, -262388, -259607, -257624, -256283, -254378, -259701, -266084, -256976]
16077b56976J572k652l924m906K828n554K151k267L307L975P225n01k899N531
16063b53090K471l286p971j976J153n6k58K069o52o627j23R699N447j486k337
16048b57023J124k801r323J498J1715k612j517j264k249J547K472k048j604m296
16034b66381j617R59j90J079O038m986k80R096N969K435l788p408L866L304l119
16019b55023M372J140j47n62o531J873M572N063k437k629m417j831J985M895J3416
16004b36261L355L23o270k778O904N65l161K157O097n093n218n266j241O137k766
15989b42516O76k740R6k469p409M139P386O048j206Q5N032Q51r7n935j606o96
15973b40361Q88Q31o42L699p67J587l288m214o41q583k772M909P479m888L188
$$ y = [-256976, -255404, -258056, -261980, -266886, -264058, -269612, -267461, -269728, -266421, -262446, -255221, -255722, -258621, -253090, -250619, -253905, -261876, -263852, -262699, -262755, -263013, -260944, -261596, -268223, -268346, -258647, -253200, -254686, -257023, -255899, -258700, -268023, -266525, -254810, -257422, -258939, -260203, -262452, -260905, -258433, -260481, -262085, -266381, -267998, -267039, -267229, -266150, -260112, -265098, -265378, -256282, -250313, -247878, -251666, -259074, -255208, -251904, -255023, -250651, -249511, -249658, -250220, -256751, -254878, -250306, -245243, -247680, -250309, -254726, -256557, -254572, -249677, -236261, -232906, -232583, -238853, -241631, -234727, -234162, -237323, -235166, -229069, -234162, -239380, -244646, -245887, -239750, -242516, -241840, -244580, -244484, -246953, -254362, -250223, -242837, -236789, -237995, -237910, -232878, -232027, -232124, -238059, -239665, -240361, -239473, -238642, -239284, -235585, -236352, -234765, -238053, -242267, -242908, -251491, -254263, -249354, -241875, -246763, -243575]
15958b43575M254K052r06j056p2n869q380J821K947m378p25K502M503N155l636
15943b45363J984N534M83M65o26l989K461L417K007J917k820L837J295o985j349
15928b37732L695L568L150j0437k618p52k74N543J0152k9k276o948j1873l11p71
15913b47913O57J494J038J990J128J807J08m506O208O184l507r570j32q45N620
15898b40239R278K909o021J552J563l344O30O59P243K808L264m699p962K286J901
15883b28172m703N158L429M264l644N512L318l721K092l573q45l621j0583M12
15869b34677P262O461P002N252n584p231L347O743N417k20j5414m171k91k964
15855b29068j017N467L099q56l78K934K029n21K851l711r76k039k950p003P050
$$ y = [-243575, -239321, -237269, -238175, -239231, -239303, -245172, -253552, -251731, -248784, -253162, -253887, -251385, -246882, -241727, -245363, -243379, -237845, -237362, -236897, -237523, -241512, -239051, -235634, -233627, -231710, -234530, -230693, -229398, -236383, -237732, -234037, -230469, -227319, -237756, -240374, -241126, -241400, -235857, -225705, -225734, -228010, -234958, -246831, -247142, -247913, -247256, -245762, -244724, -242734, -241606, -239799, -239691, -244197, -237989, -231805, -235312, -244882, -245014, -245859, -240239, -230961, -228052, -234073, -232521, -230958, -234302, -233672, -233013, -225770, -222962, -219698, -224397, -232359, -230073, -228172, -232875, -227717, -224288, -220024, -223668, -218156, -214838, -218559, -216467, -220040, -220885, -224506, -235089, -234677, -227415, -220954, -213952, -208700, -214284, -221515, -218168, -211425, -206008, -206228, -221642, -225813, -226104, -229068, -230085, -224618, -221519, -222375, -222753, -219819, -217790, -218311, -215460, -219171, -220147, -222186, -225136, -232139, -225089]
15840b25089O087p291l430j497Q83N006M590L591J185o898r973k706L820O190
15826b25532m055m8N146O641l120m646j185K578m79l694R04O24m93M357Q95M210
15810b17897K446j389L208p62l926n588R36R439L332j501p75J818j846M441m711
15795b12775m074l696o31N421K420m05O963j502k594L570k573m429j1898n950
15781b32153M244M072M39o55j5M409jM835J1307K004o601O13n265l977K236K388
15765b12120m093N483m088Q47o69l89Q76N87k952Q20P86Q19p20P327N929n286
15749b06843r445l317Q60L585q81K95k51r52n43k173P507M143j67m692o422J332
15733b17964N616Q811O356k219q467n943N984M690n207j183l487j883L733O73
$$ y = [-225089, -219002, -226293, -229723, -231220, -230337, -225331, -220741, -217150, -215965, -222863, -232836, -235542, -231722, -225532, -229587, -229635, -224489, -217848, -220968, -225614, -226799, -224221, -224700, -228394, -227490, -226866, -227359, -223002, -222107, -217897, -215451, -216840, -213632, -214394, -218320, -223908, -222972, -213533, -210201, -211702, -212477, -210659, -212505, -208064, -212775, -216849, -220545, -221176, -215755, -213335, -213740, -206777, -208279, -210873, -207303, -209876, -214305, -226203, -232153, -227909, -223837, -223398, -224053, -224068, -219659, -219660, -214825, -203518, -201514, -208115, -207502, -212767, -216744, -214508, -212120, -216213, -210730, -214818, -213971, -214640, -215029, -214153, -213566, -216518, -215698, -214912, -214093, -214813, -207486, -201557, -206843, -216288, -219605, -218745, -215160, -216041, -215746, -215997, -216949, -217492, -219665, -212158, -208015, -208182, -212874, -219296, -217964, -212348, -203537, -197181, -199400, -207867, -213810, -207826, -203136, -208343, -209526, -213013, -214896, -211163, -210490]
15719b10490k535L467k659q06j3089K38N311N674R084N391M494O439k196l723
15705a95400O27m303k866mk746l092M768N148J625K029k403m005P25R98k088O440
15689a94547k670l276j820J450p240k452m305O966P283N62L046k524o945L01J1472
15674a94699J679J631J63o454J51N094N852M880O442n244r371j903o33n520k196
15659b00128N561J803J503r831l806P894K496k195Q60M491j68k202L041M770l708
15644a89619m914j436j265j757j129L375M908J407l042k597l885K603o850L088
15630b01113M429N14O444N758m073p342M335k238j904n167J921M778k270P429
15616a88499M817K730o158o372N257O44l088p144M028J402M818K309l183M285
$$ y = [-210490, -213025, -209558, -212217, -213023, -226112, -225874, -220563, -214889, -205805, -200414, -195920, -189481, -191677, -195400, -194773, -199076, -201942, -201946, -204692, -207784, -203016, -197868, -196243, -194214, -196617, -200622, -199897, -198899, -200987, -194547, -197217, -200493, -202313, -200863, -208103, -210555, -214860, -207894, -200611, -200049, -197003, -199527, -206472, -206171, -194699, -193020, -191389, -191226, -197680, -197529, -192435, -186583, -181703, -175261, -180505, -189876, -191779, -192412, -197932, -200128, -194567, -192764, -191261, -201092, -204898, -197004, -194508, -196703, -195843, -191352, -191520, -193722, -190681, -185911, -189619, -194533, -195969, -197234, -198991, -200120, -196745, -191837, -190430, -193472, -196069, -199954, -197351, -204201, -201113, -196684, -196170, -189726, -183968, -188041, -195383, -191048, -193286, -195190, -200357, -198436, -193658, -195928, -188499, -183682, -180952, -187110, -193482, -188225, -187581, -190669, -197813, -193785, -192383, -187565, -185256, -188439, -184154]
15602a84154q748n845P367O185L348j565l234l389n409M548k35o958L651N617
15588a88821N019N836k07m816m799M940l668k223M852m45J85j127n170j413M024
15573a87833L660M00J25M682N337q743m057q762Q260J1507J945k348J49K76n21
15558a75923o726k019O564P003J020o847j409l62O518q168r742k759L268M050
15544a85532l026K149O626j025j519j047l955m437L039O252L178J602J466P33
15530a75496m025K645n715o319r9j154K320m969J757P351k862l253L713J154k88
15515a85240k82P574l137k527L669J0219J37j157o88J902m389m65M541n072k445
15500a77360p72M049j868J432m990n84K311N274J875K614M195L93l491n053J461
$$ y = [-184154, -192902, -198747, -191380, -185195, -181847, -183412, -186646, -190035, -195444, -190896, -191131, -198089, -194438, -188821, -183802, -177966, -178173, -182989, -187788, -182848, -186516, -188739, -183887, -184332, -184147, -185274, -190444, -191857, -187833, -184173, -183773, -183648, -178966, -173629, -182372, -186429, -195191, -186931, -175424, -173479, -175827, -175678, -175402, -175923, -182649, -184668, -178104, -171101, -170081, -176928, -178337, -178699, -172181, -180349, -190091, -192850, -189582, -185532, -188558, -186409, -179783, -180808, -182327, -183374, -187329, -191766, -188727, -182475, -179297, -177695, -176229, -175496, -179521, -176876, -182591, -188910, -189009, -190163, -187843, -192812, -191055, -183704, -186566, -189819, -186106, -184952, -185240, -185522, -177948, -181085, -183612, -179943, -169724, -169587, -170744, -171432, -169530, -173919, -174384, -169843, -174915, -177360, -178132, -174083, -175951, -174519, -179509, -180093, -177782, -172508, -170633, -168019, -163824, -163431, -166922, -171975, -170514]
15485a70514K290K299o239l106L575M811k196Q03k887k335R96j622j218N20Q077
15470a66746J392l410k893J065Q5R35N852P80l525K285n024n558M454M493J794
15455a64021o431N928J822j416p18o556K357l34j2793j144O769J285j964J06N074
15440a72036Q108j236p751j003l146K417N002J056J95L618o510j924J117J004
15426a71089M121M960N177J304p532o576J712J1482K814K10l100l31K219o768
15412a61397r621J333M522J058j217k423J304O24n204o786r90M071L337P094j252
15397a65547o472k091q85M819N877l744o819L711Q90L87Q342p55L546o230l918
15382a68889N421O666N677k31p48M811m696q399L326l728J925q11l417L781m9
$$ y = [-170514, -168224, -165925, -172164, -175270, -171695, -166884, -169080, -168277, -171164, -173499, -172503, -174125, -175343, -174823, -166746, -165354, -168764, -171657, -170592, -170507, -169572, -163720, -162940, -166465, -164180, -169204, -174762, -170308, -165815, -164021, -170452, -164524, -162702, -164118, -164836, -171392, -169035, -169369, -182162, -183306, -176537, -175252, -177216, -177110, -172036, -163928, -165164, -172915, -173918, -177064, -174647, -169645, -168589, -168394, -164776, -171286, -173210, -172093, -171089, -166968, -162008, -156831, -155527, -163059, -169635, -167923, -156441, -153627, -153417, -156517, -156848, -154629, -161397, -171018, -169685, -165163, -164105, -165322, -167745, -166441, -165817, -171021, -177807, -178797, -174726, -171389, -164295, -165547, -172019, -174110, -174995, -170176, -164299, -168043, -174862, -171151, -170261, -169874, -161532, -162287, -158741, -164971, -168889, -163468, -156802, -151125, -151356, -152104, -147293, -151989, -160388, -157062, -160790, -158865, -159676, -163093, -159312, -159361]
15367a59361l921m497O051L017R12o012Q003L465j903p633K110O497N555j422
15353a49139K088l59k839j50l636l317J520J730L975L992j364k050M122L927n315
15338a46815j936k524Q925J261j0556q393L574L697L282K202R454j992l708L345
15324a40184M208j973j1119j1074K429O466r38O3N033J880L162l607n711L145
15310a48220K298o284k096L737J103K801l620J233K062K197j073p193N1n86N671
15295a47919M59j878M703N079M643k608N41Q034r399p196l470R44K363J238q364
15280a52830j44L346L913l722K985j821O604m377j587P67j012K358L077J438l728
15265a44733q000n961L83N770J2939K363n746n562l218M515N12j807O827k521
$$ y = [-159361, -163282, -167779, -161728, -158711, -157799, -163811, -155808, -152343, -154246, -161879, -159769, -153272, -147717, -149139, -147051, -147410, -150249, -150399, -154035, -157352, -155832, -154102, -150127, -146135, -147499, -149549, -145427, -141500, -146815, -148751, -151275, -142350, -141089, -151645, -160038, -156464, -152767, -149485, -147283, -137829, -139821, -143529, -140184, -135976, -137949, -149068, -160142, -157713, -151247, -152185, -152122, -147089, -145209, -142047, -145654, -151365, -148220, -145922, -152206, -154302, -150565, -149462, -146661, -150281, -149048, -146986, -144789, -145862, -153055, -153004, -153590, -147919, -147460, -149338, -144635, -139556, -134913, -137521, -136980, -128946, -138345, -145541, -149011, -148067, -145704, -144466, -152830, -152974, -149628, -145715, -149437, -146452, -148273, -141669, -146046, -147633, -146866, -147878, -145520, -142443, -141005, -144733, -152733, -158694, -158311, -152541, -139602, -137239, -142985, -148547, -151765, -147250, -146738, -148545, -141718, -144239]
15251a44239o688J537N192o28m096N350L26L560J603M676l545j961n202q603J28
15236a52590K116Q309O141j383M469K604p871j916N204P542K127k488j010m325
15222a33071l502m801o002q00M365O65p062N517Q499O243l266r674l8L344N327
15207a34256p29K512j080m344l595k412j369M61Q250L401j659j437k076J428M108
15192a32797q24L783p308m467k342J115j800M813J814R21L09L193k100L564l595
15177a35721k216m197K136M728N403j376p01k343K189M716r9k330l462o91N19
15162a33445l360L721l642k122Q91N90k688L032N182J0023K563J328n828n342
15148a29097k608R53J17k869m337n97j677N27K117N228L086k421L711O606r15
$$ y = [-144239, -150927, -149390, -144198, -144826, -148922, -143572, -143246, -139686, -138083, -133407, -136952, -138913, -144115, -152718, -152590, -150474, -142165, -136024, -137407, -132938, -130334, -138205, -140121, -134917, -127375, -125248, -127736, -128746, -133071, -136573, -141374, -147376, -148176, -143811, -143146, -150208, -144691, -136192, -129949, -133215, -142889, -142927, -139583, -134256, -134985, -132473, -133553, -137897, -141492, -143904, -145273, -144812, -136562, -133161, -134820, -136257, -138333, -136905, -132797, -133621, -129838, -137146, -141613, -143955, -142840, -144640, -139827, -138013, -137092, -136783, -133590, -135690, -132126, -135721, -137937, -142134, -139998, -135270, -129867, -131243, -131944, -134287, -132098, -127382, -127481, -129811, -133273, -133964, -133445, -136805, -133084, -136726, -138848, -137957, -137367, -140055, -137023, -131841, -121818, -119255, -117927, -123755, -129097, -131705, -130752, -130635, -133504, -137841, -138438, -140115, -139588, -137471, -132243, -129157, -131578, -127867, -121261, -122176]
15133a22176J846k697p501l064k346l250K151L9K131L439K114L649K64p408j029
15118a33838r07M682J0228L371N2p384p73M221J819l559j078L1K210m943N57n05
15102a25816q20l598j382j544M577N305l731L391L085O0p854j082L236l821K963
15087a27031P668o22K092N57J356L17l423l36m198M770k317q391M065l25q58L7
15071a26639N373j377K569L678k294r39k790P918N948N50n422m108l163J222P796
15056a11678o797l397Q01j957O812J238k893J697P309O486k073l781l408j415
15042a13056n175p15K723K247j093n183Q867R096n620m162J124j067p111m97o91
15027a20313p058M245Q770L808N046m968n499k115M513M291l342K354M31n284
$$ y = [-122176, -120330, -123027, -130528, -133592, -135938, -139188, -137037, -136998, -134867, -131428, -129314, -125665, -125401, -132809, -133838, -134745, -130063, -119835, -116464, -116412, -123796, -124569, -120348, -118529, -122088, -123166, -123135, -120925, -125868, -125311, -125816, -126636, -130234, -131616, -133160, -128583, -123278, -127009, -123618, -120533, -120473, -128327, -129409, -126173, -129994, -127031, -119363, -119985, -117893, -117336, -115980, -115663, -119086, -119422, -123620, -118850, -121167, -129558, -125493, -125818, -126676, -126639, -121266, -122643, -120074, -116396, -118690, -119629, -122419, -114501, -108553, -108003, -113425, -117533, -120696, -119474, -111678, -118475, -121872, -121071, -123028, -116216, -114978, -117871, -116174, -108865, -102379, -104452, -108233, -111641, -113056, -118231, -118946, -116223, -113976, -115069, -120252, -111385, -102289, -107909, -112071, -110947, -112014, -119125, -119622, -120313, -127371, -123126, -114356, -110548, -105502, -110470, -115969, -118084, -113571, -109280, -112622, -110268, -109837, -115121]
15013a15121K010M20J122k466p54j651L373j950l048r315K005P136O449N619q455
14998a14626l218jL979J787K483o7J235j642J708k363M242J586m217kj561q593
14982a19270l858L126P141P683N17l571l60J50l478J275M929l658l605R630J8
14967a03331r746L75J0324k819n129L44O40M191l784K772m09M81O684n04l163
14952a03074L533m9l857k465p638l445N495K626K063N800J317j0787o929J934
14938a15476R110O558k241k850j101N875q29k086l90K981K147r29k042J486m100
14923a03887m534m933l03j553M404K993N716N612k728J124k491J832J084n170
14909a02834l885j764K013J44M456K650n266K255M743J573p541j552K684j086
$$ y = [-115121, -113111, -112691, -111569, -114035, -114789, -116440, -113067, -115017, -118065, -127380, -125375, -118239, -111790, -106171, -114626, -117844, -117845, -113866, -112079, -109596, -109663, -108428, -110070, -108362, -110725, -106483, -104897, -109114, -109116, -110677, -119270, -123128, -120002, -112861, -105178, -104661, -108232, -108592, -108442, -111920, -110645, -105716, -109374, -112979, -103349, -103331, -113077, -112702, -102378, -105197, -110326, -109982, -109342, -105151, -108935, -106163, -106572, -106091, -99407, -99911, -103074, -99541, -99590, -103447, -105912, -113550, -116995, -111500, -108874, -106811, -101011, -99694, -110481, -117410, -115476, -106366, -99808, -102049, -104899, -106000, -100125, -100954, -103040, -103430, -100449, -98302, -99231, -101273, -99787, -103887, -108421, -113354, -113657, -115210, -110806, -107813, -102097, -96485, -99213, -98089, -100580, -98748, -97664, -102834, -106719, -108483, -106470, -106326, -101870, -99220, -104486, -102231, -97488, -95915, -103456, -105008, -102324, -103410]
14895a03410j697J13K339m081j834L82M646j251K174N439K968J315j0005q660
14881a11562N019O524M943m593j561J438K58L726L023j525N852j725j2073k103
14867a04359N490K74m631M301L859L599J029O805j990n218m195o840K417N400
14853i4059K172j76l532k489j215J649J648N291J510l453Q64j433J746j263l51
14838i3091o29m336Q831N045O019K523n916k35L201O64n229j193j308j055l065
14823h9774j682J481j271J88j800k23N165N484l862J927J161j644N61m487M63
14808h8313k864o29K066J487j847j820M806L54j109n231j804K825K183K655o31
14793h7872j468J142J008j562j774N695N351m464j500j691N707O427O076k558
$$ y = [-103410, -105107, -104994, -102655, -106736, -108570, -108188, -103542, -104793, -102619, -97180, -94212, -92897, -102902, -111562, -106543, -100019, -95076, -99669, -101230, -99792, -99534, -95808, -92785, -94310, -88458, -90183, -102256, -104359, -98869, -98595, -103226, -98925, -95066, -91467, -90438, -83633, -85623, -90841, -95036, -101876, -99459, -94059, -91887, -92063, -95595, -98084, -99299, -97650, -96002, -90711, -89201, -92654, -91790, -93223, -91477, -92740, -93091, -93720, -98056, -89225, -84180, -78161, -75638, -81554, -81789, -78588, -77924, -83153, -84346, -85654, -86709, -89774, -91456, -89975, -91246, -91058, -92858, -93081, -87916, -82432, -86294, -84367, -83206, -84850, -84289, -88776, -88313, -91177, -91806, -89740, -88253, -90100, -91920, -87114, -86760, -87869, -93100, -94904, -92079, -89896, -87241, -87872, -89340, -88198, -87190, -88752, -90526, -84831, -79480, -83944, -85444, -87135, -81428, -75001, -68925, -71483]
14779g1483l581p295q771p011k77Q012M644K416M526o974o34k435l872K400L614
14764h6721O384K970M413N90Q634Q0n982K784R51j3003j1282j832J036k035J0400
14749h2613P193M025n32m282M63J948k693l860j312p93R785K46o579n373k408
14734h6785L032j512p85p77KJ507R74q32m472Q16j179R305J2182p94j773k587
14718g3678M540O78l52q52k016o396l865r33J271M525l725n2J489L533J177o678
14702h1334l053O878l524n153K059K089K228N950J339O12J306l76l32J82j015
14687g2144N433k377l716j580p853R02J2176K813p405L37O068O37m587m366L150
14672g2512K171n1M918K261q206r443m50O786K777L069n70J298k122R16J908l789
$$ y = [-71483, -75064, -82359, -91130, -98141, -98418, -90406, -85762, -83346, -78820, -85794, -86428, -88863, -92735, -90335, -86721, -80337, -77367, -72954, -72364, -63730, -63650, -69632, -66848, -65897, -78900, -90182, -92014, -90978, -93013, -82613, -75420, -71395, -71927, -76209, -75746, -73798, -76491, -80351, -81663, -82456, -72671, -72425, -79004, -84377, -86785, -83753, -85265, -86050, -86827, -86825, -85318, -84344, -85176, -89648, -88832, -90011, -80706, -68524, -69318, -71091, -73678, -69138, -68460, -68812, -69664, -71680, -78076, -81941, -82874, -81603, -77078, -80803, -80855, -79366, -75833, -74656, -81334, -84387, -77509, -81033, -86186, -84127, -82038, -79810, -73860, -72521, -71909, -70603, -70979, -71311, -71129, -72144, -66711, -69088, -72804, -74384, -82237, -81335, -69159, -66346, -73751, -73414, -67346, -66709, -71296, -75662, -72512, -70341, -70392, -65474, -63213, -71419, -80862, -81312, -74526, -71749, -68680, -69250, -67952, -70074, -69158, -67250, -71039]
14656g1039j259j819K247k256p846N732O348q636k943J1985R567k459q958j808
14642g3144l164m379k739N434J0412j838J687O396l522r446m593L441Q41K779
14628g1835K525k886p493L878L583N38m648J661l081N512J908L443K115K600K58
14613f1922M498J142m68j0723l104k31J14q99R998K798l404q480k62M336R203
14598e7404l295p708n637L911K080N815M253m54o016k139P77N291K022m31O018
14583e2917K732j336m109k175q91K223m50j637l485O157P910J461N10n282l478
14568e4767K53K432n338l266j730M141k822j696K050l954O66q61L732L033K729
14553e5398J215M654k081J132R6M680J674l184J570n530j309l603l064m703q271
$$ y = [-71039, -72298, -74117, -71870, -74126, -81972, -76240, -69892, -78528, -81471, -69486, -59919, -62378, -71336, -73144, -76308, -80687, -83426, -77992, -67580, -69418, -67731, -61335, -64857, -74303, -78896, -75455, -74614, -71835, -69310, -72196, -79689, -75811, -72228, -71690, -76338, -74677, -77758, -72246, -70338, -66895, -64780, -62180, -61922, -57424, -56282, -56750, -67473, -70577, -70808, -70694, -71593, -61595, -58797, -62201, -70681, -70943, -66607, -57404, -60699, -68407, -74044, -70133, -68053, -62238, -57985, -58439, -64455, -66594, -65817, -60526, -58504, -58935, -52917, -50185, -51521, -55630, -57805, -58696, -56473, -56923, -58560, -62045, -55888, -47978, -46517, -46007, -51289, -54767, -54514, -52082, -57420, -60686, -62416, -58275, -61097, -62793, -60743, -64697, -64031, -64892, -61160, -58127, -55398, -54183, -49529, -51610, -50478, -50382, -45702, -44028, -47212, -45642, -51172, -52481, -56084, -59148, -63851, -72122]
14538g2122K065P834J298k060j158l978m361O199L953j000K578L326J60J655j114
14523e6725j282o708q35m136K616N471L178L361J743M895k43Q48K653l092k254
14508e0510m257l1k284m615K534K50j830N186N008m584n834j746N635O632m336
14493e4782J10L071M631k092Q609m61o03l224o136O462k111j791P322p927P867
14478d1055O165l917m871M111M085j90j004O88L67k254j094J439k757K19o04n648
14462d6320n261J637k919l268l582K066K310J249P05R1O21L848N499N509k833
14447d0648q149M520N170R39q889k653L416P72J074n19j258p523k59L30N947K719
14431d5011j953M928L002K845j320l939M578L543j656j252l793m551j227O751
$$ y = [-72122, -70057, -62223, -60925, -62985, -64143, -68121, -72482, -66283, -62330, -63330, -60752, -57426, -57266, -55611, -56725, -58007, -64715, -65550, -69686, -67070, -61599, -58421, -55060, -53317, -48422, -48665, -47817, -45164, -48256, -50510, -54767, -54798, -57082, -61697, -59163, -58913, -60743, -55557, -50549, -55133, -60967, -62713, -57078, -50446, -54782, -54672, -51601, -46970, -49062, -40453, -40914, -41517, -44741, -50877, -44415, -46526, -48317, -40995, -48922, -41055, -34890, -38807, -43678, -39567, -35482, -35672, -36676, -35988, -35621, -37875, -38969, -37530, -40287, -40068, -40672, -46320, -51581, -49944, -52863, -56131, -59713, -57647, -55337, -54088, -53383, -53292, -52671, -48823, -43324, -37815, -40648, -48797, -44277, -39107, -38168, -47057, -49710, -46294, -45522, -44448, -44967, -46225, -53748, -54007, -53677, -47730, -45011, -46964, -42036, -39034, -36189, -37509, -41448, -36870, -33327, -34983, -36235, -40028, -44579, -45806, -39055]
14417c9055O122P76j417j327m649O625j067l548n757L268L828k099O211K125j0118
14402d0082j4191j794N789M699J021k018P869M636l137M95J613k23O90o17k858
14387c8108m754j382L034M586N63m945k930P222o00k767N809k066l953K29J685
14372c8377M89J675M332L101j110k374m504J894Q665k592m158l180L184J244l339
14357c5050l865l040O797O10p633l876K668L348K600L412n145K278Q514J0727
14343a7655K158l250k300k181J820l510M18l469K875l254n621k840k601j46J963
14328c7593P376j424k317j072K038L773J4N755j943M03L826j805o348p027M029
14313c2315R38k431M707K406p33J763P638J523l167n708k264m05m18L97n676K342
$$ y = [-39055, -32933, -32157, -33574, -34901, -39550, -32925, -33992, -37540, -43297, -40029, -36201, -38300, -32089, -29964, -40082, -54273, -56067, -50278, -45579, -44558, -46576, -38707, -34071, -37208, -36713, -35100, -35323, -34633, -35250, -38108, -42862, -44244, -41210, -36624, -36061, -41006, -43936, -36714, -37314, -40081, -34272, -36338, -40291, -40062, -38377, -37888, -36213, -31881, -28780, -29890, -32264, -36768, -34874, -26209, -28801, -32959, -36139, -32955, -31711, -35050, -38915, -41955, -35158, -34548, -42181, -46057, -43389, -40041, -37441, -34029, -39174, -36896, -28382, -17655, -15497, -18747, -21047, -23228, -21408, -24918, -24500, -27969, -25094, -28348, -33969, -36809, -39410, -39556, -37593, -30217, -31641, -33958, -35030, -32992, -29219, -29205, -23450, -25393, -24990, -21164, -22969, -29317, -36344, -32315, -31377, -33808, -29101, -26695, -27428, -25665, -18027, -16504, -19671, -25379, -27643, -28048, -28466, -28069, -33745, -31403]
14297c1403N285L820m836j2486j822M554K624l380r09o318N513l086P054K075
14283c3315n058l019J0889L424j355m804k122K853Q777k045k652L679m97m851
14269c0096k581k4k549J3347R688q931n85N449J972n464k352K939K392L479K089
14254a1227j028k605l029J74m901R719l806j0246m52L865K620j512j87J208M819
14239a6588L781j513j766l00K825K9l164m312l251L191N848j611K328R23N202
14224h378M221L968O95n032q845j968N378q92p817q79Q89m816j525l417N017J162
14208b2239n058K447J058J829L345n459k484L858J758r53m067K529K83k254L466
14193b1941P542j067M311L425j564p496k010J542R60K115m669l769j240J0285
$$ y = [-31403, -26118, -22298, -27134, -39620, -41442, -36888, -34264, -37644, -38553, -44871, -39358, -42444, -35390, -33315, -38373, -41392, -30503, -27079, -28434, -33238, -35360, -32507, -23730, -25775, -28427, -24748, -25245, -30096, -32677, -32701, -35250, -21903, -12215, -21146, -21731, -16282, -14310, -19774, -22126, -19187, -16795, -13316, -11227, -12255, -14860, -17889, -17715, -22616, -12897, -16703, -26949, -27401, -23536, -20916, -22428, -22615, -21407, -16588, -12807, -14320, -16086, -16386, -13561, -13532, -16696, -21008, -24259, -21068, -15220, -16831, -14503, -13580, -8378, -4157, -189, 506, -4526, -13371, -15339, -9961, -10853, -18670, -19549, -18660, -23476, -25001, -28418, -23401, -22239, -27297, -24850, -23792, -21963, -18618, -24077, -26561, -22703, -20945, -21898, -25965, -23436, -23153, -25407, -21941, -14399, -15466, -11155, -7730, -9294, -16790, -18800, -17258, -16298, -14183, -18852, -22621, -23861, -13576]
14179a3576P847J657j658k962j491k019L184n764l644R85K907P43n866O87K509
14164a6461M54k39Q219J469n483n257N837J1126J898m050q12M653L065j976r474
14149g031j1204o400l500j200O582N607m10Q789O880m628n652k459K784K691N925
14134c226l198q780P431r31J954J558J056J102K0r231J197q91L022L098o85M17
14118f087N584j87o251m195K606P350nj348k111P93M817k075o376K902K653j587
14102c517k643m43j302L839K998k659l947O324N213o457m041j523l258K376N691
14087c349LJ010m15K757K515J011p564j336K200J958K600M798J574k394k813n072
14071b517j005j211K018N48K863N27Rj401p925J0811M938j812J616K756M560o727
$$ y = [-13576, -5729, -4072, -5730, -8692, -10183, -12202, -9018, -14782, -18426, -17441, -14534, -13791, -19657, -18970, -16461, -16007, -16246, -8027, -6558, -12041, -17298, -11461, -335, 1563, -2487, -3299, 1354, 4419, 2443, -7031, -18235, -24635, -28135, -29335, -22753, -17146, -17556, -8767, -1887, -6515, -12167, -14626, -11842, -9151, -3226, -6424, -15204, -7773, -8704, -6750, -5192, -4136, -3034, -3014, -12245, -11048, -11939, -8917, -5819, -6504, -6087, -503, -690, -6941, -11136, -8530, -1180, -1185, -2533, -4644, -3851, 966, -1109, -7485, -4583, -1930, -3517, -6160, -6603, -7905, -4066, -1068, -3727, -7674, -1350, 3863, -2594, -6635, -8158, -11416, -9040, -3349, -3346, -2336, -2751, 6, 2521, 3532, -4032, -5368, -3168, -1210, 1390, 6188, 7762, 5368, 2555, -2517, -3522, -4733, -2715, -2167, 696, 1223, 1232, -169, -8094, 2717, 7655, 5843, 7459, 10215, 14775, 8048]
14055H048r418M75L818J374o50K55k363j605J078j111j358N576J919J102K838
14040I978L203N6J156J420j400q253m922M17M621M367o277M155K608k942k897
14025E290J574o81k815J37p77j250j200Q728M628L969j847L88l755q51m481p677
14009f20m474k320j91M007J0002K012M932K443K891k306m147p25M309O54l90j69
13993A5908n11p950O608L804l964K35K830q658l384m25J787L893R66J697l075
13978I761M71m33O7J0174N714l287l548o831n49J020r05m320%J521L94j155P318
13961A5412P360n803k028L046J61K355k158P2n273j805P841l460k395k837j827
13946H661n67k372O836M229K295l149p612k631K784K927j139O6P993l5o467l697
$$ y = [8048, -1370, -895, 2923, 4297, 3647, 3902, 1539, -66, 1012, -99, -1457, 4119, 6038, 7140, 9978, 13181, 13237, 14393, 15813, 14413, 6160, 1238, 1655, 6276, 10643, 4366, 8521, 11129, 8187, 5290, 6864, 6183, 3368, 3505, 2728, 1478, 278, 9006, 13634, 17603, 15756, 16144, 12389, 11538, 7057, -620, -5094, -7414, -7605, -3598, 6404, 8416, 13348, 15791, 18682, 16376, 12229, 11504, 15813, 16467, 16077, 15908, 15397, 7447, 14055, 17859, 13895, 14130, 16960, 8302, 4918, 4493, 6280, 10173, 11139, 12836, 9761, 10232, 9799, 9866, 20040, 25754, 22467, 18919, 12088, 11539, 12559, 11654, 7334, 7334, 8855, 9249, 8094, 15412, 22772, 16969, 14941, 17987, 18148, 20503, 18345, 18417, 13144, 11339, 19180, 15720, 13325, 10488, 8661, 8094, 5722, 12558, 16787, 19082, 15933, 8321, 5690, 8474, 11401, 10262, 10328, 18321, 18286, 11819, 8122]
13930H122L451K67J585p86O744K327k954k99R7J419N35n649l00l18l193j394K090
13913A1744N640L626j899j458o345k017N621K548m044J863O9j207J648O450M370
13898B6609n159k256L078j700n210m574J673J90Q743J760O881l443m980Q01J397
13883B3810n303n9k90p97n141k43R14m078r63J1435N541n00l44j916O509L653
13867C2228k665k587l132J90J471l896n77L837K912m248j790p15l227k028P416
13852B3189M208j354m12j25n923Q462O517r30o219l148J707K732J630k195n00
13837B7639K552m078m717R359N166j572j506J196k277j270J538n000K270Q09J368
13822C1477k399j910K712Q38j5p626L162P273r98p086N40Q31P52o27K173K598
$$ y = [8122, 11573, 11840, 13425, 12639, 19383, 21710, 18756, 18457, 18554, 19973, 20508, 14859, 14559, 14241, 11048, 9654, 11744, 17384, 21010, 19111, 17653, 11308, 9291, 14912, 17460, 13416, 15279, 15348, 14141, 15789, 22239, 26609, 21450, 19194, 22272, 20572, 15362, 10788, 12461, 12651, 21394, 23154, 30035, 26592, 21612, 22413, 23810, 18507, 18448, 18158, 17361, 12220, 11977, 12891, 8813, 7850, 19285, 24826, 24326, 23982, 22066, 28575, 32228, 29563, 26976, 23844, 24034, 25505, 21609, 21032, 24869, 27781, 23533, 21743, 21028, 17801, 15773, 23189, 27397, 26043, 25631, 25506, 19583, 28045, 34562, 33632, 27413, 24265, 25972, 28704, 30334, 28139, 27639, 30191, 26113, 21396, 30755, 35921, 34349, 32843, 34039, 31762, 30492, 32030, 27030, 29300, 30109, 31477, 29078, 27168, 29880, 30718, 30703, 23077, 26239, 33512, 32514, 25428, 25968, 26799, 27551, 26924, 29097, 31695]
13806C1695L708l52n796r858j005J1110K273J491Q25M708m219J364M341L01k903
13791C7683Q57m782K727J204L273r042m762O831P887j661j633L438o801J022M104
13776D0345j446n09l15M0l374r40Q58P49N112p4o454J366L110J393m69L966K398
13759D5756l217p62R54J199J816k580k156R08M083L714K842j979p648o221L274
13744C9983J1081J380p890J427J575m846j379K264j969j262N618k731p615J330
13730C6966J733N689K700N77j862J411K643n635l671J311Q99L783q09N561j1536
13715C9760p011J969N452P766K016l097N344P315j412k6j5021j206L644L937M077
13700E3507K62l57M182m369q602k570M394L691K414o770p594J128J681N97M442
$$ y = [31695, 35403, 35051, 29255, 19397, 18392, 29502, 31775, 33266, 34091, 38799, 34580, 35944, 40285, 40586, 37683, 38540, 33758, 36485, 37689, 40962, 31920, 27158, 33989, 41876, 40215, 38582, 42020, 35219, 36241, 40345, 38899, 38390, 38075, 38115, 34741, 33801, 34659, 35408, 40520, 40446, 33992, 35358, 38468, 39861, 39392, 43358, 45756, 42539, 41777, 42731, 43930, 45746, 43166, 41010, 41918, 46001, 49715, 52557, 50578, 42930, 36709, 39983, 51064, 52444, 44554, 45981, 47556, 42710, 41331, 43595, 41626, 40364, 45982, 43251, 35636, 36966, 38699, 44388, 47088, 47665, 45803, 47214, 49857, 44222, 40551, 41862, 42761, 46544, 45735, 51296, 39760, 32749, 34718, 40170, 47936, 49952, 46855, 52199, 59514, 58102, 58076, 43055, 41849, 45493, 49430, 53507, 53769, 53412, 57594, 53225, 44623, 42053, 46447, 50138, 52552, 45782, 38188, 39316, 40997, 41594, 46036]
13685D6036M215M911J46p361m240R014J328Q71m674K203M273j063R168N163l654
13670F6336m4q91n124r555l661O579P013k098m081k789l815j1738O35N716K149
13655D4632L103L149L381K376j547M277j344j747R99M441j709J51n157n431l174
13640D6400L522o9M132J613o565q741M899N825L402k799n489M348N192m576q717
13625D2377L604L247j246L701R55M99J730M8o666L924R339R81q86o878j95k141
13609E2393j380P73M296K134N44O66N798P420K934r425k248l832m383L301P773
13594F6764j362j306M4M314R68N322R33o01K21j990n241K908K881n34q378n021
13578E9922N85k978K574q67K375J602j328L956k35K380K563m110p614k791l030
$$ y = [46036, 50251, 55162, 55308, 47947, 43707, 52721, 54049, 54920, 50246, 52449, 56722, 55659, 64827, 69990, 66336, 66292, 65401, 60277, 50722, 47061, 53640, 60653, 58555, 54474, 51685, 47870, 36132, 36767, 42483, 44632, 47735, 50884, 54265, 56641, 55094, 59371, 58027, 56280, 57279, 61720, 60011, 60162, 55005, 49574, 46400, 49922, 49853, 53985, 55598, 49033, 40292, 45191, 51016, 54418, 51619, 46130, 50478, 55670, 51094, 42377, 45981, 49228, 47982, 51683, 52638, 53137, 54867, 54915, 48249, 52173, 61512, 62493, 61607, 54729, 54534, 52393, 51013, 51786, 56082, 58216, 58760, 59426, 65224, 72644, 75578, 66153, 63905, 60073, 55690, 58991, 66764, 65402, 64096, 64140, 68454, 69422, 74744, 75677, 75076, 75297, 73307, 68066, 70974, 73855, 73321, 64943, 59922, 60507, 57529, 60103, 59236, 61611, 63213, 61885, 65841, 65606, 67986, 70549, 66439, 58825, 56034, 53004]
13563E3004N094O570L863j24J718J759L59L48N256j959o171J760J102K727L51
13548G5657q055o322l32M822l128j121j840M560n86m215K279P094K536j449M670
13533G4570P506k370p18q056q673r488P429N173J424J499N294r76k180M734L067
13518G8235k950m461m677N902Q778j188n266o550l120L966M237K750j07L67O023
13503H1939K680N012l579k404q55l511q13K028p69l597o68M015J2k227M79l345
13487G4397N267O598k474k887o78q256k585M845Q228k827j1223J221J1755M636
13473H6017k007J966J733m395m000q769j27R628j150j491P628l576q69O850K63
13458H7701J220o315j0737n19N569P073j855k797K023J629M202K408P46K242J797
$$ y = [53004, 58098, 64668, 68531, 68407, 70125, 71884, 72243, 72591, 77847, 75888, 69717, 71477, 72579, 75306, 75657, 67602, 61280, 60948, 65770, 62642, 61521, 59681, 64241, 63655, 59440, 61719, 68813, 71349, 69900, 74570, 82076, 79706, 78988, 70932, 62259, 52771, 60200, 65373, 66797, 68296, 73590, 72614, 70434, 75168, 78235, 75285, 70824, 66147, 72049, 80827, 79639, 74373, 67823, 64703, 68669, 72906, 75656, 75549, 75916, 81939, 84619, 89631, 86052, 83648, 82793, 79282, 78469, 80497, 79728, 76131, 75463, 79478, 79490, 77263, 77742, 74397, 79664, 86262, 83788, 80901, 80223, 71967, 69382, 74227, 82455, 79628, 68405, 69626, 81381, 86017, 84010, 85976, 87709, 83314, 79314, 70545, 70418, 80046, 78896, 77405, 85033, 81457, 80588, 87438, 87701, 88921, 82606, 71869, 71350, 76919, 83992, 82137, 79340, 81363, 82992, 87194, 89602, 90348, 92590, 94387]
13443I4387J136l095m971o270N662j98j530L602P839M515n598m047k754m762j163
13428H2753L115K184M044j354p64n072J248M50K434rL144j041j976K162J2954
13413A04272k003j1394O3L889m669o930J66N189J549m557j171l50K968M490K140
13398I3652N738k215Q60M641K247l843p556l37R660L975n049j031p871n107j397
13383H6367m491J698L226O172N096J075J307m178j1287k502M837M098R196q64
13369I9750l343L164O23J612j322l081L920l104l377L890K889o00q49K614N484
13354A08270K39K220m309n233o855K764r09m950J410L573p70M424m012k38k079
13339I3545R25P278j432r30j070k73J815L72M325Q174M187q084k787J490J486
$$ y = [94387, 95523, 92428, 87457, 81187, 86849, 86651, 85121, 88723, 96562, 101077, 95479, 91432, 88678, 83916, 82753, 85868, 88052, 92096, 90742, 89978, 84906, 86154, 86604, 89038, 89029, 92173, 91132, 89156, 91318, 104272, 102269, 90875, 90938, 94827, 90158, 83228, 83394, 88583, 90132, 85575, 84404, 84054, 87022, 91512, 93652, 99390, 97175, 98035, 102676, 104923, 101080, 93524, 93187, 102847, 106822, 101773, 100742, 92871, 87764, 86367, 81876, 83574, 86800, 92972, 98068, 99143, 100450, 96272, 84985, 82483, 87320, 91418, 100614, 99750, 96407, 99571, 100194, 101806, 100484, 97403, 101323, 98219, 94842, 98732, 101621, 101021, 100172, 102786, 108270, 108509, 110729, 106420, 101187, 94332, 97096, 96187, 91237, 92647, 96220, 95450, 99874, 95862, 95624, 93545, 94470, 101748, 100316, 99386, 98316, 98043, 99858, 100230, 104555, 112729, 116916, 108832, 106045, 107535, 109021]
13324A09021j006l183M009N194J21K074k858K137M536M445k880j246l23k969l211
13309A13861l355j027p257o324J036N829O830J988J129L529k408o965J062L272
13295A11200n345K968j058k187m697p808l057O847O323J281K257P790K079P89
13281A17382l821K135m29l450M355J898p36L603j740o044j360K729J860L562o20
13266A19324j777M090l055K27k920j591j619k853K688N531L197k570O978P466
13252A33116n809k403j523Q85J828o551j0734J998J2472O177j236o973n369l824
13238A12054j086K379k388k032L193J0141P229M494k633k208P662k772n224O5
13224A28874p358k597J301K504O455M866l797L148q70J930L410l008l085n056
$$ y = [109021, 108015, 104832, 108841, 114035, 114156, 116230, 113372, 115509, 120045, 124490, 121610, 120364, 120041, 117072, 113861, 110506, 109479, 102222, 95898, 96934, 102763, 109593, 111581, 112710, 116239, 113831, 106866, 107928, 111200, 105855, 108823, 107765, 105578, 100881, 93073, 90016, 96863, 103186, 104467, 106724, 114514, 116593, 117382, 113561, 115696, 115267, 111817, 116172, 118070, 117334, 120937, 119197, 113153, 111793, 114522, 116382, 119944, 119324, 117547, 121637, 118582, 118809, 115889, 114298, 112679, 109826, 112514, 118045, 121242, 118672, 125650, 133116, 127307, 124904, 123381, 124266, 126094, 119543, 108809, 110807, 123279, 129456, 128220, 121247, 115878, 112054, 110968, 113347, 110959, 108927, 112120, 122261, 129490, 133984, 131351, 129143, 136805, 134033, 128809, 128874, 121516, 118919, 120220, 122724, 129179, 134045, 130248, 133396, 132526, 134456, 137866, 134858, 131773, 126717]
13210A26717j776l294N26o28N149N464K913q959k550R980J1455P862l443j0202
13196A39214j1527k156O154l5k445M759K289M582M31k575n018L977O069K50k819
13181A41150J321P40Q885N11j0774j2259r592r89J38N062O784q628n267K493O39
13166A20214K603O918J0566K15P99q61k650l001J090k19q39O627k164J173J197
13151A41668j024n176L057N484L291L821J1047J643j492J918L986j608K202O197
13137A75014N796P528J1261R42o788k3842l2423l1169k0827l209L273M684P427
13124I7667M673m568K173M195J2066Q484L035K527k961j75L672K741j259r290
13110A22980j35M023L725Q002M101l902P23M279J427K080J864J747N200l595J191
$$ y = [126717, 124941, 121647, 122173, 121545, 126694, 132158, 135071, 126112, 123562, 133542, 144997, 152859, 149416, 139214, 127687, 125531, 131685, 131650, 129205, 133964, 136253, 140835, 141266, 138691, 133673, 137650, 143719, 143969, 141150, 142471, 143211, 152096, 152607, 141833, 129574, 119982, 118993, 119131, 124193, 130977, 122349, 117082, 119575, 120214, 122817, 129735, 140301, 140516, 141315, 140454, 137804, 134803, 135893, 135674, 134835, 141462, 139298, 140471, 141668, 140644, 135468, 138525, 144009, 147300, 151121, 162168, 163811, 162319, 164237, 168223, 166615, 168817, 175014, 180810, 188338, 199599, 200541, 193753, 169911, 137488, 106319, 85492, 82283, 85556, 90240, 97667, 102340, 97772, 99945, 104140, 116206, 124690, 127725, 130252, 127291, 127116, 130788, 133529, 132270, 122980, 122845, 126868, 130593, 138595, 142696, 138794, 139517, 143796, 145223, 147303, 149167, 150914, 156114, 152519, 153710]
13095A53710J1931M975K570N926K410K843J0071M081r426k7665m2014k3095r763
13082H6554k054J0903J1066R7L327P99J388p56p993L04R362J4435O546m133o966
13067A22879M584N253L212k274n198K13j221M587N590M979k610K29j155L498o87
13052A41879k256K378K308L997O777r28n550L245N327L082l393m441j0750j3289
13038A28386p187l367O42M173N920M508L790L233K668j963p290N94n751M648Q63
13023A33867l771N220K897k860p73j029P891J1284Q68q560j453j896J547M022
13009A47254n272k100k523j786P8N302j666O396N629N268m51L102m855n26O369
12994A60219L261k690l261J668j285q766p39O045M746p67M84l073j622P96J684
$$ y = [153710, 165641, 170616, 173186, 179112, 181522, 184365, 194436, 198517, 189091, 161426, 119412, 96317, 86554, 84500, 95403, 106469, 106566, 109893, 110692, 112080, 111324, 103331, 103635, 112997, 127432, 133978, 129845, 122879, 127463, 132716, 135928, 133654, 128456, 128669, 127448, 132035, 137625, 142604, 139994, 140223, 139068, 142566, 141879, 139623, 142001, 144309, 148306, 155083, 154155, 148605, 151850, 157177, 160259, 156866, 152425, 141675, 128386, 121199, 117832, 118474, 122647, 128567, 133075, 136865, 140098, 142766, 140803, 133513, 134107, 128356, 133004, 133867, 130096, 135316, 138213, 135353, 134580, 133551, 141442, 152726, 153594, 145034, 143581, 141685, 143232, 147254, 141982, 139882, 137359, 135573, 135651, 140953, 139287, 145683, 151312, 156580, 156129, 159231, 154376, 153850, 160219, 163480, 160790, 157529, 159197, 157912, 149146, 148407, 154452, 159198, 158431, 158915, 155842, 154220, 155016, 156700]
12979A56700k531k453J019j306m058l382L81J431j602o43M30q02O062k546J3516
12964A60216P636q313o033N083P905Q367m052o787J819J815m769r640o345L335
12950A50237K58M153P168J202j068l763J855J315L762O806l204n658n881O150
12936A63332Q462L487k706j63l250p739N069O894L63o48l310l344j93J781k738
12921A65297L671k057p331J862M199K401k642j607L381k243J159N42J0937k113
12907A75456k997k266o994k517j482N451O844M66m305p745K649J420J43N170M317
12892A73610J413K472N4l170n255J592N644K339j926M240j811k572k163K477K022
12877A78966O092N346J699l778j0280m834k301N245N440O293j235j2315m601J0571
$$ y = [156700, 154169, 151716, 152735, 151429, 147371, 143989, 144370, 145801, 144199, 143556, 143986, 143184, 149246, 146700, 160216, 167852, 159539, 153506, 158589, 166494, 174861, 170809, 164022, 165841, 167656, 162887, 153247, 146902, 150237, 150495, 154648, 161816, 163018, 161950, 158187, 160042, 161357, 165119, 171925, 168721, 163063, 157182, 163332, 171794, 175281, 172575, 172412, 169162, 161423, 166492, 173386, 173749, 173101, 169791, 166447, 166254, 168035, 165297, 168968, 166911, 159580, 161442, 165641, 168042, 165400, 163793, 167174, 164931, 166090, 166632, 177569, 175456, 172459, 170193, 163199, 160682, 159200, 164651, 171495, 171961, 167656, 159911, 162560, 163980, 164123, 169293, 173610, 175023, 177495, 177549, 174379, 169124, 170716, 176360, 178699, 176773, 181013, 179202, 176630, 174467, 176944, 178966, 185058, 190404, 192103, 188325, 178045, 173211, 170910, 176155, 181595, 187888, 186653, 174338, 169737, 180308]
12863A80308O066q945l680Q906L331p99l052o902L561P468k469l46K292l780l489
12848A78470L92J1587J0092k702p650n345k555M598P003J568q72p40j428K393
12834A94811J451n242l923K277j39l733Q345L2k368J909L301p48l744l976r16
12819A87337O439K569k57n286m048n0Q756J0001N841K268l816p417q626k470L07
12804A91548K752O910N210n740q117j854M353l73J456p7j273j627N592M945m647
12789A99058j1O536o063j145Q190P377k266m874l172J648o115m254M226P772L364
12774B10271Jl676J205k633m464K22L468K7M27l875L874Q052j953p51J11K452
12758B12758L027J182N324j0525l154k126j505P119N918o816r247K421r52l131
$$ y = [180308, 186374, 177429, 173749, 182655, 185986, 185187, 182135, 175233, 178794, 186262, 183793, 183447, 185739, 181959, 178470, 178862, 190449, 200541, 197839, 190189, 184844, 182289, 186887, 193890, 195458, 194586, 193846, 192418, 194811, 196262, 191020, 187097, 189374, 189235, 185502, 193847, 193879, 191511, 193420, 196721, 195973, 192229, 188253, 187337, 193776, 196345, 196088, 190802, 186754, 186704, 195460, 205461, 211302, 213570, 209754, 202337, 193711, 191241, 191548, 194300, 201210, 206420, 200680, 192563, 190709, 195062, 194689, 196145, 196068, 194795, 193168, 198760, 203705, 199058, 199047, 205583, 199520, 198375, 206565, 213942, 211676, 206802, 203630, 205278, 199163, 194909, 199135, 206907, 210271, 210272, 206596, 207801, 205168, 200704, 200926, 204394, 204421, 204848, 200973, 204847, 212899, 210946, 210195, 210306, 212758, 215785, 216967, 222291, 211766, 208612, 206486, 204981, 212100, 218018, 211202, 201955, 204376, 203424, 200293]
12744B00293J466J0502j153n599n12K158n541K343K158J956J52P41p472J902K466
12729B05860L633O149l249J276K943r059J768O681M063k643l469l94j437N587
12715B17709L873n690l11k231m422q050K102N590L119m75O885P683k133m002j221
12700B18426j67J1880J0105J886k177m825k079l937q245O74N591Q59q491k118
12686B17382O535P783K511m291p243j481P872m287l970j09K160K689P107N639
12672B38297k413K636K436o449n189k906m409l063K241K457M038M508O277k263
12658B36198j1274J467n12n729K44q18M520L408j855L235N01L002q53l932k218
12643B25384J1159N320j920k659K080K036L375k607o253o842K940K856L084l718
$$ y = [200293, 201759, 212261, 211108, 205509, 204997, 207155, 201614, 203957, 206115, 208071, 208223, 208964, 201492, 203394, 205860, 209493, 215642, 212393, 213669, 216612, 207553, 209321, 216002, 220065, 217422, 213953, 213559, 212122, 217709, 221582, 215892, 215581, 213350, 208928, 200878, 202980, 208570, 211689, 211214, 218099, 225782, 223649, 219647, 218426, 218259, 230139, 240244, 242130, 239953, 235128, 233049, 229112, 220867, 221541, 227132, 227991, 219500, 217382, 223917, 231700, 234211, 229920, 222677, 221196, 229068, 224781, 220811, 220702, 222862, 225551, 232658, 238297, 235884, 238520, 240956, 234507, 229318, 226412, 222003, 218940, 221181, 223638, 227676, 232184, 238461, 236198, 224924, 226391, 225879, 220150, 220394, 219576, 224096, 227504, 225649, 228884, 229385, 232387, 231534, 227602, 225384, 236543, 241863, 239943, 237284, 239364, 241400, 244775, 242168, 235915, 229073, 232013, 234869, 237953, 234235]
12629B34235p688k16O777k841l643N887L722p64l965l051O408M583J134j83L486
12614B43881K04P14l374m379N30k290k489O457j29M56n713M534Jm452P961R178
12598B51090k318m000K932p857n410N040L239R10L937l114o244K599N55M867N282
12583B51508J612n907j669j150o683J009O698R00n712M577L041o663n250L607
12569B39918Q362Q044N543o985m153k203P46K863J047l280l632K607L696p77J882
12554B53678k264J644M743n797M369L211k651J090m88Q010L759k731p877L108
12540B61804k218m571l418r10L889L549k173k099N574Q007O04k81r70l340r080
12525B54367o413N346P832O392N856j442l845O185j2o168j43P154J146p801l493
$$ y = [234235, 226547, 226331, 233108, 230267, 226624, 232511, 236233, 235469, 231504, 228453, 234861, 239444, 240578, 240395, 243881, 244085, 244799, 241425, 237046, 237576, 235286, 232797, 239254, 239125, 239581, 233868, 238402, 238403, 233951, 241912, 251090, 248772, 244772, 247704, 239847, 234437, 239477, 242716, 243626, 247563, 244449, 238205, 240804, 241359, 246226, 251508, 253120, 247213, 245544, 244394, 237711, 238720, 245418, 246318, 240606, 245183, 248224, 241561, 236311, 239918, 248280, 256324, 261867, 254882, 250729, 248526, 249272, 252135, 253182, 249902, 246270, 248877, 252573, 251796, 253678, 251414, 253058, 257801, 252004, 256373, 259584, 256933, 258023, 257535, 265545, 269304, 266573, 258696, 261804, 259586, 255015, 251597, 250687, 254576, 258125, 255952, 253853, 259427, 267434, 268038, 267757, 266787, 263447, 254367, 247954, 253300, 261132, 267524, 273380, 271938, 268093, 274278, 274266, 268098, 267955, 275109, 276255, 268454, 264961]
12510B64961j013K489k527K289L564J058k292O500m533o159l573m36O037O478
12496B72843j37L996K7q847q81j813r23j868J675M244N408l972k944l171n374
12481B58263j936J807L123L594K817O163j703J455N514N15m754j165m029L659
12467B73323O173R73l565O353J160n537o997m303Q47Q174L689K571k047k372P89
12452B79231l104K851L515L390p9k113k442l13M096K521L151j122J4M36j531K685
12436B91186N22K928m39N66L100L28p539j288M664L13k351l754k017N992J090
12421B93301K756J166l662j800J897J523j13M980L85L612R99p654o368n291K855
12406B88586j450P829J817j841J721j066K48n08j174J143m211k671N68j005J165
$$ y = [264961, 263948, 266437, 263910, 266199, 269763, 270821, 268529, 275029, 270496, 264337, 260764, 260328, 266365, 272843, 272706, 276702, 276729, 267882, 267001, 265188, 264265, 262397, 264072, 268316, 273724, 269752, 266808, 263637, 258263, 256327, 258134, 261257, 264851, 267668, 273831, 272128, 273583, 279097, 279612, 274858, 273693, 269664, 273323, 279496, 280469, 276904, 283257, 284417, 278880, 271883, 267580, 268427, 276601, 280290, 282861, 280814, 278442, 279231, 276127, 278978, 282493, 285883, 285804, 283691, 281249, 280936, 285032, 287553, 290704, 289582, 289596, 290032, 288501, 291186, 291708, 294636, 294197, 294763, 297863, 298191, 290652, 289364, 294028, 294341, 291990, 288236, 286219, 292211, 293301, 296057, 297223, 293561, 291761, 293658, 295181, 295068, 300048, 300433, 304045, 305044, 297390, 291022, 285731, 288586, 287136, 294965, 296782, 294941, 296662, 295596, 295844, 295336, 294162, 295305, 291094, 288423, 288991, 287986, 289151]
12391B89151Q83N869K414j116L084M657N186N178k256l826m731n71M412O54P111
12376C16099j878P34n189l412l791K441j447k658q212J628O968L344L152L048
12362C10827J467l460j674n053n28L199k863j975K248J3229J1470R89l319m049
12348C20508p068j635K578J56j008m203o06N513O407K606J374l357m887R83L220
12333C20581J044l844l278L084K060j934j360Q83L640J285K394K723l47l28O27
12318C27230l268l880m002K271P357K670J415n007m209k158L526J703M410P902
12304C35960k126j544K244p22r014J626P978K821l22Q841L578o597j265n142m202
12289C32114L613R18M616j721J727J969K671Q21j427o375o05K219o467k463K255
$$ y = [289151, 290034, 295903, 298317, 297201, 300285, 304942, 310128, 315306, 313050, 309224, 304493, 303922, 308334, 308988, 316099, 314221, 314955, 309766, 306354, 302563, 305004, 303557, 300899, 292687, 294315, 301283, 304627, 307779, 310827, 312294, 308834, 307160, 302107, 301579, 304778, 301915, 299940, 302188, 315417, 326887, 327876, 324557, 320508, 313440, 311805, 314383, 314539, 313531, 309328, 308722, 314235, 320642, 323248, 324622, 321265, 316378, 317361, 320581, 321625, 317781, 314503, 317587, 319647, 317713, 316353, 317236, 320876, 322161, 324555, 327278, 326931, 326603, 327230, 323962, 320082, 316080, 318351, 325708, 328378, 329793, 324786, 320577, 318419, 321945, 323648, 328058, 335960, 333834, 332290, 334534, 333812, 324798, 326424, 334402, 337223, 336901, 345742, 349320, 342723, 341458, 336316, 332114, 335727, 336645, 341261, 339540, 341267, 343236, 345907, 346728, 345301, 338926, 338321, 340540, 334073, 331610, 333865]
12274C33865K736k588J087K761k378l933j000K21K925M90J1051p13o307J310L08
12259C39835N733Q854M467m942q576J025O217O667L345o222p786n69o814m398
12245C36836M210J735l98Q53N973K626k380L637l142K99K353k899RP534k423l881
12229C50942J897J724l903L07k77J954K654K787p01l65j098Q664k615j391n182
12214C55397K689N124O986l474p349K903P92j056L449M502q81m38l15m96K75K836
12198C70944J766l835n676K192m707j3969M367R128l30l279P2L502K620p43o351
12183C55701q50N502R159N071n92l073l932m678L984K17k629j10Q350N924J298
12168C79342m554n786j289J073K727L718j140L098M413P945j915m088o824m102
$$ y = [333865, 336601, 334013, 335100, 337861, 335483, 331550, 330550, 330771, 333696, 334186, 345237, 344524, 338217, 339527, 339835, 345568, 354422, 358889, 353947, 345371, 346396, 352613, 359280, 362625, 356403, 348617, 348048, 341234, 336836, 341046, 342781, 342383, 343236, 349209, 351835, 349455, 353092, 349950, 350249, 352602, 349703, 349712, 357246, 354823, 350942, 352839, 354563, 350660, 350967, 350690, 352644, 355298, 358085, 357384, 357019, 355921, 364585, 361970, 360579, 355397, 358086, 363210, 370196, 366722, 359373, 362276, 363068, 362012, 365461, 369963, 369082, 368644, 368329, 367833, 368108, 370944, 372710, 368875, 363199, 365391, 360684, 346715, 351082, 360210, 359880, 356601, 356673, 360175, 362795, 362052, 355701, 354851, 360353, 369512, 374583, 373991, 370918, 366986, 362308, 366292, 366509, 363880, 363770, 372120, 378044, 379342, 374788, 369002, 367713, 368786, 371513, 375231, 374091, 377189, 381602, 389547, 387632, 383544, 376720, 372618]
12154C72618L974J258Q02n28j988O97j012n04k799O496M998j369M619M419k975
12139C88706k073k671m19R891K721n38l632P39l400k359l992j689O431R255j096
12124C95874p49k039K063J1262l620k966L76O829K427k874l300l775o62m27J601
12109D00020m243j298J929N639J755J767K844L409k948k31M251M038o698l366
12095D06868P994N84k987O75k485l075q22J885m71o519n422J472O296L962J778
12080D09733j69j484j085j979R002N908R5k137k537N30L107K929j0985j222l0
12065D09676n78l843Q137Q038N13l651n285K226L147Q639m302m274O633M869l265
12050D26680k530L039L205l499l677j631L729P610L529l50l055J543K782r985
$$ y = [372618, 376592, 377850, 378652, 378124, 376136, 376833, 375821, 375317, 372518, 379014, 384012, 382643, 387262, 391681, 388706, 386633, 383962, 383543, 393434, 396155, 395617, 391985, 392724, 389324, 386965, 382973, 381284, 387715, 396970, 395874, 395125, 393086, 395149, 406411, 402791, 399825, 400201, 407030, 409457, 406583, 403283, 399508, 398846, 398419, 400020, 395777, 394479, 396408, 402047, 403802, 405569, 408413, 411822, 408874, 408643, 412894, 416932, 410234, 406868, 414862, 415446, 412459, 413134, 410649, 407574, 406752, 408637, 408166, 401647, 396225, 397697, 403993, 407955, 409733, 409564, 408080, 406995, 405016, 414018, 419926, 420021, 417884, 415347, 415877, 418984, 421913, 410928, 409706, 409676, 409098, 405255, 413392, 421430, 421943, 418292, 413007, 415233, 418380, 427019, 422717, 418443, 425076, 429945, 426680, 424150, 427189, 430394, 426895, 423218, 421587, 425316, 432926, 436455, 436105, 433050, 434593, 437375, 427390]
12036D27390r279L395P136M07J423M1L801L169l973m346q83n532n97k937M557
12021D23772J968N27N235j380K227K146J826K740n165O38M812K177L134O725N516
12006D56898p46J076l234r556n321J15k135K71m943J340M632O209Q608j0306p013
11991D35895M097K836k664M056N027R307N828l774m292k691L256J334K337m34
11977D60118k888k22j70j364k035J728M095N592Q58Q55k262N76K83j356Q897O003
11961D78708J83n762J231K200p107m615O943M245r17n265j917J087l27k706L946
11946D69927P28k611l565O583M387j129l757j054P118l335N193j950O02J819N5
11931D79011L869K237k567n465M576K372j731k417k553O337l450J15m21J81O147
$$ y = [427390, 418111, 421506, 428642, 429049, 430472, 430513, 434314, 437483, 433510, 429164, 428281, 422749, 422152, 419215, 423772, 425740, 426267, 431502, 430122, 432349, 434495, 436321, 439061, 433896, 434534, 439346, 441523, 444657, 451382, 456898, 456152, 457228, 453994, 444438, 439117, 439232, 437097, 437368, 432425, 433765, 438397, 444606, 453214, 442908, 435895, 439992, 442828, 440164, 444220, 449247, 458554, 464382, 460608, 456316, 453625, 456881, 458215, 460552, 460118, 457230, 457008, 456838, 455474, 453439, 455167, 459262, 464854, 465712, 466567, 464305, 464881, 465164, 463808, 472705, 478708, 478891, 473129, 474360, 476560, 469453, 464838, 471781, 476026, 475109, 469844, 467927, 469014, 468687, 465981, 469927, 470655, 468044, 464479, 471062, 475449, 474320, 470563, 469509, 476627, 473292, 478485, 476535, 477137, 478956, 479011, 482880, 485117, 482550, 477085, 481661, 484033, 482302, 479885, 477332, 483669, 480219, 480334, 479913, 480094, 486241]
11916D86241M305M842O140Q97P71j165l293l471j42m517L067O082l442N437P157
11901E08909ol957r323q29P288k836k223m344k127J0573L635l578m91k953j95
11886D97543N909K637K859n008O714k467k357J37m778r88P705L123k213m973M248
11871E08091q71M954L203N558P43O147N547M212m586j1353j1215j265J941p28
11857E10378M31l52N510M567P60p67M543K718n825r780p91N979J885R12o38k802
11841E16728P017P570M152l30j583K847j33o67K733K937O198L671p135o139J735
11826E39601L023K887M321k90K176o279n092M661N914N621j248o26n506R55p702
11811E42416K647N44k421N036P619m783l384J664K680k115N50K327L468K722M23
$$ y = [486241, 490546, 495388, 501528, 502425, 503196, 502031, 498738, 495267, 495125, 490608, 493675, 499757, 496315, 501752, 508909, 508903, 504946, 495623, 494794, 502082, 499246, 497023, 492679, 490552, 501125, 504760, 501182, 500691, 497738, 497543, 503452, 506089, 508948, 503940, 510654, 508187, 505830, 505967, 501189, 500201, 507906, 511029, 508816, 503843, 508091, 507220, 512174, 515377, 520935, 521678, 527825, 533372, 537584, 532998, 521645, 510430, 509165, 511106, 510378, 510809, 510457, 515967, 520534, 521294, 520527, 525070, 527788, 521963, 512183, 511392, 517371, 519256, 520168, 519530, 516728, 523745, 531315, 535467, 535137, 533554, 536401, 536268, 535601, 538334, 541271, 547469, 551140, 544005, 537866, 539601, 542624, 545511, 549832, 549542, 551718, 545439, 540347, 545008, 550922, 556543, 555295, 554669, 549163, 550118, 542416, 545063, 545607, 543186, 548222, 555841, 551058, 547674, 549338, 552018, 549903, 550453, 552780, 556248, 558970, 559393]
11796E59393K696N58N39j751m686K994L246q0j849M693k590L615m68K216M079
11781E72605k80J981J042K085n354j2231L621O881J788m40l090n544J804M449
11767E69317j216J666n77j286O243j932j646N94j267J943N589j236K560k540N779
11752E81991P824M382q102o56M895j246M07P626J317k966o873n407N871O119J54
11737E95336K026o046K927N90n195M408N225L850L234L932K362N193K753L66p566
11722F13395L798L477m280j064j54J886n594j180q7J0136O643j780n191L142o31
11707F22516k999k801j63N335N445r07l327o825K861P050L234J777m642m905j86
11692F21463L447P478L675L223m941k076J384M979K10O46o969m341L666O314L418
$$ y = [559393, 562089, 562647, 563186, 561435, 556749, 559743, 562989, 562909, 561060, 565753, 563163, 566778, 566310, 568526, 572605, 572325, 574306, 575348, 577433, 572079, 559848, 563469, 570350, 572138, 571698, 568608, 563064, 564868, 569317, 568101, 569767, 569190, 567904, 574147, 572215, 570569, 571163, 569896, 571839, 577428, 576192, 578752, 576212, 581991, 589815, 594197, 586095, 585439, 590334, 589088, 589495, 597121, 598438, 595472, 588599, 583192, 589063, 595182, 595336, 597362, 591316, 594243, 594833, 589638, 594046, 599271, 603121, 606355, 610287, 612649, 617842, 620595, 620961, 613395, 617193, 620670, 616390, 615326, 615172, 617058, 611464, 610284, 610197, 620333, 626976, 625196, 620005, 623147, 622516, 619517, 616716, 616553, 621888, 627333, 626426, 623099, 616274, 619135, 626185, 629419, 631196, 626554, 621649, 621463, 624910, 632388, 636063, 639286, 634345, 632269, 633653, 638632, 638842, 639488, 632519, 628178, 631844, 638158, 641576]
11677F41576l288L593K620j468m445M409P199L004K298O212L184n90n233l404
11663F55667n473j605n318P480P74K233L954Rp57p894O701N331N853k48r72l796
11647F61939j851o4j598n728N531n540Q32O594O846M894m54l277m78R210m04k065
11631F74387j060K891N454k371j04j82n613N087P667k494n45n080r07O810O348
11616F90288N986J796N373r255k733j886P97j45K797J961K750j478j192p48m792
11601F89519j972J5744J2841k185K105L701M51k809n662o748J32m037k207N949
11587G04822N011N472K301p398k266O991J034j371J0995N261K521k925m390q950
11573G17108L901P189O516K007j833J358j422j186K227J062K743K797j500J819
$$ y = [641576, 638288, 641881, 644501, 643033, 638588, 642997, 650196, 653200, 655498, 661710, 664894, 664304, 659071, 655667, 650194, 648589, 643271, 650751, 651525, 653758, 657712, 657721, 656964, 649070, 655771, 661102, 666955, 666707, 665735, 661939, 660088, 660024, 658426, 652698, 658229, 652689, 653521, 660115, 666961, 671855, 671401, 668124, 667646, 676856, 676452, 674387, 673327, 676218, 681672, 679301, 679197, 679015, 673402, 678489, 686156, 683662, 683117, 678037, 677130, 683940, 690288, 696274, 698070, 703443, 694188, 691455, 689569, 690366, 690221, 693018, 694979, 697729, 696251, 695059, 694311, 689519, 687547, 703291, 716132, 713947, 716052, 719753, 720204, 717395, 711733, 704985, 705117, 701080, 698873, 704822, 709833, 715305, 717606, 710208, 707942, 714933, 715967, 714596, 725591, 730852, 733373, 730448, 726058, 717108, 721009, 728198, 734714, 736721, 734888, 736246, 734824, 733638, 735865, 736927, 739670, 742467, 740967, 742786]
11559G42786R093o136m975m753J064N322N435N058N390N27j516l078o148l69P478
11544G55178N253N85j487Q99n844l213N733O295M473k068q83J318J250J756k520
11529G66725l038k738r77P776M657N700J49l216L397K511j376L1P78Q127K647
11514G91153n554j225K578O179R461M249j02m719n052j602L302j607m095k289
11500G90677P280M744l214L430Q395J466m902J736J655M121N053n656j910O781
11486H19656L821m211k856M563m984J881Q495P927J441J887o566M09O720l265
11472H34918m569O761n786n545J394K606n336K064K963M362Q22j139M219L894
11458H41628J0262K620N047L89J384j043m404o06M43j631o993K800L111P141O091
$$ y = [742786, 751879, 745743, 740768, 736015, 737079, 742401, 747836, 752894, 758284, 758811, 757295, 754217, 748069, 747700, 755178, 760431, 761016, 759529, 760428, 754584, 751371, 757104, 763399, 767872, 765804, 764921, 766239, 767489, 769245, 766725, 763687, 760949, 759972, 767748, 772405, 778105, 778254, 775038, 778435, 780946, 779570, 779601, 780379, 788506, 791153, 785599, 784374, 786952, 793131, 802592, 806841, 806739, 802020, 796968, 795366, 798668, 797061, 792966, 790677, 797957, 802701, 799487, 802917, 811312, 812778, 807876, 809612, 811267, 815388, 820441, 814785, 812875, 819656, 823477, 819266, 816410, 820973, 815989, 817870, 826365, 834292, 835733, 837620, 831054, 831463, 838183, 834918, 830349, 837110, 831324, 825779, 827173, 829779, 824443, 826507, 829470, 833832, 834654, 833515, 837734, 841628, 851890, 854510, 859557, 859946, 861330, 860287, 855883, 855277, 855720, 854089, 847096, 849896, 853007, 860148, 866239]
11443H66239k17n46J252l94P45n46O438J678J16K504J846K996Q55N651l661J314
11427H86270O846k171k199N949L353k557L59N251M088J058M894K67l715n281J789
11412I04201O904M817M371m431K070N037L52q391P22J730q243l196P758J149R546
11397I24396P536j513j1164K725K887M263k467K141L529O764J194J273J839l840
11383I39563M337j103K780K7L270R76Q340L374L199k60l480J284N545J948j437
11368I68363L729p31k249L514K242k19J599j770r7j046P426n98N932K780n82J674
11352I89967K247M78P66J607l933j688L012Q301O16k199P648L471j958J828L723
11337A013886o508J256L913M771p61l732K327m413J558Q104J2494L03q30j643
$$ y = [866239, 866022, 865476, 866728, 866334, 867079, 866533, 872971, 874649, 874765, 877269, 879115, 882111, 882966, 888617, 884956, 886270, 893116, 890945, 888746, 894695, 898048, 895491, 895850, 901101, 905189, 906247, 911141, 911408, 907693, 902412, 904201, 911105, 915922, 920293, 915862, 917932, 922969, 923321, 914930, 915652, 917382, 909139, 905943, 913701, 914850, 924396, 931932, 930419, 919255, 921980, 924867, 929130, 926663, 928804, 932333, 939097, 940291, 941564, 943403, 939563, 943900, 942797, 945577, 945604, 948874, 949850, 958190, 961564, 964763, 964503, 961023, 962307, 967852, 969800, 968363, 972092, 971361, 969112, 972626, 974868, 974649, 976248, 974478, 974381, 973335, 980761, 980163, 986095, 988875, 988293, 989967, 992214, 992692, 993458, 995065, 991132, 989444, 992456, 1000757, 1001373, 999174, 1006822, 1010293, 1008335, 1010163, 1013886, 1007378, 1008634, 1012547, 1017318, 1016557, 1012825, 1015152, 1010739, 1012297, 1020401, 1032895, 1033198, 1032368, 1030725]
11323A030725K069N141Q808r5p021O89J2006M139o730l785J476L866k756O809
11309A055341J676N008K528K496p84O79N620L91k94j053j720K147Q758O935J163
11294A088891j108L387K207j521M580J572L262r64P96P631Q563O219k029j6009
11280A105477K585L281O676L970K718M65j592L037L304O55j361N584M714j065
11266A138448j661L122L103q415j415Q628M625J026o16j402R148p77K362M154
11252A160330N843L565O641L160l516n031K90M676O030J3020O298j897j222K016
11238A200203J071J416j12l519J529J507J57L664K919M631J1131J516q13J750
11224A227050L482J253M753P74l441l512q78K374R214O712N728L563j916L858
$$ y = [1030725, 1032794, 1037935, 1046743, 1046648, 1039627, 1040316, 1052322, 1056461, 1049731, 1045946, 1047422, 1051288, 1048532, 1055341, 1057017, 1062025, 1064553, 1067049, 1066265, 1066944, 1072564, 1072955, 1072661, 1071608, 1069888, 1072035, 1080793, 1087728, 1088891, 1087783, 1091170, 1093377, 1091856, 1096436, 1098008, 1101270, 1100306, 1101102, 1108733, 1117296, 1123515, 1121486, 1105477, 1108062, 1111343, 1118019, 1121989, 1124707, 1125172, 1123580, 1126617, 1129921, 1130576, 1129215, 1134799, 1139513, 1138448, 1136787, 1139909, 1143012, 1134597, 1133182, 1141810, 1146435, 1147461, 1146845, 1145443, 1154591, 1153814, 1156176, 1160330, 1166173, 1169738, 1176379, 1179539, 1176023, 1170992, 1171282, 1175958, 1181988, 1195008, 1201306, 1199409, 1198187, 1200203, 1201274, 1202690, 1202578, 1199059, 1200588, 1202095, 1202252, 1205916, 1208835, 1213466, 1224597, 1226113, 1225300, 1227050, 1230532, 1231785, 1236538, 1237312, 1233871, 1230359, 1229481, 1231855, 1241069, 1247781, 1253509, 1257072, 1255156, 1259014]
11210A259014O647N980J484k425J01m48m216K398O171J2556N572K901K014J579
11196A299328J906Q543m312j0104L594Q1K122L597J933k428L903K859M087L807
11182A318916P188M774N18Q4J45L20P348O201J660k157m15M976L950K35K158O722
11166A362623J395J762K249r61L332M615J0066N893J0123q4R42Q048J231R43L529
11151A415706J652K686O91L643L873Q88M1M415N44j716O955m612k255P341R159
11136A449011P755m47n410O545N781P023O633L629m237K716K002j337J1494M601
11122A495759n568m353Q353P143N993K407n80J551M524R615M520N40L181Q900
11108A541985N350Q10k110J908N756J1298J847M829P493N94O409j193J339M318
$$ y = [1259014, 1265661, 1271641, 1273125, 1270700, 1270801, 1270353, 1266137, 1268535, 1274706, 1287262, 1292834, 1295735, 1297749, 1299328, 1301234, 1309777, 1305465, 1295361, 1298955, 1299036, 1301158, 1304755, 1306688, 1304260, 1308163, 1311022, 1315109, 1318916, 1326104, 1330878, 1331396, 1331480, 1331625, 1331945, 1339293, 1345494, 1347154, 1344997, 1344582, 1349558, 1353508, 1353743, 1355901, 1362623, 1364018, 1365780, 1368029, 1367068, 1370400, 1375015, 1385081, 1390974, 1401097, 1401013, 1401955, 1410003, 1411234, 1412177, 1415706, 1417358, 1420044, 1420735, 1424378, 1428251, 1429139, 1429180, 1433595, 1434139, 1432423, 1439378, 1434766, 1432511, 1439852, 1449011, 1456766, 1456319, 1450909, 1457454, 1463235, 1470258, 1476891, 1480520, 1476283, 1478999, 1481001, 1479664, 1491158, 1495759, 1490191, 1485838, 1494191, 1501334, 1507327, 1509734, 1509154, 1510705, 1515229, 1524844, 1529364, 1529904, 1533085, 1541985, 1547335, 1548145, 1546035, 1547943, 1553699, 1564997, 1566844, 1571673, 1579166, 1579760, 1586169, 1584976, 1586315, 1590633]
11094A590633Q123M667m750k038R104O390O469J85R13M386O068O948m064n604
11080A627430L288O273Q844q92N661P964K287P043N319O263N465O985Q131j076
11066A698985p98K433Q790P613K677l470p63R105J3395P224L379J1240P119J928
11052A768857k860Q912O685J425K005K212J2177P532J200L938L530j493N865J0860
11038A830845J4713P985J1048N223n471K165P985P900p48J165O661J3510Q277
11025A911258R579J4257P116Q799Q374O123N311P675J7900J3487k163P453J7181
11012B032350J1453J7032J6276J1745P094J076J0803N455j325J2238J8972K5726
11000B168895J7542J9693K6509K9898L0784L5525L6882L9174M5433N3155O8628
$$ y = [1590633, 1598756, 1603423, 1598673, 1596635, 1605739, 1612129, 1618598, 1618783, 1619696, 1624082, 1630150, 1637098, 1633034, 1627430, 1630718, 1636991, 1645835, 1644943, 1650604, 1658568, 1660855, 1667898, 1673217, 1679480, 1684945, 1691930, 1700061, 1698985, 1698187, 1700620, 1709410, 1717023, 1719700, 1716230, 1715467, 1724572, 1737967, 1745191, 1748570, 1759810, 1766929, 1768857, 1765997, 1774909, 1781594, 1783019, 1785024, 1787236, 1799413, 1806945, 1808145, 1812083, 1815613, 1814120, 1819985, 1830845, 1845558, 1853543, 1864591, 1869814, 1864343, 1866508, 1874493, 1882393, 1881645, 1882810, 1889471, 1902981, 1911258, 1920837, 1935094, 1942210, 1951009, 1959383, 1965506, 1970817, 1978492, 1996392, 2009879, 2007716, 2015169, 2032350, 2043803, 2060835, 2077111, 2088856, 2095950, 2097026, 2107829, 2113284, 2111959, 2124197, 2143169, 2168895, 2186437, 2206130, 2232639, 2262537, 2293321, 2328846, 2365728, 2404902, 2450335, 2503490, 2572118]
10989B572118Q6046J01701J20445J24949O4464j72043o48276q56024m34554K00
10979I59026J32363J32248J03381Q5275O7405N4412N0890M9424L8568K8748K9951
10968A731691L1993L1765K2471J4027J3878K0765K1944K3498J5265P507P165P209
10956A949178J4376J4462J3264K014J1978J5315J2248J3610J3649J3916J5373
10945B089383J5928P467J2305J1354N552M729L149P202R949Q428P921J3752P313
10932B204432L537N159J5346J7415J8224Q211N101J8725J4728m04M394R085J3524
10919B337477J2218O564M515Q931O235J1067R356R813R826J3896Q657M864P777
10906B451196J2195L370m081J0860J3594J9304J5241M926O520J5316J0234Q834
$$ y = [2572118, 2658164, 2759865, 2880310, 3005259, 3069723, 2897680, 2249404, 1393380, 958826, 959026, 1091389, 1223637, 1327018, 1412293, 1479698, 1534110, 1585000, 1634424, 1672992, 1701740, 1731691, 1763684, 1795449, 1817920, 1831947, 1845825, 1866590, 1888534, 1912032, 1927297, 1934804, 1941969, 1949178, 1963554, 1978016, 1991280, 1993294, 2005272, 2020587, 2032835, 2046445, 2060094, 2074010, 2089383, 2105311, 2112778, 2125083, 2136437, 2141989, 2146718, 2149867, 2157069, 2167018, 2175446, 2183367, 2197119, 2204432, 2207969, 2213128, 2228474, 2245889, 2264113, 2272324, 2277425, 2296150, 2310878, 2310474, 2314868, 2323953, 2337477, 2349695, 2356259, 2360774, 2369705, 2375940, 2387007, 2396363, 2406176, 2416002, 2429898, 2438555, 2443419, 2451196, 2463391, 2466761, 2462680, 2473540, 2487134, 2506438, 2521679, 2526605, 2533125, 2548441, 2558675, 2567509]
10894B567509N083M186L586O171N659J1432K0358K2871J8118J1773J40J1597Q603
10881B697086R643J9414J7692R704N669k096N993J1008J801M953N383J5631J7903
10868B819784J3298L662N430J7209J2320P872Q113J1042Q812J1366J1182J6540
10856B946630J5847J9199K0858K1609K3052J7345K2390J5647J0056J370n49R221
10844C122675K56k74O854K2479K1401J4004O315J1355N056j2565q58L0967M4066
10831C271731K3702L381K790M964K445J9755J6525P806n609j0896K958M969R943
10818C354464J4593Q093L669L757J9217K7576K2619J7457K0257K8200K4096J4513
10806C558511J2449J8240J3279J1248J2210J7461J9419K4778K3894K8532K9408
$$ y = [2567509, 2572592, 2576778, 2580364, 2586535, 2592194, 2603626, 2623984, 2646855, 2664973, 2676746, 2676886, 2688483, 2697086, 2706729, 2726143, 2743835, 2753539, 2759208, 2757112, 2763105, 2774113, 2775914, 2780867, 2786250, 2801881, 2819784, 2833082, 2836744, 2842174, 2859383, 2871703, 2879575, 2887688, 2898730, 2907542, 2918908, 2930090, 2946630, 2962477, 2981676, 3002534, 3024143, 3047195, 3064540, 3086930, 3102577, 3112633, 3114003, 3113454, 3122675, 3122931, 3122657, 3129511, 3151990, 3173391, 3187395, 3193710, 3205065, 3210121, 3197556, 3196698, 3227665, 3271731, 3295433, 3298814, 3301604, 3306568, 3309013, 3328768, 3345293, 3353099, 3347490, 3336594, 3339552, 3344521, 3354464, 3369057, 3377150, 3380819, 3384576, 3403793, 3431369, 3453988, 3471445, 3491702, 3519902, 3543998, 3558511, 3570960, 3589200, 3602479, 3613727, 3625937, 3643398, 3662817, 3687595, 3711489, 3740021, 3769429]
10795C769429K1082J4667J7836J4961K0093K0085K2115K1301K0127J5319J2665
10784C969680J9992J2311K0049K1190J7935K7860L3992L0389K0071J9167J8489
10773D211125J7368K3534J4795R634J1827L2146M0547N1365M5997L1658J4292
10762D504288k591K014j937j3653O796K4174M7152N7165M2523L3434K5346K6317
10750D751028K5222K9686L6436L6288K6723K1496K3929K6415K1258K4918L1658
10739E055057K3654J2036J7533J0489R40R29j3525l4743l6855J755J27141K18310
10727E382721J70974J04197O0813M1761M6856M7103L7067M2175M0991M5369M1381
10716F061408M0711M1380M7216N2371Q7010J18133J50629J75041J66889N9486
$$ y = [3769429, 3790511, 3805178, 3823014, 3837975, 3858068, 3878153, 3900268, 3921569, 3941696, 3957015, 3969680, 3989672, 4001983, 4022032, 4043222, 4061157, 4089017, 4123009, 4153398, 4173469, 4192636, 4211125, 4228493, 4252027, 4266822, 4276456, 4288283, 4320429, 4360976, 4412341, 4458338, 4489996, 4504288, 4501697, 4503711, 4501774, 4488121, 4494917, 4519091, 4566243, 4623408, 4665931, 4699365, 4724711, 4751028, 4776250, 4805936, 4842372, 4878660, 4905383, 4926879, 4950808, 4977223, 4998481, 5023399, 5055057, 5078711, 5090747, 5108280, 5118769, 5119709, 5120638, 5107113, 5072370, 5035515, 5037270, 5164411, 5382721, 5553695, 5657892, 5718705, 5760466, 5807322, 5854425, 5891492, 5933667, 5974658, 6020027, 6061408, 6102119, 6143499, 6190715, 6243086, 6330096, 6448229, 6598858, 6773899, 6940788, 7000274]
10706G000274j08267j91712j14053K3767J11220J08637J31596J54358Q0391l8665
10696G157546p8972m4390J2566M7343M9393N1638O5741Q1508Q5114Q5813Q3530
10685G596830P7746P2611P3610P6216Q0618O9152P0804Q7928R1427Q6416R0360
10674H473718R7866Q6406Q7160Q8040Q1894Q5718Q5183Q8883R0640R6456R9431
10663I461395J20264J26534J31205J22428J09583J11307J23616J35577J41356
10654A0583265J49837J60322J56938J38626J43829J57306J52037J37745J34140
10645A1914045J43895J56516J70017J72668J82132J82557J93961K09379K27473
10636A3552643K32775K48801K55866K70313K84712K83981K79025K67606K60860
$$ y = [7000274, 6892007, 6700295, 6586242, 6610009, 6721229, 6829866, 6961462, 7115820, 7196211, 7157546, 7078574, 7034184, 7046750, 7094093, 7143486, 7195124, 7260865, 7342373, 7427487, 7513300, 7596830, 7674576, 7747187, 7820797, 7897013, 7977631, 8046783, 8117587, 8205515, 8296942, 8383358, 8473718, 8571584, 8657990, 8745150, 8833190, 8915084, 9000802, 9085985, 9174868, 9265508, 9361964, 9461395, 9581659, 9708193, 9839398, 9961826, 10071409, 10182716, 10306332, 10441909, 10583265, 10733102, 10893424, 11050362, 11188988, 11332817, 11490123, 11642160, 11779905, 11914045, 12057940, 12214456, 12384473, 12557141, 12739273, 12921830, 13115791, 13325170, 13552643, 13785418, 14034219, 14290085, 14560398, 14845110, 15129091, 15408116, 15675722, 15936582]
10627A5936582K70054K87597L02720L26801L34756L54009L80703M07793M20353
10618A9021368M20186M28471M44803M61828M88640N30686N79332O18738O57521
10609B3651573O78159P16821P76848Q00247Q08743Q63777R66240J079692J180898
10600C1522998J282191J378285J446939J381072J076524P31557J054287J843769
10592D1717622K360754K660352K892479L134415L432995L873419M445642N162826
10584F9680504O074305P095221Q146893R711392J2091014J4876694J8146605K1573053
10576A67395681K1892149Q118868m1413961j27209314j52549590p0971680K007477
10569a92730370K2290427K2364809J8464537J4694666J1976870R905676Q177488
$$ y = [15936582, 16206636, 16494233, 16796953, 17123754, 17458510, 17812519, 18193222, 18601015, 19021368, 19441554, 19870025, 20314828, 20776656, 21265296, 21795982, 22375314, 22994052, 23651573, 24329732, 25046553, 25823401, 26623648, 27432391, 28296168, 29262408, 30342100, 31522998, 32805189, 34183474, 35630413, 37011485, 38088009, 38819566, 39873853, 41717622, 44078376, 46738728, 49631207, 52765622, 56198617, 60072036, 64517678, 69680504, 75754809, 82850030, 90996923, 100708315, 112799329, 127676023, 145822628, 167395681, 189287830, 197406698, 155992737, 28783423, -123766167, -194737847, -192730370, -170439943, -148075134, -129610597, -114915931, -102939061, -93033385, -84855897]
10562h4855897O916380O004109N294379M676716M110043L650960L252951K844292
10554d8106067K527821K324458K194364K019923J687656J078099N71257P71297
10546c4931192J160324J234849J169652J111919J050568R70035Q97611Q16131
10538b6520103P48486P22811O88852O38729N97984N78585N58700N29680N21875
10529b0934401N07462M67868M44473M15380L90104L80169L76639L61412L53625
10520a7237269L48246L53191L37392L10579K81342K53155K38148K23909K25297
10511a4666010K20672K09257K04547K05106J90002J91630J90185J90677K03831
10502a2860103J97635J84764J89857J94964J84686J59415J52075J46369J45668
$$ y = [-84855897, -77939517, -71935408, -66641029, -61964313, -57854270, -54203310, -50950359, -48106067, -45578246, -43253788, -41059424, -39039501, -37351845, -36273746, -35702489, -34931192, -33770868, -32536019, -31366367, -30254448, -29203880, -28233845, -27336234, -26520103, -25771617, -25048806, -24359954, -23721225, -23123241, -22544656, -21985956, -21456276, -20934401, -20426939, -19959071, -19514598, -19099218, -18709114, -18328945, -17952306, -17590894, -17237269, -16889023, -16535832, -16198440, -15887861, -15606519, -15353364, -15115216, -14891307, -14666010, -14445338, -14236081, -14031534, -13826428, -13636426, -13444796, -13254611, -13063934, -12860103, -12662468, -12477704, -12287847, -12092883, -11908197, -11748782, -11596707, -11450338, -11304670]
10493a1304670J42856J20137J12236J21574J24704J27203J24590J21838J16764
10484a0192768R2090J00294J10640J09238J05983R2199R0958R8845J06095J12512
10474i173914R8276R1530Q3196P8076P8433P4660Q3699R0263Q3909Q5985R0214
10463h235673P7739O8682P7855P4074O9461N6107M1868M7914N6158P0349Q0422
10452g515044J07438J39780J34158J12508P5826k7804o5084p242M5449K3759M546
10441f971710J39940K43755K03122O9899m6350p2872l6945k20K3498L8775N4640
10430f354468M9754M2460M7646N0086M8882M6117M6852M8107L4083K7309R006
10419e904166q927o3083j31408j00367M3840J19739J11900Q2796O6353O8103N4475
$$ y = [-11304670, -11161814, -11041677, -10929441, -10807867, -10683163, -10555960, -10431370, -10309532, -10192768, -10100678, -10000384, -9889744, -9780506, -9674523, -9582324, -9491366, -9392521, -9286426, -9173914, -9075638, -8984108, -8900912, -8822836, -8744403, -8669743, -8586044, -8495781, -8411872, -8325887, -8235673, -8157934, -8089252, -8011397, -7937323, -7867862, -7811755, -7769887, -7721973, -7665815, -7595466, -7515044, -7407606, -7267826, -7133668, -7021160, -6945334, -6973138, -7038222, -7045464, -7000015, -6976256, -6971710, -6831770, -6588015, -6384893, -6314994, -6361344, -6434216, -6471161, -6471381, -6447883, -6409108, -6354468, -6304714, -6262254, -6214608, -6164522, -6115640, -6069523, -6022671, -5974564, -5940481, -5913172, -5904166, -5913093, -5976176, -6107584, -6207951, -6164111, -6044372, -5932472, -5849676, -5783323, -5715220, -5660745]
10408e660745M7443M4680M6329M2161L5621L5546M1149L2725L5067L4502L2378
10397e233144K7147L0293K6212K3671K9161K3237M992p16j02K0877M7578N4129
10385d946665O1016N2513L9791L8305K4626K711j727Q74J5349K3997L4875L1915
10373d622420K1340K8937L6053K0431J5723K1915J3658J9780J8673J5211K7922
10362d382777K4224J7679K1960K9576K6415J5188K0626K0779J8999K1625K5910
10351d139796K3633J5958J1246O137J1334J4270J0739J3179J4421K6917L1110
10340c960852K3654R150K2178K0443J5672J1199J6513K3796J0351M903J3189J8694
10328c771110J2961R025J7938J9552J6665K6162K1806J4656K2091K3502J8143
$$ y = [-5660745, -5613302, -5568622, -5522293, -5480132, -5444511, -5408965, -5367816, -5335091, -5300024, -5265522, -5233144, -5205997, -5175704, -5149492, -5125821, -5096660, -5073423, -5068431, -5069147, -5069249, -5048372, -5000794, -4946665, -4885649, -4833136, -4793345, -4755040, -4730414, -4727703, -4729430, -4728556, -4713207, -4689210, -4654335, -4622420, -4601080, -4572143, -4536090, -4515659, -4499936, -4478021, -4464363, -4444583, -4425910, -4410699, -4382777, -4358553, -4340874, -4318914, -4289338, -4262923, -4247735, -4227109, -4206330, -4187331, -4165706, -4139796, -4116163, -4100205, -4088959, -4082822, -4071488, -4057218, -4046479, -4033300, -4018879, -3991962, -3960852, -3937198, -3928048, -3905870, -3885427, -3869755, -3858556, -3842043, -3818247, -3807896, -3802993, -3789804, -3771110, -3758149, -3749124, -3731186, -3711634, -3694969, -3668807, -3647001, -3632345, -3610254, -3586752, -3568609]
10317c568609Q657P946J2893O268K003O260J1456K1651J6182m028L073J4929J5904
10304c445415K0292K6272J9265R036J462J5764K1950J5512J8250J3720J692L067
10292c279133R304L642N840J1549J2796Q286M994Q440J5105J4981J9079J6653
10280c148464R196J1442J1125O858Q522J5409J7632J7098J3734J5724P997J3490
10268c000237K0042J7410P679q67j2446J121J5540J6370J3275K02L382N819P861
10255b904849J0141J2391N134J3706J6872J7364Q178L348N495L653R018J2311
10243b787238J1324M483M727J2387M485M675R690R628M058M642J5058J3844Q589
10230b679648M249K566J0397R168R601R077O827R934J1718R729P099J1283O212
$$ y = [-3568609, -3559952, -3552006, -3539113, -3532845, -3530842, -3524582, -3513126, -3491475, -3475293, -3479321, -3476248, -3461319, -3445415, -3425123, -3398851, -3379586, -3370550, -3369088, -3353324, -3331374, -3315862, -3297612, -3283892, -3282200, -3279133, -3269829, -3266187, -3260347, -3248798, -3236002, -3227716, -3222722, -3214282, -3199177, -3184196, -3165117, -3148464, -3139268, -3127826, -3116701, -3109843, -3101321, -3085912, -3068280, -3051182, -3037448, -3021724, -3013727, -3000237, -2980195, -2962785, -2955106, -2955973, -2968419, -2967298, -2951758, -2935388, -2922113, -2921911, -2918529, -2912710, -2904849, -2894708, -2882317, -2877183, -2863477, -2846605, -2829241, -2821063, -2817715, -2812220, -2808567, -2799549, -2787238, -2775914, -2771431, -2766704, -2754317, -2749832, -2745157, -2735467, -2725839, -2721781, -2717139, -2702081, -2688237, -2679648, -2675399, -2672833, -2662436, -2653268, -2643667, -2634590, -2627763, -2617829, -2606111, -2596382, -2589283, -2578000, -2571788]
10217b571788J415P339M768K881M864J3757J1390M342Q342J4290J6992J1359R349
10204b460700J2058J0586L752j334M533J1548J2571P565J2198r21K52J0949J7109
10191b359834K3874J7034J7912M275K872J4335J6008J3272J7210O273P690R256
10179b209823J6886K3703J2973J7192J7774J7518J1682K8857L5761L5256L5684
10168a956537L7412M5090N0575O4395P7480R1300J14176J28522J17462j6691l98017
10157a644833q40438o92837j69889Q5841J26601J18059R8746Q6355N8655N6628
10147b717112M9939L9010L4715L0307L2907K7535K3311J7042J9465K1616J5133
10136b406132J7716J2175M571R660J0840J4982J6374J0566M708J2971Q506P375
$$ y = [-2571788, -2570373, -2563034, -2558266, -2555385, -2550521, -2536764, -2525374, -2521032, -2512690, -2498400, -2481408, -2470049, -2460700, -2448642, -2438056, -2434304, -2435638, -2431105, -2419557, -2406986, -2399421, -2387223, -2388144, -2387892, -2376943, -2359834, -2335960, -2318926, -2301014, -2296739, -2293867, -2279532, -2263524, -2250252, -2233042, -2226769, -2219079, -2209823, -2192937, -2169234, -2156261, -2139069, -2121295, -2103777, -2092095, -2063238, -2027477, -1992221, -1956537, -1919125, -1874035, -1823460, -1759065, -1681585, -1590285, -1476109, -1347587, -1230125, -1246816, -1644833, -2485271, -3178108, -3347997, -3262156, -3135555, -3017496, -2918750, -2832395, -2773740, -2717112, -2667173, -2628163, -2593448, -2563141, -2530234, -2502699, -2479388, -2462346, -2442881, -2421265, -2406132, -2388416, -2376241, -2371670, -2362010, -2351170, -2336188, -2319814, -2309248, -2304540, -2291569, -2283063, -2275688]
10124b275688L512N013J3367J0132M902O723N467L022J0118O995P599J898J2209
10111b184731K2312J0555m78P175P67J109J1057M373J0526O710J0097J5597R570
10098b075361J008m345j028O612J0507m45j204O014R454J3777P613N945k111J136
10084b022428O187O630N208K904L985P426O482J11j783M943k806N352P441N733
10070a964615N074L152J601M064M587P951J3307Q843l699M99l46k282P52J105
10056a920007J2152J2763N002J4788R937N772L600j240m245J666J90N713K246
10043a851663L325P504P461P866m478r123k723M93j907P064R673Q220J121O485
10029a810682J150Q1K582Q58O002J2300O698o90J807O767l70L881J546Q04m452
$$ y = [-2275688, -2272176, -2267163, -2253796, -2243664, -2238762, -2232039, -2226572, -2223550, -2213432, -2206437, -2198838, -2196940, -2184731, -2162419, -2151864, -2152342, -2145167, -2144400, -2143291, -2132234, -2127861, -2117335, -2110625, -2100528, -2084931, -2075361, -2074353, -2078698, -2079726, -2073114, -2062607, -2063052, -2064256, -2058242, -2048788, -2035011, -2027398, -2021453, -2023564, -2022428, -2016241, -2009611, -2004403, -2001499, -1997514, -1990088, -1983606, -1983495, -1985278, -1980335, -1983141, -1977789, -1970348, -1964615, -1959541, -1956389, -1954788, -1950724, -1946137, -1938186, -1924879, -1916036, -1919735, -1919236, -1919582, -1921864, -1921112, -1920007, -1907855, -1895092, -1890090, -1875302, -1865365, -1859593, -1855993, -1857233, -1861478, -1859812, -1859622, -1853909, -1851663, -1848338, -1840834, -1833373, -1825507, -1829985, -1839108, -1841831, -1841338, -1843245, -1836181, -1826508, -1818288, -1817167, -1810682, -1809532, -1809451, -1806869, -1806011, -1800009, -1787709, -1781011, -1781701, -1779894, -1773127, -1773497, -1769616, -1768070, -1767266, -1771718]
10014a771718K710N329Q539M197N222M088L71Q006j288n643J602L730K822N605
10000a726428P590J3528P465N130K30l995L430M159m768l257N455K567j424J220
9986a689098K954R574J1390Q755n739j285K070K996p69L412L798j469J1022N551
9972a636838J015j079k2K800M299O668K659k143o53L218k85O103O703M563Q53
9957a602139r302J2090P381o365n576k87O087R295J3105L666n261l552Q343L928
9943a568587K597q461P538J3780O355J630J065k665J170R81Q463J924J41M736
9929a529333n37k409O640Q591N477K734L378j507J331K745N745M839l863n556
9915a501725K507Q272M934o54K793J0875K663O024J325J734o216l210p476p470
$$ y = [-1771718, -1769008, -1763679, -1755140, -1750943, -1745721, -1741633, -1741262, -1733256, -1734544, -1740187, -1738585, -1734855, -1732033, -1726428, -1718838, -1705310, -1697845, -1692715, -1692485, -1696480, -1693050, -1688891, -1693659, -1696916, -1691461, -1688894, -1690318, -1689098, -1686144, -1676570, -1665180, -1656425, -1662164, -1663449, -1661379, -1658383, -1659152, -1655740, -1651942, -1653411, -1642389, -1636838, -1635823, -1636902, -1636924, -1634124, -1629825, -1623157, -1620498, -1622641, -1623294, -1620076, -1620361, -1614258, -1607555, -1602992, -1602139, -1611441, -1599351, -1591970, -1598335, -1603911, -1604198, -1598111, -1588816, -1575711, -1572045, -1577306, -1580858, -1572515, -1568587, -1565990, -1574451, -1566913, -1553133, -1546778, -1545148, -1544083, -1546748, -1545578, -1544597, -1536134, -1534210, -1534069, -1529333, -1529870, -1532279, -1525639, -1517048, -1511571, -1508837, -1505459, -1506966, -1505635, -1502890, -1497145, -1492306, -1496169, -1501725, -1499218, -1490946, -1486012, -1486666, -1483873, -1472998, -1470335, -1464311, -1462986, -1461252, -1467468, -1470678, -1478154, -1485624]
9901a485624M073K871O948M083P559J309j17J810l036M202P420L802m98q070K943
9886a450325J0137L677P66J0218K300k662l105M390M047N119N492N360k041K722
9872a403905Q885N723J780P006k903j0224k016j971M671P599Q656N021l588K045
9858a373221O982J0125J1423J722r577J737P302P705K489O214N227k13L741O677
9844a311667K775l682M330O754Q198M824O701Q917N600J3100j81J0410K4289J4395
9830a205237J8479J4099K4480K7802K7292J7624n7247j56469j78385j11236j7285
9819a596083K2766L3686L5576K4625J7835J8306J3394J5960J6346N742M306J913
9807a385628Q77N046Q236O954K174L501J119L550Q797J0735J0532m7j0231l05
$$ y = [-1485624, -1481551, -1478680, -1471732, -1467649, -1460090, -1458781, -1458898, -1457088, -1460124, -1455922, -1448502, -1444700, -1445198, -1453268, -1450325, -1440188, -1436511, -1435745, -1425527, -1423227, -1425889, -1428994, -1424604, -1420557, -1415438, -1409946, -1404586, -1406627, -1403905, -1395020, -1389297, -1387517, -1380511, -1383414, -1393638, -1395654, -1397625, -1392954, -1385355, -1376699, -1371678, -1375266, -1373221, -1366239, -1356114, -1344691, -1342969, -1352546, -1350809, -1343507, -1335802, -1333313, -1327099, -1321872, -1322085, -1318344, -1311667, -1308892, -1312574, -1308244, -1301490, -1293292, -1288468, -1281767, -1272850, -1267250, -1254150, -1254331, -1243921, -1219632, -1205237, -1186758, -1172659, -1148179, -1120377, -1093085, -1075461, -1132708, -1289177, -1467562, -1578798, -1596083, -1573317, -1539631, -1504055, -1479430, -1461595, -1443289, -1429895, -1413935, -1397589, -1391847, -1387541, -1385628, -1384751, -1379705, -1371469, -1364515, -1362341, -1358840, -1357721, -1354171, -1345374, -1334639, -1324107, -1324154, -1334385, -1334690]
9793a334690Q885N024K238K353n392J514N470J441M523K374R515N669Q94p776
9779a297958M71R770P253j743l143l299J648j297j621N498J1619M179M684l29
9765a264268m192J434P501P296J874k743J603L576K426q81P70P200k402q954M082
9750a245678Q080M688m808j254q12o78N919M874p16J825O171P248O876j028n661
9735a214954m804M670J440J805O100O693m18n669j830p531M88Q479M385n5K117
9720a199084m090P44p66K085P049N173Q853j321m11k289j830N971P250j55K775
9705a170046q8N036N505k990K407Pl0m660m846j731J145Q759P039l090J461m7
9689a156169j289Q419O523L367l255n990n927o55J491j982K924J1507N659m983
$$ y = [-1334690, -1325805, -1320781, -1318543, -1316190, -1321582, -1320068, -1314598, -1313157, -1308634, -1306260, -1296745, -1291076, -1290182, -1297958, -1297487, -1287717, -1280464, -1282207, -1285350, -1288649, -1287001, -1288298, -1289919, -1284421, -1272802, -1268623, -1263939, -1264268, -1268460, -1267026, -1259525, -1252229, -1250355, -1253098, -1251495, -1247919, -1245493, -1246374, -1245604, -1238404, -1240806, -1249760, -1245678, -1237598, -1232910, -1237718, -1238972, -1239784, -1240462, -1234543, -1229669, -1230385, -1228560, -1222389, -1215141, -1208265, -1209293, -1214954, -1219758, -1215088, -1213648, -1211843, -1205743, -1199050, -1199468, -1205137, -1206967, -1214498, -1214010, -1205531, -1201146, -1201201, -1199084, -1203174, -1202430, -1203196, -1201111, -1194062, -1188889, -1180036, -1181357, -1181768, -1184057, -1185887, -1179916, -1172666, -1172821, -1170046, -1170134, -1165098, -1159593, -1162583, -1160176, -1160169, -1160199, -1164859, -1169705, -1171436, -1170291, -1161532, -1154493, -1157583, -1156122, -1156169, -1157458, -1149039, -1142516, -1139149, -1142404, -1148394, -1154321, -1154976, -1153485, -1155467, -1152543, -1141036, -1135377, -1140360]
9675a140360K870L965M552M758j554L14N594J293p54M543J1648Q97j0820j200
9661a114254M693K152j71Q391K848j854J510K529l417n855J457K931K162L981
9647a092897j735j857L205j557q58j948j191K8O806N717K783J177j313L938m483
9632a084185l059L758R254P06j952K374l678l148J0918N001p578n246n53j912
9618a079300J233N978J1381m856K963M161J232k74j86o903J517L072P400M144
9604a048438M85K521K95k717J461O716j566J234J783j926j01L65J082J195K452
9589a035159O135L75l006J912J68L979j119j539j200O397L053r29K992L111J221
9574a013609l905m977J0781L828m26Q973k243o155J50L308k067l17M846j822r464
$$ y = [-1140360, -1137490, -1133525, -1128973, -1124215, -1125769, -1125455, -1119861, -1118568, -1119322, -1114779, -1103131, -1102234, -1113054, -1114254, -1109561, -1107409, -1107580, -1099189, -1096341, -1098195, -1096685, -1094156, -1097573, -1103428, -1101971, -1099040, -1096878, -1092897, -1094632, -1096489, -1093284, -1094841, -1095699, -1097647, -1098838, -1098810, -1092004, -1086287, -1083504, -1082327, -1083640, -1079702, -1084185, -1087244, -1083486, -1074232, -1073526, -1075478, -1073104, -1076782, -1079930, -1069012, -1064011, -1071589, -1076835, -1077388, -1079300, -1078067, -1072089, -1060708, -1065564, -1062601, -1058440, -1057208, -1057482, -1057668, -1064571, -1063054, -1059982, -1052582, -1048438, -1047953, -1045432, -1045137, -1047854, -1046393, -1039677, -1041243, -1040009, -1038226, -1040152, -1040253, -1039888, -1038806, -1037611, -1035159, -1029024, -1028649, -1031655, -1029743, -1029575, -1025596, -1026715, -1028254, -1029454, -1023057, -1020004, -1020933, -1017941, -1014830, -1013609, -1017514, -1022491, -1011710, -1007882, -1008308, -999335, -1001578, -1007733, -1007583, -1004275, -1006342, -1006659, -1001813, -1003635, -1013099]
9559a013099m11M952M930J802M224O092K569O35m247j817K399N419N286K811j477
9544i79932n009J139j837l841q87K1L564M542R35O703O245l025P19J283m760o071
9528i80211O77L737N244p84o539k78K80m72N585Q729N29p78J467N93O316k692
9512i58597M054j964q502Q171O894O100N914L74k707P07K996l801J838k560l471
9497i44554N355J0737J814J86J630K650j734J529K07l404l1K857K288K959j521
9482i19032L873L504j92k568k825j677p49K042Q3L118p53J620l07M447l543o599
9466i19558M146N778J31J000n893K671O64K597K463K657M782P57l987M140J484
9451h96168k890O18q22J144R701o697p163J1311J1193K721j510q611m413K491
$$ y = [-1013099, -1013510, -1008558, -1003628, -1001826, -997602, -991510, -988941, -988306, -992553, -994370, -991971, -986552, -981266, -978455, -979932, -984941, -983802, -985639, -989480, -990367, -990346, -986782, -982240, -981305, -974602, -968357, -971382, -970663, -969380, -974140, -980211, -979534, -975797, -970553, -971337, -977876, -978154, -977874, -978346, -972761, -964032, -963503, -964281, -962814, -962221, -955905, -958597, -954543, -956507, -965009, -956838, -949944, -943844, -937930, -937556, -940263, -939556, -936560, -940361, -938523, -941083, -944554, -939199, -928462, -926648, -926462, -924832, -922182, -923916, -922387, -922180, -925584, -925615, -922758, -920470, -917511, -919032, -915159, -911655, -911847, -914415, -917240, -918917, -919666, -917624, -917541, -914423, -915176, -913556, -913863, -909416, -912959, -919558, -915412, -909634, -909503, -908503, -914396, -911725, -911061, -908464, -906001, -903344, -898562, -897805, -901792, -897652, -896168, -899058, -898440, -899262, -898118, -888417, -895114, -902277, -890966, -879773, -877052, -878562, -887173, -891586, -889095]
9437h89095P320P791k217J289q83J072J547L572k754K64N719L298M250j039q21
9422h60687J317K441l119N506K102M780N096Q70n447k058M290k086o32J851k021
9407h47797K487N686m904K515j00J44J1182M365O16J922K984J357p799k774N568
9392h24548N428R204L778J632j1p7p117o35j588N392J999L289N682l587k987P737
9376g96409M401O805q97m632O598k64k500N439j097M074K810n846N652M902O177
9361g64787m50N946L409M8P749M140p878l113L735J0066Q722N386L493j254N97
9346g24191K078P768O665o554L172J771K036R83R388Q359Q707J0066Q871P273
9332f53608J0603M729N295K909R385J3296J4768J5601J1307R707Q081R602J8903
$$ y = [-889095, -881775, -873984, -876201, -874912, -875795, -874723, -873176, -869604, -872358, -872094, -866375, -863077, -858827, -859866, -860687, -859370, -856929, -860048, -854542, -852440, -847660, -842564, -841694, -847141, -849199, -844909, -846995, -847627, -845776, -847797, -845310, -839624, -844528, -842013, -842113, -841969, -830787, -826422, -825806, -823884, -820900, -819543, -827342, -830116, -824548, -819120, -809916, -806138, -804506, -804517, -804594, -811711, -812346, -813934, -808542, -806543, -803254, -797572, -801159, -804146, -796409, -792008, -785203, -786100, -790732, -784134, -784398, -786898, -781459, -782556, -778482, -775672, -781518, -775866, -770964, -764787, -765237, -759291, -755882, -755834, -748085, -743945, -751823, -754936, -751201, -741135, -732413, -727027, -723534, -724788, -724191, -722113, -714345, -707680, -714234, -711062, -709291, -707255, -706272, -696884, -688525, -679818, -669752, -660881, -653608, -643005, -638276, -632981, -630072, -620687, -607391, -592623, -577022, -565715, -556008, -547927, -538325, -519422]
9319e19422K3651K5113K1481J4299J5424K6938L2548K7735L7221M3034L8814L9564
9307a73600L6038K7264M412m2114j14086j89374k58194k88240k56376j75612q9587
9296a519469k6064K817K0192L6087M1127L6073L7200L1850K6092K7543K3899J8145
9284a244508J6725K0920J8701J8396J7454J7980J9449J3853P478M084J1911J0648
9272a066909J0756O064J2673R797R11k352L659R100P315J5067P042K756K82Q228
9258i75611P916l178L710J159J344K471L431L206O621O179p078m358l55J592m67
9243i53418J2871J0771N613P395P790j191k091n277k668R90N828l88P072P636
9229h99067R58N70K546k662K3L406q15j136j37M518O720N944J020K965J075n964
$$ y = [-519422, -495771, -470658, -449177, -434878, -419454, -392516, -359968, -332233, -295012, -251978, -213164, -173600, -137562, -110298, -105886, -148000, -262086, -451460, -709654, -997894, -1254270, -1429882, -1519469, -1545533, -1542716, -1522524, -1486437, -1445310, -1409237, -1372037, -1340187, -1314095, -1286552, -1262653, -1244508, -1227783, -1206863, -1188162, -1169766, -1152312, -1134332, -1114883, -1101030, -1093552, -1089468, -1077557, -1066909, -1056153, -1050089, -1037416, -1027619, -1026708, -1029060, -1025401, -1016301, -1008986, -993919, -986877, -984121, -983839, -975611, -967695, -970873, -967163, -966004, -964660, -962189, -958758, -955552, -948931, -942752, -949830, -954188, -954543, -952951, -953418, -940547, -929776, -924163, -916768, -908978, -910169, -912260, -917537, -920205, -919215, -913387, -913775, -906703, -899067, -898109, -897539, -894993, -897655, -897632, -894226, -895041, -896177, -896314, -891796, -885076, -879132, -878112, -875147, -874072, -880036]
9213h80036m314J0048J194L944N325p47M310L545J046p44K947K296J397O067n026
9198h48748m421p62R00o69l176q59M248M894L757J648q801j535J957M113L164
9183h44290k703L064j724O296J4669L64o886L546q1L818L015k6j525k726j206
9168h26395J685J193R55K866N162q851m826Q927N334R4m475m16J567J1150R414
9153g96616l942N33N53p644o479L246M956L905P01K512J4J213m653q903J680L903
9137h05021L990n882L206N130L062k085pL014k253L37N272Q309L241j080n987
9122g86754l359O465k991J51P067k274l040m207M88o16M958N834j347m666K681
9107g81610Q088l766n226L450K822m208J332K045N663l653J209J1409P405n784
$$ y = [-880036, -884350, -874302, -873108, -869164, -863839, -864586, -860276, -856731, -855685, -856429, -853482, -851186, -849789, -843722, -848748, -853169, -853931, -853031, -853700, -856876, -857735, -853487, -848593, -844836, -843188, -851989, -853524, -851567, -847454, -844290, -846993, -843929, -845653, -839357, -824688, -824324, -831210, -827664, -827745, -823927, -820912, -820938, -822463, -825189, -826395, -824710, -823517, -822562, -819696, -814534, -823385, -828211, -819284, -813950, -813856, -818331, -818747, -817180, -806030, -796616, -800558, -800025, -799472, -807116, -813595, -810349, -805393, -801488, -800787, -798275, -798261, -797048, -801701, -810604, -808924, -805021, -801031, -806913, -803707, -798577, -795515, -797600, -797607, -794593, -796846, -796509, -791237, -782928, -779687, -780767, -786754, -790113, -783648, -786639, -786488, -779421, -781695, -784735, -788942, -788454, -789070, -784112, -778278, -779625, -784291, -781610, -773522, -777288, -782514, -779064, -776242, -780450, -779118, -777073, -771410, -775063, -773854, -762445, -755040, -760824]
9093g60824m561Q450L838k489k409m407o641L67K271P85M7L704K173o58j977k143
9077g64474O054m071k989m410k100J7092L990j220K175j57J314Q24k582O38l263
9062g53179n136R02J0246Q238m392l584j314N770j786n674l270M118j262j489
9048g51812K836P273N220K392J565k134k561k978P255L269l084n809k438M201
9034g36805O544M063o347j719K994n292l130P705J1490o29k987p677J864j576
9020g31502k10j08J407k883k815j100k458M003N665R146M536M629j958n364p563
9005g26575L261O603q126j2223O061N061J827J463q396l695R79N874K976k993
8991g27903L677o430j420M436Q353Q276K680l317p672j082N38O829J986q17J667
$$ y = [-760824, -765385, -756935, -753097, -755586, -757995, -762402, -769043, -768676, -766405, -765620, -765573, -761869, -759696, -760354, -762331, -764474, -758420, -762491, -765480, -769890, -771990, -754898, -750908, -752128, -749953, -750110, -748796, -747972, -750554, -749916, -753179, -758315, -757413, -747167, -738929, -743321, -746905, -748219, -742449, -744235, -749909, -753179, -749061, -750323, -751812, -748976, -741703, -736483, -734091, -732526, -734660, -737221, -740199, -732944, -729675, -732759, -738568, -741006, -736805, -730261, -726198, -732545, -734264, -731270, -736562, -739692, -731987, -720497, -721126, -724113, -731790, -729926, -731502, -731712, -731820, -730413, -733296, -736111, -737211, -739669, -735666, -730001, -720855, -716319, -711690, -713648, -719012, -726575, -723314, -716711, -724837, -737060, -730999, -725938, -724111, -722648, -731044, -734739, -733760, -727886, -724910, -727903, -724226, -730656, -732076, -727640, -719287, -711011, -708331, -711648, -719320, -720402, -719864, -713035, -711049, -711866, -710199]
8976g10199K13K90J827L52o47k467l920J136q93k385o52K763N207L362k848q382
8960g17243L694M76k430M280N228l206K857K023K807K255J506j806k943r530j023
8945g13055J0293Q070O461P42M415K445J979k729o224k185J779k338m384K018
8931f92713L651j59L44k567M26K096m360k626o43J2785J1792o144r17J382p15
8916f78368P20k553k105L3k590j929N225n702p306l992K501M350O70m90K566k031
8900f91001k909J627M285L028k40J027M13j402N286K424k152m035O846M613L070
8885f69120k378q14k076J69k308K507j486m587j10j601L802N705j995K026J346
8870f70920l270k625K444N652j788L008N048L757l092q979n833M458O993l92J56
$$ y = [-710199, -709986, -709696, -707869, -707517, -708164, -710631, -714551, -713415, -714308, -716693, -717345, -714582, -709375, -706013, -708861, -717243, -713549, -713073, -715503, -711223, -705995, -709201, -706344, -704321, -701514, -699259, -697753, -699559, -702502, -712032, -713055, -702762, -694692, -688231, -687489, -683074, -680629, -678650, -681379, -687603, -689788, -688009, -690347, -694731, -692713, -689062, -689221, -688877, -691444, -691018, -688922, -693282, -695908, -696551, -683766, -671974, -678118, -679035, -677653, -678368, -677648, -680201, -682306, -682273, -684863, -686792, -681567, -687269, -694575, -698567, -696066, -691716, -691046, -691536, -688970, -691001, -693910, -692283, -687998, -684970, -685210, -684183, -683770, -685172, -679886, -677462, -679614, -683649, -676803, -672190, -669120, -671498, -672312, -674388, -674219, -676527, -674020, -675506, -680093, -680203, -681804, -678002, -672297, -674292, -672266, -670920, -674190, -676815, -674371, -668719, -670507, -667499, -662451, -658694, -661786, -670765, -676598, -672140, -665147, -665539, -665383]
8855f65383l542K327N723n454p470N2q8L662O536J64N317k702k818L00j287l059
8839f67722N688P624Q35P99n481k622l134M607L789J1860Q499p297n521j386K019
8824f47443Q03M889p53l286M377L715Qn321m358k109l070Q892L812n16O29K155
8808f37576K068O179L695l609m030J709O279p673p568J639o291o016m700m648
8794f60542J515J2221R124n95M072q355N81N922K402j349o372n958l017K439n6
8779f47968L065J2006J0177M151n212p330L214J777k769k26K176J497n331k105
8765f32878J119k189M837P354k332p634L636P791P27l076J756l074j828Q70J881
8750f23040L734l697j845J554J818L67L336j752l263O90m664m262K114M560r86
$$ y = [-665383, -668925, -666598, -660875, -666329, -673799, -673747, -673835, -670173, -663637, -663473, -658156, -660858, -663676, -663376, -664663, -667722, -662034, -654410, -653575, -652776, -658257, -660879, -664013, -659406, -655617, -643757, -635258, -642555, -648076, -649462, -647443, -646640, -641751, -642504, -645790, -641413, -637698, -637690, -643011, -647369, -649478, -652548, -643656, -639844, -640360, -639731, -637576, -635508, -629329, -625634, -629243, -633273, -631564, -625285, -632958, -640526, -638887, -645178, -651194, -655894, -660542, -659027, -646806, -637682, -638277, -634205, -642560, -641979, -636057, -633655, -635004, -641376, -647334, -650351, -647912, -647968, -644903, -632897, -622720, -618569, -623781, -631111, -627897, -626120, -628889, -629115, -626939, -625442, -630773, -632878, -631759, -633948, -629111, -621757, -624089, -631723, -628087, -620296, -619569, -622645, -620889, -623963, -625791, -624921, -623040, -619306, -623003, -624848, -623294, -621476, -621109, -617773, -619525, -622788, -622098, -626762, -631024, -628910, -624350, -625336]
8735f25336M579J2172P1j041l919j0774q612o56J1743Q686L331l914K769j280
8721f12181r192L003N336l211k28K210k19K802M417M758J759o879L814O471J825
8706e95515l968M401K395m264l790k975n17k638l374k301M665K469l418P115J832
8691e99883K511J086m680k999q81J707j528L775L700n079o72L949J635J397j247
8676e97209j849N578n98q922m939O031P653q7j452J135K056O048K955m76n155
8661e89231j1894mR686O949N096J822J474N219P883K161o530j185l820k796o802
8646e81972k299K723J482M596K900J0893N751M467p002n352j690L384N245j00
8632e56974j88J143J051P98P949J2535R830L728J507n194l9286n8984l2113J543
$$ y = [-625336, -620757, -608585, -608514, -609555, -613474, -624248, -632860, -633516, -621773, -613087, -609756, -613670, -610901, -612181, -621373, -618370, -613034, -616245, -616473, -614263, -614482, -611680, -607263, -602505, -600746, -607625, -603811, -597340, -595515, -599483, -595082, -592687, -596951, -600741, -603716, -604233, -606871, -610245, -612546, -607881, -605412, -608830, -601715, -599883, -597372, -596286, -600966, -603965, -604846, -603139, -604667, -600892, -597192, -602271, -602943, -598994, -597359, -595962, -597209, -599058, -593480, -594078, -603000, -607939, -601908, -594255, -594342, -595794, -594659, -592603, -586555, -583600, -584076, -589231, -601125, -601129, -591443, -584494, -579398, -577576, -576102, -570883, -563000, -560839, -567369, -568554, -572374, -575170, -581972, -584271, -581548, -580066, -575470, -572570, -561677, -555926, -551459, -558461, -563813, -565503, -562119, -556874, -556974, -557162, -556019, -554968, -554170, -546221, -533686, -523856, -520128, -518621, -523815, -563101, -622085, -654198, -652655]
8618f52655M495J2512P270M163M426J3077Q029k838j102O024P281N447j079J419
8604e83531M41J469K082j348j90l898O731Q185N177M505Q394L540k129N729J479
8589e43364P48O100J4487R064Q81O807J2436J0183J1824J2582O605j6891p5840
8576e44378j13095o1439l711J7183K1904J3470L312J2070J6118O797L577M812
8564f23380j5P297L184j250k930K616K303L054Q847J532P21K940k733J841M15
8549e95558L849L92M614p51K666q67L991N26N488M898L539m55J897k071Q169J1558
8533e48115r84k7934n7483m6364n08K1810J9122O257O53K808Q423R940N386k838
8519f09827K581O35J70M011J0094J311o601n802K318O625K595K50J83j026n580
$$ y = [-652655, -648160, -635648, -628378, -624215, -619789, -606712, -598683, -601521, -602623, -596599, -589318, -583871, -584950, -583531, -583090, -581621, -579539, -580887, -581077, -584975, -578244, -570059, -564882, -560377, -551983, -548443, -550572, -544843, -543364, -542616, -536516, -522029, -512965, -512084, -505277, -492841, -482658, -470834, -458252, -451647, -468538, -544378, -657473, -718912, -722623, -705440, -683536, -670066, -666754, -654684, -638566, -631769, -628192, -623380, -623395, -616098, -612914, -614164, -617094, -614478, -612175, -609121, -600274, -598742, -598021, -595081, -597814, -595973, -595558, -591709, -591317, -586703, -587454, -584788, -585655, -581664, -581138, -575650, -570752, -567213, -567668, -565771, -567842, -559673, -548115, -549099, -577033, -634516, -680880, -681388, -659578, -640456, -634199, -633546, -630738, -622315, -612375, -606989, -609827, -607246, -606611, -606441, -602430, -592336, -591025, -597626, -603428, -601110, -594485, -591890, -591640, -591457, -592483, -598063]
8504e98063n194j000L164K498r23K138Q553J0789m965r306J104L413N029K916
8490e79847q228q3J82N96L292M177J307J008O50J188L830L511J206n982n411N014
8474e73590j74J025K611R14p768m497L469J484L939O705k4l340J042M903L964
8459e59337k853o183k659L912K326M894l660j242q88O429K514n540m227J647O44
8444e64223o931l960j512J983J967q10M883L239q91M505L509j695K537L129k319
8429e56589p946l14L697j770R017n569p169L044N655j0565N20K063q460j87K070
8414e72503J0551Q801M804p456k337j959M208N429M094r865m172J347O11k08Q953
8399e49702m26m764L048M619m694p712K443K822K057J261Q40K452J403n7J381
$$ y = [-598063, -603257, -604257, -601093, -598595, -599518, -597380, -588827, -578038, -583003, -592309, -591205, -587792, -582763, -579847, -588075, -588158, -587976, -587380, -584088, -579911, -578604, -577596, -576946, -575758, -571928, -568417, -567211, -573193, -578604, -573590, -573764, -572739, -570128, -569214, -576982, -581479, -578010, -576526, -572587, -565882, -565906, -569246, -568204, -563301, -559337, -562190, -568373, -571032, -567120, -564794, -559900, -563560, -564802, -565690, -559261, -556747, -562287, -566514, -564867, -564223, -571154, -575114, -576626, -574643, -572676, -573486, -568603, -565364, -566255, -561750, -558241, -559936, -557399, -554270, -556589, -564535, -564849, -561152, -562922, -553905, -559474, -566643, -563599, -557944, -568509, -567989, -565926, -574386, -574573, -572503, -561952, -553151, -548347, -555803, -558140, -560099, -555891, -550462, -546368, -556233, -560405, -559058, -558447, -558655, -549702, -550128, -554892, -551844, -547225, -551919, -559631, -557188, -554366, -552309, -551048, -550208, -547756, -546353, -546410, -545029]
8384e45029j043N102O181k648k640K367N382O193m955j5632l922J097K517l329
8370e50359k467M882K047o209K991P985l107K257L508j006M052j00L63j237j10
8355e36510k586r313l348O556J6259l899j210J723L503K030K594l367p528o575
8341e41671L627rn38J86j651j721N199L180k091p560k098K111J0268L112j159
8326e30815J353l786J798l587M966M343K301M66n087j276m239K100K134r26j0169
8311e40424K015O854K687L53K518R11O14k53M68J712J862J027N26j763m459n210
8295e30562R13M798L567L67K70p263j283q26L715k361j096p96K449L732P820J404
8279e15152j780j252l776K337n740o444O355R2R20r08J460J257L849k938K516
$$ y = [-545029, -546072, -540970, -534789, -537437, -540077, -537710, -532328, -526135, -531090, -546722, -550644, -549547, -547030, -550359, -552826, -547944, -545897, -552106, -549115, -541130, -544237, -541980, -538472, -539478, -535426, -535526, -535163, -536400, -536510, -539096, -548409, -551757, -545201, -528942, -532841, -534051, -532328, -528825, -526795, -524201, -527568, -535096, -541671, -538044, -538053, -538591, -538405, -540056, -541777, -536578, -533398, -535489, -543049, -545147, -543036, -532768, -529656, -530815, -529462, -533248, -531450, -535037, -530071, -525728, -523427, -522961, -528048, -529324, -533563, -531463, -529329, -530255, -540424, -538409, -531555, -528868, -528515, -525997, -525086, -524472, -524725, -524257, -522545, -520683, -519656, -519130, -520893, -525352, -530562, -529649, -524851, -521284, -520917, -520647, -527910, -529193, -530019, -526304, -528665, -529761, -530557, -528108, -524376, -516556, -515152, -516932, -518184, -521960, -519623, -525363, -531807, -525452, -525360, -524440, -525348, -523888, -522631, -518782, -521720, -519204]
8264e19204q04j713m944L221M294J2212l634l305k829r465m375M247O208P906
8250e12185k331m112J760R28l27K524N44n327Q934N216l175n889K143N70n60l196
8234e14483L920k58O93k497k610o340k068K936O347L49Lj497k482K449J565k473
8218e16446k894K653P655j25o129j244K859j253q586P46N275k36K101J823P675
8203e06126N699k714l665j532P909p57m447l036n813J398P397N373K41J205M057
8188d94811k024l319j2454l466L80L111j372m373M562Q258L573L745N541M81k292
8173d94460m352l98M469l056K591N361J301o051k100J727L044j168q002n584J269
8158e05409N869L602L33J008p709l340L380j93r029K296R123R914O515m308n728
$$ y = [-519204, -520008, -521721, -526665, -523444, -519150, -506938, -510572, -513877, -516706, -526171, -530546, -526299, -520091, -512185, -514516, -518628, -516868, -515940, -516267, -513743, -513199, -518526, -509592, -504376, -507551, -513440, -511297, -510727, -511287, -514483, -510563, -510821, -510128, -512625, -515235, -521575, -523643, -520707, -514360, -514011, -514008, -515505, -517987, -515538, -513973, -516446, -519340, -516687, -509032, -509157, -515286, -516530, -513671, -514924, -523510, -522764, -517489, -517725, -515624, -513801, -506126, -500427, -503141, -506806, -508338, -500429, -501186, -505633, -508669, -514482, -513084, -505687, -500314, -500073, -498868, -494811, -496835, -500154, -512608, -516074, -515694, -512583, -513955, -518328, -513766, -505508, -501935, -498190, -492649, -492168, -494460, -498812, -499210, -494741, -497797, -495206, -489845, -488544, -494595, -496695, -494968, -491924, -493092, -501094, -506678, -505409, -499540, -495938, -495605, -494597, -502306, -505646, -502266, -502459, -511488, -509192, -500069, -490155, -483640, -487948, -493676]
8143d93676l774k50o699L79l349K378J361o594M511K441L414M807Q883K167n264
8128d89265n562n265m165m427j651J0303M267L871N184m930o827j998j531M718
8114d97278P303M575l382j408q83k759J656O571K043l222n853l541J41k657L480
8099d95214j304L623J2655n309n825j750L415k24j804J051O038P916p308K555
8085d81485L270j0276Q47J668K761O6k188k109l476q66j096P709O540l89J700
8070d77324o568k862K849K391N374K495j279k403m717l299L279n297p586l70m137
8055d99454J0431J2405k301p319k871J412J119R43K678K369k493n411J485o014
8041d93021N334J0239j726p24n33m420o597k57M711J2442J0796l07m822j485l693
$$ y = [-493676, -497450, -497700, -504399, -504020, -507369, -504991, -503630, -510224, -505713, -503272, -499858, -495051, -486168, -484001, -489265, -494827, -500092, -504257, -508684, -510335, -500032, -495765, -491894, -486710, -491640, -498467, -500465, -501996, -497278, -489975, -485400, -488782, -490190, -491073, -493832, -492176, -485605, -483562, -486784, -492637, -496178, -496037, -498694, -495214, -496518, -492895, -480240, -485549, -491374, -493124, -489709, -489933, -491737, -490686, -484648, -476732, -484040, -481485, -478215, -488491, -487644, -485976, -483215, -483149, -485337, -487446, -490922, -491788, -492884, -485175, -478635, -479024, -477324, -483892, -486754, -483905, -481514, -476140, -473645, -474924, -477327, -482044, -485343, -482064, -487361, -494947, -495317, -499454, -489023, -476618, -478919, -486238, -489109, -487697, -486578, -485635, -482957, -480588, -483081, -488492, -487007, -493021, -487687, -477448, -479174, -479898, -480431, -484851, -491448, -491705, -486994, -474552, -463756, -464063, -468885, -470370, -474063]
8026d74063n780L78o85j426K829N787N631N905K770j165j901j651K212k083k590
8011d65832j185K882j613o007m435k951O127O994K662n208q61n67J361r31Q089
7996d61475P355k990o208n919p5J032O509R5q936o653m235k112Q104O477K323
7981d66708M185k860O388q238m884M424M737k91l74J020r517l72K188l785J508
7966d72579m911K15O178K339L386N185j590n048L321k186J859J701M942m00l347
7951d60935O34N663K893q851j1001l808O474M308m74l142j949J448L533L74J307
7936d63526J591L618k766n335M307K048o846m225j188Q174M610q87P45K47k25
7921d59658K46K882o768N782j523q26j826j329j417N431L992k794j126k374J637
$$ y = [-474063, -479843, -479465, -480150, -481576, -478747, -472960, -467329, -461424, -458654, -459819, -461720, -463371, -461159, -463242, -465832, -467017, -464135, -465748, -471755, -476190, -479141, -473014, -466020, -463358, -468566, -469427, -469994, -468633, -469564, -461475, -454120, -457110, -463318, -469237, -469312, -468280, -461771, -461676, -470612, -477265, -481500, -483612, -475508, -469031, -466708, -462523, -465383, -458995, -467233, -472117, -467693, -462956, -463247, -463621, -462601, -472118, -472490, -470302, -474087, -472579, -477490, -477275, -471097, -468758, -465372, -460187, -461777, -466825, -463504, -465690, -463831, -462130, -457188, -457588, -460935, -460301, -454638, -451745, -460596, -471597, -475405, -468931, -464623, -465097, -468239, -470188, -468740, -465207, -464833, -463526, -461935, -458317, -461083, -466418, -462111, -460063, -466909, -471134, -472322, -464148, -459538, -460425, -459680, -459433, -459658, -459412, -456530, -463298, -457516, -459039, -459865, -461691, -463020, -464437, -459006, -455014, -457808, -458934, -461308, -459671]
7906d59671R898L72o853o721n45J0697O975p299l900K589J529k999j1362j157
7892d68447K091N760P467l872K508l986N15M352k795m840M90q32k980Q52J259
7877d62458j108M565R964o94p213j074L965L877o211j864N678L80j083R52l349
7862d55673K414K095k74P33j017K242L227L57l81l246K165K814n485k108O354
7847d45783M375p071m382N700J523n862m145k618M423N481L236L338l509l763
7833d49057j764K458M728j220p780p573K048O692Q47K919L382L376o193q288q32
7818d56257m213q89J0530Q292n464J268P549j873k892J447L656L948j303q04j288
7803d38293L888j0308l244L076K422K493o353N62M170J663m711j696M112k39K018
$$ y = [-459671, -449773, -449401, -456254, -462975, -463520, -452823, -445848, -453147, -457047, -454458, -452929, -455928, -467290, -468447, -466356, -460596, -453129, -457001, -454493, -458479, -457964, -453612, -456407, -461247, -460757, -461589, -464569, -463717, -462458, -463566, -459001, -449037, -449731, -456944, -458018, -454053, -450176, -456387, -458251, -452573, -452193, -453276, -452324, -455673, -453259, -451164, -451438, -450705, -451722, -449480, -446253, -445896, -446277, -449523, -447358, -444544, -450029, -452137, -445783, -441408, -448479, -452861, -447161, -445638, -451500, -455645, -458263, -453840, -448359, -445123, -441785, -445294, -449057, -450821, -448363, -443635, -444855, -452635, -460208, -458160, -451468, -450621, -447702, -444320, -440944, -447137, -455425, -456257, -460470, -461359, -450829, -442537, -448001, -446733, -439184, -441057, -443949, -442502, -438846, -434898, -436201, -437005, -438293, -434405, -444713, -447957, -444881, -442459, -439966, -446319, -445757, -441587, -439924, -444635, -446331, -442219, -442458, -440440]
7788d40440k554r54O86L711Q81m943l250j877P251N622q28J960m007N2Q768P361
7772d22561K732n357j0120j047M799j05p505j662o32m558m67Q147L218J679j318
7757d34757m860k871L567J674P86P944j648j236k476o046L683m403J624M580k688
7742d37127p4k068L722l79J767J773l480k026R48j331J654k03m13K379j79Q149
7726d26888J757n140j284n950k132M420Q79K746j592J989l851L10L048J049j617
7711d32256K143l826K997N688L854K59J984n77j102k332n638l616L181L896J9
7696d25326m308M863K693l992N57L641m650J791N098K655l368j1454n375J581
7682d35594J121K54K573J0N723j723m159j810M903K46k58K395O260J039m114Q07
$$ y = [-440440, -442994, -443948, -443262, -439551, -438670, -443613, -446863, -448740, -441489, -435867, -436695, -434735, -438742, -438690, -429922, -422561, -419829, -425186, -435306, -436353, -431554, -431659, -439164, -440826, -441458, -446016, -446483, -438336, -435118, -433439, -434757, -439617, -442488, -438921, -437247, -436461, -428517, -430165, -431401, -433877, -439923, -436240, -440643, -439019, -434439, -437127, -437201, -439269, -435547, -435926, -434159, -432386, -435866, -437892, -436944, -438275, -436621, -436824, -437237, -434858, -435037, -426888, -425131, -430271, -431555, -437505, -439637, -435217, -434338, -431592, -433184, -431195, -435046, -434736, -431688, -430639, -432256, -430113, -433939, -430942, -425254, -421400, -421141, -419157, -419734, -420836, -423168, -428806, -432422, -429241, -425345, -425326, -429634, -424771, -422078, -426070, -425513, -421872, -426522, -424731, -419633, -416978, -420346, -431800, -437175, -435594, -434473, -434219, -431646, -431636, -425913, -427636, -431795, -433605, -428702, -428456, -428714, -426319, -420059, -419020, -423134, -422327]
7666d22327M63M889k531m751k021M088J989L152j371o819n34J0381N654o348n768
7651d21854k323k906J816K055L046j726k880j490Q835P813J088k815p811l012
7637d22164N158L104P371q362j1924J487K339N057M91M617j107j341K734k791
7623d15331K824p543k425J190l146J245J394p531Q39O312L611N677J952l549j66
7608d14647J506J768l867L179Q34N28L231j540m471K382L81O69j624o755l909
7593d22335O050N1O685L733p278o186K421l175R83N00k505J714q45K938J72K422
7577d14655K325J554j546j176Q56L96K910j381J787n223k616L791M936k065m130
7562d14237K604O650n019o167p814K801L093M836j039J767N456P86K069N48j118
$$ y = [-422327, -421864, -416975, -419506, -424257, -426278, -422190, -420201, -417049, -418420, -425239, -425773, -415392, -409738, -416086, -421854, -424177, -427083, -425267, -423212, -420166, -421892, -424772, -426262, -417427, -409614, -408526, -411341, -419152, -422164, -417006, -413902, -406531, -414893, -426817, -425330, -422991, -417934, -417443, -412826, -413933, -415274, -412540, -415331, -412507, -420050, -422475, -421285, -424431, -423186, -421792, -429323, -428484, -422172, -418561, -412884, -410932, -414481, -414647, -413141, -411373, -415240, -412061, -411227, -410699, -407468, -409008, -413479, -411097, -410716, -410047, -411671, -418426, -422335, -416285, -416234, -409549, -405816, -413094, -419280, -416859, -420034, -419051, -418551, -421056, -419342, -420187, -417249, -417077, -414655, -412330, -410776, -412322, -413498, -412642, -412246, -409336, -410717, -408930, -414153, -416769, -412978, -408042, -410107, -414237, -411633, -404983, -410002, -416169, -423983, -421182, -418089, -413253, -414292, -412525, -407069, -406283, -404214, -403666, -404784]
7547d04784j554o59N463M75r7n000m26j429K286N702L80J839J07l364M404Q77
7531c95780o34N565j277p165q51L13k940m995K600O924j146m651N999n628l413
7516d07079m53J131m201J800M371q44l242k442m535M292K567m53P557M510k188
7501c99209k670r526p37M505O153j760J65r17J944K326M743n215p401J300J044
7486d05255N105k589o61k269K273L511l410j696j378L16L207l080J891O972K063
7471c95000o992o025o38P23o0Q03M65j648k472M67K548N009k594N371Q168m01
7455c92276m672J047K847n714J721L299K85j647k916p280K35K083L033M81N57
7440c98917N025M236J403n286J2L690L869n74J385n291M580m455k882l894M117
$$ y = [-404784, -406338, -406997, -401534, -401059, -401156, -406156, -406582, -408011, -405725, -400023, -399643, -397804, -397697, -401061, -396657, -395780, -396414, -390849, -392126, -399291, -400142, -399829, -402769, -407764, -405164, -398240, -399386, -404037, -398038, -403666, -407079, -407532, -406401, -410602, -408802, -404431, -405275, -408517, -410959, -415494, -411202, -408635, -409088, -401531, -397021, -399209, -401879, -411405, -412142, -407637, -401484, -403244, -403079, -403996, -402052, -399726, -394983, -400198, -407599, -406299, -405255, -400150, -402739, -403400, -405669, -403396, -399885, -403295, -404991, -406369, -406053, -402846, -405926, -404035, -397063, -395000, -401992, -408017, -408655, -407932, -407992, -407189, -406724, -408372, -410844, -410377, -407829, -402820, -405414, -400043, -391875, -392276, -396948, -395901, -393054, -398768, -397047, -393748, -393463, -395110, -398026, -405306, -405071, -402988, -399955, -399474, -398917, -393892, -389656, -388253, -393539, -393527, -389837, -385968, -386542, -385157, -390448, -385868, -390323, -393205, -397099, -392982]
7425c92982L862R33q284o590J77Q012Q256O53M343l24l176K505j909p721p176
7410c99421M99R586Q01k378k552K850n666n314m794M793Q505j176l50k340J984
7395c94973J557M187P264l85j475p26m208p850m163Q0k751j449K817L580L565
7380c94930j94l650l528N437K425M362M690r27K257M427q688j712j042J671N754
7365c83648M803P90l019m011o746o607n5N220Q125L986Q878L129m266p40q371
7350c82532l380J096J027J752J11K778m216k944N765j24l256J04l296m088K019
7335c89184J700r75k512L081J0441J185J176M758P04j922m820n325R06J965J904
7320c76918K306M417p353p764m397J339j06L471L194L989O797M261l341r7M64
$$ y = [-392982, -389120, -388187, -396471, -403061, -402884, -394872, -386616, -385963, -381620, -381944, -385120, -382615, -384524, -392245, -399421, -398922, -389336, -388535, -390913, -393465, -390615, -396281, -401595, -406389, -401596, -393091, -394267, -394617, -396957, -394973, -393416, -389229, -381965, -382350, -383825, -384551, -388759, -396609, -400772, -400692, -403443, -404892, -402075, -398495, -394930, -395124, -398774, -402302, -396865, -394440, -390078, -385388, -386315, -384058, -379631, -388319, -390031, -391073, -389402, -383648, -378845, -378055, -381074, -385085, -391831, -398438, -398493, -393273, -385148, -381162, -372284, -369155, -373421, -374161, -382532, -385912, -384816, -383789, -382037, -381926, -379148, -383364, -386308, -380543, -380667, -383923, -383819, -387115, -391203, -389184, -387484, -388459, -390971, -387890, -377449, -376264, -375088, -370330, -369626, -371548, -376368, -381693, -380787, -378822, -376918, -374612, -370195, -377548, -385312, -389709, -388370, -388476, -385005, -381811, -377822, -371025, -366764, -370105, -370202, -369738]
7305c69738n789r34k880k849L120L421k922m698l601l430N573k927l3k658O961
7290c83384R835P423O25p740q128k033O950N303j26J899K506N282J152r06k881
7275c64223r817n159J921O17J48l409N029n03J611j270J611L872K49k942p114
7260c79379K884L651m08K671J129l678j702N589Q344j921p97L55l53O90n942m863
7244c73730j865J178L176N572l268j628r380J109O386J745j427j49q83K03j857
7229c74818Q14M227k46K295J688m013j311j377K293N147J078l02O077j412l711
7214c63571q98L108j403m934L492M056O715J126k790n166K534O943M707M74o766
7199c52373n620J210o806j143J871J620k826l292J820O873j62j938P527q50m321
$$ y = [-369738, -375527, -376461, -379341, -382190, -379070, -375649, -378571, -383269, -386870, -390300, -384727, -387654, -387687, -390345, -383384, -373549, -366126, -365501, -373241, -381369, -383402, -376452, -371149, -371275, -369376, -366870, -361588, -360436, -361342, -364223, -374040, -379199, -377278, -376661, -376513, -379922, -374893, -375396, -373785, -375055, -373444, -369572, -369323, -372265, -379379, -376495, -372844, -373252, -370581, -369452, -373130, -374832, -369243, -360899, -362820, -363617, -363262, -363615, -362925, -368867, -373730, -375595, -374417, -371241, -365669, -368937, -370565, -379945, -378836, -372450, -370705, -372132, -372281, -373164, -372961, -374818, -374004, -369777, -370023, -367728, -366040, -370053, -371364, -372741, -370448, -365301, -364223, -364525, -358448, -359860, -363571, -364469, -361361, -362764, -367698, -364206, -360150, -353435, -352309, -355099, -360265, -357731, -350788, -346081, -345607, -352373, -357993, -356783, -363589, -364732, -362861, -361241, -364067, -367359, -365539, -358666, -358828, -360766, -353239, -354089, -358410]
7184c58410J129J109L058j3q762o052o159M146M187M870j954L646L387m247m617
7169c64682m818k773N371K847K144N004M686m365M450J189P16J0900j428m497
7155c45256n794n500m827J535K401L667L382J331k070k379k477k801K090J545
7141c55153m687k887j5N090P954j152j369n125J418K779L544o16k194k477j223
7126c56113p9j834O385j520l481l132j21L694M496M817K445J689k8j375j692L750
7110c42099P98p73m490O026k438m013K462m381m405L938Q473q72K284k992j673
7095c44155N0l627K683n58j544l512j670P083P332L015j06K771K637L605k382
7080c28378m364p114n725j928m924J654Q36n827N524O650q013l926L454K685L016
$$ y = [-358410, -357281, -356172, -353114, -353127, -361889, -367941, -374100, -369954, -365767, -360897, -362851, -359205, -355818, -360065, -364682, -369500, -372273, -366902, -364055, -361911, -356907, -352221, -356586, -352136, -350947, -350231, -339331, -340759, -345256, -351050, -356550, -361377, -359842, -357441, -353774, -350392, -349061, -351131, -353510, -355987, -358788, -356698, -355153, -359840, -362727, -362742, -357652, -349698, -350850, -352219, -357344, -355926, -353147, -349603, -350219, -352413, -354890, -356113, -356192, -358026, -351641, -353161, -356642, -359774, -359895, -356201, -351705, -346888, -344443, -342754, -342782, -344157, -345849, -342099, -341301, -342074, -346564, -340538, -342976, -346989, -344527, -348908, -353313, -349375, -340902, -341774, -339490, -342482, -344155, -344105, -347732, -345049, -345607, -347151, -350663, -352333, -345250, -337918, -334903, -335009, -332238, -329601, -325996, -328378, -332742, -339856, -345581, -347509, -352433, -350779, -349943, -355770, -350246, -343596, -351609, -355535, -352081, -349396, -346380]
7065c46380R191K909N502j826M04m244n865o174k352O60M787j108j182K609R63
7050c42106L95P000R11j177m665m3j135M69O225o71j771K242n517j1031N256M223
7034c41395o58P211K71k176o17K812M142K742P0j2305n663M1Q42O86O386M418
7018c33193M406o480J122J902k592j385O781J834P92K948L985n117q008l475j294
7003c37774N497N529L547q052K081Q055O684m103j510p43n77N04k576k287k729
6988c28454J481j975p542L601M939O754k19J722O432K321m562k331J008o83p129
6973c24637m264Q25J512R47J853J745O713l229m895L501L611j875l316m912j555
6958c27976k649J2712Q819n142m623l826j329L334O787J976m172Q21l73j903J221
$$ y = [-346380, -337189, -334280, -328778, -330604, -330200, -334444, -340309, -346483, -348835, -348175, -343388, -344496, -345678, -343069, -342106, -341711, -334711, -333800, -334977, -339642, -339685, -340820, -340351, -334126, -334797, -336568, -334326, -339843, -350874, -345618, -341395, -342053, -334842, -334571, -336747, -337364, -334552, -330410, -327668, -327598, -339903, -345566, -345525, -344683, -343997, -337611, -333193, -328787, -335267, -334145, -332243, -334835, -336220, -329439, -327605, -326813, -323865, -319880, -324997, -333005, -336480, -337774, -332277, -326748, -323201, -331253, -329172, -321117, -314433, -318536, -320046, -320789, -321366, -320862, -323438, -325725, -328454, -326973, -328948, -336490, -332889, -327950, -321196, -321415, -319693, -313261, -310940, -315502, -317833, -316825, -317508, -324637, -328901, -328076, -326564, -325617, -323764, -322019, -315306, -318535, -323430, -319929, -316318, -318193, -321509, -326421, -327976, -330625, -317913, -309094, -314236, -318859, -322685, -324014, -320680, -313893, -311917, -316089, -315268, -315641, -317544, -316323]
6943c16323n90N355K63j806j378J829K665n104m848N612J920L399K960M593l66
6928c01819p740p528O246J0416o53M560J438K628l281n987l559L779l379l986
6914c08865N950j0494n403J0021P919n292M063O314J661n315m498j819l706M470
6900c04994O520m460K485J92j916L868l271O225Q570J0129L624k391j045p012
6886b83476m449l753l629k472J268J407L612K046K532q44r86l108n313K831M589
6871b89745Q581R221n076m671N116J063l694l219J057j294J764P940N229q478
6857b76206J026L891j145l21R20J1952q344o629P073K144n894m53O440L776l820
6842b65590O030O669J1318r93o707m212L1j263K145O160M630L332M691l53j529
$$ y = [-316323, -316913, -311558, -311295, -313101, -314479, -312650, -309985, -315089, -319937, -314325, -312405, -309006, -306046, -301453, -301819, -309559, -317087, -310841, -300425, -301078, -296518, -295080, -292452, -295733, -301720, -305279, -301500, -304879, -308865, -302915, -313409, -318812, -308791, -300872, -306164, -302101, -295787, -294126, -299441, -303939, -305758, -309464, -304994, -298474, -302934, -300449, -300257, -302173, -298305, -301576, -295351, -286781, -276652, -273028, -275419, -276464, -283476, -287925, -291678, -295307, -297779, -296511, -295104, -291492, -289446, -286914, -287758, -288744, -291852, -297165, -294334, -289745, -281164, -271943, -277019, -281690, -276574, -275511, -279205, -282424, -281367, -282661, -280897, -272957, -267728, -276206, -275180, -271289, -272434, -272755, -271835, -259883, -268227, -274856, -267783, -265639, -271533, -271986, -265546, -261770, -265590, -259560, -252891, -241573, -242566, -249273, -253485, -253454, -254717, -252572, -246412, -241782, -238450, -233759, -234112, -235641]
6827b35641q094k069k441J774q47K984Q628J112p712r3Q642M811m588P447p40
6812b26827k783P747k096m139j546R22j428L288L996m92L791L9J596Q211l204
6797b12925l535m227j396J95P477R518J0110N736n70k987O057P335j668J153R180
6782a70547L65o170R48O738j585L116P848k095K43l984M452R565O404R134O229
6767a29339J754M445M775L903K625l498J471N200J6627Q045N573J3187P490K32
6753e7510J965M14N149r86O609J4082J5567J2483J4361J4333R391J2198Q310J935
6739E8301J4499J8203K2947K3178K3887K4060K1777J8991J106k9735l2106P105
6727A72213L1113L7475L8355M0546M9331N8259O3767O7580Q0737Q5030J03278
$$ y = [-235641, -243735, -245804, -248245, -246471, -247318, -244334, -235706, -234594, -242306, -242399, -233757, -228946, -233534, -226087, -226827, -229610, -221863, -223959, -228098, -229644, -228722, -230150, -226862, -222866, -223358, -219567, -219528, -217932, -209721, -212925, -216460, -220687, -222083, -221888, -214411, -204893, -194783, -189047, -189617, -192604, -186547, -179212, -180880, -179727, -170547, -170182, -176352, -175404, -168666, -170251, -167135, -159287, -161382, -161139, -165123, -160671, -151106, -144702, -135568, -129339, -127585, -123140, -118365, -114462, -111837, -115335, -113864, -108664, -92037, -83992, -78419, -65232, -57742, -57510, -55545, -55131, -49982, -50968, -44359, -30277, -14710, -2227, 12134, 26467, 35858, 48056, 56366, 58301, 72800, 91003, 113950, 137128, 161015, 185075, 206852, 225843, 226949, 197214, 165108, 172213, 203326, 240801, 279156, 319702, 369033, 427292, 491059, 558639, 639376, 724406, 827684]
6716H27684J28611J53852J91121K21881K51190K73647K37129j9269p79688j866615
6706c80457j934651p65815P7839K96465K91510K45560K03841J68738J46265J22614
6696a528091R9269Q2126P1449P1503N8863N1945N5323M9588L9036L3629L3678
6685h81682K1399j0344l1060j4980J4244K5887K4747J6027J8315K5977J7460J1042
6673g62968J4397J7010J4284R214J1414N197M128J2413J1256P54o364K829J6747
6660f49689J1901J4131J0929j833K995J4707L452K382R708N064J081q03J128P009
6646e67838O506R102O582j72N00l74o742j53Q596K454R529Q350O529N20j1199
6631e27810j450O576L430K943M040K637O927k131o496J271R178J0682K539N533
$$ y = [827684, 956295, 1110147, 1301268, 1523149, 1774339, 2047986, 2285115, 2265846, 1486158, -380457, -2315108, -3080923, -3003084, -2706619, -2415109, -2169549, -1965708, -1796970, -1650705, -1528091, -1428822, -1346696, -1275247, -1203744, -1144881, -1092936, -1037613, -988025, -948989, -915360, -881682, -860283, -870627, -901687, -916667, -902423, -876536, -851789, -835762, -817447, -791470, -774010, -762968, -748571, -731561, -717277, -708063, -696649, -691452, -687324, -674911, -663655, -662901, -669265, -666436, -649689, -637788, -623657, -612728, -614561, -611566, -596859, -593407, -591025, -581317, -576253, -575172, -575975, -574847, -567838, -561332, -552230, -545648, -545820, -545320, -545694, -552436, -552589, -543993, -541539, -532010, -523660, -517131, -516611, -527810, -529260, -522684, -519254, -516311, -512271, -509634, -502707, -504838, -511334, -510063, -500885, -490203, -487664, -482131]
6617d82131k365l088J1M385O970K406l111p77L132M009J157j092M357n6K203J841
6601d62149J960M719l738l063L284Q717J011K62K679k239l207J380k153q60L440
6586d49957O123K529j167N305r76k439O60L228K431n870o258N159Q073K554l733
6571d34338p9K03Q043q40m562j8k036n801k697O989M554Q993N923M903l497q854
6555d23114k046J733K608l804l864k270O474O591k631J379Q111K190o721q512
6541d23876J04P581l890L638K475K81k826l863l005M374M61L514K257J421M969
6526d06385N32k218M056j191p078k834k041K322L884L090K360j522L464m46l601
6511d07608j918k371K965K647k96j429l091o4J176j688l432n535R849Q572K436
$$ y = [-482131, -484496, -487584, -487573, -483188, -476218, -473812, -476923, -477700, -474568, -470559, -469402, -470494, -466137, -466193, -463990, -462149, -460189, -455470, -459208, -462271, -458987, -450270, -449259, -448997, -446318, -448557, -451764, -450384, -452537, -453397, -449957, -443834, -441305, -442472, -437167, -438143, -440582, -439922, -436694, -434263, -440133, -446391, -441232, -433159, -430605, -434338, -434417, -434214, -426171, -427011, -431573, -431591, -433627, -439428, -442125, -435136, -430582, -421589, -415666, -410763, -414260, -423114, -425160, -423427, -420819, -424623, -428487, -430757, -424283, -417692, -420323, -418944, -410833, -408643, -415364, -423876, -423772, -416191, -420081, -416443, -413968, -413687, -416513, -420376, -423381, -419007, -418546, -415032, -412775, -411354, -406385, -405853, -408071, -404015, -405206, -412284, -415118, -417159, -414837, -410953, -407863, -405503, -407025, -403561, -404007, -407608, -409526, -411897, -408932, -406285, -406581, -408010, -411101, -411165, -409989, -411677, -415109, -420644, -410795, -402223, -399787]
6496c99787J297m320J809M416J463k247O443O22N893p586j1278j760K860J499
6482d00676o264N88k881Q988P558J800k801M76N396L570p941J67J209k409J903
6467c91317n510J297n01L11K984L088m28J335N071k813o315KM543J916J995Q383
6451c75959p97q279j1785J971O383O487J554n377N76Q78k587n080L829M954J618
6436c81614M17O96M604m948O855J301J546M683K973n491n308p051m566J425R995
6421c74483K803J383R30q370n13l617o630N55J242M315n459q010P129J3764P654
6406c67307l029n477J07K817L791J834M928m444o127l061r8O109P31k434k732
6391c74392Q171j530q79M711l359l650K987K647n376R501L701k41k160o851j424
$$ y = [-399787, -398490, -402810, -401001, -396585, -395122, -397369, -390926, -390304, -384411, -391997, -403275, -405035, -402175, -400676, -406940, -406352, -409233, -400245, -392687, -390887, -393688, -393212, -387816, -384246, -392187, -392020, -390811, -393220, -391317, -396827, -395530, -396031, -395720, -392736, -389648, -390076, -388741, -383670, -386483, -392798, -392796, -388253, -386337, -384342, -375959, -376756, -385035, -396820, -394849, -388466, -381979, -380425, -385802, -385226, -384348, -386935, -392015, -388186, -383232, -381614, -381197, -380501, -375897, -380845, -373990, -372689, -371143, -366460, -363487, -368978, -374286, -381337, -385903, -384478, -374483, -371680, -370297, -369367, -377737, -378250, -381867, -388497, -387942, -386700, -382385, -387844, -395854, -388725, -374961, -367307, -370336, -375813, -375706, -372889, -369098, -367264, -362336, -366780, -372907, -375968, -376066, -369957, -369226, -371660, -374392, -366221, -367751, -368630, -363919, -367278, -370928, -367941, -365294, -370670, -361169, -357468, -357709, -359869, -366720, -368144]
6376c68144n586j92M644J202n956k069L212O348m152K107Q184n118k707j967M302
6361c65892J701o88N337M296Q52l663l877n346N678L288j80Q32R16l995j43J815
6345c59069O517M990n136k690q591n514L119R741R467P72n786q257k516m782O357
6330c61378J371o22L33k328n546J733k023j103J121M955P163n116J592k102p310
6315c69260K01k047K555K631k080K649K691L74N500o150p78j115R73J026p95J439
6299c62186M550r01k865J846l943j522m26J538L564M589K109j363j131j981M01
6284c57721N445J648n684L293J044K881j684M814o923p318N123N876J312r036
6270c56930o266J642N672J687J956M839J24P01l867l331l332J02m048q391M046
$$ y = [-368144, -373730, -373922, -369278, -368076, -374032, -376101, -372889, -366541, -370693, -368586, -360402, -365520, -368227, -370194, -365892, -364191, -364879, -359542, -355246, -354394, -358057, -361934, -367280, -361602, -358314, -358494, -357662, -356746, -360741, -360884, -359069, -352552, -347562, -352698, -355388, -363979, -369493, -366374, -356633, -347166, -346394, -352180, -360437, -362953, -367735, -361378, -360007, -360629, -360296, -362624, -368170, -366437, -368460, -369563, -368442, -363487, -356324, -361440, -359848, -361950, -369260, -369059, -371106, -368551, -365920, -368000, -365351, -362660, -362286, -356786, -362936, -363714, -364829, -363856, -362830, -363625, -362186, -357636, -358537, -361402, -359556, -363499, -365021, -365447, -363909, -360345, -355756, -353647, -355010, -356141, -358122, -357721, -352276, -350628, -356312, -353019, -351975, -349094, -350778, -345964, -352887, -360205, -355082, -349206, -347894, -356930, -363196, -361554, -355882, -354195, -352239, -347400, -347276, -346575, -350442, -353773, -357105, -357003, -361051, -369442, -365396]
6255c65396j247J624P523O41j077N569J107J236p55K729j596m192Q25J820P23
6240c50466M596j605K955k387J69R793K923p311n934j153K527K803O025j0062
6226c47127j57l615m507m619J998R517L915l503L92K133l488r92n053q836j217
6211c65159R970J0957j647l983o638k809j632L519M861q39R75k171q8J1075N580
6196c38029Q64k160q730M38L678l267q163m789P777L513l231K079R027M152r252
6181c46093n278M765J0759r71k901J77J045J084l147l703K123M235k1q384l796
6166c50106O277P544J297q940j854R987L748l789N26K771J449M05n551j296j164
6151c38696Q480N687m464m035j630k601M440P77k102o252K541M303k572j452l328
$$ y = [-365396, -366643, -365019, -357496, -356855, -357932, -352363, -351256, -350020, -350775, -348046, -349642, -353834, -353009, -351189, -350466, -345870, -347475, -344520, -346907, -346738, -336945, -334022, -341333, -347267, -348420, -345893, -343090, -337065, -347127, -347284, -350899, -355406, -360025, -358027, -348510, -344595, -348098, -347706, -345573, -349061, -350053, -355106, -363942, -365159, -355189, -344232, -345879, -349862, -356500, -359309, -360941, -357422, -352561, -353400, -352425, -354596, -354684, -343609, -338029, -337165, -339325, -348055, -347617, -343939, -347206, -355369, -360158, -352381, -348868, -352099, -350020, -340993, -336841, -346093, -351371, -346606, -335847, -336818, -339719, -339542, -338497, -337413, -340560, -344263, -342140, -337905, -337926, -346310, -350106, -343829, -336285, -334988, -343928, -345782, -335795, -332047, -335836, -335310, -332539, -331090, -330685, -336236, -337532, -338696, -330216, -324529, -328993, -333028, -334658, -337259, -332819, -332042, -334144, -340396, -337855, -333552, -336124, -337576, -340904]
6136c40904n10j430M156K408l601J628m211J360P94N892K981n512P4l313Q99K997
6120c36292k679M400K43q778m821L503O623L122L765M112o270j1265l3M311N336
6105c34723K160Q26L503K481J510L758Q7n550j0264J026M424m36J11L176m888
6090c32799p572o219L750J3043K669j732o945L80L060J812l134o447k350J327
6076c41157O931j323Q64l44K523k475l599N83J020L894L467J975k497m316M11
6061c34043P09J929l94j063K07j016j390l058l437O43Q104J079j439K428K182
6046c28559o84K32m639K354P515K327m143o161m098m91j937l49P112K783J1622
6031c17116o66n251p633k780P76J56m198j000N613j221n232K878K675J910J58
$$ y = [-340904, -341414, -342844, -338688, -336280, -339881, -338253, -342464, -341104, -340310, -334418, -331437, -336949, -336875, -340188, -339289, -336292, -338971, -334571, -334328, -343106, -347927, -344424, -337801, -334679, -330914, -326802, -333072, -344337, -344370, -340059, -334723, -332563, -331737, -328234, -325753, -324243, -320485, -320398, -325948, -336212, -335186, -330762, -331198, -331087, -327911, -332799, -340371, -346590, -342840, -329797, -327128, -328860, -335805, -335425, -332365, -330553, -333687, -340134, -342484, -341157, -334226, -335549, -334685, -335029, -332506, -334981, -338580, -337997, -336977, -333083, -329616, -327641, -330138, -334454, -334043, -333334, -331405, -331799, -332862, -332655, -333671, -335061, -338119, -341556, -340913, -332809, -331730, -333169, -330741, -328559, -329243, -329011, -333650, -331296, -323781, -321454, -325597, -331758, -335856, -336347, -338284, -338633, -331521, -328738, -317116, -317782, -323033, -330666, -333446, -332670, -332514, -336712, -337712, -332099, -333320, -338552, -335674, -332999, -331089, -330931]
6016c30931J293K203m055m036L832K263k898M678J29l541L220q515r047k416j41
6001c47962N50L224P568O708L832L39j05J032j1313J351J51M529P9k453Q68j463
5985c33065O72l955P29P970J85q085J367J082J032m528Q29Q547r31n450q31J289
5969c33143N717K359J1K463r558r039O318J0723L93l744K348N998J558l610l786
5954c24992j108j939r524j489M224O959j64L000R215J358L92l379p151M77J294
5939c22827o39q63P891J678n750n628L107M576m69j1996p35L103K961n048j456
5924c32095R32P830Q052j653L863n948o962j29J604J249r33o57k447l770P54M792
5908c25518R83j959K040K28L918J793O884m848n166K753N115L25k845m512k74
$$ y = [-330931, -329638, -327435, -331490, -335526, -331694, -329431, -332329, -327651, -327522, -331063, -327843, -336358, -345405, -347821, -347962, -347412, -344188, -336620, -329912, -326080, -325741, -325846, -324814, -336127, -334776, -334625, -330096, -330017, -332470, -331602, -333065, -332393, -336348, -335619, -327649, -327464, -335549, -334182, -333100, -332068, -336596, -335767, -327220, -328151, -333601, -334432, -333143, -327426, -325067, -325056, -322593, -332151, -341190, -334872, -324149, -323756, -327500, -325152, -319154, -317596, -321206, -324992, -326100, -328039, -337563, -339052, -334828, -327869, -328033, -325033, -315818, -314460, -314068, -317447, -324598, -324121, -322827, -323466, -324329, -316438, -314760, -320510, -326138, -323031, -318455, -318924, -330920, -331655, -328552, -325591, -330639, -332095, -331163, -323333, -315281, -316934, -313071, -319019, -325981, -326110, -324506, -323257, -324190, -324847, -327294, -331064, -330310, -325518, -324535, -326494, -324454, -324226, -320308, -318515, -311631, -316479, -321645, -318892, -313777, -313452, -316297, -320809, -321083]
5893c21083k540J895M181M202L1k280L30j486j2549oL427M435P658o161q620J160
5877c27406k419J223R659L851l088n01O96L033J520l989q087j588J0123N140L220
5862c08613j474r172l873J395K642l59p023m510K374P222j13q52Q0k447l5K112
5846c22646P561o723k283N489L5j5779k609L663N693J324R42K602P551k170J444
5831c15906N633j613o021P54J130l395r098m75L942J875J583M901J36K53n534
5816c21835k497J0509J083m750R33N660L567k734k418j0735o171Q994R657P878
5802c02859q61l526m500o732j930O325j184m409J1668R890P50j743j564R13p975
5787c07737q561m247M366J935l760K432J484j886N267l250Q454K635K338o114
$$ y = [-321083, -323623, -321728, -317547, -313345, -313314, -315594, -315264, -316750, -329299, -329305, -325878, -321443, -313785, -319946, -328566, -327406, -329825, -328602, -318943, -315092, -318180, -318681, -317985, -314952, -313432, -317421, -325508, -327096, -316973, -311833, -308613, -310087, -319259, -323132, -321737, -319095, -319454, -326477, -330987, -328613, -321391, -321504, -322356, -322276, -324723, -324758, -322646, -315085, -321808, -324091, -318602, -318567, -334346, -336955, -333292, -327599, -326275, -325333, -322731, -315180, -317350, -315906, -310273, -311886, -317907, -317153, -316023, -319418, -328516, -328991, -325049, -323174, -321591, -316690, -316554, -316301, -321835, -324332, -313823, -312740, -317490, -316557, -310897, -307330, -310064, -312482, -323217, -329388, -320394, -310737, -302859, -303720, -307246, -311746, -318478, -320408, -314083, -315267, -319676, -308008, -298118, -297368, -299111, -300675, -299762, -307737, -316298, -320545, -316179, -314244, -318004, -315572, -314088, -315974, -310707, -313957, -305503, -302868, -300530, -306644]
5773c06644l394K124k419L455j577J130K667j651K864J919l414q430J28k547k23
5758c16012j419K158Q09K934k853K342M816l171k457o2M231J990M567o964P4R03
5742c08114l625j101P032k689L71J875M153L322M23p642L16P61k826p7k65J032
5726c07054j944o287J952J193K603n05M615P174l858n611m32L09L385m462m090
5711c13012J275J618p413N761M260L999J878J851M088K649p484l871o6K75L558
5696c00634P475k226m224K146m612m045K68k978k422k720l335J2454M457m633
5682c05029J187K599o28j840K332M550j616p815o473Q95N138k37M482M28p530
5667c09557p05N765m708p645l57J072L212j268k378l133O45O967Q32N080M387
$$ y = [-306644, -310038, -307914, -310333, -306878, -308455, -307325, -304658, -306309, -303445, -301526, -304940, -313370, -313242, -315789, -316012, -317431, -315273, -314464, -311530, -314383, -312041, -307225, -310396, -312853, -312915, -308684, -306694, -302127, -309091, -309017, -308114, -311739, -312840, -305808, -308497, -308126, -306251, -302098, -298776, -298353, -305995, -305679, -304918, -307744, -307821, -308086, -307054, -308998, -315285, -313333, -312140, -309537, -310042, -305427, -298253, -302111, -307722, -308154, -307845, -304460, -308922, -313012, -311737, -310119, -317532, -311771, -307511, -303512, -301634, -299783, -295695, -293046, -300530, -304401, -304467, -304192, -300634, -293159, -295385, -299609, -297463, -302075, -306120, -305852, -308830, -311252, -313972, -317307, -304853, -300396, -305029, -303842, -301243, -301871, -303711, -301379, -296829, -298445, -306260, -312733, -311838, -306700, -306937, -302455, -302027, -309557, -310262, -304497, -309205, -316850, -317207, -316135, -312923, -314191, -316569, -319702, -319057, -312090, -311258, -306178, -301791]
5652c01791J306p686o274M176N795l579O677J079m266l586K880k970j012J0253
5638b98998l299n920k941p53L466M128n6k25J168M906n679K366K234k067M59k906
5622c04117K807l4L111Q54j0813n867P501N306M864k493k308p515m182M432M284
5607c04170M896J187p444q747L597J215l739M960q93n87l65j65J315L440L319
5592c02181j055Q643n221j1543J513P008N49k328J605m224p44M762L016k897O076
5577b97021O481L486l755p911p99O463M478J033L11l159r82m239K286K61J380
5562b91687m091m60O509q287l726k905P726j110p349k707j427L784N277K656O805
5547b90992o02k237m810m974n64K72M298K59p56l889j457L210N467l261R34R99
$$ y = [-301791, -300485, -308171, -314445, -310269, -304474, -308053, -301376, -300297, -304563, -308149, -305269, -308239, -309251, -298998, -302297, -308217, -311158, -311911, -308445, -304317, -304373, -304598, -303430, -298524, -304203, -301837, -299603, -301670, -301211, -304117, -301310, -301344, -298233, -297379, -308192, -314059, -306558, -301252, -296388, -298881, -301189, -308704, -312886, -308454, -304170, -299274, -298087, -305531, -314278, -310681, -309466, -313205, -308245, -309138, -309725, -310090, -310255, -308940, -305500, -302181, -303236, -294593, -299814, -311357, -309844, -302836, -302287, -304615, -303010, -307234, -307978, -303216, -300200, -303097, -297021, -290540, -287054, -290809, -298720, -299519, -293056, -288578, -287545, -287234, -290393, -291375, -295614, -293328, -293067, -291687, -295778, -296238, -289729, -298016, -301742, -304647, -296921, -298031, -305380, -308087, -309514, -305730, -300453, -297797, -290992, -291594, -293831, -298641, -303615, -304179, -303907, -299609, -299350, -300106, -303995, -305452, -302242, -296775, -300036, -299102, -298103]
5531b98103J370L69l567M27k381j200K568Q304j342q905J619M451m01K831j367
5516b95327P77K936L673l410k521k449n225K691L747j220l601m469N086K884L460
5501b92968M259j490k311m345m169m24l288m477j648O264O007P634l054k163K097
5486b94076m4k441J265M004m886p984M635L734J317N392K618l876N487K94J419
5471b83142o590k960q832N59M477M550R51M267m864o526q556l234M031P303L937
5456b94629l175M74L108j675K740P199P18k960l242k990k10j193j835O511N691
5441b85468p004j0040N823M579Q86n694n367k378M229L845Q868L284p472m741
5427b96650n439J381P085L58r23n563p176J383j959m933L243Q682O811N980J306
$$ y = [-298103, -296733, -296364, -299931, -299504, -301885, -303085, -300517, -292213, -293555, -302460, -300841, -296390, -296791, -293960, -295327, -294550, -291614, -287941, -291351, -293872, -296321, -301546, -298855, -295108, -296328, -299929, -304398, -299312, -296428, -292968, -288709, -290199, -292510, -296855, -301024, -301448, -304736, -309213, -310861, -304597, -298590, -290956, -294010, -296173, -294076, -294120, -296561, -295296, -291292, -296178, -304162, -299527, -295793, -294476, -289084, -286466, -290342, -284855, -284561, -283142, -289732, -292692, -301524, -300965, -296488, -291938, -290987, -286720, -291584, -298110, -306666, -309900, -305869, -298566, -294629, -297804, -297330, -294222, -295897, -293157, -285958, -285240, -288200, -291442, -294432, -294642, -295835, -297670, -291159, -285468, -292472, -302512, -296689, -292110, -291224, -296918, -302285, -304663, -300434, -296589, -287721, -284437, -291909, -296650, -302089, -300708, -293623, -293265, -294188, -299751, -306927, -305544, -307503, -312436, -309193, -300511, -293700, -287720, -286414]
5412b86414n800J014j201j786O504l341n216n570K446r15K439l09M670L659k354
5397b92174m414N720o61m043J36L983Q017L263j679j1378o619O099N981Q51j00
5382b87018l132J210p59j58K312q99Q20l384K827L443L111O64l73o622j428N58
5366b88828J413p718J49l52J844p53M287M775j500j1238k389L613R697M285M190
5351b78525J108q945n115o181P292M701m717k941J173P120N568l610j934m722
5337b89728l286P959j989o703J681R75r9J22N268M331r13N90o731j241k183K834
5321b89113P191j679M32K138q27O91J381m383R19J632O181j318j003l615m441
5306b85814l058j202M177O299L361j388k967m401p966k785K172Q195N052l138
$$ y = [-286414, -292214, -291200, -292401, -294187, -287683, -291024, -296240, -301810, -299364, -300279, -297840, -298149, -293479, -289820, -292174, -296588, -290868, -291529, -295572, -295436, -291453, -283436, -280173, -281852, -293230, -299849, -293750, -287769, -286918, -287018, -290150, -288940, -289699, -289857, -287545, -288444, -287624, -291008, -288181, -284738, -281627, -280963, -281336, -287958, -289386, -288828, -287415, -295133, -294984, -295336, -293492, -294245, -289958, -285183, -286683, -297921, -300310, -296697, -287000, -282715, -278525, -277417, -286362, -291477, -297658, -290366, -285665, -290382, -293323, -292150, -285030, -279462, -283072, -285006, -289728, -293014, -285055, -287044, -293747, -292066, -291091, -291190, -291068, -285800, -281469, -282382, -281792, -288523, -289764, -291947, -289113, -281922, -283601, -283169, -281031, -281858, -281167, -279786, -284169, -283250, -281618, -275437, -276755, -277758, -281373, -285814, -288872, -290074, -285897, -279598, -276237, -277625, -280592, -284993, -292959, -295744, -293572, -285377, -280325, -283463]
5292b83463J140r26m369j213n13j159L330N38K00K894k252K307j066q156N790
5277b86918J330L99j538Q360l905j366K204N497R655R112k765p743k811m796m965
5262b80250k067K342q600k113J529n09j974q80m817j278M023M972j772k739l915
5247b98048K368j32j737K572j032l542P884L625j580k138M932j393l049M348N281
5232b81641n090m765J0755L797p751J608M685j712q72n419q49m980o16O412M698
5217b81740l544n818K270J629J144r26M048J3786q24k641o97m095k769M78n461
5202b85160j539K701Q132J682j443k99J223q455m355M349r94p26K41j371O32N770
5186b79612P433L05r70p42m40J144j199Q55R73j0063m853J959L997N226J227o59
$$ y = [-283463, -282323, -283249, -287618, -288831, -289344, -290503, -287173, -286635, -286435, -283541, -285793, -283486, -284552, -292708, -286918, -285588, -285189, -286727, -278367, -282272, -283638, -281434, -275937, -266282, -257170, -259935, -267678, -270489, -275285, -280250, -282317, -279975, -288575, -290688, -289159, -289668, -291642, -292522, -297339, -298617, -294594, -289622, -291394, -294133, -298048, -295680, -295812, -297549, -294977, -296009, -299551, -291667, -288042, -289622, -291760, -286828, -288221, -291270, -286922, -281641, -286731, -291496, -280741, -276944, -284695, -283087, -278402, -280114, -280986, -286405, -287254, -292234, -292850, -286438, -281740, -285284, -291102, -288832, -287203, -286059, -286985, -282937, -269151, -269975, -272616, -273313, -277408, -280177, -279699, -285160, -286699, -283998, -275866, -274184, -275627, -275926, -274703, -283158, -287513, -283164, -284158, -284884, -284643, -286014, -285382, -279612, -272179, -271874, -272844, -273586, -274026, -272882, -274081, -273226, -272253, -282316, -287169, -285210, -281213, -275987, -274760, -275419]
5170b75419n22j292m978n72M389J26m969k058l919L9L429K068L607K99j552P49
5154b80575J862N033o564m808j934m00R6K577j628p066L101P353K092q37o5M199
5138b77564j374K842K204k048N976J796p224K950j89m773n801J564J38j835l182
5123b86520J618O875J1116l147K256m260n648p879J808O618k212m356l26O099
5109b77958j866O86N79M406J088Q259p838j299P581j540k143k401o655o91J818
5094b77974R356l08q495m185O289q50m45K038N739j788k274k261K26O440L187
5079b65305J690n378j0159L268J520l108M035M670n60M658j693r905L757j476
5065b73986L832K443j620j274j407k47l431L723M58l23n646p979L060L115J788
$$ y = [-275419, -275941, -277233, -282211, -282783, -278394, -278268, -283237, -285295, -289214, -289175, -285746, -283678, -280071, -279772, -281324, -280575, -278713, -273680, -280244, -285052, -286986, -287386, -287290, -284713, -286341, -293407, -290306, -282953, -280861, -281698, -281763, -277564, -278938, -276096, -273892, -275940, -269964, -268168, -275392, -272442, -272631, -277404, -283205, -281641, -281503, -283338, -286520, -284902, -278027, -266911, -270058, -267802, -272062, -277710, -285589, -283781, -277163, -279375, -283731, -284057, -277958, -279824, -279138, -278559, -274153, -273065, -264806, -272644, -273943, -266362, -267902, -270045, -272446, -279101, -279792, -277974, -268618, -268926, -277421, -281606, -275317, -276167, -276612, -274574, -268835, -270623, -272897, -275158, -274932, -268492, -265305, -263615, -268993, -279152, -275884, -274364, -277472, -273437, -268767, -269327, -264669, -266362, -276267, -272510, -273986, -270154, -267711, -269331, -270605, -272012, -272259, -275690, -271967, -271509, -271832, -277478, -285457, -282397, -279282, -277494]
5050b77494j191J909K343O173j476K736Q25o911j348l428k956L957K150J998m858
5035b77571L290q85o457L548J337K645K804j99k089J360N828K523j851o922Q60
5020b71779K153l760K02K015L127m450j946M585J990l054m701P120L189k291o
5005b67606L670r153p182J265J364N680N781J623J467o302J531P399k369l377
4991b66209N3P99n014m902q752J082P359K267k557j204K783N417P12l61n018Q740
4975b64805K909m256l328j200m953m709k666j690P719O275l372k965M573K816
4961b69652J926n638q417L00N968m09q149N49k136j31N056P625O249q09N687L857
4945b58124m062l441j505q970j846J0224J370J34J036J615M295l400m82j013k167
$$ y = [-277494, -278685, -276776, -274433, -268260, -269736, -267000, -266175, -273086, -274434, -277862, -280818, -276861, -274711, -272713, -277571, -274281, -275166, -281623, -278075, -276738, -274093, -271289, -271488, -273577, -272217, -266389, -263866, -265717, -272639, -271779, -269626, -273386, -273184, -271169, -268042, -272492, -274438, -269853, -267863, -270917, -275618, -268498, -265309, -267600, -267606, -263936, -273089, -280271, -279006, -277642, -271962, -266181, -264558, -263091, -269393, -267862, -260463, -262832, -266209, -266156, -265357, -270371, -275273, -284025, -282943, -275584, -273317, -275874, -277078, -274295, -268878, -268166, -268527, -273545, -264805, -261896, -266152, -269480, -270680, -275633, -280342, -283008, -284698, -276979, -270704, -274076, -277041, -272468, -269652, -267726, -273364, -281781, -281481, -275513, -275922, -284071, -283522, -285658, -285789, -280733, -273108, -266859, -267668, -261981, -258124, -262186, -265627, -267132, -276102, -277948, -267724, -266354, -266220, -265184, -263569, -259274, -262674, -263156, -264169, -266336]
4930b66336P45N13m21M006j383q446m79J951p60N809O918L668m168j2944m15L439
4914b68303q26K869k648k076J746k038o62J339N170n644R88j672J859r20K300
4899b68518P27K177N149K533N89o883m851J222j600J84J01o451J201O830J979
4884b65611L432O316L653M598k946p079j3491m744L950L007j313m278M739L561
4870b66206K78O212L6j21L065k581m174m403l776K4N861N128n986K518o060j0681
4854b80866K603J691L720J064M557O506l644o550p075J817j484L74J444m80M933
4839b71390m039J156N620j758N164J4500K842j912J431n98m151l591M343l487
$$ y = [-266336, -265591, -265078, -265499, -261493, -262876, -271322, -271801, -269850, -270610, -264801, -257883, -254215, -258383, -271327, -271742, -268303, -269129, -266260, -268908, -270984, -269238, -271276, -271938, -270599, -265429, -271073, -270085, -271757, -269898, -270818, -268518, -267791, -265614, -260465, -257932, -257343, -264226, -269077, -267855, -269455, -269271, -269170, -275621, -274420, -267590, -265611, -262179, -255863, -252210, -247612, -250558, -257637, -271128, -275872, -271922, -268915, -270228, -274506, -269767, -266206, -265928, -259716, -259680, -259801, -256736, -259317, -263491, -267894, -271670, -271646, -265785, -260657, -266643, -264125, -270185, -280866, -278263, -276572, -272852, -271788, -267231, -260725, -264369, -270919, -277994, -276177, -277661, -277287, -275843, -276323, -271390, -275429, -274273, -268653, -270411, -265247, -250747, -247905, -249817, -248386, -248984, -253135, -256726, -252383, -255870]
$$ [...]
##END NTUPLES=NMR SPECTRUM
##END=
