##TITLE=Analysis number 328052
Compound Code cc 49646
Book Reference 528/26
Project Code adrs
Chemist Name davee
##JCAMPDX= 6.0         $$ Bruker NMR JCAMP-DX V2.0
##DATA TYPE= NMR SPECTRUM
##DATA CLASS= NTUPLES
##ORIGIN= Bruker BioSpin GmbH
##OWNER= nmr
$$ XWIN-NMR		Version 3.5
$$ Fri Apr 27 12:57:00 2007 GMT Daylight Time (UT+1h)  MAYBRIDGE\nmr@NMR_250MHZ
##.OBSERVE FREQUENCY= 250.131544655141
##.OBSERVE NUCLEUS= ^1H
##.ACQUISITION MODE= SIMULTANEOUS (DQD)
##.ACQUISITION SCHEME= undefined
##.AVERAGES= 16
##.DIGITISER RES= 18
##SPECTROMETER/DATA SYSTEM= dpx250
##.PULSE SEQUENCE= zg30
##.SOLVENT NAME= CDCl3
##.SHIFT REFERENCE= (INTERNAL, CDCl3, 0, 16.522)
##AUDIT TRAIL= $$ (NUMBER, WHEN, WHO, WHERE, WHAT)
$$ ##TITLE= Audit trail, XWIN-NMR		Version 3.5
$$ ##JCAMPDX= 5.01
$$ ##ORIGIN= Bruker BioSpin GmbH
$$ ##OWNER= nmr
$$ C:\u/data/dgb/nmr/ADRS/3270/pdata/1/auditp.txt
$$ ##AUDIT TRAIL=  $$ (NUMBER, WHEN, WHO, WHERE, WHAT)
(   1,<2007-04-27 12:56:40.07 +100>,<MAYBRIDGE\nmr>,<NMR_250MHZ>,
      <created by zg, POWCHK disabled, PULCHK disabled
       configuration hash MD5:
       76 6E 9A 78 1E 09 19 81 EC 84 63 8F B0 6A 59 2D
       data hash MD5: 64K
       2C AB 55 A2 1A 34 3E 69 A1 39 B3 CD 99 85 C6 9F>)
(   2,<2007-04-27 12:56:52.03 +100>,<MAYBRIDGE\nmr>,<NMR_250MHZ>,
      <Start of raw data processing
       ef LB = 0.3 FT_mod = 6 PKNL = 1 SI = 32K 
       data hash MD5: 32K
       22 36 32 4A BA 66 D1 8E 7C 36 86 EB 6E AF E2 59>)
(   3,<2007-04-27 12:56:53.70 +100>,<MAYBRIDGE\nmr>,<NMR_250MHZ>,
      <apk 
       data hash MD5: 32K
       2C C6 06 16 CD F1 C2 D5 B3 14 DE A8 7D A5 5D D7>)
(   4,<2007-04-27 12:56:54.42 +100>,<MAYBRIDGE\nmr>,<NMR_250MHZ>,
      <abs ABSG = 5 
       data hash MD5: 32K
       0B C9 F8 C1 72 E2 F5 A1 BB F5 70 CE 99 C5 2D 50>)
$$ ##END=
$$ 
$$ hash MD5
$$ E4 45 6D 8E B3 34 3B AC E6 B8 DC 2B 74 C2 48 65
##$RELAX= 
##$RELAX= 
##$RELAX= 
##$RELAX= 
##$RELAX= 
##$RELAX= 
##$RELAX= 
$$ Bruker specific parameters
$$ --------------------------
##$DU= <C:\u>
##$EXPNO= 3270
##$NAME= <ADRS>
##$PROCNO= 1
##$TYPE= <nmr>
##$USER= <dgb>
##$AMP= (0..31)
100 100 100 100 100 100 100 100 100 100 100 100 100 100 100 100 100 100 
100 100 100 100 100 100 100 100 100 100 100 100 100 100 
##$AQSEQ= 0
##$AQ_mod= 3
##$AUNM= <au_zg>
##$AUTOPOS= <28 >
##$BF1= 250.13
##$BF2= 250.13
##$BF3= 250.13
##$BF4= 250.13
##$BF5= 500.13
##$BF6= 500.13
##$BF7= 500.13
##$BF8= 500.13
##$BYTORDA= 1
##$CFDGTYP= 0
##$CFRGTYP= 5
##$CHEMSTR= <none>
##$CNST= (0..31)
1 1 145 1 1 1 1 1 1 1 1 1 1 1 1 1 1 1 1 1 1 1 1 1 1 1 1 1 1 1 1 1 
##$CPDPRG= <>
##$CPDPRG1= <>
##$CPDPRG2= <>
##$CPDPRG3= <>
##$CPDPRG4= <mlev>
##$CPDPRG5= <mlev>
##$CPDPRG6= <mlev>
##$CPDPRG7= <mlev>
##$CPDPRG8= <mlev>
##$CPDPRGB= <>
##$CPDPRGT= <>
##$D= (0..31)
0 1 0 0 0 0 0 0 0 0.06 0 0 0 0 0 0 0.0002 0 0 0 0 0 0 0 0 0 0 0 0 0 0 
0 
##$DATE= 1177674999
##$DBL= (0..7)
120 120 120 120 120 120 120 120 
##$DBP= (0..7)
150 150 150 150 150 150 150 150 
##$DBP07= 0
##$DBPNAM0= <>
##$DBPNAM1= <>
$$ [...]
##$SUBNAM7= <"">
##$SUBNAM8= <"">
##$SUBNAM9= <"">
##$SW= 20.6930455092707
##$SWIBOX= (0..15)
0 0 3 0 0 0 0 0 0 0 0 0 0 0 0 0 
##$SW_h= 5175.983436853
##$TD= 65536
##$TD0= 1
##$TE= 683.16
##$TE2= 300
##$TE3= 300
##$TEG= 300
##$TL= (0..7)
0 120 120 120 120 120 120 120 
##$TP= (0..7)
150 150 150 150 150 150 150 150 
##$TP07= 0
##$TPNAME0= <>
##$TPNAME1= <>
##$TPNAME2= <>
##$TPNAME3= <>
##$TPNAME4= <>
##$TPNAME5= <>
##$TPNAME6= <>
##$TPNAME7= <>
##$TPOAL= (0..7)
0.5 0.5 0.5 0.5 0.5 0.5 0.5 0.5 
##$TPOFFS= (0..7)
0 0 0 0 0 0 0 0 
##$TUNHIN= 0
##$TUNHOUT= 0
##$TUNXOUT= 0
##$USERA1= <user>
##$USERA2= <user>
##$USERA3= <user>
##$USERA4= <user>
##$USERA5= <user>
##$V9= 5
##$VALIST= <valist>
##$VCLIST= <CCCCCCCCCCCCCCC>
##$VD= 0
##$VDLIST= <DDDDDDDDDDDDDDD>
##$VPLIST= <PPPPPPPPPPPPPPP>
##$VTLIST= <TTTTTTTTTTTTTTT>
##$WBST= 1024
##$WBSW= 4
##$XGAIN= (0..3)
0 0 0 0 
##$XL= 0
##$YL= 0
##$YMAX_a= 434613
##$YMIN_a= -417697
##$ZGOPTNS= <>
##$ZL1= 120
##$ZL2= 120
##$ZL3= 120
##$ZL4= 120
##$ABSF1= 16.522
##$ABSF2= -4.171173
##$ABSG= 5
##$ABSL= 3
##$ALPHA= 0
##$AQORDER= 0
##$ASSFAC= 0
##$ASSFACI= 0
##$ASSFACX= 0
##$ASSWID= 0
##$AUNMP= <proc_1d>
##$AZFE= 0.1
##$AZFW= 0.1
##$BCFW= 0
##$BC_mod= 0
##$BYTORDP= 0
##$COROFFS= 0
##$CY= 12.5
##$DATMOD= 1
##$DC= 0
##$DFILT= <>
##$DTYPP= 0
##$F1P= 14.0000005364418
##$F2P= -0.99999901652339
##$FCOR= 0.5
##$FTSIZE= 32768
##$FT_mod= 6
##$GAMMA= 0
##$GB= 0
##$INTBC= 1
##$INTSCL= 1
##$ISEN= 128
##$LB= 0.3
##$LEV0= 0
##$LPBIN= 0
##$MAXI= 10000
##$MC2= 0
##$MEAN= 0
##$ME_mod= 0
##$MI= 0
##$NCOEF= 0
##$NC_proc= -3
##$NLEV= 6
##$NOISF1= 0
##$NOISF2= 0
##$NSP= 0
##$NTH_PI= 0
##$NZP= 0
##$OFFSET= 16.522
##$PC= 1
##$PHC0= -52.65857
##$PHC1= 6.432936
##$PH_mod= 1
##$PKNL= yes
##$PPARMOD= 0
##$PSCAL= 4
##$PSIGN= 0
##$REVERSE= no
##$SF= 250.13
##$SI= 32768
##$SIGF1= 0
##$SIGF2= 0
##$SINO= 400
##$SIOLD= 32768
##$SREGLST= <1H.CDCl3>
##$SSB= 0
##$STSI= 32768
##$STSR= 0
##$SW_p= 5175.98343685301
##$SYMM= 0
##$S_DEV= 0
##$TDeff= 65536
##$TDoff= 0
##$TI= <Analysis number 999999
Compound Code 99
Book Reference 9
Project Code 9>
##$TILT= no
##$TM1= 0
##$TM2= 0
##$TOPLEV= 0
##$USERP1= <user>
##$USERP2= <user>
##$USERP3= <user>
##$USERP4= <user>
##$USERP5= <user>
##$WDW= 1
##$XDIM= 32768
##$YMAX_p= 559968536
##$YMIN_p= -270184
$$ End of Bruker specific parameters
$$ ---------------------------------
##NTUPLES= NMR SPECTRUM
##VAR_NAME=  FREQUENCY,     SPECTRUM/REAL,   SPECTRUM/IMAG
##SYMBOL=    X,             R,               I
##VAR_TYPE=  INDEPENDENT,   DEPENDENT,       DEPENDENT
##VAR_FORM=  AFFN,          ASDF,            ASDF
##VAR_DIM=   32768,         32768,           32768
##UNITS=     HZ,            ARBITRARY UNITS, ARBITRARY UNITS
##FACTOR=    0.157963299565203, 1,           1
##FIRST=     4132.6476996994, 0,             0
##LAST=      -1043.33573715361, 0,           0
##MIN=       -1043.33573715361, -270184,     0
##MAX=       4132.6476996994, 559968536,     0
$$ Real data points
##PAGE= N=1
##DATA TABLE= (X++(R..R)), XYDATA
$$ [...]
20965 1422 784 1211 -2103 6541 12694 -151 -8504 -17393 -21104 -20235 -27734 -15740 -8544 -14498 8361
20950 8361 17262 13524 13558 1970 7000 29467 20912 14527 16476 12668 14336 22496 8291 -5283
20936 -5283 -9066 -8159 1671 -8370 -19102 -24408 -8165 1613 -16408 -18363 -8358 -7715 -19081 -19506
20922 -19506 -41198 -46633 -36449 -31988 -26466 -27009 -26123 -14751 -1811 4837 3626 -8627 -19365
20909 -19365 -9959 -19023 -44895 -26949 -16967 -20424 -18934 -13730 -33822 -36504 -28813 -2267 -10589
20896 -10589 -13417 -8638 -27488 -21510 -22896 -33082 -43866 -39071 -33718 -975 28584 20906 -2537
20883 -2537 1852 -6839 -5632 -2744 -5833 -556 -10285 -4711 -6382 -6398 -2869 -8694 -11117 4288 22864
20868 22864 53232 46908 40753 15262 3586 1754 -5090 -7144 -3945 9888 12131 3879 -12617
20855 -12617 -16841 -20270 -31641 -28398 -16169 -4995 -7698 -22071 -18449 -2142 -1027 -16963 -35571
20842 -35571 -32734 -16700 1568 -4676 -5801 2458 -1420 -2207 48 12819 27511 20276 23070 36091
20828 36091 33244 18708 14816 24242 20693 22849 9370 -4071 -10699 920 17393 -3049 -6439
20815 -6439 2779 855 -17798 -24266 -12153 -12616 -14004 -30527 -27907 -543 -32387 -33607 -2435
20802 -2435 9092 11747 14956 -686 -19647 -51505 -49285 -31327 -14222 -20223 -8626 -6671 -8234
20789 -8234 -7415 429 8254 5093 753 -6694 -12403 -15477 -885 7967 -7350 -19173 -17853 -4910
20775 -4910 7073 6077 5683 -5651 -15348 -21409 -20740 -14975 -3732 4087 11267 10240 26165 47253
20761 47253 23144 -3044 -901 5515 8081 8591 2730 -6248 -23355 -25798 -13599 -23221 -20706 -12964
20747 -12964 -12862 -18735 -31605 -38440 -5739 11415 11976 20251 15917 -3609 -19703 -24186 -4236
20734 -4236 11123 15330 -12616 -13588 -21976 -17213 -27479 -26182 -29005 -23669 -14562 -13610 -19918 -16168
20720 -16168 1080 -4886 -20520 -45539 -36757 -12260 -17957 -17523 -6246 -11810 -9844 -11917 -18529
20707 -18529 -11924 -25452 -34101 -30156 -9021 -2727 -12377 -8143 8836 11212 6363 1382 5691 652
20693 652 -2162 8441 9910 -7376 -15040 -23884 -32891 -35206 -37346 -44696 -19570 1853 -4119 3540
20679 3540 24053 34090 24700 -59 577 -11796 -14077 -12836 -16163 -22444 -20350 2133 17696
20666 17696 18692 22266 21744 11533 9745 15769 36774 39826 14743 36363 48463 29996 22745
20653 22745 29671 10488 -9391 -20034 -12731 8890 27808 21937 422 -7431 -24992 -22514 -3400
20640 -3400 -1945 -13841 -9013 2732 25213 26257 6579 -11342 -4234 -6923 -8614 -11701 -10514
20627 -10514 -6509 -17652 -11860 5075 5312 25437 32779 21768 6124 9770 15278 23229 17343
20614 17343 4673 -2057 5869 1734 -5587 -7345 -3554 1272 -11558 -17911 -1484 9805 2746
20601 2746 14014 17139 9036 7536 -10553 -15194 -91 -15985 -9792 -15672 -22431 -20873 -7016
20588 -7016 -7638 1598 1209 5480 5315 36376 31213 5821 -234 -2094 -11789 -27650 -25586 -42285
20574 -42285 -24822 -5596 12275 18126 5398 2423 -1858 -19514 -35423 -34179 -19591 -11767 -6048
20561 -6048 -8593 -4192 -9268 -8736 -7993 854 -1410 -13095 -25653 -33896 -13780 11277 22658 16459
20547 16459 -13253 -6877 1866 -31223 -15281 -9510 -10177 -4487 1079 4458 2930 -9806 -4526 -11510
20533 -11510 -17146 -12288 7586 -3157 -11856 1161 -4180 -2028 6375 -7170 11570 9812 -13114
20520 -13114 -27149 -13234 4553 -10801 -46464 -58129 -36265 -16622 -3823 8602 15361 13425
20508 13425 5917 -4251 -6283 -5285 2252 -592 -3818 -19396 -35268 -39420 -37784 -25466 -23958 -20689
20494 -20689 5404 6389 7620 22097 13700 4200 -25792 -39220 -41737 -48703 -37968 -17091 -5390
20481 -5390 -10210 -7689 1472 7447 11290 -3281 -2292 6335 -2602 -30555 -45281 -31202 -14227 -3372
20467 -3372 27376 55787 43797 27566 11636 20128 7781 8121 4230 903 -1244 -2478 1810
20454 1810 7200 -5718 -17894 -11379 -12313 -935 -7291 -19043 -37842 -42891 -29207 -19171 -29983
20441 -29983 -3203 7906 -3977 -10058 -19196 -30397 -39607 -27425 -4683 12463 18372 -4294
20429 -4294 -21992 -17255 -979 10021 17386 -4157 -11808 -9608 -20727 -4388 -4868 -76 1442
20416 1442 -4621 -10083 -11774 22546 25831 3055 -11264 -15548 -20080 -10206 8653 6790 -2973 -6223
20402 -6223 6983 -5154 -16554 251 8001 -531 -9240 -4983 -8859 -665 14331 -4505 -22818
20389 -22818 -16208 1777 11522 19978 36532 24231 20680 23446 11142 18876 10472 -2789 -10783
20376 -10783 3372 14618 -13201 -35614 -23369 -20614 -15566 -10618 -17129 -14628 -19133 -36357 -40304
20363 -40304 -27524 -7918 2425 17181 34834 23485 11393 -3039 -17778 -25513 -29505 6982
20351 6982 9962 8628 -2637 -4636 -2313 29457 45302 48635 26444 10894 7824 3329 17
20338 17 5420 695 19061 9728 9159 38502 9413 3577 -706 8900 18336 28337 11891 326
20324 326 20013 23755 -6665 -30256 -31477 -2325 3525 -13712 -18215 -27806 -36961 -28974 -19002 444
20310 444 20475 7655 356 18805 44193 24627 -8881 -21301 932 -510 4673 18771 46989
20297 46989 40574 17972 -5494 -5408 10206 16141 17261 22619 11011 1272 -10814 -17166 -5228
20284 -5228 16154 3336 -5084 7033 7047 19849 25875 10371 -19819 -14204 10373 2776 -14906
20271 -14906 3623 27761 10199 12092 5115 1595 9069 -3183 -16079 -15369 -13580 -10421 -18235
20258 -18235 -5946 -3057 -19929 -44639 -51510 -35211 -25495 -35659 -28088 -19752 -698 30440 40000
20245 40000 44927 30864 14552 -4843 -11373 -19026 -14624 -11962 -15828 -12983 7040 8108 28932
20232 28932 31377 22767 30592 24176 2271 326 6223 2734 11235 10398 12884 3857 -1106 -4973
20218 -4973 3141 2540 -4461 -27715 -23582 -24314 -22044 -20552 -31473 -22648 -59 6666 6390 6029 2981
20203 2981 -11842 -888 2126 6238 1661 7701 5413 -452 -26252 -31525 -33618 -15776 -18248 -14027
20189 -14027 -19334 -27966 -20040 -4166 6757 7186 13353 -4990 -7428 8932 2600 -4201 11853
20176 11853 22603 23636 18624 17090 14272 5274 -8220 -4750 6201 7028 26470 35593 30382 25085
20162 25085 6978 -6142 -12844 -24125 -6716 -1247 14750 31490 26460 19717 32900 48131
20150 48131 53481 30035 13550 -2126 -6051 -14940 -29759 -26891 -3495 15572 20080 23699 1760
20137 1760 -15028 -24224 -15753 2419 1501 -9482 2323 18815 32178 36690 41799 39247 31800
20124 31800 48266 44583 20037 24480 22650 1498 -23368 -13929 6770 16750 6748 3287 6674
20111 6674 -7752 -28270 -36043 -16588 -6301 -23559 -15718 -13240 14888 23952 11459 8603 6015
20098 6015 5400 -1160 -3384 -7968 6276 5186 -4665 -24614 -25982 -13341 6054 5698 -4915 -13996
20084 -13996 -3057 13909 30066 15169 1490 -3760 -13667 -7172 15489 -2678 -13309 -8045
20072 -8045 -4446 15112 20502 34355 48433 29997 5463 -14337 -23280 -12671 -841 10495
20060 10495 3977 -12399 -32359 -23967 -14964 -14137 -15412 -9105 3899 8501 4650 10708 12592 71
20046 71 -16072 -17762 132 -1439 -16704 -15846 -9649 -4542 1706 11051 14689 11733 12331 11530 26102
20031 26102 29673 25140 27109 39611 33487 20833 29400 18548 5622 23808 27139 13534 1417
20018 1417 -6923 -14266 2675 8986 13582 3220 -15541 -18774 -11875 -4550 -2870 1006 -2720 -3131
20004 -3131 8520 17135 18596 12176 -2228 -11965 -16336 -8689 2475 5516 -3974 10693 13954 -2773
19990 -2773 -3277 -5801 -29897 -50207 -48385 -33295 -27417 -27279 -29780 -1735 978 -8183 -11774 -18556
19976 -18556 -11922 901 138 -3850 -8649 -8992 -12182 -24310 -33349 -17172 -6989 -3194 -10730 -31175
19962 -31175 -28130 -17362 -19396 -553 -6341 -7897 906 -3324 -5794 -15355 -4581 25189 41643
19949 41643 33808 21405 11413 16522 30145 30351 14688 14420 23067 26347 28439 28671 14825 4391
19935 4391 17540 18734 18085 13113 20001 8289 -14749 -14172 -28143 -33829 -33291 -18120 -10525 6323
19921 6323 5608 -14309 -23402 -26739 -9441 5836 -10087 -17250 -388 -4487 -9009 14508 20737
19908 20737 31925 42292 39769 37314 45289 62874 108258 141005 145691 160533 185206 182430 184211
19895 184211 173807 173442 162758 153210 157243 150602 140344 131890 103355 87133 73582 63979 47659
19882 47659 21487 17318 21995 16934 6725 3419 19 5652 20778 32958 21917 7855 9982
19869 9982 1879 1820 3927 5400 -28 2865 17970 26614 11089 29093 35786 38964 54490 72005
19855 72005 67648 88354 128944 138501 125624 127917 152953 173761 171058 191236 214198 192799
19843 192799 162339 147468 125130 126422 118696 77766 67011 67233 49671 33297 23529 8162
19831 8162 29384 37527 40094 22949 5548 -6034 -12913 -6688 -1738 -6966 -1258 -2475 3237 -18949
19817 -18949 -21447 -6153 -4768 -7868 1655 -5431 -10616 -4100 14137 3106 -22620 -8891 -2965
19804 -2965 106 -5796 -34348 -22322 -10902 -6357 -18102 -13766 -2403 830 -8573 -34469 -25915
19791 -25915 -17160 -4168 -2526 -8444 -10069 -11384 -2469 6287 2609 11538 1304 -10425 -15564 -15601
19777 -15601 -7384 -9862 -4573 17880 26279 8171 757 40324 45198 47178 50510 36429 10115
19764 10115 15614 22438 14643 5275 15403 10362 14696 1619 -4028 -13802 -5530 8587 18789
19751 18789 6012 -14024 -3935 20744 31530 45654 38764 24037 18610 16411 15290 8951 1899
19738 1899 -18145 -27800 -19305 -17349 3091 28055 37131 39614 22732 39475 59213 54964 43955
19725 43955 21275 9116 18832 27402 26756 26753 37320 26856 28693 15417 9402 9555 6784 13129
19711 13129 20611 30203 35117 30593 39922 37488 35895 41672 45709 40247 30891 29178 20000 17073
19697 17073 8737 7582 -15228 -18228 -16725 -17064 -13135 -15893 -38648 -31865 -24516 -18013 -28819 -33376
19683 -33376 -54223 -58721 -54235 -59285 -58659 -48834 -45752 -12073 -1626 -448 5482 3748 2015 1296
19669 1296 13658 14492 21971 43966 52168 74874 97963 94375 77392 89617 81398 70640 72474
19656 72474 77868 73355 97267 111585 121363 111929 93625 65741 47701 30609 23028 24762 25560
19643 25560 30777 44698 36879 15060 19256 32939 20706 17065 21602 21555 2625 8113 25733
19630 25733 21917 -2721 -5152 22295 12348 -7227 -16983 -14943 -13826 -5654 14113 33046 34614
19617 34614 47713 78802 80903 77837 68704 80829 97150 94067 56848 33754 51961 64548
19605 64548 68271 84214 90980 107969 109322 74260 53334 41643 35705 44045 50935 59576 64634
19592 64634 42774 40045 33930 39651 37019 32495 27217 24884 22831 17442 4588 -1777 25045 31851
19578 31851 29534 13615 22153 28682 35430 33809 41040 41893 31678 18456 8105 4896 16851
19565 16851 23129 23886 32511 33102 10327 15606 23858 28368 42745 31608 50217 72746 83757
19552 83757 93820 104886 111181 98418 90193 99680 94699 91850 107459 108900 157736 246715 378855
19539 378855 544531 637223 653522 658171 673730 614636 519748 489481 572368 669585 692597
19528 692597 634500 633737 679964 597171 413738 273234 189625 132100 94285 104547 119236
19517 119236 124102 125361 123568 119855 120092 92973 103718 135365 135003 121502 123994 127969 107816
19504 107816 109006 137312 139552 153073 169492 163312 155153 168840 179520 178490 207587 246480
19492 246480 314777 428321 603710 770827 822259 821933 840387 781937 663717 582323 599182
19481 599182 696827 807355 811831 777715 784140 742419 594995 427765 317593 243027 203110
19470 203110 166179 141194 155194 155612 151713 144950 149163 150987 147385 138540 143262 142023 128853
19457 128853 127057 138694 141088 150426 157368 140814 126077 115189 103213 97768 118159 137379
19445 137379 137419 147537 173153 176210 182782 184433 159721 153303 153791 163316 172842 177119 163936 160708
19431 160708 173302 158370 144098 158106 208446 231092 229832 256074 286056 291608 302561 334308
19419 334308 364301 399748 444719 491106 537911 568115 607278 653305 729487 804027 866324
19408 866324 945233 1050839 1158195 1272667 1371341 1454889 1582772 1753272 1982628 2331426
19398 2331426 2775778 3426444 4393037 5975050 8602220 12515890 17427135 22083816 24868908
19389 24868908 25785240 26391725 27905625 30151506 32267212 33927555 34650461 33163850
19381 33163850 29894528 27116349 26123231 25819256 23935217 19800835 14828681 10551254
19373 10551254 7517890 5615346 4416645 3658873 3137879 2806674 2596535 2441495 2349854
19364 2349854 2265112 2191188 2114194 2040997 1990544 1968141 2023618 2114018 2205820 2285089 2337877
19353 2337877 2404002 2517088 2711815 3016310 3448447 4081271 5056676 6687429 9395278
19344 9395278 13475387 18649970 23487248 26109062 26417078 26726937 29692268 35944497
19336 35944497 42991156 45893728 42363361 35459081 29704379 27094823 27037903 27266586
19328 27266586 25243394 20709289 15402814 10894119 7714138 5696767 4429114 3623890
19320 3623890 3044620 2616778 2274520 2041154 1866214 1736730 1621361 1484886 1328217
19311 1328217 1182512 1076762 1004114 936919 872460 816938 755570 712045 660228 610684 580304
19300 580304 535003 477917 419440 402100 380886 361475 359433 361647 349580 349277 357750 377488
19288 377488 407068 423380 466488 538030 635542 743552 802086 792844 789215 805972 770500 662952
19276 662952 580710 615931 727124 806246 816958 824177 920500 994998 920590 773208 659955
19265 659955 612094 575175 540461 519057 497154 467051 454429 454786 460062 481211 455863 394020
19253 394020 338146 303150 269164 227973 222615 221492 226190 219616 223210 219454 199671 200602 197158
19240 197158 221899 237733 255678 302008 402917 560423 735404 819643 846180 876131 829242
19229 829242 702287 589920 569199 632624 785247 889503 883985 908282 962452 918982 784801
19218 784801 675922 604981 558466 520348 485042 443848 433160 462126 494795 516365 521418
19207 521418 499901 455502 367872 285185 221897 173715 150705 136120 139294 118088 80167 69342
19195 69342 78286 78819 73647 82032 81511 58811 39720 39368 61153 80245 69353 61187 80089 75875
19181 75875 76347 74957 41667 34683 36581 38741 36703 23150 4304 -3063 25896 50692 63060
19168 63060 71958 76193 86392 98452 101590 75285 58545 61581 66302 59062 45533 27360 11966
19155 11966 19597 44427 56158 27418 7493 4126 8271 28123 37997 46651 51340 64390 75241
19142 75241 71155 70683 77722 69436 64969 66159 58638 80808 83270 92668 112092 138576 120597 88433
19128 88433 71147 78868 90107 107065 118971 126684 93053 74327 86331 111643 107715 84517
19116 84517 84010 77942 77356 68756 66303 62271 59174 57428 54555 58890 68374 64235 61103 58151 63991
19101 63991 72459 83129 80105 71939 66229 71951 63025 39192 47862 48832 63781 90956 99932 111342
19087 111342 131883 175795 222218 257728 285188 269982 220209 189026 165608 158894 177044 219198
19075 219198 246823 230303 212814 201436 203093 166240 118701 81118 48617 44664 50114 64073
19063 64073 70096 47571 51915 79281 84942 90437 94946 96827 88405 83300 97373 106299 95194
19050 95194 122844 147960 166936 189157 222157 255260 268834 270170 269134 255412 261337 270542
19038 270542 311695 363671 409366 433762 439779 412009 371058 340112 324464 327017 336665 330376
19026 330376 299090 275265 255909 200819 152631 124769 109902 95453 73185 45933 29040
19015 29040 32843 55268 63721 71069 78593 78189 84488 89422 80990 72075 85016 94476 114238 114092
19001 114092 120700 137332 179072 210077 224644 225165 251331 272150 280566 302013 322105 342179
18989 342179 374709 381926 379099 362736 320462 290991 263769 225829 211658 198371 173191 160466
18977 160466 139492 112813 86366 80860 88600 81618 89372 80420 73695 98251 100675 90459 88152
18964 88152 79985 79156 62988 45534 33590 43851 70594 89301 79619 62436 80598 86455 95400
18951 95400 90547 69606 60754 76371 74338 42088 23341 30898 34696 29861 14476 29612 37493
18938 37493 43014 55658 37551 30756 29011 33371 31458 42850 65336 70582 63757 66820 74961
18925 74961 67053 63341 66501 85426 101082 131671 185859 204699 195626 149313 107555 84398
18913 84398 86917 100648 126801 142399 161100 194662 194536 183071 186167 167151 140591 128369
18901 128369 113324 87692 93926 107152 85203 66685 52768 45835 36966 35926 45535 45661 40135
18888 40135 53484 53906 54430 67901 81298 108834 140194 154319 162391 163213 168368 175347 196074
18875 196074 232255 276204 328686 345270 330910 342723 351588 328994 284094 229101 188070 172150
18863 172150 178384 206004 227667 232507 231897 237032 207931 193489 180243 195331 205630 196854 195739
18850 195739 206126 193943 197570 184003 170190 153733 127721 115770 97610 81487 90140 92557
18838 92557 102805 146541 193591 200926 178717 169790 164598 159961 156407 187221 223498 271248 330543
18825 330543 348599 340826 352814 373654 388557 364338 327327 301596 276098 241872 211881 192597
18813 192597 185632 163738 144331 94208 38193 1722 -5027 -366 2675 13106 49161 67612
18801 67612 85620 108725 114816 102368 93907 86742 84170 86465 78533 67125 71299 112091 159465
18788 159465 191888 210668 189635 173966 172114 150496 140952 135136 149073 162782 158617 108326
18776 108326 83794 65244 53711 45956 47019 68887 101774 156304 231815 311733 333555 270554
18764 270554 189092 151364 154998 150091 161610 156253 130319 100506 95101 104659 115763 128040
18752 128040 128894 123861 101720 86482 75680 66128 59651 66989 66241 64693 65075 79132 70337 54906
18738 54906 53303 71490 75681 90990 82612 66183 80517 109984 110175 128485 143824 138568 143100
18725 143100 145344 125622 104929 93236 129906 173843 221338 311779 393038 413657 364217 306413
18713 306413 270905 235585 228882 268695 334510 426764 454010 389284 310562 255898 206653 181633
18701 181633 163860 140694 123017 117106 121000 144228 137366 139690 136560 150398 163924 148578
18689 148578 142738 143764 141077 138752 137070 139600 140819 146183 163905 161667 168480 173417 193116 204798
18675 204798 239477 254511 307651 401441 564026 837464 1068019 1091291 918644 719101
18665 719101 611504 551781 569659 698405 907798 1098228 1097578 899479 672007 521031
18655 521031 434557 377598 339225 317381 302750 294730 285550 266792 256514 248601 253461 248915
18643 248915 251765 242938 261766 260777 269551 307389 377077 469051 540901 556659 507743 440697
18631 440697 415078 423580 447173 516347 581408 641905 693248 693983 747518 900088 1005114 919528
18619 919528 737619 597664 523687 498280 544335 645444 824146 953095 934716 812950
18609 812950 672509 563366 497749 497263 511105 532663 548764 537643 534825 548999 580934 662117
18597 662117 761980 870784 1025461 1300373 1749652 2483551 3327512 3731427 3461107 2996648
18587 2996648 2660961 2434111 2390951 2684740 3220506 3434449 3059042 2498907 2211917 2120303
18577 2120303 1922940 1614092 1359634 1211726 1152219 1121007 1079160 1030897 1012878 1024032
18567 1024032 1059306 1095923 1148020 1239943 1342800 1425067 1478539 1517769 1563489 1648360 1784888
18556 1784888 1949130 2152609 2471001 2793137 3125555 3503668 4009264 4773325 5889011
18547 5889011 7511553 9856778 13581408 19750859 28353927 35312593 35531734 30258270
18539 30258270 24889242 22384777 23382706 28587636 38474754 49714444 55188815 53756870
18531 53756870 50880046 49056844 47337302 46108416 45857714 45535784 43138742 37980220
18523 37980220 31382445 24971249 19778844 16383699 14548527 13800451 13890678 14676209 16125534
18514 16125534 18476276 22476317 29646203 42667404 64114286 90946358 109648741
18507 109648741 107782758 91271008 77528531 76783834 87381886 99872595 101343785
18500 101343785 85408220 61039117 40920662 28488924 21194043 16717046 13788721
18493 13788721 11729002 10153045 8879235 7910458 7265518 6942968 6939303 7237970 7777870
18484 7777870 8430107 9122134 9679481 9736842 9467876 9247931 9054309 8700891 8019135 7050552
18474 7050552 5916539 4779032 3817174 3216317 2943647 2863109 2754889 2509584 2166679
18465 2166679 1854731 1652189 1550711 1510393 1520985 1589688 1644720 1578952 1471747 1402529
18455 1402529 1392175 1474225 1625040 1702158 1561341 1312327 1121970 1044381 1007380 976919
18445 976919 934058 879298 865452 858350 855389 883286 941271 1001365 1097878 1211402 1272992 1270691
18433 1270691 1247550 1317019 1456409 1535669 1470918 1370691 1336776 1323146 1276511 1249941 1341808
18422 1341808 1576093 1911892 2177309 2301705 2517645 3134359 4320673 5621348 5917510
18413 5917510 4924267 3575073 2597258 2001489 1643251 1403861 1278540 1227008 1199704 1220199
18403 1220199 1265120 1322710 1392582 1467056 1574514 1765364 2047483 2464561 3069305 3950235
18393 3950235 5321890 7538114 11020753 15780495 20994248 25091413 25989527 23264539
18385 23264539 18619390 13896691 10145404 7622501 5953146 4844101 4107472 3604002
18377 3604002 3294058 3131592 3061916 3167113 3446466 3864090 4467894 5401890 6849029
18368 6849029 9214250 13249185 19246133 24916960 25928984 21761375 16309142 12646695
18360 12646695 11131267 11109637 11633874 12164782 13058803 14469740 15010358 13765508 11959895
18351 11959895 10649765 9352260 7799033 6455088 5731835 5571450 5888505 6747587 8424030
18342 8424030 11237165 15208228 19696563 23485292 24794476 23156266 20161001 17658779
18334 17658779 16550763 16830086 17540122 17186253 15214055 12289349 9382210 7094634
18326 7094634 5569539 4654591 4199298 4055682 4056171 4167002 4490602 5189299 6392226 8392305
18316 8392305 11745133 16672588 21027796 21697290 19231171 16459818 14646048 14130132
18308 14130132 14810484 15209041 14023947 12126329 10651712 9301487 7577769 5822762
18300 5822762 4489861 3618985 3072152 2739091 2518235 2372222 2274877 2204374 2199296 2283175
18290 2283175 2482824 2836948 3414958 4420993 6074470 8355011 10896468 12893032 13236817
18281 13236817 11732381 9240593 6695358 4669897 3327973 2489978 1953269 1631213
18273 1631213 1402048 1203324 1052974 967131 898223 838703 797047 773959 763883 807756 893865
18262 893865 1003878 1166452 1361409 1509633 1606765 1641135 1519210 1327502 1155877 984659
18252 984659 824985 693199 604884 549581 528488 484413 432719 400626 384590 364375 315164
18241 315164 268454 265974 276263 280796 268644 257549 247171 248758 262426 270250 262027 238856
18229 238856 244222 235199 223189 218928 217511 200929 190952 202535 218503 224299 211803 209682 194872
18216 194872 177493 182381 185257 186745 176647 155965 144725 158837 183333 185853 194349 191698 165862
18203 165862 151334 160414 171890 170233 161248 167047 142603 132469 135429 102517 89403 74532
18191 74532 70648 66671 63522 44229 21862 23656 33342 50276 58309 44493 48401 61483 81299
18178 81299 81826 88834 74098 76704 81744 78041 67921 78703 81577 81519 72084 69865 89280 102776
18164 102776 97307 95312 94074 96236 102713 103064 98405 96465 103193 106092 108200 108338 97674 92536
18150 92536 105591 105320 94574 92887 108784 122947 121499 126376 128123 126352 140359 151006 142724
18137 142724 137808 150554 151338 167592 197274 195739 198877 205841 221871 263199 326973 362336 393528
18124 393528 434315 459811 519392 592188 706586 842610 1019373 1253403 1567634 2023376
18114 2023376 2688446 3723675 5586027 9294234 16879934 30372586 41997427 38562327
18106 38562327 24806161 13962930 8371162 5486621 3827164 2816042 2185953 1761679
18098 1761679 1450037 1196734 1002214 859133 731081 644784 559522 509349 467714 427006
18088 427006 407370 388036 358074 324800 287716 257289 250274 250758 244928 228352 225205 210634
18076 210634 199609 205991 197391 176638 133345 110779 129111 148723 152810 155760 155694 161309 182595
18063 182595 207683 230709 248795 256148 237035 201067 189234 187541 193360 209582 246315 267934
18051 267934 271568 245759 237149 206665 173780 141946 124166 112477 101986 98687 77235 54564
18039 54564 62587 58745 84256 101659 119904 164177 180768 195420 198420 222045 230459 230523 223767
18026 223767 218358 232650 250503 257803 246948 225225 233673 254709 257227 254238 244269 259522 251732
18013 251732 257379 271673 254226 246322 217489 202273 202402 201890 211674 221621 217590 209298 175902
18000 175902 125678 104378 109477 121970 119502 88678 71278 71652 83800 105322 108540 105243 134601
17987 134601 144658 136338 135966 153828 187585 213770 216094 245920 263081 258334 278292 281977 297558
17974 297558 312829 340021 389335 421070 451007 489179 495227 473900 452472 446615 464005 510582
17962 510582 625020 752594 802763 809691 841147 874260 807143 684911 614289 666581 780819
17951 780819 807258 785384 757982 711963 577660 401639 276195 202073 142147 92832 71673
17940 71673 90591 114060 99440 91470 81908 84175 89123 82015 80499 58399 59987 68893 74419
17927 74419 61200 51573 55548 52210 48674 57087 78563 97292 101340 132276 163567 223182 323013
17914 323013 473133 626503 652315 622735 668424 725170 686723 561033 532382 588441 683048
17903 683048 710056 663509 660908 624684 502766 353691 243192 181605 150091 107549 94251
17892 94251 75520 65444 59506 58986 50771 50167 52200 33416 24982 32814 32150 49982 34571 30036
17878 30036 41718 46345 76958 97820 114835 119042 125770 126326 101917 82183 75782 94816 75305
17865 75305 71849 69737 72157 91948 98280 84207 76033 67962 96644 145420 138557 114936 83215
17852 83215 45829 38508 20445 4622 3768 -4606 4279 19975 33388 38175 40735 36877 47414
17839 47414 55154 50993 42875 65777 94553 103142 111396 113580 109276 87184 66261 46027 29367
17826 29367 58573 92653 100644 100054 111648 118389 118550 121399 125107 127710 138036 132715 121052 96261
17812 96261 78348 73510 73541 69053 53031 55941 77159 115570 124340 125622 112591 84299 64666
17799 64666 50307 34579 24827 23153 6620 -1453 1597 378 13987 32903 50719 72078 70654
17786 70654 84323 100692 75649 52467 59892 54157 43161 32867 34907 34295 9466 5357 1323
17773 1323 26814 27242 48571 76972 85661 101599 116981 106759 104245 86921 58638 50959 26489
17760 26489 12901 11301 5829 -7105 -6757 -798 -5588 8338 20207 24117 28423 20679 29340 53290
17746 53290 61082 66325 81527 92541 92310 79699 58816 60913 59618 53738 39558 31771 35802
17733 35802 37666 26549 12882 12945 11165 20955 22198 31605 38251 38497 29277 17640 4111 10311
17719 10311 7426 -4747 -3506 9152 -2272 -15819 -11962 1804 2250 508 -1840 4410 5487
17706 5487 2441 -9218 -6647 1160 -14633 -18626 -21165 -17413 -18878 -8333 -3483 847 5712 -11232
17692 -11232 -23770 -25786 -28416 -10639 -12729 -26959 -20874 384 15052 10757 14381 7783 -3273
17679 -3273 -1513 19278 21697 13807 27964 25035 7768 10936 10558 23226 34874 22199 12025
17666 12025 24056 8365 347 10912 32339 34164 42834 57462 37732 24036 31204 46428
17654 46428 42024 33151 14460 24005 31214 21130 17997 14847 22016 23265 21175 15908 5898 9730
17640 9730 15324 16296 16103 23334 20074 -7390 -22548 768 4834 -6665 -16094 -28478 -37609 -27865
17626 -27865 -8567 -20009 -27672 -29605 -19147 -14227 -13234 -14625 -18662 -18562 -19545 -23336 -4392 2657
17612 2657 -17357 5156 3816 -231 255 13216 27252 25503 13313 2440 3202 5828 19610
17599 19610 27855 33009 -2814 3966 9418 -9217 -1006 10506 -1838 -9298 -19043 -10398 -7301
17586 -7301 -8969 -10484 238 8222 -3943 -10420 6835 15686 4551 7959 19316 16466 9873
17573 9873 19991 17331 -1092 -20689 -27362 -11774 -2183 3564 -3955 -6289 11686 17770 23652
17560 23652 8841 7357 35697 70698 59300 58664 38556 29656 32405 33155 27612 16420 11380
17547 11380 -3388 -8316 4426 8052 8486 40272 58565 48306 53648 71904 61122 50996 35755
17534 35755 42920 48621 29295 11919 9641 -900 -2556 -5813 -11170 -2547 14721 19957 7642
17521 7642 11745 -1416 -1323 2192 40952 70722 67111 60599 61354 43503 23599 16600 7972 -139
17507 -139 16663 22748 1431 4788 18525 25917 19766 33624 37882 29009 30665 43416 52669 35477
17493 35477 12950 8318 7573 14144 18226 9146 -5045 -2257 -174 6619 15517 25639 12772 417
17479 417 2297 8219 2556 2367 7309 6012 621 1723 14603 17677 9169 -3514 -22003 -34256
17465 -34256 -13852 -12874 -22851 -29094 -31211 -31088 -20737 -19841 3415 23931 21851 29433 30360 35375
17451 35375 35973 26983 25407 8726 8385 29421 37520 69964 136213 219263 245893 193665 117034
17438 117034 67786 32189 17562 13964 15030 16335 17422 13826 13766 10147 -1625 -17792 -22219
17425 -22219 -16918 2059 439 -4820 -17809 -19034 -29479 -46019 -35181 -19279 -27708 -28405 -22872
17412 -22872 -15642 -20729 -12283 -16966 -36149 -44120 -32477 -42511 -43801 -24502 -20442 -6741 -7496
17399 -7496 -6842 9703 13187 -504 -4020 3081 -22550 -56546 -70251 -63942 -35676 -10471 -8001
17386 -8001 -12411 -1239 7108 -2578 -22958 -21637 -26224 -16728 802 -2255 1880 12182 -4222
17373 -4222 -1470 12993 20657 31409 38261 27737 11015 24268 26668 10304 -2884 10345 7556
17360 7556 -19671 -27495 -19224 3469 10646 -1249 -5426 -11001 -10399 -2127 18077 21274 15689 2568
17346 2568 -3387 6200 12749 16417 12720 4334 1395 -9656 -22522 -22295 -26725 -22953 535 2132
17332 2132 21912 24173 6506 -6560 -13995 -27956 -19556 -8245 -9233 -39475 -37638 -26012 4176
17319 4176 9615 -12182 -8961 -4584 -1531 -11755 -18300 -13976 -13170 14906 -3237 -41670 -37064 -34557
17305 -34557 -25185 -27983 -22987 -21007 -19064 -13766 -14466 -19677 -11604 1272 -788 8351 17842 14815
17291 14815 2331 -13894 -16829 -7082 14507 13110 -10742 -23892 -33540 -42344 -40193 -23561 -10219
17278 -10219 -11474 -16210 -8781 7862 -1458 -14654 -6668 -16575 -38035 -39806 -17501 -1578 2037
17265 2037 -16053 -38484 -50386 -39188 -31151 -34873 -26800 -27804 -35580 -37293 -21991 -34454 -40910
17252 -40910 -29616 -18010 -3968 6986 5934 7676 9671 -679 -7034 -11205 -23521 -37959 -33996
17239 -33996 -12872 13186 7092 -7195 -11062 -4247 11503 9546 -5082 -17800 -7826 2506 -3794
17226 -3794 -2809 -11034 -20194 -21923 -24813 -34966 -35580 -31189 -37037 -21262 -8383 10804 2550 -9235
17212 -9235 -5815 2506 10816 15477 2913 -11859 -23317 -25993 -28576 -5927 9313 13797 20047
17199 20047 3565 -18799 -15765 -10558 -7306 -8376 -12232 -4165 -2091 -7467 306 13309 15881 28889
17185 28889 27923 3482 -8457 -4507 1636 1390 9375 308 4072 -11510 -19361 -17188 -14954 -4994
17171 -4994 13017 19389 -6112 -3650 20959 15332 -10179 -18695 -3029 -5836 10227 10020 -12762
17158 -12762 -20426 -15767 -21933 -25114 -11051 7175 11452 20568 15576 23359 13402 -1415 22509
17145 22509 20284 -2114 6235 14459 -4553 -21046 -13607 -1298 519 15195 9275 -5696 1615
17132 1615 5763 12811 8519 -14502 -6130 27511 14727 15033 36756 28625 4298 6174 13227 6452
17118 6452 7194 5086 20937 24324 11249 14108 28744 16745 17571 22296 17103 -8546 -30314 -27812
17104 -27812 -13169 11203 -2860 -24688 -15004 -8503 5080 24814 25070 2502 -20397 -23268 -25561
17091 -25561 -8307 20051 37017 27556 20943 26326 31940 31682 27391 7830 -4813 -13278 -5499
17078 -5499 -12340 -19554 -32198 -28905 -25344 -5686 -585 -10091 -1417 140 -1100 11662 21996 9628
17064 9628 -7027 -12404 -10649 -3390 8719 8229 21130 27455 14849 7061 -6141 3034 4988 8552
17050 8552 7894 12691 18000 38432 26082 549 -17336 -15316 -3211 4824 2605 -8879 -34345
17037 -34345 -22834 12964 18565 11941 -256 -6466 -22407 -24222 -17077 -4960 -984 1479 9529
17024 9529 10579 8697 7907 10155 3279 1365 9262 12674 2129 -4321 -2760 7138 14720 3616
17010 3616 22431 -1199 -14028 -28506 -3048 -1240 -5267 -16756 -10565 -5932 -24266 -34507 -15336
16997 -15336 -12316 -13602 4264 -4256 1900 22037 18612 14741 14808 3771 -4358 -4229 -18282 -20684
16983 -20684 -12094 -20142 2854 12214 2032 3084 8358 23321 26677 13531 -6963 -16451 -24149
16970 -24149 -15080 2228 -16543 -16130 -1150 -5004 -24289 -25553 -26456 -21057 -33237 -50301 -35245
16957 -35245 -19959 -4510 12641 17864 13032 10467 -6383 -10503 -15190 -18469 -21633 -10839 92
16944 92 1622 -14270 -18492 -22734 -19019 -2617 9664 14166 6286 3347 -5450 1550 -1530 10134
16930 10134 13768 9043 -1707 -4082 -11827 -14668 -13787 -18506 -22150 -27116 -16495 -15730 -5235 3401
16916 3401 -12929 -39837 -24774 -1713 5114 21845 21526 14628 14635 14387 -19851 -17534 -16758 -17414 -20531
16901 -20531 -3071 17371 20028 11690 7152 16284 5824 -27026 -32839 -17888 -22072 -17424 -25710
16888 -25710 -23735 -4504 14755 30461 13103 -12416 -25010 -19742 -18609 -22348 -11915 740
16876 740 5852 -4891 -11286 -5997 -2964 5353 2008 -6196 -24811 -18274 -6275 -11203 -11777 -19766
16862 -19766 -16873 -16573 -27112 -26126 -27843 -17896 -11251 1356 5416 3830 -9934 -14794 -7688 -11080
16848 -11080 -17498 -13608 -14704 -531 -14269 -18073 -32247 -29884 -45077 -41314 -32913 -22901 -10648
16835 -10648 -11343 -8934 -5621 12958 8450 -18267 -12654 -3260 -21553 -30180 -12452 -10012 -7546 -21538
16821 -21538 -17407 -7969 -1384 1863 4580 5243 5352 565 746 -5757 -11388 -14506 1054 6047 2537
16806 2537 3136 16789 12363 -1575 -3742 17140 4006 -4320 9551 11335 17982 12642 4984 2186
16792 2186 1846 322 -24654 -37069 -22348 -17327 -12976 2763 12842 3459 19954 39717 33327
16779 33327 37747 38608 45833 28232 1233 -20528 -5732 206 4355 31409 44488 32258 13277
16766 13277 7763 12165 3555 -7542 -28053 -25204 -18245 -3522 5789 6538 8964 3309 -2155 -1628
16752 -1628 -4388 -17568 -1072 14197 20792 33658 26897 29994 20112 11698 -10060 -17452 -33323
16739 -33323 -33023 -34959 -28225 -25177 -4938 3854 15090 1871 -24859 -24037 -7538 -7345 -13143 -29122
16725 -29122 -35560 -18806 -12151 -7138 -8609 -7532 -3304 -1817 -9402 -17823 -22380 -7466 -1664 7455
16711 7455 13908 16826 -1867 -5161 -13256 -6455 -6638 1943 12830 -3558 -4325 -382 -1045 -11846
16697 -11846 -8809 10295 -3081 -6632 -14961 -10091 -4053 -14893 -17864 -15144 -31554 -9316 21966
16684 21966 6238 -18208 -2922 17297 16986 6245 1065 6068 2722 -5792 9931 11439 4302
16671 4302 -3852 17109 10610 4170 1143 -16349 -26450 -25187 3983 40684 29691 12950 19438
16658 19438 18264 19611 9553 2874 1884 -8084 20981 31005 6110 -4081 -17583 -30789 -10377
16645 -10377 12489 13644 5943 -942 -2254 -25256 -30777 -17890 -8143 15673 34837 29922 28325
16632 28325 26091 11891 13821 117 -1828 -26342 -29322 -11572 2108 -3961 -16175 -8484 -13041
16619 -13041 -16204 -6076 -649 1437 9671 4819 -7612 -12301 -17534 -8410 -14092 -3263 -1781 1876
16605 1876 -15699 -33058 -20397 1241 25595 3812 -14940 -27372 -32927 -21166 -6732 1951
16593 1951 -6016 -8317 5706 14262 19999 5331 -427 5654 -9879 -21280 -8848 2420 20874
16580 20874 20609 -6498 -2911 5589 -2724 801 -8691 -11379 -7370 2170 -16944 -5319 -6138 -9426
16566 -9426 -16619 -9903 8383 4529 13970 16118 14840 -2421 -11143 153 -10569 -16791 -18450 -9351
16552 -9351 3111 267 -1408 1445 -2090 -15592 -27601 -27466 -15835 -24544 -14966 -2375 -4532 4537
16538 4537 17719 11633 7948 1344 16645 11939 1647 9041 12762 2315 -23648 -41804 -27328
16525 -27328 -24922 -34652 -29358 -24349 -22115 -6979 2339 -2240 7150 15227 1723 560 -21779 -30456
16511 -30456 -10315 -1201 -23334 -26544 -23532 -18690 -4983 20225 34708 23423 19587 30116 28137
16498 28137 17323 18328 17612 9099 -6443 -7415 -966 -7524 -21301 -15876 -14525 -20630 -5381 -3728
16484 -3728 -22401 -14224 2890 205 -6075 -10496 -23954 -12979 -7271 6808 4081 -3018 -6252
16471 -6252 -3277 2167 -18527 -23369 -12484 9165 9773 24034 13468 -2116 -636 -9865 -27943
16458 -27943 -44705 -46550 -29033 4408 9708 4468 1192 3654 5718 8902 -5629 -24614 -22592
16445 -22592 -4091 8394 15529 6400 -1955 -7518 616 10600 3623 13816 7004 -23841 -25949
16432 -25949 -2365 -7582 -14446 20882 40248 33540 19451 8947 -5876 -15344 -11535 -20714 -5232
16419 -5232 7491 10272 -6411 -8208 -10951 -20266 -40188 -38993 -20976 -20698 -20607 -48459 -43053 -47538
16405 -47538 -50651 -56312 -48093 -40444 -53909 -29385 -11385 -5858 -7431 -20790 -35402 -28563 -28496 -11059
16391 -11059 -14105 -9906 1891 15600 12495 6309 1850 -5762 -10215 -17403 -14234 -9853 -11850 3961
16377 3961 14603 15641 19491 6011 -1132 15228 21940 16249 7477 13758 13106 20699 19039 9865
16363 9865 11910 23277 7189 -9684 -15270 -6518 -926 -3402 9048 13419 18557 17046 13141 16128
16349 16128 14893 13983 22036 20064 7123 369 14858 38593 33053 21641 11338 269 -28918
16336 -28918 -17557 2222 9734 19716 22717 -7597 -23806 -21399 -2839 16021 14847 -1503 -12981
16323 -12981 -2698 380 2584 -1293 13266 35179 40145 31279 30929 31829 10193 -5249 8371
16310 8371 7414 8509 8074 10155 12777 4644 -7053 -9407 6970 -1674 -20874 -16907 -23513 -25082
16296 -25082 -9478 -2993 -9800 -9807 -16287 -28966 -11828 -18718 -17711 7604 10993 22018 9252 1053
16282 1053 -801 789 -15520 -15533 -9117 14113 11101 14666 18479 9155 3489 2718 -9749 -30390
16268 -30390 -25578 -36396 -25339 -9130 -16967 -28586 -29334 -19096 -14185 -12354 -13332 -1946 10080
16255 10080 10103 20195 9198 -7131 -17876 -16732 -18017 -11687 -6181 -9243 326 -4707 -21660 -40339
16241 -40339 -27499 -18771 -7529 7489 12688 -1178 -16977 -13418 -2946 -1936 5822 -645 3714
16228 3714 10267 2638 3822 13890 8931 6567 -10708 -24949 -21205 -25555 -23710 -11364 -1475 -2304
16214 -2304 2293 3797 -8180 -3127 -6029 -6032 -9490 -18361 -35015 -27599 -2743 -11117 -9339 -3415 -17328
16199 -17328 -14786 -9411 -7462 -20836 -10162 17419 18508 3477 15028 20106 13200 -3298 -8027
16186 -8027 1698 3080 -5412 4972 12918 22543 17119 14885 13249 15757 9471 3481 3458 5519 8251
16171 8251 11857 -420 -18388 -13077 2078 9733 3423 -4431 5575 6040 -8995 -2083 119 11842
16157 11842 2848 -31230 -45694 -34472 -11110 3035 3933 -14740 -19601 -15131 -4272 4675 657
16144 657 -12062 -8602 9191 9794 -805 -15707 -29148 -20828 -18481 -28920 -29909 -7066 15114
16131 15114 5730 -2852 -12319 -6571 -16905 -38773 -43345 -20845 -18526 -21833 -12279 -14667 -2103
16118 -2103 -2339 4643 -2685 -13088 -14604 -20000 -21232 -17027 -31976 -28561 -7749 561 -5582 -7818
16104 -7818 -21951 -8998 -6054 -7502 -26308 -27484 -26859 -12913 1621 17959 33087 24282 20206
16091 20206 16578 20443 12053 9661 -3586 -4814 -6942 -3725 8932 15787 22199 10733 -14221
16078 -14221 -17478 861 9110 -9042 -31685 -29469 -37177 -34522 -36988 -19782 -11125 -13003 -8501
16065 -8501 1707 5614 -6928 -13764 -26660 -15198 2619 14817 27292 11511 -17149 -48000
16053 -48000 -48349 -45066 -35290 -1705 -4763 -28689 -52990 -60988 -49711 -34131 -15920 -21524 -38096
16040 -38096 -28225 -17466 -6957 -6348 1956 9289 -1872 -11339 -9070 1678 12305 13870 -1169
16027 -1169 700 -23143 -31683 -20863 -7767 -6336 -16954 -34680 -17924 -8152 3025 -1877 -3532
16014 -3532 16463 25742 19009 10411 3341 -10480 -28197 -31222 -3127 16385 -15036 -30971 -28115
16001 -28115 -35287 -40631 -30749 -3424 10761 2846 -911 -3142 8510 12001 10680 -3688 -23585
15988 -23585 -26668 -18653 -1588 -16116 -29945 -41747 -42275 -24223 -12958 -14894 -14283 -6787 -7513 -2248
15974 -2248 -9815 -5804 1335 -3302 -15126 -20620 -12349 -7881 -8465 -19519 -36930 -34398 -17241 -31348
15960 -31348 -24014 -16080 2956 12776 12142 3443 -1713 1643 -8242 -4077 -15829 -14570 -19110 -1661
15946 -1661 357 5113 4343 17401 844 -17397 -15791 -4486 -21929 -25882 -23586 -13441 -13904 -590
15932 -590 -9622 -12693 -8060 -2897 2563 7357 18546 24343 35278 23932 20657 10136 22581 21169
15918 21169 18226 5724 -392 1980 -7985 -14771 -6088 -10106 -2019 -6183 -19975 -13316 -17799 -18412
15904 -18412 -13580 -4025 -2505 12309 29295 27802 34187 21626 7033 4747 4788 -4801 -2137 -3214
15890 -3214 1096 -19165 -35355 -36986 -14921 -15762 -45357 -56271 -42151 -5981 12284 11417 10727
15877 10727 1290 -21989 -24169 -19191 -23618 -34295 -28525 -26231 -10928 -2436 -734 14709 7527
15864 7527 6641 -1776 -19837 -25752 -7857 -4474 -14429 -14807 -9763 -18982 -15199 3149 26348 14947
15850 14947 -3408 -7565 -7836 -16881 -3906 -1273 -5783 2594 12611 14053 -3603 -19672 -15446
15837 -15446 -16098 2286 25051 37529 26730 12279 -3391 -12684 -25963 -27843 -27864 -8447 -17995
15824 -17995 -29276 -25234 -5546 6352 -5271 -5022 2654 -5238 -14856 -15388 -3898 11507 11743 7187
15810 7187 -13074 -12146 2601 17888 32804 14428 -3113 -1130 3702 8963 -1006 -8441 -8801 -15923
15796 -15923 -9372 10273 12131 2644 12178 1562 15493 35277 26970 22115 8952 -4564 3774
15783 3774 18153 14224 -4920 -16584 -30066 -32829 -15570 -13164 7233 11961 12477 8507 -1570
15770 -1570 6293 10504 17342 -12598 -17159 -10177 -13792 6467 14664 -13058 -21556 -27759 -27069 -11775
15756 -11775 403 -945 -4338 5231 21335 31108 37729 28759 28769 39083 22705 3953 3138 15783
15742 15783 12376 3661 -2075 -4177 8007 -5731 -22300 -16222 -14665 -1689 5467 10215 -219
15729 -219 -13046 997 10112 22325 5302 -9501 -13722 -22438 -20127 -18949 566 25742 43664
15716 43664 36836 22542 23785 29193 29903 16122 9755 10012 1419 11021 4646 -15982 -14910 -7466
15702 -7466 6902 14715 25429 16326 13001 -9260 -35396 -51269 -42915 -53554 -49910 -19973 -27471
15689 -27471 -32008 -17678 -15255 3824 23879 20536 281 -12618 -12342 -9821 -8281 -10034 -2537
15676 -2537 -17556 -20404 5352 25788 31491 33065 31716 25276 24288 19487 28342 9790 -7662 -37237
15662 -37237 -43152 -28581 -1344 10386 10289 9146 -390 -26655 -36451 -5085 -13278 -33876 -35796
15649 -35796 -38893 -26325 -18822 -23402 -12427 -5672 -251 5576 1161 2750 -253 -12288 -11934 -6839
15635 -6839 -14938 -31728 -43002 -29319 -7110 11305 20156 11860 -171 -179 -13125 -10487 1317
15622 1317 -3304 -12364 -14873 -30227 -23947 -15754 -3457 5107 11311 27601 3825 -15366 -22347
15609 -22347 -27190 -22494 -17716 -146 3882 -6109 -13476 -12420 -7980 6391 19695 18651 -434
15596 -434 -633 -7867 -8508 -13395 -21755 -8892 7425 17947 -2515 -6273 -18648 -18542 11525 5200
15582 5200 5351 3007 -16274 -26713 -20943 -21714 -15580 -4554 7182 -8079 -29583 -32718 -28940 -31852
15568 -31852 -23495 704 10677 13878 295 -7654 -8605 2379 -5680 -25573 -47008 -47593 -46839 -44609
15554 -44609 -39196 -41715 -41035 -16612 9064 4049 2153 10838 6816 11098 25082 21812 12771 13059
15540 13059 8473 8432 14677 -2422 -6950 -6911 3600 -520 -6818 12300 27845 25629 9999 -315
15526 -315 13235 21716 20902 14172 18329 9814 807 -4739 -11040 -23794 -31448 -20763 -33619 -34423
15512 -34423 -16274 -20213 -14555 -559 2583 -12754 -43081 -50308 -38245 -40543 -26687 -7988 3209
15499 3209 6854 14879 6464 1075 2829 3652 -15023 -26375 -27133 -17990 5566 -94 -9607 -7632
15485 -7632 -10421 -1339 12314 8976 3040 -6575 -9871 6278 11332 11074 9437 7699 2865 11950
15471 11950 24002 33943 36843 35828 17788 7247 -5828 -10142 8268 17129 9672 4709 9239
15458 9239 10360 -7818 -8510 -9606 -11686 -23623 -25837 -11714 -5937 -8342 3105 3588 -10045 -26110
15444 -26110 -37394 -27260 -13923 -14508 -8700 1820 7769 25941 20706 10162 13900 7019 16851
15431 16851 17412 19614 25116 7126 -6683 -4886 -1039 -7132 -6476 -11614 -22383 -25312 -18285 -4124
15417 -4124 5440 10025 7405 3102 -1524 1600 4473 -3868 1352 10915 -3390 -13488 -11484 -12099
15403 -12099 -10607 -17735 -8171 13059 24363 20329 4550 -3523 11761 34507 28060 17369 1810
15390 1810 -485 7167 1310 -12067 -26269 -38891 -22429 -30226 -29172 -20572 -8299 -16975 -26443
15377 -26443 -15439 -5191 -10198 -22690 -27359 -30955 -13088 -3006 -11045 -20790 -10447 -9230 -12962
15364 -12962 -11608 -1833 4282 20555 7612 -8807 -22859 -46 -4260 -28994 -10922 11372
15352 11372 11326 14147 2982 -8863 -11046 -8358 -15500 -19265 -7129 5607 12245 8743 -2243 3252
15338 3252 21040 15274 16182 22217 25187 37857 35914 22907 5464 -11659 -20011 -9833 15863
15325 15863 34986 24939 16827 14413 16616 12567 -16041 -22944 -16707 -17432 -9762 -4196 -8728 -2570
15311 -2570 -376 909 -3290 -11324 -8580 -14923 -4968 -8688 -14187 -28758 -37018 -25695 -25793 -27376 -23331
15296 -23331 -3935 -5742 -15988 -10771 -7051 -13736 -18391 -9267 -13864 -29108 -28914 -12439 -5763 -6608
15282 -6608 -14611 -15705 -18386 -11645 -13661 -24887 -22505 -9598 -20123 -19393 -12689 -4677 -8714 -2460
15268 -2460 -5725 -20365 -28624 -17039 -8115 11219 21271 17059 13329 6942 -3871 -9454 12890
15255 12890 10950 -10371 -10496 2223 -1435 -19584 -25578 -30438 -27456 -12738 -7091 -3002 -2110 -29450
15241 -29450 -40247 -16234 -18121 -23535 -20721 -14917 -11318 -14717 6735 30476 15862 -4631 6909
15228 6909 14194 890 -1733 1827 2111 -2733 -28102 -20103 -17566 -10932 7382 3762 -27853 -26481
15214 -26481 -1920 128 -5628 -3167 -16756 -29212 -29905 -15358 -6838 -10825 -19303 -23311 -6461
15201 -6461 10074 21435 15597 644 -18186 -18514 -19852 2033 6255 -1318 -19359 -9578 -16338
15188 -16338 -6163 -4118 -5174 925 27969 28218 10295 4374 9318 12784 1549 -11868 -160
15175 -160 -1011 -5164 6472 2727 -6947 -1307 -3262 -1821 5228 -816 -3745 -5164 1357 -6192 4767
15160 4767 13729 -5297 800 26079 18444 -10695 -19308 -20850 -5997 4536 12574 7807 -7572
15147 -7572 -24830 -36138 -36465 -24390 -24919 -18684 -4651 -18073 -24290 -9951 -6363 -10715 -4899 -8374
15133 -8374 6427 13244 -530 -8235 -18189 -20093 -11330 -9290 2613 9135 9791 2984 11192 19284
15119 19284 -3457 -18372 -32191 -25286 -11444 -28444 -46587 -29192 -14031 -1241 -6290 -9127
15107 -9127 -18855 -30514 -22343 -23469 -21648 -28681 -25920 -2730 -8831 -18329 -11194 -1264 6842 19324
15093 19324 14783 1150 6685 -1678 848 1176 21219 16212 -11382 -3215 8998 3207 5705 -2664
15079 -2664 13483 11753 -10923 -7844 -2976 -17792 -12371 -14482 -8058 -17645 -15132 -11443 -4506 10410
15065 10410 6499 -9175 -16331 -21704 -15197 -19357 -12422 15502 5171 -7772 7392 12247 21079
15052 21079 16491 2353 688 -458 -3609 -7317 -4634 12728 35295 42021 35732 45739 61050
15039 61050 57099 70625 88057 91753 101275 92219 73518 65070 74534 75606 71466 70584 50247 16898
15025 16898 8478 12543 10258 2932 6247 30243 48623 35092 25780 6894 -607 -10002 -8067
15012 -8067 10679 16583 5641 -6360 485 16622 12306 -18305 -23661 -21472 -3051 -14277 -31590
14999 -31590 -34301 -30969 -17724 -21993 -12205 -326 -12158 -24062 -24573 -5046 -11601 2003 9502
14986 9502 5919 -1049 -11159 -7786 -8117 -9029 -37059 -44464 -45207 -39583 -32749 -23925 -20268 -7742 10322
14971 10322 15785 8511 5398 6729 -2447 -23929 -46348 -50396 -34478 -8718 -2601 10586 21561
14958 21561 14087 15104 -15278 -12799 10445 3023 -6601 -15951 -15435 -12405 2402 574 -9645 -15800
14944 -15800 -5690 13922 18667 -7320 -20136 -15784 -6299 -2289 -2420 -11763 -17131 -14402 -32738
14931 -32738 -21929 -29530 -44688 -35296 -22926 -18681 -20584 -20726 -5873 17568 25168 37694 47874
14918 47874 33043 35095 19090 3115 -14230 -24558 -23920 -33292 -39313 -40323 -23115 -16034 -2834
14905 -2834 12181 28722 44453 41373 26816 8940 1527 -4465 13751 38495 36991 24564 23158
14892 23158 24470 10596 12549 21295 1536 -7230 -1096 1686 14243 24434 40113 35983 18710
14879 18710 15170 23428 17352 19413 21741 24895 32043 33434 19797 -4139 -825 11444 12294 19429
14865 19429 43661 33874 14766 22069 16443 13677 19670 20240 -4392 -17978 -21683 -18081 -2328
14852 -2328 7601 6996 7949 1991 14955 -4800 -9628 266 -1194 -18782 -33207 -25692 -2162 -4825
14838 -4825 -13919 -936 10652 -13323 -29874 -21736 3489 16781 17201 15778 14457 12318 1334
14825 1334 6411 9242 -2562 2127 1513 -4999 -1000 13075 17472 4994 1418 5724 8688 2270
14811 2270 -7861 -5148 -12022 -10206 -5939 -5602 -12310 -9714 -10651 -7826 1425 1344 8670 10078 -5944
14796 -5944 -2529 -7899 -3653 10361 1629 -8899 -9543 -16502 -23111 -2368 1843 -12923 -15369 -18362
14782 -18362 -28969 -26018 -7571 -4282 -6756 5661 17296 7092 -4775 -8657 1330 4806 -13963
14769 -13963 -34632 -43532 -23735 -12755 5232 12901 6402 14235 16880 12079 16505 10619 -12916
14756 -12916 -19720 -14837 -17197 -6027 -12330 -7999 -2639 5545 10388 17552 12637 26682 39128 33530
14742 33530 10642 10541 21055 7610 636 7873 2619 9113 7281 6848 -5052 10870 20476 12080
14728 12080 838 9328 11542 -4840 -28948 -32784 -14587 1685 17985 24545 25868 10714 10140
14715 10140 12068 -6890 -12629 -27976 -21433 -13733 130 -7808 -18883 -23927 -23119 -3745 11997
14702 11997 3351 -10170 -17093 -7099 -9086 -17623 2717 13879 5383 -23706 -32130 -19647 -13354
14689 -13354 -4039 -9087 -10784 -17395 -23233 -18608 1973 8318 1592 -1782 308 -22205 -33296 -14692
14675 -14692 -18169 -30443 -26337 -27670 -4601 11839 -3601 -22101 -25164 -12378 -5869 -21308 -16609
14662 -16609 9869 9990 -14848 -13812 8359 3464 -463 11442 15277 8772 9123 10592 1953 -13363
14648 -13363 -18757 -8305 -6414 1113 -5986 -7420 -17323 -13688 6533 20255 18474 11736 3287 -2478
14634 -2478 -2918 -17508 -19046 -16724 -24145 2132 10650 2061 -10564 -30793 -35458 -25539 -23518 -28595
14620 -28595 -27059 -12589 93 15348 14705 15312 6562 -5688 -14242 -14155 -13021 -18669 -13430 -4337
14606 -4337 2299 32436 27764 10801 547 7905 9442 17426 31254 14719 10324 22134 24708
14593 24708 28213 6154 -18773 -30326 -32960 -24125 -29736 -15737 -11711 -22979 -20504 -11843 -22669
14580 -22669 -28027 -5790 8645 -6962 -12820 -14243 -27379 -38744 -23748 -8513 -12182 -2508 6752
14567 6752 -1364 8662 20303 12565 -1704 -18716 -28065 -24598 -12906 -24204 -33548 -29970 -35589
14554 -35589 -11494 -1639 2620 -2253 1061 2648 -5935 -6099 11200 10903 -9988 -17320 -16206 3355
14540 3355 22754 19343 19995 21222 20980 21671 8017 3171 -1771 -20 18421 45874 44439 36990
14526 36990 26939 21670 21692 16437 1224 -10133 5636 21368 18696 16809 13844 22229 22285 5442
14512 5442 -335 10674 21632 16270 5806 -13885 -16289 -5380 1215 869 -9363 -1262 -3787
14499 -3787 13962 8749 -2257 23707 35364 32938 37475 30101 17763 3518 8566 -6283 -11813
14486 -11813 -11947 -19221 -32998 -34550 -3952 -979 -86 -21003 -31864 8936 47208 72084 81027
14473 81027 48473 39470 39565 30368 42568 53412 48164 54209 43908 23848 18114 16661 -2566
14460 -2566 6279 2154 -3053 -6869 10004 19496 12142 24976 16300 -6028 -11829 -8029 3061 -4877
14446 -4877 -17360 -8939 17911 31087 17245 -4868 -16995 -22411 -31666 -44040 -43595 -34711 -40196
14433 -40196 -33371 -36470 -40915 -18546 243 -903 6961 422 -10339 -4907 -2490 -4224 -25836
14420 -25836 -32582 -19116 -3391 4154 -12692 -24284 -30817 -23506 -13902 922 -3146 -2827 -3931
14407 -3931 574 -11892 -7675 -3835 -4789 -3537 -575 -5113 -3122 22470 35843 29601 9458 9474
14393 9474 25035 16932 17452 10504 -7525 -19562 -31117 -25430 5810 15847 -13832 -28790 -22674
14380 -22674 -14738 15778 23609 10010 9779 4829 18511 25591 22385 15725 10221 3880 12352 9232
14366 9232 17966 13635 6253 1856 -10435 -20870 -44330 -49271 -33193 -6257 14862 23283 20876
14353 20876 6000 -10450 -2636 3685 16181 18559 8728 4684 16922 19974 11673 -10526 -12008
14340 -12008 346 6439 4306 14330 18983 19552 15004 5464 5013 29364 26222 19853 17869 23821
14326 23821 15908 9847 20268 13503 -12140 -9030 -15160 -29261 -22156 -1813 5263 -1081 -1538 18513
14312 18513 5872 -8188 -7213 -3277 -859 3818 -223 -3046 -2853 -2936 -5552 -26959 -17468 -15576 -14554
14297 -14554 -7360 -1028 9786 16068 7714 -1786 11398 32315 28587 9780 -13383 -17056 -16648
14284 -16648 -25896 -24939 -16191 1611 5310 10180 17891 25810 30546 33840 28302 14769 3757 25198
14270 25198 14010 -6894 375 -10497 -17666 -5964 4803 12421 22827 16819 -4900 -9832 13217
14257 13217 7328 -1660 -8452 -35295 -31904 -27550 -25154 -7954 14983 27559 38009 43862 26893
14244 26893 19750 18714 11202 -3399 -8376 -5137 -31638 -27550 -30716 -50709 -37597 -21700 -19167
14231 -19167 -9355 -15482 -6157 -7143 -19428 -20104 -17947 -34580 -26386 -31566 -27942 -18168 -5450 529
14217 529 -1082 -6722 -7917 11385 3132 -10200 3981 10878 -9783 -7371 19013 34531 42223
14204 42223 26726 31218 25744 4080 -73 19480 19521 25138 41206 36360 15490 12754 1486
14191 1486 8762 24505 5952 13149 27809 30523 22199 -4657 -10981 1511 -237 -3107 1766
14178 1766 10106 4333 851 -2123 -640 7365 5210 -7482 -10548 -12369 -8833 10163 30752 26311
14164 26311 9170 14886 18121 10420 3457 4022 -13372 -21796 -24924 -32134 -12036 6975 1495 -2603
14150 -2603 -3941 -9009 1556 19227 20130 35893 41772 24777 2784 -9606 -8124 5920 17411
14137 17411 26732 8444 4092 4802 -1686 -7592 4294 12933 -2262 -12794 -7057 -883 949 -6606
14123 -6606 -9832 -10476 -3390 598 -2830 6398 15224 16415 -1254 6231 22563 5003 5371 22879
14109 22879 17763 21830 13350 -3721 -12956 4021 1270 -17738 -7795 23441 21080 14211 9770
14096 9770 14000 30108 31421 26970 12971 -13500 -28317 -35535 -11921 -3286 5898 -18949 -30750
14083 -30750 -18757 -7807 -4496 1863 3957 -4091 -450 -5751 7573 15460 15189 12461 -238 -6521
14069 -6521 6124 5598 -12721 -28146 -19762 4840 -15306 -22693 -7924 6210 2963 5438 774
14056 774 3960 22328 10107 -4051 -7977 5469 15320 11984 3991 14483 38722 43578 19255
14043 19255 13983 -6316 -27520 -17718 -10906 -15549 -6753 16288 1682 -28215 -29483 -17085 -15882
14030 -15882 -17148 -2556 15085 19485 6249 9469 456 -7928 -2192 -185 -1090 -6186 17327 26236
14016 26236 3136 9202 33969 39778 12473 -11640 -15929 -4594 -15074 -16739 -1398 -6768 -10752
14003 -10752 -2845 -6438 11324 19445 25890 26218 32864 25308 11582 7767 -4669 -1911 14551 12580
13989 12580 2426 4269 -20653 -19257 10349 6555 -7005 -23974 -22420 -13349 5500 24051 25042
13976 25042 4860 -9291 -11816 -9335 0 5614 -5019 -1106 -4229 -9783 -4670 7436 -9373
13963 -9373 -6249 6727 9698 2371 13971 6050 -8775 -1983 911 1459 377 -12910 -24910 -31267
13949 -31267 -19040 -11612 -13040 -22525 -34231 -40141 -32472 -19067 -9615 -10544 -10105 -11284 -3133 -10332
13935 -10332 -12482 2172 13751 27033 42223 40657 42852 23607 24747 23728 17084 6791 7284
13922 7284 20847 32133 17010 11804 11660 1794 14523 15603 23822 7299 -12537 -14697 -29005
13909 -29005 -23460 -10956 -14526 -25111 -25312 -13594 -334 8702 -3338 -27891 -25106 -18831 8454
13896 8454 -7797 -19239 -7096 148 -9933 -20343 -8055 -4025 -4188 -1457 7112 4642 19759
13883 19759 26712 39485 41969 22394 -6830 -8613 12631 25321 3469 -965 -23622 -31329 -3061
13870 -3061 13134 16739 7395 9215 10588 13844 20480 3497 -9237 -13412 8798 2754 -7947
13857 -7947 -3070 -401 -2909 11738 15580 -14345 -12145 58 -2568 2101 27094 11960 -588
13844 -588 3808 14841 30722 19763 -1440 -2248 -3720 -11362 -14683 -18974 -11195 -1136 -11112 -11060
13830 -11060 -11070 -24385 -25986 -22606 -24148 -10904 -5460 -11919 -12068 -35842 -29735 -6330 -3791 -26812
13816 -26812 -28381 -31761 -33749 -9225 -2257 -7096 -21382 -38157 -22599 -9832 10348 16256 -2402
13803 -2402 -990 6275 9421 7530 83 -16993 -22537 -29494 -32372 -15854 275 5036 -4004 -11965
13789 -11965 1354 -9255 -4689 -21082 -22093 -25259 -14633 -25989 -27063 -14787 -7062 -3901 15108
13776 15108 37984 36563 26639 27802 30232 31435 31559 31301 20270 -7478 -16984 -21084 -31347 -18259
13762 -18259 4156 7869 -1421 -9310 -4402 -5313 -14251 -8155 -8291 -5629 4493 13804 7275 -9939
13748 -9939 -14317 -10678 -22614 -26129 -14237 -11716 -29009 -45547 -41357 -19415 -6892 -19263 -28364
13735 -28364 -26609 -29671 -26563 -789 12738 2905 -8524 -30814 -42034 -36579 -31792 -29670 -19832
13722 -19832 4341 8187 -17498 -19980 -3051 -3662 -19212 -20630 -20024 -14663 -11422 -25449 -37663
13709 -37663 -43807 -25245 -8488 7611 8316 285 -11694 -29640 -15420 366 -8665 11046 4487
13696 4487 -22605 -28777 -15028 -9085 411 11138 7188 21318 15471 6752 875 -13701 -21336
13683 -21336 -24462 -17663 -4703 8766 13763 7340 -9925 -9126 -21519 -21168 -9142 8646 4157
13670 4157 24023 20727 8532 -6509 -12018 -18217 2646 15006 3708 5113 27300 24518 9514
13657 9514 -9335 5342 27168 33639 25342 20351 11917 2938 -11665 -9623 7515 10747 9434
13644 9434 16176 -10355 -3224 -7219 -7847 27810 47094 47485 29156 25402 25934 16540 12242 19157
13630 19157 35043 40631 49251 51223 54511 60340 45145 13307 4266 7273 6844 3426 13158 11238
13616 11238 -2792 18395 9313 1946 3811 -202 -14388 -5066 -44 3223 -14297 -13885 -2774
13603 -2774 -1988 14293 20273 17280 12548 14603 3738 493 14792 29988 33765 20906 25514 17169
13589 17169 11657 7546 23441 38206 19620 14817 25378 27641 25398 22826 21177 30502 21965
13576 21965 9800 7101 -9748 -15213 -29594 -28799 -5734 -5722 -8928 -3717 11471 20413 36419 31835
13562 31835 11976 540 -4262 18508 21117 16780 21417 18952 20063 29453 29963 31637 40280 29808
13548 29808 18585 17377 -3629 4979 -2837 -19791 -23653 -11673 10547 9076 5917 9934 6105
13535 6105 14305 11867 3243 11457 31629 56403 84403 118740 135378 147323 188735 229689 238775
13522 238775 227422 216217 203727 193402 168171 173426 142509 114192 94521 73174 65691 64550
13510 64550 56243 41081 7878 -4980 -5935 -4181 11026 31543 34921 30115 16472 -4893 -11669
13497 -11669 -5470 -11689 -24564 -19756 -1734 15261 19329 21372 16239 22058 40429 61986 75676
13484 75676 58937 38647 43079 48337 54965 75673 92671 99404 131212 159814 218289 284443
13472 284443 356284 492673 660762 825419 962137 1049431 1051831 978116 852024 694437
13462 694437 550604 441586 344063 275254 226367 172560 136944 123667 106153 102532 98225
13451 98225 96147 88298 73603 63457 59394 38889 31778 21227 29229 40511 48469 33617 30745
13438 30745 32919 4210 11013 26276 41849 33832 21867 23280 14728 11554 4231 1302 22819
13425 22819 52473 35778 32944 6532 1956 14861 31135 21292 7766 24758 42072 47780
13413 47780 56752 45824 49590 42555 30512 6638 813 15748 21119 23518 25035 38986 36795
13400 36795 18531 13044 23849 26863 12399 15944 31489 25811 27531 14376 20634 44843 48084
13387 48084 47881 41474 40610 36450 47285 40960 44211 30287 36343 30996 19057 -6349 -11218 2196
13373 2196 25876 27636 22243 23573 14360 22783 30394 33105 49985 49415 48932 61932 55316 48706
13359 48706 75171 83043 75168 70943 58273 58753 52296 48919 60358 59794 14641 -31870 -73763
13346 -73763 -113887 -150050 -146829 -124472 -114975 -105373 -96118 -102940 -74083 -53547 -36000 -37024 -34810
13333 -34810 -41899 -46679 -45586 -47552 -45617 -32982 -32383 -36446 -34562 -26917 -40175 -38148 -28507 -14550
13319 -14550 -4433 -20934 -13045 7217 13543 -3064 2070 23902 52447 52029 41367 22627 24983
13306 24983 49189 54626 60375 66510 52417 34314 42010 69506 72232 71224 80232 93627 116207
13293 116207 135115 137630 148323 136716 106108 77545 66321 43697 23773 7792 6373 15547
13281 15547 12254 6154 9479 2702 -2000 -11314 -23428 -15084 -6441 5025 6068 1669 -9318 -14932
13267 -14932 -13283 -11948 -9870 -8031 -5925 -15691 -9525 -4366 -3749 7992 9628 -6099 -12723 -2288
13253 -2288 1981 -11126 -17851 -800 -498 -6126 -10199 -380 16157 22832 22848 28984 28464 27104 21439
13238 21439 21149 43393 43916 29879 23981 30011 32168 18461 14474 22453 45611 52919 62431 67241
13224 67241 52602 50280 45820 32136 8088 3968 25314 34049 36233 44101 59652 59409 50423
13211 50423 54117 66651 108794 124711 113108 87022 60221 50572 60842 58919 55534 60976 77028
13198 77028 69498 94213 115541 111361 98761 97709 119401 141359 139163 116808 86986 104092
13186 104092 113298 122072 134025 132036 129164 130180 153068 137869 122549 133470 132937 129630 120534
13173 120534 136719 156664 190617 230185 266430 297407 311265 347773 357401 351271 330506 297841
13161 297841 263639 231779 207736 188176 179663 166277 168131 186404 199258 190394 162969 147853
13149 147853 156508 172460 168787 179599 179706 149937 163564 184140 189879 185541 189158 183435 181076
13136 181076 173202 164106 174795 199464 213730 221050 223470 224244 235365 254406 255335 254585 259164 251967
13122 251967 269811 265547 263575 274315 275611 295173 313443 320354 331635 367699 384956 387335
13110 387335 413238 429924 455129 472461 477333 493275 523095 533555 536756 565378 589783 605454
13098 605454 627476 651220 687611 715718 730694 772896 801279 836153 867458 893841 926219
13087 926219 939275 963465 1000208 1037091 1066593 1085498 1115090 1166254 1240842 1319199 1406133
13076 1406133 1499875 1597459 1721097 1827733 1928635 2058228 2210771 2378985 2573382 2814634
13066 2814634 3067983 3344284 3700671 4100494 4592964 5181760 5894622 6756870 7791454
13057 7791454 8969988 10341383 11884602 13511810 15192769 16972470 18979692 21476174
13049 21476174 24923626 29922402 37338485 48428272 65001114 89126908 121549713
13042 121549713 158911658 192776208 213418056 215350700 199505523 171687194 139079307
13035 139079307 107680602 81265753 61188480 46859596 36922688 30075805 25336339
13028 25336339 22013384 19588344 17648819 15893119 14210533 12625618 11140696 9776818
13020 9776818 8575274 7538141 6626682 5878852 5276680 4747180 4299756 3938525 3639320
13011 3639320 3382067 3142983 2905611 2697675 2508572 2334896 2198067 2091625 1991955 1886187
13001 1886187 1784507 1685689 1607561 1538171 1482005 1410819 1341789 1296398 1263595 1198522 1137546
12990 1137546 1105339 1077863 1023695 985477 955886 917192 893115 850592 824720 795708 766017
12979 766017 765509 732921 688530 651639 611127 580171 573033 563447 552523 550873 554293 542807 536753
12966 536753 532847 513738 509234 474510 440532 443720 457698 465846 459947 439843 425599 406545
12954 406545 406212 418638 409018 405053 406188 399469 386002 373942 359886 325785 298423 296760 293580
12941 293580 283377 263218 254702 241891 231670 247824 274461 278989 259616 265780 275819 271099
12929 271099 262817 245001 228086 228192 233418 236140 227918 218937 202302 181756 177235 183867 170274
12916 170274 185404 228749 253158 271777 286137 289534 309604 334779 365371 393909 401026 381605
12904 381605 328273 263753 226463 201879 179017 158128 150170 142434 120901 105802 88383 71948
12892 71948 90237 107151 111331 115412 110194 104837 95732 96483 118552 128042 121257 129923 123056 113741
12878 113741 89169 62824 86557 105154 105720 97076 95932 103660 109401 85655 64305 87230 94920
12865 94920 97952 89094 93643 97105 106886 111064 85835 60909 68218 73401 73788 74470 75935 72262
12851 72262 64300 74942 84738 90005 85792 87899 103422 108488 95597 96739 94942 103652 110675 105677
12837 105677 104126 102736 99729 103734 99929 96426 104602 102770 114042 110587 100666 104337 86160 72355
12823 72355 85320 85547 99703 107762 95125 75515 68350 76798 87125 82580 72243 82893 87072
12810 87072 71507 54436 36868 50040 69077 58539 69280 71134 68838 79401 81464 73993
12798 73993 78903 83610 80755 80274 64397 64410 62377 57105 60529 86883 116544 123554 118635 111107
12784 111107 104990 99524 116829 149206 226540 310268 386291 430427 441161 397124 319026 263562
12772 263562 222784 189427 156413 125624 118150 103723 99290 92920 103021 105480 101981 75114
12760 75114 89079 107501 106485 89090 91898 95611 96241 82668 79758 101846 106940 90858 92918
12747 92918 100019 109119 91414 84853 86145 99781 106970 117746 134543 135215 153386 187721 189658
12734 189658 180972 176222 150631 119544 75286 29285 4145 22980 30256 2954 -23871 -23462
12722 -23462 -25905 -22284 -6763 3597 3864 -4919 7012 15734 28030 41059 53000 84207 149135
12709 149135 230118 293983 275449 221887 170548 151099 147004 136069 111704 99215 86250 70894
12697 70894 67371 63003 58876 74626 99916 111853 121804 131168 134503 125031 92762 68663 62452
12684 62452 43654 43212 43805 32507 37717 18142 9111 2063 -10868 9102 23162 12200 22265
12671 22265 20457 21433 22560 19550 14060 3988 5094 7071 27307 37555 49258 72313 81548
12658 81548 67468 72059 76869 103394 124374 144960 155755 180830 219390 258012 328760 423165
12646 423165 558226 728868 967653 1240666 1532995 1815519 2047928 2196209 2208910 2110831
12636 2110831 1886920 1583726 1270773 985998 748097 555917 443355 354196 284453 261161
12626 261161 263150 240409 226819 225493 211526 182470 172212 174394 185003 204517 222952 237302
12614 237302 259214 319689 389626 472789 591564 764457 935619 1055384 1097363 1075311 971905
12603 971905 824175 674085 534630 421809 338267 266921 202707 163065 154960 158580 132889
12592 132889 120876 131935 119468 103458 104442 105133 85477 84447 96384 100656 72316 49291 40406
12579 40406 38692 37893 39646 36050 24897 15450 -958 -3419 4127 14963 -911 -2886 -1646 -4552
12565 -4552 -26918 -1659 18684 57009 78012 48676 33453 32543 33003 43967 37136 13280 25936
12552 25936 46058 33750 33017 43095 64386 96990 136145 149927 149319 111737 83440 67979
12540 67979 58375 37796 23265 -2993 -9769 3775 -4233 -8022 -7163 7436 2751 7058 18443
12527 18443 20604 -1509 7456 30918 49110 49763 33240 15658 10418 11533 2582 -6980 5944
12514 5944 15646 29192 32263 21795 12520 8636 533 -16107 -3934 -1220 -1911 9811 -7461
12501 -7461 -24345 -23923 -25833 -9376 -6326 -10020 -14168 6018 17993 6674 4086 4677 5093 7792
12487 7792 20709 25751 34329 42010 34973 2985 -20452 -30587 -14752 -674 12548 16558 3711
12474 3711 10174 6206 4125 6362 4911 2877 12364 16363 -7869 -16458 -16341 -12223 -3823 11070
12460 11070 27885 27246 25341 29597 22815 15991 16099 8330 4065 12562 21152 6956 10557 13062
12446 13062 19312 20033 14459 -2053 1219 -5487 -13993 -11050 -38336 -37889 -13734 7238 14487 7992
12432 7992 20740 29349 16632 24278 12819 2413 7472 7465 27699 38003 29969 28672 10098 12532
12418 12532 27344 34697 32898 5667 1132 -3694 1811 19968 27957 22555 9092 3648 -3069
12405 -3069 -19923 -19469 -9243 -11703 -2264 -5123 673 7278 20311 17554 23630 34818 33616 37920
12391 37920 27843 27613 20217 22734 25677 25111 35030 44830 42986 26660 14809 -225 -14688 -12747
12377 -12747 13969 22733 22595 19233 17833 5217 -24927 -7621 3773 7244 11317 4643 -9260
12364 -9260 -14197 -9088 -3860 -19479 -17845 -21756 -37607 -10417 5888 -10898 -5859 -14850 -19431
12351 -19431 -6068 -20720 -21394 -13659 -21630 -16304 -9714 -21360 -26517 -44977 -46479 -33568 -34350 -33645
12337 -33645 -25829 -7054 6294 -14993 -20603 8332 16841 11588 13726 2255 -5756 -3931 2963
12324 2963 29551 27546 18771 15349 3448 406 -12552 -11785 2751 -4150 2125 7375 27987 35742
12310 35742 18360 8550 -9033 -9493 4812 3438 -9220 -7943 -8700 -4085 -1657 -14030 -12810 1122
12296 1122 12855 25768 38212 25762 24418 37336 24546 14072 11623 9105 14283 36280 52914
12283 52914 62329 75764 79668 74193 47318 20153 12139 4448 16052 15782 21698 18706 10542 -3485
12269 -3485 -3187 2113 4258 10250 817 12069 28849 6173 12941 21147 13331 17231 9296 24563
12255 24563 21562 19434 24525 7933 -4412 -12801 -7012 5491 10573 7510 9161 17139 20349 13833
12241 13833 14706 21791 36864 18231 12771 5869 -722 -1424 -14921 676 10006 22424 21001 12362
12227 12362 -193 -3602 9731 309 -7260 5466 11609 -205 -783 1650 18713 2112 -9121
12214 -9121 -1346 6049 19086 14306 7468 -1670 19144 14703 -10238 -7248 -11226 -12558 -7617 -1234
12200 -1234 21734 19626 28685 18224 8280 6155 27266 47987 49406 30124 24315 21109 10243
12187 10243 -925 6737 736 19721 42220 53957 45071 37426 23350 6528 -1453 11629 10675
12174 10675 467 11738 22037 25797 37326 39068 48937 24337 20894 20567 14396 22442 19702
12161 19702 8185 6109 7458 16337 37403 29184 18765 20176 12375 -502 -4187 2706 14899
12148 14899 26176 40951 47272 49783 48597 45616 39387 42342 40640 44997 29180 23431 32929 45191
12134 45191 50158 41532 25221 25645 19160 13019 14638 16563 13375 21349 12884 -12901 -15775 -1798
12120 -1798 -6473 -13572 -13180 -8367 -7654 -17662 -21765 -6116 -13830 -24434 -29016 -36921 -42216 -40586
12106 -40586 -20709 -6101 10679 18320 37617 44995 47976 47932 35149 19332 14158 13619 32743
12093 32743 20961 10130 9364 11082 12800 6254 4250 -967 -1345 2438 2550 14767 43025 42729
12079 42729 11912 -5838 11776 25063 36839 25822 -2941 3506 23842 27733 26390 16223
12067 16223 10883 16754 3580 -11404 11931 23625 18512 3855 21704 46787 58668 87245
12055 87245 98747 95030 89594 65309 42049 17747 11911 -5676 -15077 -11947 -7839 -398 -1331
12042 -1331 9734 7031 9972 15488 9077 4878 18310 29023 18170 14754 12953 16456 34107
12029 34107 24245 16867 31162 34727 16477 14169 10231 10901 4923 -1742 -11954 -21779 -14168 4320
12015 4320 4624 -5965 -34875 -57815 -50409 -29284 -18456 -1865 -13716 -12969 -11831 -11429 -12614 -1915
12001 -1915 -9085 -9146 -3095 -8999 -14580 -10444 -17810 -38407 -41167 -38460 -29257 -32883 -28183 -2166 6573
11986 6573 10335 21715 4151 334 465 -3236 5919 9663 -867 7728 8139 2649 -3256 -7281
11972 -7281 9080 3729 5968 7130 4926 3827 15164 23642 30254 27662 22833 14540 10165 1407
11958 1407 -12524 -5884 -311 -3793 -25757 -52740 -47333 -29988 -13702 -12652 -32304 -33180 -11438
11945 -11438 365 5355 -15284 -31449 -30505 -3839 17243 10812 19702 20182 13266 15083 -1919
11932 -1919 363 13054 4382 -21159 -33888 -37868 -25569 -22620 -17172 -8799 -15890 -12088 7929
11919 7929 20293 12935 -11490 -17711 -24744 -24558 -1604 -7317 -16375 -20520 -24464 -10951 4876 18036
11905 18036 7867 -5942 -22567 -30371 -16924 3169 -6020 -13617 -6759 4758 -7093 -22771
11893 -22771 -21845 -11258 17670 18167 30771 43577 49618 53774 55314 51754 66896 42173 10098
11880 10098 20815 36189 21877 -676 -3704 -56 -11274 -5686 -5709 -8374 -11821 -3849 -19505
11867 -19505 -30390 -35182 -17194 -4330 8621 22404 35071 43702 34535 27489 29146 37433 31920
11854 31920 13691 8056 -1184 1686 16628 13497 25186 32123 40871 57341 46660 67023 85937
11841 85937 102003 105895 113048 127871 160098 166264 168258 157522 158373 178779 218104 282336 349046
11828 349046 444505 614883 885188 1265784 1675565 1936510 2067667 2277156 2838809 3782667
11818 3782667 4588909 4605363 4014220 3597566 3745793 4378308 4814104 4407458 3483582 2712376
11808 2712376 2322540 2166307 1966846 1611757 1202709 873148 625132 454018 366146 309722
11798 309722 265384 234267 197705 164707 152934 141500 132874 113279 117050 121732 120004 116279
11786 116279 105438 104842 89538 79395 63580 53998 52919 50055 46527 39537 18782 605 -169
11773 -169 8756 30833 34341 27111 13235 12572 21586 26944 27502 5650 -14593 -17364 -10214 -2284
11759 -2284 -2221 15542 33894 44315 35221 34346 27463 -3543 7099 7654 -6603 -8776 -10812 3359
11745 3359 1686 -14061 -19184 -16720 7533 28080 22771 6608 -847 -7545 -10628 -30821 -11624
11732 -11624 -7 3790 4497 -7248 -1280 -1307 7758 -61 -4154 -11779 -32778 -22450 -4815 15368
11718 15368 30479 40958 38392 33044 32088 21830 10174 -7819 -25372 -7427 15935 20933 28989
11705 28989 52849 65114 46310 29256 7659 8017 35010 66292 128560 217209 279386 301563
11693 301563 261918 207697 189546 180198 173963 171254 166630 148796 135738 113656 99002 74320
11681 74320 79078 85049 75500 77209 73467 83172 116789 173426 253722 358312 450202 516238 555494
11668 555494 526805 455204 346742 249315 177849 123247 82216 53287 39095 28023 27862 26339
11656 26339 26435 11880 9696 -24063 -13825 10516 14640 12429 9062 7793 1249 6777 12553 -615
11642 -615 -17697 -24441 -9018 29365 96997 194481 240423 201456 113364 77824 69944 28902
11630 28902 16062 27799 33360 20844 -2961 -100 13123 6097 2525 15743 13065 12310 -10613
11617 -10613 1990 1657 14941 29550 34811 46857 56035 33029 13314 11262 580 6866 12828
11604 12828 22444 43919 67771 84668 109645 188884 253288 256962 192210 147809 110208 72115
11592 72115 44974 36024 32781 25447 19230 37559 31888 34649 43171 52041 29565 28277 40735
11579 40735 35061 37141 35958 22650 17238 15735 28969 19932 -6289 3735 21079 29363 19778
11566 19778 17123 24520 22579 32577 33334 17290 9990 -5580 -3860 -5233 18932 33683 34411 28406
11552 28406 40888 48957 32146 16920 3024 7970 27347 47278 51002 53762 51607 41734 36215
11539 36215 13288 2308 -7186 -8490 17175 23017 29916 38165 16346 -235 19960 18515 14715
11526 14715 16618 -16723 -25186 -18493 -11093 -629 5639 7637 -27068 -30862 -14840 3386 -13315
11513 -13315 -9351 6763 5188 13218 -2797 -5944 8176 2381 -11610 -20092 -25915 -24947 -21762 -20679
11499 -20679 -21883 -20391 -6834 22828 18494 8646 17633 15889 -20799 -30183 -33765 -22961 -8717
11486 -8717 18772 29600 14125 7557 13671 34740 30034 852 5457 38469 64384 70811 37205
11473 37205 15779 18639 28932 34684 24381 30094 21559 23962 21935 5931 -4865 -17426 -8725
11460 -8725 124 -3495 -9568 -13169 -3355 -1103 4011 13429 15221 19464 17648 -717 -21613 -25391
11446 -25391 -25210 -39333 -42313 -16646 2201 9090 1124 -13247 -16982 -12962 -10691 -17830 -17640 -11288
11432 -11288 -1588 833 -5738 1038 -8044 -19957 -32783 -24628 -24783 -20235 -21461 -35040 -29449 -29105
11418 -29105 -26783 -3861 3177 5559 346 1296 -1378 -24574 -20641 -6431 -12328 -4368 15066 6974
11404 6974 8423 31396 38499 41967 43992 54088 43803 35509 39818 37343 45248 44339 46523 52222
11390 52222 34538 20847 27936 20994 25656 9682 6779 18504 15299 28272 47117 36801 31217
11377 31217 38239 40462 39217 31213 8783 3896 11928 26956 37914 35737 27633 23354 -92
11364 -92 -5552 -1511 -9623 -16898 -13010 -15614 -13213 -4470 -7006 -17825 -20278 -6342 4441 19030
11350 19030 4018 8607 20774 6011 -10132 850 11831 6573 -6542 5296 6358 20296
11338 20296 31030 36185 46188 47373 31908 12703 22844 18417 3830 9870 16436 5972 -11894
11325 -11894 -18809 -7359 13853 19891 -4925 -22595 -19028 -12495 -10308 -13028 1222 15528 12879
11312 12879 7825 21973 19550 19253 17579 14411 12171 11339 23355 16770 19801 15730 15113 5856 -4028
11297 -4028 13496 16172 20053 36101 31247 32072 47048 54895 50504 40335 37025 46762 35591 14208
11283 14208 6407 15684 3800 1801 26234 33671 46524 40725 24993 25035 21133 21097 23476 40235
11269 40235 35327 28929 23739 16536 26360 21970 38963 49816 47691 53832 58754 41913 23133
11256 23133 15067 27969 31095 33994 42345 54303 53373 28360 27969 34297 33463 33614 38234 31865 20822
11241 20822 13591 24013 37530 35607 44913 32935 34792 28603 30098 44133 40903 29686 35433
11228 35433 42329 25903 18564 10071 18634 32439 40986 48035 48093 40394 23226 8593 -656 -10333
11214 -10333 -37 18251 37358 46422 66555 100001 114156 113254 104160 74518 65312 72523 90853
11201 90853 118290 164357 212430 242251 219315 171989 115001 96662 86654 82571 98394 111411
11189 111411 115094 137688 129220 120869 100000 89145 78095 68476 51170 34059 29856 18496
11177 18496 33112 49603 49575 37396 53760 87934 87205 68213 49565 52643 34786 42127 46899
11164 46899 72580 98960 103849 81397 79792 99982 132343 140672 137321 165628 187853 206774
11152 206774 230858 296234 417631 575506 827997 1164192 1425796 1484216 1358882 1240816
11142 1240816 1246641 1416392 1799409 2541651 3596492 4314533 4067219 3179402 2434956 2073640
11132 2073640 2027734 2340558 2999780 3918077 4450262 3981297 2943162 2098890 1600747
11123 1600747 1377598 1341164 1440325 1578585 1591655 1369268 1018702 735158 536290 408761
11113 408761 322193 263598 225684 200909 181594 166832 136620 100937 96375 105416 96342 117420
11101 117420 102099 84564 75125 50196 47883 46636 29965 29138 44685 55491 35861 18408
11089 18408 46514 58712 60348 64174 60724 50854 46233 46778 45998 44428 57353 62781 61908 48648
11075 48648 43134 55664 75909 77377 89584 127674 127160 146083 156682 161741 137193 106482 104326
11062 104326 63809 37033 28056 34450 39103 38022 43926 57091 51439 38034 46699 39985 35328
11049 35328 41328 41931 37792 33070 33947 29548 11269 18168 30777 17996 11381 27778 48442 34111
11035 34111 11737 12376 16859 25234 33327 47054 57956 55221 52196 61299 59269 50038 58318 84234
11021 84234 107214 91745 74492 61372 46106 37702 46900 63782 81128 105945 133435 183455
11009 183455 249740 288239 268551 205393 141238 105442 72994 28406 10847 31721 61578
10998 61578 71570 82431 58547 16585 -46921 -96511 -114975 -105162 -80882 -66689 -52995 -31167
10986 -31167 -19771 -8016 -1527 15546 34728 27839 10466 31747 43819 26707 5489 21262
10974 21262 30726 24256 42465 37322 27329 46509 42966 26294 20184 25962 15184 3628 23034
10961 23034 53291 46862 44393 64019 83979 98743 122038 143747 159809 208202 268813 363236
10949 363236 546400 836005 1343700 2162595 2969414 3011025 2263875 1467462 969663 677648
10939 677648 497317 366314 281488 238922 220357 193612 149575 142060 131700 101990 98560
10928 98560 98961 86660 71784 54212 46530 60634 74036 77837 95055 92097 73809 50316 48887
10915 48887 32338 34578 41630 57653 83509 95480 89272 69348 48603 26320 12143 -27963
10903 -27963 -27393 -23531 -17456 610 9586 13092 2046 -6369 -7361 17355 44297 53913 59055 76351
10889 76351 80412 104096 134371 157125 161674 152424 155169 166536 184398 214466 214309 190746 164660
10876 164660 162343 191515 208190 236533 298462 384572 485777 661525 903550 1271257 1720076
10865 1720076 2113555 2224109 1966265 1536443 1150910 865192 654968 519175 427324 367770
10855 367770 334261 315989 312847 295923 281193 253948 210425 172782 167789 186837 165260 102072
10843 102072 -53481 -217399 -270184 -260715 -232310 -197920 -160433 -134246 -107186 -80337 -47351
10832 -47351 -20996 -31870 -38841 -36571 -26978 -18672 -4095 -7311 -31076 -30188 -25867 -16085 4686
10819 4686 41494 63136 57283 52737 52428 33649 34563 39072 50231 50386 25751 12427 12598 4162
10805 4162 19305 37015 52189 41707 39938 39697 38573 68992 96993 108864 113818 119413 137503
10792 137503 166542 205935 258159 350220 418076 394602 308138 223719 155501 100716 81801
10781 81801 80017 74496 67904 50558 32060 29384 56292 76771 72569 49156 43322 47072 56522
10768 56522 69131 52797 47799 55759 80593 97877 87727 84540 98002 109628 97449 81585
10756 81585 59544 10667 -56155 -117835 -178273 -195310 -186451 -170039 -173251 -171550 -154110 -139047
10744 -139047 -106359 -63475 -36956 -40689 -63462 -65478 -43554 -30885 -43704 -67250 -49539 -21081
10732 -21081 -19067 -20702 1646 24670 21687 20735 33852 81430 103098 114701 121679 129481 134679
10719 134679 105811 70722 34071 25707 17717 30670 62147 95613 118180 112626 131764 163079
10707 163079 202208 207831 208906 227924 264061 285436 335452 434633 546647 637567 712222 739195
10695 739195 656568 512984 410982 375977 329960 276381 227804 188284 158344 147160 149889
10684 149889 141868 144219 152115 178051 184051 186518 167928 132978 101879 115530 114303 127703 154582
10671 154582 187941 208222 217706 221457 229895 265462 327345 464749 637882 702117 666511 569602
10659 569602 464247 351022 283098 245290 213651 229442 237417 247635 229812 225188 224445 221590
10647 221590 209268 187738 179077 195529 205003 193611 194652 215065 243203 247319 263164 273902
10635 273902 283416 303944 321669 326842 301412 275262 215090 203087 261655 332088 373556 375691
10623 375691 354579 368428 426019 509321 638471 879316 1280425 1791421 1962863 1657681
10613 1657681 1200440 907391 749388 647843 582249 562384 584726 588224 619818 646085 684916
10602 684916 711168 727217 743311 746001 723748 700349 694262 702310 762376 851333 916320 948871
10590 948871 956072 960487 968849 990882 1011257 1048315 1092883 1137377 1180580 1227068 1255280 1273883
10578 1273883 1306464 1326731 1385172 1553197 1812336 2042527 2194530 2322494 2438689 2525584
10568 2525584 2564376 2619592 2722989 2845915 3063080 3398845 3852067 4419779 5197131 6301451
10558 6301451 7283581 7436630 7079184 6971435 7257113 7733981 8393253 9263654 10419778
10549 10419778 11941969 13849385 16309412 19617797 24077464 29869835 37740034 49054388
10541 49054388 66034184 94195755 145602589 241091370 397566367 551965945 559968536
10534 559968536 420808320 266911284 170553875 115767825 82090331 60347912 46243319
10527 46243319 36784301 29961185 24676671 20564082 17447930 15040705 13101338 11483913
10519 11483913 10151363 9123728 8395745 7928412 7663095 7649789 8001487 8513031 8352752
10510 8352752 7285519 6072744 5272144 4776458 4400392 4114319 3863783 3655594 3466070
10501 3466070 3332330 3265523 3238725 3240663 3283218 3321749 3324251 3299310 3287099 3282638 3295349 3350188
10489 3350188 3420107 3483401 3551528 3709969 3917698 4175414 4575472 5150473 6071305 7705830
10479 7705830 10615253 14538757 16646114 15179286 12394069 11057310 11681977 14252435
10471 14252435 17790659 19005090 16805281 13865109 12361211 12183783 12773150 13666584
10463 13666584 14508501 15218922 16086278 17424682 19403466 22155456 25862248 30697469
10455 30697469 37097597 45816478 58111479 75980732 102896933 144434704 207256658
10448 207256658 291963872 376961875 416196404 382981476 302707018 220283987 157664246
10441 157664246 114821740 85945361 66203548 52413983 42486328 35133840 29575420
10434 29575420 25299117 21961704 19371874 17391428 15886918 14678638 13536618 12298850
10426 12298850 11055116 9900681 8905993 8064779 7346300 6696580 6148963 5718972 5374015
10417 5374015 5064412 4755560 4445619 4144122 3865641 3649585 3527928 3456141 3342776 3203703
10407 3203703 3077566 2935419 2795078 2626894 2469927 2317103 2167946 2043750 1965249 1909405
10397 1909405 1851939 1782737 1743508 1691115 1623686 1567315 1515033 1472272 1432604 1419606 1404119
10386 1404119 1340940 1284808 1226054 1166876 1104337 1026779 969403 963299 987451 997406 1026914 1030381
10374 1030381 1018196 1000756 995719 966317 933157 910903 864527 844893 844490 856238 859609 878729
10362 878729 879595 861920 840542 842750 859633 866193 842411 808560 797151 756127 696455 640557
10350 640557 610679 603218 580168 573117 593596 606098 629721 631610 612472 596440 589082 584090
10338 584090 583036 583152 587077 565922 568614 569709 558510 551234 544300 542528 532806 543073 553861
10325 553861 567236 571917 592099 619978 663863 696804 688540 658056 635481 654167 680527 678176
10313 678176 689012 727018 801273 940505 1157118 1460402 1792213 1963027 1888031 1726335
10303 1726335 1594641 1638532 1915993 2507287 3469188 4460187 4673531 3988663 3099973 2512175
10293 2512175 2264672 2359091 2831731 3688828 4518070 4531925 3712041 2757715 2110748 1753361
10283 1753361 1633520 1671080 1801097 1875054 1742273 1443829 1129205 900479 750524 655316
10273 655316 583028 521864 495035 476067 455414 461211 448202 413161 389726 369532 345720 349231
10261 349231 327942 292660 294441 304110 311215 317538 348451 367989 387754 382782 357907 359243 365052
10248 365052 383080 390727 392552 399631 389629 374542 366858 357611 350088 356710 365255 400872 435792
10235 435792 449591 456634 483943 532783 569978 600783 555558 429208 284304 214978 193831
10224 193831 188234 183783 163224 162324 175301 171386 163406 165748 167478 180200 181061 174795 174138 174123 175171
10209 175171 185762 185667 183033 193464 204914 203632 193728 202279 218496 231635 220538 222782 223331
10196 223331 241791 245172 238516 227300 209145 204970 187678 172171 185911 196334 204812 209540
10184 209540 224375 223400 211231 198111 201455 201612 208230 193673 192286 210450 209980 200667 185338
10171 185338 160824 153975 172328 172186 192223 215870 224608 220346 212669 207294 212806 238074 240067
10158 240067 234039 256678 274420 286572 298488 290914 291950 301713 301831 311303 314302 370936 407764
10145 407764 419597 443133 478452 528090 567484 564010 514693 445161 393400 400597 415824 428209
10133 428209 452478 492382 557954 648926 760302 920575 1135809 1464699 1974964 2817157
10123 2817157 4227698 6388858 8887435 10823424 11582761 10942078 9057296 6703870
10115 6703870 4692528 3307944 2434687 1855606 1433810 1164738 963027 788229 687960
10106 687960 621769 568886 517664 506750 480367 442002 409616 397132 378955 349937 316135
10095 316135 301951 282455 262452 244832 234732 229449 225341 225372 219497 220530 205672 212259 228805
10082 228805 252835 274975 289012 300343 315475 284015 207347 141647 131285 131270 109184 85981
10070 85981 113193 135036 141473 156755 167968 173418 189290 205211 190731 176732 159527 133376
10058 133376 128920 165746 173913 178834 178994 173772 171382 141390 144760 147219 140794 151474 150240 148820
10044 148820 156867 157849 172763 173895 174065 205924 203676 207266 232130 246621 246022 254512 279278 309734
10030 309734 359749 425757 501421 612269 792537 1033549 1364279 1776419 2103817 2141928
10020 2141928 1912234 1565336 1230665 966943 765733 617761 529583 460746 429715 417987
10010 417987 395421 373274 357470 349826 363531 365777 386200 442221 478621 510895 588998 735732
9998 735732 976375 1297416 1720750 2090546 2250199 2359231 2749611 3614980 4730473 5185251
9988 5185251 4624434 3875124 3701925 4228920 4987666 4985028 4065339 3065667 2509231 2312297
9978 2312297 2178121 1933924 1534597 1138839 853901 665387 554167 482007 439593 400186
9968 400186 350168 307446 298669 279602 265302 238247 230053 251855 270686 277616 298377 322165
9956 322165 332970 317997 290679 256994 227835 209120 183381 178403 172711 175746 181166 160523
9944 160523 156111 165452 179860 174207 177994 165600 179665 199683 197838 199514 177434 151291 144270
9931 144270 155702 151663 142992 140347 142255 150832 157498 152972 156629 154637 148464 115197 93345 103669
9917 103669 118639 133439 134337 101935 82436 99333 118993 139505 159410 160233 155011 165458 151470
9904 151470 130868 126712 125252 116829 103779 120626 145570 158203 164550 184584 197989 197840 198882
9891 198882 189420 180866 189470 173414 142599 144485 158353 159109 172085 199186 212450 209921 196089
9878 196089 193171 189755 180290 194634 192440 178844 165215 149651 149924 171632 168767 162396 165938
9865 165938 181447 192513 199621 195599 180783 187059 200730 214916 223756 214735 215086 211587 202681
9852 202681 214098 218862 213400 186679 188000 202180 208937 208691 212543 216117 228218 228269 221097 225024
9838 225024 244184 271643 289811 292822 296301 287194 282480 259427 235313 226722 214000 212299 223600
9825 223600 218014 206095 220083 222248 222717 212552 212613 220787 219492 239476 246217 254132 260660 263607
9811 263607 262698 257836 255372 261235 265636 258491 255072 253803 257715 265880 287208 308257 315688 293717
9797 293717 287846 302451 305762 312666 319898 311468 305732 305541 301284 323467 323029 329590 349482 359664
9783 359664 385387 388118 394342 410937 424263 431378 410688 398814 388529 401365 406496 405467 399390
9770 399390 392803 399422 400690 410335 414396 405412 388582 378845 385126 402997 418068 419189 426751 446627
9756 446627 459799 462600 466305 493335 487104 479405 486961 504882 517226 511098 516150 516849 540968
9743 540968 569102 594894 604562 597122 600140 602798 597669 597589 594621 600631 607300 604493 630862 659659
9729 659659 651704 644046 659589 677804 715293 729138 718890 725282 727792 726973 749284 759951 779973
9716 779973 789442 798383 807835 828431 866718 882027 886155 894241 899879 904719 907786 923909 946994
9703 946994 986232 1017253 1034898 1059744 1075710 1103251 1120033 1142721 1163880 1183124 1214063 1249656
9691 1249656 1277155 1288636 1305063 1344922 1371446 1407018 1433203 1458278 1490998 1538379 1583573
9680 1583573 1613177 1646938 1678435 1717970 1753330 1785550 1815274 1863360 1905368 1966230 2034441
9669 2034441 2098162 2159489 2225482 2279047 2348217 2423078 2480915 2551959 2619306 2706186 2792619
9658 2792619 2870985 2987067 3087708 3204399 3318012 3411406 3523491 3640745 3790425 3934245
9648 3934245 4082162 4235404 4399954 4573787 4755850 4941743 5144327 5361714 5577844 5802261
9638 5802261 6061784 6326187 6598139 6886130 7206172 7551675 7912047 8286956 8690397 9103296
9628 9103296 9543256 9991141 10461271 10958652 11483745 12040771 12644884 13280172 13924332 14545437
9618 14545437 15194716 15850849 16520496 17198589 17866203 18503776 19099271 19676370 20209585
9609 20209585 20653564 21037134 21346433 21550991 21672889 21704170 21657081 21494134 21239939 20891604
9599 20891604 20481996 20006354 19481214 18887137 18261193 17603820 16937773 16272892 15600712
9590 15600712 14953287 14325106 13681297 13062973 12469574 11884289 11321432 10799917 10322676
9581 10322676 9838690 9393692 8974227 8591452 8219132 7868093 7511882 7166645 6843712
9572 6843712 6541175 6268648 6010292 5759583 5525083 5289081 5084552 4887338 4717257 4529241
9562 4529241 4351818 4206175 4062595 3904774 3761652 3637748 3512135 3375098 3253703 3150289
9552 3150289 3061527 2967031 2881622 2778771 2674796 2584352 2518489 2439740 2388002 2320548 2249369
9541 2249369 2194368 2134252 2075946 2009306 1956505 1905529 1852765 1784356 1754359 1723794 1651674
9530 1651674 1618756 1584530 1554234 1534292 1507410 1474953 1458979 1412134 1369225 1363723 1337306 1296301
9518 1296301 1271440 1258706 1218465 1180639 1137687 1092360 1083967 1075701 1053306 1023922 1009793 1004955
9506 1004955 991243 978123 955713 944893 937215 923537 886876 881374 882034 853326 822119 804545
9494 804545 799629 796669 778767 747237 736837 737233 725419 701706 688109 690493 669501 656316 641731
9481 641731 632415 626542 627027 603064 604226 607987 584194 578233 566744 567504 544970 532599 501253
9468 501253 498439 504006 502041 517876 510131 498236 483580 482348 472863 474245 481795 497139 494075
9455 494075 471662 450584 437803 436222 429756 430703 424307 399487 379120 380958 371096 370975 378097 383492
9441 383492 366214 357679 344170 330352 328020 341875 341171 344595 346144 333425 350864 357372 353247
9428 353247 338867 330804 309513 302582 296335 285920 287162 296937 296497 284796 272608 268690 282671
9415 282671 306479 311763 296705 296958 298775 290018 274394 259426 269208 264563 248710 252956 250389
9402 250389 232396 242910 254319 258512 245596 251415 259051 252666 242916 230336 217254 211712 222284
9389 222284 229832 226076 216107 208420 205583 218957 223693 226666 222072 213361 209873 220179 225832 228614
9375 228614 221586 230155 224027 213069 205006 209543 223491 208336 186605 185983 195575 181594 191613
9362 191613 199509 207665 200104 188867 175329 165869 156235 161585 165876 168428 163572 185254 193864 172073
9348 172073 176956 171060 178788 183262 173323 143924 132209 153827 167257 170957 168898 159142 146287
9335 146287 138540 134464 126883 133125 138485 162851 170306 174045 179184 181620 180434 183908 193385 189771
9321 189771 162353 159079 160180 164056 156591 145139 140137 145357 146374 131641 123137 115370 125678
9308 125678 138063 140495 150870 152319 138120 130673 127539 124059 121115 125615 142484 162914 165674
9295 165674 158019 151462 154787 142651 121639 84150 78633 89207 92769 93885 94794 80526 94334
9282 94334 101208 91791 98228 93199 54606 62581 77490 74502 106444 129859 118367 101390 94019
9269 94019 98755 109307 86669 89295 97595 103793 106155 107365 122715 99071 94256 83361 63458
9256 63458 68220 79833 66504 74931 86329 87396 106689 125621 127968 100128 85888 78229 65791
9243 65791 74813 80421 79926 88308 99547 84481 65197 76972 84908 73051 78505 69036 49117
9230 49117 52157 57936 52562 59338 62779 57663 59384 56612 44148 58366 59788 70324 73373 80474
9216 80474 67694 48062 64147 81110 80531 79719 77528 65705 55010 56208 71388 66790 64868
9203 64868 44972 37198 49089 58216 51854 42768 44715 50396 49258 36435 57036 58423 67322 69120
9189 69120 72326 69992 61995 58511 68577 63983 43309 39349 35829 31295 49171 45029 38625 41156
9175 41156 38715 54634 58268 66410 62508 68699 60314 82556 106314 84822 77902 79790 88595 91301
9161 91301 97407 83811 77385 65707 55233 58055 64437 57857 38928 27439 51466 53224 57655
9148 57655 57889 60954 56267 39882 50530 57548 70791 63429 68201 88011 90906 76150 62883
9135 62883 36285 27981 47132 49439 32676 38957 52729 42644 26953 43718 65529 54451
9123 54451 46627 51212 47203 33129 36367 54664 66454 63166 42382 20616 -61 5260 19437
9110 19437 27256 25642 30433 28749 38661 50892 49158 58238 69131 65856 49787 57354 70725 61906
9096 61906 53231 51518 47313 37806 53156 51212 49625 36821 41819 53059 38518 36283 44766 42401
9082 42401 37011 42804 38367 54516 39053 35945 38748 41529 50359 46852 30125 40207 40550 18424
9068 18424 29150 34347 62363 66085 43036 41444 72430 81238 82519 57332 46748 51015 37376
9055 37376 25661 14781 6167 8966 10527 10539 14070 28316 45818 45582 53351 51427 47849 47456 49477
9040 49477 53350 45920 49786 54771 52226 41550 43450 41978 45669 55693 41701 37161 38292 24664
9026 24664 18350 18751 24898 13671 9329 21065 30937 27877 18688 8572 1756 6989 13449 22914
9012 22914 16015 12778 12729 10902 11190 24858 35477 22461 18383 20659 12186 28923 33755 40189
8998 40189 24603 31233 37364 37853 35388 23130 29100 33270 32874 29354 26117 13963 8917 18871
8984 18871 38122 52650 65349 55607 59850 49040 24437 8297 13814 18598 25560 16384 21506
8971 21506 30659 10129 -1478 -2425 -4050 -4215 14720 9161 -2658 -101 13830 30702 58299
8958 58299 53465 43526 41590 56589 68709 51991 14412 -427 25204 44194 51688 51239 36070
8945 36070 35349 39065 19781 13778 27666 31775 17511 1330 18246 28581 18069 11828 16308
8932 16308 22732 26809 4181 -7476 25643 44588 52778 43115 34788 32094 36442 13153 4779
8919 4779 2169 18385 47283 64258 73562 42053 14140 13440 17885 19460 2382 1012 7149 -8298
8905 -8298 6813 10659 3127 16517 26966 30373 27095 24661 42613 44604 33388 23823 33930
8892 33930 41052 31524 26085 42534 42322 38515 44498 34135 25157 6384 16711 26327 32139 41706
8878 41706 46015 46443 45428 61085 63178 37639 24523 712 -3319 4970 3048 -6632 1317 4053
8864 4053 10717 36600 48249 57496 77726 81937 88081 61654 62462 55561 41999 31803 19872
8851 19872 27500 28972 38030 26515 8796 6492 6051 27673 51681 43895 31723 24679 18831 9849
8837 9849 -1 8394 -6861 -5773 2561 16543 25422 23187 30250 25426 17125 31588 35192 38055
8823 38055 33959 10564 13300 14963 25099 38298 30454 25641 38138 26978 9479 13958 13383
8810 13383 19261 27069 28838 10567 3215 18369 40414 48159 35312 42851 45285 33182 17285
8797 17285 6979 13146 23200 15491 8405 7053 18379 25671 27770 6859 5795 5430 -3054 -1220
8783 -1220 7908 12871 -1253 7925 37587 49549 31362 24434 19482 25891 23291 12718 13221 19182
8769 19182 3288 -7695 6712 18141 23762 28920 26153 35991 22333 6345 -8170 -4129 3795
8756 3795 302 2411 27333 40089 34017 31750 28908 32491 30399 51234 50006 36685 31974 25334
8742 25334 14287 13312 -974 8936 15689 12192 24834 8481 4090 14796 18322 11293 10246 29461
8728 29461 27490 17695 8099 4690 8452 8841 2555 -2135 13964 34163 30924 31991 33193 37615
8714 37615 37787 40271 31740 32126 43347 46138 37554 25610 26829 18472 -4299 -23721 -20312 6292
8700 6292 15384 18893 16765 16464 8720 -4068 5836 11815 12102 13378 14634 8331 7995 11600 28592
8685 28592 30130 10378 -9502 -5137 2262 19340 5354 9162 20775 25614 5263 -16579 -15724
8672 -15724 3134 12358 21415 25214 11527 19340 19892 18002 22839 39437 35165 28696 20696 -3229
8658 -3229 -2365 367 13778 31667 32787 29689 32536 38942 35290 17944 20690 10836 6675 15272
8644 15272 20218 22111 18919 18312 13353 17770 33545 37950 31368 31882 55788 53437 26610 4413
8630 4413 10907 44502 53747 51772 39312 37980 50382 62827 77732 65918 51973 46777 49728
8617 49728 52987 59420 56458 35165 30843 38955 44248 37188 32222 26796 20651 29738 37574 28967
8603 28967 22667 43628 66610 62040 42687 23288 18935 31495 33074 43040 42449 42315 63306 54447
8589 54447 42149 45778 42559 27587 55403 74155 74867 87204 114896 142648 168212 191722 185182
8576 185182 149629 117779 109837 104048 89673 77652 68390 50758 39925 54701 50417 30831
8564 30831 17032 22089 31667 34125 44714 39049 25941 15972 -1443 -17397 -11905 -7797 -992
8551 -992 -2188 30966 46031 37032 9303 -6159 15590 35241 34391 24347 24445 16494 23898 45580
8537 45580 70999 56661 50505 72251 78379 78896 67841 50683 28674 20852 27281 28232 10235
8524 10235 9964 10299 16019 17108 16322 7579 -1898 11234 25360 29515 11103 3547 11476 16517 20898
8509 20898 9912 6654 7187 8997 7958 16231 13278 23120 5971 11078 10313 -15016 3736 46679
8495 46679 44227 17965 15996 24056 31219 29152 25223 24155 27580 39068 31688 13456 10846 8273
8481 8273 -15118 -22308 -26310 -32353 -13409 19229 30051 24911 40012 45032 35098 18352 7739
8468 7739 37579 93490 115509 114852 111102 91987 52796 9401 -10877 7543 29227 20269 9247
8455 9247 14329 21889 22580 22805 29989 360 -14481 -10923 -24101 -28132 -34872 -32201 -19661 -3431
8441 -3431 134 -11876 3995 19307 25953 23453 8005 8048 2703 -8797 3930 11281 -5932 -1827
8427 -1827 7109 17900 54399 74871 68662 49810 74601 126035 190522 226753 196852 147818
8415 147818 120232 105235 78229 55693 74590 80038 55794 57905 48788 31742 29427 34577 19754
8402 19754 13267 13649 11904 1482 -620 12763 9974 2498 -2740 -10849 -10702 1245 7416 2163
8388 2163 732 9247 1093 5256 -1025 -8394 1856 10826 19016 17097 13480 14169 19140 28662 51922
8373 51922 99046 113234 107101 88427 77829 83852 55595 36314 25142 28538 27935 48110 33692
8360 33692 35529 28495 27584 13784 10855 8000 9723 15020 15956 5742 10308 15009 8630 120 -3211
8345 -3211 -4114 9539 4983 20686 17535 -5251 -17923 -17519 -4600 3857 -13379 -1604 9743
8332 9743 13260 24977 2250 -17807 -42315 -49053 -38235 -17050 5728 11584 2107 32 19092
8319 19092 43233 36537 16357 13841 27608 27045 22435 13254 11461 22561 35812 36257 31520 31478
8305 31478 21554 22030 11084 25650 45591 43738 13844 6974 8650 7140 12414 16038 7897 -7479
8291 -7479 -17166 -4358 -3238 -4822 2251 -8749 -19229 -14228 -18243 -23432 -7669 4017 14522
8278 14522 9648 -17946 -27023 -9962 297 -2047 -1889 -9745 -11919 3672 18620 15948 14388 22845
8264 22845 39552 45269 32756 8779 -10542 -8549 -35880 -32434 -9678 -979 -3811 -7377 -12338
8251 -12338 3932 -1594 -349 17942 14251 6592 15557 15993 24543 30713 21978 33845 39873 48902
8237 48902 47729 43089 38760 14233 4989 -3061 -13772 -16010 -3560 6804 6477 -262 -4710 -368
8223 -368 12243 22600 37527 48970 30634 22226 27541 67762 79871 73942 62647 62254 68518
8210 68518 64270 51727 39245 15679 5360 -1421 955 -17728 -3659 10293 12635 12549 2779
8197 2779 -3064 -3583 2046 18078 30825 51718 80912 74995 55406 46201 38222 7658 11138 29050
8183 29050 23991 8807 8256 600 4970 5202 -1896 -7429 2006 -4354 14898 17660 -7349 -5365
8169 -5365 21168 30529 24376 37423 34339 8251 -9212 -5845 13085 14876 18895 14270 16864 21049
8155 21049 28182 19018 13718 4770 12436 22857 34245 40720 46409 74222 82104 60387 28572
8142 28572 9679 9958 561 -6966 -21389 -10848 16572 21466 9491 21967 37397 38948 38522
8129 38522 46793 59610 59922 41371 12920 -3995 -16451 -20077 -25340 -18107 -8221 8710 21215
8116 21215 29933 31669 42237 29400 19654 19590 11267 5743 20349 33479 22383 24449 27825 19796
8102 19796 18986 24020 29984 6455 446 -2763 16428 17648 15333 28772 20092 -6793 -4614 -3260
8088 -3260 -10504 -11158 -2618 11771 15342 20579 23861 11210 756 -570 14319 16233 20684 38620
8074 38620 36339 24301 20354 22531 31293 29928 21306 2687 -4137 -2988 7633 8674 2629 -147
8060 -147 -20403 -15728 -11803 5601 25183 9427 -14249 -20177 -7266 10144 13689 2876 -2453
8047 -2453 7146 5288 -472 -8345 6891 31826 21587 5229 12630 28323 33988 38700 27943
8034 27943 19310 13552 28615 58665 46674 26886 20363 377 -608 15636 21107 37380 51207
8021 51207 53555 26989 18580 20562 43068 57838 54465 41350 46659 45229 58149 59428 40339
8008 40339 22712 19819 21967 15338 20125 22553 -4633 -7515 -10048 5859 22135 22002 12735 4705
7994 4705 14464 22476 20053 27790 26116 8202 18965 21490 39018 55222 50893 45939 37339 33365
7980 33365 43418 42314 43716 42426 54590 55787 46890 33318 17341 11324 -2705 6671 19339
7967 19339 22487 29111 25101 27352 42701 43861 18576 12199 14043 16297 17022 15297 10964 8466
7953 8466 3921 4047 -5333 -6296 -4854 -516 129 20552 37623 55311 71639 75829 61097 39497
7939 39497 23443 -620 7884 17428 11173 11758 10322 34409 36243 37419 40088 42171 55719 52055
7925 52055 25723 11949 25238 19552 20997 10880 -8932 -9794 10223 32102 52089 43401 43920
7912 43920 42363 46048 45935 38848 50094 53620 60641 46873 55660 60476 62793 56894 68839 59613
7898 59613 61424 58697 38144 14781 -5891 5662 26003 27344 21155 15170 16986 35689 21461
7885 21461 9917 12182 12490 19658 16984 15306 13781 21469 17380 35672 40152 46164 44263 30820
7871 30820 49556 73518 68777 64727 70365 58529 56481 35740 32872 46125 55531 46374 47968
7858 47968 40523 22213 7849 4902 25582 9288 -21297 -22021 2443 15964 20039 19119 -5242
7845 -5242 -870 7788 10465 -6344 -11228 -1690 -15164 -14892 -5399 1789 5649 29337 31044 884
7831 884 -15011 651 -11904 -17716 -27574 -21310 11187 15778 9483 26920 23263 10435 -7012
7818 -7012 -13783 2103 -2989 -7139 -9089 -6314 1882 14083 11600 6579 8917 10625 -3813 -11651
7804 -11651 -15094 -37652 -49012 -36639 -18282 -13253 -3373 12126 1918 490 -12757 -28788 -22209
7791 -22209 8072 21022 7901 1612 10038 19128 33138 28942 36320 36358 20148 -2544 -1371 10388
7777 10388 7175 -12826 -8700 7708 -374 -18666 -24333 -24023 -19204 -14560 -24989 -22376 -15439 -33658
7763 -33658 -46829 -41902 -26954 -13578 1467 -4411 2627 28602 24954 -1669 13296 17928 17493
7750 17493 15313 -2080 -8816 -1767 -4430 8390 19218 17340 20847 10652 -10523 -14277 -15754
7737 -15754 -15117 -3472 -9100 273 11425 1534 -1402 -2045 4922 13349 8354 18025 15798 18180 24432
7722 24432 10112 1632 -3433 -9710 -11546 -6801 6163 4716 -20614 -25066 -9854 -6003 16259
7709 16259 17421 -4125 4813 21277 19955 4085 10649 -1965 -32148 -18079 -1881 799 -6476
7696 -6476 -22136 -15588 -15200 -15821 -4957 -3236 8268 2837 653 10030 36515 26243 10538 -10818
7682 -10818 -6099 -18318 -39266 -55602 -63307 -34760 -13557 5865 15813 14153 9430 4218 1767
7669 1767 -4384 976 6953 -4985 1604 4554 11334 7336 8569 1504 -17204 -24484 -24945 -31520 -28589
7654 -28589 -9103 -161 5302 -2242 2654 75 -8024 -7887 -5332 -1343 -389 -1312 -14573 -2022 14325
7639 14325 12099 5881 6983 10257 -19335 -26868 -38117 -23641 -6948 -11572 -23812 -16589 -1365
7626 -1365 24999 20845 -1340 -4133 226 -221 3674 2944 9919 26937 36090 28740 1376 -1379
7612 -1379 21827 20020 6877 6039 11318 11477 -1115 -239 11875 13297 6023 -3589 -4817 4940 26034
7597 26034 14867 -6238 -8159 20861 14535 -3726 2397 22337 18381 6841 4905 -1509 -7363
7584 -7363 -2679 5317 -6919 2203 9524 4136 -3575 -6149 -13740 -8721 4726 11182 13377 20572
7570 20572 23822 16207 5673 -6101 -4742 8838 14954 11820 -2363 -13252 -10157 -2846 21146
7557 21146 28354 21172 15499 382 -8500 4574 16883 20512 922 -22669 -21303 -11213 -8080
7544 -8080 -8894 -25555 -16505 -5238 -14528 -18254 -8094 1441 -2756 447 -1260 -22233 -33531 -22918
7530 -22918 -24902 -21344 -28228 -31874 -32664 -39346 -28376 -27202 -23392 -28540 -19117 -14161 -22696 -2542
7516 -2542 -4540 -22590 -22125 -20040 -16657 -11528 -12557 -20517 -5950 -4869 2654 10022 -12029 -15894
7502 -15894 -5705 -4153 5881 8782 -8237 -8953 -14227 -17436 -13580 -1585 13552 -17566 -20991
7489 -20991 -15957 -11272 -15423 -17100 -13770 -5040 -4789 -13376 -15230 9051 6314 -2417 -13487 -20389
7475 -20389 -14779 -12285 -18266 -17375 -16201 -10720 -7629 -14629 -27563 -31249 -2890 -4994 -8770 -7305
7461 -7305 -3713 -10171 -8685 -18207 -16795 -15597 -3159 -2843 4227 -1278 -6069 -2012 -9216 -12071 -14037
7446 -14037 -20328 -16869 -12796 -12981 -10351 -3436 -2092 6696 13260 5468 -2698 4744 6622 -492 -21405
7431 -21405 -19449 -13584 -214 4490 -814 6123 20496 11927 -14849 -22504 -7069 -9597 -22179
7418 -22179 -12120 10147 13445 10478 16233 3151 -3854 12674 13745 -14400 -21824 -21535 -22729 -25092
7404 -25092 -18314 -9094 -10513 -28638 -22251 -15003 -9494 -18467 -18378 -19838 -11317 -10087 997 -16800
7390 -16800 -8262 -15299 -13792 -10032 -8837 775 -8446 -10201 -33621 -23989 -206 -19334 -24386 -27026
7376 -27026 -28380 -26227 1805 4040 7556 18829 22620 13468 19101 13003 6793 6013 3088 469
7362 469 10717 4479 -1491 -11651 -11954 -24746 -20494 8726 18216 22910 27698 33765 33572 17917
7348 17917 15828 10017 15502 8294 -5706 -3914 937 6378 -10267 -22049 -38892 -38049 -7745 -3552
7334 -3552 -14762 -31413 -23868 -10353 -10981 -14030 -1003 -2224 -10502 2921 16984 12411 11379 10845
7320 10845 -15268 -18194 3128 11001 -14586 -22727 -40395 -36678 -33314 -31532 -17495 -17022 -5739
7307 -5739 -11477 -18912 -34230 -33053 -8429 7348 22517 36332 23777 28572 19339 17146 970
7294 970 -2666 4061 12624 -6645 -8501 -118 822 3065 4905 -4675 -19990 5302 29588 33602
7280 33602 6756 -16028 -29806 -31807 -13315 -10454 -13529 -294 -6161 -5669 18633 32969 33465
7267 33465 23004 7144 1732 14502 24185 5221 -632 -1784 -6377 -4816 17980 37783 19817
7254 19817 9757 1046 6241 3218 3359 10303 6064 -7606 7377 23936 22625 20333 16773 30952
7240 30952 38567 46919 34843 7922 10536 17700 30291 35119 18664 2136 -2826 12963 22989
7227 22989 17572 15302 16291 8573 -672 -2410 -1883 12835 -8854 1856 24045 34651 17030 22847
7213 22847 20113 -7175 2594 -3239 -14243 -6915 482 -9128 -23667 -35721 -17763 3356 7987
7200 7987 10228 8172 -13080 -21696 -19450 -8086 -3226 -11081 -3272 -7978 -17649 -15469 -16946 -3549
7186 -3549 -2453 -874 -3195 10041 25624 16573 -11209 -18419 -3643 -1006 1554 -1922 6868 40202
7172 40202 39885 16056 2785 -3933 -14682 -1060 -6652 -17740 -15971 -1752 17422 33174 8027
7159 8027 -21159 -9571 -15801 -1036 5619 -3155 -19992 -18797 -8649 13124 -2629 -13431 -7352
7146 -7352 -14330 -9352 724 13128 -2451 -11951 -21187 -27397 -4608 -11522 -17464 -21572 -14933 -22602
7132 -22602 -27003 -15977 -22958 -25126 -337 2336 -15549 -20931 -9243 -5446 360 13910 774
7119 774 -19921 -25699 -9700 -6397 1955 24110 20954 2782 -19930 -17965 -11519 1860 -1819 9167
7105 9167 26412 4076 -15580 -14815 -927 -3002 -13550 4200 10750 10938 8161 7428 7941 5354
7091 5354 -19594 -27719 -22223 -15985 -3377 -5877 -15650 -19397 -14373 -21602 -26478 -23703 -15738 12617
7077 12617 4095 -11376 -22423 -12287 -27196 -31525 -38352 -14296 -4093 5155 25 -13764 -12681
7064 -12681 -16013 -10866 -7014 711 -5961 -27579 -35823 -14545 -26211 -39421 -41244 -48353 -46419 -57266
7050 -57266 -43800 -36454 -27526 -15574 -38029 -45515 -26740 -21499 -26836 -32632 -30235 -43598 -27308
7037 -27308 -6376 6687 12923 10897 412 5591 15175 16453 12071 16058 20746 15715 3214 3977
7023 3977 9476 6379 7341 8406 24683 11047 -6389 -17810 6395 16223 1745 -12233 -19015
7010 -19015 -989 9320 6301 27108 8024 -6188 -5858 8310 6623 -5216 -12624 7620 1652
6997 1652 6233 13260 22714 22467 16279 9609 14930 13492 18379 20512 18513 2422 -13740 -21177 -20252
6982 -20252 -8223 -826 -17180 -12688 -181 -512 739 -8502 -13034 -4213 -18302 5068 25186
6969 25186 26166 30963 7627 -11244 -24251 -17621 -11224 -12919 -9394 6535 23493 20409 8769
6956 8769 -4107 2650 -6993 -8076 3860 -585 -781 -14641 -3039 23291 25729 16878 15906 7544
6942 7544 2732 -4865 -21297 -11487 -3737 -7905 -6466 -18234 -12027 -4911 5756 -8632 -18646 -26717
6928 -26717 -31915 -14371 -18551 -13829 1430 7930 18762 21812 3557 -16116 -2827 6945 15007
6915 15007 -10310 -2988 14976 8508 -4188 -10320 -10972 -24515 -36735 -30535 -30287 -25634 -9886 -14750
6901 -14750 -14809 -17517 -20023 -42317 -22079 14102 20439 15965 6178 3893 2351 5326 21677 28830
6887 28830 20935 3369 -13210 -26441 -26770 -41381 -23992 -12838 -14697 -20589 -34434 -40183 -32306
6874 -32306 -26047 -24179 -28489 -31694 -39505 -45609 -51562 -36912 -25111 -20568 -4995 20119 16596 14695
6860 14695 -5880 -29662 -37783 -46638 -39278 -35334 -42466 -49812 -26199 -30946 -24218 -7839 -11486 -25710
6846 -25710 -19430 4328 7135 -1309 10599 -10464 -36919 -28780 -9687 4327 -1043 -18311 -8882
6833 -8882 4636 5660 7711 19091 26501 17036 -17152 -29264 -21613 -12076 -17503 -29168 -22555 -16018
6819 -16018 -17909 -25419 -39597 -36699 -43263 -33891 -24196 -19609 -18815 -26207 -23348 -22461 -4357 -6340 -14726
6804 -14726 -15990 -13640 4744 13944 9522 18658 9484 -144 2391 1075 -19246 -24425 -23599 -20580
6790 -20580 -20553 -9872 -2947 -9186 -6665 -5185 -3955 -6963 -18637 -25361 -17791 -15434 -807 18162
6776 18162 18653 9072 23541 29517 16459 927 -14247 -8354 -7226 9505 21100 7617 -12807
6763 -12807 -12429 -5811 2078 -3975 -5870 -10914 -2531 3542 -18421 2151 15429 32617 41233 25785
6749 25785 12934 10348 16798 41452 42938 24973 34722 24174 4494 -115 -6976 1145 5636
6736 5636 11822 17302 4111 13433 10241 9832 2838 2183 -6691 5941 22350 20141 7128 9635
6722 9635 11861 -14841 -21686 -9721 -63 25023 42710 40544 32119 45590 60083 60599 61979 59499
6708 59499 39322 30206 35680 46330 43900 27245 35564 27477 5915 -12116 -9576 -6008 -14005
6695 -14005 -38861 -43468 -41406 -40632 -24727 8822 20348 15058 16918 10622 -21153 -18627 4251
6682 4251 4815 -10682 22612 48505 46071 31253 -3211 -22899 -30526 -27911 -25669 -31132 -39290 -41948
6668 -41948 -32486 -25533 -29 3421 -353 6323 -9755 -32827 -21025 -16014 -13005 -9075 -11236 -19133
6654 -19133 -31982 -13219 -1620 -16252 -14362 -7556 -8116 -7688 -18275 -22823 -23096 -9408 -5560 6173
6640 6173 7269 7693 -3913 -16884 -19483 -16265 -39456 -28754 -19255 -13764 -9883 -39423 -41048 -20049
6626 -20049 -10577 18247 23164 22210 -10500 -35955 -39840 -10721 8852 9834 -10905 -13223 12969
6613 12969 33488 41004 17052 16200 21488 15032 -18259 -11984 12598 24599 31966 25874 7058
6600 7058 10165 12411 6380 -7562 -32645 -35239 -12403 -6487 -1303 2724 7664 11867 2472 9545
6586 9545 11181 8875 11817 9719 23819 43827 28957 -1494 8685 25065 14272 17440 1867
6573 1867 -7348 -11341 -4066 513 7596 -8370 -16123 -7214 -12504 -27373 -36403 -14053 630 7002
6559 7002 -14478 -24559 -17965 -17153 -8793 -3785 -10795 -24084 -35463 -43242 -13648 2549 3241 318
6545 318 -810 -7535 -5787 -1371 2748 497 15859 2358 -7644 1934 15954 7292 -5001 -9061
6531 -9061 7679 4840 1008 3540 3232 3696 -2340 -12382 -9736 -2742 8124 15813 10705 -3515
6517 -3515 2549 17586 26425 3212 -4099 17796 24555 10871 3859 7252 -12330 -23708 -40463
6504 -40463 -30883 -27409 -29093 -35122 -32434 -9431 -4113 -7043 -6215 -6868 -6534 2347 797 -5910 -9256
6489 -9256 -6107 18530 22225 31256 18609 11828 10802 2842 8818 6299 3040 847 -1295 19109
6475 19109 42469 31642 28928 26695 11041 -8756 -10337 -15051 -3943 -18503 -10685 -3144 -11676
6462 -11676 -15395 -23647 -35556 -19204 -13360 -27873 -22179 -16009 -27632 -25632 -11502 -8946 -6224
6449 -6224 3003 8483 -2707 7450 9335 10525 11176 1983 5173 -19926 -24957 -9999 -22348 -21704
6435 -21704 -16078 -18920 -23723 -32297 -27615 -13731 -27349 -20702 -22130 -27963 -25489 -14786 -13935 411
6421 411 27101 12513 -12788 -14804 -359 -3394 -6036 12759 16471 14941 11567 28888 41247
6408 41247 19796 14538 25536 34716 18936 17025 12602 9798 8331 16186 23802 14763 -2862 -14699
6394 -14699 -24444 -22978 -23228 -14264 -8673 -7570 8395 3631 -7370 -1678 6698 -3973 -11399 -14166
6380 -14166 -23100 -26886 -20553 -10494 2137 2493 225 -19089 -18451 -24170 -27588 -40511 -34174 -13753
6366 -13753 1145 -475 5242 -6400 -7090 -4032 -12090 -3171 1090 -2602 -828 -18483 -24555 -20725
6352 -20725 -8956 -2113 18125 15818 22143 7436 -6305 12621 398 13338 21338 19067 -10759
6339 -10759 -18255 -20658 -14019 -19787 -25612 -17356 4686 -5493 -22179 -10323 -9179 -11647 5286
6326 5286 17548 880 -253 28757 31942 17588 32315 36556 22335 13859 19271 -7709 -23970
6313 -23970 -26418 -11631 -10742 -7112 -10644 -9743 -2710 4102 6978 -8959 -13943 -24976 -34810 -27032
6299 -27032 -32801 -27657 -17038 -2244 6150 1020 -12379 -24362 -25386 -9119 -6354 -6838 -1151 2975
6285 2975 20535 35822 37188 42945 32715 7605 10788 24728 942 -21979 -39619 -52131 -42968
6272 -42968 -22357 -14469 -27100 -41931 -41331 -24344 2761 1583 -2943 -6493 -2776 -7622 -25467
6259 -25467 -14423 6001 21599 29528 7931 -3974 16495 1819 -7560 18195 21378 13956 3374
6246 3374 12006 3036 -24078 -13798 10444 19892 18988 -2665 -33988 -32710 -37142 -16590 -3025
6233 -3025 8871 19595 22641 2549 153 -7974 11533 27247 29873 22899 5692 -2038 -11582
6220 -11582 -5309 -3488 -13906 1691 34277 34344 9843 3781 -9849 -5386 -16042 -24585 -14985 -16284
6206 -16284 -34149 -34331 -34445 -49756 -53032 -28883 -10367 -24123 -20403 -39687 -42840 -40912 -26573
6193 -26573 -18990 -25995 -15090 -15039 -12999 15689 32829 20734 2095 -5971 -4387 -17396 -27937
6180 -27937 -28644 -11442 -2334 -15025 -8053 -14334 -18866 -8596 -13768 -10353 3156 10847 14034 4301
6166 4301 4715 3167 -7670 -8352 8582 26972 38415 19309 974 8939 27374 21926 29048 22455
6152 22455 3485 -14731 -13848 -16906 -13401 -7133 -27912 -29622 -6653 1712 -1300 -7785 -8466 -14661
6138 -14661 -35193 -64511 -56582 -34461 -20247 -17213 -27858 -30281 -12520 -10467 -15501 -12365 -9142
6125 -9142 -9296 -9759 -15089 -12532 -15919 -8742 -7087 -19421 -18706 -29290 -18444 -7210 -10739 -9531 -25041
6110 -25041 -27775 -15098 -12999 -3836 -11678 -38714 -49189 -30053 -19385 -14389 -17714 9004 31551
6097 31551 25689 24232 14720 7597 10372 12797 3670 -807 -7797 -2244 -16616 -30247 -25932 -11917
6083 -11917 -5789 -7266 -12391 -5862 -15863 -12557 -1931 2523 16095 34411 24057 15330 21522
6070 21522 19246 16484 26779 29657 22224 6845 3070 -128 -3647 -11419 -278 -11804 -1445
6057 -1445 1891 548 -6583 -19141 -33230 -20103 -20966 -21674 -11105 -10798 -11990 3953 -3093 -8860
6043 -8860 -4243 -9812 -4643 1599 7957 -22569 -51800 -49450 -46974 -29822 -5329 -6760 -18849 -16641
6029 -16641 -11570 -11842 -25178 -19259 375 -6629 -16812 -26152 -28117 -13788 2138 7840 9366 7285
6015 7285 1836 11879 3535 4056 -5437 7276 -315 -621 7898 5159 5599 -7386 662 -3163 -12419
6000 -12419 -9939 -12794 -13374 -8739 4664 -643 4705 -2311 -1814 9786 25600 35079 27477 11542
5986 11542 15528 15493 4645 -2662 -6423 -2283 641 3804 -8262 -12259 -25800 -20148 -1875 17945
5972 17945 21887 15488 9557 15773 10645 10004 17628 2687 -738 -12016 -15700 -13898 2697 12102
5958 12102 14503 3926 -7270 -10363 -4414 -9425 -23465 -49237 -51254 -45358 -58022 -50545 -41253
5945 -41253 -43659 -23531 -5863 -8144 -17064 -3976 -16769 -11025 -17535 -29155 -16514 -3082 -2296
5932 -2296 -857 16 -11789 -16302 3655 9055 9757 -376 -652 1320 -3177 -15857 -31170 -28270
5918 -28270 -12444 -9950 -1395 15181 7308 19316 26652 6422 -17079 -16173 1722 18943 -3205
5905 -3205 -17855 -8640 -25180 -48947 -53982 -44096 -29552 2209 12903 -2691 -5984 -6396 -400
5892 -400 -10430 10412 1231 408 4667 -17824 -24526 -15717 -11013 -17098 -13677 13445 17136 16194 33684
5877 33684 38634 34208 12902 15779 9869 872 -10090 -22228 -21611 -23867 -17820 -1126 -10139 -16791
5863 -16791 -18521 -15192 -21671 -10090 9801 7942 -2430 -19442 8081 11611 145 2882 -4632
5850 -4632 -6135 -13210 -12906 -20608 -17968 -17936 -3282 -7749 -6212 -8068 -15131 -18823 -3781 19248 9076
5835 9076 -12916 -11946 -2657 -9113 -7327 16825 23266 22833 15500 10082 7129 5456 -7731 -12143 -23411
5820 -23411 -28770 -20026 -26702 -28580 -28195 -37583 -28146 -3785 -14982 -21444 -14158 -13042 -25918 -12849
5806 -12849 -10795 -10269 -24786 -23615 -32387 -22202 -2471 7192 20374 15128 6346 4607 9125 -11020
5792 -11020 -22706 -28622 -22836 -9190 263 7350 6977 20969 32780 8624 -6222 -19850 -19451
5779 -19451 13776 21675 15599 7407 1341 11150 28386 18077 -2166 28 -6783 -24572 -37744
5766 -37744 -32086 -15876 -11410 -21582 -13244 -13898 -16641 -25484 -13134 -8057 -14892 -11733 -6697 -3825
5752 -3825 -2311 -6795 -4933 -11280 10760 21134 4415 -5254 3663 13876 4337 14319 -11340 -17135
5738 -17135 -14631 -7997 7543 18373 17190 9747 6798 15616 12374 10188 14024 17462 4128 7820
5724 7820 18894 18839 8877 -18940 -39105 -23520 -12919 3121 11984 12586 8792 -20899 -32279 -20207
5710 -20207 -3761 13584 13977 2068 -2096 -4214 -3735 -13250 -22671 -13998 -9735 -1561 -2663 -11591
5696 -11591 -9015 -974 5673 9997 17166 8193 2843 335 -690 -2584 -1960 -25888 -15056 -26759
5682 -26759 -41410 -25940 -20303 -21518 -3871 4300 12147 14095 2172 -4665 -9016 15266 24569
5669 24569 10500 -5033 179 -6117 -17210 -23035 -7978 8436 9412 -544 6203 22897 16734
5656 16734 -547 -5943 4094 26273 9239 1808 4685 -7672 -19504 -7048 -19011 -25678 -29536
5643 -29536 -38537 -30603 -8653 -12327 -37974 -30453 -5723 -19123 -32912 -21107 -28137 -26457 -17077
5630 -17077 -6131 -9278 -16761 -13500 -19187 -9401 -2028 -21772 -33604 -16984 18052 26503 8265
5617 8265 18341 26067 15782 11011 16965 23018 26831 3143 -16826 -12559 -19783 -27158 -6075 -3736
5603 -3736 -10797 -23592 -35716 -23434 -9577 -12395 -21332 -27826 -32059 -20170 -3579 -710 3891
5590 3891 21827 7514 -7357 -5391 3879 6189 10275 13997 -680 8678 15996 -3004 -19817
5577 -19817 -29103 -20019 -31427 -43764 -27864 -26888 -7933 -4725 -9783 -4486 7880 20939 -8995
5564 -8995 -26157 -1709 2542 -20775 -26752 -15256 -15878 -9220 -3060 21831 15211 1028 3703 -4665
5550 -4665 -11666 -26009 -7892 1205 -7583 -21018 -1133 9822 -2491 -23354 -25396 -19230 -8762
5537 -8762 19480 37345 27461 5643 -2281 9863 15684 4688 3870 13171 12292 15655 5976 5567
5523 5567 10727 -9826 -15790 -32710 -27597 -11080 -5190 -3644 -13225 -17003 -19975 -24003 -21085 -9878
5509 -9878 -13745 -23208 -39669 -43412 -40487 -43570 -49369 -51093 -36787 -4378 17063 911 -16770
5496 -16770 -30550 -23853 -15693 -19403 2582 23313 35624 55579 33763 26775 38850 32955 14829
5483 14829 17678 14062 10614 12706 7802 1703 10551 16130 15412 18381 24818 18120 17660 8690 9056
5468 9056 4064 -3856 2947 -5379 -6568 2896 15935 34117 38713 5719 -15573 -7875 4678 24991
5454 24991 13991 -8164 -11651 6426 2226 -9858 -18325 -31221 -36526 -34414 -21280 -31215 -38062
5441 -38062 -32147 -24894 -18027 -13072 -404 -7127 -22110 -17253 1219 8944 6877 1078 -10431 -6861
5427 -6861 8039 20060 10047 25738 42545 26822 7975 -4067 -13049 -15188 -21908 -33233 -14599
5414 -14599 4714 12323 8949 -8852 -15360 -20001 -7259 7523 19485 3818 -2758 -7255 -2119
5401 -2119 -3240 -3787 -1281 1783 14148 20296 29683 28689 15892 13894 22292 24485 19790 21753 11379
5386 11379 2949 -11415 -16004 -11228 13116 12083 13291 21254 11005 17620 27042 14889 35189
5373 35189 35329 9832 -11633 -19439 754 11775 -6972 -8668 8382 7779 -16815 -31343 -25845
5360 -25845 -19951 -14534 -8710 -666 6546 376 -3126 -14001 -18777 -23302 -23092 -29039 -28900 3476 14343
5345 14343 5014 -3410 -18100 -18543 -9097 -13910 -29303 -27687 -25199 -19458 -12803 -9643 243 7086
5331 7086 -11052 -5608 -20912 -20210 -4825 -19142 -34394 -18967 2673 19816 20460 10511 6273
5318 6273 5916 -3248 -8916 -22903 -18361 -20754 -32553 -18021 -9508 -8039 15687 23034 3495 -19251
5304 -19251 -19308 -32540 1581 29144 9124 -25387 -34759 -43080 -41273 -29606 -33655 -24735 -20110 -12255
5290 -12255 -21490 -21450 -26529 -30987 -6229 12762 10153 17785 32409 15002 -22421 -47795 -25007
5277 -25007 6108 18260 -1557 -19244 -21186 -12775 5415 4103 2427 4514 3585 8264 -657 5514
5263 5514 -13797 -9540 -13315 -20842 -28768 -42043 -37511 -371 6571 11894 10551 25141 22788 -7365
5249 -7365 -11456 -20553 -39162 -32905 -16028 -2176 3972 13237 -6432 -14393 -16355 -28668 -24205 -23572
5235 -23572 -23069 -18631 -3330 1560 4363 26029 31785 17228 3587 -4762 -1646 31 -2653 4387
5221 4387 15662 22914 13545 -9477 -23643 -35886 -45854 -25754 -10090 -8241 2869 10886 15155
5208 15155 16676 25927 27159 11755 -7082 -16958 -14348 -27078 -36556 -22453 -9587 17453 12590
5195 12590 2268 7430 11545 -2927 -18726 -19036 1166 11540 14802 -641 2819 7319 3219
5182 3219 -4237 -1015 17552 30821 16452 18424 17348 35221 36696 11713 5299 20474 9077
5169 9077 -8367 -26618 -29543 -34455 -20129 -13883 -18194 -19903 -32328 -26720 -17380 -5359 -11825 -13531
5155 -13531 -3986 -1327 4133 -5770 -29628 -36216 -14351 -25226 -19918 -11695 -20037 -32661 -10988
5142 -10988 -5695 -22179 -11208 -7336 -5071 -15015 -13237 -8276 -15316 -5535 -2307 19598 32340 24622
5128 24622 9725 6123 9999 11998 15529 20863 34550 30416 180 -25916 -32708 -28949 -12114
5115 -12114 -6183 5320 -8673 -19807 -10928 9839 14145 5648 -20910 -37669 -41138 -32897 -16902
5102 -16902 2369 2702 5368 373 -3486 456 -11564 -19074 -8990 -1278 3580 20153 13775 -14755
5088 -14755 -16097 -17836 -21632 -31654 -40352 -36300 -26870 -21455 -6405 -3721 -7875 -8291 19811 30056
5074 30056 6591 -6947 4551 15776 6757 9790 23652 19498 12051 889 6152 12364 14247
5061 14247 5150 -1194 10761 20519 17001 16889 7597 4474 7364 -2426 -8333 -2442 939 -16958
5047 -16958 -9601 -2789 10694 22022 19938 3600 5440 6700 16604 -1418 2671 13566 14883
5034 14883 -7178 -12749 -19682 -23724 -3004 -11113 -16363 -10315 -12433 -7448 -15031 -2628 -1349 -3183
5020 -3183 -9311 -11406 -24047 -20350 -12899 -7445 -13293 260 23802 42542 41006 26180 9753
5007 9753 7699 11308 12017 9455 17776 11905 -6831 -23258 -12592 -21554 -19984 -2971 -14666 -25047
4993 -25047 -29671 -11659 2147 -12002 -15223 -1710 10900 2819 -14338 -364 -1294 5081 8858
4980 8858 27028 11618 4169 -10799 -26410 -32579 -25985 -5703 -7124 -11100 -3441 14367 1062
4967 1062 -18213 -25182 -23556 -10681 -14181 -475 15797 -953 -22550 -12233 1116 1433 529
4954 529 -7283 1748 -5684 4464 19147 5799 -9521 -16032 -27395 -20780 312 -5323 -7194 11879
4940 11879 22034 21251 2433 -17863 -7912 -1460 -9010 -1661 4355 2565 -8870 -27387 -19805 -15878
4926 -15878 -10094 -518 8739 20441 12671 -9185 -10947 -13038 -17296 -9379 -13070 -14115 3 6511
4912 6511 1239 13336 20788 13292 7933 -9056 -8782 -6764 12489 12816 3147 -15220 -14044 -9934
4898 -9934 -3459 -1748 906 -9464 -17239 -20320 -17698 -8299 -25740 -34959 -39105 -27538 -22052 -22949
4884 -22949 -15337 -19491 -25581 -20632 -39192 -45148 -43705 -45558 -45217 -28782 -14711 2590 14496 20968
4870 20968 18459 10528 11234 14506 11312 16418 15855 10450 -20134 -39071 -22957 -6154 -13177 -32568
4856 -32568 -26574 -25981 -20736 -3088 21452 22075 10932 11578 9412 -14843 -35258 -43910 -32160 -18093
4842 -18093 -18645 -25073 -22070 -30342 -21864 -13047 -6866 -28801 -24935 -4695 -3303 -4822 2091 -5545
4828 -5545 -6234 -1885 -11110 -13671 -6175 -4290 -4607 -9649 -4617 -7253 -4915 -2986 3709 2799 -18449
4813 -18449 -20584 -15127 -22122 -22989 -26373 -13579 3339 -9478 -4982 7921 17363 21879 14365 12105
4799 12105 15665 13865 8583 -9266 -15917 -28380 -30878 -18317 -8835 -11388 -9691 -28928 -22999 7969
4785 7969 19534 6357 -9094 -19998 -18007 -9542 -7073 -12299 -2047 4412 7182 2791 -3023 -10375
4771 -10375 -23986 -9396 17138 28818 13878 11775 9930 -9420 -13033 -25009 -16693 -2661 -1087
4758 -1087 -16837 -10502 -1677 -7356 -11324 8420 25893 22633 -9524 -27029 -17369 -7677 12550
4745 12550 14642 3503 3330 -19240 -26151 -8531 -6134 -19409 -23370 -17915 -18114 -24149 -28112 -24035
4731 -24035 -2571 1669 -37558 -39193 -37457 -26447 -25933 -42726 -36213 -4812 10333 -1078 -3519
4718 -3519 -12726 -5940 -5948 -10055 -18295 -12414 -14497 -15469 4254 6613 5645 14347 17740 2512 3192 13871
4702 13871 4437 109 -4276 -1288 5875 10753 9043 15946 15488 11925 2278 -10612 -29956 -7849
4688 -7849 648 -16455 -19862 -24932 -15155 -4090 4384 5255 10077 20389 14819 21754 22920 -1679
4674 -1679 -17131 -22305 -30648 -34214 -14391 9020 695 -11765 6186 11996 10731 3536 -423 -17395
4660 -17395 -24364 -11962 -25066 -17588 -7283 -13690 -10912 -7629 10107 2567 -10108 -800 -3822
4647 -3822 -24990 -14787 -2630 -11880 -6795 -9946 -8254 -24440 -35489 -21292 -18728 -16145 -16859 -20178
4633 -20178 -9774 -27348 -40605 -20438 -16804 -18538 -16849 -35690 -39321 -22187 -5608 -21893 -23679
4620 -23679 1089 12020 11109 -4845 -18190 -13181 -22460 -25759 -30892 -13239 14515 31419 29072
4607 29072 20690 7416 10531 -298 -17039 -4755 -26159 -40348 -21735 -23827 -17915 12077 30922
4594 30922 22214 20031 29122 16984 8619 6479 -26508 -36039 -24004 -5569 7085 8495 10185
4581 10185 -6554 -9291 -1564 -13179 -19858 -17719 1247 21393 12650 -16795 -7071 4162 8521
4568 8521 2712 -19135 -10771 -3118 -9428 6841 4970 2072 2501 -10177 -12824 -763 933 -9404
4554 -9404 3831 21610 25153 991 -3229 -2025 -15914 -40182 -23864 2807 8467 1130 -3159
4541 -3159 -14821 -12095 -11477 6438 16576 12636 18060 27297 36268 50434 46361 31732 13661 6648
4527 6648 -1650 -7574 -16397 -35247 -26004 -10670 -27788 -22118 -11835 -7956 -15623 -25250 -15870 29
4513 29 26821 36803 35843 12308 -6281 -6593 -10482 -15188 -15418 -5985 15274 18544 10338 14875 13088
4498 13088 1059 -1812 -3433 -2958 -5040 -11457 -30765 -28541 -16985 -14726 -10898 6646 1391 48
4484 48 5369 5158 14009 18088 16086 3281 -14005 5310 19956 2813 2011 5463 9354 -6772
4470 -6772 -21111 -10047 -4695 -1964 3899 -1934 -16837 -31604 -29337 -17012 3654 9900 2696
4457 2696 -4446 -16596 -19116 -16112 -11233 -10366 -15003 -31803 -43604 -24621 -4575 -12033 -505 5358
4443 5358 10141 4021 8771 16528 20420 33740 32653 21350 8869 2601 -19777 -16098 -19907 -7102
4429 -7102 7447 5891 9303 -4355 -12948 -5242 -6942 2670 2739 6103 8127 3672 -3868 -4890 -12974
4414 -12974 -10894 -11219 -515 -3580 -10605 -20903 -27889 -9477 3584 1278 9557 4254 -1355 -2368
4400 -2368 -14016 4724 10436 1721 7818 -4914 -16625 -17487 -18903 -15093 -23412 -14104 -15453 -13389
4386 -13389 -11946 5771 4396 8572 16011 19609 30650 22137 30593 47516 43051 930 3077 6557
4372 6557 -6841 -6414 -5905 -2627 -2947 610 1596 -3615 -8788 -2242 -10042 7104 19764 22728 19746
4357 19746 8446 3314 214 -5578 8038 -1188 -11833 -18523 -25709 -18764 -11669 10208 32871
4344 32871 20885 13637 28259 16504 -2715 -286 8268 15244 4306 2457 12704 2994 -23964
4331 -23964 -27486 -20933 -21556 -23357 -1487 1170 -10442 -4669 -4646 -7422 2019 6494 -6570 -25405
4317 -25405 -5040 18510 6020 16586 13012 5295 -7966 -16625 -5087 -8863 -18579 -19197 -8595
4304 -8595 -10901 -24572 460 12612 13928 15785 -9072 -12260 -7352 -11178 1316 8934 15395 7437
4290 7437 6973 9264 21420 1229 -4678 -4027 -8704 1995 -9736 -18766 -16571 -7498 -3708 -32652
4276 -32652 -50922 -27518 -23534 -26962 -26155 -18147 -10845 -3950 4424 35624 28091 -982 2323 7985
4262 7985 -2071 -10410 -2222 -6155 -5970 6573 11484 13296 2145 -4101 -35222 -63533 -44867 -27920
4248 -27920 -20546 -13996 -3909 -7370 -8397 -3530 11666 -2919 -8503 -875 -8006 -7679 -19212 -9010
4234 -9010 4972 21124 9383 -347 -2447 13353 11228 -5149 -6937 -21254 -5810 31958 55842
4221 55842 57427 31781 31560 2314 -7169 -19283 -2876 -14221 -23262 -22174 -25043 -29197 -39396
4208 -39396 -26512 1581 21163 4538 -21505 -8888 -4660 -15641 -20777 -29584 -25267 -13161 6504
4195 6504 11720 20211 10267 -3004 -9039 -3506 27460 26315 13214 3156 24203 23039 13106 -11914
4181 -11914 -5734 -17535 -33835 -14835 -10045 -29119 -26189 -33766 -48968 -38682 -29791 -32222 -28725
4168 -28725 -14948 -15477 -11462 4963 -6601 5789 20041 36415 30558 39836 44152 35070 33729
4155 33729 38915 33067 18627 8075 -11605 -12068 -13501 -11259 1975 13091 14487 7493 18454
4142 18454 22994 6639 -4562 569 3803 16762 15546 31035 31414 17537 1224 640 -18219
4129 -18219 -22793 -12532 -1807 -1757 7629 8557 9589 16934 21199 15579 14782 8815 -5079 -3161 -4364
4114 -4364 886 -946 -2901 -12042 -16034 -18065 -9728 -16368 -13142 13642 9578 552 -2834 6122 3233
4099 3233 419 -9479 -22066 -14401 -19546 -25496 -19972 -14602 -8701 -5711 -453 3833 1312 -11733
4085 -11733 -19265 -35089 -32048 -11685 9419 29314 22078 2146 -11054 -11193 -3066 -830 -4055
4072 -4055 -14669 -19408 -7546 -2556 -4836 -4413 9455 7936 10437 9976 2546 -15601 -21487 -17738
4058 -17738 -28191 -27298 -30825 -30135 -23569 927 -1008 -15717 -37884 -53941 -33448 -14175 -18223
4045 -18223 -33598 -14527 19672 38231 17309 -13818 6734 21689 -1841 -8909 -11631 -23684
4033 -23684 -13100 -17757 -11876 -621 4085 -8128 -23030 -22508 -17575 -17266 -14216 -7188 -15873 -11741
4019 -11741 -18982 -27216 -40851 -35652 -21120 -21751 4917 6219 16287 -3109 -15416 -9972 -16288
4006 -16288 -39050 -33884 -13983 -9357 -1364 8087 -3899 -22966 -27696 -12810 -10034 -4535 -5228 15605
3992 15605 22819 10168 6090 8934 -7872 -15267 -12878 -26029 -19528 -22382 -21232 -12990 -2337 -5507
3978 -5507 -21951 7366 15417 -16517 -5285 11917 11914 5289 -679 -3992 10696 17301 12745 -9298
3964 -9298 -22350 -19825 -15084 -11730 2182 7837 10720 -942 6143 -4248 9033 33320 25121
3951 25121 26253 35775 18012 7316 5595 5256 -3254 -540 11519 4458 -27581 -8569 -280 -3306
3937 -3306 -3361 -3221 11379 22322 21195 26341 29913 17098 956 1311 9501 -1009 4457 13636 26818
3922 26818 44994 40781 19272 17795 8984 2393 -4336 -10888 -13346 -4322 -10349 -15139 -4632 4401
3908 4401 5043 15102 31481 32061 11470 -3478 -8032 -10582 -9067 189 10128 18670 31730 25420
3894 25420 -10774 -18350 -10589 2765 9123 11689 -5206 -10980 -91 1772 10225 21243 24454
3881 24454 36496 24328 13431 6643 3012 -9374 -16159 -6783 10300 215 -24722 -22765 6244
3868 6244 14568 14419 16105 14382 26301 28711 12032 -21939 -30304 -31459 -29273 -18497 -5229 6689
3854 6689 15009 13720 3873 -1539 -211 4219 7156 6412 14498 12593 10943 5140 -291 11964 3904
3839 3904 -12881 -9275 -6514 16432 35105 23430 10859 -2313 -1748 -14538 -12469 -8745 -12874
3826 -12874 -7537 -6393 6340 21477 21640 177 -18092 -23957 -23441 -32128 -21881 -5967 -25821
3813 -25821 -34254 -19699 -14699 -458 -2328 -20622 -34042 -24609 -10219 -6541 -5766 1328 10568 21714
3799 21714 20074 3027 -12961 -5917 -7863 -25838 -27248 -13281 -13940 -24790 -12863 -3173 11951
3786 11951 9105 11171 -2554 7532 15132 24332 3538 1978 13947 11877 21172 24041 19362 -194
3772 -194 8048 5095 6984 17671 -4297 -22327 -20016 -11165 -5872 -4457 -9734 -1476 12288 -858
3758 -858 -3367 2252 -9564 -7080 -8533 -559 11738 2792 11666 6866 -13927 -10047 -14405 -24944
3744 -24944 -23456 -11443 -6346 -879 19809 13341 25934 25903 22192 9858 -1491 -3890 2372 15802
3730 15802 22584 18924 14455 11074 16383 -6195 -23493 -15000 -5953 -1587 -10348 -15843 -14979 -28761
3716 -28761 -16012 -5284 -384 155 -13560 -9474 -5031 -5585 -549 -1769 -8050 -23361 -39343 -37652
3702 -37652 -23218 -16008 -4634 -3167 -5189 9522 15670 772 5645 18108 21544 13917 6519
3689 6519 -16404 -19248 -13545 -20638 -14955 -229 12056 -438 -4505 -18132 -15017 2757 -901
3676 -901 -9146 -15127 -16125 -11268 -14354 -8807 -1559 -4654 -11484 3179 -4250 -13285 -7311 39 -13632
3661 -13632 -12721 -8971 1908 5859 8997 22360 14889 -19738 -26914 -18815 -15196 4783 13465 14569
3647 14569 28469 21296 17338 -99 -7688 -6256 -1370 -6612 -15550 -18016 -12089 -7167 -13688 9903
3633 9903 3783 -6718 8589 -2109 -26848 -31421 -23023 16999 27346 31857 22825 14690 16494
3620 16494 7542 11510 5870 -17191 -9980 6065 109 9013 11511 7142 -2383 624 -1145 9219
3606 9219 6316 -14529 -15252 -22619 -46055 -27632 -17736 -10733 -1957 -9586 -4334 -11091 -14452 -19762
3592 -19762 -14294 -16984 -30693 -33747 -44015 -52482 -33625 -31644 -11227 8259 7158 8795 10812
3579 10812 5392 -9972 -23867 -19332 -4090 12716 5650 -30816 -27767 -7406 -357 3720 20896
3566 20896 12572 32238 40302 22686 20939 28374 30283 19947 -2753 -16578 -6627 14455 8377
3553 8377 -11744 -15549 -17111 -18268 631 9976 17758 21858 15053 18910 9959 -9163 -16150 -7000
3539 -7000 -4696 -16643 -23607 -14108 -2829 -15944 -9334 -18569 -27216 -5468 16539 19720 8146
3526 8146 -14336 -12313 -9895 -7479 -1604 -2363 -8063 -24234 -17096 -9053 -3954 12903 12229 -1242
3512 -1242 -11301 -14308 -29865 -15074 8669 19667 6900 -2563 -14102 -17696 -27069 -37711 -31576
3499 -31576 -21972 -15823 -27286 -11246 2808 -4585 413 -5345 -15879 -6252 -10140 -15459 -32766
3486 -32766 -17730 9468 29674 23716 18355 6395 -7424 571 18722 8797 3829 7033 -4893
3473 -4893 -3176 204 -3613 13366 8619 -979 -21548 -14335 8679 13077 20929 21532 28872 22689
3459 22689 7804 -13520 -13647 -2211 4592 3946 -1144 -18793 -22301 -12554 -10875 -16364 -11865 -1003
3445 -1003 2167 -3317 -8465 -36179 -49432 -45128 -25884 -7073 7161 -19322 -35105 -37568 -35673
3432 -35673 -19601 -10250 -3233 -19649 -33855 -6609 9904 4965 -4852 -3313 1882 -425 -9081
3419 -9081 -8021 9204 -7485 -22682 -19580 -13284 -23418 -16498 -20951 -18918 -8036 -14672 -19803 -27453
3405 -27453 -19962 -6920 -1078 3080 -10657 -16074 -21856 -10412 34 15379 -7267 -10139 -5318
3392 -5318 -1951 -16149 -13687 -14299 -14080 -15247 -23081 -11249 -12861 -14228 1191 18351 2702 -18567
3378 -18567 -1623 21279 17083 2836 -6897 2914 12645 15639 16602 11172 9748 29117 19344 -2602
3364 -2602 -977 18319 27266 25884 25462 15859 21765 19245 2607 5422 15748 13720 31147 29743
3350 29743 24568 26004 32092 24574 3845 -7737 -8104 6537 6062 4970 6649 -3563 -30245 -41989
3336 -41989 -42776 -41558 -22395 -22687 -11814 9091 24157 13485 -5757 -199 2348 3445 16452
3323 16452 6372 3885 16318 15905 6229 4933 -3524 -4507 -16183 -5091 -8355 -4523 9191 7797
3309 7797 19961 19418 -762 -18391 -20808 1624 -9902 -26455 -28645 -25925 -5389 534 6203
3296 6203 8662 -1321 -5367 5020 17433 -2365 4326 -595 1866 -9224 -23243 -13576 -7083 1727
3282 1727 -8194 -1515 9197 -1270 -8202 12487 15430 4870 7152 -8015 -7163 3539 4117 -1877
3268 -1877 -7664 -13240 -18149 -13393 -19246 -10648 702 -1469 -2200 -7825 -13107 -4591 2774 -8017 -8168
3253 -8168 -4357 20832 19176 -5974 -15375 -1860 13486 7315 -9109 -22845 -32257 -30261 -15622
3240 -15622 -1351 17664 22253 20389 11507 -3213 -13545 -23484 -17518 -16476 -14680 -18704 -16637 -15319
3226 -15319 -2696 -10029 -14022 -11001 -5713 -6925 -1062 13886 11555 8256 -5229 2531 -313 6626
3212 6626 24416 21274 8271 -9663 -21031 -38278 -5012 19444 16511 4411 -5710 -8045 -13683
3199 -13683 2530 18452 17258 -9294 -10229 -16187 -15335 -13928 -34850 -31626 -4525 7292 21796
3186 21796 8223 -19282 -32955 -38048 -26010 -18220 11027 37613 28912 38539 37011 15843 29119
3173 29119 26826 26536 20719 4219 25999 36309 27802 10324 -3386 1760 -708 5082 -9039
3160 -9039 8003 27733 29607 10900 8954 13485 5073 -6903 -8442 -4454 10188 -7565 -14112
3147 -14112 -22808 -30024 -32453 -22420 11569 17548 8621 -752 7643 -2602 -15466 -17360 -17822 1872
3133 1872 -314 -9355 -5052 2598 14089 8353 -15818 -12493 6945 22563 19248 11493 -6907 -15224
3119 -15224 -20981 -29183 -21578 -17059 3210 16237 661 -13025 -10883 -133 19195 14831 10293
3106 10293 5192 -19155 -10860 -5148 -13173 -6003 4625 14029 13412 6175 7182 15458 27222 29114
3092 29114 14058 -8149 -9637 -4342 5998 11374 10974 -3539 -37435 -54804 -42338 -26963 -21411
3079 -21411 -20484 -14540 -18709 -19477 -1582 -6440 4813 24730 33511 23390 11686 9424 2157 3163
3065 3163 -673 4631 11042 -1456 -6681 12591 13431 -654 -13988 -20054 -11946 2528 -9948 -16562
3051 -16562 -24009 -15631 -16898 -10941 6015 873 -4100 -9000 -8981 -5598 -6070 -15011 -17381 -15993 -15600
3036 -15600 -10779 -7783 -13337 -5657 -26324 -39835 -29853 -16264 -8600 -10218 -5620 -9125 175 -3511
3022 -3511 -15211 -10043 -3283 6725 15242 1108 -11216 -15972 10861 21479 7751 -8832 -24487
3009 -24487 -39082 -22560 -7360 -8750 -8430 18217 21362 15073 3754 -3198 10515 -5754 -7797
2996 -7797 11529 21851 17492 4809 432 -4815 -13427 -3567 1162 -23917 -21324 -18079 -15054 -14122
2982 -14122 -25627 -28886 -13875 1946 16713 19505 16934 8382 -1645 -3352 -4706 -6202 139
2969 139 28254 33481 19027 18127 16151 13388 22811 10403 -11489 -2843 -8241 -7790 -10236 -6755 5677
2954 5677 20125 22051 24363 15064 -4844 -5189 15362 25832 21953 22527 11794 294 600 -5562
2940 -5562 10796 3572 3293 19723 27885 37296 44242 39603 23441 25103 4572 3088 1328 6020
2926 6020 -7579 -26909 -23834 -3971 4331 21039 23526 3329 -19161 -12477 8447 17291 18323
2913 18323 17571 21062 22875 12987 11892 1788 2560 6831 -5743 -3528 6129 10728 16780 6487
2899 6487 135 4447 11056 10250 23651 21935 16211 9839 -2346 -11961 -9694 141 7492 12848 8794
2884 8794 6054 -17526 -33024 -33079 -21505 -2876 5935 4991 5687 8102 25752 20141 -360 4253
2870 4253 12902 16630 16409 14487 13139 -666 -6483 -148 -20848 -37244 -22060 -6238 -5529 -6195
2856 -6195 -18746 -17283 -32295 -29553 -22137 -27203 -17920 -29799 -33832 -18326 -8791 -7109 6564 8814
2842 8814 12193 -9677 -26357 -21729 1271 9289 -320 3693 -12385 -14245 -8226 1812 -627 -10178
2828 -10178 -23222 -31017 -32536 -7782 18614 -2306 -30483 -37464 -34322 -28271 1602 13487 2263
2815 2263 -15032 -21334 -5571 -7785 -16125 -30089 -5693 9294 -509 6048 7587 9417 -10639
2802 -10639 -7815 11106 13750 4541 -24580 -38115 -33369 -2211 21925 4748 -16607 -36221 -37689
2789 -37689 -29705 -21203 -22571 -20352 -28721 -25520 -10263 -12959 -13720 -4929 10655 9695 3059 -10321
2775 -10321 -9758 -6399 -9993 -18382 -28186 -28387 -11107 5731 -1358 1311 15374 20727 1690 -18933
2761 -18933 -15305 -12314 -9474 7921 20800 23688 33900 18986 13450 33739 32517 23500 39006
2748 39006 43367 19469 -13914 -25843 -25166 -39152 -22813 -472 901 8827 74 -21366 -35314
2735 -35314 -24896 -17890 -12706 -14664 -24705 -18002 -9440 -4448 -11122 -19256 -15066 -15423 -18635 -15880
2721 -15880 -12356 -11357 -19338 -18393 -16938 -23339 -33501 -48028 -42196 -18416 -14454 -10176 -2645 -7420
2707 -7420 -13280 -26545 -34153 -14470 561 -37 5594 1326 -9550 -6673 8507 19305 8012
2694 8012 -18081 -32588 -40194 -26016 -12057 -1646 9225 17261 31151 31859 27935 41301 51343
2681 51343 45461 40866 15097 -5151 5748 27685 19520 6309 12009 9832 9629 17168 15868 10212
2667 10212 -1678 -2055 9760 19495 20250 23700 6810 -16553 -30779 -15470 18237 26128 14589
2654 14589 -8767 -25023 -17522 6655 23794 25385 2451 13220 2468 -3305 -1457 -12664 1948
2641 1948 14310 10563 11677 -6152 -19397 -32515 -29059 -8894 -10589 -9012 -1604 -12647 -23543
2628 -23543 -16814 -23254 -28016 -22816 -6093 4795 -12984 -14338 3409 14657 30475 11515 -2183
2615 -2183 -3342 -4484 -5802 -5376 666 1320 -10865 -16059 -10896 -7592 -13056 -14750 -18242 -25564 -8123
2600 -8123 11474 3613 -6693 -4341 -15462 -3506 503 2276 5231 9855 13537 8276 14030 -6904
2586 -6904 -21729 -23571 -13808 -21542 -29597 -22527 -965 22802 20550 15503 23804 26464 10431 -3688
2572 -3688 -7426 11272 24208 14154 4532 -6076 6609 2960 -595 11875 16105 20587 25892
2559 25892 19158 8282 7099 9835 20644 10586 8664 8305 1712 -6014 -5087 12456 13581 21465
2545 21465 14690 -13 4242 9021 125 -19143 -12967 -4760 -4276 -192 -27435 -22574 -22468 -21413
2531 -21413 -10277 -21563 -16959 -17070 -1187 -7838 -25891 -23093 4397 28381 34925 23576 21289
2518 21289 3070 -23252 -15755 -6895 -312 -9791 17491 25578 24704 20652 17724 21423 14920 5309
2504 5309 -9236 -3029 -8696 -8111 -8265 4830 23322 19982 1153 -6204 10777 11508 1201 10590
2490 10590 12649 -3710 -10765 6172 6036 -7191 -7581 -17994 -34387 -16051 23797 36013 27877
2477 27877 31150 30115 18298 20500 16089 11552 -1250 -13303 -10084 -9978 -8444 17089 9376 -4430
2463 -4430 5112 13860 8775 13277 10162 7456 16730 16577 23998 3152 -20948 -3489 -241 12233
2449 12233 23686 26738 17622 7199 7120 15492 8784 5389 21252 19746 27563 24229 38546 47546
2435 47546 32357 29172 27094 13501 9151 11006 3529 -13574 -6500 19162 19792 6051 18174
2422 18174 21425 -2729 -7046 -15144 -1785 -4 5369 -3092 13190 18435 39318 44662 40486 19018
2408 19018 -5143 -10613 -15758 -2583 5754 -7342 -29539 -38421 -28738 -10563 2579 1215 6206
2395 6206 9421 12968 15784 23833 2547 4924 10261 28041 29689 20838 22620 21386 5735 -9171
2381 -9171 -18107 -21855 -27004 -32497 -32922 -14003 -4691 -1555 -3122 6022 14499 9375 18850 13128 1449
2366 1449 8068 12219 10664 2805 -9539 7386 4279 -2666 7197 14666 21591 -5975 -18870 8020
2352 8020 25338 37614 17649 107 8933 21026 29529 25938 23064 17915 11462 -2388 -11758
2339 -11758 -4984 16500 14850 7434 -3907 -7799 1630 -4253 3532 13251 17489 43896 32190 7443
2325 7443 -1193 11373 27550 23843 22281 6488 1791 -295 -4656 -9583 -10290 5534 4053 2744
2311 2744 -10823 -31248 -46116 -40842 -23963 -15918 -34868 -20695 531 -513 4763 19808 6574
2298 6574 12425 10262 9939 -3013 -26202 -25416 -18205 5399 -1531 -15642 -20363 863 19257 23863
2284 23863 11051 -10210 -10288 -27956 -22343 -12442 -14596 3037 16315 30015 44815 54608 45539
2271 45539 45527 38883 15929 7731 11934 32424 38608 55252 76138 73359 40898 39103 33995 11877
2257 11877 -2874 -12887 -3179 -7162 1052 18993 18455 4434 -4284 4672 9677 17913 24227 18342
2243 18342 5502 5398 10406 2382 19622 39565 47119 38594 23095 8694 10010 5037 1174 8531
2229 8531 -1495 160 1059 -7610 -12422 -29117 -28685 -34296 -33828 -34272 -30036 -5818 22044 44005 24334
2214 24334 20852 32360 24529 763 -15781 -22616 -20973 -4291 173 6870 15450 9476 -2638
2201 -2638 4903 27939 23677 12716 12623 19111 14908 3556 -5332 3778 6087 16805 13350 3120
2187 3120 3337 -11988 -13902 -12799 -13294 -22763 -9015 22361 35330 13263 13545 23996 29620 31105
2173 31105 24625 19266 8569 -11612 651 3602 -6674 -16928 -2493 892 2236 -8879 -21992
2160 -21992 -22354 -8589 -2754 -6832 4446 -3025 -11786 -8964 -13203 -20694 -12941 -11012 -36498 -39561
2146 -39561 -19451 1502 3741 -6603 19849 21456 7857 -9171 -22826 -25554 -16507 5116 23027
2133 23027 30406 20167 31580 37900 3459 12485 30187 37638 36415 16033 17568 12598 -5529
2120 -5529 1547 -7271 -30031 -21914 3229 27096 30097 11247 -2651 -13673 -20225 -24189 -20721
2107 -20721 -12713 -20155 143 11642 -8658 -16836 -4493 -4878 -21255 -29907 -27904 -23119 -16749 -7277
2093 -7277 -31821 -23627 -26166 -26865 -2384 13352 10644 1197 12393 30535 17069 14706 -7043
2080 -7043 -11059 3053 7256 11871 285 -1623 -2338 -11947 -12253 -3629 7113 5445 2561 3713 2578
2065 2578 12742 37077 45368 33051 12050 16048 7322 -1072 -17470 -8836 18941 5910 -20180
2052 -20180 2861 7911 -1294 -5033 12789 9002 -1770 -12854 3236 10033 3417 -5694 -7119
2039 -7119 -18873 -22167 -10918 -4463 -1905 10136 14283 8541 947 3814 9421 16361 14010 -6060
2025 -6060 -12072 -15057 -21338 -12823 -21724 -240 9899 -6873 -10927 3328 39120 50668 50761 44921
2011 44921 30732 8472 -8252 -11273 -25369 -15547 -3369 -3199 3968 9361 20730 22955 17749
1998 17749 17021 11555 4987 10784 -6985 -23778 -28065 -12382 -1269 96 -11234 1065 -6232
1985 -6232 -12775 -18158 -8977 4775 4446 3741 5056 -5523 -934 -3960 -12184 -403 9696 14611
1971 14611 6871 2029 7498 -6067 -12497 -13067 -10006 -5232 -2975 -19569 -23915 -11269 8105 22777
1957 22777 -4701 -10681 -4784 -963 14673 21687 25900 13469 -1852 -22597 -38258 -25002 -23787
1944 -23787 -24087 -19349 -14350 -936 20748 12940 6224 406 7741 7210 4502 24846 28589 26043
1930 26043 19203 -2209 -4525 -22944 -30176 -11134 7203 -1083 -1882 6073 14992 22164 19180 9568
1916 9568 2824 24010 30205 16780 -1863 -3651 -2769 -9798 -551 4994 -9175 -188 243 5398
1902 5398 8978 8754 5225 -15279 -24816 -5144 -2265 -5464 5292 9451 13375 4706 -12710 -23189
1888 -23189 -15730 -28220 -12499 -8207 -10808 -10858 -20476 -7639 -13280 -20052 -24065 -22851 -38194 -37037
1874 -37037 15652 38524 24303 17073 12231 12728 13189 7122 -5414 -7007 -8132 -13208 -5006 14471
1860 14471 11912 18576 42140 61335 50612 29065 538 56 -12456 -9669 -9083 -12623 1882
1847 1882 5298 3091 -6022 -11476 -7059 6036 10854 13146 22380 18051 4129 -7495 3206 20590
1833 20590 34491 36239 20978 -1416 -12293 -27830 -23707 -14043 4716 6950 -481 7626 7003
1820 7003 2392 -8793 6260 22266 38963 33075 22845 18630 21192 29035 32097 20623 18864
1807 18864 8805 -8835 -12361 -743 -4685 -6620 10099 17041 16746 23085 29196 21219 24869 24410
1793 24410 19253 20092 9294 19133 18686 18701 14099 15383 7716 11655 24109 37269 28172 18341 11210
1778 11210 16321 25279 20140 -179 3789 -5201 -4774 11836 18948 8418 3394 19919 25054 19989
1764 19989 13080 15865 16750 10285 -13858 -24666 -16826 -10666 -10408 -34448 -20960 -10553 4597 16741
1750 16741 24101 30640 8709 -13090 3257 8461 1209 18034 23770 8870 -12651 -37325 -22937
1737 -22937 8554 19812 23044 -1411 -7715 -2909 16084 36318 43482 26710 8218 -6941 -12132
1724 -12132 -7264 1587 7654 3659 -7964 -8779 -10951 -10746 696 -4240 -20549 -18125 -7902 1089
1710 1089 -7105 -5031 -224 590 5059 -2065 -1897 2363 6470 -4618 -26630 -22762 -2633 9886
1696 9886 15183 3742 5811 19744 11016 4595 729 6733 17015 14506 6843 -2505 -17599 -28695
1682 -28695 -16586 -2080 17227 13531 10377 23646 18939 4417 4144 12980 20252 1480 -15696
1669 -15696 -20639 -25255 -31546 -8651 -3960 -15271 -7857 -6260 -21050 -32217 -19714 -9671 4651
1656 4651 9104 12983 6132 -10085 -17401 -22392 -1291 8970 17500 11065 -113 -12215 -8780 -10753
1642 -10753 -21990 -33762 -39545 -40583 -21889 -19950 -6493 182 -2051 13450 38526 26313 9318
1629 9318 22532 22283 7149 -2295 -11271 -6405 -20033 -34194 -10773 -7659 -534 -12769 -3251 7360
1615 7360 11363 8496 5802 5348 19942 23952 14754 11689 23257 53179 67566 63695 44797 30546
1601 30546 11296 1414 7164 20079 17729 25119 25538 21449 9929 7267 18383 24678 18815 22598
1587 22598 21872 30808 19213 2169 6289 21265 21310 -4303 -28482 -35530 -21167 -11758 -25372 -19051
1573 -19051 -6410 8705 21008 11380 5101 -11559 -24680 -20537 -12541 -4484 19249 11567 -18827
1560 -18827 -16079 -7369 -4058 -7020 14192 26279 26294 7624 -7855 -18712 -23790 1388 15873
1547 15873 15976 4376 15424 19735 3702 -7882 -2761 -2328 -22792 -35510 -37104 -31527 -26256 -9978
1533 -9978 -10232 -20611 -23093 -20208 3011 16217 13446 27588 19722 18105 28744 4997 10021 7928
1519 7928 -5496 -10392 -2478 -13877 -14617 -9889 -7747 -5010 5098 -17438 -35130 -23560 -18782 -15221
1505 -15221 2576 9113 6054 -7752 -20464 -18579 -7943 -3052 491 -901 2352 -5122 10471
1492 10471 29769 18139 17694 23562 8986 5817 15596 27370 32469 15427 10641 -6020 -6906 -15109
1478 -15109 6286 32355 34663 45503 30085 15658 11971 -5723 -6066 6270 -5398 -6687 3607
1465 3607 -902 -7671 2091 6422 2640 -3361 2467 -7595 -7441 -9258 -21950 -28663 -25214 -15014
1451 -15014 -6612 -1309 -18873 -21667 -7689 10185 5577 4206 -1644 9138 19801 12274 -8152
1438 -8152 -13193 -5658 1163 -6668 -18473 -3477 7146 -3705 -12662 1928 16169 11825 15044
1425 15044 18481 12500 79 3900 6370 -4177 -7285 -9989 21319 31514 17108 1051 -6962
1412 -6962 717 -4955 -739 4718 -573 -14829 -11860 5189 14598 15731 12086 15915 35286 45469
1398 45469 29095 18691 19577 16066 21156 25956 4059 11890 30466 47889 59039 37608 30739
1385 30739 32044 16961 26758 43488 37274 19868 -186 -2539 14233 24387 14314 -8798 -21032
1372 -21032 -20868 -19023 -10327 -781 13945 19994 -1111 -22447 -13038 15648 22758 -556 -389 13447
1358 13447 21790 17049 2817 -5132 -15671 -23764 1892 12394 -4798 -4478 8251 -1351 -10193
1345 -10193 -11178 -842 -2399 -6972 9628 15511 6768 -6670 -4413 2110 12855 20296 22518 8053
1331 8053 10725 13440 21679 -5124 -17763 10511 4015 -2620 -5820 -9696 -7254 -14038 -13852 4861
1317 4861 19515 12878 -1483 -3283 -16 16770 8747 -12385 -23442 4136 16198 11181 25085
1304 25085 32637 26418 11410 19548 25848 25367 14419 22810 24173 17236 26846 26577 9886 14026
1290 14026 24797 7500 1779 -3293 -15753 -20979 -21044 -22167 -15629 9313 7209 20586 18504 10067
1276 10067 7261 7729 4678 16 11095 10375 2438 -12033 -25946 -21341 -21214 -12775 3821 3616 12153
1261 12153 7782 -701 6175 16638 7308 15247 21504 -1367 -4924 6117 -5079 -11 15345
1248 15345 7469 6915 18145 5148 -12251 -14116 -20406 -17361 -10339 -14092 -21857 -10412 -7858 -12927
1234 -12927 -8971 -3256 12941 2663 -12541 -10595 6009 12182 -4917 5081 10805 -2981 2471
1221 2471 16291 5380 2971 -3381 249 19226 29646 42109 30986 22241 39054 39677 25532
1208 25532 20193 17053 19134 23731 7302 -2462 10126 23593 20327 31201 46227 30404 13137
1195 13137 34620 45516 38147 19524 2124 -12645 -14355 5528 9985 17554 24763 16538 -6185
1182 -6185 -22949 -9128 -2869 -8114 -18615 -899 12149 -3382 -4942 3783 17598 20125 15067
1169 15067 8193 9635 12321 22604 32693 18636 -476 -15672 -26749 -21050 -8503 -6568 2207
1156 2207 29584 13972 -2827 -20296 -11452 -6927 -20948 -26169 -5399 -1847 -145 7210 23920
1143 23920 28674 13256 18957 8226 6522 9671 -1220 2511 8465 17167 17732 -3182 -28134 -37612
1129 -37612 -17302 -15371 -15865 -210 19388 13332 4823 -951 -9016 -5979 -7784 14915 39460 43712
1115 43712 54887 48214 35315 20208 3537 3297 15567 22612 22045 12088 -10740 -20224 -4119
1102 -4119 2266 -3043 -4310 3561 3311 -9587 -2055 10107 24103 42501 40680 22566 6037 -14619
1088 -14619 -29996 -24656 -21883 -18778 -3996 11774 17227 11260 2782 6067 16723 19810 23530 14633
1074 14633 14424 9561 8833 18562 22926 11155 -8233 -22094 -18002 -3621 9758 13672 25169 26778
1060 26778 37234 36486 18046 18231 16900 13702 22573 -8621 -29437 -23670 -7813 11119 14595 12335
1046 12335 -2243 -14721 -7473 -9785 -2943 5403 -16244 -12830 -14915 -3353 7370 4757 8842
1033 8842 21978 36217 25954 28934 21273 -3033 -4798 -8767 -11252 -2046 -3420 -20622 -17740 -25675
1019 -25675 -9796 -12745 -11857 1727 4540 -754 2440 15400 27163 22847 18158 6797 -18086
1006 -18086 -30904 -24094 -15524 -7032 -11089 -15569 -16653 -7498 5541 -1034 -11137 -14069 10437 33803
992 33803 35555 22387 2830 475 -2854 1173 3515 2863 -5209 -1719 -8553 -17837 -2402 11253
978 11253 45311 52273 36952 30247 17745 28763 34528 26707 28138 22136 17487 14399 3392 -3183
964 -3183 25635 37224 46498 35074 22709 30510 27388 11230 23195 28172 27582 24803 20130 8079
950 8079 6748 -357 -10347 6846 15709 2119 -5669 -8972 -14845 7678 1976 -19988 -23413 -25444
936 -25444 -28614 -6047 -770 -17059 -6630 -12973 -31550 -13722 1474 -8030 1279 9231 15525
923 15525 21845 4500 -848 -20444 -28822 -12716 -3429 -4387 -1079 8155 6002 -1264 5454 -2833
909 -2833 -15865 -21738 -6539 15230 16090 10055 5863 3681 8280 9385 6050 10837 2516 -4850 6212
894 6212 19552 9095 -6841 -6090 5765 -3146 15670 40469 53776 46706 47443 39004 17940 5261
880 5261 -4716 -17323 -28002 -28737 -8179 -8870 -11059 -18939 -3760 -7999 -19384 -7828 -16974 -8956
866 -8956 2560 3963 -2758 -16575 -10338 30200 43345 29046 11745 9462 4516 -6453 -6154 13944
852 13944 3965 5600 23820 27842 22403 5494 853 -268 -1281 1301 -2716 7694 9965 1792
838 1792 -2691 2101 -3356 -9150 480 19020 17719 1856 -10418 -7955 2398 14743 29684 27692
824 27692 19876 13696 -12862 -13449 -16803 -36059 -39279 -35738 -14657 -1418 4107 18399 6268 -7950
810 -7950 1510 10401 10262 5220 -14273 -19103 -7556 4135 518 18573 14840 8571 3362 35388
796 35388 53954 40695 28944 15342 -13339 -15746 3492 12604 2603 857 -8490 -5714 1494
783 1494 -2327 11353 10756 -10798 -15777 -4862 -17479 -1892 23911 6270 135 -3222 5665 28049
769 28049 39046 15547 1903 -3098 -3475 -8988 9219 10638 11209 20251 5296 -365 -14335 -4522
755 -4522 5147 15232 -3412 -29853 -25282 -22111 -34461 -25591 -15072 -13865 -24522 -25001 -9956 -1859
741 -1859 5206 -4249 -31046 -26537 -7778 -13857 -9875 591 -7923 -3050 9321 -3473 4979 11001
727 11001 12544 17482 21574 33008 26110 4428 3183 96 3393 2816 -12493 -29730 -42464 -30241
713 -30241 -28929 -26329 -20453 -8813 -8028 -9657 -14689 -20666 -15954 4331 4832 11167 18272 13121 1113
698 1113 -329 17300 11397 -12550 -34955 -26901 -19595 -29730 -33593 -27291 -12407 -12051 -10291 3895
684 3895 837 -5546 6780 15748 15847 13661 3471 -3693 -12741 -10610 9573 16722 20027 4370 -16415
669 -16415 -22836 -14092 -28176 -22734 12167 11474 -468 -13678 -5678 -1322 10514 16598 10225 -1410
655 -1410 9137 14856 6402 184 -8591 -4093 3906 4884 -7719 -1309 -10196 17446 24999 21169 10606
640 10606 -11817 3674 244 -9937 2280 18141 5026 -27420 -4326 10227 7380 -3021
628 -3021 10299 26364 23956 17159 6761 7007 -1587 -6862 -1396 -9007 -8571 -817 -140 -13104 -18885
613 -18885 -5113 19035 42252 30725 20990 18837 3238 -6623 -6588 -3276 16007 1955 -15389
600 -15389 -17131 9590 16614 22619 11934 -10623 -23530 -20168 -2071 28952 13692 -11165 -6361
587 -6361 6651 10800 7643 579 -4693 -9843 -10633 18943 26049 13913 12414 11147 2977 -2357 1461
572 1461 6619 10105 7096 5632 12379 8871 -287 5000 10529 -9250 -19279 -33341 -31859 -23273
558 -23273 -15400 -10277 -7934 9313 6943 -15866 -25054 -20508 -5362 6241 2786 3307 5672 2808
544 2808 -10276 -4026 9709 20 13376 32477 16845 23964 25249 19525 15472 6889 9191 7657
530 7657 -7848 -7883 -2277 6237 -496 -6081 -8323 -11081 908 9748 -4376 -3587 -4301 -17032 -10663
515 -10663 -17552 -30407 -34251 -17031 -1217 8602 12180 4815 -13212 -12533 418 20735 37423
502 37423 27134 5476 -2658 -811 -2868 -25521 -51873 -38487 -17737 -7981 -13500 6423 3059
489 3059 -3317 -1040 19718 3059 -4610 3548 3093 7059 -1675 7403 8177 3462 2480 7065 -927
474 -927 -6001 -9092 -12213 -9791 1791 4478 -35 -22931 -22773 -10005 -14733 -19861 -22693 -18806 -19236
459 -19236 -8297 3222 13047 17315 18625 9251 10281 35643 18324 7137 14840 3187 2356 -6402
445 -6402 -11990 8255 8048 -9696 -12767 -17650 -22671 -18787 -408 13353 19092 20472 23499 12536
431 12536 -11237 -24741 -23152 -19841 -1024 6974 6870 13824 20761 16361 5820 7674 534 -16773
417 -16773 -20173 -12767 -26274 -34320 -11694 -13007 -27349 -35204 -19396 -5963 -3002 -4626 -5762 9521
403 9521 2415 -25053 -43013 -29962 -18476 -24869 -20664 -29152 -17267 -3 -7576 -5730 -1247 9874
389 9874 20866 18425 33303 37115 22708 27366 27740 14971 9081 -6418 -27426 -27738 -11430 610
375 610 1384 344 4536 21899 19087 6404 7780 -7616 -1123 5969 9162 16249 17332 6348 -4056
360 -4056 -2576 -4595 10659 15016 14348 -220 -17298 -14213 -16633 2690 17336 15411 -174 -17317
346 -17317 -24460 94 20974 9519 7170 -13086 -12852 -2718 -16703 -16422 -13003 -15108 -18822 -24488
332 -24488 -32487 -28013 -13295 -9331 -10048 -7797 9601 4076 -2739 -1917 -7706 -10635 1822 2936 -11744
317 -11744 -19716 -14501 -6872 10795 -1262 -4553 -5997 -10048 -16606 -24899 -19608 -14324 -16026 -18337
303 -18337 -30379 -26665 -19360 -17890 -18162 -9977 6145 8298 11435 12453 10832 1929 5576 3282 -8284
288 -8284 -6346 -2710 4875 10979 -2552 -8470 8441 21536 21354 30848 25447 20080 26330 15157
274 15157 4511 11409 8985 1440 -274 930 -18516 -21393 -8113 3128 18016 6897 -11274
261 -11274 -5178 1747 -14262 -2227 19081 35637 33753 23008 21633 7597 -848 -3685 -6835
248 -6835 -10461 -15020 -7576 7797 14204 4770 -1645 166 -11990 -22585 -16724 -13160 -16980 -9950
234 -9950 700 4362 8381 -3856 -15067 -4096 15933 26110 16913 -1125 -9913 33 22186
221 22186 19768 13180 6764 93 -12991 -4621 9840 13781 15797 -2656 -9852 2531 10528 5096
207 5096 1008 2550 15897 30026 21339 11392 2689 -2089 -11242 1 12255 -1499 -18451 -9312
193 -9312 -10191 1481 6672 21839 26907 25489 27874 25068 4521 -20810 -18361 -5004 -4080 -2714
179 -2714 -5556 3528 13033 14793 4703 -6901 -11501 -4280 4470 12296 15594 5345 6647 16882
165 16882 28911 24688 3536 -6398 2971 4270 -5006 -16429 -228 7802 -2626 1066 -4708 -13302
151 -13302 -11216 -13323 -13583 -10996 -10402 -10478 -8988 8773 5870 8898 945 7549 8683 -6622 -7429 -938
135 -938 673 -3011 -5553 -3730 -663 742 -225 -15790 -30694 -18218 -12615 -8764 -5095 -2619 5592
120 5592 11371 813 -8952 -2087 -6174 -16565 -16258 -14348 -16316 -10009 2895 9427 6433 -11369
106 -11369 -7349 -10527 -6264 -8552 -5671 2079 13616 11713 -8645 -25190 -27412 -13862 278 -3101
92 -3101 -14228 -20474 -17644 -11140 -12979 -16651 -23609 -19538 -15767 -6847 -6374 9144 16746 20119 15821
77 15821 15873 6508 -4629 -5347 8257 7639 10456 9789 105 -15632 -24338 -23195 -1296 11515 18342
62 18342 2329 -5946 1089 -4161 -6145 463 3946 -5942 3036 10086 9736 813 -5890 -4480 -3252
47 -3252 -6335 -13779 -10753 -4310 -3141 -4634 -981 -13940 -17483 -19755 -18587 -16540 -13778 -18077 -19972
32 -19972 -19277 -12726 -1632 3184 1524 16712 29969 15091 12626 13900 8103 691 -5322 734
18 734 13622 4237 -5514 -8810 -7049 -1939 3950 9157 9863 14633 19462 20314 1532 -2732 -926 2224
2 2224 3843 10377
0 10377
$$ Imaginary data points
##PAGE= N=2
##DATA TABLE= (X++(I..I)), XYDATA
32767 55585 63366 67285 74937 86972 90191 77279 60439 68409 70520 70395 78638 77904 71153 73092
32753 73092 83218 88562 91743 95357 81044 74457 90427 106939 99921 78721 74071 91486 102959
32740 102959 101873 92258 97904 97287 96715 109490 115988 121292 119278 115103 104207 106804 113963 108092
32726 108092 103800 117812 113880 121723 120477 112992 106149 96416 98375 114647 121049 119960 110373 115954
32712 115954 120953 134891 125441 123741 127313 115017 101860 107549 123738 134199 132131 143993 156354
32699 156354 158918 153997 149047 153679 146067 146945 164477 172042 167880 155331 146755 162094 162721 159761
32685 159761 175711 176757 176428 170234 165990 162631 163452 156265 151225 151816 154314 159215 159292 145591 149259
32670 149259 163833 171288 165855 157129 148400 144610 150886 160615 148677 160758 169121 173557 187668
32657 187668 193463 195411 185107 166753 162512 168786 176671 181536 170418 159355 167135 187863 196497
32644 196497 176970 161321 158842 160737 147782 146594 155783 163787 168134 184144 182676 181562 178058
32631 178058 172703 177303 178055 184793 184421 194635 206560 213769 215634 203680 196535 213442 209878 208506
32617 208506 196910 206847 212960 201123 195739 197860 203582 191983 193121 197038 198612 191736 178772
32604 178772 175028 178130 196747 222929 225801 219829 217821 216388 215010 217718 228404 234130 237412
32591 237412 236699 228250 227922 224964 221651 222255 225485 216589 226575 224097 222300 218771 231831 236583 244419
32576 244419 243178 230099 222168 221191 219163 217504 238121 255893 243534 240889 235483 234302 237837
32563 237837 228517 219675 224808 230699 229921 244068 239185 246813 248041 255900 263486 263593 263807 273957
32549 273957 268405 259984 260968 257079 245440 265814 264987 270677 268634 276729 264305 251994 261945 273687
32535 273687 260438 257769 253101 264426 281542 280717 267961 263926 272633 282778 287384 289847 291475
32522 291475 289054 275613 252543 247189 248886 252470 263059 258352 254086 257907 263772 259833 249288
32509 249288 250715 254633 263785 270397 275337 282862 275499 273986 276201 267957 260731 270773 262205 268341
32495 268341 272701 269386 263735 277547 290775 295559 283986 286388 278529 278811 276897 272599 272632 266196
32481 266196 268726 297238 292509 274526 266345 260109 259533 255920 263732 271403 286921 300047 307125
32468 307125 307817 317240 323704 318798 316879 312387 314234 307780 299988 299994 289110 273348 285283 298932
32454 298932 320655 306653 297153 302054 313561 301574 295914 292764 296108 291768 279944 288717 299697
32441 299697 305762 309243 313118 329429 338837 325293 313808 308654 303766 292507 287564 301091 310464
32428 310464 304923 305887 306716 307330 307556 315070 309415 289661 286102 293688 308618 308483 315578 323623 316200
32413 316200 293978 289126 292376 315121 326614 327404 311057 305931 312289 305551 321280 331724 318171
32400 318171 312719 334031 342354 324516 317086 311682 297787 303034 322783 314638 326044 351295 337558
32387 337558 323795 319700 308621 298822 285404 280543 289808 290846 296725 310169 321469 346701 350774
$$ [...]
##END NTUPLES=NMR SPECTRUM
##END=
