##TITLE=Analysis number 327935
Compound Code cc 50504
Book Reference 451/49
Project Code adrs
Chemist Name evam
##JCAMPDX= 6.0         $$ Bruker NMR JCAMP-DX V2.0
##DATA TYPE= NMR SPECTRUM
##DATA CLASS= NTUPLES
##ORIGIN= Bruker BioSpin GmbH
##OWNER= nmr
$$ XWIN-NMR		Version 3.5
$$ Wed Apr 18 14:55:25 2007 GMT Daylight Time (UT+1h)  MAYBRIDGE\nmr@NMR_250MHZ
##.OBSERVE FREQUENCY= 250.131544655141
##.OBSERVE NUCLEUS= ^1H
##.ACQUISITION MODE= SIMULTANEOUS (DQD)
##.ACQUISITION SCHEME= undefined
##.AVERAGES= 16
##.DIGITISER RES= 18
##SPECTROMETER/DATA SYSTEM= dpx250
##.PULSE SEQUENCE= zg30
##.SOLVENT NAME= CDCl3
##.SHIFT REFERENCE= (INTERNAL, CDCl3, 0, 16.4522)
##AUDIT TRAIL= $$ (NUMBER, WHEN, WHO, WHERE, WHAT)
$$ ##TITLE= Audit trail, XWIN-NMR		Version 3.5
$$ ##JCAMPDX= 5.01
$$ ##ORIGIN= Bruker BioSpin GmbH
$$ ##OWNER= nmr
$$ C:\u/data/dgb/nmr/ADRS/1710/pdata/1/auditp.txt
$$ ##AUDIT TRAIL=  $$ (NUMBER, WHEN, WHO, WHERE, WHAT)
(   1,<2007-04-18 14:55:02.83 +100>,<MAYBRIDGE\nmr>,<NMR_250MHZ>,
      <created by zg, POWCHK disabled, PULCHK disabled
       configuration hash MD5:
       49 4B E0 1D 92 C2 6B 37 9F E6 65 BC 52 41 86 1D
       data hash MD5: 64K
       BE 0C C1 63 EA 94 B4 89 2D C6 6C D2 6A A5 2F B5>)
(   2,<2007-04-18 14:55:17.08 +100>,<MAYBRIDGE\nmr>,<NMR_250MHZ>,
      <Start of raw data processing
       ef LB = 0.3 FT_mod = 6 PKNL = 1 SI = 32K 
       data hash MD5: 32K
       69 58 70 6E 13 0E FD 6E AD 0C 62 ED D4 74 89 00>)
(   3,<2007-04-18 14:55:19.19 +100>,<MAYBRIDGE\nmr>,<NMR_250MHZ>,
      <apk 
       data hash MD5: 32K
       69 56 6B CF 2A AB A3 0E 7A 51 4F C5 E0 8B AA A4>)
(   4,<2007-04-18 14:55:19.86 +100>,<MAYBRIDGE\nmr>,<NMR_250MHZ>,
      <abs ABSG = 5 
       data hash MD5: 32K
       32 6E C8 00 05 6D 51 1D 75 E2 BB 68 FB D2 B1 19>)
$$ ##END=
$$ 
$$ hash MD5
$$ 26 32 DE 72 20 36 A3 C8 64 D3 80 53 B4 37 47 AE
##$RELAX= 
##$RELAX= 
##$RELAX= 
##$RELAX= 
##$RELAX= 
##$RELAX= 
##$RELAX= 
$$ Bruker specific parameters
$$ --------------------------
##$DU= <C:\u>
##$EXPNO= 1710
##$NAME= <ADRS>
##$PROCNO= 1
##$TYPE= <nmr>
##$USER= <dgb>
##$AMP= (0..31)
100 100 100 100 100 100 100 100 100 100 100 100 100 100 100 100 100 100 
100 100 100 100 100 100 100 100 100 100 100 100 100 100 
##$AQSEQ= 0
##$AQ_mod= 3
##$AUNM= <au_zg>
##$AUTOPOS= <30 >
##$BF1= 250.13
##$BF2= 250.13
##$BF3= 250.13
##$BF4= 250.13
##$BF5= 500.13
##$BF6= 500.13
##$BF7= 500.13
##$BF8= 500.13
##$BYTORDA= 1
##$CFDGTYP= 0
##$CFRGTYP= 5
##$CHEMSTR= <none>
##$CNST= (0..31)
1 1 145 1 1 1 1 1 1 1 1 1 1 1 1 1 1 1 1 1 1 1 1 1 1 1 1 1 1 1 1 1 
##$CPDPRG= <>
##$CPDPRG1= <>
##$CPDPRG2= <>
##$CPDPRG3= <>
##$CPDPRG4= <mlev>
##$CPDPRG5= <mlev>
##$CPDPRG6= <mlev>
##$CPDPRG7= <mlev>
##$CPDPRG8= <mlev>
##$CPDPRGB= <>
##$CPDPRGT= <>
##$D= (0..31)
0 1 0 0 0 0 0 0 0 0.06 0 0 0 0 0 0 0.0002 0 0 0 0 0 0 0 0 0 0 0 0 0 0 
0 
##$DATE= 1176904501
##$DBL= (0..7)
120 120 120 120 120 120 120 120 
##$DBP= (0..7)
150 150 150 150 150 150 150 150 
##$DBP07= 0
##$DBPNAM0= <>
##$DBPNAM1= <>
$$ [...]
##$SUBNAM7= <"">
##$SUBNAM8= <"">
##$SUBNAM9= <"">
##$SW= 20.6930455092707
##$SWIBOX= (0..15)
0 0 3 0 0 0 0 0 0 0 0 0 0 0 0 0 
##$SW_h= 5175.983436853
##$TD= 65536
##$TD0= 1
##$TE= 683.16
##$TE2= 300
##$TE3= 300
##$TEG= 300
##$TL= (0..7)
0 120 120 120 120 120 120 120 
##$TP= (0..7)
150 150 150 150 150 150 150 150 
##$TP07= 0
##$TPNAME0= <>
##$TPNAME1= <>
##$TPNAME2= <>
##$TPNAME3= <>
##$TPNAME4= <>
##$TPNAME5= <>
##$TPNAME6= <>
##$TPNAME7= <>
##$TPOAL= (0..7)
0.5 0.5 0.5 0.5 0.5 0.5 0.5 0.5 
##$TPOFFS= (0..7)
0 0 0 0 0 0 0 0 
##$TUNHIN= 0
##$TUNHOUT= 0
##$TUNXOUT= 0
##$USERA1= <user>
##$USERA2= <user>
##$USERA3= <user>
##$USERA4= <user>
##$USERA5= <user>
##$V9= 5
##$VALIST= <valist>
##$VCLIST= <CCCCCCCCCCCCCCC>
##$VD= 0
##$VDLIST= <DDDDDDDDDDDDDDD>
##$VPLIST= <PPPPPPPPPPPPPPP>
##$VTLIST= <TTTTTTTTTTTTTTT>
##$WBST= 1024
##$WBSW= 4
##$XGAIN= (0..3)
0 0 0 0 
##$XL= 0
##$YL= 0
##$YMAX_a= 292754
##$YMIN_a= -338919
##$ZGOPTNS= <>
##$ZL1= 120
##$ZL2= 120
##$ZL3= 120
##$ZL4= 120
##$ABSF1= 16.45217
##$ABSF2= -4.241003
##$ABSG= 5
##$ABSL= 3
##$ALPHA= 0
##$AQORDER= 0
##$ASSFAC= 0
##$ASSFACI= 0
##$ASSFACX= 0
##$ASSWID= 0
##$AUNMP= <proc_1d>
##$AZFE= 0.1
##$AZFW= 0.1
##$BCFW= 0
##$BC_mod= 0
##$BYTORDP= 0
##$COROFFS= 0
##$CY= 12.5
##$DATMOD= 1
##$DC= 0
##$DFILT= <>
##$DTYPP= 0
##$F1P= 14.0000005364418
##$F2P= -0.99999901652339
##$FCOR= 0.5
##$FTSIZE= 32768
##$FT_mod= 6
##$GAMMA= 0
##$GB= 0
##$INTBC= 1
##$INTSCL= 1
##$ISEN= 128
##$LB= 0.3
##$LEV0= 0
##$LPBIN= 0
##$MAXI= 10000
##$MC2= 0
##$MEAN= 0
##$ME_mod= 0
##$MI= 0
##$NCOEF= 0
##$NC_proc= -5
##$NLEV= 6
##$NOISF1= 0
##$NOISF2= 0
##$NSP= 0
##$NTH_PI= 0
##$NZP= 0
##$OFFSET= 16.45217
##$PC= 1
##$PHC0= 237.376
##$PHC1= 7.80449
##$PH_mod= 1
##$PKNL= yes
##$PPARMOD= 0
##$PSCAL= 4
##$PSIGN= 0
##$REVERSE= no
##$SF= 250.130017465868
##$SI= 32768
##$SIGF1= 0
##$SIGF2= 0
##$SINO= 400
##$SIOLD= 32768
##$SREGLST= <1H.CDCl3>
##$SSB= 0
##$STSI= 32768
##$STSR= 0
##$SW_p= 5175.98343685301
##$SYMM= 0
##$S_DEV= 0
##$TDeff= 65536
##$TDoff= 0
##$TI= <Analysis number 999999
Compound Code 99
Book Reference 9
Project Code 9>
##$TILT= no
##$TM1= 0
##$TM2= 0
##$TOPLEV= 0
##$USERP1= <user>
##$USERP2= <user>
##$USERP3= <user>
##$USERP4= <user>
##$USERP5= <user>
##$WDW= 1
##$XDIM= 32768
##$YMAX_p= 412079332
##$YMIN_p= -696065
$$ End of Bruker specific parameters
$$ ---------------------------------
##NTUPLES= NMR SPECTRUM
##VAR_NAME=  FREQUENCY,     SPECTRUM/REAL,   SPECTRUM/IMAG
##SYMBOL=    X,             R,               I
##VAR_TYPE=  INDEPENDENT,   DEPENDENT,       DEPENDENT
##VAR_FORM=  AFFN,          ASDF,            ASDF
##VAR_DIM=   32768,         32768,           32768
##UNITS=     HZ,            ARBITRARY UNITS, ARBITRARY UNITS
##FACTOR=    0.157963299565203, 1,           1
##FIRST=     4115.18142395954, 0,            0
##LAST=      -1060.80201289347, 0,           0
##MIN=       -1060.80201289347, -696065,     0
##MAX=       4115.18142395954, 412079332,    0
$$ Real data points
##PAGE= N=1
##DATA TABLE= (X++(R..R)), XYDATA
$$ [...]
16002a14347j6506J55429K0867k45686p9637R9120J66999Q3262l1410l0901q9202
$$ -114347 -130853 24576 45443 -200243 -279880 -180760 -13761 69501 38091 7190 -82012
15991h2012L0185Q9617J79659P472q1620Q2679J1880r7413Q8612m8780n3166l7827
$$ -82012 -51827 37790 217449 224921 143301 225980 237860 140447 229059 180279 127113 89286
15979H9286J364M0096Q733J3165m2693J9134q7691j99146j74575J03517K29484
$$ 89286 90650 130746 139479 152644 109951 129085 41394 -157752 -332327 -228810 674
15968F74q7248q0538O7360M2389m6874l0021j7452l4245L4760m0829j20031J71685
$$ 674 -86574 -167112 -99752 -57363 -104237 -134258 -151710 -185955 -151195 -192024 -312055 -140370
15956a40370J75582n8324j33167N4665P8067J35765k4038o0266P82p610j57875
$$ -140370 35212 -23112 -156279 -101614 -23547 112218 88180 27914 28696 21086 -136789
15945a36789q6771M6768L1529m430M2124l3988Q050J4486J29768L9807M7486k08763
$$ -136789 -223560 -176792 -145263 -149693 -107569 -141557 -133507 -119021 10747 50554 98040 -110723
15933a10723q6059k4008J06413l6361M1077J66229J28134k6365j34337R3016K9815
$$ -110723 -196782 -220790 -114377 -150738 -109661 56568 184702 158337 24000 117016 146831
15922A46831q3544R3708j95147n1120K30302j5992m4226k8801o5109K3100r8488
$$ 146831 63287 156995 -38152 -89272 141030 125038 80812 52011 -13098 10002 -88486
15911h8486r6392J30566J16289N6095j64180J03580o8175J12646M2695j38915
$$ -88486 -184878 -54312 61977 118072 -46108 57472 -10703 101943 144638 5723
15901E723j19617J02975k7289q92J45862M1234j00246K47695P9143j78299j24096
$$ 5723 -113894 -10919 -38208 -39100 106762 147996 47750 295445 374588 196289 72193
15890G2193j71662N7447J33137N0843L2187J5352j5002J684J18086p8517j26350
$$ 72193 -99469 -42022 91115 141958 174145 189497 174495 176179 294265 215748 89398
15879H9398P5056j20763j01575J01501P889l6454j1911l1185J16637J14984J80627
$$ 89398 164454 43691 -57884 43617 51506 15052 3141 -28044 88593 203577 384204
15868C84204R0211o8955j80924j26920J43412J22890m8007j14355M6727J42584
$$ 384204 474415 405460 224536 97616 241028 363918 315911 201556 248283 390867
15858C90867n247o6808P4125j06001J05991n4824j01082k04401m7583L6186R3645
$$ 390867 385620 318812 392937 286936 392927 338103 237021 32620 -14963 21223 114868
15847A14868j48763j07502J8184l5100J12441j5205n4528m8377m7636J26783k3409
$$ 114868 -33895 -141397 -123213 -158313 -45872 -61077 -115605 -163982 -211618 -84835 -108244
15836a08244o2209l3031Q8924K22431J6469k11381j46241R8153J03710J43198
$$ -108244 -170453 -203484 -114560 107871 124340 -87041 -233282 -135129 -31419 111779
15826A11779R7590P816J15184p7985L855q9854M4213Q7867L9518k2131J8928q2401
$$ 111779 209369 217185 332369 254384 258239 168385 212598 300465 339983 317852 336780 254379
15814B54379N4266p2409j99370j16459j888J42353J48572J67896p6444j54760
$$ 254379 308645 236236 36866 -79593 -81481 60872 209444 377340 300896 146136
15804A46136m1877j11504j35052L08016L25434k0275J5344l7203j61780n8197
$$ 146136 104259 -7245 -142297 165719 491153 470878 486222 449019 287239 229042
15794B29042p5626j11623j80723j6636R7868j8426p6457M9432j34333o4342L1871
$$ 229042 153416 41793 -138930 -155566 -57698 -76124 -152581 -103149 -237482 -301824 -269953
15783b69953j47597o2954K62140K09336o224R065Q0832O8142M3613n0280j79157
$$ -269953 -417550 -480504 -218364 -9028 -15252 -6187 74645 142787 186400 136120 -43037
15772d3037J36431Q5168J0424n8851P7433j97681j58027O1924J03290l2978N7845
$$ -43037 93394 178562 188986 130135 207568 9887 -148140 -86216 17074 -15904 41941
15761D1941L8024q2475j69978j31402l4428K6484K73739j9767j11081J20319M4399
$$ 41941 79965 -2510 -172488 -303890 -338318 -311834 -38095 -57862 -168943 -48624 -4225
15750d225K03558N276k3411P135K576m8446r0589k28866o805J74902J8775k06725
$$ -4225 199333 204609 181198 188333 190909 142463 51874 -176992 -183797 -8895 9880 -196845
15738a96845N6468J4728Q8945O2611o3550j35435M5937K3432r2187j07379N6217
$$ -196845 -140377 -125649 -36704 25907 -37643 -173078 -127141 -103709 -195896 -303275 -247058
15727b47058K24947N1838J17846p7368m0579J13774O3088l42741o8601J61353
$$ -247058 -22111 29727 147573 70205 29626 143400 206488 -136253 -204854 -43501
15717d3501K1401j27546M3664J5693K8309L4277J3216n6693Q2211J54916J5331
$$ -43501 -22100 -149646 -105982 -90289 -61980 -27703 -14487 -71180 11031 165947 181278
15706A81278j004l5194j10307j08082N8191M7174q7796j94200k3443j9609o8182
$$ 181278 180274 145080 34773 -73309 -15118 32056 -55740 -249940 -273383 -292992 -361174
15695c61174J8276P6092k6015J61090K79381M4476q5069m1160l6408o5440L3273
$$ -361174 -342898 -266806 -292821 -131731 147650 192126 107057 65897 29489 -35951 -2678
15684b678k5056N9929l9883r2551Q5250j66790j4271k1687K5525l697K26945J51310
$$ -2678 -27734 32195 -7688 -100239 -14989 -181779 -196050 -217737 -192212 -195909 31036 182346
15672A82346Q539k53161k03354J4686J77729L9973J08599J0977P984K9866j21610
$$ 182346 190885 -62276 -265630 -250944 -73215 -33242 75357 86334 94318 124184 2574
15661B574M3211m1901O3599k16767k04300Q3614O8100J8892J11760J28533l7043
$$ 2574 45785 3884 67483 -149284 -353584 -269970 -201870 -182978 -71218 57315 20272
15650B0272J04489m6479m7022J59591J0202j57003j23147J7349r6344q005R4390
$$ 20272 124761 78282 31260 190851 201053 44050 -79097 -61748 -158092 -166097 -71707
15639g1707J12877r1836m7220J91996n8405j95261q5703J47631J00379k63257
$$ -71707 41170 -50666 -97886 94110 35705 -159556 -245259 -97628 2751 -260506
15629b60506k2507M9871j194j26495J46965J32861O5797R3394j64046j227O0474
$$ -260506 -283013 -233142 -234336 -360831 -213866 -81005 -15208 78186 -85860 -87087 -26613
15618b6613r1405q9932n4604j5212k469J08945j6146N0192L06141j25490L0870
$$ -26613 -118018 -207950 -262554 -277766 -280235 -171290 -187436 -137244 168897 43407 74277
15607G4277n5387j63008l12556l3837J48007J33545Q1967k5562P4922j39026j11790
$$ 74277 18890 -144118 -456674 -490511 -342504 -208959 -126992 -152554 -77632 -216658 -328448
15596c28448R9798l1030P963O348j3405J1942j8616l484N0274O6455M0951M9787
$$ -328448 -228650 -259680 -251717 -245369 -258774 -246832 -265448 -268932 -218658 -152203 -111252 -61465
15584f1465j0793O5950M216j3572n0431j44602k6024J87458L9628j6820K13610
$$ -61465 -72258 -6308 -2092 -15664 -66095 -210697 -236721 -49263 -9635 -26455 187155
15573A87155N7846n0593n4407j27656K2383P890q750q4803J37128J12837Q8374
$$ 187155 245001 194408 140001 12345 34728 42618 33868 -50935 86193 199030 287404
15562B87404Q0548j34513j80089j9278j14411O9608K5784j11162o8582Q2144J98034
$$ 287404 367952 233439 53350 34072 -80339 -10731 15053 -96109 -164691 -82547 115487
15551A15487K44086J40224q3201k31010j01997N2898j01360k23036L0789j0079
$$ 115487 359573 499797 416596 185586 83589 136487 35127 -187909 -157120 -167199
15541a67199M6470R731J00067R9714p2457j02856r4579Q5496J01206j09464j26608
$$ -167199 -120729 -110998 -10931 88783 16326 -86530 -181109 -95613 5593 -103871 -230479
15530b30479R0317n095l3488J09071J56090K7801j3683p2497K1947Q288J05913
$$ -230479 -140162 -145257 -178745 -69674 86416 114217 100534 28037 49984 58272 164185
15519A64185K3314j19884l2751j8551O2684k9232j48069q4810K356j14399L4800
$$ 164185 187499 67615 34864 16313 78997 49765 -98304 -183114 -180758 -295157 -260357
15508b60357J03221Q3625p5178L2637P1964o3688j45657R1043J53103J75632M1602
$$ -260357 -157136 -73511 -148689 -116052 -44088 -107776 -253433 -162390 -9287 166345 207947
15497B07947j9321j30602r905J58038M0465k30273k9683J33900K8874r834j17272
$$ 207947 188626 58024 48119 206157 246622 16349 -13334 120566 149440 139606 22334
15486B2334J12811P0929j499J6567k29495j54084q8345Q0041J17058Q4354J18251
$$ 22334 135145 206074 204575 221142 -8353 -162437 -250782 -170741 -53683 30671 148922
15475A48922J23250N0435j9006N7783k0195j55830M2465L8420r5811p8528p8164
$$ 148922 272172 322607 303601 361384 341189 185359 227824 266244 170433 91905 13741
15464A3741M5160O1697L0465r0501j60409j2026M5482J70192K0725k22943r6721
$$ 13741 58901 120598 151063 60562 -99847 -111873 -66391 103801 124526 -98417 -195138
15453a95138M5325Q6635J03070j16065J6049Q8133k23571j09592L2353J61558
$$ -195138 -149813 -63178 39892 -76173 -60124 28009 -195562 -305154 -272801 -111243
15443a11243J67172P8735J03540p2415k52984J9984J16339j24697P6321l1072
$$ -111243 55929 134664 238204 165789 -87195 -67211 49128 -75569 752 -30320
15433c0320q6025n6157Q1515J62300R9281k6694L5314p7887j13060L272J1339
$$ -30320 -116345 -172502 -90987 71313 170594 143900 179214 101327 -11733 -8461 2878
15422B878k4757J57713k8832o8358j16977p9599l960J09645P5228M7611K15572
$$ 2878 -21879 135834 107002 38644 -78333 -157932 -161892 -52247 22981 70592 286164
15411B86164K7816k04622m814J28099o3667p3627J4484j95031l7995R133J08802
$$ 286164 313980 109358 104544 232643 168976 95349 109833 -85198 -123193 -114060 -5258
15400e258L891j46899N6248L9238J76170j04506k3722m1802q9002L1288O5001
$$ -5258 -1367 -148266 -92018 -52780 123390 18884 -4838 -46640 -135642 -104354 -39353
15389c9353J62754L3010O5087j15041n1018o7262o1164J0584j31475j38611J0324
$$ -39353 123401 156411 221498 106457 55439 -11823 -72987 -62403 -193878 -332489 -322165
15378c22165J26186j06510j19043k4440J76350J62962r8047K1533J23454Q2039
$$ -322165 -195979 -302489 -421532 -445972 -269622 -106660 -204707 -183174 -59720 22319
15368B2319n6665j79349R6838O939M3959J29286J16818p8162j05712l5458p3227
$$ 22319 -34346 -213695 -116857 -109918 -65959 63327 180145 101983 -3729 -39187 -112414
15357a12414r4615N4011Q0921J03310R5870J46019k4411j90284n2598p9611J88543
$$ -112414 -207029 -153018 -72097 31213 127083 273102 248691 58407 5809 -73802 114741
15346A14741j6719p7915j09915o6850P8133K7744m55P6620j17108k99923m0810
$$ 114741 98022 20107 -89808 -156658 -78525 -50781 -51236 25384 -91724 -391647 -432457
15335d32457J21767J50949J23977j2639q7233J14895J05204R677J1952m2100M8995
$$ -432457 -310690 -159741 -35764 -48403 -135636 -20741 84463 94140 106092 63992 112987
15324A12987J43404o1975k03013p2972J27994j43691j13150K1009L1909J43899
$$ 112987 256391 194416 -8597 -81569 46425 -97266 -210416 -189407 -157498 -13599
15314a3599K64321k7377n9115r0825j86813j3502J05668n5878n3972K04509j23219
$$ -13599 250722 223345 164230 73405 -113408 -126910 -21242 -77120 -131092 73417 -49802
15303d9802j638j3083P1868q115J12454M5823j6534l464j51345m523q349n5810
$$ -49802 -51440 -64523 7345 -770 111684 157507 140973 137509 -13836 -18359 -26708 -82518
15291h2518K0859r862m9933P4408J06698j03975j40854N336j4426j7297J9502
$$ -82518 -61659 -71521 -121454 -47046 59652 -44323 -185177 -179841 -194267 -211564 -192062
15280a92062J95671k2164j18419j39132j9772m4689L5502j9364J38358K0432R9486
$$ -192062 3609 -18555 -136974 -276106 -295878 -340567 -305065 -324429 -186071 -165639 -66153
15269f6153R732p0383K863q942j13796k9570J62031J68910K0622j15814o1915
$$ -66153 -56421 -126804 -123941 -132883 -246679 -276249 -114218 54692 75314 -40500 -102415
15258a02415J00352R4962m3462j0117J1279j9272J02243j13745O6021j8988k07210
$$ -102415 -2063 92899 49437 39320 50599 31327 133570 19825 85846 66858 -140352
15247a40352j00732L6266L623J75080J21520J71181N942j26834r7554J00451k8160
$$ -140352 -241084 -204818 -201195 -26115 95405 266586 272528 145694 48140 148591 120431
15236A20431J8319n4598o5333N1610R4199k65837k74021k2842J96275J16081p8148
$$ 120431 138750 84152 18819 70429 164628 -101209 -375230 -398072 -201797 -85716 -163864
15225a63864Q4072N6043j3008l5925m6038L6067Q6651k3026N5905p59j48653j6128
$$ -163864 -79792 -23749 -36757 -72682 -118720 -82653 3998 -19028 36877 36118 -112535 -128663
15213a28663j45505j6005J04831O6362J17757J66393P6020m1384j11871k53182
$$ -128663 -274168 -290173 -185342 -118980 -1223 165170 241190 199806 87935 -165247
15203a65247n2809J12816P3826N1381J253j0289r5178p978k3693p3697r1498J08595
$$ -165247 -218056 -105240 -31414 19967 21220 10931 -84247 -92225 -115918 -189615 -281113 -172518
15191a72518J80210p3778j43716j4102r9148K19018K13160L9664r365j73645p1243
$$ -172518 7692 -66086 -209802 -223904 -323052 -104034 109126 148790 139425 -34220 -105463
15180a05463l5134k6445L8897J00883l8334j83478L7665O078J6277r8616o7665
$$ -105463 -140597 -167042 -128145 -27262 -65596 -249074 -211409 -205331 -189054 -287670 -355335
15169c55335N3572j30736J31048J59852J01086K22145K27509k5773P2898n5553
$$ -355335 -301763 -432499 -301451 -141599 -40513 181632 409141 383368 456266 400713
15159D00713k94361K259P332K0768k21839j63063J7464P6885j3298L3244M6197
$$ 400713 106352 108611 115943 136711 -85128 -248191 -230727 -153842 -167140 -133896 -87699
15148h7699J42546O3640j84571j3059R5835j26681j26961j2974J3999j940J56390
$$ -87699 54847 118487 -66084 -79143 16692 -109989 -236950 -249924 -235925 -237865 -81475
15137h1475K34435N7772l5296j18452P3000o2940j23456J07634l9649M4782J12134
$$ -81475 152960 210732 175436 56984 129984 67044 -56412 51222 11573 56355 168489
15126A68489O7320n9461l03432J09147L1120M0833L226j86572q5890M24M4736
$$ 168489 235809 176348 -127084 -17937 13183 54016 57242 -129330 -215220 -214796 -170060
15115a70060K15677J32046o5551j69002j08439Q6840O3717M2938J24901J4790
$$ -170060 45617 177663 112112 -56890 -165329 -78489 -14772 28166 153067 167857
15105A67857j27782N3763J2866j19755j88023J96586J94708K5451j21668p1189
$$ 167857 40075 93838 106704 -13051 -201074 -4488 190220 215671 94003 22814
15095B2814p5643q3787K9023j79470k8391P6080L7390K16044J38533k07349j32746
$$ 22814 -52829 -136616 -107593 -287063 -315454 -239374 -201984 14060 152593 -54756 -187502
15084a87502M3364J47005P8394j70549q4111P8682K23620M7045k1883o8730q7855
$$ -187502 -144138 2867 81261 -89288 -173399 -94717 128903 175948 154065 85335 -2520
15073b520o313Q8345O3341l4898L6891O0675j02545j69343j79841j23172L18613
$$ -2520 -8833 79512 142853 107955 144846 205521 102976 -66367 -246208 -369380 -50767
15062e0767O0826N8243J3173J12219n7976j33240Q2692N7893j30450j10865K744
$$ -50767 10059 68302 81475 193694 135718 2478 85170 143063 12613 -98252 -95508
15051i5508n4747J55120R0902K1695J37241l1342j19849j24617o4813O2993o2986
$$ -95508 -150255 4865 95767 117462 254703 223361 103512 -21105 -85918 -22925 -85911
15040h5911q2280J3643J1925J37389L7962k01182k55731J76805J77106N9773k05368
$$ -85911 -168191 -154548 -142623 -5234 32728 -168454 -424185 -247380 -70274 -10501 -215869
15029b15869P938J72311o7125J0342J29062N8758P4626j80135j07698O2676n5812
$$ -215869 -207931 -35620 -102745 -92403 36659 95417 170043 -10092 -117790 -55114 -110926
15018a10926q1328l3114m3749J10115Q1386K4769J70116r9910n0831Q6017q5970
$$ -110926 -192254 -225368 -269117 -159002 -77616 -52847 117269 17359 -33472 52545 -33425
15007c3425N560J07960J02443J62674L35826L40054K50953j26459m51452l01359
$$ -33425 -27865 80095 182538 345212 681038 1021092 1272045 1145586 694134 392775
14997C92775k60243j30826m8688k9663R2790n3062j90676J40635J08439K467j12062
$$ 392775 132532 1706 -46982 -76645 16145 -36917 -227593 -86958 21481 23948 -88114
14986h8114J36794N2956p7343q6873j42505O4194o3316O7012J01143j3328o8131
$$ -88114 48680 101636 24293 -62580 -205085 -140891 -204207 -137195 -36052 -49380 -117511
14975a17511q4021r3619J71973L4413Q797N2572L5836k64064j56610L0577j8416
$$ -117511 -201532 -295151 -123178 -88765 -79968 -27396 8440 -255624 -412234 -381657 -400073
14964d00073o3421R1194m924K15299r546n0916j06814J03342Q3791O5810r8478
$$ -400073 -463494 -372300 -377224 -161925 -171471 -222387 -329201 -225859 -142068 -76258 -174736
14953a74736r4773J93544Q3133K3188P2695n7608K6188j209L9611j59400o183
$$ -174736 -269509 -75965 7168 30356 103051 45443 71631 70422 110033 -49367 -55550
14942e5550O1052J32566J2682l7362k7794j06213O0724L9927r7603n1529n8596
$$ -55550 5502 138068 150750 113388 85594 -20619 40105 80032 -17571 -69100 -127696
14931a27696o7484k26697P0475K22645J09866J7247K7166k0772M2445r553j4020
$$ -127696 -195180 -421877 -351402 -128757 -18891 -1644 25522 4750 47195 37642 23622
14920B3622J01263m7844N3580n488q9128O8967R6034O4138p7584j07076q1072
$$ 23622 124885 77041 130621 125133 36005 104972 201006 265144 187560 80484 -588
14909e88q0914L3826M7747K22936J49829L758k18168M1841P4932n0585L6516m2753
$$ -588 -81502 -47676 71 223007 372836 376594 158426 200267 275199 224614 261130 218377
14897B18377k326j1059j43968r4296j7025J82547N974o4141p0827n3497N0897
$$ 218377 216051 204992 61024 -33272 -50297 132250 138224 74083 3256 -50241 656
14886F56K1342j11169m4525J75238N1099q7997r708j58541R2461l3427K5991J10119
$$ 656 21998 -89171 -133696 41542 92641 4644 -5064 -163605 -71144 -104571 -78580 31539
14874C1539O1020R7739j80632j73187j33042P2433J28452L6079J2645J03872K96004
$$ 31539 92559 190298 9666 -163521 -296563 -224130 -95678 -59599 -46954 56918 352922
14863C52922l6999j32515M9012O0499n5600k19412J0290L5789j4547j85477M92
$$ 352922 315923 183408 232420 292919 237319 17907 28197 63986 49439 -136038 -135546
14852a35546r285P1657J36635J45685l1726j0097m2346j66737l5783N6971K3220
$$ -135546 -144831 -73174 63461 209146 177420 167323 124977 -41760 -77543 -20572 2648
14841B648o0453q6618L6454P9191K4842q1598l9127J29453O6795J2872p980l2004
$$ 2648 -57805 -144423 -107969 -28778 -3936 -85534 -124661 4792 71587 84459 76479 44475
14829D4475j81521j58570N6187J01426o6809O2130j1427L2697J6806k8227R5566
$$ 44475 -137046 -295616 -239429 -138003 -204812 -142682 -154109 -121412 -104606 -132833 -37267
14818c7267p9080j21574Q5426R4909J74611K4842L6714n6242k6826k08603j4913
$$ -37267 -116347 -237921 -152495 -57586 117025 141867 178581 122339 95513 -113090 -128003
14807a28003q020K26901P9477J15579J20334q0906k01365k8134J61M8975k64191
$$ -128003 -136023 90878 170355 285934 406268 325362 123997 95863 96024 144999 -119192
14796a19192j3162J22838K671n4706j43199P8819L2226m9081N1609K2209m8952
$$ -119192 -132354 -9516 -6845 -61551 -204750 -125931 -93705 -142786 -91177 -68968 -117920
14785a17920M2401n8764o0056K3284m2317j03389K34250J49847k26916j16197
$$ -117920 -75519 -134283 -194339 -171055 -213372 -316761 -82511 67336 -159580 -275777
14775b75777J23383K7026M6301L671J2547O7578j42888R720J07411M0322p0398
$$ -275777 -152394 -125368 -79067 -75396 -62849 4729 -138159 -128439 -21028 19294 -51104
14764e1104M983m8698Q9384N3610K3934q3699O671j519k16223N43O7348j5362
$$ -51104 -46121 -94819 -5435 48175 72109 -11590 -4919 -6438 -222661 -222118 -154770 -170132
14752a70132N3975J02459J40878j27743n4202J43973o6835j23529M3207P383J16484
$$ -170132 -116157 -13698 127180 -563 -54765 89208 22373 -101156 -57949 -50566 65918
14741F5918J615K0173l5300r0306k7967j16075Q0876K07204J03178j256j48147
$$ 65918 67533 87706 52406 -37900 -65867 -181942 -101066 106138 209316 208060 59913
14730E9913J55038M7192j5545o4303k05730l9830M8121p804k0039P6271J30432
$$ 59913 214951 262143 246598 182295 -23435 -63265 -15144 -22948 -42987 33284 163716
14719A63716J0475r8577n810M7260P0163j94455k0369P4307j87910r0764K59436
$$ 163716 174191 75614 69804 117064 187227 -7228 -27597 46710 -141200 -231964 27472
14708B7472J81672J40046j733k27759j21607o5947J71560q1827j60035m9326Q2958
$$ 27472 209144 349190 347457 119698 -1909 -67856 103704 21877 -138158 -187484 -104526
14697a04526J31079P574l48481Q2576J76604j11920R0521L5814J58162R8127J63460
$$ -104526 26553 34127 -314354 -231778 -55174 -167094 -76573 -40759 117403 215530 378990
14686C78990m3392j82290k27636j41464l0340J16087p5727j00241O1367J61226
$$ 378990 335598 153308 -74328 -215792 -246132 -130045 -205772 -306013 -244646 -83420
14676h3420J83311N5806n042o9469q3000q0708l9052j55311o4400R9191J88537
$$ -83420 99891 155697 150655 81186 -1814 -82522 -121574 -276885 -341285 -242094 -53557
14665e3557N4464K25o5030N0704J37027o2504K397J40853o6068j54238N0941l937
$$ -53557 907 1132 -63898 -13194 123833 61329 63726 204579 138511 -15727 35214 31277
14653C1277J47593L8701j50358j22025l4803j05290J7835J11925J27186j24879
$$ 31277 178870 217571 67213 -54812 -89615 -194905 -177070 -65145 62041 -62838
14643f2838r1484J05836o236m3076j79084J32531N3995M1023j16839N1551J58749
$$ -62838 -154322 -48486 -54722 -97798 -276882 -144351 -90356 -49333 -166172 -114621 44128
14632D4128J882j27168j18861k0968K08286Q7757L3577R152p452j63811J07886
$$ 44128 46010 -81158 -200019 -220987 -12701 75056 108633 117785 110333 -53478 54408
14621E4408J58010N5842m4571l064p9867j34240k9624J11386r8084J3199J00517
$$ 54408 212418 268260 223689 220625 140758 6518 -23106 88280 -9804 3395 103912
14610A03912J04387N419l0073p5706k04287j43603J39565Q3863K89188m4626j91075
$$ 103912 208299 213718 183645 107939 -96348 -239951 -100386 -16523 272665 228039 36964
14599C6964k4862J01788Q4389j0967j89155k08325J863J36934J3957J33897P0255
$$ 36964 12102 113890 198279 187312 -1843 -210168 -208305 -71371 -57414 76483 146738
14588A46738j73085L4919J13723k2205m3648l4221M2851j50482J44175J37816
$$ 146738 -26347 8572 122295 100090 56442 22221 65072 -85410 58765 196581
14578A96581l7007K1945j35106j63664L9713Q7653J03871j69468j80671k2042
$$ 196581 159574 181519 46413 -117251 -77538 10115 113986 -55482 -236153 -258195
14568b58195M864O8498m5911k2085n9313O4955J79610J37777K7426j05649m4871
$$ -258195 -253331 -184833 -230744 -252829 -312142 -247187 -67577 70200 97626 -8023 -52894
14557e2894l7804P810J08131K71841J97508j807J6134K47059K10669L25074J84955
$$ -52894 -90698 -82888 25243 297084 494592 492785 508919 755978 966647 1291721 1476676
14546A476676j48546q0047k23307l06124l74019m8949j03226l2966j69996O9325
$$ 1476676 1328130 1248083 1024776 718652 344633 295684 192458 159492 -10504 58821
14536E8821R9724n5020L9765j1765q6144j70419L4039Q9473n9628j8732J45958
$$ 58821 158545 103525 143290 131525 45381 -125038 -90999 -1526 -61154 -79886 66072
14525F6072o1988j98198o023Q6699L1887p1824L5731j3381o5914J09577o3682
$$ 66072 4084 -194114 -200137 -113438 -81551 -153375 -117644 -131025 -196939 -87362 -151044
14514a51044L3871K03419J31331J751j1172K4911m3817j19853n4009J88119j17542
$$ -151044 -117173 86246 217577 219328 208156 233067 189250 69397 15388 203507 85965
14503H5965j10369o6747r8457M4565Q0434j4030R5629J30606m0750L6770R1613
$$ 85965 -24404 -91151 -189608 -145043 -64609 -78639 16990 147596 106846 143616 235229
14492B35229j26964j39513O2095p9829J23075Q6856J64737L5803J0140J6684j48783
$$ 235229 108265 -31248 30847 -48982 74093 160949 325686 361489 371629 388313 239530
14481B39530n7144M8172j2694k91174n5863K52592R4430j15088M3540o0926j2220
$$ 239530 182386 230558 217864 -73310 -129173 123419 217849 102761 146301 85375 73155
14470G3155J7185K6536j46858M7549p9270r3795l8802J20562J26615k1090o0561
$$ 73155 90340 116876 -29982 17567 -61703 -155498 -194300 -73738 52877 31787 -28774
14459b8774o5978o4648L4004r3890Q5235J4923O8172o5871j7148m5021R5041K4838
$$ -28774 -94752 -159400 -125396 -219286 -134051 -119128 -50956 -116827 -133975 -178996 -83955 -59117
14447e9117j11696K7557j6904K14405J68177m5506j16148L3189N4547o378k10363
$$ -59117 -170813 -143256 -160160 54245 222422 176916 60768 93957 148504 142126 -68237
14436f8237J927o5058N4906r2456N3131K315J25590j4020J32967j00496j36220
$$ -68237 -66310 -131368 -76462 -168918 -115787 -113472 12118 -1902 131065 30569 -105651
14425a05651j16749j0359J05097P2812n9128J07654N8495q2793P1329J92264J15168
$$ -105651 -222400 -232759 -127662 -54850 -113978 -6324 52171 -30622 40707 232971 348139
14414C48139p9874j19618j65402J37938l102q2376q2553p0786L8219q5422J47860
$$ 348139 268265 148647 -16755 121183 118081 35705 -46848 -117634 -79415 -164837 -16977
14403a6977K6667R9625m2116O4188R9338K2899k17731l13068J6517j2865J02016
$$ -16977 9690 109315 67199 131387 230725 253624 35893 -277175 -260658 -273523 -171507
14392a71507K33602K25653r6737o4211k90445k180Q4599L9778r0474J8860K2516
$$ -171507 62095 287748 191011 126800 -163645 -165825 -81226 -41448 -131922 -113062 -90546
14381i0546K4339Q9259P7146P2830j07067q5626j78308J7089J57272K07467R4205
$$ -90546 -66207 23052 100198 173028 65961 -19665 -197973 -180884 -23612 183855 278060
14370B78060L6353q7583j44900j86438j27458k9620P8113J55557J40839k0273
$$ 278060 314413 226830 81930 -104508 -231966 -261586 -183473 -27916 112923 92650
14360I2650p1155j04378k66342J6370J05250j36991J80044J19733j9313n3506
$$ 92650 21495 -82883 -349225 -332855 -227605 -364596 -184552 -64819 -84132 -137638
14350a37638r69J88822k8168k733N5655N2391j39422p4457P8578J00327P3088
$$ -137638 -138607 50215 22047 19314 74969 127360 -12062 -86519 -7941 92386 165474
14339A65474R0482j9545p9764K6601m0024J2240L3429Q2287Q524j69465q4410
$$ 165474 255956 236411 156647 183248 143224 155464 188893 271180 279704 110239 25829
14328B5829J1665N2617L9195k1454o2107n2946K8110O4984j06421m2848p398p8184
$$ 25829 37494 90111 129306 107852 45745 -7201 20909 85893 -20528 -63376 -70774 -148958
14316a48958j70499k8581J14721n6383o2401J35202P6841r071l2057O1974N9007
$$ -148958 -319457 -348038 -233317 -289700 -352101 -216899 -140058 -149129 -181186 -119212 -60205
14305f0205R6238j30471j32055q3427J36124J99073K02243K51k1858j65362p1556
$$ -60205 36033 -94438 -226493 -309920 -173796 25277 227520 227771 205913 40551 -31005
14294c1005J79144r4100k17203J53480J9568R2628J17473N1529k0483l3434j06559
$$ -31005 148139 54039 -163164 -9684 9884 102512 219985 271514 251031 217597 111038
14283A11038r9923l747K72690q7771j71829j05068J3576j87697o6383K21997K31481
$$ 111038 11115 7368 280058 192287 20458 -84610 -71034 -258731 -325114 -103117 128364
14272A28364J76963N9743J14068j79558j33902q4738q1711Q5307L5777l668J15992
$$ 128364 305327 365070 479138 299580 165678 80940 -771 84536 120313 116645 232637
14261B32637K7442j64649j9952n287p2085O6854p3113j57047K7017l9859J0362
$$ 232637 260079 95430 75478 70191 -1894 64960 -8153 -165200 -138183 -178042 -167680
14250a67680p603J67884J05433k1342j1523N5048Q6457k4959n4164j20025j15746
$$ -167680 -175283 -7399 98034 76692 65169 120217 206674 181715 127551 7526 -108220
14239a08220L5665J57316m798j16811J26596O3635j63781Q2015J22635k31719
$$ -108220 -72555 84761 79963 -36848 89748 153383 -10398 71617 194252 -37467
14229c7467k2555J02046p9141P1856J39863l3680n7184l5181L139O0930m851K2076
$$ -37467 -60022 42024 -37117 34739 174602 140922 83738 48557 51696 112626 107775 129851
14217A29851j6405j1956p1050J1922O3315M7757r5098j1025K7504O3437L9229
$$ 129851 113446 101490 30440 42362 105677 153434 58336 47311 74815 138252 177481
14206A77481j60236o9773N7097L2564N717J54332R0941L1446j13736n0594j27762
$$ 177481 17245 -52528 4569 37133 42850 197182 288123 319569 205833 155239 27477
14195B7477j26494m8122p5152R4795R9694Q286K046r1493m8466J64728J30422
$$ 27477 -99017 -147139 -222291 -127496 -27802 -19516 -17470 -108963 -157429 7299 137721
14184A37721O4466j32000n5210O852J00573p1510m0460n8319p6042r2130J03005
$$ 137721 202187 70187 14977 21829 122402 50892 10432 -47887 -123929 -216059 -113054
14173a13054J92811n4807R7019r630J015l9599k1445m1553K8013j32607o465N8503
$$ -113054 79757 24950 121969 112339 113354 73755 52310 10757 38770 -93837 -100302 -41799
14161d1799M1643J30259J67220n1813j23048j0813j72267j34798j10152Q6187
$$ -41799 -156 130103 297323 245510 122462 111649 -60618 -195416 -305568 -219381
14151b19381K9592m9013L38832J55009j76959j49477O1547Q7045M118n6960k14923
$$ -219381 -189789 -238802 100030 255039 78080 -71397 -9850 77195 81313 24353 -190570
14140a90570m4679J06506l8400n9583p4884J20668J11830O5101j40414M691J55564
$$ -190570 -235249 -128743 -167143 -226726 -301610 -180942 -69112 -4011 -144425 -139734 15830
14129A5830Q7920M8342P6486M9727j26962k34386j40526o2285J97075J7512M0439
$$ 15830 103750 152092 228578 278305 151343 -83043 -223569 -285854 -88779 -71267 -30828
14118c0828M5026j49907j12648o4865j3644K03291Q1354R895j01566n9952J52257
$$ -30828 14198 -135709 -248357 -313222 -326866 -123575 -42221 -32326 -133892 -193844 -41587
14107d1587O1133q0225j4462j26326p5387J09726r447Q3881P9194K4375L7061
$$ -41587 19546 -60679 -75141 -201467 -276854 -167128 -176575 -92694 -13500 10875 47936
14096D7936r3502j09361L7016K8901r9875j76948k7153O5595J41902J62900J41238
$$ 47936 -45566 -154927 -117911 -89010 -188885 -365833 -392986 -327391 -185489 -22589 118649
14085A18649K9419p0240p6643j99276m4820k7203M9674J44215J498l6469K4610
$$ 118649 148068 77828 1185 -198091 -242911 -270114 -220440 -76225 -74727 -111196 -86586
14074h6586J67299m0286p6057o5641q4402r6508r2015J61015J83782m7382n0095
$$ -86586 80713 40427 -35630 -101271 -185673 -282181 -374196 -213181 -29399 -76781 -126876
14063a26876J09330J26593J6793q7144q4854J53411k4945q787L2272J76931J50051
$$ -126876 -17546 109047 125840 38696 -46158 107253 82308 73521 105793 282724 432775
14052D32775K9677J525j74309j21316j40129R42M6430k7901j36184j03883k9050
$$ 432775 462452 463977 289668 168352 28223 29165 75595 47694 -88490 -192373 -221423
14041b21423j22319o8631J48953J88623O6517J97725n8960L4152N4076j01563
$$ -221423 -343742 -412373 -263420 -74797 -8280 189445 130485 164637 218713 117150
14031A17150O2501J12507o7707k3151N9241k34695n1932P424j27045J46102J56793
$$ 117150 179651 292158 224451 201300 260541 25846 -26086 -18662 -145707 395 157188
14020A57188n2977J20657O6863q458j1062M2614o5143j21688j38417j4134o6312
$$ 157188 104211 224868 291731 283273 272211 314825 249682 127994 -10423 -24557 -90869
14009i0869M6186K328R301j59467O6178J56983q1617p7271M1826O8862m4651j5248
$$ -90869 -44683 -42355 -33054 -192521 -126343 30640 -50977 -128248 -86422 -17560 -62211 -77459
13997g7459J07467J49169j58235j82350Q9626N8803P0940J31034R4512k6213M131
$$ -77459 30008 179177 20942 -161408 -71782 -12979 57961 188995 283507 257294 261425
13986B61425K4374R0098K4853j92925j9553n9068k06704k3860K7526m4403m218
$$ 261425 285799 375897 400750 207825 188272 129204 -77500 -101360 -73834 -118237 -122455
13975a22455l8891P9547K5201l9243r8579Q9304J66535M7879O0852q1435j87926
$$ -122455 -161346 -81799 -56598 -95841 -194420 -105116 61419 109298 170150 88715 -99211
13964i9211n9448K9069J29266Q7691J553j42689J40431O8818j02178j07928K0216
$$ -99211 -158659 -129590 -324 87367 88920 -53769 86662 155480 53302 -54626 -34410
13953c4410N884k42764N3368K87303o1382o4354J3858O4626J48076R9136m9881
$$ -34410 -28526 -271290 -217922 69381 7999 -56355 -42497 22129 170205 269341 219460
13942B19460j28957r362M0619J15905J74229j77930o1442J45255m6376j27334
$$ 219460 90503 81141 121760 237665 411894 233964 172522 317777 271401 144067
13932A44067o6400N5180K8438j65724q9457o5334J04133l1169J43128J15564j469
$$ 144067 77667 132847 161285 -4439 -93896 -159230 -55097 -86266 56862 172426 170957
13921A70957j91037n5336R1051m7190j96458L6934O0615J42843J28129Q5642J08353
$$ 170957 -20080 -75416 15635 -31555 -228013 -191079 -130464 12379 140508 226150 334503
13910C34503k6715j14422p9912j00313J61144J63900j5830l7047k57978n7802
$$ 334503 307788 193366 113454 13141 174285 338185 322355 285308 27330 -30472
13900c0472m0065n7751O2413j8996j06953L7534K07046J14560j2342m678j02294
$$ -30472 -70537 -128288 -65875 -84871 -191824 -154290 52756 167316 154974 150296 48002
13889D8002Q0474Q1797N3212R6432J34866p6548j38453q8940r2197J11316J41557
$$ 48002 128476 210273 263485 359917 494783 418235 279782 190842 98645 209961 351518
13878C51518Q5287J13543r271j12830q0134j1405m5827j43469k41997M2281m865
$$ 351518 436805 550348 541077 428247 348113 336708 290881 147412 -94585 -52304 -57169
13867e7169J31343N6230j17244j53728M4725J90987J00233J12047j26624O2160
$$ -57169 74174 130404 13160 -140568 -95843 95144 195377 307424 180800 242960
13857B42960J33421n0046o9413K8024L9979o9416k17671R1388j4420J08119k5529
$$ 242960 376381 326335 256922 284946 324925 255509 37838 129226 114806 222925 197396
13846A97396j74360j60935J11086k7472J38812J69488N6242n16k14623j46428
$$ 197396 23036 -137899 -26813 -54285 84527 254015 310257 309741 95118 -51310
13836e1310M2493K35315J7371j41908n1145J85579j01614j13509L9365O17j07747
$$ -51310 -8817 226498 243869 101961 50816 236395 134781 21272 60637 61254 -46493
13825d6493J01626J11782J9359P9861K21100j19485k22700j32890j55438j01200
$$ -46493 55133 166915 186274 266135 487235 367750 145050 12160 -143278 -244478
13815b44478J04800O1165j71700J4665R8868R8187J88405P5610l1816R8349O9229
$$ -244478 -139678 -78513 -250213 -235548 -136680 -38493 149912 225522 193706 292055 361284
13804C61284j33554k08642j45691R4652k3818l2497J10417k06996m2609R1646
$$ 361284 227730 19088 -126603 -31951 -55769 -88266 22151 -184845 -227454 -135808
13794a35808j30351q925N0897K6187J73456P8323j4282p1995K8586K0515l0202
$$ -135808 -266159 -275084 -224187 -198000 -24544 53779 39497 -32498 -3912 16603 -13599
13783a3599M8390M9540j35216j63183r6291R5263k8994J69640j52648j70527J28700
$$ -13599 34791 84331 -50885 -214068 -310359 -215096 -244090 -74450 -227098 -397625 -268925
13772b68925K29391O2217J21500r4154j69880k37871n9200J58520J04246J19563
$$ -268925 -39534 22683 144183 50029 -119851 -357722 -416922 -258402 -154156 -34593
13762c4593R6757l6100J28268L1036j8869N1052K6127j41669j96089l7268N9266
$$ -34593 62164 26064 154332 185368 166499 217551 243678 102009 -94080 -131348 -72082
13751g2082Q5519O4796k515k7984J38545q8695M5081P6206j61538n0281j17174
$$ -72082 13437 78233 75718 47734 186279 97584 142665 218871 57333 7052 -110122
13740a10122L15291l9139j27215L763M2399j17026J1912M7436j01585j72184n8291
$$ -110122 205169 166030 38815 42578 84977 -32049 -20137 27299 -74286 -246470 -304761
13729c04761K0274Q2916J02070j7103M8145n9720j1069j33754R9797p5953p459
$$ -304761 -284487 -201571 -99501 -116604 -68459 -128179 -139248 -273002 -173205 -249158 -256617
13718b56617m2830o9632m253p770J77939J85503J34755p7987j02176J48274n5126
$$ -256617 -299447 -369079 -373332 -381102 -203163 -17660 117095 39108 -63068 85206 30080
13707C0080p7804J19243o4931k02222J16875N6497n0312Q8531O2095l40R9927
$$ 30080 -47724 71519 6588 -195634 -78759 -22262 -72574 15957 78052 77712 177639
13696A77639O2701q2328J3558m5433n4784K8082p443m9739O1155l7712n3362K7428
$$ 177639 240340 158012 171570 126137 71353 99435 91992 42253 103408 65696 12334 39762
13684C9762o4338R0695P8644P3286m9198q1955j22687J7930J87392J75454n9575
$$ 39762 -24576 66119 144763 218049 168851 86896 -35791 -17861 169531 344985 285410
13673B85410r3790q4007j24785Q406j29103p8593J09008J62521R7931j50495m6010
$$ 285410 191620 107613 -17172 -8766 -137869 -216462 -107454 55067 152998 2503 -43507
13662d3507J65018N1525K436m8758k0354Q7633J08k30291j28342K6341P9232J08988
$$ -43507 121511 173036 175472 126714 106360 193993 194101 -36190 -164532 -138191 -58959 50029
13650E0029J09154O8566j36095j42514l5495J06720M3376J83767P3315o711m2348
$$ 50029 159183 227749 91654 -50860 -86355 20365 63741 247508 320823 314112 271764
13639B71764o5905O3038l6292n4584r4965r18K00787J56407q3374l52896j46692
$$ 271764 205859 268897 232605 178021 83056 82138 282925 439332 355958 3062 -143630
13628a43630j1647j67680J14591q5633L1498J11328J89395n59j01042J3248P7143
$$ -143630 -155277 -322957 -208366 -293999 -262501 -151173 38222 37663 -63379 -50131 27012
13617B7012Q2857n2050L6894J05240j30836L0518j3844j07324N618K4119Q5647
$$ 27012 109869 57819 94713 199953 69117 99635 85791 -21533 -15915 8204 93851
13606I3851J27662j88615r3255j34413O2117n351j08833m6048l4183o8111M2199
$$ 93851 221513 32898 -60357 -194770 -132653 -138004 -246837 -292885 -327068 -395179 -352980
13595c52980m5046N7624K56754P4610k5114J0450m8345m2813J40757R4735O1484
$$ -352980 -398026 -340402 -83648 -9038 -34152 -23702 -72047 -114860 25897 120632 182116
13584A82116n767j49767K00509J41910r0410q5973R983q4675n0813k16086k1344
$$ 182116 176349 26582 227091 369001 278591 192618 202601 117926 67113 -148973 -170317
13573a70317J71964j7092K75459R120j42289P8914M0495K3918M8259J36299r4225
$$ -170317 1647 -15445 260014 269134 126845 205759 246254 270172 318431 454730 360505
13562C60505j08531N0328j08665J63497P7132k31587n1739L6651k2814j51986
$$ 360505 251974 302302 193637 357134 434266 202679 150940 187591 164777 12791
13552A2791O2084Q1306l9894k4529K8435m9276K0033m9656j0573J20814o547j43544
$$ 12791 74875 156181 116287 91758 120193 70917 90950 41294 30721 151535 144988 1444
13540A444j29016J03879K16707K811q6474L6527Q6699l8475K138j3106K7039M7743
$$ 1444 -127572 -23693 193014 195825 109351 145878 232577 194102 196240 183134 210173 257916
13528B57916Q1221J13824k1262o9015l3476K0270j40445k5669J03203Q5139p6393
$$ 257916 339137 452961 431699 362684 329208 349478 209033 183364 286567 371706 295313
13517B95313r7838K62524m0198j45103O3520p7106J27260K01592k00020k20550
$$ 295313 197475 459999 419801 274698 338218 261112 388372 589964 389944 169394
13507A69394R3491j30200k3217J40831R7716k07936j19497j882n6412n593J52638
$$ 169394 262885 132685 109468 250299 348015 140079 20582 18700 -37712 -43305 109333
13496A09333M9063j29795J76981K32222J67112j46259j91617o8531m5865p1230
$$ 109333 158396 28601 205582 437804 604916 458657 267040 198509 152644 81414
13486H1414j11167N5237P3498j0438j67237J04677J32279o1750K7037J42480n1165
$$ 81414 -29753 25484 98982 88544 -78693 25984 158263 96513 123550 266030 214865
13475B14865K6146O3088J1915J02196J57349J26321q7847J74978L30775L94941
$$ 214865 241011 304099 316014 418210 575559 701880 614033 789011 1119786 1514727
13465A514727K40001J8571j18900L5544j92632l03413l13206j8917K5137l9448
$$ 1514727 1754728 1773299 1654399 1689943 1497311 1193898 880692 861775 886912 847464
13455H47464J6853m6254j99095l3955k2855k1918J39378J26201J01001K15087
$$ 847464 864317 818063 618968 585013 562158 540240 679618 805819 906820 1121907
13445A121907m4460j68389o3031r1242Q8765P5259J1986k4540L8433q3923l981
$$ 1121907 1077447 909058 846027 754785 843550 918809 930795 906255 944688 860765 856784
13434H56784K47460J68459R0973J45418M1136J5024n1976r6840M4017k12557k39427
$$ 856784 1104244 1272703 1363676 1509094 1550230 1565254 1513278 1416438 1460455 1247898 1008471
13423A008471J1957j48245J66K55612j30467j74423m5447J7933R866o8039M004
$$ 1008471 1020428 872183 872349 1127961 997494 823071 777624 795557 805423 737384 741388
13412G41388r2379r9597k8572J6515Q7122q0342j295J15066K03594L545L8536
$$ 741388 649009 549412 520840 537355 624477 544135 542840 657906 861500 865045 903581
13401I03581J41709K83077Q5488j0984O9183j82909k90005k71142j29866j7824
$$ 903581 1045290 1328367 1413855 1402871 1472054 1289145 999140 727998 598132 580308
13391E80308k16572j12201m0701j96235N3236J6294K68832K973J66776J15024
$$ 580308 363736 251535 210834 14599 67835 84129 352961 355934 522710 637734
13381F37734L0492m806k12406k39966o2842l9402J2131P9517Q8867M9268j54857
$$ 637734 668226 663420 451014 211048 148206 108804 120935 200452 289319 338587 183730
13370A83730p5931r4991J97268J808O6057l7568q7627L6778L0803j7403M0876
$$ 183730 107799 12808 210076 211884 277941 240373 152746 189524 220327 202924 243800
13359B43800J16029O193l3287J8489J9480j08457j52122p3857O1407Q9145k4172
$$ 243800 359829 366022 332735 351224 370704 262247 110125 36268 97675 186820 162648
13348A62648N3528J5342q719J40994J2531M169q8310Q4588j5983n4463P1160N5300
$$ 162648 216176 231518 222799 363793 376324 380493 292183 376771 360788 306325 377485 432785
13336D32785k16715q256J91309J41058L8312k01145p0567J61381o0851j46397
$$ 432785 216070 207814 399123 540181 578493 377348 306781 468162 407311 260914
13326B60914r223p2662q215J05103j1937j55997r2945n2126J06404k2631N8909
$$ 260914 251691 179029 170814 275917 263980 107983 15038 -37088 69316 46685 105594
13315A05594J42117n5973o7753l8122k1147o6269K34943K80846O471j16969K6311
$$ 105594 247711 191738 123985 85863 64716 -1553 233390 514236 520707 403738 430049
13304D30049j27221k53989j58280L5817K26444J19746k837J58949K7187J73332
$$ 430049 302828 48839 -109441 -73624 152820 272566 269729 428678 455865 629197
13294F29197j52578j35590K2504L9932j33851K7549K2319o1848K6485J52352l9845
$$ 629197 476619 341029 363533 403465 269614 297163 319482 257634 284119 436471 396626
13283C96626q4070r1178j52058k8770J69158R2865P1629Q3482n5280O4088m8884
$$ 396626 312556 221378 69320 40550 209708 302573 374202 457684 402404 466492 417608
13272D17608j02499J27449o6480k45456O6406J11784M1360l2261J23728m2720
$$ 417608 315109 442558 376078 130622 197028 308812 350172 317911 441639 398919
13262C98919m2811j1036r7584L8485n2875o3559Q7541J65519p0320J9466l9194
$$ 398919 356108 345072 247488 285973 233098 169539 257080 422599 352279 371745 332551
13251C32551J67569M6439k3214L9412m0054r3604j60289p5029J08416j16841r1345
$$ 332551 500120 546559 523345 562757 522703 429099 268810 193781 302197 185356 94011
13240I4011N0614r9983J17266N6162J52376K54729q2964O2622J55088l5799m3839
$$ 94011 144625 44642 161908 218070 370446 625175 542211 604833 759921 724122 680283
13229F80283p4n3290l7016n3227m1491n3589L7850q1718j04401J4846L7244N5278
$$ 680283 680209 626919 589903 536676 495185 441596 479446 397728 293327 308173 345417 400695
13217D00695k6360O2355Q9402l0590j00534J67875p7412j28769j88555k2305R7466
$$ 400695 374335 436690 526092 495502 394968 562843 485431 356662 168107 145802 243268
13206B43268j15086m2867J38916O2962N3888k2119j81154j05641K41751J35151
$$ 243268 128182 85315 224231 287193 341081 318962 137808 32167 273918 409069
13196D09069J51870J49091l7374k9496p2827q1423o4770R1845J2499K2581j31830
$$ 409069 560939 710030 672656 643160 570333 488910 424140 515985 528484 551065 419235
13185D19235j46447j03428J62518L1654q866J16738J34063J97622O272j05192
$$ 419235 272788 169360 331878 363532 354666 471404 605467 803089 809361 704169
13175G04169L4122J36125r257J03701P7940J39405K3393m0874P845j36594j79414
$$ 704169 738291 874416 865159 968860 1046800 1186205 1209598 1168724 1176569 1039975 860561
13164H60561m5444l1046j69685q6830j16971O0518J09404J5657O518J25498Q2254
$$ 860561 815117 784071 614386 527556 410585 471103 580507 596164 602682 728180 810434
13153H10434m2064j13318j51676j30501J16448J57452p4877r0651l3745K23829
$$ 810434 768370 655052 503376 372875 489323 646775 571898 481247 447502 671331
13143F71331K4107J28939P9762p2362O165j26371k50833P9627J28788J42989Q3222
$$ 671331 695438 824377 904139 831777 837942 711571 460738 540365 669153 812142 895364
13132H95364M1682m2319o244L1848k3438m6449J5282Q4870Q904o7564j79857o6492
$$ 895364 937046 894727 888483 920331 896893 850444 865726 950596 959500 891936 712079 645587
13120F45587P4655O8194J16934m4316k4743K4679P6532M3628O9864j44169p4607
$$ 645587 720242 788436 905370 861054 836311 860990 937522 981150 1051014 906845 832238
13109H32238Q2934j2373j25985k7269L7937J34982K11204r7219m0972J49346M7302
$$ 832238 915172 902799 776814 749545 787482 922464 1133668 1036449 995477 1144823 1192125
13098A192125j1283o9589j8064P3205o8063J24409K40683O1713M2161Q663J28788
$$ 1192125 1180842 1111253 1093189 1166394 1098331 1222740 1463423 1525136 1567297 1575960 1704748
13087A704748l4789P5489m687j79084q7786J70966J70726r800J37065J27082J23492
$$ 1704748 1669959 1745448 1740761 1561677 1473891 1644857 1815583 1805783 1942848 2069930 2193422
13076B193422J18547J02209M7266j77042k1135P4843M0674P3009K46220J48164
$$ 2193422 2311969 2414178 2461444 2284402 2263267 2338110 2378784 2451793 2698013 2846177
13066B846177L57672L11072Q1062J76829P1209J9154r342L26376L37687K19901
$$ 2846177 3203849 3514921 3595983 3772812 3844021 3863175 3853833 4180209 4517896 4737797
13056D737797J97118K99024M45489M56597M23786N23832O12277P05206Q27612
$$ 4737797 4934915 5233939 5679428 6136025 6559811 7083643 7695920 8401126 9228738
13047I228738R37043J061538J167880J363781J693636K228054K685450L327904
$$ 9228738 10165781 11227319 12395199 13758980 15452616 17680670 20366120 23694024
13039B3694024M073436N167271O405311P900771J0505583J4595296K0164360K7777916
$$ 23694024 27767460 32934731 39340042 47240813 57746396 72341692 92506052 120283968
13031A20283968L6074007M3463841M4877702L4250131J1875772j3127778k9934619
$$ 120283968 156357975 199821816 244699518 278949649 290825421 277697643 247763024
13024B47763024l7236044l6751950l1213436k3266869j5475930q823376k822415
$$ 247763024 210526980 173775030 142561594 119294725 103818795 94995419 92173004
13017I2173004K724521P202304J0216804J1205604J0218805Q612025O965614M044750
$$ 92173004 94897525 102099829 112316633 123522237 133741042 142353067 149318681 153363431
13009A53363431k84595m464036p223209p262044n544491k581108J276534O502021
$$ 153363431 153078836 148614800 141391591 134129547 128585056 126003948 127280482 133782503
13001A33782503J2818022J9270571K4275731K6511559K4770009J8633887Q357370
$$ 133782503 146600525 165871096 190146827 216658386 241428395 260062282 268419652
12994B68419652m462783j6239604k4003032k6992561k5941940k1813209j6233915
$$ 268419652 263956869 247717265 223714233 196721672 170779732 148966523 132732608
12987A32732608r872276m170101P30535M733992P558373Q700349Q434974O296935
$$ 132732608 122860332 118690231 119420766 124154758 131713131 140413480 148848454 155145389
12979A55145389K034800l203156p058369q375919r278961j0005474r397894o600403
$$ 155145389 157180189 153977033 146918664 138542745 129263784 119258310 109860416 103260013
12971A03260013j444660M845264J1789224J9101299K6379841L3369134L7351929
$$ 103260013 101815353 106660617 118449841 137551140 163930981 197300115 234652044
12964B34652044L5546665K6163017Q782359j5687723l8439011m9361114m6743216
$$ 234652044 270198709 296361726 305144085 289456362 251017351 201656237 154913021
12957A54913021l7350953k7289690j9484531j3615162r759972p493119n864841
$$ 154913021 117562068 90272378 70787847 57172685 47412713 39919594 34054753
12950C4054753m798286m063722l317377k695721k149821j816885j601901j488360
$$ 34054753 29256467 25192745 21875368 19179647 17029826 15212941 13611040 12122680
12942A2122680j091944r78531q26448o85103o10071n54497l69965k34288m62115
$$ 12122680 11030736 10052205 9225757 8540654 7930583 7376086 7006121 6771833 6309718
12933F309718m76167k61613l04254j22069r6465o4317r0207j28746q7130k67215
$$ 6309718 5833551 5571938 5267684 5145615 5049150 4984833 4894626 4765880 4678750 4411535
12923D411535m950k25122l99258j36550j29844M6270n1824j28191J14898K04408
$$ 4411535 4406585 4181463 3782205 3645655 3515811 3562081 3510257 3382066 3496964 3701372
12913C701372R0683j4900R1220Q9729m0345l69219k48025j12887j13884q7852
$$ 3701372 3792055 3777155 3868375 3958104 3917759 3548540 3300515 3187628 3073744 2985892
12903B985892j26183j34326m2906L224P2021K5669l3889J32592J75j59426l06925
$$ 2985892 2859709 2725383 2682477 2685701 2757722 2783391 2749502 2882094 2882269 2722843 2415918
12892B415918k35894n8439J15722m8430j17440K3613K8187k469O3215Q2073R8741
$$ 2415918 2180024 2121585 2237307 2188877 2071437 2095050 2123237 2120768 2183983 2266056 2364797
12881B364797N0581j2014r446q6932j86J58315j05872j23185J2770J7400j5030
$$ 2364797 2415378 2403364 2393918 2306986 2306800 2465115 2359243 2236058 2248828 2266228 2251198
12870B251198j04990J1895j22269r3045j06788J84311L9566j04744R391K4937
$$ 2251198 2146208 2158103 2035834 1942789 1836001 2020312 2059878 1955134 1964525 1989462
12860A989462q970j40290r7195L6181k03137j86462P3041Q9947O7306N8665J07778
$$ 1989462 1980492 1840202 1743007 1779188 1576051 1389589 1462630 1552577 1619883 1678548 1786326
12849A786326J0153O8440J28591O6472k21024j29921q8872j67356L8263L0471
$$ 1786326 1796479 1864919 1993510 2059982 1838958 1709037 1620165 1452809 1491072 1521543
12839A521543j29218k86563j50287n5361J6787K52574J19600j02399j70549P8469
$$ 1521543 1392325 1105762 955475 900114 916901 1169475 1289075 1186676 1016127 1094596
12829A094596J42435J02060o2250q2J13638K21307J47817M6972j5326j93197j48902
$$ 1094596 1237031 1339091 1276841 1276759 1390397 1611704 1759521 1806493 1791167 1597970 1449068
12818A449068j04122K400k23724k75481j00213n223M1900r9595m4514J199J81930
$$ 1449068 1344946 1347346 1123622 848141 747928 742705 784605 685010 640496 641695 823625
12807H23625L0133j02766j18670j50877K9394j23994r2550R4096Q7616k9058P3141
$$ 823625 853758 750992 632322 481445 510839 386845 294295 388391 476007 446949 520090
12796E20090J10975q9102q1627j3898j09931O2554l3620J1584j70585P763P7592
$$ 520090 631065 541963 460336 446438 336507 399061 365441 377025 206440 214203 291795
12785B91795Q8355r4182k6637k7678N1724K21590O6194q905n3353J4174j16257
$$ 291795 380150 285968 259331 231653 283377 504967 571161 562256 508903 523077 406820
12774D06820j62166p2124j13010j69795R3869J24217R2914J1922L03263J99968
$$ 406820 244654 172530 59520 -110275 -16406 107811 200725 212647 515910 715878
12764G15878J3387p7319m8263p0140j28185N4877J36067j12302j24553j12658
$$ 715878 729265 651946 603683 533543 405358 460235 596302 484000 359447 246789
12754B46789J4502J9702j7092p076j1427J49716P075J43528K9692p289J6082r7154
$$ 246789 261291 280993 263901 256825 245398 395114 402189 545717 575409 568120 584202 487048
12742D87048j19650J7107q2240q0020J5846n0446j47704K2707Q2499J37881n3131
$$ 487048 367398 384505 302265 222245 238091 187645 39941 62648 145147 283028 229897
12731B29897M3266r8813p6224q2929P129J14817J25208o5753L2799J7930j24709
$$ 229897 273163 174350 98126 15197 22326 137143 262351 196598 229397 247327 122618
12720A22618R3493J83523q0854k15408J7112J41251Q4904L5879j00374j07012
$$ 122618 216111 399634 318780 103372 120484 261735 346639 382518 282144 175132
12710A75132Q1027K0611O8803R6722M2855l0719j16513l0088r1043J940J02477
$$ 175132 256159 276770 345573 442295 485150 454431 337918 307830 216787 218727 321204
12699C21204O1187j30983m1196o0500l4347j16929L1532j20894R5709P2665N7333
$$ 321204 382391 251408 210212 149712 115365 -1564 29968 -90926 4783 77448 134781
12688A34781m0989q718J72344K01717k06654J6448K932K2788R6270k25052j44719
$$ 134781 93792 85074 257418 459135 252481 268929 271861 294649 390919 165867 21148
12677B1148M2576L9006L4612o3347J16691n1Q0688L1156L2631j48247o202j0293
$$ 21148 63724 102730 137342 73995 190686 190635 271323 302479 335110 186863 180661 170368
12665A70368R4371J18550m1727j49448j22672p0853J73538J04125J488o6906m9419
$$ 170368 264739 383289 341562 192114 69442 -1411 172127 276252 277740 210834 161415
12654A61415r0270R2856J80587Q5287J9178K4276o1946j58230o7829n1968P8486
$$ 161415 71145 164001 344588 429875 449053 473329 411383 253153 185324 133356 211842
12643B11842l2714p3237j64178J31601L31139K8132k7575m0451j0501j15397j28315
$$ 211842 179128 105891 -58287 73314 404453 432585 405010 364559 354058 238661 110346
12632A10346R9137L9915l650j12141J7599J40637J04048j12666k7255N3848K52229
$$ 110346 209483 249398 245748 133607 151206 291843 395891 283225 255970 309818 562047
12621E62047o2320q6730j66078j01995K23846o080M4301j23913j0946J99936j40149
$$ 562047 499727 412997 246919 144924 368770 362690 406991 283078 272132 472068 331919
12610C31919k43176m3602k7536J96929J33167j78156k3360n0579p1142K8882M6842
$$ 331919 88743 45141 17605 214534 347701 169545 146185 95606 24464 53346 100188
12599A00188M2075j5404l386O3871R3094N6145O4339J86744l8378K7054J92204
$$ 100188 142263 126859 123473 187344 280438 336583 400922 587666 549288 576342 768546
12588G68546K60371Q7921J16234J85038n8502j49746j80772r4432Q1414k39203
$$ 768546 1028917 1116838 1233072 1418110 1359608 1209862 1029090 934658 1016072 776869
12578G76869m1290n0952j13825J01680J7461j03625J53374J5057K2718J30577
$$ 776869 735579 684627 570802 672482 689943 586318 739692 754749 777467 908044
12568I08044O1550q2312r9128l5889q2991J4797j04150p2839L3189o1656P2420
$$ 908044 969594 887282 788154 752265 669274 684071 579921 507082 540271 478615 551035
12557E51035K14054K90008J38014j217K3397N9348J43389j00252J423n8054k17476
$$ 551035 765089 1055097 1193111 1191894 1215291 1274639 1418028 1317776 1319199 1261145 1043669
12546A043669N0630j20375j46601j03741Q1892N0508j08914J43148Q1571q5234
$$ 1043669 1094299 973924 827323 723582 805474 855982 747068 890216 971787 886553
12536H86553j46554M480l8110l5431L8540q0849k49223l5830Q1251J20564J69999
$$ 886553 739999 744479 706369 670938 709478 628629 379406 343576 424827 545391 715390
12525G15390J20185n3687K8430J92908L03321K14657N0105j22009k12233m27749
$$ 715390 835575 781888 810318 1003226 1306547 1521204 1571309 1449300 1237067 809318
12515H09318j46101l2293K12765Q0469k08825r7759j03409K2665j03718o098o573
$$ 809318 663217 630924 843689 924158 715333 617574 514165 536830 433112 427014 420441
12504D20441r1724j44913p0660O5171q129J93561n271j45465p3045M8707P2846
$$ 420441 328717 183804 113144 178315 170186 363747 358476 213011 139966 188673 261519
12493B61519J45178N2748Q3k06812p8081n1820K17887J74853k12541k46473J15473
$$ 261519 406697 459445 459528 252716 174635 122815 340702 515555 303014 56541 172014
12482A72014R6445k6449l314m3240j46156k12899L736o7780M8928J57755M0397
$$ 172014 268459 242010 238696 195456 49300 -163599 -159863 -227643 -178715 -20960 19437
12471A9437J74661K20523J12987q3429n8413o4565o2127J49798J7773j9697Q2869
$$ 19437 194098 414621 527608 444179 385766 321201 259074 408872 426645 406948 489817
12460D89817k6621J7482J2699o3284q9895J12159P1008K1619r3860k13407r980
$$ 489817 463196 480678 493377 430093 340198 452357 523365 544984 451124 237717 227737
12449B27737J75804k30611l8334M5430j105o634k8672R9732J48714j72097k02474
$$ 227737 403541 172930 134596 180026 178921 172287 143615 243347 392061 219964 17490
12438A7490P145J50020m5751j72454j48767O1916J27895J18698M4483j7650k1539
$$ 17490 24635 174655 128904 -43550 -192317 -130401 -2506 116192 160675 143025 121486
12427A21486q3969p869K5398j53721m0225J70973J00554p5863j4619j44259j08830
$$ 121486 37517 29648 55046 -98675 -138900 32073 132627 56764 42145 -102114 -210944
12416b10944P4950j5254J07054O3008m4839j64100M2889M9104J02289L6601o8470
$$ -210944 -135994 -151248 -44194 18814 -26025 -190125 -147236 -98132 4157 40758 -27712
12405b7712O2341O8888N5609j2941j12470k6513N8508K1781j89282p0286R5770
$$ -27712 34629 103517 159126 146185 33715 7202 65710 87491 -101791 -172077 -76307
12394g6307K9699L0691N7259J64088J42184k7981p3424J1685q7657L1194j845
$$ -76307 -46608 -15917 41342 205430 347614 319633 246209 257894 170237 201431 199586
12383A99586O1505k6403J9957o5376K4176o3104J5886J29147k72003o498R1115
$$ 199586 261091 234688 254645 189269 213445 150341 166227 295374 23371 16873 107988
12372A07988N5245j32653M7894J73672K358J24500j06720j80214N1740K6116p8381
$$ 107988 163233 30580 78474 252146 254504 379004 272284 92070 143810 169926 91545
12361I1545j59153K06927J71933l3642M343O8013l0989O3354J11816k6202j27474
$$ 91545 -67608 139319 311252 277610 281953 349966 318977 382331 494147 467945 340471
12350C40471j51199k03868j21640J37409P2297j06836j17548J60014K96083J60164
$$ 340471 189272 -14596 -136236 1173 73470 -33366 -150914 9100 305183 465347
12340D65347o4027j24282j43699q6031O7414j53823l7042J00303R9833j9541J43450
$$ 465347 401320 277038 133339 47308 114722 -39101 -76143 24160 123993 104452 247902
12329B47902r5927j23360Q1196K39073O1057q3443j52698O6286N4376k8081p88
$$ 247902 151975 28615 109811 348884 409941 326498 173800 240086 294462 266381 265593
12318B65593m2954N4791o2538J7861r9293p7255k1431j39606K7862P747L15742
$$ 265593 222639 277430 214892 232753 133460 56205 34774 -104832 -76970 -69223 246519
12307B46519j8179j04655l31198j49824J41476K39053L3157l7289J94565L4165
$$ 246519 228340 123685 -207513 -357337 -215861 23192 56349 19060 213625 247790
12297B47790j31481r3929J9850j29120J20738J30740M206M6651p5685o9368L3069
$$ 247790 116309 22380 42230 -86890 33848 164588 168794 215445 139760 70392 103461
12286A03461o7959O646j36590J53078O6659j2154j18434J01806j17R9196l9130
$$ 103461 35502 42148 -94442 58636 125295 113141 -5293 96513 96396 195592 156462
12275A56462J1694j4073k0457j7546m5771o3108N786R851m4981K1618N8267J17962
$$ 156462 168156 154083 133626 116080 70309 7201 12987 22838 -22143 -525 57742 175704
12263A75704P2340k0843n4818J7341r5337j95229n8361p2482K15514J87423K0306
$$ 175704 248044 227201 172383 189724 94387 -100842 -159203 -231685 -16171 171252 191558
12252A91558O2569j31106j47747j83148q3863J68223Q8289l6498J202l1054j11020
$$ 191558 254127 123021 -24726 -207874 -291737 -123514 -35225 -71723 -70521 -101575 -212595
12241b12595P5120J49824J33602l4672l29969m5664J36034K21986j18690q8644
$$ -212595 -137475 12349 145951 111279 -218690 -264354 -128320 93666 -25024 -113668
12231a13668N2629J44989K90781K4760k88272j38308J18257Q5192n6192k7509
$$ -113668 -61039 83950 374731 399491 111219 -27089 91168 176360 120168 92659
12221I2659r0973j0882P8085j02709r6830Q5347O4900J14058j0999j04441j49625
$$ 92659 1686 -9196 68889 -33820 -130650 -45303 19597 133655 122656 18215 -131410
12210a31410J29860O5535k512K5744Q0334k4443o0507J28930n6395p2978k07822
$$ -131410 -1550 63985 61473 87217 167551 143108 82601 211531 155136 82158 -125664
12199a25664j26669R7201J28012N2452K1685l4447j8077j58711O5889J35325J80817
$$ -125664 -252333 -155132 -27120 25332 47017 12570 -5507 -164218 -98329 36996 217813
12188B17813R9466q1881Q7149O2262q3619j38836j7612q906k8588l4236j35301
$$ 217813 317279 235398 322547 384809 301190 162354 144742 135836 107248 73012 -62289
12177f2289j32320J81630P3775q3985p5685J48339J10314j56906k07632Q3001
$$ -62289 -194609 -12979 60796 -23189 -98874 49465 159779 2873 -204759 -121758
12167a21758K35473k0751l1548j46098k9352J91986K0714j10049j63042o4877
$$ -121758 113715 92964 61416 -84682 -114034 77952 98666 -11383 -174425 -239302
12157b39302J8439l4414P19l1405J22853K6961R719J23185L4273L56j085p0575
$$ -239302 -220863 -255277 -254558 -285963 -163110 -136149 -126430 -3245 31028 31384 30299 -40276
12145d0276r509j00444j67632J75144K16116m5878K8004M4235j17691j26047m2476
$$ -40276 -49785 -150229 -317861 -142717 73399 27521 55525 99760 -17931 -143978 -186454
12134a86454J06609l400R7855J03869J21463j21461q1660L6557n4015j10817k8515
$$ -186454 -79845 -83245 14610 118479 239942 118481 36821 73378 19363 -91454 -119969
12123a19969j07827K03399J4444L832J11639p2965k33543P1210J50252J3648l4871
$$ -119969 -227796 -24397 -9953 -6121 105518 32553 -200990 -129780 20472 34120 -751
12112g51P7832N9393j037n4214p3795j28156j33955K37211R2539k939N7288n6839
$$ -751 77081 136474 135437 81223 7428 -120728 -254683 -17472 75067 72128 129416 72577
12100G2577j62796K9754n6201m9534P2149P8317Q7755O0204j68991j42755O7527
$$ 72577 -90219 -60465 -116666 -166200 -94051 -15734 72021 132225 -36766 -179521 -111994
12089a11994L5394Q7735K0482j0722j29928j98045l5215J74162j2578J31219J66591
$$ -111994 -76600 11135 31617 20895 -109033 -307078 -342293 -168131 -180709 -49490 117101
12078A17101n094j9388k5118r4198P978r3840J7022R1262q4885j5349J1376J32619
$$ 117101 112007 92619 67501 -26697 -18719 -112559 -95537 -4275 -89160 -104509 -93133 39486
12066C9486K04733J8661j70454j76144k20678r310j5930J29675K36714Q1268J46702
$$ 39486 244219 262880 92426 -83718 -304396 -313706 -329636 -199961 36753 118021 264723
12055B64723j24381j78573j98875j15985K49224M6225j1556j75982p3286O2765
$$ 264723 140342 -38231 -237106 -353091 -103867 -57642 -69198 -245180 -318466 -255701
12045b55701q974q1129Q0798J08199J83171m3267n3999n2633J4047J4776p3903
$$ -255701 -264675 -345804 -265006 -156807 26364 -16903 -70902 -123535 -109488 -94712 -168615
12034a68615r5187L7791R5327L2910j26969R8526K7118r649j3559k49806O3628
$$ -168615 -263802 -226011 -130684 -97774 -224743 -126217 -99099 -108748 -122307 -372113 -308485
12023c08485J01592M2849N0359j31530l4207K10550k8609Q2525K6323K588m1572
$$ -308485 -206893 -164044 -113685 -245215 -279422 -68872 -97481 -14956 11367 13955 -27617
12012b7617n568j2839n8168k0367L2765J21684J26234k9905Q4658l4405j30811
$$ -27617 -33185 -46024 -104192 -124559 -91794 29890 156124 126219 210877 176472 45661
12001D5661j851k1008k3453j15600p2995k7487j5797k1029J32751M9201R3946
$$ 45661 43810 22802 -651 -116251 -189246 -216733 -232530 -253559 -120808 -71607 22339
11990B2339O1673o8392q9866l4309O6477J06861J44070q7093k67646N7336j2489
$$ 22339 84012 15620 -74246 -108555 -42078 64783 208853 121760 -145886 -88550 -101039
11979a01039l1887j20332O9517k0256J81924J26118J11937J0090j41659o7045
$$ -101039 -132926 -253258 -183741 -203997 -22073 104045 215982 226072 84413 17368
11969A7368p2603L1225J5470Q6961j00067q3818N6703j8676J59902R9795m0691
$$ 17368 -55235 -24010 -8540 78421 -21646 -105464 -48761 -67437 92465 192260 151569
11958A51569j34065j26996J78002J32178L952r0777m7233j2380q8422J31644K09902
$$ 151569 17504 -109492 68510 200688 204640 113863 66630 54250 -34172 97472 307374
11947C07374J8515j79182j53222j17254j31947n3486o0979J11722R211R0529j6089
$$ 307374 325889 146707 -6515 -123769 -255716 -309202 -370181 -258459 -249248 -158719 -174808
11936a74808K0362J64938O5227R6426r9624o1104m9085j38057P8247K32806j0266
$$ -174808 -154446 10492 75719 172145 72521 11417 -37668 -175725 -97478 135328 125062
11925A25062j37456l1118j5941k1225M1535k14566o1780J19615O6713J69030J000
$$ 125062 -12394 -43512 -59453 -80678 -39143 -253709 -315489 -195874 -129161 39869 40869
11914D0869K7272q8224r0773j00034j92140q2656m7536K05829N4624K2162K6885
$$ 40869 68141 -20083 -110856 -210890 -403030 -485686 -533222 -327393 -272769 -250607 -223722
11903b23722l2337K5616Q1855l5333M7978k8915l6365n9618j40312J86675K56985
$$ -223722 -256059 -230443 -148588 -183921 -135943 -164858 -201223 -260841 -401153 -214478 42507
11892D2507J59759j30097k55688N0460J30279Q178o2984J14475J95738J49537
$$ 42507 202266 72169 -183519 -133059 -2780 5398 -57586 56889 252627 402164
11882D02164J03020j45006j86205j93004r670J48556j46281m7096J70829j33087
$$ 402164 505184 360178 173973 -19031 -28701 119855 -26426 -73522 97307 -35780
11872c5780m1742r0053J21361J8125k1276K7500J23274J1917k15472r3168o1314
$$ -35780 -77522 -167575 -46214 -28089 -49365 -21865 101409 113326 -102146 -195314 -256628
11861b56628J22431N1834M2854J03796K09285L6586n2460j56051k31865k16431
$$ -256628 -134197 -82363 -39509 64287 273572 310158 257698 101647 -130218 -346649
11851c46649N9522J84269L8916o168q8928R0069M510n7581M0682J43386N7501
$$ -346649 -287127 -102858 -63942 -70110 -159038 -68969 -64459 -122040 -81358 62028 119529
11840A19529j63949n692j012j4386J5147N9498J1203r1167L0147n0601n2179J18389
$$ 119529 -44420 -50112 -51124 -65510 -50363 9135 20338 -70829 -40682 -91283 -143462 -25073
11828b5073O8476N0282m0157q1899m2610N0964N4771k7453Q2972o0066j53056
$$ -25073 43403 93685 53528 -28371 -70981 -20017 34754 7301 90273 30207 -122849
11817a22849n9834J6388M0172j5143n1387l3074L7572N1733Q2928l784j1240O4540
$$ -122849 -182683 -166295 -126123 -141266 -192653 -225727 -188155 -136422 -53494 -57278 -68518 -3978
11805c978m568P0561j16279l7329Q5971j05916m129M6296n9683N6871M5293p0254
$$ -3978 -8546 62015 -54264 -91593 -5622 -111538 -115667 -69371 -129054 -72183 -26890 -97144
11793i7144k9955J5288J40720Q1388O2959j32461o0388J88423Q6219J39762j7023
$$ -97144 -127099 -111811 28909 110297 173256 40795 -19593 168830 255049 394811 377788
11782C77788k59665j52049l8497N0499q6838m3755j8848Q2248R579J6340j1153
$$ 377788 118123 -33926 -72423 -21924 -108762 -152517 -171365 -89117 -79538 -63198 -74351
11771g4351N838j18210j2183q5062K1922Q0407P9217J1136J03179Q6662j5535
$$ -74351 -68513 -186723 -198906 -283968 -262046 -181639 -102422 -91286 11893 98555 83020
11760H3020p8712P7492O8374l1545r8443M5353K2424l3809Q1304r7677L514N5814
$$ 83020 4308 81800 150174 118629 20186 65539 87963 54154 135458 37781 41295 97109
11748I7109o403j02554l1484n0865m4793q1555l8699O4138J5058P9998L1475o0933
$$ 97109 90706 -11848 -43332 -94197 -138990 -220545 -259244 -195106 -180048 -100050 -68575 -129508
11736a29508J8569k885J56916K49661L8999j81912j63165N9243k6470q3754L4785
$$ -129508 -110939 -113824 43092 292753 331752 149840 -13325 45918 19448 -64306 -29521
11725b9521r6174l0474O6811J09253j92063l2663L6002J16958O546J0897J661
$$ -29521 -125695 -156169 -89358 19895 -172168 -204831 -168829 -51871 -45325 -34428 -32767
11714c2767N732k2758l6360j37153R8656R4887N653J02070N9730j28523J58434
$$ -32767 -27035 -49793 -86153 -223306 -124650 -29763 -24110 77960 137690 9167 167601
11703A67601L7724o6822m692J10876K9724K6915j16164l1802J75991r1926j50975
$$ 167601 205325 138503 133811 244687 274411 301326 185162 153360 329351 237425 86450
11692H6450o6077M3654j3629l5269j45414K1488Q8760j31785J16439J83607L0466
$$ 86450 20373 64027 50398 15129 -130285 -108797 -20037 -151822 -35383 148224 178690
11681A78690J21323j62707p0505J23675J30550j09777j23470o0095k1325M8215
$$ 178690 300013 137306 66801 190476 321026 211249 87779 27684 6359 54574
11671E4574p1897k92858L6041K69472J70772J40631k16885o9984j24240n0060
$$ 54574 -17323 -310181 -274140 -4668 166104 306735 89850 19866 -104374 -154434
11661a54434J12099q5635o5142j9037J64795J93072o7116p263j15351j18340j56738
$$ -154434 -42335 -127970 -193112 -212149 -47354 145718 78602 71339 -44012 -162352 -319090
11650c19090l5162m8487m991K74056J62191q0837K6261J8703q5842K8857K6226
$$ -319090 -354252 -402739 -407730 -133674 28517 -52320 -26059 -7356 -93198 -64341 -38115
11639c8115j08549j36746J29448L0018N6196J56191k3967l1234p0182q930j2273
$$ -38115 -146664 -283410 -153962 -123944 -67748 88443 64476 33242 -36940 -45870 -58143
11628e8143Q4073N0373j2668r258J20915N2635j8687k19852J05876P5905O7280
$$ -58143 25930 76303 63635 54377 175292 227927 209240 -10612 95264 171169 238449
11617B38449O1230o6603j63818o0282o5215k8754L8632N6132j08776j10879K30362
$$ 238449 299679 233076 69258 8976 -56239 -84993 -46361 9771 -99005 -209884 20478
11606B0478O4123K8066M3277j04761J33888J66681O274l1582R6632L1459k15284
$$ 20478 84601 112667 155944 51183 185071 351752 358026 326444 423076 454535 239251
11595B39251k16641K2098J42569M5137J04679J01548Q913P513j10486j31059j53345
$$ 239251 22610 44708 187277 232414 337093 438641 447554 455067 344581 213522 60177
11584F0177M0020J49962J00457j74268m9814M0728N9378j69721j03876M4210M2572
$$ 60177 100197 250159 350616 176348 126534 167262 226640 56919 -46957 -2747 39825
11573C9825J53420O5840r3644O2167O9k0413o9039N6236k9727k3829k4724Q3822
$$ 39825 193245 259085 165441 227608 227677 207264 138225 194461 164734 140905 116181 200003
11561B00003O8786o1088J25493p7347p4100m8829p3406Q4477j0715o7004J05557
$$ 200003 268789 207701 333194 255847 181747 132918 59512 143989 133274 66270 171827
11550A71827K3570j7008p5582R4715J61431p7016k0018m9978L0827L0971p5193
$$ 171827 195397 178389 102807 197522 358953 281937 261919 211941 242768 273739 198546
11539A98546j14845r1675J05992l7015O3281J03595j26769k3103Q9927m8043j19706
$$ 198546 83701 -7974 98018 61003 124284 227879 101110 78007 167934 119891 185
11528A85p4821m5643m2560J79765R9286l2949L3311M8815k45240j56046J07544
$$ 185 -74636 -120279 -162839 16926 116212 83263 116574 165389 -79851 -235897 -128353
11517a28353J47684p8145j23336N5426Q0606M4658J19385R3792Q8002j43086j58805
$$ -128353 19331 -58814 -182150 -126724 -46118 -1460 117925 211717 299719 156633 -2172
11506b172j10210K02411J9502m6703l0398N5681M2814k1070m1829O7001Q12J9348
$$ -2172 -112382 90029 109531 62828 32430 88111 130925 109855 68026 135027 135839 155187
11494A55187r8650q1903q7445n7205Q0895R0274M5915J24070l785K7316P7092
$$ 155187 56537 -25366 -112811 -170016 -89121 1153 47068 171138 167353 194669 271761
11483B71761J82789j63433j51998j32728k9J01280J50781l4114N1946P8526o1699
$$ 271761 454550 291117 139119 6391 6362 107642 258423 224309 276255 354781 293082
11472B93082o6551m9074P9949j20341r340J77538j26532K8133j70167O9767K10452
$$ 293082 226531 177457 257406 137065 127725 305263 178731 206864 36697 106464 316916
11461C16916J55713q3755j76294Q492N3982K0827j93551r926J44529k402k27566
$$ 316916 472629 388874 212580 221072 275054 295881 102330 92404 236933 234531 6965
11450F965k283l3757R2746M7148l2958p6983l9922K8049L1707J7838J35526J47530
$$ 6965 4682 -29075 63671 110819 77861 878 -39044 -10995 20712 38550 174076 321606
11438C21606M2407K8273m1113q7949k6241O4794k44455j17188o2241K4715J58775
$$ 321606 364013 392286 351173 263224 236983 301777 57322 -59866 -122107 -97392 61383
11427F1383R876O2478j19451j57249r9884L7354M8915J02127J24718K86395j16012
$$ 61383 71259 133737 14286 -142963 -242847 -205493 -156578 -54451 70267 356662 240650
11416B40650j66359M0342N7190n9496N5371j03019j20998k754M8928r4815n340
$$ 240650 74291 114633 171823 112327 167698 64679 -56319 -59073 -10145 -104960 -110300
11405a10300R8638M1886J4329q3445p1567K34904J90229j23865o3027R5422K8709
$$ -110300 -11662 30224 44553 -38892 -110459 124445 314674 190809 127782 223204 251913
11394B51913j7869j67820m8243O0734O7593J54871p6203j88683q3202O4170J12691
$$ 251913 234044 66224 17981 78715 146308 301179 224976 36293 -46909 17261 129952
11383A29952j13123L1768K04527p4216j19467j12291J02681L5752j7129R7083
$$ 129952 16829 48597 253124 178908 59441 -52850 49831 85583 68454 165537
11373A65537J0919O3135k7361o9938q1979K48J51923J6817R132Q8535M6663R805
$$ 165537 176456 239591 212230 142292 60313 60561 212484 229301 238433 326968 373631 383436
11361C83436m662m9317M3846L889m4554r4525L1888l1752L4637r4571j7096Q3337
$$ 383436 378774 329457 373303 377192 332638 238113 270001 238249 272886 178315 161219 244556
11349B44556j59070j20028m0808l2606p1371P373R128m7476Q1547L2495O0881
$$ 244556 85486 -34542 -75350 -107956 -179327 -171954 -162826 -210302 -128755 -96260 -35379
11338c5379J03152J40377K49272K27381L9984O7655M0579L2318J25254L56659
$$ -35379 67773 208150 457422 684803 724787 792442 833021 865339 990593 1347252
11328A347252K56979k1613J03671j09158l75298l54674o4198j62369L1644q6588
$$ 1347252 1604231 1582618 1686289 1577131 1201833 847159 782961 620592 652236 565648
11318E65648k12610P3976J68805J16443Q4401J07621J05954O6282M6254O0117
$$ 565648 353038 427014 595819 712262 796663 904284 1010238 1076520 1122774 1182891
11308A182891k70879j77771m8517J42522j12483j17427l0216R1677J24109n4202
$$ 1182891 912012 734241 685724 828246 715763 598336 568120 659797 783906 729704
11298G29704K426K20838K13033J62963L00537m8133l10229j55272k35991j21047
$$ 729704 732130 952968 1166001 1328964 1629501 1581368 1271139 1115867 879876 758829
11288G58829j9083n9003k8246k03742M3248J54480J57864J81979Q7957L87j85537
$$ 758829 739746 680743 652497 448755 492003 646483 804347 986326 1074283 1074670 889133
11277H89133j9925j6871j26639k21187j42549L7544M7865P8326K16163J62099
$$ 889133 869208 852337 725698 504511 361962 399506 447371 525697 741860 903959
11267I03959K15631J20236R5942J46280p5426J42985K08210m6963k65208k82531
$$ 903959 1119590 1239826 1335768 1482048 1406622 1549607 1757817 1710854 1445646 1163115
11257A163115l01318k09612k43038k45585O628m90n9331j1264k3501K603Q4914
$$ 1163115 861797 652185 409147 163562 170190 169700 110369 99105 75604 78207 163121
11246A63121Q620q289J02623m0008q4116q142l5788p9797P4430k5052K165M3008
$$ 163121 171741 163452 266075 226067 141951 133809 98021 18224 92654 67602 69767 112775
11234A12775Q023m35N5079N5452j05629l2765P9785j26452j2159k3438J6089K6231
$$ 112775 120798 120363 175442 230894 125265 92500 172285 45833 33674 10236 26325 52556
11222E2556p1012j09309m1614n722m1525N7629Q0695l4206M4944N6632J0123o1287
$$ 52556 -18456 -127765 -169379 -175101 -216626 -158997 -78302 -112508 -67564 -10932 -809 -62096
11210f2096M2922Q9365k8224n6804j75414j3823O9981J45004L1098l6053O3294
$$ -62096 -19174 70191 41967 -14837 -190251 -204074 -134093 10911 42009 5956 69250
11199F9250Q2561j19203j3298N9660k6150j15201l6504K3780P1630J47499o6792
$$ 69250 151811 32608 19310 78970 52820 -62381 -98885 -75105 -3475 144024 77232
11188G7232q4938J43824O3765J06017K671n5426o0082j5592k287R5109j09008
$$ 77232 -7706 136118 199883 305900 308571 253145 193063 177471 175184 270293 161285
11177A61285j02490m0316j62951K199j2259J68858J12678q1634r1602Q9197m4506
$$ 161285 58795 18479 -144472 -142273 -154532 14326 127004 45370 -46232 42965 -1541
11166a541k8036J0342k2391j4062J11900K28520O9817l1377j92099j06065j9562
$$ -1541 -29577 -19235 -41626 -55688 56212 284732 354549 323172 131073 25008 5446
11155E446l2330j41968P7961K8699Q7992K5019j37656K8733J70434K12899j843
$$ 5446 -26884 -168852 -90891 -62192 25800 50819 -86837 -58104 112330 325229 323386
11144C23386K9316r8440p1464K68627N4020j59064o9525N149n1863r497M5303
$$ 323386 352702 254262 182798 451425 505445 346381 276856 282005 230142 220645 265948
11133B65948m31J51399O107l44858N2657J96778K12106o1174p9556R060M8804
$$ 265948 265517 416916 423023 78165 130822 327600 539706 478532 398976 408036 456840
11122D56840M1892m9630j10369Q9096l6910k17210j56738K3184J2766P2322K45968
$$ 456840 498732 449102 338733 427829 390919 173709 16971 40155 52921 125243 371211
11111C71211n805j28115J25723N401j78552j9964n8011M3788J02215m9975j03941
$$ 371211 365406 237291 363014 368415 189863 169899 111888 155676 257891 207916 103975
11100A03975L130r1835J56856M6572J17776R9545J43795R953K4976P2555M2754
$$ 103975 107105 15270 172126 218698 336474 436019 579814 589767 614743 687298 730052
11089G30052k7849q5556n3465J5841J12324L5866j58674o9332n151q7017k64039
$$ 730052 702203 616647 563182 579023 691347 727213 568539 499207 494056 407039 143000
11078A43000j36218J40324J71441J14627r4850j47344K39431K80580j62276k09702
$$ 143000 6782 147106 318547 433174 338324 190980 430411 710991 548715 339013
11068C39013L029L3076j9091K6350J86035P8964j69059l4017q2766q1353N5925
$$ 339013 342042 375118 356027 382377 568412 647376 478317 444300 361534 280181 336106
11057C36106R7618J00966J03464R1955q2688k33295p9454J75712R429j46168r1765
$$ 336106 433724 534690 638154 730109 647421 414126 334672 510384 519813 373645 281880
11046B81880j56975J66224J20143J38587J82651J3435J28632k8244p7982P0170
$$ 281880 124905 291129 411272 549859 732510 745945 874577 846333 768351 838521
11036H38521J67037J74756p1047M9212K07262K00327J29892O570k32929l50565
$$ 838521 1005558 1180314 1109267 1158479 1365741 1566068 1695960 1702530 1469601 1119036
11026A119036k46843k92548o5072n1956j58123m1571N0394J37266J1129R2703
$$ 1119036 872193 579645 514573 462617 304494 262923 313317 450583 461712 554415
11016E54415q5665J56147K38450k71218o3746J25032k6835l0087j5397Q9690J31073
$$ 554415 468750 624897 863347 592129 528383 653415 626580 596493 581096 670786 801859
11005H01859k39604k38456O9063J94703K1404k5021q0175j72804m2757P2930J74022
$$ 801859 562255 323799 392862 587565 608969 583948 503773 330969 288212 361142 535164
10994E35164J42059Q1531J01868m3644j10284j03070P815K2858P2871J44840J39697
$$ 535164 677223 758754 860622 816978 706694 603624 611439 634297 707168 852008 991705
10983I91705j59553J02679R976j52191Q6603j3978J24242q1107L4960K5643m8418
$$ 991705 832152 934831 944807 792616 879219 865241 989483 908376 943336 968979 920561
10972I20561j20797J34382L7703q8011J4181n9466N3389Q8567j25968K7738J04597
$$ 920561 799764 934146 971849 883838 898019 838553 891942 980509 854541 882279 986876
10961I86876K3167k6021k0752p1297K269J87985j07954P0244K14352J88926K07812
$$ 986876 1010043 984022 963270 891973 894242 1082227 974273 1044517 1258869 1447795 1655607
10950A655607Q6899j55201R5846L1525q6887m8751j7549J4626J15060J09381J18387
$$ 1655607 1742506 1587305 1683151 1714676 1627789 1579038 1561489 1576115 1691175 1800556 1918943
10939A918943O4988J4427Q3868K20637J18932J30291K9194J13672K29473J56344
$$ 1918943 1983931 1998358 2082226 2302863 2421795 2552086 2581280 2694952 2924425 3080769
10929C080769j24679K75856J97317Q0291J17641K56373K26702J96375J97948K8873
$$ 3080769 2956090 3231946 3429263 3509554 3627195 3883568 4110270 4306645 4504593 4533466
10919D533466l0498J37996L20893M74097O54135M46975M89837O54678Q14381P22999
$$ 4533466 4502968 4640964 4961857 5435954 6090089 6537064 7026901 7681579 8495960 9218959
10909I218959R20086R73079J300816J438084J909269K310144K713223L365054
$$ 9218959 10139045 11112124 12412940 13851024 15760293 18070437 20783660 24148714
10901B4148714M250992N435998P393503R822186J3509270J9006767K6491733L5064774
$$ 24148714 28399706 33835704 41229207 51051393 64560663 83567430 110059163 145123937
10893A45123937M3579218M9123256M6251076K8669572j272261k8026779m0073001
$$ 145123937 188703155 237826411 284077487 312747059 311474798 283448019 243375018
10886B43375018m0875527l6410295k9562870k2167735j4812174p539122p33663
$$ 243375018 202499491 166089196 136526326 114358591 99546417 92007295 91273632
10879I1273632N513186J1875015J6497322J8507707J6981966J1858121M827919
$$ 91273632 96786818 108661833 125159155 143666862 160648828 172506949 177334868
10872A77334868k452949r207914j4316374j6388734j4728093j0303959m347625
$$ 177334868 174881919 165674005 151357631 134968897 120240804 109936845 105589220
10865A05589220K348738R354991J6358962K3039807K8441482L2372103L2630834
$$ 105589220 107937958 117292949 133651911 156691718 185133200 217505303 250136137
10858B50136137K6750062J3316976m932352k2059282l2969441l5173840l0770733
$$ 250136137 276886199 290203175 285270823 263211541 230242100 195068260 164297527
10851A64297527k3965439j6843159r446268k065423N031918J0681693J4099918
$$ 164297527 140332088 123488929 114042661 111977238 117009156 127690849 141790767
10844A41790767J4594140J1627676N765175j198851p898174j3856764j7962793
$$ 141790767 156384907 168012583 173777758 172578907 164680733 150823969 132861176
10837A32861176j8374004j5191307r846091l604820K667128Q805798J4851982
$$ 132861176 114487172 99295865 89449774 85844954 88512082 97317880 112169862
10830A12169862K1348638K7767886L3918513L7520406L5571911K5222877L816779
$$ 112169862 133518500 161286386 195204899 232725305 268297216 293520093 297336872
10823B97336872k4522266m5549850m9844722m2888565l2970821k4119325j7307006
$$ 297336872 272814606 227264756 177420034 134531469 101560648 77441323 60134317
10816F0134317j2223885q383796o164795m510939l674267l087056k610664k167557
$$ 60134317 47910432 39526636 33361841 28850902 25176635 22089579 19478915 17311358
10808A7311358j652007j474054j211075j182722q91217q13488o87689l78117m86199
$$ 17311358 15659351 14185297 12974222 11791500 10900283 10086795 9399106 9020989 8534790
10799H534790m56104m63691l24795m56148o14945m33973j63578l38795l69061
$$ 8534790 8078686 7614995 7290200 6834052 6219107 5785134 5621556 5282761 4913700
10790D913700l18366j89832j77473j34707j07321o1164j73085k24050j49052n4196
$$ 4913700 4595334 4405502 4228029 4093322 3986001 3924837 3751752 3527702 3378650 3324454
10780C324454k35804l7837p4020k43632J0652L5804j72240j16750j0201o6148
$$ 3324454 3088650 3050813 2976793 2733161 2743813 2779617 2607377 2490627 2480426 2414278
10770B414278J01097j13976j16519J20914j24737j45396J67534m4766J0568o5760
$$ 2414278 2515375 2401399 2284880 2405794 2281057 2135661 2303195 2258429 2268997 2203237
10760B203237M5208J8642j4184j0462j12572j83592q2409p982N4308J09458k5477
$$ 2203237 2248445 2267087 2252903 2242441 2129869 1946277 1863868 1855886 1910194 2019652 1994175
10749A994175j09620k91401K9340L7209l1014K4425n0242k8524p2009P3339J45501
$$ 1994175 1884555 1593154 1622494 1659703 1628689 1653114 1602872 1574348 1502339 1575678 1721179
10738A721179k6938j71696J26489r702k28666O7246j34807p159R2538L6499l964
$$ 1721179 1694241 1522545 1649034 1639332 1410666 1477912 1343105 1335946 1428484 1464983 1461019
10727A461019j625L8919M9875J21373k8586q829M6844j22350k39921j88784N9501
$$ 1461019 1459394 1498313 1548188 1669561 1640975 1632146 1678990 1556640 1316719 1127935 1187436
10716A187436O3229k3607o5750M513j72620J3895J9356J1475p9438J11280j47474
$$ 1187436 1250665 1227058 1161308 1165821 993201 1007096 1026452 1037927 958489 1069769 922295
10705I22295k48323k9516N987J76458K17907j16122k37242J57969P0379L1482
$$ 922295 673972 644456 650443 826901 1044808 928686 691444 849413 919792 951274
10695I51274J62649j63676k06350j32993N3743J4973Q8358K06958K63411L32265
$$ 951274 1113923 950247 743897 610904 664647 679620 767978 974936 1238347 1570612
10685A570612R8913r9247j41433p4365k86103K5278j2239j57880j90872j80258
$$ 1570612 1669525 1570278 1428845 1354480 1068377 1093655 1081416 923536 732664 552406
10675E52406J17176J21055m9277r4227j41743n0257j4748J04618R4050o9813n4878
$$ 552406 669582 790637 741360 647133 505390 455133 440385 545003 639053 569240 514362
10664E14362j29903j28537J27288K6065j22754k9021j59483n70Q6411K3073j4488
$$ 514362 384459 255922 383210 409275 286521 257500 98017 97447 183858 206931 192443
10653A92443l5672p4725J19862K78026K20874m9185J13766r4360j93878k15213
$$ 192443 156771 82046 201908 479934 700808 651623 765389 671029 477151 261938
10643B61938k26817Q4185N5829M1476L4544l9901m9276N4585M9608o8767o4810
$$ 261938 35121 119306 175135 216611 251155 211254 161978 216563 266171 197404 132594
10632A32594N2962J95204J02049j29611O8196l25L339m6432N6926o6922q8535
$$ 132594 185556 380760 482809 353198 421394 421069 424408 377976 434902 367980 279445
10621B79445o400J4373j5721N9164p7879L1502m5650J5796Q8339j47105q118L8898
$$ 279445 273045 287418 271697 330861 252982 284484 238834 254630 342969 195864 187746 226644
10609B26644j0763k2865L8272O7209J50952p6859j29616J18641j07934l4632P5292
$$ 226644 215881 193016 231288 298497 449449 372590 242974 361615 253681 219049 294341
10598B94341m7259n5421n8206M0649Q2511j05339j56931J69457O2658m7192J0729
$$ 294341 247082 191661 133455 174104 256615 151276 -5655 163802 226460 179268 189997
10587A89997L1244P4865J18422O1873P1031K2227j5728O7000J4673r6107j62425
$$ 189997 221241 296106 414528 476401 547432 569659 553931 620931 635604 539497 377072
10576C77072j63517j7473j1660K22743J58505n5114n3944k93271p6991L6682K30340
$$ 377072 213555 196082 184422 407165 565670 510556 456612 163341 86350 123032 353372
10565C53372L6703q6698j52403p5309r2452O8114K0519j04017o5388J22789K5533
$$ 353372 390075 303377 150974 75665 -16787 51327 71846 -32171 -97559 25230 50763
10554E0763K56065N8182l20406k46706M0985J12659j42013K3310J55865R7429
$$ 50763 306828 365010 44604 -202102 -161117 -48458 -190471 -167161 -11296 86133
10544H6133k01902M9213J26979J58275l6601p7331J85079O9259q9857r9661O7086
$$ 86133 -115769 -66556 60423 218698 182097 104766 289845 359104 269247 169586 236672
10533B36672L642j15552L8175O3287J31775j3495k16682J4950j0082L8292O1814
$$ 236672 240314 124762 162937 226224 357999 344504 127822 142772 132690 170982 232796
10522B32796j40179m3334J95141K49594l120j84274l27986k56489M4418Q2231
$$ 232796 92617 49283 244424 494018 490898 306624 -21362 -277851 -233433 -151202
10512a51202J05900Q9481K92756j42431n747r4827j15840n2517j8567J98089J69942
$$ -151202 -45302 44179 336935 194504 188757 93930 -21910 -74427 -92994 105095 275037
10501B75037j76216r1913j40855N8816K47406J79664j03841m6051j06617j48977
$$ 275037 98821 6908 -133947 -75131 172275 351939 248098 202047 95430 -53547
10491e3547k0186p6102M2682O6097j63502K03700J14890p3077P3996j1119P3286
$$ -53547 -73733 -149835 -107153 -41056 -204558 -858 114032 40955 114951 103832 177118
10480A77118j17479j25871p6380r7456j4582J53909L4264k0076J06086K77614
$$ 177118 59639 -66232 -142612 -240068 -254650 -100741 -66477 -86553 19533 297147
10470B97147k709K4653q996j00961o9254K573J27713K1562j96175M3364j22452
$$ 297147 294438 319091 310095 209134 139880 142453 270166 291728 95553 138917 16465
10459A6465N2808K80911P5823J11783J32632K08457P6371l5374r0780J46093K56037
$$ 16465 69273 350184 426007 537790 670422 878879 955250 919876 829096 975189 1231226
10448A231226K64032J07489l4247j79804l7470k51861k07202P1771r0936l5786
$$ 1231226 1495258 1602747 1568500 1388696 1351226 1099365 892163 963934 872998 837212
10438H37212j51750p386o7300K1379R9744J25762J34426N9443l2525j32904Q1602
$$ 837212 685462 678076 610776 632155 731899 857661 992087 1051530 1019005 886101 967703
10427I67703j05666L6436L9978k51028r5461J02396R8314o6353R1438K48165J77745
$$ 967703 862037 898473 938451 687423 591962 694358 792672 726319 817757 1065922 1243667
10416A243667J53495q418K8107m8634j32486j85097l0380j63494j95114q8790
$$ 1243667 1397162 1388744 1416851 1368217 1235731 1050634 1020254 856760 661646 572856
10406E72856P2636j93581J4549J05545P4108O6876J06013j02706O263L2172K2880
$$ 572856 645492 451911 466460 572005 646113 712989 819002 716296 722559 754731 777611
10395G77611M8920j15063l1477j69460j66532J09263J45441J69726Q6278Q0998
$$ 777611 826531 711468 679991 510531 343999 453262 598703 768429 854707 935705
10385I35705K33726J06845J30848J44619j80645o1564K4735l61307k10796j24956
$$ 935705 1169431 1276276 1407124 1551743 1371098 1309534 1334269 972962 762166 637210
10375F37210k28681k9804O3434j04361j40961k02002j2190q4408N677M3935J10497
$$ 637210 408529 378725 442159 337798 196837 -5165 -17355 -101763 -96086 -52151 58346
10364E8346K3160q7603K5690j00215p1458J02416K1244R1789k9018K8498P6884
$$ 58346 81506 -6097 19593 -80622 -152080 -49664 -28420 63369 34351 62849 139733
10353A39733r7786j13840j52201p0936J73333K48040m4050n0844J26892J16038
$$ 139733 41947 -71893 -224094 -295030 -121697 126343 82293 31449 158341 274379
10343B74379k7365j81678j0651J46550J35065j55697j00994P1961r6517k07949
$$ 274379 247014 65336 54685 201235 336300 180603 79609 151570 55053 -152896
10333a52896q8178J30359Q5076q2382J79281K4419j92920J6657q4462o2844R5320
$$ -152896 -241074 -110715 -25639 -108021 71260 95679 -97241 -80584 -165046 -227890 -132570
10322a32570J52807o0577q4705O4079J18189J15677M5181j6757m0202J2446j26590
$$ -132570 20237 -40340 -125045 -60966 57223 172900 218081 201324 161122 173568 46978
10311D6978L6648l67n888l657j91338j22799Q3332j2459J19944k1161j09496K9362
$$ 46978 83626 83259 77371 73714 -117624 -240423 -157091 -169550 -49606 -70767 -180263 -150901
10299a50901J74109o3326R095J8769j24656j4222J61323K37903q2758K1970m2500
$$ -150901 23208 -40118 -31023 -12254 -136910 -151132 10191 248094 165336 187306 144806
10288A44806n828j44103m26J39433n9983j21788J4789r7295j22537n0989k6851
$$ 144806 138978 -5125 -5551 133882 73899 -47889 -33100 -130395 -252932 -303921 -330772
10277c30772q6124J19838n4739P8272J2319O540N1012J91481J34695o7735r9258
$$ -330772 -416896 -297058 -351797 -273525 -261206 -254666 -203654 -12173 122522 54787 -44471
10266d4471q6276q8216Q720J60440N1262L7598J15688J17780p5686j12649q8645
$$ -44471 -130747 -218963 -210243 -49803 1459 39057 154745 272525 196839 84190 -4455
10255d455k1779p51J9685j02981R652K1816L1923J9394O951L3899K5381K19881
$$ -4455 -26234 -26985 -7300 -110281 -100629 -78813 -46890 -27496 -20545 13354 38735 258616
10243B58616o61j40143Q0543o7152M6667J03578o0855l5098J32577J30000k2248
$$ 258616 257955 117812 198355 131203 177870 281448 220593 185495 318072 448072 425824
10232D25824j29791l03130o0749J77271J12057j283l6075N4923j06915m887r398
$$ 425824 296033 -7097 -67846 109425 221482 220199 184124 239047 132132 127245 117847
10221A17847o4591o3198p2675j51286j88J30260N6123M8182m6486J9551k6728
$$ 117847 53256 -9942 -82617 -233903 -234091 -103831 -47708 474 -46012 -26461 -53189
10210e3189n1132K02423J00093M8099N4566r208o331j47031p4435p6270j47632
$$ -53189 -104321 98102 198195 246294 300860 291652 285321 138290 63855 -12415 -160047
10199a60047J01545Q9604J01638L9452j8548l3934q5009K07741J80129n6916m6064
$$ -160047 -58502 31102 132740 172192 153644 119710 34701 242442 422571 365655 319591
10188C19591P4706N8471o6144J0614M4384N7172J9526n3699r8891p4759j62745
$$ 319591 394297 452768 386624 397238 441622 498794 518320 464621 365730 290971 128226
10177A28226L2808q7387n0693J8141j01312J0435J04866j55724m3015J90149J85712
$$ 128226 161034 73647 22954 41095 -60217 -49782 55084 -100640 -143655 46494 232206
10166B32206J75855k1456j79108k35033j23201q7855n6538R980K8616K04307R0556
$$ 232206 408061 386605 207497 -27536 -150737 -238592 -295130 -285150 -256534 -52227 38329
10155C8329q9815J86363q0033Q0830J40922L1240j32567n0132J02238J91130k0009
$$ 38329 -51486 134877 54844 135674 276596 307836 175269 125137 227375 418505 398496
10144C98496l400j30082k71969j60917j34408J31569R2688J20836M1657J41453
$$ 398496 395096 265014 -6955 -167872 -302280 -170711 -78023 42813 84470 225923
10134B25923k2905j82521m0748J6745J26547O5648L1276j43484J2208J66065P9108
$$ 225923 203018 20497 -20251 -3506 123041 188689 219965 76481 88689 254754 333862
10123C33862n0854j58713N3619k0894j82755J5577K02212J23962p2760P9965R2341
$$ 333862 283008 124295 177914 157020 -25735 -10158 192054 316016 243256 323221 415562
10112D15562K6184k06819j98635J31122J81562o999p9060Q1656K93325j27610
$$ 415562 441746 234927 36292 167414 348976 341977 262917 344573 637898 510288
10102E10288l94852p6611k6623j11022k1336J9117J32858J45724k5164l4078L5293
$$ 510288 115436 38825 12202 -98820 -120156 -101039 31819 177543 152379 118301 153594
10091A53594Q345R9k20579J55417j08561j57595p6922J49711O2655r2992m2552
$$ 153594 161939 162038 -58541 96876 -11685 -169280 -246202 -96491 -33836 -126828 -169380
10080a69380p1602R1780Q4883l616r3304N9486o2891J3914P5259K3769K0890j08265
$$ -169380 -240982 -149202 -64319 -67935 -161239 -101753 -164644 -150730 -75471 -51702 -30812 -139077
10068a39077k2778n5644N0170q6399R4172O2547j29785p0291j2645k987N9017
$$ -139077 -161855 -217499 -167329 -253728 -159556 -97009 -226794 -297085 -309730 -312717 -253700
10057b53700n4426N0118J17265J97651J14380R5201j86227j21736L2660K5659
$$ -253700 -308126 -258008 -140743 56908 171288 266489 80262 -41474 -8814 16845
10047A6845p2364j66986O6070J57103J04843L3785J38028N045j93382q0329J59953
$$ 16845 -55519 -222505 -156435 668 105511 139296 277324 282369 88987 8658 168611
10036A68611K1052J37471M4346j22514j73608k0383P1992r97K3307j14769O742
$$ 168611 189663 327134 371480 248966 75358 54975 126967 125970 149277 34508 41250
10025D1250J06305K0859l9293J51247q9506k19411R139j19084j92351J22077R458
$$ 41250 147555 168414 129121 280368 190862 -28549 -19410 -138494 -330845 -208768 -199310
10014a99310J31989l8016P2552o5100j71151J31854K55516J31780L2383K22954
$$ -199310 -67321 -105337 -32785 -97885 -269036 -137182 118334 250114 282497 505451
10004E05451N00774N20336P24770Q67495K07003o41690q63435o86189n27435k10951
$$ 505451 1006225 1526561 2251331 3118826 3325829 2684139 1820704 1134515 607080 396129
9994C96129k60544j14748K3269q5291J7098j06967n0629Q7558l4140O9302N5602
$$ 396129 135585 20837 44106 -41185 -24087 -131054 -181683 -94125 -128265 -58963 -3361
9983c361M3888J2891p317j27522P810J07523K21721k53555j63285Q2352J9629
$$ -3361 40527 53418 46101 -81421 -73611 33912 255633 2078 -161207 -78855 -59226
9972e9226J47403m2077j67147M4413O4576j7297m4088J692J5571p767N7336O403
$$ -59226 88177 46100 -121047 -76634 -12058 -29355 -73443 -71751 -56180 -63947 -6611 -208
9960b08k28349k25822L21178J33736N9277k6393l5125r7046J5150o5301p736O2203
$$ -208 -228557 -454379 -133201 535 59812 33419 -1706 -98752 -83602 -148903 -156639 -94436
9948i4436k82733J35031J92648p152L2905N1400L0751j13965M0046o7909r8514
$$ -94436 -377169 -242138 -49490 -56642 -23737 27663 58414 -55551 -15505 -83414 -181928
9937a81928K0101M6143K9784r9007n5524p7204K81163J93680j1753j39308r1587
$$ -181928 -161827 -115684 -85900 -184907 -240431 -317635 -36472 157208 145455 6147 -85440
9926h5440O8867N0469L7357n5410j02595j62773j12076R274J22948j27862J02329
$$ -85440 -16573 33896 71253 15843 -86752 -249525 -361601 -352327 -229379 -357241 -254912
9915b54912K11538J32977o3630J09416O2097j74896l1897N2690L8499n886K2178
$$ -254912 -43374 89603 25973 135389 197486 22590 -9307 43383 81882 75996 98174
9904I8174k9332l8537j10311l406O53Q4009J75752R3441J40640J86794m340j78062
$$ 98174 68842 30305 -80006 -83412 -82759 1250 177002 270443 411083 597877 593537 415475
9892D15475k28413m7619M6495M5582n2571J80258L332j17621k2139r3557k6264
$$ 415475 187062 139443 185938 231520 178949 359207 362539 244918 222779 129222 102958
9881A02958j71034R9855j1315r4140q779R6947q5652j24035O2553J26723P4554
$$ 102958 -68076 31779 20464 -73676 -82455 14492 -71160 -195195 -132642 -5919 68635
9870F8635m1852J26981J27441J6266j7163q3754n9543l7267k3438o7355J0829
$$ 68635 26783 153764 281205 297471 280308 196554 137011 99744 76306 8951 19780
9859A9780J66943K46489M3142q824J1194k82789k87592j37764o4002J43786R4337
$$ 19780 186723 433212 476354 467530 478724 195935 -91657 -229421 -293423 -149637 -55300
9848e5300J2204Q2011r1497j17378k6586J77938K32295N9542k1470j22484k10812
$$ -55300 -43096 38915 -52582 -169960 -196546 -18608 213687 273229 251759 129275 -81537
9837h1537j47537J65739J60305n3220k59587l0285L4741J1124N5324J74433O9585
$$ -81537 -229074 -63335 96970 43750 -215837 -246122 -211381 -200257 -144933 29500 99085
9826I9085k28048q6401Q8364J27955o6633j62452m7219J13508q2057Q2943J50604
$$ 99085 -128963 -215364 -127000 955 -65678 -228130 -275349 -161841 -243898 -160955 -10351
9815a0351O4495r7607r4705l1869J13606J52945Q4088r1001r5883k14162K2163
$$ -10351 54144 -43463 -138168 -170037 -56431 96514 180602 89601 -6282 -220444 -198281
9804a98281n6307M5973J227J77925k2646J53364m997K7220m3450j1552J0810N7050
$$ -198281 -254588 -208615 -207388 -29463 -52109 101255 96258 123478 80028 68476 79286 136336
9792A36336J1843q9751O25j17401j9785n3871Q3527o0368j66329L8913k6495K67701
$$ 136336 148179 58428 59053 -58348 -78133 -132004 -48477 -108845 -275174 -236261 -262756 4945
9780D945O9758K6865p5251J4676q443j8823j8087j17458J08705M049k8879l4697
$$ 4945 74703 101568 26317 40993 32550 13727 -4360 -121818 -13113 -9064 -37943 -72640
9768g2640m414O9702o6284r7645j22171l1092N3482L8775o3222J48208p381r8292
$$ -72640 -77054 -7352 -73636 -171281 -293452 -324544 -271062 -232287 -295509 -147301 -154682 -252974
9756b52974M9978M3326j9436L7907r2003J24377N9270N5457q5203n8591q068J67185
$$ -252974 -202996 -159670 -179106 -141199 -233202 -108825 -49555 5902 -79301 -137892 -145960 21225
9744B1225J16198r4246j09197o7728J88041K57483r702k18360j67505L6294j87501
$$ 21225 137423 43177 -66020 -133748 54293 311776 302074 83714 -83791 -47497 -234998
9733b34998l6013J91893J70889j20399Q2164k3912j95760j13223l2314k628J57541
$$ -234998 -271011 -79118 91771 -28628 53536 29624 -166136 -279359 -311673 -314301 -156760
9722a56760J05509N740M5643J30939r5658k68910N6535P9409j3096k5697J95737
$$ -156760 -51251 -45511 132 131071 35413 -233497 -176962 -97553 -110649 -136346 59391
9711E9391J94858J02449p7403k39042k88560M0820K38019l2213j24820j11600
$$ 59391 254249 356698 279295 40253 -248307 -207487 30532 -1681 -126501 -238101
9701b38101j06256O813K3054R1976l4517j35109J78120K36739j6345j02900M169
$$ -238101 -344357 -337544 -314490 -222514 -257031 -392140 -214020 22719 6374 -96526 -92357
9690i2357M5403K4133J09322m6459o1200m4795n061J85720J53038k9816k09260
$$ -92357 -46954 -22821 86501 40042 -21158 -65953 -71014 114706 267744 237928 28668
9679B8668p4643J47508j97351j4314k8111j6326J20631l802l4189M1620L5613
$$ 28668 -45975 101533 -95818 -110132 -138243 -154569 -33938 -37740 -71929 -30309 5304
9668E304N1464J24191j6151k01378o6185m9593J84255J77828N7995j2055p2881
$$ 5304 56768 180959 164808 -36570 -102755 -152348 31907 209735 267730 255675 182794
9657A82794j76391l8540r0194J43019R9523M6715k1621n3925K3292j2622n9565
$$ 182794 6403 -32137 -122331 20688 120211 166926 145305 91380 114672 102050 42485
9646D2485J39352J00010p4364k36610J3145J32452j24659r6839M9661o2445K5871
$$ 42485 181837 281847 207483 -29127 -15982 116470 -8189 -105028 -55367 -117812 -91941
9635i1941L394l956Q3058J6689p8636k9185N2182p4313J0339O7569j22671l62114
$$ -91941 -88547 -92503 -9445 7244 -71392 -100577 -48395 -122708 -112369 -44800 -167471 -529585
9623e29585M4306K00828L7145N0147J67770P228J07556j32679k62959N1563m4580
$$ -529585 -485279 -284451 -247306 -197159 -29389 -22161 85395 -47284 -310243 -258680 -303260
9612c03260j3833K25341J03781m9415J7215R2231r7199j49567P8521J32086L8465
$$ -303260 -317093 -91752 12029 -37386 -20171 72060 -25139 -174706 -96185 35901 74366
9601G4366j37824l8582J12845J15950j30518j95234l9114R9824L7837J01239l6469
$$ 74366 -63458 -102040 10805 126755 -3763 -198997 -238111 -138287 -100450 789 -35680
9590c5680o2498R8201K08920K2149l0546j16145m884k3412j28087O1910r6946
$$ -35680 -98178 23 208943 231092 200546 84401 79517 56105 -71982 -10072 -107018
9579a07018k5304L3938j77777K3107J20415m7582K50126P0226M4975q8501Q359
$$ -107018 -132322 -98384 -276161 -253054 -132639 -180221 69905 140131 185106 96605 104964
9568A04964l6762O6656q3107j21291N0951k3915q3847L3293O9596Q516j05468
$$ 104964 68202 134858 51751 -69540 -18589 -42504 -126351 -93058 -23462 -14946 -120414
9557a20414P6711J49670j07080q6875m2975J7780N5556J69851K6522j05485j1766
$$ -120414 -43703 105967 -1113 -87988 -130963 -113183 -57627 112224 138746 33261 21495
9546B1495l772M0886M0206p1779j23534N2622K08401J61881r7603l14590p7162
$$ 21495 17723 58609 98815 27036 -96498 -43876 164525 326406 228803 -85787 -162949
9535a62949M972L5709Q9728J62291M0104J125R5001O1492J3365o2406j09052k3629
$$ -162949 -157977 -122268 -32540 129751 169855 170980 265981 327473 340838 278432 169380 145751
9523A45751j48489J8165J00601j3141O952Q2390L5026m4147r0935r9455j0405
$$ 145751 -2738 15427 116028 102887 109839 192229 227255 183108 92173 -7282 -17687
9512a7687K5242k60239l3968J98162Q4738M7105R6542N0053j20901j35907j17082
$$ -17687 7555 -252684 -286652 -88490 -3752 43353 139895 189948 69047 -66860 -183942
9501a83942j41964O6134J63508L5925p7421j15098j2917M7752m6752M9549O0006
$$ -183942 -325906 -259772 -96264 -60339 -137760 -252858 -265775 -218023 -264775 -215226 -155220
9490a55220R5842j22166o4724j55571L5653J42975J09269o8969Q4318K11341J4630
$$ -155220 -59378 -181544 -246268 -401839 -366186 -223211 -113942 -182911 -98593 112748 127378
9479A27378p1414o3928J18775l0710J40695k8417M0826j98548q5145L4259O7816
$$ 127378 55964 -7964 110811 80101 220796 192379 233205 34657 -50488 -16229 51587
9468E1587L1180k2771j71163l8661Q2799J28778P8449J07990l4147j51106J8689
$$ 51587 82767 59996 -111167 -149828 -67029 61749 140198 248188 214041 62935 81624
9457H1624J6214M8557J01048j42514n3512K3816L211p3797o3742q6563L6152J27376
$$ 81624 97838 146395 247443 104929 51417 75233 78444 4647 -59095 -145658 -109506 17870
9445A7870O3792p787k13135L2367l6458Q3073Q4339m5767j37592j2230P7984J98774
$$ 17870 81662 73875 -139260 -106893 -143351 -60278 24061 -21706 -159298 -171528 -93544 105230
9433A05230q4516q3620o8998m1584J35093K2217l4810j2537Q6398K0755q4332
$$ 105230 20714 -62906 -131904 -173488 -38395 -16178 -50988 -63525 22873 43628 -40704
9422d0704j7054P832j28775l1003j7456M8532j2098J00190J76270M7128j9028
$$ -40704 -57758 -49926 -178701 -209704 -227160 -178628 -190726 -90536 85734 132862 113834
9411A13834j55306J7405j52618n8809N2787J15782O0676J15588J09534n9868j15833
$$ 113834 -41472 -24067 -176685 -235494 -182707 -66925 -6249 109339 218873 159005 43172
9400D3172m019Q0970K5661l3220K0636j66704k28338r2247J81150J12642K6680
$$ 43172 39153 120123 145784 112564 133200 -33504 -261842 -354089 -172939 -60297 -33617
9389c3617J0992J13610o584Q0358K179p7066J11746J18407M3724n4109j77739
$$ -33617 -22625 90985 84401 164759 166938 89872 201618 320025 363749 309640 131901
9378A31901J0700j06613o7418l1797J19372L2092k36598N5996L0544L427P2263
$$ 131901 142601 35988 -31430 -63227 56145 88237 -148361 -92365 -61821 -58394 13869
9367A3869k9604j19412J15971L06953k4796j49617p4409M4923K1716J3010R1003
$$ 13869 -15735 -135147 -19176 287777 262981 113364 38955 83878 105594 118604 209607
9356B09607R9108n3169j38597k48759J5078P3443j9514M7440j47578r7244n6396
$$ 209607 308715 255546 116949 -131810 -116732 -43289 -62803 -15363 -162941 -260185 -316581
9345c16581Q6443K23621M5946j41626R9273O9259J5562n292J6480q0104J7249
$$ -316581 -230138 -6517 39429 -102197 -2924 66335 81897 76605 93085 12981 30230
9334C0230J5673j70464l48379K563P8547P0745J04460J10296K5957r2013j9406
$$ 30230 45903 -124561 -472940 -470377 -391830 -321085 -216625 -106329 -80372 -172385 -191791
9323a91791l4450q185R6349J94074J33398J3108j6956p9790N1786n2121j97149
$$ -191791 -226241 -234426 -138077 55997 189395 202503 185547 105757 157543 105422 -91727
9312i1727n6111J47937N6142j57151j00430J9460j0884P4395P4233J9513J59563
$$ -91727 -147838 99 56241 -100910 -201340 -181880 -192764 -118369 -44136 -24623 134940
9301A34940L7278k07607q0768r0446J21400J65039j22806j5448R4106o0035j18527
$$ 134940 172218 -35389 -116157 -206603 -85203 79836 -42970 -58418 35688 -24347 -142874
9290a42874n0782L8307L759J05839N8786j1163j89580n5388K9252p7225Q1053
$$ -142874 -193656 -155349 -151590 -45751 13035 1872 -187708 -243096 -213844 -291069 -210016
9279b10016R9551J29358k4423q0623Q8289r480o7707J59307J40487m8969j47588
$$ -210016 -110465 18893 -5530 -86153 2136 -7344 -75051 84256 224743 175774 28186
9268B8186J00714k2481K3199n2279n8131j36173P7459J95686p7534r8515Q7384
$$ 28186 128900 106419 129618 77339 19208 -116965 -39506 156180 78646 -19869 67515
9257F7515M310j16415M732J29072n7817p0689O1400J59132l3748P6103o8211j54556
$$ 67515 71825 -44590 -39858 89214 31397 -39292 22108 181240 147492 223595 155384 828
9245H28P002M0937R96J6206j7216r0385L2614K7145j2410O3670N0406j27802r2708
$$ 828 7830 48767 49763 65969 48753 -41632 -9018 18127 5717 69387 119793 -8009 -100717
9232a00717K17728N8593l704n5333r219o2146o9220J5376N3511J7518n352j2805
$$ -100717 117011 175604 171900 116567 107348 45202 -24018 -8642 44869 62387 57035 44230
9220D4230N8956o787j97889j04906N0229L0606k281P8954J04524M8213J4114M403
$$ 44230 103186 96399 -101490 -206396 -156167 -125561 -127842 -48888 55636 103849 117963 122366
9208A22366J9086j56381P4000O7036L8484n6238m4813L0681J17771M1821k8207
$$ 122366 141452 -14929 59071 126107 164591 108353 63540 94221 211992 253813 225606
9197B25606p2344m4458j08712O4895r208j2035m0864r5117k7313J33722M3151
$$ 225606 153262 108804 92 64987 55779 43744 2880 -92237 -119550 14172 57323
9186E7323k8652q652P4255j469k7177j36837j4702q1442N6185J69845K8605M630
$$ 57323 28671 20019 94274 92805 65628 -71209 -85911 -167353 -111168 58677 87282 91912
9174I1912p7510J7J58954J20433J63306j66909r5366K6142M8742j89956k941N5532
$$ 91912 14402 14419 173373 293806 457112 290203 194837 220979 269721 79765 76824 132356
9162A32356N8238M034m1411J32237m988j7496n2846p1014l416L7105m9606j11184
$$ 132356 190594 194628 153217 285454 280466 262970 210124 139110 135694 172799 123193 12009
9150A2009l5443j7198J01672K56785m7718j55365O6049O3728Q9793P1488j01326
$$ 12009 -23434 -40632 61040 317825 270107 114742 180791 244519 334312 405800 304474
9139C04474J02280Q5157j17937j54883N171K17610n3180j65839J4288Q9098Q5327
$$ 304474 406754 491911 373974 219091 224262 441872 388692 222853 237141 326239 411566
9128D11566k6897P1906J9573J18596M0501r2476K0851K0421P4013R3147J19322
$$ 411566 384669 456575 476148 594744 635245 542769 563620 584041 658054 751201 870523
9117H70523J90897J91300J60234K39703J91527J19580K59930K85429L14635M08433
$$ 870523 1061420 1252720 1412954 1652657 1844184 1963764 2223694 2509123 2823758 3232191
9107C232191O22984Q90536J094512J626204K279596L204519N114559Q338306J2304247
$$ 3232191 3855175 4745711 5840223 7466427 9746023 12950542 18065101 26403407 38707654
9098C8707654J6954654K0541269J6071022l652440k2156282k2539586j5103632
$$ 38707654 55662308 76203577 92274599 88622159 66465877 43926291 28822659
9091B8822659r177728n752852l642403k282129j554416j245592p60005o29090
$$ 28822659 19644931 13892079 10249676 7967547 6413131 5167539 4407534 3778444
9083C778444o35498m67686k04389j68077k94259k61087k81599k65035j95454j52442
$$ 3778444 3142946 2675260 2470871 2302794 2008535 1747448 1465849 1200814 1005360 852918
9073H52918J01588J90844j66085j05934k1611j24117r7396J5318R6141m769J52014
$$ 852918 954506 1145350 979265 873331 851720 727603 630207 645525 741666 736897 888911
9062H88911J15871k70258k26534j61075j06045N4386l6243Q6355Q7020k5021j5569
$$ 888911 1004782 734524 507990 346915 240870 295256 259013 345368 432388 407367 391798
9051C91798j01393O9833J6690l6415m6092M2713j09168j19269J6609L7373p7654
$$ 391798 290405 360238 376928 340513 294421 337134 227966 108697 125306 162679 85025
9040H5025l5596L2158J51549J11718m3765j19750m7306o9913J7779Q207J8917
$$ 85025 49429 81587 233136 344854 301089 181339 134033 64120 81899 90106 109023
9029A09023j07666J27770M7040m0497J14711N7245j05433J8781J7486J12490o2893
$$ 109023 1357 129127 176167 135670 250381 307626 202193 220974 238460 350950 288057
9018B88057o0309j4568L9671j4465r6922j49968j36313R2287j11304M7972J70841
$$ 288057 227748 213180 252851 238386 141464 -8504 -144817 -52530 -163834 -115862 54979
9007E4979j4426j53806p375J22353O7114o7342K38032J44231n5068Q7923j11059
$$ 54979 40553 -113253 -120628 1725 68839 1497 239529 383760 328692 416615 305556
8996C05556n3969j59716k16973l1811J16457J14875r1080k2517p9778p9564R7368
$$ 305556 251587 91871 -125102 -156913 -40456 74419 -16661 -39178 -118956 -198520 -101152
8985a01152J49150j2921J87338J51655p5576j90867n0303J20601L7802l5079j14926
$$ -101152 47998 35077 222415 374070 298494 107627 57324 177925 215727 180648 65722
8974F5722M310j89527j987P0129n3031K2717J11561M729J18729p228k68624p2852
$$ 65722 70032 -119495 -121482 -51353 -104384 -81667 29894 34623 153352 146124 -122500 -195352
8962a95352N0597M3338K0163j5664N5256P6703J1830K1731R4709j02483k51024
$$ -195352 -144755 -101417 -81254 -96918 -41662 35041 46871 68602 163311 60828 -190196
8951a90196k73884m1139N1483J81814J40407O9895l6859K359J1118k2720M021
$$ -190196 -464080 -505219 -453736 -271922 -131515 -61620 -98479 -96120 -85002 -107722 -103701
8940a03701n6281j25543n6460K6833M5343o2895j2233K67144J26096m116j09252
$$ -103701 -159982 -285525 -341985 -315152 -269809 -332704 -344937 -77793 48303 44187 -65065
8929f5065j43695Q5130J71785l3183p8046N4946j04284N4412J7682p5709o2516
$$ -65065 -208760 -123630 48155 14972 -63074 -8128 -112412 -58000 -40318 -116027 -178543
8918a78543k975k0903N0830k2692p2533M8729R4552K859J10782O8641m6091N7987
$$ -178543 -181518 -202421 -151591 -174283 -246816 -198087 -103535 -100676 10106 78747 32656 90643
8906I0643J16698m2551P8509Q1479l3977p7940k51327j53062q845M8010L3184
$$ 90643 207341 164790 243299 324778 290801 212861 -38466 -191528 -200373 -152363 -119179
8895a19179J16276J9410J25657o6345o9731M0879l806m2765R0692P2696R5558
$$ -119179 -2903 16507 142164 75819 6088 46967 43161 396 91088 163784 259342
8884B59342J32895q3980j75501o1674k22994O8708J54825k3857M1600J3815j3766
$$ 259342 392237 308257 132756 71082 -151912 -83204 71621 47764 89364 103179 89413
8873H9413o4371o0680k40821O7984J60172K03836J30575J64603J83523j3602m0627
$$ 89413 25042 -35638 -276459 -208475 -48303 155533 286108 450711 634234 620632 580005
8862E80005j5176j72884k91643q8298l801O8046p717N4482o9569j0383K0100j60608
$$ 580005 564829 391945 100302 12004 8203 76249 68532 123014 53445 43062 63162 -97446
8850i7446J20445L37086J07631l95529k15964J73321Q415n8357J9816J7364J646
$$ -97446 22999 360085 467716 72187 -143777 29544 37959 -20398 -582 16782 18428
8839A8428j8596m5779O9980n2693j08939j62580j45572J40838J09612K62723J77095
$$ 18428 -168 -45947 24033 -28660 -137599 -300179 -445751 -304913 -195301 67422 244517
8828B44517K5218J31105j45084l10921Q2982J58513J69336L6992M7155k082p1252
$$ 244517 269735 400840 255756 -55165 27817 186330 355666 392658 439813 437731 366479
8817C66479p9587k17647j41457r8686R2337K51714J29796K6386j52846j58974
$$ 366479 286892 69245 -72212 -170898 -78561 173153 302949 329335 176489 17515
8807A7515j076J446L7375N0315j1390r979p3043m7795J00236L3981k2015n5904
$$ 17515 16439 17885 55260 105575 94185 84206 11163 -36632 63604 97585 75570 19666
8795A9666R6785n0366p5069M6852M867K072K25024R0564n2787l35508k23060N5703
$$ 19666 116451 66085 -8984 37868 42735 44807 269831 360395 307608 -27900 -250960 -195257
8783a95257L7306m9336J09936L34243L9037j18213M2039L6532P4604k9769r3816
$$ -195257 -157951 -207287 -97351 236892 275929 157716 199755 236287 310891 281122 187306
8772A87306o0266J10081k8010N365K6270l4212K4878o5035k41890j57492q7685
$$ 187306 127040 237121 209111 214476 240746 206534 231412 166377 -75513 -233005 -320690
8761c20690M7480p8115j3089j9760l9926K67358J60574l2985j97517q768M305
$$ -320690 -273210 -351325 -364414 -384174 -424100 -156742 3832 -29153 -226670 -235438 -231133
8750b31133l14J35442r2745n3090K71409Q7935l2161j39606l1042Q1359K0653
$$ -231133 -231447 -96005 -188750 -241840 29569 117504 85343 -54263 -85305 -3946 16707
8739A6707n0326j37886L2128P9305J20610j16347l6645l8929L7337J60937j52718
$$ 16707 -33619 -171505 -139377 -60072 60538 -55809 -92454 -131383 -94046 66891 -85827
8728h5827l0120M3446J7866R8067m4115R3376n1695m9777j6338M2995J6648j51893
$$ -85827 -115947 -72501 -54635 43432 -683 92693 40998 -8779 -25117 17878 34526 -117367
8716a17367R4868M191r0302q4012k7951J02858J12332P2308l6904o9960L4681
$$ -117367 -22499 -18308 -108610 -192622 -220573 -117715 -5383 66925 30021 -39939 -5258
8705e258j34171n859q6684l2250M2814K13883Q2662K9571k6850p563l9051r3904
$$ -5258 -139429 -145288 -231972 -264222 -221408 -7525 75137 104708 77858 70295 31244 -62660
8693f2660L834K22128J19108J58895J04915n5157k24063N3653O5378j93656k16272
$$ -62660 -58826 163302 282410 441305 546220 491063 267000 320653 386031 192375 -23897
8682b3897J20257N7968j8777j03750l6650R4731k2367n0135m6950M3837m560m8577
$$ -23897 96360 154328 135551 31801 -4849 89882 67515 17380 -29570 14267 9707 -38870
8670c8870L2916P1728J4808J17230o8616l1267J20628j35042j53495O6574Q5385
$$ -38870 -5954 65774 80582 197812 129196 97929 218557 83515 -69980 -3406 81979
8659H1979Q5666O7005m6227r8556m5781N1411l0927L5420J00388K9794j55839
$$ 81979 167645 234650 188423 89867 44086 95497 64570 99990 200378 230172 74333
8648G4333p6859J51216M6256O95J84998L6245p887K5413j33128p8670r5158R904
$$ 74333 -2526 148690 194946 195641 380639 416884 408997 434410 301282 222612 127454 137358
8636A37358L4236J9647K48792J4974l0025q0801k0114K615n160k45P5568j14461
$$ 137358 171594 191241 440033 455007 424982 344181 324067 326682 321522 321277 396845 282384
8624B82384n5747J08766R1922m6801j23595j47474o808J02092l7052j07223m5948
$$ 282384 226637 335403 427325 380524 256929 109455 102647 204739 167687 60464 14516
8613A4516J20332O6890o1055Q5620m1784j95888n3486M7748l4293Q9560J78332
$$ 14516 134848 201738 140683 226303 184519 -11369 -64855 -17107 -51400 38160 216492
8602B16492M7710K881q9087N217K3853j33204m0821j33964L3613J62212J30613
$$ 216492 264202 267083 177996 183213 207066 73862 33041 -100923 -67310 94902 225515
8591B25515J0721j83145N7628J43641R6993k357q6866k81433o5023J76473O1235
$$ 225515 236236 53091 110719 254360 351353 348996 262130 -19303 -84326 92147 153382
8580A53382R6590L44906J98714j18010j56511j21833j67970n2101R8659P6211
$$ 153382 249972 594878 793592 675582 519071 397238 229268 177167 275826 352037
8570C52037k6056r1589j92006m0767p3301q198K53231N9876q0713m9680l8113
$$ 352037 325981 234392 42386 1619 -71682 -79880 173351 233227 152514 102834 64721
8559F4721J41569J01561N6216m7976k20499j03825L9523N6678m5732m9360m2854
$$ 64721 206290 307851 364067 316091 95592 -8233 31290 87968 42236 -7124 -49978
8548d9978l562o2316Q594j05943J31288L0162J16750K65394m1037m0232M3188
$$ -49978 -53540 -115856 -107262 -213205 -81917 -51755 64995 330389 289352 249120 292308
8537B92308N185l3605j9775k8901L4521J76640p2941r2203K480q0903j32814j29839
$$ 292308 297493 263888 244113 215212 249733 426373 353432 261229 263709 182806 49992 -79847
8525g9847P1568Q287J15743r8606k15245P7459l7201j13882P1639J64274J48587
$$ -79847 -8279 8 115751 17145 -198100 -120641 -157842 -271724 -200085 -35811 112776
8514A12776M9856m510j43543K073Q7935m2636k9646J2915m2546P7218L1084k32693
$$ 112776 162632 158122 14579 16652 104587 61951 32305 45220 2674 79892 110976 -121717
8502a21717r0647N9912J24320J7796r0474K6945p1764J17764K24448o8221l5448
$$ -121717 -212364 -152452 -28132 -10336 -100810 -73865 -145629 -27865 196583 128362 92914
8491I2914L3574K8830j42190J03119O5481O6957L2666k68858k18919j02533k2008
$$ 92914 126488 155318 13128 116247 181728 248685 281351 12493 -206426 -308959 -330967
8480c30967n6876O3632J0095K27388K9965q5174j28576J2871P8844J24684J02266
$$ -330967 -387843 -324211 -314116 -86728 -56763 -141937 -270513 -257642 -178798 -54114 48152
8469D8152k2227j24903l0803j47751P7571K5627Q6170J01603J58386l0966j6812
$$ 48152 25925 -98978 -129781 -277532 -199961 -174334 -88164 13439 171825 140859 124047
8458A24047r1746j61917j46823o9j2163O5548P5048L780J54414l7338l9163N1491
$$ 124047 32301 -129616 -276439 -276508 -288671 -223123 -148075 -144295 10119 -27219 -66382 -14891
8446a4891J08880o3213k0275Q9835m5393L3973J6986O6502L1072j62707j44615
$$ -14891 93989 30776 10501 100336 54943 88916 105902 172404 203476 40769 -103846
8435a03846j3727j37500m6060K12664N0837j11329J40179r0608k44798n4697M9545
$$ -103846 -117573 -255073 -301133 -88469 -37632 -148961 -8782 -99390 -344188 -398885 -349340
8424c49340L5801Q4209M9196q8202m1897K4837M0125J40211P8146j06273j68233
$$ -349340 -313539 -229330 -180134 -268336 -310233 -285396 -245271 -105060 -26914 -133187 -301420
8413c01420M6110R0813j37062K03126J62850K01220j82343k13075n5294J1408
$$ -301420 -255310 -164497 -301559 -98433 64417 265637 83294 -129781 -185075 -173667
8403a73667M7074k7906K9742N2537L2729q0230Q3388L2608n1604K75937J38322
$$ -173667 -126593 -154499 -124757 -72220 -39491 -119721 -36333 -3725 -55329 220608 358930
8392C58930K1058P0297l2999j43909j64430p4171J70231N8325P959j27140j87096
$$ 358930 379988 450285 417286 273377 108947 34776 205007 263332 271291 144151 -42945
8381d2945j55113J23298P3379L3597R9257j77307j27644M0246J61393j95527P1145
$$ -42945 -198058 -74760 -1381 32216 131473 -45834 -173478 -133232 28161 -167366 -96221
8370i6221K09837j25876k99296q9956J69385J85244J68637R0362p977p5043j09356
$$ -96221 113616 -12260 -311556 -401512 -232127 -46883 121754 212116 204139 129096 19740
8359A9740q2778R9249m6071o6165j11305j39868J13146J44565l5291j07949j08243
$$ 19740 -63038 36211 -9860 -76025 -187330 -327198 -214052 -69487 -104778 -212727 -320970
8348c20970N4858J47620J79636O9954p3502L4452o6494j46169q9039J76443J22942
$$ -320970 -266112 -118492 61144 131098 57596 92048 25554 -120615 -209654 -33211 89731
8337H9731J17323O306k7445J7205j24100l99219M7803J24245m6327p2293L8017
$$ 89731 207054 213360 185915 203120 79020 -320199 -272396 -148151 -194478 -266771 -228754
8326b28754J51499p7091p4608L0101O8324J11793L3112n5723n3049O760J3527
$$ -228754 -77255 -154346 -228954 -198853 -130529 -18736 14376 -41347 -94396 -87636 -74109
8315g4109J68367O5664l2340j00751l46090j12091Q2327Q9234K1281Q3055J28181
$$ -74109 94258 159922 127582 26831 -319259 -431350 -349023 -259789 -238508 -155453 -27272
8304b7272l7983J30590J28117n4174q6231o7064j50846M625L8288m2311j14108
$$ -27272 -65255 65335 193452 139278 53047 -14017 -164863 -160238 -121950 -164261 -278369
8293b78369p9748J21465Q8475K83989N8265j00064j06321m4425j01926N3224R0648
$$ -278369 -358117 -236652 -148177 135812 194077 94013 -12308 -56733 -158659 -105435 -14787
8282a4787l5902K04960j91012k04540N1834O8556l4647n2957n6466q8733R6996
$$ -14787 -50689 154271 -36741 -241281 -189447 -120891 -155538 -208495 -264961 -353694 -256698
8271b56698P3134R5149J04625N7469j46276N5193o4142j08676k8492J13213O1219
$$ -256698 -183564 -88415 16210 73679 -72597 -17404 -81546 -190222 -218714 -105501 -44282
8260d4282O8994M1240J10176p9417j88570Q1890N1473q4410K9700n4291j77797
$$ -44282 24712 65952 176128 96711 -91859 -9969 41504 -42906 -13206 -67497 -245294
8249b45294J64382N5094J1884M476K2558j45052j11937k2064J9545J154n1034
$$ -245294 -80912 -25818 -13934 -9458 13100 -131952 -243889 -265953 -246408 -245254 -296288
8238b96288l8750K4004N3594q4328l471k2269j39150L9685M1187k5255J78873
$$ -296288 -335038 -311034 -257440 -341768 -345239 -367508 -506658 -466973 -425786 -451041 -272168
8227b72168O7639R6688K5204l1438j43079Q5413J96262j65340P883N0994m1858
$$ -272168 -204529 -107841 -82637 -114075 -257154 -171741 24521 -140819 -132936 -81942 -123800
8216a23800J39402l1199j39604j30649K8651j59660N2127J83438M2529M9705j6223
$$ -123800 15602 -15597 -155201 -285850 -257199 -416859 -364732 -181294 -138765 -89060 -105283
8205a05283J01901R9756o2543M348p2522o4313q9266O6036J04933j05658o3484
$$ -105283 -3382 96374 33831 38179 -34343 -98656 -187922 -121886 -16953 -122611 -186095
8194a86095k378p3290m404J32762P5497l0189R6398o9918l8674j70179K27569
$$ -186095 -188473 -261763 -266167 -133405 -57908 -88097 8301 -61617 -100291 -270470 -42901
8183d2901J16643p9484r1837Q1979k2768R3476P9335K7150n6884j34201j06817
$$ -42901 73742 -5742 -97579 -15600 -38368 55108 134443 161593 104709 -29492 -136309
8172a36309n6118M1710p7013J50990J03978n1377p9880P9284N4857J44828K6420
$$ -136309 -192427 -150717 -227730 -76740 27238 -24139 -104019 -24735 30122 174950 201370
8161B01370J6560k00122j32703K9167r6220Q3324o4956m5213J05428J52501J63288
$$ 201370 217930 17808 -114895 -85728 -181948 -98624 -163580 -208793 -103365 49136 212424
8150B12424n7674q6800M7634o6430P0319l1372j19585J19859p1989j32839Q324
$$ 212424 154750 67950 115584 49154 119473 88101 -31484 88375 16386 -116453 -108129
8139a08129J69522L0203R4715J10274j38629j10843J83802M408n1419K6730J0241
$$ -108129 61393 91596 186311 296585 157956 47113 230915 235323 183904 210634 220875
8128B20875r9967j61506n9371J43413K3883q2212O4134J65987Q2689M3053P0187
$$ 220875 120908 -40598 -99969 43444 67327 -14885 49249 215236 297925 340978 411165
8117D11165j98320j13329N5376m7320j93598o0936j13676J74436K22777R3121
$$ 411165 212845 99516 154892 107572 -86026 -146962 -260638 -86202 136575 229696
8107B29696l9816J4221p5759k24199K7966J13256j20696O3969l3312J07793m1013
$$ 229696 189880 204101 128342 -95857 -67891 45365 -75331 -11362 -44674 63119 22106
8096B2106P750J27985K500p3683M4711j0475M038o7575j16572J45594J7292j06212
$$ 22106 29856 157841 160341 86658 131369 120894 124932 57357 -59215 86379 103671 -2541
8084b541j30767K5712K2843J7943J5791O1398o5733j46961M7645n705J1162R0050
$$ -2541 -133308 -107596 -84753 -66810 -51019 10379 -55354 -202315 -154670 -160375 -149213 -59163
8072e9163L90R9077P9486r4991j27386L4259O0057l3481J61170P1432j04030r661
$$ -59163 -58773 40304 119790 24799 -102587 -68328 -8271 -41752 119418 190850 86820 77159
8060G7159J18442J4844k0801r3581k5783j65668n8817J40994N4198J3525k37693
$$ 77159 195601 210445 189644 96063 70280 -95388 -154205 -13211 40987 54512 -183181
8049a83181j36877J00032K1721r1656J06305J28515L0660k7799J39923P8529o6146
$$ -183181 -320058 -220026 -198305 -289961 -183656 -55141 -24481 -52280 87643 166172 100026
8038A00026k6814j27693p2172Q1959N6723J46831L956k39330j39890J53001J72536
$$ 100026 73212 -54481 -126653 -44694 12029 158860 162816 -76514 -216404 -63403 109133
8027A09133R6052q9819j85338N4059p2720N5695J23589J06105N6894Q1664j54556
$$ 109133 205185 115366 -69972 -15913 -88633 -32938 90651 196756 253650 335314 180758
8016A80758j24235q2617j689j22429k9647J76912K1635j56670k4872J66678J70528
$$ 180758 56523 -26094 -27783 -150212 -179859 -2947 18688 -137982 -162854 3824 174352
8005A74352k09233n3958J40446q2261J9516N6150L7515l6508r1119k2363m3366
$$ 174352 -34881 -88839 51607 -30654 -11138 45012 82527 46019 -45100 -67463 -110829
7994a10829M5532J36703K8063o6965O7601J98240J06839j47352k30531j41894
$$ -110829 -65297 71406 99469 32504 100105 298345 405184 257832 27301 -114593
7984a14593J854J6419K6141n4103N0041Q465n4770l2445J48627O7912M899R0033
$$ -114593 -112739 -96320 -70179 -124282 -74241 -65776 -120546 -152991 -4364 63548 68447 158480
7972A58480o4222n7196j47152Q7049J04487q398J12867l3237N284p0794N6341
$$ 158480 94258 37062 -110090 -23041 81446 73048 185915 152678 157962 87168 143509
7961A43509J01296J69664j3001q5721j29305N7261k5697j34613q9871M0626j02541
$$ 143509 244805 414469 401468 315747 186442 243703 218006 83393 -6478 34148 -68393
7950f8393n4366O3028j2062J36108J52997P3417O0155j15971j05173j44340m997
$$ -68393 -122759 -59731 -71793 64315 217312 290729 350884 234913 129740 -14600 -19597
7939a9597R4875j9410j19488J05135m287O4533O4098j82716j8102o9572K8751
$$ -19597 75278 55868 -63620 41515 37228 101761 165859 -16857 -34959 -104531 -75780
7928g5780n2575l0243p5222q320J65947J21083j59470K16917K31943n830j23736
$$ -75780 -128355 -158598 -233820 -242140 -76193 44890 -114580 102337 334280 328450 204714
7917B04714j77098K7432R4349J42042M5708j55249j97220j65453m664j52543j3296
$$ 204714 27616 55048 149397 291439 337147 181898 -15322 -180775 -185439 -337982 -351278
7906c51278J14261J03343P0694q5584m7573j614J2900K6973R3750K7928o6672
$$ -351278 -237017 -133674 -62980 -148564 -196137 -197751 -184851 -157878 -64128 -36200 -102872
7895a02872J06828J62214K9973k5394l09644R5220J71500k05564j7597J36012
$$ -102872 3956 166170 196143 170749 -138895 -43675 127825 -77739 -95336 40676
7885D0676J50118m5834j8397p3657l8918j40565j83971J08771J96764K22462Q447
$$ 40676 190794 144960 126563 52906 13988 -126577 -310548 -201777 -5013 217449 225896
7874B25896j69928p8615N4052j5811q6656Q1765r6082K9642J37670j38039j77797
$$ 225896 55968 -22647 31405 15594 -71062 10703 -85379 -55737 81933 -56106 -233903
7863b33903R2519Q3861J09319j84770j24843J64099J25201k6526k2914j49365
$$ -233903 -141384 -57523 51796 -132974 -257817 -93718 31483 4957 -17957 -167322
7853a67322L837P0K33900N3540j42828j65659M1121N784K37717Q5125j20787j1525
$$ -167322 -163485 -163415 70485 124025 -18803 -184462 -143341 -137557 100160 185285 64498 52973
7841E2973N2501J17770m4007k27349J2786R9953p2485l1483N7543K83169r4393
$$ 52973 105474 223244 179237 -48112 -35326 64627 -7858 -39341 18202 301371 206978
7830B06978j61544l3993J22214j7707j10154K1833n9719r5481J4826K35240N8468
$$ 206978 45434 11441 133655 115948 5794 27627 -32092 -127573 -112747 122493 180961
7819A80961j36524k65485m7771M4330M4385R540n9248J04268J61287J02707k39756
$$ 180961 44437 -221048 -268819 -224489 -180104 -170564 -229812 -125544 35743 138450 -101306
7808a01306l8320q1858L5223K8584K07074J0l51J4431P2498k8937l0829N6347
$$ -101306 -139626 -221484 -186261 -157677 49397 49407 49056 63487 135985 107048 76219 132566
7796A32566r5334j15411k3385p6436J18065l2017k03112O4033R0048P1621m9594
$$ 132566 37232 -78179 -101564 -178000 -59935 -91952 -295064 -231031 -140983 -69362 -118956
7785a18956J5272o9673p3522J73120P1766n7437j13669l2775J98171J49861o8431
$$ -118956 -103684 -173357 -246879 -73759 -1993 -59430 -173099 -205874 -7703 142158 73727
7774G3727j5667J9334q1226k02599J73373J09721l3587P541r0654L07920P1215
$$ 73727 58060 77394 -3832 -206431 -33058 76663 43076 50617 -40037 267883 339098
7763C39098j73402r1908m9751q5223J79104P8462J05723l8903p610m201j09627
$$ 339098 165696 73788 24037 -61186 117918 196380 302103 263200 255590 251389 141762
7752A41762j23178j55369r7257M709N2423J30950M5532M52J42885J3875J48640
$$ 141762 18584 -136785 -234042 -229333 -176910 -45960 -428 24 142909 156784 305424
7741C05424O0351q9866o0610O3035J68388j25447k47980q8839P9896j5986j71274
$$ 305424 365775 275909 215299 278334 446722 321275 73295 -15544 64352 48366 -122908
7730a22908j38667O09k8138k2732J41603K236j68367l1213J93348J60361K2172
$$ -122908 -261575 -260966 -289104 -311836 -170233 -167997 -336364 -367577 -174229 -13868 8304
7719H304K4374M7598J93682j64737j53635o7343M1754J31345J14489q004n895
$$ 8304 32678 80276 273958 109221 -44414 -111757 -70003 61342 175831 167827 161932
7708A61932j88924m7214p8752N9008l0702J04490Q9243j10479N4063L7543l9603
$$ 161932 -26992 -74206 -152958 -93950 -124652 -20162 69081 -41398 12665 50208 10605
7697A0605O6358k00019M8652O9026j552q548N9372n2517q1579m6576l034K0046
$$ 10605 76963 -123056 -74404 -5378 -6930 -15478 43894 -8623 -90202 -136778 -139812 -119766
7685a19766M3834R0658Q9843j71989j8872l4605R0163P4254L1064J19134J28184
$$ -119766 -75932 14726 104569 -67420 -86292 -120897 -30734 43520 74584 193718 321902
7674C21902n9372j22814R4946K3013J14150L7682r5957j14667r238N9530k24663
$$ 321902 262530 139716 234662 257675 371825 409507 313550 198883 189645 249175 24512
7663B4512m5707L2630R88K21665O9437j56601j9757P9269R239k41890j35646m3327
$$ 24512 -21195 11435 12423 234088 303525 146924 127167 206436 215675 -26215 -161861 -205188
7651b05188J20594N0293n925p771j27623j8333J43085J65017j14608P4412o0899
$$ -205188 -84594 -34301 -40226 -47997 -175620 -193953 -50868 114149 -459 73953 13054
7640A3054p7121J87229J16720j37705l2667j5764Q661l2831o8076m0115j4351
$$ 13054 -64067 123162 239882 102177 69510 53746 62407 29576 -38500 -78615 -92966
7629i2966P0598l3023j37480j30977R5464J72065L6113p110K34208m4835j50346
$$ -92966 -22368 -55391 -192871 -323848 -228384 -56319 -20206 -27316 206892 162057 11711
7618A1711p7867j2270M0994L638r2995r9163J01899L02859Q5072m9062k37479
$$ 11711 -66156 -78426 -37432 -33794 -126789 -225952 -124053 178806 263878 214816 -22663
7607b2663q6620J47217J49673j53663m6981Q0687L6697k8328q0610j89240r2942
$$ -22663 -109283 37934 187607 33944 -13037 67650 104347 76019 -4591 -193831 -286773
7596b86773K59003J24182K3559J39508j21301k33630m7411J38590k846K9552P9224
$$ -286773 -27770 96412 119971 259479 138178 -95452 -142863 -4273 -7119 22433 101657
7585A01657j36917j30722N0247K955K30270m2812j00454j455j92706k6481O7757
$$ 101657 -35260 -165982 -115735 -112780 117490 74678 -25776 -27231 -219937 -246418 -178661
7574a78661k6497k0788K578j14072J25511N8859n1311j7450N7000J50084j07095
$$ -178661 -205158 -225946 -223368 -337440 -211929 -153070 -204381 -221831 -164831 -14747 -121842
7563a21842l544P8040l9762j04984K18869K89690k1449k97801O3692j4028O357
$$ -121842 -125386 -47346 -87108 -192092 26777 316467 295018 -2783 60909 46881 53238
7552E3238l9980l3704j06763j26969q8270J04134J01650p7701N6232J64782p5653
$$ 53238 13258 -20446 -127209 -254178 -342448 -238314 -136664 -214365 -158133 6649 -69004
7541f9004K3753J63269n1614r2187q6776o1244J52187J00156M1838o2659j13802
$$ -69004 -45251 118018 66404 -25783 -112559 -173803 -21616 78540 120378 57719 -56083
7530e6083R3562O5947L7778J4294K0801J16922p6813j36529j34931P0186j7320
$$ -56083 37479 103426 141204 155498 176299 293221 216408 79879 -55052 15134 -2186
7519b186o0231N8830Q542m9253l8912N8622o2343j2583J41913K7070k444N276
$$ -2186 -62417 -3587 4955 -44298 -83210 -24588 -86931 -99514 42399 69469 67025 72301
7507G2301j75149k7363j10019M8092R6662J87459n2786J2026J41830j39942j26203
$$ 72301 -102848 -130211 -240230 -192138 -95476 91983 39197 51223 193053 53111 -73092
7496g3092L0446O2320j02954n6499J2563O6390j1512J21769J08110N030j61377
$$ -73092 -42646 19674 -83280 -139779 -127216 -60826 -72338 49431 157541 162571 1194
7485A194k02614O2506J9975j49610k2137o2404J69243K40096J6581M0933p7875
$$ 1194 -201420 -138914 -118939 -268549 -290686 -353090 -183847 56249 72830 113763 35888
7474C5888j63909J2238P1199P2185l7018n5257J38692m1515p5115l0598P3045
$$ 35888 -128021 -115783 -44584 27601 -9417 -64674 74018 32503 -42612 -73210 -165
7463a65L7360J0523q6425r0255M2835J55978M8600L600o779l9262p1539p6687
$$ -165 37195 47718 -38707 -128962 -86127 69851 118451 122051 115272 76010 4471 -72216
7451g2216J21079J89263o1957P3089J36713n4455j80605j6697p1286L354J01362
$$ -72216 48863 238126 176169 249258 385971 331516 150911 134214 62928 66282 167644
7440A67644j36569j12715J01799k1167q1807n9943J30177J53329n4036j73510
$$ 167644 31075 -81640 20159 -1008 -82815 -142758 -12581 140748 86712 -86798
7430h6798J23300J42879o9j23996j86167M852q3003K4129J31289L2035K4704n2860
$$ -86798 36502 179381 179312 55316 -130851 -125999 -209002 -184873 -53584 -21549 3155 -49705
7418d9705L0113O5039j13863r4881M1636J29324J06019J02312L9223j44669j76447
$$ -49705 -19592 45447 -68416 -163297 -121661 7663 113682 215994 255217 110548 -65899
7407f5899j49760K5107k4411O0283J77055O4103k20199m5454k0555r1598K49535
$$ -65899 -215659 -190552 -214963 -154680 22375 86478 -133721 -179175 -199730 -291328 -41793
7396d1793j02782q5644J18745o7404K10474N5174n3311l6006j2568O5876q9506
$$ -41793 -144575 -230219 -111474 -178878 31596 86770 33459 -2547 -15115 50761 -38745
7385c8745J8948N333n7778M0638J7471k24136k48899J96010P8977Q6707J47029
$$ -38745 -19797 -14464 -72242 -31604 -14133 -238269 -487168 -291158 -212181 -125474 21555
7374B1555J02447n7324k2984K2964j33452j39279Q9526Q7613n6084K44734n0784
$$ 21555 124002 66678 43694 66658 -66794 -206073 -116547 -28934 -85018 159716 108932
7363A08932j09564J71971l2115k2377N0899n5460j66134k28115P3813J28700P5413
$$ 108932 -632 171339 139224 116847 167746 112286 -53848 -281963 -208150 -79450 -4037
7352d037j4332l914k2396j1183J19240K8428R9109L0599j15912n0598r7072n0144
$$ -4037 -18369 -22283 -44679 -55862 63378 91806 190915 221514 105602 55004 -42068 -92212
7340i2212N4389K1203J7196K39518L72k24820o9150o6089J77887J92810O2776
$$ -92212 -37823 -16620 576 240094 240466 15646 -53504 -119593 58294 251104 313880
7329C13880p5197M1986N7032j16244k12761j87611j4150L0095n4062o3047n2356
$$ 313880 238683 280669 337701 221457 8696 -178915 -193065 -162970 -217032 -280079 -332435
7318c32435P9353J08437k3283J54376M5615r6911n9745Q828l0560O5862K2080
$$ -332435 -253082 -144645 -167928 -13552 32063 -64848 -124593 -115765 -146325 -80463 -58383
7307e8383J07997j9756j1214m2173Q0667o2330j48083Q145J28585J75637N9910
$$ -58383 49614 29858 18644 -23529 57138 -5192 -153275 -145130 -16545 159092 219002
7296B19002n5308J12873J22106j48314j07142m2296l2162m920o4287k8517M7755
$$ 219002 163694 276567 398673 250359 143217 100921 68759 63839 -448 -28965 18790
7285A8790J34244J1850j48781n9895N0285Q5359o6399J4981m4391p1573J98007
$$ 18790 153034 164884 16103 -43792 6493 91852 25453 40434 -3957 -75530 122477
7274A22477O0174j16358k70690o6117K0384o5005k7641J01506L6213k8421j17157
$$ 122477 182651 66293 -204397 -270514 -250130 -315135 -342776 -241270 -205057 -233478 -350635
7263c50635P8095Q5390N8941N0998K5772P3411J02308N5953k35450J2603J93496
$$ -350635 -272540 -187150 -128209 -77211 -51439 21972 124280 180233 -55217 -42614 150882
7252A50882K9510k07387k7769l1613m9992n7519P0432J42817l3610q5450j9295
$$ 150882 180392 -26995 -54764 -86377 -136369 -193888 -123456 19361 -14249 -99699 -118994
7241a18994R0361R4730M7145k0921p6164k6759j03437m9155J3130r8876J44690
$$ -118994 -28633 66097 113242 92321 16157 -10602 -114039 -163194 -150064 -248940 -104250
7230a04250J91585O5795j70118q5113k0336O2916J4756J95881n4628j5468R5623
$$ -104250 87335 153130 -16988 -102101 -122437 -59521 -44765 151116 96488 81020 176643
7219A76643L7791j0957p3708j64847k30458q7299L0067J35744K2238q6301K17680
$$ 176643 214434 203477 129769 -35078 -265536 -352835 -322768 -187024 -164786 -251087 -33407
7208c3407K02060n5440l91488j2041j1897J95046K22412o8600j37933k5922K59384
$$ -33407 168653 113213 -278275 -290316 -302213 -107167 115245 46645 -91288 -117210 142174
7197A42174K24887j03289p1982j34701j64403J21734J77269n9632O3931J01022
$$ 142174 367061 263772 191790 57089 -107314 14420 191689 132057 195988 297010
7187B97010j92860j01147J6831j5618j01296l9401J77919L967n998q8009j53142
$$ 297010 104150 3003 19834 4216 -97080 -136481 41438 45405 39407 -48602 -201744
7176b01744R8231P1301J0617k1938r1123l0521J91J02331J68845Q3925j07957
$$ -201744 -103513 -32212 -21595 -43533 -134656 -165177 -164986 -62655 106190 190115 82158
7165H2158n2670n5108j41524m624J4202M3788j4947m3786J985j7804N5254K51455
$$ 82158 29488 -25620 -167144 -171768 -157566 -113778 -128725 -172511 -170526 -188330 -133076 118379
7153A18379p5281n2210J7389j1102k16407J1184m9605L0527J26177K06056p6874
$$ 118379 43098 -9112 8277 -2825 -219232 -208048 -257653 -227126 -100949 105107 28233
7142B8233j13977q4755J0487q5607J34557J47422j12200j84392n7277R1966K29413
$$ 28233 -85744 -170499 -160012 -245619 -111062 36360 -75840 -260232 -317509 -225543 3870
7131C870R2787j54120j40147K11815M6118j91554K5917L7498J06086J23021j31413
$$ 3870 96657 -57463 -197610 14205 60323 -131231 -105314 -67816 38270 161291 29878
7120B9878j17302P207p1461o7835P7979Q8426n7485k61249q8440r290K13053J33216
$$ 29878 -87424 -80217 -151678 -219513 -141534 -53108 -110593 -371842 -460282 -469572 -256519 -123303
7108a23303l7577r8174R6521J21525Q2060n5243Q679N2659j64791o7441K03764
$$ -123303 -160880 -259054 -162533 -41008 41052 -14191 -5512 47147 -117644 -185085 18679
7097A8679J66928J81325M5598j06601j99886K9507J6909M7262r225j04369J2094
$$ 18679 185607 366932 412530 305929 106043 135550 152459 199721 190496 86127 98221
7086I8221q8307j4765N1177o9319o5969J62339N0366k64930j11020k3576J13267
$$ 98221 9914 -4851 46326 -22993 -88962 73377 123743 -141187 -252207 -275783 -162516
7075a62516J44812p5333j15885l4114m8004K685J45838J36970J12340j43695k44789
$$ -162516 -17704 -93037 -208922 -243036 -291040 -288355 -142517 -5547 106793 -36902 -281691
7064b81691j0767l514P0438J2329N6742L5975L6217O9870J8608J30177j09867
$$ -281691 -292458 -295972 -225534 -213205 -156463 -120488 -84271 -14401 4207 134384 24517
7053B4517q3788k9341n6508J76462K32078K3124j70374j20198n0584J13143j6907
$$ 24517 -59271 -88612 -145120 31342 263420 286544 116170 -4028 -54612 58531 41624
7042D1624r44j02316j29003P0276K10337Q2015o3794j57417l2728N459j16261
$$ 41624 40680 -61636 -190639 -120363 89974 171989 108195 -49222 -81950 -76491 -192752
7031a92752j05597j03083M3592J04574J46807Q136R2243J82517p9312j56266r643
$$ -192752 -298349 -401432 -357840 -253266 -106459 -98323 -6080 176437 97125 -59141 -68784
7020f8784n3707J341o0593j9767K2595N7284l5782J54551J99922N0274r8211j18849
$$ -68784 -122491 -121150 -181743 -201510 -178915 -121631 -157413 -2862 197060 247334 149123 30274
7008C0274j26109q5842J59454O6492k090N4953j96096j07865R3194J7284J43363
$$ 30274 -95835 -181677 -22223 44269 42179 97132 -98964 -206829 -113635 -96351 47012
6997D7012k8717M3358j01809O5952L5829q4464Q009J35401O4735r9522j54169
$$ 47012 18295 61653 -40156 25796 61625 -22839 -14830 120571 185306 85784 -68385
6986f8385L4237J06382l9907m427n3160j06401J17692J42974r1671j15515j0228
$$ -68385 -34148 72234 32327 27900 -25260 -131661 -13969 129005 37334 -78181 -88409
6975h8409l8684j64443j6581M9619K6986p674L10443K1316k8552K9838l964K8911
$$ -88409 -127093 -291536 -308117 -258498 -231512 -239186 71257 92573 64021 93859 89895 118806
6963A18806n16q3341J3539o1242j46564K9666K82543J44168j19355j42940r4782
$$ 118806 118290 34949 48488 -12754 -159318 -129652 152891 297059 177704 34764 -60018
6952f0018L4599K53251P7233k15527j37848K49288j34551j16835J26486K2060
$$ -60018 -25419 227832 305065 89538 -48310 200978 66427 -50408 76078 98138
6942I8138l7765j39207l5503n2185J10423J07579J43292N1316j98000j58758J25861
$$ 98138 60373 -78834 -114337 -166522 -56099 51480 194772 246088 48088 -110670 15191
6931A5191K42630j24028j18162J2405J42974p8316r2020J1748m7736J80683M4061
$$ 15191 257821 133793 15631 28036 171010 92694 674 12422 -35314 145369 189430
6920A89430k2845j42110Q743J61189J995l9965j27686o9793J9203Q2247m5704
$$ 189430 166585 24475 33218 194407 196402 156437 28751 -41042 -21839 60408 14704
6909A4704j13560q4752J05862J21849j60665o419j48986r3949J45449M0161m3926
$$ 14704 -98856 -183608 -77746 44103 -116562 -122981 -271967 -365916 -220467 -180306 -224232
6898b24232o1653N3362M5794j6173M7424P7633P053j01624q2294J04231K98182
$$ -224232 -285885 -232523 -186729 -202902 -155478 -77845 -70792 -172416 -254710 -150479 147703
6887A47703J08390j89782j11169n0517R83J48649J30450p8852p4034p1226K8343
$$ 147703 256093 66311 -44858 -95375 -94392 54257 184707 105855 31821 -39405 -11062
6876a1062M3256l021j40467L4594o9190p2242R7806K2980M9440R5214R8561Q9739
$$ -11062 32194 29173 -111294 -76700 -145890 -218132 -120326 -97346 -47906 47308 145869 235608
6864B35608k06928j37281J74887O0347j63895j32639J13036k8694R4360K50677
$$ 235608 28680 -108601 66286 126633 -37262 -169901 -56865 -85559 8801 259478
6854B59478Q5350j36385j31480K12312L0777q6308j79698n4789J16614M15o4733
$$ 259478 344828 208443 76963 289275 320052 233744 54046 -743 115871 116286 51553
6843E1553m9730O4555j65414Q78Q8147P0103j06820j45252j0512p85R1062N8641
$$ 51553 1823 66378 -99036 -98158 -10011 60092 -46728 -191980 -202492 -203277 -112215 -53574
6831e3574M7406n6691n5129J4002J13976l9571j20283l4754O2662k2810J9481
$$ -53574 -6168 -62859 -117988 -103986 9990 -29581 -149864 -184618 -121956 -144766 -125285
6820a25285R5652L4594o5876p0076p1852K9184o2299j3379P9868Q1872J3490N6992
$$ -125285 -29633 4961 -60915 -130991 -202843 -173659 -235958 -249337 -169469 -87597 -74107 -17115
6808a7115j53270R258J00565j8537j02977j70996K0132P4757R666M0770n934Q8119
$$ -17115 -170385 -161127 -60562 -79099 -182076 -353072 -332940 -258183 -248517 -207747 -213681 -125562
6796a25562J71246R7637n712j94735l8964K06927K2337O4660J81754j9554j3901
$$ -125562 45684 143321 137609 -57126 -96090 110837 133174 197834 379588 360034 346133
6785C46133j05334p5794n8102j32126q5054q1370K39948J57941j46661J11368
$$ 346133 240799 165005 106903 -25223 -110277 -191647 48301 206242 59581 170949
6775A70949K0927j19238J33350J32349j01444j10138o7759m1620N9853M8506R4071
$$ 170949 191876 72638 205988 338337 236893 126755 58996 17376 77229 125735 219806
6764B19806K47038Q1235j96750k70262n3949J37854N8483K33883p729O2182J12885
$$ 219806 466844 548079 351329 81067 27118 164972 223455 457338 449609 511791 624676
6753F24676k4487j1588K11377P991m7052J00858N0830J00281K73303P9328K6318
$$ 624676 600189 588601 799978 807969 760917 861775 912605 1012886 1286189 1365517 1391835
6742A391835K22245L52037M74521M368k15023l19861k41255j69139p765P7188
$$ 1391835 1614080 1966117 2440638 2445006 2229983 1910122 1668867 1499728 1491963 1569151
6732A569151J4544J86856O2324K46716M00571K34138L93828P69311J221086J748827
$$ 1569151 1583695 1770551 1832875 2079591 2480162 2714300 3108128 3877439 5098525 6847352
6722F847352K524759L562181N215648P416846R700285J1064614Q368125k159961
$$ 6847352 9372111 12934292 18149940 25566786 35267071 46331685 54699810 52539849
6714E2539849j2612510j3252590r129995n542619l467495k371039j465112q38733
$$ 52539849 39927339 26674749 17544754 12002135 8534640 6163601 4698489 3859756
6706C859756o31291n14054l38136m92726k96617j50344R3009r7876j17282R2130
$$ 3859756 3228465 2714411 2376275 1883549 1586932 1436588 1529597 1431721 1314439 1406569
6696A406569Q9142J91082J06011N3577j26788k27476k78157k8444k43116k79939
$$ 1406569 1495711 1686793 1792804 1846381 1719593 1492117 1213960 1185516 942400 662461
6686F62461j93603N6754J292l8580L6875O2706J0466j9513O2770k3458j57770
$$ 662461 468858 525612 526904 488324 525199 587905 598371 578858 641628 618170 460400
6675D60400k22603k50961k2739P5405P9238M5172Q0037j2558k05129n9262l6316
$$ 460400 237797 -13164 -35903 39502 118740 163912 243949 231391 26262 -33000 -69316
6664f9316m3708j14902Q9528K24390O9405j90292K7790n8q5938J6178N3033J83976
$$ -69316 -113024 -227926 -138398 85992 155397 -34895 -7105 -7163 -93101 -76923 -23890 160086
6652A60086N6674m8399k3421L1808j31656p8930J4658J92882r8468o288j0582
$$ 160086 216760 168361 144940 176748 45092 -33838 -19180 173702 75234 68946 58364
6641E8364j45684O6381N0076q1360n3540q2772J07997o126J86672p5080j16268
$$ 58364 -87320 -20939 29137 -52223 -105763 -188535 -80538 -86664 100008 24928 -91340
6630i1340n7629p6285j6903K24535N9717R292q8979o8692M8829J47886N3751M512
$$ -91340 -148969 -225254 -242157 -17622 42095 51387 -37592 -106284 -57455 90431 144182 148694
6618A48694o7733j4877k3540j00863k48676M9755K57811R7662p4919j2188L3401
$$ 148694 80961 66084 42544 -58319 -306995 -257240 571 98233 23314 11126 44527
6607D4527P4301j01162m663n1073j792J67087R6731p9590J2024j06188J3410Q5530
$$ 44527 118828 17666 13003 -38070 -39862 127225 223956 144366 156390 50202 63612 149142
6595A49142M2062j09785j26303l0106P3929k8162O6004N3503M3294L193j01488
$$ 149142 191204 81419 -44884 -74990 -1061 -29223 36781 90284 133578 136771 35283
6584C5283r632n9638j44266k157O7607J1818K6405L342o1441p7158J3086n2255
$$ 35283 25651 -33987 -178253 -180410 -112803 -100985 -74580 -71238 -132679 -209837 -196751 -249006
6572b49006L9346Q412j749R6025N1801l5338o8209o6687p611J97255O3224j76041
$$ -249006 -209660 -201248 -202997 -106972 -55171 -90509 -158718 -225405 -233016 -35761 27463 -148578
6560a48578q1740J9848J06922j4838k7103m2934n228P8655M6596J22633Q045k0260
$$ -148578 -230318 -210470 -103548 -118386 -145489 -188423 -193651 -114996 -68400 54233 62278 42018
6548D2018K3787m098Q1580Q6588k4310K0656N4650j00536l30105j30097o1112
$$ 42018 65805 61707 143287 229875 205565 226221 280871 180335 -149770 -279867 -340979
6537c40979J71988J7594M9642J27165K11369j74488J29586L0136j26584J9235
$$ -340979 -168991 -151397 -101755 25410 236779 62291 191877 222013 95429 114664
6527A14664O5693p560K4423N2605j25038j21952k3340K72177P9168o3326j1475
$$ 114664 180357 172797 197220 249825 124787 2835 -20505 251672 330840 267514 256039
6516B56039m614j85427j04589n7263K1148q3496r9190j08625K39719J81753Q707
$$ 256039 251425 65998 -38591 -95854 -74706 -158202 -257392 -366017 -126298 55455 64162
6505F4162J5216q3450o406m136J5712n8332j72869q1676J94149M2601l4354K7596
$$ 64162 79378 -4072 -10478 -14614 1098 -57234 -230103 -311779 -117630 -75029 -109383 -81787
6493h1787n9864k04436j7938K80240J80687n7961p6361K3187r6877j5031R871
$$ -81787 -141651 -346087 -364025 -83785 96902 38941 -37420 -14233 -111110 -126141 -116270
6482a16270L8930R7462Q8023j93670j60633m8431J45983J56201n0064J08613J07371
$$ -116270 -77340 20122 108145 -85525 -246158 -294589 -148606 7595 -42469 66144 173515
6471A73515p9910k43865m7074M0307m9090K8038l7949j08304Q9546L10574J37422
$$ 173515 93605 -150260 -197334 -157027 -206117 -178079 -216028 -324332 -234786 75788 213210
6460B13210j0271J19268r9608j43484j32175j72778L9461N7505r9976O6771J29925
$$ 213210 202939 322207 222599 79115 -53060 -225838 -186377 -128872 -228848 -162077 -32152
6449c2152j49546O6831J67186k9219k197o5346M5680R8590P3817J17713q2588
$$ -32152 -181698 -114867 52319 23100 20903 -44443 1237 99827 173644 291357 208769
6438B08769j89275j61562J3592O0736l9280k4710n3617j5986J19303Q1231N0422
$$ 208769 19494 -142068 -128476 -67740 -107020 -131730 -185347 -201333 -82030 -799 49623
6427D9623q2140j79415j58290M6935K15676J34995P9374k29181j77112J78662
$$ 49623 -32517 -211932 -370222 -323287 -107611 27384 106758 -122423 -299535 -120873
6417a20873K02769j03738K9828J17629j5847k0435J44771j68194j53202J0514
$$ -120873 81896 -21842 7986 125615 109768 89333 234104 65910 -87292 -76778
6407g6778J58085q9197o8394K7892Q3683J95967o7597P7068M7882O6655j62406
$$ -76778 81307 -7890 -76284 -48392 35291 231258 163661 240729 288611 355266 192860
6396A92860k10771j38076j06506L5532R9004p6458l6770J03315L7121q9399K11113
$$ 192860 -17911 -155987 -262493 -226961 -127957 -204415 -241185 -137870 -100749 -190148 20965
6385B0965J09621q8554r2138N8580R8527q9504M1260M809J03770L2191p3950j16688
$$ 20965 130586 42032 -50106 8474 107001 17497 58757 63566 167336 199527 125577 8889
6373H889l0812q0196p2637J46447j82349q1806Q3563M8220L7535R1497O4735J39076
$$ 8889 -21923 -102119 -174756 -28309 -210658 -292464 -208901 -160681 -123146 -31649 33086 172162
6361A72162o6971n3961m4924j89331r5216J72582J59882p5694L3334j07110j06462
$$ 172162 105191 51230 6306 -183025 -278241 -105659 54223 -21471 11863 -95247 -201709
6350b01709j21546o1114o177J83327J89716J36034Q8578R2191j06964L5660k0220
$$ -201709 -323255 -384369 -390546 -207219 -17503 118531 207109 299300 192336 227996 207776
6339B07776Q327J5472M2554o5103K1472r3056o5899j01009j1668j12875J9911
$$ 207776 216103 231575 274129 209026 230498 137442 71543 -29466 -41134 -154009 -134098
6328a34098J45317N9109k12238j01997J14222Q5891L9177J13886n2399j0633k5131
$$ -134098 11219 70328 -141910 -243907 -129685 -43794 -4617 109269 56870 46237 21106
6317B1106J56291j5075j95655j70065Q938j20838N8159n92N2836K9180k09543
$$ 21106 177397 162322 -33333 -203398 -194460 -315298 -257139 -257731 -204895 -175715 -385258
6306c85258m8800K70743P1367K2655l6947m1450j73411m9995O4862J98317o3185
$$ -385258 -434058 -163315 -91948 -69293 -106240 -147690 -321101 -371096 -306234 -107917 -171102
6295a71102O1048n0745j35793J22743Q7480K3649J27975k2575k3029R9359J21303
$$ -171102 -110054 -160799 -296592 -173849 -86369 -62720 65255 42680 19651 119010 240313
6284B40313p5045k56344j29153J00427o2859j37841K71973J35116L6756k4641
$$ 240313 165268 -91076 -220229 -119802 -182661 -320502 -48529 86587 123343 98702
6274I8702L0387k24312k27990L7668J25778P3343J72492j0884j25556M5505j68842
$$ 98702 129089 -95223 -323213 -285545 -159767 -86424 86068 75184 -50372 -4867 -173709
6263a73709J07179K19056p25o3022k14771J31643J51028j12046q1140L4498Q6606
$$ -173709 -66530 152526 151801 88779 -125992 5651 156679 44633 -36507 -2009 84597
6252H4597J4212k5429J09277P8477p3130j88230r183M9180n511q7647l2487J34375
$$ 84597 98809 73380 182657 261134 188004 -226 -9409 39771 34260 -53387 -85874 48501
6240D8501J28862J05855J50146j1763O4352J727k67656k23829j36541R3016Q9349
$$ 48501 177363 283218 433364 421601 485953 487680 220024 -3805 -140346 -47330 42019
6229D2019J16977J88k06869r1875O6325M2934J93849J65489J12760p7707j96856
$$ 42019 158996 159184 -47685 -139560 -73235 -30301 163548 329037 441797 364090 167234
6218A67234k75982k5495J1780n54K32530o7162j30332q1531N1324M1651L8145
$$ 167234 -108748 -134243 -122463 -123017 109513 42351 -87981 -169512 -118188 -76537 -38392
6207c8392m7687k6229j08431J73872K27829l5383k50594k32192n6789l0166P7841
$$ -38392 -86079 -112308 -220739 -46867 180962 145579 -105015 -337207 -393996 -424162 -346321
6196c46321K47812l7073N9088j01546k33704k2474J36476J65878K19593M9976
$$ -346321 -98509 -135582 -76494 -178040 -411744 -434218 -297742 -131864 87729 137705
6186A37705j93059j1476L0444J20209j23266l43468J14814L11012r953m0690J97438
$$ 137705 -55354 -66830 -36386 83823 -39443 -382911 -268097 42915 32962 -7728 189710
6175A89710M1975m133j22609p6266J50120J69312j66867j97080q793r4951P591
$$ 189710 231685 227552 104943 28677 178797 348109 181242 -15838 -24631 -119582 -111991
6164a11991J9429m951R076q762j86981K396J82364Q1949n8274p5210J28148J78053
$$ -111991 -92562 -97513 -88437 -97199 -284180 -281784 -99420 -17471 -75745 -150955 -22807 155246
6152A55246q8826o6496o2576m4138k7167P4723o9598l525K3082j6856j16956k6907
$$ 155246 66420 -76 -62652 -106790 -133957 -59234 -128832 -132357 -109275 -126131 -243087 -269994
6140b69994l5501J02297J21565k5737J2556Q5878L9187M1245k0952n3256J0752
$$ -269994 -305495 -203198 -81633 -107370 -94814 -8936 30251 71496 50544 -2712 8040
6129H040q3810J25664o0785p4390J61285m5943j2804J60708J14293n9668J3554
$$ 8040 -75770 49894 -10891 -85281 76004 30061 17257 177965 292258 232590 246144
6118B46144j0928j23031k3676q3107M3327p2174o5879J04406J03310k7827M2576
$$ 246144 235216 112185 88509 5402 48729 -23445 -89324 15082 118392 90565 133141
6107A33141j11366j52306m7233r0917M3691O4219j4043J55301J54888l9623j82454
$$ 133141 21775 -130531 -177764 -268681 -224990 -160771 -174814 -19513 135375 95752 -86702
6096h6702r5635J89588J08692j4949l3873j17845j9712J5651J11731K1011n8187
$$ -86702 -182337 7251 115943 100994 67121 -50724 -70436 -54785 56946 77957 19770
6085A9770j3426J31325J2456r7054l7784j07443n4145K1221Q3060J56864N5523
$$ 19770 6344 137669 150125 53071 15287 -92156 -146301 -125080 -42020 114844 170367
6074A70367k03584Q93J16222q3355o383j4655p9823j20520o281Q1591m1030p8410
$$ 170367 -33217 -32324 83898 543 -5840 -20495 -100318 -220838 -227119 -145528 -186558 -264968
6062b64968J66266J68562j25041k23984k5269J46690M4020o3490L262J34377J11696
$$ -264968 -98702 69860 -55181 -279165 -304434 -157744 -113724 -177214 -173952 -39575 72121
6051G2121Q0315l8543l8274K8587R5323k3382j13069j07985O2677J77179N2581
$$ 72121 152436 113893 75619 104206 199529 176147 63078 -44907 17770 194949 247530
6040B47530o3794n2764j58184j50312K4077r9825K1167j2723L6434J56641Q0780
$$ 247530 183736 130972 -27212 -177524 -153447 -253272 -232105 -244828 -208394 -51753 29027
6029B9027J0454m1944n8640m6489o4642K43801L01685o1532k65102j88844n2794
$$ 29027 39481 -2463 -61103 -107592 -172234 71567 373252 311720 46618 -142226 -195020
6018a95020J4434r0998J58283L7453J78036M1963p0573p0141l9172O5396K3165
$$ -195020 -180586 -271584 -113301 -75848 102188 144151 73578 3437 -35735 29661 52826
6007E2826l4908K7511j06066J1630M7102j20105o4385K0485Q4062j15131p0344
$$ 52826 17918 45429 -60637 -49007 -1905 -122010 -186395 -165910 -81848 -196979 -267323
5996b67323L3209J85802J54843L251j25804k3630R4679j46285k01385K09614J87386
$$ -267323 -234114 -48312 106531 109782 -16022 -39652 55027 -91258 -292643 -83029 104357
5985A04357J6520p8619N3235J15066l0556O5890M1803j03527j06551j14445J05578
$$ 104357 120877 42258 95493 210559 180003 245893 287696 184169 77618 -36827 68751
5974F8751k7765m0906j12843r3696k3218L8089J76236k704k4391J42238r2090
$$ 68751 40986 80 -112763 -206459 -229677 -191588 -15352 -18056 -42447 99791 7701
5963G701q3937q3234j64188J33839J31866J55818K9877j38500K03651j27945o6683
$$ 7701 -76236 -159470 -323658 -189819 -57953 97865 127742 -10758 192893 64948 -1735
5952a735o976J55555p5876q5030j9323j16632K432N0844J22138R7769p2940m4238
$$ -1735 -8711 146844 70968 -14062 -33385 -150017 -147585 -96741 25397 123166 50226 5988
5940E988M9340N3633K0207l0775k4284J39567m1597q241J18530K7269k22437j36340
$$ 5988 55328 108961 129168 98393 74109 213676 172079 163838 282368 309637 87200 -49140
5928d9140R6957O7760J41851O9113r5880J7151j92929q2525j5129K788k6043n5021
$$ -49140 47817 115577 257428 326541 230661 247812 54883 -27642 -42771 -39983 -66026 -121047
5916a21047Q8720K40518K1351j19562j37704j08323O5601l50P5484L1434j08495
$$ -121047 -32327 208191 229542 109980 -27724 -136047 -70446 -70796 4688 36122 -72373
5905g2373N4527m8091q9112j02572O8781m8350n9513J64934J28015k8108k9493
$$ -72373 -17846 -65937 -155049 -257621 -188840 -237190 -296703 -131769 -3754 -31862 -61355
5894f1355j0525j5667K4786N3657q4237m7398j17733N3746J25293M7834j55859
$$ -61355 -71880 -87547 -62761 -9104 -93341 -140739 -258472 -204726 -79433 -31599 -187458
5883a87458N316J77342N6163n0632k5624R5431J4376M7761P0266J7303j75595
$$ -187458 -182142 -4800 51363 731 -24893 70538 84914 132675 202941 220244 44649
5872D4649j61401N7603p837j04557O1768P0402j0837J5419J21960L0575O7931
$$ 44649 -116752 -59149 -66986 -171543 -109775 -39373 -50210 -34791 87169 117744 185675
5861A85675j30703j44889R9532Q9769R8455M7471r3899o3707Q1107p5001n0834
$$ 185675 54972 -89917 9615 99384 197839 245310 151411 87704 168811 93810 42976
5850D2976l4214M4716J19885p9560j94597N1496J89370P7095j99245j62067O9634
$$ 42976 8762 53478 173363 93803 -100794 -49298 140072 217167 17922 -144145 -74511
5839g4511K06752L5017j33713r9393p817l6114j49861j5347Q9240J04282j10197
$$ -74511 132241 167258 33545 -65848 -73665 -109779 -259640 -274987 -185747 -81465 -191662
5828a91662M078J51694j5045q0325j8832J21021J46721L0243k2940K02232k9564
$$ -191662 -187584 -35890 -50935 -131260 -150092 -29071 117650 147893 124953 327185 297621
5817B97621j44829k36552n6041N1658q2775L7442J7928J5970M8235J65278R032
$$ 297621 152792 -83760 -139801 -88143 -170918 -133476 -115548 -99578 -51343 113935 122967
5806A22967m1908o7206J19869K8639o9160j41847N9097R7642N8991n5179n3192
$$ 122967 81059 13853 133722 162361 93201 -48646 10451 108093 167084 111905 58713
5795E8713j20445J12083J82972j28143j92681j52222l2669O2452p4095k3703k8128
$$ 58713 -61732 50351 233323 105180 -87501 -239723 -272392 -209940 -284035 -307738 -335866
5784c35866J22873L01402L71771l3713P224k15373m127n9729M2276j23711j51705
$$ -335866 -212993 88409 460180 426467 433691 218318 214191 154462 196738 73027 -78678
5773g8678k3938Q3067l2536j81796k5767M6394m2727m9895r282K6139K12155K80358
$$ -78678 -102616 -19549 -52085 -233881 -259648 -213254 -255981 -305876 -315158 -289019 -76864 203494
5761B03494k7314j8173J7888n5912j4514j3489j01394K6572J16405K218l143j15462
$$ 203494 176180 158007 175895 119983 105469 91980 -9414 17158 133563 135781 132638 17176
5749A7176j74097m7907J31260O5702J16858J30611j08579j07981j49517l5528
$$ 17176 -156921 -204828 -73568 -7866 108992 239603 131024 23043 -126474 -162002
5739a62002J05446O2341J48767n4392k52374K31864J18402j10825L8666m0924
$$ -162002 -56556 5785 154552 100160 -152214 79650 198052 87227 125893 84969
5729H4969j02035j48681j10082P7838J16382r4921j41809N6187K42043L12326
$$ 84969 -17066 -165747 -275829 -197991 -81609 -176530 -318339 -262152 -20109 292217
5719B92217p6644j06982J80478m9368j88870o6675M6960J22870k6114j8840j43996
$$ 292217 215573 108591 289069 239701 50831 -15844 31116 153986 127872 109032 -34964
5708c4964R980J05800k00511N0954Q4563K6097j13607r1447k5940Q2031R0753
$$ -34964 -24984 80816 -119695 -68741 15822 41919 -71688 -163135 -189075 -107044 -16291
5697a6291M3296j53474q0666l4296m5187L5489p8152r751J48434J02410K08475
$$ -16291 27005 -126469 -207135 -241431 -286618 -251129 -329281 -339032 -190598 -88188 120287
5686A20287q1768K3460P6298k41L8158l8332j09635J2659m5072j19902l748J28420
$$ 120287 38519 61979 138277 138036 176194 137862 28227 40886 -4186 -124088 -127836 584
5674E84L7310l2309j36370O9874j13439O7904J01878J37813j6349Q4061j55725
$$ 584 37894 5585 -130785 -60911 -174350 -106446 -4568 133245 116896 200957 45232
5663D5232j82318p8146o060P7375L424O9219J71569J7429n3956O634n4595O8460
$$ 45232 -137086 -215232 -221292 -143917 -140493 -71274 100295 117724 63768 70402 15807 84267
5651H4267J00644P9888l7358j22811j14733N0958J47040l2721p040L6659k21127
$$ 84267 184911 264799 227441 104630 -10103 40855 187895 155174 148134 184793 -36334
5640c6334n0240N5106N2131j46320m5768M8485J11326j9123j26951O9979J8610
$$ -36334 -86574 -31468 20663 -125657 -171425 -122940 -11614 -30737 -157688 -87709 -69099
5629f9099O3576M1785m3564j9875o4709r790J4033m4465m4366J56216J25780m0657
$$ -69099 -5523 36262 -7302 -27177 -91886 -101676 -87643 -132108 -176474 -20258 105522 64865
5617F4865o1680n3347j30209L6455J07435M8494R3834j41202M9983J07516q5296
$$ 64865 3185 -50162 -180371 -143916 -36481 12013 105847 -35355 14628 122144 36848
5606C6848l0786j67333j41613J17504J82656J33465o7454j46211N6327o4109R805
$$ 36848 6062 -161271 -302884 -185380 -2724 130741 63287 -82924 -26597 -90706 -80901
5595h0901o1042j56560L1985Q1869N7586K06130J58054j32678m4060Q247m3352
$$ -80901 -141943 -298503 -266518 -184649 -127063 79067 237121 104443 60383 68630 25278
5584B5278K0757j08178n3056O4359J01600p556M6398L9154j64677j8724O632J72851
$$ 25278 46035 -62143 -115199 -50840 50760 43204 89602 128756 -35921 -54645 -48013 124838
5572A24838J5699O3062l1290N5463J10756P5719k32528k38388n5780j9785l6805
$$ 124838 140537 203599 172309 227772 338528 414247 181719 -56669 -112449 -132234 -169039
5561a69039m6609q2813j92729O4162J81466J00888j95056l11O4504J85669R4538
$$ -169039 -215648 -298461 -491190 -427028 -245562 -144674 -339730 -340041 -275537 -89868 4670
5550D670J05798j2546K6566l271o294n0750o6971k6230N0928q0772k8563m4284
$$ 4670 110468 97922 124488 121217 114923 64173 -2798 -29028 21900 -58872 -87435 -131719
5538a31719J74041K29294L3527j48600k33054j7977l8859M6298N8682O7729j14574
$$ -131719 42322 271616 305143 156543 -76511 -94488 -133347 -87049 -28367 39362 -75212
5527g5212k20519n205R5800J28464J50400M8858n0812j36301r5407j40867P4176
$$ -75212 -295731 -300936 -205136 -76672 73728 122586 71774 -64527 -159934 -300801 -226625
5516b26625m5144J2305J25467J05433p5899k4114l1561R6695o4191j0095J03860
$$ -226625 -271769 -259464 -133997 -28564 -104463 -128577 -160138 -63443 -127634 -137729 -33869
5505c3869J66244J73056j27543J4683K6401j00607N6267P2186l7773P3095j89732
$$ -33869 132375 305431 177888 192571 218972 118365 174632 246818 209045 282140 92408
5494I2408q9541j84112p5601l4634J32563M14063j07842j32416R3517L16162j1929
$$ 92408 2867 -181245 -256846 -291480 -158917 255146 147304 14888 108405 424567 412638
$$ [...]
##END NTUPLES=NMR SPECTRUM
##END=
