##TITLE=Analysis number 327781
Compound Code cc 50509
Book Reference 521/37
Project Code adrs
Chemist Name evam
##JCAMPDX= 6.0         $$ Bruker NMR JCAMP-DX V2.0
##DATA TYPE= NMR SPECTRUM
##DATA CLASS= NTUPLES
##ORIGIN= Bruker BioSpin GmbH
##OWNER= nmr
$$ XWIN-NMR		Version 3.5
$$ Thu Apr  5 10:10:04 2007 GMT Daylight Time (UT+1h)  MAYBRIDGE\nmr@NMR_250MHZ
##.OBSERVE FREQUENCY= 250.131544655141
##.OBSERVE NUCLEUS= ^1H
##.ACQUISITION MODE= SIMULTANEOUS (DQD)
##.ACQUISITION SCHEME= undefined
##.AVERAGES= 16
##.DIGITISER RES= 18
##SPECTROMETER/DATA SYSTEM= dpx250
##.PULSE SEQUENCE= zg30
##.SOLVENT NAME= CDCl3
##.SHIFT REFERENCE= (INTERNAL, CDCl3, 0, 16.4539)
##AUDIT TRAIL= $$ (NUMBER, WHEN, WHO, WHERE, WHAT)
$$ ##TITLE= Audit trail, XWIN-NMR		Version 3.5
$$ ##JCAMPDX= 5.01
$$ ##ORIGIN= Bruker BioSpin GmbH
$$ ##OWNER= nmr
$$ C:\u/data/dgb/nmr/ADRS/640/pdata/1/auditp.txt
$$ ##AUDIT TRAIL=  $$ (NUMBER, WHEN, WHO, WHERE, WHAT)
(   1,<2007-04-05 10:09:38.80 +100>,<MAYBRIDGE\nmr>,<NMR_250MHZ>,
      <created by zg, POWCHK disabled, PULCHK disabled
       configuration hash MD5:
       49 4B E0 1D 92 C2 6B 37 9F E6 65 BC 52 41 86 1D
       data hash MD5: 64K
       5E B5 A3 E9 A8 5F C5 69 21 14 A6 3F 6D 69 36 73>)
(   2,<2007-04-05 10:09:54.05 +100>,<MAYBRIDGE\nmr>,<NMR_250MHZ>,
      <Start of raw data processing
       ef LB = 0.3 FT_mod = 6 PKNL = 1 SI = 32K 
       data hash MD5: 32K
       54 DA 0E C7 8F 39 C7 A1 92 FE 37 4C B4 BD 17 6A>)
(   3,<2007-04-05 10:09:55.68 +100>,<MAYBRIDGE\nmr>,<NMR_250MHZ>,
      <apk 
       data hash MD5: 32K
       4C 82 5F 02 60 5F 91 0A B7 E9 14 F4 19 C4 E6 1F>)
(   4,<2007-04-05 10:09:56.38 +100>,<MAYBRIDGE\nmr>,<NMR_250MHZ>,
      <abs ABSG = 5 
       data hash MD5: 32K
       73 FB 1A 56 73 1B C0 15 84 0F 64 5B F7 36 47 2E>)
$$ ##END=
$$ 
$$ hash MD5
$$ 3A AE 83 BA 27 FF B7 CE F2 FC 6E 81 B9 B6 AC 0C
##$RELAX= 
##$RELAX= 
##$RELAX= 
##$RELAX= 
##$RELAX= 
##$RELAX= 
##$RELAX= 
$$ Bruker specific parameters
$$ --------------------------
##$DU= <C:\u>
##$EXPNO= 640
##$NAME= <ADRS>
##$PROCNO= 1
##$TYPE= <nmr>
##$USER= <dgb>
##$AMP= (0..31)
100 100 100 100 100 100 100 100 100 100 100 100 100 100 100 100 100 100 
100 100 100 100 100 100 100 100 100 100 100 100 100 100 
##$AQSEQ= 0
##$AQ_mod= 3
##$AUNM= <au_zg>
##$AUTOPOS= <10 >
##$BF1= 250.13
##$BF2= 250.13
##$BF3= 250.13
##$BF4= 250.13
##$BF5= 500.13
##$BF6= 500.13
##$BF7= 500.13
##$BF8= 500.13
##$BYTORDA= 1
##$CFDGTYP= 0
##$CFRGTYP= 5
##$CHEMSTR= <none>
##$CNST= (0..31)
1 1 145 1 1 1 1 1 1 1 1 1 1 1 1 1 1 1 1 1 1 1 1 1 1 1 1 1 1 1 1 1 
##$CPDPRG= <>
##$CPDPRG1= <>
##$CPDPRG2= <>
##$CPDPRG3= <>
##$CPDPRG4= <mlev>
##$CPDPRG5= <mlev>
##$CPDPRG6= <mlev>
##$CPDPRG7= <mlev>
##$CPDPRG8= <mlev>
##$CPDPRGB= <>
##$CPDPRGT= <>
##$D= (0..31)
0 1 0 0 0 0 0 0 0 0.06 0 0 0 0 0 0 0.0002 0 0 0 0 0 0 0 0 0 0 0 0 0 0 
0 
##$DATE= 1175764177
##$DBL= (0..7)
120 120 120 120 120 120 120 120 
##$DBP= (0..7)
150 150 150 150 150 150 150 150 
##$DBP07= 0
##$DBPNAM0= <>
##$DBPNAM1= <>
$$ [...]
##$SUBNAM7= <"">
##$SUBNAM8= <"">
##$SUBNAM9= <"">
##$SW= 20.6930455092707
##$SWIBOX= (0..15)
0 0 3 0 0 0 0 0 0 0 0 0 0 0 0 0 
##$SW_h= 5175.983436853
##$TD= 65536
##$TD0= 1
##$TE= 683.16
##$TE2= 300
##$TE3= 300
##$TEG= 300
##$TL= (0..7)
0 120 120 120 120 120 120 120 
##$TP= (0..7)
150 150 150 150 150 150 150 150 
##$TP07= 0
##$TPNAME0= <>
##$TPNAME1= <>
##$TPNAME2= <>
##$TPNAME3= <>
##$TPNAME4= <>
##$TPNAME5= <>
##$TPNAME6= <>
##$TPNAME7= <>
##$TPOAL= (0..7)
0.5 0.5 0.5 0.5 0.5 0.5 0.5 0.5 
##$TPOFFS= (0..7)
0 0 0 0 0 0 0 0 
##$TUNHIN= 0
##$TUNHOUT= 0
##$TUNXOUT= 0
##$USERA1= <user>
##$USERA2= <user>
##$USERA3= <user>
##$USERA4= <user>
##$USERA5= <user>
##$V9= 5
##$VALIST= <valist>
##$VCLIST= <CCCCCCCCCCCCCCC>
##$VD= 0
##$VDLIST= <DDDDDDDDDDDDDDD>
##$VPLIST= <PPPPPPPPPPPPPPP>
##$VTLIST= <TTTTTTTTTTTTTTT>
##$WBST= 1024
##$WBSW= 4
##$XGAIN= (0..3)
0 0 0 0 
##$XL= 0
##$YL= 0
##$YMAX_a= 386259
##$YMIN_a= -503431
##$ZGOPTNS= <>
##$ZL1= 120
##$ZL2= 120
##$ZL3= 120
##$ZL4= 120
##$ABSF1= 16.45391
##$ABSF2= -4.239262
##$ABSG= 5
##$ABSL= 3
##$ALPHA= 0
##$AQORDER= 0
##$ASSFAC= 0
##$ASSFACI= 0
##$ASSFACX= 0
##$ASSWID= 0
##$AUNMP= <proc_1d>
##$AZFE= 0.1
##$AZFW= 0.1
##$BCFW= 0
##$BC_mod= 0
##$BYTORDP= 0
##$COROFFS= 0
##$CY= 12.5
##$DATMOD= 1
##$DC= 0
##$DFILT= <>
##$DTYPP= 0
##$F1P= 14.0000005364418
##$F2P= -0.99999901652339
##$FCOR= 0.5
##$FTSIZE= 32768
##$FT_mod= 6
##$GAMMA= 0
##$GB= 0
##$INTBC= 1
##$INTSCL= 1
##$ISEN= 128
##$LB= 0.3
##$LEV0= 0
##$LPBIN= 0
##$MAXI= 10000
##$MC2= 0
##$MEAN= 0
##$ME_mod= 0
##$MI= 0
##$NCOEF= 0
##$NC_proc= -5
##$NLEV= 6
##$NOISF1= 0
##$NOISF2= 0
##$NSP= 0
##$NTH_PI= 0
##$NZP= 0
##$OFFSET= 16.45391
##$PC= 1
##$PHC0= 233.5428
##$PHC1= 6.728956
##$PH_mod= 1
##$PKNL= yes
##$PPARMOD= 0
##$PSCAL= 4
##$PSIGN= 0
##$REVERSE= no
##$SF= 250.130017029014
##$SI= 32768
##$SIGF1= 0
##$SIGF2= 0
##$SINO= 400
##$SIOLD= 32768
##$SREGLST= <1H.CDCl3>
##$SSB= 0
##$STSI= 32768
##$STSR= 0
##$SW_p= 5175.98343685301
##$SYMM= 0
##$S_DEV= 0
##$TDeff= 65536
##$TDoff= 0
##$TI= <Analysis number 999999
Compound Code 99
Book Reference 9
Project Code 9>
##$TILT= no
##$TM1= 0
##$TM2= 0
##$TOPLEV= 0
##$USERP1= <user>
##$USERP2= <user>
##$USERP3= <user>
##$USERP4= <user>
##$USERP5= <user>
##$WDW= 1
##$XDIM= 32768
##$YMAX_p= 445444539
##$YMIN_p= -425234
$$ End of Bruker specific parameters
$$ ---------------------------------
##NTUPLES= NMR SPECTRUM
##VAR_NAME=  FREQUENCY,     SPECTRUM/REAL,   SPECTRUM/IMAG
##SYMBOL=    X,             R,               I
##VAR_TYPE=  INDEPENDENT,   DEPENDENT,       DEPENDENT
##VAR_FORM=  AFFN,          ASDF,            ASDF
##VAR_DIM=   32768,         32768,           32768
##UNITS=     HZ,            ARBITRARY UNITS, ARBITRARY UNITS
##FACTOR=    0.157963299565203, 1,           1
##FIRST=     4115.61699551065, 0,            0
##LAST=      -1060.36644134236, 0,           0
##MIN=       -1060.36644134236, -425234,     0
##MAX=       4115.61699551065, 445444539,    0
$$ Real data points
##PAGE= N=1
##DATA TABLE= (X++(R..R)), XYDATA
$$ [...]
15968c6877J02749O1049k6901J0197O0522j13039n3290M2628k8855M5079P5524
15957A38786o5069k51m9547k5288j31783m2666N2710p307o925J5906k9865K3508
15945a27791m31Q3151M9211J7577P3806l2230o5641R4113R0882j60140j00955
15934g8448J8488o6547r7589O3388R7265K5539P174r0531J3414j4335o0421Q3070
15922i9533J29157j5518o8279l8796n3455r81Q9824K8086p2797q6310o000P3838
15910a20764n9182k2553L3577R6571N3613K3611j3894o7541j1203J9886M7688
15899b0191J20138M2743n9648o2541m7598p9746Q2485N5959M5150M6732K5502
15888A48985M1452l7363k0809J716P668m8770k2946P4505j34858n7088J1296N03
$$ plain form
15968 -36877 65872 126921 100020 110217 170739 57700 4410 47038 18183 63262 138786
15957 138786 73717 73466 23919 -1369 -133152 -175818 -123108 -130415 -137340 -121434 -151299 -127791
15945 -127791 -128222 -45071 4140 21717 95523 63293 -2348 91765 182647 22507 -78448
15934 -78448 -59960 -126507 -224096 -160708 -63443 -37904 -30730 -121261 -107847 -122182 -182603 -99533
15922 -99533 29624 14106 -54173 -92969 -146424 -147405 -57581 -29495 -102292 -188602 -194602 -120764
15910 -120764 -179946 -202499 -168922 -72351 -18738 4873 -9021 -76562 -87765 -67879 -20191
15899 -20191 99947 142690 83042 20501 -27097 -106843 -24358 31601 76751 123483 148985
15888 148985 190437 153074 132265 133981 141649 92879 69933 144438 9580 -47508 -36212 -35709
15876c5709L6159l4734M1382m3747j42679p2195j750J13080L9725q7708L6374
15865a51802J37948L3316j56486m4800J2691j04053K4548K01941P1798L0845P1048
15854A26994O5764r293J2203j38173j43907n1938j241j51962N4913M3021P1791
15843a21828Q9384J00778P6971k8252j27794N9898l7302j52116J24735j8025j57672
15832a91223L1785M2293m8353j01015Q9447J09262l6800O0861R2882N8934m7962
15821F0111m4274L4420j4070p4459j8730P0155n8125M206K7521Q786o0859L460
15809f1858j0042j1817J2430M775n5229Q4953R879p7262j02159P3966J10546j8307
15797d0125q6942o6110o2231R932J34367J2369m7704r9875q3831o0113O7727O4996
$$ plain form
15876 -35709 450 -34284 7098 -36649 -179328 -251523 -253273 -140193 -100468 -188176 -151802
15865 -151802 -13854 19462 -137024 -181824 -169133 -273186 -248638 -46697 25101 55946 126994
15854 126994 192758 183465 195668 57495 -86412 -138350 -139591 -291553 -236640 -193619 -121828
15843 -121828 -32444 68334 145305 117053 -10741 49157 11855 -140261 -15526 -33551 -191223
15832 -191223 -159438 -117145 -165498 -266513 -177066 -67804 -104604 -43743 49139 108073 60111
15821 60111 15837 50257 36187 -38272 -57002 13153 -44972 -40766 -13245 -4459 -65318 -61858
15809 -61858 -71900 -83717 -71287 -66512 -121741 -36788 -26909 -104171 -206330 -132364 -21818 -40125
15797 -40125 -127067 -193177 -255408 -245476 -111109 -98740 -146444 -246319 -330150 -390263 -322536 -257540
15785b57540P6162L2998J1189p5357N014n569l9411R9041J03686L9242j42793
15774a53338L2627J0707J4267O2130k1385l8017n128J87444J4206k3970m9932
15763B9611j5112j14808r6985L180J86802l3112j9403L7711m7132K7782q1433
15752a22899N6013j8056m4815O9052m0495q6866k6063N304k385J5197L9357Q077
15740a48579L6280m636r9953J64007J62516R6223p6987n6199m7429k9686k7308
15729c1751l2844K9702L4721r5629P7665l4158j31P7171Q8353j3345p2591R705
15717C6868q6198j354P1682M7378M8582J0380l8613j49659o9837n3740J06162
15706g8349m4099k9234L7471Q0012O6858N1084m8663k4815n9101o2960K7665J4584
$$ plain form
15785 -257540 -181378 -148380 -137191 -212548 -207534 -213103 -252514 -153473 -49787 -10545 -153338
15774 -153338 -120711 -110004 -95737 -33607 -54992 -93009 -98137 89307 103513 79543 29611
15763 29611 14499 -100309 -197294 -194114 -7312 -40424 -59827 -22116 -69248 -41466 -122899
15752 -122899 -66886 -84942 -129757 -60705 -101200 -188066 -214129 -208825 -211210 -196013 -156656 -148579
15740 -148579 -112299 -116935 -216888 -52881 109635 205858 128871 72672 25243 -4443 -31751
15729 -31751 -64595 -34893 -172 -95801 -18136 -52294 -52425 24746 113099 99754 27163 36868
15717 36868 -49330 -50684 20998 68376 116958 127338 88725 -60934 -130771 -184511 -78349
15706 -78349 -122448 -151682 -114211 -34199 32659 83743 35080 10265 -48836 -111796 -84131 -69547
15694f9547j76709P9232J02249r6781j05560j3273Q224J05111J22243N1115n661
15683F43j35179j1522R9709J44005O2113o2213p5279p8674k3495j8811j0642l2878
15671a42223K4172l6580P705J14559Q3585M4418p3529l7569J02708l774r3407
15660i935n2454N4954J23862M4670r4353n9855P2809J1771l919J1303j01559l0399
15648c3105p5953p6524O5180P1490n5517k8165j2574J32102k4704n2688m183L9316
15636e5325l437r246n2536k3992p210R1411k8884J5289k3065J0154j40045k8246
15624b55132P5736N8476N0626j475N7807M8397P4823k0536m4835m6596m2900l536
15612d9145k9206p543m9492J54199M7591j67522n5965P6951M5964J8113K0938
$$ plain form
15694 -69547 -246256 -167024 -64775 -161556 -267116 -280389 -272165 -167054 -44811 6304 643
15683 643 -134536 -146058 -46349 97656 159769 97556 22277 -56397 -79892 -98703 -109345 -142223
15671 -142223 -118051 -154631 -146926 -32367 51218 95636 22107 -15462 87246 83472 -9935
15660 -9935 -62389 -7435 116427 161097 66744 6889 79698 91469 87550 98853 -2706 -33105
15648 -33105 -109058 -185582 -120402 -48912 -104429 -132594 -145168 -13066 -37770 -90458 -94641 -55325
15636 -55325 -58762 -68008 -120544 -144536 -151746 -60335 -89219 -73930 -96995 -86841 -226886 -255132
15624 -255132 -179396 -120920 -70294 -71769 -13962 34435 109258 88722 43887 -2709 -45609 -49145
15612 -49145 -78351 -85894 -135386 18813 66404 -101118 -157083 -80132 -34168 -16055 4883
15601D883p7857j14385m487J62788R5148r7068j130J41431l2290n3316j31605
15590a07888p990M8648R429l5968J5885O6202n8821o2340M7662Q0020j3071K3427
15578E195l17o8277k5170J0965o4160R539R5290n0623j15294M5182Q7906M8356
15566b1408P7655m241J0381o8080K1903k6393Q9481O7178r0927j26792O2425k9076
15554c7894O0170P3116r1031j7820Q3578R0367n6033o4968n504L0192n7702o1851
15542e5380l9790M0366M9246k5206n8302l5470N8199K5791l379j02515r467J48941
15530f966J01833j1948n4083j04758j25148j29873J4354O9277Q0702J70472k2185
15519a8323k9661m30n4682o0456M6582R82Q2686M4927r4176o3380J52028J832
$$ plain form
15601 4883 -72974 -187359 -191846 -29058 66090 -30978 -32108 109323 77033 23717 -107888
15590 -107888 -115878 -67230 -57801 -93769 -77884 -11682 -70503 -132843 -85181 -5161 -18232 5195
15578 5195 4878 -63399 -88569 -77604 -141764 -132225 -36935 -87558 -202852 -157670 -69764 -21408
15566 -21408 56247 52006 62387 -5693 16210 -10183 79298 146476 55549 -71243 -8818 -37894
15554 -37894 22276 95392 4361 -13459 70119 160486 104453 39485 33981 64173 6471 -55380
15542 -55380 -95170 -54804 -5558 -30764 -89066 -124536 -66337 -40546 -43925 -146440 -155907 -6966
15530 -6966 94867 82919 28836 -75922 -201070 -330943 -316589 -247312 -166610 3862 -18323
15519 -18323 -47984 -48414 -103096 -163552 -116970 -115988 -33302 11625 -82551 -145931 6097 7929
15507G929j1626n794M3507L3193n1896L9042j6512n7618n2587N0629R5880J3311
15495H7458j83970j62903O6259J80480R6492m9813r7408j3510N0399o135k4174
15484e6825K9703j18364m4175J26585P9057N995J1172k6353J9818j15506o4451
15473a53344n187l5170J52J40851J00054L6829p2968j29634J12683N3127p0223
15462b2830j2408l6017k2874P9962N0501q9807n9298r0282N2811J18471j04640
15451a36411J5066P1291k4597o9473J00361o0149p3755j18316J34705R7371J1788
15440e2119R1797j5763k9027r1751K7630Q6753J21949k2140p5649j39087m3583
15429a40990M8603Q1580j4104j13977m6894O9610j0683j43056M1989P9274L2150
$$ plain form
15507 7929 -3697 -9491 34016 67209 15313 54355 37843 -19775 -72362 -21733 74147 87458
15495 87458 -96512 -259415 -193156 -12676 83816 34003 -63405 -76915 -26516 -32651 -56825
15484 -56825 -27122 -145486 -189661 -63076 15981 21976 33148 6795 26613 -88893 -153344
15473 -153344 -158531 -193701 -193549 -52698 47356 84185 11217 -118417 -5734 47393 -22830
15462 -22830 -35238 -71255 -94129 -14167 36334 -53473 -112771 -203053 -150242 -31771 -136411
15451 -136411 -121345 -50054 -74651 -144124 -43763 -103912 -177667 -295983 -161278 -63907 -52119
15440 -52119 39678 23915 -5112 -96863 -69233 17520 139469 117329 41680 -97407 -140990
15429 -140990 -92387 -10807 -24911 -138888 -185782 -116172 -126855 -269911 -227922 -148648 -116498
15418a16498j1347l8937J45302J22212M1990j54298M5649j4567j2763M944M1746
15407E3433k107p6681p8327M9474J94522m3977j39408o4664O5026J33788M0759
15396A31838o0651j03223J4509J04716J26369K123m9312n9191j03007n5928K4989
15385b6768J11478J6967o3721o8589o1281o9911k0161J06794P6168j57987M5732
15374a11279P0683r82Q0215l2310j12860o5485q4892M8040O6025J08341R1143
15363E6639O479r0896o2369j8049r584Q2910J04285q8493q342M6406O9195J14161
15351B02342K9897r5066j45205p8476k2116P4986n1502q9094K5567P1979J5463
15340f1225L0902r512k6001j0257J2149J07793M4695M4680J3533n7845P0965L3803
$$ plain form
15418 -116498 -127845 -166782 -21480 100732 142722 -11576 34073 19506 6743 11687 53433
15407 53433 51326 -25355 -103682 -54208 140314 96337 -43071 -107735 -42709 91079 131838
15396 131838 71187 -32036 -17527 87189 213558 215681 166369 107178 4171 -51757 -26768
15385 -26768 84710 101677 37956 -30633 -91914 -161825 -181986 -75192 976 -157011 -111279
15374 -111279 -40596 -41578 38637 6327 -106533 -172018 -256910 -208870 -142845 -34504 56639
15363 56639 63118 -27778 -90147 -108196 -117780 -34870 69415 -19078 -27420 18986 88181 202342
15351 202342 232239 137173 -8032 -86508 -108624 -33638 -85140 -174234 -148667 -76688 -61225
15340 -61225 -30323 -39835 -65836 -76093 -63944 43849 88544 133224 146757 88912 159877 193680
15328A93680j59956N8817J2105m3941l5737n6131k7455j01815o0326j77899J38574
15317b60084J80166q0320l2453J04209J73284K6933j28273m231p8557m5437N5703
15306h9060k6600M3998K5438O2323P97q5515P8280Q3532p8880N5854m916p9229
15294a3978J8691J26529K6443j92583j69411L3870j4685m484o4027J3529R3157
15283a46949J15807m156r4488j02830K9296n0753r3179M6090J48329J57024J2298
15272A6489M7912K8167K1676O478r4739k2715r4334N0796L5638K7188k0193J03202
15260A05565J9622l0103Q6236k0161j88192m3124n6532n7212K8380L4161J65925
15249D4565Q4336q3092r9267j3722L0352l809k6073j9618L3060P4418l1456j1919
$$ plain form
15328 193680 33724 92541 104646 60705 24968 -31163 -58618 -160433 -220759 -398658 -260084
15317 -260084 -79918 -160238 -192691 -88482 84802 111735 -16538 -20769 -99326 -144763 -89060
15306 -89060 -115660 -71662 -46224 16099 16896 -68619 9661 93193 14313 70167 65251 -13978
15294 -13978 4713 131242 157685 -34898 -204309 -170439 -185124 -189608 -253635 -240106 -146949
15283 -146949 -31142 -35298 -129786 -232616 -203320 -254073 -347252 -301162 -152833 4191 16489
15272 16489 64401 92568 114244 120722 25983 3268 -91066 -40270 -4632 22556 2363 105565
15260 105565 125187 95084 181320 161159 -27033 -70157 -126689 -183901 -155521 -121360 44565
15249 44565 128901 45809 -53458 -67180 -36828 -40637 -66710 -86328 -53268 21150 -10306 -22225
15237b2225J2374M4067j9783j9337L7319o055j193L0535L628J2218k962l0421
15225C8165k2642k38840q2358J84190M1793L3422l3135j02367L248n6455q0373
15214c15352J0305N891O1370O0558j66726N8216K76156J38451j22253j8756Q6159
15203G4019L9375q3058m5358N5313M9104J03651N7158j6907j0897j58817n136
15192E8447J8068j01540j7184J55863K6785o1154j11943k124O2547J03667P0268
15181B01700j43979p8546J2393n6338l0647m0840q656J5076n8532J51545P1354
15170C4530M1154j4024k5194K0938l564Q7476m983j35946l7045k8490j0386R9086
15158B3552J31491j133k5376r2450n761J2213j29613R9766O7270j44264j26091
$$ plain form
15237 -22225 -9851 34216 14433 -4904 32415 26360 25167 55702 59330 71548 68586 38165
15225 38165 15523 -223317 -305675 -121485 -79692 -46270 -79405 -181772 -178524 -234979 -315352
15214 -315352 -305047 -299156 -237786 -177228 -343954 -285738 -9582 128869 6616 -12140 74019
15203 74019 113394 30336 -15022 40291 89395 193046 250204 233297 222400 63583 58447
15192 58447 76515 -25025 -42209 113654 140439 79285 -32658 -34782 27765 131432 201700
15181 201700 57721 -20825 -8432 -64770 -95417 -136257 -144913 -129837 -188369 -36824 34530
15170 34530 75684 61660 36466 57404 53840 141316 136333 387 -36658 -65148 -75534 23552
15158 23552 155043 153910 128534 36084 30323 42536 -87077 12689 79959 -64305 -190396
15147a90396O1256R2938J0986l3914j17666j02391l3085j3205J04058J13347p6010
15136a84082J8622j6622p4270j0654R7526J23057O2565M5433q3613j08724J3132
15125a17630j43662J4233M7285J44897J11172n6758k0463p3096m0931m1540M2715
15114a33778N6375O922M2162m3229j3016L336m4243O5200L6613l4863k2979J25548
15102D4048o2463m9190p6402k3543m7436o1051L6508Q3036Q0247k0301j632m0236
15090a38415K5101P4844J26961o3586m2411m21q8803L8582J4793k5318m956j8319
15078a01948N9032K06727J835o8780j07595m4904P7904P8028j8662j05767j2415
15067c6545k0412k6123R804j19878L8378k0787K1701j6266Q6222L8462p2892L9664
$$ plain form
15147 -190396 -129140 -36202 -25216 -59130 -176796 -279187 -312272 -325477 -221419 -108072 -184082
15136 -184082 -165460 -182082 -256352 -267006 -169480 -46423 16142 61575 -22038 -130762 -117630
15125 -117630 -261292 -247059 -199774 -54877 56295 -463 -20926 -94022 -134953 -176493 -133778
15114 -133778 -77403 -70481 -28319 -71548 -84564 -81228 -125471 -60271 -23658 -58521 -81500 44048
15102 44048 -18415 -67605 -144007 -167550 -214986 -276037 -239529 -156493 -76246 -96547 -98179 -138415
15090 -138415 -113314 -38470 88491 24905 -17506 -17927 -106730 -68148 -53355 -78673 -83629 -101948
15078 -101948 -42916 163811 165646 96866 -10729 -55633 22271 100299 81637 -24130 -36545
15067 -36545 -56957 -83080 -73276 -193154 -154776 -175563 -153862 -170128 -83906 -45444 -118336 -78672
15055g8672Q3914K1487j5583j0609J64644P1138j18581l8446j04219j19723K7691
15044a16959J84216P8442j04157P4165P6770p0400o3624P3479K6248j6140Q108
15033A50148j20224j19283k0219L7854J32108R9318L484K8664j09581l9335J78943
15022B21877O1762l2524m2394j0220o2262j12970j3000K1171l7553N241M2990
15011D2118p9641k8553J8448K0110J39338L8049j0398O5563j2438j15314p8987
15000a705j84651j7771J33529R5392J42330j11731o1274P0022n961M4536Q3505
14989A86221m898j78336n0102L7461J50037L6702o4412q3740j3218N0864q698
14978E7881m3005j41333l2893J77836Q7530O5082m5339m5235m1824q9242n3295
$$ plain form
15055 -78672 5242 26729 11146 537 165181 236319 117738 79292 -24927 -144650 -116959
15044 -116959 67257 145699 41542 115707 192477 122077 58453 131932 158180 142040 150148
15033 150148 29924 -89359 -109578 -71724 60384 159702 163186 191850 82269 42934 221877
15022 221877 283639 251115 208721 198501 136239 23269 10269 31440 -6113 -872 42118
15011 42118 -37523 -66076 -47628 -27518 111820 149869 139471 205034 192596 77282 -1705
15000 -1705 -186356 -204127 -70598 24794 167124 55393 -5881 64141 58180 102716 186221
14989 186221 181323 2987 -47115 -9654 140383 177085 112673 28933 15715 66579 57881
14978 57881 14876 -126457 -159350 18486 106016 171098 125759 80524 38700 -50542 -103837
14967a03837N1245J45937j22796l3322J2640J14452k2694J0482R0315n7222j46083
14956f0883J36377K9962r2698j5735P8291l999m9946l9735p6718n6366P9123k9123
14944a01450L4997J01232R0704j0518j11479K3526j1326N0078N4120J23440K9829
14933B73153j38606p193R326j33717n5577K9097K8273J8835p6071n43R2130m1563
14921b456K1136k1767J2580J2332N3560l6244n8029l0681o5617j36336p9522M1276
14909b89768N8233Q4918J44228M4562p5301l3620m6739N8121J99346J40620l0951
14898B53649l9573J1725k3023j2503j02262n5118n2480j6544m392O2719k4354
14887b156l7597o5655o6454Q4449K0552M1902K6468k1522j4671L6780O336q4932
$$ plain form
14967 -103837 -52592 93345 -29451 -62773 -50133 64319 41625 52107 142422 85200 -60883
14956 -60883 75494 105456 12758 -2977 75314 71315 21369 -18366 -95084 -151450 -72327 -101450
14944 -101450 -66453 34779 125483 114965 3486 27012 15686 65764 119884 243324 273153
14933 273153 134547 127354 136680 2963 -52614 -23517 4756 23591 -52480 -53023 39107 -2456
14921 -2456 18680 -3087 9493 21825 75385 39141 -18888 -49569 -115186 -251522 -331044 -289768
14909 -289768 -231535 -146617 -2389 42173 -33128 -66748 -113487 -55366 143980 284600 253649
14898 253649 214076 225801 202778 190275 88013 32895 -19585 -36129 -40521 22198 -2156
14887 -2156 -39753 -105408 -171862 -87413 -66861 -24959 1509 -20013 -34684 2096 8432 -76500
14875g6500j52257M6717J18173K0529N191l3662j389O8010J5714m0986P6504j9118
14863B6926j6316q7743k8557L816q804Q3931L3757j9298J2112l2457m7530J1748
14851f8415k7099k4799O1945n4885m0735q4483R7099J42214J1407n0601L1503
14840f849K0423k2077n768J3320J69664m451l5320j7924O0173q8331j18746j5653
14828e1539l970m2999K3715M5136Q8417M3427J3026r8036N5821L1011j22367Q6875
14816F8517P5906r9637l5346n6210n5987J344J0959j6122k5306n8905k080J06277
14804h6590K985J5147J09848J34562k6810j2012K29093Q4192j28349P034q3964
14793B45136j24533l8629K895L1417P953L5181m5050m3715j02334o2614O1713
$$ plain form
14875 -76500 -228757 -182040 -63867 -43338 -38147 -71809 -73198 -5188 10526 -30460 46044 26926
14863 26926 10610 -77133 -105690 -101874 -110678 -26747 7010 -12288 -176 -32633 -80163 -68415
14851 -68415 -95514 -120313 -58368 -113253 -153988 -238471 -141372 842 12249 -38352 -6849
14840 -6849 13574 -8503 -14271 -951 168713 164262 128942 111018 171191 82860 -35886 -51539
14828 -51539 -55509 -98508 -74793 -29657 58760 102187 115213 17177 72998 104009 -18358 68517
14816 68517 144423 44786 9440 -46770 -102757 -101413 -90454 -106576 -131882 -190787 -192867 -86590
14804 -86590 -83605 -68458 41390 175952 149142 137130 366223 450415 322066 329100 245136
14793 245136 120603 81974 84869 116286 124239 159420 114370 70655 -31679 -94293 -32580
14782c2580l2223P739L7621n5902J4183J06981J30559Q1648r4530r1759q6807
14771a5070l2925n9054n7289J33658P2256K5089j01007K9214O38O9547L6399p7548
14759B3908Q4431l877l1603r7917j118L5323K85J6052k6313q5410o60O0185O2052
14746C5338J45j2416l4528J851J2360r3644J1506N2982J1351o4790R2269j1808
14734F16k8324p021L804J8138j54907m0338N9489j68286N0108J16865R9450P8984
14722B8578L1281k9765m4264p5225r8479K9651R307r8533J8078J01542R1384o0643
14710i7088j0262o396J20280j11279p4005N6737k3103O9672Q5974r064Q8609N3748
14698A43823J1933j1351j00995p2516K8927O5702n6358j10165K7705J37696m3284
$$ plain form
14782 -32580 -64803 -57064 -19443 -75345 -61162 45819 176378 258026 163496 71737 -15070
14771 -15070 -47995 -107049 -164338 -30680 41576 66665 -34342 -5128 -4490 65057 101456 23908
14759 23908 108339 104462 72859 -25058 -26176 9147 9432 25484 -829 -86239 -86899 -26714 35338
14746 35338 35483 23067 -11461 -9610 2750 -90894 -79388 -26406 -15055 -79845 12424 616
14734 616 -27708 -34729 -30925 -12787 -167694 -208032 -148543 -316829 -266721 -149856 -50406 28578
14722 28578 59859 30094 -14170 -89395 -187874 -158223 -148916 -247449 -229371 -127829 -36445 -97088
14710 -97088 -107350 -113746 6534 -104745 -178750 -122013 -145116 -75444 10530 1466 90075 143823
14698 143823 155756 144405 43410 -29106 -179 65523 9165 -101000 -73295 64401 21117
14687B1117M6362O2191n2361j69648m0270l0557n054O5830J83275M9507j70232
14676c9840j07908J7669O2642k7628n2849Q768J9724j22154m0217L7448J41380
14665a02965M6158J0651J39263J23565L3609q0261n7837P875O4435k7023r3889
14654F3581j32157L7922R3177J2788j01382l6542r3372R8860L1136j31751j7667
14643a75407N9960J57859K7437m5446l9731O665L9570l6418M0831l0551m374K8392
14631B8787j7797N3461M331j28791n7933K5539m57J03480n3297m9141O6492P6756
14619E1430j58108l8914N8823o7293l3025R9756l1869q58M3191P5006K1447j9988
14607d02o4577l4400l3655k4536K2450q9084k1505J09249M2422N6887K0297r5972
$$ plain form
14687 21117 67479 129670 77309 -92339 -132609 -163166 -168220 -102390 80885 130392 -39840
14676 -39840 -147748 -130079 -67437 -95065 -147914 -139146 -119422 -241576 -281793 -244345 -102965
14665 -102965 -56807 -46156 93107 216672 250281 170020 112183 120058 184493 157470 63581
14654 63581 -68576 -30654 62523 75311 -26071 -62613 -155985 -57125 -25989 -157740 -175407
14643 -175407 -115447 42412 69849 24403 -15328 -8663 30907 -5511 35320 4769 395 28787
14631 28787 10990 64451 68782 -60009 -117942 -92403 -92860 10620 -42677 -91818 -25326 51430
14619 51430 -106678 -145592 -86769 -154062 -187087 -87331 -119200 -120058 -76867 -1861 19586 -402
14607 -402 -64979 -99379 -133034 -157570 -135120 -224204 -245709 -136460 -94038 -37151 -16854 -112826
14595a12826J00335K33936N89j70689o3007o1214M4512K4632K1377n1863J5009
14584a9209R081p7504M9821J20394m5015j48429Q0116J44426J13581M9470k0958
14573B55774j03326j54445J1849k7890O9420J1500p4535L1411P2406Q062j57125
14562e6899j11366M5810O6101P9683R394k0145K1546m969N2329L4692N6760p0740
14550A02196k4010J61658Q0251R3662L1929N2804J72074J34383N4446J13521J31581
14539A104495l8044q1249l6935j29021j17243j00181j13589r1016j15317R4633
14529C76533p2527j04967l5287Q8921Q8827r0535r6903m2043j36571j8915O6530
14518B3063K0132J3303K3567Q8100p9209j06413N7734J3919k8037n1303k6411
$$ plain form
14595 -112826 -12491 221445 222034 51345 -11662 -72876 -28364 -3732 17645 -34218 -19209
14584 -19209 -10128 -87632 -37811 82583 37568 -110861 -30745 113681 227262 276732 255774
14573 255774 152448 -1997 9852 -18038 51382 62882 -11653 19758 92164 100226 -56899
14562 -56899 -168265 -122455 -56354 23329 32723 12578 34124 29155 81484 116176 172936 102196
14550 102196 78186 239844 320095 413757 445686 498490 670564 804947 859393 972914 1104495
14539 1104495 1066451 985202 948267 819246 702003 601822 488233 397217 281900 376533
14529 376533 304006 199039 163752 252673 341500 250965 154062 112019 -24552 -43467 23063
14518 23063 43195 56498 80065 168165 88956 -17457 40277 54196 26159 -25144 -51555
14507e1555Q2144K7932M882q2937N0821J6724n9864M582K1223l0242P631J0431
14495A772j93770P7761R3330M9874K4861J08872R3164j00432j14371j2030q8282
14484e9251o1708M8101j6336K2394J00035P8275k5624R0116J8133j22593q3751
14473a2209q2405k8445R7212J14569J12718N333O9936p2867j59604r0845Q193
14462c8414J8470N0825P809q7001O106j04739N8585Q6413j10237l8437J8368Q3349
14450d8903J03278k4762L0783p222j2765J0310l5402L5322J94198j8082l5951
14439A90804q1510n4973N1723j2330o6001J51845P8274m6182J4447Q7902P8663
14428C92662j33200r9937K2925L6526K1134O017J94782M2686M5693K43363m9402
$$ plain form
14507 -51555 30589 58521 63403 -19534 31287 48011 -11853 -7271 13952 -16290 -8659 1772
14495 1772 -191998 -114237 -20907 28967 53828 162700 255864 155432 41061 29031 -59251
14484 -59251 -120959 -72858 -89194 -66800 33235 111510 85886 176002 194135 71542 -12209
14473 -12209 -94614 -123059 -25847 88722 201440 206773 276709 203842 44238 -46607 -38414
14462 -38414 -19944 30881 38690 -48311 -42205 -146944 -88359 -1946 -112183 -150620 -132252 -48903
14450 -48903 54375 29613 60396 53174 40409 50719 15317 50639 244837 226755 190804
14439 190804 109294 54321 106044 93714 27713 179558 257832 211650 226097 313999 392662
14428 392662 259462 159525 182450 218976 240110 246127 440909 483595 529288 772651 723249
14417G23249K9100N303P8625P3110J46615M0221j6105k1277J59331J14203J64743
14406A497118l5772J14531J93945J59569K25121K71075J58707n374q4130j42177
14396B352613k55419j84218k22659j20767j22006j13222r3900o4436o3644m3255
14386A069087j52714q4267J52797o4264j55755Q8779J02113L1935R07j1970J24042
14375A100690J27766P8898P2857q1127m6350j69055k62659k00258r7711O8388
14365E91439K6856r0619k14608j01949K7930J24929K08194J81101K30712J40511
14355A124496p6572K4902j15047j62815J4519j0718o7147o4986j19730j16847
14345D30055j18847l7374p9142Q0432q413k4472j1869J63005J42778K0744j06535
$$ plain form
14417 723249 752349 757652 836277 909387 1056002 1096223 1080118 1058841 1218172 1332375 1497118
14406 1497118 1461346 1575877 1769822 1929391 2154512 2425587 2584294 2578920 2494790 2352613
14396 2352613 2097194 1912976 1690317 1569550 1447544 1334322 1240422 1175986 1112342 1069087
14386 1069087 916373 832106 984903 920639 764884 853663 955776 987711 988618 976648 1100690
14375 1100690 1228456 1307354 1380211 1299084 1252734 1083679 821020 620762 523051 591439
14365 591439 618295 527676 313068 211119 239049 363978 572172 753273 983985 1124496
14355 1124496 1047924 1072826 957779 794964 809483 798765 731618 666632 546902 430055
14345 430055 311208 273834 194692 275124 266711 242239 230370 393375 536153 556897 450362
14334D50362J876J27221K37619J95685J59440J06741l7902j55793j76003k39080
14324F70166j99675j00896j44884o7705K0316j2985k2088m2261o0915J28617J18377
14313B86067J4912j33042n6730l8696p92L4959Q257j7893j72895m1417J3051L3243
14301g0976L2637K5891N7777J24904J14565k3334o6944q0721Q3973R1464k4092
14290B65144r76p878j47002r3601J23903P914J3433n2579L3417O6303N5850N208
14278B69136o7934p4741j6954K5405j6933m9591o1065N8989M1638M8908J09172
14267B66030j09424o8306K3196J12022n9238n6229q5735L9101k6301m1321J16083
14256A09878K2774l51J826p5249j07852P2954J81359k3586k5680L3938M6484j5580
$$ plain form
14334 450362 452238 579459 817078 1012763 1172203 1278944 1241042 1085249 909246 670166
14324 670166 470491 369595 224711 157006 177322 164337 142249 99988 39073 167690 286067
14313 286067 300979 167937 111207 72511 71719 106678 114935 97042 -75853 -117270 -104219 -70976
14301 -70976 -38339 -12448 45329 170233 284798 261464 194520 113799 197772 289236 265144
14290 265144 264168 256290 109288 15687 139590 147504 160937 108358 141775 208078 263928 269136
14278 269136 201202 126461 109507 134912 117979 68388 7323 66312 107950 156858 266030
14267 266030 156606 88300 111496 223518 164280 108051 22316 61417 35116 -6205 109878
14256 109878 132652 132301 134127 58878 -48974 23980 205339 181753 156073 190011 236495 220915
14244B20915L69j6984L6837k1635m3651L0345K5847K5120K1904r7606p1487J6742
14232A26716L2991J11749K459q43j6889K8411m0466P5282K0760j04522L1596N8314
14220C25558N5026m8841j6125l3375q2155J4419j6604O0694M3060M5399k5375
14209C21681p0812J29898K6130R0691j17616j06835Q2866J2644j4723J32395P3267
14198E59586p5718j42793r1345Q3187N8183j84419j00053J27225J20206q416j63679
14187A81964Q1300P2081j10531q8414l1326J793Q387M9297o1985J31555J8099
14176B52220j4227K4858K2337M9673n0751j04706l8197n7267j9753K6265J30153
14165B20605J14518n9258Q7183n5758k1726l6762l9954K796j61157j70771J06308
$$ plain form
14244 220915 221284 204300 241137 219502 175851 206196 232043 257163 279067 181461 109974 126716
14232 126716 159707 271456 273915 273072 256183 284594 244128 319410 340170 235648 267244 325558
14220 325558 380584 331743 315618 282243 200088 214507 197903 258597 301657 347056 321681
14209 321681 250869 380767 406897 497588 379972 273137 356003 368647 353924 486319 559586
14198 559586 483868 341075 249730 332917 391100 206681 106628 233853 354059 345643 181964
14187 181964 263264 335345 224814 136400 105074 106867 115254 164551 102566 234121 252220
14176 252220 237993 262851 285188 334861 284110 179404 141207 83940 64187 90452 220605
14165 220605 335123 275865 363048 307290 285564 248802 208848 211644 50487 -120284 -13976
14154a3976J86919J05097k7604k2059R5623o2156q3825K0991J2102j6750J3617
14143B07979J34643L5554o3493o2731k0033K8036O1421o6989j05793R3363M3843
14132B85800K0682L1859n135N1522r831m361P0443N2593n2627n1717M3886l2242
14120D00872J02073p878j57357r2617L961J2316j897k3097O9106R3421l9457m7042
14108C12404L4156J14135R6040l5107M7424J07106j09044q6951M996k0261p062
14097D57836k3237J60359j2123l3598L5470K6621J9004R5502M8938K7804Q2408
14086H84984p3982r0549p0811K3513K3500p0379M2237k2730O1204J24096j4668
14075H16415j8625q1551j23386q0523Q4525L2163O6851O3352J21210J01913Q4607
$$ plain form
14154 -13976 172943 278040 250436 228377 324000 261844 178019 199010 211112 194362 207979
14143 207979 342622 378176 314683 251952 231919 259955 321376 254387 148594 241957 285800
14132 285800 306482 338341 333206 384728 374897 370536 440979 493572 440945 389228 433114 400872
14120 400872 502945 495067 337710 245093 249054 261370 259473 236376 305482 398903 359446 312404
14108 312404 346560 460695 556735 521628 569052 676158 567114 480163 485159 464898 457836
14097 457836 434599 594958 582835 549237 584707 611328 630332 725834 774772 802576 884984
14086 884984 811002 720453 649642 673155 696655 626276 668513 645783 706987 831083 816415
14075 816415 797790 716239 592853 512330 596855 629018 695869 759221 880431 982344 1066951
14064A066951p9784p0970M931M0845M1878L73l7153n7717n7746P2216K8436M1594
14052I93854J00475L1159P528k1109Q3822J34263j1642j05020J9801Q3876K7995
14041A345002R2142Q7361N4848N3191J25214R1592M1135R0776J9328P3287m2699
14030B031177P5081Q2724J29329K1582R7077N5538m3125O9827K55116R7729N5823
14019B927878J26982J58635K42594K29554K87833J20672J90345K55394K75002
14010D814889J37182K64400L17153K86464M18995M56329L82897M44499N40101
14001H062909N76571M33982L76142O78894P34334P64576Q69409Q26542R44059
13992A4267418J061778J114014J334062J409794J502386J622062J722204J893221
$$ plain form
14064 1066951 987167 916197 921128 961973 1003851 1004224 967071 909354 851608 923824 952260 993854
14052 993854 1094329 1125488 1133016 1111907 1195729 1329992 1318350 1213330 1233131 1317007 1345002
14041 1345002 1437144 1524505 1579353 1632544 1757758 1849350 1890485 1981261 2000589 2073876 2031177
14030 2031177 2106258 2188982 2318311 2339893 2436970 2492508 2449383 2519210 2774326 2872055 2927878
14019 2927878 3054860 3213495 3456089 3685643 3973476 4094148 4284493 4539887 4814889
14010 4814889 4952071 5216471 5533624 5820088 6239083 6695412 7078309 7522808 8062909
14001 8062909 8639480 9073462 9449604 10128498 10862832 11627408 12496817 13323359 14267418
13992 14267418 15329196 16443210 17777272 19187066 20689452 22311514 24033718 25926939
13984B5926939K091090K358622K827767K953456L136440L543391L985515M371098
13976E1194318M913565N372668N810071O351640P159808P914611Q476512R310178
13968A06503371J0196010J1055506J1799720J2716253J3452603J4100329J4340880
13961A94164672J4486145J4506410J4086374J3195614J2097150J0483913Q527082
13954B81547360O159548L906967J373396j386795m036383o422444q513370j0276746
13946B62351533j1858913j3020116j3802104j4097153j4075891j3907476j3528117
13939A68061763j2917626j2327452j1550920j0812346j0044740r227305q419965
13932I2761409p657308p155156o546081n950206n421822m840429m572138m018718
$$ plain form
13984 25926939 28018029 30376651 33204418 36157874 39294314 42837705 46823220 51194318
13976 51194318 56107883 61480551 67290622 73642262 80802070 88716681 97193193 106503371
13968 106503371 116699381 127754887 139554607 152270860 165723463 179823792 194164672
13961 194164672 208650817 223157227 237243601 250439215 262536365 273020278 281547360
13954 281547360 287706908 291613875 292987271 291600476 287564093 281141649 272628279 262351533
13946 262351533 250492620 237472504 223670400 209573247 195497356 181589880 168061763
13939 168061763 155144137 142816685 131265765 120453419 110408679 101181374 92761409
13932 92761409 85104101 77948945 71402864 65452658 60030836 55190407 50618269 46599551
13924D6599551l648251l366601l136568k744924k534621k252291k128961k023632
13916B4763702j709816j553332j554601j384672j314246j240087r63246q83532
13908A4160170j010914q44957o11523o51797o62175n81561n89257n39474m32394
13899H236118m76643o25063n25453k42646k23395k16882j88897k73658l73913
13890E089568k88674k11455k10468k03298k05715k59853j77113j03141J5784j09099
13880C336536j49144k03992j81164j25394k27963j29680q1856K5129j5294j21285
13870B125893k7289j49736q5621k15656j85138N9538K5636k8220M3234l8579q4485
13859A439577j03810p1314O0136J0742j11159J25828p0019o6678l895L4020N4031
$$ plain form
13924 46599551 42951300 39584699 36448131 33703207 31168586 28916295 26787334 24763702
13916 24763702 23053886 21500554 19945953 18561281 17247035 16006948 15043702 14160170
13908 14160170 13149256 12304299 11692776 11040979 10378804 9797243 9207986 8668512 8236118
13899 8236118 7759475 7134412 6608959 6366313 6142918 5926036 5737139 5463481 5089568
13890 5089568 4800894 4589439 4378971 4175673 3969958 3710105 3532992 3429851 3445635 3336536
13880 3336536 3187392 2983400 2802236 2676842 2448879 2319199 2237343 2262472 2247178 2125893
13870 2125893 2098604 1948868 1863247 1647591 1462453 1521991 1547627 1519407 1562641 1524062 1439577
13859 1439577 1335767 1264453 1324589 1335331 1224172 1350000 1279981 1213303 1209408 1243428 1297459
13848A297459j27032j44126N3241O6549p4605r6517o9609j7535Q7097Q2385l3548
13837A023759J4126j08273M1696Q7673O3014R908j05195j05635P7007J0494J4601
13826A023175k8229k0954m6823J5542m140r0136j8937p3505J12108J14204M1792
13815A024097j896j93513j45773o3434K2017j2009Q6159m8544j28108p9374P0746
13804E30368N098r3167q7541J716J04778N1198k7524n4284M9M5453j7747n5034
13792D03363J9892R134L8042m1953p4519M1993n7440r803O980M3966O495R948
13780C96098l352l1630j58438k21391k5707Q0217J24479J26842J6005k1411n4538
13769B27174n1625q382K0355J58263J04107o6838j03217j5711n0490j12652M9693
$$ plain form
13848 1297459 1170427 1026301 1079542 1146091 1071486 974969 905360 887825 974922 1057307 1023759
13837 1023759 1037885 929612 971308 1058981 1121995 1131903 1026708 921073 998080 1008574 1023175
13826 1023175 994946 973992 927169 942711 938571 848435 829498 755993 868101 982305 1024097
13815 1024097 1022201 828688 682915 619481 641498 629489 715648 667104 538996 459622 530368
13804 530368 535466 442299 354758 356474 461252 512450 484926 430642 430691 476144 458397 403363
13792 403363 423255 432389 470431 428478 353959 395952 338512 328709 335689 379655 386150 396098
13780 396098 392746 361116 202678 -18713 -44420 35797 160276 287118 303123 281712 227174
13769 227174 175549 167167 187522 345785 449892 383054 279837 264126 213636 100984 150677
13758A50677K01418m7709j64306q4588m5612j8983L4612J66570L8158o5141p4764
13747I0332j48480r6183N8459J60294K6519K3424O1299J2401L8522J2266R0743
13736C29596N073J6985k0505m2622j33729L3839l3927j08805M0570J1794K7517
13725A25786J3993K3690O6464J3800j01409L1951J23349O654M6780m0184k06221
13714A04653J5219L6227N4185J67062K4230j20272j35282M8794J70767J7606L2873
13703D16062M7286o4603J2575K9067N8327j29688K0033m1381O9132O1478m7105
13692D31183q002j38781q6310l4986k7952j8721J55550J28250j64012j69309J7953
13681H4863l3161J0397R3602l5438m8485k0417r265K868m4283k4738k799j05433
$$ plain form
13758 150677 352095 304386 140080 55492 9880 -9103 25509 192079 230237 165096 90332
13747 90332 -58148 -154331 -95872 64422 90941 114365 175664 188065 226587 238853 329596
13736 329596 334669 351654 331149 288527 154798 188637 154710 45905 86475 98269 125786
13725 125786 139779 163469 229933 243733 142324 174275 297624 304278 351058 310874 104653
13714 104653 119872 156099 210284 377346 401576 281304 146022 194816 365583 383189 416062
13703 416062 463348 398745 411320 440387 498714 369026 389059 347678 416810 478288 431183
13692 431183 423181 284400 198090 163104 135152 116431 271981 400231 236219 66910 84863
13681 84863 51702 62099 155701 120263 71778 51361 42096 44964 681 -24057 -26856 -132289
13669a32289J7985N2121J1235R2931N8520q4465k1306M4006n7373J0693k7802
13658c5744J60178Q5769p2193j15418n7625K3988m775N7922j826j8230J7029K6630
13646F5705o4394J02978K7094L4151p6891J030N3851j13324j02305q6279o9796
13635b28180J26425J15091M891p2374o7494O7700P1815J8717o2131J2805J01567
13624H8832L5929P0787q1398p5900j7043L9085r3377n333K1533N0891J08045J23563
13612B65614j4529j41487q1565Q5633J23284q5758j46226j3828p8248N1427J27563
13601I1880n55q2615J2312R6806J21620P2498j55544n7233o8053K955M8741l6723
13589D6089q3791J8255J3944Q7147J0025n1095J32299P3990j10869m9556K3049
$$ plain form
13669 -132289 -114304 -62183 -50948 41983 100503 16038 -5268 38738 -18635 -7942 -35744
13658 -35744 124434 210203 138010 22592 -35033 -11045 -15820 42102 40276 22046 39075 65705
13646 65705 1311 104289 131383 165534 88643 89673 143524 30200 -72105 -158384 -228180
13635 -228180 -101755 13336 18227 -54147 -121641 -53941 17874 36591 -25540 -12735 88832
13624 88832 124761 195548 114150 38250 21207 60292 -33085 -38418 -16885 34006 142051 265614
13612 265614 251085 109598 28033 113666 236950 151192 4966 -8862 -87110 -35683 91880
13601 91880 91325 8710 21022 117828 239448 311946 156402 99169 31116 34071 82812 46089
13589 46089 -37702 -19447 -5503 81644 91669 40574 172873 246863 135994 86438 109487
13578A09487k1554M5357q3536j93946o5715O4972J06645k8670J442j809J51734
13567H4407N6781J6554o318J46175q3728L887L1055P659p6709r3809K1199J00436
13555B07589o0949o8061k4274J7718o8656j58618K363J72778M0075l2879r1819
13544f4733J3220L7976L6901j42738k8351M4905J52124J65620R8570O7611m3256
13533C37849j7493j08485M6027J02924Q333l4936n1428N6079K1129p5194R0645
13522C75450P5720K482R9505k2260J6957o2210L5461P0814P5972o3567j5040J69577
13510G58861J55221k1605J35383J13927Q6867M2193J35448P8918n6146k9570L6
13499A399533O5696N9336j0826K5128o2512p2268l7706K5228O7828m9805r0702
$$ plain form
13578 109487 87933 133290 49754 -144192 -209907 -144935 -38290 -66960 -65518 -67327 84407
13567 84407 141188 157742 151424 297599 213871 217758 248813 256472 179763 85954 107153 207589
13555 207589 146640 78579 54305 72023 3367 -155251 -152888 19890 59965 27086 -64733
13544 -64733 -51513 -13537 23364 -119374 -147725 -102820 49304 214924 313494 381105 337849
13533 337849 320356 211871 257898 360822 369155 334219 282791 338870 359999 284805 375450
13522 375450 451170 453652 553157 530897 547854 485644 521105 591919 667891 604324 589284 758861
13510 758861 914082 892477 1027860 1141787 1228654 1270847 1406295 1485213 1429067 1399497 1399533
13499 1399533 1465229 1524565 1513739 1538867 1476355 1404087 1366381 1391609 1459437 1409632 1318930
13488A318930m4427j81470j62937j07101o2834R29R2058l3667j16502m1877j70980
13477D90122j54928p3161L6120Q8827m6085p8512M5934p186j42222n394K1534
13466A75049Q6445K5584j0653J5035P6817p1051p0898R9341o4220J0240O2798
13455C34487m8335o5799p9016q4148l3914M5067P666P0436Q3454J0590q6529L3059
13443A87018p7312o5639j1378P2256l6050k2707J32833J15049m0967o4145j17526
13432G1432M5107M1048j28307r3087J3052j1037j8540J14749J04949J01086m6899
13421A93553J3627J7772N7285N249j07740p3905o371O1416q2631j44974m396J3616
13409e7499K0815J2066J4180k7955L1705L4717N2533m592l4571N8085Q5960L2776
$$ plain form
13488 1318930 1274503 1093033 930096 822995 760161 761090 853148 819481 702979 661102 490122
13477 490122 335194 262033 298153 386980 340895 262383 308317 301131 158909 153515 175049
13466 175049 261494 287078 276425 291460 368277 297226 226328 325669 261449 271689 334487
13455 334487 286152 220353 141337 57189 23275 68342 76008 146444 229898 240488 153959 187018
13443 187018 109706 44067 32689 104945 68895 46188 179021 294070 253103 188958 71432
13432 71432 116539 157587 29280 -63807 -50755 -61792 -80332 34417 139366 240452 193553
13421 193553 207180 224952 282237 287486 179746 105841 99470 160886 78255 -66719 -71115 -57499
13409 -57499 -36684 -24618 -10438 -38393 -6688 28029 80562 75970 41399 99484 185444 218220
13397B18220o748M1642o2856r4750q7835N372O1725N7664O249j15941L4328J94164
13385B51234j1525k3487J3315k8906j2001L8849m1647m8785m4878K3508o5955
13374D9722m6136K798L2455k4763l7598J0062O8512R3913p0345m6699J32922J10584
13362B75427M9081j9056j0165l4539k465j59420r4672N4853l5658m6219l8358
13351f1191l909R445O5935J23477Q5735o721K16915K91029L34950K37545K40597
13340A533807K83675J56899r4879j40857j77277l00662k83259r9475P3311j9403
13330I31880o2294l0316O7605M0477J27368K12983J16l7795K6259j5150l3961
13319A227172P2859l6979l2568n348l8772J5760J07341K30045R2080M2231J11203
$$ plain form
13397 218220 211472 253114 190258 95508 7673 13045 74770 132434 138683 22742 57070 251234
13385 251234 239709 216222 229537 200631 188630 227479 185832 137047 92169 115677 49722
13374 49722 3586 6384 38839 14076 -23522 -13460 55052 148965 78620 31921 164843 275427
13362 275427 324508 305452 295287 260748 258283 98863 4191 59044 23386 -22833 -61191
13351 -61191 -65100 -55655 10280 133757 219492 212771 429686 720715 1055665 1293210 1533807
13340 1533807 1817482 1974381 1879502 1738645 1561368 1260706 977447 877972 951283 931880
13330 931880 869586 839270 906875 947352 1074720 1287703 1287819 1250024 1276283 1261133 1227172
13319 1227172 1300031 1263052 1230484 1225136 1186364 1202124 1309465 1539510 1631590 1673821 1785024
13308A785024N3469J3683J1287J09462o3432p6185j16344k03982j74788j44632
13298A193562q1018r8734r215O2376P3271J10736P7157M6519l2800j39924j21211
13287A080719r1822o2294l8272R6057k0897P2745J10278M9454K54345J63224K20693
13276A834230J85699J69758Q8534j74686k76559m25763l60370j76297j63442j70777
13266E30327j56498n454R4256L8995j1106q3292j01579p059r1052o7200J6046
13255A56384j02107m6371J08774k1575n3711j0435P5052J73520L6852j96450o1966
13244E7967P9686l7168n4629n3042J5539R330R006J16942R1648o6303J08395L1458
13232C08829J9069k1883n5902N3108J4952q7934K2828j9359l2295r800n1483p7514
$$ plain form
13308 1785024 1838493 1852176 1863463 1972925 1909493 1833308 1716964 1512982 1338194 1193562
13298 1193562 1112544 1013810 1004595 1066971 1140242 1250978 1328135 1374654 1341854 1201930 1080719
13287 1080719 988897 926603 888331 984388 963491 1036236 1146514 1195968 1450313 1613537 1834230
13276 1834230 2019929 2189687 2278221 2103535 1826976 1401213 1040843 864546 701104 530327
13266 530327 373829 368375 462631 501626 490520 407228 305649 298590 207538 140338 156384
13255 156384 54277 7906 116680 95105 41394 30959 106011 279531 316383 119933 57967
13244 57967 137653 100485 45856 -7186 8353 17683 26689 143631 235279 168976 277371 308829
13232 308829 327898 306015 250113 303221 318173 230239 253067 233708 201413 191613 140130 62616
13220F2616l3456o7542J0443J53703J23978P7965J4080k3789j10368L7566J8067
13209B63263K0970j5069j29737n2019n304j5897K315o5367J0822J4956l0709J23696
13197A21920J47801Q7108p501P5267O9714m4326j34154o5879J16066J3401m3876
13186C35541L1894Q9978j768j25906j11404J04844l5298j53429K8578n7835J5188
13175A20383p750j6654O2681j6107K2956L1099O7864l6749J8933l0588L9191L1123
13163B86382P7448O4080r4735O6348J62403R4874l8775r0181k3497m5498j06881
13152C51968j17669j8480N382k650P5925J03790m9695J1326J45906J43243j07491
13141E41555j08751k5388K147r493L4581j35227N9567P9055m1654K8229N2502
$$ plain form
13220 62616 29160 -38382 -27939 125764 249742 327707 341787 317998 207630 245196 263263
13209 263263 284233 269164 139427 87408 82104 66207 68522 3155 13977 28933 -1776 121920
13197 121920 269721 356829 349328 424595 494309 449983 315829 249950 366016 379417 335541
13186 335541 367435 457413 455645 329739 218335 323179 287881 134452 163030 105195 120383
13175 120383 112633 95979 158660 142553 165509 196608 264472 227723 246656 216068 255259 286382
13163 286382 363830 427910 333175 399523 561926 656800 618025 527844 504347 458849 351968
13152 351968 234299 215819 221201 218551 294476 398266 348571 359897 505803 649046 541555
13141 541555 432804 407416 409563 400070 434651 299424 358991 438046 396392 424621 477123
13130D77123M0055k4396L2233Q6167m9431j38935j3687j09591J71770J69359j4265
13119F26402n2034N534j16030j9988O1099p2157p8378q5179J35920K23218j4438
13108F13969r2227k9232l3758j1578k5614O3521j7366l5654N6603J65369J24674
13097G78707L4857j16075j12110k7491R2411P8032K2680n6053k5863J4118m6412
13086F36801m8951l4452k7552L0405M4849k0803j3718r9786l1392J37512r6683
13075D76230q5727j3902p7322M7712J09897M5192o2841p2423k9176J10438J4421
13064D62499L1749P3985M4291L6568P1677O3519m0284m0910L696M3598J58656
13053I09044P3946J47872N0824j3655K16801K57255J48176R8555k3913r9373j06683
$$ plain form
13130 477123 517178 492782 525015 611182 561751 422816 409129 299538 471308 640667 626402
13119 626402 574368 579902 463872 443884 504983 432826 354448 269269 405189 628407 613969
13108 613969 521742 492510 458752 447174 421560 485081 467715 432061 488664 654033 778707
13097 778707 813564 697489 585379 557888 650299 728331 751011 694958 669095 683213 636801
13086 636801 587850 553398 525846 556251 601100 580297 566579 466793 435401 572913 476230
13075 476230 390503 376601 299279 346991 456888 502080 439239 366816 337640 448078 462499
13064 462499 494248 568233 612524 649092 720769 784288 744004 703094 706790 750388 909044
13053 909044 982990 1130862 1181686 1168031 1384832 1642087 1790263 1888818 1864905 1765532 1658849
13042A658849j14108j52609j82176n3852p8954p791m5069L0266q304L5629o2498
13031A019383m8195j0675n9742q5457O855R7605J40228j4953o4657k7006p0464
13020H82922n4564Q5308J28354J5729n3784K0040k8572j37947n2356R0444M5296
13009I40870O5762O5875J49773k098q3728o3990J1327J41182Q2246j50739k7079
12998A129401L0210k4891n0484J10728J48146J1517k971n4868J29144Q2231j2128
12987A496035p8374m8345O6984Q7800K6257l2970L5406L9009m2270P0890N5998
12976A676420Q803o3385n0142J40674J36315J43302k9981Q8927M9385M9401o8247
12965B081472j1602J3487J39409N9742M0435J10563J5775k279M1886m2993J75284
$$ plain form
13042 1658849 1544741 1392132 1209956 1156104 1077150 1069359 1024290 1054556 1046252 1081881 1019383
13031 1019383 971188 960513 900771 815314 822169 919774 1060002 1045049 980392 953386 882922
13020 882922 828358 913666 1042020 1057749 1003965 1024005 995433 857486 805130 895574 940870
13009 940870 1006632 1072507 1222280 1220182 1136454 1072464 1083791 1224973 1307219 1156480 1129401
12998 1129401 1159611 1134720 1084236 1194964 1343110 1354627 1351656 1296788 1425932 1508163 1496035
12987 1496035 1417661 1369316 1436300 1524100 1550357 1517387 1552793 1591802 1549532 1620422 1676420
12976 1676420 1685223 1621838 1571696 1712370 1848685 1991987 1962006 2050933 2100318 2149719 2081472
12965 2081472 2069870 2083357 2222766 2282508 2322943 2433506 2449281 2447002 2488888 2445895 2621179
12954B621179K21917K8800J31531J09674K55478N1850k773L8901n483k487J74679
12943C623266J25709K95621K31078K12933K84352K77733K43033K84168K59789
12934E837682L49724M74922K37739L73717M55335N92089P27614P54062R75455
12925A0778339J270427J492690J664327J683083J842708K336325L057636L743231
12917B7868766M631395N704527O894343Q361355J0498068J4097323J9797197K8064986
12909A25917960L9978638N4885998O8031404O8054141M4764005N819442k7902548
12902C79549040m6598209n2298147m8155756l8539729k7830604j8378915r889764
12895A37857916j931541N562719J1634991J4822519J4502094J2706208J1349689
$$ plain form
12954 2621179 2843096 2871896 3003427 3113101 3368579 3420429 3417656 3456557 3451074 3448587 3623266
12943 3623266 3748975 4044596 4275674 4488607 4772959 5050692 5293725 5577893 5837682
12934 5837682 6187406 6662328 6900067 7273784 7729119 8321208 9048822 9802884 10778339
12925 10778339 12048766 13541456 15205783 16888866 18731574 21067899 24125535 27868766
12917 27868766 32500161 38204688 45099031 53460386 63958454 78055777 97852974 125917960
12909 125917960 165896598 220782596 288814000 356868141 401632146 407451588 379549040
12902 379549040 332950831 280652684 232496928 193957199 166126595 147747680 137857916
12895 137857916 135926375 141489094 153124085 167946604 182448698 195154906 206504595
12888B06504595R371992M105196l466990r125315j0926816r968940p376771l207849
12880A75909102K840640J0879094K0192128K8995328L5697419L8149529L4624883
12873C47288123K4007507P175558j1774368k7230199l5414512l7012634l3824298
12866B33215177k7595935j9817674j1753542m243219K456117P736873J1394338
12859A91392135J3128458J2511058Q089659K70152o699314r913717j1210989j3071115
12851A84496327j5109882j3824415q493650p63529Q085786J7692591K8225433
12844B00308661M0052326N0660157N5782924N1300974L4006306J123706l9030844
12837C94204210o5701326o9508335n8535104m4064910l1788818k2823647j6538327
$$ plain form
12888 206504595 215876587 219981783 216514793 207389478 196462662 186493722 179116951 175909102
12880 175909102 178749742 189628836 209820964 238816292 274513711 312663240 347288123
12873 347288123 371295630 378471188 366696820 339466621 304052109 267039475 233215177
12866 233215177 205619242 185801568 174048026 169804807 172260924 179997797 191392135
12859 191392135 204520593 217031651 225121310 225391462 218692148 208778431 197567442 184496327
12851 184496327 169386445 155562030 147068380 146304851 154390637 172083228 200308661
12844 200308661 240360987 291021144 346804068 398105042 432111348 433235054 394204210
12837 394204210 328502884 258994549 200459445 156394535 124605717 101782070 85243743
12830H5243743j2611922j0356445r060138p728478o313743n200637m169363l389277
12822B6413740k726035k223621j805138j700379j442398j384541j075305r29569
12814A3126754r36788q95216q14491o68231o58370n43050m57735m99481m58035
12805G195357k89784m25142m77269n49451k66469k07744j64079p4232k31590k15718
12795D293879j74165j60012k21006j61368j0853j31084j11943j11288j8881N0946
12785C244225p7695q0953P8384o3482m1970J056J01916j23411j75792O9099K572
12774B933949j72722o1189l3806o1076j38845L3629J29793Q3682j04245m079P1762
12763B676853N4878K20287K73611O2429N9793N1710P8043J54245J05467Q7062
$$ plain form
12830 85243743 72631821 62275376 53215238 45486760 39173017 33972380 29803017 26413740
12822 26413740 23687705 21464084 19658946 17958567 16516169 15131628 14056323 13126754
12814 13126754 12189966 11294750 10480259 9812028 9153658 8610608 8152873 7653392 7195357
12805 7195357 6905573 6480431 6003162 5453711 5187242 4979498 4815419 4741187 4509597 4293879
12795 4293879 4119714 3959702 3738696 3577328 3566475 3435391 3323448 3212160 3193279 3244225
12785 3244225 3166530 3085577 3163961 3100479 3058509 3059565 3161481 3038070 2862278 2931377 2933949
12774 2933949 2761227 2700038 2666232 2605156 2466311 2499940 2629733 2713415 2609170 2605091 2676853
12763 2676853 2731731 2952018 3225629 3288058 3347851 3399561 3477604 3631849 3737316 3824378
12753C824378j29189n535l5527J7300j3910r8334p9752o3284r1116O944j27613
12742C204362n6240Q7245K3564R5834Q9688j7200l65R6464p2000j4898K4002J06133
12730C566589n5761l3465J7608j6899P4226M6853K3259r1987k9718j197O2038
12719C561546O0199m3597r0122J9715m1603L7916j4672L7473P9093o5436j21628
12708C418884n0486J74692J27172K4731M3083k9981N3339M8585Q7744R6592P5019
12697D069374L5273m5385j70403j60969p4350o7895o9490j8261l0275j21281j16153
12686C230185j50556k05329j96094k15818k83580l38955k46228K4560J523k12084
12676A407624j81996j61153j4447R4609n0784q0845k0273j44668P497J3113j54356
$$ plain form
12753 3824378 3695189 3689654 3654127 3671427 3657517 3559183 3479431 3416147 3325031 3331975 3204362
12742 3204362 3148122 3235367 3258931 3354765 3444453 3427253 3426888 3523352 3451352 3436454 3460456 3566589
12730 3566589 3510828 3477363 3494971 3478072 3552298 3599151 3622410 3530423 3500705 3499508 3561546
12719 3561546 3621745 3578148 3488026 3507741 3466138 3504054 3489382 3526855 3605948 3540512 3418884
12708 3418884 3368398 3543090 3670262 3694993 3738076 3708095 3761434 3810019 3897763 3994355 4069374
12697 4069374 4104647 4059262 3888859 3727890 3653540 3585645 3516155 3497894 3467619 3346338 3230185
12686 3230185 3079629 2874300 2678206 2462388 2178808 1839853 1593625 1618185 1619708 1407624
12676 1407624 1225628 1064475 1050028 1144637 1093853 1013008 992735 848067 855564 868677 714321
12665G14321m5391J255k7791l9893J2006j51072l8593m7747r3494N3402r0438
12654B46565L9908J64270J0067N8012J32577K4672n5572q4992k8430q7013j0239
12643D09825N9902P3530Q3738q7335O8051m0487r6663n4521R2799M7890L0369
12632E87098r7094k1697K1368N568l8655m2651O101N1033K7609q0955N8704M6870
12620E23299r9696p7383L7623N9408L2044j8101L8643q496k00940k9647m0124
12609B16630J00420J54792Q1126q9599l2768j17679K5543J4873l3128L046J6657
12598C39913l2296M4452M8081m4527q5765o1928j2223K28864M9719q8110k7143
12587C59037l1902J41912k7025l6573O2860m155m3157j02473K9890J11240l5576
$$ plain form
12665 714321 668930 670185 642394 602501 614507 463435 424842 377095 283601 337003 246565
12654 246565 286473 450743 460810 518822 651399 676071 620499 535507 507077 420064 409825
12643 409825 469727 543257 626995 539660 607711 567224 470561 416040 508839 556729 587098
12632 587098 490004 468307 489675 495243 456588 413937 420038 471071 498680 417725 476429 523299
12620 523299 423603 346220 383843 443251 475295 457194 495837 487341 286401 256754 216630
12609 216630 317050 471842 552968 463369 430601 312922 338465 353338 320210 323256 339913
12598 339913 307617 352069 400150 355623 269858 207930 195707 424571 474290 386180 359037
12587 359037 327135 469047 442022 405449 468309 464154 420997 318524 348414 459654 424078
12576D24078q6061m3393l5632j08096r3251L006P7039J00494P9398m0942j1159
12565B65481O3646k0457N1415o4984l4360p0990J580J09301m3703p0115n985M4240
12553B25069L5781o0416q6058L756R4043k981j16800l3117L9270J26447J39432
12542C64426J6761m8010o2239M9256n8755j48988k446N2200j1540k9208m9831
12531G1626M3988L5685R982L6481k72l7123m826O0831n6121m066J6532l6817r686
12518A26214J2777J31107n7240j43840J0340P2240J41919K08986k8654m7812n9041
12507C66996m5012p5415j06982n5411J09989L3039l5962l7253M4389r3091q7145
12496A8142J3375k8333N9836J02484J71720R4906m1650j16647j11815l8286n296
$$ plain form
12576 424078 338017 294624 258992 150896 57645 60651 137690 238184 317582 276640 265481
12565 265481 329127 308670 360085 295101 260741 189751 191331 300632 256929 186814 180829 225069
12553 225069 260850 200434 114376 118132 212175 209194 92394 59277 98547 224994 364426
12542 364426 381187 333177 270938 320194 261439 112451 110005 162205 150665 121457 71626
12531 71626 115614 151299 161281 197762 197490 160367 155541 216372 160251 156185 172717 135900 126214
12518 126214 138991 270098 212858 69018 79358 151598 293517 502503 473849 426037 366996
12507 366996 321984 246569 139587 84176 194165 227204 191242 153989 198378 105287 18142
12496 18142 31517 3184 63020 165504 337224 432130 390480 273833 162018 123732 118436
12485A18436m0477L92L9889R905K18L5987P5843P2201O2400n778j1509J21350
12473D78857L6743l196J63621K14177J06179J79990M03393L06177K03651J09308
12463B198900q0364j11891p6706j81251k23021k81984m502j37053l9359J8856
12453A081625o7122K5496J19658m589J01007m7719j6770n8861m5368P3489M2421
12442A203267P0772P5242M1943k1048j11953K0016K63562K54176K02442J38475
12432B136894M7812N1304m6330j65018j68115k37455j09541p2528p340m6124j3874
12421A369685n1339l971J2623K2474n2019r241J02792Q407j20221l1641N3829
12410A301378j720J16819K11436O8675j01041j22180k320n4696J52618L65399
$$ plain form
12485 118436 77959 78351 118240 128145 128363 164350 240193 312394 374794 369016 357507 478857
12473 478857 515600 512404 676025 890202 996381 1176371 1579764 1885941 2089592 2198900
12463 2198900 2118536 2006645 1929939 1748688 1525667 1243683 1239181 1102128 1062769 1081625
12453 1081625 1014503 1039999 1159657 1155068 1256075 1208356 1191586 1132725 1087357 1160846 1203267
12442 1203267 1274039 1349281 1391224 1370176 1258223 1278239 1541801 1795977 1998419 2136894
12432 2136894 2184706 2236010 2189680 2024662 1856547 1619092 1509551 1437023 1429683 1383559 1369685
12421 1369685 1318346 1314375 1326998 1349472 1297453 1288212 1391004 1399411 1279190 1247549 1301378
12410 1301378 1299658 1416477 1627913 1696588 1595547 1473367 1471047 1416351 1568969 1934368
12400A934368K07261M2107m6863j1186j11976l08813m48995k44321p2659j73264
12390G65659j87426n20n0078j52173j9086j15745O7975N8944k8678m297m269N0948
12378C81254j07756j08698J20873R5173o4836j62392P5999J4360j00491q26P4169
12367B16829m0775l0624k9915p1358o1622J15986J41429J14697q4936j35864J04679
12356B38526r522J7098q1919N6940N0660j12687r5978O3298M9826n1972r1632
12345C2638L1539J12980m6769L2885K5213J9840Q8231J00321q9725L1957P2917
12334D12027l3505j94801n2850M6566L2713J60634J3265n3543r4140m9292M6417
12323B33491j4171k3413J14693P1304p9391n2378r4160k2095m295M8096K0354
$$ plain form
12400 1934368 2141629 2183736 2136873 2125687 2013711 1704898 1255903 1011582 938923 765659
12390 765659 578233 577713 527635 375462 356376 240631 308606 367550 338872 334575 330306 381254
12378 381254 273498 164800 285673 380846 316010 153618 229617 243977 143486 142660 216829
12367 216829 176054 145430 115515 44157 -17465 98521 239950 354647 269711 133847 238526
12356 238526 229004 246102 164183 221123 271783 159096 63118 126416 176242 124270 32638
12345 32638 64177 177157 130388 163273 188486 208326 296557 396878 307153 339110 412027
12334 412027 378522 183721 130871 177437 210150 370784 384049 330506 236366 187074 233491
12323 233491 219320 195907 310600 381904 302513 250135 155975 133880 129585 177681 198035
12312A98035J76087j52433P1828J41243r9789n2683N7061R4852R6865l7434j8932
12301D74700j354q0014k2113L9789j6175M637p256k4850j13163J1913J11320J2859
12289C90293M123r7295P0985N2731l5344L1505j11744j3473o2237J1992J02400
12278C43936N04J06173M8100Q0957j2903P9146O5660l2513n6010k1178l2010k5667
12266E44195q8769o2216R6081J15115P1978M373p1591p0246n7798N7736J38946
12255F77804J2168j64444l5527J78506J98847o5262j79109Q8744J63994j10842
12245G64879q0969K0495J44371O6474j24653O7320Q6501m0012l6725m3331j623
12234H22727p9417M740k356r6557j00737j40743q6447J25710k2351Q406J0335
$$ plain form
12312 198035 374122 221689 293517 434760 334971 282288 339349 434201 531066 493632 474700
12301 474700 473346 393332 371219 411008 394833 399470 392214 367364 254201 266114 377434 390293
12289 390293 394416 297121 368106 420837 385493 416998 305254 291781 229544 241536 343936
12278 343936 344440 450613 498713 579670 566767 645913 711573 679060 623050 601872 569862 544195
12266 544195 455426 393210 489291 604406 676384 680757 609166 538920 481122 538858 677804
12255 677804 689972 525528 490001 668507 867354 802092 622983 711727 875721 764879
12245 764879 683910 704405 848776 915250 790597 857917 944418 904406 867681 824350 822727
12234 822727 743310 748050 745694 649137 548400 407657 321210 446920 424569 432975 443310
12223D43310L7074q917j2868J3894n3736j06752R0838J42972P0554J790K5047
12212F43206q8558J2223J19731n8291M25J596m9891J561J3354j1971K14250P4447
12200H72082j00459j36567j4655j9196n8253Q2404J12095M8269j01363n871n430
12189F73056k9284n1994K9550K5900j5046N022k2894j6015l1360M5451K0145M9207
12177F81738K2802J7099O789j35370m4846K0049Q3122J17031Q7479M973r5414
12166G65452r2054J9661J3802k0130j1186k5895L3988J78540J5799M1163O3354
12155I82494L1134q3636p9097m3561J71639P7821O8777J46540R8896J0088o2946
12144A318149J45020K16236J17135J40985M1535K18966K40547J68238J91678K36880
$$ plain form
12223 443310 480384 471467 458599 472493 418757 312005 402843 545815 616369 618159 643206
12212 643206 554648 566871 686602 628311 628736 630332 580441 582002 595356 583385 797635 872082
12200 872082 771623 635056 620401 601205 542952 625356 737451 785720 684357 678486 673056
12189 673056 643772 591778 621328 647228 632182 637204 614310 598295 566935 612386 632531 681738
12177 681738 704540 721639 728428 593058 548212 568261 651383 768414 855893 860866 765452
12166 765452 673398 693059 706861 686731 675545 649650 683638 862178 877977 919140 982494
12155 982494 1013628 929992 850895 807334 978973 1056794 1125571 1272111 1371007 1381095 1318149
12144 1318149 1463169 1679405 1796540 1937525 1979060 2198026 2438573 2606811 2798489 3035369
12134C035369K93615K91115K60429M42986L41592L64370M01669M63473M63967
12125F358585M91519J96234K16678M18258K89401J77127Q1298J0664j06124p5354
12115H058286k22789l21292m89320m51235m54175m22159m80293m19636m52807
12106D344580m45895l31779k89060j20659j83291k33558l73739j48141j05189
12097B113269k23884j61810p3148j13075k29997m6067K7914j13818j99282j56684
12087H23418J01852j365k29954n6037J2717r2893p7186m9600o3422N2444K70449
12076F90423Q302l0309n3577j4790q7958p7976o5899L7194O7420q370K1400Q8105
12064E73965o0753j07460l5460j80173l3120k0143p5083L1286M3833R193O3334
$$ plain form
12134 3035369 3328984 3620099 3880528 4323514 4665106 5029476 5431145 5894618 6358585
12125 6358585 6850104 7046338 7263016 7681274 7970675 8147802 8229100 8239764 8133640 8058286
12115 8058286 7835497 7514205 7024885 6573650 6119475 5697316 5217023 4797387 4344580
12106 4344580 3898685 3566906 3277846 3157187 2973896 2740338 2366599 2218458 2113269
12097 2113269 1889385 1727575 1654427 1541352 1311355 1265288 1293202 1179384 980102 823418
12087 823418 925270 923905 693951 637914 650631 557738 480552 430952 367530 419974 690423
12076 690423 698725 668416 614839 600049 512091 434115 368216 405410 472830 464460 485860 573965
12064 573965 513212 405752 370292 190119 156999 136856 61773 93059 136892 146085 209419
12053B09419J00874o0846R6730l2453j46942k5215M2783M0285P1149j48397p7822
12042F9565R926j67556M9800J00141R758L6864l5247L9506K965r8356M6102O3313
12030A26781M6576M3762l2119Q0152R923j00689j08171j12550J2277L0818k0430
12019b3670K3280Q0555L1668m2628j8096n4559l9498p0164k2823M9231O9063J00882
12007H3241l18m7171Q0795J20922j3285r5752j07484j12931J39775Q5057L8043
11996A70892N6554r691n9780L3858K281j07065m5123j36066O2608R7625q9312
11985b3219r0008m7310N8477q553L9881N471l0998L5948M200j5022j13491L4594
11973a50030J58744M2820n80j48328L2246J06058o3389Q890o226M2713M9428j19395
$$ plain form
12053 209419 310293 249447 346177 313724 166782 141567 184350 224635 295784 147387 69565
12042 69565 79491 -88065 -38265 61876 71634 108498 73251 112757 115722 17366 63468 126781
12030 126781 173357 217119 185000 265152 275075 174386 66215 -46335 -34058 -3240 -23670
12019 -23670 -390 80165 111833 69205 51109 -3450 -42948 -113112 -135935 -86704 -17641 83241
12007 83241 82923 35752 116547 237469 224184 128432 20948 -91983 47792 132849 170892
11996 170892 227446 217755 157975 191833 194114 87049 41926 -94140 -31532 66093 -23219
11985 -23219 -113227 -160537 -102060 -110613 -70732 -65261 -96259 -60311 -56111 -71133 -184624 -150030
11973 -150030 8714 51534 50954 -97374 -65128 40930 -22459 -13569 -19795 22918 72346 -47049
11961d7049r4715k855J5511k424J0315P040Q0447J09862P9861O937j7932N2594
11949A97592j4231m8887l6859j08937N5002R0896n6497k6032J0181M227J04099
11938A70554p4962j7150O5484k8103R5750K7843j91323K112N5174J968j19010
11927a1663m6419J11445o583k4201K4433r0835J3100J48587Q132m6640O024j1527
11915G3853M498j17461p5203Q0889J12873P4794Q6879j27455n0405m593k9739
11904B8930N8656q6339r4638J45877O8749o4723l2088m5861l2078Q691Q2967J9689
11892E7832Q154p7730n0356M7907k7347j4823K7234N0743q3235p1731Q3207J0566
11880c9579J6034J02775n8962j1981J651N527N6055r0841L1937Q0672o3855k381
$$ plain form
11961 -47049 -141764 -144619 -129108 -131532 -121217 -114177 -33730 76132 155993 162930 144998 197592
11949 197592 183361 134474 97615 -11322 43680 134576 78079 52047 62228 66455 170554
11938 170554 95592 78442 143926 115823 211573 239416 48093 50205 105379 107347 -11663
11927 -11663 -58082 53363 46780 22579 47012 -43823 -30723 117864 125996 79356 85380 73853
11915 73853 78351 -39110 -114313 -33424 79449 154243 241122 113667 63262 58669 28930
11904 28930 87586 1247 -93391 52486 121235 56512 24424 -21437 -53515 -44824 38143 57832
11892 57832 65986 -11744 -62100 -14193 -41540 -56363 -29129 21614 -61621 -133352 -50145 -39579
11880 -39579 -23545 79230 20268 8287 9938 15465 71520 -19321 12616 93288 29433 27052
11868B7052M3952k6807n28r2814J2792l0480n2420j1472J2784j08248R5932N7511
11856g2746m6255k7738P8435r0288j56375R4100J85038Q9643M5774j7623j24242
11845d2277o3987L0989l3412J16580M2646l3986J35299o244j25834J15380P7602
11834B12756j3166r6775j21637l2308Q6539P3429N6365j37660J0396J28751N7249
11823B23939R148r0939j54159J5252M3120j9635n548K0810l804J1124O3490o8301
11811D4497k3008n360j20068J02464M653k0512l0990K0432L5147J1223m0372j10837
11799a32731p9099K5780Q3095R0891J9459k1894Q6386J3820j01664j76696j0797
11788b03450J01813J52496P3468K7668n9050q944j36279K221n8351J3646p4880
$$ plain form
11868 27052 71004 44197 43669 -49145 -36353 -66833 -119253 -130725 -117941 -226189 -130257 -72746
11856 -72746 -119001 -146739 -68304 -158592 -314967 -220867 -35829 53814 99588 81965 -42277
11845 -42277 -106264 -75275 -108687 7893 50539 16553 151852 145608 19774 135154 212756
11834 212756 199590 102815 -18822 -51130 35409 108838 165203 27543 37939 166690 223939
11823 223939 233087 142148 -12011 3241 46361 26726 21178 41988 38184 49308 112798 44497
11811 44497 21489 16129 -103939 -1475 3178 -17334 -48324 -27892 7255 18478 -21894 -132731
11799 -132731 -211830 -186050 -102955 -12064 7395 -14499 71887 85707 -15957 -192653 -203450
11788 -203450 -101637 50859 124327 151995 92945 84001 -52278 -50057 -108408 -94762 -169642
11777a69642l1775R1895N1912j34933o8680k7529Q994J56377J79577J73218j27823
11766A01591j26585q7930R869n19L952P9993p484n9460K1671L4671p5008m893
11754a10132L0242M4733o017N6369J28228M47l7098J945k2099J01650m2698p6058
11742F9512o4599m6717J25185k1250j38565k19512R8915J81878K2272M7213P8112
11731A32444j13219k58448m8188P5292P7297M5652K2892J28943r393k7241J64117
11720A90148K1484j01255L4590l4897N8490k3409o6685l2341j20787L310j02288
11709a73640q7683P0588L9511N4576J12842k6128j09428Q3152Q4511J0630K7334
11698H6265k6670j11060Q0360L603j19089m1237j0164N006k0769p5719M2779R8329
$$ plain form
11777 -169642 -201417 -109522 -57610 -192543 -261223 -288752 -279758 -123381 56196 229414 101591
11766 101591 -24994 -112924 -103055 -103574 -99622 -19629 -27113 -86573 -64902 -30231 -105239 -110132
11754 -110132 -79890 -35157 -41174 15195 143423 143870 106772 108717 86618 188268 145570 69512
11742 69512 4913 -41804 83381 62131 -76434 -295946 -197031 -15153 7119 54332 132444
11731 132444 19225 -239223 -287411 -212119 -134822 -89170 -66278 62665 53272 26031 190148
11720 190148 211632 110377 144967 110070 168560 145151 78466 46125 -74662 -71352 -173640
11709 -173640 -261323 -190735 -151224 -96648 16194 -9934 -119362 -36210 48301 58931 86265
11698 86265 59595 -51465 28895 32498 -86591 -127828 -137992 -132986 -153755 -229474 -186695 -88366
11686h8366J08057L9998O4426O2644j42416l9275J19791M3376N9001k7011o5675
11675A34550r7454m6445L3621M9567K7566q7650p4652J4848O5484P6826p2977
11664B3284n0532K8552r4265p0018l986J82490k0899p9186j52375J15461j0818
11653a32292J6484o0928O149J95063m6938q473L4190J05505n7994K1386J9073
11642I1225O4394P453r76l5554q5071M620k2261j5292k8313Q7789R3154p2155
11630H9013j57859O353P3878R7061K7948K4253m4461j58282m1617K0846o0953
11619a23820j6296J57033J39494K2384n8518K7571J3003O975m6234j16592k7924
11608b2924q4018J4482Q9098J00463r408P0777o6049m9034Q4189K6762K1263n9197
$$ plain form
11686 -88366 19691 59689 124115 186759 44343 5068 124859 168235 227236 200225 134550
11675 134550 37096 -9349 24272 73839 101405 13755 -60897 -46049 19435 96261 23284
11664 23284 -27248 1304 -92961 -162979 -166965 15525 -5374 -84560 -236935 -121474 -132292
11653 -132292 -115808 -176736 -170587 24476 -22462 -30935 3255 108760 50766 72152 91225
11642 91225 155619 163072 162096 126542 41471 46091 23830 8538 -19775 68014 161168 89013
11630 89013 -68846 -62493 11385 108446 136394 160647 116186 -42096 -83713 -62867 -123820
11619 -123820 -140116 16917 156411 178795 120277 147848 160851 167826 121592 5000 -22924
11608 -22924 -106942 -92460 -3362 97101 87693 158470 92421 43387 127576 154338 175601 116404
11596A16404m9599m5100P2381L7391o1126j30664j6296Q5948Q9803R639o3122
11585D5659o6370p0035r5164j7362K49268R3835j45708J7843L4717R5363M1981
11574A84027K0654K0548o4339j1889r2573n7181P1083j229m8271j30190j01621
11563b10981M476N7811P3756k2475l2865r8121P7725O5045k1131N64K9063L7560
11551c9573J4992M4623m9182Q7287K072J4543J3267J21160k6833j07834q0088
11540e566o7201j01664l1047l3452M5966J38512J38603m0547l3383p8221R9644
11529C1644J363j00731o6600N4990O7687Q0948l7149k2798J7219K5824J18296
11518A70693m2430j144J2162m9478K9801R530j35291l8924N5850P6655j00488
$$ plain form
11596 116404 66805 21705 94086 131477 70351 -60313 -76609 9339 99142 108781 45659
11585 45659 -20711 -90746 -185910 -203272 45996 139831 -5877 11966 46683 142046 184027
11574 184027 204681 225229 160890 149001 56428 -753 70330 69101 20830 -109360 -210981
11563 -210981 -206505 -148694 -74938 -97413 -130278 -228399 -150674 -85629 -106760 -106196 -77133 -39573
11551 -39573 -24581 20042 -29140 58147 60219 74762 88029 209189 182356 74522 -5566
11540 -5566 -72767 -174431 -205478 -238930 -192964 -54452 84151 43604 10221 -68000 31644
11529 31644 33007 -67724 -134324 -79334 -11647 69301 32152 9354 26573 52397 170693
11518 170693 128263 127119 139281 89803 119604 129134 -6157 -45081 10769 87424 -13064
11507a3064j74796q1889J30166Q5570P5567P0512K0511l3790j8596r1739q8033
11496a19581l5859k6223O6747J01752k4006j0938j8539J13438L5000m3009k7009
11485A1773J1277j2218M460q9567L7551j8566l8491P5462J8808q0582r115K3536
11473f5672m3306n292n0164J05005J63013k625o416J13831q950j16201o1999Q0890
11461A02114O9714j8865O0899P692q0589j01964P8180k357j07928o4175j13584
11450a70863L7748R042j6627P709O6650J16600p1484J04402r0766m9315j7750
11439g4654J17998k5429j14866p4699M8560M9153r0765J07010K03535N0561j47274
11428D9130j2139M7818M6115j8743j00535m8003R1166P3888j182q4440N2851k4895
$$ plain form
11507 -13064 -187860 -269749 -139583 -54013 21554 92066 112577 78787 60191 -31548 -119581
11496 -119581 -155440 -181663 -114916 -13164 -37170 -48108 -66647 46791 81791 38782 11773
11485 11773 23050 10832 15292 -74275 -36724 -55290 -93781 -18319 489 -80093 -89208 -65672
11473 -65672 -108978 -114270 -164434 -59429 103584 100959 94543 208374 199424 83223 21224 102114
11461 102114 171828 152963 213862 221554 140965 39001 117181 114824 6896 -57279 -170863
11450 -170863 -133115 -124073 -140700 -132991 -66341 50259 -21225 83177 -7589 -56904 -74654
11439 -74654 43344 17915 -96951 -171650 -123090 -73937 -164702 -57692 145843 196404 49130
11428 49130 36991 84809 130924 112181 11646 -36357 54809 128697 127515 43075 95926 71031
11416G1031K0526l0827j09597j9244M1377J07570R4615Q957n6811o7072l18n9759
11404D48k5127J38922R0115r1392j32145O760M1634Q4870q719k1133j02944l5538
11392e4249M0595Q9256j07494j8371K2159R3649M8272p3622p6449Q1048K8218
11381G3012J3042L8295l7123o6749k0029o9049l6038j5959N1781J28379R0293
11370A49855o306q3795j9008L3191O5453P2788L0137r0002r3148L5639l6245n0546
11358H013l7820p791K1808l2548J02106J43977j18002j07053j6027M528J17005
11347G8196J58423L3015j15794n8917J5859K9657k6100P7454K5066j56043q3888
11336b3072O4140Q9123m8602l6027p733L0151n2876J0906p0082K9901J53146R3849
$$ plain form
11416 71031 91557 60730 -48867 -68111 -26734 80836 175451 184408 127597 60525 60207 448
11404 448 -24679 114243 204358 112966 -19179 -12419 29215 114085 105366 84233 -18711 -54249
11392 -54249 -13654 75602 -31892 -50263 -28104 65545 113817 40195 -36254 44794 73012
11381 73012 86054 124349 87226 20477 448 -68601 -104639 -120598 -68817 59562 149855
11370 149855 143549 59754 40746 73937 139390 212178 242315 152313 59165 94804 58559 8013
11358 8013 -29807 -37598 -15790 -48338 53768 197745 79743 -27310 -43337 -38809 78196
11347 78196 236619 269634 153840 94923 110782 140439 114339 191793 216859 60816 -23072
11336 -23072 41068 130191 81589 45562 37829 67980 15104 26010 -44072 -14171 138975 232824
11324B32824j26344j3797M741J1450K1749n1160k6521N3791P9333R5769O06r0594
11312A91847j38716l9139K3928n0110J363K3282O3195Q828J6074P2319q934O1450
11300B25387R338j56710p0950P7029P4758j00810n6705R9039J44731M0358J22927
11289D08392J97566K19997K46509K73925L83635L51603J89453J4619k05352l01157
11279A779190k24744k75754j93226j56034j31506P9387k1923j2864Q2039N2728
11269I77293J70262J14171J93417M3907j46766k00362k06985j0161r0545n721
11259H38510j3170n4508K6240J07795J74114J02843J84678L10817L95312J43319
11249B215950l3476k27188j22529j55701k33434k72753j77567p7430j5687J18799
$$ plain form
11324 232824 106480 92683 97424 108874 130623 79463 52942 106733 186066 281835 282441 191847
11312 191847 53131 13992 37920 -12190 -10827 12455 75650 84478 100552 172871 163937 225387
11300 225387 234725 78015 7065 84094 158852 58042 1337 100376 245107 285465 408392
11289 408392 605958 825955 1072464 1346389 1730024 2081627 2271080 2285699 2080347 1779190
11279 1779190 1554446 1278692 1085466 929432 797926 877313 855390 842526 924565 977293
11269 977293 1147555 1261726 1455143 1499050 1352284 1151922 944937 934776 844231 838510
11259 838510 825340 770832 797072 904867 1078981 1181824 1366502 1677319 2072631 2215950
11249 2215950 2182474 1955286 1832757 1677056 1443622 1170869 993302 915872 900185 1018984
11239A018984J0206J24377J39540P3649L5390K9700k0900o4595j67576j93214
11229I85561j18973O0066q052M9743J2279N7917K0431J53078K12962K87122K94779
11218B006913Q5907K1405j13624j83191k80289k60965k06307j64464k42116p2394
11208E90875M0638j35572q1144m5642n2131o9716k856J7536j22432j43739O0306
11197E6123N3782M0629n4897K861K4798l5071K4997R501k0472l6239N91P2159
11185A38762K2974L2532j36001p4235M8973j44446q0316q679J31755J25170N8134
11174A14623J24767m1287j0351q0897r9514j5233p7531J1001J3881K6865j20124
11163a53800l4817J93711N8670L7932M7760J17411L8406j34370J17100K481r0181
$$ plain form
11239 1018984 1029190 1153567 1293107 1366756 1402146 1431846 1410946 1346351 1178775 985561
11229 985561 866588 926654 918602 968345 980624 1038541 1058972 1212050 1425012 1712134 2006913
11218 2006913 2092820 2114225 2000601 1817410 1537121 1276156 1069849 905385 663269 590875
11208 590875 631513 495941 414797 369155 317024 247308 244452 261988 139556 -4183 56123
11197 56123 109905 150534 95637 98498 123296 88225 113222 122723 102251 66012 66603 138762
11185 138762 161736 194268 58267 -15968 33005 -111441 -191757 -200436 -68681 56489 114623
11174 114623 239390 198103 187752 106855 7341 -7892 -85423 -74422 -60541 -33676 -153800
11163 -153800 -188617 5094 63764 101696 149456 266867 305273 170903 288003 290484 200303
11152B00303j26363k9178N267j12891L8630P7725K3061N0296p3261k2219N5958
11141H7328J03641O0591M0156j18683q5570j43168j4114P018j073o764K8245N7339
11129A4946k0922j52640p0928O2873J18092R3454L165M0718r6638k3034P8080
11118D7166m318J4270P84j8758Q5378k2884m53N7576K8486J02891J04348j5408
11106C79078k0331J6212J06733O7984J3354N4829m8603j10016L4766J33879L9080
11095F66965j17055j15601n6366l4708m2798j35169P4525L5605l19N9368O8473
11084D02920m0828k0025J8826N4321p9064o8280p5357L3965K7641P5477J71129
11073E00725M8694N9149p0153r571J12865N5427m3479j20627M6317m8103j80503
$$ plain form
11152 200303 73940 44762 50029 -62862 -24232 53493 76554 126850 53589 31370 87328
11141 87328 190969 251560 291716 173033 87463 -55705 -69819 -62801 -63874 -70638 -42393 14946
11129 14946 -5976 -158616 -229544 -166671 -48579 44875 48040 88758 -7880 -30914 47166
11118 47166 42848 57118 57902 39144 124522 101638 101185 158761 187247 290138 394486 379078
11106 379078 358747 374959 481692 549676 563030 617859 569256 459240 494006 627885 666965
11095 666965 549910 434309 377943 343235 300437 165268 239793 275398 275079 334447 402920
11084 402920 362092 342067 360893 415214 336150 267870 192513 226478 254119 329596 500725
11073 500725 549419 608568 538415 528844 641709 697136 653657 533030 579347 531244 350741
11062C50741N2908q172j2941j4397k2555r7941Q3851P5548l0878J5164k6463n216
11050C59649J3667N1286j8749j1500L0236K1710o0144M8201q6494q579r084P6589
11038D06788k5232j5324k1397P1328P3896o7798K831k0920J16141P9215N6738
11027F56266j85623r211o6259m1042p0085P7638L1900Q7496m0758j5288N0974
11016D76008j31512m8454O3187j4112O70M1208R1468Q6993O405j00882N2804O2605
11004E86388L4086M5457N0641m6329J7494M3897J45905L9069m0395M4186o5217
10993H55182J61912J49329J10063L49810K33320J47801J60958J08384q0238j11969
10983B084552j71481k06756l29902j86079P3388l160j81683Q55k3176j70314O4261
$$ plain form
11062 350741 403649 395477 382536 368139 345584 247643 331494 407042 376164 391328 364865 359649
11050 359649 373316 424602 405853 394353 424589 446299 386155 434356 347862 339283 330199 406788
11038 406788 381556 366232 344835 416163 490059 422261 425092 404172 520313 599528 656266
11027 656266 470643 461432 395173 354131 284046 361684 393584 481080 440322 425034 476008
11016 476008 344496 296042 359229 345117 345787 386995 478463 565456 571861 470979 523783 586388
11004 586388 620474 665931 716572 670243 687737 731634 877539 916608 876213 920399 855182
10993 855182 1017094 1166423 1276486 1626296 1859616 2007417 2168375 2276759 2196521 2084552
10983 2084552 1913071 1706315 1376413 1190334 1263722 1260562 1078879 1079734 1056558 886244 950505
10972I50505J9917l6053M675j00677m06J6789m2698J1438j43455j02088K84743
10961H62690N5856K4173n5743j43138J7562J34328K3258m9388p090J7982K3265
10950I03755M5597M0062J4541k6082r5181j22559k238k503J14768J52966J26879
10939A150005L2014K838o9402J1490O6374l2250n950n8495j97271M6150J63259
10928A108762O7761J1196n2848J39682O2820L0053J67690j2308k5577j02687k1543
10917A373001M8255J4319M802K0098P2262R8002J01249L4402N8107J30335j1110
10906A943722P019o7390L618J34502J8710J7809N2742J80275L0435N7295J32015
10895B510752J08766N7276p5258L2838R4784K12550K07693K29727J03721K17142
$$ plain form
10972 950505 970422 934369 939044 838367 837961 854750 812052 823490 680035 577947 862690
10961 862690 918546 942719 886976 743838 761400 895728 918986 869598 862508 880490 903755
10950 903755 949352 989414 1003955 977873 882692 760133 757895 755392 870160 1023126 1150005
10939 1150005 1182019 1184857 1115455 1126945 1193319 1161069 1155119 1096624 899353 945503 1108762
10928 1108762 1176523 1187719 1134871 1274553 1337373 1367426 1535116 1522808 1497231 1394544 1373001
10917 1373001 1421256 1435575 1440377 1460475 1532737 1630739 1731988 1766390 1824497 1954832 1943722
10906 1943722 1950741 1883351 1886969 2021471 2040181 2057990 2110732 2291007 2321442 2378737 2510752
10895 2510752 2619518 2676794 2601536 2634374 2729158 2941708 3149401 3379128 3482849 3699991
10885C699991J57174R0079N7518Q2143K00739K60471K99396L60993L59156J76108
10875E743768J14182K94383K74304L58771N05455N10001O82040Q80767J081961
10866A0445632J219406J582875J863668J801153K034256K449339K703215L508756
10858B7608300M201611N176143O469606Q298097J1027759J5502713K2383977L2277905
10850A32946111M4911943N9725383P4002349P7313385N2841987L703381l8449142
10843D06995397n5588333n6334092n0315701m1439662l1742800k2339904j2988037
10836A36246868l872423N506586J4881081K2997911K6950331K4957429J7498955
10829B45166738P732332k072995j2364360k0839997k4112451k1937696j5961881
$$ plain form
10885 3699991 3857165 3947244 4004762 4086905 4287644 4548115 4847511 5208504 5567660 5743768
10875 5743768 5857950 6152333 6426637 6785408 7290863 7800864 8482904 9363671 10445632
10866 10445632 11665038 13247913 15111581 16912734 18946990 21396329 24099544 27608300
10858 27608300 31809911 36986054 43455660 51753757 62781516 78284229 100668206 132946111
10850 132946111 177858054 237583437 311585786 388899171 441741158 445444539 406995397
10843 406995397 351407064 295072972 244757271 203317609 171574809 149234905 136246868
10836 136246868 132374445 137881031 152762112 175760023 202710354 227667783 245166738
10829 245166738 252899070 250826075 238461715 217621718 193509267 171571571 155609690
10822A55609690p892184J195303J0764995K0076382K8965964L7520722M5502475
10815B91743347M9167407M2556228K3557471l059028k8940711m5250065m8368343
10808B81406306m2337917l3845988k4838621j5357883n317941M644287J3465962
10801A77818205J9938645K1967316J8152047R743713M24911q664621j8156322
10794B21223894k5336561k7078682k3063883j5482245o991278J298764R353656
10787A33923665J7890441K6785778L6324099M6819189N5509617N6980276M4135262
10780D18368327R569108l7025678o6813689o9410291n7547894m3844330l2264547
10773A21031006k3024264j6939658j3082656j0145533q261612o796579n580209
$$ plain form
10822 155609690 147717506 148912809 159677804 179754186 208720150 246240872 291743347
10815 291743347 340910754 383466982 407024453 403965425 375024714 329774649 281406306
10808 281406306 239068389 205222401 180383780 165025897 159707956 164352243 177818205
10801 177818205 197756850 219724166 237876213 247619926 248044837 239380216 221223894
10794 221223894 195887333 168808651 145744768 130262523 123271245 124570009 133923665
10787 133923665 151814106 178599884 214923983 261743172 317252789 374233065 418368327
10780 418368327 427937435 390911757 324098068 254687777 197139883 153295553 121031006
10773 121031006 98006742 81067084 67984428 57838895 49577283 42780704 37200495
10766C7200495m467372l703116l215343k598593k017345j782658j660148j370091
10758A6385829j229837j018437j031911r10047o64585o49705m93089l67496k65347
10749I755375j58577k66063l48928k47772m1015J68615J52387J809N722p4058
10739H947495l18694n95467o36499l69907m04154l90706k34668l56673m21582
10730E219145l37372j27165j97231l30562o1245J4328j366j61N7583J39885Q8082
10719D463921n0138r0937n7095j36981j289P1829K22583L35840M06430L19058
10709E483221J78445J25932k1457k88267l77038m89501m68640n38546m30366k13675
10699B960108j74465l45694j33143j37125q6729o798L2902j00454l3010j8019
$$ plain form
10766 37200495 32733123 29030007 25814664 23216071 21198726 19416068 17755920 16385829
10758 16385829 15155992 14137555 13105644 12195597 11531012 10881307 10388218 10020722 9755375
10749 9755375 9596798 9330735 8981807 8734035 8693020 8861635 9014022 9015831 9021553 8947495
10739 8947495 8628801 8033334 7396835 7026928 6622774 6232068 5997400 5640727 5219145
10730 5219145 4881773 4754608 4557377 4226815 4165570 4179898 4178532 4178371 4235954 4375839 4463921
10719 4463921 4413783 4322846 4265751 4128770 4127481 4199310 4421893 4757733 5164163 5483221
10709 5483221 5661666 5787598 5766141 5477874 5100836 4611335 4142695 3604149 3173783 2960108
10699 2960108 2785643 2439949 2306806 2169681 2082952 2076154 2109056 2008602 1975592 1957573
10689A957573j02566R5948J06191o9864j21445p1624M079n4077j24567j72567
10679A447081K6800N5709o4649M8156n0802k7865j0975J02011N132J1566j9471
10668A522693j01256k0901r356o5949K9467j01780k2207j0118k2050K4630P0945
10657A294118J55559J06530n3859m7815j4615O2824R2L5415L1453Q0119m2522
10646A607299k2972J20672J06804L6987K742R8168K30739J10392r0416k93043
10636A907372k23776k82391r1357j9498r1033o0122Q208J4752q5381j0892q0824
10625I85058n6994M8755j2951n7359j3505m0577n2788l9572p990K7646K3737j11171
10613F92289n1260J33917J8710n9228N8951K0114R0916J65623o2651j81170k64887
$$ plain form
10689 1957573 1855007 1950955 2057146 1987282 1865837 1794213 1798292 1744215 1619648 1447081
10679 1447081 1473881 1529590 1464941 1513097 1462295 1434430 1423455 1525466 1530598 1542164 1522693
10668 1522693 1421437 1400536 1391180 1325231 1354698 1252918 1230711 1220593 1198543 1223173 1294118
10657 1294118 1449677 1556207 1502348 1454533 1439918 1502742 1502834 1538249 1569702 1649821 1607299
10646 1607299 1584327 1704999 1811803 1848790 1851532 1949700 2180439 2290831 2200415 1907372
10636 1907372 1683596 1401205 1309848 1290350 1199317 1139195 1147403 1162155 1076774 1065882 985058
10625 985058 928064 976819 963868 906509 893004 852427 799639 760067 752077 779723 803460 692289
10613 692289 641029 774946 793656 734428 793379 813493 904409 1070032 1007381 826211 561324
10602E61324p2927O6579o2815j83213p6651J37390J47749K2579J10892J7603L5561
10591G04071K13877O4743o6220q9071o0599P2871n6909q880r6690k0740N8948
10580G15401J4973M1176m1l2064J75889R766J5998R0194r0729k5227k278j36087
10568G76971o6208L3731j1618J184m4550L6106R8627J15501L7386K338j04955
10557H74513L5631J76680Q6454j07853k03632l0156J52893J09965r9285m9723
10547I45487k9959l1395p7603n266J30010J61826J4344n9609j97598j17552o5935
10536F66750L9330m0869N6346j1973j11045J1728r08p5258j8273M500N0361J8941
10524E89630Q5158N6481J1518j12878j27547O3787K8436k9382j32720O905k1581
$$ plain form
10602 561324 488397 554976 492161 308948 232297 369687 517436 540015 650907 668510 704071
10591 704071 917948 982691 916471 827400 766801 839672 782763 773883 677193 656453 715401
10580 715401 730374 771550 771509 739445 915334 925100 941098 1031292 940563 915336 913058 776971
10568 776971 710763 744494 732876 734060 689510 725616 824243 939744 977130 979468 874513
10557 874513 910144 1086824 1173278 1065425 861793 831637 984530 1094495 995210 945487
10547 945487 915528 884133 806530 801264 931274 1093100 1107444 1047835 850237 732685 666750
10536 666750 706080 665211 721557 709584 598539 610267 609359 534101 515828 520328 570689 589630
10524 589630 674788 731269 742787 629909 502362 566149 594585 565203 432483 439388 417807
10513D17807J45790Q3440J08685j4250k6506j8800j00698o6195m2400M0030K8651
10502E55554P6076K159j31006j37119j83652r6662J18588J09321m0013p9907l0336
10491A63003J09304M0297P0833J25613P6994m2175j34778J3489Q7986J46865L4341
10480F91772m0858m41P8824M3819r7477o8751N9088J38884j1173Q5689R8778Q0728
10468A058882M6809L78968P80090R62593R26386N42741K86198m1169k00834l57150
10458D383514n88586o91874o58722n09634k37836r9015k20395j76961j92915l5115
10448I72461j05199k09490o2233o8206J1528l1539K2478J7039P91m8422j32277
10437C66931j78403q3600R321J10950K49629K38795j39474j6643J4003N3480K45440
$$ plain form
10513 417807 563597 647037 755722 741472 714966 696166 595468 529273 486873 526903 555554
10502 555554 631630 633789 502783 365664 182012 85350 203938 313259 273246 193339 163003
10491 163003 272307 312604 383437 509050 586044 543869 409091 422580 510566 657431 691772
10480 691772 650914 650473 729297 773116 675639 606888 665976 804860 793687 879376 978154 1058882
10468 1058882 1105691 1484659 2264749 3227342 4153728 4696469 4982667 4941498 4740664 4383514
10458 4383514 3794928 3103054 2444332 1934698 1696862 1597847 1377452 1200491 1007576 972461
10448 972461 867262 657772 595539 527333 538861 507322 529800 546839 547630 499208 366931
10437 366931 188528 104928 114249 225199 474828 713623 574149 557506 571509 624989 870429
10426H70429K53369K48508K05413J06107j0200m6212j18098k23589k91830k57808
10416G36089K1626n7652k9692M8675j1853J33893K71047P0432N1622K38359M19386
10405A891932M22885M71333L74500J33703r0205j73094j87584k75619m09267l18663
10395A839921k35013r8917k8593r6256j53249P0509J76238J24112L5723l2213
10385A602262l012j7411j33879k9752j30579j36532j32701Q9024l9783J36569
10375A204206K09020J46692J83945J72325J79374J48459J57370j32708k44274
10366B024409k98392k08053l3223j59032l3903l5981j30114q9828J40808J18544
10356A295235K39464M9553n7215q0810j36763j33532k02884j31540M9073J9307
$$ plain form
10426 870429 1123798 1372306 1577719 1683826 1673626 1627414 1509316 1285727 993897 736089
10416 736089 757715 700063 670371 719046 707193 841086 1112133 1182565 1234187 1472546 1891932
10405 1891932 2314817 2786150 3160650 3294353 3204148 3031054 2843470 2567851 2158584 1839921
10395 1839921 1604908 1505991 1477398 1381142 1227893 1298402 1474640 1598752 1634475 1602262
10385 1602262 1599250 1581839 1447960 1418208 1287629 1151097 1018396 1107420 1067637 1204206
10375 1204206 1413226 1559918 1743863 1916188 2095562 2244021 2401391 2268683 2024409
10366 2024409 1726017 1517964 1484741 1325709 1291806 1255825 1125711 1035883 1176691 1295235
10356 1295235 1534699 1584252 1527037 1446227 1309464 1175932 973048 841508 890581 909888
10346I09888l1319K3251J19106O3667L10989M01032K07158Q2788J83560q1632
10336B188488j53732k94606k23883l08172l37140j36831r1335p8133l3791j06883
10326D23982n7259j12962q3455j8460l9518K1056N2134P98O981k4872o5254K3082
10314A26253P8662k5718j15727k3963M2351J31368K2415o1648J6542q7322p7423
10303B5790p7922l7948L7763K56706L1566j26293L6410J05841q8572j9900q3616
10292E9825k7736J21202P6060q5287p7894p2866j605J49873N9006r6733n7911
10281D5934J642J18865Q3j57450j13528K8399N9376J2222R4589N6172n5242j18756
10269b7694P777J97939J928l2037j4674J44171M8297j37016r0716k7390J08845
$$ plain form
10346 909888 878569 901820 1020926 1084593 1395582 1796614 2003772 2086560 2270120 2188488
10336 2188488 2034756 1740150 1516267 1208095 870955 734124 642789 564656 530865 423982
10326 423982 366723 253761 170306 151846 112328 133384 185518 186316 193297 168425 103171 126253
10314 126253 204915 179197 63470 39507 81858 213226 235641 173993 190535 103213 25790
10303 25790 -52132 -90080 -52317 204389 235955 109662 146072 251913 163341 143441 59825
10292 59825 32089 153291 229351 144064 66170 -6696 -8301 141572 200578 103845 45934
10281 45934 47576 166441 166524 9074 -104454 -76055 -16679 -4457 90132 146304 91062 -27694
10269 -27694 -19917 178022 179950 147913 133239 277410 325707 188691 97975 70585 179430
10258A79430J37778r1094l2204J3615p0444N0277o0063j02260n1351q6716M5270
10247f7762J23743J13955k3659p5590l3519m4034j1326N4614L4114k3384o2594
10236a5442j7332q0375Q9889P4276P5807M3991r0382o7332o909K0240k4174P8479
10224H0736K7728R1637M6835K4912j07525o8220J3090J35697j8538j65544l2336
10213B8472m5128J22036L7866q6067j9326R8627R9327J5995k2929j1564Q7233
10202C04542R9463L5942k4109j1140l0968j27894q943l7614j51244O9479N9203
10191A76717r780M5362L5761k461n1368j5105K0206O4235K9755L1719M3992L6337
10179D05370o2287j31728j03423p9589P3834n9216k7076J54746O6928r1918p1932
$$ plain form
10258 179430 317208 226114 193910 207525 137081 187358 127295 25035 -26316 -113032 -67762
10247 -67762 55981 169936 146277 70687 37168 -6866 -18192 36422 70536 47152 -15442
10236 -15442 -32774 -113149 -23260 51016 126823 170814 80432 13100 6191 26431 2257 80736
10224 80736 108464 200101 246936 271848 164323 96103 109193 244890 226352 60808 28472
10213 28472 -16656 105380 143246 57179 37853 136480 235807 251802 228873 217309 304542
10202 304542 404005 439947 415838 404698 373730 245836 236893 199279 48035 117514 176717
10191 176717 166937 212299 248060 245599 194231 179126 199332 263567 293322 325041 369033 405370
10179 405370 343083 211355 107932 28343 102177 42961 15885 170631 237559 145641 73709
10168G3709N790n872L7972l3568j02906K7072J47671Q9713K6522q276O7823M2252
10156C67902r6524j48683M3630Q5843j0580q1416L3130j63102p8724O2883P5223
10145H9582p534P4797R2320l7182n5604p2779L7420k1649N3151L3747l1242j37962
10133A7065l2824P8239J02310J5057J2816M9512K0007M8091J00521N7879j51502
10122C17171j63277j5629J04425l0525j30818P2526K13723K8951j3633J1270m007
10111C90177j13715q4303n9332r1872J312J03492N3015j01282j36048J21811K24217
10100C07472R1016N4799p765m1250j06840n0675j2662q5943q6785J07028R6627
10089B65022k0503K3020Q4357p1154o2196m4792N8642m3129M4128l0892m046l922
$$ plain form
10168 73709 79499 73627 111599 78031 -24875 2197 149868 239581 266103 257827 325650 367902
10156 367902 271378 122695 166325 252168 241588 160172 193302 30200 -48524 14359 89582
10145 89582 82048 156845 249165 211983 156379 83600 121020 99371 152522 186269 155027 17065
10133 17065 -15759 62480 164790 179847 192663 242175 262182 310273 410794 468673 317171
10122 317171 153894 138265 242690 212165 81347 153873 367596 396547 382914 394184 390177
10111 390177 276462 192159 132827 40955 42267 145759 198774 97492 -38556 83255 307472
10100 307472 398488 453287 445522 404272 297432 246757 234095 148152 61367 168395 265022
10089 265022 244519 267539 351896 280742 218546 173754 232396 189267 233395 202503 198457 194535
10077A94535R0782k5353P8466L8876J08867P8400q4207j20933m7412l3391M8265
10066C26895N2685K0295p564Q052o2035l4126p411Q0851P850M6698n227n8408
10054C68555N6910k6704l6416J2379N5881P5304R1053J7976N47M5062k694L0382
10042F88235P1459l1617j94375K9576P4837L9823k1125n3766j2753O2717l3648
10031F19363k5557N7753R3012L2270J5577K1875j32455J08887Q4458q066O268
10020H73385P6389k6449P64J34752J21474j67610J9230Q1361O4109Q2167L0265
10009A289837r9157L5772J24177N8501M3877J49591R4909O2013R4716R0483K87707
9998B232426O23300J019444J047520M19853o61800q74060n92812l06177j12313
$$ plain form
10077 194535 285317 259964 338430 377306 486173 564573 480366 359433 312021 278630 326895
10066 326895 379580 399875 392311 400363 338328 304202 296791 377642 385492 432190 426963 368555
10054 368555 425465 398761 362345 374724 430605 505909 596962 614938 615485 660547 657853 688235
10042 688235 759694 728077 533702 563278 638115 677938 656813 603047 590294 653011 619363
10031 619363 593806 651559 744571 776841 792418 814293 681838 790725 875183 867117 873385
10020 873385 949774 923325 924089 1058841 1180315 1012705 1031935 1113296 1177405 1259572 1289837
10009 1289837 1190680 1226452 1350629 1409130 1453007 1602598 1697507 1759520 1854236 1944719 2232426
9998 2232426 2855726 3875170 4922690 5342543 4680743 3806683 3213871 2907694 2795381
9989B795381J19273m8760p9074K6412K4771R0952J20612J51581P5253J39194J56654
9978C572249R1055K42241K50623P4956J31262J90040J28904L43090L52617K09377
9968E586414K68790K37994L68851M00995L55465L62186M73872L04205L99585M37877
9958I196234N40954N35981N50282N67377N95370O13833P94026P94806P44157P23900
9948A5656920P48851J035961J107234R90590J006571J081050J026859J152024
9940B3806060J229338J346438J449095J435275J544022J635868J707978J817757
9932C5971831J916172J971583K261350K289413K385158K639861K679834K836626
9924E4951828L000715L033048L154624L179142L374676L506769L478004L514260
$$ plain form
9989 2795381 2914654 2865894 2786820 2813232 2838003 2928955 3049567 3201148 3276401 3415595 3572249
9978 3572249 3663304 3905545 4156168 4231124 4362386 4552426 4681330 5024420 5377037 5586414
9968 5586414 5855204 6093198 6462049 6863044 7218509 7580695 8054567 8358772 8758357 9196234
9958 9196234 9737188 10273169 10823451 11390828 11986198 12600031 13394057 14188863 14933020 15656920
9948 15656920 16405771 17441732 18548966 19539556 20546127 21627177 22654036 23806060
9940 23806060 25035398 26381836 27830931 29266206 30810228 32446096 34154074 35971831
9932 35971831 37888003 39859586 42120936 44410349 46795507 49435368 52115202 54951828
9924 54951828 57952543 60985591 64140215 67319357 70694033 74200802 77678806 81193066
9916H1193066L398811L070804K842880K600581K372138J828620J269593O82920
9908I9259413Q7493m93686q57716j524325k066150k371457k849820l159991l334282
9899H2689479l371256l430026l545247l436186l400980l298731k963149l084870
9891E6159034k843212k619885k601162k429674k382836k263172k045735j979854
9883C6993504j741506j799909j676847j666957j477413j310106j294829j212784
9875B4813153j247276j244347j097692j013179r67497q49454r23539r52918q96917
9866A5620334q38230o72773m89429m62065o09511n41305o63041o31654o31109
9857A0081217o56410m66541m10764m38095l90062j70077j93073k96137l56633
$$ plain form
9916 81193066 84591877 87662681 90505561 93106142 95478280 97306900 98576493 99259413
9908 99259413 99346906 98853220 97995504 96471179 94405029 92033572 89183752 86023761 82689479
9899 82689479 79318223 75888197 72342950 68906764 65505784 62207053 59243904 56159034
9891 56159034 53315822 50695937 48094775 45665101 43282265 41019093 38973358 36993504
9883 36993504 35251998 33452089 31775242 30108285 28630872 27320766 26025937 24813153
9875 24813153 23565877 22321530 21223838 20210659 19243162 18393708 17470169 16517251 15620334
9866 15620334 14782104 14109331 13619902 13157837 12548326 12007021 11343980 10712326 10081217
9857 10081217 9424807 8958266 8547502 8109407 7719345 7549268 7356195 7060058 6703425
9848F703425k84285k34493l89334k80215k83907l07435k35785k45105l09072k24574
9838C909220p2341Q6571j16018k63108k17561m8326k1931j80571k26136m3656
9828B806143p751j06085j64817j13755j11262j18095j30737J4829j8277o0137
9818A990056j27317j43101j52496K7187N6620O6094K4383q3445l5000K656j14471
9807A511166M3755q1593r7803K9182l6763j31966j6315P060k9902j46904l668
9796A046249M9993k9701J0812r325o1127l0544J2452O4531Q0811Q3326j57440
9785A060037q6963n8155p9724K4508j1221j26816q3881j01461O8204J33360P2130
9774H10018j030o9551N0371R450j1886j08345o8012j0420q5149l4631l2966m0872
$$ plain form
9848 6703425 6419140 6184647 5795313 5515098 5231191 4923756 4687971 4442866 4133794 3909220
9838 3909220 3836879 3923450 3807432 3544324 3326763 3278437 3256506 3075935 2849799 2806143
9828 2806143 2798392 2692307 2527490 2413735 2302473 2184378 2053641 2068470 2050193 1990056
9818 1990056 1862739 1719638 1567142 1594329 1650949 1717043 1741426 1657981 1622981 1625637 1511166
9807 1511166 1554921 1473328 1375525 1404707 1367944 1235978 1219663 1226723 1196821 1049917 1046249
9796 1046249 1096242 1066541 1077353 1068028 1006901 976357 988809 1053340 1134151 1217477 1060037
9785 1060037 973074 914919 835195 859703 848482 721666 637785 536324 604528 737888 810018
9774 810018 808988 739437 789808 799258 787372 679027 611015 600595 515446 480815 447849 406977
9762D06977M0887K1944O0907O1328N827j00176L5609j50712j09359l3253J10862
9751C50841K28693O7426N5181n8600q4648j31705J5172p0051j00977n4299R2369
9740C09402J63937Q7852o7060J44299O1801j85863q2224K7905k2067k2961N4295
9729D69316J1381k9974j32386R472L2826n9633k0128N256m7512m469J27100J19197
9717D80446o4238l978j6679j42829j43143m4707J69302J25473k9763l7976K8812
9706C20720J8041m4373r8743n7917q9514k3774j0125J06409J05149j4417j4441
9695A97015j2107k6366q8600p8465P3629J97016R1571m6682p9129l1543P3935
9684B70274J5449J1393j9191j29750l0985P1089n3943P031n998l0835k6284j8892
$$ plain form
9762 406977 447864 469808 530715 592043 597870 497694 533303 382591 273232 239979 350841
9751 350841 579534 646960 702141 643541 558893 427188 442360 372309 271332 217033 309402
9740 309402 473339 561191 494131 638430 700231 514368 432144 460049 437982 415021 469316
9729 469316 480697 450723 318337 327809 360635 301002 280874 286130 238618 234149 361249 480446
9717 480446 416208 412230 395551 252722 109579 64872 234174 359647 329884 291908 320720
9706 320720 338761 294388 195645 137728 48214 24440 14315 120724 225873 211456 197015
9695 197015 184908 158542 69942 -8523 65106 262122 353693 307011 227882 196339 270274
9684 270274 285723 297116 277925 148175 117190 188279 134336 141367 135369 104534 78250 59358
9672E9358o77m7658M0951K6936K9746J30390q2142o097Q1081J12395r4451l5734
9660B14098p7568M3925P9347J50405o361K1964R3883o8815l5741j34451j30567
9649A50119p9680m9750L4119k8609L2753O7791N9392j3637P4698O4105L3333j87975
9637A56659o6895J69558K5652j18194p5053q369p1943o3032k2959R9016M8690
9626G3130O0871R3021R2177J4969k4030n0468K0230j52460j81681k1537J47881
9615G2103R0016j2115r369M2452K8123q8133o7127N5627O7039l8338m6629k3547
9603G0102N8315K8639j4821J3399m8917K9314L9324J2557n8418j1996k3030l5951
9591E8517J8157J794Q4871J31936r1867q3107k9278L3065J76898p252j14126j3134
$$ plain form
9672 59358 58681 11023 51974 78910 108656 239046 156904 150807 231888 344283 249832 214098
9660 214098 136530 180455 259802 410207 403846 425810 519693 450878 415137 280686 150119
9649 150119 70439 20689 54808 26199 58952 126743 186135 172498 247196 311301 344634 156659
9637 156659 89764 259322 284974 166780 91727 83358 11415 -51617 -74576 24440 73130
9626 73130 134001 227022 319199 334168 310138 259670 279900 127440 -54241 -75778 72103
9615 72103 162119 150004 140635 183087 211210 123077 55950 111577 178616 140278 93649 70102
9603 70102 128417 157056 142235 155634 106717 136031 175355 187912 129494 117498 94468 58517
9591 58517 76674 78468 163339 295275 203408 120301 91023 124088 300986 293734 179608 166474
9579A66474O6406M2587J0272j49788j02681k1654N3759L4064N9374L0627J71608
9568C61048k4613j99532j84603L0761M4773J4341N1553N5597J10650M8436n4489
9557B53922j60245j8603M0638J38598l1463L9608k2902o5801k0028k0679M409
9546A37454q0961j4639r5759P5995J7250j23275K6723J9704j2256M9205P0017
9535F9458q1209J2169P2788P930k8378K3508J4759P3054J94660o4038j21141n1838
9523A21722k8788Q2263m7240r1176O9225N5851K19N5909K3309K3554p0882j355
9511A92611J38264m995o8444q0566L101l0607o4641k3263L3371K9312O0237J6713
9499B01093o0999K7948P7571N1166j14970r8429m7947K7488j081O208r6815M6320
$$ plain form
9579 166474 232880 275467 285739 135951 33270 11616 65375 99439 158813 189440 361048
9568 361048 336435 136903 -47700 -16939 27834 42175 93728 149325 259975 308411 253922
9557 253922 93677 75074 115712 254310 222847 262455 239553 173752 153724 133045 137454
9546 137454 56493 41854 -53905 22090 39340 -83935 -57212 -37508 -49764 -559 69458
9535 69458 -11751 418 73206 81136 52758 76266 91025 164079 358739 294701 173560 121722
9523 121722 92934 175197 127957 36781 106006 161857 162076 217985 241294 264848 193966 192611
9511 192611 330875 325880 257436 176870 179971 149364 84723 61460 94831 124143 184380 201093
9499 201093 140094 168042 245613 296779 181809 83380 35433 62921 61840 68048 -28767 17553
9487A7553O2490k8315n9804K4828Q6458m0536k1160q149L3134Q7506R4596N5020
9475C03621r1624K2327J60127j1873j33817J751m0531O9896R6267j9018j14133
9464B42993l9209N8210N820j5396o4293K203q3442o5075J34027P9751j15311m2927
9452I7351J26340j5360j2928J14023o461J8605k498o8835K9531j64433j02278
9441A3057p9661K2655J18115J72655Q696O6915K0220n5979j76599o3080N5849
9430A02843P1811R5351q187l8460j36628O1323n0683R9470J00874N7333o8790
9419B86257j18333j18871l6546M8686N7699J49436Q932K5682j1655j30768o9569
9408I0950M3756p7304o0695N2463R3628k8032j7309L6852k5878J7499l8463J6793
$$ plain form
9487 17553 80043 51728 -8076 16752 103210 62674 41514 33365 66499 154005 248601 303621
9475 303621 211997 234324 394451 382578 248761 250512 209981 279877 376144 357126 242993
9464 242993 203784 261994 267814 252418 188125 190328 106886 41811 175838 255589 140278 97351
9452 97351 223691 208331 195403 309426 302965 321570 319072 250237 279768 115335 13057
9441 13057 -66604 -43949 74166 246821 255517 322432 342652 286673 110074 46994 102843
9430 102843 174654 270005 261818 223358 86730 148053 97370 196840 297714 355047 286257
9419 286257 167924 49053 12507 61193 118892 268328 277260 302942 291287 160519 90950
9408 90950 134706 57402 -3293 49170 142798 114766 97457 134309 108431 125930 87467 104260
9396A04260R2339o5338q0307P201P2863R0793J5001o0904r4141P8947N805N519
9384A72038O4580n6472j2403M7907n4670j39528j8277O1055L8464J02011j1630
9373A93075J2068M6370M2696J06028J39j3185p5688j30192l1335J03293m4318
9362B08951r6087m934O7889J03718K5345K6822J2051J05311P1885m3871j7677
9351D59403j5333p1223N337j3069k3936k9949m898l6491p8894K0886J72425J70694
9339E54952l521j37061N5578K6660J1730k8442L7615k2516q3873o0907J57683
9328E07898L0207m8985r712K7294N7960k4919j11245m1622R2353Q323j71122R1783
9316D08213J30095j8267q7003Q3685L957O5646J66633R0300m7045p4019o7764
$$ plain form
9396 104260 196599 131261 50954 58155 131018 221811 236812 175908 81767 160714 166519 172038
9384 172038 236618 180146 167743 215650 160980 21452 3175 64230 102694 204705 193075
9373 193075 205143 251513 294209 400237 400376 387191 311503 181311 149976 253269 208951
9362 208951 112864 107930 175819 279537 304882 331704 343755 449066 520951 477080 459403
9351 459403 444070 372847 378184 365115 341179 311230 306332 269841 190947 211833 384258 554952
9339 554952 551431 414370 469948 496608 508338 479896 517511 494995 411122 350215 507898
9328 507898 538105 489120 479408 506702 564662 539743 428498 386876 479229 487552 316430 408213
9316 408213 538308 520041 433038 516723 520680 586326 752959 843259 796214 722195 654431
9305F54431J3814L1015K5264J37612L8122N9170P1836M1425q8169K5373K4562
9294A034455p8874j51155Q3733J00904K43461O1895M9749J6655N7813m8825R1334
9283A461145R9593o1103M2905K12843M5307l521P5484J21568M7760J4091J41349
9272B197421J51416J06287J87746K49864J09835N1261R1112J42403Q985L1818
9262C328148J67169R0504k985q3350R8645O5488J00631R9927k2844N7990M2779
9251C942102l8913j31272j05439m5906o1495j4505L9367m1383o4247o9393j88311
9240C220605k54206j63841j70233q473j22778j03426k2289l9446k8282p7696r5229
9229B134706o5575r8583l0127j02776j6245o5633j83689j69880j00775J6347m0514
$$ plain form
9305 654431 668245 699260 724524 862136 900258 959428 1031264 1072689 984520 1009893 1034455
9294 1034455 955581 804426 888159 989063 1232524 1294419 1344168 1360823 1418636 1369811 1461145
9283 1461145 1560738 1499635 1542540 1755383 1800690 1797169 1872653 1994221 2041981 2056072 2197421
9272 2197421 2348837 2455124 2642870 2892734 3002569 3053830 3144942 3287345 3296330 3328148
9262 3328148 3495317 3585821 3582836 3499486 3598131 3663619 3764250 3864177 3841333 3899323 3942102
9251 3942102 3903189 3771917 3666478 3620572 3559077 3544572 3583939 3542556 3478309 3408916 3220605
9240 3220605 2966399 2802558 2632325 2623852 2501074 2397648 2375359 2335913 2307631 2229935 2134706
9229 2134706 2069131 1970548 1940421 1837645 1821400 1755767 1572078 1402198 1301423 1317770 1277256
9218A277256m3441o2044j62839m1413L4874K8804j0198m4554l0003m2224j29681
9207G74537p4701N7770M2199L2339j05891l1706J8660j75453n0259K01840l4875
9196F54460k30423p4747J3998P0100Q0753L6893j3232K7020Q3936j01570j33055
9185D14133r9380k2679J10631q5994j5271j16578j04357K3952K9145J4954J09831
9174B58387J21293m994P7205p4003o4954J2602l2823N4270m254l2918o955j02655
9162B00201p3234N472k3299P7030k1234J16581K0169M6991p1894j4221m8005j65806
9150D8751K4740J95977J32224j03650r9080m4549l098j1273N074N3199l5608M466
9138A67173N328j316j08470L7403Q6263J04590l1747J9374m1171M0732Q2167k7518
$$ plain form
9218 1277256 1233815 1171771 1008932 967519 1002393 1031197 1020999 976445 946442 904218 774537
9207 774537 699836 757606 799805 832144 726253 694547 713207 537754 487495 689335 654460
9196 654460 424037 349290 363288 433388 514141 551034 537802 564822 648758 547188 414133
9185 414133 314753 292074 402705 316711 301440 184862 80505 104457 133602 148556 258387
9174 258387 379680 374686 451891 377888 312934 325536 292713 346983 342729 309811 302856 200201
9162 200201 126967 132439 109140 186170 164936 281517 301686 348677 276783 262562 214557 48751
9150 48751 73491 269468 401692 298042 198962 154413 151315 140042 145116 198315 162707 167173
9138 167173 172501 171185 62715 100118 186381 290971 259224 278598 237427 278159 360326 332808
9126C32808L8152o8126K6161K1721M9917m4425R751J2230O2262O6240K9203k5192
9114E10702j60658m4086o5975K0942N8732O3245N9162L8482J13488M0651p1311
9103E63374o1011j24981m8022n6072J0010J00165J59065K4881j09773J8235L6272
9092E12143Q6299j52914o3370m5590o5503R1133P4352K0077o7351l3594M4496
9081D00178Q4781R0534n7874j76556n2567R502J72368R9266M8556P0190j12345
9070E76033j13391N8204K4325j3208k7911l0229J0558m5679n9973K815Q5620J02377
9058E69541r9310q0661J40960n7799r3825k0611l982P4987M112j7351q2139m2254
9046B91668J3393N6675l9547j4338j1269p445J20323P803K8143j77882j07038
$$ plain form
9126 332808 370960 302834 328995 350716 400633 356208 365959 378189 440451 506691 535894 510702
9114 510702 350044 305958 239983 260925 319657 382902 442064 480546 594034 634685 563374
9103 563374 502363 377382 329360 273288 283298 383463 542528 567409 457636 475871 512143
9092 512143 598442 445528 382158 336568 271065 362198 436550 456627 389276 355682 400178
9081 400178 484959 575493 517619 341063 288496 297998 470366 569632 618188 688378 576033
9070 576033 462642 520846 545171 531963 504052 473823 484381 438702 378729 381544 467164 569541
9058 569541 470231 389570 530530 472731 378906 358295 354313 429300 433412 416061 333922 291668
9046 291668 305061 361736 322189 307851 296582 289137 409460 417263 445406 267524 160486
9035A60486L7178j8918P1055M7633J8661p6507p0090L6938Q1314L7401K2812m0416
9023C07547k7515N4946L9237n7562m597M8946p084k415j29296j21753k1457N3453
9011A32450K7977n5922o9248K5307P3740k6197j52620l1522R9132N8824p8680
9000C241o770o91J0048j24141K0905O4656J6054R0922j4557p275j00182m6322
8988i4112K4315L6827J15184J45942L2336j32844r4552l670k0890K2200P7628
8977A08364P3420m824l2951n5704r9212J1309J21297l5938r3135l8933J27217
8966H0910K3439p8602k6239q9614N5051J44461P5113L8707k3430r6655j6049j66678
8954g9586J9184J37219J8537K8485l4455l1653j08102K2733j133K3194j8441j17617
$$ plain form
9035 160486 197664 178746 249801 297434 316095 239588 169498 206436 287750 325151 347963 307547
9023 307547 280032 334978 374215 316653 312056 361002 353918 351503 222207 100454 78997 132450
9011 132450 160427 104505 35257 60564 134304 108107 -44513 -76035 23097 81921 3241
9000 3241 -3529 -4220 5828 -118313 -97408 -32752 -16698 74224 59667 52392 -47790 -94112
8988 -94112 -69797 -32970 82214 228156 260492 127648 33096 29426 8536 30736 108364
8977 108364 181784 176960 144009 88305 -10907 402 121699 85761 -7374 -46307 80910
8966 80910 104349 25747 -492 -90106 -35055 109406 184519 223226 199796 103141 87092 -79586
8954 -79586 -60402 76817 95354 123839 89384 57731 -50371 -27638 -28771 -5577 -24018 -141635
8942a41635m7496K8216K07776Q2103n0737p1614L6372M6150R099k3711j84440
8931a09917n7590L4420p8050L1833K21983N1694q6848M0157j1229M447L408L2012
8919G6320P4744k2389j10159l5205O6684r887p2825n4650k239P5912L6411J4811
8907C7528M1134k3412j07376N6422M5703N0969P5332q3200j5489n2579l7683k3752
8895c6403o3874N4781N8525n3525n7387p1812l4044Q1079J44622J03905L9676
8884A65543N1746m1858j49444n0968Q6980Q7145n1392n9958N4001o1682K6670
8873E6783m8867J4547N1033l363N7279j23271n3807N6877k363p0764j8204l3945
8861a18065j3257j0187M6303L5679q790P483J343P6206M3065j31907j29363o7205
$$ plain form
8942 -141635 -189131 -160915 46861 128964 78227 6613 42985 89135 98234 74523 -109917
8931 -109917 -167507 -133087 -211137 -179304 42679 94373 7525 47682 36453 40900 44308 76320
8919 76320 151064 128675 18516 -16689 49995 40108 -32717 -87367 -89606 -13694 22717 37528
8907 37528 78662 55250 -52126 4296 49999 100968 176300 93100 77611 25032 -12651 -36403
8895 -36403 -100277 -45496 13029 -40496 -97883 -169695 -203739 -122660 21962 125867 165543
8884 165543 217289 175431 25987 -24981 61999 149144 97752 37794 91795 30113 56783
8873 56783 7916 22463 73496 70133 127412 4141 -49666 7211 4848 -65916 -84120 -118065
8861 -118065 -131322 -141509 -95206 -59527 -68317 -60834 -59491 16715 59780 -72127 -201490 -268695
8849b68695N2919J28255J0675M3905O148N6637k6230L9866L6473n3826r6596r666
8837h0135J14365r242m3920k427P7714J4104p8364P0756j5394k1416j08852N4665
8825b8146o18j41567M6480J57453J04681N0454j54539n5496n3673n8944k1510
8814a55425k7705O0158P5128M3061N1074J384p3602l6549Q2941Q8832K2059j9844
8802A11512p3974m729l0159M5281k2424j7861j02677Q9737J10182J6195K8284
8791A49367k2867R2543J14492o0701L1892n1844j28126j03705n9243J4201j4424
8780c8415L8044k1875n7658j15411N5769L6221J28180Q4908m7645n8523L9158
8769D2753k1818q9787o5764N5416K31628L5828m2354j9991J8756p959J250K0970
$$ plain form
8849 -268695 -215776 -87521 -76846 -32941 -26793 29844 3614 43480 79953 26127 -70469 -80135
8837 -80135 34230 24988 -18932 -21359 56355 70459 -7905 62851 47457 26041 -82811 -28146
8825 -28146 -28764 -170331 -123851 33602 138283 188737 34198 -21298 -74971 -133915 -155425
8814 -155425 -183130 -122972 -47844 -4783 46291 47675 -25927 -62476 20465 109297 131356 111512
8802 111512 37538 32809 2650 47931 25507 7646 -95031 -5294 104888 121083 149367
8791 149367 126500 219043 333535 272834 304726 252882 124756 21051 -38192 -23991 -38415
8780 -38415 -371 -22246 -79904 -195315 -139546 -103325 24855 109763 62118 3595 42753
8769 42753 20935 -68852 -134616 -79200 152428 188256 145902 125911 144667 136708 137958 158928
8757A58928j08851L6557j03369P2261Q3889l5243m9632k9761M0113q358K7874
8746H4408m1115o4315n6410j3547Q8604j460j4351m1178J34324P3240j25270j25939
8734a03009j0218N1671P885L8076J13019J31090n6333j93439p6857N1418J60568
8723A13871K6102q6383m1578p0922J4023J20092k1804m1067M5922j7334k4364
8712A6558p3741J1223R1065m6331j4069o3700m2088J22379K691n6068k0913Q6037
8700A3043M3455j1070L6967j44404k1769L1318P5351J09189l1072m7888p3165
8689b0045r654L1041M1919m2958j15181P3835K3523l9929J39350N2961p9362N8420
8677A13920P1471j8786o6530j30266K4467j0669Q8072J26096l1794r2561j2022
$$ plain form
8757 158928 50077 86634 -16735 55526 139415 104172 54540 24779 64892 56534 84408
8746 84408 43293 -21022 -77432 -90979 -2375 -3835 -18186 -59364 74960 148200 22930 -103009
8734 -103009 -113227 -61556 -53671 -15595 97424 228514 172181 -21258 -98115 -46697 113871
8723 113871 139973 53590 12012 -58910 -44887 75205 53401 12334 58256 40922 16558
8712 16558 -57183 -45960 45105 -1226 -15295 -78995 -121083 1296 3987 -52081 -72994 13043
8700 13043 56498 45428 82395 -62009 -83778 -52460 22891 132080 101008 53120 -20045
8689 -20045 -29699 1342 43261 303 -114878 -41043 -17520 -57449 81901 134862 55500 113920
8677 113920 185391 166605 100075 -30191 -5724 -16393 71679 197775 165981 73420 61398
8666F1398p0292o0514r9214n5710J43032J06063j3564J8730j19704k1519O3501
8655d7793p637m8404m4934M8601Q3667N1763N6434n7047o1314l7433j19780k450
8643a86327J50652L0539o553N8183k0950J31238J20294q9218q4065n7758J03563
8632A49598K9428p7744j48776l7744Q7571J03083n3337r1408p5010J02705K2253
8621A0619m5831k5065m8579k9330J08490L1002R7091j7161m7941K0677N9223M9084
8609A62279N8296L0883j20443j55201Q5124O1943n60J4469p0876r1636L4464L0245
8597C8987L0641j18132k5166m7022J71976J9049k0821M5533q6127L5462P8635
8586A23015j38018r2255n1031Q7242K8104r8577j46912K9945P7179l6294J4856
$$ plain form
8666 61398 -8894 -69408 -168622 -224332 -81300 24763 11199 29929 -89775 -111294 -47793
8655 -47793 -55430 -103834 -148768 -100167 -16500 35263 91697 34650 -26664 -64097 -183877 -186327
8643 -186327 -35675 -5136 -11689 46494 25544 156782 277076 187858 103793 46035 149598
8632 149598 179026 101282 -47494 -85238 2333 105416 52079 -39329 -114339 -11634 10619
8621 10619 -35212 -60277 -108856 -138186 -29696 1306 98397 81236 33295 53972 113195 162279
8609 162279 220575 251458 131015 -24186 60938 122881 122321 136790 65914 -25722 8742 38987
8597 38987 69628 -48504 -73670 -120692 51284 70333 49512 95045 8918 44380 123015
8586 123015 -15003 -107258 -158289 -71047 -42943 -141520 -288432 -258487 -181308 -217602 -202746
8575b02746o7906O7132J22212M3778J04483l2980L604N4559M8620L2087l1085
8564A41758m771J174l6235J7210L4409j03154l4591J22477k7756o0909o5959j225
8552a7572M788J07409k6275k24271k8568Q0392L9486Q5974L8091P9093j26894
8541A1653j19801J02582O5102O8293j54162n554J41996n2707o044L745k859j10446
8529e8202l8476L86K02831J56037j6200m6591j23960P7061P3707k17879r7928
8518h9214Q7563M6918R1091K4915j29008q5665M7284j4334J56399K5571j00946
8507F0574o3257k6924J35867j849K8137J1387p1231n4943Q7619L8680L261j2060
8495A35261P8177k2501J4626J9685Q1921j1398j02821N113j15948P098J43899
$$ plain form
8575 -202746 -270652 -203520 -81308 -37530 66953 33973 37577 92136 140756 172843 141758
8564 141758 136987 138161 101926 119136 153545 50391 15800 138277 110521 49612 -16347 -17572
8552 -17572 -12784 94625 68350 -155921 -184489 -104097 -64611 21363 59454 138547 11653
8541 11653 -108148 -5566 59536 127829 -26333 -31887 110109 57402 51358 55103 52244 -58202
8529 -58202 -96678 -96292 106539 262576 246376 199785 75825 152886 226593 8714 -89214
8518 -89214 -1651 45267 136358 161273 32265 -53400 -6116 -20450 135949 161520 60574
8507 60574 -2683 -29607 106260 104411 132548 143935 72704 17761 105380 144060 147321 135261
8495 135261 213438 190937 205563 225248 307169 295771 192950 198063 82115 89213 233112
8484B33112l4726n3469Q913N354n2962Q1362J71320k2961j52358j30596J2039
8473F5028J13810L5265q5744k2206J47136j0266l6563r0154M763k9430R823j6213
8461H5249j08247P2719N4891j10860n753J67374N2977K7814q0509m8317L1957
8450A39295J04775k0057j65138j51440L0108J06415J08357P0247l4782j30362
8440E7418M6781J91676M3969r1337q2856J15016l6088j31970R8534J04531n6478
8429B59196l4408Q94J25200N2465q4905j04456J8824J694O7434J35139J41617
8418E78694p9743p538q0615k4686P3747N8515j3614k653J8957q8452j56736N0652
8406C26528M6499l8688o44Q3721l264k2314L6696k3600M1239k4504k2593Q9485
$$ plain form
8484 233112 198386 144917 153830 159184 106222 187584 358904 335943 183585 52989 65028
8473 65028 178838 214103 128359 106153 253289 243023 206460 116306 121069 91639 101462 85249
8461 85249 -22998 49721 104612 -6248 -12001 155373 208350 236164 155655 107338 139295
8450 139295 244070 224013 58875 -92565 -62457 43958 152315 222562 187780 57418
8440 57418 104199 295875 339844 248507 165651 280667 244579 112609 211143 315674 259196
8429 259196 224788 225682 350882 403347 318442 213986 232810 234504 301938 437077 578694
8418 578694 498951 491413 410798 386112 459859 518374 504760 502107 521064 432612 275876 326528
8406 326528 373027 334339 333695 417416 414152 391838 428534 404934 446173 421669 399076 488561
8394D88561p8527o6550L659J9643O6092K0496N5008j07283p4197p2739l4740R1822
8382C11245J21218k4635Q101L3052O1494N0662R6268J17969k3561j10640j47982
8371D93191j28416R8472k7142Q2649m0427r905j36824l7591P0014Q7804P1532
8360E23357R10r7455j2668K1818n0122L2361L8881J410L0309m528l028k9492k4998
8347D26755M8836l0854J26804J19439n0122j62149o1510k8740o9641p5357J36390
8336C79851J14377N1312j33877j36588m6581J21285Q3250j06657q5243M3251l5139
8325B49241n6478q8350J18939K1099M0424M1065o5048K0014K8589K6565q1024
8314B55036q0120L498Q348k700p4381M6495l1050m6771R2518N9165m7987p0663
$$ plain form
8394 488561 410034 343484 347143 366786 432878 453374 508382 401099 326902 254163 219423 311245
8382 311245 432463 407828 415929 448981 510475 561137 657405 775374 751813 641173 493191
8371 493191 364775 463247 436105 518754 478327 468422 331598 294007 364021 451825 523357
8360 523357 524267 426812 414144 435962 385840 418201 457082 458492 488801 484273 481245 451753 426755
8347 426755 475591 444737 571541 690980 640858 478709 417199 388459 318818 243461 379851
8336 379851 494228 545540 411663 275075 228494 349779 433029 326372 241129 284380 249241
8325 249241 192763 104413 223352 244451 284875 325940 260892 280906 309495 336060 255036
8314 255036 174916 178414 186762 184062 109681 156176 125126 78355 170873 230038 182051 111388
8302A11388O1568j0183r3584m2212J24888k3200j41008P3330k5763O6592j9452
8291H2364L6667K7915J6202m5437m8390l2436O1997M0661J13058n5197j52986
8280D4418J2620K6455R494p7740K7615p8292N2570k8541P859o2307j29483M6428
8268a48904k7436M6380j8135O8301j7963J26931R9723j78284j85767n822J42008
8257i8968R4124P9386J39237m086q2326j00136m9569j35659l004K8244k1000o3702
8245b17459O7838K4171k6857P2281M9704n488o7025l0673P7228J31438J00959
8234A76117O9027j57497o5811P2942P2291R49N656J5802k4274j48007j47686K4435
8222a06056J46707k1063L3233j06935j62925p3199M1458J47269J1412m8887m9008
$$ plain form
8302 111388 172956 162773 69189 26977 151865 128665 -12343 60987 35224 101816 82364
8291 82364 119031 146946 163148 117711 69321 36885 98882 139543 252601 197404 44418
8280 44418 57038 83493 92987 15247 42862 -35430 17140 -11401 -3542 -65849 -195332 -148904
8268 -148904 -176340 -129960 -148095 -79794 -97757 29174 128897 -49387 -235154 -240976 -98968
8257 -98968 -4844 74542 213779 209693 127367 27231 -22338 -157997 -161001 -132757 -153757 -217459
8245 -217459 -149621 -125450 -152307 -80026 -30322 -35810 -102835 -133508 -56280 75158 176117
8234 176117 245144 87647 21836 94778 167069 168018 173674 189476 165202 17195 -130491 -106056
8222 -106056 40651 19588 52821 -54114 -217039 -290238 -248780 -101511 -90099 -138986 -187994
8211a87994j7650N3864Q4396m0924N2219K01997N7675m3453p6177q9695J07781
8200A02039N0762n5790L0441M2379J8962J6734k6326j18234p8368o5230n2246
8189a34877K0863J16645m072l4634J0407k52k2978j32318k8378J17382J71378
8178G9166N7475O8704N4982j53181r4167m4237o7639J4445p2579k1058L0025J73636
8166B5572q6872j2922L7241n2242o0314o9801O0864L6426n759r5049R4859M2277
8154h5720Q4473L6972j6930n0145J1472p2780P4255N6031J12773L7665O48P3571
8142B62285k4245p8768j72987j2923l7418L9829r9668l0913n8179N3007Q4574
8131g5406P4051J5409m892Q355j05144L544L3061r9111p4274l5508k8199M8389
$$ plain form
8211 -187994 -205644 -151780 -67384 -108308 -56089 145908 203583 160130 83953 -5742 102039
8200 102039 152801 97011 127452 169831 188793 205527 179201 60967 -17401 -82631 -134877
8189 -134877 -114014 2631 -1441 -36075 -25668 -25920 -48898 -181216 -209594 -92212 79166
8178 79166 136641 205345 260327 107146 12979 -31258 -98897 -84452 -157031 -178089 -148064 25572
8166 25572 -61300 -74222 -36981 -89223 -149537 -219338 -158474 -122048 -127807 -222856 -127997 -85720
8154 -85720 -1247 35725 18795 -31350 -19878 -92658 -18403 37628 150401 188066 188714 262285
8142 262285 238040 159272 -13715 -26638 -64056 -24227 -123895 -154808 -212987 -159980 -75406
8131 -75406 -1355 14054 9162 17517 -87627 -84083 -51022 -150133 -224407 -259915 -288114 -239725
8119b39725L8O6771K1952m6642J08455N3271O0948m9966M3841M3711l526K5695
8107H4823j8847J00193J5114L2629r7960j68819l6610J0883m2902k5545N1992
8096i5049P2557L7373j8713l2020O3365M5839Q862M9828K7931n1187n060k4431
8084G9295j01315J16267R2885K0826l6371J4320J6899m0805j61268j61737l1563
8073a92567j6747O2454k1155q0169M5172p6375r660r4544m1643J37485J17759
8062a69990L62J3029R881k7429K1931n7638N4150J06014J5167J0456J87612k800
8050A60745j17782o6235j22928Q1564J21890O5624l1224j02609J4804N6452n8628
8039A673o5347m8823j8084O4295J73127Q0157m4724j21091j5925J58681r584n0848
$$ plain form
8119 -239725 -239687 -172916 -150964 -197606 -89151 -35880 25068 -24898 18943 62654 59128 84823
8107 84823 65976 166169 181283 213912 115952 -52867 -89477 -78594 -121496 -147041 -95049
8096 -95049 -22492 14881 -3832 -35852 27513 73352 82214 132042 159973 108786 103726 79295
8084 79295 -22020 94247 187132 207958 171587 185907 202806 162001 733 -161004 -192567
8073 -192567 -209314 -146860 -168015 -248184 -203012 -279387 -289047 -383591 -425234 -287749 -169990
8062 -169990 -169628 -156599 -146718 -174147 -152216 -209854 -155704 -49690 -34523 -24067 163545 160745
8050 160745 42963 -23272 -146200 -64636 57254 122878 91654 -10955 3849 60301 1673
8039 1673 -63674 -112497 -130581 -66286 106841 186998 142274 21183 5258 163939 154355 103507
8027A03507n9151j49347J9550N0103M6676l8877O015l2312Q0104K4706k6012r3671
8015f8709L2166K9929k4865k5568m8944o9680K872R6458P9481k7153p207k0778
8003e1998n9364J11872K2923O9090K467l7351m9844O984o9338j03696J9571J4627
7991a24057M949R4318k3435m5664N7846P2506R7926l5625j56221p2732P7634K03710
7979A51155P3180k8973l026n4512M0332l2195O0178l684j66855M4732L3688K989
7967A17009O9442J05619n485j97998r4804n4016l3115L8879n009K7387O4770K2911
7955E5590J1441N6659M5206R878L3763J2992r9765j06809N4265m8514k7241P5129
7943G2594M3544n773n5633J3777n5621l9280M0087r3261k0577J32474j95809N7254
$$ plain form
8027 103507 44356 -104991 -85441 -35338 11338 -27539 -21524 -53836 26268 50974 24962 -68709
8015 -68709 -36543 -6614 -31479 -57047 -105991 -175671 -172799 -76341 3140 -24013 -31220 -51998
8003 -51998 -111362 510 23433 92523 94990 57639 7795 14779 -54559 -158255 -138684 -124057
7991 -124057 -119108 -24790 -48225 -93889 -36043 36463 134389 98764 -57457 -130189 -52555 151155
7979 151155 224335 195362 192336 137824 178156 145961 206139 202455 35600 80332 114020 117009
7967 117009 186451 292070 286585 88587 -6217 -60233 -93348 -54469 -59478 -32091 32679 55590
7955 55590 67031 123690 168896 178774 212537 225529 125764 18955 73220 24706 -2535 72594
7943 72594 116138 110365 54732 68509 12888 -26392 13695 -79566 -100143 32331 -163478 -106224
7931a06224Q2362q2180J00860M3969L4202N4756P3634j7955k2726k5384j10631
7920B4683M4714p200k1871k066l6630k5036L7995k3896q3549l7757M5064L1811
7908e3738r0293q3568J25050J55814l7016M9824O8378p1687p7143j9845J7017
7897a7207j1534j0758l5925m3819L9121K4535k4538j9355J19819Q1297M798K2266
7885A28700j34807K6118O132Q729J0821j27723L8688J19389m107j8744Q616j52
7873F1660j66630l9059J14829P5391L6867P0107m1836l0096O5321J40080J1264
7862B97898r0903k3316l6227k6602j12923n1872k8359n3330J75754P022n1149
7851E993m0075P9292l0830n5466P2670M649o4504L5556j8516k3363M3752O2405
$$ plain form
7931 -106224 -23862 -106042 -5182 38787 72989 127745 201379 183424 160698 135314 24683
7920 24683 69397 62197 40326 38260 1630 -23406 14589 -9307 -92856 -130613 -85549 -53738
7908 -53738 -144031 -227599 -102549 53265 16249 66073 134451 62764 -14379 -34224 -17207
7897 -17207 -28741 -39499 -75424 -119243 -80122 -55587 -80125 -99480 20339 101636 106434 128700
7885 128700 -6107 20011 26143 34872 45693 -82030 -43342 76047 71940 53196 61812 61660
7873 61660 -104970 -144029 -29200 46191 83058 153165 111329 81233 146554 286634 297898
7862 297898 206995 183679 147452 120850 7927 -43945 -72304 -125634 50120 57142 5993
7851 5993 -34082 45210 14380 -41086 31584 36233 -28271 7285 -11231 -34594 9158 71563
7839G1563o7894J5986O0030j1022L0968m5208j12210J33627k514j11288n0290
7828h8252L2989N7635k6348j11787K1109Q7978J08221P017j2979K8998q8196j7446
7816a061l8250l1180J6877j2843M1423P1005O1039m9317j1124n8569j31237l0617
7804a73854N1170J51152O4060K488r0200p7225l3135L99R7588Q7431p5086l8594
7792c3806k7499k8139Q3398j1863j64814q7663N5340Q0713p3252l2606p4950L6010
7780b79131L0153O0424N9688M5977P1643q1670l0895k8377n2865P4284J00557
7769c0212N235j1942n6310M3300M6618k1781o943M4435q8299l8178p438k5637
7757a47152K3104m5449K8908L8762M8662O9198q404k2316l7202k699q0224O9225
$$ plain form
7839 71563 3669 19655 79685 68663 99631 54423 -57787 75840 73326 -37962 -88252
7828 -88252 -55263 2372 -23976 -135763 -114654 -26676 81545 88562 75583 104581 16385 -1061
7816 -1061 -39311 -70491 -53614 -66457 -25034 45971 107010 57693 46569 -12000 -143237 -173854
7804 -173854 -122684 28468 92528 95016 4816 -72409 -105544 -105145 -7557 79874 4788 -33806
7792 -33806 -61305 -89444 -6046 -17909 -182723 -270386 -215046 -134333 -207585 -240191 -315141 -279131
7780 -279131 -248978 -188554 -128866 -82889 -11246 -92916 -123811 -152188 -205053 -130769 -30212
7769 -30212 -24977 -36919 -93229 -49929 -3311 -25092 -32035 12400 -75899 -114077 -121515 -147152
7757 -147152 -124048 -169497 -140589 -101827 -53165 16033 7629 -14687 -51889 -54588 -134812 -65587
7745f5587N9022j25519j02728O3862J45944J02706k069l2436k0275n3075l5833
7734f5988J47699N6073o6534M4305n5292j35686j40857o3440K0800L0092R5965
7723a32863K32414j1338j09110j09940q3222M9271o6838P3780J21312j23872M6895
7712a13511J03763K6440P529r7889K833N57J3221O08r0890Q4419L1417M1585J39761
7699A49843K0185m9747o6599q8843k4008J53834q1648j64189j03334K5641M3172
7688a85693J35106O6534j7836L0881j00907l5328O9195M3376P1138M6541o8809
7677E4198M156J02948j51860j63670o0501J10339R9828M0126m5196J2123k8777
7666b6286j40567m6026Q1325O4249j0276O3521M8864o5082n14n2392n6562r991
$$ plain form
7745 -65587 -6565 -132084 -234812 -170950 -25006 77700 75631 43195 22920 -30155 -65988
7734 -65988 81711 137784 71250 115555 60263 -75423 -216280 -279720 -258920 -228828 -132863
7723 -132863 99551 88213 -20897 -130837 -214059 -164788 -231626 -157846 -36534 -160406 -113511
7712 -113511 -9748 16692 24221 -73668 -70835 -70278 -57057 -56449 -147339 -62920 -31503 10082 149843
7699 149843 170028 120281 53682 -35161 -59169 94665 13017 -151172 -254506 -228865 -185693
7688 -185693 -50587 15947 -1889 28992 -71915 -107243 -38048 5328 76466 123007 54198
7677 54198 58354 161302 9442 -154228 -214729 -104390 -4562 35564 -9632 2491 -26286
7666 -26286 -166853 -212879 -131554 -67305 -77581 -14060 34804 -30278 -30792 -83184 -139746 -149737
7654a49737J32800j2j17397m3746K5565J11908M3687l8611N0255k0191M4374m6929
7642h034L301o6535n3015n1403j40008J3099L1137J3237M5022L2543j60267Q5909
7630b55014j0823J06328R0902k3416Q628q607n1814p5663l897J460k0812J85293
7618e7435J59732q960j09409j02178q7453m7009n8949m155J8389J55238J81257
7607C9068R141l9034n3840N5774P6619M6427r0111r7950M8320K2306j14738J3418
7595h4600J0714J1414q1082q3877j35708m9153M7191J33610Q6059J06125K2343
7584a6964P681j01560P437M2272m443R745l0980K2030K0838j55652N1364K1234
7572a26998n5322P9845Q195p3264j4616K30555l6615j53979M8929n2954n4512
$$ plain form
7654 -149737 -16937 -16949 -134346 -178092 -152527 -40619 3068 -35543 14712 -5479 38895 -8034
7642 -8034 -4733 -71268 -124283 -175686 -315694 -302595 -271458 -258221 -213199 -180656 -340923 -255014
7630 -255014 -265837 -159509 -68607 -92023 -83395 -92002 -143816 -219479 -223376 -221916 -242728 -57435
7618 -57435 102297 93337 -16072 -118250 -205703 -252712 -311661 -315816 -297427 -142189 39068
7607 39068 48209 9175 -44665 11109 87728 134155 44044 -53906 -5586 16720 -98018 -84600
7595 -84600 -73886 -62472 -143554 -227431 -363139 -412292 -365101 -231491 -145432 -39307 -16964
7584 -16964 -9283 -110843 -103406 -61134 -65577 -55832 -86812 -64782 -43944 -199596 -148232 -126998
7572 -126998 -182320 -102475 -94280 -167544 -182160 48395 11780 -142199 -93270 -146224 -200736
7561b00736N6603L7202p460J15214J02517p804j8625l1491o3374O0942J54473
7550A97461q4893j67477o5041k9915l5389J11191L1207m7735R1841R2070l2945
7539F0375K4681M3801N564k5350l5763l9062o9887p7822o732k4382N6902l3259
7527a20934L9859p2369l8107K02106o402Q134k6966Q2622N6340N9704J3965j44827
7515E3125j17024o9509m789O956q0657r409J58849J56812R9677q6122j58498j10783
7503a61372j5626K7023j59542N3079P4895J36996Q4455O085k1404l4904l371J00345
7491H6659N3952m020j39078j76L9893M2351j6609j58639N844J00901K9185J0367
7479E0630j08623J0444J52759N6553J8052K850o2899q6067M3940R1870M6200K0538
$$ plain form
7561 -200736 -144133 -106931 -114391 823 103340 95536 76911 45420 -17954 42988 197461
7550 197461 112568 -54909 -119950 -149865 -185254 -74063 -42856 -90591 1250 93320 60375
7539 60375 85056 128857 134421 109071 73308 34246 -35641 -113463 -120195 -144577 -87675 -120934
7527 -120934 -81075 -153444 -191551 10555 4153 12287 -14679 67943 124283 183987 197952 53125
7515 53125 -63899 -133408 -138197 -131241 -211898 -221307 -62458 94354 194031 107909 -50589 -161372
7503 -161372 -176998 -149975 -309517 -256438 -181543 -44547 39908 45993 24589 -10315 -13686 86659
7491 86659 140611 136591 -2487 -2663 37230 79581 62972 -95667 -89823 11078 40263 50630
7479 50630 -57993 -47549 105210 161763 179815 182665 119766 33699 77639 169509 215709 236247
7467B36247n0241k45717r261j5445o8869Q044L0461J55662j14632j15074p475
7456a96300J0397N9882n9474M6362N4871m0607m4385P6726J05614q5831o3931
7445a36676R5639m5539j04342J2878j3464K0141o238J4076J77901o2590j20218
7434a68432J0967r8408o0088R5868J77889J109j9482l0301O1166J7550J06690
7423I4528P5339n6952o1612p7210p7885o4852j06841K5075O4075K7816M3968l2757
7411a47308L5542N7529o4666m803J7418J42790r6524l6350J60802P3393j8238
7400A19585k4192M8981p8519j25205L5110L1555J991j30413k6572O7062k2769
7389a03386p7566O1865O3158N2777R4346J2541j10368k981m9447J1383l6904M7640
$$ plain form
7467 236247 186006 -59711 -68972 -84417 -153286 -145242 -114781 40881 -73751 -188825 -196300
7456 -196300 -185903 -126021 -185495 -139133 -84262 -124869 -169254 -92528 13086 -72745 -136676
7445 -136676 -41037 -86576 -190918 -178040 -191504 -171363 -177601 -163525 14376 -48214 -168432
7434 -168432 -157465 -255873 -315961 -220093 -42204 -41095 -60577 -90878 -29712 -12162 94528
7423 94528 169867 112915 51303 -25907 -103792 -168644 -275485 -250410 -186335 -158519 -114551 -147308
7411 -147308 -111766 -54237 -118903 -123706 -106288 36502 -60022 -96372 64430 137823 119585
7400 119585 95393 144374 65855 -59350 -24240 7315 9306 -121107 -147679 -80617 -103386
7389 -103386 -180952 -119087 -55929 -3152 91194 103735 -6633 -9614 -59061 -47678 -84582 -36942
7377c6942L3948m4776L6619L9711o1192l8876r9703O511O0206Q423J69435j5690
7365E7674j48643j2533J27773N4662K9990J9134j64991K3395P9643j28554q4879
7354a47329l5724M5619J16088P151O0714m756N127j1083o6084J5878P8178P757
7342G1536q7862p3619N5157P6363l6439m1804N1891L7246p3748k3032J276M3588
7330E53q4089j22263J1567J82121J18839J06743j17951l4669n7168l1706q3232
7319a11255j55612J38826J37656j18981M6257J40769n8745o782l7387l8571J7046
7308d6779N2691N007m6263n3829P5547k317r5432k4097Q393p5917O687R5542l7097
7295a37864l4535n125L114L7273L8479j47256l2232l2458K7910J74031J41925
$$ plain form
7377 -36942 -2994 -47770 -11151 28560 -32632 -71508 -171211 -164700 -104494 -96071 73364 57674
7365 57674 -90969 -103502 24271 78933 108923 128057 -36934 -13539 66104 -62450 -147329
7354 -147329 -183053 -137434 -21346 -14195 46519 41763 46890 35807 -30277 -14399 63779 71536
7342 71536 -16326 -89945 -34788 41575 5136 -36668 15223 52469 -21279 -44311 -43035 553
7330 553 -83536 -205799 -194232 -12111 106728 213471 95520 60851 3683 -28023 -111255
7319 -111255 -266867 -128041 9615 -109366 -63109 77660 18915 12133 -25254 -63825 -46779
7308 -46779 5912 10919 -35344 -89173 -13626 -15943 -111375 -135472 -127079 -202996 -196309 -100767 -137864
7295 -137864 -172399 -177524 -174410 -137137 -98658 -245914 -278146 -310604 -282694 -108663 33262
7284C3262R6749P871j64480n8573P6872j995j33066N4356Q8027O0885r4268k86503
7272c20863r8070N7341J52747L9302n4198n3439J9682Q580Q1544J50847R8651
7261H2124j58550l6132n8411k3524J40108J01734P4167j27707n6406M6887j9499
7250c5209o8422J1168n7595Q5642M8751j21206q586J20688j144K2388m7460m9743
7238a00728R846N0195J4157J02232M1450J1638n4203p8355j37654K341k4584M6825
7226a16840l205R2432M0718p5946p5236k0656J05531j3821j82088L2658K51660
7215C5207N2036p443P5643q9605j48440J8179J31188m1429j18422m9527p5679
7204b18292n156N914p5886k8769N0892L9528m8061l7735O0095J44622J48677R2407
$$ plain form
7284 33262 130011 137882 -26598 -85171 -8299 -10294 -143360 -89004 -977 59908 -34360 -320863
7272 -320863 -418933 -361592 -208845 -169543 -223741 -277180 -257498 -248918 -167374 -16527 82124
7261 82124 -76426 -112558 -170969 -194493 -54385 47349 121516 -6191 -62597 -15710 -35209
7250 -35209 -103631 -92463 -150058 -64416 -15665 -136871 -145457 -24769 -25913 -3525 -50985 -100728
7238 -100728 -90882 -40687 -26530 75702 117152 128790 74587 -3768 -141422 -139081 -163665 -116840
7226 -116840 -120045 -27613 13105 -62841 -138077 -158733 -53202 -67023 -249111 -216453 35207
7215 35207 87243 79800 155443 65838 -82602 -64423 66765 25336 -93086 -142613 -218292
7204 -218292 -223448 -217534 -293420 -322189 -271297 -231769 -279830 -317565 -257470 -112848 35829 128236
7192A28236L6489r8510p6536r7141k9218K4592L6858J16860Q5395m9633l0706
7181D6686m5102L5869j08857j36347k3008J1800O3808O1681j8133q7331J4043
7170a84891L1135J7717p5765J02598J12113R37l4381p1485O2985J906n9961r0297
7158a87389J9083J04238Q3914j127J9295O7925q6823q1230m9072o4363Q725P9881
7146h6943L2880J09801q8915p4183K0156N3987M3365P0020O950M286M3806oj17726
7133A7478J3802J28480n361q3895j04265j00855J09698k1010p9145P5753N9929
7122A0609n2586j68160m1440k5547P8994K5141L1498J24339o2284r5046J8310
7111a56172J8909J45343M3488j8005K4368m2022r6941k4338n0825L4903p5521
$$ plain form
7192 128236 164725 66215 -10321 -107462 -136680 -112088 -75230 41630 127025 77392 46686
7181 46686 1584 37453 -71404 -207751 -230759 -218959 -155151 -93470 -111603 -198934 -184891
7170 -184891 -153756 -136039 -211804 -109206 2907 3844 -30537 -102022 -39037 -37131 -97092 -187389
7158 -187389 -168306 -64068 19846 18719 38014 105939 19116 -62114 -111186 -175549 -166824 -86943
7146 -86943 -54063 55738 -33177 -107360 -87204 -33217 10148 80168 87118 91404 135210 135204 17478
7133 17478 31280 159760 154399 70504 -33761 -134616 -24918 -45928 -125073 -49320 10609
7122 10609 -41977 -210137 -251577 -277124 -198130 -172989 -141491 -17152 -79436 -174482 -156172
7111 -156172 -137263 8080 51568 33563 57931 15909 -81032 -105370 -156195 -121292 -196813
7100a96813j72289j7165J26364R4647N0852M9348Q7055k4065j14458P4540K8126
7089a3858N0413q136R487J897j00061J2597Q319j04678L7472L7988n5194m2025
7077a65779l6757J00383J70188n7166q729k0737r2424o1739P4696L8855p7229
7066a36438n768Q8181O035j35592j7427K01102R5679O0528M3304j37436k16287
7055a54119J6613R4190L3489j7615m6137j28792K7147L1885Q3896K2663J1462
7044b5318j08863K3193k1996k8315N074q199N2256L5071P021J25383q9441n610
7032c9744l170p3395P3340l8774R9n3359m639o6781N9823O2099M544q8128L6636
7019a31449n3115k600n7077N9568Q5326j4574J4134n1347o0495j02206N7571J20512
$$ plain form
7100 -196813 -369102 -386267 -259903 -165256 -114404 -65056 21999 -2066 -116524 -41984 -13858
7089 -13858 36555 28419 37906 39803 -60258 -47661 -39342 -144020 -106548 -68560 -123754 -165779
7077 -165779 -202536 -102153 68035 10869 2140 -18597 -111021 -172760 -98064 -59209 -136438
7066 -136438 -142206 -54025 -47990 -183582 -201009 93 95772 156300 199604 62168 -154119
7055 -154119 -137506 -43316 -9827 -27442 -73579 -202371 -175224 -143339 -59443 -36780 -25318
7044 -25318 -134181 -110988 -132984 -161299 -156225 -164424 -112168 -77097 -70076 55307 -34134 -39744
7032 -39744 -42914 -116309 -42969 -81743 -81644 -135003 -139642 -206423 -146600 -84501 -79957 -168085 -131449
7019 -131449 -184564 -187164 -244241 -184673 -99347 -113921 -99787 -151134 -211629 -313835 -256264 -135752
7007a35752q495J5457P8734M2489O562j06832j53087r7990l7621N6484J02749
6996b37302Q5961r7917M8995Q1257k2927o4532r3910j7485J16960N2027L177R6622
6984d9074k085J2647N6229m2155j05493k9937N4377J53214m0734P418N7660R3081
6972A65148q8558L8278r371k9932K9137o0360M0827r156j0181l8090j7678j6756
6960f692l4414P3460j29043o0015p286Q0877J62342k0883r4236K614L2287j7657
6948a8646J31237P9580k2588o909l7044J13150l8447r9651m7693P9096N0566p8349
6936A04302k9566j6544O4848J32301m874r2923j51992r7538k4951k5021q7512
6925b29470J14666J90935J19391o9937p5652o8904o9140m2872J63160J10556q9327
$$ plain form
7007 -135752 -144247 -128790 -50056 -7567 -1005 -107837 -260924 -358914 -396535 -340051 -237302
6996 -237302 -151341 -249258 -200263 -119006 -141933 -206465 -300375 -317860 -200900 -148873 -145696 -49074
6984 -49074 -51159 -38512 17717 -24438 -129931 -159868 -105491 47723 6989 14407 72067 165148
6972 165148 76590 114868 105497 75565 104702 44342 85169 76013 65832 27742 10064 -6692
6960 -6692 -41106 32354 -96689 -156704 -163990 -83113 79229 58346 -35890 -33276 -989 -18646
6948 -18646 112591 192171 169583 162674 125630 238780 200333 100682 52989 132085 182651 104302
6936 104302 74736 58192 123040 255341 250467 157544 5552 -91986 -116937 -141958 -229470
6925 -229470 -114804 76131 195522 125585 49933 -18971 -88111 -130983 32177 142733 53406
6914E3406m5032l8572o6686l0271j2013N4789m2889Q311l6791l8419k4263J03480
6902a14950J2051j3025L1832Q5407m0466j35574P0802J13701j5645l3364M652
6891c4579m255o1301K2930q4548M5809N8293P3093K7117n4864j6737m2073j4303
6879h5418J2057P986j9854j18877q387J22061J20851Q524j20501J10326P2968
6868A01736r0676j08861l5509j25018J7560L6650O3034K7220l5687j3164j5038
6857a77753K7699J33884J04119l7468M9408p2513Q262q561p2676n4984k6898m515
6845a31996L0306O520L5777j5254j89375Q4147O4857j2685j7778J50347J21198
6834A26064l1664j6077m6188q6001j0953P2405m4844l7519Q3263K0467r351O696
$$ plain form
6914 53406 8374 -30198 -96884 -127155 -139168 -84379 -127268 -118957 -155748 -194167 -218430 -114950
6902 -114950 -102899 -115924 -84092 1315 -39151 -174725 -103923 9778 -5867 -39231 -34579
6891 -34579 -38834 -100135 -77205 -161753 -115944 -57651 15442 42559 -12305 -29042 -71115 -85418
6879 -85418 -73361 -65375 -85229 -204106 -212493 -90432 30419 38943 -81558 28768 101736
6868 101736 11060 -97801 -133310 -258328 -240768 -204118 -141084 -113864 -149551 -162715 -177753
6857 -177753 -150054 -16170 87949 50481 99889 27376 35638 27077 -45599 -100583 -127481 -131996
6845 -131996 -101690 -95170 -59393 -74647 -264022 -179875 -115018 -127703 -145481 4866 126064
6834 126064 94400 78323 32135 -53866 -64819 7586 -37258 -74777 8486 28953 19602 26298
6822B6298L6688J993j7167p73n3027K6172O3735P7990Q5014k4189o1139j95589
6810c3994k9606l3957J5576R6785n0744M3563m5922j0730M4213q0655J9613L4860
6798c0998n3359m4796J28055L5756n3672m8740N6043N9257l7909j01564k9127
6787a21054N4927J15959n983n8112M0312q7547l917K5817L982k9865K6005Q7844
6775D8368K7266j44836j47571r62L9987J86928N3919o4049r6463j6425o6332r7166
6763b77336P3078L6374o7396L5787R4936n757p7947O23Q8070M0313R0411k5385
6751E771j04125n594N7603N5793N54n3529P0453o0200r9965K2101J80601l1075
6739C8388k397Q4322J03997J1529j1886r570l3390o4356l2523R4712r0367j8813
$$ plain form
6822 26298 62986 64979 47812 47039 -5988 20184 83919 161909 246923 222734 161595 -33994
6810 -33994 -63600 -97557 -81981 14804 -35940 7623 -38299 -49029 -4816 -85471 -65858 -30998
6798 -30998 -84357 -129153 -1098 34658 -19014 -67754 -11711 47546 9637 -91927 -121054
6787 -121054 -66127 49832 43849 -14263 26049 -61498 -65415 -39598 -35616 -65481 -39476 48368
6775 48368 75634 -69202 -216773 -217735 -177748 9180 63099 -950 -97413 -113838 -180170 -277336
6763 -277336 -204258 -167884 -235280 -199493 -104557 -110314 -188261 -187638 -99568 -59255 31156 5771
6751 5771 -98354 -103948 -46345 9448 10002 -43527 26926 -33274 -133239 -111138 69463 38388
6739 38388 35991 120313 224310 235839 223953 214383 180993 116637 84114 178826 88459 69646
6727F9646J42059j84498j24266R8808J24161m3129Q0584Q7451J22416K08793L40324
6716I22349M99999R19653J248277O69870n25213j163880r59630o50227l78873
6707E82325k02584r7436n3818n5828j02003J6780J47822j02627j31748O7579M2046
6696A10508j12871p5199R385O3864R9485r7584l7469N0175J01076O4209R602j07611
6684G7570j9730K3500R9355k08376k09073k1432M6778L8480J26999J37547J38793
6673B30411M4213k3328j37509q5946l1720k9450q4602n6193m931m0573R0923O2295
6661f6410j9535P1213P0999n7354j01081K957J16766P6707p2123m0763L271M1936
6649B6583j7043o0227l1094K4404L8836M2823j7375n0919R5090L8760J4830r1689
$$ plain form
6727 69646 211705 27207 -97059 1749 125910 82781 163365 250816 373232 582025 922349
6716 922349 1422348 2342001 3590278 4260148 3734935 2571055 1611425 961198 582325
6707 582325 379741 282305 228487 172659 70656 87436 235258 132631 883 68462 110508
6696 110508 -2363 -77562 -68177 -4313 95172 -2412 -39881 10294 111370 175579 185181 77570
6684 77570 57840 81340 180695 -27681 -236754 -258186 -211408 -172928 -45929 91618 230411
6673 230411 274624 251296 113787 27841 -3879 -33329 -117931 -174124 -179055 -219628 -128705 -66410
6661 -66410 -85945 -14732 56267 -1087 -102168 -99211 17555 94262 22139 -18624 -15353 26583
6649 26583 9540 -50687 -81781 -57377 -18541 24282 6907 -44012 51078 89838 104668 12979
6637A2979N159Q4142j15208K2352j18446l3663m9591J04850Q5311j57381p8732
6626b38228L5409O4329j9231J3155N0252K1995N4048n7942j8069N1630K5638Q7926
6614G0912k3591j4566K0040j17789L5678N809q9713O809n1642j3475q0839q463
6602b60830K20861J08696r8356p0783K2132J28815M3110j03784l0213j8451L500
6591e5303N859P8496q482M4229K13572l5325j20255N7822l3651j30619l8634j03283
6579a25574J12663R2375J0608j80611J5087M3130J9609k0725j1072n0322p9882
6568a74714N7566J24490n4801o038k5768J6113R9598Q2196P190m701j41435j22852
6556a43156R6258Q690p9731j55375l4045K0363O1892K1104L4948k8076m8628J04742
$$ plain form
6637 12979 18138 102280 -12928 9424 -109022 -142685 -192276 -87426 -2115 -159496 -238228
6626 -238228 -202819 -138490 -157721 -144566 -94314 -72319 -18271 -76213 -94282 -42652 -17014 70912
6614 70912 47321 32755 52795 -64994 -29316 -23507 -113220 -106411 -158053 -171528 -252367 -260830
6602 -260830 -39969 68727 -29629 -100412 -78280 50535 93645 -10139 -40352 -58803 -55303
6591 -55303 -49444 29052 20570 64799 278371 243046 122791 180613 146962 16343 -22291 -125574
6579 -125574 -12911 79464 90072 -90539 -75452 -32322 -12713 -33438 -44510 -94832 -174714
6568 -174714 -117148 7342 -47459 -53497 -79265 -63152 36446 118642 125832 121131 -20304 -143156
6556 -143156 -46898 -38208 -117939 -273314 -307359 -286996 -225104 -204000 -169052 -197128 -245756 -141014
6544a41014J35294M9165r1469L0350J07016j0248J9198Q129n6812m0915J9954
6533B8648N016o8645r6449J23756J11195p2247j32390q6907M1325J31469N917
6522i312M6557P2744p3545o0983j20398o716K1626Q5876J8703p7491P5044R1711
6510F3816K2939j9466j6373l884n2564j40681l8783O7962k5001P0719k134r1815
6498a65265l5017N6164L057J24379R2145m1138o2546o7975j2396m1403R1401O4438
6486E844j3744K6181P1408j5766j01922K0165j09869Q384L443P728n5453N1991
6474a01610j0563j0121J10980R3914J15965M9188j33507o3906n9455M249k3274
6463b8140O9760O055r2223M575r038j0424N4764j3648l2223O2002K951L3684k0778
$$ plain form
6544 -141014 -5720 43445 -48024 -17674 89342 79094 98292 106421 49609 8694 28648
6533 28648 33664 -34981 -131430 -7674 103521 31274 -101116 -188023 -146698 -15229 -9312
6522 -9312 37245 109989 36444 -24539 -144937 -151653 -130027 -44151 -25448 -102939 -27895 63816
6510 63816 86755 67289 50916 47032 -5532 -146213 -184996 -117034 -142035 -71316 -73450 -165265
6498 -165265 -200282 -144118 -141061 -16682 75463 34325 -28221 -96196 -108592 -149995 -58594 5844
6486 5844 -7900 18281 89689 73923 -27999 -7834 -117703 -109319 -105876 -98148 -153601 -101610
6474 -101610 -112173 -122294 -11314 82600 198565 247753 114246 50340 -9115 -4866 -28140
6463 -28140 41620 47675 -44548 -39973 -49011 -59435 -4671 -18319 -50542 11460 14411 48095 27317
6450B7317m487M7320N9697k0164M4555k8699J8715p3106r2886n63N1763j76021
6438a46559j501J52155J0110r2620k4896O324M7633M7747m3714k177j5069l2864
6426i5431J20043R0139M2653J5609n5832N3583J07754K0618r7904j42532p189
6415E1511m324l7607Q7588r1426j21197J12372J0291l2238k1476o4285J2728N3962
6403d4101J42152o163L1208Q5763n8023j09028j9736K5791j2954P7722j1080m4511
6391E7040J0494q6740j11275q4449j9664j38398R4288l2853j00038L9550J76389
6380a95656J87425j09L1868O6819o5700j33350l7881N0761o535J3354M0450n6544
6368a05098r9318Q7152p134o6863j6407O1142J07733j7582l1307J6576N1626p5500
$$ plain form
6450 27317 22830 70150 129847 109683 154238 125539 144254 71148 -21738 -22301 29462 -146559
6438 -146559 -148060 4095 14205 -78415 -103311 -96987 -49354 -1607 -45321 -47498 -62567 -95431
6426 -95431 24612 114751 157404 173013 117181 170764 278518 299136 201232 58700 51511
6415 51511 47187 9580 97168 5742 -115455 -3083 7208 -25030 -46506 -110791 -98063 -44101
6403 -44101 98051 91888 123096 208859 150836 41808 22072 47863 34909 112631 101551 57040
6391 57040 67534 -19206 -130481 -214930 -234594 -372992 -278704 -311557 -411595 -372045 -195656
6380 -195656 -8231 -8340 23528 90347 24647 -108703 -146584 -95823 -102358 -89004 -48554 -105098
6368 -105098 -204416 -117264 -124398 -191261 -207668 -146526 -38793 -56375 -87682 -71106 -19480 -94980
6356i4980o5818k0968O3002Q9632P144l7114l3040K2675L2854p7819k1847N1861
6344h4418K5377J25124k2854r9118P448O1299j6521j8877l4603n398Q7252R7630
6332A22341k9490j31038j00578L3199O5702P5631o722m1906j46537o6018L0725
6321a94691J30020Q8255N0402r3417m4250L4176p769J20047k765m1931r5565j3564
6309g1052P2851K9085j53626q6623J01958R5811J2217o9949j06877L9638O9449
6298f7118J07558n4093j3242J7578Q2840k1525O860P0586k5591k4617M4877J309
6286A25422j0428j55668r2038J07128k824k2135J55099P3845l029n7410p1777
6275D6185l9170r925n2355P7175N9943O714J03541L5549r9193j85729L2656j406
$$ plain form
6356 -94980 -160798 -181766 -118764 -29132 -21988 -59102 -92142 -69467 -36613 -114432 -136279 -84418
6344 -84418 -59041 66083 43229 -55889 -48441 12858 -3663 -22540 -57143 -62541 24711 122341
6332 122341 92851 -38187 -138765 -105566 -39864 35767 29045 -12861 -159398 -225416 -194691
6321 -194691 -64671 23584 73986 -19431 -63681 -29505 -37274 82773 80008 38077 -57488 -71052
6309 -71052 1799 30884 -122742 -209365 -107407 -11596 621 -69328 -176205 -136567 -67118
6298 -67118 40440 -13653 -26895 -9317 73523 51998 58858 129444 103853 79236 124113 125422
6286 125422 114994 -40674 -132712 -25584 -28408 -50543 104556 178401 175372 117962 46185
6275 46185 7015 -2910 -55265 21910 81853 88567 192108 227657 128464 -57265 -24609 -26015
6263b6015j14983L9680J17404J03176j81711o1445Q8760L6399M840J7968K6288
6252E0361l246J40593q9890j91860j3082J35934K6786j6179l2330o2484k6551
6241h1948M0436J4748K3464r857M2948j2888p1802j5932R3656L3315K2835J5232
6229I4207J9696l1610J0173Q2613M8485p8700n4053p1507m3192j55694P0077Q7998
6217b1507n3234r9687j2575N531L9731J74767k3587n1885l0367N54o1207N097
6205a28369J15045k9473m7119j8523J33792k6015j36993j4956P4552Q4998J3267
6194B0206O0590k6379j94742k861N9572J8282L0850J04788o6121N3416J0603l1115
6182C7089N1102O316m9426l1869K5277K7517J271l4809K1920R3993n8655n2589
$$ plain form
6263 -26015 -140998 -101318 16086 119262 -62449 -123894 -35134 1265 6105 24073 50361
6252 50361 47115 187708 97818 -94042 -107124 28810 55596 39417 7087 -55397 -81948
6241 -81948 -41512 -26764 -3300 -13157 29791 16903 -54899 -70831 22825 56140 78975 94207
6229 94207 113903 82293 92466 175079 223564 144864 90811 19304 -23888 -179582 -109505 -21507
6217 -21507 -74741 -174428 -187003 -181472 -141741 33026 9439 -42446 -72813 -72259 -133466 -128369
6205 -128369 -13324 -42797 -89916 -108439 25353 -662 -137655 -152611 -78059 6939 20206
6194 20206 80796 54417 -140325 -143186 -83614 -65332 -34482 70306 4185 57601 68204 37089
6182 37089 88191 94507 45081 13212 38489 66006 67277 32468 54388 148381 89726 37137
6170C7137M0947k2631j06800J1782N2019m0687r3512j22246J6802N5648J19002
6159e2539J86194N635l3622J36722K259j92597j3974j35881o3362l0070j20835
6148c12070J3700Q4658P2657L3984m753R9764J17219L1674L3706n3553j59906
6137d2920J231n376l5432P3101m5344K0830J3374O4588j5084o0527m2403j9231
6125i3193j19771n2846J29558J69640O6876n0706r747l6021j6428L653L722k1070
6113b6333q7893l9806J990M3261K2566J46514L7974k2965n340K7030p2399o3269
6101c8670p0916p348K7459K7646L0202O6993J8022M1842q810P7698N2040p9663
6089A36495p0153m1624m4265J29348k5027m6526K0788j5887j54066o9818P7835
$$ plain form
6170 37137 78084 55453 -51347 -39565 12454 -28233 -121745 -243991 -227189 -171541 -52539
6159 -52539 133655 139290 105668 242390 244649 52052 38078 -97803 -161165 -191235 -312070
6148 -312070 -298370 -213712 -141055 -107071 -111824 -12060 105159 136833 170539 116986 -42920
6137 -42920 -41689 -47065 -82497 -9396 -54740 -33910 -20536 44052 28968 -31559 -73962 -93193
6125 -93193 -212964 -265810 -136252 33388 100264 49558 39811 3790 -12638 -8985 -5263 -26333
6113 -26333 -114226 -154032 -152042 -108781 -86215 60299 98273 75308 69968 96998 24599 -38670
6101 -38670 -109586 -116934 -89475 -61829 -31627 35366 53388 95230 86420 164118 216158 136495
6089 136495 66342 24718 -19547 109801 84774 38248 59036 43149 -110917 -180735 -102900
6078a02900q989O206L8770p8955m7422j2781J13801k8381m5277K7721p8573J2874
6066b03906J32062n3704M2404J12740k4418j44496P7349M3948q105K8513J7877
6055B0264O0775q7547Q0791J5295o4756p6226r0652L5500M3098K9317k0391J5598
6043c8934l5904l7386k748L0001R6283o2541p8618R3547R2147P761K2855j09637
6031b3174j60139Q4072K0744r1512r6891N4175O0310R164J29275J26164p6624
6020C5564n1673k0545j55685M7569O396q3070J81249P0647m3724p0867Q231J3195
6008f2713J0741L6188q9049J9677l8296K0920Q574P3449R5255m859j31568j1263
5996g2944j5935L0690l6451k3708M1635j15437l8437Q3038J33863q1551j33098
$$ plain form
6078 -102900 -111889 -105683 -66913 -145868 -193290 -206071 -92270 -120651 -165928 -138207 -216780 -203906
6066 -203906 -71844 -125548 -83144 29596 5178 -139318 -61969 -18021 -26126 2387 20264
6055 20264 81039 -6508 74283 89578 24822 -51404 -142056 -106556 -63458 -34141 -54532 -38934
6043 -38934 -74838 -112224 -114972 -84971 11312 -51229 -129847 -36300 55847 63608 86463 -23174
6031 -23174 -183313 -99241 -78497 -170009 -266900 -212725 -152415 -143251 -13976 112188 35564
6020 35564 -16109 -36654 -192339 -144770 -138374 -221444 -40195 30452 -13272 -84139 -75908 -62713
6008 -62713 -51972 -15784 -104833 -85156 -123452 -102532 -93958 -20509 74746 69887 -61681 -72944
5996 -72944 -88879 -58189 -94640 -118348 -76713 -192150 -230587 -147549 -13686 -95237 -228335
5985b28335J35371O0482R7883k2334J6987J8963o6995n7230k6547r216l2519r521
5973a23011J40516K535m4291l1880p4698M6999J22377j95504j10022o982O9676
5962b04285K48706R6019J9092K8931n5609k2298q9147n8155O8990k6033j634l5859
5950c1282K0190P0207O718J14148J854o8535j9360L420L672j3367r3706l9782
5938d5823j6950n1877M904L528Q8282j22386j33874P6837L3879O6760R5723P1292
5926G0295Q4853j6163L4926n3719n8633j901P6213r8392j81596L9625K2618K3728
5914e8146K6580Q2072N6570P4338n2283k961l8585N2574Q7394n2562p3716j03782
5902b507M4776J47401o7677j48088j04070M298l384o5898L8167K3302l9968j38928
$$ plain form
5985 -228335 -92964 -32482 65401 43067 60054 79017 12022 -45208 -71755 -80971 -113490 -123011
5973 -123011 17505 20040 -24251 -56131 -130829 -83830 38547 -156957 -266979 -273961 -204285
5962 -204285 44421 140440 159532 188463 132854 110556 21409 -36746 32244 6211 4577 -31282
5950 -31282 -11092 59115 65833 179981 181835 113300 93940 97360 101032 87665 -6041 -45823
5938 -45823 -62773 -114650 -109746 -106218 -17936 -140322 -274196 -197359 -163480 -96720 -997 70295
5926 70295 155148 138985 173911 120192 61559 59658 135871 37479 -144117 -104492 -81874 -58146
5914 -58146 -31566 50506 107076 181414 129131 126170 87585 140159 227553 174991 101275 -2507
5902 -2507 42269 189670 121993 -26095 -130165 -125867 -129251 -195149 -156982 -133680 -173648 -312576
5890c12576o5420M0548J09337K04485O3862m1236j11816k1772j0581Q1567N3673
5879i929m9253l3317O7219k6430p7444l1270Q9673J7211l591J5773L2033Q4185
5867G4860O6710l9788m8356r321J9925Q1074n7923j30780k1620l1640J02011N3742
5855E8894J14811p893j73479r067Q2964N708n6577N4478N9617n3039m9702m3413
5843a6698O82J03140K0446j12302N9616o2194o0922O7054Q6301p9083j7157K7177
5831A6060j9793M4478J04891R8555q1264n4648l1670j41884o4836N9151N1811
5820a9149J02868J5638j42829j03760m7531Q9831P1751L4160m8263j14800j0365
5809a72449J12570M6078P0331r6227K4754K8142M513J4591J08840P8163m856j63001
$$ plain form
5890 -312576 -377996 -337448 -228111 -23626 40236 -1000 -112816 -134588 -145169 -63602 -9929
5879 -9929 -59182 -92499 -25280 -51710 -129154 -160424 -70751 -53540 -57131 -41358 -9325 74860
5867 74860 141570 101782 53426 44105 64030 145104 87181 -43599 -65219 -96859 5152 58894
5855 58894 173705 165812 -7667 -16734 66230 71938 15361 69839 129456 76417 26715 -16698
5843 -16698 -16016 87124 107570 -4732 54884 -7310 -68232 -1178 85123 6040 -11117 16060
5831 16060 -3733 40745 145636 244191 162927 108279 76609 -65275 -130111 -70960 -19149
5820 -19149 83719 99357 -43472 -147232 -194763 -104932 -33181 979 -47284 -162084 -172449
5809 -172449 -59879 -13801 56530 -39697 -14943 13199 17712 32303 141143 219306 214450 51449
5797E1449j31578m3708k458J2327K5437m265n5873m6834R206k6266J1573J62217
5785c8773J16929p1302q0060k6560R5579N1598J9323J60704j01197k14582p3024
5774a61365N92j04808J41123J92506Q0565l5440j8799j15969j2924K1643l6941
5763d9817L3673n3160p2051j15483O3084R4766L158N0712m5737L0931j5968n2849
5751a28741N6467L7720l7011M8044J5421K8315R5271k7057J9516j83205j00708
5740a75968J29283J06089n3844r2142k3833N6330M5287q6857n6436J3861K07295
5729F9065l1773k5229J7563j2744j64384j42193L7814N4423J71555J34332n2847
5718E5582j01078l1754L148Q0611J93592j5434n162j15904m0296L6582q4367j28851
$$ plain form
5797 51449 -80129 -123837 -126295 -113968 -88531 -92796 -148669 -195503 -186297 -212563 -200990 -38773
5785 -38773 78156 6854 -73206 -99766 -4187 47411 66734 227438 126241 -88341 -161365
5774 -161365 -160773 -265581 -124458 68048 148613 113173 94374 -21595 -34519 -12876 -49817
5763 -49817 -16144 -69304 -141355 -256838 -193754 -98988 -95830 -45118 -90855 -59924 -75892 -128741
5751 -128741 -72274 -34554 -71565 -23521 -8100 20215 115486 88429 107945 -75260 -175968
5740 -175968 -46685 59404 5560 -86582 -110415 -54085 -8798 -95655 -152091 -138230 69065
5729 69065 37292 12063 29626 16882 -147502 -289695 -251881 -197458 -25903 108429 55582
5718 55582 -45496 -77250 -74102 6509 200101 184667 179505 63601 23305 59887 -24480 -153331
5706a53331M1379J51523q470m2864L4447o8258m3078J21841K2780m4527m6651
5695c5209n3729k1060J04286J6845K8108J9197N441K7268q8546N5208j0879n6881
5683i951J41901N3642n3637j06107p7054N1140O8067J489r7187j7199Q842L311
5671c2743M4606n5284j11954N1340l999l8039K9086n3189R1539P453N3618Q6922
5659F9356l6296l0882n2062J8987J5487N2037k7880N9389r3524j07867p1547q9534
5647b94336P4306M3689r622P5508J19942R6619M9793j20953p5122K2097M060n36
5635a4555r463k2302J9774R1317n5602o7088j5205l4792j33380O2694J44974J7216
5623a6412K540J602N4278j9796p1766n4203O5555P0308L3055o238q4693l9199
$$ plain form
5706 -153331 -111952 39571 31101 -11763 22684 -45574 -88652 33189 55969 11442 -35209
5695 -35209 -88938 -109998 -5712 11133 39241 58438 63879 91147 2601 57809 46930 -9951
5683 -9951 131950 185592 131955 25848 -51206 -66 68001 69490 -27697 -44896 -36054 -32743
5671 -32743 11863 -43421 -155375 -104035 -108034 -146073 -116987 -170176 -78637 -71184 -17566 69356
5659 69356 33060 2178 -49884 -30897 -15410 36627 8747 68136 -25388 -133255 -204802 -294336
5647 -294336 -220030 -176341 -185963 -110455 9487 106106 155899 34946 -40176 -18079 -14019 -14555
5635 -14555 -24018 -46320 -26546 64771 9169 -57919 -73124 -107916 -241296 -178602 -33628 -16412
5623 -16412 -13872 -12270 42008 22212 -49554 -103757 -38202 32106 65161 58923 -25770 -64969
5611f4969J1481o6761q4171M5220n5847k4004O1559N8705M3918n7859R381L3763
5599h9584M8323O2836O6556l2147J8022j5396m4581N4934K6476J6873k1167K0062
5587A11207K296o7941r0051p0924q115j9504M7028O8767K2998J02012R1137m3310
5575A45600m0970l5221o3029j31677l9313O2582P4858J1542N2879M6927M6190
5564A30368n3618l9532l3935M3609J6913O046L744j15943q8833L4508L5674o6391
5552a27390o2474n2970l129k5003r047P582L7006J51508J19094M8303j62208n1939
5540a30667R0719J26743L7520K5111r2383J1393P7869j4232j32549j15141j09160
5529b24777J22509O9168K5694q358J2428R5356n8624K6033N9445l6422J7364J2090
$$ plain form
5611 -64969 -53488 -120249 -204420 -159200 -215047 -239051 -177492 -118787 -74869 -132728 -123347 -89584
5599 -89584 -41261 21575 88131 55984 74006 58610 14029 68963 95439 112312 91145 111207
5587 111207 113503 45562 -44489 -115413 -123528 -143032 -96004 -27237 -4239 97773 188910 145600
5575 145600 104630 69409 6380 -125297 -164610 -102028 -27170 -15628 37251 84178 130368
5564 130368 76750 37218 3283 46892 63805 69851 73595 -42348 -131181 -96673 -60999 -127390
5552 -127390 -189864 -242834 -245963 -270966 -280013 -272431 -235425 -83917 35177 83480 -78728 -130667
5540 -130667 -39948 86795 124315 149426 57043 68436 146305 132073 -476 -115617 -224777
5529 -224777 -102268 -33100 -7406 -15764 -3336 92020 33396 59429 118874 82452 99816 111906
5517A11906k1549j4509M0891p698o7763j342J5570J55196n602r8913k337n1120
5505E2730j23747p7812O0292j188P477J5597J03384J5087r0759J7275R9258J67733
5493B45327N2143m1874j21925l3912o6347n7943P5290l5221r6506J6397Q5618
5482B1047l0329l9384O5937n128j1953p6466n69J42651K6713n4095j73265r2923
5470b27764o252r556J14718J31952L7944j2481j00736j2034l9573P5674p832K123
5458e3817L0098p7845J5919N3371k2846R0398N024k3711l9450k7516K0540N9311
5446B9476O047j40659j02317k0709J65732J27548R1059O397o8192m5182l181P5836
5434A21855q2243r4837p1184m9398O0803O2068J37429M839L0677q2314o1605P4629
$$ plain form
5517 111906 90357 75848 116739 109041 41278 39936 55506 210702 205100 106187 103850 52730
5505 52730 -71017 -148829 -88537 -89725 -82248 -66651 36733 51820 -38939 -21664 77594 245327
5493 245327 297470 255596 133671 99759 33412 -24531 50759 15538 -80968 -64571 21047
5482 21047 -9282 -48666 17271 12143 190 -76276 -76845 65806 92519 38424 -134841 -227764
5470 -227764 -234016 -243572 -128854 3098 41042 28561 -72175 -84209 -123782 -48108 -55940 -53817
5458 -53817 -23719 -101564 -85645 -32274 -55120 35278 40302 16591 -22859 -50375 -29835 29476
5446 29476 35523 -105136 -207453 -228162 -62430 65118 156177 162574 94382 49200 46019 121855
5434 121855 39612 -55225 -126409 -175807 -115004 -52936 84493 89332 120009 37695 -23910 50719
5422E0719J1045o532o7738j9022l0711l3266n5436k5626j01175L7803P1484P4548
5410i3907J10192K8623j03415j22769k1971J17090L9190q297l2990q8486p5988
5399b52728L8628Q1836q488m4892O0661O1616P7471J03431r9149p2402j0115J4795
5387d9336M2254J3758j1141N6434M0227M2496n7905n8387l3533m9081j3q842L6413
5374c6656m0882L412L8377Q5152o4962K1935O8433J12727J72625K7297q4380k32889
5362G0189k08286O488L5550O9896m049K091J0032j06686L5507N3652j5239J9241
$$ plain form
5422 50719 61764 55232 -12506 -31528 -62239 -95505 -150941 -176567 -277742 -239939 -168455 -93907
5410 -93907 16285 44908 -58507 -181276 -203247 -86157 -46967 -55264 -88254 -176740 -252728
5399 -252728 -214100 -132264 -140752 -185644 -124983 -63367 14104 117535 18386 -54016 -64131 -49336
5387 -49336 -7082 6676 -4465 51969 92196 134692 76787 18400 -15133 -64214 -64227 -73069 -36656
5374 -36656 -77538 -74126 -35749 49403 -15559 6376 74809 187536 360161 387458 303078 70189
5362 70189 -138097 -131609 -96059 -26163 -30212 -28121 -18089 -124775 -89268 -35616 -50855 -31614
$$ [...]
##END NTUPLES=NMR SPECTRUM
##END=
