##TITLE=Analysis number 327836
Compound Code cc 50526
Book Reference 521/43
Project Code adrs
Chemist Name evam
##JCAMPDX= 6.0         $$ Bruker NMR JCAMP-DX V2.0
##DATA TYPE= NMR SPECTRUM
##DATA CLASS= NTUPLES
##ORIGIN= Bruker BioSpin GmbH
##OWNER= nmr
$$ XWIN-NMR		Version 3.5
$$ Thu Apr 12 09:23:32 2007 GMT Daylight Time (UT+1h)  MAYBRIDGE\nmr@NMR_250MHZ
##.OBSERVE FREQUENCY= 250.131544655141
##.OBSERVE NUCLEUS= ^1H
##.ACQUISITION MODE= SIMULTANEOUS (DQD)
##.ACQUISITION SCHEME= undefined
##.AVERAGES= 16
##.DIGITISER RES= 18
##SPECTROMETER/DATA SYSTEM= dpx250
##.PULSE SEQUENCE= zg30
##.SOLVENT NAME= CDCl3
##.SHIFT REFERENCE= (INTERNAL, CDCl3, 0, 16.4498)
##AUDIT TRAIL= $$ (NUMBER, WHEN, WHO, WHERE, WHAT)
$$ ##TITLE= Audit trail, XWIN-NMR		Version 3.5
$$ ##JCAMPDX= 5.01
$$ ##ORIGIN= Bruker BioSpin GmbH
$$ ##OWNER= nmr
$$ C:\u/data/dgb/nmr/ADRS/1130/pdata/1/auditp.txt
$$ ##AUDIT TRAIL=  $$ (NUMBER, WHEN, WHO, WHERE, WHAT)
(   1,<2007-04-12 09:23:11.49 +100>,<MAYBRIDGE\nmr>,<NMR_250MHZ>,
      <created by zg, POWCHK disabled, PULCHK disabled
       configuration hash MD5:
       49 4B E0 1D 92 C2 6B 37 9F E6 65 BC 52 41 86 1D
       data hash MD5: 64K
       A5 2C 02 11 3A A4 48 21 74 2A 8D 6D 8E E4 E9 77>)
(   2,<2007-04-12 09:23:24.20 +100>,<MAYBRIDGE\nmr>,<NMR_250MHZ>,
      <Start of raw data processing
       ef LB = 0.3 FT_mod = 6 PKNL = 1 SI = 32K 
       data hash MD5: 32K
       A5 46 8F 67 3A 09 17 3A BA 9D F0 A1 B8 44 84 CD>)
(   3,<2007-04-12 09:23:25.92 +100>,<MAYBRIDGE\nmr>,<NMR_250MHZ>,
      <apk 
       data hash MD5: 32K
       AE 75 9C A6 3D 85 38 0B 6D DE 22 1C C0 AD 3C FE>)
(   4,<2007-04-12 09:23:26.62 +100>,<MAYBRIDGE\nmr>,<NMR_250MHZ>,
      <abs ABSG = 5 
       data hash MD5: 32K
       EC DD 2C 1F 5A 49 05 C3 EF 9C 25 1F CB A8 7A D2>)
$$ ##END=
$$ 
$$ hash MD5
$$ 25 8B CB C3 E1 98 62 A2 BB 83 91 C1 7C F7 28 71
##$RELAX= 
##$RELAX= 
##$RELAX= 
##$RELAX= 
##$RELAX= 
##$RELAX= 
##$RELAX= 
$$ Bruker specific parameters
$$ --------------------------
##$DU= <C:\u>
##$EXPNO= 1130
##$NAME= <ADRS>
##$PROCNO= 1
##$TYPE= <nmr>
##$USER= <dgb>
##$AMP= (0..31)
100 100 100 100 100 100 100 100 100 100 100 100 100 100 100 100 100 100 
100 100 100 100 100 100 100 100 100 100 100 100 100 100 
##$AQSEQ= 0
##$AQ_mod= 3
##$AUNM= <au_zg>
##$AUTOPOS= <52 >
##$BF1= 250.13
##$BF2= 250.13
##$BF3= 250.13
##$BF4= 250.13
##$BF5= 500.13
##$BF6= 500.13
##$BF7= 500.13
##$BF8= 500.13
##$BYTORDA= 1
##$CFDGTYP= 0
##$CFRGTYP= 5
##$CHEMSTR= <none>
##$CNST= (0..31)
1 1 145 1 1 1 1 1 1 1 1 1 1 1 1 1 1 1 1 1 1 1 1 1 1 1 1 1 1 1 1 1 
##$CPDPRG= <>
##$CPDPRG1= <>
##$CPDPRG2= <>
##$CPDPRG3= <>
##$CPDPRG4= <mlev>
##$CPDPRG5= <mlev>
##$CPDPRG6= <mlev>
##$CPDPRG7= <mlev>
##$CPDPRG8= <mlev>
##$CPDPRGB= <>
##$CPDPRGT= <>
##$D= (0..31)
0 1 0 0 0 0 0 0 0 0.06 0 0 0 0 0 0 0.0002 0 0 0 0 0 0 0 0 0 0 0 0 0 0 
0 
##$DATE= 1176366190
##$DBL= (0..7)
120 120 120 120 120 120 120 120 
##$DBP= (0..7)
150 150 150 150 150 150 150 150 
##$DBP07= 0
##$DBPNAM0= <>
##$DBPNAM1= <>
$$ [...]
##$SUBNAM7= <"">
##$SUBNAM8= <"">
##$SUBNAM9= <"">
##$SW= 20.6930455092707
##$SWIBOX= (0..15)
0 0 3 0 0 0 0 0 0 0 0 0 0 0 0 0 
##$SW_h= 5175.983436853
##$TD= 65536
##$TD0= 1
##$TE= 683.16
##$TE2= 300
##$TE3= 300
##$TEG= 300
##$TL= (0..7)
0 120 120 120 120 120 120 120 
##$TP= (0..7)
150 150 150 150 150 150 150 150 
##$TP07= 0
##$TPNAME0= <>
##$TPNAME1= <>
##$TPNAME2= <>
##$TPNAME3= <>
##$TPNAME4= <>
##$TPNAME5= <>
##$TPNAME6= <>
##$TPNAME7= <>
##$TPOAL= (0..7)
0.5 0.5 0.5 0.5 0.5 0.5 0.5 0.5 
##$TPOFFS= (0..7)
0 0 0 0 0 0 0 0 
##$TUNHIN= 0
##$TUNHOUT= 0
##$TUNXOUT= 0
##$USERA1= <user>
##$USERA2= <user>
##$USERA3= <user>
##$USERA4= <user>
##$USERA5= <user>
##$V9= 5
##$VALIST= <valist>
##$VCLIST= <CCCCCCCCCCCCCCC>
##$VD= 0
##$VDLIST= <DDDDDDDDDDDDDDD>
##$VPLIST= <PPPPPPPPPPPPPPP>
##$VTLIST= <TTTTTTTTTTTTTTT>
##$WBST= 1024
##$WBSW= 4
##$XGAIN= (0..3)
0 0 0 0 
##$XL= 0
##$YL= 0
##$YMAX_a= 220816
##$YMIN_a= -304972
##$ZGOPTNS= <>
##$ZL1= 120
##$ZL2= 120
##$ZL3= 120
##$ZL4= 120
##$ABSF1= 16.44982
##$ABSF2= -4.243353
##$ABSG= 5
##$ABSL= 3
##$ALPHA= 0
##$AQORDER= 0
##$ASSFAC= 0
##$ASSFACI= 0
##$ASSFACX= 0
##$ASSWID= 0
##$AUNMP= <proc_1d>
##$AZFE= 0.1
##$AZFW= 0.1
##$BCFW= 0
##$BC_mod= 0
##$BYTORDP= 0
##$COROFFS= 0
##$CY= 12.5
##$DATMOD= 1
##$DC= 0
##$DFILT= <>
##$DTYPP= 0
##$F1P= 14.0000005364418
##$F2P= -0.99999901652339
##$FCOR= 0.5
##$FTSIZE= 32768
##$FT_mod= 6
##$GAMMA= 0
##$GB= 0
##$INTBC= 1
##$INTSCL= 1
##$ISEN= 128
##$LB= 0.3
##$LEV0= 0
##$LPBIN= 0
##$MAXI= 10000
##$MC2= 0
##$MEAN= 0
##$ME_mod= 0
##$MI= 0
##$NCOEF= 0
##$NC_proc= -6
##$NLEV= 6
##$NOISF1= 0
##$NOISF2= 0
##$NSP= 0
##$NTH_PI= 0
##$NZP= 0
##$OFFSET= 16.44982
##$PC= 1
##$PHC0= 236.4249
##$PHC1= 6.225454
##$PH_mod= 1
##$PKNL= yes
##$PPARMOD= 0
##$PSCAL= 4
##$PSIGN= 0
##$REVERSE= no
##$SF= 250.13001805235
##$SI= 32768
##$SIGF1= 0
##$SIGF2= 0
##$SINO= 400
##$SIOLD= 32768
##$SREGLST= <1H.CDCl3>
##$SSB= 0
##$STSI= 32768
##$STSR= 0
##$SW_p= 5175.98343685301
##$SYMM= 0
##$S_DEV= 0
##$TDeff= 65536
##$TDoff= 0
##$TI= <Analysis number 999999
Compound Code 99
Book Reference 9
Project Code 9>
##$TILT= no
##$TM1= 0
##$TM2= 0
##$TOPLEV= 0
##$USERP1= <user>
##$USERP2= <user>
##$USERP3= <user>
##$USERP4= <user>
##$USERP5= <user>
##$WDW= 1
##$XDIM= 32768
##$YMAX_p= 461304515
##$YMIN_p= -1331984
$$ End of Bruker specific parameters
$$ ---------------------------------
##NTUPLES= NMR SPECTRUM
##VAR_NAME=  FREQUENCY,     SPECTRUM/REAL,   SPECTRUM/IMAG
##SYMBOL=    X,             R,               I
##VAR_TYPE=  INDEPENDENT,   DEPENDENT,       DEPENDENT
##VAR_FORM=  AFFN,          ASDF,            ASDF
##VAR_DIM=   32768,         32768,           32768
##UNITS=     HZ,            ARBITRARY UNITS, ARBITRARY UNITS
##FACTOR=    0.157963299565203, 1,           1
##FIRST=     4114.59366470616, 0,            0
##LAST=      -1061.38977214685, 0,           0
##MIN=       -1061.38977214685, -1331984,    0
##MAX=       4114.59366470616, 461304515,    0
$$ Real data points
##PAGE= N=1
##DATA TABLE= (X++(R..R)), XYDATA
$$ [...]
$$ plain form
17953 7889365 7606537 7250314 7171292 6926720 6818137 6628452 6544272 6403298 6013086 5706397
17943 5706397 5506759 5438827 5343601 5287359 5085878 5117439 5070559 4685023 4423096 4201430
17933 4201430 3869311 3982196 4218349 4070393 4112332 4337397 4015268 3814231 3969995 4157283
17923 4157283 3829683 3438364 3722427 3834282 3703428 3533502 3368933 3453858 3326241 3288093
17913 3288093 3299626 3078882 2817089 2867177 2532581 2324450 2492392 2656685 2294971 2505446
17903 2505446 2970268 2779252 2548259 2557370 2403816 2192943 2106243 2075569 1739096 1624781
17893 1624781 1728890 1928396 2295751 2177495 1891811 2041894 1977125 1708285 1736015 1845401
17883 1845401 1649061 1501422 1526287 1477910 1275267 1150798 1225493 1308023 1281187 1335240
$$ packed form
17953G889365k82828l56223p9022k44572j08583j89685q4180j40974l90212l06689
17943E706397j99638o7932r5226n6242k01481L1561m6880l85536k61927k21666
17933D201430l32119J12885K36153j47956M1939K25065l22129k01037J55764J87288
17923D157283l27600l91319K84063J11855j30854j69926j64569Q4925j27617l8148
17913C288093J1533k20744k61793N0088l34596k08131J67942J64293l61714K10475
17903B505446M64822j91016k30993R111j53554k10873q6700l0674l36473j14315
17893A624781J04109J99506L67355j18256k85684J50083o4769k68840K7730J09386
17883A845401j96340j47639K4865m8377k02643j24469P4695Q2530k6836N4053
$$ plain form
17873 1335240 1084331 1029595 1256447 1623316 1845840 1815724 1530189 1476658 1528775 1766048
17863 1766048 1727691 1519857 1487839 1779219 1793114 1553614 1326794 1481819 1849101 1896017
17853 1896017 1801600 1752951 1804002 1607629 1255975 1156782 1293691 1650104 1447041 1099421
17843 1099421 820426 821177 937698 1045518 1042499 1016119 1157300 1107800 960043 708096 394058
17832 394058 444753 868885 1288455 1463404 1354914 1142041 1003883 666131 1012417 1233376
17822 1233376 1469599 1728793 1469862 1158444 957724 788359 1067480 1173547 706464
17813 706464 407584 801169 923611 1347520 1552247 1384234 1263928 1325249 1151053 1179549
17803 1179549 925725 500621 517677 414124 630501 914250 1150262 1052143 471222 503137
$$ packed form
17873A335240k50909n4736K26852L66869K22524l0116k85535n3531N2117K37273
17863A766048l8357k07834l2018K91380J3895k39500k26820J55025L67282M6916
17853A896017r4417m8649N1051j96373l51654r9193J36909L56413k03063l47620
17843A099421k78995P51J16521J07820l019k6380J41181m9500j47757k51947l14038
17832C94058N0695M24132M19570J74949j08490k12873j38158l37752L46286K20959
17822A233376K36223K59194k58931l11418k00720j69365K79121J06067m67083
17813G06464k98880L93585J22442M23909K04727j68013j20306O1321j74196K8496
17803A179549k53824m25104J7056j03553K16377K83749K36012r8119n80921L1915
$$ plain form
17793 503137 769730 732131 659756 1074887 1331398 1463045 1574299 1408545 1366965 1433444
17783 1433444 1208822 810916 854005 737450 611128 511412 432080 457242 520177 606503
17773 606503 764870 863973 702664 401695 186312 70765 294966 748715 1021075 1027229
17763 1027229 949099 697183 967316 1204354 1132676 841832 667710 606757 787803 1078607
17753 1078607 1111370 925554 665281 726189 972760 1022450 1058912 1112175 703452 685356
17743 685356 575469 361400 511532 672910 605769 236264 322131 347678 252592 424075
17733 424075 400337 347563 300737 378710 322294 483969 524934 558904 639269 947147 968814
17722 968814 743304 808171 526856 394361 659900 695833 676816 298265 63425 34963
$$ packed form
17793E03137K66593l7599p2375M15131K56511J31647J11254j65754m1580O6479
17783A433444k24622l97906M3089j16555j26322r9716p9332K5162O2935Q6326
17773F06503J58367R9103j61309l00969k15383j15547K24201M53749K72360O154
17763A027229p8130k51916K70133K37038p1678k90844j74122o0953J81046K90804
17753A078607L2763j85816k60273O0908K46571M9690L6462N3263m08723j8096
17743F85356j09887k14069J50132J61378o7141l69505Q5867K5547r5086J71483
17733D24075k3738n2774m6826P7973n6416J61675M0965L3970Q0365L07878K1667
17722I68814k25510O4867k81315j32495K65539L5933j9017l78551k34840k8462
$$ plain form
17712 34963 179559 462566 257941 -86283 -51189 -73211 -133900 99181 296797 575574
17702 575574 610184 631151 574045 384717 411548 763235 658678 385569 346806 696992
17692 696992 1017377 545894 74521 25341 103016 -39043 -244919 114525 389227 133064
17682 133064 -113508 -131892 138850 205805 200559 166684 252146 17205 -339697 -56896 6594
17671 6594 20633 56575 267962 442212 546927 578469 709405 605535 548703 293033 361029
17660 361029 698113 687381 520111 518704 710083 723787 603739 192495 251050 23207
17650 23207 -33204 45692 24038 -118325 108077 392025 528722 654850 627932 411544
17640 411544 399010 688329 1017150 963452 860315 697585 1312392 1602027 1584423 1689253
$$ packed form
17712C4963J44596K83007k04625l44224L5094k2022o0689K33081J97616K78777
17702E75574L4610K0967n7106j89328K6831L51687j04557k73109l8763L50186
17692F96992L20385m71483m71373m9180P7675j42059k05876L59444K74702k56163
17682A33064k46572j8384K70742O6955n246l3875Q5462k34941l56902K82801O3490
17671F594J4039L5942K11387J74250J04715L1542J30936j03870n6832k55670O7996
17660C61029L37084j0732j67270j407J91379J3704j20048m11244N8555k27843
17650B3207n6411P8896k1654j42363K26402K83948J36697J26128k6918k16388
17640D11544j2534K89319L28821n3698j03137j62730O14807K89635j7604J04830
$$ plain form
17630 1689253 1978754 2112477 2641517 2570194 2181277 1359026 818356 909297 1163278 1043165
17620 1043165 729989 476777 672217 546405 458445 265591 432373 472671 244817 195474
17610 195474 316363 611308 652436 665830 636933 237906 -100468 -185444 105442 -81694
17600 -81694 -139950 -92490 256738 594123 602816 515666 267269 95058 215946 215380 322398
17589 322398 132401 51532 371457 485880 514910 301178 222240 517389 425131 211894
17579 211894 212938 -16752 -192757 -715452 -662194 -410647 -213737 -275778 -243137 -109184
17569 -109184 16657 84328 504343 542719 700593 418283 237788 279920 460738 537219
17559 537219 517329 486457 527192 116777 -252251 -165490 39970 59808 235017 562961
$$ packed form
17630A689253K89501J33723N29040p1323l88917q22251n40670R0941K53981j20113
17620A043165l13176k53212J95440j25812q7960j92854J66782M0298k27854m9343
17610A95474J20889K94945M1128J3394k8897l99027l38374q4976K90886j87136
17600h1694n8256M7460L49228L37385Q693q7150k48397j72211J20888n66J07018
17589C22398j89997q0869L19925J14423K9030k13732p8938K95149r2258k13237
17579B11894J044k29690j76005n22695N3258K51547J96910o2041L2641J33953
17569a09184J25841O7671M20015L8376J57874k82310j80495M2132J80818P6481
17559E37219j9890l0872M0735m10415l69028Q6761K05460J9838J75209L27944
$$ plain form
17549 562961 725870 1181430 849803 455069 574593 533277 518718 688140 433647 606434
17539 606434 727628 484676 567276 908823 772704 695857 875675 1056361 1254305 1195218
17529 1195218 1445681 1649394 1536333 989787 502043 334658 260740 406601 162695 97956
17519 97956 -100978 -253948 -81755 -155029 -151506 117561 183446 166608 371795 349195 344262
17508 344262 550789 673342 770882 684449 635782 761096 875396 976362 1034452 1206886
17498 1206886 1282993 1082248 502772 300797 108909 368051 902920 919177 941596 592873
17488 592873 398972 314365 418614 149137 27274 47942 389130 635093 495174 439950
17478 439950 301000 37836 86740 245697 341314 266688 182193 280459 208383 68771 111776
$$ packed form
17549E62961J62909M55560l31627l94734J19524m1316j4559J69422k54493J72787
17539F06434J21194k42952Q2600L41547j36119p6847J79818J80686J97944n9087
17529A195218K50463K03713j13061n46546m87744j67385p3918J45861k43906o4739
17519I7956j98934j52970J72193p3274L523K69067O5885j6838K05187k2600m933
17508C44262K06527J22553R7540q6433m8667J25314J14300J00966N8090J72434
17498A206886P6107k00745n79476k01975j91888K59142N34869J6257K2419l48723
17488E92873j93901q4607J04249k69477j21863K0668L41188K45963j39919n5224
17478D39950j38950k63164M8904J58957R5617p4626q4495R8266p2076j39612M3005
$$ plain form
17467 111776 -95913 -134172 -375744 -510061 -462089 -269036 137554 -75228 -71510 -125755
17457 -125755 -171042 -267177 200111 458374 294590 -136459 -191021 -209427 -34569 80094
17447 80094 82759 805956 1352762 1473747 1584577 2015662 2462036 2363160 1562403 966128
17437 966128 557621 202054 -99995 -261509 -325635 -339194 -198086 6937 85237 -191326
17427 -191326 -428312 -258515 198904 158648 21191 -139536 -210746 -11821 228210 33554
17417 33554 -10707 219133 249007 -86657 65231 459418 325672 12209 -105418 138924
17407 138924 254144 286050 230928 341782 213958 -18597 31968 -125143 -395952 -558306
17397 -558306 -511134 -286769 -79679 20820 121500 -19408 -170755 -309864 -354909 162737
$$ packed form
17467A11776k07689l8259k41572j34317M7972J93053M06590k12782L718n4245
17457a25755m5287r6135M67288K58263j63784m31049n4562j8406J74858J14663
17447H0094K665P23197N46806J20985J10830M31085M46374r8876q00757n96275
17437I66128m08507l55567l02049j61514o4126j3559J41108K05023P8300k76563
17427a91326k36986J69797M57419m0256j37457j60727p1210J98925K40031j94656
17417C3554m4261K29840K9874l35664J51888L94187j33746l13463j17627K44342
17407A38924J15220L1906n5122J10854j27824k32555N0565j57111k70809j62354
17397e58306M7172K24365K07090J00499J00680j40908j51347j39109m5045N17646
$$ plain form
17387 162737 302273 436598 251367 -214827 -562333 -506370 -406966 -368974 -190754 -259282
17377 -259282 46077 192593 156463 157801 243584 354390 113898 97784 -31661 47438 361482
17366 361482 297870 -118135 -94477 -291827 -487448 -275629 -131194 -57888 -60818 28063 156586
17355 156586 -163974 -72073 77199 -84079 33827 101555 -102476 -264637 -53562 114508
17345 114508 23680 -76052 -85822 53516 -111398 -1891 24140 -12141 -469872 -614330 -303878
17334 -303878 -127385 -297305 -592850 -591933 -218899 182735 41631 -173961 -457939 -822856
17324 -822856 -1036687 -782366 -464051 -360572 -47086 -90062 -180030 131612 76674 15635
17314 15635 17826 -56327 -62356 190727 41619 17970 149706 249833 314762 217008 106583
$$ packed form
17387A62737J39536J34325j85231m66194l47506N5963R9404L7992J78220o8528
17377b59282L05359J46516l6130J338Q5783J10806k40492j6114j29445P9099L14044
17366C61482o3612m16005K3658j97350j95621K11819J44435P3306k930Q8881J28523
17355A56586l20560R1901J49272j61278J17906O7728k04031j62161K11075J68070
17345A14508r0828r9732r770J39338j64914J09507K6031l6281m57731j44458L10452
17334c03878J76493j69920k95545R17L73034M01634j41104k15592k83978l64917
17324h22856k13831K54321L18315J03479L13486m2976q9968L11642n4938o1039
17314A5635K191p4153o029K53083j49108k3649J31736J00127O4929r7754j10425
$$ plain form
17303 106583 -247689 -494763 -315074 -17287 144061 255420 8125 -65069 -181708 -225420
17293 -225420 -68235 88453 -73885 -48264 -92010 174293 69749 36761 245304 274245
17283 274245 201754 303754 58714 -68089 13227 -77977 47373 84937 360086 553800
17273 553800 659260 626085 217325 50837 312919 428102 200752 -27326 -374024 -574012
17263 -574012 -378289 -175218 58141 -128453 -183997 75008 134649 -239754 -462928 -336490
17253 -336490 -119834 -121781 -2344 -73886 146967 174944 -112426 -280311 -50279 64658
17243 64658 216310 339484 5251 1390 -163717 -204467 -188805 -548252 -621760 -86896 -97722
17232 -97722 -98425 -185722 -111693 -222749 -380803 -543314 -203147 175078 258277 21291 -22924
$$ packed form
17303A06583l54272k47074J79689K97787J61348J11359k47295p3194j16639m3712
17293b25420J57185J56688j62338K5621m3746K66303j04544l2988K08543K8941
17283B74245p2491J02000k45040j26803Q1316r1204J25350L7564K75149J93714
17273E53800J05460l3175m08760j66488K62082J15183k27350k28078l46698j99988
17263e74012J95723K03071K33359j86594n5544K59005N9641l74403k23174J26438
17253c36490K16656j947J19437p1542K20853K7977k87370j67885K30032J14937
17243F4658J51652J23174l34233l861j65107m0750J5662l59447p3508N34864j0826
17232i7722p03q7297P4029j11056j58054j62511L40167L78225Q3199k36986m4215
$$ plain form
17221 -22924 -48079 1859 90809 496713 393196 422953 279333 316149 140908 -165429 -637270
17210 -637270 -508449 -231802 39465 132226 -30776 -2675 159651 524325 80389 69722
17200 69722 141690 254585 108822 -55933 121234 89820 465351 525666 331897 -72051
17190 -72051 -120581 -54407 27969 160532 247522 224230 13185 4191 -314834 -410023 -221077
17179 -221077 -421618 -523387 -641767 -687857 -631530 -578199 -296786 62231 355595 169999
17169 169999 -26397 261148 140658 -97537 -4655 -112655 -120465 119886 318268 -52096
17159 -52096 -329775 -199932 -146562 -318009 -220070 40943 305452 111586 124155 262680
17149 262680 189384 -79211 17618 304972 465778 270095 996 40571 -64693 103242
$$ packed form
17221b2924k5155M9938Q8950M05904j03517K9757j43620L6816j75241l06337m71841
17210f37270J28821K76647K71267R2761j63002K8101J62326L64674m43936j0667
17200F9722P1968J12895j45763j64755J77167l1414L75531O0315j93769m03948
17190g2051m8530O6174Q2376J32563Q6990k3292k11045q994l19025r5189J88946
17179b21077k00541j01769j18380m6090N6327N3331K81413L59017K93364j85596
17169A69999j96396K87545j20490k38195R2882j08000p810K40351J98382l70364
17159e2096k77679J29843N3370j71447R7939K61013K64509j93866J2569J38525
17149B62680p3296k68595R6829K87354J60806j95683k69099L9575j05264J67935
$$ plain form
17139 103242 367959 445907 226354 1693 186586 231864 218691 219355 385755 300956 297020
17128 297020 421573 367265 237077 32390 -35353 -374618 -39205 -214648 -353830 -194205
17118 -194205 -96522 1928 139265 453233 247151 -32682 249531 342282 271291 282658
17108 282658 155384 77939 82011 212573 366683 191075 -139211 -257411 -598029 -611025
17098 -611025 -196063 44592 184089 210937 -3582 -294850 -495857 -446148 -437471 -10039
17088 -10039 256731 288840 472844 356770 166085 212082 286022 170983 -177161 -368443
17078 -368443 -236035 26764 1991 -131310 -136028 -306215 -528293 -551571 -448337 -242096
17068 -242096 -293292 -281023 -237456 -259884 127450 265868 338496 168080 -46780 -192379
$$ packed form
17139A03242K64717P7948k19553k24661J84893M5278j3173O64J66400q4799l936
17128B97020J24553n4308j30188k04687o7743l39265L35413j75443j39182J59625
17118a94205R7683R8450J37337L13968k06082k79833K82213R2751p0991J1367
17108B82658j27274p7445M072J30562J54110j75608l30286j18200l40618j2996
17098f11025M14962K40655J39497K6848k14519k91268k01007M9709Q677M27432
17088a0039K66770L2109J84004j16074j90685M5997P3940j15039l48144j91282
17078c68443J32408K62799k4773j33301m718j70187k22078k3278J03234K06241
17068b42096n1196J2269M3567k2428L87334J38418P2628j70416k14860j45599
$$ plain form
17058 -192379 -438203 -345937 -534591 -468259 -422984 -373631 -497427 -436497 -602414 -500864
17048 -500864 -320449 -233831 -78289 144765 337624 320291 -48629 -362423 -599224 -608532
17038 -608532 -198181 240860 31545 -226698 -313025 -253267 122806 464069 98382 -82163
17028 -82163 311981 580128 628743 375771 -214158 -454800 -824103 -772386 -355398 -511781
17018 -511781 -988228 -780595 -274128 -95341 -52252 20646 48633 -2451 147761 279850
17008 279850 144182 -89957 -155000 119914 93649 155494 55656 211398 115814 7743
16998 7743 191231 221165 259493 -86176 -208133 -155102 -161384 -94027 -183444 49103 116336
16987 116336 168481 195758 -48519 -132738 42144 274979 327213 325106 62973 -108285 -449933
$$ packed form
17058a92379k45824R2266j88654O6332M5275M9353j23796O0930j65917J01550
17048e00864J80415Q6618J55542K23054J92859j7333l68920l13794k36801r308
17038f08532M10351M39041k09315k58243q6327N9758L76073L41263l65687j80545
17028h2163L94144K68147M8615k52972n89929k40642l69303N1717M16988j56383
17018e11781m76447K07633N06467J78787M3089P2898K7987n1084J50212J32089
17008B79850j35668k34139o5043K74914k6265O1845r9838J55742r5584j08071
16998G743J83488K9934L8328l45669j21957N3031o282O7357q9417K32547O7233
16987A16336N2145K7277k44277q4219J74882K32835N2234k107k62133j71258l41648
$$ plain form
16976 -449933 -266177 15049 316671 -109498 -640762 -307536 -153968 -149278 -71823 -175659
16966 -175659 -665678 -645845 -435822 30729 347692 341756 181348 -319100 -760475 -341693
16956 -341693 -244853 -471166 -207894 256977 641889 774822 765092 312248 220874 448461
16946 448461 950930 931958 405769 48456 -45848 -285265 -134567 -68687 -429438 -385908
16936 -385908 -402937 -141615 -59020 -218386 -49557 112634 -309610 -566601 -552059 -256066
16926 -256066 -187234 -242467 -262558 -49770 -82817 -182317 -277899 -87628 213480 438698 227705
16915 227705 -180552 -540959 -413492 -429137 -306642 52774 289547 210197 94256 61823
16905 61823 130164 -227961 -544591 -173599 -256872 -512384 -594034 -569734 -342595 -47311
$$ packed form
16976d49933J83756K81226L01622m26169n31264L33226J53568M690P7455j03836
16966a75659m90019J9833K10023M66551L16963n936j60408n00448m41375M18782
16956c41693R6840k26313K63272M64871L84912J32933r730m52844r1374K27587
16946D48461N02469j8972n26189l57313r4304k39417J50698O5880l60751M3530
16936c85908j7029K61322Q2595j59366J68829J62191m22244k56991J4542K95993
16926b56066O8832n5233k0091K12788l3047r9500r5582J90271L01108K25218k10993
16915B27705m08257l60407J27467j5645J22495L59416K36773p9350j15941l2433
16905F1823O8341l58125l16630L70992q3273k55512q1650K4300K27139K95284
$$ plain form
16895 -47311 244267 406215 -36426 -727413 -565653 -469900 -541166 -197259 165253 -2796
16885 -2796 -238094 33441 -135367 -248570 -319720 26950 152628 -283504 -369573 -99541
16875 -99541 -89255 -54342 -115928 -98172 -251390 -515712 -335316 97204 -122711 -555159
16865 -555159 -826128 -1082992 -904236 -353351 -133837 -284480 -648370 -228775 -174463 -384737
16855 -384737 -426699 -273140 -10126 20953 -6302 162457 123513 -190986 -455719 -401467
16845 -401467 -485635 -534724 -292501 -292783 -345369 -347749 -236091 -132515 -65977 -250141 -302450
16834 -302450 -128501 115866 -2205 -225431 -258327 -361694 -205027 -316003 -525821 -432750
16824 -432750 -229505 -134493 -264829 -26059 69308 -3227 -122033 -269441 -253970 -186338
$$ packed form
16895d7311K91578J61948m42641o90987J61760R5753p1266L43907L62512j68049
16885b796k35298K71535j68808j13203p1150L46670J25678m36132q6069K70032
16875i9541J0286L4913o1586J7756j53218k64322J80396M32520k19915m32448
16865e55159k70969k56864J78756N50885K19514j50643l63890M19595N4312k10274
16855c84737m1962J53559K63014L1079k7255J68759l8944l14499k64733N4252
16845d01467q4168m9089K42223k82n2586k380J11658J03576O6538j84164n2309
16834c02450J73949K44367j18071k23226l2896j03367J56667j10976k09818R3071
16824d32750K03245R5012j30336K38770R5367p2535j18806j47408J5471O7632
$$ plain form
16814 -186338 19699 -260644 -189275 -82283 -242235 -356555 -709526 -654900 -932383 -636967
16804 -636967 -60223 128967 -169098 -512749 -326500 -198239 -445957 -183902 -240432 30263
16794 30263 54354 131575 -157801 -387982 -640298 -598101 -642432 -712878 -599705 -488993 -553596
16783 -553596 -471368 -208564 -215600 -478908 -688005 -719756 -758468 -405274 -330002 -372649 -39611
16772 -39611 51593 2120 111934 293918 -59270 -200602 54069 324821 290050 -194364
16762 -194364 -421273 -474634 -758310 -539344 -223487 -407186 -369751 -82838 -115554 -230735
16752 -230735 -85930 -227709 -115542 3702 2188 218544 404645 406287 377213 27733
16742 27733 -6052 110125 228904 120184 -96021 73111 -9809 -116205 -181427 -95850
$$ packed form
16814a86338K06037k80343P1369J06992j59952j14320l52971N4626k77483K95416
16804f36967N76744J89190k98065l43651J86249J28261k47718K62055n6530K70695
16794C0263K4091P7221k89376k30181k52316M2197m4331p0446J13173J10712o4603
16783e53596Q2228K62804p036k63308k09097l1751l8712L53194P5272m2647L33038
16772c9611R1204m9473J09814J81984l53188j41332K54671K70752l4771m84414
16762a94364k26909n3361k83676K18966L15857j83699L7435K86913l2716j15181
16752b30735J44805j41779J12167J19244j514K16356J86101J642k9074l49480
16742B7733l3785J16177J18779j08720k16205J69132q2920j06396o5222Q5577
$$ plain form
16732 -95850 -149072 -122677 -46545 292587 237136 185653 119960 -33912 -9311 -31186 -75669
16721 -75669 -187163 -146375 30360 300055 440473 475825 291280 132421 -174609 -580793
16711 -580793 -733825 -374511 -20174 -146170 -345862 -509966 -465522 -310250 217708 94687
16701 94687 -199898 -280418 -101016 -47847 -23818 -51787 -67191 112780 5959 -208616 -140718
16690 -140718 -52094 134160 63207 -277215 -485872 -547202 -248231 -374940 -611751 -429261
16680 -429261 145787 352137 206490 402739 91184 -140016 -350479 -310607 -420583 -420425
16670 -420425 -250631 -276882 -61472 -9241 -315380 -556170 -240809 87318 357004 470031
16660 470031 440985 195614 227889 -25549 -190377 -499723 -610544 -233622 -236573 -427172
$$ packed form
16732i5850n3222K6395P6132L39132n5451n1483o5693j53872K4601k1875m4483
16721g5669j11494M0788J76735K69695J40418L5352j84545j58859l07030m06184
16711e80793j53032L59314L54337j25996j99692j64104M4444J55272N27958j23021
16701I4687k94585q0520J79402N3169K4029k7969j5404J79971j06821k14575O7898
16690a40718Q8624J86254p0953l40422k08657o1330K98971j26709k36811J82490
16680d29261N75048K06350j45647J96249l11555k31200k10463L9872j09976J58
16670d20425J69794k6251K15410N2231l06139k40790L15361L28127K69686J13027
16660D70031k9046k45371L2275k53438j64828l09346j10821L76922k951j90599
$$ plain form
16650 -427172 -435500 -465154 -525522 -870436 -718937 -233519 -15312 115575 407883 469801
16640 469801 535441 376807 404955 78485 -25718 326888 377022 174881 262489 442678
16630 442678 347266 233831 182126 213380 254449 170646 23476 25450 179100 297326 -99377
16619 -99377 -207957 -621747 -689343 -515876 -559739 -123453 34945 61519 238502 232148 -41064
16608 -41064 -163715 -324673 -418319 -329265 134000 124942 -69674 192470 244716 -230375 -356311
16597 -356311 -137736 -28074 214134 291918 258881 -16199 -372407 -154496 -271397 -361349
16587 -361349 -609503 -678078 -748972 -654566 -411387 -175804 -479584 -324300 -177492 18968
16577 18968 361169 333954 725501 709922 577320 757671 1040244 1103506 859520 733092
$$ packed form
16650d27172q328k9654o0368l44914J51499M85418K18207J30887K92308O1918
16640D69801O5640j58634K8148l26470j04203L52606N0134k02141Q7608J80189
16630D42678r5412j13435n1705L1254M1069q3803j47170J974J53650J18226l96703
16619i9377j08580m13790o7596J73467m3863M36286J58398K6574J76983o354k73212
16608d1064j22651j60958r3646Q9054M63265r058j94616K62144N2246m75091j25936
16597c56311K18575J09662K42208P7784l3037k75080l56208K17911j16901q9952
16587c61349k48154o8575p0894R4406K43179K35583l03780J55284J46808J96460
16577A8968L42201k7215L91547j5579j32602J80351K82573O3262k43986j26428
$$ plain form
16567 733092 299626 269738 215458 30726 -269823 -324063 -338580 -326245 -91313 -37876 -68626
16556 -68626 -176360 80392 126545 304952 122485 134957 -331129 -865349 -673933 -219275
16546 -219275 -462779 -527616 -174602 -380229 -406376 168879 257030 -159266 -281589 -326144
16536 -326144 -49503 141836 317393 72234 169945 87870 65465 192961 318066 240814
16526 240814 126985 204213 245329 -103162 -222423 -192646 61653 113441 -153300 2063
16516 2063 -22827 136033 -15 -243497 -269771 -53843 -11428 -171290 -310633 -172074
16506 -172074 -40021 -17409 -471988 -575569 -9577 280437 196967 -63174 -322953 -269193
16496 -269193 -425922 -595065 -232929 -13688 12354 -270518 -310671 -18254 337988 645510
$$ packed form
16567G33092m33466k9888n4280j84732l00549n4240j4517J2335K34932N3437l0750
16556f8626j07734K56752M6153J78407j82467J2472m66086n34220J91416M54658
16546b19275k43504o4837L53014k05627k6147N75255Q8151m16296j22323m4555
16536c26144K76641J91339J75557k45159R7711q2075k2405J27496J25105p7252
16526B40814j13829P7228M1116l48491j19261K9777K54299N1788k66741J55363
16516B063k4890J58860j36048k43482k6274K15928M2415j59862j39343J38559
16506a72074J32053K2612m54579j03581N65992K90014q3470k60141k59779N3760
16496b69193j56729j69143L62136K19241K6042k82872m0153K92417L56242L07522
$$ plain form
16486 645510 254764 -34376 -114964 -279632 -532968 -423733 -429488 -271055 -188243 130004
16476 130004 170105 -118435 -399706 -524011 -229541 -47334 -40818 -67801 -280094 -832801
16466 -832801 -775582 -664646 -664537 -452586 -117223 -238826 -355615 -357728 -372554 -54317 -3595
16455 -3595 -221396 -126935 -224714 -276711 60222 307551 332152 -105322 -245038 -301740 -374034
16444 -374034 -384286 -405403 -489429 -368584 -455347 -303006 -88634 -58942 -130323 43383 287393
16433 287393 190041 154047 -61892 25756 292320 123949 -162819 -447195 -236374 -295082
16423 -295082 -296789 -433263 -134246 -77906 -150691 -264175 -188728 -296099 -754665 -955133
16413 -955133 -889604 -736527 -172798 64143 -125028 224271 320916 500868 428005 524079
$$ packed form
16486F45510l90746k89140q0588j64668k53336J09235n755J58433Q2812L18247
16476A30004M0101k88540k81271j24305K94470J82207O516k6983k12293n52707
16466h32801N7219J10936J09K11951L35363j21603j16789k113j4826L18237N0722
16455c595k17801R4461r7779n1997L36933K47329K4601m37474j39716n6702p2294
16444c74034j0252k1117q4026J20845q6763J52341K14372K9692p1381J73706K44010
16433B87393r7352l5994k15939Q7648K66564j68371k86768k84376K10821n8708
16423b95082j707j36474K99017N6340p2785j13484P5447j07371m58566k00468
16413i55133O5529J53077N63729K36941j89171L49299R6645J79952p2863R6074
$$ plain form
16403 524079 544268 353107 216627 -820 -95633 -25379 -123268 -314040 -312764 -127984 -63291
16392 -63291 39444 -60914 -332656 -677966 -656970 -648787 -404926 -445313 -310015 -444717
16382 -444717 -626668 -416810 -264528 -196875 47452 -110226 -318599 -109561 217494 229607
16372 229607 189116 313753 163028 53777 277002 109886 -221373 -353156 -175001 -160347
16362 -160347 -547498 -496575 -109961 60893 71225 121272 -206938 -388094 -345174 -270364
16352 -270364 -326163 -430067 -599690 -538835 -68461 195839 221646 150371 -2386 -273173
16342 -273173 -401447 -161696 -370308 -816751 -763963 -564874 -52945 -58584 -74052 33032
16332 33032 -120580 -272671 -338615 -425510 -144170 181768 706340 752037 510711 392947
$$ packed form
16403E24079K0189j91161j36480k17447r4813P0254r7889j90772J276J84780O4693
16392f3291J02735j00358k71742l45310K0996Q183K43861m0387J35298j34702
16382d44717j81951K09858J52282O7653K44327j57678k08373K09038L27055J2113
16372B29607m0491J24637j50725j09251K23225j67116l31259j31783J78155J4654
16362a60347l87151N0923L86614J70854J0332N0047l28210j81156M2920P4810
16352b70364n5799j03904j69623O0855M70374K64300K5807p1275j52757k70787
16342b73173j28274K39751k08612m46443N2788J99089N11929n639j5468J07084
16332C3032j53612j52091o5944q6895K81340L25938N24572M5697k41326j17764
$$ plain form
16322 392947 265028 413542 341579 75087 253534 312343 507458 597687 236217 241495
16312 241495 142394 220882 508565 707222 869086 713076 688279 642587 163390 -15502
16302 -15502 -203256 -201335 87439 286493 571692 687627 554161 388781 265220 144520
16292 144520 -3983 -225080 -134127 16755 119174 -150226 -154535 7950 96857 -197587
16282 -197587 35047 38558 -128087 -310110 -6334 -71314 -118524 -35831 -287992 -240096 -170361
16271 -170361 -36257 20447 -121389 -128891 -134547 -85456 -367546 -352168 -395818 -332425 -292690
16260 -292690 -404151 -290371 -103509 -126458 -168208 -160992 -24145 124961 38886 -70468
16250 -70468 219602 148834 95143 -134052 -307238 -174457 -47154 -396765 -401853 -329717 -212738
$$ packed form
16322C92947j27919J48514p1963k66492J78447N8809J95115R0229l61470N278
16312B41495r9101P8488K87683J98657J61864j56010k4797m5692m79197j78892
16302a5502j87754J921K88774J99054K85199J15935j33466j65380j23561j20700
16292A44520j48503k21097R0953J50882J02419k69400m309J62485Q8907k94444
16282a97587K32634L511j66645j82023L03776o4980m7210Q2693k52161M7896O9735
16271a70361J34104N6704j41836p502n656M9091k82090J5378m3650O3393L9735
16260b92690j11461J13780J86862k2949m1750P216J36847J49106q6075j09354
16250g0468K90070p0768n3691k29195j73186J32781J27303l49611n088P2136J16979
$$ plain form
16239 -212738 -100668 -8435 4446 -48893 273866 -172772 -353495 -403573 -204179 48695
16229 48695 417542 727344 734674 336227 208363 -6838 165647 467898 556074 488488
16219 488488 159107 210884 -19609 27894 -129798 -177514 12942 -173711 -10634 -158307
16209 -158307 -214498 -420629 -613739 -655345 -286070 255094 372255 445577 505055 37846
16199 37846 -150399 164974 212411 -60081 -188580 -93092 -222988 -5742 218492 196960
16189 196960 244734 325010 347586 271014 49228 26832 -193890 -178008 -166583 -216323 -229786
16178 -229786 -235716 -363011 -706782 -929032 -699055 -276524 -361806 -420393 -725808 -687825
16168 -687825 -490686 -303609 -228317 -262829 -309314 -196376 -176537 -89266 -134903 -257794 -69724
$$ packed form
16239b12738J12070R2233J2881n3339L22759m46638j80723n0078J99394K52874
16229D8695L68847L09802P330l98447j27864k15201J72485L02251Q8176o7586
16219D88488l29381N1777k30493M7503j57692m7716J90456j86653J63077j47673
16209a58307n6191k06131j93110m1606L69275N41164J17161P3322N9478m67209
16199C7846j88245L15373M7437k72492j28499R5488j29896K17246K24234k1532
16189A96960M7774Q0276K2576p6572k21786k2396k20722J5882J1425m9740j3463
16178b29786n930j27295l43771k22250K29977M22531q5282n8587l05415L7983
16168f87825J97139J87077P5292l4512m6485J12938J9839Q7271m5637j22891J88070
$$ plain form
16157 -69724 124330 290638 266860 249703 11418 -425856 -321551 -79929 93480 110731
16147 110731 74985 36850 -8301 -246921 -194628 -46628 -347957 -717054 -518546 -304379
16137 -304379 -252840 122617 -3431 -206508 -107121 -27464 137914 285558 201167 -90632
16127 -90632 -299403 -105077 108055 273027 240681 -44216 -304501 -426670 -24265 -194825
16117 -194825 -89020 27887 27050 -30526 84845 -113448 25558 -190872 -287689 -44266
16107 -44266 305629 -24577 -300367 -183555 -215020 -451828 -433341 -324709 -66535 -89185
16097 -89185 -261625 16920 156862 212807 272954 304175 238616 3827 -126046 -259997
16087 -259997 -322041 -505206 -584119 -370627 23254 116855 27609 78777 277063 31558
$$ packed form
16157f9724J94054J66308k3778j7157k38285m37274J04305K41622J73409J7251
16147A10731l5746l8135m5151k38620N2293J48000l01329l69097J98508K14167
16137c04379N1539L75457j26048k03077R9387P9657J65378J47644q4391k91799
16127i0632k08771J94326K13132J64972l2346k84897k60285j22169M02405j70560
16117a94825J05805J16907q37n7576J15371j98293J39006k16430r6817K43423
16107d4266L49895l30206k75790J16812l1465k36808J8487J08632K58174k2650
16097h9185j72440K78545J39942N5945O0147L1221o5559k34789j29873j33951
16087b59997o2044j83165p8913K13492L93881R3601q9246N1168J98286k45505
$$ plain form
16077 31558 -48740 -130754 -81802 272903 316540 -307574 -908197 -403668 -174082 99759
16067 99759 -29229 -331847 -226811 265689 268490 143540 -133043 -384961 -338654 -369221
16057 -369221 -661624 -659634 -390458 -443957 -371637 -319072 -272422 -333231 -333759 -188844 296061
16046 296061 70318 -355384 -644401 -653811 -460100 -285258 -105518 205350 57837 -396356
16036 -396356 -358076 -195985 -122698 -427027 -476869 -252067 -29597 77431 334797 333295
16026 333295 182054 284458 615668 755911 520979 277367 129139 326044 680507 963822
16016 963822 868471 478190 256109 -5923 -201142 -255389 -143716 -246555 -507847 -231926
16006 -231926 31097 173187 -24828 155705 226160 -94067 -454829 -685452 -473236 -677857
$$ packed form
16077C1558q0298q2014M8952L54705M3637o24114o00623N04529K29586K73841
16067I9759j28988l02618J05036M92500K801j24950k76583k51918M6307l0567
16057c69221k92403J990K69176n3499P2320N2565M6650o0809n28J44915M84905
16046B96061k25743m25702k89017r410J93711J74842J79740L10868j47513m54193
16036c96356L8280J62091P3287l04329m9842K24802K22470J07028K57366j502
16026C33295j51241J02404L31210J40243k34932k43612j48228J96905L54463K83315
16016I63822r5351l90281k22081k62032j95219n4247J11673j02839k61292K75921
16006b31926K63023J42090j98015J80533P0455l20227l60762k30623K12216k04621
$$ plain form
15996 -677857 -349403 116291 509742 181034 -32754 -114737 28506 49968 -51468 -346971
15986 -346971 -297516 -247674 -164421 -18458 -182471 -119165 -238554 -339367 -249053 -257453 -534082
15975 -534082 -524754 -105294 160578 236836 128987 94895 25556 171657 20985 250574
15965 250574 270872 252316 36911 -252355 -602107 -664316 -670993 -510465 -345115 -547285
15955 -547285 -415989 -112473 290086 302027 227976 217219 3319 -355983 -263060 -128222
15945 -128222 110285 -158255 -169614 37854 247060 -126365 -361872 -629198 -629271 -286856
15935 -286856 -190226 -67518 6642 -84785 -83893 -106999 -52146 -61505 131980 459864 313960
15924 313960 51008 158131 89985 41443 -172073 -195768 -343626 -506714 -212145 103531
$$ packed form
15996f77857L28454M65694L93451l28708k13788q1983J43243K1462j01436k95503
15986c46971M9455M9842Q3253J45963j64013O3306j19389j00813R0314q400k76629
15975e34082R328M19460K65872P6258j07849l4092o9339J46101j50672K29589
15965B50574K0298j8556k15405k89266l49752o2209o677J60528J65350k02170
15955e47285J31296L03516M02559J1941p4051j0757k13900l59302R2923J34838
15945a28222K38507k68540j1359K07468K09206l73425k35507k67326p3L42415
15935b86856R6630J22708P4160r1427Q92k3106N4853r359J93485L27884j45904
15924C13960k62952J07123o8146m8542k13516k3695j47858j63088K94569L15676
$$ plain form
15914 103531 244635 271150 -169450 -420783 -443551 -683138 -554337 -156425 138233 99545
15904 99545 53189 108133 34610 190307 112858 -61792 -138121 -103509 -96439 93409 29034
15893 29034 -5932 530931 280898 68515 91306 -27599 92843 -55985 -177184 -49589
15883 -49589 7763 55436 -25401 -284563 -306887 -27607 247955 338437 229897 -246477 -314291
15872 -314291 -374050 -584021 -487622 -428108 -505981 -443613 -236611 -155789 -454243 -515609 -180613
15861 -180613 228271 -44260 -307994 -138224 -74676 33949 102434 -6587 53635 219147
15851 219147 -126303 -274929 -98382 -291288 -599991 -535699 -349446 -362903 -215946 -227527
15841 -227527 -144152 100009 -192331 31425 213837 -149190 -471039 -338518 -48744 75790
$$ packed form
15914A03531J41104K6515m40600k51333k2768k39587J28801L97912K94658l8688
15904I9545m6356N4944p3523J55697p7449j74650p6329L4612P070J89848o4375
15893B9034l4966N36863k50033k12383K2791j18905J20442j48828j21199J27595
15883d9589N7352M7673q0837k59162k2324K79280K75562R0482j08540m76374o7814
15872c14291n9759k09971R6399N9514p7873O2368K07002Q0822k98454o1366L34996
15861a80613M08884k72531k63734J69770O3548J08625O8485j09021O0222J65512
15851B19147l45450j48626J76547j92906l08703O4292J86253j3457J46957j1581
15841b27527Q3375K44161k92340K23756J82412l63027l21849J32521K89774J24534
$$ plain form
15831 75790 19427 171576 365978 249003 86371 209030 288607 155536 188080 -62814
15821 -62814 187387 79266 -218038 -409387 -681655 -730091 -517165 -114756 -46278 122851
15811 122851 262954 34207 85098 265916 633523 411110 265622 94083 -221212 -536040
15801 -536040 -895136 -875140 -663349 -381278 -227139 -161370 -243549 95977 299458 138180
15791 138180 -151219 -473516 -495881 -336321 -106052 -219128 -146084 89615 88368 -463465
15781 -463465 -794463 -584891 8268 593029 653964 553883 517645 221348 245950 309448
15771 309448 89451 -386215 -613081 -536912 -360633 -426010 -551848 -609674 -668556 -762690
15761 -762690 -737688 -526298 -400631 -291482 -202200 -303556 -167259 -299767 -441275 -131616
$$ packed form
15831G5790n6363J52149J94402j16975j62632J22659P9577j33071L2544k50894
15821f2814K50201j08121k97304j91349k72268m8436K12926M02409O8478J69129
15811A22851J40103k28747N0891J80818L67607k22413j45488j71539l15295l14828
15801e36040l59096J9996K11791K82071J54139O5769q2179L39526K03481j61278
15791A38180k89399l22297k2365J59560K30269j13076P3044K35699j247n51833
15781d63465l30998K09572N93159N84761O0935j00081l6238k96297K4602O3498
15771C09448k19997m75666k26866P6169J76279o5377j25838n7826n8882r4134
15761g62690K5002K11390J25667J09149Q9282j01356J36297j32508j41508L09659
$$ plain form
15751 -131616 127168 125511 109311 81480 -773 18398 128034 148515 -45644 -324898 -539132
15740 -539132 -454028 -442622 -606356 -352334 55003 -71898 -134797 26100 -120983 -332770
15730 -332770 -550116 -457431 -589582 -172020 78186 -3423 -122992 -421644 -502505 -626115
15720 -626115 -578110 -449003 -415264 -223783 -95268 139516 201099 93155 -97620 -6948
15710 -6948 61835 80459 272872 305491 399610 389366 580212 720710 713083 499912 30557
15699 30557 -281315 -414759 -24187 403659 205739 62237 348979 323456 89661 -69384
15689 -69384 -368373 -617701 -851999 -405262 -452335 -62705 292443 -29809 -455083 -733086
15679 -733086 -456535 -92517 -157005 -263667 -334455 -443608 -78708 140070 -57943 -588978
$$ packed form
15751a31616K58784j657j6200k7831q2253J9171J09636K0481j94159k79254k14234
15740e39132Q5104J1406j63734K54022M07337j26901o2899J60897j47083k11787
15730c32770k17346R2685j32151M17562K50206q1609j19569k98652q0861j23610
15720f26115M8005J29107L3739J91481J28515K34784O1583j07944j90775R0672
15710f948O8783J8624J92413L2619R4119j0244J90846J40498p627k13171m69355
15699C0557l11872j33444L90572M27846j97920j43502K86742k5523k33795j59045
15689f9384k98989k49328k34298M46737m7073L89630L55148l22252m25274k78003
15679g33086K76551L64018o4488j06662p0788j09153L64900K18778j98013n31035
$$ plain form
15669 -588978 -680027 -703708 -824500 -641380 -717569 -633731 -639068 -583511 -724774 -608916 -393077
15658 -393077 -200279 -516357 -426283 -71046 -56753 -370890 -478561 -520992 -439222 -318540
15648 -318540 -113013 51067 84587 256261 -67932 -332901 -289191 -228106 82976 -123714
15638 -123714 -294473 21394 36740 -99093 -190227 -477094 -717577 -704261 -380340 -498888
15628 -498888 -482126 -585842 -360844 -690440 -670690 -306799 -171576 -53346 149409 171157
15618 171157 -123257 -664856 -536316 -691059 -596243 -684354 -694186 -302149 -350278 -821186
15608 -821186 -587467 -259515 -91829 -9033 -152530 -168522 -243892 -199304 -66459 -240859
15598 -240859 -260155 -313933 -312117 -167676 14325 433944 371601 237741 -23735 -51447 -131222
$$ packed form
15669e88978r1049k3681j20792J83120p6189Q3838n337N5557j41263J15858K15839
15658c93077J92798l16078R0074L55237J4293l14137j07671m2431Q1770J20682
15648c18540K05527J64080L3520J71674l24193k64969M3710O1085L11082k06690
15638a23714j70759L15867J5346j35833r1134k86867k40483J3316L23921j18548
15628d98888J6762j03716K24998l29596J9750L63891J35223J18230K02755K1748
15618A71157k94414n41599J28540j54743R4816q8111r832L92037m8129m70908
15608h21186K33719L27952J67686Q2796j43497j5992p5370M4588J32845j74400
15598b40859j9296n3778J816J44441J82001M19619o2343j33860k61476k7712p9775
$$ plain form
15587 -131222 -67486 94225 125691 -227334 -107659 -105409 -427710 -519747 -223034 -246793 -277450
15576 -277450 -58359 18208 7127 -232390 -356648 -178895 -132930 -14557 -175370 125780
15566 125780 474593 513073 437863 161863 36770 172564 245484 -101279 -178474 -81358
15556 -81358 -86460 -93847 -130151 -308080 -315053 101724 -206406 -435996 -336769 -234627 113476
15545 113476 -24160 -30039 57610 169217 311574 413603 592857 634677 317036 108639
15535 108639 106128 -25038 -246598 39359 134525 277601 398823 408704 -100773 -136852 -47562
15524 -47562 308466 399803 238027 -45676 501293 821222 593282 86302 200571 320574
15514 320574 258123 114182 394978 362063 253440 -74284 -436756 -531035 -681597 -698937
$$ packed form
15587a31222O3736J61711L1466l53025J19675K250l22301r2037K96713k3759l0657
15576b77450K19091P6567j1081k39517j24258J77753M5965J18373j60813L01150
15566A25780L48813L8480p5210k76000j25093J35794P2920l46763p7195R7116
15556h1358n102p387l6304j77929o973M16777l08130k29590R9227J02142L48103
15545A13476j37636n879Q7649J11607J42357J02029J79254M1820l17641k08397
15535A08639k511j31166k21560K85957R5166J43076J21222R881n09477l6079Q9290
15524d7562L56028R1337j61776k83703N46969L19929k27940n06980J14269J20003
15514C20574o2451j43941K80796l2915j08623l27724l62472r4279j50562j7340
$$ plain form
15504 -698937 -397888 -355053 -63272 -189159 -264318 -481479 -475219 -529447 -535235 -331789 -159496
15493 -159496 -432785 -856432 -797999 -366880 -437949 -474442 -734737 -713326 -281575 -164359
15483 -164359 -182635 -179222 -91451 -144077 41746 560 -35342 230451 177514 6989 -147390
15472 -147390 -20524 -89298 -192416 -162056 526040 601589 428621 -21267 -356253 -379432
15462 -379432 -447688 -43463 158924 114116 -87680 -367620 -317931 -497812 -701322 -756691
15452 -756691 -538401 -210120 -112755 86936 206522 124112 -30312 -592734 -417866 -143080
15442 -143080 -144727 -111670 -21245 -11665 -143094 -185148 -258490 -303819 -9411 -112058 -300492
15431 -300492 -208095 39773 -215487 -688084 -909829 -473031 -213034 -182232 181758 56883
$$ packed form
15504f98937L01049M2835K91781j25887p5159k17161O260n4228n788K03446J72293
15493a59496k73289m23647N8433M31119p1069l6493k60295K1411M31751J17216
15483a64359j8276L413Q7771n2626J85823m1186l5902K65793n2937j70525j54379
15472a47390J26866o8774j03118L0360O88096P5549j72968m49888l34986k3179
15462c79432o8256M04225K02387m4808k01796k79940M9689j79881k03510n5369
15452g56691K18290L28281R7365J99691J19586q2410j54424n62422J74868K74786
15442a43080j647L3057R0425R580j31429m2054p3342m5329K94408j02647j88434
15431c00492R2397K47868k55260m72597k21745M36798K59997L0802L63990j24875
$$ plain form
15421 56883 134101 244488 498719 452826 251128 362972 193426 156490 54109 173511
15411 173511 406410 331795 497 37677 252187 343339 353773 186612 -22842 127640
15401 127640 219331 17035 -18225 224782 -61580 -60709 183157 529370 567328 309542 178160
15390 178160 10215 -134063 -278168 -236240 -413337 -221663 115215 269928 -169774 -32989
15380 -32989 122186 -63334 -297332 -161482 -419108 -466647 -572005 -609571 -797099 -572792
15370 -572792 -400872 -101361 -56072 14850 -147666 -497872 -602309 -69114 -4707 -523491
15360 -523491 -291403 -330369 -245834 -38026 -38946 -93681 -68374 210388 244060 -50192 -171367
15349 -171367 -165190 -189423 -439066 -587544 -176498 155614 -28169 -421829 -506384 -233438
$$ packed form
15421E6883P7218J10387K54231m5893k01698J11844j69546l6936j02381J19402
15411A73511K32899p4615l31298L7180K14510R1152J0434j67161k09454J50482
15401A27640R1691k02296l5260K43007k86362Q71K43866L46213L7958k57786j31382
15390A78160j67945j44278j44105M1928j77097J91674L36878J54713m39702J36785
15380c2989J55175j85520k33998J35850k57626m7539j05358l7566j87528K24307
15370e72792J71920K99511M5289P0922j62516l50206j04437N33195O4407n18784
15360e23491K32088l8966Q4535K07808r20n4735K5307K78762L3672k94252j21175
15349a71367O177k4233k49643j48478M11046L32112j83783l93660q4555K72946
$$ plain form
15339 -233438 -307233 -326475 -141220 47374 176094 373040 321007 235283 112217 70831
15329 70831 148791 169317 35779 -150705 -162008 -43727 267096 -18461 -107193 -18705 -314365
15318 -314365 -303513 -123677 -34197 -116406 -229063 -543298 -836522 -748267 -6785 391402
15308 391402 543502 640227 415950 143649 -312781 -154771 -22631 134783 -51169 -85165
15298 -85165 -86752 -134759 -428386 -443032 -272875 -523376 -326545 -448221 -113356 -77718 -96803
15287 -96803 84692 439408 671570 535412 382536 -74865 -377821 -368708 -319190 -246985
15277 -246985 -158177 -346795 -418599 -347165 -53265 252953 410451 268972 218318 -98942
15267 -98942 -331629 -140661 -68009 212951 72724 -22749 1904 -326832 -249170 -79090
$$ packed form
15339b33438p3795j9242J85255J88594J28720J96946n2033q5724j23066m1386
15329G0831P7960K0526j33538j86484j1303J18281L10823k85557q8732Q8488k95660
15318c14365J0852J79836Q9480q2209j12657l14235k93224Q8255P41482L98187
15308C91402J52100R6725k24277k72301m56430J58010J32140J57414j85952l3996
15298h5165j587m8007k93627j4646J70157k50501J96831j21676L34865L5638j9085
15287i6803J81495L54716K32162j36158j52876m57401l02956R113M9518P2205
15277b46985Q8808j88618p1804P1434K93900L06218J57498j41479n0654l17260
15267i8942k32687J90968P2652K80960j40227r5473K4653l28736P7662J70080
$$ plain form
15257 -79090 86758 -52350 -364843 -541829 -287353 -383774 -461791 -294242 137734 348494
15247 348494 348055 457856 180985 -279470 -206807 204526 17385 -189712 -205855 -224355 60999
15236 60999 -59259 -352548 -243895 54534 -315213 -636122 -571070 -228374 79134 255221
15226 255221 26987 265533 367517 329400 111838 230072 193385 14095 41584 -14654
15216 -14654 220780 229546 465307 408060 551025 652880 87512 95801 24561 99109 -354727
15205 -354727 -667969 -800424 -605701 -317961 -241053 -332081 -463599 -533968 -423159 -307109
15195 -307109 -66033 139213 38893 48812 -94104 -147306 -114185 -90564 -83785 75772 335438
15184 335438 327525 156649 59890 36987 -160062 -397820 -260399 -108961 -64717 -324122
$$ packed form
15257g9090J65848j39108l12493j76986K54476r6421p8017J67549M31976K10760
15247C48494m39J09801k76871m60455P2663M11333j87141k07097j6143j8500K85354
15236F0999j20258k93289J08653K98429l69747l20909O5052L42696L07508J76087
15226B55221k28234K38546J01984l8117k17562J18234l6687j79290K7489n6238
15216a4654K35434Q766K35761n7247J42965J01855n65368Q289p1240P4548m53836
15205c54727l13242j32455J94723K87740P6908r1028j31518p0369J10809J16050
15195c07109K41076K05246j00320R919j42916n3202L3121K3621O779J59557K59666
15184C35438p913j70876r6759k2903j97049k37758J37421J51438M4244k59405
$$ plain form
15174 -324122 68668 51040 235986 268286 23007 -255265 -76292 -2294 -245234 -532393
15164 -532393 -512916 -604100 -565564 -397637 -141992 -161478 -47159 81304 45385 -27654 72354
15153 72354 111055 -155001 -260415 -663694 -685397 -673992 -730750 -832333 -605810 -137106
15143 -137106 -281087 -259141 -67993 148551 81475 296904 480246 224013 -68719 -215283
15133 -215283 -471259 -300797 -87642 -73580 -209571 40915 136809 371327 464827 352876
15123 352876 65200 120660 60545 58550 -6564 -189465 -387934 -660539 -696642 -532635 -256388
15112 -256388 -114863 -107788 -206304 -173004 -282382 -373911 -125998 -26406 -1339 187869 490827
15101 490827 624319 632924 452002 33037 -31714 13356 255014 -15811 -173081 90170
$$ packed form
15174c24122L92790j7628J84946L2300k45279k78272J78973P3998k42940k87159
15164e32393J9477r1184L8536J67927K55645j9486J14319J28463l5919p3039J00008
15153G2354L8701k66056j05414m03279k1703J1405n6758j01583K26523M68704
15143a37106j43981K1946J91148K16544o7076K15429J83342k56233k92732j46564
15133b15283k55976J70462K13155J4062j35991K50486R5894K34518R3500j11951
15123C52876k87676N5460o0115j995o5114j82901j98469k72605l6103J64007K76247
15112b56388J41525P075r8516L3300j09378r1529K47913R9592K5067J89208L02958
15101D90827J33492Q605j80922m18965o4751M5070K41658k70825j57270K63251
$$ plain form
15091 90170 176789 380260 149041 89146 -51710 -3043 -216984 -156215 -123282 -219418 -292707
15080 -292707 -411660 37406 107863 213088 1861 -215082 -252858 12361 245951 147436
15070 147436 51410 131365 246538 183909 386844 149554 -24668 -149664 -389181 -194313
15060 -194313 -126165 -272475 -397427 -429422 -431838 -442316 -536302 -559419 -609587 -322425 -99891
15049 -99891 2525 170325 269072 212501 -12292 -103782 -72614 -103632 141505 212741 397780
15038 397780 542764 298284 -206141 -58841 39958 35978 -137807 -395543 -492330 -447941
15028 -447941 -20094 367309 624913 581638 406391 424397 439751 366874 310318 259012 185799
15017 185799 386322 311769 108265 156575 369772 703005 940103 856579 633392 1131541
$$ packed form
15091I0170Q6619K03471k31219n9895j40856M8667k13941O0769L2933r6136p3289
15080b92707j18953M49066P0457J05225k11227k16943l7776K65219K33590r8515
15070A47436r6026P9955J15173o2629K02935k37290j74222j24996k39517J94868
15060a94313O8148j46310j24952l1995k416j0478r3986k3117n0168K87162K22534
15049i9891J02416J67800R8747n6571k24793r1490L1168l1018K45137P1236J85039
15038C97780J44984k44480n04425J47300R8799l980j73785k57736r6787M4389
15028d47941M27847L87403K57604m3275j75247J8006J5354p2877n6556n1306p3213
15017A85799K00523p4553k03504M8310K13197L33233K37098q3524k23187M98149
$$ plain form
15007 1131541 2040389 2957073 4449905 6082631 6664391 6544080 4524814 2798860 2130888
14998 2130888 1496635 1100364 833152 951338 951486 993871 745305 687848 917922 808265
14988 808265 516079 250034 96503 -171516 51129 253981 508693 694386 553155 412684
14978 412684 68981 279115 269964 421085 382690 41940 128182 298390 145408 117218
14968 117218 -86538 -99953 27478 -152991 65997 98157 158996 125369 -169629 -94096
14958 -94096 174478 -66914 -208361 -376174 -528595 -517172 -88033 197264 352842 482377
14948 482377 398898 431069 424762 648040 613890 298612 -63887 -240660 -236802 -259483 107156
14937 107156 441986 381777 176150 175709 497193 624595 314899 81246 410616 579162
$$ packed form
15007A131541R08848R16684J492832J632726N81760j20311k019266j725954o67972
14998B130888o34253l96271k67212J18186J48M2385k48566n7457K30074j09657
14988H08265k92186k66045j53531k68019K22645K02852K54712J85693j41231j40471
14978D12684l43703K10134r151J51121l8395l40750Q6242J70208j52982k8190
14968A17218k03756j3415J27431j80469K18988L2160O0839l3627k94998P5533
14958i4096K68574k41392j41447j67813j52421J1423M29139K85297J55578J29535
14948D82377q3479L2171o307K23278l4150l15278l62499j76773L858k2681L66639
14937A07156L34830o0209k05627m41L21484J27402l09696k33653L29370J68546
$$ plain form
14927 579162 143194 -248412 -209725 -455306 -167465 -98047 232259 285302 -1677 -83089
14917 -83089 -329930 -346198 189549 279835 153857 77670 259083 87166 316418 389788
14907 389788 356544 -4397 -92734 -292558 -108290 -103588 461980 786547 708484 291634
14897 291634 -117754 -112234 191882 440988 553606 -12187 -393652 -215136 8064 168214
14887 168214 459749 700815 500282 689679 395036 43705 -481640 -460695 -185621 -325324
14877 -325324 -631005 -514742 -415618 -260931 -260427 -263981 -75688 27717 244846 235814 197755
14866 197755 149579 445141 562555 442579 291785 260689 262780 64085 39044 -220439
14856 -220439 -86916 167943 349130 36796 -294056 -426360 -199353 -132439 -101599 -250306
$$ packed form
14927E79162m35968l91606L8687k45581K87841O9418L30306N3043k86979q1412
14917h3089k46841j6268N35747R0286j25978p6187J81413j71917K29252P3370
14907C89788l3244l60941q8337j99824J84268M702N65568L24567p8063m16850
14897B91634m09388N520L04116K49106J12618n65793l81465J78516K23200J60150
14887A68214K91535K41066k00533J89397k94643l51331n25345K0945K75074j39703
14877c25324l05681J16263R9124J54687N04l554J88293J03405K17129r032l8059
14866A97755m8176K95562J17414j19976j50794l1096K091j98695k5041k59483
14856b20439J33523K54859J81187l12334l30852j32304K27007O6914L0840j48707
$$ plain form
14846 -250306 -153801 -75048 188423 405759 368303 167590 281625 104878 -250458 -422383
14836 -422383 -635727 -361840 -6841 -28759 90676 129037 167502 234383 92551 -380835
14826 -380835 -798976 -969517 -891531 -408168 -36216 97780 69764 -351314 -417535 -445643
14816 -445643 -258980 -309184 -500215 -658782 -440068 -123875 19925 208699 256666 227135
14806 227135 97323 -58446 -229125 -25085 102031 204131 394761 225296 299132 44001
14796 44001 -361659 -554037 -602940 -433113 -383494 -608734 -284200 -280515 -335714 -557973 -581029
14785 -581029 -467516 -273083 -4350 49829 54370 100480 250062 384845 83237 -91673
14775 -91673 -235926 -365933 -353948 -295661 -158224 -71291 92959 172552 129250 -180687 -343612
$$ packed form
14846b50306R6505P8753K63471K17336l7456k00713J14035j76747l55336j71925
14836d22383k13344K73887L54999k1918J19435L8361L8465O6881j41832m73386
14826c80835m18141j70541P7986M83363L71952J33996k8016m21078o6221k8108
14816d45643J86663n0204j91031j58567K18714L16193J43800J88774M7967k9531
14806B27135j29812j55769j70679K04040J27116J02100J90630j69465P3836k55131
14796D4001m05660j92378m8903J69827M9619k25240L24534L685n5199k22259k3056
14785e81029J13513J94433K68733N4179M541M6110J49582J34783l01608j74910
14775i1673j44253j30007J1985N8287J37437Q6933J64250P9593m3302l09937j62925
$$ plain form
14764 -343612 -455645 -364475 -32256 180807 431333 244429 -72773 -159199 119328 490749
14754 490749 470647 451204 617223 651806 -128072 -347594 -37701 160946 61841 -290892
14744 -290892 -359877 -463734 -309780 -223171 -47998 71235 -192946 -184182 -16087 -27368
14734 -27368 -165011 -309479 -138546 27073 191920 -157799 -201082 88340 110222 -106777
14724 -106777 -227652 -207716 -140774 -114361 281323 64578 -288992 -89496 99521 28653
14714 28653 -29260 -241781 -44840 -64447 -37259 -141815 -206212 19905 330057 315335 85539
14703 85539 -168561 -349347 -121158 -128580 -4213 -73969 -317305 -70309 63168 224342
14693 224342 67513 -40533 253746 187975 -13773 14369 73245 101729 125398 222813 227231
$$ packed form
14764c43612j12033R1170L32219K13063K50526j86904l17202q6426K78527L71421
14754D90749k0102j9443J66019L4583p79878k19522L09893J98647r9105l52733
14744b90892o8985j03857J53954Q6609J75173J19233k64181Q764J68095j1281
14734b7368j37643j44468J70933J65619J64847l49719m3283K89422K1882k16999
14724a06777j20875J9936O6942K6413L95684k16745l53570J99496J89017p0868
14714B8653n7913k12521J96941j9607K7188j04556o4397K26117L10152j4722k29796
14703H5539k54100j80786K28189p422J24367o9756k43336K46996J33477J61174
14693B24342j56829j08046K94279o5771k01748K8142N8876K8484K3669R7415M418
$$ plain form
14682 227231 346749 3889 -191523 -145887 -88729 -171671 -265344 -185116 -237560 -148031 73243
14671 73243 456385 436428 240494 265580 249367 109467 -67188 197490 145589 165158 266651
14660 266651 589240 814256 616132 213069 118633 303124 276608 417833 669779 446232
14650 446232 298686 695946 654883 347535 236314 56467 8512 -279395 -330306 -434911
14640 -434911 -550381 -325871 -341766 -330276 -321115 -425446 -383702 -57577 248385 412296
14630 412296 546643 568181 257110 229163 262207 268476 208233 219917 272592 54710 -258885
14619 -258885 -10881 451257 802644 704148 571756 46632 -24884 251952 432375 70886
14609 70886 312731 761925 908496 445942 24713 -366159 -737055 -365821 -113052 -276497
$$ packed form
14682B27231J19518l42860j95412M5636N7158q2942r3673Q0228n2444Q9529K21274
14671G3243L83142j9957j95934K5086j6213j39900j76655K64678n1901J9569J01493
14660B66651L22589K25016j98124m03063r4436J84491k6516J41225K51946k23547
14650D46232j47546L97260m1063l07348j11221j79847m7955k87907n0911j04605
14640d34911j15470K24510j5895J1490R161j04331M1744L26125L05962J63911
14630D12296J34347K1538l11071k7947L3044O269o0243J1684N2675k17882l13595
14619b58885K48004M62138L51387r8496j32392n25124p1516K76836J80423l61489
14609G0886K41845M49194J46571m62554m21229l90872l70896L71234K52769j63445
$$ plain form
14599 -276497 -484261 -221392 -174419 -234540 -406248 -293906 -346909 -153819 -260737 -57658
14589 -57658 261539 611612 591710 476044 271156 28111 -332870 -120778 63639 157965
14579 157965 546200 798091 887278 482121 175158 -68159 20092 105713 16973 -85148
14569 -85148 -241155 -227987 -199562 -52807 31914 122104 -39281 114992 26306 -98998 30305
14558 30305 -66804 -234663 -114147 -95967 132290 224645 191992 59621 -271624 -104167
14548 -104167 91086 -54166 -193809 -85872 250184 627174 579651 241937 147191 142059
14538 142059 363272 295328 396203 525892 373199 128389 -95393 -390074 -412275 -457823
14528 -457823 -315480 -350340 -41904 -97127 -372739 -439793 -399106 -409247 -741856 -795792 -701325
$$ packed form
14599b76497k07764K62869M6973o0121j71708J12342n3003J93090j06918K03079
14589e7658L19197L50073j9902j15666k04888k43045l60981K12092J84417R4326
14579A57965L88235K51891Q9187m05157l06963k43317Q8251Q5621q8740j02121
14569h5148j56007J3168K8425J46755Q4721R0190j61385J54273q8686j25304J29303
14558C0305r7109j67859J20516J8180K28257R2355l2653j32371l31245J67457
14548a04167J95253j45252j39643J07937L36056L76990m7523l37714r4746n132
14538A42059K21213o7944J00875J29689j52693k44810k23782k94681k2201m5548
14528d57823J42343l4860L08436n5223k75612o7054M0687j0141l32609n3936R4467
$$ plain form
14517 -701325 -572127 -419483 -488887 -356282 -167478 -37851 94046 -114633 -497964 -693100
14507 -693100 -418967 -116322 -90273 -188758 -396117 -555426 -875431 -590631 15974 395037
14497 395037 -90115 -466549 -392769 -210184 -76470 -310142 -203304 279545 87089 -106451
14487 -106451 -179485 -147874 -103919 34620 -213889 -352561 -146618 -382526 -470904 -405137
14477 -405137 -220510 -113028 -286449 -325435 -363178 -280182 -382775 -375060 -325715 -223238 -252769
14466 -252769 171188 411089 196543 -121419 -254242 -15386 79740 -29022 -129312 -211364
14456 -211364 -513592 -248935 -308877 -380629 -594306 -696976 -610374 -488376 -286838 -297839
14446 -297839 -365395 -662821 -896131 -407623 74298 180982 267163 198258 174871 299383
$$ packed form
14517g01325J29198J52644o9404J32605J88804J29627J31897k08679l83331j95136
14507f93100K74133L02645K6049r8485k07359j59309l20005K84800O06605L79063
14497C95037m85152l76434P3780J82585J33714k33672J06838M82849j92456j93540
14487a06451p3034L1611M3955J38539k48509j38672K05943k35908q8378O5767
14477d05137J84627J07482j73421l8986l7743Q2996j02593P715M9345J02477k9531
14466b52769M23957K39901k14546l17962j32823K38856R5126j08762j00290q2052
14456b11364l02228K64657n9942p1752k13677j02670Q6602J21998K01538j1001
14446b97839o7556k97426k33310M88508M81921J06684Q6181o8905k3387J24512
$$ plain form
14436 299383 -39040 -248782 -154372 -119713 -227183 -386540 -190260 -21700 255635 454766
14426 454766 168969 16397 250584 317459 388049 483429 363583 -131555 -291622 -194049
14416 -194049 50734 -114075 -395825 -212158 201472 460934 128380 167406 171908 288890
14406 288890 153818 2238 50514 -198528 -16815 62092 -69790 -234534 -217229 -267738
14396 -267738 -330848 -318504 -111930 168026 160241 78104 70975 126443 76623 3830 45138
14385 45138 -199735 -654488 -732537 -251875 -48216 210596 98792 -224671 -301975 -32288
14375 -32288 151369 175720 345559 303645 212443 184564 19563 -178040 -72341 165307
14365 165307 173200 78232 296107 54871 -59026 -265919 -343686 -355909 -453337 -231527 67007
$$ packed form
14436B99383l38423k09742R4410L4659j07470j59357J96280J68560K77335J99131
14426D54766k85797j52572K34187O6875P0590R5380j19846m95138j60067R7573
14416a94049K44783j64809k81750J83667M13630K59462l32554L9026M502J16982
14406B88890j35072j51580M8276k49042J81713P8907j31882j64744J7305n0509
14396b67738o3110J2344K06574K79956p785q2137p129N5468m9820p2793M1308
14385D5138k44873m54753p8049M80662K03659K58812j11804l23463p7304K69687
14375c2288J83657K4351J69839m1914r1202k7879j65001j97603J05699K37648
14365A65307P893r4968K17875k41236j13897k06893p7767j2223r7428K21810K98534
$$ plain form
14354 67007 266306 -55158 -434103 -452919 -147245 -102716 -9381 189016 353300 102804
14344 102804 21074 -34250 -302657 -554238 -327699 122904 200012 39213 74887 37288
14334 37288 64399 112504 160779 -30087 -380913 -498083 -419220 -396536 -90701 30057 -214093
14323 -214093 -53652 430468 622812 365935 75679 -138492 -329116 -406131 -569973 -500378
14313 -500378 -387795 -546644 -491410 -449801 -390460 -284378 134806 417175 488390 201529
14303 201529 58236 122968 43691 -295414 23492 119169 51795 -170348 59762 364057
14293 364057 547415 410617 -10267 -220052 -252909 -132324 178330 500538 566147 364375
14283 364375 373315 123061 242320 456616 193440 200641 336716 276478 -47704 -180946
$$ packed form
14354F7007J99299l21464l78945j8816L05674M4529R3335J98397J64284k50496
14344A02804q1730n5324k68407k51581K26539M50603P7108j60799L5674l7599
14334C7288K7111M8105M8275j90866l50826j17170P8863K2684L05835J20758k44150
14323b14093J60441M84120J92344k56877k90256k14171j90624p7015j63842O9595
14313e00378J12583j58849N5234M1609N9341J06082M19184K82369P1215k86861
14303B01529j43293O4732p9277l39105L18906R5677o7374k22143K30110L04295
14293C64057J83358j36798m20884k09785l2857J20585L10654L22208O5609k01772
14283C64375Q940k50254J19259K14296k63176P201J36075o0238l24182j33242
$$ plain form
14273 -180946 134960 270880 36323 35710 239843 429378 293771 232878 11977 14953 -280780
14262 -280780 -249445 52467 214137 97812 -148181 -252252 -99988 56302 344546 317615
14252 317615 555513 581219 337472 324656 -69460 181266 476675 481478 274626 -27989
14242 -27989 128525 375718 409209 483018 581423 370767 -14397 -86081 -356794 -164377
14232 -164377 222440 325778 127680 -204729 -429909 -262595 -70589 -8559 -109015 -3183
14222 -3183 316988 309305 927 -68352 -104046 -82818 -273772 -98356 -253955 -592197 -748500
14211 -748500 -1134995 -1003570 -1009669 -784966 -480581 69916 386273 326715 426306 209358
14201 209358 204379 245514 677109 720259 361992 212644 297582 33857 13244 132387 -49973
$$ packed form
14273a80946L15906J35920k34557o13K04133J89535j35607o0893k20901K976k95733
14262b80780L1335L01912J61670j16325k45993j04071J52264J56290K88244k6931
14252C17615K37898K5706k43747j2816l94116K50726K95409M803k06852l02615
14242b7989J56514K47193L3491P3809R8405k10656l85164p1684k70713J92417
14232a64377L86817J03338j98098l32409k25180J67314J92006O2030j00456J05832
14222c183L20171p683l08378o9279l5694K1228j90954J75416j55599l38242j56303
14211g48500l86495J31425o099K24703L04385N50497L16357n9558R9591k16948
14201B09358m979M1135M31595M3150l58267j49348Q4938k63725k0613J19143j82360
$$ plain form
14190 -49973 168240 76645 -194100 -310961 -497223 -520433 -284599 -390015 -130644 -240596
14180 -240596 -190353 -124291 -210294 -147055 121035 259563 356581 14026 -374331 -447693 -533662
14169 -533662 -81971 55934 286907 541042 382447 128907 43383 145337 125754 12470
14159 12470 133643 293052 570629 533646 137552 309990 412903 64962 -98545 123535
14149 123535 198845 132973 185930 158047 223778 -79354 -20003 72154 -321636 -576048 -350633
14138 -350633 -226111 -368906 -475934 -274291 -57876 -120364 134935 -87373 -453689 -526585
14128 -526585 -463021 -191364 -333826 -565981 -289556 -169073 -214551 41527 161171 -1367
14118 -1367 -243126 -375029 -391436 -445747 -357505 5233 178647 -163841 -436838 -242952
$$ packed form
14190d9973K18213r1595k70745j16861j86262k3210K35834j05416K59371j09952
14180b40596N0243O6062q6003O3239K68090J38528R7018l42555l88357p3362q5969
14169e33662M51691J37905K30973K54135j58595k53540q5524J01954j9583j13284
14159A2470J21173J59409K77577l6983l96094J72438J02913l47941j63507K22080
14149A23535P5310o5872N2957k7883O5731l03132N9351R2157l93790k54412K25415
14138c50633J24522j42795j07028K01643K16415o2488K55299k22308l66316p2896
14128e26585O3564K71657j42462k32155K76425J20483m5478K56078J19644j62538
14118a367k41759j31903j6407n4311Q8242L62738J73414l42488k72997J93886
$$ plain form
14108 -242952 -7436 97432 -102847 -427391 -413161 -23959 -129932 -488069 -384615 -48855
14098 -48855 255979 133401 -183150 -89724 155015 101082 -79244 -159813 -618951 -779307
14088 -779307 -489640 -463444 -178872 -246848 -539433 -368498 -415012 -291755 119232 -67251
14078 -67251 261244 313959 173636 306913 618761 601809 381525 418846 649789 402914
14068 402914 37323 -314374 -403053 -198912 97721 -118880 -191088 -304376 -128725 135112
14058 135112 208701 235777 255131 423826 408326 769790 712981 267720 -23680 -57260 -219495
14047 -219495 -184392 -174819 -244657 -197390 -305586 -209680 -11746 18243 282662 117849 119819
14036 119819 369801 499817 218847 -37043 -159692 -357091 -411200 -434189 -84722 98466
$$ packed form
14108b42952K35516J04868k00279l24544J4230L89202j05973l58137J03454L35760
14098d8855L04834j22578l16551R3426K44739n3933j80326q0569m59138j60356
14088g79307K89667K6196K84572o7976k92585J70935m6514J23257M10987j86483
14078f7251L28495N2715j40323J33277L11848j6952k20284L7321K30943k46875
14068D02914l65591l51697q8679K04141K96633k16601p2208j13288J75651K63837
14058A35112P3589K7076J9354J68695j5500L61464n6809m45261k91400l3580j62235
14047b19495L5103R573o9838M7267j08196R5906J97934K9989K64419j64813J970
14036A19819K49982J30016k80970k55890j22649j97399n4109k2989L49467J83188
$$ plain form
14026 98466 -45702 -323496 -439030 -138677 -198714 -134568 -56327 33984 -40293 98050 96917
14015 96917 139513 209459 -48818 -236785 -260127 -146652 41580 -87871 -172993 -241313 -168710
14004 -168710 -40052 201595 89023 136417 462162 191791 17775 186459 98143 -62411
13994 -62411 -98138 165818 309890 418210 580841 401731 235647 43473 100310 389408
13984 389408 198792 344022 228208 85874 -9873 -178847 -232476 -238545 -212132 35452
13974 35452 -147817 -217860 11891 -26340 -40380 -269684 -240532 -209670 -260064 -111456 92872
13963 92872 250798 263255 166561 164105 171469 22090 -5248 -143132 -189255 -55480 -77334
13952 -77334 -361572 -128480 161726 254864 61824 109023 7684 -194414 -308020 -277745
$$ packed form
14026I8466j44168k77794j15534L00353o0037O4146P8241R0311p4277J38343j133
14015I6917M2596O9946k58277j87967k3342J13475J88232j29451q5122o8320P2603
14004a68710J28658K41647j12572M7394L25745k70371j74016J68684q8316j60554
13994f2411l5727K63956J44072J08320J62631j79110j66084j92174N6837K89098
13984C89408j90616J45230j15814j42334r5747j68974n3629o069K6413K47584
13974C5452j83269p0043K29751l8231j4040k29304K9152L0862n0394J48608K04328
13963I2872J57926J2457r6694k456P364j49379k7338j37884m6123J33775k1854
13952g7334k84238K33092K90206R3138j93040M7199j01339k02098j13606L0275
$$ plain form
13942 -277745 -109909 245139 352840 365162 357440 293858 196638 56379 -147621 -100595 -147761
13931 -147761 -317052 -13293 373590 583179 561658 550496 226055 188488 102983 259301
13921 259301 168779 -80726 244066 466929 249180 216753 -142415 -76042 349435 396464
13911 396464 135495 26896 -148928 51149 57664 51512 -190457 -349435 -218225 -361082
13901 -361082 -489628 -303343 -64854 58727 57285 -66802 -572211 -712328 -321969 -6601
13891 -6601 -286103 -312473 -164674 -130657 69510 373551 403225 26639 207375 232812 17267
13880 17267 -133583 -15041 123810 -71013 -255141 -247039 -275819 -291079 -113173 -5219
13870 -5219 239068 346634 683858 637662 623205 593118 286405 124834 -20883 208884
$$ packed form
13942b77745J67836L55048J07701J2322p722o3582r7220j40259k04000M7026m7166
13931a47761j69291L03759L86883K09589k1521j1162l24441l7567q5505J56318
13921B59301r0522k49505L24792K22863k17749l2427l59168O6373M25477M7029
13911C96464k60969j08599j75824K00077O515o152k41969j58978J31210j42857
13901c61082j28546J86285K38489J23581j442j24087n05409j40117L90359L15368
13891f601k79502k6370J47799L4017K00167L04041K9674l76586J80736K5437k15545
13880A7267j50850J18542J38851j94823j84128Q102k8780j5260J77906J07954
13870e219K44287J07566L37224m6196j4457l0087l06713j61571j45717K29767
$$ plain form
13860 208884 505340 295126 -15066 -200345 -58471 129110 3737 -161815 -116265 71652
13850 71652 -50612 -25828 119595 44948 -76404 48091 11211 -47844 73270 14253 -456108
13839 -456108 -290419 -93324 -298341 -102959 -18074 -82631 -178775 -236095 -198664 -237974 -116950
13828 -116950 -407796 -398729 -238223 -273959 -36954 -213268 -39819 -230044 -494472 -380875
13818 -380875 168116 150920 -56254 -261787 -389642 -228592 -50254 237243 312704 123610
13808 123610 -7095 -50767 152901 406870 495169 545086 391478 340198 3949 -318373
13798 -318373 -55400 114713 -49060 -23032 -130021 -147529 -509751 -511231 -95548 235983
13788 235983 343825 477266 345793 201508 207285 -47018 -161284 94851 339961 -34032
$$ packed form
13860B08884K96456k10214l10192j85279J41874J87581j25373j65552M5550J87917
13850G1652j22264K4784J45423p4647j21352J24495l6880n9055J21114n9017m70361
13839d56108J65689J97095k05017J95382Q4885o4557r6144n7320L7431l9310J21024
13828a16950k90846R067J60506l5736K37005j76314J73449j90225k64428J13597
13818c80875N48991j7196k07174k05533j27855J61050J78338K87497P5461j89094
13808A23610j30705m3672K03668K53969Q8299M9917j53608n1280l36249l22322
13798c18373K62973J70113j63773K6028j06989j7508l62222j480M15683L31531
13788B35983J07842J33441j31473j44285N777k54303j14266K56135K45110l73993
$$ plain form
13778 -34032 182543 338897 401200 146991 169546 -9136 -74853 -154856 -130957 -107669 -305459
13767 -305459 -498424 -553205 36082 594003 762413 573001 33682 -69850 -135853 -393059
13757 -393059 -370677 -431193 -538868 -727478 -491080 -210231 1601 83104 -228958 -83760
13747 -83760 350432 415289 389335 261569 382277 193307 121729 23966 -262842 30973
13737 30973 475278 573640 279624 -88768 -526792 -404834 -94244 266177 478472 111900
13727 111900 -83065 144655 645698 1187349 1096640 685623 658058 772436 498122 338894
13717 338894 74268 -124996 173814 282934 438018 297212 171651 21945 257746 161315
13707 161315 -57793 -242687 -118566 111776 29697 -226463 -417685 -598593 -600433 -545294
$$ packed form
13778c4032K16575J56354O2303k54209K2555j78682o5717q0003K3899K3288j97790
13767c05459j92965n4781N89287N57921J68410j89412n39319j03532o6003k57206
13757c93059K2382o0516j07675j88610K36398K80849K11832Q1503l12062J45198
13747h3760M34192O4857k5954j27766J20708j88970p1578r7763k86808K93815
13737C0973M44305R8362k94016l68392m38024J21958L10590L60421K12295l66572
13727A11900j94965K27720N01043N41651r0709m11017k7565J14378k74314j59228
13717C38894k64626j99264K98810J09120J55084j40806j25561j49706K35801r6431
13707A61315k19108j84894J24121K30342q2079k56160j91222j80908j840N5139
$$ plain form
13697 -545294 -406914 -142530 -218216 -201552 -90272 -10923 8327 143075 122257 -246103
13687 -246103 -517323 -575142 -189079 -91010 -288213 -154429 -201891 -195815 -391668 -424192 -78096
13676 -78096 102551 62277 75358 163509 176077 29753 -52383 8938 -206740 -286621 -171337
13665 -171337 25724 243101 637649 312617 -57805 -99497 -412468 -391615 -34652 -76446
13655 -76446 -150922 -91567 -17738 3011 -304378 -368040 -244898 23223 -228137 -443883 -509333
13644 -509333 -116734 333269 194137 -153606 -327101 -559192 -536984 -520058 -333375 -543676
13634 -543676 -526805 -461858 -308103 -175838 -383698 -350941 -233942 -53232 -16059 -117011
13624 -117011 48516 203709 253464 -42038 -188828 -161642 80935 98598 -110787 -34634
$$ packed form
13697e45294J38380K64384p5686J6664J11280P9349J9250J34748k0818l68360
13687b46103k71220n7819L86063R8069j97203J33784m7462O076j95853l2524L46096
13676g8096J80647m0274J3081Q8151J2568j46324q2136O1321k15678p9881J15284
13665a71337J97061K17377L94548l25032l70422m1692l12971K0853L56963m1794
13655g6446p4476N9355P3829K0749l07389o3662J23142K68121k51360k15746o5450
13644e09333L92599M50003j39132l47743j73495k32091K2208J6926J86683k10301
13634e43676J6871O4947J53755J32265k07860L2757J16999J80710L7173j00952
13624a17011J65527J55193M9755k95502j46790K7186K42577J7663k09385P6153
$$ plain form
13614 -34634 308174 404441 387917 409014 203906 -118310 -166402 19676 -159020 -254910 -220806
13603 -220806 -237234 -278707 -86379 241759 54450 -10708 -134090 -86944 71837 221809
13593 221809 186694 200044 122262 -367862 -413551 -449830 -312114 -34916 34658 -8958 -152086
13582 -152086 -190634 -119991 -278430 -473152 -490051 -245124 -169097 -449531 -652909 -508822
13572 -508822 -599209 -696159 -451405 -261372 -165314 47254 -253823 -399950 56881 274900
13562 274900 202950 278556 234244 291353 392814 355720 231872 228523 203642 300024 472920
13551 472920 -58666 -383795 -127309 475930 812153 667376 28255 -315148 -386091 -139431
13541 -139431 -165477 -47386 -32988 -356208 -204506 -119804 152591 436899 375687 156717
$$ packed form
13614c4634L42808R6267j6524K1097k05108l22216m8092J86078j78696r5890L4104
13603b20806j6428m1473J92328L28138j87309o5158j23382M7146J58781J49972
13593B21809l5115J3350p7782m90124m5689l6279J37716K77198O9574m3616j43128
13582a52086l8548P0643j58439j94722j6899K44927P6027k80434k03378J44087
13572e08822r0387r6950K44754J90033R6058K12568l01077j46127M56831K18019
13562B74900p1950P5606m4312N7109J01461l7094j23848l349k4881R6382J72896
13551D72920n31586l25129K56486O03239L36223j44777o39121l43403p0943K46660
13541a39431k6046J18091J4398l23220J51702Q4702K72395K84308o1212k18970
$$ plain form
13531 156717 -173615 -107596 -273949 -441703 -439231 -654806 -409218 -400369 -83002 212019
13521 212019 204512 305341 413591 259288 177925 112927 -12593 -25119 99027 386227
13511 386227 404827 420930 264242 395829 383757 210140 163769 -72724 -283232 -234250
13501 -234250 77801 128705 78385 -169043 255961 309555 266869 425672 603685 455355
13491 455355 317729 686974 908126 1375229 1643851 1771702 1661453 1603487 1329412 639190
13481 639190 297047 549693 851150 950837 775915 606043 560676 515653 680752 986700
13471 986700 1081626 976655 1131350 1240690 1273490 1064945 932964 1251495 1381378 1306939
13461 1306939 1465502 1347695 1306910 1457728 1451813 1822650 2005453 1789209 1809865 1698049
$$ packed form
13531A56717l30332O6019j66353j67754K472k15575K45588Q849L17367K95021
13521B12019p507J00829J08250j54303q1363o4998j25520j2526J24146K87200
13511C86227J8600J6103j56688J31587j2072j73617m6371k36493k10508M8982
13501b34250L12051N0904n0320k47428M25004N3594m2686J58803J78013j48330
13491D55355j37626L69245K21152M67103K68622J27851j10249n7966k74075o90222
13481F39190l42143K52646L01457R9687j74922j69872m5367m5023J65099L05948
13471I86700R4926j04971J54695J09340L2800k08545j31981L18531J29883p4439
13461A306939J58563j17807m0785J50818n915L70837J82803k16244K0656j11816
$$ plain form
13451 1698049 1521952 1687418 1617725 1449724 1462583 1728238 1849081 1945857 2063807 2249813
13441 2249813 2125079 1851749 1914641 1893669 1636694 1603398 1145756 1117416 1348988 1126048
13431 1126048 1291880 1626443 1573327 1787552 1989075 1804296 1759941 1872677 1929456 1900137
13421 1900137 1720104 1944504 1751767 1783027 1804917 2030375 1737942 1434852 1276332 1156790
13411 1156790 1066185 1115708 699453 679662 764582 685665 664011 354030 440769 1005057 879933
13400 879933 810317 867571 936375 1065019 1036274 1043249 1081054 814059 563420 617238 719861
13389 719861 1133339 1256636 586388 -5432 -244421 285337 548328 607856 454644 231431
13379 231431 -111096 -50218 344693 601166 374262 333097 545885 893011 1199788 1099783
$$ packed form
13451A698049j76097J65466o9693j68001J2859K65655J20843R6776J17950J86006
13441B249813j24734k73330O2892k0972k56975l3296m57642k8340K31572k22940
13431A126048J65832L34563n3116K14225K01523j84779m4355J12736N6779k9319
13421A900137j80033K24400j92737L1260K1890K25458k92433l03090j58520j19542
13411A156790r0605M9523m16255j9791Q4920p8917k1654l09981Q6739N64288j25124
13400H79933o9616N7254O8804J28644k8745O975L7805k66995k50639N3818J02623
13389G19861M13478J23297o70248n91820k38989N29758K62991N9528j53212k23213
13379B31431l42527O0878L94911K56473k26904m1165K12788L47126L06777j00005
$$ plain form
13369 1099783 702568 394932 391573 574401 514336 638139 668366 356774 111034 65839
13359 65839 3152 130825 455702 407816 240636 279218 347051 356661 109557 -78919 69452
13348 69452 -42771 5166 445408 579843 383106 441854 201906 -172736 -26751 -151094
13338 -151094 -339948 -334535 -175917 -62690 -302728 -453210 -364290 -332145 142070 231981
13328 231981 309117 148277 328529 520272 635604 732224 851064 432512 423046 444860
13318 444860 455781 346628 108190 344857 200960 414973 456097 444036 106103 -47166
13308 -47166 174951 520548 810722 756100 470238 724157 1076838 944149 703677 425477
13298 425477 110271 145492 170204 290066 216853 477576 443314 311543 275025 779813
$$ packed form
13369A099783l97215l07636l359J82828o0065J23803L0227l11592k45740m5195
13359F5839o2687J27673L24877m7886j67180L8582O7833R610k47104j88476J48371
13348F9452j12223M7937M40242J34435j96737N8748k39948l74642J45985j24343
13338a51094j88854N413J58618J13227k40038j50482Q8920L2145M74215Q9911
13328B31981P7136j60840J80252J91743J15332R6620J18840m18552r466K1814
13318D44860J0921j09153k38438K36667j43897K14013M1124j2061l37933j53269
13308d7166K22117L45597K90174n4622k85862K53919L52681j32689k40472k78200
13298D25477l15206L5221K4712J19862p3213K60723l4262j31771l6518N04788
$$ plain form
13288 779813 1225284 1193841 1070211 684512 676877 933482 953160 747892 485768 456703
13278 456703 462194 401688 356170 532007 809753 1187733 1017439 724842 527783 596113
13268 596113 520450 606831 734214 1040966 987366 964941 931248 689400 421646 835537
13258 835537 1023377 939650 757602 380246 503654 709145 954140 836032 317093 503663
13248 503663 876898 813214 819185 533963 360794 576625 416253 432036 761591 665420
13238 665420 534122 467322 207392 415231 319789 44612 104288 108396 97365 -24628 31075
13227 31075 303746 418794 594926 663781 862230 939496 1030121 899611 923982 1098622
13217 1098622 889395 394766 327704 613176 739355 300575 125530 313577 106755 -166207
$$ packed form
13288G79813M45471l1443j23630l85699p635K56605J9678k05268k62124k9065
13278D56703N491o0506m5518J75837K77746L77980j70294k92597j97059O8330
13268E96113p5663Q6381J27383L06752n3600k2425l3693k41848k67754M13891
13258H35537J87840q3727j82048l77356J23408K05491K44995j18108n18939J86570
13248E03663L73235o3684N971k85222j73169K15831j60372J5783L29555r6171
13238F65420j31298o6800k59930K07839r5442k75177N9676M108j1031j21993N5703
13227C1075K72671J15048J76132O8855J98449P7266R0625j30510K4371J74640
13217A098622k09227m94629o7062K85472J26179m38780j75045J88047k06822k72962
$$ plain form
13207 -166207 -15166 177072 639994 1002865 1648731 1699527 1926385 1993665 1940243 1992803
13197 1992803 1830804 1838990 1949917 2313920 2659810 2546125 2372709 2575848 2624816 2438701
13187 2438701 2298638 2678038 3099480 3187757 2748548 2683841 2472274 2450764 2347770 2019291
13177 2019291 1832607 1901132 1939576 2141131 2403307 2445684 2338361 2412196 2522626 2431787
13167 2431787 2109974 2020073 1985895 1890503 2185786 2388941 2470188 2777274 3020564 3104801
13157 3104801 2639508 2556333 2514140 2561641 2864383 3194196 3232463 3362359 3312419 3311728 3203062
13146 3203062 3038733 2804410 2858371 2526043 2384278 2301635 1984960 2286460 2726284 2853960
13136 2853960 2990006 3268062 3289658 3227830 3152618 3420478 3507583 3231554 3042931 3555543
$$ packed form
13207a66207J51041J92238M62922L62871O45866N0796K26858O7280n3422N2560
13197A992803j61999Q186J10927L64003L45890j13685j73416K03139M8968j86115
13187B438701j40063L79400M21442Q8277m39209o4707k11567k1510j02994l28479
13177B019291j86684O8525L8444K01555K62176M2377j07323P3835J10430r0839
13167B431787l21813q9901l4178r5392K95283K03155Q1247L07086K43290Q4237
13157C104801m65293q3175m2193M7501L02742L29813L8267J29896m9940o91j08666
13146C203062j64329k34323N3961l32328j41765q2643l16675L01500M39824J27676
13136B853960J36046K78056K1596o1828p5212K67860Q7105k76029j88623N12612
$$ plain form
13126 3555543 3744719 3552918 3301475 3305122 3498906 3582852 3347775 3293217 3718837 3966003
13116 3966003 3826405 3342447 2831231 2879907 3165413 3374392 3266634 3447294 3643420 3351392
13106 3351392 3578347 4019077 4126991 4479523 4398019 4204308 4177627 4355499 4456794 4242919
13096 4242919 4333931 4701221 4963829 4864647 4660885 5119406 5632518 5634582 6149931 6645329
13086 6645329 6827352 7151536 7844885 8674879 9002761 9432372 10166354 11056571 11900794
13077 11900794 12658516 13685530 14930040 16150841 17966889 20102877 22359048 24655358
13069 24655358 27248609 30758165 34982416 40632827 46813447 54121782 63061966 73299933
13061 73299933 85836815 101747076 121979644 147289097 178460077 215750729 256853474
$$ packed form
13126C555543J89176j91801k51443L647J93784Q3946k35077n4558M25620K47166
13116C966003j39598m83958n11216M8676K85506K08979j07758J80660J96126k92028
13106C351392K26955M40730J07914L52532q1504j93711k6681J77872J01295k13875
13096D242919R1012L67290K62608r9182k03762M58521N13112K064N15349M95398
13086F645329J82023L24184O93349Q29994L27882M29611P33982Q90217Q44223
13077A1900794P57722J027014J244510J220801J816048K135988K256171K296310
13069B4655358K593251L509556M224251N650411O180620P308335Q940184J0237967
13061G3299933J2536882J5910261K0232568K5309453L1170980L7290652M1102745
$$ plain form
13054 256853474 295636410 324572388 337159353 330397469 308124701 278158295 247332195
13047 247332195 220237445 199052442 184561146 176244995 173727760 176650977 184174530
13040 184174530 194616655 206966456 219095856 229829355 238525935 243790199 244811855
13033 244811855 241794290 236899956 231986846 228766843 229085989 233657776 243115534 257589402
13025 257589402 276862537 300522375 325105091 347047201 363062000 370182045 366701743
13018 366701743 353562709 332739045 308520055 284684814 264500542 248920457 238800356
13011 238800356 234381982 234521609 238726088 246038797 254851645 263326378 269436536 271659039
13003 271659039 269290844 263152145 254901876 245657452 236304494 228770228 224715414 225820394
$$ packed form
13054B56853474L8782936K8935978J2586965o761884k2272768k9966406l0826100
13047B47332195k7094750k1185003j4491296q316151k517235K923217P523553
13040A84174530J0442125J2349801J2129400J0733499Q696580N264264J021656
13033B44811855l017565m894334m913110l220003L19146M571787R457758J4473868
13025B57589402J9273135K3659838K4582716K1942110J6014799P120045l480302
13018C66701743j3139034k0823664k4218990k3835241k0184272j5580085j0120101
13011B38800356m418374J39627M204479P312709Q812848Q474733O110158K222503
13003B71659039k368195o138699q250269r244424r352958p534266m054814J104980
$$ plain form
12995 225820394 232595116 245887626 265353623 291193241 322247016 354630430 383745387
12988 383745387 402973322 405237659 388045299 354648560 311822685 268343952 230433642
12981 230433642 199828098 176212570 158048655 144191289 132916764 123441518 115711583
12974 115711583 109158848 103451615 98648904 94544704 91080312 87887538 84816416 81962639
12966 81962639 79216690 76316555 74230310 72473745 70511913 68793218 67012949 65176610
12958 65176610 63424251 62182401 60593126 58626324 56736082 54979443 53357939 51544140
12950 51544140 50041285 48738709 47504481 46327366 45383847 44469975 43351093 42607625
12942 42607625 41954171 41167496 40479118 39802550 39475720 39057347 38430361 37809420 37560926
$$ packed form
12995B25820394O774722J3292510J9465997K5839618L1053775L2383414K9114957
12988C83745387J9227935K264337j7192360l3396739m2825875m3478733l7910310
12981B30433642l0605544k3615528j8163915j3857366j1274525r475246p729935
12974A15711583o552735n707233m802711m104200l464392l192774l071122k853777
12966H1962639k745949k900135k086245j756565j961832j718695j780269j836339
12958F5176610j752359j241850j589275j966802j890242j756639j621504j813799
12950E1544140j502855j302576j234228j177115r43519r13872j118882p43468
12942D2607625o53454p86675o88378o76568l26830m18373o26986o20941k48494
$$ plain form
12933 37560926 36713563 35785496 35208432 34545318 34067858 33552808 33321024 32868455 32078604
12924 32078604 31304737 30823445 30386379 30115371 29939464 29461342 28617062 28412410 28197298
12915 28197298 27515370 26815212 26385099 25739683 25351458 24672407 24415859 24275082 23637730
12906 23637730 23336292 22992513 22851315 22617230 22364507 22042905 21713370 21225961 20739466
12897 20739466 20138733 19324021 18598009 17939549 17641011 17462066 17012709 16088680 15841378
12888 15841378 15728133 15433540 14995827 14843969 14520740 14103317 13944534 13321510 12674870
12879 12674870 12337157 12037908 11614511 11042373 10800523 10696821 10353490 9926844 9587086
12870 9587086 9284939 9205093 9043894 8827668 8439598 8332203 8427531 8245360 7749118 7244151
$$ packed form
12933C7560926q47363r28067n77064o63114m77460n15050k31784m52569p89851
12924C2078604p73867m81292m37066k71008j75907m78122q44280k04652k15112
12915B8197298o81928p00158m30113o45416l88225o79051k56548j40777o37352
12906B3637730l01438l43779j41198k34085k52723l21602l29535m87409m86495
12897B0739466o00733q14712p26012o58460k98538j78945m49357r24029k47302
12888A5841378j13245k94593m37713j51858l23229m17423j58783o23024o46640
12879A2674870l37713k99249m23397n72138k41850j03702l43331m26646l39758
12870I587086l02147p9846j61199k16226l88070j07395R5328j82171m96242n04967
$$ plain form
12860 7244151 7152740 6845228 6600271 6928743 6683716 6162548 6056127 5741404 5504949 5603504
12850 5603504 5897284 5809050 5715092 5718230 5645111 5589957 5372739 5143459 5155266 4810842 4601166
12839 4601166 4343904 4203517 4001071 3727436 3598542 3621293 3022625 2775295 3064931 3271591
12829 3271591 2918154 2414501 2409410 2864204 3217576 3433471 2849520 2425481 2244258 2454655
12819 2454655 2823347 2481257 2619813 2660340 2726490 2735552 2465860 2508467 2659032 2265948
12809 2265948 2096876 2215936 2236925 2203539 2334068 2374371 2373320 2677712 2941113 3078852
12799 3078852 2833768 2655142 2609547 2700523 2544411 2438120 2610687 3021248 2959482 2697700
12789 2697700 2462272 2413645 2302131 2263256 2123252 2096159 2018453 2300786 2489252 2354501
$$ packed form
12860G244151r1411l07512k44957L28472k45027n21168j06421l14723k36455R8555
12850E603504K93780q8234r3958L138p3119n5154k17218k29280J1807l44424k09676
12839D601166k57262j40387k02446k73635j28894K2751n98668k47330K89636K06660
12829C271591l53437n03653n091M54794L53372K15895n83951m24039j81223K10397
12819B454655L68692l42090J38556M0527O6150R062k69692M2607J50565l93084
12809B265948j69072J19060K0989l3386J30529M0303j051L04392K63401J37739
12799C078852k45084j78626m5595R0976j56112j06291J72567M10561o1766k61782
12789B697700k35428m8627j11514l8875j40004k7093p7706K82333J88466j34751
$$ plain form
12779 2354501 2490059 2645949 2617306 2691878 2820564 2765973 2735846 2866122 2508529 2393723
12769 2393723 2575378 2747583 2833486 2444216 2387335 2480315 2603127 2849277 2405946 1871387
12759 1871387 1849228 2316477 2460237 2604774 2986164 3109044 2536331 2330380 2524001 2735874
12749 2735874 2539589 2093700 1702194 1655518 1979351 2163699 1871929 1886013 1917976 2113951
12739 2113951 2034891 1942509 2081053 2085320 2140101 1956720 1918182 2003816 2068964 1746382 1356012
12728 1356012 1451933 1737102 1627281 1664033 1749384 1616803 1783653 1875386 1570260 1647567
12718 1647567 1773494 1616000 1763362 1838153 1865545 1464571 1718390 1627826 1623028 1523991
12708 1523991 1255580 796322 671402 978915 1042955 1044035 596813 772154 879914 842065
$$ packed form
12779B354501J35558J55890k8643P4572J28686n4591l0127J30276l57593j14806
12769B393723J81655J72205Q5903l89270n6881R2980J22812K46150m43331n34559
12759A871387k2159M67249J43760J44537L81390J22880n72713k05951J93621K11873
12749B735874j96285m45889l91506m6676L23833J84348k91770J4084L1963J95975
12739B113951p9060r2382J38544M267N4781j83381l8538Q5634O5148l22582l90370
12728A356012R5921K85169j09821L6752Q5351j32581J66850R1733l05126P7307
12718A647567J25927j57494J47362P4791K7392m00974K53819r0564m798r9037
12708A523991k68411m59258j24920L07513O4040J080m47222J75341J07760l7849
$$ plain form
12698 842065 1073030 1070418 625659 517468 672484 774109 1186501 1256236 983257 974047
12688 974047 925378 967489 881192 767110 851449 909689 949448 762529 503489 452779 553337
12677 553337 742658 1021491 1258289 990743 816401 922883 1000200 1077908 1031814 1201376
12667 1201376 1154730 792890 881307 976606 1006354 903368 900015 928421 732481 338274 177533
12656 177533 490931 615021 827921 1053912 956394 995833 985160 633873 425030 705148
12646 705148 946879 699603 397568 294813 302146 204878 207251 342669 292801 412786 502556
12635 502556 802669 981020 585907 378871 592332 791095 767759 872005 603104 695600
12625 695600 939134 1110406 1066216 1105221 885887 969687 1227417 1220876 1343352 1513955
$$ packed form
12698H42065K30965k612m44759j08191J55016J01625M12392O9735k72979r210
12688I74047m8669M2111q6297j14082Q4339N8240L9759j86919k59040n0710J00558
12677E53337J89321K78833K36798k67546j74342J06482P7317P7708m6094J69562
12667A201376m6646l61840Q8417R5299K9748j02986l353K8406j95940l94207j60741
12656A77533L13398J24090K12900K25991r7518L9439j0673l51287k08843K80118
12646G05148K41731k47276l02035j02755P333r7268K373J35418m9868J19985Q9770
12635E02556L00113J78351l95113k07036K13461J98763k3336J04246k68901R2496
12625F95600K43534J71272m4190L9005k19334Q3800K57730o541J22476J70603
$$ plain form
12615 1513955 1869189 1976905 2122998 2474185 2522617 2444268 2156298 2274060 2119284 1706668
12605 1706668 1645011 1737182 1658275 1436810 1610308 1662916 1535940 1551937 1791968 1749641
12595 1749641 1617623 1556664 1602287 1936170 1868187 2013547 2062677 2200063 2117958 1824664
12585 1824664 1936319 2367980 2589298 2423250 2301336 2129134 2318965 2415829 2386611 2489042
12575 2489042 2653610 2490996 2465648 2167230 1852921 1657831 1662070 1391443 1220276 1388085
12565 1388085 1684453 2018765 1881451 1732653 1734406 1835647 1813152 2008092 1885584 1960134
12555 1960134 1705665 1623391 1611147 2097349 2193298 1879618 1829022 2110439 2270450 2558863
12545 2558863 2775909 2575941 1980118 1434807 1463162 1678199 1328405 772452 980267 1314370
$$ packed form
12615A513955L55234J07716J46093L51187M8432p8349k87970J17762j54776m12616
12605A706668o1657R2171p8907k21465J73498N2608j26976J5997K40031m2327
12595A749641j32018o0959M5623L33883o7983J45360M9130J37386q2105k93294
12585A824664J11655M31661K21318j66048j21914j72202J89831R6864k9218J02431
12575B489042J64568j62614k5348k98418l14309j95090M239k70627j71167J67809
12565A388085K96368L34312j37314j48798J753J01241k2495J94940j22508P4550
12555A960134k54469q2274j2244M86202R5949l13680n0596K81417J60011K88413
12545B558863K17046j99968n95823n45311K8355K15037l49794n55953K07815L34103
$$ plain form
12535 1314370 1249291 1140544 1218796 1026455 667546 784701 859700 698839 746153 670947
12525 670947 904202 975729 866504 1178724 1342010 1346317 1288538 1150879 854887 889875
12515 889875 820868 686958 644744 501413 594013 384067 319619 368748 538707 570007 505068
12504 505068 739851 787713 911643 813152 786994 902282 755634 124082 63720 382704
12494 382704 612574 915845 666340 366601 73552 -86255 90625 248278 666322 1034365
12484 1034365 1092583 896372 833213 980383 867431 567693 825752 814697 709362 487219
12474 487219 573028 562575 851997 918311 1152440 1490766 1697601 1253768 1068543 929812
12464 929812 923864 776511 425473 463205 556777 601727 631063 849852 835673 691614 820828
$$ packed form
12535A314370o5079j08747P8252j92341l58909J17155P4999j60861M7314p5206
12525F70947K33255P1527j09225L12220J63286M307n7779j37659k95992L4988
12515H89875o9007j33910m2214j43331R2600k09946o4448M9129J69959L1300o4939
12504E05068K34783M7862J23930r8491k6158J15288j46648o31552o0362L18984
12494C82704K29870L03271k49505k99739k93049j59807J76880J57653M18044L68043
12484A034365N8218j96211o3159J47170j12952k99738K58059j1055j05335k22143
12474D87219Q5809j0453K89422O6314K34129L38326K06835m43833j85225j38731
12464I29812n948j47353l51038L7732R3572M4950K9336K18789j4179j44059J29214
$$ plain form
12453 820828 691372 619209 838069 813137 859161 713461 475924 260270 393295 243152
12443 243152 37078 264694 312346 266856 358350 500116 427566 274208 262157 610550
12433 610550 888357 1120228 821659 590888 508395 495392 672339 1004625 928852 699207
12423 699207 485442 212221 -29548 371564 440632 364518 414002 476867 601002 479029
12413 479029 572886 744055 790972 931196 595049 173661 35917 94797 87769 164133 221717
12402 221717 197389 -2920 216418 245789 101458 154364 370361 227613 -208108 -339406
12392 -339406 205002 348551 451448 621948 491518 453728 386198 552585 548543 320429
12382 320429 429848 335620 52695 306857 417723 272219 19662 73012 146868 235738
$$ packed form
12453H20828j29456p2163K18860k4932M6024j45700k37537k15654J33025j50143
12443B43152k06074K27616M7652m5490R1494J41766p2550j53358j2051L48393
12433F10550K77807K31871k98569k30771q2493j3003J76947L32286p5773k29645
12423F99207k13765k73221k41769M01112O9068p6114M9484O2865J24135j21973
12413D79029R3857J71169M6917J40224l36147m21388j37744N8880p028P6364N7584
12402B21717k4328k00309K19338K9371j44331N2906K15997j42748m35721j31298
12392c39406N44408J43549J02897J70500j30430l7790o7530J66387m042k28114
12382C20429J09419r4228k82925K54162J10866j45504k52557N3350P3856Q8870
$$ plain form
12372 235738 46360 57553 351425 355000 151202 -20577 -79683 40180 75398 346835
12362 346835 363624 362944 237191 -186460 -205629 -82677 160680 574042 407016 375905 474748
12351 474748 572319 753057 601007 187962 321646 110290 215126 700559 376279 218474
12341 218474 546755 822790 958520 736387 245768 282447 367194 48651 343795 498999
12331 498999 108776 -4308 -90438 -148389 -326036 -256525 -231436 -105689 -44662 183732
12321 183732 447689 808544 644171 158522 -88001 195437 62498 -98386 31310 83776
12311 83776 -40750 235467 316050 613073 497102 22588 80614 -339666 -366788 -98597
12301 -98597 9598 -225559 -307742 -285914 -352971 -619955 -705637 -427862 -154869 206626
$$ packed form
12372B35738j89378J1193K93872L575k03798j71779n9106J19863L5218K71437
12362C46835J6789o80j25753m23651j9169J22952K43357M13362j67026l1111R8843
12351D74748R7571J80738j52050m13045J33684k11356J04836M85433l24280j57805
12341B18474L28281K76035J35730k22133m90619L6679Q4747l18543K95144J55204
12331D98999l90223j13084q6130n7951j77647O9511K5089J25747O1027K28394
12321A83732K63957L60855j64373m85649k46523K83438j32939j60884J29696N2466
12311H3776j24526K76217Q0583K97023j15971m74514N8026m20280k7122K68191
12301i8597J08195k35157q2183K1828o7057k66984q5682K77775K72993L61495
$$ plain form
12291 206626 415249 125630 289117 367742 438403 411232 499231 388767 -45652 -547724
12281 -547724 -531849 -816317 -851999 -540064 -486366 -499851 -266975 -315033 -380697 -192434 -400563
12270 -400563 -459003 -99696 19465 130822 -78765 -82158 370973 530885 534334 359052
12260 359052 546528 758703 673992 142145 -91882 -100180 15588 -108 93766 630650
12250 630650 659141 424291 531825 472913 640227 667158 452044 182744 228645 173608
12240 173608 26167 92501 -76508 5511 145420 56557 -49119 -55189 -143461 -637149 -768158
12229 -768158 -791090 -757115 -670383 -617792 -931962 -1132469 -1139979 -894904 -379148 -418934 -309979
12218 -309979 -259787 -43493 123879 157330 -335681 -330557 35713 -160655 -301932 180880
$$ packed form
12291B06626K08623k89619J63487P8625P0661k7171Q7999j10464m34419n02072
12281e47724J5875k84468l5682L11935N3698j3485K32876m8058o5664J88263k08129
12270d00563n8440L59307J19161J11357k09587l393M53131J59912L449j75282
12260C59052J87476K12175q4711n31847k34027q298J15768j5696R3874N36884
12250F30650K8491k34850J07534n8912J67314K6931k15114k69300M5901n5037
12240A73608j47441O6334j69009Q2019J39909q8863j05676o070q8272m93688j31009
12229g68158k2932L3975Q6732N2591l14170k00507p510K45075N15756l9786J08955
12218c09979N0192K16294J67372L3451m93011N124L66270j96368j41277M82812
$$ plain form
12208 180880 235358 -57591 94471 223360 136143 210716 493860 547520 367436 201676
12198 201676 138747 102147 274064 524071 722615 454315 233273 68924 -73430 139592
12188 139592 126897 240156 398081 475825 379992 220682 80162 248737 94542 110718
12178 110718 -84184 -318075 -510598 -435571 -179472 -140572 -208674 -297300 -422357 -246533
12168 -246533 113264 596707 426266 461833 637660 154090 -123691 -192531 -240843 -214767
12158 -214767 -98694 -40835 6227 265046 821383 1017854 838618 526890 354127 64896
12148 64896 321784 567846 294349 185003 560023 551502 466552 280253 91382 343131
12138 343131 317539 406749 162653 -56877 -79 101125 -116780 -911553 -722896 -366020
$$ packed form
12208A80880N4478k92949J52062J28889q7217P4573K83144N3660j80084j65760
12198B01676o2929l6600J71917K50007J98544k68300k21042j64349j42354K13022
12188A39592j2695J13259J57925P7744r5833j59310j40520J68575j54195J6176
12178A10718j94902k33891j92523P5027K56099L8900o8102q8626j25057J75824
12168b46533L59797M83443j70441L5567J75827m83570k77781o8840m8312K6076
12158b14767J16073N7859M7062K58819N56337J96471j79236l11728j72763k89231
12148F4896K56888K46062k73497j09346L75020q521q4950j86299j88871K51749
12138C43131k5592Q9210k44096k19530N6798J01204k17905p94773J88657L56876
$$ plain form
12128 -366020 -133490 -77266 -12717 -353147 -401529 -91016 -48736 -36926 147247 304175
12118 304175 -24070 -291583 -536121 -898157 -856631 -850812 -571946 -426876 -264856 -440860
12108 -440860 -659956 -847881 -682311 -643486 -582695 -783577 -610403 75975 285592 308232
12098 308232 78395 -221512 -414948 -134774 -221522 -371958 -235679 39074 -49723 -202501
12088 -202501 -138638 -304802 -432221 -369405 -264397 -32231 102096 50964 -261081 -410448
12078 -410448 -94213 203773 94783 9292 53237 -245073 -135067 88228 -93756 -422409
12068 -422409 -303125 -244004 -132285 -7323 185973 202387 272873 366411 79479 29241
12058 29241 201681 443071 545548 228746 -50742 145249 -35048 -8065 121602 -41993
$$ packed form
12128c66020K32530N6224O4549l40430m8382L10513M2280J1810J84173J56928
12118C04175l28245k67513k44538l62036M1526N819K78866J45070J62020j76004
12108d40860k19096j87925J65570L8825O0791k00882J73174O86378K09617K2640
12098C08232k29837k99907j93436K80174q6748j50436J36279K74753q8797j52778
12088b02501O3863j66164j27419O2816J05008K32166J34327n1132l12045j49367
12078d10448L16235K97986j08990q5491M3945k98310J10006K23295j81984l28653
12068d22409J19284N9121J11719J24962J93296J6414P0486R3538k86932n0238
12058B9241J72440K41390J02477l16802k79488J95991j80297K6983J29667j63595
$$ plain form
12048 -41993 223511 322702 185566 139231 -10776 -64769 -285922 -327541 -434027 -245256
12038 -245256 -234442 -62939 -23863 -155685 -117291 -489121 -199057 -121705 -124296 -147302 -42959
12027 -42959 -55117 -49834 -47381 143097 40101 -252334 -431684 -458512 -350974 -149059 218276
12016 218276 164895 165402 -125830 -210621 -167467 149017 308691 428592 597655 688844 411520
12005 411520 -7338 -316724 -169992 -298693 -197193 17722 369297 29230 99996 555670
11995 555670 260735 155646 308421 845509 697391 341303 196980 187797 219295 203359
11985 203359 303751 237336 230004 312194 281655 124777 -133734 -346218 -10831 47426 -588803
11974 -588803 -702364 -473622 -380531 -375880 -314159 24083 59765 219642 673666 542164
$$ packed form
12048d1993K65504R9191j37136m6335j50007n3993k21153m1619j06486J88771
12038b45256J0814J71503L9076j31822L8394l71830K90064P7352k591k3006J04343
12027d2959j2158N283K453J90478j02996k92435j79350k6828J07538K01915L67335
12016B18276n3381N07k91232q4791M3154L16484J59674J19901J69063R1189k77324
12005D11520m18858l09386J46732j28701J01500K14915L51575l40067P0766M55674
11995E55670k94935j05089J52775N37088j48118l56088j44323r183L1498j5936
11985B03359J00392o6415p332Q2190l0539j56878k58511k12484L35387N8257o36229
11974e88803j13561K28742R3091M651O1721L38242L5682J59877M54024j31502
$$ plain form
11964 542164 315775 368031 186862 -315536 -635244 -398391 -160738 -238654 -187290 -78813
11954 -78813 -71915 -115531 -428857 -306781 110063 309277 -27985 -301885 -248678 -400938
11944 -400938 -371917 -271549 -90286 183046 473912 644542 578079 234726 107046 33507
11934 33507 7963 269277 88981 -5039 78450 343318 510085 108256 32057 235765
11924 235765 355184 144670 109942 32754 211640 210390 177790 210302 42066 -465168 -552603
11913 -552603 -193707 31747 -202125 -248994 -66578 -18022 177002 130345 62573 83271
11903 83271 57313 -139513 -288816 -634035 -1084978 -972636 -621804 -448446 -342986 -103301
11893 -103301 -208650 -338746 13763 244392 -13179 -94952 -127046 -191904 72580 410406
$$ packed form
11964E42164k26389N2256j81169n02398l19708K36853K37653p7916N1364J08477
11954g8813O898m3616l13326J22076M16844J99214l37262k73900N3207j52260
11944d00938K9021J00368J81263K73332K90866J70630o6463l43353j27680p3539
11934C3507k5544K61314j80296r4020Q3489K64868J66767m01829p6199K03708
11924B35765J19419k10514l4728p7188J78886j250l2600L2512j68236n07234q7435
11913e52603L58896K25454k33872m6869J82416M8556J95024m6657o7772K0698
11903H3271k5958j96826j49303l45219m50943J12342L50832J73358J05460K39685
11893a03301j05349j30096L52509K30629k57571q1773l2094o4858K64484L37826
$$ plain form
11883 410406 414754 305552 71491 106309 300175 289919 -150094 -439596 -363689 -359870 -62829
11872 -62829 -307501 -588024 -337903 -169550 -283588 -298851 -99896 -240271 -384328 -191583
11862 -191583 -170164 -11407 33895 -332950 -512870 -421382 -395261 -726316 -540885 -247617
11852 -247617 -35245 58433 124835 -76574 22797 88292 -45425 147024 241908 6436
11842 6436 -223495 -238463 -119329 -284840 -403408 -575098 -1116646 -1331984 -1014297 -412738
11832 -412738 -11914 -147786 -138126 -340262 -141810 37380 -68260 2837 87071 57898
11822 57898 98999 -5920 -5697 208372 217458 96618 156794 285453 71016 76716 368908
11811 368908 640323 519722 206909 -51937 259494 183661 -131784 -172055 206086 257513
$$ packed form
11883D10406M348j09202k34061L4818J93866j0256m40013k89502P5907L819K97041
11872f2829k44672k80523K50121J68353j14038j5263J98955j40375j44057J92745
11862a91583K1419J58757M5302l66845j79920R1488K6121l31055J85431K93268
11852b47617K12372R3678O6402k01409R9371O5495j33717J92449R4884k35472
11842F436k29931j4968J19134j65511j18568j71690n41548k15338L17687O01559
11832d12738M00824j35872R660k02136J98452J79190j05640P1097Q4234k9173
11822E7898M1101j04919K23K14069R086j20840O0176J28659k14437N700K92192
11811C68908K71415j20601l12813k58846L11431p5833l15445m0271L78141N1427
$$ plain form
11801 257513 271022 162237 -141498 400849 604416 391290 148847 306008 280913 267897
11791 267897 472487 659270 460340 433899 419803 143191 -53324 -7165 331116 341699
11781 341699 -104253 -344845 -303799 -464349 -484467 -342294 -241584 -78347 125033 233257
11771 233257 -8349 -65283 -171203 -199238 68615 472069 781463 795945 484446 245807
11761 245807 343488 413303 433741 496121 105977 222128 636765 597464 500353 534710 405998
11750 405998 -35272 -138161 14131 461738 726989 329762 -186256 -102026 66398 216726
11740 216726 437511 402639 137168 -3115 197643 327881 372791 -7825 -68959 -259686
11730 -259686 -353335 -139615 21071 160768 63364 -73379 -24687 -280231 -256736 -149297
$$ packed form
11801B57513J3509j08785l03735N42347K03567k13126k42443J57161k5095j3016
11791B67897K04590J86783j98930k6441j4096k76612j96515M6159L38281J0583
11781C41699m45952k40592M1046j60550k0118J42173J00710J63237K03380J08224
11771B33257k41606n6934j05920k8035K67853M03454L09394J4482l11499k38639
11761B45807R7681O9815K0438O2380l90144J16151M14637l9301r7111L4357j28712
11750D05998m41270j02889J52292M47607K65251l97227n16018Q4230J68424J50328
11740B16726K20785l4872k65471j40283K00758J30238M4910l80616o1134j90727
11730b59686r3649K13720J60686J39697r7404j36743M8692k55544K3495J07439
$$ plain form
11720 -149297 -166861 -61906 -113362 -136378 115136 123747 -44871 -301780 -331657 -229510 -389710
11709 -389710 -410012 -528692 -431740 -302137 -107628 -91370 -130669 -17387 100695 136103
11699 136103 364854 321335 -109548 -101903 19387 123265 60671 19822 -362188 -565685
11689 -565685 -187971 -102301 -329239 -445935 -183765 211504 116253 -53250 -253062 -692113
11679 -692113 -501566 -139597 215960 20710 -503642 -711556 -353059 18923 -11427 -24349
11669 -24349 -53489 -365814 -471874 -328324 -114499 402395 432062 183059 294508 202164
11659 202164 286910 160169 -161744 -243560 -380130 -449889 -564138 -499473 -461141 -571514
11649 -571514 -723737 -549603 -528990 -525873 -582145 -315981 -96582 -222067 -330510 -291610
$$ packed form
11720a49297j7564J04955n1456k3016K51514Q611j68618k56909k9877J02147j60200
11709c89710k0302j18680R6952J29603J94509J6258l9299J13282J18082L5408
11699A36103K28751m3519m30883P645J21290J03878o2594m0849l82010k03497
11689e65685L77714Q5670k26938j16696K62170L95269r5251j69503j99812m39051
11679f92113J90547L61969L55557j95250n24352k07914L58497L71982l0350j2922
11669b4349k9140l12325j06060J43550K13825N16894K9667k49003J11449r2344
11659B02164Q4746j26741l21913q1816j36570o9759j14249O4665L8332j10373
11649e71514j52223J74134K0613L117n6272K66164K19399j25485j08443L8900
$$ plain form
11639 -291610 112807 30165 82754 162198 37115 -72777 8649 -495027 -575466 -183516
11629 -183516 -96438 72689 148733 69303 10134 -114333 -361368 -370189 -275457 -124432 34852
11618 34852 -88917 63654 98418 -166954 -127645 187716 300609 62745 3694 47520
11608 47520 -226844 -30299 368039 117401 238223 118223 124121 64732 -2836 46071 -65250
11597 -65250 -390641 -653738 -643884 -557616 -142309 -80699 -39428 68311 -60485 39389 212081
11586 212081 327010 127671 -248122 -402216 -439584 -249219 -73694 -29372 -183325 26798
11576 26798 260397 304291 144536 83285 -168778 -289171 -342959 -610151 -533017 -235962
11566 -235962 104178 490750 646276 275842 18527 222120 336858 196079 38434 143739
$$ packed form
11639b91610M04417q2642N2589P9444j25083j09892Q1426n03676q0439L91950
11629a83516Q7078J69127P6044p9430n9169j24467k47035q821R4732J51025J59284
11618C4852j23769J52571L4764k65372L9309L15361J12893k37864n9051M3826
11608D7520k74364J96545L98338k50638J20822j20000N898n9389o7568M8907j11321
11597f5250l25391k63097R854Q6268M15307O1610M1271J07739j28796R9874J72692
11586B12081J14929j99339l75793j54094l7368J90365J75525M4322j53953K10123
11576B6798K33599M3894j59755o1251k52063j20393n3788k67192P7134K97055
11566b35962L40140L86572J55526l70434k57315K03593J14738j40779j57645J05305
$$ plain form
11556 143739 -112884 320449 719975 517201 241806 -121785 -149817 -495811 -383889 -142248
11546 -142248 147596 6587 -430380 -504156 -147083 68248 -79546 -51278 155677 138364
11536 138364 -17036 -39585 -283255 -396401 -246451 -116631 -40783 129329 219190 -39099
11526 -39099 -147611 -347640 -704805 -458971 -212032 -76999 322906 402479 407020 526709
11516 526709 481535 468531 528158 438668 252259 -41418 141550 351118 173424 -230142
11506 -230142 -157206 -17740 -181110 -291569 -301412 11578 197938 161837 17700 1013
11496 1013 -129215 -205213 -292908 -250816 -366726 -255103 7788 56570 160417 221865 280230
11485 280230 365211 297587 -277332 -447038 52849 63755 6585 -264501 -198724 -5104
$$ packed form
11556A43739k56623M33333L99526k02774k75395l63591k8032l45994J11922K41641
11546a42248K89844j41009m36967p3776L57073K15331j47794K8268K06955j7313
11536A38364j55400k2549k43670j13146J49950J29820P5848J70112Q9861k58289
11526c9099j08512k00029l57165K45834K46939J35033L99905P9573M541J19689
11516E26709m5174j3004N9627q9490j86409k93677J82968K09568j77694m03566
11506b30142P2936J39466j63370j10459r843L12990J86360l6101j44137j6687
11496A013j30228p5998q7695M2092j15910J11623K62891M8782J03847O1448N8365
11485B80230Q4981o7624n74919j69706M99887J0906n7170k71086O5777J93620
$$ plain form
11475 -5104 -62246 130044 391837 196808 50625 170552 -38710 -237276 -113088 162424
11465 162424 209282 -223941 -127737 -7065 316615 342919 471082 668958 538565 256106
11455 256106 414569 448234 527599 78117 166514 489464 455197 545900 469633 449155 62976
11444 62976 -158760 -226736 -198048 -1502 -231160 -858806 -800848 -434743 -65648 103410
11434 103410 11837 65915 24282 133928 200303 131683 54713 92347 15394 -191974 -407004
11423 -407004 -209138 138661 -147459 -555875 -573601 -252352 -200307 -495592 -401515 -408416
11413 -408416 -157593 277081 234587 -9025 -209224 -37588 -167852 -207198 -164745 -113102
11403 -113102 -86281 -349105 -510878 -84034 465485 649073 455976 318302 334590 364105
$$ packed form
11475e104n7142J92290K61793j95029j46183J19927k09262j98566J24188K75512
11465A62424M6858m33223R6204J20672L23680K6304J28163J97876j30393k82459
11455B56106J58463L3665P9365m49482Q8397L22950l4267R0703p6267k0478l86179
11444F2976k21736o7976K8688J96546k29658o27646N7958L66105L69095J69058
11434A03410r1573N4078m1633J09646O6375o8620p6970L7634p6953k07368k15030
11423d07004J97866L47799k86120m08416j7726L21249N2045k95285R4077o901
11413d08416K50823M34674m2494k43612k00199J71636j30264l9346M2453N1643
11403a13102K6821k62824j61773M26844N49519J83588j93097j37674J6288K9515
$$ plain form
11393 364105 404978 504677 570237 479250 101405 -222029 -277947 -111553 102581 110933 101684
11382 101684 -117997 -139622 -36082 -168392 -186365 -457078 -465294 -189648 64332 -321726
11372 -321726 -630697 -347386 224058 354007 246071 226897 279158 421370 640070 481872
11362 481872 387155 687340 832332 817761 1157862 1416389 1820830 2193820 2103984 1648545
11352 1648545 1124432 957470 918890 882320 710894 971539 1344748 1521993 1443648 1238690
11342 1238690 887344 726545 854711 874383 1003328 1314117 1596403 1605211 1427078 1322565
11332 1322565 1507475 1585444 1473885 1351918 1087572 1132320 1144280 1261877 1528137 1812051
11322 1812051 1959368 1926427 1898534 1805975 1950715 1800524 1574285 1612336 1763818 1556478
$$ packed form
11393C64105M0873R9699O5560r0987l77845l23434n5918J66394K14134Q352r249
11382A01684k19681k1625J03540j32310j7973k70713q216K75646K53980l86058
11372c21726l08971K83311N71444J29949j07936j9174N2261J42212K18700j58198
11362D81872r4717L00185J44992j4571L40101K58527M04441L72990q9836m55439
11352A648545n24113j66962l8580l6570j71426K60645L73209J77245p8345k04958
11342A238690l51346j60799J28166J9672J28945L10789K82286Q808j78133j04513
11332A322565J84910P7969j11559j21967k64346M4748J1960J17597K66260K83914
11322A812051J47317l2941k7893r2559J44740j50191k26239L8051J51482k07340
$$ plain form
11312 1556478 1289489 1470597 1520494 1357278 1394689 1213686 976960 1264386 1388915 1380684
11302 1380684 1258207 1373639 1558622 1490724 1304699 1458360 1407210 1481593 1936736 2091788
11292 2091788 2001481 2308934 1941786 1447091 1482361 1640204 1564649 1278976 1145955 1026838
11282 1026838 723054 328023 359726 557218 750074 1017603 905792 471075 421368 612844
11272 612844 588305 387481 516116 273555 -13190 487972 830738 647255 242357 179832
11262 179832 205996 410944 366470 376440 373998 614132 682336 817064 807650 156776 -29414
11251 -29414 -107950 260926 740447 708013 300620 299360 364650 689669 840616 567616 389509
11240 389509 407141 -15387 -227301 -169799 -89935 -74754 12617 173944 469862 448698 288173
$$ packed form
11312A556478k66989J81108M9897j63216L7411j81003k36726K87426J24529q231
11302A380684j22477J15432J84983o7898j86025J53661n1150P4383M55143J55052
11292B091788r0307L07453l67148m94695L5270J57843p5555k85673j33021j19117
11282A026838l03784l95031L1703J97492J92856K67529j11811m34717m9707J91476
11272F12844k4539k00824J28635k42561k86745N01162L42766j83483m04898o2525
11262A79832K6164K04948m4474R970k442K40134O8204J34728r414o50874j86190
11251b9414p8536L68876M79521l2434m07393j260O5290L25019J50947k73000j78107
11240C89509J7632m22528k11914N7502P9864J5181Q7371J61327K95918k1164j60525
$$ plain form
11229 288173 526197 854032 871554 577000 302526 -169162 -475319 -86765 56455 228211
11219 228211 264229 297630 451869 600098 546654 184649 -191822 -379161 -293627 -57374
11209 -57374 -3310 -116739 -263974 -304003 -324667 -85931 -45294 66225 235160 209673 225263
11198 225263 190928 260192 448692 -28093 -131819 314098 85307 -122719 128257 185180
11188 185180 318658 623466 469909 487184 442382 299211 408130 617385 864488 626131
11178 626131 478624 586186 862125 610230 219426 443695 282678 -5273 -23832 156469
11168 156469 243767 183146 99087 -91520 143323 194474 255788 541501 322968 11277
11158 11277 -78508 96222 277198 542039 617039 421936 351381 336906 48297 -116591
$$ packed form
11229B88173K38024L27835J7522k94554k74474m71688l06157L88554J43220J71756
11219B28211L6018L3401J54239J48229n3444l62005l76471j87339Q5534K36253
11209e7374N4064j13429j47235m0029k0664K38736M0637J11519J68935k5487J5590
11198B25263l4335O9264J88500m76785j03726M45917k28791k08026K50976N6923
11188A85180J33478L04808j53557J7275m4802j43171J08919K09255K47103k38357
11178F26131j47507J07562K75939k51895l90804K24269j61017k87951j8559J80301
11168A56469Q7298o0621q4059j90607K34843N1151O1314K85713k18533l11691
11158A1277q9785J74730J80976K64841P5000j95103p0555j4475k88609j64888
$$ plain form
11148 -116591 -189933 -240027 -365128 7894 192511 305597 417898 452935 113344 -123049
11138 -123049 -180717 -39933 23716 257872 123349 292833 551386 276909 382609 414836
11128 414836 392383 642444 729650 649819 414690 370253 395575 718245 535903 156569
11118 156569 -28500 -231373 -43579 53338 162998 480449 389060 517465 608868 461474
11108 461474 331255 432798 288302 184857 214435 194976 263897 643262 353713 11909
11098 11909 -155249 -136323 -134722 73625 700701 877069 773137 574451 674282 542776
11088 542776 308349 47939 -143474 -28493 201975 605849 625942 793408 621818 446183
11078 446183 376802 123103 328530 550242 792659 930127 1277349 1269276 1237361 1182918
$$ packed form
11148a16591p3342n0094j25101L73022J84617J13086J12301L5037l39591k36393
11138a23049n7668J40784O3649K34156j34523J69484K58553k74477J05700L2227
11128D14836k2453K50061Q7206p9831k35129m4437K5322L22670j82342l79334
11118A56569j85069k02873J87794R6917J09660L17451r1389J28405R1403j47394
11108D61474j30219J01543j44496j03445K9578j9459O8921L79365k89549l41804
11098A1909j67158J8926J601K08347O27076J76368j03932j98686R9831j31506
11088E42776k34427k60410j91413J14981K30468M03874K0093J67466j71590j75635
11078D46183o9381k53699K05427K21712K42417J37468L47222q073l1915n4443
$$ plain form
11068 1182918 1337338 1427734 1713078 1759156 1861173 2376518 2566188 2653037 2606043 2941721
11058 2941721 3001501 3166938 2972996 2788342 2855240 3095367 2940661 2238566 2161788 2160164
11048 2160164 2065715 2072747 2038764 1788715 1494203 1528598 1838840 2349691 2787806 2737459
11038 2737459 2690458 2684345 2669275 2729501 2597657 2657693 2537987 2259633 2554051 2935074
11028 2935074 2710632 2552719 2660037 2869150 3041350 3093980 3131377 3028950 2641754 2580480
11018 2580480 2655264 2707790 2947382 3047470 2986116 2753512 2347442 2385134 2618853 2659697
11008 2659697 2662243 2922636 2570030 2173684 2673764 3230815 3108450 3034501 3395879 3556104
10998 3556104 3300197 3204641 3436880 3608367 3378883 2846723 2857337 3254796 3235495 3384496
$$ packed form
11068A182918J54420R0396K85344M6078J02017N15345J89670Q6849m6994L35678
11058B941721N9780J65437j93942j84654O6898K40127j54706p02095p6778j624
11048B160164r4449P032l3983k50049k94512L4395L10242N10851M38115n0347
11038B737459m7001o113j5070O0226j31844O0036j19706k78354K94418L81023
11028B935074k24442j57913J07318K09113J72200N2630L7397j02427l87196o1274
11018B580480P4784N2526K39592J00088o1354k32604m06070L7692K33719M0844
11008B659697K546K60393l52606l96346N00080N57051j22365p3949L61378J60225
10998C556104k55907r5556K32239J71487k29484n32160J0614L97459j9301J49001
$$ plain form
10988 3384496 3311078 3039540 2967347 2941648 3059541 3287941 3294392 2972504 2908102 3245995
10978 3245995 3098442 2858781 2841324 2620885 2754272 3145057 3317893 3225995 3168877 3496836
10968 3496836 4000763 3883801 3998732 3962903 3937330 4336147 4201706 4053466 4258102 4447907
10958 4447907 4465837 4943716 5123034 5618806 5869238 6143524 6591322 7108517 7785710 8222567
10948 8222567 8513473 9048197 9532376 9885321 10343359 11182460 12076153 12787580 14129852
10939 14129852 16073644 17914767 19823004 22192521 25177103 28556039 32344724 37038138
10931 37038138 42645850 48673603 56181607 65633986 77595226 92662412 111534560 135316592
10923 135316592 165599336 202726171 245789850 291093668 330966089 356123975 360978251
$$ packed form
10988C384496p3418k71538p2193k5699J17893K28400O451l21888o4402L37893
10978C245995j47553k39661j7457k20439J33387L90785J72836r1898n7118L27959
10968C496836N03927j16962J14931l5829k5573L98817j34441j48240K04636J89805
10958D447907J7930M77879J79318M95772K50432K74286M47798N17195O77193M36857
10948H222567K90906N34724M84179L52945M58038Q39101Q93693P11427J342272
10939A4129852J943792J841123J908237K369517K984582L378936L788685M693414
10931C7038138N607712O027753P508004R452379J1961240J5067186J8872148K3782032
10923A35316592L0282744L7126835M3063679M5303818L9872421K5157886M854276
$$ plain form
10916 360978251 345513309 316045749 281685578 249426222 222114015 201195238 186854366
10909 186854366 179161018 178146634 183650440 195329929 211906033 230638094 248638495
10902 248638495 262293518 269145344 268334204 260588858 248075684 233892276 221185171
10895 221185171 213163382 211586968 216554697 227363149 244801170 268139069 295930248
10888 295930248 325944037 354769527 377105346 388001382 384743337 368215655 342092529
10881 342092529 312762373 284903512 261228545 243959077 233962126 231111677 234549679
10874 234549679 244068293 257512503 271661338 283078552 288728905 287233461 279110135
10867 279110135 265792409 249128696 232026691 218011742 209182951 206669880 210681508
$$ packed form
10916C60978251j5464942k9467560l4360171l2259356k7312207k0918777j4340872
10909A86854366p693348j014384N503806J1679489J6576104J8732061J8000401
10902B48638495J3655023O851826q11140p745346j2513174j4183408j2707105
10895B21185171q021789j576414M967729J0808452J7438021K3337899K7791179
10888B95930248L0013789K8825490K2335819J0896036l258045j6527682k6123126
10881C42092529k9330156k7858861k3674967j7269468r996951k850449L438002
10874B34549679R518614J3444210J4148835J1417214N650353j495444q123326
10867B79110135j3317726j6663713j7102005j4014949q828791k513071M011628
$$ plain form
10860 210681508 220282143 236046149 257905962 284868125 315903312 348009189 375839859
10853 375839859 391859884 390209015 368912746 332064024 288097206 246254690 211138179
10846 211138179 183480871 162064691 145644395 133040741 123085835 114739614 107909049
10839 107909049 102451984 97413446 93085740 89454999 86211200 83054153 80443340 78261147
10831 78261147 76105335 73807681 72026565 70380819 68938486 67537271 65660215 63523988
10823 63523988 61637918 59607140 57517207 56006958 54572150 53216032 51878195 50632379
10815 50632379 49036238 47402943 46502304 45324263 44214263 43262014 42157805 41039845
10807 41039845 40063767 39380131 38981841 38575433 37910713 37285489 36760796 36183322 35897961
$$ packed form
10860B10681508R600635J5764006K1859813K6962163L1035187L2105877K7830670
10853C75839859J6020025j650869k1296269l6848722m3966818m1842516l5116511
10846B11138179k7657308k1416180j6420296j2603654r954906q346221o830565
10839A07909049n457065n038538m327706l630741l243799l157047k610813k182193
10831G8261147k155812k297654j781116j645746j442333j401215j877056k136227
10823F3523988j886070k030778k089933j510249j434808j356118j337837j245816
10815E0632379j596141j633295r00639j178041j110000r52249j104209j117960
10807D1039845r76078o83636l98290m06408o64720o25224n24693n77474k85361
$$ plain form
10798 35897961 35418676 35042334 34428543 33858010 33184322 32426146 31807922 31421813 31208389
10789 31208389 30485133 29933493 29136343 28384298 28130268 27838465 27456646 27011778 26920120
10780 26920120 26400780 25795707 25212503 24859907 24176098 23455539 23235367 23193863 23029574
10771 23029574 22549153 21975382 21514563 20904665 20628794 20408679 20299212 19977129 19445348
10762 19445348 19335480 18934959 18308974 17740014 17035746 16356597 15954680 15636698 15108839
10753 15108839 14536146 13822427 13710839 13608196 12947678 12413293 12120616 12488916 11860588
10744 11860588 11417610 11208253 10772604 10158716 9862524 9705447 9719297 9801837 9834309 9386393
10734 9386393 8898203 8775097 8300375 8393588 8475507 8302619 8077573 7812345 7365669 7059843
$$ packed form
10798C5897961m79285l76342o13791n70533o73688p58176o18224l86109k13424
10789C1208389p23256n51640p97150p52045k54030k91803l81819m44868r1658
10780B6920120n19340o05073n83204l52596o83809p20559k20172m1504j64289
10771B3029574m80421n73771m60819o09898k75871k20115j09467l22083n31781
10762A9445348j09868m00521o25985n68960p04268o79149m01917l17982n27859
10753A5108839n72693p13719j11588j02643o60518n34385k92677L68300o28328
10744A1860588m42978k09357m35649o13888k96192j57077J3850Q2540L2472m47916
10734I386393m88190j23106m74722R3213Q1919j72888k25046k65228m46676l05826
$$ plain form
10724 7059843 6944682 6373300 6272267 6114275 5846918 5670090 5422907 5429393 5745173 5396866
10714 5396866 5303260 5317009 4987840 4568960 4480692 4284395 4142397 3961535 4025797 3984712
10704 3984712 3995455 3926731 3616583 3386982 3417999 3611433 3530717 3160081 2687652 2505062
10694 2505062 2551522 2718499 2935922 2866721 2653695 2531938 2452443 2272620 2307968 2400845
10684 2400845 2571150 2524813 2385441 2467313 2421101 2705227 2740932 2733412 2627318 2456980
10674 2456980 2456313 2351821 2030704 1915506 2010542 1952381 1614206 1732620 1796996 1723490 1607559
10663 1607559 1383985 1627706 1966404 1829027 1525437 1704976 1868749 2108160 2071657 2189856
10653 2189856 2098278 2141567 2270505 2099795 2092392 2288989 1792286 1657305 1509258 1538225
$$ packed form
10724G059843j15161n71382j01033j57992k67357j76828k47183O486L15780l48307
10714E396866r3606J3749l29169m18880q8268j96297j41998j80862O4262m1085
10704C984712J0743o8724l10148k29601L1017J93434q0716l70636m72429j82590
10694B505062M6460J66977K17423o9201k13026j21757p9495j79823L5348R2877
10684B400845J70305m6337j39372Q1872m6212K84126L5705p520j06094j70338
10674B456980o67j04492l21117j15198R5036n8161l38175J18414O4376p3506j15931
10663A607559k23574K43721L38698j37377l03590J79539J63773K39411l6503J18199
10653B189856r1578M3289J28938j70710p403J96597m96703j34981j48047K8967
$$ plain form
10643 1538225 1489475 1542509 1807183 2323226 2377912 2310399 2401991 2459485 2411942 2647097 2563985
10632 2563985 2653165 2809280 3010487 3033658 2761522 2561320 2621421 2841193 2708374 2969818
10622 2969818 3040885 2961447 2906725 2802961 2716663 2548562 2366189 2197720 2557042 2455379
10612 2455379 1995693 1743501 1826886 2188598 2130276 2053756 2056756 1927489 1669330 1980719
10602 1980719 2196706 1984693 1848772 1625922 1676870 1335668 1317109 1369259 1288139 1145453
10592 1145453 975925 1243911 1370520 1555907 1758868 1807437 1959521 1971783 1787945 1259071
10582 1259071 956417 1179024 1143351 1175558 1092147 1077609 1171007 1213864 1186531 1076246 998347
10571 998347 912242 874852 739959 796954 1080253 1294160 1255733 792475 705343 639375 765965
$$ packed form
10643A538225m8750N3034K64674N16043N4686o7513R1592N7494m7543K35155q3112
10632B563985Q9180J56115K01207K3171k72136k00202O0101K19772j32819K61444
10622B969818P1067p9438n4722j03764q6298j68101j82373j68469L59322j01663
10612B455379m59686k52192Q3385L61712n8322p6520L000j29267k58159L11389
10602A980719K15987k12013j35921k22850N0948l41202j8559N2150q1120j42686
10592A145453j69528K67986J26609J85387K02961M8569J52084J2262j83838n28874
10582A259071l02654K22607l5673L2207q3411j4538R3398M2857k7333j10285p7899
10571I98347q6105l7390j34893N6995K83299K13907l8427m63258q7132o5968J26590
$$ plain form
10560 765965 602547 364521 677437 700337 722189 1012879 1366987 1183832 1217217 1135802
10550 1135802 862327 844135 995793 1130009 931544 822111 411760 -20422 122023 443401
10540 443401 549271 274704 118321 224057 499843 818482 725482 852330 652150 475123
10530 475123 786808 645639 561504 656887 768666 962104 1160476 1210070 1243520 1295763
10520 1295763 1423632 915426 700774 590937 862994 812134 380512 157183 326242 731916
10510 731916 780253 1003585 937027 1040861 1118560 1012158 852443 991873 1485653 1882212
10500 1882212 1478242 1482587 1267283 849876 702794 655614 684807 521349 659358 823782
10490 823782 753939 1103029 1185510 1213939 1296815 1246728 1124246 946674 1135476 1087634 1408753
$$ packed form
10560G65965j63418k38026L12916K2900K1852K90690L54108j83155L3385q1415
10550A135802k73475j8192J51658J34216j98465j09433m10351m32182J42445L21378
10540D43401J05870k74567j56383J05736K75786L18639r3000J26848k00180j77027
10530D75123L11685j41169q4135R5383J11779J93438J98372M9594L3450N2243
10520A295763J27869n08206k14652j09837K72057n0860m31622k23329J69059M05674
10510G31916M8337K23332o6558J03834P7699j06402j59715J39430M93780L96559
10500A882212m03970M345k15304m17407j47082m7180K9193j63458J38009J64424
10490H23782o9843L49090Q2481K8429Q2876n0087j22482j77572J88802m7842L21119
$$ plain form
10479 1408753 1897736 2166351 1927134 1860640 2095706 2232572 2292324 2135912 1691861 1778665
10469 1778665 1816671 1674025 1629326 1527438 1569043 2078720 2147940 2097813 2296179 2304663 1989258
10458 1989258 1960108 2071353 2010272 1796225 1936121 1763969 1546972 1872665 2370162 1997645
10448 1997645 2186476 2424855 2219562 2016393 2034703 2334740 2579000 2575966 2685949 2591594
10438 2591594 2305540 2248065 1920694 1886039 1839761 1750605 1665418 1728498 1806091 2029063 2112530
10427 2112530 2117182 2289355 1916688 1899492 2042590 2234914 2271234 2093237 2000706 2002177 1894845
10416 1894845 1687419 1861559 2291725 2627341 2560280 2506257 2753753 2597675 2353498 2050016
10406 2050016 1922279 1691290 1738716 1700883 1586100 1650632 1411784 1406946 1186728 932400
$$ packed form
10479A408753M88983K68615k39217o6494K35066J36866N9752j56412m44051Q6804
10469A778665L8006j42646m4699j01888M1605N09677O9220n0127J98366Q484l15405
10458A989258k9150J11245o1081k14047J39896j72152k16997L25693M97497l72517
10448A997645J88831K38379k05293k03169J8310L00037K44260l034J09983r4355
10438B591594k86054n7475l27371l4655m6278q9156q5187O3080P7593K22972Q3467
10427B112530M652J72173l72667j7196J43098J92324L6320j77997r2531J471j07332
10416A894845k07426J74140M30166L35616o7061n4023K47496j56078k44177l03482
10406B050016j27737k30989M7426l7833j14783O4532k38848m838k20218k54328
$$ plain form
10396 932400 859394 774156 736918 967424 1323044 1024955 836401 968030 849719 686230
10386 686230 541849 581525 563844 614030 457965 652947 784750 630575 581360 601351
10376 601351 374890 536069 505813 297855 261900 221790 478041 573668 690602 629428
10366 629428 672550 652076 687400 388259 310188 385422 173230 511444 577881 550621 552328
10355 552328 807996 589412 314048 120393 279418 347761 312383 255578 -107633 -483634
10345 -483634 -302171 30586 521116 709083 418391 -35919 92162 320025 392071 252236
10335 252236 29137 248950 374843 585347 856128 602733 335623 237950 789351 1086025
10325 1086025 915532 774356 713071 531171 629263 663781 795606 639573 326627 -11658
$$ packed form
10396I32400p3006q5238l7238K30506L55620k98089j88554J31629j18311j63489
10386F86230j44381L9676j7681N0186j56065J94982J31803j54175m9215J9991
10376F01351k26461J61179l0256k07958l5955m0110K56251R5627J16934o1174
10366F29428M3122k0474L5324k99141p8071P5234k12192L38214O6437k7260J707
10355E52328K55668k18584k75364j93655J59025O8343l5378n6805l63211l76001
10345d83634J81463L32757M90530J87967k90692m54310J28081K27863P2046j39835
10335B52236k23099K19813J25893K10504K70781k53395k67110r7673N51401K96674
10325A086025j70493j41176o1285j81900R8092L4518J31825j56033l12946l38285
$$ plain form
10315 -11658 198618 395270 370522 565504 569622 350478 2097 -622457 -558833 -8705
10305 -8705 59412 309557 620765 778480 685870 576849 576290 783691 903595 672762 339854
10294 339854 112187 -103293 -332598 -136904 -53028 200007 323748 212259 179410 39804
10284 39804 -253163 -46996 53547 6382 272097 -19423 -292534 153660 481956 626935
10274 626935 577328 419647 353410 561183 728004 554363 351796 230214 -171695 -395130
10264 -395130 -233223 -312759 -60045 132699 232435 542035 726939 637193 413312 178914
10254 178914 168113 146343 286486 598626 715678 467802 59593 -30821 201488 222544
10244 222544 412952 652962 270702 182261 137065 -99012 149185 237625 306024 430750
$$ packed form
10315a1658K10276J96652k4748J94982M118k19144l48381o24554O3624N50128
10305h705O8117K50145L11208J57715r2610j09021n59K07401J19904k30833l32908
10294C39854k27667k15480k29305J95694Q3876K53035J23741j11489l2849j39606
10284C9804k92967K06167J00543m7165K65715k91520k73111M46194L28296J44979
10274F26935m9607j57681o6237K07773J66821j73641k02567j21582m01909k23435
10264c95130J61907p9536K52714J92744R9736L09600J84904q9746k23881k34398
10254A78914j0801k1770J40143L12140J17052k47876m08209r0414K32309K1056
10244B22544J90408K40010l82260q8441m5196k36077K48197Q8440O8399J24726
$$ plain form
10234 430750 404630 95691 167957 43719 164209 208326 184105 13222 -23459 230770
10224 230770 172958 -128565 -150367 2357 161793 36586 -95297 282092 523795 476539
10214 476539 230630 235711 227844 204964 103101 91889 466978 743397 924373 1015711 916157
10203 916157 845257 385220 185974 300306 456157 243550 222755 278152 342001 306588
10193 306588 571143 449760 172574 142724 -104350 -27347 -54198 -59918 456623 288192
10183 288192 23889 5944 460094 477272 139309 194733 280976 571326 369731 113366
10173 113366 299599 367303 454832 517019 500984 611400 390147 81267 23045 134084
10163 134084 228185 7467 -188505 -224809 59994 -257505 -572995 -485982 -196851 165173
$$ packed form
10234D30750k6120l08939P2266j24238J20490M4117k4221j70883l6681K54229
10224B30770n7812l01523k1802J52724J59436j25207j31883L77389K41703m7256
10214D76539k45909N081p867k2880j01863j1212L75089K76419J80976R1338r9554
10203I16157p0900m60037j99246J14332J55851k12607k0795N5397O3849l5413
10193C06588K64555j21383k77186k9850k47074P7003k6851n720N16541j68431
10183B88192k64303j7945M54150J7178l37963N5424Q6243K90350k01595k56365
10173A13366J86233O7704Q7529O2187j6035J10416k21253l08880n8222J11039
10163A34084R4101k20718j95972l6304K84803l17499l15490Q7013K89131L62024
$$ plain form
10153 165173 442726 522817 594994 349726 -332474 -822387 -964157 -830806 -535011 -329251
10143 -329251 -91972 -49055 -146335 -383224 -108046 -237980 -595763 -597797 -374659 -424299
10133 -424299 -195615 163485 381114 506484 101646 -378441 -208039 39004 -54478 83706
10123 83706 290083 246689 313043 243799 396907 435465 419163 157378 29932 262332 31651
10112 31651 -217851 112040 351014 186462 -86303 29154 -152096 -395632 -277004 -274588
10102 -274588 -385335 -601422 -418563 -464349 -281141 -28686 -303623 -770430 -379619 75731
10092 75731 101971 61156 -115508 -341729 -470986 -432499 -201153 258653 662816 394376
10082 394376 22678 88821 -44008 -117929 -201873 -339492 -134513 184216 365158 432616
$$ packed form
10153A65173K77553Q0091P2177k45268o82200m89913j41770J33351K95795K05760
10143c29251K37279M2917r7280k36889K75178j29934l57783k034K23138m9640
10133d24299K28684L59100K17629J25370m04838m80087J70402K47043r3482J38184
10123H3706K06377m3394O6354o9244J53108L8558j6302k61785j27446K32400k30681
10112C1651k49502L29891K38974j64552k72765J15457j81250k43536J18628K416
10102b74588j10747k16087J82859m5786J83208K52455k74937m66807L90811M55350
10092G5731K6240m0815j76664k26221j29257L8487K31346M59806M04163k68440
10082C94376l71698O6143j32829p3921q3944j37619K04979L18729J80942O7458
$$ plain form
10072 432616 386436 157556 -30036 -86307 49633 -78742 -40940 -2311 -364782 -515445
10062 -515445 -258853 -241187 -142804 -23236 52404 13282 -147706 -244097 -120278 160882
10052 160882 882174 1420324 1578441 1088194 420164 -153097 -250322 -115841 14621 282644
10042 282644 19770 -177359 3184 -166333 -154441 -115192 -9950 193138 148318 224753
10032 224753 286236 8591 -13611 193992 616011 662867 701433 878968 549436 197056
10022 197056 -34991 -142416 -426808 -278104 -173733 -2494 176260 358506 242475 8159
10012 8159 21798 150922 339935 237042 137463 440882 539711 98341 -149677 -174396 30822
10001 30822 366782 54532 -47798 13964 -77864 116589 499902 787711 798994 518605
$$ packed form
10072D32616m6180k28880j87592n6271J35940j28375L7802L8629l62471j50663
10062e15445K56592J7666R8383J19568P5640l9122j60988r6391J23819K81160
10052A60882P21292N38150J58117m90247o68030n73261r7225J34481J30462K68023
10042B82644k62874j97129J80543j69517J1892L9249J05242K03088m4820P6435
10032B24753O1483k77645k2202K07603M22019M6856L8566J77535l29532l52380
10022A97056k32047j07425k84392J48704J04371J71239J78754J82246j16031k34316
10012H159J3639J29124J89013j02893r9579L03419R8829m41370k48018k4719K05218
10001C0822L35960l12250j02330O1762r1828J94453L83313K87809J1283k80389
$$ plain form
9991 518605 421064 116096 117517 170973 804 -80579 -65139 -58240 -339140 -527911 -550522
9980 -550522 -210540 -282930 -2172 411898 870313 574904 292178 389143 566766 472482
9970 472482 427619 336537 424513 463523 565609 298571 69096 386541 545638 569202 442201
9959 442201 541591 621801 487544 364959 230015 226074 446068 478182 550714 430968 157767
9948 157767 106356 -60879 2165 176318 320492 173700 399666 452070 234400 107557
9938 107557 195010 259421 154602 -270894 -15390 135125 381010 494068 269503 227004
9928 227004 -30270 -83924 53815 -126248 -686344 -839078 -453517 81257 -5037 -572475
9918 -572475 -340913 -305186 -181615 -373988 -494603 -300055 -142587 -238562 -227017 -60696
$$ packed form
9991E18605r7541l04968J421N3456j70169q1383J5440O899k80900j88771k2611
9980e50522L39982p2390K80758M14070M58415k95409k82726R6965J77623r4284
9970D72482m4863r1082Q7976L9010J02086k67038k29475L17445J59097K3564j27001
9959D42201R9390Q0210j34257j22585j34944l941K19994L2114P2532j19746k73201
9948A57767n1411j67235O3044J74153J44174j46792K25966N2404k17670j26843
9938A07557Q7453O4411j04819m25496K55504J50515K45885J13058k24565m2499
9928B27004k57274n3654J37739j80063n60096j52734L85561N34774q6294n67438
9918e72475K31562L5727J23571j92373j20615J94548J57468r5975J1545J66321
$$ plain form
9908 -60696 -8200 -100447 -119276 231688 617965 470862 169517 34952 35722 323287 497128
9897 497128 644022 471108 165147 53838 46602 104912 268236 533791 711192 681088
9887 681088 544444 301873 78037 -154088 -98909 61620 154676 -88394 -343208 -154034
9877 -154034 296062 174976 191132 64003 -211770 -249119 39568 244206 315415 465765
9867 465765 464669 439003 340227 547551 449983 600520 759130 747616 566865 392164 412853
9856 412853 695619 781649 476244 125846 -43723 -116402 40223 46179 -100897 -12634 -192947
9845 -192947 -232239 70137 286734 245447 -50757 -58562 -5298 -369630 -418449 -258698 -277891
9834 -277891 -282164 -33498 -104469 -243408 -92567 -49988 -214913 -472357 -505487 -163045 -51343
$$ packed form
9908f0696N2496r2247j8829L50964L86277j47103l01345j34565P70K87565J73841
9897D97128J46894j72914l05961j11309p236N8310J63324K65555J77401l0104
9887F81088j36644k42571k23836k32125N5179J60529R3056k43070k54814J89174
9877a54034M50096j21086J6156j27129k75773l7349K88687K04638P1209J50350
9867D65765j096k5666r8776K07324r7568J50537J58610j1514j80751j74701K0689
9856D12853K82766Q6030l05405l50398j69569p2679J56625N956j47076Q8263j80313
9845a92947l9292L02376K16597m1287k96204p805N3264l64332m8819J59751j9193
9834b77891m273K48666p0971j38939J50841M2579j64925k57444l3130L42442J11702
$$ plain form
9823 -51343 -191481 -507725 -258986 -45994 -126918 67951 20588 -123962 -169550 -73895 290145
9812 290145 208677 -102828 -18981 123486 38748 -6763 -25114 -446206 -410309 -85661 -114875
9801 -114875 -180114 155578 34290 100059 181799 188394 122035 315395 439155 241887 -52009
9790 -52009 -310532 50128 255335 323560 326931 101205 -216351 -249366 244277 411781 311902
9779 311902 185308 168206 46488 -17763 -12333 39439 -165003 -45063 285958 243636 31198
9768 31198 -195741 -147863 48978 276191 52973 -173857 -102714 19289 -257783 -74921
9758 -74921 -47151 -260740 -418129 -63787 184108 -38501 -75955 38159 -108695 -17573
9748 -17573 213029 481797 558493 759697 606606 -45401 -412426 -214128 -231225 -283573
$$ packed form
9823e1343j40138l16244K48739K12992q0924J94869m7363j44550m5588R5655L64040
9812B90145q1468l11505Q3847J42467q4738m5511j8351m21092L5897L24648k9214
9801a14875o5239L35692j21288O5769Q1740O595o6359J93360J23760j97268k93896
9790e2009k58523L60660K05207O8225L371k25726l17556l3015M93643J67504r9879
9779C11902j26594j7102j21718o4251N430N1772k04442J19940L31021m2322k12438
9768C1198k26939M7878J96841K27213k23218k26830P1143J22003k77072J82862
9758g4921K7770k13589j57389L54342K47895k22609l7454J14114j46854R1122
9748a7573K30602K68768P6696K01204j53091o52007l67025J98298j7097n2348
$$ plain form
9738 -283573 -312177 -300524 -365698 -479117 -573581 -375085 -141837 92989 235346 217672 7935
9727 7935 -283318 -36181 324483 271010 -90081 -318591 -283396 -39778 107788 161003 36975
9716 36975 44823 -23030 216125 298171 151555 59560 -52513 -129039 -353719 -496379 -368870
9705 -368870 77960 321873 494086 262009 52318 205314 53673 191408 43903 -185441
9695 -185441 -169953 -38218 29720 21628 8490 236352 335111 309294 -1311 -64479 -132005
9684 -132005 -10267 -17752 19422 150236 673399 559317 -45264 -243083 -212515 103516
9674 103516 -254528 -417462 -308541 -253598 -404380 -414817 -178391 84975 298180 283258
9664 283258 312207 363869 140291 198168 191946 215505 256056 354362 500816 581218 493514
$$ packed form
9738b83573k8604J1653o5174j13419r4464J98496K33248K34826J42357j7674k09737
9727G935k91253K47137L60664n3473l61091k28510L5195K43618J47566N3215j24028
9716C6975P848o7853K39155Q2046j46616r1995j12073p6526k24680j42660J27509
9705c68870M46830K43913J72213k32077k09691J52996j51641J37735j47505k29344
9695a85441J5488J31735O7938q092j3138K27862R8759k5817l10605o3168o7526
9684a32005J21738p485L7174J30814N23163j14082o04581j97819L0568L16031
9674A03516l58044j62934J08921N4943j50782j0437K36426K63366K13205j4922
9664B83258K8949N1662k23578N7877o222K3559M0551R8306J46454Q0402q7704
$$ plain form
9653 493514 263273 270211 154024 -95828 -530025 -500868 -378608 -179579 -58623 -223211
9643 -223211 -425176 -309926 -566107 -254758 273269 348828 240460 52521 115961 85445
9633 85445 -356386 -430110 -322441 -3459 22176 -384709 -708122 -97298 218643 110800
9623 110800 191693 626114 605300 274082 56206 -46049 7465 102422 -182432 -121010 140040
9612 140040 318073 534564 300218 302930 128769 35401 -154750 -436281 -409442 -39911
9602 -39911 403075 341273 293146 180132 298668 -44236 -372283 -45524 -72663 -311880
9592 -311880 -588975 -518727 -279042 -314105 -414998 -62483 219653 -84792 206202 198505
9582 198505 178886 352274 568945 428073 193031 159309 194448 116918 -269880 -463011
$$ packed form
9653D93514k30241O938j16187k49852m34197K9157J22260J99029J20956j64588
9643b23211k01965J15250k56181L11349N28027P5559j08368j87939O3440l0516
9633H5445m41831p3724J07669L18982K5635m06885l23413O10824L15941j07843
9623A10800Q0893M34421k0814l31218k17876j02255N3514R4957k84854O1422K61050
9612A40040J78033K16491k34346K712j74161r3368j90151k81531K6839L69531
9602c9911M42986o1802m8127j13014J18536l42904l28047L26759k7139k39217
9592c11880k77095P0248K39685l5063j00893L52515K82136l04445K90994p697
9582A98505j9619J73388K16671j40872k35042l3722L5139p7530l86798j93131
$$ plain form
9572 -463011 -500624 -222070 69256 -74131 -95477 112445 9068 -67947 -102100 -17968 35794
9561 35794 -163743 -109149 353428 32316 -597551 -411082 -96796 -154169 -274703 -306099
9551 -306099 -68665 -288657 -49007 242091 -207595 -239538 88603 232134 336083 517956
9541 517956 496128 580823 539425 307337 151500 321354 474035 343593 307443 225357 216496
9530 216496 318908 69193 -110575 -100953 66622 -69048 -106117 -87973 -274873 -455705
9520 -455705 -206741 60060 75846 -60768 60775 74201 190611 350436 492044 465794
9510 465794 297165 -175576 -462156 -266982 -211448 -225216 -59991 -149099 -13915 -31978
9500 -31978 -158269 -329968 -69670 -71567 -184654 -261899 -115802 135600 -29048 -140015
$$ packed form
9572d63011l7613K78554K91326j43387k1346K07922j03377p7015l4153Q4132N3762
9561C5794j99537N4594M62577l21112o29867J86469L14286n7373j20534l1396
9551c06099K37434k19992K39650K91098m49686l1943L28141J43531J03949J81873
9541E17956k1828Q4695m1398k32088j55837J69854J52681j30442l6150q2086q861
9530B16496J02412k49715j79768R622J67575j35670l7069J8144j86900j80832
9520d55705K48964K66801J5786j36614J21543J3426J16410J59825J41608k6250
9510D65794j68629m72741k86580J95174N5534j3768J65225q9108J35184j8063
9500c1978j26291j71699K60298j897j13087p7245J46097K51402j64648j10967
$$ plain form
9490 -140015 -278683 71626 73508 -121329 171706 277440 3743 -179166 -171367 79024
9480 79024 204912 451891 29812 -264154 -176490 -253458 -469602 -403156 -47424 -296742
9470 -296742 -200576 -110851 -64728 -410800 -335839 -164036 -23411 -83817 -214429 -133377 205044
9459 205044 227654 -234004 -349020 -126400 389625 700879 465710 507681 526685 126997
9449 126997 -261823 -283688 -9802 -227374 -287266 -445189 -390772 -245350 -423024 -213126
9439 -213126 180552 -30021 -503637 -323063 -185016 -198506 -154055 53051 325454 362613
9429 362613 256862 429281 380678 295798 351006 449039 306489 319042 293820 275482 297133
9418 297133 -164386 -192396 -10278 -8901 266329 498961 406217 349607 176693 -385648 -212860
$$ packed form
9490a40015j38668L50309J882j94837K93035J05734k73697j82909P799K50391
9480G9024J25888K46979m22079k93966Q7664p6968k16144O6446L55732k49318
9470b96742R6166Q9725M6123l46072P4961J71803J40625o0406j30612Q1052L38421
9459B05044K2610m61658j15016K22620N16025L11254k35169M1971J9004l99688
9449A26997l88820k1865K73886k17572n9892j57923N4417J45422j77674K09898
9439b13126L93678k10573m73616J80574J38047j3490M4451K07106K72403L7159
9429C62613j05751J72419m8603q4880N5208R8033j42550J2553k5222j8338K1651
9418B97133m61519k8010J82118J377K75230K32632r2744n6610j72914n62341J72788
$$ plain form
9407 -212860 -337133 -525468 -368052 -384840 -475945 -338943 -327994 -126805 -137049 -168405 -83454
9396 -83454 166591 -69527 -370416 -777567 -839626 -596686 -447034 -286612 -265046 -286449
9386 -286449 -316230 -334236 5135 212371 130942 345735 455618 403083 -18557 90793
9376 90793 352330 730502 722058 721500 489408 456949 526471 241601 64936 10992 -284496
9365 -284496 -97597 94410 214691 614408 550064 700408 600930 390133 178187 261749
9355 261749 787878 796163 484596 295106 82751 -73397 -332403 -255260 -315203 -359356 -369708
9344 -369708 256427 587980 644284 241202 -183349 -87300 285898 500874 345632 225447
9334 225447 536528 641662 362382 432571 229944 413712 597111 464052 391607 134255
$$ packed form
9407b12860j24273j88335J57416j6788r1105J37002J0949K01189j0244l1356Q4951
9396h3454K50045k36118l00889m07151o2059K42940J49652J60422K1566k1403
9386b86449k9781j8006L39371K07236q1429K14793J09883n2535m21640J09350
9376I0793K61537L78172q444n58k32092l2459O9522k84870j76665n3944k95488
9365b84496J86899J92007J20281L99717o4344J50344r9478k10797k11946Q3562
9355B61749N26129Q285l11567j89490k12355j56148k59006P7143n9943m4153j0352
9344c69708O26135L31553N6304m03082m24551R6049L73198K14976j55242j20185
9334B25447L11081J05134k79280P0189k02627J83768J83399j33059p2445k57352
$$ plain form
9324 134255 -218754 -331312 -91983 5280 262748 508892 732176 676054 314203 -393687
9314 -393687 -611139 -531915 -188523 -136773 -43349 182513 264125 217986 277552 192661 239685
9303 239685 192256 25511 -78024 -117360 236385 455093 466889 534749 503312 328972 205996
9292 205996 99576 233609 -90507 61281 -9486 -260010 -259280 -475021 -350649 -497
9282 -497 60591 61842 148045 724312 706444 736848 644795 385563 -182130 -391952 -380311 -172264
9270 -172264 -83636 88415 215105 242076 317520 138619 285883 368569 367100 477885 480461
9259 480461 607504 355047 400368 250618 -107548 -173184 60720 -53119 37565 93232
9249 93232 372185 661297 864448 515827 181894 110996 -23575 -183939 42241 -127206
$$ packed form
9324A34255l53009j12558K39329R7263K57468K46144K23284n6122l61851p07890
9314c93687k17452P9224L43392N1750R3424K25862Q1612m6139N9566q4891M7024
9303B39685m7429j66745j03535l9336L53745K18708J1796O7860l1437j74340j22976
9292B05996j06420J34033l24116J51788p0767k50524P30k15741J24372L50152
9282d97O1088J251Q6203N76267j7868L0404r2053k59232n67693k09822J1641K08047
9270a72264Q8628J72051J26690K6971P5444j78901J47264Q2686j469J10785K576
9259D80461J27043k52457M5321j49750l58166o5636K33904j13839R0684N5667
9249I3232K78953K89112K03151l48621l33933p0898j34571j60364K26180j69447
$$ plain form
9239 -127206 333177 894162 771114 485278 723217 612968 755829 544384 462382 328078
9229 328078 35713 83584 194938 220348 371471 260284 -148898 -192300 25654 157133
9219 157133 277828 390072 478293 429861 527753 759057 651369 952752 965877 917100 707861
9208 707861 672482 808316 589106 550564 440784 38799 -276820 -53916 -13141 -139965
9198 -139965 -100818 85112 -55036 -73359 -184759 -70664 160281 37547 -118009 277427
9188 277427 512113 217756 143816 374591 344676 282234 301581 397843 385103 640771 579005
9177 579005 259696 325517 242608 171703 234005 176589 512776 444092 422041 132115 399896
9166 399896 728728 558698 744996 726501 669740 748512 904074 954460 647964 299527
$$ packed form
9239a27206M60383N60985j23048k85836K37939j10249J42861k11445q2002j34304
9229C28078k92365M7871J11354K5410J51123j11187m09182m3402K17954J31479
9219A57133J20695J12244Q8221m8432R7892K31304j07688L01383J3125m8777k09239
9208G07861l5379J35834k19210l8542j09780m01985l15619K22904M0775j26824
9198a39965L9147J85930j40148j8323j11400J14095K30945j22734j55556L95436
9188B77427K34686k94357p3940K30775k9915o2442J9347R6262j2740K55668o1766
9177E79005l19309O5821q2909p0905O2302n7416L36187o8684k2051k89926K67781
9166C99896L28832j70030J86298j8495n6761P8772J55562N0386l06496l48437
$$ plain form
9156 299527 183728 213492 756312 1052212 1212575 1248068 956249 854538 1133662 1105068
9146 1105068 1384155 1680689 1777532 1204064 1729096 1752397 1209401 1215735 1592982 1583269 1511780
9135 1511780 1534024 1603325 1800645 1673943 1931872 2397448 2552957 2474019 2131389 2068074
9125 2068074 2294477 2518038 2295728 2259947 2527670 2865125 3352374 3585279 3799560 4243272
9115 4243272 4383537 4199622 4399308 4192238 4439088 4894385 5027176 5298868 5942733 6282079
9105 6282079 6608578 7283377 7732831 8310097 8751812 9269601 10154571 11470608 12367717
9096 12367717 13077748 13925944 15025406 16537043 18038789 19595227 21150527 22947273
9088 22947273 24079652 25501894 27428374 28750923 29488293 30077466 30384855 30288443 29969112
$$ packed form
9156B99527j15799K9764N42820K95900J60363L5493k91819j01711K79124k8594
9146A105068K79087K96534R6843n73468N25032K3301n42996O334L77247r713p1489
9135A511780K2244O9301J97320j26702K57929M65576J55509p8938l42630o3315
9125B068074K26403K23561k22310l5781K67723L37455M87249K32905K14281M43712
9115D243272J40265j83915J99686k07070K46850M55297J32791K71692O43865L39346
9105F282079L26499O74799M49454N77266M41715N17789Q84970J316037Q97109
9096A2367717P10031Q48196J099462J511637J501746J556438J555300J796746
9088B2947273J132379J422242J926480J322549P37370N89173L07389r6412l19331
$$ plain form
9079 29969112 29334535 28263627 27291824 26000973 24610502 23168679 21819808 20598009
9071 20598009 19555799 18613307 17626567 16767165 15826523 15004711 14252945 13698052 13148353
9062 13148353 12335593 11645193 10847951 10349220 10237061 9929267 9481668 9109361 8812988
9053 8812988 8218452 8137977 8050429 7845177 7642363 7694046 7232608 6865557 6603822 6243690
9043 6243690 5987515 6078529 6045949 5658567 5592737 5295415 5371496 5516037 5226412 4873866
9033 4873866 4647807 4451342 4126882 4080414 3965642 3964556 3945970 3881362 3693275 3418241
9023 3418241 3290514 3207359 3256414 3165323 3140806 3143114 3169823 3288432 3048243 3019639 2806044
9012 2806044 2646375 2570598 2556269 2651020 2869090 2875862 2560231 2329071 2095530 2188195 2113477
$$ packed form
9079B9969112o34577j070908r71803j290851j390471j441823j348871j221799
9071B0598009j042210r42492r86740q59402r40642q21812p51766n54893n49699
9062A3148353q12760o90400p97242m98731j12159l07794m47599l72307k96373
9053H812988n94536q0475q7548k05252k02814N1683m61438l67051k61735l60132
9043F243690k56175R1014l2580l87382o5830k97322P6081J44541k89625l52546
9033D873866k26059j96465l24460m6468j14772j086j8586o4608j88087k75034
9023C418241j27727q3155M9055r1091k4517K308K6709J18609k40189k8604k13595
9012B806044j59669p5777j4329R4751K18070O772l15631k31160k33541R2665p4718
$$ plain form
9001 2113477 2194214 2389091 2448511 2535733 2415450 2281713 2404959 2592647 2454983 2484267
8991 2484267 2426723 2233402 2031938 2141775 2048502 2112924 2040759 1981970 1558046 1445410
8981 1445410 1908528 1735226 1355749 1343288 1743659 1780779 1783659 1715966 1803405 1575176 1482678
8970 1482678 1492511 1767797 1609719 1419965 1212783 1443522 1631675 1616312 1446343 1329549
8960 1329549 1236015 1372800 1356548 1263802 793639 624715 600793 490834 653729 929988
8950 929988 1217982 1128587 1055332 847542 1140821 1378547 1275114 914467 864336 864496 717304
8939 717304 164960 25736 280292 548610 693459 873597 794275 565459 543881 361110
8929 361110 326665 490651 67978 -302999 -100278 388791 295492 323220 695883 668725
$$ packed form
9001B113477Q0737J94877N9420Q7222j20283j33737J23246J87688j37664K9284
8991B484267n7544j93321k01464J09837r3273O4422p2165n8789m23924j12636
8981A445410M63118j73302l79477j2461M00371L7120K880o7693Q7439k28229r2498
8970A482678R833K75286j58078j89754k07182K30739J88153j5363j69969j16794
8960A329549r3534J36785j6252r2746m70163j68924k3922j09959J62895K76259
8950I29988K87994q9395p3255k07790K93279K37726j03433l60647n0131J60j47192
8939G17304n52344j39224K54556K68318J44849J80138p9322k28816k1578j82771
8929C61110l4445J63986m22673l70977K02721M89069r3299K7728L72663k7158
$$ plain form
8919 668725 559475 770413 694573 523075 120029 214582 361788 168915 95380 -92222
8909 -92222 -121301 -20670 244583 70307 -58412 97988 419726 707453 762350 597851
8899 597851 270873 -47987 -168426 -27869 -47641 136317 332251 393246 503058 252901
8889 252901 459706 539374 500578 166563 -352370 -154630 21619 170684 200232 566832
8879 566832 576220 445221 374065 273550 344015 100887 -32660 292691 397402 599057
8869 599057 702232 441629 139135 45185 164987 143771 266833 408045 633738 589401
8859 589401 432705 30873 -410277 -49107 150130 186064 198375 285356 190765 476796
8849 476796 481777 251517 197973 73110 206192 100758 105252 276711 101205 -399621 -178129
$$ packed form
8919F68725j09250K10938p5840j71498m03046R4553J47206j92873p3535j87602
8909i2222k9079J00631K65253j74276j28719J56400L21738K87727N4897j64499
8899E97851l26978l18860j20439J40557j9772J83958J95934O0995J09812k50157
8889B52901K06805P9668l8796l34015n18933J97740J76249J49065K9548L66600
8879E66832R388j30999p1156j00515P0465k43128j33547L25351J04711K01655
8869E99057J03175k60603l02494r3950J19802k1216J23062J41212K25693m4337
8859E89401j56696m01832m41150L61170J99237L5934J2311Q6981r4591K86031
8849D76796M981k30260n3544j24863J33082j05434M494J71459j75506n00826K21492
$$ plain form
8838 -178129 286963 579570 605409 186947 -20659 -215789 -84331 307769 4730 -136316
8828 -136316 198971 340006 227386 179033 367788 498639 307662 128114 446497 868008
8818 868008 800952 716433 851133 930741 707865 772090 826040 793150 595108 334946 70836
8807 70836 198664 156541 14609 -29465 -96755 196457 637448 610077 575531 702065 622280
8796 622280 234300 254002 379007 284277 220661 74670 86996 94867 -289819 22678 137549
8785 137549 79369 86594 150685 362212 604892 510039 635368 844606 617039 428688 752233
8774 752233 788802 727755 678429 822268 1080538 1014550 969501 616041 81431 -192967 -141125
8763 -141125 135678 405905 396045 353996 -109455 -398862 -325034 -51027 156857 379013
$$ packed form
8838a78129M65092K92607K5839m18462k07606j95130J31458L92100l03039j41046
8828a36316L35287J41035j12620m8353J88755J30851j90977j79548L18383M21511
8818H68008o7056q4519J34700P9608k22876O4225N3950l2890j98042k60162k64110
8807G0836J27828m2123j41932m4074o7290K93212M40991k7371l4546J26534p9785
8796F22280l87980J9702J25005r4730o3616j45991J2326P871l84686L12497J14871
8785A37549n8180P225O4091K11527K42680r4853J25329K09238k27567j88351L23545
8774G52233L6569o1047m9326J43839K58270o5988m5049l53460n34610k74398N1842
8763a41125K76803K70227r860m2049m63451k89407P3828K74007K07884K22156
$$ plain form
8753 379013 438637 518538 551705 680581 638399 513510 242756 -158044 -348087 -222520
8743 -222520 -89667 -160215 238211 319215 207296 222643 189681 273974 352012 282925 266961
8732 266961 526165 404454 565336 557183 175322 -44354 114003 8140 66370 156382
8722 156382 363852 260403 210402 319748 395898 320919 585843 649029 159246 265669
8712 265669 423597 191563 14491 -106339 -35267 138851 343817 607014 322862 -60825
8702 -60825 11513 -28664 232773 483783 420605 305796 293153 457391 305947 282651 417591
8691 417591 382567 288682 240737 217231 304543 758450 709519 274353 28633 159742 391538
8680 391538 255088 274027 162652 201943 118709 -13210 -46873 59645 302034 432010
$$ packed form
8753C79013N9624P9901L3167J28876m2182j24889k70754m00800j90043J25567
8743b22520J32853p0548L98426Q1004j11919J5347l2962Q4293P8038o9087j5964
8732B66961K59204j21711J60882q153l81861k19676J58357j05863N8230R0012
8722A56382K07470j03449n0001J09346P6150p4979K64924O3186m89783J06423
8712B65669J57928k32034j77072j20830P1072J74118K04966K63197k84152l83687
8702f0825P2338m0177K61437K51010o3178j14809j2643J64238j51444k3296J34940
8691D17591l5024r3885m7945k3506Q7312M53907m8931m35166k45720J31109K31796
8680C91538j36450J8939j11375L9291q3234j31919l3663J06518K42389J29976
$$ plain form
8670 432010 390454 267962 73394 -192566 -110940 190046 274244 548636 640930 594754 433125
8659 433125 326993 102317 248174 723529 775572 354353 154388 206118 416530 282116
8649 282116 81791 62264 153385 210433 156719 151710 405557 508560 282151 193057 51660
8638 51660 -2139 431402 767207 866794 716787 595963 409942 399196 483458 539127 455235
8627 455235 316331 527651 933955 973401 1069775 523632 272478 330203 294752 284809 307070
8616 307070 332810 -29979 -4024 -5657 227841 426458 680428 606099 488914 457478 472829
8605 472829 357050 330441 34651 170233 314776 442577 468978 552928 1001924 1016482
8595 1016482 1027853 1292542 1597282 1720172 1644912 1188977 619845 281497 493944 544591
$$ packed form
8670D32010m1556j22492j94568k65960Q1626L00986Q4198K74392R2294m6176j61629
8659D33125j06132k24676J45857M75355N2043m21219j99965N1730K10412j34414
8649B82116k00325j9527R1121N7048n3714n009K53847J03003k26409q9094j41397
8638E1660n3799M33541L35805R9587j50007j20824j86021j0746Q4262N5669q3892
8627D55235j38904K11320M06304L9446R6374n46143k51154N7725l5451r943K2261
8616C07070K5740l62789K5955j633K33498J98617K53970p4329j17185l1436J5351
8605D72829j15779k6609k95790J35582J44543J27801K6401Q3950M48996J4558
8595A016482J1371K64689L04740J22890p5260m55935n69132l38348K12447N0647
$$ plain form
8585 544591 414857 355609 461289 639886 780292 572947 292446 266705 315117 166018
8575 166018 22977 -87587 337731 774619 741478 403894 22377 -103575 -289856 -283134
8565 -283134 145394 41176 217762 382193 95475 -74042 92 -68293 -329910 -359693
8555 -359693 53754 416989 397868 303106 399907 336305 123540 240015 251912 97171 107989
8544 107989 225649 60015 -119652 -117663 264822 402486 430583 404164 151302 -175840
8534 -175840 -168538 -97769 25082 -105978 -77879 -23151 277205 226028 -64484 -38435 120007
8523 120007 390341 97626 -352575 -422988 -344087 -43849 355999 741210 666264 400333
8513 400333 64150 43229 221031 312762 182009 106283 528371 437859 84106 84063 31333
$$ packed form
8585E44591j29734n9248J05680J78597J40406k07345k80501k5741M8412j49099
8575A66018j43041j10564M25318M36888l3141l37584l81517j25952j86281O722
8565b83134M28528j04218J76586J64431k86718j69517P4134o8385k61617k9783
8555c59693M13447L63235j9121r4762R6801o3602k12765J16475J1897j54741J0818
8544A07989J17660j65634j79667J989L82485J37664K8097k6419k52862l27142
8534a75840P302P0769J22851j31060K8099N4728L00356n1177k90512K6049J58442
8523A20007K70334k92715m50201p0413P8901L00238L99848L85211p4946k65931
8513D00333l36183k0921J77802R1731j30753p5726M22088r0512l53753m3n2730
$$ plain form
8502 31333 201261 422085 162428 54110 177882 254966 193779 311120 455754 515870
8492 515870 581384 463165 356786 184965 334786 514602 430540 168876 28914 -110168
8482 -110168 57404 -9149 -402088 -583458 -210476 -120722 -21954 84175 -193523 25388
8472 25388 156327 -233982 -780003 -947529 -403283 92805 -91352 -544669 -717789 -516248
8462 -516248 -342170 -299021 -341994 -368070 -537293 -595009 -286247 148025 361659 193577
8452 193577 -79587 -125582 168378 319699 138029 -314557 -143247 98813 189973 34064
8442 34064 139466 304798 262920 -56516 -222746 160809 453331 378900 45036 -250697
8432 -250697 2521 108876 -43851 -145744 -239964 -20130 -13493 -51573 -109232 -60284 232054
$$ packed form
8502C1333J69928K20824k59657j08318J23772P7084o1187J17341J44634O0116
8492E15870O5514j18219j06379j71821J49821J79816q4062k61664j39962j39082
8482a10168J67572o6553l92939j81370L72982Q9754R8768J06129k77698K18911
8472B5388J30939l90309n46021j67526N44246M96088j84157m53317j73120K01541
8462e16248J74078M3149m2973k6076j69223n7716L08762M34272K13634j68082
8452A93577k73164m5995K93960J51321j81670m52586J71310K42060R1160j55909
8442C4064J05402J65332m1878l19436j66230L83555K92522p4431l33864k95733
8432b50697K53218J06355j52727j01893r4220K19834O637l8080n7659M8948K92338
$$ plain form
8421 232054 132005 -220146 -130327 89014 215768 409491 248268 533867 578632 276820
8411 276820 294141 543340 586549 193592 -134606 -154884 -264457 -210126 -347785 -493829
8401 -493829 -267781 -87864 -127339 61097 105415 210026 158024 543734 432665 24592
8391 24592 142835 260223 233580 206144 22739 -122615 316935 552109 481292 267712
8381 267712 329486 503002 297967 313535 300568 20779 -126903 183602 317657 61024
8371 61024 -48862 124439 541374 670975 705167 545558 101190 -117576 34568 228891
8361 228891 228573 84387 -109917 -259706 -306193 -108747 362682 312799 58619 -316219 -189340
8350 -189340 244270 101033 41017 380275 458228 439131 269775 27191 -157380 266496
$$ packed form
8421B32054j00049l52151Q9819K19341J26754J93723j61223K85599M4765l01812
8411B76820J7321K49199M3209l92957l28198k0278j09573N4331j37659j46044
8401d93829K26048J79917l9475J88436M4318J04611n2002L85710j11069m08073
8391B4592J18243J17388k6643k7436j83405j45354M39550K35174p0817k13580
8381B67712O1774J73516k05035J5568j2967k79789j47682L10505J34055k56633
8371F1024j09886J73301M16935J29601L4192j59609m44368k18766J52144J94323
8361B28891l18j44186j94304j49789m6487J97446M71429m9883k54180l74838J26879
8350a89340M33610j43237o0016L39258P7953j9097j69356k42584j84571M23876
$$ plain form
8340 266496 512479 587699 361551 46873 111218 332036 275923 205841 302162 293930 203973
8329 203973 -22871 -122593 -43004 -139282 188233 75568 -193709 -104573 -191135 -84752 -157438
8318 -157438 -352289 -584704 -511818 -376956 -618524 -369717 194652 2543 69268 -393942
8308 -393942 -554648 -329562 -313093 -772991 -833994 -721078 -336105 215078 244099 -62665
8298 -62665 -99265 176266 6044 133361 -73998 -291488 -36508 323972 470624 340909
8288 340909 -90125 -198806 -8094 190259 128308 -130564 -242562 -191513 91517 302393
8278 302393 134819 -376513 -476300 327819 477519 438733 392973 601012 534877 573237 619534
8267 619534 520938 272225 -279104 -385319 -45810 48436 274164 210681 276311 308072 -217912
$$ packed form
8340B66496K45983P5220k26148l14678O4345K20818n6113p0082R6321q232q9957
8329B03973k26844r9722P9589r6278L27515j12665k69277Q9136q6562J06383p2686
8318a57438j94851k32415P2886J34862k41568K48807N64369j92109O6725m63210
8308c93942j60706K25086J6469m59898o1003J12916L84973N51183K9021l06764
8298f2665l6600K75531j70222J27317k07359k17490K54980L60480J46652j29715
8288C40909m31034j08681J90712J98353o1951k58872j11998N1049K83030K10876
8278C02393j67574n11332r9787Q04119J49700l8786m5760K08039o6135L8360M6297
8267F19534r8596k48713n51329j06215L39509R4246K25728o3483O5630L1761n25984
$$ plain form
8256 -217912 -604384 -588481 -582825 -544235 -583328 -577936 -504888 -395039 101998 360241 250949
8245 250949 -2627 -35402 55289 -53828 -245058 -180245 -362918 -449994 -453690 -459311 -656256
8234 -656256 -610429 -55327 95900 19520 -66748 -176568 -159540 -498047 -597410 -545076 -387940
8223 -387940 -25800 223718 110875 -66196 -108755 60433 16378 63196 283112 755602
8213 755602 560791 383699 685674 777988 309009 -44495 -414777 -300419 132936 248517
8203 248517 124622 -101265 -54421 53138 -164206 111045 73972 256672 387091 276934
8193 276934 76528 -193489 -51276 192097 170886 90768 92636 95893 39548 243632 160166
8182 160166 -22154 200612 162791 73284 13912 -229062 -199836 -263283 -197673 176535 -18328
$$ packed form
8256b17912l86472J5903N656L8590l9093N392P3048J09849M97037K58243j09292
8245B50949k53576l2775R0691j09117j91230O4813j82673q7076l696n621j96945
8234f56256M5827N55102J51227p6380q6268j09820J7028l38507r9363N2334J57136
8223c87940L62140K49518j12843j77071m2559J69188m4055M6818K19916M72490
8213G55602j94811j77092L01975R2314m68979l53504l70282J14358M33355J15581
8203B48517j23895k25887M6844J07559k17344K75251l7073J82700J30419j10157
8193B76934k00406k70017J42213K43373k1211q0118J868L257n6345K04084q3466
8182A60166j82320K22766l7821q9507n9372k42974K9226o3447O5610L74208j94863
$$ plain form
8171 -18328 -350902 -366017 -390870 -622897 -580084 -206987 244188 280944 388136 325769 158289
8160 158289 -95044 42628 -127255 20418 108591 241431 225200 -167672 -376751 -62704
8150 -62704 -45375 -109049 117977 127913 312616 213881 137110 -20161 -14168 -79179 -218709
8139 -218709 -251456 -129472 295726 285385 434116 140782 11734 -219240 -199067 -245366
8129 -245366 90241 298353 269231 156521 12012 -115316 -296434 -231077 -3616 234060
8119 234060 230847 280186 241692 567681 734056 651660 474529 460435 510036 526516 534171
8108 534171 -40208 -417069 -234533 -212110 -462816 -528097 -522713 -483610 -303328 -279305 101431
8097 101431 181799 -6514 -327553 -359794 -512804 -434813 -358819 -65694 -135280 -155408 189776
$$ packed form
8171a8328l32574j5115k4853k32027M2813L73097M51175L6756J07192o2367j67480
8160A58289k53333J37672j69883J47673Q8173J32840j6231l92872k09079L14047
8150f2704J7329o3674K27026R936J84703r8735p6771j57271N993o5011j39530
8139b18709l2747J21984M25198j0341J48731k93334j29048k30974K0173m6299
8129b45366L35607K08112k9122j12710j44509j27328j81118O5357K27461K37676
8119B34060l213M9339l8494L25989J66375q2396j77131j4094M9601J6480P655
8108E34171n74379l76861J82536K2423k50706o5281N384L9103J80282K4023L80736
8097A01431Q0368j88313l21039l2241j53010P7991P5994K93125o9586k0128L45184
$$ plain form
8086 189776 174180 50551 330979 181897 151428 161389 470342 384304 391336 489375 441047
8075 441047 402016 187714 253613 340950 172958 16128 151637 74986 229610 299068 127655
8064 127655 106515 -129401 -23987 289119 209749 158271 349186 568633 365907 383379
$$ packed form
8086A89776j5596j23629K80428j49082l0469R961L08953q6038P032R8039m8328
8075D41047l9031k14302O5899Q7337j67992j56830J35509p6651J54624O9458j71413
8064A27655k1140k35916J05414L13106p9370n1478J90915K19447k02726J7472
$$ [...]
##END NTUPLES=NMR SPECTRUM
##END=
