##TITLE=Analysis number 326857
Compound Code cc 52408
Book Reference 464/108/2
Project Code adrs
Chemist Name chrisr
##JCAMPDX= 6.0         $$ Bruker NMR JCAMP-DX V2.0
##DATA TYPE= NMR SPECTRUM
##DATA CLASS= NTUPLES
##ORIGIN= Bruker BioSpin GmbH
##OWNER= nmr
$$ XWIN-NMR		Version 3.5
$$ Mon Feb 26 12:32:17 2007 GMT Standard Time (UT+0h)  MAYBRIDGE\nmr@NMR_250MHZ
##.OBSERVE FREQUENCY= 250.131544655141
##.OBSERVE NUCLEUS= ^1H
##.ACQUISITION MODE= SIMULTANEOUS (DQD)
##.ACQUISITION SCHEME= undefined
##.AVERAGES= 16
##.DIGITISER RES= 18
##SPECTROMETER/DATA SYSTEM= dpx250
##.PULSE SEQUENCE= zg30
##.SOLVENT NAME= CDCl3
##.SHIFT REFERENCE= (INTERNAL, CDCl3, 0, 16.522)
##AUDIT TRAIL= $$ (NUMBER, WHEN, WHO, WHERE, WHAT)
$$ ##TITLE= Audit trail, XWIN-NMR		Version 3.5
$$ ##JCAMPDX= 5.01
$$ ##ORIGIN= Bruker BioSpin GmbH
$$ ##OWNER= nmr
$$ C:\u/data/dgb/nmr/ADRS/1950/pdata/1/auditp.txt
$$ ##AUDIT TRAIL=  $$ (NUMBER, WHEN, WHO, WHERE, WHAT)
(   1,<2007-02-26 12:31:54.80 +000>,<MAYBRIDGE\nmr>,<NMR_250MHZ>,
      <created by zg, POWCHK disabled, PULCHK disabled
       configuration hash MD5:
       49 4B E0 1D 92 C2 6B 37 9F E6 65 BC 52 41 86 1D
       data hash MD5: 64K
       77 65 54 96 87 0D 93 01 45 F5 A1 6F 9F F4 1E B3>)
(   2,<2007-02-26 12:32:07.39 +000>,<MAYBRIDGE\nmr>,<NMR_250MHZ>,
      <Start of raw data processing
       ef LB = 0.3 FT_mod = 6 PKNL = 1 SI = 32K 
       data hash MD5: 32K
       E4 DD 94 83 06 E6 F8 7B 63 2C A0 4D 3F DD D4 1A>)
(   3,<2007-02-26 12:32:08.97 +000>,<MAYBRIDGE\nmr>,<NMR_250MHZ>,
      <apk 
       data hash MD5: 32K
       8F D0 7C D2 62 4B FF 0C 14 8E D7 E1 A1 E3 2E 62>)
(   4,<2007-02-26 12:32:09.68 +000>,<MAYBRIDGE\nmr>,<NMR_250MHZ>,
      <abs ABSG = 5 
       data hash MD5: 32K
       6E A4 22 EC D6 DC 04 B7 B1 CD F5 58 CE A4 86 B6>)
$$ ##END=
$$ 
$$ hash MD5
$$ 86 18 30 AE 70 4B 80 18 44 86 5B 64 D6 21 61 3A
##$RELAX= 
##$RELAX= 
##$RELAX= 
##$RELAX= 
##$RELAX= 
##$RELAX= 
##$RELAX= 
$$ Bruker specific parameters
$$ --------------------------
##$DU= <C:\u>
##$EXPNO= 1950
##$NAME= <ADRS>
##$PROCNO= 1
##$TYPE= <nmr>
##$USER= <dgb>
##$AMP= (0..31)
100 100 100 100 100 100 100 100 100 100 100 100 100 100 100 100 100 100 
100 100 100 100 100 100 100 100 100 100 100 100 100 100 
##$AQSEQ= 0
##$AQ_mod= 3
##$AUNM= <au_zg>
##$AUTOPOS= <32 >
##$BF1= 250.13
##$BF2= 250.13
##$BF3= 250.13
##$BF4= 250.13
##$BF5= 500.13
##$BF6= 500.13
##$BF7= 500.13
##$BF8= 500.13
##$BYTORDA= 1
##$CFDGTYP= 0
##$CFRGTYP= 5
##$CHEMSTR= <none>
##$CNST= (0..31)
1 1 145 1 1 1 1 1 1 1 1 1 1 1 1 1 1 1 1 1 1 1 1 1 1 1 1 1 1 1 1 1 
##$CPDPRG= <>
##$CPDPRG1= <>
##$CPDPRG2= <>
##$CPDPRG3= <>
##$CPDPRG4= <mlev>
##$CPDPRG5= <mlev>
##$CPDPRG6= <mlev>
##$CPDPRG7= <mlev>
##$CPDPRG8= <mlev>
##$CPDPRGB= <>
##$CPDPRGT= <>
##$D= (0..31)
0 1 0 0 0 0 0 0 0 0.06 0 0 0 0 0 0 0.0002 0 0 0 0 0 0 0 0 0 0 0 0 0 0 
0 
##$DATE= 1172493113
##$DBL= (0..7)
120 120 120 120 120 120 120 120 
##$DBP= (0..7)
150 150 150 150 150 150 150 150 
##$DBP07= 0
##$DBPNAM0= <>
##$DBPNAM1= <>
$$ [...]
##$SUBNAM7= <"">
##$SUBNAM8= <"">
##$SUBNAM9= <"">
##$SW= 20.6930455092707
##$SWIBOX= (0..15)
0 0 3 0 0 0 0 0 0 0 0 0 0 0 0 0 
##$SW_h= 5175.983436853
##$TD= 65536
##$TD0= 1
##$TE= 295.16
##$TE2= 300
##$TE3= 300
##$TEG= 300
##$TL= (0..7)
0 120 120 120 120 120 120 120 
##$TP= (0..7)
150 150 150 150 150 150 150 150 
##$TP07= 0
##$TPNAME0= <>
##$TPNAME1= <>
##$TPNAME2= <>
##$TPNAME3= <>
##$TPNAME4= <>
##$TPNAME5= <>
##$TPNAME6= <>
##$TPNAME7= <>
##$TPOAL= (0..7)
0.5 0.5 0.5 0.5 0.5 0.5 0.5 0.5 
##$TPOFFS= (0..7)
0 0 0 0 0 0 0 0 
##$TUNHIN= 0
##$TUNHOUT= 0
##$TUNXOUT= 0
##$USERA1= <user>
##$USERA2= <user>
##$USERA3= <user>
##$USERA4= <user>
##$USERA5= <user>
##$V9= 5
##$VALIST= <valist>
##$VCLIST= <CCCCCCCCCCCCCCC>
##$VD= 0
##$VDLIST= <DDDDDDDDDDDDDDD>
##$VPLIST= <PPPPPPPPPPPPPPP>
##$VTLIST= <TTTTTTTTTTTTTTT>
##$WBST= 1024
##$WBSW= 4
##$XGAIN= (0..3)
0 0 0 0 
##$XL= 0
##$YL= 0
##$YMAX_a= 341335
##$YMIN_a= -403040
##$ZGOPTNS= <>
##$ZL1= 120
##$ZL2= 120
##$ZL3= 120
##$ZL4= 120
##$ABSF1= 16.522
##$ABSF2= -4.171173
##$ABSG= 5
##$ABSL= 3
##$ALPHA= 0
##$AQORDER= 0
##$ASSFAC= 0
##$ASSFACI= 0
##$ASSFACX= 0
##$ASSWID= 0
##$AUNMP= <proc_1d>
##$AZFE= 0.1
##$AZFW= 0.1
##$BCFW= 0
##$BC_mod= 0
##$BYTORDP= 0
##$COROFFS= 0
##$CY= 12.5
##$DATMOD= 1
##$DC= 0
##$DFILT= <>
##$DTYPP= 0
##$F1P= 14.0000005364418
##$F2P= -0.99999901652339
##$FCOR= 0.5
##$FTSIZE= 32768
##$FT_mod= 6
##$GAMMA= 0
##$GB= 0
##$INTBC= 1
##$INTSCL= 1
##$ISEN= 128
##$LB= 0.3
##$LEV0= 0
##$LPBIN= 0
##$MAXI= 10000
##$MC2= 0
##$MEAN= 0
##$ME_mod= 0
##$MI= 0
##$NCOEF= 0
##$NC_proc= -4
##$NLEV= 6
##$NOISF1= 0
##$NOISF2= 0
##$NSP= 0
##$NTH_PI= 0
##$NZP= 0
##$OFFSET= 16.522
##$PC= 1
##$PHC0= 227.0103
##$PHC1= 6.297181
##$PH_mod= 1
##$PKNL= yes
##$PPARMOD= 0
##$PSCAL= 4
##$PSIGN= 0
##$REVERSE= no
##$SF= 250.13
##$SI= 32768
##$SIGF1= 0
##$SIGF2= 0
##$SINO= 400
##$SIOLD= 32768
##$SREGLST= <1H.CDCl3>
##$SSB= 0
##$STSI= 32768
##$STSR= 0
##$SW_p= 5175.98343685301
##$SYMM= 0
##$S_DEV= 0
##$TDeff= 65536
##$TDoff= 0
##$TI= <Analysis number 999999
Compound Code 99
Book Reference 9
Project Code 9>
##$TILT= no
##$TM1= 0
##$TM2= 0
##$TOPLEV= 0
##$USERP1= <user>
##$USERP2= <user>
##$USERP3= <user>
##$USERP4= <user>
##$USERP5= <user>
##$WDW= 1
##$XDIM= 32768
##$YMAX_p= 393990235
##$YMIN_p= -108908
$$ End of Bruker specific parameters
$$ ---------------------------------
##NTUPLES= NMR SPECTRUM
##VAR_NAME=  FREQUENCY,     SPECTRUM/REAL,   SPECTRUM/IMAG
##SYMBOL=    X,             R,               I
##VAR_TYPE=  INDEPENDENT,   DEPENDENT,       DEPENDENT
##VAR_FORM=  AFFN,          ASDF,            ASDF
##VAR_DIM=   32768,         32768,           32768
##UNITS=     HZ,            ARBITRARY UNITS, ARBITRARY UNITS
##FACTOR=    0.157963299565203, 1,           1
##FIRST=     4132.6476996994, 0,             0
##LAST=      -1043.33573715361, 0,           0
##MIN=       -1043.33573715361, -108908,     0
##MAX=       4132.6476996994, 393990235,     0
$$ Real data points
##PAGE= N=1
##DATA TABLE= (X++(R..R)), XYDATA
$$ [...]
24046 -38133 -9144 -10260 5281 6267 -9520 -17741 -21423 -20567 -6983 2493 -17682 -23630 -30909 -17948
24032 -17948 2645 18225 10771 -7399 -27482 -34169 -31078 5154 31510 26265 24736 17683 25367
24019 25367 13490 3629 -14038 -11194 240 1419 -1487 -14810 3112 28062 21135 21152 21196 13943
24005 13943 14903 22109 30512 26883 20451 23334 7937 -13367 -16734 -8139 -1286 -21695 -35144 -19034
23991 -19034 3092 9876 -4003 -8010 4448 47056 54911 39627 32613 37272 33421 5553 -19305
23978 -19305 -20743 8883 19480 33784 55701 57907 13365 16876 12410 -21133 -7549 -3425 660
23965 660 -1922 -13983 -38187 -53564 -36911 -406 9034 4243 11863 19017 -4105 -21812 251
23952 251 -18173 -18886 -9346 7421 15663 3194 -5853 -20992 -28051 -2489 -2000 -33516 -22666 -35196
23938 -35196 -12178 3090 18598 24879 11572 17030 17136 27620 27645 29235 -2492 13245 36627
23925 36627 37031 29408 12352 10366 27117 11796 -11689 -21254 -16674 -33813 -24794 -51876 -62103
23912 -62103 -48788 -31551 -12280 4854 2388 9512 22169 36216 23536 12202 20267 11899
23900 11899 23199 40555 15756 -26159 -43542 -22978 -14148 3170 12422 36093 15527 19746
23888 19746 -8745 -32515 -35173 -15037 -16515 -35151 -30381 -31505 -18903 9539 -27686 -48902
23876 -48902 -26780 -33771 -39106 -18162 -18117 -27813 17199 12926 -7712 -14156 -39646 -52888 -70312
23863 -70312 -44383 -37273 -44624 -20183 -14643 -14755 -23486 -8664 17525 31361 8576 8997 -3615
23850 -3615 -8565 -7566 -12717 -17343 -45773 -49380 -58465 -63057 -34700 -12588 -9604 -11081 27734 21269
23836 21269 8080 -8541 -19316 -16690 -25653 -24959 -9517 -12665 -33589 -36515 -33544 -21320 -22436
23823 -22436 7636 23981 325 2257 -20377 -47076 -22163 4484 -2948 4919 1165 -10280
23811 -10280 6129 -28345 -65344 -59798 -36091 -12827 -7484 -9625 -28398 -51423 -56233 -30841
23799 -30841 7249 -18197 -8512 39778 35353 -13819 -31003 -22010 -23578 -38095 13928 44910
23787 44910 52815 27146 13846 -25829 -38072 -20824 3026 12616 -3603 8826 137 -7119
23775 -7119 -17903 -16717 -8631 10519 32849 33409 28371 13291 26487 44738 39416 34712 40585
23762 40585 30711 13568 29058 35448 45018 34301 18175 14364 8538 -4933 -18435 -17415 -2138
23749 -2138 -14504 -46881 -18298 10892 -21774 -20084 -19822 3580 13868 20978 9830 -9789 -26393
23736 -26393 -3362 -8786 13285 6622 -3161 -6629 7859 12872 13596 3267 -9268 -15473 7508
23723 7508 -2536 -20075 -17108 310 14074 22920 5761 -31206 -17986 9916 22482 16652
23711 16652 -3661 -7607 -3616 21932 10295 4702 9756 6230 8555 8212 -4640 -19862 -39505
23698 -39505 -32187 -13563 -5604 11683 29383 24693 -867 -39434 -18328 11134 19722 24390 21765
23685 21765 9650 -3522 -21041 -13275 -2067 11798 20650 17447 2456 11767 15404 -1065 4495
23672 4495 4720 -9039 -3893 -27717 -37144 -45695 -29973 -3605 5283 4325 28448 20259 13262 5371
23658 5371 -2403 -5409 -5137 -13726 -20427 -11224 5393 17703 324 -22244 -12120 -19190 -27726 -35118
23644 -35118 -3263 13425 -9516 -20301 11869 19526 -13179 -11947 -11956 -28758 -17669 2782 3827
23631 3827 16202 30381 19265 29573 41133 51735 40535 44048 30108 8556 -620 20413
23619 20413 18540 12273 26974 23921 59 -19545 -726 448 2533 7447 23868 15675 -13903
23606 -13903 -10464 10733 7351 -14546 -12725 4722 35053 7087 16423 38904 32523 26654 13839
23593 13839 -3705 -7262 16942 31222 19194 13907 -8155 -13976 -8619 -28641 -8341 9754
23581 9754 16260 8143 -3771 -12561 -4895 -1849 -19595 -9559 212 898 2939 6745 -10524 -11990
23567 -11990 3457 -7660 -15104 -23840 -9874 2007 6034 16260 -19218 -23708 -19941 2795 3434
23554 3434 4376 -6035 10163 33470 22775 -2087 -25658 -56811 -52203 -47080 -21822 -4821 -1182
23541 -1182 -1031 23025 45526 41778 9370 2291 -15129 -40838 -47548 -54745 -32548 528 12040
23528 12040 -2476 -16986 -14747 1622 -5235 9200 6826 -452 18349 34127 22333 -9893
23516 -9893 848 17696 29061 33425 23598 -10606 -44854 -51949 -15969 1982 18051 24411 48333
23503 48333 32045 -7138 -12094 11502 4267 4787 1767 -9980 1351 18410 17436 -920 1545
23490 1545 -34838 -20833 -31358 -45991 -49470 -46868 -31118 -777 10098 -16056 -205 22402
23478 22402 41522 25481 -1404 -21217 -21079 -14547 -15974 -9217 -17117 -22180 -4364 -10046 6728
23465 6728 17167 41615 17738 3756 11959 12080 -38820 -70955 -42520 -6282 9730 26992
23453 26992 13082 12390 24239 14863 4605 -15602 -5711 5723 27585 30678 17760 2324 -9221
23440 -9221 -6734 25187 56114 42085 12825 26541 26641 38119 18754 229 -5577 -35901 -29587
23427 -29587 -31657 -29215 -37553 -17317 11692 -4109 -19028 -22979 -31922 -18007 -6975 -22930 -3196
23414 -3196 -8199 -28796 -36414 -14445 16943 31025 23816 -12840 -12755 10148 6044 452 3009 19318
23400 19318 17955 6623 -1516 -17857 5381 7773 -7048 -13681 14999 30323 20109 16869 4234
23387 4234 10466 14407 19361 3030 -37522 -20319 4226 12720 21532 29752 43205 32997 1098
23374 1098 -6163 22169 13309 11564 -4983 -10160 7247 10948 1343 23565 8070 -9744 -296
23361 -296 20226 56170 68923 32247 11036 -17846 -21046 5084 12688 3018 -17668 -20892 -15291
23348 -15291 14147 35625 -10187 -20265 4376 12989 14511 9127 11615 139 829 1524 9163
23335 9163 -9464 16799 13872 8629 8061 6277 3500 -30514 -18713 -216 -8858 -13055 11884
23322 11884 13496 -4881 -4935 -4831 -17798 -18730 7735 9261 43529 39119 42998 56328 34729 627
23308 627 -11266 -32567 -35432 -40974 -56514 -59503 -60971 -47002 -24602 -40080 -45696 -42433 -21739
23295 -21739 -13502 4052 -1741 -1453 17118 18084 1729 -12196 -23249 -41571 -45820 -34900 -20390
23282 -20390 -25131 -3136 34250 16622 4712 9433 30013 48484 52879 47119 27347 -2374
23270 -2374 -11684 9598 30878 39083 26185 14156 14303 17199 37730 7909 -4968 32660 14383
23257 14383 4306 20612 1031 -6408 -20602 -24136 -27339 -15094 -20212 -28905 -5664 11632 7678
23244 7678 -4043 12066 37732 20697 5303 24617 29197 -1281 -26422 -27619 -32944 -38246 -55110
23231 -55110 -55798 -54305 -47220 -24263 10251 13451 308 -21247 -6533 -7538 -24190 -29714 -22045
23218 -22045 -1294 3541 21252 39514 32385 24615 8017 0 -7827 -15184 3687 6173 -8242
23205 -8242 -8545 37585 37371 12855 -18920 -30407 -26061 -38189 -22423 18082 12149 -15571 -50625
23192 -50625 -66374 -48563 -30373 -22501 -31465 -25861 -26044 -25576 -26245 -31559 -12252 29552 43328 31284
23178 31284 33896 58543 42438 18191 -6127 5057 51948 23598 24974 53311 53158 31256
23166 31256 17045 1432 23234 52002 43564 23585 22015 -2771 3099 -4579 3860 -4907 -18732
23153 -18732 2485 44785 32528 14376 -30459 -37697 -10418 18995 14499 -6759 -19566 -9253
23141 -9253 15249 15223 -3096 -9987 -10547 -19674 -30039 -22536 -13079 -704 -26249 -61963 -80002 -61563
23127 -61563 -21326 -2224 -19140 -7898 10994 853 -16025 -8485 12017 9915 -23253 -27615
23115 -27615 9263 22548 2130 -23566 -18362 -13885 -23613 3526 37197 21507 -532 -27735
23103 -27735 -52141 -60080 -46971 -46421 -39180 -35163 -28744 -37003 -39296 -17208 -33237 -45887 -31177
23090 -31177 -39269 -28917 -43177 -13125 8429 30633 49883 13682 -18853 -10570 10335 6724
23078 6724 -7368 176 14841 21652 16914 11493 17953 -5548 -18448 -31174 -30228 6670 17423
23065 17423 15444 -11341 -23765 -26478 -49447 -47442 -32865 -36390 -24985 -44251 -24113 -5753
23053 -5753 -6271 -18734 -25624 -22367 -40597 -21614 17691 42793 44467 15482 11648 -2958 -6615
23040 -6615 -3070 -4487 -12616 -26777 -15717 -28747 -25034 21395 25746 -3382 -4542 -9274 -341
23027 -341 -31122 -6216 3233 25157 24433 -331 3222 20119 13937 12020 6620 18827 28436 36388
23013 36388 41338 42080 18774 -1343 -3461 -25672 -28302 -9755 9811 18273 -6574 -16221 -16186 -22596
22999 -22596 -39242 -37203 -24785 -24293 -21843 -5344 9890 -9958 -15848 -36517 -37457 -30281 -27053
22986 -27053 -13857 -19839 -4772 -10885 -30179 -34097 -10628 3934 -9539 1448 12822 25847
22974 25847 18016 -1462 -7453 -12612 13147 -5259 -25090 -26380 -23350 -18507 -6563 -12030 11515
22961 11515 33921 28626 1837 -12046 -27137 -20851 5912 24378 30339 16173 -4134 -18011
22949 -18011 -17554 1168 22595 27287 17214 37680 19669 2972 -1823 -5984 -19858 -25611 -20907
22936 -20907 9569 -69 -4 -5951 -12977 -17711 -4286 -28674 -37229 -41782 -23537 6814 10512 -13184
22922 -13184 -17675 -21582 -9979 -936 2234 15569 16435 -1729 -5695 27009 44041 21438 -9097
22909 -9097 3902 17035 22656 28403 26897 -3139 -14906 -20348 4817 4741 -36095 -37020 -7303 -22385
22895 -22385 -32049 -6515 12223 7132 -7872 -16639 -10412 -23207 472 14834 -1163 66 -2853
22882 -2853 -5123 -131 -19630 -8260 770 14057 -3130 -8893 3428 27329 -4749 -30929 -24844
22869 -24844 -31904 -39223 -35631 -9682 28293 16026 957 4423 10648 -5613 6060 24721 17650
22856 17650 1491 -33718 -34111 -42430 -26546 -13279 21777 25590 6824 4020 11264 2196 -1558
22843 -1558 -239 57 -6803 -8679 -37512 -58212 -25601 -29696 -51232 -38220 -46631 -43874 -27293
22830 -27293 -11220 6053 -495 9057 28625 28603 -1204 -5741 13996 27667 18532 7372 30706
22817 30706 52972 34139 15018 22541 23466 -12376 -15610 18703 31244 31820 41225 28217 20613
22804 20613 16767 2054 -32710 -16641 -17144 -37840 -16744 -1474 -31195 -23277 3751 9465 4840
22791 4840 -13023 -17358 -9825 -8475 -4348 23393 21507 -14481 -12123 8893 23060 8348 -5176
22778 -5176 27709 39725 52561 56681 29116 135 20879 27258 15746 22407 31632 29030 3025
22765 3025 -17951 -4986 16481 36224 22400 19806 9373 14269 26330 54660 59235 19022
22753 19022 -14902 -50766 -43454 -32061 -11544 -36 -2507 -6844 -22684 -13513 -15670 -4286 6214
22740 6214 4559 24848 34846 11060 -17271 -39106 -33858 -37200 -25785 -30188 -29329 -14522 -3284
22727 -3284 10771 2979 41997 51279 63653 41846 5691 4198 20058 -715 -21025 -28149 -24999
22714 -24999 -30205 -42470 -54059 -53558 -13378 14288 21599 27064 39084 32457 26965 24227 36218
22701 36218 6765 -6834 23665 13782 2159 12801 32896 2141 -20067 -20098 -20210 -37926 -40305
22688 -40305 -34840 -12357 7756 21605 5328 15154 2911 -8834 -18099 -46363 -24515 -14068
22676 -14068 -20175 -36775 -18881 5562 17421 -6714 -16258 -11251 -18275 10806 41416 47442 17229
22663 17229 -11614 -12289 -8083 3685 14968 40929 39111 28547 19525 -2218 -25189 -18745 -14641
22650 -14641 -21579 -30513 -31206 -33205 -23802 -2539 -10703 -23321 -57192 -51915 -19577 -23709 -44793
22637 -44793 -35259 -10157 -37625 -48861 -24730 4815 32083 36716 28038 13287 -8131 8847
22625 8847 22385 19948 34306 12873 -764 -23894 -22747 -12295 -600 -16749 -20240 -27780 -37423
22612 -37423 -47010 -16166 -14918 -41263 -38717 -4366 -838 -23961 -50432 -62727 -46747 -49590 -20818
22599 -20818 -5268 37718 31793 17913 -1706 -10268 15585 37140 27581 38155 8398 13161
22587 13161 20900 14297 18084 32305 24250 26192 26748 30582 31762 1691 -16567 -21403 -16141 -10927
22573 -10927 -18403 -10021 -10815 -26789 -32667 -12293 11953 22373 9342 4760 3602 -460 -7947
22560 -7947 -14930 1021 12812 25194 18963 17232 -13380 -43964 -32572 -1095 8252 27384 26889
22547 26889 23085 29805 12103 29945 35400 50542 45419 27449 5664 1178 17881 38938 27032
22534 27032 14856 17831 11952 -6584 -1296 13634 34104 11726 -6992 1924 8107 -1840 8874
22521 8874 1501 -26326 -38304 -28209 -24642 -43316 -68072 -47113 -24475 -52116 -62619 -11697
22509 -11697 17152 41690 18650 -6357 -1817 -6554 -30397 -34866 -14545 -1646 -11852 -25893
22497 -25893 -14667 215 5704 -10215 -8294 7675 -14721 -39278 -20835 -27212 5481 46681
22485 46681 59015 39054 -725 -4450 9265 13712 3279 -10013 -7033 -13859 -18622 1799 -8230
22472 -8230 11314 8599 -9711 19496 39245 30672 7486 -15167 -12087 -2902 -5593 -17027 -23664
22459 -23664 -21754 -35557 -3545 13532 2627 13951 27863 25939 -3710 -2172 25029 17076
22447 17076 12149 943 -12774 -8763 18043 10763 -6635 -14775 -4122 -7076 -24833 -46123 -24807
22434 -24807 -34769 -19893 -33514 -47771 -26204 -17269 1834 29455 14465 12550 -8490 1135
22422 1135 13414 3460 -11141 594 -11177 -16808 -25829 32681 65313 65551 23885 -10733 -21452
22409 -21452 -38216 -27506 7508 37418 43795 54790 27958 -12628 -17355 -19419 -24738 -19814 -26248
22396 -26248 -14225 -13345 -12773 -8861 -27980 -35885 -30049 -3533 -7552 -44183 -46716 -45134 -33808 -23317
22382 -23317 9673 33269 30580 11081 16202 8793 -29580 -32917 -11520 -25207 -39916 -11341
22370 -11341 -4468 -1979 -701 -8089 3049 105 7388 16306 -1359 -3950 9702 26075 24013
22357 24013 31224 48504 44757 9895 -12672 -23963 -8030 3364 31668 17074 45 12385
22345 12385 48129 15902 -343 -2858 -6722 -12489 -14919 -24015 -35601 -26137 -46449 -43779 -48834
22332 -48834 -13976 8788 -7362 -33286 -40669 -30304 -50915 -48731 -26601 -25555 -30932 -11591
22320 -11591 848 -17148 -20897 -20281 4626 32166 49965 49787 36095 14406 20369 31059 23533
22307 23533 6156 40625 68652 31752 2023 -11665 -33074 -38776 -38547 -44809 -70357 -55196
22295 -55196 -31380 -32493 -41986 -34831 -37806 -46602 -30942 -14949 -17486 -34481 -47817 -36381 -1526
22282 -1526 34563 24669 2342 12886 -10957 -47998 -44791 -37391 -11057 -11121 -21726 -29610 -15671
22269 -15671 -33086 -28359 2097 14320 19935 21595 79200 95982 97942 127179 107640 98814 73155
22256 73155 40852 -6506 6026 39796 24035 5796 -6287 -12219 -12588 1358 8396 188 -8145
22243 -8145 -5446 -2930 -8665 11780 -13270 -30005 -47041 -58091 -51398 -20146 11439 43830 40819
22230 40819 31440 48169 32279 501 -9706 -3247 10838 -5904 -32975 -17118 4411 21558
22218 21558 33123 22492 10546 9500 -6195 -8335 -24226 -15589 -10826 11244 24644 24863 4931
22205 4931 -377 -9445 -26033 -40657 -19095 5911 -12613 -34755 -22478 -9051 -16025 6032
22193 6032 28238 20555 -16475 -34061 -40588 -46520 -32475 -25855 -39907 -33849 -15603 14465 31161
22180 31161 32918 21036 6976 12523 21709 19252 -6634 -6000 1123 -33447 -36619 -23332 -32852
22167 -32852 -43526 -28295 -33580 -50157 -33279 -2754 32803 25757 4420 -1927 -3377 -4220 -32417
22154 -32417 -39108 -14983 11857 40061 52122 24964 -10802 -25772 -3316 6361 15174 17234
22142 17234 13719 4057 -1517 -17599 -34053 -18818 -8262 3760 5852 21904 23005 27348 15914
22129 15914 9194 28740 21712 4693 -16646 -47478 -45816 -43096 -38241 -2980 21185 25737 14290
22116 14290 -17439 -41561 -52100 -44709 -19224 23436 21283 -4278 -18071 -31270 -41562 -33655
22104 -33655 -19642 -28523 284 49368 25635 11679 2479 -19829 -5459 214 18941 19344 14335
22091 14335 7187 -11502 -24140 -16939 -46197 -37289 -28940 -52074 -26633 -1605 -22029 -2481
22079 -2481 21646 15836 -8184 -13109 -18973 -23860 -3586 -3602 5157 -18506 -24243 -419 23580 30542
22065 30542 16460 3884 8835 26532 721 -3158 26642 6547 -2945 -13062 -28542 -27686 -18180
22052 -18180 -3174 4956 -143 10859 23254 10767 -28622 -34739 -31656 -23724 -10427 -16863 -11202
22039 -11202 15353 24974 13059 -18403 -26015 -17079 -19040 -19592 -27912 -15634 -17522 -3400 26322
22026 26322 8398 5192 21849 18007 -10887 -27252 -14323 1025 -440 -16426 -44715 -11691
22014 -11691 3114 9239 9025 7724 13682 5049 18794 25263 51327 55823 28054 -6051 -27336
22001 -27336 -36581 -34260 -13414 -18913 -24814 -18151 -49777 -41278 -13634 32915 45718 13941 -12618
21988 -12618 -9625 -12500 -4763 -12237 -38442 -42306 -63820 -60924 -59992 -71392 -40111 -4626 31443
21975 31443 46877 22061 -11127 -35413 -46790 -7954 7009 16468 18245 14286 -767 -10099
21963 -10099 -24839 -50719 -57336 -25776 -7651 9170 17103 4419 30033 18921 8617 4892
21951 4892 1010 -1695 -21696 -47147 -27096 -5805 15191 20591 5429 -2915 -4587 -22450 -35136
21938 -35136 -31983 -52656 -47583 -1186 5557 -9454 -39746 -46458 -30889 -50544 -53483 -56944 -43211
21925 -43211 -10907 31954 19850 -1488 -14282 -33251 -33917 -38860 -29907 -17711 -1686 40566
21913 40566 30759 2366 12371 28476 27584 51130 40403 28574 4495 -14449 -15414 -10793 1930
21900 1930 4014 -202 14103 7293 22115 20604 -3954 -7076 -27467 -35775 -28284 -36031 -35625 -20725
21886 -20725 9819 18155 27868 4425 -26458 -37599 -7707 -7135 7243 -9152 -19179 13079
21874 13079 7434 -3377 22442 18049 11730 19618 34031 -10146 -18310 19679 22681 32421 14124
21861 14124 -3269 -30616 -83253 -102542 -66059 -18693 7330 39857 25827 11604 -31404 -33752
21849 -33752 -44111 -48631 -47292 -45478 -26154 2017 13952 19093 30359 49010 20600 -25356
21837 -25356 -27149 -11531 -1169 11065 15565 15382 16281 7857 115 -29269 -37449 -43993 -61634 -34048
21823 -34048 -4981 112 -8799 -1244 -22505 -22567 10734 17187 -10546 -27071 -55386 -45781 -25890
21810 -25890 -16400 -6751 -25823 -21660 -42302 -3769 22538 8064 -16217 -17101 -2956 3262 -2175
21797 -2175 -10665 4174 28415 44576 31163 22061 -1980 -39502 -54150 -22821 -2283 16148
21785 16148 24659 40201 37574 48937 23312 16341 30972 43669 48221 68404 87794 105964
21773 105964 106465 106320 65665 30823 24561 -12207 -42959 -28597 -7320 20737 36030 4927
21761 4927 -24061 -17877 11719 64767 85683 63901 51044 43457 10149 -2508 -5564 9435
21749 9435 6824 -5998 -18854 -22716 -11866 14237 12413 3251 13567 65367 75920 37188 18354
21736 18354 2076 -27706 -25313 -10479 1463 750 -7997 -1937 7692 18349 24002 3629 -14855
21723 -14855 4298 18918 32546 28720 29130 18088 25438 14138 -16769 -48736 -49718 -21218 9948
21710 9948 7539 3972 1593 -21899 -4340 11892 6176 1188 -16449 1598 39669 68565 42324
21697 42324 16987 8034 -1317 9617 -20806 -23292 -22318 -15945 -13143 -5163 4549 155 54 -4324
21683 -4324 13107 33488 56468 50816 15035 1738 29389 30202 36378 40159 28404 51135 68938
21670 68938 77480 51835 42565 47753 37574 47315 55625 48275 40973 45388 28358 31540 37476 53157
21656 53157 48149 29864 39596 89143 103845 102319 107915 98223 73778 69801 56884 59273 69671
21643 69671 57817 44712 47769 68614 56057 33862 40129 67748 58645 36782 16639 30626
21631 30626 43152 32857 34168 35701 20086 23547 34786 14792 -7121 -13205 32876 32469 30607
21618 30607 66822 68841 65219 67598 72803 68554 58117 39242 52553 71951 67008 69359 66624
21605 66624 65206 68404 57969 36902 31999 9176 23558 24776 15288 -3845 8268 28589 39071
21592 39071 41751 36886 11124 -17890 -51582 -7418 39133 49698 46683 47842 20998 23665 9994
21579 9994 1370 26031 49140 62607 22966 -13351 -18008 18041 7270 -6218 -4762 4736 -1010
21566 -1010 -14183 -26531 -50742 -50204 -19823 -982 1720 741 -16489 -13875 -14591 -2981 19536
21553 19536 27917 43175 38543 26392 6124 34339 50549 30092 39180 55749 65205 32948
21541 32948 1202 21543 40675 32319 28473 2745 447 1219 20926 5549 -22790 568 3583
21528 3583 -3669 -2490 1657 18925 21060 13657 2159 -4267 -10342 4730 9879 -20406 -38405
21515 -38405 -34635 -19186 -14347 -38533 -30721 -13632 -32242 -21520 391 -30 11441 14357 2720
21502 2720 -24918 -22127 -10094 -1152 9737 17673 -69 -15160 -26173 -7655 -15295 -27386 -14331
21489 -14331 -4919 -21476 -3363 21231 37259 23985 11358 -5028 -2085 -9085 -31607 -46288
21477 -46288 -32408 -18866 -5795 -48316 -46473 11813 17107 16022 20048 7377 -10516 20128
21465 20128 -3542 -1739 -1539 -5529 30648 15483 9250 17711 12440 -464 -6910 -20841 14330
21452 14330 67110 88382 82517 29389 14174 13550 33421 21102 11623 31216 40984 9782 -5702
21439 -5702 3065 11269 35394 16546 -4806 4017 26788 34384 34478 29665 15146 4982 25002
21426 25002 6166 -17325 5324 26334 24478 -7154 -13354 3972 -22842 -38003 -9372 19290
21414 19290 -6858 -32675 -43790 -67043 -60573 -7446 -18376 -8342 30459 20139 6697 5487
21402 5487 -5069 4876 28469 6164 -32207 -17504 -1637 -5125 12440 20556 30994 15453
21390 15453 6327 -13271 -25595 5504 32652 27910 23467 -8766 -13061 -10289 12372 36028 -5296
21377 -5296 -22813 -10388 -13506 -13165 -37915 -43395 -5243 -28141 -37702 -40680 -39021 -33573 -48337
21364 -48337 -43696 -33521 -12426 7907 -2630 25678 51722 53732 35935 46302 64146 47427
21352 47427 22956 22769 2152 -21407 -28917 -55166 -61791 -31617 -27585 -36065 -5615 -7918 -14902
21339 -14902 -29136 -37474 -29229 -18477 -17000 -18850 -19966 -10796 17963 41288 10347 -19432 -21392
21326 -21392 -9599 -26259 -44047 -9533 11845 -7654 -26757 -24265 -17989 -41318 -57160 -44516
21314 -44516 -29980 -19696 -29566 -21483 3130 40473 21395 9496 11148 -22765 -29381 -48634
21302 -48634 -77594 -56617 -9170 8402 18201 20333 11207 -22056 -5917 3942 -16186 7128
21290 7128 9639 29905 41587 19911 16347 10145 7086 24914 34213 29564 -2402 -25968 2832
21277 2832 20924 -1596 993 2692 25659 13768 -16486 -15013 -8310 -24225 -40377 -35631 -30184
21264 -30184 -16190 -1622 31349 38418 -2075 -5381 9338 4889 -8818 12291 22242 31911 23200
21251 23200 32359 31397 14749 24666 21233 33011 14942 2578 10007 -1624 -14768 -13009 -928
21238 -928 -6305 -7691 6715 7967 20031 39764 46572 15250 -9930 2924 3382 13086 -20940
21225 -20940 -27569 5667 15784 18633 5234 -12667 -14627 -26105 -56990 -50333 -17972 3656
21213 3656 -9251 18546 19288 13118 -28124 -29836 -14798 9201 8031 -12897 -6332 6538 7809
21200 7809 -16006 -3280 40358 31507 5404 1383 -10527 -13033 14737 -3904 -9436 1460 3975
21187 3975 -16143 -9423 17331 28105 7408 -10312 -23265 -25515 -19749 -18289 -9266 6489 4964
21174 4964 13979 239 -19769 -10358 -11099 -35508 -35060 -22646 -13683 -17927 -29389 -37185 -17839 11009
21160 11009 1150 -8094 3226 -1496 20544 56520 56649 40400 30715 6541 38144 35007 15231
21147 15231 -14764 -8186 1167 -2037 -9704 13493 17075 2544 16835 10732 -13702 -19635 -16751
21134 -16751 -28060 -25773 -30046 -39961 -58311 -56454 -35122 -8002 5831 -8643 -44449 -24113
21122 -24113 -25776 -40540 -59483 -45517 -41146 -33553 -9078 6985 18398 281 -16596 -16076 -18809
21109 -18809 -787 708 -10896 -3075 -8369 -11557 -4632 -2435 17794 27986 13571 22938 -19729
21096 -19729 -47820 -46084 -55402 -35487 -47335 -50984 -17912 -21387 -18377 3826 -11022 -28635 -17787
21083 -17787 -7077 9149 6502 789 -6204 15658 15876 4716 -13734 -36618 -40700 -50666 -51976
21070 -51976 -59137 -39526 -20739 -17873 -21240 -17312 -2680 -478 -5087 2719 -12759 -24013 -42040
21057 -42040 -64254 -56183 -20374 -12015 -17100 -24139 -20565 -36823 -53768 -37429 -30000 -23922 -16865
21044 -16865 8202 47128 48692 -279 -23777 -4483 8004 19626 28712 24598 18946 7145
21032 7145 -36494 -6301 15048 3259 -4320 -22375 -14357 4364 9668 16692 21391 13296 34800
21019 34800 56829 33163 25704 42511 60967 49497 45806 23901 2775 -11156 -24783 -43698
21007 -43698 -28412 -797 -3123 -16942 -19197 1497 12594 9860 -8771 -36454 -27867 -20942 -27794
20994 -27794 -25292 -28711 -26237 -8307 -29394 -48281 -33449 -55802 -70719 -41061 -15258 -11058
20982 -11058 -24117 -34675 5369 4372 4703 -18794 -13303 -6035 -2836 -14115 -31768 -14435 17090
20969 17090 30830 -4067 4901 -5920 -16536 -18207 -12017 4647 12293 -17241 -37813 -38554 -19629
20956 -19629 10313 7507 -2248 9977 -8316 -6489 -8626 -21361 -37163 -36547 -27259 -23960 -25846
20943 -25846 -47443 -51082 -42799 2097 29616 25364 17850 16423 10166 10740 27980 39642 29385
20930 29385 27 -3921 -339 -37412 -47962 -60926 -16268 2106 -10255 -8530 -7293 -25987
20918 -25987 -39761 -40253 -56001 -44449 -15094 -15187 -4005 6501 10343 16769 -10594 -9130 -2250
20905 -2250 -267 7402 19204 11118 -13368 -39650 -37727 -45468 -35315 -24085 -24136 -265 5368 24046
20891 24046 13677 2922 23234 8788 2717 404 -7289 -20547 -3560 3261 20258 11615 -32653
20878 -32653 -39635 -35995 -23530 -5309 -6796 13912 21820 44882 10242 -16560 -20854 -85 19393
20865 19393 27566 30608 38782 -2542 -25801 -3504 16550 -4916 -34216 -21173 14497 21350
20853 21350 21 9631 9429 -10814 -7752 1839 -25324 -41268 -41271 -13015 7988 13962 18314 -23094
20839 -23094 -44903 -34187 -2419 6098 -14178 -9469 -609 -2206 -37346 -54464 -55077 -35314 -28107
20826 -28107 -12859 16348 37932 24625 -19946 -20103 -214 -3266 -27239 -36812 -20471 -1399
20814 -1399 4847 3484 -12696 -4267 36199 38602 25330 9823 12230 9153 20956 22477 2845
20801 2845 -26451 -11593 2273 -2509 22209 33093 27085 2472 5634 -22896 -32444 -19511 -1914
20788 -1914 -4423 9032 18354 12100 -9423 -11711 -1314 8000 -4447 -20256 -34229 -22532 23510
20775 23510 33671 -13147 -28718 -27671 -29589 -27419 -2435 -175 -10071 -10968 -11636 -27698 -43929
20762 -43929 -24698 -36524 -40799 -23122 -11971 3888 27814 35260 8471 -39252 -26475 -10427
20750 -10427 -36685 -41397 -31749 -18079 -25753 -24191 -24981 -22832 -19280 -7614 -246 -6602 14339 -23151
20736 -23151 -45841 -29366 -8936 -15706 -42323 -29958 -27032 8248 35428 18810 902 -23496
20724 -23496 -14514 -6539 -7789 -20594 -8345 -2543 -10892 -49290 -68188 -16434 6766 11979 -1989
20711 -1989 -30603 -57195 -49697 -47759 -22883 -9288 -37760 -52974 -34962 -7449 1234 11564
20699 11564 32219 40506 21902 15841 10819 16181 14188 14480 15440 3448 6387 7493 36865 27312
20685 27312 26373 -6323 -39829 -50269 -25751 21458 41014 17958 350 -17540 -18933 -12325
20673 -12325 -14772 -23646 -33385 -41367 -21842 -45840 -38395 -34766 -23857 -10464 11154 7212 -4120
20660 -4120 -1798 5339 5175 24121 19960 -4092 -30638 -16954 -4409 -6553 1389 16554 6570
20647 6570 -25501 -47628 -31032 5982 18411 24292 -10511 -12570 -35341 -46906 -56420 -9503
20635 -9503 18490 -594 -44266 -37238 -15258 -9499 -749 -11684 3956 890 -957 554 -26391
20622 -26391 -32733 -57527 -68792 -41410 -31110 -57751 -61895 -38747 -48298 -41462 -4832 28151
20610 28151 13767 3490 -5551 -7841 17558 18503 -5829 -20865 -10931 -7192 -17362 -30636 -33691
20597 -33691 -25402 -11562 4110 1831 -19160 -6483 3291 -10315 -28787 -42391 -57141 -62408
20585 -62408 -56747 -22054 13793 4509 -12033 -32891 -36238 -27454 -38501 -39894 -35273 -13274 2045
20572 2045 -29608 -31895 -29171 -46349 -51807 -47377 -13442 -30927 -50171 -31141 -31345 -32481 -54866
20559 -54866 -61054 -52086 -33194 -19539 -5543 1918 -5701 -4579 -1653 2616 -4810 -10308 -9874 -9289
20545 -9289 -5454 -517 6759 28164 31278 27551 4399 3559 10279 25774 32187 5779 -4374 7430
20531 7430 530 -10564 -3347 14773 2724 -14582 -41752 -61467 -70774 -29981 8590 7399 17953
20518 17953 -15790 -18866 -21469 -18130 -11379 4867 7925 -9650 -59479 -79484 -57898 -1248 12818
20505 12818 -4999 -7929 -1194 -10979 -14680 -17226 3841 1057 -8971 9126 4377 -8947 -4102
20492 -4102 19624 44162 21883 20527 7351 15223 47885 43545 28991 24785 27555 23642 10856
20479 10856 -8029 12381 11036 -16363 -32195 -18954 -578 22264 256 -47697 -42403 -31384
20467 -31384 -35965 -19784 7759 3346 2290 18986 7281 21769 13493 1403 25805 32075 -10986
20454 -10986 -43743 -42833 -20986 -18387 -26003 -28139 -34719 -23486 -29534 -35779 -18981 -18017 -20939 -27847
20440 -27847 -31521 -55372 -41346 -22348 -11462 -19348 -18359 -42502 -59271 -40383 -31036 -28330 -43036
20427 -43036 -23078 -9042 -7861 4693 5060 9912 -8733 -42288 -56806 -24939 7857 18834
20415 18834 23387 23629 18046 33082 54143 35945 -4209 -19478 -28229 -5 20099 1410 3883
20402 3883 -302 -24737 -44801 -51930 -49961 -19897 -13084 -32059 -3245 -6445 -23568 -22738 4879
20389 4879 845 -12598 -27305 -21222 4048 -28405 -44260 -30534 -47535 -56310 -37375 -18879
20377 -18879 -26168 -23275 -23096 -35280 -30867 -38722 -42614 -30710 -41934 -49633 -52517 -44524 -33526 -8744
20363 -8744 4460 3980 2087 -622 -18288 -19968 11909 11998 -10607 -28287 -41748 -57449 -54817 -38518
20349 -38518 -30586 -53833 -38133 4709 31328 23535 18481 16416 12613 2196 4606 8286 -8635
20336 -8635 -21170 -27558 -19939 -18323 -31508 -36041 -40619 -33775 -23978 -10847 -9796 -4188 -14433 -42949
20322 -42949 -44210 -34950 -33392 -13241 -16736 -27722 -36479 15 16454 1629 -18376 -21473 -25940
20309 -25940 -14616 -20895 -17551 -7710 134 20863 26438 -5771 -11672 -26079 -46565 -33866 -23381
20296 -23381 -15531 -15450 -2446 -9166 -5150 587 9755 5711 -10546 -26957 -16507 -33924 -43805 -28437
20282 -28437 -32715 -30772 -45338 -31792 -41157 -61144 -54149 -29014 -47694 -63998 -50836 -30518
20270 -30518 -26001 -30693 -25459 -25648 -44253 -31159 -25845 -45216 -56988 -56486 -12461 -1658 -10561
20257 -10561 -13010 -24220 -27539 -12907 -17651 -10452 -469 441 -3215 -6107 -10810 -34690 -30523 -23309
20243 -23309 -15986 -2024 20674 24950 29612 37188 9677 28609 6191 -32372 -21570 -11583 -18176
20230 -18176 -8768 2986 5897 19400 22416 -24934 -20297 -21754 1478 13951 -1954 2309 7832
20217 7832 -16377 -44048 -36089 -17391 -18700 -38433 -63460 -57060 -40941 -26521 -24553 -25038 -20409
20204 -20409 -13409 16005 16521 -8055 -32016 -21990 -14647 -35997 -41680 -49386 -17739 -2127 9381
20191 9381 3331 -5563 -18259 -29690 -26340 -8508 -6846 -13779 -31473 -34796 -30143 -32951 -44445
20178 -44445 -39019 -22865 -11543 2569 -3832 7102 16211 3296 9587 -7289 -7378 -7545 -17511 -12254
20164 -12254 -11675 -16455 -18203 -31752 -39518 -48206 -46098 -41454 -15804 4377 17535 16866 -10077 -14482
20150 -14482 -16935 -24555 -22872 -1442 32626 11410 -5230 -20305 -19562 -15199 6661 -11127 -16550
20137 -16550 -23212 852 -12961 -22869 -16982 10427 12563 -4245 -25969 -36100 -18826 -7026
20125 -7026 -15483 -29025 -632 4347 1757 -10368 -16241 4387 -4607 15337 -20328 -49351 -57784
20112 -57784 -19495 10428 24602 1573 -12603 -29984 -14569 489 12588 14578 5574 28143
20100 28143 22002 3623 -2418 -9984 1419 -14915 -45964 -30831 7094 15221 24014 60009 46684
20087 46684 20646 38312 60480 35143 22630 22663 22300 -6726 -1388 26320 37497 27370 -872
20074 -872 -14 -4772 -621 -16534 -50245 -42827 -17174 -23182 -29786 -23406 -21063 -38189 -34205 -9802
20060 -9802 -20162 -51314 -42781 -34047 -39908 -21952 -33516 -15304 -9263 -8413 2961 -7472 -14679
20047 -14679 -17373 5535 25200 -9091 -38077 -16923 9736 23016 -5393 -23637 -39055 -26923
20035 -26923 -7720 5688 -3668 3164 -31075 -46638 -34083 -1792 -11080 -30394 -65373 -53417
20023 -53417 -27176 -16863 -27214 -37398 -30562 -18181 -27382 -6249 17758 5265 2700 13291
20011 13291 -2892 -9063 -3100 -2312 3328 -8621 -48710 -54426 -43089 -35113 -36425 -12555 -18263
19998 -18263 -34280 1731 35614 19321 9388 -1368 -13720 -48793 -25756 -14353 -22367 -14797
19986 -14797 -27071 -27311 -36867 -39212 -23485 -15196 -19161 -29726 -35138 -21737 -14705 -27931 -56589
19973 -56589 -72966 -66347 -62283 -63519 -8895 29667 16071 23308 -13809 -13309 13919 19736 37022
19960 37022 45883 19992 754 16644 38906 21030 -6192 -20802 -35035 -59244 -60486 -49327
19948 -49327 -25597 -5305 10783 -22655 -36677 -11041 6209 18806 30142 39448 22651 20323
19936 20323 8604 -23037 -34692 -39603 -54599 -66317 -24632 -7627 21836 41034 37511 8195
19924 8195 -35769 -41268 -33886 -13317 -18948 -5794 -2041 3806 27356 16292 16431 15343 3921
19911 3921 9332 26685 34880 35435 8880 -3436 2746 14156 4683 -4271 -152 21811 48226
19898 48226 71523 64192 29195 -1770 -3172 5971 3392 -23970 -5814 3002 -16320 -20313 -1571
19885 -1571 4080 17549 45283 36628 23183 43802 25729 11516 9785 -15 -14384 -20141 -12726
19872 -12726 -8014 28630 42424 41171 11165 327 -19673 -14271 -4092 -2564 1264 151 12337
19859 12337 17733 19553 20282 25526 -9995 -18201 -18562 -2226 14505 13118 528 32816 26870 -6381
19845 -6381 -18946 -37372 -20678 696 13790 23628 31319 61778 51153 43453 56202 44621
19833 44621 28858 31344 27130 -1568 -18671 -8026 2125 28280 22776 -1608 4113 -14903
19821 -14903 -45952 -44733 -38883 -46748 -29480 2063 -1259 -322 -17588 -4353 29947 34031 19809
19808 19809 10068 -10696 -16823 -23582 -28133 -29347 -37977 -25453 1607 6219 -4560 -2714 1683
19795 1683 1458 31847 19679 10845 23322 32644 -8582 -32884 -40357 -34928 -36029 -23323 16240
19782 16240 33972 38644 -10431 -17732 -9480 -32134 -23026 -24855 -19666 -26718 -52058 -75183 -34223
19769 -34223 -33893 -10211 557 8269 13321 -15981 -45314 -43810 -18756 4607 9651 2827 -20850
19756 -20850 -27429 -27961 -36714 -30134 -21945 -24715 5917 6692 -3190 26506 25665 9094 7384 -3297
19742 -3297 -23709 -7411 -8168 -19884 -20566 -3227 -7341 3036 26369 37100 13925 49359 52404
19729 52404 41225 43945 21955 28460 27385 -2612 -31291 -10255 2723 8480 15288 18893 -21360
19716 -21360 -61822 -95173 -51829 -26391 4451 11678 -8057 -2058 15289 32296 26120 38138
19704 38138 28716 16303 10931 -3463 -16273 -27784 -41890 -46742 -57885 -36746 -29399 -32474 -19899
19691 -19899 -10798 -20690 -19544 7818 13044 -4651 -1653 -12714 -25033 -14797 -6470 1253 1117
19678 1117 -7880 -16244 -17651 -17653 -25418 489 1549 -14155 -37690 -18554 -6507 -11913 -6269 5935
19664 5935 5368 -36749 -37476 -9148 1778 7040 13137 16199 27936 6931 30273 62702 53677
19651 53677 16859 -2564 25724 48288 41078 17520 3962 31924 13280 -7429 -859 9340
19639 9340 -4629 108 -24167 -49772 -30818 -33016 -19340 -13680 -19227 -22090 -34903 -39474 -32383
19626 -32383 -25090 -12581 -12277 -9703 -5022 -9218 -7812 -3308 2668 22460 30884 -186 -989 -14496
19612 -14496 -47049 -38063 -23817 -38318 -36293 -26252 -20909 -37941 -31347 4665 19921 -2233
19600 -2233 -6705 2422 17144 17077 8131 -15146 -9043 -35281 -24003 -14810 -14215 11522 19875 2086
19586 2086 -651 6739 -4488 -36479 -62997 -58893 -51221 -80394 -75328 -67245 -44287 -3179 5889
19573 5889 4654 -5392 -8409 -5806 -25412 -27395 -32446 -37354 -13229 19805 -3136 -17927 -26802
19560 -26802 -52082 -46879 -17902 1863 -23628 -47947 -39825 -11157 -16840 -14952 5705 51259
19548 51259 50064 -1945 -19975 4274 37175 44768 13324 -25512 1464 11655 -4044 6751
19536 6751 7527 25658 34836 18336 149 6461 4611 23559 67155 57663 43166 26094 14940
19523 14940 10210 397 15485 4644 2150 827 -8583 -33776 -19445 -938 21553 23037 38281
19510 38281 35473 36352 35158 36803 18453 -11026 -15028 -6672 3532 23231 50486 38738 13805
19497 13805 5216 -6485 -24905 -48444 -40259 -19506 -10043 9414 7184 -2128 9513 -12248 -17404
19484 -17404 -38436 -25206 -7811 4340 36482 28873 28216 15523 9048 6762 9095 -24260 -16972
19471 -16972 -9261 -14278 -13528 -10450 -2476 -8521 -13774 -36810 -56489 -70045 -73348 -48048 -16565
19458 -16565 2566 -5734 -4534 -10883 -17938 4014 23851 30659 35430 38866 48502 29902 32878
19445 32878 20627 8808 -15480 -9583 3720 2452 -4609 -9045 -12862 -344 26595 34396 21625
19432 21625 25404 26225 32002 -6071 -43046 -63809 -79390 -57459 -44036 -48942 -20305 32317 28829
19419 28829 23811 13365 -4191 -36306 -72612 -60652 -39157 -35764 -31962 -25327 -18818 -53513 -44912
19406 -44912 -24880 8048 36526 4919 -13859 56 14981 3914 4646 2153 10695 22360
19394 22360 43188 14964 6842 8980 -18986 -2459 8401 -9049 -6236 -15752 -979 -5044 14189
19381 14189 16411 3397 5543 25440 48094 39356 36733 36051 25416 2398 -22856 -16045 -11611
19368 -11611 -11386 -23473 -46553 -50446 -33235 -18834 -12109 -20946 -18153 -2623 8019 16069 779
19355 779 -787 -3615 -17420 -29856 -14545 -17806 6399 10667 26293 37655 18744 8721 1235
19342 1235 -27532 -61884 -68999 -61618 -39740 -21719 -27700 -37865 -27835 -12816 -16659 -21827 -22531
19329 -22531 -13079 -18023 -18093 -22632 -23032 -19345 -2760 -22838 -31972 -38721 -7812 -1740 -27034 -38801
19315 -38801 -20032 -13435 -4960 -2298 10377 -8383 -31984 -15580 -25203 -18316 -7256 5972 7728
19302 7728 9790 30062 25916 1402 -31133 -36368 -41768 -28107 -39377 -42735 -15282 -11931 -1381
19289 -1381 16947 22179 31154 11418 -49089 -43773 -9635 9610 20021 31597 35996 58810 60329
19276 60329 50382 51521 23258 32771 37081 -5651 -15306 -11446 -12663 -10514 -16901 -12068 -13982 -13827
19262 -13827 -8652 22482 17786 24688 9315 -26851 -11064 15910 38469 33266 13884 27352
19250 27352 37483 47322 40786 38562 24840 -27068 -41579 -35664 -31278 -52964 -59782 -28529 -26028
19237 -26028 -27718 -6532 9831 10826 9557 26358 49637 50712 7084 10198 13971 41401 34922
19224 34922 48121 88006 104900 71652 68510 40255 47756 45911 54717 68544 64791 43993 22631
19211 22631 5359 -4006 -23440 -31131 -38871 -54938 -53402 -54879 -27203 12480 -10450 -15440 -1587
19198 -1587 20523 48140 54473 45409 19175 -12322 -26082 -810 92 23842 39285 19167 7778
19185 7778 34884 45782 27513 20150 20191 22733 -2687 -1952 3625 -12898 -38650 -38941 -29378 -17338
19171 -17338 1215 3151 -24075 -16347 2936 1704 -10881 -41566 -49778 -22947 5641 22843
19159 22843 10797 -3937 449 37104 51311 22100 -58 -3746 10543 1877 -28344 -20015
19147 -20015 -17666 -17522 -28962 -33278 -4922 -2331 -7772 15278 34254 28533 5218 -13773 3889
19134 3889 4123 14064 -260 -11007 -15479 -14790 -1223 32891 20941 13938 -10238 -31905 -22622
19121 -22622 10471 24670 20354 11335 13810 26209 43708 74013 73556 64931 55146 54254 55889 36896
19107 36896 7544 -8996 -22909 -37231 -13274 14004 20524 35453 22904 29135 15807 18329
19095 18329 9081 -4363 -3652 -15775 -30250 -62064 -39182 -18097 -8450 -10247 -37075 -20838 -3037
19082 -3037 -12258 -2473 -27589 -41959 -16761 -19861 -21720 -7716 16558 3206 -23069 -26464 -7872
19069 -7872 -8519 -20715 -27108 -48571 -36822 -12367 -5669 6563 -6793 -19506 1450 41 -22648
19056 -22648 -15407 -18093 -5030 -15633 -9128 -7600 20071 70511 99293 118432 126578 128831 108095
19043 108095 120191 95471 97744 68465 44743 20461 4884 7752 5805 14224 31256 42132
19031 42132 11064 -46955 -41332 -30395 -33429 -31435 -18718 -23497 -19894 27266 62894 55598 8292
19018 8292 -3259 -5048 -11083 -1259 1849 -17100 -15137 -17505 -1456 28522 44671 36473 10666
19005 10666 2130 8822 31215 29270 34311 56040 75530 53397 29029 27583 95087 96170 68304
18992 68304 69264 81766 59787 50618 41911 24891 1114 -11531 -255 -5685 -19644 2091 20605
18979 20605 24836 2975 7541 6618 25653 40286 44625 21801 4181 21249 20225 -14592 -20417
18966 -20417 -12461 3599 13153 -4166 4410 8751 13120 5272 23581 19059 22959 40710 42194
18953 42194 64254 56589 59428 31160 -4484 5426 17991 3705 7227 -5782 5868 14426 27136
18940 27136 41619 11097 -3349 -7347 -12011 -56199 -72147 -55684 -54892 -34838 -20712 -1997
18928 -1997 4757 -10532 -44470 -58531 -56227 -61999 -31226 -9250 22480 67318 75936 57105 36279
18915 36279 -9057 9023 31381 49884 48322 62433 72251 50880 49806 29428 18478 -4693
18903 -4693 -12645 -15702 2909 -9113 -15959 -268 30682 48856 49173 25966 21800 44748 65701
18890 65701 69763 35712 17523 16600 -1838 -7150 -908 -8164 10323 57235 58879 61326 52649
18877 52649 48899 18333 -8421 -27088 -17514 -7071 31883 66741 106776 135068 130159 82955
18865 82955 69917 71799 50444 34892 25854 25768 55240 37431 55044 85683 98041 85247 54952
18852 54952 39452 27180 2477 8113 30458 37658 46964 41856 34362 21724 53453 66192 64723
18839 64723 69681 82995 105511 131380 140146 141944 126226 71887 41396 22853 42768 66301
18827 66301 45746 21391 38457 46787 30854 37017 61043 81995 73343 21504 -4712 5657
18815 5657 23058 47636 68094 79872 77723 56312 57130 71426 56001 56060 26578 24025 33541
18802 33541 60814 95492 76098 67488 44770 55371 72377 69372 59738 31089 40805 12821
18790 12821 8843 7330 -1404 -754 33812 43184 33727 31634 33613 42138 41464 59170 65283 67616
18776 67616 65262 76750 71674 53846 55574 66627 93119 141061 226923 340171 456063 416807
18764 416807 284008 174281 128618 119970 96710 63365 44916 44148 21508 35117 41814 48231
18752 48231 37488 2186 -7904 -745 13465 41648 75926 53840 -1407 945 16608 9474
18740 9474 27906 60314 101090 117797 131909 142328 150835 190263 195358 200114 204842 234324 268174
18727 268174 312652 304529 288209 285904 270196 220872 219323 236743 252085 276697 287761 327519
18715 327519 332988 340399 359163 386407 369952 346573 319623 282599 262022 218496 193793 215796
18703 215796 241915 259544 237548 198731 186531 141681 123337 107228 63234 60877 71853 75794
18691 75794 51470 60036 68514 83787 75232 63078 50324 85325 80790 90384 156836 216909 222927
18678 222927 191737 177855 206897 229795 255044 287540 310246 352611 363226 374319 381833 374019
18666 374019 371608 380205 428901 450209 437885 433733 409566 349554 329784 348846 373434 441452
18654 441452 467914 459583 432666 365985 315388 293503 278370 260518 257803 271308 287805 286355
18642 286355 294988 296733 320187 347502 388382 437716 521134 584126 653979 660058 620906 547712
18630 547712 468120 404654 364450 336736 322731 317948 300751 285756 284492 261790 224832 215312
18618 215312 209437 209119 198563 167062 143052 148422 137112 148563 170980 152577 129996 102888
18606 102888 67448 82032 78922 72255 94678 78540 94379 118904 117767 125123 169863 203967
18594 203967 219488 238930 290154 305951 297481 296376 334532 366882 386401 406685 436800 515188
18582 515188 602831 691405 758157 774318 743897 688674 613234 513274 415166 343694 302670
18571 302670 268395 224039 208673 195906 179096 165519 186591 209700 203019 172500 124281 95577
18559 95577 109499 116154 108160 104995 86625 67012 66914 100825 116179 121567 116938 122342 121543 105805
18545 105805 87768 92845 127312 137140 87740 115995 146939 112151 76061 106915 130540 118965
18533 118965 105655 41994 11718 8789 16479 15494 40531 45744 31744 22504 2486 27499 71114
18520 71114 93635 77471 56398 29124 38285 58103 71076 85834 81121 61396 72940 101381
18508 101381 77364 55919 71532 75221 45936 56564 80592 110744 109076 90353 76893 86999
18496 86999 122712 168872 196423 229018 201304 165601 175040 176924 167653 175967 194335 192204 180766
18483 180766 180643 183589 178083 168640 163770 168247 197399 226413 265574 253886 224145 229473 223584
18470 223584 203838 176375 182146 213228 222971 207167 210564 246725 265539 298118 324299 386985
18458 386985 455368 504618 570177 606616 608789 597639 542388 508624 476076 425808 391194 361611
18446 361611 336766 328541 305080 290234 296841 299251 316824 316343 314291 313444 311717 289820 276773
18433 276773 270551 252528 241698 234887 211941 195615 206613 234569 231295 201973 213203 231201
18421 231201 238282 237785 272184 275683 252034 254091 287604 329865 347448 351302 342898 346886 349081
18408 349081 316165 326160 338788 392115 437658 523288 617441 666182 685953 689735 652924 591692
18396 591692 530190 453361 385529 323471 271462 254079 231807 205515 213821 179839 177463 189902
18384 189902 181941 180603 178823 181484 177969 170341 173115 160092 128284 112846 141951 178274 155092
18371 155092 134549 144647 170447 204031 212126 167656 144042 142239 129011 149502 163989 179340
18359 179340 193524 188954 169941 143480 134569 156192 161885 203707 239258 256959 274762 291874
18347 291874 276959 261550 267710 243861 236668 200426 187180 185459 200129 207864 178513 189728
18335 189728 223903 234401 235027 239569 258729 272455 280126 252728 220995 191796 190656 168725
18323 168725 168447 191918 209730 210450 195411 197173 206031 223277 232440 238984 236577 237110 249277 272074
18309 272074 279665 265898 267683 280163 293799 328791 364844 378145 371884 333513 337692 332050
18297 332050 348315 380656 405428 436082 479136 500639 525417 516460 514470 496736 469959 437525
18285 437525 443571 464794 474934 457247 451837 479758 517171 535611 522974 509815 467815 490849
18273 490849 528323 529353 556627 587520 595224 625731 658365 665397 675271 714462 757730 798309
18261 798309 836675 899193 946980 998541 1099222 1232931 1374302 1569321 1818094 2059851
18251 2059851 2319228 2557512 2711227 2856913 3059646 3380679 3865435 4721480 6098987
18242 6098987 7958892 9990385 11869041 13267262 13485028 12705709 11564158 10333649
18234 10333649 9314287 8759736 8658753 9041163 9937043 11511066 14133227 18398675 25391643
18225 25391643 36749218 53987347 76432540 99985855 121528777 133999644 131664034
18218 131664034 120093171 102834236 82681965 64021188 49672111 39656327 33793271
18211 33793271 31889219 33260785 36732285 40651394 43570878 43602016 39682563 33595636
18203 33595636 26936592 20766000 15996904 12747500 10669082 9381106 8642196 8269786
18195 8269786 8105755 8030379 7998267 7963395 7959080 7966077 8033002 8323381 8950462 10023316 11753461
18184 11753461 14456825 18503708 24248555 31286065 38352683 44107282 46670475 44935625
18176 44935625 40934751 36525084 33242566 32714067 36048766 43981751 56997043 75224895
18168 75224895 98609873 123629424 144226007 157104832 157760520 140711212 114501833
18161 114501833 87097791 62031948 43313241 31220419 23705209 18956255 15863638
18154 15863638 13822109 12572557 11960577 12023234 12800297 14244990 15935892 17356918 18058421
18145 18058421 17186875 15026567 12475196 9932808 7816428 6316987 5335346 4755018
18137 4755018 4417996 4170154 3988696 3804949 3529291 3263691 3015490 2813800 2651353
18128 2651353 2496465 2363649 2249642 2178356 2133616 2150885 2208790 2294031 2365955 2455304 2634432
18117 2634432 2968659 3502911 4303243 5483438 7374246 10725104 17109833 29028468
18109 29028468 47947983 67760720 64694215 42770632 25245368 15694979 10622416
18102 10622416 7698158 5920626 4798854 3967377 3326386 2872471 2468185 2111858 1836287
18093 1836287 1636605 1491051 1365070 1214065 1097765 986539 889999 834933 825660 810292
18083 810292 785117 742622 691006 675065 654849 617137 558314 535904 495272 479334 483327 485390
18071 485390 487691 491857 486269 482289 491902 531151 606548 691154 760328 786294 748635 698482
18059 698482 675669 674625 656155 624692 590362 542759 513015 490839 476557 485767 518969 519372
18047 519372 483798 459900 458429 451112 430768 398341 371692 349214 328157 329840 325921 356669
18035 356669 424189 505859 571651 672109 771851 823283 867996 858608 833275 770989 662140
18024 662140 571074 509332 454645 411131 365856 344052 354183 380994 430342 476224 532664
18013 532664 596849 670507 724077 759439 775855 750837 729467 736828 739857 738453 734696 731371
18001 731371 746224 763911 770681 783712 811354 869988 874665 873534 884502 906016 903614 851074
17989 851074 800146 765368 722281 696079 647777 597663 581277 550748 539100 561653 585520
17978 585520 574759 565384 548167 563338 585020 581655 574259 572579 573362 593205 592114 551653 509299
17965 509299 439578 456876 509573 536748 551281 561102 576890 608205 620403 652417 720255 768424
17953 768424 768366 753321 741495 758308 804546 851667 905400 918360 908421 887557 853219 820558
17941 820558 753267 685455 627388 580350 493654 442559 419386 425263 427482 417408 437303 437847
17929 437847 414588 400765 384541 352786 314085 275382 258906 259375 250588 231980 257406 288137
17917 288137 276238 249391 232500 234146 206817 193077 201159 222455 206868 224136 247604 258378
17905 258378 254690 242545 283618 299189 313497 317227 297185 297566 308817 332084 355338 326172
17893 326172 310605 315494 319928 367078 462060 547817 591917 639817 716209 722389 715557 686828
17881 686828 644884 560166 503892 456603 405685 359527 339114 375103 420458 435771 423857
17870 423857 407834 408808 387335 376187 353500 331025 323996 321970 325955 355648 346405 356742 384903
17857 384903 392306 409533 463454 520811 615976 722443 811841 912471 1061726 1169638 1176494
17846 1176494 1140876 1068659 1020793 928719 830867 739101 674371 654084 668777 686041 723476
17835 723476 740640 793054 834980 876095 886200 903492 892575 858401 786572 674483 597180
17824 597180 540051 513106 480079 413372 362856 351416 360893 382773 396593 411190 424299 454152
17812 454152 496734 536450 556660 581529 605566 638450 644153 588491 576570 593921 620953 654195
17800 654195 700523 774123 890904 985021 1087977 1192487 1274516 1316392 1282444 1184318 1042574
17789 1042574 896462 756871 644476 547579 439482 379313 339523 300016 322381 331340 340095
17778 340095 353392 349088 356448 394540 437989 409136 392605 383706 398495 394744 345079 318531
17766 318531 297529 260043 273463 277306 257092 265834 273125 239383 223201 215864 184143 173539
17754 173539 168123 148064 156995 161806 158234 146070 131360 143472 152574 152744 147897 146129 143418
17741 143418 192018 239933 264290 293408 312467 278388 222906 210405 215463 245057 283726 321703
17729 321703 364264 384610 401097 377241 378042 391777 420064 435151 449657 492368 507613 544468
17717 544468 545749 513427 482456 466038 468084 489953 489535 460343 401822 362541 322099 286813
17705 286813 279398 271666 257092 305946 324709 342722 361415 348721 342881 337418 332849 315076
17693 315076 281494 269108 258073 230062 233406 275503 309773 325213 360672 401048 449348 485268
17681 485268 539306 581606 618494 656256 674459 704110 752737 818449 896648 998026 1098157
17670 1098157 1165869 1172200 1173886 1150278 1104352 1078794 1101508 1136959 1209845 1302397 1407104
17659 1407104 1473415 1524766 1538779 1499611 1396347 1317518 1224257 1129025 1068073 1020847 991235
17648 991235 937851 886200 849600 821731 779316 704523 645456 628554 571827 515361 466003
17637 466003 443204 460219 459501 483283 475548 482743 488486 476025 486371 474151 472016 454875 437487
17624 437487 453686 456603 478690 538338 584300 638880 671575 684989 685800 662496 659992 696719
17612 696719 696403 731079 779239 847651 959601 1036620 1124988 1248907 1321391 1333813 1279000
17601 1279000 1184881 1104391 1001461 902395 822370 780422 791556 775532 796716 797906 820400
17590 820400 842213 833303 864818 917414 953019 1039604 1110344 1147767 1155544 1106056 1043936 991953
17578 991953 965458 905656 882539 852493 850796 848716 868098 931309 975450 983354 1014863 1036094
17566 1036094 1081086 1110904 1129910 1207028 1299709 1434649 1588654 1728719 1871002 1963905
17556 1963905 2052093 2105160 2116458 2139146 2210381 2323274 2463199 2637395 2898189 3193053
17546 3193053 3631427 4222752 4935010 5782251 6916002 8513652 10779893 13565194 16231722
17537 16231722 17727663 17553254 15927584 13710237 11849861 10799750 10536121 10908070
17529 10908070 11879321 13482344 15809439 19209843 24423199 32839864 46530066 67738697
17521 67738697 96617332 128816032 154934916 165963187 158984506 138474905 112374189
17514 112374189 87298435 66565498 51321951 41445173 36221382 34894147 36874354
17507 36874354 41246693 46313657 49583148 48878755 43871057 36121334 28101933 21460254
17499 21460254 16733396 13625374 11656571 10444555 9661293 9093601 8591473 8129291 7756558
17490 7756558 7554602 7495231 7572806 7803453 8103385 8582233 9368314 10696300 12867305
17481 12867305 16318682 21459423 28296685 35774691 41756694 44139125 42433400 38017225
17473 38017225 33391050 30605344 30786103 34381651 41876205 53810416 70394092 90734597
17465 90734597 112690503 131620052 141357539 136619867 118172104 91983241 66672189
17458 66672189 47103638 34003023 25705098 20433172 16973854 14578129 12784597 11458013
17450 11458013 10588288 10270815 10668344 11805697 13387155 14844193 15438433 14767854 13016116
17441 13016116 10741404 8545484 6841766 5647800 4775140 4084409 3544511 3114729 2797514
17432 2797514 2519892 2296765 2088640 1905302 1760257 1674919 1595963 1524840 1438916 1351640
17422 1351640 1278565 1277436 1245782 1229466 1267307 1310802 1297620 1276976 1239595 1182842 1147361
17411 1147361 1113155 1129163 1179733 1242985 1299295 1409552 1575088 1663458 1724026 1723728 1640028
17400 1640028 1462579 1280761 1153697 1095548 1060540 1043381 1054559 1107089 1162314 1165966 1108376
17389 1108376 999972 878792 822393 786780 799113 809834 819112 855162 899363 897033 850943
17378 850943 811502 774021 734767 716732 699953 672178 634269 586713 557353 535276 491702
17367 491702 443070 416737 393046 403795 391425 371236 353726 378800 435961 463492 457691 423465
17355 423465 425794 411009 381855 361434 349112 338614 319857 312987 318643 297569 283308 268198
17343 268198 267843 280564 287194 264894 244530 234036 229194 254606 269568 280672 333873 400225
17331 400225 457815 484466 500468 537314 550313 568299 564916 533063 488630 442495 378030 340415
17319 340415 319083 313032 282049 235993 227007 232443 236666 262449 289727 265953 259873 237159
17307 237159 228524 262458 256916 243203 261161 282031 271363 239532 191174 177428 204661 184959
17295 184959 143671 150714 159696 162590 212806 213271 167189 150724 168992 168024 151524 135559 138752
17282 138752 134677 136765 155788 147758 121007 110307 101786 88477 92039 60709 47831 72635
17270 72635 88165 103283 119344 154593 171488 186342 185058 171450 151690 154794 144545 142970
17258 142970 145218 167473 182196 154936 156706 137035 132161 109720 96905 82458 85523 105517
17246 105517 93986 106607 103026 130882 113026 122533 123427 122625 112020 103844 95469 93414 91987
17233 91987 85610 79808 95552 78230 49188 58021 80617 69212 55037 85421 96452 59512
17221 59512 44535 26988 20963 17421 28410 58364 68420 35260 21964 52087 78604 95772
17209 95772 105681 111068 90207 60884 45723 63483 65304 82628 97672 106517 108570 82319 60195
17196 60195 36306 53720 53561 69030 66100 74553 56490 41933 63593 71008 66407 72062 71954
17183 71954 53236 31708 29548 25512 31463 59256 74676 62490 20454 12007 63009 77058
17171 77058 63300 44682 47985 43940 36477 22021 26867 12913 -1570 -1292 16880 39256 41562
17158 41562 57980 91210 90568 71538 44866 39558 42075 34511 32269 31653 26398 30942 60751 56502
17144 56502 40125 29918 17775 16656 37849 41373 61485 52222 67770 61449 29511 30226 30916
17131 30916 3549 8229 25133 59268 85881 82884 60957 49803 30634 21682 17260 1132
17119 1132 -17500 -14225 5257 -6160 29474 21079 40377 44429 53268 61114 56586 38074 66191
17106 66191 76442 72526 70967 73321 74193 57932 17042 3129 -10294 -7909 6754 15548 13524
17093 13524 12783 18969 44576 44342 38603 64428 30064 7516 -6968 -14248 -29390 -36716 -31196
17080 -31196 -11081 30728 48561 58480 46716 44732 57853 41702 -4517 -40850 -789 31414
17068 31414 16043 -12728 -20221 -12076 -4775 8783 17331 11362 50911 74005 59868 13199 1149
17055 1149 17216 -3081 -16248 -27847 4684 32964 34431 57938 55983 57050 54289 53212 40369
17042 40369 1087 -7379 16212 18677 9215 13176 19467 52926 84918 123297 114642 75334 75377
17029 75377 93595 83858 69247 73025 105627 131031 166807 189584 268578 329020 380987 379466
17017 379466 375378 358789 347361 344162 341331 314839 257786 204470 203219 230167 283503 335229
17005 335229 395746 409034 411320 412870 389928 311328 239726 187605 134093 117356 93132 77200
16993 77200 59258 78951 77979 109542 127899 119707 117594 92435 73599 67834 63223 40324 40798
16980 40798 52138 38823 49237 59387 46667 57584 82211 114150 177076 243879 288035 302399
16968 302399 290908 327057 400062 437121 447718 462798 465359 423715 378760 313265 233191 177271
16956 177271 173422 191015 187193 180602 143801 131207 181104 247853 292552 319643 353795 375679
16944 375679 369284 346261 290976 232399 169999 138732 113188 87067 66080 43130 39360 58210
16932 58210 56898 39298 29619 51306 87174 60803 51845 25052 29484 39836 42844 5189 18370
16919 18370 49673 25366 9737 23434 49778 68405 77082 72062 65539 54499 47228 60927
16907 60927 55519 6162 -18631 -16318 -32176 -7023 12185 8152 -13599 -2311 10787 8962
16895 8962 18002 15110 21484 12144 5530 16406 24529 18737 15973 -2097 15358 12806 11887 11458
16881 11458 35631 26296 24472 12316 9952 6422 31564 52751 42555 37638 48496 61556 29498
16868 29498 -4334 -16825 -29055 -33309 -58174 -53602 -28531 -22465 -18619 2640 8855 -5038 252
16855 252 8349 10213 29732 44019 35140 9686 7716 10165 -13748 -27541 -31583 -14175 -687
16842 -687 -13986 -43114 -56233 -44893 -22512 -11993 -9997 -7503 2373 14752 9572 11144 -11863
16829 -11863 -4703 20129 36012 47029 31289 13586 11341 16086 10881 -14128 -40073 -49690 -35366
16816 -35366 9619 31582 38026 9129 -19914 -2628 7324 -30211 -53428 -47504 -32485 -12403
16804 -12403 7259 11544 -17775 -27530 -15735 -14572 -12788 -24052 -18083 8320 4537 -3517 3029
16791 3029 -13434 -14308 -6527 2571 14935 -6988 -5999 13096 -10722 -27227 -12641 -17932 -2508
16778 -2508 -6431 5740 23658 5182 -31237 -43595 -41884 -29267 -1319 12006 3525 -19044
16766 -19044 -50741 -49259 -48215 -56811 -40950 -32864 -40191 -50859 -74694 -86767 -90281 -73729 -58032
16753 -58032 -62386 -52587 -24769 -11482 8224 -7960 25127 29256 487 -12092 -12306 8363 3473
16740 3473 -29874 -49430 -51920 -65439 -49875 -49140 -54044 -40844 -20878 8356 9552 12091 11256
16727 11256 3117 9483 -1538 -39662 -45524 -24015 -12803 10088 19290 27355 20968 -359 6213
16714 6213 25919 25154 21866 12715 12353 -34830 -10918 19715 10017 -7665 -13175 -6428 19619 46093
16700 46093 69299 63021 31237 6534 875 -12850 -28064 -37296 -27118 -32629 -29714 -16413 -3036
16687 -3036 8741 8475 -16203 -40730 -376 21591 4769 -7638 11129 9801 23306 10782
16675 10782 -4786 945 -10930 3885 737 -17138 -22574 -14947 8600 12618 5949 1815 -9037
16662 -9037 -4290 28725 40164 -2579 -24975 491 4716 3543 -11053 1751 22818 46254
16650 46254 34006 22091 -15708 -30876 -24687 -18112 -17316 -26602 -25121 -18980 -18787 2825 7706 10161
16636 10161 -12342 -25757 -36669 -10172 -19683 -7985 -8717 -13186 -8595 4673 -1334 3647 4895
16623 4895 6416 27375 25385 -13857 -29131 -27771 -42755 -54246 -41659 -49673 -22008 7269 -11846
16610 -11846 -39720 -59872 -31628 16752 29792 39851 23965 8462 3653 -8863 -24428 -7524
16598 -7524 -13882 -42468 -54963 -37808 -29453 -11970 -8460 -23646 -38565 -42511 -11999 -15919 -26929
16585 -26929 -18479 -11807 5679 16220 6778 5954 272 5064 9799 -14491 -14549 16991 29848 14602
16571 14602 687 -10139 -2215 -22221 -62637 -80021 -65343 -4181 27499 8636 449 -17975
16559 -17975 -36508 -31013 -9663 -12756 -33000 -37613 -47922 -76031 -48191 -15304 1410 -5428
16547 -5428 22267 25505 16647 13183 30286 13976 -16215 -29838 -47810 -12064 11719 13014 26695
16534 26695 19212 3014 -11667 -2043 17034 16660 -18445 -27807 -7733 9973 -12151 -22654 -39159
16521 -39159 -18019 -7790 -12064 22570 35737 47920 48509 22456 -7202 -11208 -5735 11857 -3255
16508 -3255 22031 33152 11164 -16664 -51769 -35429 -11532 -27658 -38128 -48081 -53976 -39487
16496 -39487 -10662 -6781 12104 58386 70978 42947 39797 31727 21454 8448 4401 -16558
16484 -16558 -27803 -28378 -12450 4906 4663 6223 18904 5392 -6760 -2084 32080 35545 24118
16471 24118 -6166 -15424 7762 6555 -15445 -27451 -22185 -24519 4204 19585 -5281 -25059
16459 -25059 -20982 10062 8237 -11415 6257 26555 16744 -6562 -14570 -9603 -1637 -13724 2430
16446 2430 3576 -9943 2523 -11484 -31329 -19527 -15897 -7499 -6804 -5737 -35897 -22461 26573
16433 26573 53361 42358 26402 16692 -1043 -23469 -31338 -37480 -29538 -15278 -22643 -29777 -34739
16420 -34739 -9050 20589 32072 -2531 -22514 -7911 -24675 -40272 -51060 -47010 -58178 -30359
16408 -30359 6747 -5535 -27843 -47698 -44365 -20160 -34194 -29908 -2227 13422 27005 34328
16396 34328 33077 32733 41452 29374 37343 32993 14179 -23983 -42629 -29003 -10764 4333 3745
16383 3745 -12391 -24927 2901 30573 28898 20035 -27289 -76079 -42976 -3531 5053 -8942
16371 -8942 -19951 -16076 -9570 -2689 -11065 -8147 731 -19654 -10080 21018 26269 -4030 -51530
16358 -51530 -73756 -60952 -28725 12335 21989 882 -17790 -21224 -41340 -18320 -3726 -18751
16346 -18751 -23722 -33968 -46163 -61625 -36062 24403 48310 39240 7277 7617 13998 -3492 1840
16333 1840 2802 10507 -4991 -44308 -7669 16106 23944 31252 43367 38349 23404 7287 -13070
16320 -13070 -15199 -10571 -9776 -5139 17763 14160 5892 33451 20584 -1332 -22830 7685 24267
16307 24267 30050 25452 755 -30795 -49932 -43679 -9844 21283 -6185 3760 29575 30286 30989
16294 30989 5152 1933 397 9392 -9868 -21409 2059 -8207 -32471 -23389 -20168 -35427 -13534
16281 -13534 -8676 -21175 -22380 -16385 8861 21497 27515 -220 -3832 -23811 -18458 -2416 1545
16268 1545 11319 11192 -4782 -19572 -16532 -5539 555 -7630 -26491 -13501 10684 21095 9952
16255 9952 -2505 -4917 9736 -1027 -738 -3409 -13627 -198 2740 -25134 -8041 8058 27860
16242 27860 46250 15178 12803 18824 2131 -13501 -29097 -28984 -16895 -572 15285 7919 -5916
16229 -5916 -7836 3153 -13072 -24934 -12913 -5930 -15613 -7261 -4756 -16996 -26077 -25201 -12112
16216 -12112 -1654 -2739 -16529 -29460 -18660 -17730 -60892 -28571 -33017 -18994 8786 40361
16204 40361 39472 31955 13852 258 -22565 -41151 -55201 -31772 -19017 -19523 -11693 -11323 4264
16191 4264 8487 -2744 -22156 7558 2326 -14851 -20841 -8822 -10560 -5667 -2448 13641 28151
16178 28151 39996 9756 -22650 -5255 -3235 -1378 680 2156 -8742 -11109 5885 26167 31825
16165 31825 22810 -6240 -10494 5481 13184 -444 -35353 -39999 -48392 -27324 -2342 1272 -2290
16152 -2290 -10907 -9088 -18658 -30521 -19089 -11718 -8325 -4506 -12805 -20321 -26997 -36552 -32829 5626
16138 5626 32905 14364 19195 22909 11068 1171 -10052 -41604 -19532 -1684 -19385 -41507
16126 -41507 -13471 -7992 -9783 -841 -23592 -14567 -23403 -43401 -35370 -1048 195 -23358 -13154
16113 -13154 1565 -3628 -61 2942 15977 29519 56022 46457 35619 36086 29064 16459 15646
16100 15646 11476 -13827 -26235 -27786 -31397 -30191 -50785 -48367 -7879 -7243 -30725 -39443 -62326
16087 -62326 -63484 -65453 -29944 -15479 -17735 -32386 -31347 -9995 10696 -17369 -38049 -24549
16075 -24549 -8809 -12810 -14860 -15826 -3965 -9185 2842 -8069 -16711 -286 11015 46845 66361
16062 66361 56689 48104 46321 12898 -23098 -30622 -11540 -1107 13792 1178 -11158 1098
16050 1098 -16404 -36238 -23989 -29232 -17073 -7558 -12630 -19689 -9503 12188 3963 8549 46472
16037 46472 51408 46445 38178 31619 36113 12765 -9258 -29315 -19036 -2270 -6655 -9236 402
16024 402 11277 734 13607 3157 -16295 -12269 -12461 -6197 21859 9102 -8600 6305 17375
16011 17375 11696 4883 -15524 -13372 -556 -27879 823 5163 -10547 -33789 -17857 -16057 11976
15998 11976 789 -38476 -33198 -37582 -1260 -6402 3903 20519 6224 8294 -5297 -15864
15986 -15864 -4351 -4974 10382 30658 34965 12992 -4582 -11679 -22449 -25024 -15403 2230 5233
15973 5233 19837 23220 16370 6079 -5839 49567 52261 40456 14738 12316 9066 14516 28293
15960 28293 11274 -871 -14566 -30649 -37179 1698 12226 17482 -7604 -5809 7798 17793
15948 17793 -22072 -32879 -24537 -49147 -42975 -13529 -23071 -27428 -16643 -1219 3208 26433 28455
15935 28455 22574 34704 33164 25767 10604 375 4528 20444 25319 20121 -863 -2109 8232
15922 8232 3923 14105 28438 18342 14733 5533 -15959 -16409 -2831 -519 3574 18656 39843
15909 39843 33412 40113 27102 40320 19906 17655 42903 40102 6532 21060 9820 -7933
15897 -7933 8010 29901 13675 27663 7051 10807 31230 34268 22009 12608 4227 -6067 1901
15884 1901 16141 24647 53270 66810 51529 40689 16920 -10165 -15140 -9301 9647 6532 -1311
15871 -1311 13950 24814 19140 43862 14322 -32200 2395 52875 41365 -3580 -19315 -9234
15859 -9234 16395 37121 51928 14711 -23105 -37703 -25765 -24122 -26729 -21056 17025 46744
15847 46744 54440 25073 11789 24394 14440 16428 38699 21506 -15158 -5348 7842 -11178
15835 -11178 -3015 -15508 -31577 -37831 -26499 -24191 -35534 -36461 -9967 -26958 -39106 -4060 15426
15822 15426 7830 7830 -5484 -11362 -26252 -958 -5245 -20047 -35916 -25115 -11336 -8066 -28382
15809 -28382 -36009 -70120 -44813 -10433 6492 42157 44581 37558 21906 6783 -24085 -2550
15797 -2550 -19565 -26611 -12243 2960 32918 8301 -5991 -13089 -16687 -31927 -26054 -26348 8848
15784 8848 30888 35771 -263 -15337 -32523 -9952 -3510 -19984 -23405 -2623 -7987 -20411 -35296
15771 -35296 -19444 1410 1459 -8573 -31327 -37538 -29325 -49686 -35695 4907 20421 11079 -19078
15758 -19078 -41833 -71345 -63432 -32864 -44106 -51994 -42765 -29924 -27161 -28499 -15191 8487 18638
15745 18638 21372 19235 19233 2528 12881 18701 4691 672 -1746 11274 21537 4146 -26810
15732 -26810 -11175 -7753 7409 -14093 -7406 20864 43937 35645 25528 -2353 -16572 -8184
15720 -8184 -7839 -21016 14688 61177 80782 81487 69707 59564 22128 8782 21007 -10744 -45732
15707 -45732 -36153 -2930 -8426 -10245 -74 -10778 -13803 -6130 1872 -8038 9454 34669 41157
15694 41157 28869 29217 40543 23155 -853 -6583 332 26489 23306 18857 10656 -4565 -28692
15681 -28692 -31327 -28012 -5933 -13338 -36655 -48889 -41742 -52192 -46605 -5749 7897 -3411 -26155
15668 -26155 -16521 -898 13368 19418 -1920 -28746 -17043 -9699 -8460 -6115 16698 33140 9875
15655 9875 6015 -5487 4660 9522 9231 10859 19325 45730 36898 15230 29256 41197 20921
15642 20921 8053 7719 -522 5495 34894 29242 25113 -1087 -9715 20465 47439 33989 23204
15629 23204 9761 314 20 -634 -15273 1363 -22711 -37294 -39957 -3648 13 11982 -3432
15616 -3432 5681 15196 6065 10593 24361 24748 9164 10271 -19722 -46082 -47500 -30126 -55170
15603 -55170 -65622 -46184 -43831 -25102 -6191 8243 8654 -9728 -21383 -39396 -37407 -26577
15591 -26577 7059 26251 8806 -31563 -15335 15649 31372 29576 21669 9431 6039 9207
15579 9207 20155 5077 19415 -3015 -13078 -21133 -872 34131 43719 7488 -9709 4832
15567 4832 11744 13272 26900 1494 -11802 -19804 -11552 1078 4111 -2401 8190 -1407 -4112
15554 -4112 -3892 11534 13516 35325 34409 1199 -7502 -10731 -16361 -15385 -19424 -33016 2445 29690
15540 29690 20971 -6100 22132 28000 27737 18994 15025 13153 7919 -4725 -9689 1294 -4473 -26586
15526 -26586 -31140 -5406 22342 -30404 -45214 -10347 3070 -2169 3839 5611 5901 7626 26527
15513 26527 50251 30322 35580 27426 20108 17151 5066 10108 -15468 -41439 -35239 -10269 -29883
15500 -29883 -40787 -10737 20593 9133 5065 13985 -10588 7787 19571 10651 27277 10953
15488 10953 -9232 -2520 24407 10106 -14911 4951 17019 -12066 -15603 -1045 22671 66071
15476 66071 63245 25938 -10398 -12365 9586 -13158 -38938 -30003 -36181 -6805 8923 -3290
15464 -3290 4293 5534 2948 17838 25149 -7566 -22394 1205 8964 3878 807 -737 -28119
15451 -28119 -16160 3083 4162 -8136 28949 40067 9666 4000 12252 12501 -8025 -11790 -13460
15438 -13460 -5703 -8820 -13984 -19961 -9768 -407 2481 989 -15034 -17346 -15002 -33641 -36732 -34166
15424 -34166 -10521 -10641 -2376 9372 1280 5879 -4195 8422 22777 19957 23513 12522 5538
15411 5538 20332 27269 28254 -8388 -8715 10135 20569 20427 -2298 -31192 -51262 -51725 -27312 -12049
15397 -12049 13769 12617 23434 -72 -13644 -23008 -11650 12151 20470 6930 -700 11886
15385 11886 26902 15290 -18493 -37817 -39477 -21592 -27211 -49187 -69329 -59886 -31663 -37513
15373 -37513 -21877 -11137 -7275 43853 75279 44562 33286 27651 11722 4149 -12096 11130
15361 11130 538 -12376 -6011 18778 18698 -2977 5760 -2965 -6993 8163 10087 13664 767
15348 767 12733 20269 23500 -1046 21499 36310 26468 -4114 15876 39043 34243 46921 47702
15335 47702 18129 -8561 -16924 -7118 13156 14565 17267 17108 -12975 -24911 -26213 1988 35681
15322 35681 39594 71656 86661 79734 66801 15649 4535 17429 33917 22552 -2695 10462
15310 10462 4215 8651 5133 -836 -710 791 11489 3587 -3106 12926 37464 44281 15569 5871
15296 5871 20680 -6263 -41119 -37111 -26815 -13415 -5121 12353 31673 41702 19062 2519
15284 2519 -11663 -14076 10320 -17430 -14691 14029 107 1353 12932 28866 32993 18616 11785
15271 11785 43366 45580 15933 5291 -4880 -772 2895 22857 29031 19057 6762 -10287 -14004
15258 -14004 -200 7928 17684 14567 25736 36959 37319 2838 12460 -8 -36883 -45679 -14987
15245 -14987 17620 13718 -9423 23192 18482 -31613 -48888 -54216 -47313 -5440 -782 -6448 2262
15232 2262 4238 3250 -3123 2769 2253 -3720 11700 23313 32317 18639 11644 -14878 2296 13502
15218 13502 21472 31210 10719 716 -13359 -11999 2935 4749 -10580 -31054 -16003 12010
15206 12010 13718 7647 -8598 -5159 3828 3230 12905 15017 18212 -8243 -17820 -24101 -41681 -19196
15192 -19196 -30770 -60252 -65247 -54187 -6500 42161 59155 43817 25640 42675 66255 58911
15180 58911 34997 5226 -28230 -31908 -1971 18890 33899 7666 2679 21337 18185 17915 9554
15167 9554 10539 11009 2963 159 -6762 -13219 516 12939 3176 -2678 12342 1181 -13042 -2587
15153 -2587 6394 12379 17801 -9439 -31177 -1768 7775 15617 11069 2191 -17164 -22009 -25231 -8318
15139 -8318 -14674 -21056 -17244 -16405 -7177 12546 20780 30834 -1411 -2871 -5298 -22751 -27760 -40340
15125 -40340 -41453 -32877 -46794 -19835 21136 38990 24514 -9073 -18348 5165 29806 23556
15113 23556 17739 581 -7065 1754 11446 26588 29463 21183 13332 17562 14021 11843 4462 1714
15099 1714 27181 -3420 -30675 -44375 -40330 -21709 -15044 -17707 -14073 -10801 -12915 -13274 11222
15086 11222 -9768 -18294 12521 43983 43491 22990 2244 -4377 -10769 -3522 4979 12570 10933
15073 10933 6359 -19682 -4405 20822 20614 17827 -6018 -32225 -37672 -28829 -13935 -31088 -57489
15060 -57489 -35112 -33247 -38393 -20231 -8477 8469 -1964 -4806 14741 14694 41385 52342 35459
15047 35459 13226 3852 21437 32745 29947 14213 -14360 -16681 -14562 -35450 -3549 19706
15035 19706 14913 -10388 -43995 -36515 -5769 1537 10978 10408 -18052 -13680 -13751 -12489 -18873 -22940
15021 -22940 -32656 -9829 5476 32231 50385 35691 12131 -963 5503 36373 32882 27761
15009 27761 9337 -14729 -5902 -1476 4367 -110 -9534 -39857 -46785 -31937 -9172 7282 19232
14996 19232 13772 6560 12024 -10034 -3749 19358 38874 35024 1753 6691 12816 -3480 -5399
14983 -5399 -4068 -14024 -20001 -32126 -18571 7491 -4282 89 338 11078 27939 1999 -24763
14970 -24763 -40086 -17068 3341 11808 -1086 -20487 -4491 13807 8881 21138 26747 55181
14958 55181 52334 26809 25736 1485 -10662 -9456 16452 48654 59019 45231 5980 -18713
14946 -18713 -27170 7494 25585 4215 -15773 -30324 -30881 -1619 12278 11263 25719 39073
14934 39073 34786 33659 41944 36188 40073 43320 39190 9436 3537 17007 18089 17653 7880 -12460
14920 -12460 -32659 -16956 -1743 -33115 -50831 -58864 -37788 -38837 -11692 3824 -14501 -884
14908 -884 1526 -7651 19719 10692 -856 9854 -2420 -43532 -75635 -67140 -26131 1550 1077
14895 1077 8603 38193 11465 -15677 -43693 -36361 4848 28051 22445 7637 -8622 -9512 3057
14882 3057 5868 27183 33298 29585 14424 -14420 -23576 -9730 -21888 -35501 -4395 15386 7441
14869 7441 3735 4653 22049 22103 13516 -1923 -7305 -12349 -12005 -25081 -16402 -2804 1560 28700
14855 28700 35036 9401 -2554 3776 -1391 -8554 -24495 -1556 17205 5128 -13465 -21978 -13681
14842 -13681 -7974 -10956 -11183 18728 30927 36587 39191 32670 30839 69414 66472 63937 53285 27803
14828 27803 16170 18526 16315 20281 26272 29425 25734 33978 22601 1680 -18538 -30193 -15278
14815 -15278 -3573 14344 21416 42765 56254 48889 27132 17841 42369 29486 6875 -18578
14803 -18578 -24432 -21696 -5799 15844 -9712 -30634 -6402 2152 -4360 -2748 12377 25521 37863
14790 37863 43561 24494 8329 26870 22825 4202 -9245 -24071 -29680 -13517 -3437 -12030
14778 -12030 -3753 -7863 -22276 -19347 -18262 -14280 -5010 7313 10323 14432 2928 -14236 -24231
14765 -24231 9591 18578 -5335 2648 9079 11489 11536 19768 3892 -3158 -24158 -28760 524 30734
14751 30734 15429 16181 9218 9053 9858 6926 18983 6247 -2720 -7048 15532 12707 11792 27588
14737 27588 13558 22903 5478 21721 54214 60489 50491 54850 60820 50768 10880 -88 -7592
14724 -7592 -4438 6048 17419 15342 30196 18237 16324 39648 51506 48872 43288 25278 6256
14711 6256 10851 33865 64790 68141 51124 46080 13823 231 25458 36480 28151 20391 45815
14698 45815 46696 26128 2620 963 2641 -25464 -15355 1258 -4612 -15209 -29494 -13157 -32090
14685 -32090 5135 43400 52424 23446 7080 8764 11374 -21629 -25699 6757 14017 7970 1682
14672 1682 -7405 5532 -2645 739 34734 16982 12193 -4329 -24141 -17383 12401 28854 13748
14659 13748 -7698 -32308 -40880 -46093 -5166 15701 6100 -22018 -12993 14534 27825 38524
14647 38524 52862 51108 74211 85057 67644 47981 32461 38538 28220 10094 7611 20706
14635 20706 -6647 -30300 -591 9336 -4063 -22328 -43172 -59696 -58848 -41979 -18480 15020
14623 15020 13741 -13125 -45100 -41139 -38536 -55593 -21357 4850 -10961 -20051 311 1612 -13118
14610 -13118 -26381 -14173 9770 -171 2513 -11391 -14541 -39769 -45015 -34651 1012 15721
14598 15721 3275 4259 16522 22941 14093 -9132 -18389 -18794 31730 64060 59721 41741 40807 38455
14584 38455 55942 83041 77838 22272 31272 25278 15350 3142 -14244 -25615 -13088 32958
14572 32958 30635 24853 48847 42273 47298 62941 98822 126538 120266 124203 147593 143406 144609
14559 144609 122093 84954 72608 38421 18217 7164 12191 24544 49019 53893 64271 56170
14547 56170 33957 14601 14731 10189 2004 -11248 -14711 -19608 -25380 -53102 -48672 -28375 -44118
14534 -44118 -49262 -12748 17320 14023 16411 49263 54867 31013 26842 26211 14537 -7401 -11276
14521 -11276 -9862 -12761 -29993 -34438 -13322 12435 9741 16573 53282 68865 38704 24194 28355
14508 28355 48059 58259 52103 41146 45705 74976 86064 62924 51180 21217 -11407 -36512
14496 -36512 -51337 -26313 -20042 -5461 15406 27966 36014 46958 42073 35821 33683 12294 22624
14483 22624 34383 26317 25474 23913 3993 -37155 -36961 -18264 3141 -5813 -12057 -22910 -34113
14470 -34113 -18798 -19957 -6655 -5264 -36901 -26204 -3501 109 -23660 -15391 -36419 -44478 -24487
14457 -24487 -25453 -34316 -29158 -36072 -41235 -49279 -13299 38620 54082 37073 31146 45506 55847
14444 55847 31076 26520 27006 35019 41210 47784 70889 49768 20279 16453 50465 84740 97977
14431 97977 121295 123799 113981 68051 66814 69384 66700 26491 -3909 24870 28933 42614 50118
14418 50118 54745 49027 24179 19268 26702 17499 4960 11233 8155 21066 50577 63586 48036
14405 48036 42794 12258 11643 29944 11804 20441 49890 53945 57258 51112 64281 74795 78959
14392 78959 77027 58868 23446 50432 77104 94783 93692 74561 55132 41923 16635 8739
14380 8739 27201 54833 68581 76933 112914 110581 90846 76527 65642 35971 31487 7143
14368 7143 -6921 8146 12092 34937 56131 39928 36157 15347 -429 3291 7588 28571 31125
14355 31125 33247 33165 15650 22232 31258 31592 22102 38720 73462 84502 65751 51207 32059
14342 32059 44574 44078 57789 66784 60135 71534 79115 45532 32001 20879 32111 41823 40483
14329 40483 30984 6763 20180 15297 44528 78654 80710 82027 65925 59796 36726 43360 47023
14316 47023 44622 35317 14809 10832 3938 6086 24557 29731 29269 49617 49015 13047 -1783 21211
14302 21211 26453 14253 20924 25636 9290 4667 5608 6761 18011 23796 40850 52667 55680
14289 55680 64918 70110 101653 119395 100191 59237 25391 21374 32504 46983 53941 70042
14277 70042 97350 60585 23979 38690 51254 80066 80554 84283 62898 55316 71356 86445
14265 86445 84581 63051 68953 87996 95063 79415 64993 40522 20560 10178 6655 13091 44742
14252 44742 77978 63116 77673 99630 83669 87770 93434 107756 146954 130222 91882 105594
14240 105594 130011 110123 116431 131718 149844 135647 134531 135211 105027 100962 101254 125264 152155
14227 152155 172181 191697 200428 206919 270973 318989 360114 350365 357376 387621 422126 515598
14215 515598 707270 945025 1209221 1528154 1799109 1987461 2047723 1921258 1667738 1352692
14205 1352692 1064514 804158 589120 483331 419916 365828 336269 332535 309361 272308 258477
14194 258477 247234 210041 171869 124893 114032 104454 81653 63941 66831 72283 62541 79340
14182 79340 83167 87453 125530 128809 163541 205709 219761 232718 235518 249502 257356 240321 222194
14169 222194 189307 166985 142007 115767 96047 105058 100148 126871 120843 113035 115814 101649
14157 101649 123002 131985 124754 160867 185672 190692 198820 194546 222411 231278 233455 219851 213128
14144 213128 170273 141555 126232 96975 96528 90782 92757 91539 103767 127970 146259 127831
14132 127831 98219 98288 120287 147211 125772 135914 143337 146305 135829 127101 110364 115911 127685
14119 127685 145446 140942 116661 87555 84589 79115 77143 79715 71606 38151 26294 9776 31776
14106 31776 64132 73691 98154 111389 105135 126778 136444 165754 164360 157093 125126 100177 91856
14093 91856 93397 108083 80470 47049 41534 2528 -5808 -9094 -8329 20974 47497 53470 45723
14080 45723 23219 23858 52704 75459 63928 86673 110880 72830 34805 17435 32472 38068
14068 38068 43628 76647 95308 62460 35992 34139 453 8728 35137 56538 66636 76543
14056 76543 71395 57687 71631 94199 49312 39613 44380 74532 85668 51710 49782 64864
14044 64864 32277 35575 40597 47645 28423 -82 15752 39902 32434 32006 15601 -3403 3982
14031 3982 6329 35627 60867 80557 91778 79413 44138 41123 79564 63682 36017 32146
14019 32146 41367 58446 48788 48576 46337 36957 43567 72855 66917 70421 81597 43511 24792
14006 24792 30733 47279 61345 67017 59947 63667 61660 74823 112298 134436 115411 76723 64892
13993 64892 84832 111698 137677 174362 204780 219897 244200 268143 310518 320226 343348 366997
13981 366997 375081 353180 312910 273330 234793 211789 224537 208164 190449 175225 136411 113461
13969 113461 135597 141087 140340 156271 167308 166363 163353 162768 168003 164604 157553 153559 151354 145820
13955 145820 125407 124188 155964 185230 235488 269937 285515 320113 339624 361388 388261 402090
13943 402090 428245 465750 464771 431628 431725 420443 382576 357601 345057 347383 344363 323684 289554
13930 289554 261822 265832 267746 259123 281648 276175 292199 288722 298637 331770 356854 357282 358935
13917 358935 378368 383238 388417 425465 445708 449624 453200 452413 466277 474915 438553 407046 375655
13904 375655 388634 404510 378659 381649 353505 340317 335814 334464 299556 271513 247917 243230
13892 243230 263550 254879 220722 202876 196498 210666 239825 250971 249922 243791 253517 265321
13880 265321 268463 290025 318710 312032 296835 310464 328885 337012 342996 371990 377331 387338
13868 387338 389477 384226 369723 390859 423704 435626 461271 518911 591890 663666 729294 805299
13856 805299 883571 890987 868663 845136 782393 703445 642397 636289 643510 598441 572946 570420
13844 570420 519803 514182 555154 601212 640741 679783 738633 810923 855894 882394 907558 911524
13832 911524 861775 824233 791209 739010 739357 746991 744244 757311 769293 771293 793834 846887
13820 846887 883519 913494 934722 957830 990074 1041352 1072965 1107118 1152048 1231154 1340591
13809 1340591 1454555 1594763 1764601 1992754 2305551 2725387 3270116 3982365 4915538
13800 4915538 6015221 7217208 8358335 9298943 9927644 10108694 9840767 9199528 8338390
13791 8338390 7367006 6431162 5614898 4959649 4490343 4232402 4131232 4132768 4252214 4479919
13781 4479919 4864665 5428745 6239969 7400087 9017198 11032740 13304307 15670095 17834081
13772 17834081 19459660 20329242 20261813 19263410 17619721 15623488 13571346 11696630 10163443
13763 10163443 9096753 8447726 8107355 8024939 8149539 8448410 8967193 9733303 10867650
13754 10867650 12512771 14800525 17905824 21813024 26343039 31132828 35667651 39294221
13746 39294221 41517099 42159918 41402329 39743823 37910224 36599513 36378260 37930357
13738 37930357 41998342 49762089 63312122 86039679 122172777 173975494 238102075
13731 238102075 305762862 362063259 393990235 392921360 360405752 306739533 245409327
13724 245409327 189777720 146542738 116704348 96675880 82127493 70344138 60128197
13717 60128197 51161679 43439454 37042441 32038337 28178323 25098793 22498887 20191861
13709 20191861 18219375 16624389 15508594 15010332 15183372 16098791 17765616 20167151
13701 20167151 23156872 26383337 29378659 31658564 32764617 32446027 30711770 27878702
13693 27878702 24363411 20654576 17193476 14239534 11956952 10296762 9111036 8291064
13685 8291064 7763241 7471999 7416032 7651895 8181123 9095959 10497125 12357155 14555763
13676 14555763 16913599 19165811 21002867 22206019 22506031 21796780 20196775 17982405
13668 17982405 15448596 12911138 10592280 8679687 7232925 6171401 5422629 4900465
13660 4900465 4560885 4368356 4312455 4393880 4609889 5026535 5621271 6467092 7472324 8579145
13650 8579145 9603242 10396877 10870035 10872539 10371644 9505492 8351001 7132083 5975783
13641 5975783 4922087 4056532 3400047 2902216 2556251 2306431 2083246 1901771 1737249
13632 1737249 1625345 1546621 1497827 1494179 1496238 1458930 1428766 1389995 1334593 1287240 1206938
13621 1206938 1146659 1078888 1003208 950278 925373 912106 896834 904465 894535 880133 873972 876476
13609 876476 870559 877882 892814 910046 903363 889396 897323 928438 952521 932738 892344 875605
13597 875605 849774 800621 782141 758306 735919 710787 671396 643372 619675 593091 569112
13586 569112 563590 600921 616440 593986 591677 600202 622960 658682 681197 666107 654795 645854
13574 645854 624360 633872 643126 628471 633553 605107 603483 587493 578055 530320 505622 524398
13562 524398 511257 491218 450474 417608 414270 424432 436090 457555 434416 430744 441983 420164
13550 420164 384709 381871 383329 364108 374566 377423 364738 353308 347132 332856 329594 325380 300523
13537 300523 273563 248118 248334 243958 246874 262250 274496 279976 286914 277925 245991 229579 237670
13524 237670 230294 250238 261980 248811 225895 242476 275275 247092 212199 188279 192621 190702
13512 190702 195914 201467 195091 198699 215803 200153 199715 193837 179294 202138 183971 169773 168223
13499 168223 160611 156908 150582 141478 143428 147546 136627 132230 131511 141869 154330 156294 163801 166367
13485 166367 157118 162191 164351 150848 144840 120103 145383 166635 132209 121023 117482 113988 99876
13472 99876 131910 125957 116407 102846 137485 161928 163308 170164 164605 137047 105537 130302 140459
13459 140459 130859 136332 145764 141017 153194 170499 186290 182425 153735 111423 96776 122766
13447 122766 132441 132826 157296 172550 189528 175518 198440 203299 216098 232947 255021 237886
13435 237886 251654 242381 203878 206576 227890 251557 259436 257006 267073 242282 205266 207236
13423 207236 194095 206746 217936 201174 192590 173148 163861 175822 192869 205657 196456 221700
13411 221700 265710 265056 254255 241171 231353 230644 232656 221537 209198 226805 231748 227051 235467
13398 235467 218574 247980 261761 263416 264987 261085 261539 268074 254950 237851 230448 212848 188106
13385 188106 167554 158474 171394 171338 197153 165732 132111 131489 151112 190562 209834 229333 246448
13372 246448 273678 307909 292484 279664 264490 255573 283355 285225 300112 300282 304430 308601 335683
13359 335683 332352 325806 304320 283721 285483 242481 200578 183908 170402 149209 127268 149095
13347 149095 163446 180153 178628 183149 190736 217935 245043 279907 295051 318204 327424 349975
13335 349975 357739 323568 313155 279488 276565 281101 245058 225793 222377 253552 272330 269740
13323 269740 280926 285949 310734 321428 291761 306085 337969 319426 279906 294234 288038 278606
13311 278606 270864 254890 235852 240875 244812 239396 216937 234988 261149 254520 261483 269647 271228
13298 271228 284737 272818 266259 302925 327383 304464 286249 306713 316729 310010 307514 304502
13286 304502 304504 267031 250188 263688 240769 224223 201903 206061 190265 142781 120915 141868
13274 141868 142534 125299 125396 141927 159428 187542 248824 264061 250104 275427 329859 383478
13262 383478 399512 379098 358019 341628 353329 329365 312233 296635 274511 269228 271065 273027
13250 273027 316144 375948 442379 542692 701768 950473 1270874 1655764 1977033 2146305
13240 2146305 2159135 2019067 1780995 1495803 1235661 969697 755698 589872 463818 376634
13230 376634 362581 313637 280006 240686 209958 215379 215749 215220 202073 197721 220877 205084 173528
13217 173528 154389 171209 201261 206384 204539 227476 217772 214597 200013 190020 184065 199520 191260
13204 191260 174424 161249 163476 167783 146379 143566 162818 194850 190667 144561 128223 129125 134120
13191 134120 157283 187650 184515 153671 130245 107457 114558 117209 123294 116808 96690 91799 95242
13178 95242 131019 137312 131813 122656 112160 113430 125923 159561 167727 169878 158113 162935 165172
13165 165172 182955 170157 170963 163348 178604 159088 109364 109838 113001 123027 109404 109611 106241
13152 106241 108123 115378 109389 73483 52657 90130 100015 77421 76269 75435 110704 115408 97192
13139 97192 94372 110366 108839 106982 112895 119836 95076 100793 117221 124745 115754 123776 143104
13126 143104 165882 177828 190326 185633 159726 156501 150103 144715 137777 156236 198223 203114 196614
13113 196614 203567 191690 173172 174051 160970 163598 189224 192431 197311 201238 212034 199925 226374
13100 226374 267110 265942 242785 241477 258685 262938 280433 281353 272463 259899 267221 309540 348133
13087 348133 377820 415586 446057 503161 558405 612609 634704 628928 625239 638064 626190 594697
13075 594697 587485 597104 604075 590711 590126 577624 563879 562957 543504 514614 497756 490463 472319
13062 472319 476835 482677 467706 476010 496084 500275 499473 522699 536098 542101 558842 569578 612894
13049 612894 629217 659623 672935 696422 730696 741842 755916 753754 730837 696992 650995 643113
13037 643113 645659 624270 596143 603126 626140 631409 610380 598475 581785 562933 549785 552522
13025 552522 548119 545325 543192 513261 511831 535554 550097 540402 558720 587976 601263 643949
13013 643949 666978 698510 716617 744832 774090 797570 863150 946029 1016880 1094003 1177374
13002 1177374 1303998 1392918 1451490 1545212 1657985 1759320 1882114 2060310 2246557 2483611
12992 2483611 2817205 3218375 3726313 4374742 5196110 6217455 7502149 9213812 11514733
12983 11514733 14564662 18279302 22117670 25422949 28006871 29880531 30657301 30030089
12975 30030089 28240860 25823319 23142397 20214864 17160866 14401745 12196846 10580658
12967 10580658 9572871 9046867 8903797 9119071 9756907 10841807 12441040 14678062 17620432
12958 17620432 21233093 25178368 28906889 31914614 34251514 35800680 35948763 34680861
12950 34680861 32696693 30523157 28289697 26298485 25032805 24821471 25614484 27044273
12942 27044273 28829275 30599717 31786990 32258656 32258556 31685223 30276848 28208233 25865303
12933 25865303 23357241 20667982 17948512 15545756 13728635 12491611 11827649 11688282
12925 11688282 12002799 12793519 14069495 15920852 18335461 21115126 23979570 26953566
12917 26953566 29896291 32482440 34524481 36099336 37370507 38358500 39018633 39456118
12909 39456118 39926712 40487684 41175044 41897214 42313905 42156704 41416413 40120581 38047345
12900 38047345 35101051 31640411 28150797 24756385 21518309 18702442 16497361 14921794
12892 14921794 13981940 13647113 13926096 14859387 16494742 18893456 21986945 25371845 28700011
12883 28700011 31870683 34826617 37442693 39327066 40227773 40426021 39977333 38490470
12875 38490470 36183379 33906356 32258889 31597530 32166044 33980796 36562913 39339465
12867 39339465 41942101 44124346 45376618 45015721 43082635 40122864 36270901 31629678
12859 31629678 26787282 22469522 18986438 16301631 14319745 12930526 12077056 11736066
12851 11736066 11887977 12608431 14023875 16142305 19040391 22655158 26591520 30453423
12843 30453423 34005597 37088651 39317454 40122387 39191635 36859848 33513517 29189750
12835 29189750 24214584 19423068 15463596 12512613 10350841 8700343 7380914 6292031
12827 6292031 5388582 4656421 4082368 3607284 3241135 2984643 2782476 2635533 2529156
12818 2529156 2406507 2258244 2124390 1986711 1863112 1771195 1693675 1583126 1479196 1401871
12808 1401871 1345253 1310769 1288102 1299946 1282197 1229265 1183280 1124511 1088753 1038227 1025623
12797 1025623 1048508 1052150 1074177 1114673 1106002 1085038 1097648 1118209 1118409 1132025 1187565 1273436
12785 1273436 1363533 1464979 1573889 1648279 1685922 1681768 1664766 1655143 1607259 1550602 1469001
12774 1469001 1411323 1361863 1286100 1174689 1107302 1082047 1039747 960632 921956 883568 860412
12763 860412 839385 820737 797272 764200 745003 742223 751711 747157 733728 719041 743021 767670
12751 767670 796551 844546 875319 906987 920703 934781 1000595 1070990 1144066 1190255 1212572
12740 1212572 1199070 1148886 1100251 1071080 1062156 1035651 984155 944453 942918 986536 1004394 1023604
12728 1023604 1065133 1055056 1093397 1143844 1219477 1335697 1451986 1566072 1684673 1787049
12718 1787049 1859638 1854631 1836883 1819294 1824352 1801207 1756954 1697515 1616675 1540846 1461680 1334839
12706 1334839 1241470 1187189 1141811 1062650 1009245 1000740 1022152 1030532 1035547 1048259 1026016 997061
12694 997061 977794 952801 931455 894450 867608 854133 828640 809724 794381 783661 764751
12683 764751 757051 706764 649924 636955 617108 580137 594259 610765 595843 603266 629813 658509
12671 658509 677955 706281 754993 791277 819720 792159 754528 717035 699965 649974 612443
12660 612443 571083 548956 556378 564303 583124 614264 632127 635446 642670 649199 652836 667816 704390
12647 704390 750799 776475 752329 696635 646054 596526 584948 562708 556307 522184 465660 429916
12635 429916 410647 399409 392330 367209 360402 408414 416055 404326 404015 410518 406518 414555 439476
12622 439476 447596 445546 422200 377640 357677 356063 359968 333391 325195 318029 332531 318885 318795
12609 318795 315538 299980 298476 277877 284173 298428 299762 300625 302599 274355 227169 212879 238774
12596 238774 254274 251625 208468 171852 152644 171429 198233 196005 187467 176073 179579 163505
12584 163505 162724 165830 152294 152827 149794 150843 172277 164766 182843 203268 198943 205959 202032 221243
12570 221243 196994 179343 177828 179630 196534 172360 142276 135366 120522 138882 139547 138332 105395
12557 105395 98724 109044 115001 148252 145234 144072 157083 168372 163136 123983 99008 108176 139008
12544 139008 154901 156743 157939 150055 114003 72710 89731 119475 142187 144551 134451 110931
12532 110931 120596 154775 176530 182462 198276 198787 210292 200779 180600 188334 188775 184999 203332
12519 203332 226094 225378 234544 239191 239967 218289 202856 221232 239924 252406 257660 235724 233971
12506 233971 211319 179369 167583 181343 181129 168251 157168 172015 198738 216711 194346 192336
12494 192336 240193 276647 296919 317113 308234 289556 278388 271411 270380 259759 246343 246557
12482 246557 262649 289633 290831 277487 314174 332586 316524 299410 315979 330534 339135 314418
12470 314418 307169 309325 293127 276121 269512 249711 236328 233890 233472 229712 260162 263553 266897
12457 266897 312630 349415 369675 390422 379322 375301 367565 381999 374313 366465 364789 369622 356888
12444 356888 352607 337538 373362 398546 357831 355277 356604 380347 391563 366195 371394 360141
12432 360141 343268 331254 369695 376434 333693 315065 327325 382506 395935 413700 440880 454617
12420 454617 463480 484468 526648 541705 540428 525430 502165 493846 493131 494154 510806 517067 530080
12407 530080 556270 580212 614269 675315 707222 705035 707046 687923 685249 689404 670431 629539
12395 629539 598255 572991 556983 566091 593997 636609 636888 640445 655372 693133 735244 788427
12383 788427 849455 904254 954985 1015846 1048532 1109015 1157214 1194919 1271679 1357000 1438396
12372 1438396 1532631 1596541 1710806 1866375 2036405 2254923 2488448 2788971 3176020 3631373
12362 3631373 4155115 4773108 5551784 6473186 7643324 9197985 11340983 14267913 18202687
12353 18202687 23382527 29693177 36609167 42858926 46981079 47516366 43817585 37180822
12345 37180822 29953242 23807587 19221577 16091551 14033453 12796628 12199031 12187326
12337 12187326 12807549 14146834 16302317 19307143 23172086 27945584 33595062 39599677
12329 39599677 44649744 47327157 46879751 43426852 37771254 31160588 24785997 19506806
12321 19506806 15543495 12704685 10698472 9354614 8484891 7981089 7738615 7672514 7632185
12312 7632185 7617814 7608567 7706326 7980123 8473335 9274857 10467502 12185132 14569478 17792488
12302 17792488 22008609 27373309 33776715 40582488 46487623 49668080 49006553 45336198
12294 45336198 40187531 34555532 29147241 24477485 20894398 18447393 17023871 16480941
12286 16480941 16789200 18013359 20286826 23855734 29034149 36042283 44772231 54878214
12278 54878214 65565019 75316424 81782843 82432585 76900479 67514734 57053269 47138594
12270 47138594 38451803 31241683 25658318 21551826 18698831 16810584 15695479 15340727
12262 15340727 15726203 16936120 19099350 22246277 26250602 30688957 34968146 38331012
12254 38331012 39764903 38440100 34654919 29658421 24540767 19989402 16291666 13486739
12246 13486739 11422258 9924128 8864426 8179602 7761398 7527766 7363368 7235840 7122959
12237 7122959 7032345 6984874 7013004 7210653 7664829 8433387 9674603 11546148 14248183
12228 14248183 18127762 23170067 28801750 34091516 37918832 39508663 38604867 35398116
12220 35398116 30811023 26152017 22114972 18697037 15827945 13568000 11974042 11003683
12212 11003683 10579277 10679994 11332245 12655356 14875750 18298500 23135552 29197904
12204 29197904 35384852 39762362 40718070 38289986 33639063 27976998 22433744 17758082
12196 17758082 14139652 11474249 9503880 8067567 6999715 6179634 5494602 4932552
12188 4932552 4461631 4039743 3652890 3308721 2980493 2657114 2396775 2154812 1964236
12179 1964236 1837154 1724081 1612145 1474694 1366577 1311720 1298934 1307651 1341692 1395109
12169 1395109 1442857 1451167 1467808 1452339 1375731 1322628 1269607 1210386 1135701 1075288 1028545
12158 1028545 970060 946036 934328 889745 852219 821555 786647 765737 750195 740676 696322
12147 696322 648452 633408 594951 584060 579723 563823 533398 505766 510163 521245 519940 536431
12135 536431 525848 548232 521737 464016 438511 442621 449472 449194 443461 418606 405113 423701
12123 423701 422043 405430 366840 351803 351046 347268 313981 282541 297224 296495 271686 260284 246201
12110 246201 256048 273959 246617 211682 193259 189225 170757 179168 224867 216938 218433 235790
12098 235790 239432 238709 216905 220398 232340 211365 206957 228200 225408 225295 199511 189799 174077
12085 174077 158037 139144 124352 115757 118551 107342 82896 109040 137304 136785 139640 156257
12073 156257 164993 171617 186818 180426 186053 211857 200419 148501 123079 119278 116964 165687 176961
12060 176961 129770 112723 134315 162745 182517 180385 161545 160909 144210 115526 121390 147219
12048 147219 144877 146300 135078 150455 177942 171321 150854 138079 132734 142293 175860 177760 162659
12035 162659 141854 117239 113334 117094 87376 62116 60774 82099 116492 122178 111659 116471
12023 116471 123607 128725 117491 119592 105183 116105 126717 121194 103048 88195 92307 92480 112820
12010 112820 96163 68989 83403 80908 72325 72549 48541 53975 90545 90604 84790 112384 109845
11997 109845 93363 89229 111368 143979 143528 121859 112784 95725 86457 91600 111192 87145 53505
11984 53505 59686 51477 44734 16750 6747 37780 72297 82375 86645 55447 31452 45876
11972 45876 43540 43391 62478 83805 92249 82133 66060 41019 37164 13171 8445 27821 15923
11959 15923 21229 47082 56455 61695 41950 8964 -513 17369 27474 58287 77258 55857
11947 55857 28829 10305 598 25135 49365 59429 68484 78117 73598 57969 57121 46724 63570
11934 63570 71202 66280 71119 81182 56545 48042 65271 61501 58419 57325 56023 58202 38185
11921 38185 23744 17383 19610 36750 21927 24724 39436 65498 80392 59800 57502 68718
11909 68718 56268 63338 71084 117684 131974 169351 155339 143910 158734 173687 231258 270945
11897 270945 303954 295129 277063 246839 207859 161484 133976 116374 138863 105663 95744 108496
11885 108496 137758 172172 183950 194295 170440 196080 269083 300085 312244 298851 261423
11874 261423 247976 183533 140719 100309 65086 36735 57085 87372 98166 86712 74095
11863 74095 92517 95650 70696 76718 88970 92774 70299 59227 80515 92693 103820 151142
11851 151142 184862 202546 197857 239803 257485 244716 237348 247288 250065 230569 192161 169725
11839 169725 174666 152814 105830 76816 103687 135071 165439 175392 206690 228663 274893 303860
11827 303860 352599 423784 487498 500533 486242 459760 416012 351917 263221 193712 150867
11816 150867 138697 160431 152504 174383 161805 115020 116485 117423 123723 149435 171795 183018
11804 183018 206689 238616 226911 211817 199140 197083 178224 139698 99354 62611 84797 94394
11792 94394 101916 101406 44994 30295 56737 65653 46539 42375 11121 20812 33964 43072 49386
11779 49386 64850 62155 82256 116571 162121 208844 238485 250072 231583 220414 187362 151763
11767 151763 133171 120867 103543 69312 56472 36752 63678 93957 92838 110288 133890 134562
11755 134562 125270 150194 187150 228672 226580 200717 178029 183557 140059 85012 79331 90853
11743 90853 74656 55595 49358 41477 6373 28218 62108 66056 76442 66510 48989 36137
11731 36137 23132 -6436 -1555 25402 22706 35338 47943 45931 61227 26727 32574 65564
11719 65564 68218 68774 71556 80301 87956 79048 74687 81226 60280 47153 51070 55619 43547 28269
11705 28269 17004 13275 17656 33835 21299 13098 -6616 -9255 -24920 -22448 4328 14490 18082
11692 18082 10983 -7703 -7700 15921 44622 46078 43707 47764 40444 22223 8246 33507 26943 9172
11678 9172 17179 39791 29651 24134 23778 25592 40969 22480 17099 18953 33360 13405 -27587
11665 -27587 -14738 30369 27675 41327 40910 20372 17133 33630 40333 30431 11767 14460 272
11652 272 28710 60239 43599 25326 35522 59422 61478 35537 23869 18329 11724 16844 21177
11639 21177 34925 35507 39286 27813 18729 2243 -9714 914 13473 24769 6042 -11793
11627 -11793 -3902 -2370 -37028 -37145 2094 8457 -16300 -16896 -1164 26133 44779 50654 23378
11614 23378 4314 3458 -32678 -25143 8047 32561 43857 42877 29062 33797 18520 8105 -13890
11601 -13890 -38799 -18511 9729 14634 -6597 -14580 -16546 -44276 -20229 10323 -4721 -13438
11589 -13438 17517 18998 -27217 -40147 -27997 -8742 6472 26502 62094 48920 27899 29383
11577 29383 30814 48721 45697 9250 251 -4382 6467 21400 16390 34996 31482 22024 8747
11564 8747 -7171 15324 63510 39164 38 27045 39553 18758 27676 20263 -5429 -19524
11552 -19524 -58849 -65065 -29585 -18103 -16963 -5562 -9462 -14551 -6425 12100 65922 93937 85312
11539 85312 55203 24115 7053 3437 9527 18563 -9741 -1995 23091 10722 964 -24925 -43350
11526 -43350 -50729 -21445 -4058 6486 -5979 -9404 -25632 -24720 -20902 -21644 -14332 -5688 -303 23627
11512 23627 5593 -5272 -23145 -34267 -22966 7296 36546 25697 5044 23265 22913 -828
11500 -828 23976 35749 25808 1321 -21029 -35937 -35061 -24525 -8880 -12073 -31018 -37720 2476
11487 2476 20315 37834 66374 60833 35365 -6679 -20631 -21872 -14437 6557 49756 59011 43807
11474 43807 20432 9382 8833 2677 -15825 -22824 -24797 -844 1812 -1587 -28848 -42787 -32040
11461 -32040 -38631 -28550 -40831 -10017 18146 49575 57576 61232 59019 70716 77133 68891 70162
11448 70162 33382 8800 -5806 -12100 -35686 -43243 -59492 -63841 -54685 -42852 -64205 -69879 -48293
11435 -48293 -21613 -28460 -42695 -26056 -29859 -34035 -20899 -67 -6932 -16373 -8200 -13665 -35732
11422 -35732 -25603 -4381 824 -1931 25862 39238 53958 61460 45693 44649 44501 25216 23929
11409 23929 4857 -6768 -30534 476 17724 5329 -4898 2340 13272 -483 5525 4960
11397 4960 -10620 8109 16000 11078 -13895 -18961 -5728 -11433 -4081 -3054 -5152 11808 24339
11384 24339 15539 -7491 -10246 3130 -22380 -34725 -39179 -33571 -24513 -10952 -7383 18907 35558
11371 35558 38394 58183 71530 43906 24828 4259 -19088 -31839 -52493 -37103 -20411 -26656
11359 -26656 -49639 -31212 -10357 12445 10131 11810 18933 28340 40460 65934 60375 45551 48127
11346 48127 8635 -3175 4642 -7231 -16170 -16079 -8167 -14725 -10019 1333 -8062 -28501 2264
11333 2264 -10911 -3301 4328 -3153 10794 36118 36419 47969 38178 43855 23101 -7363 -14187
11320 -14187 -8682 18153 30554 31452 12599 15957 33453 12991 14157 36414 31362 -21311 -55014
11307 -55014 -46560 -27619 840 -1951 10985 24539 44354 54538 36057 4249 -7553 4691
11295 4691 2886 -14670 -13966 12763 29186 32182 24922 17613 11573 -11354 -13110 -31434 -25051 -7878
11281 -7878 -29793 -78329 -53975 -14679 -4845 -7286 7381 21296 39101 30959 28176 41423 58382
11268 58382 50366 30282 34480 33615 25756 7336 -8915 -7756 -3993 8127 -8583 -4008 -11847
11255 -11847 -24771 -20364 -2714 -24303 -21527 -13101 -5090 -7772 6302 -4785 -28628 -37788 -49395
11242 -49395 -36090 -37477 -29942 -24288 -45659 -46009 -19964 -8124 15066 9314 1167 21203 13082
11229 13082 19070 7134 -3507 -8613 8531 24373 2503 -12529 822 7371 12497 -5217
11217 -5217 -32243 -17749 34 -3924 -375 17412 34986 25725 20207 22099 11920 -8404 -29865
11204 -29865 -31643 -45396 -38077 -31858 -6565 -2187 -19394 -41958 -26418 -33696 -33193 -34856 -25881
11191 -25881 -25594 -33854 -9593 -5195 -406 6752 2299 -2386 -31472 -29550 -24823 -16297 -27275 -29506
11177 -29506 -37567 -811 12986 21871 35110 30123 22934 15847 -2337 -16135 -23553 -26874 -21253
11164 -21253 -24953 -21839 -2200 11761 11688 25056 28199 17073 21387 9360 -17596 -7969 13063
11151 13063 30198 24419 -5852 17163 19565 29461 7965 -14717 -17408 7901 4270 -6712 -1656
11138 -1656 -7793 5766 23868 10729 -21555 -42509 -8903 11553 7689 -30938 -7696 -550
11126 -550 -36332 -20953 -20603 -22835 -19061 -7590 -10964 5957 7231 13226 -6408 -29057 -43468
11113 -43468 -16203 13805 12539 4953 17344 17537 17099 47265 54893 26162 -5848 -22609 -21187
11100 -21187 -7579 -3041 -13129 -11075 -4879 -19863 -10801 -19211 5070 8531 12260 42191 31567
11087 31567 -11176 -34404 -38435 -32121 -14345 -28551 -55775 -65509 -59621 -26827 -2046 7364 -4377
11074 -4377 -3292 25999 44759 22215 13957 31698 4453 -7399 13044 16231 -7716 -29929
11062 -29929 -47810 -49078 -46220 -45948 -47222 -37604 -48201 -47600 -24473 1440 1466 -42614 -64856 -60123
11048 -60123 -47223 -14378 -2099 -16540 -15576 8447 17536 1182 -14201 -22721 -10281 -10552 7650
11035 7650 22365 12151 28952 50258 53733 43773 54576 51787 30108 24407 14698 19171 19993
11022 19993 44015 64666 51461 48740 53445 38861 15705 11233 24747 2720 5181 27796
11010 27796 26076 7210 -40049 -38796 -22466 -38051 -32737 -10891 -25130 -39207 -12819 -6211
10998 -6211 12713 46796 61978 44154 17293 6611 18171 28540 38368 19427 29563 15475
10986 15475 -1119 -5214 -21171 -20359 -25413 7274 38419 27848 -12136 -27892 -16322 11901
10974 11901 27782 35916 8296 15597 22044 22928 26692 26695 7239 11150 1426 17690 12837 31394
10960 31394 42343 8704 5166 27155 13005 -18023 -24984 -8419 14246 -4592 -15943 -4120
10948 -4120 -25901 -39268 -11748 5766 11805 6081 5075 -1805 2120 -2960 -13106 -4058 -1886
10935 -1886 6539 -8246 5210 35411 13592 -12608 -8588 4800 6130 -8143 -9770 8040 12838
10922 12838 24451 6925 4142 11819 -4339 5984 16570 -8038 -14932 -20257 -25800 -15040 -23270
10909 -23270 -30173 7889 27313 18941 35980 9960 -11629 18241 36769 20161 33016 34362
10897 34362 10420 17374 -16270 -28115 -10501 5207 34530 26127 -1582 -16151 -25430 -17510
10885 -17510 -28668 -28642 -35666 -28262 -18232 -646 39403 26910 -679 18277 21180 3633 7964
10872 7964 9630 26248 6695 563 22172 35969 59947 35388 -19967 -11287 -18183 -26648 -26492
10859 -26492 -18708 -25850 -23332 -18321 -23471 -27881 -40708 -44707 -24010 -17112 -18700 -14449 11354 13994
10845 13994 10498 30252 26011 14177 12330 -10168 -3114 7341 20529 9607 -3277 -27978
10833 -27978 -38097 -17972 -8262 -1786 -15228 -18616 8958 14454 23944 70175 47613 32621 25865
10820 25865 16414 16224 -11299 -18114 -5860 1944 -1577 1935 -9645 -26020 -39838 -46311 -19192
10807 -19192 -7972 -13740 -12509 1589 42444 62385 51295 34087 19897 36037 53201 25099
10795 25099 3019 -9797 14727 37683 57649 36871 18421 22849 25279 38235 71225 50190
10783 50190 22399 20091 362 2581 1008 -20713 -20530 -29749 -29668 -4642 13962 2048 -7773 -10873
10769 -10873 1115 -7925 12616 2403 -15560 -32992 -18479 -9611 -26042 -28147 -16235 -7518
10757 -7518 21824 30178 17199 14182 44439 57083 50033 42138 50806 39882 36402 37672 61239
10744 61239 73205 47454 21182 -10874 -8801 -12872 -21516 2593 -12844 -22972 -14916 -9131 -6980
10731 -6980 -4288 21261 15011 -2634 23654 46764 43687 56403 50247 16171 3362 23814 39062
10718 39062 27613 38678 40187 18462 -23760 -17989 20308 49317 36171 10451 -23172 -17159
10706 -17159 -13550 -12251 3457 1266 1782 7263 7746 -4549 -22057 -1328 -3736 -2038 -2078 -20863
10692 -20863 -30979 -14454 -1135 5740 -8860 -6732 -9807 -20162 23757 48207 38604 -4952
10680 -4952 -19172 1368 47246 39466 24838 15639 2405 -4662 -23458 -19668 -17343 -13474 -28090
10667 -28090 -36987 -24413 -11650 -11412 -23368 -8046 20977 3407 11668 30983 41253 43692 50319
10654 50319 37283 26190 27539 27483 14173 2076 -9798 -12726 -10059 -52498 -36535 -14198 -20130
10641 -20130 8535 -10184 -30862 -18063 38990 53253 31727 26993 36421 20394 9784 9378
10629 9378 -3579 9191 29525 40433 74775 87312 65283 7058 -23593 -42898 -36587 -25861
10617 -25861 -11688 -14664 -773 27203 20975 17501 21183 35348 13512 7848 6499 -3047 4904
10604 4904 20380 16963 -10556 9860 32264 39145 46148 26716 37588 52248 59936 36041 51385
10591 51385 37316 20749 13122 -1932 -13649 18523 33175 6587 10233 -18809 -45146 -48243
10579 -48243 -26270 -11791 -8782 -18266 -24400 10026 12821 41091 52146 14513 -11116 -10041 -7336
10566 -7336 -28973 -45421 -49973 -37538 -40558 -57105 -76211 -87498 -48560 -21574 -33653 -34358 7430
10553 7430 20429 -4909 -10949 -5481 -1766 2581 -5440 -15062 -27378 -23942 1285 -15785 -38049
10540 -38049 -39995 -6407 24646 24238 15379 4574 -946 7041 9504 12274 17007 4139 -2659 -28017
10526 -28017 -46256 -69845 -73037 -83285 -49950 -20727 -5211 -31033 -50446 -26346 -9144 -15893
10514 -15893 -44683 -10770 19830 2404 -10313 -33494 -33811 -16919 -9118 -7535 -5236 7528 -18506
10501 -18506 -45902 -18712 9727 45664 32147 42586 37734 9996 3144 -332 -3115 -5171 -1936
10488 -1936 10119 19687 42806 46250 16601 -34 -28233 -53539 -39743 -10594 13425 12075
10476 12075 -28735 -40805 -21280 -3973 -10640 -24026 -2878 18579 -15907 -54804 -35009 -4594
10464 -4594 -12526 -12459 15076 4689 -8076 -61 19221 35743 47800 32315 36126 11357 15203
10451 15203 40307 45019 41654 31612 24428 13027 11191 3317 -6139 7950 -2853 -15552 -13275
10438 -13275 5293 30966 31492 23623 27285 36613 32850 24896 31889 16976 24974 14756 -9817
10425 -9817 -22463 -33448 -33159 -48560 -55264 -39837 -36327 -8832 609 19465 6363 -10738 -23443
10412 -23443 -21905 -9066 -2321 -21952 -13002 -17703 -25400 -21839 -24657 -13125 27409 56844 41710
10399 41710 14386 19687 62978 48885 30221 24788 -460 -19782 -6135 13373 51961 40615
10387 40615 36081 37860 24890 17132 52254 90027 95672 62278 34668 23563 20706 22420 31959
10374 31959 26359 31522 31449 49416 61158 49865 32458 28380 33243 38176 66996 101104 128774
10361 128774 133222 116720 86379 86893 68030 82107 94211 111729 141042 199913 243593 340310
10349 340310 470253 643426 801644 984570 1185347 1369516 1464044 1487388 1495039 1458835
10339 1458835 1326677 1163911 984478 830854 673534 526308 418895 315740 193537
10330 193537 148613 115515 109684 95835 94723 82477 66856 58622 38864 42256 40399 64575
10318 64575 89458 96337 104126 79577 58501 48776 69857 50967 30512 13665 8487 -10919
10306 -10919 12743 48183 52880 36554 40013 58357 58413 57082 85592 98293 69751 83446 84372
10293 84372 81081 65040 23972 6026 12991 35241 42247 69510 65378 66356 75460 79178 42381
10280 42381 20746 16181 63295 78504 80456 90952 105604 120881 117552 123014 127407 111658 105581
10267 105581 139103 145225 137527 138034 138706 178964 183128 161758 123785 101923 128825 135257 152724
10254 152724 179199 162029 167511 136499 124886 130757 136388 133820 143633 165583 163850 140428 121483
10241 121483 112817 106552 96961 107889 113326 114769 121541 115306 133148 158609 194545 182673 175203
10228 175203 170650 155726 157534 144081 157529 164618 167452 164903 156713 176453 213333 256907 294199
10215 294199 335151 357409 400225 468144 517146 513018 491608 457345 399813 344749 260121 219065
10203 219065 214024 219204 237735 260687 238288 204334 177554 167267 174715 171844 172835 158788 150013
10190 150013 167134 194315 201244 215326 230063 216112 216742 193592 155733 144837 153188 166680
10178 166680 215854 225754 229894 255699 228764 216479 210428 207786 190626 185289 178992 169159 163284
10165 163284 188521 221858 224388 236440 257843 240200 234431 234299 228300 202024 192832 186128 215613
10152 215613 221300 209343 223411 232120 259482 267467 259789 233357 195348 163356 135432 137794
10140 137794 168906 186951 204025 206203 203895 205568 167603 131350 80564 64198 98141 105822
10128 105822 127104 135402 147462 143496 125481 129320 124558 95416 80839 96802 98170 85364
10116 85364 52475 64204 80456 106630 131101 96798 55429 57250 83190 109303 105694 44721
10104 44721 8185 15509 45937 75397 87510 81584 67969 22681 22189 25115 25262 38939 41634
10091 41634 30210 50629 71842 54332 43705 42923 63147 63602 36739 41874 67198 73686 45432
10078 45432 27886 43431 41824 44754 49878 61012 52471 47357 48522 58545 55494 64040 83298
10065 83298 88133 83474 102780 111023 122523 101127 76653 76157 61971 53759 74760 39449 39092
10052 39092 44424 69276 140326 169527 134430 111425 124099 110701 103898 139907 138641 110258
10040 110258 94581 108286 115066 110822 93842 74654 92475 103275 96922 91113 83882 108373
10028 108373 126259 108684 128509 136425 144624 152249 141749 116777 108992 103020 117505 108294 120747
10015 120747 112201 122860 159940 158740 164964 136762 129076 112673 108786 114065 86229 67533 55813
10002 55813 72173 96960 100625 106298 129308 158584 161933 169321 179683 174641 154638 166285 141722
9989 141722 129476 122684 98412 77305 101571 133192 147269 158163 144205 123037 85262 120378
9977 120378 159224 189820 187378 167377 152822 126789 148407 152630 152477 141786 179988 206982
9965 206982 209606 235659 214290 173154 167304 199213 201250 226387 239878 257328 270169 264947
9953 264947 280176 312781 327554 343744 314374 332818 338416 356664 374291 348289 328705 328377
9941 328377 351124 349782 354434 347555 343645 358917 372356 342852 329949 331927 346738 368681 416800
9928 416800 450368 482714 501038 499497 509549 518254 529878 564764 599568 622152 635591 621486
9916 621486 631945 658938 673742 690013 705394 754524 849373 914051 961005 1042937 1156508
9905 1156508 1281308 1461792 1643119 1876483 2224005 2640965 3158973 3774235 4510753 5396514
9895 5396514 6458580 7650341 8695607 9407367 9789508 9954821 10038394 10159619 10504862
9886 10504862 11173323 11985584 12545002 12517009 11716508 10405937 9142012 8232347 7843925
9877 7843925 7975035 8591055 9636730 11103881 12920201 14826420 16561946 18061806 19248583
9868 19248583 19963452 20142591 20168975 20485433 21248413 22305430 23322266 23931056 23918871
9859 23918871 23268449 22151043 20860023 19684731 18808690 18167852 17587407 17104914 17118969
9850 17118969 17795598 18957340 20312768 21615646 22664953 23227432 22931886 21798957 20262170
9841 20262170 19097205 18722031 19126480 19932716 20597942 20935221 20903917 20774454 20840959 21163323
9831 21163323 21577594 21773301 21623790 21139498 20622907 20452061 20836583 21487485 21955858
9822 21955858 22015163 21705142 20931287 19496528 17546255 15630186 14198721 13552853 13852206
9813 13852206 15172057 17416451 20266834 23261803 25758921 27181585 27347105 26609250
9805 26609250 25789634 25424523 25423376 25663273 26350488 27492695 28542151 28669404 27462402
9796 27462402 25142932 22300463 19657597 17860465 17215464 17732519 19336979 21890786
9788 21890786 25124742 28373143 30921574 32427376 33144612 33301554 32825670 32083597 31829618
9779 31829618 32403548 33488132 34482626 34950382 34903739 34589350 34204490 33920895 33612435
9770 33612435 32996853 31952719 30678862 29642974 29407205 30349136 32354645 34597729 36039758
9761 36039758 36133546 35117025 33548815 31721756 29807150 28207810 27436100 27648015 28490733
9752 28490733 29428370 30306556 31372849 32810163 34500009 36105287 37025688 36917115 35861623
9743 35861623 34273256 32755853 31773977 31482363 31525379 31289336 30357748 28731607 26567280
9734 26567280 23915741 20885035 17975477 15601794 13916899 12987796 12893613 13639122 15106969
9725 15106969 16962352 18619866 19462523 19259046 18306202 17152661 16275765 15913453 15866261
9716 15866261 15874664 15731430 15208691 14102265 12476782 10650556 8946680 7474281 6221691
9707 6221691 5212953 4415250 3814554 3403832 3082527 2791515 2522341 2325453 2208484
9698 2208484 2094711 1958178 1830245 1736109 1665110 1609692 1579637 1536754 1504479 1430793 1347412
9687 1347412 1296662 1237152 1187555 1138281 1106659 1079811 1058275 1056148 1043665 1031261 1017847 1027777
9675 1027777 1017721 987424 973481 976761 967117 934772 906801 888348 896920 875155 833770 821299
9663 821299 822424 816826 818294 840688 872026 865166 855916 841568 790352 779510 784180 794690 793811
9650 793811 762398 736206 731698 727833 686742 670005 645771 628141 616098 631358 647271 636076
9638 636076 619303 617642 609789 598013 576052 564328 574132 607828 587521 556227 595373 592182
9626 592182 540395 518261 543056 525623 504375 486020 465941 481511 515501 524966 517750 517402
9614 517402 504104 499588 499724 495169 500630 503408 508310 477633 450233 477896 505972 500674 453042
9601 453042 444529 444661 445525 447640 453938 461477 461253 466144 475655 479044 493475 466321 505765 546594
9587 546594 574462 581931 570721 558059 535025 537506 559642 572049 545345 529390 545413 570005
9575 570005 582002 617235 632969 657083 679862 719285 761343 783022 800579 841149 927178 998697
9563 998697 1060900 1133091 1228234 1328652 1453937 1569368 1726440 1914336 2140821 2404642
9553 2404642 2740995 3148757 3683324 4371413 5216150 6204057 7499998 9261244 11748587
9544 11748587 15012466 18819724 22439381 24703219 25199708 24370052 22536489 19774925
9536 19774925 16529737 13531931 11185424 9427984 8122963 7233567 6645572 6335041 6243068
9527 6243068 6387786 6786364 7497984 8520959 9891570 11717638 14042849 16731410 19498578
9518 19498578 21856180 23348808 23870527 23614424 22901640 21504993 19363635 16856845 14362631
9509 14362631 12177084 10441875 9174974 8289035 7750429 7604922 7732050 8112309 8765866
9500 8765866 9686718 10919486 12575329 14872981 18037189 22363217 27739850 33529824
9492 33529824 38662856 42296646 44420717 45210181 44115317 40833410 36134423 31029796
9484 31029796 26159538 21939456 18660856 16323885 14680039 13572526 12935807 12789296
9476 12789296 13163234 14131487 15720123 18020290 21199715 25331059 30185213 35156357
9468 35156357 39296187 41947899 43307817 44184253 44730400 44291964 42478191 39702099 36672744
9459 36672744 33822578 31330989 29143738 26981560 24732355 22671665 21028824 19635894
9451 19635894 18175800 16598395 15244511 14423389 14234753 14709266 15821880 17490099 19634215
9442 19634215 22064629 24619704 27116541 29197141 30352998 30409484 29766957 28888160 27976047
9433 27976047 27140605 26229476 24927066 23031587 20852558 18819405 17001367 15427550
9425 15427550 14272696 13660759 13655235 14309502 15735857 17747092 19950082 21892235 23355735
9416 23355735 24654712 26207979 27958826 29406370 30266894 30770568 31220298 31793311 32514787
9407 32514787 33062401 32915962 32045956 30865159 29675334 27972549 25406531 22228219 18950516
9398 18950516 16041081 13693466 11905807 10640046 9790506 9326237 9189987 9340287 9817425
9389 9817425 10625458 11894942 13724391 16174733 19176077 22464993 25630666 28122933
9381 28122933 29314339 29126459 28015875 26146551 23279066 19654961 16050256 13041684
9373 13041684 10765004 9167775 8072442 7256254 6572514 6035357 5658009 5448801 5418023
9364 5418023 5591250 6024328 6699399 7655843 8908596 10469018 12145137 13655108 14735850
9355 14735850 15281697 15492112 15372073 14696581 13434311 11804352 10093975 8532190 7241578
9346 7241578 6260030 5486315 4890716 4516506 4356372 4341905 4433682 4643936 5050930 5713993
9336 5713993 6681844 7994712 9712750 11731906 13607290 14944364 15629311 15682418 14814875
9327 14814875 12955961 10610112 8429743 6694221 5478369 4627209 3968334 3429349 2997432
9318 2997432 2654682 2383465 2154211 1976647 1829953 1683699 1572258 1512820 1475611 1443075
9308 1443075 1429531 1393354 1369034 1345952 1325791 1264069 1163079 1051970 1022215 1012909 957184
9297 957184 929977 934112 919763 886895 853618 827930 794616 775185 771694 758903 743203 729321
9285 729321 707307 655327 631092 618072 610080 616226 655083 683149 681585 639759 632737 637989 581538
9272 581538 555410 572687 568892 557430 561072 573333 563709 569093 556331 565361 566866 561630 562678
9259 562678 566200 566201 539086 530838 520300 490355 492215 515636 525003 533882 550683 564722 534051
9246 534051 506009 483562 478836 443214 443978 461486 456141 431809 408207 437022 475254 478330 459630
9233 459630 442858 448156 460787 458679 452022 458478 463958 474265 477092 500047 509769 493426 488767
9220 488767 509383 537917 514341 503580 501132 484428 459561 473220 499743 533743 569461 575239
9208 575239 603009 607042 604059 628547 666414 712093 736441 793901 835355 857808 903680 1006494
9196 1006494 1102290 1195601 1331935 1488080 1642155 1827170 2091571 2397965 2691126 3036076
9186 3036076 3428598 3862133 4263414 4605365 4816062 4855883 4720380 4419217 4030039 3613369
9176 3613369 3178238 2840440 2536490 2247847 1991398 1763685 1561849 1370568 1218701 1105885
9166 1105885 1019982 934078 859656 792058 728145 661892 617843 592405 542978 473306 458102
9155 458102 465698 438821 393674 357878 350130 329295 329136 327253 319970 319968 315519 300266 301779 313657
9141 313657 290725 255943 254369 260665 266727 281249 296651 284360 289521 298032 287361 285010 261452
9128 261452 260263 266993 255427 298463 304181 267277 251336 238625 206154 153117 144140 141799 127875
9115 127875 125334 126798 121461 135474 157955 201253 176207 177131 201616 219285 233029 257742 270236
9102 270236 301154 292100 258070 241918 225218 214899 190822 177190 214071 178021 175194 186819
9090 186819 185473 181191 172715 176647 187657 202347 212794 224055 239753 282626 327659 352498
9078 352498 359223 367927 354777 346637 336596 318203 296177 249141 196464 167403 174775 162604
9066 162604 134504 148885 173779 189325 187752 164126 149383 172868 208132 244136 263948 267217
9054 267217 299827 337621 356489 362073 364631 397972 357036 321217 312078 277931 259616 246915
9042 246915 222600 224167 217607 215018 201692 182867 159078 123621 142658 148455 137936 143283 158109
9029 158109 153321 163760 199327 209578 222987 228038 242051 250363 224869 189783 142773 155225
9017 155225 155602 143416 130686 154679 173028 164733 142413 143795 147738 169209 167877 183782 203962
9004 203962 215264 237013 223812 196428 189533 197196 216906 221901 236836 251975 257282 251101 253052
8991 253052 238399 209069 193849 194809 164317 169498 144178 111654 96553 76486 70482 72048 72467
8978 72467 93688 106352 118715 128301 141009 154755 180005 195310 206116 196903 197823 189458 199955
8965 199955 202003 183502 189894 191445 142814 115923 132015 115343 92921 90430 99294 95739 91944
8952 91944 97750 101922 114036 115012 86393 84393 108812 129461 133885 132349 142729 134461 116304
8939 116304 114405 135446 136190 141687 138970 123051 97583 93019 85828 80524 85441 63962 60517 82438
8925 82438 119606 118373 98859 95636 95372 119992 131592 137660 130580 125282 140994 122177 112332
8912 112332 104762 108200 83086 73899 85171 100616 113091 141555 129165 122650 101277 69337
8900 69337 71793 79936 98313 118745 119271 127760 149450 147777 180374 205868 234953 263102 294878
8887 294878 373592 469461 562200 758763 1106387 1668619 2453558 3264223 3454220 2829442
8877 2829442 1994841 1372575 990861 736082 557842 487863 449620 447159 389037 341197 285008
8866 285008 232250 199553 165220 150532 132475 110619 116553 89557 69133 88380 107510 82190
8854 82190 61356 52376 43284 63217 65433 51970 43191 30029 19543 21045 34570 37050 19014
8841 19014 733 18493 37215 28164 24678 18464 50399 97915 115204 105768 100671 72457 71531
8828 71531 72291 74627 52661 28960 26720 41474 48286 78261 86799 77818 51677 33462 12743
8815 12743 18723 30711 50092 54890 34286 -1958 -4059 -10776 3806 8632 25132 35264 28734
8802 28734 26652 40302 64684 70927 59788 42740 44760 64479 32688 25320 40995 50485 50787
8789 50787 41868 34706 31769 22625 8886 10218 35493 38061 47954 43007 39013 32469 11063 3484
8775 3484 24653 51887 54571 49485 62688 19329 3026 14119 21869 33417 48950 81592 77349
8762 77349 65749 63436 54205 53254 59027 35751 21924 40202 42417 16502 2361 32961 71501
8749 71501 59949 58856 52416 52986 29884 27256 35737 34470 32141 35156 31502 28002 19860 16671
8735 16671 17616 20375 12419 -15714 -15847 12219 31514 43487 28270 47885 45770 30678 40312
8722 40312 34504 7671 2947 20184 19710 26851 40789 21579 21998 28188 17941 32572 37136 33241
8708 33241 23962 47755 60296 62820 62079 76293 99531 87563 61953 65279 63558 64328 75211
8695 75211 93836 88898 84366 82696 82426 101274 66821 50893 61957 44185 54080 61572 72009
8682 72009 81150 84798 81679 45607 55691 45675 37907 46661 65837 65507 69008 75444 72321 81221
8668 81221 96651 87231 78970 97593 115475 80493 78907 93021 100851 103156 117051 115727 122589
8655 122589 112645 102023 95318 90515 110658 102212 85366 68085 65311 74751 98382 112507 98138
8642 98138 44379 57037 63849 60993 79866 63213 86623 95905 82684 96516 119839 120906 96565
8629 96565 73774 98574 108264 132057 144455 155210 150994 127375 152089 172654 190146 175530
8617 175530 177848 207505 223493 253529 258795 241464 227976 194186 178179 181064 216306 236433
8605 236433 252327 248118 245325 251853 284468 301964 312706 306326 277916 258086 242126 198020
8593 198020 170361 135165 95075 85141 65167 49996 59559 62375 70029 92829 94105 111525 110905
8580 110905 106249 87078 45196 41634 41824 50359 36440 32799 40570 80580 92787 91234 89670
8567 89670 65951 46765 49047 64784 78019 71134 69310 80519 76695 55240 76032 61330 72180
8554 72180 79987 68182 19282 26184 51738 51977 45440 49277 44438 26013 27760 64934 43411
8541 43411 40431 43995 49433 30528 40153 27396 -14087 -5945 23158 28017 23265 38388 25740
8528 25740 20344 20263 16677 19539 16340 14833 -15171 -3372 -12724 -5955 25863 53070 48234 38787
8514 38787 21037 6375 9992 26397 55880 63276 51308 40616 30367 21141 48433 80337
8502 80337 54716 50722 53642 34397 11647 27783 33841 6960 -19225 6792 42161 30338
8490 30338 53652 86160 92298 43949 -2371 11662 32083 51582 45020 18924 20847 30174 29662
8477 29662 18073 23706 33382 50909 41048 45069 31314 21497 30784 39711 22844 -3108 3338
8464 3338 4443 12118 39817 83226 75875 74446 68025 64760 33270 19681 30467 -6816 -13585
8451 -13585 -3982 -4288 18556 57495 66387 74863 70456 86916 58355 17526 7386 15972 -12921
8438 -12921 -19268 -25558 -26523 -23234 -25017 -24225 -16356 28323 51334 54907 54023 46999 30340 41801
8424 41801 65179 62795 28825 19807 13896 31509 47934 26231 -5560 -23109 -4947 16475
8412 16475 26763 15355 40284 31027 16872 17359 12361 13596 29063 36370 42479 25193 10557
8399 10557 2033 1736 -14245 -20715 10078 22060 44339 59714 51754 33307 29659 33920 36385
8386 36385 65960 54178 45427 30376 22934 22424 -838 -5169 38585 37107 318 -19485 -12749
8373 -12749 -12742 -20745 18722 41288 33352 21249 28365 37757 30747 39561 26373 -6307 -18960 -17873
8359 -17873 4502 8420 20286 21395 6688 5788 -3019 22016 40243 27968 30774 5704 -21302
8346 -21302 -19057 13323 7674 -549 3321 22974 43713 56753 49035 23230 13520 2804 17400
8333 17400 22180 32538 26888 21863 20558 12352 21028 -6703 -2197 37693 44563 36631 27356 30391
8319 30391 40810 36854 56556 30989 28603 7698 -3337 -1988 -299 -3077 11748 39777 41539
8306 41539 24874 14623 14860 13351 21500 47787 42995 52556 29388 21090 1850 17814 25560
8293 25560 29944 47482 26167 15388 15741 25901 28319 21752 19925 38404 12169 -6134 -20041
8280 -20041 -20675 -5660 11921 16252 3784 -15568 583 17629 12624 16605 40061 41567 5874
8267 5874 1021 13332 11936 47017 57256 69422 64337 28906 -9854 -25684 -6247 48020 49710
8254 49710 21513 26390 42183 42134 28389 26705 38732 42494 40969 33255 27102 14939 29923 19401
8240 19401 26208 18370 -5327 10225 21397 42903 56395 57419 53444 73566 58997 31151 23126
8227 23126 23879 45441 36860 -2232 -47669 -31661 -5872 7288 -12971 -10955 -14919 -20570 -10975
8214 -10975 -1672 -10356 -10784 -16127 -10031 -15565 -23737 -15223 6829 14753 16584 9252 -12609 13127
8200 13127 58576 49632 40526 24 -19301 18876 13489 35234 18852 -15272 1118 38641
8188 38641 49565 34198 37728 35727 26167 2471 618 30708 39240 32777 58975 35983 11862
8175 11862 32998 41997 10356 -13051 -3749 32143 59316 71277 54065 41257 50903 79379
8163 79379 88063 64159 61516 73620 59383 45804 30673 38260 45581 52548 42249 11550 20546
8150 20546 29362 2762 -8733 -10708 -13258 -3197 -22943 -35888 -16800 -10898 -5677 15038 17942
8137 17942 7462 4582 19002 26677 22243 5744 -5061 -15032 -14562 -37329 -32468 9793 46770
8124 46770 63903 74292 115146 133001 107582 98078 91183 53744 7912 -18669 9725 34836
8112 34836 26332 -4307 -21900 -8087 -21780 -30221 -6359 18294 18994 10944 7396 20381 19151
8099 19151 6746 3477 26417 18153 18728 29902 31513 16827 -9105 -6527 5365 -5025 12933
8086 12933 32713 28174 13043 9053 16395 39185 57723 54118 54897 62895 60816 50070 28657
8073 28657 37947 41569 70220 54702 43683 89294 122226 109335 82246 59417 39880 11850
8061 11850 -7352 8784 30063 32475 37512 62367 69261 78737 98603 106274 90749 63705 68897
8048 68897 65924 93930 102972 112080 135461 124507 106258 89485 76179 78866 58914 29226 5071
8035 5071 841 33822 38855 58126 45555 34333 28910 50100 68083 56408 33649 42322 31777
8022 31777 31083 63862 71388 69029 95919 104016 91157 75418 80576 115962 150857 152731 141294
8009 141294 147692 184394 141771 116521 121793 126103 120956 111643 126567 166912 173484 163009 139245
7996 139245 93882 70053 71493 77370 55143 33729 21251 6658 16713 42027 28148 -7560
7984 -7560 25668 44891 45511 38097 39140 34428 10551 18449 35651 56117 53728 73786 92790
7971 92790 94426 107682 128270 135439 159378 165455 167547 145495 79455 65391 99981 120516 129369
7958 129369 149722 135851 115718 92986 60364 44236 60994 82103 83597 47707 38664 50208
7946 50208 50224 32167 43839 16655 -27783 -26614 -17613 -21917 -21692 -1056 17895 15420 13616 8286
7932 8286 53364 59043 71039 68753 52000 57692 75765 104433 113885 96348 84758 71600 42469
7919 42469 55052 65735 44421 15096 23085 32268 41289 31541 13104 37003 39174 26583 24196
7906 24196 8701 15746 665 3785 16263 24794 13219 -533 -5560 -494 24510 20126 58233
7893 58233 66886 36063 2161 5732 7661 17939 21170 -19104 -6814 -609 -15030 1925 14374
7880 14374 -542 -43679 -37108 -41069 -39698 -11522 165 -11833 -30889 -40284 -48818 -42884 -44338
7867 -44338 -47184 -43615 -32735 -2294 15057 -11522 -12506 32832 37627 44560 63914 38471 21599
7854 21599 11919 -8302 -2861 -20100 -18400 -17847 -29241 11753 13741 34817 34472 39130 16744 469
7840 469 10381 23838 2771 -16738 26781 42258 40849 23463 7079 3941 267 -2555 -2125 -6136
7826 -6136 -5229 19082 19542 20193 26242 7716 11087 16023 -3307 -3464 -13241 3427 18648 24304 17813
7811 17813 13237 12377 792 -15010 -30173 -6190 39346 45755 21803 -18662 -16356 -24556 -12136
7798 -12136 -3657 38040 20365 11518 11735 12300 -1684 10142 1160 -5033 -13298 -15757 -22131 -23271
7784 -23271 781 -2019 -16119 -4844 17940 29193 13911 -5093 -5241 17403 5009 6998 30507
7771 30507 1411 -7146 -29885 -28426 7769 -15554 -15339 2911 23216 -15340 -35543 3008 -172
7758 -172 -26181 -42547 -26561 -11278 -10220 -3405 -25288 -54195 -58581 -36600 -13716 -19426 -24043
7745 -24043 -22463 -11260 -247 8544 1281 -5234 -22075 -28930 -20836 11928 27760 13164 18790
7732 18790 21334 11756 23999 -2068 -23801 -29476 -50763 -44529 -2081 18722 24795 17856 3434
7719 3434 -19686 -44904 -17324 5052 29977 33597 22033 11592 -15350 -30483 -43217 -31759
7707 -31759 -7309 20005 38703 24355 28417 37936 44331 20874 14942 7764 -8465 -22974 -11894
7694 -11894 -22050 -17525 -19755 -14923 -15923 -11794 19562 -3524 19067 32361 16884 -1783 -17766
7681 -17766 -37211 -42329 -14642 -26417 -34501 -52101 -49092 -29078 -17422 -3657 -4893 -5111 11001
7668 11001 6403 26738 26033 -2817 -17195 -27370 -7742 15610 19954 26983 47618 14073 -26678
7655 -26678 -27483 -13414 -4377 -1531 20335 16690 -1376 2820 22357 -14111 -57471 -78775 -70388
7642 -70388 -48349 -4666 -5517 -32937 -21107 3828 5001 22839 29408 1094 -43451 -46077 -906
7629 -906 -3278 9631 34552 22816 19404 35004 19631 5608 12478 -10305 -12319 -11990 -24322
7616 -24322 -37964 -53451 -32633 -21818 -14926 -12883 -6128 -19379 -37714 -47461 -39050 -33666 -40083
7603 -40083 -36101 -25946 460 18676 19351 21704 27857 28170 10595 927 7938 6637 -7019 9817
7589 9817 -7780 -16197 -29246 -40180 -21536 -6663 9133 6642 4774 -17198 -31113 -63304 -54113
7576 -54113 -47494 -40371 -33253 -46435 -41067 -27946 1274 22794 17410 18618 8172 -4028 -1168
7563 -1168 -10969 -13127 -36297 -28653 7290 43172 35919 11088 -1464 15235 8505 -2254 5193
7550 5193 22490 36206 45044 20250 2360 1902 -7670 -13436 -15730 -172 1704 -17046 -17645 -11072
7536 -11072 -7125 -2130 -3556 -10098 -6385 4055 -24258 -20024 91 15058 3406 4392 -361 5382
7522 5382 10260 20554 23559 7441 1034 10360 1037 -4051 9678 -7177 -34376 -32370 -35178 -27542
7508 -27542 -7841 -3509 11701 11070 23390 20278 -5046 -24050 -36109 -9327 22890 42797 38924
7495 38924 19357 3498 5232 -6137 -32678 -56906 -55993 -55690 -50753 -39322 -50185 -40233 -49997
7482 -49997 -51824 -28281 -17569 -15798 -9142 -5274 -23657 -15065 -13851 -20379 -26434 -20035 -8824 5642
7468 5642 5541 -3671 -11356 -2295 7982 4851 -3768 7955 20965 30370 35671 7436 3565 -7612
7454 -7612 -10067 10352 28064 -17772 -54881 -80882 -45205 -40843 -35137 -14688 -2552 -19517 25432
7441 25432 54683 5240 -8958 -4497 12374 20777 2170 -12446 -34979 -21855 7327 13490
7429 13490 30278 32209 15479 38075 36229 17758 16472 17795 -2388 -41823 -35643 -21984 -19076
7416 -19076 24487 24930 20192 12176 -18956 -29886 -8030 -6080 10477 12319 16394 19418 -1875
7403 -1875 -24771 -19571 -28000 -21861 -26435 -29476 -19806 -32224 -39925 -31594 -32611 -36350 -32774 -14245
7389 -14245 -8736 -15558 -8843 15705 38374 24033 9553 3891 7245 12101 799 -28278 -21316
7376 -21316 -15233 -26524 5548 1642 -12643 -24116 -34138 -41909 -55931 -28063 2588 -3547 -21078
7363 -21078 -28250 -29487 -18304 -8340 -27222 -21373 -8666 -17633 -15985 -18810 -6784 34648 52022
7350 52022 38402 33457 39673 48080 9914 14436 3443 33501 37549 -5305 -29537 -49938 -20519
7337 -20519 -4099 7953 24502 -8047 -9115 5294 22047 10659 -8089 -2539 15799 25715
7325 25715 15604 5150 -7614 -16866 -9746 12791 3112 -18419 -12546 -9877 -12232 -946 2246
7312 2246 15085 6071 22949 22889 10165 -5771 -11780 -22362 -20686 -20415 5132 -3450 -29701 -20218
7298 -20218 -4630 29761 42891 27435 -3030 -1613 5309 31375 50792 43800 22849 -16680
7286 -16680 -42427 -43724 -63502 -58003 -47135 -49006 -19936 -29081 -4491 24138 40963 51117 61393
7273 61393 42997 30374 24488 26035 38359 18999 -33797 -28137 5137 12986 39455 24753 -1280
7260 -1280 -7987 -20824 -24101 -48740 -48921 627 -14866 -4266 18396 -10589 -17194 -11117 -374
7247 -374 7174 32728 32784 3685 -10827 -13163 -24981 -31968 -26631 -8256 4553 -2906 -12239 -4048
7233 -4048 686 -26406 -13301 8077 3097 15234 17949 -4813 -11252 -11014 -12629 25406 37602
7220 37602 1245 -31195 -41305 -43593 -33558 -3947 10102 -21145 -39282 -24023 -29359 -20570
7208 -20570 11004 20106 24157 8507 14503 13859 25546 27547 37312 37046 22499 27422 44238 21117
7194 21117 -1817 2751 -6393 -6455 12306 19245 -4368 -16056 -6313 -2201 -9439 -24949 -37641 -20640
7180 -20640 17795 22147 28126 29199 13665 -2817 -16354 -24376 354 36069 29881 13464 -7588
7167 -7588 -20526 -8155 3469 -6936 15398 31127 51395 23296 10537 -2862 -21275 -32314
7155 -32314 -20050 7633 12884 -3791 -18776 -33394 -39806 -34581 -29224 -7720 -8938 -25599 -33530
7142 -33530 -38077 -41952 -25828 -22526 -20405 -23649 -28368 -13018 -33698 -43973 -66982 -89215 -94178
7129 -94178 -85623 -45790 -5960 15243 35191 19298 -31860 -43684 -33562 -687 39141 34510
7117 34510 16746 9653 19660 10872 8255 12444 -2796 -22277 -25993 -7183 -22127 -26979 -3799
7104 -3799 36912 50437 47661 28419 20377 -349 -7143 3537 20157 -2631 -33386 -30708 -28663
7091 -28663 -17474 3076 11064 -19846 -30157 -28383 -28323 -21115 -3358 31382 54416 53916 43592
7078 43592 27827 23642 22031 23172 14159 35664 32991 13920 -5339 -21613 -29744 -25723 14090
7065 14090 15925 19901 4148 -16495 -14655 -13243 -14097 -10583 -8322 -10745 -37956 -54847 -46292 -24889
7051 -24889 -2493 -18773 -25097 480 25127 31169 30901 23172 9556 542 -4882 -11020 -9228 -22752
7037 -22752 -23066 -39518 -24100 -11767 -46070 -38841 -18066 -23547 -35483 -58979 -6459 7793 2347
7024 2347 -861 21549 43450 41287 41181 28607 37797 51599 41339 7105 7071 538 -12262 1204
7010 1204 23253 45215 33637 18251 -2253 7295 22522 12742 -5666 -10444 -33383 -36548 -36776
6997 -36776 -43313 -40179 -56633 -47434 -49641 -60804 -48534 -41237 -25462 -25274 -13112 2608 -3936
6984 -3936 -13618 -16280 -9377 -1896 9195 14449 -11043 -18501 -14017 -27939 -24895 -30681 -35418 -21544
6970 -21544 -8636 -12650 23249 6122 -8919 -46730 -23839 1691 279 -9404 -7634 -22958 -5568
6957 -5568 14705 8712 -8164 -25658 22537 37888 17890 -10491 4462 -10897 -16790 447
6945 447 9504 25877 50837 32013 21360 14761 5543 12096 15056 29141 3333 -16212 5251
6932 5251 6247 13106 -1822 15582 8707 21574 8489 -31915 -41186 -34200 -24079 -20294 6669
6919 6669 33498 8594 -2688 -6919 28549 22791 -16258 -34838 -27455 -19165 -19912 -42583 -47702
6906 -47702 -24503 -17601 -11459 12288 22641 4501 -14177 17733 15073 1592 20655 19384 -3188
6893 -3188 -26318 -44075 -49904 -47373 -43420 -24011 10811 9092 -26617 -29738 -6622 -34939 -6291
6880 -6291 37237 38005 37085 -401 -15458 -39154 -45879 -27938 19691 44615 18138 32890 38929
6867 38929 11972 -19060 -25522 -10964 -21477 -45547 -41173 -6319 12466 12753 -9264 -28293 -46541
6854 -46541 -52810 -33457 -4268 -3043 -21237 -20883 -11352 14835 31108 16951 7956 4458 10942
6841 10942 138 9686 9723 -2969 -36086 -47552 -50777 -35111 -17566 4736 23839 35168 28760
6828 28760 16115 10695 12341 5606 -747 -25852 -17311 3683 -11903 -2028 1798 18047 12041
6815 12041 15398 18999 21007 33656 34606 -857 -6947 -2396 -20865 -15918 6457 -5057 -24774
6802 -24774 -46008 -40294 -3036 -24839 -23648 4293 -3504 1883 21367 15837 35920 32210 -14414
6789 -14414 -3208 13840 -443 24089 26057 30933 55509 61836 20760 -304 17205 45282
6777 45282 35832 9967 -13612 -21868 -11187 -22026 -18459 -3158 30152 14347 13451 10537 -10729
6764 -10729 3955 53718 40103 28340 25956 33975 56015 52006 37468 24404 23104 15268 7841
6751 7841 15623 26126 47070 50536 48185 42305 20456 3924 -5675 5980 27099 47593 24930
6738 24930 29844 36987 18738 14395 11312 -17030 -10850 26819 61349 74198 99006 125701 140930
6725 140930 142409 107116 94037 78639 42030 22521 14970 -8522 -38490 -35005 -50914 -53645
6713 -53645 -19148 -6387 -7109 -11993 -33164 -30241 555 18082 19375 13110 -9931 -23922 -17391
6700 -17391 -27685 -26529 -35833 -49425 -27016 -22487 -37857 -28871 -33895 -27298 -21680 -6246 34902
6687 34902 58730 34368 -10878 -448 680 21327 23087 39858 46437 37385 25258 5856 -4320
6674 -4320 24207 34947 21521 14917 14402 15223 19364 14294 269 -33569 -47734 -66393 -79848
6661 -79848 -80709 -77657 -47402 -21719 -26893 -22072 -22675 -21169 -24682 -32063 -38719 -72174 -61770 -32506
6647 -32506 18048 39529 1242 -2347 12245 -2278 -7216 20675 47243 13989 -7722 -10711
6635 -10711 -19417 9223 1017 1564 -5119 6241 -23581 -19677 -10018 -11566 -7435 -9525 -17245 -18501
6621 -18501 -30186 -58751 -38488 10501 31090 56022 49049 36396 8784 -21946 -26415 -25672 -16357
6608 -16357 -27643 -41177 -43245 -26316 -25110 -3935 -28389 -19861 -18893 3944 9180 20483 13979
6595 13979 -20755 -2591 27508 23087 17850 11671 37559 27234 20399 21467 6097 627 -13807
6582 -13807 -11279 -5926 -5856 -23224 -47735 -39279 -13792 -11554 11161 6554 -7839 -1638 -4726 -11163
6568 -11163 -28666 -50909 -54594 -54040 -62410 -27606 -6930 -17294 -29931 -20316 -3552 -19892 -19294
6555 -19294 -22985 -22368 -16660 -14577 21907 16972 17881 26517 21105 8700 5868 -16530 -36892 -37550
6541 -37550 -16740 8582 3341 -23995 -7102 -33330 -52012 -31168 -26853 -24038 -17960 -7309 2375
6528 2375 -10198 -1584 8697 23060 45811 56142 75983 74619 48196 40376 20084 18692 35683
6515 35683 34847 18454 14799 6596 -13643 -11545 8412 14950 -14043 -41524 -45596 -24249 2
6502 2 -3514 8547 30851 12962 -4604 -2761 -10173 2 11708 -111 -8157 4398 -5498 3978
6488 3978 36042 28267 -13004 -13718 -11733 -28623 -35149 -16582 3548 12341 -29081 -51933 -54878
6475 -54878 -42586 -1119 403 -24650 -48309 -38187 -13188 -752 -2973 5289 8322 16889 10443
6462 10443 1973 -915 -12554 -5335 -5372 -12604 -23610 -34472 -49977 -27129 -729 -5929 -5704 -8739
6448 -8739 -4188 15421 24696 -13119 -4827 -13178 -17094 -263 22093 21522 -10125 -26898 -20084 4294
6434 4294 15692 24541 38035 25076 -1128 -12242 -22077 -42929 -43707 -21536 -10623 -24919 -42535
6421 -42535 -65268 -61659 -24221 4894 3282 26358 13243 -1109 -18709 -28818 -15147 -20795
6409 -20795 -42050 -49832 -19472 -14075 -23010 -30867 -43677 -42618 -34391 -16202 -19823 -44685 -46324
6396 -46324 -46682 -55870 -46124 -34819 -8805 27498 44039 33927 28676 23439 18864 22448 4558
6383 4558 -627 -16807 -1576 13914 15663 -3442 -13852 -14936 -2307 27415 9350 7786 8094
6370 8094 -17543 -18787 -5253 6399 18452 19189 13161 16064 5692 -14378 -43591 -49869 -65027
6357 -65027 -44212 -4239 -365 40673 44138 25686 33663 15592 -18905 -9987 5928 14422 16864
6344 16864 11620 19386 27405 5245 -28862 -20721 13900 10194 8708 18514 29050 38429 39124 40712
6330 40712 23183 -15180 -8261 3830 -12347 -14988 -10491 9086 15722 8543 -14946 -2160 3492
6317 3492 -5619 -2235 7828 9882 -8273 -20172 -24302 -19771 -15440 -7646 1656 -3758 -7647 -16606
6303 -16606 4255 34770 7474 -2903 427 849 -8860 -6442 47946 63636 20680 -20692 -39511
6290 -39511 -11106 -11253 -26759 -22905 -31902 -7405 -2774 -12379 -19123 -64123 -54879 -19198 -20093 -18927
6276 -18927 3670 23505 860 15176 27643 27122 36714 47564 19706 -14621 -35182 -55377
6264 -55377 -49283 -45197 -27865 1376 22897 43489 51801 80336 71862 52236 27639 58940 49259
6251 49259 18370 21500 26411 43496 54306 37507 4498 -17005 -21877 -3123 27957 28310 27192
6238 27192 36077 20726 20876 34859 34704 3461 -16981 -24158 -31741 -46399 -49266 -17119 -13051 6553
6224 6553 5914 -16129 -13920 6314 23482 19932 26227 25221 26169 59573 44477 11296 -15608 -33992
6210 -33992 -48893 2438 7371 -23891 -28928 -12483 -4483 -14612 2881 -5366 -41579 -50481 -47192
6197 -47192 -47777 -14237 6818 20479 23250 9833 -6159 -23236 -13151 -9126 -13903 -8683 -17318
6184 -17318 -30637 845 13150 13620 -15282 -19409 5868 2950 -12490 -29741 -17290 2443 -7945
6171 -7945 -23111 -8443 14063 21044 8300 -1050 5133 -16013 -29817 -20294 22389 39386 20477
6158 20477 -22235 -36581 -26794 -13126 -6183 16765 32986 16747 24152 6123 -22029 -44526
6146 -44526 -43345 -28975 -14119 18308 37614 33333 8983 -9793 -13787 -16117 -8453 -3107 12405
6133 12405 14159 -3053 -36987 -45130 -51872 -47161 -37700 -31615 -24490 -7060 -7581 -23138 -22243 -11021
6119 -11021 5821 -286 -28021 -17812 4044 -20747 -43444 -36248 -1239 30694 25771 25078 61093
6106 61093 57433 -2195 -32618 -22575 -27528 -16052 -14318 -13191 -7959 4471 42496 59702 23819
6093 23819 3239 12627 21804 -27292 -28596 -22317 -7065 -1796 -17227 -36781 -54430 -34634 -936
6080 -936 12857 -10770 -17434 -32716 -33852 -13327 9926 22535 18257 17303 12422 -1675 -1858 8706
6066 8706 15003 10374 16339 20789 36674 25508 32224 20830 25720 42966 32871 22294 7903
6053 7903 14793 32690 48022 35169 17913 791 4490 -866 -20812 -37508 -29230 -39403 -42504
6040 -42504 -45509 -34277 -1688 35659 18326 29501 21868 14466 6112 -11109 -4827 12583 33483
6027 33483 -10937 -18912 -1774 -15292 1090 24871 6322 -38543 -33652 7037 -1727 -7194 18161
6014 18161 20722 23824 17085 13933 19443 -4770 -14127 4368 12941 20442 21548 24062 47643 57956
6000 57956 25844 6348 -11684 -28342 -25428 -40981 -49229 -27918 -33042 -18681 25465 18625 19867
5987 19867 26484 28520 2151 -12122 -20957 -31229 -28339 -10676 -12246 -15562 -2558 5460 12561
5974 12561 5271 21552 17196 -10045 -32606 -15851 -17193 -25099 -6556 -5964 -9022 -6570 -2521 24890
5960 24890 31459 -5125 -22032 -50019 -74634 -59629 -52403 -24534 -8794 -13452 -30924 -23610 -29679
5947 -29679 -20017 335 -13246 -25117 -21270 -42849 -40935 -18959 20245 37140 22062 27586 27681
5934 27681 28225 10521 -1705 17329 29278 27149 13088 20505 12696 7811 2913 2851 -10412 -36932
5920 -36932 -33251 -31968 -42650 -12436 -7480 -21863 2832 40774 47672 10805 -9739 -16976 -26503
5907 -26503 -8174 7135 2946 -12222 -23374 -5917 25518 -5590 -20200 12517 17927 10682
5895 10682 18216 605 2943 8868 -17062 -17217 3150 -3151 -31184 -32056 -14080 -13213 6924 -16148
5881 -16148 -21000 2992 3308 8922 -18689 -28193 -30272 -35776 -49504 -7389 15586 16390 6238 -7102
5867 -7102 -8709 -17968 -9691 3733 -2311 6285 -2457 22155 23949 6613 -4557 -11154 4006 -19381
5853 -19381 -18574 -25930 -27821 2458 207 -1040 26255 20671 24965 33144 -13594 -48416 -26072 -35618
5839 -35618 -35412 -20657 -30818 -26330 3121 6017 -14058 -20687 -4043 8606 14117 18968 17110
5826 17110 -10256 -12625 -1088 2808 -24836 -17561 -15464 169 -5855 -38315 -4172 16436 16585
5813 16585 28849 17858 4490 1151 875 6577 27153 23251 5926 7691 -1158 -36805 -54084
5800 -54084 -49757 -28592 -11398 -17349 -12137 -24746 -35110 -23139 -6794 18059 12292 -18336 -18494
5787 -18494 -9300 -32821 -61341 -51959 -15971 6818 11879 -4787 -9999 16031 42555 40314 29523
5774 29523 5230 -20401 -3648 -1053 -1027 -18366 -19514 -15837 468 9129 13149 3645 -19857 -33428
5760 -33428 -47354 -28809 -8935 18519 39184 36421 27264 16646 -10913 -29520 -37351 -33677 -34055
5747 -34055 -30169 -47011 -26700 -39391 -48253 -49826 -40269 -44461 -55441 -53585 -28825 -15427 472
5734 472 9468 -431 5296 18116 21731 -3237 -10353 34368 49773 15112 4660 -9160 -12295
5721 -12295 -9560 -28415 -27662 12326 9010 16751 21148 2480 -15089 -14532 1637 6994 6743 -8986
5707 -8986 -12864 -8995 -12224 10205 28438 11177 -3617 -39570 -57170 -60651 -35048 -24131 -29286
5694 -29286 -29537 -50104 -49468 -55675 -79761 -76477 -61613 -21940 -9669 -39028 -33550 2480 13770
5681 13770 4777 10101 9494 8980 -18184 -19323 33889 40119 43604 26988 14120 13963 26701 13755
5667 13755 5598 4134 607 -770 -15334 -3749 -6809 11887 13605 24650 37414 30742 6794
5654 6794 -19062 -35296 -60980 -81255 -69096 -27185 -14738 -33802 -25258 -17898 -1996 -4 9834
5641 9834 14324 30341 8062 3896 6558 9917 21007 26951 1800 2875 13765 23265 16342 15381
5627 15381 7126 3175 15609 31395 19294 36332 22344 24869 21449 52288 48119 31607 13959
5614 13959 3184 7837 -14063 -22068 -9181 9997 22989 -2211 -30301 -27800 -17318 -31295
5602 -31295 -36393 -20962 -519 6183 4370 13546 5762 -2477 8133 -1729 14889 -18689 -57641
5589 -57641 -24003 4260 43946 13958 -25866 3849 17291 18246 17994 24202 -15325 -40497 -46432
5576 -46432 -44215 -26581 -19133 8757 -6175 -21773 -29535 -1906 -965 4987 1587 -9083 -14761
5563 -14761 -8262 21986 34653 14925 21991 31033 -1408 -18340 -12932 10228 -9542 -20372 5945
5550 5945 -2012 -268 -8592 -3269 7129 -3646 9382 -1936 -12017 -22202 -6779 10442 33515
5537 33515 35353 15739 35311 58594 50847 45567 79943 70893 10615 8071 25959 53528 73863
5524 73863 93460 85427 46218 29779 3783 -293 947 -17151 -2423 5059 16384 39348 27825
5511 27825 14829 -5343 -1423 8846 1016 -17673 -8867 143 21665 42609 23199 -16879 -9728
5498 -9728 -19335 -42946 -35315 -19705 -7297 -30300 -29439 6538 14915 6713 5806 22432 23572 24491
5484 24491 30417 32699 28587 24549 36079 28836 20285 24335 29123 40646 22697 16483 33669 -5390
5470 -5390 -28196 -24750 8717 9769 136 2788 42955 52031 18187 -603 4057 5919 -17513
5457 -17513 -32538 -41295 -4652 13549 23623 2663 -20186 -33180 -27617 -24472 -31287 -40569 -38965
5444 -38965 -19871 5809 -23841 -68211 -53330 -8036 -4219 -3974 -20311 3970 24401 10159
5432 10159 -733 -11676 -10703 -7588 21041 23069 -2118 -34504 -25836 -27119 -34052 -24940 -40902
5419 -40902 -34234 -35934 -58093 -51361 -32722 -31110 -28514 -3648 34573 40350 12569 -27152 -8464
5406 -8464 5642 -1341 11290 22538 28016 28453 -2440 -31076 -45461 -24110 -5699 10620 34094
5393 34094 50306 41343 20574 14301 8386 -1243 4253 -36314 -48457 -40918 -48080 -24915 -5406
5380 -5406 18201 9851 -15607 -18692 -25714 -9925 1239 11601 9743 21063 24943 8781 12700
5367 12700 19229 -2469 10391 45052 63421 62578 51417 13555 17078 30797 34768 8961 11552
5354 11552 3942 -407 3146 -5412 2621 23161 49408 42468 14558 -3203 -17670 -5466 3795
5341 3795 1266 19299 6871 12311 17072 -15631 -25581 -20347 4540 -3610 15499 29777 31098
5328 31098 25168 8175 -2359 9584 24127 17233 -9332 -11861 3899 16998 -4616 -4640 -13136
5315 -13136 -4361 2775 -1473 -12717 11661 18172 26584 34698 25876 22788 24500 16642 7832 -26687
5301 -26687 -43305 -13053 -20959 -19594 -7887 8737 6371 8287 7585 19641 32147 52772 51107
5288 51107 28595 38062 54635 53729 30606 6519 -82 4302 -12533 8850 35416 34640 4191
5275 4191 -14897 -27857 -47088 -38494 -22455 -17619 -22525 -23496 -7159 -17391 -31132 -32248 -23938
5262 -23938 -18496 -24790 -29865 -26601 -43971 -45521 -46381 -20306 1699 14575 -36311 -44523 -44349 -50057
5248 -50057 -42260 3690 31700 19851 12095 35616 36778 22615 -12598 -34396 -43744 -59609 -46631
5235 -46631 -30833 -31570 -2065 5299 -248 -26469 -21750 -4354 -17743 -18406 -8162 -12715 -23178
5222 -23178 -35761 -30350 -7555 -29678 -30355 -26036 4363 18856 37129 35568 71785 42618 40440
5209 40440 30132 11698 15291 37144 -8927 -12100 -27285 -33707 -12479 -6982 19771 24053 26166
5196 26166 22646 19117 2152 -24382 -28045 -48490 -48062 -29145 -27593 -21160 8406 36880 33693
5183 33693 734 5632 -7997 3126 35280 15630 4778 11941 17385 34216 32629 23858 32658
5170 32658 75375 60387 57308 47564 31846 6132 13910 11772 -11874 7253 5325 19680 22330
5157 22330 -13538 -30492 -43783 -31613 -40379 -52602 -51979 -34454 -8412 4755 6485 11711 10114
5144 10114 11011 2562 -4446 -514 18068 17465 -25352 -31118 -33047 -49939 -51491 -27134 -4319 4254
5130 4254 28223 26222 8367 10331 -9927 -6162 18934 8081 -10744 1336 -14322 -34249 -30585
5117 -30585 -11181 -15699 -21729 -24563 -18108 -18848 -35587 -41667 -2578 23887 24542 7335 -8047 -20429
5103 -20429 -24861 -32897 -27250 -38040 -70590 -87819 -51852 -25146 5764 8754 1238 24977 23061
5090 23061 4190 -10685 13907 33375 2492 -3676 5253 7021 -5980 -11244 12311 11379 9229
5077 9229 11066 -24285 -27118 -12910 -17545 -14023 5429 9908 2224 -6886 -4035 -279 -7122 -33872
5063 -33872 -40893 -31452 -39149 -44652 -40729 -38774 -13756 -8507 4230 -17015 -28623 -12835 1030
5050 1030 -10136 -22529 -14001 -844 -27605 -25486 -19629 -26967 -39268 -17507 3141 20623 1395
5037 1395 -16862 -16574 27682 8376 -11328 -25368 -30587 -30415 -15710 -4463 -7670 -12554 -3692 10309
5023 10309 3703 2888 -20265 -24947 3355 6805 -24027 -27010 5621 40482 60845 18983 26855
5010 26855 29952 -8796 -23006 -20289 -19659 -18512 -5681 21479 10163 10861 24547 12440 -1490
4997 -1490 -5878 -1798 -11314 -206 15009 28327 26318 28601 15318 21033 -3965 -50152 -63486
4984 -63486 -51967 -65581 -66024 -45888 -27900 -7194 -3529 -644 8597 -26815 7243 25249 34312
4971 34312 4844 -17736 -13222 -23589 -39392 -16100 25416 27336 16895 12671 -208 -24055
4959 -24055 -41822 -6783 28548 26225 -10282 -20637 -11684 10366 -11547 -19485 -19981 -28288 -15332
4946 -15332 -1550 -12365 -2363 19211 17127 26584 9964 -22761 -15433 -18073 -17212 -26551 -47595
4933 -47595 -75783 -63386 -38699 -22193 -2164 -8913 -20698 -41396 -56799 -50387 -31620 -8460
4921 -8460 -17384 -25546 -39187 -42220 -21985 -28872 -58290 -53148 -23470 10613 23277 24635 16106
4908 16106 12464 6701 9322 -8057 -2077 -12131 -2172 18579 14695 13988 5527 -10992 -27042 -12581
4894 -12581 -20113 -24976 -19475 -7548 -11751 -3693 7232 -4706 -30853 -23520 -16248 -68367 -68769 -68099
4880 -68099 -52453 -23682 -28696 -20982 -9595 -1316 4548 -2001 -5099 -19942 -24514 -20206 -18665 -11912
4866 -11912 -15017 -10037 -11246 -19112 -14630 -25524 7762 -3252 -4331 21414 17918 13935 6194 -11700
4852 -11700 -21983 -19067 -32101 -36049 -10982 -1305 -21592 -33214 -11031 26010 29249 46952 17925
4839 17925 -8157 -1775 13590 -5238 -30654 -21803 -6013 -3627 -9820 -4524 -4074 22954 27589
4826 27589 5243 -17920 -17634 -14884 -14320 -18828 -37565 -32510 -19805 -30978 -41630 -13616 -4896
4813 -4896 -13506 786 -21669 -22346 21344 1851 -12092 -20323 -12313 -3228 5342 1376 337 -2825
4799 -2825 -9196 -31095 -46676 -12532 -7056 4170 1396 27053 -5949 -19709 -16100 -31418 -19295
4786 -19295 -21360 -19455 -9486 -9018 -11179 -16749 -12717 28369 20209 31311 23008 5169 -25911 -55040
4772 -55040 -39448 -47110 -49144 -47350 -36411 -18799 -5811 5230 -13008 -37751 -19345 4579
4760 4579 -7022 -15834 -21125 -29623 -9753 -18832 -8065 -16748 -31570 -23652 -3704 -10908 -4283 6017
4746 6017 7761 40709 29478 -377 -2553 -13326 7396 34111 22414 812 -7538 -17865 -27798
4733 -27798 -20949 -21884 -5429 14946 13518 16257 18132 16490 23875 18291 -12716 -36074 -30611 1118
4719 1118 -17459 -29447 -35862 -33823 -8187 2115 4957 3359 10874 17044 18072 10337 8350 42320
4705 42320 45753 15248 16092 32448 -327 -13861 -24087 7783 35549 20509 -9471 -3893 24928
4692 24928 13478 -18507 -37973 -28900 -7952 21156 26721 18422 -13908 -18047 -19446 -16441 -27833
4679 -27833 -61296 -33512 1219 -14806 -13891 -28398 -38367 -74717 -41584 9023 -16411 -27882
4667 -27882 -38939 -38961 -25907 -38687 -41914 -42135 -55524 -42169 -33192 -22455 1689 2877 -581 10515
4653 10515 12387 -6838 -20724 -14652 3980 6177 12366 14467 -1375 -37023 -55634 -36907 1627
4640 1627 14399 9058 584 -22153 -37385 -35450 -26267 -31255 4338 19002 16148 12484 19072 40920
4626 40920 25181 27752 11521 -22897 -7339 18817 14116 33991 44921 49471 26622 -23580
4614 -23580 -23807 14947 23382 8757 -3444 11673 31596 32473 17559 20181 5164 1517 13090
4601 13090 9006 -11024 -7531 34290 34626 -20565 -62760 -54473 -20955 8255 5994 -1223 21990
4588 21990 45332 54933 50134 29694 14167 14289 38037 31469 25083 16419 3993 -18396 -50185
4575 -50185 -28262 -22321 -33202 -69955 -52260 -29409 -18093 -32849 -29142 -28601 -25694 -5484 3490
4562 3490 4536 -20883 -41122 -43445 -40901 -39593 -16255 -17568 -21843 -36227 -43675 -39161 -11984 14667
4548 14667 11727 -24710 -28099 -6316 10400 20900 22518 -436 -4609 15991 27690 37597 36028
4535 36028 24041 27973 15485 13311 14151 -11189 -11312 11910 17638 25176 32177 29064 7393 685
4521 685 717 -3345 -11011 -16976 -30617 -27069 -13177 -35903 -54762 -35597 -19250 -11531 21136 23562
4507 23562 44304 61817 27011 -3188 -14423 -15752 -21194 -25099 -34401 -28771 -25538 -33474 -25043
4494 -25043 -25174 -15912 -34337 -32673 -42906 -26726 12 -5141 -25448 -9139 4512 4568 -7964
4481 -7964 -9344 20206 56276 62498 28524 32578 35327 18057 27862 34546 19755 17602 33287
4468 33287 31953 17389 13520 -2236 -16879 -18198 -33144 -54712 -81393 -74145 -74371 -73711 -50861
4455 -50861 -17147 2129 -7225 -33425 -46203 -52599 -72009 -62198 -68247 -64175 -24178 7 -11601
4442 -11601 -11156 4993 7514 4492 5115 1186 -16547 -2897 15347 27471 46964 23923 9913
4429 9913 -21442 -33882 -768 -29261 -35951 -20520 -32048 -26603 1025 32961 25661 4420 -11593
4416 -11593 3784 3328 -19682 -3879 12901 18632 28345 9893 10980 13373 21502 18098 8212 25739
4402 25739 23657 -2898 -30691 -36569 -28452 -4871 8991 17976 17867 -12366 -22440 -26002 -15062
4389 -15062 -30232 -16248 -11939 6627 -2152 -9288 -17442 -25305 -5880 11659 -9401 -28653 -17883
4376 -17883 14583 14485 -19433 -5860 -16693 -35365 -22471 -6256 2107 -22943 -54104 -60762 -40699
4363 -40699 -21772 5947 10569 19364 31287 23059 -14703 -29657 -27199 -36717 -33850 -23746 -26275
4350 -26275 -40635 -19665 -12995 -8566 -7198 8688 -9792 -3729 -5473 7783 23987 49886 26861
4337 26861 25349 32229 32975 19188 26412 3727 12654 25326 -12581 -18235 -10407 -5523 -3348 -23469
4323 -23469 -40412 -57784 -51713 -19340 -36442 -41185 -58604 -57311 -58070 -67791 -29493 -21164 -41125
4310 -41125 -50117 -69354 -56892 -36198 -27766 -25291 -44831 -59561 -41683 -7129 6067 -7396
4298 -7396 -36068 -4860 11301 19643 30214 31461 37122 43043 44677 55581 33798 15335 10606
4285 10606 -3598 14329 28560 24628 17109 7083 -9022 9071 -728 -12832 -3256 -3839 -10888
4272 -10888 -18574 -62349 -66372 -49291 -42118 -31275 -17241 -17478 -32616 -26857 -13528 -16408 -19311
4259 -19311 -10749 -387 27567 35265 8806 -18249 -30569 -13070 -12715 9294 1718 -29826 -29941
4246 -29941 1870 -259 -18910 -12960 -8334 2913 1230 -8961 -12448 -31373 -27566 -17200 2415
4233 2415 10885 25449 38402 51930 7502 -13908 -17200 -10531 3123 -11554 -26141 -28455 -1858
4220 -1858 7399 -8126 -15354 -14580 -27815 -54597 -79107 -80901 -64578 -58448 -32753 -15960 -32601
4207 -32601 -40957 -18616 -12325 1457 16966 23167 32700 39420 36119 33035 39259 51402 41343
4194 41343 25537 6296 -18822 -29603 -33981 -30174 -10063 -6924 -14135 -18135 -45117 -60726 -70538
4181 -70538 -56732 -46403 -35300 -32777 -30949 -9289 4116 373 -18713 -25277 -13260 12045 21708
4168 21708 8479 -10264 -32878 -29225 -22484 -16311 -13811 -30307 -14725 -33310 -15041 -13911 -32992
4155 -32992 -36081 -25070 4758 11628 -10442 -1807 -4639 -10668 -20088 -40568 -49460 -35244 -17759
4142 -17759 -18037 -27891 -21398 -14298 -33529 -51329 -46914 -17863 -4598 -10226 -9391 29555 56226 40686
4128 40686 10294 1023 -6131 -42592 -32698 -1438 17869 5035 -11861 17236 24130 4525 7393
4115 7393 3848 4997 21661 -8410 -28267 -32249 -25786 -44399 -53846 -28625 -17109 -31403 -41254
4102 -41254 -43484 -30194 -6444 10687 28747 18987 9922 10523 28624 25297 9596 11918 -4532
4089 -4532 -12211 -2390 -14412 -20806 -14217 -10105 1016 1672 -2622 -1335 -9826 -8303 -29278 -25080
4075 -25080 8678 46222 36564 2935 1509 2027 -16539 -17065 -8943 8610 -17594 -36880 -17879
4062 -17879 3623 25202 26620 672 -2931 4612 1117 8755 2792 -6431 -35508 -58561 -50133
4049 -50133 -37170 -35680 -18342 -15691 -13012 -18997 -16863 -29886 -13825 16759 8870 11844 11182 -7133
4035 -7133 -8512 -8803 -15631 -7594 717 -9774 -25452 -28140 -31203 -16276 -2533 5144 11088 5797
4021 5797 -11950 90 13340 -7393 -14849 -8000 -7821 -14138 9833 -2276 -25201 -54612 -56001
4008 -56001 -35027 -27058 -12395 -1506 11160 -17525 -11056 -15429 -40494 -22863 -5527 -607 -11823
3995 -11823 -18619 -41656 -23983 -7270 -11465 -23592 -8638 20760 20494 1556 2002 20077 15290
3982 15290 -11365 -34687 -44712 -40086 -41739 -35903 -28737 -39814 -68242 -78897 -67235 -53825 -60074
3969 -60074 -47198 -24725 792 -10537 -657 -326 -23568 -45195 -48402 -26813 -6285 -1875 8577
3956 8577 -14321 -35417 -14176 8699 3636 5107 30654 30323 28389 27185 -420 -336 -12697 -50669
3942 -50669 -55433 -9315 18533 29293 22078 4569 -5994 -17907 -13349 -31338 -39070 -54594 -51400
3929 -51400 -39638 -17949 3870 21573 25893 5772 -10708 6236 24662 12682 -8945 -32893
3917 -32893 -26917 -18534 -34864 -7466 -16030 -8759 8102 -16628 -29152 -35547 -18151 5617 -7888
3904 -7888 -8725 -8943 -4739 -24193 -34964 -32850 -43181 -10293 -2351 2839 11033 13549 26716 18778
3890 18778 16772 13469 13474 29339 44043 50396 73092 69282 49022 8038 22328 20040 5774 18654
3876 18654 44504 35689 -4389 -5710 39593 42452 13860 3570 -14196 -45488 -32456 -13098
3864 -13098 1956 18016 4429 -10645 -4536 -8189 -7836 4817 -7586 -21712 -17770 -17735 -31552
3851 -31552 -15101 7307 22782 25511 18669 -4968 9931 15103 5193 6712 19456 2752 -5313
3838 -5313 -43227 -21963 -2179 10387 -903 -9896 -8731 -24331 -47948 -39603 -29108 -14186 16585
3825 16585 23579 -5644 15516 5721 -18757 -3117 -3155 954 -10930 -28966 -23321 -29372 -35882 -1815
3811 -1815 16080 -20927 -19387 -5261 6651 19206 34758 6207 21677 29991 2101 -11229
3799 -11229 12978 24089 25563 21347 26744 35010 29715 -3428 -4219 15037 5209 -2916 5456 -35432
3785 -35432 -26797 -7723 -25803 -36671 -30669 -26661 16098 32391 27430 -3828 17610 13538 -4886
3772 -4886 -1048 -7736 -4622 -13102 -22377 -2971 11889 -12596 -41720 -32056 -43184 -5497 4583
3759 4583 -715 30281 44389 17727 8037 21624 8496 16360 45829 -4499 -24535 -18103 -43761
3746 -43761 -29408 -3829 -3783 -2701 7088 11978 17458 35495 40147 13129 24008 32944 22026 -4117
3732 -4117 7270 25059 14439 13584 35841 28526 25910 23987 11249 -10912 -31453 -39075 -38416 -49924
3718 -49924 -30349 -16323 -26833 -32799 -10286 -12717 -33857 -33691 -23441 -12257 -25409 -4623 8147
3705 8147 7747 -13499 -28095 -22777 -32323 -10123 -10608 12441 36717 52269 22689 -8526 -31832
3692 -31832 -26743 -450 7777 -8104 -17449 -14985 -25666 -22738 -6725 -9028 -581 30392 36207
3679 36207 19134 6033 26271 29175 36356 16783 -12387 -8794 -16136 11010 46923 54480 46892
3666 46892 18911 437 8723 11007 9019 7220 2724 7000 20137 9185 12420 12483 1564 -15006
3652 -15006 -7182 -12470 -26194 -18097 -12871 -16044 -26518 -15631 4114 -4361 -8603 -4172 5451 7077
3638 7077 -6544 -18882 -12705 -33617 -44467 -46323 -37224 -37330 -12755 4218 6451 -9404 -2736
3625 -2736 61 13672 16901 9577 -3932 3292 -7404 -47327 -49135 -18757 -5454 18396 30443
3612 30443 10531 -9533 -6131 724 9033 2620 -31161 -35089 -9090 3410 45384 14136 -15014
3599 -15014 -3020 5632 931 14248 24742 -636 -3289 3677 9023 -8291 -41869 -28916 -20659
3586 -20659 3195 10781 14460 639 1879 6171 5484 -1684 -2856 -17221 -28227 -3218 -28907
3573 -28907 -35869 -8612 -10577 -13247 -5129 -20200 -21089 -29135 -30743 -20654 -25357 -42463 -43510 -44993
3559 -44993 -34703 -20763 -29383 -38217 -42240 -12468 -30774 -36133 -11188 29701 21913 11480 20667
3546 20667 15903 3007 -10033 9699 33256 32504 63872 63293 44913 13531 6348 -8859 -26192
$$ [...]
##END NTUPLES=NMR SPECTRUM
##END=
