##TITLE=Analysis number 327592
Compound Code cc 56206
Book Reference 513/63/36
Project Code adrs 
Chemist Name ronp
##JCAMPDX= 6.0         $$ Bruker NMR JCAMP-DX V2.0
##DATA TYPE= NMR SPECTRUM
##DATA CLASS= NTUPLES
##ORIGIN= Bruker BioSpin GmbH
##OWNER= nmr
$$ XWIN-NMR		Version 3.5
$$ Tue Mar 27 12:33:50 2007 GMT Daylight Time (UT+1h)  MAYBRIDGE\nmr@NMR_250MHZ
##.OBSERVE FREQUENCY= 250.131544655141
##.OBSERVE NUCLEUS= ^1H
##.ACQUISITION MODE= SIMULTANEOUS (DQD)
##.ACQUISITION SCHEME= undefined
##.AVERAGES= 16
##.DIGITISER RES= 18
##SPECTROMETER/DATA SYSTEM= dpx250
##.PULSE SEQUENCE= zg30
##.SOLVENT NAME= CDCl3
##.SHIFT REFERENCE= (INTERNAL, CDCl3, 0, 16.522)
##AUDIT TRAIL= $$ (NUMBER, WHEN, WHO, WHERE, WHAT)
$$ ##TITLE= Audit trail, XWIN-NMR		Version 3.5
$$ ##JCAMPDX= 5.01
$$ ##ORIGIN= Bruker BioSpin GmbH
$$ ##OWNER= nmr
$$ C:\u/data/dgb/nmr/ADRS/2240/pdata/1/auditp.txt
$$ ##AUDIT TRAIL=  $$ (NUMBER, WHEN, WHO, WHERE, WHAT)
(   1,<2007-03-27 12:33:24.16 +100>,<MAYBRIDGE\nmr>,<NMR_250MHZ>,
      <created by zg, POWCHK disabled, PULCHK disabled
       configuration hash MD5:
       49 4B E0 1D 92 C2 6B 37 9F E6 65 BC 52 41 86 1D
       data hash MD5: 64K
       34 95 64 D7 2A 38 1E B5 8F A7 26 5F C8 CB 22 9D>)
(   2,<2007-03-27 12:33:39.11 +100>,<MAYBRIDGE\nmr>,<NMR_250MHZ>,
      <Start of raw data processing
       ef LB = 0.3 FT_mod = 6 PKNL = 1 SI = 32K 
       data hash MD5: 32K
       D7 D0 1C C9 D9 1B 95 2A 9A C1 85 67 29 29 B1 79>)
(   3,<2007-03-27 12:33:40.89 +100>,<MAYBRIDGE\nmr>,<NMR_250MHZ>,
      <apk 
       data hash MD5: 32K
       D3 C4 71 C7 5D F8 E5 C2 FC 70 04 72 12 EF C0 0B>)
(   4,<2007-03-27 12:33:41.66 +100>,<MAYBRIDGE\nmr>,<NMR_250MHZ>,
      <abs ABSG = 5 
       data hash MD5: 32K
       08 BE 55 0E 08 1E 04 C6 25 E8 6B 6E AB 32 7F 61>)
$$ ##END=
$$ 
$$ hash MD5
$$ 49 71 FC EF 60 63 70 51 69 1E 84 5D 5B 64 84 64
##$RELAX= 
##$RELAX= 
##$RELAX= 
##$RELAX= 
##$RELAX= 
##$RELAX= 
##$RELAX= 
$$ Bruker specific parameters
$$ --------------------------
##$DU= <C:\u>
##$EXPNO= 2240
##$NAME= <ADRS>
##$PROCNO= 1
##$TYPE= <nmr>
##$USER= <dgb>
##$AMP= (0..31)
100 100 100 100 100 100 100 100 100 100 100 100 100 100 100 100 100 100 
100 100 100 100 100 100 100 100 100 100 100 100 100 100 
##$AQSEQ= 0
##$AQ_mod= 3
##$AUNM= <au_zg>
##$AUTOPOS= <27 >
##$BF1= 250.13
##$BF2= 250.13
##$BF3= 250.13
##$BF4= 250.13
##$BF5= 500.13
##$BF6= 500.13
##$BF7= 500.13
##$BF8= 500.13
##$BYTORDA= 1
##$CFDGTYP= 0
##$CFRGTYP= 5
##$CHEMSTR= <none>
##$CNST= (0..31)
1 1 145 1 1 1 1 1 1 1 1 1 1 1 1 1 1 1 1 1 1 1 1 1 1 1 1 1 1 1 1 1 
##$CPDPRG= <>
##$CPDPRG1= <>
##$CPDPRG2= <>
##$CPDPRG3= <>
##$CPDPRG4= <mlev>
##$CPDPRG5= <mlev>
##$CPDPRG6= <mlev>
##$CPDPRG7= <mlev>
##$CPDPRG8= <mlev>
##$CPDPRGB= <>
##$CPDPRGT= <>
##$D= (0..31)
0 1 0 0 0 0 0 0 0 0.06 0 0 0 0 0 0 0.0002 0 0 0 0 0 0 0 0 0 0 0 0 0 0 
0 
##$DATE= 1174995202
##$DBL= (0..7)
120 120 120 120 120 120 120 120 
##$DBP= (0..7)
150 150 150 150 150 150 150 150 
##$DBP07= 0
##$DBPNAM0= <>
##$DBPNAM1= <>
$$ [...]
##$SUBNAM7= <"">
##$SUBNAM8= <"">
##$SUBNAM9= <"">
##$SW= 20.6930455092707
##$SWIBOX= (0..15)
0 0 3 0 0 0 0 0 0 0 0 0 0 0 0 0 
##$SW_h= 5175.983436853
##$TD= 65536
##$TD0= 1
##$TE= 683.16
##$TE2= 300
##$TE3= 300
##$TEG= 300
##$TL= (0..7)
0 120 120 120 120 120 120 120 
##$TP= (0..7)
150 150 150 150 150 150 150 150 
##$TP07= 0
##$TPNAME0= <>
##$TPNAME1= <>
##$TPNAME2= <>
##$TPNAME3= <>
##$TPNAME4= <>
##$TPNAME5= <>
##$TPNAME6= <>
##$TPNAME7= <>
##$TPOAL= (0..7)
0.5 0.5 0.5 0.5 0.5 0.5 0.5 0.5 
##$TPOFFS= (0..7)
0 0 0 0 0 0 0 0 
##$TUNHIN= 0
##$TUNHOUT= 0
##$TUNXOUT= 0
##$USERA1= <user>
##$USERA2= <user>
##$USERA3= <user>
##$USERA4= <user>
##$USERA5= <user>
##$V9= 5
##$VALIST= <valist>
##$VCLIST= <CCCCCCCCCCCCCCC>
##$VD= 0
##$VDLIST= <DDDDDDDDDDDDDDD>
##$VPLIST= <PPPPPPPPPPPPPPP>
##$VTLIST= <TTTTTTTTTTTTTTT>
##$WBST= 1024
##$WBSW= 4
##$XGAIN= (0..3)
0 0 0 0 
##$XL= 0
##$YL= 0
##$YMAX_a= 264623
##$YMIN_a= -337526
##$ZGOPTNS= <>
##$ZL1= 120
##$ZL2= 120
##$ZL3= 120
##$ZL4= 120
##$ABSF1= 16.522
##$ABSF2= -4.171173
##$ABSG= 5
##$ABSL= 3
##$ALPHA= 0
##$AQORDER= 0
##$ASSFAC= 0
##$ASSFACI= 0
##$ASSFACX= 0
##$ASSWID= 0
##$AUNMP= <proc_1d>
##$AZFE= 0.1
##$AZFW= 0.1
##$BCFW= 0
##$BC_mod= 0
##$BYTORDP= 0
##$COROFFS= 0
##$CY= 12.5
##$DATMOD= 1
##$DC= 0
##$DFILT= <>
##$DTYPP= 0
##$F1P= 14.0000005364418
##$F2P= -0.99999901652339
##$FCOR= 0.5
##$FTSIZE= 32768
##$FT_mod= 6
##$GAMMA= 0
##$GB= 0
##$INTBC= 1
##$INTSCL= 1
##$ISEN= 128
##$LB= 0.3
##$LEV0= 0
##$LPBIN= 0
##$MAXI= 10000
##$MC2= 0
##$MEAN= 0
##$ME_mod= 0
##$MI= 0
##$NCOEF= 0
##$NC_proc= -4
##$NLEV= 6
##$NOISF1= 0
##$NOISF2= 0
##$NSP= 0
##$NTH_PI= 0
##$NZP= 0
##$OFFSET= 16.522
##$PC= 1
##$PHC0= 235.1931
##$PHC1= 5.09536
##$PH_mod= 1
##$PKNL= yes
##$PPARMOD= 0
##$PSCAL= 4
##$PSIGN= 0
##$REVERSE= no
##$SF= 250.13
##$SI= 32768
##$SIGF1= 0
##$SIGF2= 0
##$SINO= 400
##$SIOLD= 32768
##$SREGLST= <1H.CDCl3>
##$SSB= 0
##$STSI= 32768
##$STSR= 0
##$SW_p= 5175.98343685301
##$SYMM= 0
##$S_DEV= 0
##$TDeff= 65536
##$TDoff= 0
##$TI= <Analysis number 999999
Compound Code 99
Book Reference 9
Project Code 9>
##$TILT= no
##$TM1= 0
##$TM2= 0
##$TOPLEV= 0
##$USERP1= <user>
##$USERP2= <user>
##$USERP3= <user>
##$USERP4= <user>
##$USERP5= <user>
##$WDW= 1
##$XDIM= 32768
##$YMAX_p= 306048214
##$YMIN_p= -345843
$$ End of Bruker specific parameters
$$ ---------------------------------
##NTUPLES= NMR SPECTRUM
##VAR_NAME=  FREQUENCY,     SPECTRUM/REAL,   SPECTRUM/IMAG
##SYMBOL=    X,             R,               I
##VAR_TYPE=  INDEPENDENT,   DEPENDENT,       DEPENDENT
##VAR_FORM=  AFFN,          ASDF,            ASDF
##VAR_DIM=   32768,         32768,           32768
##UNITS=     HZ,            ARBITRARY UNITS, ARBITRARY UNITS
##FACTOR=    0.157963299565203, 1,           1
##FIRST=     4132.6476996994, 0,             0
##LAST=      -1043.33573715361, 0,           0
##MIN=       -1043.33573715361, -345843,     0
##MAX=       4132.6476996994, 306048214,     0
$$ Real data points
##PAGE= N=1
##DATA TABLE= (X++(R..R)), XYDATA
$$ [...]
30532 48386 83383 94530 89831 33827 14330 89070 18947 -97850 -108277 -58902 -13470 -17935
30520 -17935 -13605 -3742 7257 -72634 -28187 33505 76197 81192 -9100 -70246 -73722 -79128 -60603
30507 -60603 -22109 8924 78577 121168 158550 197639 210886 159446 56872 -27190 50867
30496 50867 54333 6277 -50573 -50833 -21733 37112 30962 -13645 -59148 -20869 -6212 -9528 1928
30483 1928 6569 61875 107792 83528 26334 -36486 -13336 -26700 813 27748 1600 6182
30471 6182 61290 20761 22876 -59983 -66101 -96612 -81588 -17881 -6905 -10016 75307 60714
30459 60714 22730 12875 -2398 30144 98418 73787 79722 112740 60016 69786 105644 137292
30447 137292 122530 28393 11953 74618 70909 30297 2269 42034 -8430 13980 40158 12545
30435 12545 11340 33575 42634 48587 -32389 -56092 33476 171722 95926 77965 94988 19643
30423 19643 -26819 -642 30578 30511 -7465 -106229 -159072 -86638 39423 10007 39183 47113
30411 47113 -196 -10443 -683 12247 -3690 -1610 7902 86177 143590 83227 90714 47034
30399 47034 19540 -68044 -105894 -81450 -89539 -66852 -10816 1502 2627 24090 69167 72696
30387 72696 -53697 -127812 -148952 -97630 -62096 -44241 -20703 -114470 -196570 -225025 -176545
30376 -176545 -120876 -47220 5400 -18443 -67757 -100946 -109165 -95941 -70849 -123865 -112070 -63243
30364 -63243 -13322 -45517 -90824 -71300 -6283 73116 101002 85197 135095 134133 51776 19520
30352 19520 47948 3175 14618 59933 -13131 -41091 -30212 -12185 946 39137 -9387 -99079
30340 -99079 -11395 110251 32391 70185 47663 -11284 14742 40027 79316 99145 72354
30329 72354 84570 128106 137413 92700 94126 63720 -51811 933 43744 9189 -5582 36505
30317 36505 27677 80675 91140 133157 169523 89933 19462 16581 13218 15834 -14740 -18742 -50880
30304 -50880 -37117 -25079 -37727 -20618 -1038 30679 -53032 -95869 -19400 56349 50939 58797
30292 58797 89764 36420 60343 -32424 -107924 -82090 -95949 11434 -4989 -28887 42870
30281 42870 61158 -8469 6622 47160 26081 18219 -47922 -73130 -46673 -71625 -57562 -38776
30269 -38776 -35947 -90508 -30421 23701 -28703 13977 9612 -50806 -140933 -57197 -15725 -32330
30257 -32330 21971 24845 -2849 -23477 -14286 23038 9898 -39735 -88142 -148036 -126065 -96166
30245 -96166 -30151 15153 -76466 -210564 -188749 -105652 -35330 -29686 -32821 23161 -43232 7883
30233 7883 30774 -24242 -32740 -79079 -103793 -22676 31422 91831 75003 11159 -39389 -26961
30221 -26961 57205 29705 -29670 -46120 -4448 96914 176470 105187 -7321 -14638 898
30210 898 100798 124634 47765 51711 121601 84297 -1336 -60809 -71778 -70771 -1771 90397
30198 90397 128725 143940 120562 52192 37955 103801 68912 -3762 -71232 -108509 -103287 -33487
30186 -33487 9849 28020 -17838 -64069 -114235 -100338 -72739 -44773 -32650 102380 129122
30175 129122 149531 148737 92769 74082 64237 62792 17825 -14653 -35102 38098 62921 95666
30163 95666 55932 11587 -63436 -127027 -132334 -205727 -144186 50550 128293 142235 139866 141371
30151 141371 111104 128053 122306 40057 -27081 -19624 63756 38389 -22436 -37716 -7547 -3814
30139 -3814 53878 66745 -18709 -36695 -45540 -74913 -70881 -17810 9424 59969 134684 62198
30127 62198 -920 -46241 -22065 55188 105703 92876 60882 10186 34826 80588 102294 115132
30115 115132 -15791 19056 61118 65682 26653 78687 90823 24341 32064 -6432 -48122 4084
30103 4084 18709 -59841 28978 95002 -29801 -108279 -97928 -102389 -65349 -94160 -22382 -4677
30091 -4677 -7902 36747 79583 13569 -65079 -49204 -43548 -24697 48957 30974 47311 71081
30079 71081 48056 88025 56134 -13689 -52112 -48871 26093 17257 -35891 -22373 41058 2690
30067 2690 -36994 -87871 -78966 -2826 1448 45517 7740 -13104 21150 47557 102460 159753
30055 159753 198312 204776 139246 83338 65704 -63690 -90467 -65857 -6335 25464 -29934
30044 -29934 -106788 -100473 -30413 -12349 -87844 -21132 -85487 -8566 74858 98745 112568 -2659
30032 -2659 -45749 -70114 -35893 -29637 -57154 -76158 -119297 -161189 -88410 8740 25952 -1909
30020 -1909 -51748 -13683 75894 58419 14672 -47290 -116052 -59691 104139 160128 151202 91748
30008 91748 50382 39692 20128 -152482 -199680 -54212 -58165 -17743 33872 49314 31503
29997 31503 110993 84223 25427 55346 89962 118531 202922 170525 26342 -12954 -59265
29986 -59265 -83668 -43583 -59838 -56923 -8347 71815 55516 26042 -73510 -151905 -144663 -51708
29974 -51708 -1378 -15148 -25891 -70607 -126118 -28925 28452 46147 57204 82958 67071 5323
29962 5323 -24907 53059 109535 70491 88158 82719 36549 -25480 -27848 -34878 -31804 -23961 -30390
29949 -30390 -75463 -130785 -97044 14049 -12516 -30296 71539 63586 81605 75482 -10815 -90796
29937 -90796 -15657 51861 126530 81498 49860 54723 96945 98699 86598 3390 -47718 -19717
29925 -19717 -27942 9011 7044 -45200 -95964 -99489 -8372 57393 85334 32887 -89076 -108474
29913 -108474 -92471 -66287 24853 102794 197013 213860 153848 51297 -61088 -93046 -57103
29902 -57103 48466 196805 186399 84531 11859 -7561 20558 54864 192721 191490 3065
29891 3065 -104751 -98147 -154480 -147003 -122633 -8606 59565 125724 33754 -5885 -33815 -75535
29879 -75535 14037 47919 4021 2544 20921 19854 -6790 -4153 28238 -7365 -8039 68687 112435
29866 112435 86469 10801 -39663 -39270 34628 57990 28456 78145 62332 -4129 -18369 -64542
29854 -64542 -103100 -111188 -109294 -66314 -83349 -103850 -82252 -18511 -1946 26298 85839 43867
29842 43867 40211 61212 35816 -21281 20467 40101 27096 8281 33982 54651 65230 71217
29830 71217 107885 130616 143838 121205 60999 63453 -42319 -171521 -140470 -106235 35201
29819 35201 92818 85907 112601 133318 62009 6487 16627 -44627 -13852 -56414 -126078 -171316
29807 -171316 -165242 -124696 -28646 -14202 -67342 -113466 -60625 -29458 -47052 -88903 -128797 -31616
29795 -31616 5865 55377 57572 -71324 8129 91185 79960 66560 59698 37571 37665 106286
29783 106286 77982 123573 137150 77842 85067 -17141 -54579 -63612 -67150 -39228 -23300 39202
29771 39202 44308 27347 -8343 -4822 -2966 -32591 -78809 -14028 26741 64151 -7209 -127550
29759 -127550 -86017 53527 140073 6361 -81385 -77029 -42057 -2905 73832 39247 -66906
29748 -66906 -126889 -144957 -72355 7506 43908 11236 72944 38541 14692 27013 -26225 -214
29736 -214 -8077 -13481 -12600 -9521 11693 48867 105744 144570 99781 66262 4010 -56652 -39648
29723 -39648 41916 58700 7734 -11383 -6843 12385 53826 57567 69158 91947 100120 227149
29711 227149 126364 -15499 -45262 -20288 -62140 -32221 -3830 -4819 -29869 21775 34757
29700 34757 80642 75710 76644 89103 65787 11279 -44345 -72208 -52563 -34836 -24971 42503
29688 42503 73307 67898 -25882 -110480 -116703 -149671 -185993 -189886 -161860 -117344 -48245 -10108
29676 -10108 -64923 -37178 10376 41839 -38263 -40581 28025 93322 17981 -64723 -30052 -42998
29664 -42998 -90578 -99199 -11513 41317 94994 110572 106777 74980 -65328 -109539 -55691 57928
29652 57928 166296 67972 -1625 -43453 -62776 14215 123072 131729 118169 62262 -68472
29641 -68472 -169559 -163609 -58450 -30951 -66134 -13023 4398 45246 68166 61560 53796 73691
29629 73691 121484 160135 106025 43891 41232 51574 66813 15218 -26737 7879 14865 86799
29617 86799 51214 -116958 -150767 -74386 -18170 16157 23041 8230 -14445 -82703 -92400 -32332
29605 -32332 -36285 -57825 -71097 -79324 -63134 -78602 -8299 -51263 -79838 -84636 5776 43890
29593 43890 53785 72051 2059 -53773 -86240 -42417 -22115 -55506 -35334 -25486 -12265 35550
29581 35550 60900 37648 2962 -18862 -59003 -70144 -72108 -32644 -37607 -89178 -29291 103047
29569 103047 93395 27624 1143 21074 111135 219814 177149 172813 157992 69626 -12280 -82720
29557 -82720 -115115 -147354 -75433 7536 116016 184263 170691 111852 74088 121943 114910 128717
29545 128717 72614 -11740 -93680 -95889 -31868 17223 11842 -110270 -165386 -69476 65384
29534 65384 54260 81460 25135 -40748 -34625 40107 75905 -57843 -148305 -173598 -161585 -171151
29522 -171151 -84536 -42332 61376 77119 16102 34230 65661 12622 -41530 5824 56480
29511 56480 23031 -32129 -76799 -75922 -109758 -126209 -2892 113104 49757 75113 20158 -8014
29499 -8014 17239 14155 -47174 24738 56005 12793 7730 60102 31053 -1031 -35579 -35231 2296
29486 2296 39162 89586 45415 -32107 -72361 -94447 -147742 -203872 -259555 -166812 -171079 -135202
29474 -135202 -7529 48916 142821 119893 3220 -91347 2546 88089 104946 26432 28411
29463 28411 -34786 -114924 -96160 -34212 4066 -87982 -148250 -127266 -182450 -103340 -38119 7078
29451 7078 73398 38049 -12999 -89601 -90690 -55616 -27005 47086 57039 67531 37862 23290
29439 23290 14788 80538 149202 97866 107349 87876 67412 23361 -44925 -66945 16804 83168
29427 83168 49265 52873 64214 47494 -20082 -51683 -34351 29382 87928 105353 121675 123816
29415 123816 141390 40237 -40001 -71025 -65733 -99506 -33623 40704 112318 161025 49035
29404 49035 45910 23416 -40430 -25827 18863 23 -16736 47523 111972 64119 -1169 -10090
29392 -10090 12573 -61794 -72494 -48215 -25310 45616 44984 -13030 -57739 -35329 -49232 -132482
29380 -132482 -106468 4078 -9107 8946 -27388 -18685 -13350 40208 29764 -7931 23358 -18175
29368 -18175 -65410 -90119 -68770 -21579 12370 8450 21689 47040 61523 98453 72910 30863
29356 30863 29881 36865 -32459 -67745 -51102 10786 102800 56292 12665 -26819 -167 12274
29344 12274 56645 4022 -96797 -117989 -105898 -105184 -80278 -87150 -96937 -66953 -1582 58798
29332 58798 10707 -14022 -23614 -34650 35784 73972 134534 89794 56503 -23100 -94980 -108776
29320 -108776 -69829 62160 90093 32085 -46285 -95626 -74635 -42066 -18691 -78292 5917
29309 5917 44327 8149 -33537 -1645 -12141 12938 -10710 -63202 -27994 117580 32347 -5796
29297 -5796 47616 127294 98406 -8725 -70633 -23114 -52731 -44253 -114404 -106388 -65027 3856
29285 3856 -5439 -87196 -28434 54699 43101 -50632 905 40174 2308 6537 -26538 39557
29273 39557 136542 90609 69675 120262 113914 96505 142057 125370 92670 32710 -8279 -33955
29261 -33955 15147 -8903 -64352 -9109 -2484 -21784 9285 27643 -5824 31638 -23209 -29349
29249 -29349 -55476 -67569 53786 10681 -48249 -6173 4669 22185 59513 134169 9193
29238 9193 -100430 -102576 -51712 -68401 -42613 36588 22756 68316 70532 31135 148402 238848
29226 238848 211074 111678 63355 23241 -4164 68810 45850 5158 32965 -3309 -67445
29215 -67445 -134325 -30190 -5279 4186 40426 -2729 -94021 -4943 34581 42434 118816 169648
29203 169648 119974 41973 -41756 -68833 -49698 -38940 -14079 27020 -85136 -145130 -64490
29192 -64490 -30428 -101929 -140445 -119496 -48386 -55558 -96264 -83605 -117304 -122780 -28988 -4291
29180 -4291 -23648 -69972 -100347 -102465 -130065 -130572 -117014 -61959 -57595 7540 29083 -6731 17897
29167 17897 -21170 5576 -29371 -54925 25482 80207 75931 -8039 -45499 -80479 -71956 -88269
29155 -88269 -70368 -94597 -78977 -18547 -33140 -19670 45252 -7428 -31712 -29383 -23637 -31570
29143 -31570 -14557 45429 3581 21507 79098 100762 44060 1950 -20376 35068 -6030 -30468
29131 -30468 -10696 -7315 -52344 -10987 631 -101552 -100797 -31932 57147 107901 65571 50943
29119 50943 -42435 -34671 -79013 -118868 -34122 59052 104985 -35738 -117259 -24578 67048 104249
29107 104249 148647 61943 78165 63011 97682 182301 204359 168139 184748 161123 95271
29096 95271 23672 -50009 -76890 13822 137153 107214 48330 -49185 -56830 59683 100682
29085 100682 163035 189217 139331 96113 26164 -50739 -48008 -110370 -169640 -49927 -6914
29074 -6914 -3371 -53744 -110218 -70200 -92503 -73087 -44076 60087 68156 114732 116502 25467
29062 25467 127065 204834 195018 60090 -34737 -9467 33832 67547 65478 91474 193374
29051 193374 146419 102998 67553 -1653 -20574 -42307 -106498 -86462 -79753 -70384 -73137 26148
29039 26148 94855 18963 -15417 49822 -60524 -131688 -130663 -23323 125813 132551 61593
29028 61593 4740 -7780 15124 134675 184464 143232 148279 95043 86258 -3245 -63564 -34404
29016 -34404 -30171 -36197 -43155 -36315 -34265 12194 43592 34252 24595 -38050 -92975 -77274 -1040
29003 -1040 -29285 -20773 -145416 -133628 -115906 -136304 -96041 -106026 -150563 -116405 -44184 -16552
28991 -16552 -58855 -148609 -112478 70917 162792 80692 56791 62250 23009 29081 105397 232059
28979 232059 192546 124996 60798 62121 17130 317 48133 48078 2257 -103851 -125664 -98156
28967 -98156 -39337 32604 87345 143124 140979 50924 19454 119563 63438 -20867 -51775 -67745
28955 -67745 -41623 -33545 37237 58762 -15811 17419 42492 41982 85723 88622 93878 103484 93823
28942 93823 54576 -951 28331 62240 61545 56828 47633 -8299 -37474 -48847 -54810 -31385 11461
28929 11461 36056 7929 15778 8720 -18556 -42373 -85808 -58246 -74412 1641 42570 -56090
28917 -56090 -103431 -100987 -111150 -81419 -92615 -32624 38663 61210 23458 -44901 -80649 34153
28905 34153 105463 40290 8522 -41250 -192692 -253359 -261301 -69187 131938 115123 69933
28894 69933 44341 29100 52071 60450 22301 17775 -41549 -19513 -15269 53421 107607 119837
28882 119837 78296 164104 191405 99282 55036 88977 38179 -41557 -55689 10794 57136
28871 57136 45661 16107 -32690 -40174 -29182 25861 23328 25164 118106 115694 30209 1424
28859 1424 12900 -9671 -61310 -111989 -114279 -107760 -91748 -40708 -50405 -24956 -5096 -72687
28847 -72687 -99741 -55679 38367 23069 -67243 -70099 -169449 -209762 -78507 17821 38758 22294
28835 22294 -51912 -42377 -46444 -96446 -72579 -103062 -124327 -75149 -10180 2688 -60390 -29640
28823 -29640 45636 -57345 -116429 -68958 -132775 -126082 -49133 -53952 18231 1340 -25100 -5448
28811 -5448 6064 -6735 33576 62653 58880 103130 119633 24647 -75979 -169288 -155445 -51846
28799 -51846 -26966 -73872 -155813 -69145 -2986 67352 97485 84648 -5883 -84515 -158060 -155996
28787 -155996 -136930 -118216 -3387 71466 81508 93263 72611 106597 54929 -7134 -64119
28776 -64119 -57191 -17036 14092 29768 101149 73707 22456 16022 -66471 -85902 -52514 52961
28764 52961 101174 54336 -23073 -132210 -147875 -23126 38032 12036 45014 78146 -598
28753 -598 -117753 -162534 -73093 -78090 -175500 -110695 -14685 31889 122190 56251 53847 79799
28741 79799 91707 65053 57516 22159 -11396 -22242 2470 -13468 -15459 81201 171859 108322
28729 108322 -74 -91702 -100464 -63734 -20372 9928 36732 91157 86751 16520 1889 -13587
28717 -13587 -52084 -75290 -119821 -70169 21351 -13116 -41381 -36470 63063 61319 41686 6023
28705 6023 35391 41137 32099 15572 56948 21191 25435 56762 30491 20602 87747 169228 187287
28692 187287 81270 -39824 -129656 -99447 -59349 2208 47371 -8119 -17182 -28390 -51925
28681 -51925 -106326 -164073 -220700 -177435 -233030 -138537 3553 37313 17438 -44012 -54012
28670 -54012 10825 45917 36032 64242 97906 141656 64387 -49099 -92486 -57837 38916 19076
28658 19076 56223 94275 83183 70416 41984 36575 35236 16579 24379 74809 117416 59228
28646 59228 64638 77518 162760 105736 -1729 13872 81308 102532 23168 -67046 -88201 -73921
28634 -73921 -55650 -63184 -33654 -2900 -8312 83885 80409 95253 71406 84874 143987 40665
28622 40665 -80684 13916 -3818 -41009 -83727 -70380 -25285 105826 164271 155738 146002 151482
28610 151482 146381 142412 26293 -64740 -74507 -1321 27809 -5970 -349 1833 -31274 -78508
28598 -78508 -102170 -52700 -1963 -37150 -8995 -18656 -57228 -90639 -80670 -71800 -41868 -12947
28586 -12947 -16248 -25187 25671 -13086 -72052 -81674 -46111 48762 59586 111756 136087 65502
28574 65502 -17835 -31971 -5641 3309 3880 30705 46148 12150 -6279 -14554 15513 -8596
28562 -8596 60356 99935 54723 42520 -30256 -46283 29989 99606 54500 -11799 -32680 -61078
28550 -61078 -32530 57553 35595 -7600 21278 95726 76023 18196 103978 163429 112851 -1865
28538 -1865 -72554 -21231 146145 156620 169266 146841 111134 21427 11152 67690 37792 43710
28526 43710 86108 58493 83870 106656 90226 46774 29395 46379 101279 94827 45532 55943
28514 55943 41881 -15727 41114 11910 -14137 12876 6880 -44184 -72048 -60794 -31146 88459
28502 88459 56776 57877 113078 141725 84321 -9106 -4925 42316 102531 42400 101040 192117
28490 192117 120192 92836 89405 -19405 -63938 -18202 10704 103151 134945 110415 202456
28479 202456 209325 186617 172470 144214 159078 44099 -40219 -9194 29159 104378 170087
28468 170087 231205 230594 167587 58826 60437 57802 -401 119878 239748 136500 26658
28457 26658 -6451 32477 -13826 -55736 -73414 -133339 -70900 32229 72618 29620 31406 49562
28445 49562 -62602 -118595 -49372 -24941 -31270 -60549 -12117 -51008 -40750 15320 51608 93991
28433 93991 83678 103573 148900 82131 -6419 -11021 90218 92637 -13341 -16028 -257 13915
28421 13915 -8550 -43300 757 71991 71114 32517 66099 94312 70257 62151 31091 -52622
28409 -52622 -34728 34293 80190 73025 -9241 758 43574 1437 -20418 -59439 -64784 -111026
28397 -111026 -54369 -63089 -29928 82281 30830 -41970 19459 14101 -56345 -30230 34312 57950
28385 57950 188 -744 -19975 -33825 -54198 -6716 48546 63063 57379 6040 -28886 1524
28373 1524 -6867 -25673 86338 142702 1777 -94236 -127227 -111389 49532 30749 -39676
28362 -39676 -26934 69259 145559 141569 169597 183148 177893 80955 -25943 -15383 72774 106310
28350 106310 175140 125672 31130 -2099 -28226 -77355 -64615 -29293 -8215 44485 13903
28339 13903 -43792 -9158 -24051 73823 116820 91107 95127 102724 128946 30156 -64478 -46985
28327 -46985 24913 9237 -79475 -100715 -76349 -40307 -57574 11330 -30031 -60154 -21622 -244
28315 -244 58060 19127 2689 -19310 17250 28067 21808 78121 89089 27200 -23237 -14698
28303 -14698 -3911 10499 -15330 -49253 -52405 -42128 -39830 -37002 -70984 -57818 -60574 -54720 -124463
28290 -124463 -70394 -43730 -9899 -29597 -17003 73385 24317 -32828 -102831 -111705 -66813 -21146
28278 -21146 29270 105187 81836 8014 -53114 -71556 -49270 336 42461 63015 186961
28267 186961 187770 73423 -38626 -23076 56576 76830 38489 -24807 -16363 -38943 -80584 -89295
28255 -89295 -18081 -17051 4065 63576 39483 31501 75093 7322 14351 25478 -18728 -58544
28243 -58544 -107514 -125535 -103381 -67758 14308 63273 41138 92819 126499 7380 -23788
28232 -23788 -65909 -39202 -50109 35264 122986 143566 102494 23170 1120 -7782 14724 -15938
28220 -15938 15130 -12252 -16736 19422 17529 42623 155861 244084 235518 256374 138072 12560
28208 12560 -57546 -62550 -17528 9771 19791 29788 -82580 -38272 63407 86297 -2822 -29675
28196 -29675 -14338 4988 -14942 -58706 -35212 33935 56782 47371 18805 -38555 -11761 8052
28184 8052 28460 -1610 7502 32391 53257 89212 108650 76183 38605 -36363 -6787 84710
28172 84710 67514 18538 -28474 -15224 -9318 6109 -2403 -26178 -3319 -41503 -80069 -52466
28160 -52466 -11460 -55960 -25749 42864 31641 -38974 -94990 -129497 -98883 -62215 -22447 1588
28148 1588 -8869 24028 37328 -48379 -32727 -29085 -35169 -48055 -45515 -9583 -52355 -81024
28136 -81024 -36793 -112534 -214035 -204036 -182860 -176703 -70064 -62616 -124426 -120428 -20419 75686
28124 75686 82263 95162 -7551 -69404 -90841 -159526 -202906 -159626 -52204 -18488 -48584
28113 -48584 -36129 -17026 -56468 -49510 -40531 -134776 -106388 -18621 32298 54540 66083 18407
28101 18407 23153 -50233 -102896 -160511 -9470 113126 167053 109901 72128 14683 15177 12792
28089 12792 6378 -33561 -104175 -75291 -71277 22248 44598 30434 31597 -36508 -22838 65224
28077 65224 24877 28780 17545 -20114 28646 23922 -43312 -66775 -46280 -57618 -45896 -37372
28065 -37372 16671 97804 26841 -80712 -12904 34379 53062 83034 118393 -11547 -68204
28054 -68204 -67542 -89786 -134559 -125038 -69365 45560 9455 -70309 -81690 21377 86872 -118
28042 -118 -41032 37702 46898 67684 43111 88466 65409 31032 38985 -14047 -28617 -34717 -41988
28029 -41988 -110354 -72152 67678 68031 38634 49380 101400 96105 57527 -3818 -24486 -32541
28017 -32541 -20918 -60717 -14430 60724 108636 -11388 -16483 -54866 -70961 -122035 -84535 -53100
28005 -53100 11423 41889 77267 60265 -15316 -27328 38836 29172 -19072 -9826 80399 79943
27993 79943 39893 -4432 49865 97822 120298 118835 43349 34696 64633 70600 61718 4866
27981 4866 -102908 -145845 -60602 -39503 -57992 13350 14672 34881 59380 53665 54941 -64496
27969 -64496 -73646 -92651 -65771 -71631 -94013 -13936 -17366 -72078 -58865 -4303 12946 -39389
27957 -39389 31250 59791 31818 -33114 3099 -62860 -96325 -45441 -13021 -27752 -104566 -42209
27945 -42209 56741 60212 82582 54454 -25873 -27771 18681 -25482 -80647 5848 66572 34236
27933 34236 47844 -34327 -54477 23177 60502 49186 19367 -32539 -83783 -81697 11365 72567
27921 72567 59415 90697 125635 83445 52119 30303 -17370 -38022 -49147 -16379 -35668 -83874
27909 -83874 -35155 23612 51895 66525 -380 -60007 7292 135162 150095 126821 9216
27898 9216 -77276 -86166 20206 129027 116948 40065 -32571 -23650 -65738 -140632 -63321 -9412
27886 -9412 54009 -10020 -104982 -81719 -127574 -133559 -38373 12945 1176 59400 89943 78503
27874 78503 -38705 -101617 -72840 -82422 -117512 -134376 -108506 -40212 -86123 -176170 -171407 -167309
27862 -167309 -186180 -120750 -114940 -51867 76075 118960 70969 -13098 -27184 -33569 3016 74565
27850 74565 69161 88723 173459 167384 95401 93870 134402 208355 80864 -22744 23148 69778
27838 69778 61260 -59636 -154120 -155927 -161838 -140680 -31321 -61430 -169526 -224704 -133908 -15476
27826 -15476 -30528 -2609 5187 30969 -56439 -199587 -203972 -163560 -106599 -25988 -6771 -66687
27814 -66687 -89679 -142547 -143700 -155302 -105349 -64670 -4733 -38267 -4354 58784 10831 16839
27802 16839 84956 112587 72929 -19940 44894 44334 62544 43546 70094 -9382 -58942 -70608
27790 -70608 -82045 -23543 -12502 -5899 35716 20510 48573 73417 58905 50859 43160 70433
27778 70433 66418 60049 24147 -35538 -22717 -28836 -10882 -62626 -97332 -25727 -26450 29423 78777
27765 78777 -16342 -92940 -95465 -64257 -46543 -36334 -57874 -42444 -52283 -96901 -45865 54454
27753 54454 102680 100564 76770 80524 -12477 -109861 -149673 -60759 -40979 -48109 34701 89425
27741 89425 71083 53884 -28662 -61334 -75422 -128692 -58657 -100545 -61769 -27590 -94737 -24239
27729 -24239 46481 52469 101302 128089 104669 185394 146694 114359 46667 77551 122259 36286
27717 36286 -42136 7798 -4273 -105660 -91291 -5839 -52333 -21060 28332 -36458 -15734
27706 -15734 10512 44636 55489 59705 75633 59085 -47095 18901 26454 -2137 -18877 -4486
27694 -4486 -975 129482 187472 105624 -28935 -41739 62680 -20123 -29509 -4886 46677 20253
27682 20253 -61685 -43334 -13496 -18722 -40577 -18161 -21792 -72006 -31202 -46969 39652 82177
27670 82177 22383 8270 19845 -1664 4096 40106 63891 64675 52229 -19149 -69504 -103527
27658 -103527 -172293 -181015 -132372 -160892 -84561 -6723 -66761 -107167 -99051 -79406 19551 87831
27646 87831 23008 23396 -53273 -106781 -64849 -25543 26184 84717 -4537 -96898 -111639 -71786
27634 -71786 -23599 -19593 -24561 44827 7611 -92142 -65120 -54490 -23233 24407 -21397 22876
27622 22876 66322 113026 153193 73111 -8059 28389 65441 86674 70853 -9088 -25751 91905
27610 91905 80918 6131 8181 6966 -117259 -114966 -22143 -5599 11581 19321 26253 73876
27598 73876 125729 113778 94570 39605 32961 20351 28660 21872 2690 -43143 -91364 -74311
27586 -74311 -55129 -62864 -35972 -68232 -50916 -54754 -18945 15788 -7197 -15481 -74821 -148679
27574 -148679 -124758 -69319 -19183 34172 -43368 -60338 -34095 -51622 -107060 -172191 -190031
27563 -190031 -95240 3969 -1114 31015 91568 176549 90402 -18661 -13987 -37809 -67865 -29223
27551 -29223 33278 54740 107001 86537 53351 96058 109337 20778 -37908 -95725 -150069 -122692
27539 -122692 -30129 11954 -19334 -110843 -121306 -86081 -63586 -9429 22932 28024 4067 -44965
27527 -44965 -46419 -75574 -110622 -37295 64644 160645 219826 252856 209742 66457 -66331
27516 -66331 -24142 -23258 -26271 -30662 -26280 -44859 -24331 -33896 -106958 -119073 -131258 -137748 -107442
27503 -107442 -39881 -24924 37811 24194 15287 68205 15686 1405 -13806 -17606 5897 -61081
27491 -61081 -99374 -53686 -36938 -14532 11627 -94868 -84944 -30683 -42283 -58178 -12013 40544
27479 40544 -26445 -73784 -79982 -20151 53000 8023 -23609 -27940 7827 -27601 -33974 -7525
27467 -7525 15384 28707 44128 47811 -1878 12655 8406 -7868 -55457 -57516 -16187 -20697 -1697
27454 -1697 -58262 -152297 -142427 -29487 6626 -33473 -109779 -158036 -155832 -43891 -19684 9654
27442 9654 57772 96758 40167 -4890 -1267 10384 1234 -696 55121 37783 -32760 -63349
27430 -63349 -126878 -38504 116174 138178 74325 57638 21071 -9835 -52764 -166622 -143150
27419 -143150 48760 121340 139824 90838 3395 -43105 16395 -17793 -43406 24746 25026 -66181
27407 -66181 8889 69199 79929 62554 108936 53718 -24536 7234 87237 211632 238198
27396 238198 170274 71989 72989 18561 -30799 -15335 35648 62976 58398 77231 93286 87321
27384 87321 119958 130019 115054 -25105 9012 106213 112463 77636 98149 92647 12037 51790
27372 51790 87873 6434 -41592 -96419 -26816 81786 36227 -14448 -128724 -171297 -194063
27361 -194063 -144595 -117957 -56202 -22719 26025 56345 34809 12335 70068 59145 8966
27350 8966 79922 131052 110700 32270 -29599 -40552 -140005 -26148 38750 23043 80961 110790
27338 110790 165042 164456 109066 109362 82062 55683 75420 29430 10961 -10359 -23516 -9389
27326 -9389 -24861 -3279 20217 19160 83678 125931 81354 79804 109558 97164 51596 59699
27314 59699 33979 14662 -29115 -96672 -137438 -97743 -34547 -31436 -26949 -95354 -194497 -106989
27302 -106989 -33800 -23780 -64336 13753 41530 -95479 -63676 -38896 -52701 -13465 -11651
27291 -11651 -104892 -40399 -35515 -25213 -69204 -49665 48710 -7378 22787 3363 -133931 -88299
27279 -88299 32391 11119 -21034 27550 72364 114556 98112 42369 14642 50594 43628 8469
27267 8469 -4570 62471 105700 122826 65122 66368 47426 10505 24738 25936 33640 14619
27255 14619 9842 24289 7035 73899 37885 -10810 57818 21136 -31614 2560 46353 41326
27243 41326 58832 -19215 27583 24023 -19085 -65614 -105186 -43772 2481 103526 73378 -42654
27231 -42654 -38982 13998 10636 -42937 2026 12972 -40823 -25310 9529 24848 27263 77276
27219 77276 -14271 -37495 51537 151408 74986 22678 -40697 -33952 -8126 -63211 -85039 -95592
27207 -95592 -81357 52503 34445 47436 306 -4840 -26432 -6678 -11220 54226 32565 34965
27195 34965 31550 16387 4113 5196 -74884 -49546 15065 128 39141 80115 15297 19196
27183 19196 -26981 -39799 -47183 14334 80280 94294 127042 39947 -90450 -85848 -12618 -39411
27171 -39411 -83378 -67074 -99100 -17203 -9561 -43232 -46172 -49628 -165121 -136227 -95464 -14150
27159 -14150 71671 -23657 -79950 -105005 -39926 44835 114572 72411 7048 39373 43246 -14535
27147 -14535 -37587 -70653 -67630 -65780 -2465 27372 45150 81401 49068 24811 3080 -44746
27135 -44746 -56340 -22791 -62381 -91598 -72316 -38167 -55170 -22721 -95255 -136446 -35901
27124 -35901 21517 88236 135772 207140 254028 195476 188258 181221 149378 178632 165591 117369
27112 117369 70583 17833 17353 65042 83905 69225 3053 -52650 16786 37228 45025 15464
27100 15464 94687 159383 151319 34859 2801 20757 12220 20958 75540 39578 21949 14269
27088 14269 47098 82065 107419 209500 207265 117260 68340 103279 102526 133622 113040 27885
27076 27885 -42217 35021 99689 32417 40586 41312 80419 36253 30340 16536 23608 59205 34917
27063 34917 83257 118241 80464 73223 20027 54458 76871 61985 -17305 -41613 4595 -5682
27051 -5682 53432 88157 73013 -70625 -115027 -118424 1717 105971 66300 59575 57039 6264
27039 6264 -32443 -26722 -13128 53944 104491 -61 -81382 -39365 -52812 -31000 3929 6614
27027 6614 12332 -16302 -43572 -51222 36902 -2032 2205 79119 16192 9055 -8162 -28885 -80289
27014 -80289 -107855 -87494 -16959 28487 35906 -33916 -117821 -124092 -108791 -106450 -91938 -61106
27002 -61106 -63714 -62732 -23666 -35402 -80790 -116681 -192398 -188645 -49503 47308 50633 -42328
26990 -42328 -77839 -81937 -82294 -123000 -92703 -116815 -12279 31676 77732 85662 44193 -1481
26978 -1481 -19245 62418 124097 -14199 -146719 -111439 -46034 -3831 33461 14209 10488 -13589
26966 -13589 15946 19202 -23751 34343 70122 104464 45965 -50658 5639 -7612 33710 63806
26954 63806 21315 -27033 -64400 -63514 -148315 -188463 -142937 -32429 -28613 -71086 -15343 -53861
26942 -53861 -19793 55061 98519 113594 110689 56733 34628 143504 100632 84292 69027 68412
26930 68412 106634 73212 11036 8174 -20332 -82422 -97388 -35654 8817 -81884 -184047 -209926
26918 -209926 -72960 -42631 -41864 -8711 -10533 -28353 -96397 -14009 -17165 1292 16514 6010
26906 6010 27561 37402 88397 65516 12646 37621 -17461 -30718 -2172 41551 92975 54298
26894 54298 -19401 -39627 -33686 7665 67410 19691 -62073 -123069 -79922 -3885 58111 87573
26882 87573 64230 13602 -43006 -27947 -73364 -65731 6966 -4335 -46627 -17779 40472 28336
26870 28336 21912 22777 -35736 -5681 -16385 6595 37269 -3361 -94579 -132893 -40170 -39344 46552
26857 46552 165649 172284 67650 -4322 -40448 -15759 -3769 -5359 -1243 12974 48695 61362
26845 61362 83897 107337 39998 -14638 56604 64995 60670 31919 62069 79247 103281 135152
26833 135152 199076 148141 62428 31032 77635 1875 -28856 -9806 61477 27056 31875 13859
26821 13859 -13155 19647 82481 134605 212447 176159 171641 150581 128776 99576 95790 19042
26809 19042 -23770 27579 102288 142348 124353 113536 34713 2567 47354 109007 84066 63165
26797 63165 71830 51614 59458 31516 -22209 -10625 -13719 -18243 32239 58203 34754 8528
26785 8528 5119 62306 88448 -6879 30815 -44630 -101668 -71678 -60624 -135036 -98517 -12328
26773 -12328 48854 31455 52009 7267 -69823 -18107 102856 155751 84453 31684 -20935
26762 -20935 -52920 -130513 -180484 -157490 -180223 -147024 -50959 8354 -24327 36569 18878 61652
26750 61652 50206 3578 -21335 -94706 -90847 -31575 -36292 -78765 -138849 -82441 53638 -11944
26738 -11944 -54193 -11674 42790 40870 17000 23941 47395 79076 54553 88855 123622 156257
26726 156257 159836 101600 108012 114046 97140 102291 43008 -8020 -79214 -164134 -137515 -98312
26714 -98312 -93551 28099 103444 49810 83885 125358 57449 -9179 -49645 14378 -22966 -88991
26702 -88991 -52126 -85394 -60793 -107498 -153470 -159440 -78500 19127 -43016 -109647 -85195 -92048
26690 -92048 -101744 -170426 -187135 -135942 -114694 -67107 -54232 4447 -59651 -100764 -76496 -6611
26678 -6611 -54332 -29659 19509 48888 18958 -27051 -35909 -30750 -21549 -5308 8986 14155 87030
26665 87030 155146 190179 103163 -9232 -31429 2413 53880 21678 -25832 2885 -7627
26654 -7627 1849 -19833 -62515 -21553 66725 34892 -77162 -182897 -71822 -1581 57589
26643 57589 80903 64113 10985 32694 94771 109533 109750 158281 141549 115605 80616 111654
26631 111654 147776 61207 -65166 -116960 -64737 -71085 -107536 -19224 -26277 -65732 -2439 -4635
26619 -4635 26325 9832 3548 -28184 9272 -5395 -66187 -98033 -50045 14436 -40071 9395
26607 9395 -50570 -98753 -97833 -42701 -18194 -4195 -25708 32215 76227 61136 59881 -20350
26595 -20350 -40565 -41160 -112985 -102761 -124565 -130048 -85686 -40861 -15603 37121 -1482 -76276
26583 -76276 -89826 -83607 -33230 -1211 25024 -37767 -75809 14657 101093 91641 104183 83501
26571 83501 87013 128754 162375 185100 184646 149869 102213 81844 -17686 -72633 -115389 -140156
26559 -140156 -192119 -161168 -105513 -61107 -49699 21645 47606 -18031 43269 113600 72936
26548 72936 45812 25068 -12027 -21681 24356 17309 26498 32216 -36472 42113 20952 15778 -14820
26535 -14820 24367 35924 67972 33379 -42657 -91473 -51276 -38414 -83030 -145687 -183635 -192681
26523 -192681 -118195 -107790 -14606 51735 84501 64963 30493 125247 143966 38095 84618
26512 84618 114267 153480 150072 118020 131888 214268 191053 102066 -41907 -203739 -155707
26501 -155707 -86208 1165 -30150 -84274 -42733 -18850 721 -22526 -14090 55637 26211 -55248
26489 -55248 -32107 -60220 -120713 -67943 20696 -12252 -14160 84097 89083 -43576 -112315 -69323
26477 -69323 22306 38592 157888 136034 81980 33414 72617 99631 131408 121478 91186 17122
26465 17122 -44595 -55988 -63586 -30623 -77987 -48749 -40123 1074 37353 28672 19653 79486
26453 79486 152492 144512 81616 70140 58814 5053 -108304 -73143 96236 168784 176661 98000
26441 98000 87187 131954 108385 43559 3052 13633 -102408 -98593 -22825 19098 15096 -16610
26429 -16610 11091 -11787 -74055 -80646 -56181 10783 -8817 -15140 -38637 -19419 -68010 -40575
26417 -40575 -42704 10658 74085 108516 80131 116289 184044 150169 121544 69426 -42058 -72053
26405 -72053 -133917 -131973 -98344 -105234 -38435 -8044 -19614 -16855 -67224 -124259 -52979 -79102
26393 -79102 -189893 -265454 -195455 -103428 -83425 -27340 8855 -73149 -103949 -86626 737
26382 737 73591 84766 50560 59723 51433 53993 19446 -6820 111435 124082 190428 140138
26370 140138 41022 -21766 -8126 42074 125297 88033 89265 48624 -15930 -134307 -199720
26359 -199720 -157362 -10351 52842 78123 91304 99255 40237 -11256 -25392 -53586 58989
26348 58989 117502 146774 132242 84336 97022 99739 30574 4377 1748 -56158 -23870 -76342
26336 -76342 -34344 81821 183543 141202 39380 7538 36655 96825 125276 96343 89443
26325 89443 14994 -49462 -44248 -5635 37861 17476 50507 50982 5999 85138 74059 38366
26313 38366 -55167 -70539 -34150 -2192 -35731 -54123 -1321 38171 43787 38103 -43292 -96131
26301 -96131 -37774 18742 -34975 -80855 -19121 2289 -18706 -22199 -41724 -127838 -90928 -60847
26289 -60847 4851 41306 -6749 5534 -33508 -26618 62722 94295 57285 -9413 -35822 -39463
26277 -39463 -5111 -25984 -32709 -55671 -15660 64125 20511 -46804 -92870 -94040 -120234 -49662
26265 -49662 -22287 88667 91784 25198 -45999 -82472 -67453 -51475 -83498 -11194 -10803 -13137
26253 -13137 43143 13380 2635 -29102 -78395 -134289 -142051 -44399 42403 97879 143854 194523
26241 194523 151859 56287 101240 111914 50787 31557 84724 86087 82596 -350 -69068 -77867
26229 -77867 -38393 31827 45852 23716 -19751 -15420 28993 -21841 -65894 -53817 -19006 9802
26217 9802 -4225 -31028 -67255 -63378 -66614 -79968 -68595 -130771 -97114 -43161 26033 99424
26205 99424 13763 -40170 -10390 -36531 -57013 -73071 -35861 -19379 -9683 -13820 -107548 -207604
26193 -207604 -134695 -4280 54368 66399 144257 109690 6271 -61457 -41077 -28379 -39825
26182 -39825 -13498 -14413 47029 31767 -19388 -10699 -10440 26853 8722 12576 69527 -1897 44776
26169 44776 65221 72333 102928 113381 119076 67202 -9622 3242 259 -80707 -15657 22816
26157 22816 48067 -15643 -80111 -118082 -157667 -115216 -124830 -130115 -134581 -66952 24885 -15695
26145 -15695 -80704 -30508 37686 63305 -1246 -30013 -12833 14581 86132 101960 111870 74179
26133 74179 71870 91885 118299 16368 -945 -13920 -52967 -25058 -28492 -23634 7638 78776
26121 78776 32122 -56684 -15203 133695 146720 96424 90190 143584 88639 42277 107676 99917
26109 99917 -17198 -55293 -21085 -20905 3464 86851 61335 33370 33096 -42720 -140563 -90059
26097 -90059 -44837 -16656 -51016 -78379 -35574 25322 86377 110239 98512 141876 66443 36653
26085 36653 99790 152488 163190 61750 12381 -7419 -2660 9241 -1800 10742 4570 23858
26073 23858 46050 4164 -36177 -165265 -108037 -7605 -1503 -43550 -156759 -166721 -119092
26062 -119092 -137076 -129642 -66115 -39130 19336 -15330 9779 -47688 -25935 20645 69020 120949
26050 120949 133947 127258 61448 9608 31025 67289 84736 91682 67787 83602 67844 38747
26038 38747 -33056 -111415 -137098 -110758 -145649 -159977 -88040 -42782 53603 18405 -30857 21775
26026 21775 49819 71006 24460 14791 -54482 -13640 68280 27643 -40141 -42849 15488 26869
26014 26869 61695 -55713 -112589 -70705 -62104 -72936 -77134 -54084 -53871 -15799 141621 108944
26002 108944 -24689 -12892 -7496 -21551 -24818 -54603 21391 21783 -28010 33451 83148 21365
25990 21365 3511 -23726 -35600 -26984 -44859 24819 54933 -19509 17491 6622 33078 15581
25978 15581 -59777 -22504 80148 19004 -29803 -24500 -28868 -5952 37974 26217 17335 -33325
25966 -33325 -43494 -967 15505 13705 45786 30294 4978 38885 56442 22877 31001 18510
25954 18510 -48607 -24407 14503 68316 62544 92066 76451 34921 40182 68455 103340 185967
25942 185967 193055 114355 149760 136970 73910 -16360 -148452 -201306 -136889 -51112 27989
25931 27989 14763 2950 47498 60421 19012 59332 81438 104736 41779 -535 8905 4481
25919 4481 28853 33462 16557 -18408 -54460 -119884 -101978 -121697 -91647 -23763 88419 45183
25907 45183 -16705 19686 15139 30443 42866 10369 25986 -33145 -56658 74034 147525 121282
25895 121282 159263 188849 165326 66494 17178 -28315 -28848 -51976 -36625 83206 71587 27147
25883 27147 33644 82677 26127 -9595 3027 25146 -41072 -3199 13364 115293 116077 68748
25871 68748 67226 22284 2449 16794 68571 49266 23727 -56445 -160819 -183023 -91330 -25209
25859 -25209 -17961 -53816 -105668 -118797 -99587 -102357 -115680 -55586 -1088 -84834 -4821 104909
25847 104909 176563 127859 44446 6322 30080 34707 -15434 -28149 -38638 -129208 -169922 -112231
25835 -112231 -100368 -99141 -6958 21553 -11996 -74473 -69957 -22216 10459 50930 58157 40222
25823 40222 4286 -11930 36721 19090 -24199 -69083 52181 97664 84429 25968 42368
25812 42368 69586 53428 21799 48324 2846 35233 63622 50419 67745 85912 78053 142613
25800 142613 119558 36684 -33640 8708 62626 62662 40468 17357 118474 137475 135977 109093
25788 109093 25945 -22791 -40522 -71568 -55482 10540 125805 63673 -50797 -78766 -169705
25777 -169705 -134562 -86517 -48288 -15916 -10608 55258 -10250 -52476 -59540 -34259 -26028 -57920
25765 -57920 -5758 72657 103386 29129 -17512 -10992 17124 41860 -6383 51915 -17142 -89383
25753 -89383 -9541 55484 -18562 -119086 -90239 -14962 -4599 63702 66335 12160 -76927 -43874
25741 -43874 23924 16121 71422 105307 88354 46800 23137 -12081 -34686 -60836 2618 5476
25729 5476 46247 18188 42175 27879 76822 52010 46359 37066 58638 53534 74207 116310
25717 116310 136648 126684 21954 41810 80094 38008 -24280 -78304 -143360 -52863 50764
25706 50764 -13688 18151 82709 -20936 -106737 -22326 28221 20958 2089 39999 61620 121530
25694 121530 106970 -23438 -45676 -94679 -46752 61838 132815 82960 2220 -86407 -39456
25683 -39456 30348 -35934 -53272 -112502 -140852 -170875 -160400 -154134 -207596 -206049 -91817 26329
25671 26329 -32882 69417 180901 119159 23573 -19127 52632 6486 -65505 -66007 -58710 -40212
25659 -40212 4203 22470 17815 72953 82078 16669 25923 20390 66649 47536 -48699 -113611
25647 -113611 -97777 -91286 -56766 -8856 -31426 -40602 31091 57489 107508 60426 -27956 -118643
25635 -118643 -114417 -83218 -68364 -36084 701 -38172 -9158 -7659 27585 19847 14723 79239
25623 79239 95996 56887 34384 16128 -11851 -31296 -19621 3057 20864 -72273 -105387 -62475
25611 -62475 -54171 -111582 -155060 -112451 -67884 -32053 -13740 12088 -36150 -75095 -46769 -68132
25599 -68132 -5925 -36550 -35405 113 55944 77633 91940 143778 96059 -52326 -144887 -74095
25587 -74095 -107243 -122713 -28299 -33422 37166 79271 134354 161983 35076 -21255 3250 -28559
25575 -28559 -13311 -61821 -109923 -113499 -146707 -39490 30351 39665 -15815 -98257 -38288 19531
25563 19531 -61258 -65835 -25635 -9810 -72 -75410 -109934 -163803 -149700 -64520 -6996 32823
25551 32823 76567 156851 110990 68378 -8317 -85112 -64882 35142 7541 10386 -26554 -62596
25539 -62596 -74718 -59461 -20981 -5838 2550 3362 -116628 -21009 79553 106150 43008 35733
25527 35733 -8414 82035 16378 -16256 -57762 16282 64605 112556 75076 -13318 61602 128820
25515 128820 67517 3451 -16408 -35674 -50708 -103732 -75049 -42305 -66879 -35315 40668
25504 40668 121020 68919 52435 30545 -25332 -59063 -60556 -51599 -29569 56474 83183 66230
25492 66230 86900 96914 85090 27783 -111007 -120996 -47915 -63335 -20389 3606 67781 160724
25480 160724 100112 98184 179927 166452 128669 102535 48134 29324 18281 6289 -1641 4409
25468 4409 42173 74063 17489 -61219 -76985 -47179 -23847 38251 54691 48467 68576 61029
25456 61029 54828 40002 -5948 -45810 -128191 -129715 -146311 -211935 -223387 -157651 -75141 -19328
25444 -19328 59276 127333 107840 59758 61450 81697 63296 -76053 -196060 -132385 -126618 -106363
25432 -106363 -41539 -21927 -66373 -80002 5732 103008 62548 11979 -26234 -74844 -67734 35390
25420 35390 81361 74939 -43324 -32941 -22861 -42765 -39021 -36098 -11338 -52985 -86540 -97087
25408 -97087 -54328 37258 64931 46560 -2022 -27785 -15780 46214 122473 105527 -41138
25397 -41138 -84004 -44845 24970 26152 7501 19242 78679 109541 28360 -12043 47581 21487
25385 21487 14787 10551 -17516 108021 53099 -23175 -41040 -50770 -63605 -126265 -144018 -161954
25373 -161954 -237244 -227729 -52160 -39059 -14882 44948 -4020 -39569 -86164 -59704 -79225
25362 -79225 -138374 -157643 -166065 -124684 -219098 -203255 -136323 34695 60363 46186 -3640 23242
25350 23242 31014 38310 19521 23587 -8385 -55289 9283 52283 77391 78127 -10172 -6412 -9849
25337 -9849 -15281 -35023 -66737 -65023 -41457 -30069 -57767 -47908 -2743 39988 69852 48828
25325 48828 29881 37518 49884 107484 101171 27039 -6198 -6103 -10202 -47973 -33835 67640 98438
25312 98438 85569 86046 120569 108373 63783 6762 11590 102226 54683 11798 -19998 -80855
25300 -80855 -16347 39035 -48642 -45228 -40947 -25014 -31926 -11876 73419 70834 10500 -5613
25288 -5613 22250 157139 87842 5423 59780 181316 59529 24477 -24432 -57794 -72302
25277 -72302 -173128 -132245 -92208 -46421 24853 28 -43791 32135 60808 31322 33045 95981
25265 95981 62804 -12269 66098 153978 66881 -101878 -158007 -120719 -113085 -151146 -80823 -8190
25253 -8190 7159 -40413 -5854 33702 15688 -23811 -40723 10390 -2312 12602 -60217 -77602
25241 -77602 -2036 99593 84766 55555 16954 4861 93794 156658 137180 111148 49117
25230 49117 -46259 -59467 -1820 90172 18725 61390 24255 -49191 -74912 -20454 -27060 -45546
25218 -45546 5214 55114 -20041 -132375 -46393 -12419 -88463 -113429 -99583 -81698 -57884
25207 -57884 -58434 -73668 -85459 -46162 -50881 -95652 -117544 -22704 54527 30667 19501 -55633
25195 -55633 -19149 -4648 -14918 -16902 -27919 -34269 -51925 -22564 8833 55278 61095 98243
25183 98243 27319 23685 48382 81305 9066 -56955 -44190 8408 40720 17025 -57119 -38488
25171 -38488 -94331 -123519 -73380 -51690 -112178 -19853 -36880 -99344 -78081 -47728 -66304 -143112
25159 -143112 -176739 -54950 -22417 -32480 -77396 -21807 88549 124080 149265 51319 32044
25148 32044 91506 11374 -62184 -39122 -30440 -23732 -11329 -33952 -76002 -95496 -133577 -97464
25136 -97464 -15218 -83124 -148974 -100334 -17577 -5322 -3003 -98075 -90171 -31916 7004 40324
25124 40324 63737 29242 -19777 -35190 -23578 -823 -42705 -59365 -144115 -270182 -244970
25113 -244970 -107535 23429 100798 183859 233326 150039 39070 39693 -12381 59486 116452
25102 116452 89657 24738 37151 41567 64707 17844 14173 34646 -21498 -17943 -19397 -10447
25090 -10447 -13155 -36660 47077 113362 17734 -27361 10234 -11367 -53437 -49498 -46944 -47842 -1942
25077 -1942 -25930 -71014 -144253 -237990 -226070 -185757 -93679 -87852 -74223 -117646 -169449 -106514
25065 -106514 44669 107859 112696 43706 62357 127435 96135 54141 68590 106832 102852 141564
25053 141564 118352 59745 28658 -12341 591 -29976 18281 48344 11200 68867 109357
25042 109357 53294 8272 28089 73950 45409 54469 82978 19711 -75282 -112820 4448
25031 4448 38274 -6456 -38571 -49777 12777 99427 102077 113203 144748 83760 708 82792
25019 82792 172540 197635 133312 73133 -137 10973 60013 42227 -3778 51119 110055 63581
25007 63581 -25083 -43993 -9343 -46080 -74524 -8555 82809 181175 183610 111775 95831 -18060
24995 -18060 -31987 31068 31623 38286 20014 70349 120231 114042 195612 179458 64417 51157
24983 51157 -2866 -78709 -90126 -40180 13828 145682 187044 149319 83866 51269 16369
24972 16369 12036 -23557 -32476 40516 24153 71673 1946 -18387 62692 164043 152633 100755
24960 100755 66557 130340 113098 84324 34140 9034 11854 26481 -70310 -140620 -186199 -70820
24948 -70820 39499 139341 147287 94789 43113 1126 41555 29768 31654 -15522 44375 3107
24936 3107 18392 64756 120542 128981 97260 29665 -22776 -56517 -108335 -149155 -121430 -25050
24924 -25050 -13212 -59734 -37150 -6708 35954 114050 107143 87598 10732 -54925 -70102 -167913
24912 -167913 -151436 -99970 -13802 80629 78282 -16025 -60689 -77395 -13840 78016 44094 -9261
24900 -9261 -40087 -102111 -190406 -156759 -51085 4701 49486 56661 42504 -63148 -75897 -67747
24888 -67747 -124051 -61343 26374 -7135 -27221 -57531 -60592 -69173 1190 38827 7243 21820
24876 21820 15786 -31188 19619 -25025 -66402 -98389 -100366 -16274 10360 73314 40670 41711
24864 41711 -13513 -23055 7481 66923 15502 -61717 -69370 -93580 -187968 -197110 -206560 -151587
24852 -151587 -83627 14932 68677 28161 -42224 -20006 24053 21443 -12435 104281 226345
24841 226345 213669 142807 59223 9204 -1722 6029 3393 23316 19772 -30503 -128541 -97905
24829 -97905 -74824 -50387 -46975 -20287 -37339 -5886 21978 32594 -56506 -76766 -93199 -74106
24817 -74106 -87519 -61015 -70117 -112444 -104494 -86748 9597 54592 76837 22244 4993 -40148
24805 -40148 -61930 -66456 -35666 -51628 -38990 -22079 -48604 -34745 -48161 -43550 -31553 -71534
24793 -71534 -102182 -122035 -193682 -139668 -57087 21862 52412 30368 39962 81021 117652 82186
24781 82186 49314 26929 137897 175668 137055 86609 23776 -37297 53436 58604 61585 -28311
24769 -28311 -75622 -73687 -57618 -39076 -66168 -90571 -80013 -84854 -34821 -40962 27512 95978
24757 95978 32413 -2028 -86314 -58082 103887 142218 110917 10360 -31543 -21930 -17047 -32579
24745 -32579 -111881 -137066 -159285 -150918 -195761 -187261 -154374 -135340 -40444 -6213 16965 6822
24733 6822 -42804 -126743 -85837 35903 142199 132743 -51536 -135465 -92517 -16124 76002
24722 76002 102571 109715 93173 -5311 56245 21829 -51520 -40838 -36767 47482 -1014 -28804
24710 -28804 -90472 -127056 -168878 -147522 -168516 -197811 -94938 -28965 13900 -31547 81784
24699 81784 148932 168090 114025 87362 49620 2808 1868 -100254 -149805 -88372 -59383 -57795
24687 -57795 -6230 13127 -26648 -30226 2924 -4769 10118 54418 41727 -2910 -23921 -65103
24675 -65103 -94284 -132916 -105825 -65830 -2039 85573 73345 21421 32026 -15455 -7010 -25923
24663 -25923 -4904 -38199 -60857 -70093 -23225 35509 76279 88391 -23559 -109106 -88965 -78128
24651 -78128 -97713 -49418 4485 118529 160204 163682 112487 75642 24016 -86282 -81631 9167
24639 9167 96814 147612 151514 87396 42869 85111 44819 52473 88170 114238 83661 -7085
24627 -7085 -63149 -73864 -46488 4805 -11628 -12760 -47989 -99430 -56057 -23311 -96802 -96191
24615 -96191 -121998 -136783 -128574 -68166 -95571 -202123 -190721 -106007 -156025 -198572 -139333 -14230
24603 -14230 43521 22450 -43237 -116848 -71982 -85025 -106437 -94666 -68915 -35734 -4561 -48804
24591 -48804 -92480 -74586 -71916 -94711 -105994 1648 29591 -11907 -57510 -54054 -37668 -75176
24579 -75176 -50321 47965 17552 -23404 -16415 -10459 -17354 -4109 -14449 -21440 42776 -6779
24567 -6779 -46570 -90488 -75443 -8959 78876 51807 66650 -12808 37192 88993 70383 73994
24555 73994 72303 54291 88154 118839 83407 50207 32079 -6292 -92848 -105625 -106988 -74466
24543 -74466 -87554 -118567 -107727 -19333 40443 92596 46344 49977 37450 15030 19604 -54570
24531 -54570 -88602 -24685 -14381 -27091 -59821 -45689 17524 -74744 -26020 13141 -7073 45455
24519 45455 24822 -11035 -72971 -41245 -12044 54972 -10778 -53654 -45945 -59197 -84628 -130910
24507 -130910 -117227 -108319 -65787 -79580 -105346 -101534 -81947 -111551 -135731 -93220 -38039 -72464
24495 -72464 -132392 -118357 -162620 -127362 -85370 -104916 -118439 -155995 -152529 -104061 -112123 -64762
24483 -64762 -63684 -53807 31946 48614 72582 71910 -24809 -55454 61508 146962 154116 135525
24471 135525 60546 15836 -89228 -96942 -63777 -78758 -10785 -155 -5191 33717 -17303 -21267
24459 -21267 -69033 -69266 1309 14742 -25786 26806 90211 60905 35045 133517 126463 19044
24447 19044 -33338 -80783 -29070 33455 19355 78632 -17116 -98328 -9203 63956 41208 87284
24435 87284 37293 95750 79681 18302 50544 81469 120087 83569 -62893 -85847 -51452
24424 -51452 -61666 -36431 -55127 -172485 -156888 -107089 -103576 -67426 21216 103804 69434 -82358
24412 -82358 -125108 -94467 -104783 -73961 394 -34769 -102615 -25420 18510 -8434 -72002 -17482
24400 -17482 24628 -17897 -101640 -100089 -83123 -7189 22040 68030 59948 112492 117296 56648
24388 56648 -5379 -41821 -15792 -9524 -52909 3959 1601 -33878 30813 90370 -8278 -121602
24376 -121602 -132143 -110258 -90303 -105588 -28013 -919 -54158 -88462 -31827 -45494 -172892
24365 -172892 -185135 -114595 -136297 -132849 -173181 -132119 -82701 -86251 -126418 -70912 6507 -9322
24353 -9322 60753 156272 121578 265 -26465 444 5395 38133 -3585 -112671 -179170 -169366
24341 -169366 -113616 -50454 17995 -10168 -133601 -189195 -129427 -133283 -123705 -64481 -117738 -121197
24329 -121197 -178572 -205675 -173710 -114695 -16106 -1906 -101724 -134273 -109872 -149501 -22991
24318 -22991 -31934 -51506 26216 73219 79814 103089 25940 6521 7535 -29410 -19646 -51134
24306 -51134 -32741 -1636 32899 28645 39548 58998 58491 -38343 -54367 -68092 -68314 -46089 -53167
24293 -53167 -34361 -5016 13985 6873 52380 172625 128909 -59055 -81066 18953 21096
24282 21096 -16749 -39783 -49264 10055 6458 -86917 -124491 -96489 -76800 -77863 -52263 94610
24270 94610 144110 55411 16355 14024 69561 32468 -60654 -65965 -24600 30303 38536 24674
24258 24674 1776 -61972 -85151 -111722 -115272 -42691 376 18705 -28711 -50828 -19918 24048
24246 24048 18198 -75542 -124486 -125272 -102045 -69390 -18495 -42957 -6008 72078 88451 24309
24234 24309 25304 77232 76708 -13170 -3140 -125264 -209142 -162408 -142491 -148798 -165980 -105138
24222 -105138 -80668 -109615 -37514 -17348 -73334 -66971 -23050 -27154 -51626 -27771 12057 38534
24210 38534 12610 -3308 14094 11462 10384 107487 102951 76725 55327 -13840 -42462 -88373
24198 -88373 -89844 12233 12192 -52954 -44857 -9479 -10471 -2375 12900 -61110 -157868 -151988 -88243
24185 -88243 -40387 40887 61729 34522 -80488 -85132 -36403 -68953 -75909 21942 91293 -26172
24173 -26172 -132162 -100385 -82121 -10130 -16429 2479 73675 87334 13211 -3311 119451
24162 119451 136451 95907 99018 5462 -27875 44994 17100 -1713 13031 25591 -32085 -90151
24150 -90151 -100099 -59304 3504 91158 5105 -20501 -63898 -133181 -144355 -148876 -126270 -23040
24138 -23040 -8154 6298 19359 -42481 -75086 -77467 -74125 -155614 -166814 -140118 -39156 19610
24126 19610 -35502 -33282 -48806 -14362 -12974 -12951 3682 -14948 20315 -48202 -48554 -4541 -50475
24113 -50475 -95124 29333 84522 -14227 -127412 34226 86236 -7463 16888 56060 9187
24102 9187 -38775 -16728 48978 15046 21484 101807 66623 23093 55265 153259 126669 81848
24090 81848 79417 53967 -69152 -66673 38270 92128 7198 28140 143104 191997 185628 109038
24078 109038 -2307 -41250 16320 110726 148440 130624 70210 -3257 4480 62049 11739
24067 11739 20683 -18761 -37683 -58239 -110222 -24285 42110 -18511 -33943 -166823 -226169 -189386
24055 -189386 -93705 -79715 -107463 -176423 -186280 -184808 -181860 -87244 -64140 -95271 -20480 -28042
24043 -28042 -63737 -89084 -88494 15792 14693 -31467 -190598 -188428 -137841 -120429 -60868 81043
24031 81043 101916 19968 -59826 -33588 81727 112150 98657 39492 15581 -45083 -8642
24020 -8642 145741 178614 118974 60080 33767 67620 145349 154120 84309 95994 93850 107800
24008 107800 118423 78476 25683 14150 -16112 -2302 -29139 -25623 81067 84695 43514 14410
23996 14410 77333 132020 167366 91540 5803 -8786 41834 95499 -4159 -36317 -2653 68593
23984 68593 52644 -42166 21289 78437 118060 86625 49551 38356 74821 25464 23236 82311
23972 82311 139865 85589 -20623 16824 22564 -6625 -33814 -44949 -56668 25195 -895 -101220
23960 -101220 -116070 -75616 17084 36075 -14583 -88474 -119564 -136861 -60953 -30736 -49845
23949 -49845 -113633 -56990 -37208 32407 -11642 -53365 -4200 -36770 -55376 8956 47347 46668
23937 46668 8438 -50974 -98585 -112425 -117286 -143886 -166490 -188457 -118625 -38113 -48562 -179144
23925 -179144 -225910 -178645 -95203 -29273 -51054 -19959 49722 66291 -4644 -38069 -108308
23914 -108308 -143536 -182299 -168818 -151614 -105945 -99311 13016 14250 -47240 23328 100033 96850
23902 96850 25095 37847 57607 39657 37480 48038 57282 102058 68689 22848 5765 -48504
23890 -48504 -74279 -94643 -123951 -49286 -11709 836 -71291 -164105 -119648 -64220 -23631 -62022
23878 -62022 -88758 -38114 -5677 -12834 38672 50227 -26114 -91668 -70026 -41825 -88806 -109490
23866 -109490 -68551 -88197 -56292 -59772 -98712 -43843 -109501 -185285 -170284 -138025 -119051 -107696
23854 -107696 -3707 5141 51369 -5874 -57888 46054 118806 33828 -40848 -44315 96995
23843 96995 125394 56917 -24884 -21229 16461 57259 87871 61145 43656 23150 -7882 -44180
23831 -44180 -37207 2534 21976 72869 84781 74345 -8037 14256 34193 24030 6684 -24925
23819 -24925 -72193 -38509 -34940 28757 42995 6738 -22205 -71683 -108595 -112216 -24933 16463
23807 16463 -23321 -11663 38269 74858 31498 -22061 60064 42416 47577 43511 -28186 -28985
23795 -28985 1290 -17542 -2047 71197 25338 1179 98284 98749 28083 -2400 -26747 1129
23783 1129 -47525 -66117 1125 35643 87512 70723 36579 46356 37658 18788 -26731 71323
23771 71323 102631 37772 -13035 -105703 -177185 -136227 -82231 13449 -26464 -75392 -40318 -31270
23759 -31270 4057 5160 -22619 -14848 735 -24982 -51802 -55507 -123150 -114669 -3674 13377
23747 13377 13183 61771 40513 72927 44120 32537 9611 89690 70667 32967 41675 6865
23735 6865 26410 -8345 -42839 -32166 17335 55557 47171 5656 -2293 -1403 -50088 -69210 -117291
23722 -117291 -46816 38738 62343 1756 -68172 -8687 37512 57121 70802 35030 70549
23711 70549 82275 124510 90735 69945 50990 24842 39671 -22171 -90554 -53480 23468 53840
23699 53840 52125 21753 84977 122116 87875 106351 97117 141804 105297 -9435 -50205 -20503
23687 -20503 93677 147811 171828 160485 190456 192456 180151 130078 80334 43091 45837 50783
23675 50783 151940 226400 213894 236063 199390 109620 181406 196379 242254 265794 185833
23664 185833 155793 53431 31098 2621 -38140 -108103 -122185 -76704 -30565 -104786 -99559
23653 -99559 -41112 -67783 -116937 -104355 -32565 -12215 25657 -35898 20016 58869 78241 69946
23641 69946 31234 -61095 -128095 -153128 -175043 -105750 -26184 -36648 -52320 -82117 -107403 -158687
23629 -158687 -158511 -134827 -78950 -113598 -154138 -180637 -119082 -166926 -234930 -202888 -165466 -145481
23617 -145481 -150133 -123823 -4593 -9346 27632 11907 -5866 -19036 -44974 -59782 -9250 68004
23605 68004 40507 57634 71437 35505 -8539 -1006 32389 119386 154072 112869 52116 61489
23593 61489 43282 75836 123519 167262 119394 107189 123400 112199 143209 135758 42413 -3127
23581 -3127 -17110 5578 54250 117256 149523 182506 176394 148404 55734 10527 77945 31155
23569 31155 452 -62954 -70055 -7671 31735 49251 44834 68876 37525 53085 51015 72039
23557 72039 33506 -18791 29898 22666 -49635 -99751 -46091 578 74409 126168 151108 114984
23545 114984 96960 120813 19796 -43919 50425 44697 -50389 -28893 23922 -4484 -4376 -53365
23533 -53365 -30388 -40466 -47524 -37800 18680 30025 -24795 -105394 -115428 -70589 -124895 -155011
23521 -155011 -100759 -37805 10614 -1 -10972 56153 141831 126749 55439 74132 119395
23510 119395 92071 50746 -49140 -35685 -113080 -109251 -38209 -27340 3200 65825 14268 -67374
23498 -67374 -72207 -58117 -49220 -87115 -19659 40277 106242 101869 58589 100298 140464 78693
23486 78693 87578 42663 -28235 -101865 -49291 20782 53618 -6880 33313 80671 71178 29498
23474 29498 32251 35522 47373 45689 72359 -12031 -14926 11965 -28886 -12503 -16412 4135 46058
23461 46058 27963 -29359 -50999 -44400 -13084 -93766 -123695 -21968 33541 20581 -69768 -28446
23449 -28446 76804 84892 -2084 -10409 -54204 -85359 -119129 -58987 -64273 -112318 -70114 -60515
23437 -60515 -44349 -45121 -13762 -11360 -6102 61401 86907 3439 21209 36000 53042 17944
23425 17944 -17104 15184 87191 48313 -9211 32016 30625 9428 -23481 -6098 -43709 -53926
23413 -53926 -39980 -45174 32614 89163 42167 -16026 -29985 -54640 -108919 -110386 -97585 -124584
23401 -124584 -132993 -127982 -143457 -147691 -133467 -142304 -114188 -41134 22576 65636 52801 2506
23389 2506 -36614 -96392 -161191 -120757 -88743 -19606 8777 -12316 -14068 14362 47221 71640
23377 71640 8489 -11692 28336 57097 3893 -37886 -31134 -3632 58681 -19913 -109329 -88851
23365 -88851 -57743 -28032 20609 145939 138725 148672 97027 20432 -30374 35408 38441 -24249
23353 -24249 -63455 -43753 25254 92370 48256 -57094 -80495 -51838 2149 -23545 -9870
23342 -9870 -41755 -33246 -41512 5585 26895 93571 170454 134236 62505 -21602 -11912 -23926
23330 -23926 106807 96769 47871 15040 -27259 -26208 -10610 17953 22304 -21820 -2474 44573
23318 44573 2672 -38556 -97945 -66274 -102828 -63714 -43770 -62262 -61365 -95721 -18642 26503
23306 26503 104786 84409 6544 -34027 -38386 -45521 -108762 -79050 -38216 -102417 -100162 -53399
23294 -53399 23873 45080 64689 -8594 -46561 -47006 19796 45222 -50498 -78627 6760 4600
23282 4600 -10377 -56587 -91343 -141692 -201478 -193472 -139037 -65185 -38457 -11775 -94694 -76566
23270 -76566 4279 3948 -26242 -82569 -78630 25003 60593 8574 -66084 -87329 -95165 -50777
23258 -50777 59048 128437 46454 -21085 -33043 16508 -6210 -46240 -47756 -72304 -65858 -24245
23246 -24245 1142 6432 -48623 -104698 -180767 -146348 -39160 20410 74170 -1686 29896 74740
23234 74740 9086 -39718 -26981 18686 11102 34089 -43041 -102869 -68364 -29506 -13358 58036
23222 58036 105723 41232 -62914 -62016 -28117 11004 44414 41791 38104 73930 45737 46419 86630
23209 86630 -38098 -82282 -87780 -73050 7614 1005 -51629 -66876 -47550 -115600 -80494 12352
23197 12352 21074 -1032 39514 80949 42741 -12574 37094 108879 37548 -53978 -7861 -31302
23185 -31302 -74499 -107658 -81093 -16073 22944 13163 -5255 -26853 -25603 102680 156090 83534
23173 83534 -19594 -43065 -51418 15584 32665 158008 234457 148112 62309 16410 -97530
23162 -97530 -119547 -64429 28073 50171 81552 89049 38043 5127 30424 16657 -56339 -45104
23150 -45104 -58798 -62065 -57865 -166977 -236441 -239289 -217623 -253295 -249329 -179735 -131131 -135500
23138 -135500 -51754 -34280 -114163 -150707 -48701 -91105 -167422 -132908 -129768 -96850 -39147
23127 -39147 11201 69805 122508 144417 92037 8062 -91855 -26161 5319 -51140 -79389 32288
23115 32288 99233 26774 -10955 -10287 -43430 6056 151751 133710 115542 137830 120096 42844
23103 42844 -11791 96080 140536 65431 22351 -12904 6927 -10731 -33509 -87135 -95098 7428
23091 7428 56111 27628 138856 176710 110949 123313 96495 117006 105215 61331 14835 79328
23079 79328 75327 46024 118997 199710 129074 41494 27886 -2061 -74278 -132156 -61342 -53122
23067 -53122 -118025 -140048 -83398 -45005 -35847 5415 -42428 -39650 6577 64960 -13558 -28075
23055 -28075 12442 24819 15934 60885 143413 158967 59797 28346 19208 150147 227437 226604
23043 226604 195817 125630 144392 183807 165836 114826 104941 134237 71343 -28448 36396 78040
23031 78040 57782 101687 87863 128390 199395 116621 73160 40103 45025 3165 2984 5242
23019 5242 -63408 -137716 -94738 -58676 -4340 -8872 1472 57580 407 -140412 -144579 -58975
23007 -58975 -46360 -35924 -74988 -75231 -137029 -124959 -112608 -92582 -9600 4133 68626 68841
22995 68841 5263 12590 101260 38015 49185 16347 -19854 29745 90151 52588 13841 10345
22983 10345 -24236 -43896 -12484 -59027 -13075 56300 120035 133450 25692 -113808 -94665
22972 -94665 -45602 17707 35497 93044 13447 -24418 21680 9609 -45551 -73355 -100034 -136325
22960 -136325 -61813 23038 -7253 -21220 -51193 -73793 -99076 -55958 1898 -22371 -39742
22949 -39742 13378 58393 27259 17310 -5436 34275 16850 -57211 -70126 -28981 23515 -11736
22937 -11736 -151 -1970 56957 110473 88985 35521 -896 -65666 -89550 -2070 64669 -14354
22925 -14354 -12646 38451 66394 127486 283977 240296 104537 -13166 -34349 23633 -12868
22914 -12868 -42401 -34005 -33450 -121483 -249144 -235986 -109997 -57911 -152159 -160301 -137465 -122331
22902 -122331 -113984 -82483 52494 91228 33305 27318 19858 11158 107706 100091 80865 124015
22890 124015 40476 -16559 34889 77709 35180 3445 45996 14457 -7769 -14376 -46761 -89103
22878 -89103 -90065 -101492 -59492 -12438 7524 -3064 -105301 -49764 54863 11863 15163 52250
22866 52250 23866 2367 -100856 -113182 -71465 -42439 34241 36298 2825 37521 9807 -70041
22854 -70041 -96880 -25780 5958 -23481 -28489 -57726 -41808 -30623 -34434 -19632 -33885 21589
22842 21589 21669 17011 -62839 -109121 -127729 -11474 122898 137801 92806 -24655 -66078 17870
22830 17870 40019 2111 1956 3308 -8763 38563 59756 27680 16922 47684 -8750 -156077
22818 -156077 -168355 -115388 -170450 -171208 -146168 -86491 -29021 25156 7552 84718 40777 -110
22806 -110 -14390 11492 59117 28615 38162 86895 135924 65317 -27724 -50258 -92868 -40245
22794 -40245 -2995 -48175 -55946 -12103 -48787 -23201 29387 -2694 -36833 -105208 -141203 -92237
22782 -92237 -22846 26890 15267 64410 87698 64314 117664 109212 1224 -94101 -61879 32556
22770 32556 52868 37280 -18951 -7346 29819 -49842 -74238 -77423 1418 -6759 -22263 -6182
22758 -6182 -82647 -71760 42261 56806 74829 105629 115779 70412 102477 92521 33805 -15119
22746 -15119 -11283 66246 111349 125119 53002 3427 18438 22229 26651 -270 53464 107194
22734 107194 164612 100805 -34871 -37664 36701 -1529 -55097 -100577 -137868 -125858 -66143
22723 -66143 -2666 -16444 -46546 -86282 -165526 -117449 20 44200 -48618 -72650 -54538
22712 -54538 20314 25636 -71811 -124355 -134733 -62039 30929 102574 127568 108689 101499 4507
22700 4507 -93927 -150437 -120682 -127040 -97392 -130138 -148735 -143921 -148137 -114016 -107002 -110526 -88380
22687 -88380 -138001 -126434 -119252 -113354 -19289 -78819 -142930 -169905 -195420 -120497 -68921 -67161
22675 -67161 -176106 -225286 -159064 -88803 -102602 -110692 -150227 -155298 -27283 55615 13226 -52933
22663 -52933 -38495 12934 34378 45215 -21853 17453 44536 -26386 -134883 -183039 -111067
22652 -111067 -59737 -120690 -138606 -30078 -2150 33021 48456 70535 43235 -18148 -54664
22641 -54664 -113936 -101715 -54334 -47519 -126690 -76953 -65128 -134579 -146597 -185936 -166652 -146066
22629 -146066 -154924 -110411 -80105 -48415 -10415 -7563 -37200 -52499 -9277 59932 56394 -3372
22617 -3372 -15181 41339 72818 84575 -2989 -42528 -50200 -80024 -136675 -122448 -57502 36512
22605 36512 10964 10985 10851 104475 144901 52419 -13727 -17714 85725 69865 31261 9768 -7228
22592 -7228 7792 -16813 -71946 -84796 -60614 -2131 41174 77944 77910 35771 62981 53524 -22466
22579 -22466 -13649 61576 -14978 -75066 -18937 14550 -42140 -68668 -28950 -66744 -45497 25144
22567 25144 46462 97294 116234 103361 82987 9817 -56073 -83958 -55921 -98153 -43909 -29205
22555 -29205 -30566 24181 21138 -22368 -86498 -91414 -57937 -22218 894 -104381 -164366 -137725
22543 -137725 -111363 -69787 -58212 42482 76647 15207 -22763 -10111 66530 24653 -5699
22532 -5699 41213 71016 -11093 -28805 -39347 -49067 15487 -7602 -39237 -28821 38557 -11521
22520 -11521 -17434 -81542 -100401 -66287 -7901 96332 80031 50231 890 35760 -1914 16980
22508 16980 50806 32336 -975 71788 55302 -4755 -95122 -26958 53830 10148 -37703 -13411
22496 -13411 -19315 -35080 -75022 -96456 -138395 -81131 22129 66744 -15389 -37037 27523 10523
22484 10523 36190 70739 53126 69023 114333 93865 95580 65494 -6170 -37045 -73993 -54539
22472 -54539 -25089 -54839 -26059 12654 25767 22323 -100714 -108995 -30555 59567 105261 66399
22460 66399 63250 23226 4566 -66777 -45400 8146 22574 -43067 -84955 -85526 -58419 -54547
22448 -54547 -155334 -185834 -141427 -101058 -131184 -22678 80488 88041 13571 -65059 -85973
22437 -85973 -151212 -165567 -69864 -81854 -125004 -124161 -57756 -56008 -13769 36089 36401 5848 2629
22424 2629 -66611 -31527 77594 78895 61640 22879 -62917 34625 97229 29624 -39377 -62773
22412 -62773 -65927 -97356 -46269 23525 3678 -3204 -46086 -49191 33124 41364 -30492 45567
22400 45567 207219 151805 54524 29138 -47529 -52771 -52146 -37339 -82961 -149192 -157383 -46117
22388 -46117 8375 -26367 -92932 -77513 24324 19320 -54341 -2764 64369 147515 113996 44519
22376 44519 22213 -17025 -16264 6955 -19908 -43779 -16559 76050 67173 22542 -7017 28007
22364 28007 19831 81532 183976 202180 140501 86201 88822 87998 -26189 -68273 -61576 -38390
22352 -38390 -10348 -54510 -22400 9610 49391 233490 280636 162565 87671 110362 121409
22341 121409 92038 83655 53803 32884 59950 32744 61523 69887 134884 158107 77083 48184
22329 48184 40097 3765 -2737 -49777 -80067 -88625 -22511 4489 -43651 2020 91225 64107
22317 64107 -17470 -103676 -39500 -17657 -59539 44196 123066 96159 39916 65125 81177
22306 81177 32712 2426 -5898 -102067 -77083 -71818 -64339 -25277 -72681 -115190 -124755 -103130
22294 -103130 -56272 -132346 -64174 26384 85672 87321 35738 8088 -81574 -163991 -147705 -98763
22282 -98763 -37804 60104 112862 131914 93465 40178 -46996 -72641 -87266 -90795 -48092 -116584
22270 -116584 -71606 71474 81283 32963 -34579 -11968 16543 -85466 -158114 -153960 -112431
22259 -112431 -48710 -10029 -17706 -32037 -22068 -107813 -158366 -37042 29744 -13963 -72949 -61258
22247 -61258 -27695 -106772 -120631 -119258 -54756 -56511 -83101 -94287 11421 141257 111942 43591
22235 43591 -13603 2938 204 -4723 60988 134103 186939 143263 13399 -31134 -26739 32637
22223 32637 66492 110398 25450 -40383 -84778 -112397 -108021 -119576 -52311 29410 3144 -18569
22211 -18569 25013 54745 91542 37946 -47104 -42869 -3972 5624 3548 23941 97007 89916
22199 89916 137009 78722 51782 63882 62616 60726 20707 -20943 -12922 39835 -328 -62961
22187 -62961 -118015 -154043 -134157 -58153 -29751 79170 165348 145317 73676 34356 62004
22176 62004 181628 159253 132486 116324 38370 -13634 40015 34912 34761 50541 76146 41201
22164 41201 -8732 -1591 -13962 -26934 1006 -46313 -75188 -60469 -108168 -164254 -90942 39807
22152 39807 83305 68751 43783 60362 -7920 -50073 73273 82716 3887 -2888 59761 77320
22140 77320 13143 -10033 -39975 -133210 -168692 -107178 -57301 -62083 -78388 -167656 -201789 -91404
22128 -91404 -49852 1445 42527 120898 38765 -86091 -81670 -33902 -51880 -110843 -80593 -45247
22116 -45247 -28086 -27502 -29083 5090 -14016 19456 -21076 -36186 -72357 28511 39397 -7605
22104 -7605 -89015 -141517 -144657 -250003 -203474 -83901 -37993 -76200 -25488 -17770 -73196 -101103
22092 -101103 -114092 -62024 -63310 -52946 -50261 -85733 -72612 -18019 24141 33202 -5316 -60661
22080 -60661 32049 22647 -62695 -63597 -17875 -18832 -127781 -174681 -108662 -114308 -138743 -139139 -154679
22067 -154679 -217870 -148055 -71789 29504 106280 147927 127829 56912 361 -31193 -33513
22056 -33513 -3967 32384 9302 31601 57880 25284 12916 19631 -45544 -22782 -26378 26451
22044 26451 688 -43781 18688 -11654 -133600 -101623 -46844 38731 93862 89120 82255 55277
22032 55277 -72039 -176122 -158716 -149199 -83575 -42689 -29279 -22402 -48138 -43930 -136965 -97834
22020 -97834 -44240 3944 46877 48444 63583 64284 -78593 -59692 15455 25552 73066 147064
22008 147064 82206 10413 15851 -15492 -6669 -40045 -36656 -6233 -20234 6925 56299 19308
21996 19308 -63468 -35121 35853 -50024 3639 17306 27747 26045 81528 104827 104054 15306
21984 15306 -29820 -60410 -70584 24618 16218 -20411 -15242 36400 12619 33053 -9184 -22183
21972 -22183 70747 86585 10129 -50259 16429 41552 -24458 35722 52996 36032 35995 -10198
21960 -10198 -24702 19119 76061 64341 20473 47621 25869 -92237 -159631 -128431 -83113
21949 -83113 -38209 -11362 -35369 -86103 -49055 31488 1213 -10264 -55770 -126515 -132281 -130063
21937 -130063 -99400 -108263 -143565 -152112 -130077 -150211 -60843 55843 -44191 -64046 44532
21926 44532 99063 24390 10422 41136 -12168 -104392 -80882 -75012 -62517 -73328 -86296 -76353
21914 -76353 541 31924 -65760 -24489 66259 6116 -38504 -68994 -73031 -19202 12829 -18744
21902 -18744 -83780 -58655 -59418 -72214 -120630 -139645 -137573 -99078 -11800 -26515 -120067 -28152
21890 -28152 122145 134695 81995 15479 -26062 -336 -455 -1931 44669 143059 118839 -14053
21878 -14053 -47767 -21494 29582 32263 -13438 -60376 -65409 -7904 22524 -45192 -1182 -9526
21866 -9526 76211 145038 173150 115089 91228 35232 83585 53968 63971 42548 32987 42491
21854 42491 62604 -488 -50304 -18350 109481 109483 68885 44795 18188 -7260 26981 2025
21842 2025 -41651 -43590 -81655 -72785 -17065 -15973 -55256 19655 49719 41591 -75590 -188669
21830 -188669 -166328 -94467 -24929 -28457 -2689 2914 78499 102797 57033 45319 -52179 -89696
21818 -89696 -27231 -44723 -19144 48460 9734 -179 -33021 -48964 -43954 -1572 57955 28238
21806 28238 -17475 6816 65803 -3939 -9608 31324 59632 74499 12558 -51603 2953 29741
21794 29741 -10058 55200 106891 86270 80377 129506 119480 63603 33657 -23183 -1262 75917
21782 75917 107055 143025 91836 27890 -15585 -34870 -80955 -66552 39459 79577 62389
21771 62389 34640 68591 8745 -21509 -16491 -123516 -82178 -66225 -84446 -95172 -77360 -56405
21759 -56405 -60765 -22687 16245 10932 -77643 -53843 -64541 -140587 -234061 -280887 -162779 45252
21747 45252 82612 74174 78771 69055 -31595 -91076 -64451 -61643 -121626 -63268 -34216 -46756
21735 -46756 -32083 -67624 -69151 -38600 -24446 12212 -36835 -45727 -5386 -2677 30431 47827
21723 47827 89679 46974 -2107 -68971 -163596 -107790 -31994 -42424 -48690 -4267 28273 -59756
21711 -59756 -76488 -77798 -89633 7193 46301 33169 -33344 -27805 36213 83569 43813 27272
21699 27272 -13364 -26711 -25070 -55068 -4938 -15278 -98733 -53657 -92025 -134848 -67024 2136
21687 2136 -29833 -50477 -50955 20896 66591 88422 72190 11123 -45407 -43119 -9512 -100057
21675 -100057 -117670 -89846 -9263 272 -27751 -123885 -156782 -75049 45583 91959 82087 68866
21663 68866 71512 53010 94976 87315 17709 28850 24545 40887 33941 -77959 -97932 -65342
21651 -65342 -38766 -68902 -53740 -14393 -28186 -2752 26375 26037 11946 -53278 -96924 -135827
21639 -135827 -97153 -6642 9637 15490 6718 -16740 -16072 32187 -17336 -19893 11188 -28915
21627 -28915 -17448 64436 41594 -41601 -66583 -126486 -221422 -169716 47229 220931 211505
21616 211505 136882 89999 72041 62864 43781 98756 158412 125960 106776 153331 117678 17293
21604 17293 -76916 -98045 -65176 -81839 -63761 25761 85023 88281 83205 71948 14272 15763
21592 15763 -12798 27161 49290 30719 -77304 -133342 -95093 -31278 -112 -7534 -18590 -7462
21580 -7462 -50025 -147578 -177296 -141682 -74364 -44022 -13782 -136781 -234310 -131571 -45397
21569 -45397 -48042 -148676 -151218 -66113 17846 35694 1792 -6840 19450 42762 86802 134203
21557 134203 121823 45463 3418 79314 94143 44978 -26516 -99618 -151181 -176919 -142408
21546 -142408 -85397 -58928 -52204 15003 62877 75381 83489 3690 -7238 23182 54012 1057
21534 1057 -64903 -36143 -18124 -88480 -65962 21872 131026 129408 110056 43943 25020 73800
21522 73800 104540 3494 -49761 -3291 -4569 -47060 -5690 56632 79600 119838 189811 223387
21510 223387 142549 93103 53596 26951 10969 -100998 -160698 -45700 28087 -10532 -77532
21499 -77532 -124750 -125967 -62040 -33649 -45615 -47257 -51781 -67920 -59765 -46117 -54709 -56025 3756
21486 3756 14534 -729 -29552 -44424 -24723 -76523 -38097 247 11786 52402 62341 44445
21474 44445 19094 17544 14123 98789 124420 152840 189459 114520 89759 73225 41350 -39661
21462 -39661 1764 40319 -45617 -39052 -55100 -74137 -38758 -28339 -71471 -61861 -34578 101909
21450 101909 61639 -21411 -11920 -38618 -61200 4464 100194 104498 42405 -39003 -15480 40337
21438 40337 70243 45936 30766 -58442 -84302 -11143 -85058 -41420 -34413 -42843 -70546 -107525
21426 -107525 -75092 -17803 29121 -7083 -16016 -4916 -47483 -733 69163 7114 -30579 59928
21414 59928 66451 101660 124273 116729 22134 17742 19419 42556 102872 179159 218265 174197
21402 174197 118418 177557 215188 176930 109256 104853 154222 239386 165724 28564 -40028
21391 -40028 13499 65127 64412 64131 63951 -9085 -162078 -164780 -134889 13468 143032 152701 119492
21378 119492 69543 37472 47972 52191 23457 5117 -14675 34468 4616 21808 8345 -1652
21366 -1652 40383 -10064 -61908 -71855 2648 57998 46345 57178 145149 204559 80853 33357
21354 33357 12725 -88271 -25675 -35149 -37423 -31428 -37287 -73230 -80683 -46667 21425 35775
21342 35775 54481 77752 153823 163667 124377 97149 215609 255340 158937 83754 95672 122451
21330 122451 203891 217005 180769 137897 153340 129133 -4396 -76763 -48128 -75436 -20396
21319 -20396 -45387 -79858 -78078 -133359 -170792 -121410 -37574 -62898 -56678 -39544 9787 67671
21307 67671 30845 -54086 -36013 28049 18108 8846 41075 94595 189952 155703 39674 28139
21295 28139 10542 58185 97210 89136 99323 83819 -1490 -15309 -49671 -26300 -22986 -31674
21283 -31674 -46623 -58009 -27176 18507 100677 49144 44853 62655 149673 162356 178214 139393
21271 139393 151550 93871 110967 35413 -9248 29762 -39927 -147971 -51434 82964 81926
21260 81926 65589 69870 73546 66869 53111 47311 34834 95869 58336 11416 -34425 -74902
21248 -74902 -17121 -63044 -81850 -44432 -96894 -83725 -35982 44936 48796 53772 16825 -46818
21236 -46818 -7221 65302 -26781 -59667 -9052 15074 -59991 -19503 -2402 -78013 -139217 -134431
21224 -134431 -59880 -4924 13143 -27081 -14592 59229 100860 97857 147025 174940 109475 111985
21212 111985 136716 139988 134998 110475 104403 30500 9453 17676 10729 -71305 -180254 -103516
21200 -103516 3656 41883 21378 103266 148065 142528 145037 160246 161988 164490 128464 193229
21188 193229 195127 128529 96120 99816 59138 -29369 -44475 -16758 7965 12049 -23648 -107368
21176 -107368 -135049 -80107 -46328 -127829 -110938 -53130 -56249 21504 94709 122069 138561 135971
21164 135971 185294 210081 272552 300130 282414 180035 103710 56115 32269 -14545 28574
21153 28574 70670 133621 129021 28578 20352 9327 -21951 -129792 -66003 53688 8670
21142 8670 -110197 -58475 84942 148543 89238 138435 262488 434819 618259 775285 781983
21131 781983 622479 472374 372736 252333 219471 292478 310844 278383 383472 356606 365063
21120 365063 337093 338507 559868 736713 878991 846724 791933 657079 421359 329353 309935
21109 309935 377582 414567 446367 462261 501176 666351 800268 915021 921601 806032 587038
21098 587038 440518 304483 254998 231861 116378 93083 155401 217487 250174 307307 500440
21087 500440 692669 792906 832581 690389 573254 447870 346341 284805 221093 250063
21077 250063 177982 130896 114726 59264 87266 131616 41694 20478 -24500 -25672 -17736 -52717
21065 -52717 -75714 47922 50938 -32480 -92905 4146 10545 66909 43981 98594 162030 225360
21053 225360 246090 216926 255502 171739 60081 35971 -34028 -63500 69252 58971 -16228
21042 -16228 -14395 44278 100728 53420 -20236 19025 52568 12546 9886 -68419 -84606 -86592
21030 -86592 -35490 -10894 -17541 -59751 -20538 33717 67818 22264 29189 6870 14191 52903
21018 52903 6508 -15883 7917 1280 62850 112824 68097 82868 90624 121009 111042 21449
21006 21449 25905 319 -19096 3460 55274 46303 25781 113618 112191 69252 97771 137943
20994 137943 69150 -49048 -114007 -78964 -16216 5621 13853 49991 158930 282042 210870
20983 210870 151531 121483 57621 -11385 7475 12332 -55341 -27618 -11250 58883 97028 82532
20971 82532 111466 200283 179991 167125 170166 200887 210708 186758 187478 37635 -43515 -98540
20959 -98540 -156737 -198912 -47322 14325 32456 64107 57722 20164 89114 125096 35165 -65694
20947 -65694 -16669 49654 47004 5448 -7809 -14253 16835 7871 -64287 -10627 55363 87230
20935 87230 72082 72668 77586 51784 29694 109972 77310 94665 129901 107193 64831 117584
20923 117584 140159 81758 53226 106458 115696 107685 128147 40615 -14952 127021 148890 55597
20911 55597 45281 75355 110996 74747 45281 50605 30132 45507 8779 26783 46698 33314
20899 33314 37263 24575 -17019 57332 137043 136026 58872 -34638 -26040 58851 69230 38921
20887 38921 -29057 -70687 -71268 -120952 -110379 -128485 -122842 -39314 18373 81927 126233 37521
20875 37521 69724 140440 129634 133684 162698 121828 130585 119635 155210 127946 166717 196742
20863 196742 201769 241318 227904 239448 232367 123614 85074 76493 25498 14027 62683 -4745
20851 -4745 -83701 -37310 18533 56932 14421 -95154 -116473 -80979 -112785 -144853 -132326 -34146
20839 -34146 53293 40511 146197 169663 126162 76917 107987 118745 142985 220656 217727 196307
20827 196307 35190 12692 130834 162549 198649 270773 272716 172199 94678 128045 41939
20816 41939 83841 231618 213676 253929 316640 280638 252431 222232 190268 223135 287254
20805 287254 289782 350495 295957 291142 281856 225676 228115 191723 176561 155027 195637 188286
20793 188286 204559 254752 251364 191257 190388 191204 229725 226181 140959 188598 133205 93151 72908
20780 72908 66175 154436 240678 323604 307736 281153 220733 277241 248785 210432 160388 161206
20768 161206 126116 90209 189139 202148 169539 167003 126815 77571 52945 132587 127260 82012
20756 82012 57878 142016 204592 148320 73750 50240 145774 94061 54090 60343 84508 173567
20744 173567 183062 161767 165904 100104 30743 88121 167728 196333 155658 150035 128951 138421
20732 138421 108616 138609 85318 35159 36563 163456 144582 17320 111067 238499 201022
20721 201022 153315 264363 283376 156258 119621 177899 186870 104809 234513 285387 231753
20710 231753 145869 162303 182814 183382 235831 229066 191327 170763 109106 144594 216900 243798
20698 243798 312076 348514 331318 176551 135709 136642 137333 172592 171028 227591 320346 340331
20686 340331 331377 347347 368854 295930 163671 58135 -101997 -73881 -83523 -6350 113389
20675 113389 151880 153026 159305 145744 243645 321205 305507 298530 265969 174462 155918 172748
20663 172748 223203 386524 369167 380385 422657 448052 485024 483653 488846 489729 496569 420165
20651 420165 282079 215714 129565 54375 95252 134368 129888 75083 136701 215254 299102
20640 299102 351989 391302 345865 422228 487032 397002 345549 390529 402444 367038 370510 398085
20628 398085 464237 491807 530941 523927 536028 531477 520737 549673 557310 589619 649719 648006
20616 648006 665315 728486 719064 730967 830646 932350 921504 895385 888115 976089 1074935 1099278
20604 1099278 1117825 1019491 1072065 1188812 1349965 1518305 1630709 1703291 1752194 1755667 1747291
20593 1747291 1878788 2133511 2342489 2619297 2965537 3488417 3799490 3837378 3829012 3789631
20583 3789631 3946805 4275787 4591322 4902394 5197316 5427747 5560721 5592491 5679436 5976857
20573 5976857 6364198 6759847 7366488 8215472 9225721 10496327 12027678 13905137 16409186
20564 16409186 19668461 24001479 30114035 39306479 53450941 75681612 110873216 164269001
20556 164269001 236601771 293901998 280762560 224588154 166830644 118512449 84071625
20549 84071625 62061390 48264949 39160366 32655611 27733298 23961924 21152860 19198520
20541 19198520 17914414 17199988 16898608 17104118 17700259 18715347 20296001 22682503 26031581
20532 26031581 30834488 38025491 48748790 64880463 90125357 129993494 189955879
20525 189955879 265203769 306048214 273267697 212228264 154201757 107547668 75435947
20518 75435947 55102036 42102974 33342114 27046514 22339142 18815510 16017781 13823843
20510 13823843 12181606 10890317 9695113 8726343 7965218 7354219 6981206 6695034 6574169
20501 6574169 6693541 6805123 6719793 6362969 5885297 5426611 5070458 4897350 4816096 4727396
20491 4727396 4539833 4087444 3598622 3229237 2892169 2742067 2659986 2538569 2440484 2262144
20481 2262144 2082262 1929527 1880665 1928417 1966569 1943257 1855080 1675523 1439902 1292659
20471 1292659 1153424 1106150 1159687 1139977 1123514 1063240 980616 910720 847128 765407 730291
20460 730291 661357 616555 685038 666006 669027 783208 847957 866412 836807 784070 716661
20449 716661 631377 638200 709432 649394 589598 700128 812543 931268 976170 1050715 1042667
20438 1042667 1066280 1045829 1100002 1157160 1067625 1043265 1067291 1081605 1142131 1096894 1064945
20427 1064945 975967 745227 530317 503179 448534 439684 437970 532128 525716 418328 388838
20416 388838 298116 246092 236386 210283 193847 234733 221901 207444 241093 238017 176822 244883
20404 244883 383067 434056 501090 584055 662341 661631 550586 458035 364908 314217 317270 311701
20392 311701 313071 286438 296374 327962 254275 146293 151335 156929 40806 -50563 -49181 -36681
20380 -36681 7629 38524 129735 134901 138517 135532 89162 59369 101527 124671 143996 187765
20368 187765 296947 259716 233177 167390 176231 103433 134488 234444 288921 337117 361832
20357 361832 297811 135572 134814 138373 36133 17788 21541 57777 90152 130621 193930 174533
20345 174533 83130 31866 80874 80951 164910 241411 237798 204355 207123 137616 154878 154002 153250
20332 153250 169936 161575 145780 149461 144346 71690 69218 64260 54388 58461 53551 79383 38562
20319 38562 -37624 23272 55010 50705 56984 85416 154204 132534 140361 128536 100532 75903
20307 75903 43682 55056 77549 142052 90068 -22269 -77384 -68540 -54016 -48270 25470 117100
20295 117100 168960 137928 160921 127155 79516 156451 217174 185039 141543 141361 152576 127261
20283 127261 98652 88635 85496 87991 30068 81512 114130 135075 193684 149994 71582 104790
20271 104790 160883 157254 206587 159445 169149 133579 159181 127775 92128 83487 59406 64042
20259 64042 75210 91794 101432 106602 118207 142544 223421 166187 59902 -20249 -74715 30241
20247 30241 54288 41068 66682 70390 107485 173815 143137 60700 55091 91299 176924 249867
20235 249867 205441 73398 78657 139693 261387 326073 261587 202173 259153 304110 298716
20224 298716 252261 240026 267765 169022 93054 51056 -9557 48768 17910 -85658 60120
20213 60120 195683 123698 167532 167709 130343 97918 122118 139880 243117 180971 184487 139394
20201 139394 182486 231628 166008 130761 131571 107910 105665 17154 -15538 30251 87207 64624
20189 64624 88533 136199 76938 85175 100648 64352 64530 39850 -6087 34279 83031 64816
20177 64816 49585 113560 155561 210848 208606 180426 207541 264391 200540 130339 155338 196935
20165 196935 187059 154139 241623 259307 214349 132762 86258 55255 29015 59843 77333 51082
20153 51082 85632 109423 117855 153473 96182 139159 156807 110033 147772 155699 204717 143382
20141 143382 127762 81716 66217 133782 110774 127025 180259 214054 109350 102560 88467
20130 88467 100254 100709 138536 174502 130868 167933 134746 83648 96878 125189 125819 34715
20118 34715 -21597 3958 20262 25263 55366 81652 75680 106818 169168 274842 275671 237220
20106 237220 320203 327326 235971 172555 193217 133362 74848 23325 28937 20045 -2319 -17815
20094 -17815 73420 174067 220213 212521 136219 11594 74760 103849 54422 25101 40922
20083 40922 61317 97095 132789 123528 146237 178350 207915 256779 309356 347804 338571 300815
20071 300815 296066 303635 276254 270393 289986 379913 390962 295847 274495 250704 254039 262948
20059 262948 208205 253424 342054 371907 427764 320648 335409 293043 265184 286486 304164
20048 304164 270534 284790 305357 282021 193386 113890 109436 219466 323862 515922 561063
20037 561063 539595 516561 534881 592587 582135 559426 554895 528595 526977 530975 489086 478243
20025 478243 514696 616324 636099 741898 808703 842137 796984 805500 934623 1040869 1036160
20014 1036160 1115204 1223180 1364670 1536128 1752684 2064874 2399331 2544726 2586610 2745432
20004 2745432 2842885 2890691 2895096 2854882 2964011 3231107 3612535 4176415 5013857 6182184
19994 6182184 7681077 9929808 13656180 19375722 25246147 25843629 22704032 19440647
19986 19440647 16992115 15836998 15825004 16952529 19282722 23532157 31058663 43925142
19978 43925142 65808613 101860466 157292807 203867490 199739664 183348937 166393290
19971 166393290 134955663 100046849 73641192 55216424 44097486 39469303 40258687
19964 40258687 46269006 57521925 69049882 67760928 55287161 42120765 31117081
19957 31117081 23189935 18340564 15390130 13289966 11741274 10697681 9871781 9093902
19949 9093902 8648718 8366451 8261146 8178139 8296685 8654976 9058700 9572399 10250626 11124521
19939 11124521 12408717 14322226 17390418 22605642 31113211 44063471 60630448 69912698
19931 69912698 64321304 53742669 44504307 38648637 37488935 41687149 52508298 72625286
19923 72625286 105193115 142893213 170168437 198763826 228836425 207873999 155593885
19916 155593885 110397408 75146787 51202187 36818505 28284729 23113253 20083320
19909 20083320 18362814 17947691 19211064 22224148 27099678 29766016 25918606 20235353
19901 20235353 15342138 11554291 9008621 7367443 6174467 5263975 4579096 4034966
19893 4034966 3695523 3591688 3545329 3506813 3494104 3331881 3236189 3103393 2692420 2199270
19883 2199270 1800343 1644372 1388056 1246544 1153176 1116144 1083178 1023237 1059341 1140759
19873 1140759 1064678 992291 973840 913358 872511 802465 675929 560290 515415 502286 451202
19862 451202 433102 503689 568876 620521 578028 528699 469684 494991 486506 546655 622182 636392
19850 636392 619661 650701 601285 505063 475518 454807 395330 363695 323801 341330 293505
19839 293505 289012 328238 303139 214942 271531 344257 274093 200772 124971 132100 140709 107762
19827 107762 89700 176749 160767 101184 82417 165941 264364 291601 322333 302367 287797
19816 287797 226642 175916 296240 342162 250381 210487 216194 179422 174700 197603 260174 232472
19804 232472 245183 245239 223743 218957 160206 172324 259577 318224 361490 406965 447144 483611
19792 483611 418675 412959 303008 170462 74206 55570 109386 154037 205302 134499 62773
19781 62773 38529 49048 71719 83937 64320 53321 96383 74604 84736 82925 13438 24150
19769 24150 20286 42011 75975 104575 175735 174955 31400 -64880 8984 88116 155563 175790
19757 175790 133577 99984 81694 118712 100531 19429 42107 58180 71224 105270 104370 141992
19745 141992 179151 173125 160550 38853 7828 -31505 -36558 -108409 -202812 -201470 -76618 -69191
19733 -69191 -125927 -173683 -98191 -14726 -30863 -63944 -67416 102660 104562 74266 124466 112039
19721 112039 42613 -30720 -87921 -99932 -37269 82051 95832 60486 112901 148315 159083
19710 159083 183365 150773 99760 102614 150811 81603 14487 -55021 -44683 19344 76 9296
19698 9296 14514 7182 28430 101108 72808 30836 -38085 -69286 -91866 -134003 -155612 -40947
19686 -40947 81341 108006 124259 118738 39480 114233 146970 72704 10965 15103 -23001 -28657
19674 -28657 16823 75435 87548 43938 -32390 -70009 -151616 -197805 -148271 -107330 -72857 -68070
19662 -68070 -102059 -49640 54741 108534 17069 -34911 -35932 -31674 -45612 -32169 -89318 50454
19650 50454 129782 125752 83866 132996 110765 59933 128874 154695 84133 50805 85749 91007
19638 91007 80823 51185 -6775 33517 1776 -73012 -61919 25856 59617 46750 78374 70782
19626 70782 13956 -74237 17854 64588 57119 72006 60860 30756 72813 77395 73220 47241
19614 47241 30536 -28884 -44289 -8357 -20241 26267 13484 63590 69297 22968 17887 56850
19602 56850 -6776 -39889 -116154 -145894 -102308 13464 51233 29885 1126 11503 -55999
19591 -55999 -80189 -74613 -81298 -83317 -69759 -52820 -21790 -81276 -73522 -75403 -32931 31874 -6370
19578 -6370 4899 -14697 -135720 -182451 -103066 -61117 -66020 17124 -44532 -39846 -1171 54120
19566 54120 -7036 -60553 -90331 -153303 -150839 -105547 -24294 -4053 -13102 57883 113345 112960
19554 112960 124394 165501 115624 95637 68718 -3873 -41181 -51362 -43055 -62387 -72607 -86198
19542 -86198 -112461 -61623 -48451 -15580 -936 -83336 -60642 -20446 -140836 -124044 -69017
19531 -69017 40819 62415 9894 -68874 -113787 -84337 -124417 -82414 -140669 -179090 -110911
19520 -110911 -30391 -22225 5796 -56482 -104268 -97602 -101634 -68484 -59332 -41337 20028 -41449
19508 -41449 -102056 -78968 -79231 -13923 29466 -35215 -104179 -117954 -125410 -23590 60504 10876
19496 10876 12447 368 -10877 13651 -18183 -97283 -54035 -69007 -88922 -40512 -46456 -64927
19484 -64927 -46272 -35348 17460 40053 56512 72257 63646 52694 37821 33472 30482 90989
19472 90989 98049 71178 104289 154401 116991 126557 76618 156966 248924 336681 443061 469366
19460 469366 509857 435498 342062 371092 379310 403903 447008 484397 527164 610763 626997 701306
19448 701306 817160 775982 640362 504351 368891 305151 279789 259541 196862 151652 84333
19437 84333 -55687 38127 200605 307301 351922 293851 118376 75060 -2109 4258 77327
19426 77327 135266 125813 82840 49963 38855 22557 67344 29893 20488 81480 174695 180099
19414 180099 175288 312668 364444 392544 440488 419997 400426 500561 631573 760162 786344
19403 786344 636425 483414 398384 268340 173069 118097 142721 294194 336142 429017 526804
19392 526804 697630 829058 707648 622232 564858 389239 171233 138686 129874 46438 -667
19381 -667 -33474 -32310 -53579 -97523 -135026 -151520 -149500 -57637 87148 63797 67678 88648
19369 88648 45483 -46584 -66104 -60863 -49888 -19305 35948 -17729 20339 62163 7204 -32799
19357 -32799 -73749 -70398 -37451 -42391 -32740 9580 -21114 45017 125598 131332 96884 119954
19345 119954 152510 137430 100367 117828 46429 36528 71780 69945 151098 202948 181282 101360
19333 101360 131334 102409 89213 -41827 -112446 -116255 -117825 -103581 -39645 -2753 8513 -49327
19321 -49327 -27129 -33423 -21842 24847 -3859 -32493 -19347 -11731 4447 17648 -21511 -51801
19309 -51801 -151544 -245611 -192524 -52781 81861 152196 41965 -51010 -122221 -121415 -123628 -120716
19297 -120716 -104381 -84897 -79057 -26891 51278 53095 7960 -75434 -116035 -70165 -97571 -142491
19285 -142491 -94549 -20504 3328 14498 54227 66057 38923 46959 50337 -50844 -124199 -131620
19273 -131620 -97115 -114803 -81454 -29656 182 5710 17563 -21238 12182 127638 214323
19262 214323 127446 129912 146237 182009 181525 144171 126704 39628 -76619 -143081 -131771 -54646
19250 -54646 50391 65992 -28108 -44295 -27644 -144502 -215980 -287058 -287275 -166470 -62407
19239 -62407 -40843 -48412 -159126 -158726 -108801 -81015 -27149 61042 46305 46718 37205 9518 -37808
19226 -37808 -74807 -105182 -88276 -85826 -39235 -37331 -22535 23552 -2583 -33182 31513 57218
19214 57218 -4657 -9430 -49784 -4869 75923 112039 89765 75493 68739 40656 47769 19943
19202 19943 -59861 -80220 -105635 -88265 -45688 -99311 -120544 -50560 15980 9751 -92078 -100747
19190 -100747 -59730 7478 23544 -544 -87861 -100358 -60380 12696 788 22936 38577
19179 38577 48774 25347 51832 -916 20687 -996 -15750 46265 67670 28910 62126 64561
19167 64561 16672 23005 76392 60145 81432 169000 84632 43651 -12921 -89276 -91061 -16904
19155 -16904 -3419 10961 1577 -7050 -44711 -24152 6289 37576 60480 70566 83121 119597
19143 119597 170266 25608 -40070 -49513 -18305 -52885 -88506 -21900 73345 71669 33200 -53076
19131 -53076 -78369 -21475 -15643 43084 29380 -80900 -128528 -36884 -12109 -64458 -95652 -125394
19119 -125394 -150074 -118792 -60074 47030 37067 5741 44229 89932 111259 61795 8238
19108 8238 -1489 -16686 78392 76855 6474 -25843 19580 40740 -13517 -93456 13516 147041
19096 147041 111156 60608 48466 -7286 -22171 -53795 -55463 6112 19570 12953 77798 54432
19084 54432 -56604 -84832 5494 -8848 -18226 -76065 46504 121617 91247 17489 -41402
19073 -41402 -69787 -48578 -1613 -28763 -41432 -98952 -100897 -55527 -32405 -16061 -31312 -50231
19061 -50231 -93416 -90358 -63091 12639 -34936 17002 55722 33350 8612 33068 64258 77256
19049 77256 131789 65089 74855 68652 -1000 -71477 8491 47117 63452 71987 81889 12235
19037 12235 -43295 -56781 26513 93484 138935 152427 56351 13163 36764 31313 -138321 -211962
19025 -211962 -162872 -148474 -94916 -22281 15435 65088 -9057 -39966 32075 -12072 -36622
19014 -36622 -1936 60348 110544 80359 4904 50484 131562 134940 160320 140414 179579 170480
19002 170480 120568 36118 -19831 -120615 -127760 -167907 -26676 38749 2611 -83688 -76368
18991 -76368 14700 46060 25471 -124588 -144163 -163656 -177328 -127657 -68977 -169368 -134258
18980 -134258 -97044 -119026 -81498 -6688 -36231 7424 -40864 -97992 -130673 -154215 -125948
18969 -125948 -109083 -97525 -88980 -93087 -25641 14589 25166 105605 103347 107491 133428 175286
18957 175286 150172 12142 -107119 -163012 -93188 -49936 -12414 -18860 -25858 -79787 -74425 -12444
18945 -12444 -2296 4868 -15485 -52471 51779 113448 128368 124208 48453 54763 39773 52546
18933 52546 -6270 -42774 23766 56389 56610 71559 157364 104395 39483 -6822 -86038 -104933
18921 -104933 -78038 -95264 -89091 -65403 -93401 -100980 -138042 -108846 25676 158060 140375
18910 140375 78204 93057 83257 54336 38211 -30871 -31509 2105 -21090 48317 136902 192137
18898 192137 246255 263017 214516 189831 37999 -55023 -11905 64903 58333 62387 93463 117454
18886 117454 125407 93343 -5579 -18900 14215 55801 75275 27880 -45834 -63528 7176 62976
18874 62976 158671 141374 147828 193970 125404 69679 114301 72262 -446 44724 75065 80772
18862 80772 44991 -48212 -164654 -128610 -84110 -37563 -49427 -69873 -85131 -98007 -54598
18851 -54598 -44249 -28648 -66258 -129354 -183260 -144457 -48516 8674 -10808 13265 53985 81834
18839 81834 166725 170871 179361 205726 218501 197054 183066 101286 154135 173470 148058 182417
18827 182417 255153 197563 120777 93293 139836 123369 128012 199560 229253 204740 144004 47082
18815 47082 15090 -22181 66406 70158 45519 17149 51396 106683 27472 -59083 -25534 47099
18803 47099 -7468 -115506 -166801 -101012 -11140 77032 69148 -50835 -26628 37008 132460
18792 132460 51740 18270 -17627 -89647 -172617 -131693 -59745 36200 1884 17611 143071
18781 143071 187433 214487 252070 224751 156552 63274 55870 93727 148641 215002 292856 356584
18769 356584 454591 597286 878475 1113041 1011256 777115 482929 268786 217009 165114
18759 165114 117160 179331 166793 181203 207859 148085 114033 88646 81975 48372 40585 104712
18747 104712 193271 133300 -28791 -114183 -78786 -73414 -111816 -82924 -47215 -28786 -13488
18736 -13488 24531 -23214 -85716 -64770 -33592 -30381 -19037 -12715 24762 79786 114542 70479
18724 70479 -34176 -58646 79197 137748 147673 108425 -8649 19596 28153 -1603 56970
18713 56970 -4982 -71065 -9325 -17476 -80255 -70769 26286 -35137 59546 150088 101283 66561
18701 66561 72326 -8297 28731 56897 67872 48128 42591 23076 -31815 -109099 -86877 -19224
18689 -19224 40739 34435 45584 148965 125238 88886 18759 83075 125534 132482 134924 134587
18677 134587 135699 204687 117416 29487 99158 99996 8772 8395 54483 11361 -19961 2637
18665 2637 49601 -44306 -87642 -46086 -52358 -135332 -125952 -73594 -8891 15433 47528 40362
18653 40362 51621 48682 -19679 -7580 -7179 53557 91249 157828 157829 160018 184383 152318 154791
18640 154791 165274 103232 103806 191239 196991 167391 126024 33330 71448 122234 127440 104265
18628 104265 184181 280073 262648 232155 182912 176735 226987 192622 154138 158114 177361 167121
18616 167121 141311 163246 119384 124253 177229 185640 166630 124767 48393 -27066 -40297 9530
18604 9530 39625 87332 78230 99357 123817 132459 202145 215471 158270 159038 89852 -4377 -32215
18591 -32215 17389 73157 37844 95096 205797 255096 209190 216671 189096 197812 174038 155989
18579 155989 248609 278225 208174 182286 278165 311984 287366 329655 401524 477245 501413
18568 501413 624571 761249 838508 751299 643815 689451 718294 716554 600921 502144 441461
18557 441461 371650 477457 495197 646811 757136 751877 669216 533026 479988 452557 486597
18546 486597 566995 560519 558709 527249 455254 353674 302272 311700 323739 418601 477872 551646
18534 551646 556411 615037 858542 1034841 1086231 962641 822239 662649 513961 448087
18524 448087 491174 523701 610528 579517 488608 372315 325315 309920 370210 386982 491806
18513 491806 624286 810070 1033054 1200347 1170193 1108228 1017503 894062 862106 828329
18503 828329 779493 855143 933556 993717 1002929 966046 962260 968605 814462 647832 524953
18492 524953 540110 525181 459240 440982 521212 579827 572217 464978 301918 228429 207635
18481 207635 143710 170804 205445 213372 246573 245576 232327 221323 179068 196525 221009 164916
18469 164916 189152 238387 204891 181541 188729 234898 212396 179427 166640 181341 329871
18458 329871 426638 517891 641123 847217 725870 485225 374871 332218 339811 340155 314307
18447 314307 266941 280648 312182 253288 258959 189550 146513 142337 125382 141996 198419 252652
18435 252652 153182 128039 217033 258264 237675 234574 257467 284594 243173 228409 101081
18424 101081 73849 121907 91403 84933 97686 148916 165524 75679 113101 171969 167815 150848
18412 150848 129055 206423 276819 248673 191134 124556 57578 20415 33235 112615 264030
18401 264030 327658 328490 328908 309761 253156 201687 195334 293175 419155 495998 495587 435600 286958
18388 286958 332797 454138 436116 422127 519353 575523 574976 674782 696897 841086 1174795
18377 1174795 1633838 2010133 2093358 2250598 2622053 3142877 3648132 3943976 3754962 3347884
18367 3347884 3190117 3127411 3234833 3030905 2486459 2055878 1788602 1688975 1846640 1891390
18357 1891390 1829083 1697730 1669912 1729810 1818380 1738994 1530702 1317634 1045011 954504
18347 954504 928883 927340 933015 899833 866398 1003966 1153053 1372567 1642381 2003039 2274031
18336 2274031 2291988 2313332 2415000 2537663 2696165 3021909 3473016 4196886 4689190 4853278
18326 4853278 4977142 5275086 5824537 6265697 6849518 7236840 6755410 6413058 6524291
18317 6524291 7176193 8042180 8226453 8161205 7527339 6737911 6463810 6557684 6561892 5993940
18307 5993940 5272954 4741877 4259890 3659545 3034390 2644075 2491482 2591939 2537929 2495036
18297 2495036 2365776 2172964 1977551 1866040 1759529 1783272 1686791 1587682 1493979 1456595
18287 1456595 1366410 1238823 1211065 1268792 1391327 1574133 1887631 2400524 3123725 3890388
18277 3890388 4724171 5622584 6593355 7553260 8222216 9105042 9987818 10473829 10003456
18268 10003456 8820945 7944865 7430767 6843564 5847813 4670606 3528207 2770494 2252523
18259 2252523 2018102 1960442 1972455 1914495 1789389 1634924 1635987 1685826 1603163 1448771 1286539
18248 1286539 1157791 1054482 988457 867600 809456 729846 683376 677888 617305 534109 520804
18237 520804 615646 619461 521728 444378 295522 174826 104887 156042 216744 273706 293950
18226 293950 379030 391830 453198 470632 454872 441872 407127 413565 399517 312403 297447 368271
18214 368271 380110 404738 464306 490770 460839 404660 416489 459848 440598 394225 362912
18203 362912 322505 311479 368510 432380 398521 403249 416092 494704 429867 383299 324555 414108
18191 414108 432679 417115 368800 386738 453590 483248 474501 453395 450287 490809 558551 606988
18179 606988 585499 566585 576002 613811 645458 652262 605443 618920 538871 490186 542438 587049
18167 587049 722665 850811 879012 1008972 1155555 1306715 1438649 1512943 1540381 1622388
18157 1622388 1817023 2245870 2770409 3482462 4028561 4387816 4942952 6007261 7396781
18148 7396781 8537949 8892070 8819367 9056756 9785404 11234085 13106762 14649048 15332769
18139 15332769 14949019 13895017 13032046 12663064 13194730 14010113 14121829 13574284 12787581
18130 12787581 11716289 11008937 10430451 10050648 9771980 9205409 8596390 8214963 8323606
18121 8323606 8582720 8519746 8612467 9092780 10167821 11993301 14856425 19186026 25736100
18112 25736100 36687883 55719483 88609489 146087671 201418807 176123467 127556919
18105 127556919 88711791 58286250 39771685 30136596 25005794 21550345 18626362
18098 18626362 16374012 14821475 13699241 12867977 12266446 11668595 10941415 10348165 10298643
18089 10298643 10874035 10795055 10099147 9622339 9209047 8768971 8636972 9192272 10325836
18080 10325836 10885504 9945469 8976574 8423093 7949574 7676843 7640747 8101684 8676884
18071 8676884 8702194 8575256 8315894 8271568 8618679 9456317 10916990 13267392 17059045
18062 17059045 23021746 29209599 29574670 26167081 23164750 20986580 19862477 20103907
18054 20103907 21681004 24887900 30129016 38602889 52911382 76893610 115967458 175706138
18046 175706138 221727039 214124680 198042118 177057932 140425200 105249571 80028132
18039 80028132 63680639 55247372 53540018 58476372 71558555 94478736 125846165
18032 125846165 151059965 147487710 117210650 85839035 60859760 43234742 32388913
18025 32388913 25996083 22145354 19800293 18072659 16765252 15635847 14542310 13798522
18017 13798522 13551858 13607017 13955298 14744639 15572333 16632763 18338478 21064864 25200656
18008 25200656 30868681 39477664 53559152 76102850 108991799 145607222 184349000
18001 184349000 222302846 214256761 171476235 133618419 107661560 97071010 103470334
17994 103470334 126547322 155684128 175716785 200397595 226623636 201196815 150698469
17987 150698469 108437806 75613598 53826787 40948178 33507424 29018367 26118479
17980 26118479 24426359 24129657 25562074 29140698 35423183 41298730 43566273 47905032
17972 47905032 58843697 79431400 96918162 87535750 66502622 48229635 33760824
17965 33760824 23709596 17475843 13493118 10946390 9172689 7968210 7127758 6273509
17957 6273509 5471433 4931331 4524552 4161687 3768829 3416728 3124140 2800932 2531108
17948 2531108 2328445 2197364 2074794 1914648 1691126 1571633 1528570 1416430 1317569 1291075
17938 1291075 1300746 1359806 1382434 1202539 1060734 1014429 978761 993590 1048016 1031323 1068877
17927 1068877 1197707 1228472 1164554 1188903 1236388 1202329 1263222 1283100 1236036 1182935 1176176
17916 1176176 1183311 1167303 1144464 1145334 1083811 1038291 1017171 955075 858524 856182 868106 773032
17904 773032 652360 610123 617414 536529 468906 414806 386655 415447 374952 248152 274294
17893 274294 271153 302428 338739 314409 212430 215091 323524 308096 366714 381945 354144
17882 354144 329238 444042 566673 575595 583463 715021 774105 609787 487878 497519 449997
17871 449997 393764 465064 542169 558530 521483 420347 387425 426856 369553 300040 194778
17860 194778 114269 117107 177347 165501 141303 231798 229149 167509 97759 112433 164163 180427
17848 180427 220582 226235 213564 251064 291159 276749 201328 121635 128836 74001 37324 149473
17836 149473 163468 184309 248205 220694 277665 228160 133254 110357 126613 120589 205043 180427
17824 180427 87278 143427 80194 70328 38739 119073 64447 42595 91527 176939 156114 96846
17812 96846 81144 107268 151194 156252 69463 74959 143135 180706 143978 104099 122495 139895
17800 139895 77654 110234 128305 145480 167768 133261 181849 263287 250666 227942 259219
17789 259219 280768 228522 194386 154984 122278 118012 189123 155066 86325 39179 4887 -43794
17777 -43794 -46604 -41890 54497 126478 18291 -65984 895 48524 -15172 -115484 -83463 -146894
17765 -146894 -161556 -48821 78370 140747 201401 159642 136020 80567 41301 40767 57204
17754 57204 55175 -25242 -32393 9052 61865 44140 8241 9661 -8731 4506 129778 156531
17742 156531 154320 156216 94653 64970 126145 165131 160878 94377 67051 60422 42796 56232
17730 56232 -7184 -8620 -6166 -80819 -63112 2941 -76191 -176270 -135458 -125534 -184127 -142175
17718 -142175 -129590 -110059 -70643 -94285 -11444 45922 31502 2744 -66016 -73432 -55599 -32383
17706 -32383 3767 -62531 -71769 -145661 -29513 64849 46291 53985 85444 39185 -85659 -189243
17694 -189243 -250625 -238743 -160609 -68157 32453 21873 -9316 8762 -25515 -142366 -161554
17683 -161554 -173330 -204886 -119797 -104471 -142661 -113538 -101807 -7879 -21886 -18569 25102 62137
17671 62137 53520 906 -39076 1129 87004 54525 -38283 -85453 -94917 -80009 -68419 -88429
17659 -88429 -77550 -17025 -49288 -47068 -25916 -72496 -128843 -63585 -32812 -58195 -67259 -91522
17647 -91522 -44688 -49940 15614 -33258 -26197 17087 113414 145358 107781 17849 -96347 -117156
17635 -117156 -85141 -18711 -110713 -123661 -117891 -99120 -135389 -139398 -96995 -50649 14658 61018
17623 61018 42009 26808 839 13039 44176 7495 -15116 -19487 34818 24781 -5663 -77694
17611 -77694 -67566 4904 44019 53103 69229 67325 51048 -50293 20484 -19144 12190 -39922
17599 -39922 -46372 -25370 16011 80241 41682 -50047 -37631 47354 33310 62316 76627 48474
17587 48474 59792 71818 54312 53662 114513 133062 132021 102652 68154 30572 -30763 -16719
17575 -16719 39050 130786 122756 100424 84479 31996 6074 -80610 -95364 -31756 28988 -110969
17563 -110969 -154707 -85247 -78790 -88959 -113172 -104235 -104465 773 17890 -15020 -38250 -10796
17551 -10796 10800 20605 -19744 -14138 -3813 45208 5869 -78829 -82375 43129 90337 92115
17539 92115 164282 215965 277392 357806 445928 556348 569128 503190 437857 491452 563692
17528 563692 519733 429119 331332 302176 380998 511407 548701 637174 645911 546330 435211
17517 435211 440953 357799 225585 63074 76016 46932 57648 78874 108699 147047 182575
17506 182575 226040 228700 276646 335598 188568 74949 30733 82912 178246 182768 220358
17495 220358 388122 418442 344881 318728 257816 116288 134658 235876 283678 334260 402800
17484 402800 589444 577409 558996 562252 567221 646723 633259 524304 393569 304041 308601
17473 308601 238000 242423 272609 262625 305008 319949 442132 645463 914538 1232764 1481004
17462 1481004 1362246 1115454 832909 596031 480936 362035 243709 163138 95076 -28504
17452 -28504 -57565 -11871 -34896 -52478 2100 34161 99436 194398 421128 762258 1071104
17441 1071104 996684 693590 529641 325000 188224 206231 263338 377526 477875 553863
17431 553863 514793 403729 265964 167160 72821 36923 70721 172051 212587 204647 132019
17420 132019 93268 38638 -25490 -31785 -64234 -12650 20593 39157 63920 26408 27867 60222
17408 60222 31602 66436 89469 118698 155740 116766 14454 -47595 15824 53370 53797 -12893
17396 -12893 -1081 121246 142309 59809 -42400 -121708 -128361 -152244 -106024 -42665 -44043 5626
17384 5626 -41134 13431 49751 -39477 -117223 -90945 -57852 -112136 -147643 -95209 40595 94120
17372 94120 33025 16756 -74978 -97146 -109845 -127983 -107344 -77670 -82449 18705 1039 -25447
17360 -25447 -62993 -74986 -153054 -189935 -151311 -170822 -122871 32333 97986 56274 129858
17349 129858 100280 27928 -3782 -44240 -46386 -89343 -127820 -144728 -118046 -67842 -64565 -87957
17337 -87957 -89609 -32076 56980 29496 -72200 -91739 -82314 -120422 -63261 12804 24437 30564
17325 30564 -3526 41749 57233 -2598 13917 -46253 -159084 -121347 29042 21133 -21181
17314 -21181 12117 -21889 -67693 -94345 -66673 -78392 -78986 -105000 -56305 -27242 -74431 -70367
17302 -70367 -58474 -41536 -9141 3845 21462 11453 -11847 -162279 -178511 -156204 -114047
17291 -114047 12758 42599 27965 40791 74391 97512 63954 142621 120271 128825 148846
17280 148846 158956 102659 -17791 -35974 -22664 -40309 -9905 10704 -5636 -69890 -9828
17269 -9828 35195 -51176 -20397 14232 84008 117779 152714 145788 191419 276640 273449 185414
17257 185414 58627 -58738 -28438 1884 -3870 -9512 42218 36946 -53887 -99176 -87243 -29157
17245 -29157 -46618 -133538 -108332 -87039 -24995 -24900 12671 117109 98056 -10792 -39260 -22465
17233 -22465 -20567 -27166 3875 -46431 -139779 -133837 -115180 -91743 -122879 -121787 -130796 -101557 -71321
17220 -71321 -85478 -56053 6792 -9572 52950 26973 20259 -83760 -74773 -6691 26477 3567
17208 3567 -77607 -54458 -37047 -110319 -248970 -233035 -94058 54975 69951 18634 97014
17197 97014 189961 72888 -6732 53352 38689 29227 26855 -29981 -41727 34132 -29259 -89784
17185 -89784 -47940 -35827 -134456 -170408 -102762 -46174 3402 -46654 -31668 -20720 -27883 -84507
17173 -84507 -46064 -11499 118869 129135 72426 37121 -39435 -23275 -32193 -27092 -83807 -84997
17161 -84997 -52063 -33293 35853 -16171 -133121 -115066 -6511 92096 57179 -26694 -10598
17150 -10598 5028 8833 -44589 -85207 -109290 -119891 -162426 -133783 -108882 -69378 45311 -3812
17138 -3812 -87038 -71849 -67668 -37670 -82509 -134428 -181951 -211158 -112714 -19437 -22916 -52957
17126 -52957 -148506 -141263 -103773 -119524 -73893 -69861 -82888 -38583 -29834 9057 42647 34791
17114 34791 65517 91161 142511 86040 -50384 -108983 -71427 -49215 -40509 -45850 -57428 -84247
17102 -84247 -70359 -21360 -52278 -107716 -67300 -62125 -68844 -33684 -48224 -108108 -192900 -199801
17090 -199801 -108657 -3776 71556 52186 -3733 -118964 -96594 -4830 65446 102219 -1071
17079 -1071 -102402 -64025 -134391 -162029 -116605 -57474 -75737 -71536 57874 -9405 -73776 -57820
17067 -57820 -23864 23227 21091 4802 -87118 -55223 -24662 2404 -82783 -93133 -82344 -114939
17055 -114939 -115416 -114828 -55194 -68291 -76878 -94123 1832 14878 33611 -30046 -81054 -39837
17043 -39837 -100723 -150372 -118539 -89752 -60585 -74468 -55584 -63533 -135625 -163762 -102112 -135976
17031 -135976 -139134 -41524 -21289 -42895 -27009 -60149 -128178 -115634 -95492 -25994 -1950 -44387
17019 -44387 -164513 -173985 -113603 -105382 -83405 -99294 -52594 -55678 -70761 -98907 4978 32994
17007 32994 -109256 -149152 6704 53746 -261 14985 -40075 -105147 -71357 -74553 -55045
16996 -55045 -20953 59502 45422 -26148 -97136 -97561 -74898 10009 51709 20847 62556 67023
16984 67023 41586 4638 -14627 -27470 37129 57475 25068 -12894 17367 18789 8629 -22114
16972 -22114 -34381 -84444 -69293 -91307 -168503 -160141 -176405 -175041 -23298 -69212 -84526 -638
16960 -638 68416 56079 30060 72257 24380 -16381 46797 21739 2148 2202 -26990 25296 14307
16947 14307 -40893 -37358 -84612 -58835 61298 154881 149133 49383 75459 43231 -6319 -67299
16935 -67299 16757 -5163 -86731 -27621 2256 10525 6160 -45645 -56892 -74981 -47371 -116271
16923 -116271 506 146855 147191 113047 138051 27162 -46553 -88518 -83317 3510 -41720
16912 -41720 -114147 -92420 -95238 -72187 -12108 -9006 -30565 -57697 -18143 85884 186558 252086
16900 252086 197943 46383 -10261 -5462 9675 -62246 -119208 -102902 -98486 -84658 -93072 -115774
16888 -115774 -54714 -11761 5937 -45734 -6200 48088 86021 98875 38354 34444 -34797 -138712
16876 -138712 -129373 -69104 -3448 95185 72641 25939 44363 10909 -19556 -26278 -30630 -48949
16864 -48949 -34270 36784 53978 53797 -340 -33963 -38378 -55734 -28879 23333 9512 -37111
16852 -37111 -42881 60278 170168 139443 -4286 85235 96595 18701 30847 97591 -9555
16841 -9555 -108148 -131514 -135538 -140628 -201126 -225153 -95316 -6188 855 -1448 23183 9686
16829 9686 -40628 -29761 -17485 -36792 -40091 -54916 -54786 -26899 -6372 -39656 10449 -2863
16817 -2863 -132162 -204560 -178444 -180278 -231930 -241551 -166808 -89029 -177014 -112350 -7591 -38575
16805 -38575 -30170 -7145 38821 13599 7122 30593 63391 87959 47417 17793 6381 72342
16793 72342 154700 157502 114439 112641 18236 -27069 -46382 -16369 -34664 -56611 13933 20407
16781 20407 18062 42863 -35827 -65971 -103493 -115643 -30619 79578 77284 -12714 -128080 -117391
16769 -117391 -24812 61429 -29077 7808 -15650 -48491 -98292 -116777 -77637 38325 75415
16758 75415 40054 15056 74975 18381 -100683 -141670 -121636 -13852 -21844 44295 64621
16747 64621 20369 -51556 -68260 -30595 -45048 -99185 -184994 -204822 -166514 -72367 -29660 -18101
16735 -18101 -39012 -2247 -14258 -13078 -37818 -67671 -105231 -42585 24111 -9127 -28260 -49174
16723 -49174 -7431 66681 -9259 -19007 23975 2879 -22208 -28078 -55226 -62739 -108353 -159826
16711 -159826 -73678 -34682 29168 5773 -120169 -173069 -212577 -209866 -189413 -162152 -34883
16700 -34883 7980 12931 -18899 -32132 -34051 -83963 -175319 -148293 -74733 -30670 -108392 -168081
16688 -168081 -189196 -76961 4746 6202 -4972 98399 172331 155046 72599 20217 9792
16677 9792 1598 61745 89193 104608 75293 45988 -20450 -82803 -99771 -122698 -76020 -29858
16665 -29858 -105614 -133119 -63389 -63506 -44850 88248 143425 68570 -2982 -37266 -58101 -26959
16653 -26959 -44590 -14944 84338 112016 24943 -22836 -50799 66911 32797 -27174 -12395
16642 -12395 -34346 -161494 -142571 -45595 -21558 -39021 27962 -97618 -42295 95212 9758
16631 9758 -84854 -123463 -209644 -228627 -122724 -27755 -22910 -34718 8188 -5325 16182 39528
16619 39528 47950 -61324 -166680 -81257 36123 8114 -3793 -22135 899 15924 -63349
16608 -63349 -49508 11950 33391 29955 -25911 -95377 -103110 -44401 24854 76605 97244 131719
16596 131719 93395 30427 -12288 2302 32403 71846 65848 44185 -49632 -92388 -71008 -11701
16584 -11701 -3530 -47985 -133197 -97208 -39351 -78420 -57386 -55551 -69473 -165885 -144539 2853
16572 2853 70981 61603 70260 148842 78721 21294 -4236 -41391 -7637 34992 9775 8430
16560 8430 -36628 -159009 -134439 -104782 -30447 -21327 -50738 27208 106327 112841 49635 23206
16548 23206 -1245 -42786 -83211 -101129 -88544 -721 75414 125261 100682 80282 59278 23997
16536 23997 -63581 4081 60085 130385 53886 -22575 -70868 -189479 -163556 -55916 -11977
16525 -11977 -27739 -59836 -47662 5685 25875 57169 65262 42584 -24370 -53679 23507 6446
16513 6446 -76008 -62104 -67550 3590 -6504 -77460 -65295 -80201 1429 52300 -15903 5062
16501 5062 -29259 -104889 -65893 -60904 19519 16662 46261 18490 -34481 3923 89526 37203
16489 37203 46409 34309 135796 134477 141207 103660 25179 -49457 -59468 -65808 -44626 -59398
16477 -59398 -75482 -8135 51010 6949 -35197 -58424 -10031 16676 -42941 -67226 11532 46973
16465 46973 -25538 -34325 -53194 -102001 -119214 -103526 38493 33330 -59418 -36754 -14338 38568
16453 38568 80337 133073 138804 134087 83499 92336 17925 -371 -42006 -67373 -12041 72826
16441 72826 96927 88817 96004 51952 2146 -48614 -3857 8007 -15192 10739 -29207 -124650
16429 -124650 -190313 -81970 -6190 -15443 2047 -11718 -80475 -50379 -33694 -71597 -151059
16418 -151059 -98838 34899 121394 186919 178080 170297 200824 140434 54653 61773 -69814 -167251
16406 -167251 -108902 -70080 -24346 -50901 -68410 -70078 -82262 -117680 -82316 -33806 -27350 62025
16394 62025 33496 -32856 -130047 -123827 -35579 -22251 -19441 -104212 -144865 -71261 98786 171406
16382 171406 184983 129192 10862 -118547 -113247 -34865 1184 90317 69506 24345 -101907
16371 -101907 -123387 -27441 -13434 -39901 1663 9070 -13880 -111557 -70533 35804 22176
16360 22176 -18087 -11763 7880 93243 115444 36869 27363 30504 23493 -25523 -24600 -33130 -66250
16347 -66250 -35784 -31983 23831 28122 -6279 21191 46751 66791 26095 -52029 -85231 -139950
16335 -139950 -102490 35094 160649 148052 101124 67778 81053 141603 106213 38178 -33003
16324 -33003 -51655 -49848 -88945 -50401 26319 56433 63904 -2093 -71457 -85878 -136963 -105176
16312 -105176 -33701 19708 25775 12565 83471 135471 149711 169546 92666 58456 -25551 -98656
16300 -98656 -50968 -97090 -27377 48136 -8758 -32344 -20314 -436 50985 47745 140462 79289
16288 79289 5336 -16886 814 44994 113006 92119 131830 127150 -9851 864 -45313 -1897
16276 -1897 25982 -34042 -57065 -115983 -136346 -76354 -61752 -2927 38615 73400 78945 60587
16264 60587 30474 -37769 -30087 36927 87607 109390 155627 191331 190947 206437 216999 176822
16252 176822 162491 102936 5329 21574 100156 47254 -14610 -40227 -48270 -90197 -150196 -67804
16240 -67804 -15874 27067 45229 37378 79728 65689 34781 3702 70487 62747 -21662 -48111
16228 -48111 -59669 -61215 -89617 -168186 -217922 -143887 677 109603 65754 -32425 -50462
16217 -50462 -121850 -150435 -95813 -163975 -125559 -56100 -12923 4605 36244 -13268 -59815 -69998
16205 -69998 5699 -2614 -39417 4440 44109 -15100 -104328 -180717 -196793 -238044 -258033 -214689
16193 -214689 -129023 -89394 -112669 -82782 -48274 -28089 -25431 -65407 -98320 2441 48277
16182 48277 -11859 -4858 35367 68459 -10476 -31827 -129874 -102932 -133573 -189657 -103178 -24405
16170 -24405 -4055 -33435 -8801 48215 26611 -66990 6260 95143 54714 -14309 -90959 -119462
16158 -119462 -119416 -72554 -19856 9626 18796 -4174 -57536 -37643 -6549 12732 23208 26603
16146 26603 -68878 -143615 -123491 -106233 -110895 -38000 -70940 -78171 -39302 -24168 13591 14245
16134 14245 -13494 23511 -47324 -33619 32257 70344 30287 48722 90044 138520 55187 9925
16122 9925 25668 32902 -7196 -1687 -14464 -56098 -69325 -56398 -68043 -113560 -176048 -117234
16110 -117234 -132116 -107204 -114801 -60287 -60824 -6050 17880 115644 212701 156113 -28826 -139611
16098 -139611 -102196 -134575 -169949 -118108 -115408 -115767 -81071 -15847 6430 6937 28254 27037 -9279
16085 -9279 17599 38388 32747 29343 -32672 26063 103327 81749 114116 120913 62027 -57153
16073 -57153 -5960 77159 63563 -13271 -149231 -95271 -71373 -100923 -43530 18356 -13458
16062 -13458 -7188 5989 42896 68710 126021 73708 8590 -62772 -94811 -25575 -36738 -14665
16050 -14665 -3495 3312 53183 22885 42818 37268 47917 56945 38543 61578 78514 83150
16038 83150 58790 37999 108144 7068 48316 54938 19661 9383 -38373 -36491 -9613 -36761
16026 -36761 -34966 -26587 -59339 -179511 -226900 -166310 -71831 -67159 -22743 82859 172712 265016
16014 265016 205108 81142 14337 -89555 -154431 -69290 4122 -14155 -18993 10270 -1701
16003 -1701 -4930 64371 121166 201929 188335 104452 41780 45375 58834 114958 72886 -8163
15991 -8163 98550 83896 83428 62168 18875 -72204 -101511 -7642 22117 -16165 -107349 -135719
15979 -135719 -53009 20097 71837 -7590 -89131 -51869 -72973 -75212 -34413 -16100 -32538 -35276
15967 -35276 -28028 -30139 -43267 29421 35168 21480 -143 -68575 -36943 -24566 -32055 -33092 -51644
15954 -51644 17221 111385 129730 31889 46586 86280 50328 57661 -11417 -102981 -138558 -160814
15942 -160814 -99216 -84079 -22218 43515 34979 13146 44768 58495 62677 141427 178770 150293
15930 150293 128067 138070 80512 9771 -7975 -5257 -66563 -72785 -1843 1672 34150 96085
15918 96085 49481 -49377 -87518 -5491 135830 109944 63722 -30316 -79930 -72650 -87015 -71157
15906 -71157 -32404 -94923 -50458 23460 51276 53553 47305 6003 -10552 190 -14401 -65979
15894 -65979 -143501 -152592 -225295 -239536 -132938 -60274 -78477 2163 55014 -7773 -53117 -109423
15882 -109423 -107424 -73369 -37569 -15357 -44900 -22659 74703 45143 -11596 -65916 -68300 -73108
15870 -73108 -29063 49206 81847 3140 -57812 -124036 -181289 -130466 -102876 -134844 -142209 -64513
15858 -64513 -58876 -65561 -44898 -22559 14785 13284 -13913 -110564 -81693 -68473 -68563 -22864 -19698
15845 -19698 -21035 -56377 -51199 -57596 -76660 -21402 -11371 -24359 2190 -13132 51461 78096
15833 78096 -40229 -84012 -63657 -97028 -103787 -138658 -83567 4395 -46850 -72367 -89692 -39911
15821 -39911 19320 98576 95491 54066 10356 15254 -44062 -114325 -69582 30052 71738 43254
15809 43254 -12050 12960 48152 70151 56158 -74922 -32905 -43875 -29156 -74295 -115649
15798 -115649 -84379 -93353 -82623 -56396 -66135 -60531 -113449 -101925 -72479 -78411 -50371 -42541
15786 -42541 -21002 -17625 -58226 -158861 -89671 -77052 -31146 55425 43087 -39366 -76603 -85131
15774 -85131 -52267 -55602 -155575 -191339 -129492 -80171 -68699 -36076 396 19413 4693 -94943
15762 -94943 -49830 -47331 -46762 -14532 -25095 57430 117940 123747 84297 -8262 51353 121530
15750 121530 92152 83117 67422 23161 -53527 -43632 6503 -39461 -55185 -16622 36891 79445
15738 79445 82893 66385 5989 -30414 61224 103365 70785 36940 2385 -101795 -106160 -16794
15726 -16794 44737 22238 -43170 -41696 -44641 -63238 -18206 -17448 27779 25507 48795 14482 90663
15713 90663 14168 -48709 -10239 -44725 -37407 6411 -44455 -55923 38173 15169 -65059 -68103
15701 -68103 -14253 6109 -44874 -26054 31211 21072 -31831 -66529 -165880 -200651 -221828 -139010
15689 -139010 -148530 -117768 -54983 -43968 -46838 -75579 -127742 -93683 -6748 -68672 -97274 -66245
15677 -66245 -79756 -82274 -90063 -59399 -54238 -16309 78735 70312 -23456 10509 6029 -10037 -55531
15664 -55531 -65163 -127528 -134053 -36617 57040 47347 -21931 -20766 20524 32341 61627 531
15652 531 -8057 -17385 -24917 -52208 -58953 -72664 36791 92487 55683 -22084 -94349 -150562 -213483
15639 -213483 -266054 -110274 -26411 -20351 -104549 -28563 32819 24782 66037 -7232 -64313 -40922
15627 -40922 -48411 -42664 -28561 -39765 -16692 -8722 -130173 -145461 -150999 -169636 -33973 -55122
15615 -55122 -89415 -13703 -40413 -64394 -9891 -57805 -105151 -175056 -178674 -205337 -202468 -64272
15603 -64272 -19171 9282 56125 12690 10238 11886 46951 42595 -2231 -33082 -29749 -103864
15591 -103864 -125379 -95401 -61522 -95799 -42729 -37306 -66730 -80387 -38437 -89929 -152029 -188206
15579 -188206 -166378 -167995 -121563 -54005 62419 133409 105647 21659 -8167 -35939 -1574
15568 -1574 -10296 -49460 -112074 -161308 -72382 -85231 -144092 -46571 -3884 -17019 -71199 -101206
15556 -101206 -84861 -12048 -54570 -69449 44466 98375 164703 39046 -90697 -126918 -163013
15545 -163013 -140524 -143623 -105643 -54707 -14855 29699 14589 13607 58859 132805 119217 59270
15533 59270 -40912 -125437 -101798 -78042 -58374 -113978 -105830 -42499 -61076 -117359 -92685 -46712
15521 -46712 -13652 4610 -14049 -1971 21529 -40302 -118858 -132175 -100126 -20504 -17367 -93565
15509 -93565 -148586 -103420 -117394 -59279 23845 32891 26676 -11888 -79615 -47442 -69620 -135452
15497 -135452 -111974 14696 74244 11589 1762 9878 41119 45030 -3279 -6246 6270 16109
15485 16109 -6588 -23574 15790 15538 2737 -14816 -11961 -12105 -70447 -87220 -63218 -56866 -28840
15472 -28840 -68153 -63005 -27024 -9345 70598 102605 12386 -39568 -89077 -58199 -75079 -76789
15460 -76789 -66194 -28092 -77 -40414 -69400 -14460 80217 90471 20784 -10258 -46887 -25206
15448 -25206 -43582 61309 175883 191303 136712 157629 99786 3857 3463 61502 -12798 -63919
15436 -63919 -76103 -53843 -24523 -4249 66546 60629 51371 -3569 3620 -51385 -90728 -15609
15424 -15609 30897 7552 -47058 3102 26474 -12817 -91439 -162921 -157950 -128086 -70989 -28984
15412 -28984 -35743 -63619 -18388 -17149 -32228 -20070 88278 83974 -16210 -24821 24709 -34735
15400 -34735 -137226 -152523 -140748 -158085 -174960 -189886 -180687 -85660 85749 131302 90266
15389 90266 -15426 -58948 58939 102107 81073 61155 90815 164941 154496 97416 63126
15378 63126 101898 138221 63691 -35552 -52228 33914 161965 196467 180777 137696 166484
15367 166484 104628 74503 72363 23039 5082 48827 1483 -48297 -1481 5255 877 68473
15355 68473 102364 30900 -17268 -51556 6631 12865 -59093 -40972 -3654 -34576 -71711 -135836
15343 -135836 -27951 30270 46559 79544 20889 -215 3477 27853 41182 33879 19364 74804
15331 74804 53402 -17755 6048 59539 27024 16156 40994 39525 22523 167824 149777 62268
15319 62268 -3073 -20902 9568 44400 38541 70985 7812 -53513 -38681 2314 -10806 -33215
15307 -33215 -50405 -18890 18414 37833 17235 -44956 -173142 -201127 -98180 -51990 -22389
15296 -22389 -22477 45862 57506 -62257 -112530 -159280 -106765 -38514 59447 110830 167247 174887
15284 174887 119285 86524 84414 123341 61086 25988 -41881 -80339 -124326 -98502 -33266 41617
15272 41617 50936 126258 147415 58630 37047 60050 73137 86330 70695 -5840 -70412 -82613
15260 -82613 -42949 36348 -16703 -43931 18900 20809 -89323 -167969 -90680 -46305 -28935 -6773
15248 -6773 33299 25521 -56984 -104252 -39391 -38854 -36097 -14665 26945 77018 67660 51993 79824
15235 79824 92438 4583 -96117 -112622 -93950 -135757 -73511 -2306 -86212 -77851 -24082 32843
15223 32843 114265 79040 42469 100264 123689 61252 45674 5600 30648 -43996 10867 80332
15211 80332 94015 116466 105377 29912 5788 -32782 -60598 62520 126066 108798 72674
15200 72674 -28472 -90549 -151816 -160471 -82209 -68373 -90787 -168365 -149232 -89981 -106951 -74084
15188 -74084 -102335 -168702 -146561 -79123 -36824 51712 62590 50333 26767 -48080 -84179 -132412
15176 -132412 -112272 -152413 -117366 -130160 -134472 -94129 -76560 -96971 -87508 -100928 -87268 -91624
15164 -91624 -43353 -38550 -35591 -39295 -31065 -80841 -105255 -27869 6990 -74444 -112946 -15662
15152 -15662 28555 36283 10255 29140 92406 122578 47779 -102389 -107855 -74121 -87336 -84353
15140 -84353 -35856 -32991 -157778 -169400 -79219 -45344 56097 42544 37404 51892 24242 43355
15128 43355 75120 22451 -9833 -6505 -70126 -69850 -111259 -111820 -104583 -5353 63163 -4684 -56298
15115 -56298 16499 79444 55348 48507 -389 10102 45727 28637 36740 61239 -18561 -40061
15103 -40061 -62967 37243 57433 -9470 -2475 14746 22292 29810 12428 64544 101398 95420
15091 95420 74129 71700 110879 110212 54448 -21406 -42031 -40273 -88573 -68649 55779 -5273
15079 -5273 -76027 -23585 14357 4716 45241 57960 60017 21681 24277 132930 189235 69924
15067 69924 24049 109857 94570 67147 17819 69893 16304 -70517 -20712 -915 -53672 -8894
15055 -8894 101779 112459 128625 103203 90961 60038 35112 21623 44361 -9042 -72793 -59341
15043 -59341 -31910 92985 155711 142579 101118 32883 -87469 -191526 -197421 -94194 -17712
15032 -17712 -73036 -34095 -32529 -80640 -136153 -105304 -28246 7827 -9437 -60141 -112648 -112410
15020 -112410 -66199 -43845 -105275 -122703 -116597 -113837 -75995 -157689 -189089 -150435 -59298 -9230
15008 -9230 37743 44244 33518 -63361 -117310 -80192 22270 85395 167462 210194 183432 123870
14996 123870 46478 40693 3183 39014 16780 40820 98477 108725 121946 87124 146663 129203
14984 129203 52614 3939 72024 22780 55674 130918 182456 122980 -5733 -95679 -92825
14973 -92825 -67185 -75844 44747 21276 -79667 -119080 -145932 -147998 -59965 -81454 -100808 -25961
14961 -25961 -32772 -50855 -57250 -41805 -5909 3747 7457 1834 10786 -55759 -58944 -45496 -47815
14948 -47815 -46341 51325 112055 39255 49608 9440 10905 76598 72432 27694 96274 140511
14936 140511 78215 51996 78728 115435 101443 77358 35510 35009 124497 98934 47099 29199
14924 29199 -23999 -60778 -27527 56941 52284 22281 10390 -18389 -16514 -68420 -152006 -93497
14912 -93497 -39612 -79573 -54281 1149 85216 -19333 -76910 -32392 -41845 4744 153997
14901 153997 126773 20709 7060 -17943 -95067 -69965 -39588 -57676 -40511 3067 44127
14890 44127 85123 97454 45643 1623 33876 -12578 22553 8085 3297 -27333 -40736 -70860
14878 -70860 -30370 12143 -14617 4991 -53109 -94522 -18792 122109 196687 158109 81132
14867 81132 -33085 -3807 24497 42547 67880 57483 -15771 -52531 -29314 -47749 -168775
14856 -168775 -165065 -33208 83886 108089 63398 47980 78480 95141 -3472 -76516 -51650
14845 -51650 -70645 -9440 25278 32700 130364 179938 131740 22786 63037 58280 23056 27936
14833 27936 32153 -8625 -25955 -10244 -61343 37380 43145 35790 -24036 2067 46605 117439
14821 117439 108753 102438 90662 7592 -22778 -18636 -32093 -21798 35984 103321 145311 109147
14809 109147 125219 32089 -40953 -56144 -57614 -77744 5965 59605 73705 83801 77804 42550
14797 42550 30940 30878 85119 -9061 -78749 -45407 -53596 -89770 -46167 -42299 -34148 -17643 -17385
14784 -17385 -9238 -61661 -78939 16698 63874 63553 -31801 -46435 -39245 2746 -68272 12953
14772 12953 65931 -9413 -37125 92162 23531 -18884 -4515 7138 9700 -20511 -266 24568
14760 24568 37263 -14616 -14097 -19172 64706 137593 74556 97198 150687 139628 98384 22504
14748 22504 -37436 -26243 -38089 -17953 45559 109379 186459 265175 252390 187484 151853 164440
14736 164440 128887 63298 -2194 38348 52712 164278 107626 33821 16963 88205 168868
14725 168868 178749 150170 125885 87865 45005 -9205 -73488 -60739 107769 178613 128212
14714 128212 135301 68990 31065 21096 41942 -11540 -45007 -34026 8157 56007 122570 111791
14702 111791 53508 -15082 31265 19353 -24263 -71285 -6971 13396 61530 22115 -16091
14691 -16091 -36481 -20024 42760 97508 127153 76168 31962 18628 -53132 -86830 -108213 -119271
14679 -119271 -103544 -89655 -36084 -26240 -85813 -73913 -88395 -43786 33380 84827 143343 152273
14667 152273 111002 35958 -25025 -40266 15712 37366 49476 133237 67924 43837 123395
14656 123395 209616 218280 140329 107873 45696 -78477 -83631 -69861 -48079 -92606 -104759 -186182
14644 -186182 -163630 -82852 -32917 -46613 -24510 -10746 27904 -32417 61088 41568 1414
14633 1414 -25341 -97848 -146771 -43186 72657 107440 35553 -42246 -2845 21600 -5273
14622 -5273 -2734 29713 41239 -38037 -119579 -120348 -62959 -28156 -64260 30572 86901 41218
14610 41218 76331 86029 62611 60253 45883 21313 33146 48337 89226 137853 95219 39891
14598 39891 -9014 -81056 -90378 -59509 -1006 27156 -12452 -57899 -44140 -2737 21938 15116
14586 15116 -40503 -95103 -76841 8407 -39110 -133322 -137213 -64995 -91343 -61204 -13498 -3766
14574 -3766 -29237 -23094 6787 69586 144677 178166 210570 186898 88613 47306 51588 54559
14562 54559 3648 -67754 -23264 -4301 4148 -100239 -140708 -58157 20423 163931 200358
14551 200358 114745 80885 113054 176567 259700 171198 78641 23480 7642 41298 150
14540 150 -73857 -87035 28421 93880 36536 29955 28460 -42741 -144195 -103775 -8800 -21970
14528 -21970 -55590 -20108 -74877 -135315 -133003 -93008 -106476 -116299 -144738 -124972 -37357 -999
14516 -999 -33073 -38995 19137 -8948 1743 -25764 23308 41140 -35989 -65691 -123134 -89348
14504 -89348 -25472 48313 65219 130038 139180 141679 120189 105006 57796 94372 140835 11793
14492 11793 -100422 -96012 -109787 -80562 -51057 -2697 1145 -71860 -98182 -177574 -183148 -103020
14480 -103020 55229 74026 -28650 -51265 -25096 -2943 -28593 10353 -30073 -60216 -53601
14469 -53601 -15074 51200 -13067 -13575 -77341 -105784 -62196 -68926 -142118 -123848 -104676 -90660
14457 -90660 -42579 -81455 -129135 -87293 -42270 20514 -43593 -134209 -162424 -122801 -7367
14446 -7367 70401 91223 26982 -72314 -41204 -30534 -46281 -14145 -39726 51822 80371 116878
14434 116878 97842 75887 66467 102553 121977 148115 168765 66670 -25831 -33083 47576 -9668
14422 -9668 -72445 -83011 -49685 -86351 -85064 -103458 -118598 -139166 -117303 -38913 -12259 5837
14410 5837 6719 45962 24820 54975 46286 14408 12173 -62162 -91482 -103752 -131718 -66690 -61444
14397 -61444 -147005 -73478 44722 93550 23169 -20423 -113170 -124890 -31882 22652 114207
14386 114207 119792 130733 79271 135532 140421 164338 200979 269760 243379 117789 12508
14375 12508 -27479 -56318 -52515 -68859 -122263 -21097 -14145 24325 -23084 -95090 -51437 -41185
14363 -41185 -77304 -56459 -14821 -75009 -90923 -66511 -57553 -82732 -84443 10972 52471 14988
14351 14988 43636 -42850 -85092 -41867 71187 131015 56430 -47784 -56951 -88509 -60985
14340 -60985 -56399 -45347 -12795 -43498 30366 64654 20447 -1173 -46086 -76662 -16896 2119
14328 2119 12048 -29654 -96684 -59509 8678 -35336 -85764 -39124 5620 -71476 -96847 -56755
14316 -56755 -60690 -38987 -38174 -70017 -69150 -52855 -14182 18746 22587 44892 56907 -20357 -74386
14303 -74386 15868 83742 105117 72787 61783 60764 97607 33761 -54072 -82037 -84922 -60543
14291 -60543 18281 70438 105244 188097 128441 122720 90488 105608 90786 82471 150316 144073
14279 144073 39345 -3093 99 65717 -25967 -29263 28517 34399 16429 -48191 15802 9053
14267 9053 7548 127327 104089 73959 55024 54223 9272 57456 85346 70950 50857 30974
14255 30974 -5655 20879 1748 -46268 -7273 95760 90773 -41199 -61593 -30474 156741
14244 156741 138122 74835 118470 116316 114801 194080 250508 259818 215405 115582 1716 -73954
14232 -73954 -106531 -30623 64251 129322 73791 63232 14855 17539 -37716 -6561 60648 70202
14220 70202 55786 39248 43239 30329 -15729 -67672 -98722 -125419 -76158 -26831 23464 32733
14208 32733 -30321 -124465 -130647 -13983 65951 24530 2058 -53115 -47715 19682 75771 75295
14196 75295 122170 115217 165530 223702 235341 78053 26038 40282 35713 50093 67325 70935
14184 70935 25704 -6862 -79706 -97611 -6181 3064 -41660 -99540 -93856 -75971 -67974 -82287
14172 -82287 -52794 34033 -4760 -40031 -107080 -96055 -27445 27897 176727 228591 169503
14161 169503 109705 81185 3705 -2157 49395 183852 220736 151087 108319 96136 136548
14150 136548 173778 167444 75494 44284 32623 24343 98228 76472 73715 30285 -93273 -118034
14138 -118034 -37718 53502 26803 -42773 -19821 -100838 -169796 -85410 68711 71440 85574
14127 85574 97220 76239 34464 -48627 -2188 26900 8720 41302 81671 64883 75821 100601
14115 100601 109893 94545 3401 69197 35271 11256 87827 70764 13400 -64335 -54260 -38813
14103 -38813 -55709 4851 -13295 -40762 -12506 737 -9556 -65650 -37782 20729 77817 51277
14091 51277 54762 54011 -11975 -25276 14868 -3720 -46341 -64979 -20328 -10102 22922 54145
14079 54145 7301 21447 60744 61339 66710 54772 55748 77370 -22207 -78527 -8459 47272 109459
14066 109459 202235 184568 217944 171255 175118 61842 25741 -11875 -22023 1146 96947
14055 96947 120678 56870 39969 107960 161247 117989 67924 27685 13996 17809 -62852 -41565
14043 -41565 -13572 -1794 8551 77891 99734 55448 40791 44719 92878 86833 38393 131832
14031 131832 75381 -35827 -105300 -96158 -4319 115262 77743 -17749 31051 53057 94939
14020 94939 113369 42578 43728 14511 -11789 -41442 9372 68277 79097 35260 49774 19771
14008 19771 4968 19010 20545 -3432 -3313 11261 -38767 -28938 3035 8867 15856 -12686 43011
13995 43011 28124 52279 57365 54788 42564 20436 5878 -34027 -15484 -30404 -54720 -43948
13983 -43948 -33795 -19657 -7698 -12934 -60952 -53830 -41261 23843 71203 45981 9528 10096
13971 10096 -55951 -114250 -95840 -3122 66215 56430 10949 10875 58619 31803 -17191 -53424
13959 -53424 -53098 -6688 82022 57036 50704 -50636 -156819 -161147 -101137 -35605 -20712 -6248
13947 -6248 30599 48571 69774 54262 -7439 -68505 -43151 -43438 -59828 39056 145037 150445
13935 150445 59005 24867 -51521 -133369 -90842 1226 -32364 -15253 61472 45723 67500
13924 67500 58404 45714 66456 54122 91437 106997 48650 36413 11590 -32834 -130040 -119513
13912 -119513 -180468 -149658 -144861 -156231 -55306 79970 155152 97543 121332 33714 -44531
13901 -44531 31452 72369 32078 -3822 23624 111907 138895 123610 43705 56517 102110 114850
13889 114850 174167 207603 126019 19285 -13302 358 17825 22256 -18515 271 -18945
13878 -18945 -70784 -96751 -9462 -16482 -24689 -8225 -16644 -5260 -7455 -29009 -29164 -39850 -44174
13865 -44174 -39461 1888 33418 9762 7346 69292 85220 4474 -60500 -5501 -46309 -46200
13853 -46200 -67798 -133809 -59657 -4001 123127 170088 141950 115980 102082 61929 -32140
13842 -32140 -95029 -148368 -148892 4616 89451 75258 74461 113792 116951 122835 72491 21389 -9469
13829 -9469 82390 101319 -26222 -118362 -109032 -37044 -78524 -35179 -15436 59035 55866 50569
13817 50569 32575 70180 72706 115685 80378 183618 190102 130680 154628 178918 209197 141367
13805 141367 123377 171070 136990 6531 -52603 -76444 -70433 -56027 -64994 -54651 -78712 -61790
13793 -61790 95251 134003 39168 21025 -41473 -93127 -96476 -55527 -89687 -3086 53035 12201
13781 12201 -17556 -1270 -72622 -94247 -24273 -103954 -168904 -119516 -57691 -30524 -5761 1870
13769 1870 92566 163241 103346 14653 103227 108776 60845 50600 59699 47074 23844 -4758
13757 -4758 53196 105021 132622 74483 42394 60213 -7605 -45655 -18787 -33473 -52350 -9697
13745 -9697 24768 -66361 -136481 -126058 -22712 -7912 -63252 6955 -103713 -84527 -63153
13734 -63153 -33544 -61235 -81065 -20535 45640 126085 162578 103254 1596 108301 132277
13723 132277 48294 -5388 34755 3943 -45102 -70535 -6848 18905 -7233 -55771 -79
13712 -79 58507 -11713 -874 72057 45829 35382 -10798 116458 158536 188862 176054 115294
13700 115294 51647 -45149 -128948 -16039 18664 -61081 -88596 -101785 -32859 46914 95733
13689 95733 65250 -14637 -15634 -23206 -14568 40748 780 88311 134014 81224 33593 -2526
13677 -2526 -1975 88608 158816 131884 54678 -39586 -53261 32606 50554 -2828 -19506 9447
13665 9447 61606 113465 112924 103819 106755 108529 107059 134835 143010 23775 -77708 -114503 -75173
13652 -75173 -31983 -17713 20646 55444 -69715 -74391 -121571 -117671 -139106 -153546 -161233 -88312
13640 -88312 -26823 -61254 -9431 -39637 -112635 -91587 -123357 -46138 -33482 -31799 -13764 42892
13628 42892 49206 127782 181980 133079 87439 33091 73332 117427 59660 28276 77881 56295
13616 56295 22185 20448 -35427 -58754 -89781 -139368 -150462 -90742 -60469 -73814 -11042 357
13604 357 -28807 724 43026 -10224 -47643 3626 60977 51753 11876 -24290 13820 30178
13592 30178 15773 18427 44020 2081 92774 67238 -12665 10431 117399 184465 161833 121002
13580 121002 112327 104266 -1110 -76755 -86533 -117972 -76780 -74076 -45311 -376 8257 51181
13568 51181 85394 101136 182705 240866 196646 213246 174364 169181 138400 119187 49694 88308
13556 88308 123414 116109 40912 15007 3026 -71739 4537 83239 73364 156221 76336 -37605
13544 -37605 -104387 -101054 -68852 -56953 7340 -77976 -100745 -58333 -152416 -175939 -120246 -117674
13532 -117674 -71025 -78026 -132537 -60646 11653 -5323 -28526 -56419 -25965 27691 22104 25067
13520 25067 87472 109267 97927 51672 -17268 34097 160110 187646 137614 83081 139329
13509 139329 246335 132566 20008 33630 50335 46712 -19596 -54788 -80202 -46379 -47721
13498 -47721 -71154 -86085 -105270 -85137 -25945 35755 38277 26537 4270 31875 34529 44104
13486 44104 67974 46128 57038 43970 28857 39670 51392 26495 6779 -26104 -26232 29192
13474 29192 52470 2214 -64385 -64243 47888 34406 20915 117327 152859 59882 27928 100308
13462 100308 121063 183004 189952 165182 90643 119642 143800 150199 101476 72978 696 -40544
13450 -40544 -74399 -89968 1526 -8143 -15695 9900 -2470 -30041 -104713 -63325 19811 87308
13438 87308 74223 -21205 -2282 29142 -56324 22173 28617 -24709 -2089 -33432 -60238 -50580
13426 -50580 -35679 19037 -28594 -40000 -58025 -38277 -43942 29857 3193 12788 -5841 -84457
13414 -84457 -64441 45008 88772 51617 76816 81846 53332 41080 22764 59674 124800 37419
13402 37419 49558 85995 81537 2515 -124137 -134845 -164119 -87162 3653 37584 24661 61826
13390 61826 19715 -20201 38417 117484 106850 77499 28592 52321 72860 39002 -23965 -74224
13378 -74224 -76574 -52325 54692 137144 66986 29826 27393 16551 -34322 -54898 55339 109679
13366 109679 144584 18824 -30219 -6282 -17299 -57348 -22426 28750 99950 67265 58605
13355 58605 45376 -240 65693 46963 35393 49514 -46520 -8668 -12178 38086 36133 27919
13343 27919 25009 54548 90153 76329 67045 72294 26541 -49137 -96784 -68235 -24229 2061
13331 2061 58164 115645 85127 7051 -8552 9974 153276 205315 144553 31066 -13570
13320 -13570 -62211 -69664 -62845 -110388 -23429 55983 77601 15692 -28011 7548 21655 -29479
13308 -29479 -79907 1449 66239 52134 59249 70704 109771 87167 41238 2140 -28773 -61591
13296 -61591 7364 60429 25264 27055 3497 -9768 -18544 -20329 39266 53484 -13687 -68049
13284 -68049 -83322 -53432 -6002 -39883 63827 91008 60945 119084 47903 -61743 -147335
13273 -147335 -122116 -22570 -63101 -56629 -31773 -11269 -15404 13565 -30520 -4374 11708 12044
13261 12044 40076 44774 43992 5002 -29295 -58570 -71487 -121855 -118045 -36736 -44434 31025 49707
13248 49707 -21539 -56661 -16416 95009 91933 -1936 -28430 30573 -17257 -128810 -106456
13237 -106456 -63393 -39152 18972 26882 -17335 -35276 -24703 -19172 -75695 -120788 -195801 -75603
13225 -75603 -16428 -13350 92957 91340 18790 -6541 -62243 -42601 -17890 -16847 -31073 -86497
13213 -86497 -22823 -61573 -92732 -60526 -94071 -94199 -135173 -77905 -60437 -36833 -4311 -17635
13201 -17635 -5907 -14400 -1031 12596 42254 -45243 -76496 -96669 -46662 6627 -54162 -36561
13189 -36561 -31810 29230 30642 -28722 -36175 64494 38437 1610 -60488 5787 30876 36333
13177 36333 76023 76822 30719 46639 90219 21499 -3297 61192 125394 98814 99342 114233
13165 114233 101772 86751 96433 57564 39482 69485 40160 60453 73366 124455 110006 44498
13153 44498 9962 9246 -16294 -26314 -39383 -53872 -83137 -82652 -61709 -22475 13961 25752
13141 25752 5889 -50360 -48451 -3168 50969 102916 104449 4231 -39942 31405 63190 -72915
13129 -72915 -75541 2237 45057 159212 175065 95798 -12888 -109835 -126866 -39697 -76080
13118 -76080 11253 57453 85050 16696 -45628 23946 123844 94535 -32218 -36194 -24028 15618
13106 15618 37789 -75860 -100130 -43096 -52145 -82532 -77802 -43125 -6623 -52731 -34541 15612
13094 15612 8445 21554 144971 108455 -54106 -86608 -17047 -16669 -47857 -10380 59350 83167
13082 83167 118774 38838 -15293 -38395 -71952 -53971 -82128 -71886 -55021 -24300 29730 46171
13070 46171 9749 41205 114283 181919 215007 246507 225869 131200 74335 -2871 -61157 -83786
13058 -83786 -51894 59953 126929 105670 133784 145031 134295 164169 180252 108691 -1817
13047 -1817 7237 11988 5347 25071 12533 43710 29360 3715 90366 90743 7908 -17190 -119609
13034 -119609 -169835 -121861 -59308 -12109 39852 -27369 -49072 -60140 -31556 43031 50072 65929
13022 65929 123320 146414 108486 18206 -27925 78053 130316 143270 96354 65456 64868 141331
13010 141331 124011 104264 126057 150388 166582 30951 -132723 -122948 -112800 -134796 -59360
12999 -59360 30598 70620 31834 -11155 -12163 -35862 -8072 120722 71704 23317 24676 -30270
12987 -30270 -42499 -49977 -92813 -126138 -63422 -2594 -14388 3513 75109 48491 50268 86276
12975 86276 122680 288 -78706 -51349 -15420 52936 131603 18535 -37067 10172 44576
12964 44576 54029 78374 79640 79107 49981 1824 -6392 4145 -7739 7035 15927 -79749 -76731
12951 -76731 38126 117937 141966 4976 -66240 -42145 -7301 -5448 15104 19714 35084 -7457
12939 -7457 -11473 75473 64809 44671 105683 99391 56131 59035 92271 125146 136947 168180
12927 168180 117199 -11721 -97149 -107711 -108135 -147118 14440 196745 283711 166700 121320
12916 121320 -44728 -46197 -79481 -107028 -51130 65881 103262 25085 -65047 -95663 -111263
12905 -111263 -77013 -118716 -97654 -32240 31968 4963 10201 131091 179849 198890 93581
12894 93581 31583 -16465 2168 -53107 -61537 -83624 -47534 57970 95285 132355 162565 123545
12882 123545 73138 19554 -12534 -75798 -7939 31235 88410 104780 109098 107078 47829 20077
12870 20077 3329 43412 19291 -37114 -17525 26650 71737 136626 144099 119537 107572 62838
12858 62838 82562 47325 121400 132525 124712 137077 113728 47039 81443 97099 105236 144894
12846 144894 173981 102421 120266 176026 212290 148122 132577 148058 71768 86175 163559
12835 163559 117041 102369 49800 33851 1496 -38198 -141828 -142227 -106339 -52864 -33571 -28134
12823 -28134 14626 25893 -77232 -129627 -140374 -147657 -129404 -29248 -6630 -5687 -14063 242
12811 242 -18595 -83620 -48970 2671 134207 32789 1225 4249 104775 180076 134259 101225
12799 101225 126138 125669 63439 93431 47995 -47179 -37226 98580 163848 82203 52221 81225
12787 81225 76999 46722 34987 30200 82572 166064 82341 17585 40815 136549 47455 55768
12775 55768 67505 2112 -28979 -11829 -78846 -111811 -5573 -7245 17354 28547 82627 150910
12763 150910 120481 107658 101303 112772 122585 106841 46532 -94185 -138961 -69501 -64492 9373
12751 9373 15328 603 34918 56080 -37053 -67917 -73814 -80038 -35719 40630 98699 130457
12739 130457 110084 19978 34564 112553 131131 91239 57944 76274 9431 -62229 -64533 -18115
12727 -18115 66482 12879 -7034 -60212 -110220 -124816 -56216 -13475 -56337 -13296 -6124 -25073
12715 -25073 -47282 13131 -27395 -58833 26859 23874 -1029 -3285 -43710 -25846 -235 -2094
12703 -2094 -37541 -49259 16947 67260 185276 236371 140112 79206 -4871 -39577 -70972 -10522
12691 -10522 49140 -87052 -101439 23401 79929 22072 -72663 -63601 7894 33459 -52004
12680 -52004 -54310 -47706 30246 30598 -75505 -81076 -2739 64722 135303 119577 48811 23901
12668 23901 24801 40691 51945 25356 17383 75453 61842 19766 -28177 -48066 52489 60422
12656 60422 119725 93916 -10178 -65386 -17639 -82763 -121380 -90573 -63638 -16208 -61557
12645 -61557 -48270 -80231 -105009 -49075 42691 55874 110235 98800 93109 70587 100107 40807
12633 40807 4565 36401 -20233 9571 9695 -66660 -66899 -25919 -29246 64849 74301 104593 58214
12620 58214 -26817 -50733 17324 30146 71594 90448 18225 -6760 15956 -13445 -13758 -42573
12608 -42573 -73192 -30665 8605 -22911 -36247 38163 -1357 -134113 -90861 20974 126326
12597 126326 62707 -50244 -86694 -94977 -97273 -58013 -61638 -886 67228 110028 172702 199318
12585 199318 113809 67406 39257 4660 -617 52821 42818 -31333 541 108672 155280
12574 155280 148268 96804 29882 28273 43910 39331 -37504 -22916 24754 -19451 -38847 10362
12562 10362 -14383 -46669 -11476 19315 -40524 -71430 22330 71401 23314 45259 58672 75706
12550 75706 117025 41646 -61264 -93604 -1642 134417 197716 209121 115868 63933 -20043
12539 -20043 -105267 -140397 -141731 -47536 61243 53809 -36203 -119158 -142229 -50249 58951 93752
12527 93752 48520 13461 -42523 -27307 -7638 34578 19424 -43441 -83130 -25978 97776
12516 97776 98272 -2660 -98511 -106453 -134452 -139262 -163457 -208260 -154305 -63027 -96824 -208174
12504 -208174 -232103 -190099 -105244 -105845 -62118 -88260 -99234 -56255 35638 63587 151418 123299
12492 123299 73725 68280 31859 10722 -37674 25866 77803 75900 78057 31408 3827 49059
12480 49059 11716 16176 47673 -28941 -62019 -44351 18453 73414 120622 71347 27748 -3765
12468 -3765 34909 -3052 -43766 -59105 -24031 -28323 3902 39691 29127 -32280 -46958 -40035
12456 -40035 -32173 35002 44143 44642 46429 25612 9227 -13202 -13025 -44133 -16628 62995 167439
12443 167439 117901 24874 -8083 15314 31452 -9218 -75117 -123538 -75013 -40510 36474
12432 36474 92139 37234 -60890 -984 58839 39247 23364 4192 -21459 -94855 -80349 -34857
12420 -34857 -19156 -67092 -5979 11399 37067 53270 119499 136395 140653 214493 184702 95203
12408 95203 55693 16184 -38844 -88699 -83065 -78249 -98110 -54633 79061 133352 40022 -19777
12396 -19777 96573 24125 -80760 17315 -34913 -30499 7771 99284 167766 164215 102693 18235
12384 18235 -9934 -52615 -58987 3722 -19589 -24544 -28955 -90900 -102635 -114420 -171141 -140110
12372 -140110 -13829 150383 121625 -19799 -51924 -41100 -44877 -30761 -73801 -38197 26754
12361 26754 54871 41701 -34095 -27083 5311 -4724 -87749 -155086 -144703 -39142 -89033 -49749
12349 -49749 -27550 -14902 67768 83392 53587 63647 44721 -32249 -66324 -60651 46762 74432
12337 74432 55621 -62585 -121282 -66734 1207 24828 100639 96091 83367 46218 20270 35132
12325 35132 71856 184291 162970 82803 -35646 -175232 -247470 -177093 -132518 -98867 -69630
12314 -69630 -97281 -62203 -41373 -53612 -33349 37346 -16245 -58059 -367 59621 50072 43333
12302 43333 13674 61699 150868 153737 100422 -878 -73165 -100276 -74639 -23535 71547 145035
12290 145035 185303 262688 159793 35214 15005 -38605 -55716 -64281 -65378 -7697 19122
12279 19122 -14387 -16000 39762 33626 60236 62466 89764 70532 94303 84111 66002 43057
12267 43057 48189 81741 65475 61716 11311 -7380 -9574 -14692 -41649 6671 -8162 10452
12255 10452 -2808 -16866 47329 82805 123121 39731 1010 -15745 -113329 -65050 23913 69077
12243 69077 35080 16255 61561 87931 97969 99420 160219 169846 114947 46232 -63130 -177424
12231 -177424 -177599 -128903 -62173 -42452 -49259 25157 78179 97356 16409 -85498 -28558 49173
12219 49173 140068 166715 194353 125943 108379 81473 9217 16905 105424 91341 21917 48098
12207 48098 61477 27453 3052 -5610 -23364 64284 110644 112762 113848 26389 -30787 14493
12195 14493 93342 68384 16575 -36235 -111029 -101584 -130371 -105183 -36877 61247 107825 31690
12183 31690 -14617 52994 30665 821 37089 -23009 22975 34287 -12716 -61746 -44433 -27924
12171 -27924 18983 62914 77940 117339 86050 -1370 41110 -36067 -74178 -100061 -20628 724
12159 724 19186 -528 -67496 -66993 -72601 -42668 13132 -33720 -70132 -46589 -1196 -51790 -50961
12146 -50961 -15117 5660 -18491 -33756 -46873 -41430 45603 57211 49899 -23694 10929 61398
12134 61398 89754 35158 37277 52497 55278 209746 226721 156320 98414 -4716 -50482 -1845
12122 -1845 69379 96500 115878 68609 55544 48936 3280 13550 51826 37651 68132 -4067
12110 -4067 -20070 -28138 -92274 -135114 -78250 -17970 -10250 10756 -3162 -20293 -12436 -52301
12098 -52301 -31217 -32901 -19912 -14157 -50557 -91530 -139433 -66608 9304 16826 14738 -27940
12086 -27940 -39391 -31306 5662 12826 69180 126780 130397 47696 49167 110234 36213 45687 59327
12073 59327 16819 -19460 14057 63252 73981 78113 73417 -6337 -12870 85765 44048 -1191
12061 -1191 -22979 -49650 5645 48323 -7142 -461 -22513 -11338 -17705 14175 -13401 -64888
12049 -64888 -63043 19450 -4024 61390 58668 -12593 -30566 -2588 -6042 3818 10466 -39204 -6821
12036 -6821 -56756 -90247 -84073 -40199 -44511 -83491 -108904 -40659 -16735 29832 31147 -6721
12024 -6721 -32061 -31684 -72657 -100961 -70017 -5428 9298 28266 -41741 -105678 -134344 -156266
12012 -156266 -58530 28633 47349 79031 31916 -52766 -85904 -100184 -63787 -25925 20738
12001 20738 -10587 -74588 -43823 36912 -8426 32904 10342 -17449 -30102 -9740 -14837 -12124
11989 -12124 -36065 -59820 -11140 18887 32091 1986 -109403 -86329 -3984 -6708 37778 24935
11977 24935 -71290 -96923 -112052 273 63544 -46966 -169816 -114575 -85465 -104432 -26526
11966 -26526 -14550 36319 48042 125928 167108 52874 -31434 -36472 32407 61531 73746 53383
11954 53383 54585 42361 24203 47373 43682 36448 38952 86361 63801 23427 31702 -18758 6897
11941 6897 74379 50973 47136 26164 -9159 9569 8125 -18696 -105981 -100097 -99808 -46669 -9447
11928 -9447 4041 24394 87357 109113 102894 47287 287 -42326 -21455 -32523 -67919 -56282
11916 -56282 53688 146804 124022 72639 27337 45497 17782 -13634 49039 54656 43370 29231
11904 29231 8101 38380 -16568 18811 60476 -62371 -50715 -19868 -58823 -73692 -53837
11893 -53837 -66361 -47383 -53322 -100762 -108960 -160223 -160726 -124961 -102205 -26798 -19947 38008 36470
11880 36470 38845 60411 40592 -52134 -120697 -152542 -154979 -170024 -157110 -46942 -56355 -57450
11868 -57450 -42267 -48810 -13280 48596 41201 69307 36741 -52562 -106699 -98317 -54624 32912
11856 32912 113233 82212 32299 2409 -36270 -27155 -120174 -121309 -66579 -16491 40899 78345
11844 78345 48128 26184 -54575 -112172 -51923 -66242 -89576 -70356 -16266 -63072 -86162 -52555
11832 -52555 -6804 19021 7576 -21605 -8061 22429 56036 -857 17299 -62621 -180856
11821 -180856 -182222 -134632 -127353 -27245 22591 54849 10738 -1148 -5540 2790 83195 73309
11809 73309 45835 78852 142209 188002 125929 94055 95029 118347 158091 186123 154917 86718
11797 86718 -44222 -95748 -90093 -120360 -70457 31510 63177 90184 73289 48745 -51093
11786 -51093 -18371 77694 105119 91701 -1271 -57657 -33936 14825 86635 153681 129930 105227
11774 105227 60153 99162 121916 73782 -5118 80962 198615 140586 116368 84094 -2862
11763 -2862 -11554 52339 17675 2137 37553 89545 110384 88078 38718 92772 133233 78357
11751 78357 -19761 -34139 43891 53044 85118 58907 22158 40528 53791 106376 89042 18547
11739 18547 17274 -7595 26952 33654 35885 13293 19927 5200 -110905 -150502 -122773 -59591
11727 -59591 26638 -11491 38808 113877 84793 43366 53160 97403 104805 50906 -38159 -32736
11715 -32736 -64165 -65147 -51654 -35456 -6905 -11173 57330 139087 180633 133001 29715 -4224
11703 -4224 4536 83317 86586 -6747 -123031 -69951 23346 -24790 -159403 -179839 -127153 -4797
11691 -4797 16535 -4895 9764 52576 -37591 -141420 -8580 67608 31094 83273 203315
11680 203315 195461 71790 21345 -10988 18773 29203 65422 130674 111071 59331 -21672
11669 -21672 -47427 -67857 -124678 -11845 96056 52530 30477 12514 12555 68184 43310 58923
11657 58923 55866 102026 163399 135646 35835 66915 -46848 -75922 -77293 -715 78400 22468
11645 22468 -77285 -104000 -112805 18920 41990 58158 87768 76948 73675 103360 161683 171698
11633 171698 159689 110108 89494 69135 74111 18675 -32469 27181 47417 20397 22659 84700
11621 84700 131031 208510 201177 99870 39663 -14712 37080 88539 156994 156436 75476 37934
11609 37934 46188 -41989 -80855 -45508 -22816 -2243 -23810 10565 87551 -53824 -132386 -116562
11597 -116562 -135641 -162969 -150667 -177703 -131667 3833 24428 70276 38200 8255 -75434
11586 -75434 -58230 -13650 56720 45943 -9324 -58152 -62328 -23566 16462 -41040 -109540 -40975
11574 -40975 66375 67804 125185 52786 -6590 -6766 22316 40549 -26000 -99547 -99656 -108154 -106585
11561 -106585 -99370 -26528 -107606 -175478 -88641 -57062 -90134 -80366 -100240 -44217 -20021 -35361
11549 -35361 4555 52869 129217 56766 33904 29100 -35167 -30282 -7902 -29022 -5412 -25968
11537 -25968 -28604 62629 155002 159375 141710 137658 95607 87613 108770 -283 -1027 25741 -30549
11524 -30549 -74655 -83632 -57237 -43711 24739 56565 -29937 -103843 -82118 -100255 -77198 -137514
11512 -137514 -93458 -68613 -68962 27007 30340 18386 21728 -6479 -3424 49070 33534 12909
11500 12909 -49482 -87596 -57049 -22304 -3542 8858 -31538 3698 -36230 -73982 -37162 -38994
11488 -38994 26455 86984 113997 130315 26548 35083 10608 47121 95861 44367 39815 46714
11476 46714 10369 -48753 48489 47355 -63681 -51080 -42571 -99264 -136501 -105209 -87187 -33681
11464 -33681 -22903 -45881 31564 102840 109521 66769 18060 -65548 -41263 -18370 64562 18609
11452 18609 -29309 2193 39672 21695 -10094 -23957 -16929 21308 58452 62960 88111 145094
11440 145094 116592 54129 12096 64189 139974 102836 90653 97986 66388 68490 70135 -18688
11428 -18688 -60732 82393 138822 52014 22282 22383 85559 88136 32804 47507 122395 46054
11416 46054 61036 44152 -22823 -25977 -109090 -120065 -21572 -4345 12416 -9277 -39831 -139148
11404 -139148 -177912 -108840 -56187 -67306 -114988 -117200 -35467 483 -51317 -70345 -31539 69246
11392 69246 29215 -44911 -63256 -101625 -151498 -97125 -22162 27346 -64170 -103433 -115475 -89565
11380 -89565 -55638 -27912 -51087 -24273 22474 61197 65773 47464 22906 -38490 -89796 -63962
11368 -63962 29494 95028 89729 105216 53885 -18977 43685 148082 183011 116766 40874 10843
11356 10843 25909 41399 43817 75103 106607 128230 66887 -51904 -92587 -85112 58302 128367
11344 128367 114480 108966 116648 123564 91438 -3772 -45439 -63260 -40920 16579 21958 -4617
11332 -4617 17902 -26315 -3642 -114459 -184463 -131791 -11163 54601 31084 -3331 -5957 -18265
11320 -18265 -59089 673 -7205 -63617 -53084 -73011 -104061 -87302 -95194 -57746 -26607 -70944
11308 -70944 -101620 -40828 22006 -588 -15657 -29380 -17585 -40230 -140436 -59291 -61325 -7152
11296 -7152 28734 55886 83727 90135 103934 120772 110273 93813 42100 -9730 -8579 -1308
11284 -1308 -63805 -2339 -66243 -59545 20358 91291 52893 8015 13891 -23344 -30778 -13638
11272 -13638 -7779 -16331 -49215 -60191 -71341 -63538 -47925 -26510 658 69920 30737 -49121
11260 -49121 -60909 -28722 6593 12685 46494 75515 89918 55190 72044 127496 46676 38566
11248 38566 -10074 -60594 5061 41908 8035 70419 45154 13798 -25272 -21002 62077 17546
11236 17546 -13926 -72794 -156245 -112036 -29546 -18136 -22090 76768 146621 141025 89260 38578
11224 38578 41403 -30821 -59763 -73244 -68216 -65777 -84874 -121627 -77755 -142493 -193575 -113098
11212 -113098 -55855 -13025 -50578 -17501 -79126 -78168 -27053 -14385 -36744 -71238 -87916 -139257
11200 -139257 -131161 -62238 40766 16374 -53289 -25447 2189 -61468 -51600 -60550 17391 29875
11188 29875 -15696 -71799 -98125 -86254 -70856 2381 -51482 -115883 -95695 -48696 -61657 -106335
11176 -106335 -188223 -180554 -109086 -93366 -64054 2177 42327 9187 -4686 -44322 -64702 -14825
11164 -14825 52547 38332 52550 91689 73145 41352 45057 -23380 -50811 25253 28942 47523
11152 47523 51043 -9726 -66831 32696 57290 13381 -75603 -102569 -71416 -23336 -81938 -73179
11140 -73179 34607 90724 111990 97874 30812 -66675 -105793 -38143 71277 17019 -56358
11129 -56358 -67047 7040 10337 -69316 -12164 57526 -421 -51916 -59283 -10911 4710 25811
11117 25811 -45037 -105561 -41482 -1632 -75651 9715 26313 24557 33595 -21565 -9770 43693
11105 43693 15097 -33072 -43801 -23013 -11365 1876 12770 -17149 -31 32387 37782 87032
11093 87032 52176 -65019 -101984 -89744 -88116 -122063 -121617 -87780 -16716 29505 -29229 -87665
11081 -87665 -91202 -124654 -54050 -36860 -100844 -62376 19980 98739 18528 -41881 -24368 -30439
11069 -30439 -51328 -99801 -43700 -41572 47955 146108 64883 59298 135920 185242 251817 172575
11057 172575 -31452 -76585 -58613 -24028 -2592 5126 -53193 -98186 -110821 -50534 -3532
11046 -3532 13731 105778 88744 -11020 -53383 -115768 -77505 -26932 -83973 -124897 -11355 70203
11034 70203 82701 141756 97231 -30215 -131832 -100071 -42263 -90983 -31040 10846 32963
11023 32963 84435 28097 -11355 10931 11408 18482 12827 -77532 -24523 82573 26863 -16354
11011 -16354 -9082 29598 60995 11229 -7019 -28907 -84533 -93774 -72166 -118445 -124631 -146949
10999 -146949 4775 27260 73899 38477 -1034 73097 113615 -48366 -77843 -59073 -46639
10988 -46639 -18200 15528 20988 27533 14773 -29572 -78340 -101239 -46440 -31082 -66983 -133536
10976 -133536 -103584 -43979 64862 41742 14129 44464 -320 46087 95626 111937 139046
10965 139046 142109 56086 -11308 -40047 -14291 -27915 -25838 110655 93023 131746 106467 77433
10953 77433 45766 -44905 -124056 -75716 -11563 202 -35031 -7857 -57876 -95910 -131542 -64976
10941 -64976 -17442 -30975 -13421 59082 55900 6754 53517 107857 114059 6562 -91974 -162421
10929 -162421 -197690 -182407 -135677 -62196 -2099 17435 -7555 9761 -79495 -109124 -101831 -133858
10917 -133858 -123333 -33387 22059 -48302 -126244 -141857 -157904 -111250 -31435 30886 47183
10906 47183 117441 186960 220387 189398 154644 42210 62741 58281 -54787 -19066 58699
10895 58699 65180 77206 67514 64251 59361 30542 60016 78527 58027 4443 17867 46091
10883 46091 -8780 -8116 61967 74487 36997 71605 95385 87656 52725 72993 78104 30779
10871 30779 -50761 -61839 -13399 12964 24685 7628 45504 138788 153799 105143 157546 268674
10859 268674 284653 212072 134615 137786 105223 -19193 -1494 63332 34091 11919 -27602
10848 -27602 -57621 -68000 -69308 19774 -31302 -76148 -132286 -179385 -165810 -129015 -53872 -80488
10836 -80488 -92465 -54441 -25173 -22405 -33936 -17111 29059 -3722 -14236 1615 -44829 -71111
10824 -71111 -347 97783 89410 906 -6776 -28652 -74178 -96960 -77944 -63682 -55464 4558
10812 4558 110149 142261 115026 37798 -66648 -59817 -15653 -53689 -114448 -176558 -127519 -56824
10800 -56824 -31647 -16179 -51681 -68666 -34413 -4507 37812 34441 16736 33111 15272 -11642
10788 -11642 -11352 -11581 42774 95355 110825 89013 45889 31985 -49505 -123297 -181013 -152338
10776 -152338 -67622 -54512 -70768 -76568 -154377 -123171 -6022 -36760 -140392 -169151 -114300
10765 -114300 2040 35325 21177 85486 87093 25607 31193 98161 67171 26670 13339 52688
10753 52688 30398 80736 85068 -25374 -133725 -160082 -113667 -45499 -29926 42696 150447
$$ [...]
##END NTUPLES=NMR SPECTRUM
##END=
