##TITLE=Analysis number 328623
Compound Code cc 56213
Book Reference 513/79/36
Project Code adrs
Chemist Name ronp
##JCAMPDX= 6.0         $$ Bruker NMR JCAMP-DX V2.0
##DATA TYPE= NMR SPECTRUM
##DATA CLASS= NTUPLES
##ORIGIN= Bruker BioSpin GmbH
##OWNER= nmr
$$ XWIN-NMR		Version 3.5
$$ Thu Jun 21 08:45:51 2007 GMT Daylight Time (UT+1h)  MAYBRIDGE\nmr@NMR_250MHZ
##.OBSERVE FREQUENCY= 250.131544655141
##.OBSERVE NUCLEUS= ^1H
##.ACQUISITION MODE= SIMULTANEOUS (DQD)
##.ACQUISITION SCHEME= undefined
##.AVERAGES= 16
##.DIGITISER RES= 18
##SPECTROMETER/DATA SYSTEM= dpx250
##.PULSE SEQUENCE= zg30
##.SOLVENT NAME= CDCl3
##.SHIFT REFERENCE= (INTERNAL, CDCl3, 0, 16.522)
##AUDIT TRAIL= $$ (NUMBER, WHEN, WHO, WHERE, WHAT)
$$ ##TITLE= Audit trail, XWIN-NMR		Version 3.5
$$ ##JCAMPDX= 5.01
$$ ##ORIGIN= Bruker BioSpin GmbH
$$ ##OWNER= nmr
$$ C:\u/data/dgb/nmr/ADRS/1750/pdata/1/auditp.txt
$$ ##AUDIT TRAIL=  $$ (NUMBER, WHEN, WHO, WHERE, WHAT)
(   1,<2007-06-21 08:45:23.20 +100>,<MAYBRIDGE\nmr>,<NMR_250MHZ>,
      <created by zg, POWCHK disabled, PULCHK disabled
       configuration hash MD5:
       76 6E 9A 78 1E 09 19 81 EC 84 63 8F B0 6A 59 2D
       data hash MD5: 64K
       BD 47 67 62 29 D2 C2 2E AB 86 5E AC 23 64 17 D5>)
(   2,<2007-06-21 08:45:39.89 +100>,<MAYBRIDGE\nmr>,<NMR_250MHZ>,
      <Start of raw data processing
       ef LB = 0.3 FT_mod = 6 PKNL = 1 SI = 32K 
       data hash MD5: 32K
       4B A7 12 43 42 85 D7 4F F9 82 84 AF 4D 96 D9 FB>)
(   3,<2007-06-21 08:45:41.78 +100>,<MAYBRIDGE\nmr>,<NMR_250MHZ>,
      <apk 
       data hash MD5: 32K
       50 73 24 00 BA 84 01 27 A6 44 DC A3 C9 43 32 1E>)
(   4,<2007-06-21 08:45:42.51 +100>,<MAYBRIDGE\nmr>,<NMR_250MHZ>,
      <abs ABSG = 5 
       data hash MD5: 32K
       A9 2A 97 58 6B A5 07 70 99 64 25 73 8F C4 3A 7E>)
$$ ##END=
$$ 
$$ hash MD5
$$ 12 0F 66 1E 57 58 D1 48 DE 40 BB EC 93 44 AD 7B
##$RELAX= 
##$RELAX= 
##$RELAX= 
##$RELAX= 
##$RELAX= 
##$RELAX= 
##$RELAX= 
$$ Bruker specific parameters
$$ --------------------------
##$DU= <C:\u>
##$EXPNO= 1750
##$NAME= <ADRS>
##$PROCNO= 1
##$TYPE= <nmr>
##$USER= <dgb>
##$AMP= (0..31)
100 100 100 100 100 100 100 100 100 100 100 100 100 100 100 100 100 100 
100 100 100 100 100 100 100 100 100 100 100 100 100 100 
##$AQSEQ= 0
##$AQ_mod= 3
##$AUNM= <au_zg>
##$AUTOPOS= <1 >
##$BF1= 250.13
##$BF2= 250.13
##$BF3= 250.13
##$BF4= 250.13
##$BF5= 500.13
##$BF6= 500.13
##$BF7= 500.13
##$BF8= 500.13
##$BYTORDA= 1
##$CFDGTYP= 0
##$CFRGTYP= 5
##$CHEMSTR= <none>
##$CNST= (0..31)
1 1 145 1 1 1 1 1 1 1 1 1 1 1 1 1 1 1 1 1 1 1 1 1 1 1 1 1 1 1 1 1 
##$CPDPRG= <>
##$CPDPRG1= <>
##$CPDPRG2= <>
##$CPDPRG3= <>
##$CPDPRG4= <mlev>
##$CPDPRG5= <mlev>
##$CPDPRG6= <mlev>
##$CPDPRG7= <mlev>
##$CPDPRG8= <mlev>
##$CPDPRGB= <>
##$CPDPRGT= <>
##$D= (0..31)
0 1 0 0 0 0 0 0 0 0.06 0 0 0 0 0 0 0.0002 0 0 0 0 0 0 0 0 0 0 0 0 0 0 
0 
##$DATE= 1182411921
##$DBL= (0..7)
120 120 120 120 120 120 120 120 
##$DBP= (0..7)
150 150 150 150 150 150 150 150 
##$DBP07= 0
##$DBPNAM0= <>
##$DBPNAM1= <>
$$ [...]
##$SUBNAM7= <"">
##$SUBNAM8= <"">
##$SUBNAM9= <"">
##$SW= 20.6930455092707
##$SWIBOX= (0..15)
0 0 3 0 0 0 0 0 0 0 0 0 0 0 0 0 
##$SW_h= 5175.983436853
##$TD= 65536
##$TD0= 1
##$TE= 296.16
##$TE2= 300
##$TE3= 300
##$TEG= 300
##$TL= (0..7)
0 120 120 120 120 120 120 120 
##$TP= (0..7)
150 150 150 150 150 150 150 150 
##$TP07= 0
##$TPNAME0= <>
##$TPNAME1= <>
##$TPNAME2= <>
##$TPNAME3= <>
##$TPNAME4= <>
##$TPNAME5= <>
##$TPNAME6= <>
##$TPNAME7= <>
##$TPOAL= (0..7)
0.5 0.5 0.5 0.5 0.5 0.5 0.5 0.5 
##$TPOFFS= (0..7)
0 0 0 0 0 0 0 0 
##$TUNHIN= 0
##$TUNHOUT= 0
##$TUNXOUT= 0
##$USERA1= <user>
##$USERA2= <user>
##$USERA3= <user>
##$USERA4= <user>
##$USERA5= <user>
##$V9= 5
##$VALIST= <valist>
##$VCLIST= <CCCCCCCCCCCCCCC>
##$VD= 0
##$VDLIST= <DDDDDDDDDDDDDDD>
##$VPLIST= <PPPPPPPPPPPPPPP>
##$VTLIST= <TTTTTTTTTTTTTTT>
##$WBST= 1024
##$WBSW= 4
##$XGAIN= (0..3)
0 0 0 0 
##$XL= 0
##$YL= 0
##$YMAX_a= 389732
##$YMIN_a= -444929
##$ZGOPTNS= <>
##$ZL1= 120
##$ZL2= 120
##$ZL3= 120
##$ZL4= 120
##$ABSF1= 16.522
##$ABSF2= -4.171173
##$ABSG= 5
##$ABSL= 3
##$ALPHA= 0
##$AQORDER= 0
##$ASSFAC= 0
##$ASSFACI= 0
##$ASSFACX= 0
##$ASSWID= 0
##$AUNMP= <proc_1d>
##$AZFE= 0.1
##$AZFW= 0.1
##$BCFW= 0
##$BC_mod= 0
##$BYTORDP= 0
##$COROFFS= 0
##$CY= 12.5
##$DATMOD= 1
##$DC= 0
##$DFILT= <>
##$DTYPP= 0
##$F1P= 14.0000005364418
##$F2P= -0.99999901652339
##$FCOR= 0.5
##$FTSIZE= 32768
##$FT_mod= 6
##$GAMMA= 0
##$GB= 0
##$INTBC= 1
##$INTSCL= 1
##$ISEN= 128
##$LB= 0.3
##$LEV0= 0
##$LPBIN= 0
##$MAXI= 10000
##$MC2= 0
##$MEAN= 0
##$ME_mod= 0
##$MI= 0
##$NCOEF= 0
##$NC_proc= -4
##$NLEV= 6
##$NOISF1= 0
##$NOISF2= 0
##$NSP= 0
##$NTH_PI= 0
##$NZP= 0
##$OFFSET= 16.522
##$PC= 1
##$PHC0= 155.0681
##$PHC1= 7.009725
##$PH_mod= 1
##$PKNL= yes
##$PPARMOD= 0
##$PSCAL= 4
##$PSIGN= 0
##$REVERSE= no
##$SF= 250.13
##$SI= 32768
##$SIGF1= 0
##$SIGF2= 0
##$SINO= 400
##$SIOLD= 32768
##$SREGLST= <1H.CDCl3>
##$SSB= 0
##$STSI= 32768
##$STSR= 0
##$SW_p= 5175.98343685301
##$SYMM= 0
##$S_DEV= 0
##$TDeff= 65536
##$TDoff= 0
##$TI= <Analysis number 999999
Compound Code 99
Book Reference 9
Project Code 9>
##$TILT= no
##$TM1= 0
##$TM2= 0
##$TOPLEV= 0
##$USERP1= <user>
##$USERP2= <user>
##$USERP3= <user>
##$USERP4= <user>
##$USERP5= <user>
##$WDW= 1
##$XDIM= 32768
##$YMAX_p= 393236265
##$YMIN_p= -64985
$$ End of Bruker specific parameters
$$ ---------------------------------
##NTUPLES= NMR SPECTRUM
##VAR_NAME=  FREQUENCY,     SPECTRUM/REAL,   SPECTRUM/IMAG
##SYMBOL=    X,             R,               I
##VAR_TYPE=  INDEPENDENT,   DEPENDENT,       DEPENDENT
##VAR_FORM=  AFFN,          ASDF,            ASDF
##VAR_DIM=   32768,         32768,           32768
##UNITS=     HZ,            ARBITRARY UNITS, ARBITRARY UNITS
##FACTOR=    0.157963299565203, 1,           1
##FIRST=     4132.6476996994, 0,             0
##LAST=      -1043.33573715361, 0,           0
##MIN=       -1043.33573715361, -64985,      0
##MAX=       4132.6476996994, 393236265,     0
$$ Real data points
##PAGE= N=1
##DATA TABLE= (X++(R..R)), XYDATA
$$ [...]
18831F48298k8825m0732m2665m1516j7343j5951j9581n7241p6756n1169l3864
18820B22655k3514j3799m930j2456K673Q647Q681J3395K5859J2628J8539L1915
18808B90293L5218M6050L7552L9739L6293J1010Q820K7240J6010J4039J6155L5333
18796F13752O2745Q8191P5999M4339J2219R470R613k6492p8863q9511n7630l9529
18784F24303l7069m3437m1784l8548m9968l5540k3634k4994m3779l8407l0811
18773B16332k0673n499o37j2819J7473M3512L3116j2846l6966l1137j6790n951
18761A67115j0594k3250r162L871r914O253j89o64M95P185q325q069o935o620
18747A01197r920n934j5412o934J4524o130J009k645j787J8226P115r225n863
$$ plain form
18831 648298 619473 578741 536076 494560 477217 461266 441685 384444 307688 256519 222655
18820 222655 199141 185342 180412 167956 170629 179276 187957 201352 227211 239839 258378 290293
18808 290293 325511 371561 409113 448852 485145 496155 504975 532215 548225 562264 578419 613752
18796 613752 676497 764688 840687 885026 897245 906715 916328 889836 810973 721462 663832 624303
18784 624303 587234 543797 502013 463465 413497 377957 354323 329329 285550 247143 216332
18773 216332 195659 190160 189523 176704 194177 237689 270805 257959 220993 189856 173066 167115
18761 167115 156521 133271 124109 127980 118066 124319 124130 123466 123961 131146 122821 114752 107817 101197
18747 101197 91277 85343 69931 62997 77521 71391 72400 69755 67968 86194 93309 84084 78221
18734G8221m25o132m004J5941l407n731o310R113K5385J1408K753k4077N47N367
18720I8649l084J9637J5862l13P163Q126O491J8032L0182R952k270l780K676l63
18706B06960P46M859R36J1038O295j74j2650l1728l1352j8948K21j882j4452k0784
18692I9085K262M105J1967M623Oj056m869o807k034l05R734O691k585J8654J3169
18677A52640n631k4679j2152j3089j3531M303O893O771L1187K2239J501j8156
18665A38296j3541m89q985m540N205K1526N903P860J1450J5751J1041K967j4535
18652A77909o167o900j3959j7544j1356j7261j432j48m346J1944P511J1323P864
18639A37438j2430J2064J9039L13K973j4699j9452o714p995r125R617J0232J8077
$$ plain form
18734 78221 77796 71664 67660 83601 80194 74463 68153 77266 102651 114059 116812 92735 93282 98649
18720 98649 95565 115202 131064 130751 137914 146040 152531 170563 200745 210697 208427 204647 207323 206960
18706 206960 207706 212565 213501 224539 230834 230660 218010 186282 154930 135982 136203 134321 119869 99085
18692 99085 101347 105452 117419 122042 122048 120992 116123 109316 107282 106977 116711 123402 120817 139471 152640
18677 152640 147009 122330 110178 97089 83558 87861 94754 101525 132712 154951 156452 138296
18665 138296 124755 124266 115281 110741 115946 137472 143375 151235 162685 178436 189477 192444 177909
18652 177909 171742 164842 150883 133339 121983 104722 103290 103142 98796 110740 118251 129574 137438
18639 137438 125008 137072 156111 156424 159397 144698 125246 118532 110537 101412 111029 121261 139338
18626A39338J7024O138j550k1196k6361q174j2052P831K089o600P237J867q95
18613A04696m194N87l872l797O858J7061J3796J7283R051l612L231R669K2048
18600A88805J3804J0783r421k742j1017j2717j070p164m245l207j2768j9175j6780
18587A13086o34j0842O151J4957j1766p430K805k35L863j517Q3j0693M611Q528
18573A10967P937j658M315K1185O137r853p246O434J6745O411p109r735J6673
18560A61203K2728J8003N089k824J4334Q348O596O533L562m136N437K9065M1386
18547C15324K6596K7740K0835K274k854j1142l3208j9310k1841l6851l4491k6960
18535B06112k8236j2016K415l238P669P82n814Q496M983j0761k9003j4778k523
$$ plain form
18626 139338 156362 162500 160950 139754 113393 105219 93167 100998 103087 96487 103724 105591 104696
18613 104696 100502 101089 97217 93420 100278 117339 131135 148418 157469 153857 157088 166757 188805
18600 188805 202609 213392 203971 201229 190212 177495 176425 169261 165016 161809 149041 129866 113086
18587 113086 112452 101610 107761 122718 110952 103522 106327 106092 109955 108438 108521 97828 102439 110967
18573 110967 118904 117246 121561 142746 148883 139030 131784 138218 154963 161374 154265 144530 161203
18560 161203 183931 201934 207023 204199 218533 226881 233477 240010 243572 239436 244873 273938 315324
18547 315324 341920 369660 390495 392769 389915 378773 345565 326255 304414 267563 233072 206112
18535 206112 177876 165860 168275 165037 172706 173488 167674 176170 181153 170392 141389 126611 124088
18522A24088J961J7426J0142J0801J226Q339j3660j3689j4508n086J1129O408
18510A44577J6307K160j0006l096K4472J7042J2196K2341M412j828j5290n650
18498B07637J3233L6617K8844K3276K1023N7124O4066M1166Q209j8823k4282n2052
18486D06038m0812j8500k3010k1667J3213K0049R207P765M866k664r345k7920
18474C17220j6393j2401m188k491o901j8898m218O122J837M208J729J2383M2239
18461C20248M8093J5518J2313L7443K5384K4692K7976L2422L5485L6346L4864
18450F50784N1656O0240P3768P7181Q1942J00248J00515R0391N8489L9126O701
18439A391041M106K1850N0760J10470J54865J44749J27872J14259J91412K35637
$$ plain form
18522 124088 126049 143475 153617 164418 165644 173983 160323 146634 132126 127040 138169 144577
18510 144577 160884 163044 153038 149942 174414 191456 203652 225993 230405 228577 213287 207637
18498 207637 220870 257487 286331 309607 330630 387754 451820 492986 501195 482372 458090 406038
18486 406038 365226 346726 323716 302049 315262 335311 344518 352283 357149 354485 345140 317220
18474 317220 300827 288426 284238 281747 274846 255948 251730 257852 259689 263897 265626 278009 320248
18461 320248 368341 383859 396172 433615 458999 483691 511667 544089 579574 615920 650784
18450 650784 702440 762680 836448 913629 995571 1095819 1196334 1286725 1345214 1384340 1391041
18439 1391041 1395147 1416997 1467757 1578227 1733092 1877841 2005713 2119972 2311384 2547021
18429B547021R2870j21651j76423j55309j84098k18974j57415p3965n1351p5275
18419A425430q9248m1582k6343k3934j8401q447L3599P2049J16552R5347M2816
18408A577838J698J0863L5956L4268M7046R7861J64345K06340J66940O8722p7688
18397B334189j38849p0895K1235J10444K20102L11658K55300M292r7264l6268
18387B913944r433j8558l1681N542P1974J41876K24092K92487L48170L88749M07960
18376D735122M14236M05019L57869L50562L74198L98378N07489P20199R36845
18367I199917J209587J769636K461519K671369K209935K147459L062842L682846
18359B8415110K469792J167625K393754N503430R087534J3263694J7140100J6274324
$$ plain form
18429 2547021 2639891 2518240 2341817 2186508 2002410 1783436 1626021 1552056 1500705 1425430
18419 1425430 1336182 1294600 1268257 1244323 1225922 1217475 1251074 1323123 1439675 1535022 1577838
18408 1577838 1579536 1590399 1626355 1660623 1707669 1805530 1969875 2176215 2343155 2411877 2334189
18397 2334189 2195340 2124445 2145680 2256124 2476226 2787884 3043184 3047476 2950212 2913944
18387 2913944 2904511 2885953 2854272 2859814 2931788 3073664 3297756 3590243 3938413 4327162 4735122
18376 4735122 5149358 5554377 5912246 6262808 6637006 7035384 7542873 8263072 9199917
18367 9199917 10409504 12179140 14640659 17312028 19521963 21669422 24732264 28415110
18359 28415110 30884902 32052527 34446281 39949711 49037245 62300939 79441039 95715363
18351I5715363J3034805J7072275K4027194J7367860k664128j0138439l327760
18344A51087170m902173j6337412k0225011j4239478r410159r583135r007824
18337F7381978n006359j043614j494395n526020p109124n460464m355867n158343
18329C2227792n818072m987943l560493k300601j455635r69620o29941l13867
18321A2191620q8176p9992p0304J57821M64580P71165J234952K030440L206275
18312A9818381M600272N551631N057835M092506M925093O770175N945368K102163
18304E8863424J076132M754218Q785007R226901Q814554J3481534J9131485J4797894
18296A38931149L333787K314479R426059K576742j6926069k3248398j5934941
$$ plain form
18351 95715363 108750168 125822443 149849637 167217497 164553369 154414930 151087170
18344 151087170 146184997 129847585 109622574 95383096 85972937 76389802 67381978
18337 67381978 62375619 61332005 59837610 54311590 47202466 41742002 37386135 32227792
18329 32227792 26409720 21421777 17861284 15560683 14105048 13135428 12505487 12191620
18321 12191620 12103444 12023452 11953148 12110969 12575549 13346714 14581666 16612106 19818381
18312 19818381 24418653 29970284 35028119 39120625 44045718 50815893 56761261 58863424
18304 58863424 59939556 64693774 73478781 82705682 91520236 105001770 124133255 138931149
18296 138931149 142264936 144579415 154005474 156582216 139656147 116407749 100472808
18289A00472808j1700996j4897005j5948493j2114625q053840m915751k268498
18282C0573600j001422k029555l351433k989598k110968k115128k601595k484387
18274A1889514j885392j364802j037916p71401n44526m57249m80004m47148l57951
18265D543125l24891l47450l03227k48975j95633j60905j49716j39669j29943
18256B542716j16623j20830r8996r2102j08076r0401n7301l9785l0247k9656l9940
18245A718759m6786n2165m8907n3047m2760n0352m6086l7155l6909k2083m7028
18234A235481p1981l2171l280L437q232j3579j4095J491j1732j4985K445K523
18222A075322m535j9559k9011j3145l0283k8337k4068m1015l2631p116n087p415
$$ plain form
18289 100472808 88771812 73874807 57926314 45811689 37757849 32842098 30573600
18282 30573600 29572178 27542623 24191190 21201592 19090624 16975496 14373901 11889514
18274 11889514 10004122 8639320 7601404 6830003 6285477 5828228 5348224 4901076 4543125
18265 4543125 4218234 3870784 3567557 3318582 3122949 2962044 2812328 2672659 2542716
18256 2542716 2426093 2305263 2206267 2114165 2006089 1915688 1858387 1818602 1788355 1758699 1718759
18245 1718759 1671973 1619808 1570901 1517854 1475094 1424742 1378656 1341501 1304592 1282509 1235481
18234 1235481 1163500 1131329 1128049 1131486 1123254 1109675 1095580 1097071 1085339 1070354 1072799 1075322
18222 1075322 1070787 1051228 1022217 1009072 978789 950452 926384 885369 852738 845622 840535 833120
18210H33120M690k4941l4281l9397j3304P904N543l308j2638n421j2155Q088K6953
18197G40853K5798o730j3428Q475L942j7955j8126l1825k1092k057j9933q921
18185F39001k905J1525j3755j2517J3170L994j738j087J3317Q18J4421J3362J4085
18172F91691K9924K4401J844n975J2156J33k2549j7400p394j4841k2682k5715
18160F43593j1347j64R199k302m274m250R155J5065p936j8915l841m465M174O516
18146F30208K3055M0163L5842Q62J2944N1361O9451P7391R7939J38479J33640
18135A311335J24451K04200K93414J97587L1087N5754J71172J25011j04085j69021
18125B240905n4638p678r2532j34873j06814j9206J3462J3681R8972K11744L02695
$$ plain form
18210 833120 837810 812869 778588 739191 725887 733791 739334 736026 723388 717967 705812 713900 740853
18197 740853 766651 759921 746493 754968 758910 740955 722829 691004 669912 667855 647922 639001
18185 639001 636096 647621 633866 621349 634519 638513 636775 635688 649005 649823 664244 677606 691691
18172 691691 721615 746016 747860 741885 754041 754174 731625 714225 706831 691990 669308 643593
18160 643593 632246 632082 641281 638979 634705 630455 639610 654675 646739 627824 623983 619518 623692 630208
18146 630208 653263 693426 729268 730130 743074 794435 863886 941277 1039216 1177695 1311335
18135 1311335 1435786 1639986 1933400 2130987 2162074 2217828 2389000 2514011 2409926 2240905
18125 2240905 2186267 2178589 2086057 1951184 1844370 1825164 1838626 1852307 1951279 2163023 2465718
18114B465718L56256N71906J016405J860231L366794N842077P947836K845289
18106B6272512o675060p836737m637378k454815j337137p86911n15276l42440
18098A686758k21659j45688o4881l9506j7390O903K5444L5737k0146m5647O124
18087A206049O9630P5588L6148M5489J27165J60678R4865M8052J25859J74880
18077B164403L1157j65500j38865j5240n3173k32311k58454j56526j06810j01126
18067I67555q9041n8107l2221M941N3997O1612L7792l6607p8658p5129p9045p7471
18055E99618p6874n6868l0541J242K3993K9528K4903R767J2182l417k7681n6895
18043D48957m9157m2019l2208j9224p260k680L534j2230L71j9588j2316j379J0305
$$ plain form
18114 2465718 2821974 3393880 4410285 6270516 9637310 15479387 23427223 26272512
18106 26272512 19597452 11760715 7123337 4668522 3331385 2544474 2029198 1686758
18098 1686758 1465099 1319411 1254530 1215024 1197634 1204537 1229981 1265718 1245572 1199925 1206049
18087 1206049 1275679 1351267 1387415 1432904 1560069 1720747 1815612 1863664 1989523 2164403
18077 2164403 2195560 2030060 1891195 1875955 1822782 1590471 1332017 1175491 1068681 967555
18067 967555 878514 820407 788186 793127 847124 908736 946528 909921 831263 756134 677089 599618
18055 599618 522744 465876 435335 436577 460570 490098 515001 524768 536950 533533 505852 448957
18043 448957 399800 357781 325573 306349 299089 296409 299943 287713 288084 268496 256180 254801 265106
18030B65106O12Q030k8164l5829j6792j6443m42O445N058J0821Q951J285P366
18017B16004J1079J0891M8799N2871J8622l6024k6325q278o417k962n337m158
18005B68765m664J166Q926J5021J7422K5965J7115J6151k8344m1081K850L8368
17993C37660R069j7045j0297l1060k4003l817k667P496J2460K7644L0027J2860
17981C48327r300k9562l9545j7604J2420J2035O175k471M308N312J1145n602J7777
17968C13415L8020M3393J2407L866L9282O0135J9529k9229m2866m5072l4504l921
17956C74455n522j0970n87J3372K6601Q624p223N762J4865Q493R224J4724J4218
17943D66036J8254j005p235J3060M2092M0646M8127J5260Q504L7318P8447P1641
$$ plain form
18030 265106 265718 273748 245584 209755 192963 176520 176078 182523 187581 198402 207353 208638 216004
18017 216004 227083 237974 286773 339644 358266 322242 295917 287639 281222 278260 272923 268765
18005 268765 264101 265267 274193 289214 306636 332601 349716 365867 337523 296442 299292 337660
17993 337660 346729 329684 319387 288327 264324 260507 257840 265336 277796 305440 335467 348327
17981 348327 339027 309465 269920 252316 264736 276771 282946 280475 284783 290095 301240 295638 313415
17968 313415 351435 394828 407235 411101 450383 510518 530047 500818 457952 412880 378376 374455
17956 374455 368933 357963 357376 370748 397349 405973 398750 404512 419377 427870 437094 451818 466036
17943 466036 484290 483285 476050 489110 531202 571848 619975 635235 643739 681057 759504 831145
17931H31145N7018L9912K4420M6683R6577J65104K03094J42993P6023Q5912P3452
17920A842333P282L6145J03231J47501J88244K27374K85290L59377N33065P84145
17910D513987J096420J443006J755592K177505L208453N251030Q753148J4395586
17902D2594727K2173504K6178277J1443527j6140081k7090842k0704186j2438941
17895B6015985p165302m172170k593478j653234r80258o64375o58727o94481n53537
17886F880423l11609q8892J45195L83697O79043J038857J552349K197699K905267
17877A5382029L582896M697747P292743J2140875K0064912L2338705M6730828
17870A42230735M5150040M544875m1984682m9716386l4588939k0927321j2653761
$$ plain form
17931 831145 888163 928075 952495 999178 1095755 1260859 1463953 1606946 1682969 1768881 1842333
17920 1842333 1849615 1885760 1988991 2136492 2324736 2552110 2837400 3196777 3729842 4513987
17910 4513987 5610407 7053413 8809005 10986510 14194963 19445993 28199141 42594727
17902 42594727 64768231 90946508 102390035 86249954 59159112 38454926 26015985
17895 26015985 18850683 14678513 12085035 10431801 9451543 8787168 8128441 7433960 6880423
17886 6880423 6568814 6479922 6625117 7008814 7687857 8726714 10279063 12476762 15382029
17877 15382029 18964925 23662672 30955415 43096290 63161202 95499907 142230735
17870 142230735 187380775 191925650 149940968 100224582 65635643 44708322 32054561
17863C2054561p747662m891126l083069j861003j289677j299196j405421j227963
17855I249444r48337o09635l13887p9729J22045K92181N64316R55696J383660
17846A0615754J739357K435504M008319O791059J1351829J8208725K4768852J8733456
17838I8652855o290435k4660149k2631466j4598945r202246n901988l710017k342565
17830I315044j466432r13872o93321p14800p44317o63922n26122m07079l07470
17821B877709k18926j81346k18780k02564j52529j15764q3968p9877o7304n7790
17811A498861l0164K0948P2763J32702K10116L02937K91467K387k88701l33333
17801A879983k08957j21393q3995n7955p9206r9529r8831n5926l0978k4691k2637
$$ plain form
17863 32054561 24306899 19415773 16332704 14471701 13182024 11882828 10477407 9249444
17855 9249444 8301107 7691472 7377585 7297856 7419901 7712082 8276398 9232094 10615754
17846 10615754 12355111 14790615 18798934 25589993 36941822 55150547 79919399 98652855
17838 98652855 92362420 67702271 45070805 30471860 21269614 15367626 11657609 9315044
17830 9315044 7848612 6934740 6241419 5526619 4782302 4118380 3592258 3185179 2877709
17821 2877709 2658783 2477437 2258657 2056093 1903564 1787800 1703832 1623955 1556651 1498861
17811 1498861 1468697 1489645 1562408 1695110 1905226 2208163 2499630 2502017 2213316 1879983
17801 1879983 1671026 1549633 1465638 1407683 1328477 1228948 1130117 1074191 1043213 1018522 995885
17790I95885J8667K1408k81K4607M5506J6158m4026p2105p8304o8964o5009p8251
17778G15291n9286k4957k374J394k5853m3211m9572l3924m123j903j7008j5351
17766D39123k7126j1751j959j9796k850J8026j0418j6364j0334j5652J165R961
17754C52025N731L396j0297m633j1898r354J7589K7291K8734N5360K0717k4015
17742D50646o9063o7760j6751j8183k7655k6995m919K815r72j3309k681J6841
17730B22014J2140L431p439m805q690r583M818J8382J9450J779J688m213m382
17717B44590M716J4158K7459K1953M697l6807m9434j8571m331j302R08m400j7275
17704A86361j5670R18J0864m387L783Q328R64r210k946l029k71m595l084m055
$$ plain form
17790 995885 1014552 1035960 1035679 1060286 1105792 1121950 1077924 1005819 927515 858551 793542 715291
17778 715291 656005 631048 628674 630068 604215 561004 511432 477508 473385 471482 454474 439123
17766 439123 411997 400246 398287 378491 375641 393667 383249 366885 356551 340899 342064 352025
17754 352025 357756 361152 350855 346222 334324 324970 342559 369850 398584 453944 474661 450646
17742 450646 381583 313823 297072 278889 251234 224239 219320 222135 221163 207854 205173 222014
17730 222014 234154 237585 230146 225341 216651 207068 211886 230268 249718 251497 253185 248972 244590
17717 244590 249306 263464 290923 312876 317573 280766 231332 212761 208430 207128 208036 203636 186361
17704 186361 170691 171609 182473 178086 181869 190197 191161 181951 179005 175976 175705 171110 168026 163971
17690A63971J966R971O904L083N12O445L0323M2049M7256L1728K8467O652M710
17677C84037j3556l6263n1515m2799m1849l4707k3645L789J7123O455r920J3504
17665A70654J7040K8283L2533N5159L5054K3235r3j9816l4662m2009l0639m2070
17653A92669k4288j6314k0564j3661l085Q474M555j111p56m392p291q035N531
17640A11732P667J0296J2332J0359j1441o592j595j0118p989j89o452p948j86
17627I9876o889r984N305l57p162j4049r178N313Q127M684l432k0908l219R006
17613E7133O131J5380J839j0284M508N544N658m262J644r00K935Q25k63r182j8996
17598E7710m175J6737R75m59J1212J6905R11k3189Q07Q487q89j7792p506j643
$$ plain form
17690 163971 165937 175908 182812 185895 186407 192852 223175 265224 312480 344208 372675 379327 384037
17677 384037 370481 334218 282703 239904 198055 163348 139703 143492 160615 167070 157150 170654
17665 170654 187694 215977 248510 303669 338723 361958 361865 342049 307387 265378 234739 192669
17653 192669 168381 152067 131503 117842 114757 123231 127786 126675 125919 121527 114236 106201 111732
17640 111732 119399 129695 142027 152386 140945 134353 132758 122640 114651 114462 108010 100062 99876
17627 99876 92987 83003 88308 87951 80789 66740 57562 62875 71002 75686 72254 51346 48127 57133
17613 57133 63264 78644 80483 70199 74707 80251 85909 81647 83291 82391 85326 86151 85888 76706 57710
17598 57710 53535 70272 71247 70788 82000 98905 99816 76627 77434 85921 85032 67240 59734 58091
17584E8091O458m426n174l530J070P575j5033J8428N053j4985l596Q021p275J6
17570E0693J4777R525L87p845n198o65K929J1081O486l299l339r981m219R64L012
17555F5308r458p617o010n929O766L959O629q613J767M539q035K984K149M834
17541E3273N099l963Q62L853P925n244J43l32k952m509j6823k881M398L9l960
17526C4928J4596J1353j067o822k669J0162J5841k918k3577j1688j571K295M27
17513C9290q635n057q053p95J0317J1898J3127j83o506n64J359m943j1646j586
17499B8023o9p40L337R232j800o237L87R68l985J0583J811q777q648j2052q982
17484C051O356J0330R288K805j3567j985J713O060J416n620k688P654k971q422
$$ plain form
17584 58091 64549 60123 54949 51419 52489 60064 45031 63459 68512 53527 49931 57952 50677 50693
17570 50693 65470 74995 75382 67537 62339 61674 64603 75684 82170 78871 75532 65551 61332 62296 65308
17555 65308 55850 48233 42223 36294 43060 47019 53648 45035 46802 51341 43306 46290 48439 53273
17541 53273 58372 54409 55271 59124 67049 61805 61948 61616 58664 54155 37332 34451 38849 38888 34928
17526 34928 49524 60877 59810 52988 50319 60481 76322 73404 49827 38139 36568 38863 39290
17513 39290 30655 25598 17545 16750 27067 38965 52092 51909 45403 44839 46198 41255 29609 28023
17499 28023 27954 27214 30551 39783 37983 31746 32133 33101 29116 39699 41510 32733 24085 12033 3051
17484 3051 9407 19737 29025 31830 18263 16278 17991 24051 25467 19847 17159 24813 21842 13420
17470A3420j616N411O427j13K439K358j529M680J967j0613n524P240N082l993
17456B5636J8139J186j3909k061O716J629M221l9n163l859K0031P203M630K652
17442F7012J7082M5426L4108o278m1066m1888j9962j2419O384m561q81q396k512
17429C2049l745q557k108O140J5783R548k496J834R586m130j1346M983O112r39
17415E2714j2314o720j5620M276n02P962N118m74M825J540j74j137j189k469k881
17400C2955k130n845j4751P248J7324K0o392j0225j323J1216O046k887o5P766
17386C8957n328Q084P40O423J5330j2221l992P076l302M741O522j0974n483J5633
17372F2206J3598J5781K3855J2890J5570M1273M8913R0195R8620N1981l1961r0923
$$ plain form
17470 13420 11804 17215 23642 23529 25968 28326 26797 31477 33444 22831 17307 24547 29629 25636
17456 25636 43775 44961 31052 28991 35707 37336 41557 41518 36355 32496 52527 59730 64360 67012
17442 67012 84094 129520 163628 157350 116284 74396 54434 42015 48399 43838 42957 34561 32049
17429 32049 28304 19747 17639 23779 39562 49110 46614 48448 58034 53904 42558 47541 53653 52714
17415 52714 40400 33680 18060 22336 21834 29796 34914 34440 39265 40805 40631 39494 38305 35836 32955
17400 32955 30825 24980 10229 17477 34801 34821 28429 18204 16881 28097 34143 31256 31191 38957
17386 38957 33629 41713 42453 48876 64206 51985 47993 55069 51767 56508 63030 52056 46573 62206
17372 62206 75804 91585 115440 128330 143900 185173 234086 324281 422901 474882 442921 351998
17360C51998r0874p2999l7602k5024k6752r871R447O189j7667q591p682K51L738
17347G4561J511l381l701L115J1246J5590J5691J5062K7630M5665N5705J08392
17335C67086J57559J85629J71298M7275j29027j99586j68765j14882q2263n0728
17325A83596l5983j7197j0588j2461q157j6339j9308q122M078J2006j2758L68
17313E9135N312R04J3457J5738N367O78L5277M5137O0306P4429Q5603P4390m308
17300D71425o8792r3826r5081o4888m4036k1913L336p194m160k000M418r816k0036
17287D7437q959L802L224j0829L25K0269R242L289j8557o219m953m032o02K12
17273C3649j2975L604R707m439r768J659j0716q48J1768j3722Q698j308l562K807
$$ plain form
17360 351998 261124 188125 150523 125499 98747 88876 98323 104512 86845 78254 70572 70823 74561
17347 74561 76072 72691 68990 72105 83351 98941 114632 129694 157324 202989 258694 367086
17335 367086 524645 710274 881572 928847 799820 600234 431469 316587 234324 183596
17325 183596 147613 130416 119828 107367 99210 82871 63563 55441 59519 71525 58767 59135
17313 59135 64447 65351 78808 94546 99913 100591 135868 181005 241311 315740 401343 475733 471425
17300 471425 402633 308807 213726 148838 104802 82889 86225 79031 74871 72871 77289 67473 47437
17287 47437 38478 42280 45504 34675 35000 55269 64511 67800 49243 43024 38071 34039 33437 33649
17273 33649 20674 24278 33985 29546 19778 21437 10721 9873 21641 7919 16617 15309 11747 14554
17259A4554J512o585j2648n67J0090J8848j197O172L512L381k259k278K769j2705
17245B2599l453k693O284J771l689j4667P024J3030J209N322k829m734p281L276
17231B1169r766r327p417K147J3195M251O430m789l678J3712q39l835J1109l036
17217B9326n639j2949N416O85J1098O174j776n993j66M928J924m298J7L435j3284
17202A8898m669J313J606j530j542L086R34O004j311j9042j893J1188J0834p92
17188B3084j762O780K838K550j2638j5364j047J0855K810L434j608l581j8261
17175a910N509J1641J77J2057J3108k341j1491j9477N97p974n280Q981R550J7715
17161C0862J8098k303j188q848k3862j0664j3978j0908J1835K5775R457p018Q006
$$ plain form
17259 14554 16066 9481 -3167 -3734 6356 25204 24007 30179 33691 37072 34813 32535 35304 22599
17245 22599 19146 16453 22737 24508 20819 6152 13176 26206 27415 32737 29908 25174 17893 21169
17231 21169 11403 2076 -5341 -3194 10001 14252 20682 15893 12215 25927 25088 21253 32362 29326
17217 29326 23687 10738 16154 16839 27937 34111 32335 26342 26176 31104 33028 28730 28747 32182 18898
17202 18898 14229 15542 17148 15618 14076 17162 18096 24100 22789 3747 1854 13042 23876 23084
17188 23084 21322 28102 30940 33490 20852 5488 4441 15296 18106 21540 19932 16351 -1910
17175 -1910 3599 15240 15417 27474 40582 38241 26750 7273 7870 -104 -5384 3597 13147 30862
17161 30862 48960 46657 45469 36621 12759 2095 -11883 -22791 -10956 14819 24276 17258 25264
17148B5264j88l974r363j1603j6462O715K126N617K0546M296n488j3325p477p510
17134a0826J1729J3838P494M143n153L59q144q421n59J0675l564J514k742m986
17120E357K218o66M679m364n059P833M754Q450R170N009k831r280j3628Q854R706
17105C0202r410n660j664l261P099k841m305R30p618K779J9793R575k755l115
17091B9749O909r794N97L507r695l420L534l663k835p94P509J2651j851j4954
17077A7450o034j0471P67J0607L401L147k602M0p118j244R784J010P248J0491
17063C6476o549j2506q31K013k303p421K587N08K763J9585J4352j792p429o540
17049C2913J8853n194j7345J2Q329j636k1315k618J2608O582j6556J319N305J51
$$ plain form
17148 25264 25076 21102 11739 136 -16326 -9611 -7485 -1868 18678 22974 17486 4161 -3316 -10826
17134 -10826 903 14741 22235 26378 21225 21584 13440 5019 4460 15135 11571 13085 10343 5357
17120 5357 7575 6909 11588 7224 2165 9998 14752 23202 32372 37381 34550 25270 11642 20496 30202
17105 30202 20792 15132 13468 10207 17306 14465 10160 11090 3472 6251 26044 35619 32864 29749
17091 29749 36658 26864 27461 30968 21273 17853 21387 17724 14889 14095 21604 34255 32404 17450
17077 17450 11416 945 1712 12319 15720 18867 16265 16305 9187 7943 17727 18737 25985 36476
17063 36476 29927 17421 16590 18603 16300 8879 11466 11974 14737 34322 48674 46882 39453 32913
17049 32913 51766 46572 29227 29239 37568 35932 14617 11999 24607 31189 14633 15952 21257 21408
17035B1408j3881j819l667p74Q996J0730m124m512j859J0301K0148m390q033k246
17021B6278l444k629N552J570n133j0827q41O18j3982m186J4695K4541p179j7502
17007G531N83o03O542J5967j518j700K137r553o887N922J5632l52L569m685n075
16992B7510j2341N207J0930o045M086M697L148q673j3434m840Q346p42m663j70
16978A3016p327k224P287K101J2413J3319R321J0139L741j1606k923n179p459
16965C4619p563j2116P631K1932j7175q18N834j2837r020J1843R237N769n626
16952C1710j5466p994n174j673l944L876J2392J299j2765m484R313K51K277K27
16938I845L278M637k592l505K915l09J827M347j26o323J035j637j0363J2085J280
$$ plain form
17035 21408 7527 5708 2041 1267 10263 20993 16869 12357 10498 20799 40947 36557 28524 26278
17021 26278 22834 20205 25757 27327 22194 11367 10526 11144 -2838 -7024 7671 32212 25033 7531
17007 7531 8114 7511 14053 30020 28502 26802 28939 19386 12499 18421 34053 33701 37270 32585 27510
16992 27510 15169 20376 31306 25261 29347 34044 37192 28519 15085 10245 18591 17849 13186 13016
16978 13016 5689 3465 10752 12853 25266 38585 47906 58045 61786 50180 47257 42078 34619
16965 34619 27056 14940 22571 44503 27328 26510 32344 19507 10487 22330 31567 37336 31710
16952 31710 16244 8250 3076 1403 -2541 1335 13727 15026 2261 -2223 7090 7341 9618 9845
16938 9845 13123 17760 15168 11663 14578 14269 16096 20443 20317 13994 15029 13392 3029 15114 16394
16923A6394O353l225N848k44n60o725m054Q8l897L149N727J42j5431N465M180
16908A3210J774k230R682O21n914m808o703J478l669J172j3224l167J539N608
16894d631j82P642J0592k747M925n925R60q409R58m974M96R764P479m360p302
16879D286r033r841J626K914K934N541J387J690j2123M516J7506P878K392M630
16865B6303M899q236m738r270o824R712o453J742k065j4603k417o076K075k772
16851a8723k579K2444Q204J936R618K560n247J156j979o126q572J4054J1717o791
16837B1672j0315o539K882m576l076K292j0900n577J0751L302j1307K065P975
16824a351J1597J9822R225k1866k1526P009r12p905Q49N886J285p448K111m75
$$ plain form
16923 16394 22747 19522 25370 25126 24566 17841 13787 13875 9978 13127 18854 18996 3565 9030 13210
16908 13210 14984 12754 22436 23057 17143 12335 5632 7110 3441 4613 -8611 -11778 -10239 -4631
16894 -4631 -4813 2829 13421 10674 15599 9674 10634 2225 3183 -1791 -1295 8469 15948 11588 4286
16879 4286 -4747 -14588 -12962 -10048 -7114 -1573 -186 1504 -10619 -6103 11403 19281 21673 26303
16865 26303 31202 22966 18228 8958 2134 11846 5393 7135 5070 -9533 -11950 -18026 -15951 -18723
16851 -18723 -21302 1142 9346 11282 20900 23460 18213 19369 17390 11264 2692 16746 28463 21672
16837 21672 11357 4818 7700 3124 48 2340 -8560 -14137 -3386 -84 -11391 -9326 -1351
16824 -1351 10246 30068 39293 17427 -4099 2910 1998 -5907 -5058 828 2113 -5335 -3224 -3699
16810c699P038K0481J1472R837q191n310n004j0429L887k705j988k908K04l098
16796I587L563R135Q682l244M400o728o797J114L080n303j1050O529j1751k565
16782a348J1433Q115L044L243j1153j5897J754J9376P425p462j1312o060K438
16769C596o561Q037K902J1058N333p269k546M933n06p362L3q687M754J026m193
16754D548K592K125j830p811M33N93J6340K254r36j4086o884J163N250J0535P700
16739B1986K921m560j995K105k0431j1502O333J5615L0595j0111k4465j5009N390
16726c128R111J953j0139m758J0563J8458J2308R653r700j6420j6411l004N296
16713C782n205n929J2311J7903P330o539K866O853K0545P353J6691M2141N2789
$$ plain form
16810 -3699 3339 23820 35292 45129 36938 31628 26624 16195 20082 17377 15389 12481 12685 9587
16796 9587 13150 22285 30967 27723 32123 25395 18598 19712 22792 17489 6439 12968 1217 -1348
16782 -1348 10085 18200 21244 24487 13334 -2563 -809 18567 25992 18530 7218 1158 3596
16769 3596 -2965 5072 7974 19032 24365 17096 14550 19483 18977 11615 11648 2961 7715 8741 4548
16754 4548 7140 9265 7435 -376 57 650 16990 19244 18308 4222 -2662 -1499 3751 14286 21986
16739 21986 24907 20347 18352 20457 26 -11476 -5143 10472 41067 30956 6491 -8518 -3128
16726 -3128 5983 7936 -2203 -6961 3602 22060 34368 44021 34321 17901 1490 -1514 3782
16713 3782 -1423 -7352 4959 22862 30192 23653 26519 33372 53917 61270 77961 120102 172891
16700A72891K5060j3470l1772n234J8454K3847j5055m6345k6681k5447j5156j8359
16688D2733q298M264l331J4619K1896M0260L7291L2863Q129p562o755n001L445
16675A74553j528p537l7222m0640k7141j3774m67o633n80J172p70o752k0731j5362
16661c412O38K5048P059p430O73P899J948p428j4305P74J1125M024o924r371M348
16646A4666r851l97K226j4350j131R520O005l95j752p61J009l002m767n601L642
16631d939O633M079r916M573K675N782j027l760p76j335j816j4056n896j0738
16617c0517j156k743o474R943J2337J1659N725o066j3239J040P787J061j121K939
16603h825R379M15n963k437J6218J0625j590m298k373l142m197j1349Q12N628
$$ plain form
16700 172891 197951 184481 152709 147475 165929 189776 174721 128376 101695 76248 61092 42733
16688 42733 34435 38699 35368 49987 71883 112143 149434 182297 190426 182864 176109 171108 174553
16675 174553 173025 165488 128266 87626 60485 46711 46244 39611 39031 40203 39433 32681 11950 -3412
16661 -3412 -2774 22274 29333 21903 22576 30475 32423 24995 10690 11464 22589 26613 19689 10318 14666
16646 14666 4815 4418 6644 -7706 -8837 683 6688 6293 4541 3780 4789 1787 -2980 -8581 -4939
16631 -4939 1694 5773 -4143 430 3105 8887 7860 4100 3324 1989 173 -13883 -19779 -30517
16617 -30517 -31673 -34416 -40890 -30947 -18610 -6951 -1226 -7292 -20531 -19491 -11704 -10643 -11764 -8825
16603 -8825 554 969 -4994 -7431 8787 19412 17822 13524 11151 8009 3812 -7537 -6725 -1097
16589a097J365n092m100j487n304l142J4119P411j0497l697m972K049J3936J1042
16575A0534m114j4908M896J6521J0562j420j1347J409q489j1056N694J3742q68
16562A1156q583K231P764o255m769j3777J1111Q740j1687M558l499j0076n160
16549a8246J1733J2035j0169o346P339J1710J0387L285j478j9139j8903K823J3746
16536a223j1390j2177J1260J1841j595J420l704O956K0384J765P562p109Q438
16523C2428O652j364P27k421P782j117L792l52j1268p754j180O388r509O031M853
16508C3688k210o234J80j799K433J159r290j926l173k448l195P160o262o626l061
16493a604P956K903l754o131R939N020j592q897J1711L60J333N397M902J748l624
$$ plain form
16589 -1097 268 -4824 -8924 -10411 -15715 -18857 -4738 2673 -7824 -11521 -16493 -14444 -508 10534
16575 10534 6420 -8488 -3592 12929 23491 22071 10724 12133 3644 -7412 -1718 12024 11156
16562 11156 2573 4804 12568 6313 1544 -12233 -1122 7618 -4069 489 -3010 -13086 -18246
16549 -18246 -6513 5522 -4647 -10993 -3654 8056 18443 21728 20250 1111 -17792 -14969 -1223
16536 -1223 -12613 -24790 -13530 -1689 -3284 -1864 -5568 1388 21772 23537 31099 23990 32428
16523 32428 39080 37716 38443 36022 43804 42687 46479 46127 34859 27105 25925 32313 22804 28835 33688
16508 33688 31478 25244 25424 23625 26058 27217 17927 16001 12828 10380 7185 14345 8083 1457 -1604
16493 -1604 6352 9255 5501 -630 9309 14329 12737 3840 15551 15911 17244 22641 27543 29291 25667
16478B5667j0479O570M207k945M676J3294J8166o297l097J0432Q673q435p876
16465E2556Q33j1995N217K665j286k610j3241k445J4973P877j4847j7080p004
16452A3613n227k311L007M716m107k979n246l712n601R359O329K606J4352L114
16438B7913j1034l601K426j5236j6775k771M166m658R303M576p667J42o581J2427
16424g370J4176k534P70L841r667j2082k422l301K133n17L946J3619k538j2146
16410a4092j8197p34N884Q557J4986q856m121m832N640O745Q936l942J006n22
16396c542n368L561n570p639M419R391k762N821l720j891J1062O897j3418o188
16382h947j2212r772k736Q624J1290o170j2776K476O151m024O199M874n988M143
$$ plain form
16478 25667 15188 21758 25965 23020 27696 40990 59156 52859 49762 60194 68867 60432 52556
16465 52556 53389 41394 46611 49276 47990 45380 32139 29694 44667 52544 37697 20617 13613
16452 13613 8386 6075 9082 13798 9691 6712 1466 -2246 -7847 1512 7841 10447 24799 27913
16438 27913 16879 13278 15704 468 -16307 -19078 -14912 -19570 -10267 -5691 -13358 -13216 -19797 -7370
16424 -7370 6806 4272 5042 8883 -784 -12866 -15288 -18589 -16456 -16973 -13027 592 -1946 -14092
16410 -14092 -32289 -33023 -27139 -18582 -3596 -12452 -16573 -21405 -15765 -9020 -84 -4026 -3020 -3542
16396 -3542 -8910 -5349 -10919 -18558 -14139 -4748 -7510 -1689 -5409 -7300 3762 10659 -2759 -8947
16382 -8947 -21159 -30931 -33667 -25043 -13753 -19923 -32699 -30223 -24072 -28096 -21897 -17023 -23011 -18868
16368a8868R804q19l209M917r610O435J7991J1347r291M73o291L721m66q467o467
16353h800L479n034O481Q424J188q299j272O99O468p98J713J395N841J4343j045
16338B4783l874J4731o368k3208l121k893j5259m89N044K794k83J460m039N694
16324e028M981O924k939o061k410M118L490n633j0755k169K629r04O313j427K301
16309f570m028L405m029j866N666o217m879K471j6789K65O441J404N034J1062
16295h630L891R237k101j857p707m152R492P874r234p899J3101K4732p968o362
16281A2417O35r379K1k183K330q856k2468o617L691J0985N030o248k394Q872R655
16266d509O944O243N0k199m38j155j1232m240O771J307P4q194l341L817m798N697
$$ plain form
16368 -18868 -9064 -9883 -13092 -8175 -17785 -11350 6641 17988 8697 9170 2879 6600 6134 -2333 -8800
16353 -8800 -5321 -10355 -3874 4550 5738 -2561 -3833 -3134 3334 2536 4249 5644 11485 25828 24783
16338 24783 20909 35640 29272 6064 2943 50 -15209 -15698 -10654 -7860 -8143 -6683 -10722 -5028
16324 -5028 -47 6877 3938 -2123 -4533 -415 3075 -2558 -13313 -15482 -12853 -13757 -7444 -8871 -6570
16309 -6570 -10598 -7193 -11222 -13088 -7422 -13639 -18518 -16047 -32836 -32571 -26130 -24726 -19692 -8630
16295 -8630 -4739 4498 2397 540 -7167 -11319 -1827 6047 -3187 -11086 2015 26747 18779 12417
16281 12417 13052 3673 3694 1511 3841 -5015 -27483 -34100 -30409 -19424 -14394 -20642 -23036 -14164 -4509
16266 -4509 2435 8678 8728 6529 6091 4936 -6296 -10536 -3765 -2458 -2384 -10578 -13919 -10102 -14900 -9203
16250i203J1607J3936p418r309J0615k3760j3645o37k968P722J0712O678J0393
16237D723M123j499N29M164P973n888K65l79L893m545j5527Q690M843o957j4591
16222a0183l357L47k993r827m742K972J2437L836N653k482j231J4747R226P415
16208B1818j580j2875N445l74j2702k264Q840j37m027k3971r597K197J6979k123
16194a4371m703J3821L15o578m503N13P153J225l604K696L81K727J3097M690J914
16179A4773J608N889q003k0213M0N779p091j5482R964M876J1246O469k226q87
16165F742r533k384N633k301j382k338l326n892K981K3257J8582N799j4901j7625
16151C312L461O568o26q864j5403j956P011K217P592J367k119m216L196J378Q9
$$ plain form
16250 -9203 2404 16340 8922 -387 10228 -13532 -27177 -27814 -30782 -23060 -12348 -5670 4723
16237 4723 8846 7347 7876 12040 20013 14125 14390 14011 17904 13359 -2168 6522 11365 4408 -10183
16222 -10183 -13540 -13193 -16186 -26013 -30755 -27783 -15346 -11510 -5857 -8339 -9570 5177 14403 21818
16208 21818 20238 7363 12808 12434 -268 -2532 6308 6171 2144 -21827 -31424 -29227 -12248 -14371
16194 -14371 -19074 -5253 -4938 -11516 -16019 -15506 -8353 -7128 -10732 -8036 -7655 -4928 8169 12859 14773
16179 14773 16381 22270 14267 -5946 -5906 -127 -7218 -22700 -12736 -7860 3386 9855 7629 6742
16165 6742 -2791 -5175 458 -1843 -3225 -5563 -8889 -14781 -11800 11457 30039 35838 20937 3312
16151 3312 6773 13341 12715 3851 -11552 -13508 -6497 -4280 3312 4679 2560 -1656 1540 2918 3007
16136C007k36P192Q567O265m763K153j0903j7851o443l76L923L447J3117Q042
16122A5141K38q334o146l632J355J485J158q782O099J3536N748p72m487R475m279
16107A7803p516l456n075L983M769N132j1581k668Q059N388n391j4809l996O944
16093b414l344j509J66Q59Q37q783Q175P424n986q312Q999L617L150Q689k605
16078H963j2468n086K69O073M853Q259J0274k074n015j2551L869K0829p240j2911
16064F044r38J363l30N894O676r839P608J5615p451j2401O961M141o676J110J571
16049A9348J0070j617p068N338o637j4146J974k865N163N361n131k2688j3140
16036b6038j384J3332L536O605J0299k414k117N970L34k654k448l079L02Q00J2565
$$ plain form
16136 3007 2771 9963 18530 24795 20032 22185 11282 -6569 -13012 -13388 -9465 -6018 7099 15141
16122 15141 15379 7045 899 -2733 -1378 107 1265 -7517 -1418 12118 17866 17094 12607 22082 17803
16107 17803 10287 6831 1756 5739 10508 15640 4059 1391 9450 14838 9447 -5362 -9358 -2414
16093 -2414 -5758 -7267 -7101 -6242 -5405 -14188 -6013 1411 -4575 -12887 -3888 -271 2879 11568 8963
16078 8963 -3505 -8591 -8322 -2249 2604 10863 21137 19063 14048 1497 5366 26195 18955 6044
16064 6044 5106 6469 6139 12033 18709 8870 16478 32093 24642 12241 19202 23343 16667 17777 19348
16049 19348 29418 27801 20733 26071 19434 5288 7262 4397 9560 14921 9790 -12898 -26038
16036 -26038 -27422 -14090 -10554 -3949 6350 3936 1819 7789 8123 5469 3021 -58 244 1044 13609
16021A3609K805l263n082o05n070L385o546o790m088P946J2590k623k549k388
16007A331J866K019k212l683K968m6R78L771N865o107j4854q230J0650m699J333
15992i050K026L57J0960J539j0201L277R926k600N04k212l07j3470j201J1050
15978E98Q760J2888M838r143r106R755K154k247r916j2910J941O901P872J861
15964A4246j3982q181N081R864Q979O781n038m072l912J27J0501j6030p99J2453
15950A6018O912m81r772n156n362J0667N484K468j1181l179P667n85k470K372
15936A3402J1397Q125q431j8719N4K846k066l502M504M618j1712j787N940Q525
15922A3194O672K449r3l700p746L06K974L390o690P036k418K943J913o127l996
$$ plain form
16021 13609 16414 13151 8069 7464 2394 5779 -767 -7557 -11645 -3699 8891 6268 3719 1331
16007 1331 3197 5216 3004 -679 2289 2243 3221 6992 12857 6750 -8104 -16334 -5684 -10383 -9050
15992 -9050 -7024 -6667 4293 5832 -4369 -1092 8834 6234 6738 4526 4219 -9251 -10452 598
15978 598 9358 22246 27084 17941 8835 18590 20744 18497 8581 -4329 -2388 4513 12385 14246
15964 14246 264 -7917 -2836 7028 16007 22788 17750 13678 9766 9893 20394 4364 3565 16018
15950 16018 22930 22449 12677 7521 2159 12826 18310 20778 9597 6418 14085 13500 11030 13402
15936 13402 24799 32924 24493 5774 5828 8674 6608 3106 7610 12228 516 -1271 4669 13194
15922 13194 19866 22315 22222 18522 10776 11082 14056 17446 10756 17792 15374 18317 20230 14103 10107
15907A0107r263L266N295m949M52J2106j610P022O248q177j1294o222m696R615
15893G900J895j5629j1143J0049Q856N697j230j4735j5406n472K68N292L14m796
15879b8140Q753J5033n334j3330Q110k564p383J0086J2147M145r32R35m316j0106
15865a2896n845M038O534Q392o556K090Q902m964n297M506k948N868Q769J1967
15851B2560j1839j3631j848M99l533o388J3560R38j3131N186J5551n120n774M49
15837b521k133n973p70J734l09m187J4573r677L355J5128L271J839j0212k2066
15823a7948p525l82O316R027Q655M577L169L346L169L670p065k158l995L595j601
15808D850K552K087j1736J3217K875j4487j7228J525j152P300P935q402n26n936
$$ plain form
15907 10107 844 4110 9405 4456 4908 17014 15404 22426 28674 20497 9203 2981 -1715 7900
15893 7900 9795 -5834 -16977 -6928 1928 7625 6395 -8340 -23746 -29218 -28950 -23658 -23344 -28140
15879 -28140 -19387 -4354 -9688 -23018 -14908 -17472 -24855 -14769 -2622 1523 591 1526 -2790 -12896
15865 -12896 -18741 -14703 -8169 223 -6333 -4243 4659 -305 -5602 -1096 -4044 1824 10593 22560
15851 22560 10721 -2910 -4758 -4259 -7792 -14180 -620 318 -12813 -7627 7924 2804 -2970 -2521
15837 -2521 -4654 -10627 -11397 -9663 -9972 -14159 414 -9263 -5908 9220 12491 14330 4118 -17948
15823 -17948 -25473 -25855 -19539 -10512 -1857 2720 5889 9235 12404 16074 9009 6851 2856 6451 4850
15808 4850 7402 9489 -2247 10970 13845 -642 -17870 -16345 -17497 -10197 -2262 -10664 -11190 -17126
15794a7126o673J065J919q539M711J3710m284p605o668J4204J7792j5257q595
15781b1346k429p986J9320J1382q519k159o258k541R802m244o849J4587o705Q990
15767d955O128q073j0863l399j5841k119J15M260J6231L206J5073P114M232q278
15753B831q423q751K022J4015k012j6315r958n752m304M768N010J2029K051J1906
15739h83J5517k346j5726p073k470P775R838o914J203K814p898j1342L644K964
15725a0897j4004j0130J611N780J3165J7044K97j1730o540n38p506J777q877k17
15711c0765O622J1455J0302m69l692p912m630j292J836O159O80n280N631r653
15697b1008l097J2570k992o606Q115J0700l36j35N680J1087M582l218O763O448
$$ plain form
15794 -17126 -23799 -22734 -20815 -29354 -24643 -10933 -15217 -22822 -29490 -15286 2506 -12751 -21346
15781 -21346 -23775 -31761 -12441 -1059 -9578 -11737 -17995 -20536 -10734 -14978 -21827 -7240 -13945 -4955
15767 -4955 1173 -6900 -17763 -21162 -37003 -39122 -39007 -34747 -18516 -15310 -237 6877 11109 2831
15753 2831 -5592 -14343 -12321 1694 -318 -16633 -26591 -32343 -36647 -31879 -26869 -14840 -12789 -883
15739 -883 14634 12288 -3438 -10511 -12981 -5206 4632 -2282 -1079 1735 -6163 -17505 -13861 -10897
15725 -10897 -24901 -35031 -33420 -27640 -14475 2569 2866 -8864 -15404 -15942 -23448 -21671 -30548 -30765
15711 -30765 -24143 -12688 -2386 -2855 -6547 -14459 -19089 -20381 -18545 -12386 -11706 -16986 -11355 -21008
15697 -21008 -24105 -11535 -14527 -21133 -13018 -2318 -2654 -2789 2891 13978 18560 15342 22105 28553
15683B8553r934r995L290L53p836q515j0840l985r388l109p010K628R37Q493O800
15668a9558n170L306K954Q351N756k243j386o761P414L651k564l126j248Q746
15654a878j194r043o818n425M654n206q748k231l53J0710J0772J0336J074q257
15640a1607j0027r394J1327o788m249M199P843O745j054m180j3839Q48Q765J7676
15626c735o9o635M91k055R495j3423p390Q360J2345k840k3178j9119j742J0256
15612c9239o198J0235O589J2287N325n67R715Q049o891q046j5071q574O121J6948
15598i317j513K938m342Q256n060K325J2609P060r973j1191j1320P424N521j886
15584h469O50J3020K4j9793J711J7874K114k586N232j4374j0558k1985J3639J0323
$$ plain form
15683 28553 18619 8624 11914 12267 4431 -4084 -14924 -18909 -28297 -31406 -38416 -35788 -34851 -26358 -19558
15668 -19558 -24728 -21422 -18468 -10117 -4361 -6604 -7990 -14751 -7337 -3686 -6250 -9376 -10624 -1878
15654 -1878 -3072 -12115 -18933 -24358 -19704 -24910 -33658 -35889 -36242 -25532 -14760 -4424 -3350 -11607
15640 -11607 -21634 -31028 -19701 -26489 -30738 -26539 -18696 -11951 -13005 -17185 -31024 -30176 -21411 -3735
15626 -3735 -3804 -10439 -9948 -12003 -2508 -15931 -23321 -14961 -2616 -5456 -28634 -47753 -49495 -39239
15612 -39239 -45437 -35202 -28613 -16326 -11001 -11568 -1853 6196 -695 -8741 -23812 -32386 -26265 -9317
15598 -9317 -10830 -7892 -12234 -3978 -9038 -6713 5896 12956 2983 -8208 -19528 -12104 -6583 -8469
15584 -8469 -7819 5201 5225 -14568 -12857 5017 7131 4545 9777 -4597 -15155 -37140 -23501 -13178
15570a3178Q06r497l844k08J926l264P25J0195K616r073J549p240j704Q822M500
15555a6869p27Q58O58K238J055Q651N323o196o464J763j626q349o084r988M308
15540c1449K528J496j3556k721k67J6784Q251p582m845q878o460Q972J6038J0716
15526a0973j4856j8283j932O515r585J7988J8263P996n662Q072j6020j4393M796
15513b8074M930j411N369j2170o971J0256L131O512k360K260J2977N8j2385L400
15499a4478L76p229p256j359j0054m139L814Q809j0490j3549K410J1517J1325
15486c0303J1147m603k860M194O4J4049K767J0779j696q773n178K045J2747p011
15472b632K885k205n734o856n559R69Q910L642j9178j0453R120J2090o772n321
$$ plain form
15570 -13178 -12372 -21869 -25713 -25921 -23995 -27259 -26534 -16339 -13723 -22796 -21247 -28487 -30191 -21369 -16869
15555 -16869 -17596 -16738 -16080 -13842 -12787 -4136 1187 -5009 -11473 -9710 -11336 -19685 -25769 -35757 -31449
15540 -31449 -28921 -27425 -40981 -43702 -43969 -27185 -18934 -26516 -31361 -40239 -46699 -37727 -21689 -10973
15526 -10973 -25829 -44112 -46044 -39529 -49114 -31126 -12863 -4867 -10529 -2457 -18477 -32870 -28074
15513 -28074 -23144 -24555 -19186 -31356 -38327 -28071 -24940 -18428 -20788 -18528 -5551 -5493 -17878 -14478
15499 -14478 -14102 -21331 -28587 -29946 -40000 -44139 -40325 -31516 -42006 -55555 -53145 -41628 -30303
15486 -30303 -19156 -23759 -26619 -22425 -22361 -8312 -5545 5234 3538 -5235 -10413 -8368 4379 -2632
15472 -2632 253 -1952 -7686 -14542 -20101 -19132 -10222 -6580 -25758 -36211 -27091 -15001 -21773 -27094
15458b7094N305K90P881J026L393R178n126r641o553j909p209L717J2912k130
15444a5960J257J1477j5136m272L521J2266K601q372p868k145K444N3J884M728
15430a3522l591r818J099J1844r926o009J0646J1526O690j892k1419m967Q501
15417b0838k741j935K087Q090o24j649m499m266O648Q32J137O365N127j4229r052
15402b9547Q992L25J675M687Q062n150j7737K602M629m573J1818J1248k063m566
15388i598p34j749r604r07J0187R222l364j8040l175L929J4305J4200J0951J1093
15374B6716q875j1073m525j2191l914m688p501o407k737M291m238m377j788o936
15360d8243M504N534K84L701k76K1126j00p611l269O222O68L410J4383P282P182
$$ plain form
15458 -27094 -21789 -21499 -13618 -12592 -9199 -21 -5147 -14788 -21341 -23250 -30459 -26742 -13830 -15960
15444 -15960 -14703 -3226 -18362 -22634 -19113 -6847 -4246 -12618 -20486 -22631 -20187 -20134 -18250 -13522
15430 -13522 -17113 -26931 -25832 -13988 -23914 -29923 -19277 -7751 -1061 -2953 -24372 -29339 -20838
15417 -20838 -23579 -25514 -23427 -15337 -15961 -17610 -22109 -26375 -19727 -18895 -17758 -11393 -6266 -20495 -29547
15402 -29547 -20555 -20230 -18555 -13868 -5806 -10956 -28693 -26091 -21462 -26035 -14217 -2969 -5032 -9598
15388 -9598 -10332 -12081 -21685 -22592 -12405 -3183 -6547 -24587 -27762 -23833 -9528 4672 15623 26716
15374 26716 17841 6768 2243 -9948 -13862 -18550 -26051 -32458 -35195 -30904 -35142 -39519 -41307 -48243
15360 -48243 -43739 -38205 -37921 -34220 -34496 -13370 -13470 -21081 -24350 -18128 -17460 -14050 333 7615 14797
15345A4797N180l655j1107j4018J400m159j3085j2146o772M006J0772N88M971
15332b3228R450O53K1756R576p203o462Q50r313j5621j3640N985J2542J4401m244
15318d498J058L770j7311j1635N34M075l186P042J3841n174j6150r441K3599N991
15304g485L7r359k3990j8546J3219P004O006N466Q433N31o279q818k309R4K106
15289c3890P397J33o558Q832J011j612N982Q925m973k253M30p239l999K4788K8911
15274B5885j72r945j0442j7371q977Q22K968l154j916J2022Q153r915l484J914
15260a3612k2280N712J5429J77k297p070n334l987n246J1996J861J5670k052o702
15246a7735R401N698N34L143M356o938j3851o44M069j1536m019n706Q62J2914
$$ plain form
15345 14797 19977 16322 5215 -8803 -7403 -11562 -24647 -36793 -43565 -39559 -28787 -28199 -23228
15332 -23228 -13778 -13125 8631 18207 11004 4542 5392 -3921 -19542 -33182 -27197 -14655 -254 -4498
15318 -4498 -3440 330 -16981 -28616 -28082 -24007 -27193 -20151 -6310 -11484 -27634 -37075 -13476 -7485
15304 -7485 -7448 -16807 -40797 -59343 -46124 -39120 -33114 -27648 -19215 -18684 -24963 -33781 -36090 -35996 -33890
15289 -33890 -26493 -26360 -32918 -24086 -23075 -24687 -18705 -9780 -14753 -17006 -16576 -23815 -27814 -3026 25885
15274 25885 25713 15768 5326 -12045 -21022 -20200 -17232 -20386 -22302 -10280 -2127 -12042 -15526 -13612
15260 -13612 -35892 -30180 -14751 -14574 -16871 -23941 -29275 -33262 -38508 -26512 -24651 -8981 -11033 -17735
15246 -17735 -8334 -2636 -2102 1041 5397 -1541 -15392 -16036 -11967 -23503 -27522 -33228 -32366 -19452
15232a9452j665l091L784N152l208J302q873j2654N99M896J3333N654M481P801
15218a941k959L656J1996l026l430L154m301p809j2031o952K3400O681j7039p101
15204a7702L65j94o544j4277K1889L906k936l731J339L00j2368j0091J718J7112
15190b1214O29J990o703n195r91N775J2100n06j4261j2076j725J6157Q043N172
15176a2805o487k185O030p729o232L040j871j0195j283J8851L152q730n148J524
15162c0068j910n647M508o027R851P210J6739K910q266p427M198p449q470m928
15148c4776j270J9442K772j0932p5J1474K929P115P804j138r301N72l543J067
15134g860PJ6861O817j3582M243j2076j1236L709Q566p187k077M117o557m867
$$ plain form
15232 -19452 -21117 -24208 -20424 -15272 -18480 -17178 -26051 -38705 -38106 -33210 -19877 -14223 -9742 -1941
15218 -1941 -4900 -1244 10752 7726 4296 7450 3149 -4660 -16691 -23643 -243 6438 -10601 -17702
15204 -17702 -17337 -17531 -24075 -38352 -16463 -12557 -15493 -19224 -17885 -17585 -29953 -40044 -38326 -21214
15190 -21214 -20585 -18595 -25298 -30493 -31484 -25709 -13609 -14115 -28376 -40452 -42177 -26020 -17977 -12805
15176 -12805 -19292 -21477 -15447 -23176 -29408 -26368 -28239 -38434 -39717 -20866 -17714 -26444 -31592 -30068
15162 -30068 -31978 -37625 -33117 -39144 -29293 -22083 -5344 -2434 -10700 -18127 -13929 -21378 -29848 -34776
15148 -34776 -36046 -16604 -13832 -24764 -24839 -13365 -10436 -3321 4483 3345 -5956 -5384 -8927 -7860
15134 -7860 -7853 9008 15825 2243 6486 -5590 -16826 -13117 -4551 -11738 -13815 -9698 -16255 -21122
15120b1122L621R59O025m502q68j148m248J0172l197n186K636M84j741l985P739
15105a4361o082Q390j772K204L264j3688j1681N023Q620J1713j1156k635j8235
15092d0396R35J6580J164M806N278m688L947j592r964n494P144M035q529P65J1675
15077a4334o493N401O444j792j1829p771o283Q682r97M740Q674r274M296J0703
15063i833Q192N401j6163K339k828j0236J8384J549K231l456r104J1815q849j2765
15049b3323J6240J0600n867K204k048J1411P053j0588q173L041j3918j2961n525
15036c1854N878O028N010J1815n98j3505j3617J2106l170j3675r029J4915R459
15023b0237Q345J457L990q351k708m890l921O303O22M533p280K477j3265N83J496
$$ plain form
15120 -21122 -17501 -16542 -10517 -15019 -15887 -17035 -21283 -11111 -14308 -19494 -16858 -16374 -18115 -22100 -14361
15105 -14361 -20443 -12053 -13825 -11621 -8357 -22045 -33726 -28703 -20083 -8370 -19526 -22161 -40396
15092 -40396 -39461 -22881 -21717 -16911 -11633 -16321 -12374 -13966 -23930 -29424 -22280 -18245 -26774 -26009 -14334
15077 -14334 -20827 -15426 -8982 -10774 -22603 -30374 -36657 -27975 -28972 -24232 -15558 -24832 -20536 -9833
15063 -9833 -1641 3760 -12403 -10064 -12892 -23128 -4744 -3195 -964 -4420 -13524 -1709 -10558 -23323
15049 -23323 -7083 3517 -2350 -146 -2194 9217 16270 5682 -2491 550 -13368 -26329 -31854
15036 -31854 -25976 -19948 -14938 -3123 -3721 -17226 -30843 -18737 -21907 -35582 -44611 -29696 -20237
15023 -20237 -11892 -10435 -6445 -14796 -17504 -22394 -26315 -20012 -19390 -14857 -22137 -19660 -32925 -32342 -30846
15008c0846p079j3824N652K5848P991N915L927j1036j818K518L70q515k584O585
14994a6896J0500O06L918K695m708M847r674p061L1M79N679K433j4435K942L116
14979a5528J396j8879J829R382J3249l648j3217O903J3722m224j6941j8046o251
14966e0253l236R403R443R527m51l914R121N684L347q753p987k724Q723O956Q740
14951f374m921k767j1778o945K495q119M946M886R416Q622j0959l831m869m126
14937c4324N381L758J1920K096n817p046n841J339J4280J1131J60n733Q954m354
14923d096m787o785J960R231O152p97P415l622K380j1929j2433Q253K791o252
14909a2519n485j187n05n865k59J2805P092O246O161K483q912p241o409n07m769
$$ plain form
15008 -30846 -37925 -51749 -46097 -20249 -12258 -6343 -2416 -13452 -15270 -12752 -12382 -20897 -23481 -16896
14994 -16896 -6396 -5790 -1872 823 -3885 962 -8712 -15773 -15742 -15263 -9584 -7151 -21586 -18644 -15528
14979 -15528 -14132 -33011 -31182 -21800 -8551 -12199 -25416 -18513 -4791 -9015 -25956 -44002 -50253
14966 -50253 -53489 -44086 -34643 -25116 -25567 -29481 -20360 -14676 -11329 -20082 -28069 -30793 -22070 -15114 -6374
14951 -6374 -11295 -14062 -25840 -32785 -30290 -38409 -33463 -28577 -19161 -10539 -21498 -25329 -30198 -34324
14937 -34324 -28943 -25185 -13265 -11169 -16986 -24032 -29873 -28534 -14254 -3123 -2963 -8696 258 -4096
14923 -4096 -8883 -15668 -13708 -4477 1675 878 8293 4671 7051 -4878 -17311 -9058 -6267 -12519
14909 -12519 -18004 -19191 -19696 -25561 -25820 -13015 -5923 323 6484 8967 55 -7186 -13595 -14102 -18871
14894a8871p289n030N700J869J3780K116j8206j465R476p859J906J881j895j56
14880b4043J0141J1801J0129p588p256l83m041M867K942k574n465m001o406K153
14866a9724J4763J0079p471q278J633j0927p659M896j466q53J3793o952j3349
14853c1515m698j1923l904K7248J3722Q853k021L477k93j3214j4604j730N334
14840b5268R601J0920P003l210n487j029r638l545k755R559K2146o214L665j536
14826D212o630q656r344j2719K711m12m107l08N172J483K633J1290N586o877o631
14811b2597j1838n643P214K8276J0194p096n184l092p089o136n39o109j274L132
14797b7781p57J4229l812O42J0925k018k0250Q506J7202K840j3596r507J992J270
$$ plain form
14894 -18871 -26160 -31190 -25490 -23621 -9841 -7725 -25931 -27396 -17920 -25779 -23873 -21992 -23887 -24043
14880 -24043 -13902 -2101 8028 440 -6816 -7199 -11240 -6373 -3431 -6005 -11470 -15471 -21877 -19724
14866 -19724 -4961 5118 -2353 -10631 -8998 -19925 -27584 -22688 -24154 -25007 -11214 -18166 -31515
14853 -31515 -36213 -48136 -52040 -24792 -11070 -2217 -4238 -761 -1054 -14268 -28872 -30602 -25268
14840 -25268 -15667 -4747 2256 -954 -6441 -7470 -17108 -20653 -23408 -13849 8297 2083 5748 4212
14826 4212 -2418 -11074 -20418 -33137 -30426 -30838 -34945 -35253 -30081 -28598 -25965 -14675 -9089 -15966 -22597
14811 -22597 -34435 -40078 -32864 -4588 5606 -1490 -6674 -9766 -16855 -22991 -23530 -29639 -30913 -27781
14797 -27781 -28538 -14309 -18121 -17479 -6554 -8572 -28822 -20316 -3114 -274 -13870 -23377 -21385 -20115
14783b0115r208j924J888p102J0624J1678N732p530R36Q787l398j356q482k154
14769b1624l441l067J4873N434J141j836J0491K418l108O01k297J323M380l276
14755B012m488Q37l621j0028n500p35n862o290R226m079O029m256L301K421j5834
14740c6867o520J4296J602k458j250J7452J9331L604J0921N203k1260j0021m483
14727a0450j824k392l732L761n001N725o184M019J4179j0530j0091j0168J331
14714c1357J1219J264Q011j809m941j2497q81k012k805L632J1930J739o036J137
14700b3406J3479P561r409n526J712J758p40J0900q984q653O461O49l740J131
14686a6807r249M640M392j194R547J3565L755m102o19j1059k830l166j1877l768
$$ plain form
14783 -20115 -29323 -31247 -29359 -36461 -25837 -14159 -8427 -15957 -15021 -6234 -9632 -10988 -19470 -21624
14769 -21624 -25065 -28132 -13259 -7825 -6684 -8520 1971 4389 1281 1882 -415 908 5288 2012
14755 2012 -2476 -1639 -5260 -15288 -20788 -21523 -27385 -33675 -24449 -28528 -22499 -26755 -23454 -21033 -36867
14740 -36867 -43387 -29091 -27489 -29947 -31197 -13745 5586 9190 20111 25314 4054 -5967 -10450
14727 -10450 -12274 -14666 -18398 -14637 -19638 -13913 -20097 -16078 -1899 -12429 -22520 -32688 -31357
14714 -31357 -20138 -18874 -10863 -12672 -17613 -30110 -30991 -33003 -35808 -32176 -20246 -18507 -24543 -23406
14700 -23406 -9927 -2366 -11775 -17301 -15589 -13831 -14571 -3671 -12655 -21308 -14847 -14198 -17938 -16807
14686 -16807 -26056 -21416 -17024 -18218 -8671 4894 8649 4547 3928 -7131 -9961 -13127 -25004 -28772
14672b8772L805K1119N062L50k884K601O181p936j4603n186p55J5887l964r198
14658a8293K200m098J208Q897j6627o047J5041P51m452l727j42P029j568J124
14644a8704k024Q030p19K60J625P593J226p401n549j0101l38o818n175o28L768
14629c4955M841k04p645Q177K434L305J7091m780j2297j444l845j002n188J1777
14615b3735J6523j333j4038O910P823p873r13K014p906j1172q90L809K487p339
14601c5633L452n295n342K22J4014K3662q70o659M842K897K708M453n04k4359
14587b2412k801J1221r95O404M845M997k986p729l188L651r233K504M748o235
14573a7209j0026p957j652J4749M345N356L821J880n961l250O249q295M462P492
$$ plain form
14672 -28772 -24967 -3848 1214 1564 -1320 1281 7462 -474 -15077 -20263 -21018 -5131 -9095 -18293
14658 -18293 -16093 -20191 -18983 -10086 -26713 -32760 -17719 -16968 -21420 -25147 -25289 -18260 -19828 -18704
14644 -18704 -20728 -12698 -13417 -13157 -11532 -3939 -2713 -10114 -15663 -25764 -26102 -32920 -38095 -38723 -34955
14629 -34955 -30114 -30318 -37963 -29786 -27352 -24047 -6956 -11736 -24033 -25477 -29322 -30324 -35512 -23735
14615 -23735 -7212 -8545 -22583 -15673 -7850 -15723 -16636 -14622 -22528 -33700 -34590 -30781 -28294 -35633
14601 -35633 -32181 -37476 -42818 -42596 -28582 -4920 -5790 -12449 -7607 -4710 -2002 2451 1947 -22412
14587 -22412 -25213 -13992 -14987 -8583 -3738 1259 -1727 -9456 -12644 -8993 -18226 -15722 -10974 -17209
14573 -17209 -27235 -35192 -36844 -22095 -17750 -12394 -8573 -6693 -12654 -15904 -9655 -17950 -13488 -5996
14559e996J218o486n222j595N85l481J8459l106j5995m541J0169M088j3146n354
14545c0403J3593Q343n180j1816L771O438o592K791P613m57n844K496K961O599
14531e687Q190j0481j0229p089l663J251O657J3168Q150M55p360N980j6219r316
14517b6193P767J0011R68J524n434n805L29R170L382L33j9035l330J3418J4068
14503A173m18J219j3709j5094M797L881k923j435q884M915N937j604J680J0507
14489i958P494j8498j9084l696M317Q136R869L780m423l471j3356k260M605K455
14475c4090K982j3416P916N765N073K431p23O169n334K940j3504k770P691R529
14461a9341k323J5713J3584o457j2070j4520l714J8602j401o408o332K800M680
$$ plain form
14559 -5996 -4778 -11264 -16486 -18081 -17496 -20977 -2518 -5624 -21619 -26160 -15991 -11903 -25049 -30403
14545 -30403 -16810 -8467 -13647 -25463 -21692 -15254 -21846 -19055 -11442 -11899 -17743 -15247 -12286 -5687
14531 -5687 2503 -7978 -18207 -25296 -28959 -27708 -21051 -7883 267 722 -6638 -658 -16877 -26193
14517 -26193 -18426 -8415 -7447 -5923 -11357 -17162 -16833 -7663 -4281 -3948 -22983 -26313 -12895 1173
14503 1173 755 1974 -11735 -26829 -22032 -18151 -21074 -22509 -31393 -26478 -20541 -22145 -20465 -9958
14489 -9958 -2464 -20962 -40046 -43742 -39425 -31289 -21420 -17640 -22063 -25534 -38890 -41150 -36545 -34090
14475 -34090 -31108 -44524 -36608 -30843 -25770 -23339 -24062 -17893 -23227 -20287 -33791 -36561 -28870 -19341
14461 -19341 -21664 -5951 7633 1176 -10894 -25414 -29128 -10526 -11927 -18335 -24667 -21867 -17187
14448a7187N034J038j5116k402r790Q402J0885J0934k661j2389J615L937P789
14435i911k589k451P02O120J2515q200n205o620J839k556J5279j73o254r690J0091
14420g103P564P09o400j262o303j5617k246J2345N57k319M361l631M221M59M313
14405a0352K272L004p421n763J7686J4342l832l601q525l005j6764m826J5815
14392a0970o61l1M686l434j0403O193P705l189o01M745K699l440j575K394l392
14377i274J379J0231M122M573j1541j4388K406R491k618l479r90M063N020k980
14363c985Q581o093j84J0239O767J0466J8992J0613M2j901m372M544M724j83Q935
14348F7185O093o02o91J6710K815j2487j0106q809q155j3843l656l462O470n490
$$ plain form
14448 -17187 -12153 -11115 -26231 -28633 -38423 -30021 -19136 -8202 -10863 -23252 -21637 -17700 -9911
14435 -9911 -12500 -14951 -14249 -8129 4386 -3814 -9019 -15639 -13800 -16356 -1077 -1250 -7504 -17194 -7103
14420 -7103 461 1170 -5230 -6492 -12795 -28412 -30658 -18313 -17756 -20075 -15714 -19345 -15124 -14665 -10352
14405 -10352 -8080 -5076 -12497 -18260 -574 13768 9936 6335 -2190 -5195 -21959 -26785 -10970
14392 -10970 -11631 -11662 -6976 -10410 -20813 -14620 -6915 -10104 -10705 -5960 -3261 -6701 -8276 -5882 -9274
14377 -9274 -7895 2336 6458 11031 -510 -14898 -12492 -3001 -5619 -9098 -10088 -6025 -1005 -3985
14363 -3985 4596 -1497 -1681 8558 15325 25791 44783 55396 55438 53537 49165 53709 58433 58250 67185
14348 67185 73278 72676 71985 88695 91510 79023 68917 60108 51953 38110 34454 30992 37462 31972
14334C1972J877L448K075j6726k1603m229o406N091R292q961J1209r11j0155r684
14320a3711j914r044k692R31J5610j7821q118m582O473k499N793P903l596K564
14306b4703R570O350m711j823n08M552j0025K196Q925j6593L727J1328Q312J9702
14292A6299Q242j342M225l878o295p772n272K826R065J7221L539r239o071O74
14278B2222M3m540r128m624n315j578Q185j035K458k214j848q755p654R152o033
14263a0664n408o690q309M014O964J0031k23o087l531J426j5302q64m122K790
14249c5975p209L196j938o726L720N826m691K954J1765P548J89m96J224P126J128
14234a2359J649J882L324L731q879O096J041j92j858p862P688r272q843l038p566
$$ plain form
14334 31972 33849 37297 39372 22646 1043 -3186 -9592 -4501 4791 -4170 7039 6128 -4027 -13711
14320 -13711 -15625 -24669 -27361 -26430 -10820 -28641 -36759 -41341 -34868 -37367 -31574 -23671 -27267 -24703
14306 -24703 -15133 -8783 -13494 -15317 -15825 -11273 -21298 -19102 -10177 -26770 -23043 -11715 -3403 16299
14292 16299 24541 23199 27424 23546 17251 9479 4207 7033 16098 33319 36858 27619 21548 22222
14278 22222 22265 17725 8597 3973 -1342 -2920 5265 4230 6688 4474 2626 -6129 -13783 -4631 -10664
14263 -10664 -16072 -22762 -31071 -27057 -20093 -10062 -10285 -16372 -19903 -18477 -33779 -34643 -38765 -35975
14249 -35975 -43184 -39988 -41926 -48652 -44932 -39106 -43797 -40843 -29078 -21530 -21341 -21837 -20613 -13487 -12359
14234 -12359 -10710 -8828 -5504 -1773 -10652 -4556 -3515 -3707 -5565 -13427 -5739 -15011 -23854 -26892 -34458
14219c4458K604Q744P335k512j3511p309J1146L723o201n796R181J0613o57m676
14205b1774j410N07r924J2762J1015O234R921J154p847k027n344o651r266r442
14191c2092n55K226J187Q147K449K149O668N065L632L447Q2O37N439m493j3731
14176i743j8367O268J2473Q410q931j91J2611K5028J5058j1817j3309m846M608
14163A7252k356l181q628j0264j0990o650K139L833J0995M452J139N337m559R297
14149G816R588J2168J0828P816j3705L16j0890o646J2423p901j541q725O34M879
14135A7060o706O72n13j2527J2448L124n971P75P053J0655j855l71M103p481L6
14120B0502M537P17j0726L35j3619o048Q223m929N243J631l385O392p289j3484
$$ plain form
14219 -34458 -31854 -23110 -15775 -18287 -31798 -39107 -27961 -24238 -30439 -36235 -27054 -16441 -17098 -21774
14205 -21774 -23184 -22677 -32601 -19839 -8824 -2590 7331 8485 638 -1389 -6733 -13384 -22650 -32092
14191 -32092 -32647 -30421 -29234 -21087 -18638 -16489 -9821 -4756 -1124 2323 2405 3042 8481 3988 -9743
14176 -9743 -28110 -21842 -9369 -959 -9890 -10081 2530 27558 42616 30799 17490 12644 17252
14163 17252 14896 11715 3087 -7177 -18167 -24817 -22678 -18845 -7850 -3398 -2259 3078 -1481 7816
14149 7816 17404 29572 40400 48216 34511 34827 23937 17291 29714 21813 20272 11547 12181 17060
14135 17060 10354 11026 10513 -2014 10434 13558 7587 8362 15415 26070 24215 23844 27947 20466 20502
14120 20502 25039 25756 15030 15365 1746 -4302 3921 -1008 4235 5866 2481 8873 1584 -11900
14106a1900n334l09O569J5302P687j0494q952J6212J8878J3952q848L811r469
14093B7105p130j698K389M212k675o231J692j0338n655r836j3206N722J2721J4642
14079A1714J22M953O102K881J604O635r719o922R67m933l965j152K611K392P058
14064B0348p895n055l041J0885J8560O139mP367J5295J3034J0280J9481J9643
14051A25037J1677m209j0415j2094p359k4742j1226j5021r569j8271j6755o510
14039E43o479J2760J4900L086q159j1086m653n814r904j1399L328J5369N370P173
14025E035n990j6361J36J0960O62Q352P618o016o573q838o708O977M381J6340
14011I975J1322l370K252j942o902m601Q689k734j707j6728j1085R90L65R487
$$ plain form
14106 -11900 -17234 -17543 -10974 4328 12015 1521 -7431 8781 27659 41611 32763 36574 27105
14093 27105 19975 18277 20666 24878 22203 15972 17664 7326 1671 -8165 -21371 -15649 -2928 11714
14079 11714 11836 16789 22891 25772 27376 34011 24292 17370 18337 13404 9439 8287 10898 13290 20348
14064 20348 12453 7398 4357 15242 33802 39941 39937 47304 62599 75633 85913 105394 125037
14051 125037 136714 132505 122090 109996 102637 77895 66669 51648 42079 23808 7053 543
14039 543 -5936 6824 21724 24810 16651 5565 912 -4902 -14806 -26205 -22877 -7508 -2138 5035
14025 5035 -955 -17316 -17180 -6220 -5558 2794 10412 4396 -2177 -11015 -17723 -10746 -6365 9975
14011 9975 21297 17927 20179 18237 11335 6734 15423 12689 10982 -5746 -16831 -15841 -15476 -5989
13997e989N905L957j7830k1346n586J3833J410L754j2005p941R344J622J2034
13984a8838J2051j0962M566O085O909p149m988j503O160N358j485J0045q823r971
13970a2545L927J3568l292j2602o98j4215R886J0408m1M514J522M026o11N265
13956I112P376R777j5099m684l558K242j9755p614J0493J1795p115j0996p326
13943b5352k44J5677L438O700J829M112M434P602K194j2028j2220j2732l199J2758
13929g031R366J5546Q70k702Q581j804j3954p836m046J3090M301j0674R934O814
13915B0455P534o350J242j1937q815k850L918P039N139j0876m755k31j4977p65
13901a6229J7885k375o704J3791K274Q027q55o60r659j4223j1847J0747J2629
$$ plain form
13997 -5989 -84 3873 -13957 -35303 -40889 -27056 -25646 -21892 -33897 -41838 -32494 -30872 -18838
13984 -18838 -6787 -17749 -13183 -7098 -189 -7338 -12326 -13829 -7669 -2311 -3796 6249 -2574 -12545
13970 -12545 -8618 4950 1658 -10944 -11642 -25857 -15971 -5563 -5604 -1090 432 4458 3847 9112
13956 9112 16488 26265 11166 6482 2924 5166 -14589 -22203 -11710 85 -7030 -18026 -25352
13943 -25352 -25596 -9919 -6481 219 2048 6160 10594 18196 20390 8362 -3858 -16590 -19789 -7031
13929 -7031 2335 17881 18751 16049 24630 22826 8872 1036 -3010 10080 14381 3707 13641 20455
13915 20455 27989 21639 22881 10944 2129 -721 3197 10236 15375 4499 -256 -487 -15464 -16229
13901 -16229 1656 -719 -7423 6368 8642 16669 15814 15154 5495 -8728 -20575 -9828 2801
13888B801J5504R350o420Q40p202m193K727n106P519L476L752n93J1945J5568
13874D9968O378P623j1257r975L605O50K84Q2j454J349J486o686m400j881N04
13859C6276r181L033n035o126m343l278J2667n448R85m556r002J593m221n199
13845a835j046j882L197r073L364P006P951K899O534N711O18K033j5597j2250
13831b370L945j489j984M778J1526n374p30j5036j0058J3869Q37j0155p372m449
13817b4062Q986J7611l089p199J3803J5303m040J1064J85o933K030j0997k3232
13804a0570j406p332L263J2579J1268P205j0420j603L267L55l694n059q312J7703
13790G244J3564j1860j1896L028J0443l288l916J031k528K18j1617m366O315J5127
$$ plain form
13888 2801 18305 27655 21235 22075 14873 10680 13407 8301 15820 19296 23048 22455 34400 49968
13874 49968 56346 63969 52712 42737 46342 46992 47276 47358 45904 47253 48739 42053 37653 35772 36276
13859 36276 27095 30128 25093 18967 14624 11346 24013 18565 19550 14994 5992 7585 3364 -1835
13845 -1835 -2881 -4763 -1566 -10639 -7275 -269 7682 10581 17115 22826 23444 25477 9880 -2370
13831 -2370 1575 86 -1898 2880 14406 9032 8302 -6734 -16792 -2923 -2086 -12241 -19613 -24062
13817 -24062 -15076 2535 -554 -7753 6050 21353 17313 28377 28562 21629 23659 12662 -10570
13804 -10570 -11976 -19308 -16045 -3466 7802 15007 4587 2984 6251 6606 2912 -2147 -10459 7244
13790 7244 20808 8948 -2948 80 10523 7235 3319 4350 1822 2040 -9577 -13943 -7628 7499
13776G499P619n43P447R049J5036J0561j5569o672K780j8453R02J3648J2524j0806
13762C5022P830p96k267r999o55n067l846J033J287q052L835J094P876J3228l339
13747C7184p779O992M497l747l140J1671M926q731O841J6954j154q640L004Q318
13733F7196J0145j4142l909M31r293j0364m488k218K647Q04J3816K4309L924N441
13719H4299J679Q524Q70N739O234J1481L135J0202Q900J1390K487j023J0334J6232
13705A80483O298J1427m345O15J4608O743j5930j6795N133q70n440j4427n802
13692A61698K428j7678j7146r068j6892j1634q148J884l138o472Q875p965n306
13679G1438j0233o110n608n946o103r014J304j1344j3206M12o117n179L917M151
$$ plain form
13776 7499 15118 14575 22022 31071 46107 56668 41099 34427 37207 18754 19656 33304 45828 35022
13762 35022 42852 42056 39789 29790 29135 24068 20222 21255 22542 14490 18325 19419 27295 40523 37184
13747 37184 29405 36397 40894 37147 34007 45678 50604 41873 48714 65668 64514 55874 58878 67196
13733 67196 77341 63199 59290 59721 50428 40064 35576 33358 36005 36809 50625 74934 78858 84299
13719 84299 85978 94502 95372 101111 107345 118826 121961 132163 141063 152453 154940 153917 164251 180483
13705 180483 186781 198208 193863 194478 209086 215829 199899 183104 188237 187367 181927 167500 161698
13692 161698 164126 146448 129302 120234 103342 91708 83560 85444 82306 75834 84709 76744 71438
13679 71438 61205 55095 49487 43541 37438 28424 29728 18384 5178 5590 -527 -5706 -1789 2362
13665B362n273k210O514p85o090o677q891P646J643j1885L925J1294n881m704
13651a9012m713P630M462L527j488N15j1915r842J6573J1866J199j2386N333M531
13637c720k412l752K998n612O244R799l127k105R271j1463l067J922j468k630
13623i122m870j450p164P440J788j5132j642J3183J4039J2022j1312l017j084
13610f321p538r666N196K47K602O98j1R615J0763j230o967O430K326k835n988
13595b679j0786j650L358l665J825p459J1919M670Q551J1666P486j5300r402j2637
13581a4103r655k285o037j1199M330Q931J1169J1520k457j0213o082j9936k688
13568d8705J2675J972p721L877M204j349N873R844j1004J542K491R91l654o111
$$ plain form
13665 2362 -2911 -5121 1393 608 -5482 -12159 -21050 -13404 -11761 -23646 -19721 -8427 -14308 -19012
13651 -19012 -23725 -16095 -11633 -8106 -9594 -9079 -20994 -30836 -14263 -2397 -1198 -13584 -8251 -3720
13637 -3720 -6132 -9884 -6886 -12498 -6254 3545 418 -1687 7584 -3879 -6946 -5024 -6492 -9122
13623 -9122 -13992 -15442 -22606 -15166 -13378 -28510 -30152 -16969 -2930 9092 -2220 -5237 -6321
13610 -6321 -13859 -23525 -18329 -18082 -15480 -14782 -14793 -5178 5585 4355 -2612 3818 6144 3309 -2679
13595 -2679 -13465 -15115 -11757 -15422 -13597 -21056 -9137 -4467 4084 15750 23236 7936 -1466 -14103
13581 -14103 -23758 -26043 -32080 -43279 -38949 -30018 -18849 -7329 -9786 -19999 -26081 -46017 -48705
13568 -48705 -36030 -34058 -41779 -37902 -33698 -35047 -29174 -19330 -30334 -28792 -26301 -25310 -28964 -35075
13554c5075k940Q197j104l574k823j1841P376K3487M990j947k015q779j2770M641
13540c4177J0602J4073O720q61j0839J465R847M400k933q440k189P277L907n370
13526f518p317K113J015K687j124r210K122O693J54R197L225M076l518j4236l856
13511a4497m236K067J5088n749l054L487N382M763j5993j4162q491P90j731N760
13497c0576N926p157k821J2283L927l623r197J1561J1976m804r559n97L094o582
13483b6149J6320N425P36K135L04n998l696j2665o445N748J696N057l40j0178
13469b8050P116J8537j820m148j1827L378Q598J518r073j7448N123J3130K98n198
13455a9866P913l587O552K815K599k412j577J1457k362j1545n057J0333K390j0043
$$ plain form
13554 -35075 -38015 -29818 -30922 -34496 -37319 -49160 -41784 -18297 -13307 -15254 -17269 -26048 -38818 -34177
13540 -34177 -23575 -9502 -2782 -3643 -14482 -13017 -3170 1230 -1703 -10143 -12332 -5055 -1148 -6518
13526 -6518 -13835 -11722 -10707 -8020 -9144 -18354 -16232 -9539 -9385 -188 3037 7113 3595 -10641 -14497
13511 -14497 -18733 -16666 -1578 -7327 -10381 -6894 -1512 3251 -12742 -26904 -35395 -34605 -36336 -30576
13497 -30576 -24650 -31807 -34628 -22345 -18418 -22041 -31238 -19677 -7701 -12505 -22064 -22661 -19567 -26149
13483 -26149 -9829 -4404 -3668 -1533 -1229 -7227 -10923 -23588 -30033 -24285 -22589 -17532 -17872 -28050
13469 -28050 -20934 -2397 -4217 -8365 -20192 -16814 -8216 -6698 -15771 -33219 -28096 -14966 -14668 -19866
13455 -19866 -11953 -15540 -8988 -6173 -3574 -5986 -7563 3894 1532 -10013 -15070 -4737 -2347 -12390
13441a2390j2741n01K26K860M364O13k291j650j56L802N464p784j8122o057P641
13426c6722l268M642P210J3597p106L12m820N624l973k778k252M600J8238J4844
13412H148j1001p975j2437R85J840o547q590J7231L989m165n055J5439J7370m057
13398E175j0731p20M15k716m95q678j7002j3595l641K1937R933r02J2981J4741
13384F702P31P86j6575o975k146q580P60P225R519N597J1046q936j2172N286J9195
13369A1463K503l9K288n511j2364o266j0618j955p015j759m121p981M552J0961
13355b5862P119j11M920p922p654J3322J2630l637o214J166K836j5843j638M089
13341b2799o382j0504J1746j5541j774J5052J7600J0646P900O076j5100j1900
$$ plain form
13441 -12390 -25131 -25632 -25406 -22546 -18182 -17569 -19860 -21510 -21666 -17864 -12400 -20184 -38306 -44363 -36722
13426 -36722 -39990 -35348 -28138 -14541 -21647 -21335 -26155 -20531 -24504 -27282 -29534 -24934 -6696 8148
13412 8148 -2853 -10828 -23265 -22280 -20440 -26987 -35577 -18346 -14357 -18522 -23577 -8138 9232 5175
13398 5175 -5556 -6276 -5861 -8577 -9072 -17750 -34752 -48347 -51988 -30051 -20118 -21020 -8039 6702
13384 6702 7433 8219 -8356 -15331 -17477 -26057 -25297 -18072 -8553 -2956 8090 -846 -13018 -7732 11463
13369 11463 13966 13927 16215 10704 -1660 -7926 -18544 -20499 -27514 -29273 -33394 -41375 -36823 -25862
13355 -25862 -18743 -18854 -13934 -21856 -29510 -16188 -3558 -7195 -13409 -12243 -9407 -25250 -26888 -22799
13341 -22799 -29181 -39685 -27939 -43480 -45254 -30202 -12602 -1956 5944 12020 -3080 -14980
13329a4980k117l497K462l28m840J435J783J3369R057R56N06J2617K68M429k656
13314A8464j849k43J0117j42k571o377N563J1504J0085J4781J6221R640J6298
13301A01491J8603r58p222N26M861N185J1711R655K752j856n329j072j5063j0278
13287A13006n376K314M963N339J1000K1373P691j2933j572j474k781p828j0548
13274A23174l166O364L555j0120k2175j2759P78r554o325k6253j7172q665R946
13261B7628P554M88L439L78L982L290K983n652j3867q734k080q645k183l16j3375
13246e110j5499L718J0006N335R245k41L587P00l247p007O83N262j361J0340J1401
13231B7812P950k532o652L476l863J1512J2571J580J3771K2748Q810J3573L4588
$$ plain form
13329 -14980 -17097 -20594 -18132 -18460 -23300 -21865 -20082 -6713 2344 3300 3806 16423 16691 21120 18464
13314 18464 16615 16372 26489 26347 23776 17399 22962 34466 44551 59332 75553 85193 101491
13301 101491 120094 119136 111914 112440 117301 122486 134197 143852 146604 144748 139419 138347 123284 113006
13287 113006 107630 109944 114907 120246 131246 152619 160310 147377 145805 144331 141550 133722 123174
13274 123174 120008 126372 129927 119807 97632 84873 85651 76097 69772 43519 26347 17682 27628
13261 27628 35182 35670 39109 39487 43469 46759 49742 44090 30223 21489 19409 10764 8581 8265 -5110
13246 -5110 -20609 -16891 -6885 -1550 7695 7454 11041 11741 8494 1487 2170 7432 6071 16411 27812
13231 27812 35762 33230 26578 30054 26191 37703 50274 51854 65625 88373 97183 110756 145344
13218A45344M6748L3113M0461M8202O9181J11380J57666K06617K33274K52943
13208A344929K39241K24369J78524J42595R3600L87p8996j49059k11152k55704
13198A528734k52735k31643k35033j98534j45816r7967n9371m5959m6808l6478
13188A78390j9824j5131j5324j2003j2990j5254k3090j7680k358J0292J1158J55
13176F6341k3171j6125j0776J5975J5564q259r821L751J0612P804P781n947j607
13163E2122K609N786J6694M617k568K871N131O630Q696J7744L8445N9488O7268
13150B85533Q4629J05360J14039Q0735N3894M668l9235q9515j08087j01411q6851
13139C03759p9214m8986l7840k9757j3104k1234j2634j2395k1047o962k303k299
$$ plain form
13218 145344 192092 225205 265666 313868 383049 494429 652095 858712 1091986 1344929
13208 1344929 1584170 1808539 1987063 2129658 2223258 2223645 2144649 1995590 1784438 1528734
13198 1528734 1275999 1044356 809323 610789 464973 367006 307635 261676 214868 178390
13188 178390 158566 143435 128111 116108 103118 87864 64774 47094 44736 55028 66186 66341
13176 66341 43170 27045 16269 32244 47808 39549 29728 33479 44091 51895 59676 53729 52122
13163 52122 54731 60517 77211 81828 79260 82131 87262 93892 102588 120332 158777 218265 285533
13150 285533 370162 475522 589561 670296 724190 728858 689623 600108 492021 390610 303759
13139 303759 224545 175559 137719 107962 94858 73624 60990 48595 27548 20586 18283 15984
13127A5984J3936R333r683o309L437O943m407j01n778m61J1795p246j7582j616
13113H245P303p628r975J0059M187j1931o291J7107O151k705K327K909J2357J588
13099C3703O110J1387q569o052k401q048o015l154j1235q489p138J112N190N415
13085A816r91k095j7225l056J332J120J0540p464j8715M760J7804J3004R695L150
13071A3675n002r55P080q555j3180L297J8409K1559P526l583n733m772o229P02
13057B4239K087O231k34K103m461Q556J6559O702R754K2627j057q987l188N03
13043H1434N487K357J7337L8129L3111K7536K5062M1399L5701J2828J7166R572
13031C47119k793k2517k8076k2611m4023m8260l5156k7604j9712n167j5011j5104
$$ plain form
13127 15984 29920 39253 29570 23261 26698 33641 29234 29133 23355 22894 34689 27443 9861 8245
13113 8245 15548 7920 -2055 8004 12191 260 -6031 11076 17227 14522 16849 19758 32115 33703
13099 33703 39813 51200 42631 36579 34178 26130 20115 16961 5726 -2763 -9901 -8789 -3599 1816
13085 1816 825 -1270 -18495 -21551 -20219 -19099 -8559 -16023 -34738 -29978 -12174 830 10525 13675
13071 13675 8673 7718 14798 6243 -6937 -3640 14769 36328 43854 40271 34538 29766 23537 24239
13057 24239 26326 32557 32323 34426 29965 38521 55080 61782 71536 94163 93106 84119 80931 81434
13043 81434 86921 89278 106615 144744 177855 205391 230453 271852 307553 320381 337547 347119
13031 347119 344326 321809 293733 271122 227099 178839 143683 116079 96367 91200 76189 61085
13019F1085l705p021j8818j1606J176Q861p836j4925O962R596J4405O170J7084
13006F1428Q517N665J1256Q719P437J224J9448J8020m467n850n267j8864l599
12993A03667m109m198j4324j2316r12q899r462L960R616K3437J9645J5690r22
12980A20873N607P526P493J1091J5080Q612k730J189l33o090j0765n038p746j3416
12966A31353n359n474n560l418m636o860p468j8619k020j229n992r303q429p979
12952C9007j8883L910m418n646J165p534j938L471O368J2709P504j1398j1845
12939A2472j0701N174o866N266J1492M493R391J6936K385j954Q653J3873J5228
12926H5842J8046K3257J5239J2328K1717J3675L190J8654J9182J2225K9175K8474
$$ plain form
13019 61085 57380 50359 31541 19935 21111 29972 22136 7211 14173 23769 38174 44344 61428
13006 61428 69945 75610 86866 95585 103022 104246 123694 141714 137247 131397 126130 107266 103667
12993 103667 99558 95360 81036 68720 67808 58909 49447 53407 63023 86460 106105 121795 120873
12980 120873 126480 134006 141499 152590 167670 176282 173552 174741 174408 168318 157553 152515 144769 131353
12966 131353 125994 120520 114960 111542 106906 100046 92578 73959 71939 70710 64718 55415 46986 39007
12952 39007 20124 24034 19616 13970 15135 7601 5663 9134 15502 28211 35715 24317 12472
12939 12472 1771 6945 79 5345 16837 21330 30721 47657 50042 48088 56741 70614 85842
12926 85842 103888 127145 142384 154712 176429 190104 193294 211948 231130 243355 272530 301004
12914C01004L4000K2138J1398J0920m425m904j2115k4320l8008l0162l0802l8789
12902A95935l5884k7257k1744j5193j4370p32K981k701P313J1984R025P797J4452
12889A31606N295J366j6187K207r410j969R817L68P725J2125J2707O187P370Q749
12875A77956K3205L2415K9215J3274J1979k422J569J1126l219n978L382J4520
12863C07022J963J660J9319J2694K2923K4763K4034K6190K1243J6473J4897J9625
12851E12806K9385K3482K2682J8315L1048K0735j981O028P496J4817J6224J0053
12839G11090K6956K9686L7293M6753M5644M8034N9808O5300O8812O1136P9057
12828A279569P6013P3078P8275N4269N5473P6377Q7899Q2823R1655J30607J46615
$$ plain form
12914 301004 335004 357142 368540 379460 375035 370131 358016 333696 295688 265526 234724 195935
12902 195935 160051 132794 111050 95857 81487 80755 83736 81035 88348 100332 109357 117154 131606
12889 131606 136901 138267 122080 124287 114877 112908 122725 123093 130818 142943 155650 161837 169207 177956
12875 177956 201161 233576 262791 276065 288044 285622 287191 298317 295098 289120 292502 307022
12863 307022 308985 310645 329964 342658 365581 390344 414378 440568 461811 478284 493181 512806
12851 512806 542191 565673 588355 606670 637718 658453 656472 662500 669996 684813 701037 711090
12839 711090 738046 767732 805025 851778 897422 945456 1005264 1070564 1139376 1200512 1279569
12828 1279569 1355582 1428660 1506935 1561204 1616677 1693054 1780953 1863776 1955431 2086038 2232653
12817B232653J54906J59848J71703K03912K20660K47914K71891K92253L23615
12808D279355L62545M03782M47317N20220O06956P38868R03326J133135J396449
12799A0791953J684276J968118K248648K579506K993050L529818M270036N340982
12791C5406387P097012J0030033J4748269K1869178L1077558L9506841M4121896
12784B03857174M5770164M4079434M0137741L2796829K1286520N308403j3263373
12777C79972892k7119547l6837748m1933837m4601510m4518771m1618352l5448700
12770A07894427k6252055j7764083j1832252q143692n947573m675430l911899
12763B9367443l423210l052610k752867k490946k229006j920767j631108j326161
$$ plain form
12817 2232653 2387559 2547407 2719110 2923022 3143682 3391596 3663487 3955740 4279355
12808 4279355 4641900 5045682 5492999 6013219 6620175 7359043 8262369 9395504 10791953
12799 10791953 12476229 14444347 16692995 19272501 22265551 25795369 30065405 35406387
12791 35406387 42503399 52533432 67281701 89150879 120228437 159735278 203857174
12784 203857174 249627338 293706772 333844513 366641342 387927862 393236265 379972892
12777 379972892 352853345 316015597 274081760 229480250 184961479 143343127 107894427
12770 107894427 81642372 63878289 52046037 43902345 37954772 33279342 29367443
12763 29367443 25944233 22891623 20138756 17647810 15418804 13498037 11866929 10540768
12755A0540768j076586q77518p19963o08008n44004m55387l91700l64344l35555
12746E167703l12818k79237k52599k29650k18384j97581j77051j61264j45764
12737C193355j28427r4094r8885r6502p2368p6440n9099l1921J0658K4824N1601
12726B622702M8970N3915P9334Q7705J07612J27231J47139J53319J46795J31289
12716C706011R4316L6566m1173j25327k05606k54420k76311k82712k76674k59201
12706B115469k05264j56097j12423r0012p6117o5328m9677m4908n8600n2166l9607
12695A165270k8606l4740l5234l6019k8917k2816K23j2211k243l645k1755l664
12683I35643M433J4594J9435M0374L9362L5925O4658P5323Q8272R0618Q6884R5825
$$ plain form
12755 10540768 9464182 8586664 7866701 7258693 6714689 6259302 5867602 5503258 5167703
12746 5167703 4854885 4575648 4323049 4093399 3875015 3677434 3500383 3339119 3193355
12737 3193355 3064928 2970834 2871949 2775447 2703079 2626639 2567540 2535619 2546277 2571101 2622702
12726 2622702 2671672 2725587 2804921 2892626 3000238 3127469 3274608 3427927 3574722 3706011
12716 3706011 3800327 3836893 3795720 3670393 3464787 3210367 2934056 2651344 2374670 2115469
12706 2115469 1910205 1754108 1641685 1551673 1475556 1410228 1360551 1315643 1257043 1204877 1165270
12695 1165270 1136664 1101924 1066690 1030671 1001754 978938 979161 966950 964707 961062 939307 935643
12683 935643 940076 954670 974105 1014479 1053841 1089766 1154424 1229747 1318019 1408637 1495521 1591346
12671A591346O6182K6485l131m5386p5232q8627q7116p5534p2262n1202l2863
12660A152660k2668L228J3351J9878P78k7522j6285l7287o8580o2220o5099o7480
12648H22754o0260o1600o9560n3366m2372k4132q391P17L16J2661K1904K1922
12636E60593M7154P0225O0431N3474N368k2154l1990l2771k5854j9150j1709R952
12624F63569K1205Q755m319J3105K1502J655l33k225m77R672j440j1317L295K736
12610G25383Q633m402n467k2563l2589k6464k6329j7884m282q85l666J1348M665
12597F05498n401N507J0142J487j4790j3150k0626l3133l0983k5835k8948l6452
12585D13316j4295p098j0095j7625q074k932j4996l939J6186N153k375r569P76
$$ plain form
12671 1591346 1657528 1684013 1680882 1635496 1560264 1471637 1384521 1308987 1236725 1185523 1152660
12660 1152660 1129992 1133220 1146571 1166449 1167227 1139705 1123420 1086133 1017553 955333 890234 822754
12648 822754 762494 700894 631334 577968 535596 511464 503073 503790 504106 516767 538671 560593
12636 560593 607747 677972 738403 791877 797245 775091 743101 710330 684476 665326 653617 663569
12624 663569 684774 693529 689210 702315 723817 725472 725139 722914 722437 732109 730669 719352 722647 725383
12610 725383 734016 729614 724147 701584 668995 642531 616202 598318 594036 593151 589485 600833 605498
12597 605498 600097 605604 615746 617233 602443 589293 568667 535534 504551 478716 449768 413316
12585 413316 399021 391923 381828 364203 356129 353197 338201 334262 350448 355601 353226 343657 344433
12572C44433P902q7k023K360m892k619j6213k081o279j5495o026j0593j6986j3138
12558B58263j2042K450q100n98P720J2478q099k828R77m406J1933P891j2864O958
12544B59733n906j5204j7168r991p849j076J470n487j6063j0945r817N881J406
12531A68984Q26q107o321m235L998M643J3695O701M16O844N457J0712Q513J858
12517B13984k597m389K2978K4502l245j9503k5072n375j0053p202O471j0001k3336
12504A57162m418P129M394K633K908K148J5557l262k0975N23j6501j5569J1232
12491A42961J0983o539k124M608l14N57K739P817K132n702l461M786P879J26Q293
12476A74741O839K205l268P981j71P408O78N634J5639K5967L9784K4593K6062
$$ plain form
12572 344433 352335 352248 350225 352585 347693 345074 328861 326780 320501 305006 298980 288387 271401 258263
12558 258263 246221 248671 240571 239973 247693 260171 252072 249244 250221 245815 257748 265639 252775 259733
12544 259733 253827 238623 221455 211464 203615 202539 204009 198522 182459 171514 161697 167578 168984
12531 168984 169810 161703 155382 151147 155145 159788 173483 180184 180600 187444 192901 203613 212126 213984
12517 213984 211387 206998 229976 254478 251233 231730 206658 201283 191230 184028 190499 180498 157162
12504 157162 152744 159873 164267 166900 169808 171956 187513 184251 163276 163799 147298 131729 142961
12491 142961 153944 147405 145281 149889 149575 150132 152871 160688 162820 157118 153657 158443 166322 166448 174741
12476 174741 181580 183785 180517 188498 188327 195735 196413 202047 217686 243653 283437 308030 334092
12463C34092O2175J43500K65314M06435M72356K96618q0528m19489m82932l32829
12453F64712j83113r7627o7057m8966l7099j5802j8728k1274r649l652p19q129
12441A52897O010N51R55P996J3384J9869O18j3729j2825k6110j4746k6941j2520
12428I5409P903Q74o611K276J5470n650j7327r974J5214q50j194m745n018p026
12414G8751O619n375j729O558L140m194K910P525M506P726K566L254k131J4625
12400A24751O216j301j0718J6387J8429J9596L1084M9989P3088M5516k1057o1983
12388B89997p2606m7582j2974j6674K379N237j5600k215o334k4010L287K694o27
12375A04972K831O801K441J7786L907R214Q065M613j068K3383L2643K1138J6345
$$ plain form
12463 334092 396267 539767 805081 1211516 1683872 1980490 1899962 1480473 997541 664712
12453 664712 481599 383972 316915 267949 230850 215048 196320 175046 165397 161745 161026 152897
12441 152897 158907 159458 160413 168409 181793 201662 202280 188551 175726 149616 134870 107929 95409
12428 95409 103312 104186 97575 99851 115321 109671 92344 82370 97584 96734 95540 90795 85777 78751
12414 78751 85370 79995 78266 84824 87964 83770 86680 94205 98711 106437 109003 112257 110126 124751
12400 124751 130967 129666 118948 135335 153764 173360 204444 254433 327521 373037 351980 289997
12388 289997 217391 169809 156835 140161 142540 147777 132177 129962 123628 99618 102905 105599 104972
12375 104972 107803 114604 117045 134831 138738 147952 156017 160630 159562 182945 215588 236726 253071
12362B53071K4181L4309M4008P0118J13006J73256K16469K41240K36424K41924
12352A648006K41044K11407J45331Q8807M04p7858j74603k90069l19081k77383
12342A196005k41036k06997j68307j17515q7346o4229l8657j1532k1391j1125
12332B27870j1167j918K538j3233j7008k7502o821q907l674K33q653m492q763
12319A18503o854J360p416j1351j1429o324j352M866R506L472m724r55l229J9929
12305A04002K9776J6147J9837J7139j2732l4929k7632n093j4025j56J939N473
12293I9746R91j793Q379N557Q752j021L703N12p064p460r568j799j0236p654R291
12278I0336k252m152j004j2869j2259m97J0590J2024J2158Q433O567j0256J791
$$ plain form
12362 253071 277252 311561 355569 425687 538693 711949 928418 1169658 1406082 1648006
12352 1648006 1889050 2100457 2245788 2334595 2334999 2257141 2082538 1792469 1473388 1196005
12342 1196005 954969 747972 579665 462150 374804 310575 271918 260386 238995 227870
12332 227870 216703 214785 217323 204090 187082 159580 152759 143852 140178 140411 131758 127266 118503
12319 118503 111649 113009 105593 94242 82813 76489 75137 80003 89509 92981 88257 87302 84073 104002
12305 104002 133778 149925 169762 186901 174169 139240 111608 106515 92490 92334 94273 99746
12293 99746 100737 98944 107323 112880 121632 120611 124314 124826 117762 110302 100734 98935 88699 81045 90336
12278 90336 88084 83932 82928 70059 57800 57303 67893 79917 92075 100508 107075 96819 98610
12265I8610J414O672j0736N873q636l322p120l260j0962L77J1971o09l617N246
12251H1901R215J904n276o247J9658K4450P690q940o80r959q223n758k609o605
12237I0521r234j112p054J796j264o72m185n529J1808J802j4426K164Q55n87Q770
12222G3653l80M744J6884J9193L711q044o155J425K120j670P216M270j419j786
12208A13762q023r673m532L825k736P332k606j0643p2M303j0082P6J4409M897
12194A00237R894J4125M414k020n583j5650r583k300m576j1926k4049q83J676
12181E3776O703J0939L646m69m84J4905O576N548k665r599m430K669o872L333
12167H3576m606j0644M009J1322P096M838L822L68j1528N284J044o477j4769k383
$$ plain form
12265 98610 100024 106696 95960 101833 93197 89875 82755 79495 68533 68910 80881 80272 76655 81901
12251 81901 91116 93020 87744 81497 101155 125605 133295 124355 123675 113716 105493 99735 97126 90521
12237 90521 81287 80175 73121 74917 73653 72981 68796 63267 75075 76877 62451 64615 65470 64883 73653
12222 73653 73273 78017 94901 114094 117805 109761 103606 105031 107151 105481 112697 116967 115548 113762
12208 113762 105739 96066 91534 95359 92623 99955 97349 86706 86634 90937 80855 80931 95340 100237
12194 100237 110131 124256 128670 126650 121067 105417 95834 93534 88958 77032 52983 52100 53776
12181 53776 60479 71418 75064 74595 74111 89016 95592 101140 98475 88876 84446 87115 80243 83576
12167 83576 78970 68326 72335 83657 90753 95591 99413 99781 88253 93537 94581 88104 73335 70952
12153G0952m033o843Q737J5377k194M25J8334O877q132l172j6607j676o021j318
12139G0706M476l028n963o153j864p76P167K171n535J4478N656J3398R729K189
12125A06651k28M048N492K535N947Q808o52k829j2154j5398r460L899L024r9M600
12110A04184o17N699L427l914o468l27J5700J6411J7941J9026Q581k515M765j0301
12096A71592k0871l181M537o749N97P987M342j0982L69L276J5318j246j9125Q81
12082A46745J3743R508P002l847J2682K3803O688p111k757J4910J8809j0463p610
12069B22102Q146J0657L20j1810J276J0348J6307j8471j3028q345N321P897k467
12056B28253n998q565o372J915R61J2051O02j4201j0390r227l059n183j1702o575
$$ plain form
12153 70952 66919 60076 68813 84190 81996 82421 100755 107632 99500 96328 79721 78045 72024 70706
12139 70706 75182 72154 66191 60038 58174 57398 64565 66736 61201 75679 81335 94733 104462 106651
12125 106651 106423 110471 115963 118498 124445 133253 132601 129772 117618 102220 92760 96659 99683 99584 104184
12110 104184 103567 109266 112693 108779 102311 101984 117684 134095 152036 171062 179643 177128 181893 171592
12096 171592 150721 147540 152077 145328 145925 153912 158254 147272 147641 150917 166235 164989 145864 146745
12082 146745 160488 169996 176998 173151 185833 209636 216324 209213 206456 221366 240175 229712 222102
12069 222102 230248 240905 241225 229415 230691 241039 257346 238875 225847 217502 222823 230720 228253
12056 228253 222255 213690 207318 209233 210194 222245 222847 208646 198256 189029 185970 180787 169085 162510
12042A62510r18P912J2786j5891l967J1510N974l503j2399J695M4K708J1872n437
12028A74896L467M00q759r07j141K696j0755M09j2212j2332q102p442L175m224
12014A19169r48r818j2470j23m639p929p540L126K900l348j7351r782O327J1973
12000F9547o18l429K257j1749m208J467m696r792k602J0076L075Q763j0209j4502
11986C3380n926N478j159J907n777k188l809Q831j780m720P106l262K643j2406
11972A8318k318J2886P57J0604n40l343r858k406P068J1718J1010j187l680l085
11958D5944j73J91Q716p823m464j2366L810M794n242J5741N578n94m062j1984
11944C8066K642R492K253n098k657P132p754j0942O76J1033J9733K787K867K853
$$ plain form
12042 162510 161592 169504 182290 166399 162432 173942 179916 176413 164014 165709 165753 168461 180333 174896
12028 174896 178363 178763 170004 169097 167956 170652 159897 160306 148094 135762 127660 120218 123393 119169
12014 119169 118221 108403 95933 95810 91171 83242 75702 78828 81728 78380 61029 51247 57574 69547
12000 69547 68929 65500 67757 56008 51800 53267 48571 38779 36177 46253 49328 58091 47882 33380
11986 33380 27454 32932 31773 33680 27903 25715 21906 30737 28957 24237 31343 28081 30724 18318
11972 18318 16000 28886 29643 40247 39707 36364 26506 24100 31168 42886 53896 52709 49029 45944
11958 45944 45771 45962 54678 46855 42391 30025 33835 38629 33387 49128 54706 54112 50050 38066
11944 38066 40708 50200 52453 47355 44698 51830 44076 33134 33810 44843 64576 67363 70230 73083
11930G3083L096k051n757k421p242j1028L060q528L908J470r346K560l524J0226
11916D7506J232j7300j3170m983J1167J0776J3349j3106R50m378r633P80J1743
11903C4933l773p150L079k413J70N801p457p272P38P325Q535k0059o84R550Q99
11888B2222L255j013j0456j4824n054J3137M372P805K01n453N571M428m554p552
11874A2085q391O985O680j8940j8310N154O051j651J4152o269j0638M592J457
11861g043R462m50K182m911L503J6240o471q208J2672O557n785o797l030L931
11847A1852r438N437O431l233J724k022j438p804k21P490J044N466O414n474J147
11832A7375Q92l892N119j896O929l769j4591j5578K985R40J1533p18j2048N551
$$ plain form
11930 73083 76179 74128 68371 65950 58708 47680 50740 42212 46120 47590 38244 40804 37280 47506
11916 47506 48738 31438 18268 13285 24452 35228 48577 35471 36421 32043 22410 23190 34933
11903 34933 31160 24010 27089 24676 24846 30647 23190 15918 16656 23981 32516 12457 11773 21323 22222
11888 22222 25477 24464 14008 -816 -5870 7267 11639 19444 19645 14192 19763 24191 19637 12085
11874 12085 3694 10679 17359 -1581 -19891 -14737 -8686 -10337 3815 -2454 -13092 -8500 -7043
11861 -7043 2419 1969 4151 -760 2743 18983 12512 4304 16976 23533 17748 10951 7921 11852
11847 11852 2414 7851 14282 11049 12773 10751 9313 1509 1288 8778 9822 15288 21702 16228 17375
11832 17375 18267 14375 19494 17598 24527 20758 6167 -9411 -6426 -5486 6047 5329 -6719 -1168
11818a168r38n086J5968o3o616J2944k905k252j18J522n09M300P614j1142p335
11803D216K477k500n002m08Q68P178j1969j236O555N067j1125j916J136O737O686
11788F764J2671l579k028j406N56J3197J4859P116Q347p319m514j4944K188m637
11774B7271r056j3651p075j0569r381J3992J3091r673m634q135l20K830l250R907
11760h653O788R953J0833k561p905J330N424m73K225k871L624P932l084q348J194
11745A5408J666o918n637K92Q183r756k961N383J0684m192j661m801J112K899
11731I701J607j897l838L568N280O147l280J894n527o417l315J31m533R427l445
11716E503p12N93p604l438R23M923m978r034J0338R682k289J3214q328j943l007
$$ plain form
11818 -1168 -2106 -7192 8776 8713 2097 15041 12136 9884 9766 11288 10779 15079 22693 11551 4216
11803 4216 6693 4193 -809 -1217 -349 6829 -5140 -6376 179 5246 -5879 -7795 -6659 78 6764
11788 6764 19435 15856 13828 12422 12978 26175 41034 48150 56497 49178 44664 29720 31908 27271
11774 27271 18215 4564 -2511 -13080 -22461 -8469 4622 -5051 -9685 -17820 -18140 -15310 -18560 -8653
11760 -8653 -1865 8088 18921 16360 8455 9785 15209 14736 16961 14090 17714 25646 22562 14214 15408
11745 15408 17074 10156 4519 4811 12994 3238 277 5660 16344 12152 10491 5690 6802 9701
11731 9701 11308 9411 5573 9141 14421 20568 17288 19182 13655 7238 3923 4054 -479 8948 5503
11716 5503 4791 5384 -2220 -5658 -4735 188 -4790 -13824 -3486 6196 3907 17121 8793 6850 3843
11701C843l076K847M458L387O549j8054j1411J1261n002o932J4692j0256J2921
11688E227p1k829P05m782p986N524J524q4O46k519J2440O749p171M309l790j1336
11672c444m783n00Q422N369j84J1253m719j4640O990q00K869R159J4532n923M433
11657B8034Q815o377j1241K554O942j5733j4033Q908o231K314L447j3341N37J2812
11643G407J2260J5119q696l594J1755J1489M272j0662N053J0706n924q958M558
11630D4785M426P44j507r743j4045j4166j3848J4844J5407j714m484j2012n169
11617C518J3118J5246j1200o034J783P499j4638K89J0413O075R472j5069j7569
11604B903j951m01Q596O472O18l749K317k212l134j598k356m386k867O081Q523
$$ plain form
11701 3843 767 3614 8072 11459 18008 -46 -11457 -196 -5198 -12130 2562 -7694 5227
11688 5227 5156 2327 3032 -1750 -9736 -4212 -2688 -2772 -2126 -4645 7795 14544 7373 11682 7892 -3444
11672 -3444 -8227 -8727 -305 5064 4880 16133 11414 -3226 3764 2964 5833 14992 29524 23601 28034
11657 28034 36849 30472 19231 21785 28727 12994 -1039 7869 1638 3952 7399 -5942 -5405 7407
11643 7407 19667 34786 26090 22496 34251 45740 50012 39350 44403 55109 49185 40227 44785
11630 44785 49211 49955 48448 38705 24660 10494 -3354 11490 26897 25183 20699 8687 3518
11617 3518 16636 31882 20682 14648 16431 23930 9292 9581 19994 26069 35541 20472 2903
11604 2903 952 551 9147 15619 16237 12488 14805 12593 9459 7861 5505 1119 -1748 4333 12856
11589A2856J019j004j0478r350k244Q591K630p47p541j050J5252j435P838j0033
11575D304r448R04q015J7495l462n460j099J1839n713Q022J1376o843j5088P788
11561F600k008J502J142j3373n144l576L548J0269J1983k1m479p184r77r59p393
11546a0070Q06L996n504L681L978l397m148m143k055P774J409L878q922q901P26
11531b0892M682J4827Q184Q344j8285p243k280J872L77J3776J3008j49R15j706
11517A5430j3944j2238j0601O459K402R731j714o437n950K858P715N177q52J0229
11503H265n598r610K330L685j1033p764O43O303K786k059k411O947P643l138L25
11488b686l333j884l152n415p538M355J4708J4974Q692j2767o682j1202o802j0512
$$ plain form
11589 12856 13875 12871 2393 -6957 -9201 -610 2020 1273 -6268 -7318 7934 6499 14337 4304
11575 4304 -5144 -4240 -12255 5240 1778 -3682 -4781 7058 1345 9367 20743 13900 -1188 6600
11561 6600 4592 6094 7236 -6137 -11281 -14857 -11309 -1040 10943 10922 6443 -741 -1718 -2677 -10070
11546 -10070 -9264 -5268 -10772 -7091 -3113 -6510 -10658 -14801 -16856 -9082 -7673 -3795 -12717 -21618 -20892
11531 -20892 -16210 -1383 6801 15145 -3140 -10383 -12663 -10791 -10414 3362 16370 16221 17136 15430
11517 15430 1486 -10752 -21353 -14894 -12492 -2761 -4475 -10912 -16862 -14004 -6289 -1112 -1964 8265
11503 8265 2667 -6943 -4613 -928 -11961 -19725 -19082 -12779 -9993 -12052 -14463 -7516 127 -3011 -2686
11488 -2686 -6019 -7903 -11055 -16470 -24008 -19653 -4945 10029 18721 5954 -728 -11930 -18732 -29244
11474b9244M77N750O115j779N9Q742J1960p947q060O07k517n654M282N229l120
11459a5100L983J0800J678P631l549L033j385m357o655l797N144K128J5678O391
11445B1623j1671p988O583o615J937l372J686N4p059j069M69k176P455R265J6735
11430B5857r225M233j1032q595N931m41j0797n1J330j894j479j5968m972J1949
11416a5154J6363J0347N448o011j7960q033N999l638P363J0382m459K673q632
11403e312m558P215j721o786L157Q959J7179R838n481p187n564l419j057p228
11389a965j8288o594k211N007J6111O828L749o145j1463m359P247P746R364k39
11375D788k132l591L070q640J195K3175M228j2966m513J922j946p404k11j4872
$$ plain form
11474 -29244 -28767 -23017 -16902 -18681 -18622 -9880 2080 -5867 -13927 -13320 -15837 -21491 -17209 -11980 -15100
11459 -15100 -11117 -317 1361 8992 5443 8476 7091 2734 -3921 -7718 -2574 -446 15232 21623
11445 21623 9952 1964 8547 1932 3869 497 2183 2237 -4822 -5891 -5422 -7598 -143 9122 25857
11430 25857 16632 20865 9833 1238 7169 6728 -4069 -4120 -2790 -4684 -6163 -22131 -27103 -15154
11416 -15154 1209 11556 17004 10993 -6967 -15000 -9001 -12639 -5276 5106 647 3320 -5312
11403 -5312 -9870 -2655 -4376 -11162 -8005 954 18133 27971 22490 15303 9739 6320 5263 -1965
11389 -1965 -20253 -26847 -29058 -24051 -7940 -1112 2637 -3508 -14971 -19330 -12083 -4337 5027 4788
11375 4788 2656 -935 2135 -6505 -5310 17865 22093 9127 4614 6536 4590 -2814 -3025 -17897
11361a7897m432R638K779n140l087O407p96J0184J0249M739p165j9338P70J7841
11347D752K987J76j0157j150J5993P427K955p106j8397j2285L318L371j609L547
11333f178Q436J4381p229q423J5402J4406j1815j7378p091j1284J946L095K318
11320i414J324n921m237m941P368m68l231O42P649P166P345L707p086J157J5308
11305A6368k065m903J3712J5848j0001o891j440l055o250P4o866p70R76p966q516
11290a1745K891P168L677R958J2407J3891o242j4465q159j0147n606l604J3565
11277C589O611m329r068n761J772O712j75O35P726k867m461l585k340j632l633
11262a0806P605m051j1059O034j27j3931J964J9609p63O802K006J676m811q670
$$ plain form
11361 -17897 -22329 -12691 -9912 -15052 -18139 -11732 -12528 -2344 7905 12644 5479 -13859 -13089 4752
11347 4752 7739 7915 -2242 -3392 12601 20028 22983 15877 -2520 -14805 -11487 -8116 -9725 -6178
11333 -6178 2258 16639 9410 987 16389 30795 18980 1602 -5489 -16773 -14827 -11732 -9414
11320 -9414 -8090 -14011 -18248 -23189 -15821 -16289 -19520 -18878 -11229 -4063 3282 6989 -97 1060 16368
11305 16368 14303 9400 23112 38960 28959 22068 20628 17573 11323 11397 4531 3761 4737 -3229 -11745
11290 -11745 -8854 -1686 1991 11949 24356 38247 32005 17540 9381 -766 -6372 -9976 3589
11277 3589 10200 5871 -3197 -8958 -7186 -474 -649 -14 7712 4845 384 -3201 -5541 -7173 -10806
11262 -10806 -3201 -7252 -18311 -12277 -12404 -26335 -24371 -4762 -5525 1277 3283 4959 148 -8522
11248h522j3331K247k051J197J4716Q538K187J269L117r681J289K21k84m875n297
11233i260J0775J7394L557o108K072R337k505j935L280j3195n082n674p609l563
11219h516K045K806j635K070L280m55K865o336j1757M728J1172k916P99Q378J4781
11204B1309o692k1687O473k420l506q989o261m72N545n876K3k718j460J6310J1300
11189H79p85M035M45L754J3738Q748j1495j5823l06l785L438P90J2160l192j2554
11174D7P295q73k175Q991J1276N476N080k306n703L056o894j2584N839J4239l082
11159B7682l576l332l233j4339l941r25l357L897k607J745R888P401l512k858
11145H933k2017n027J1467J7227l529K002q185O2N506k815N959M178O967K456
$$ plain form
11248 -8522 -21853 -19606 -21657 -20460 -5744 2794 4981 6250 9367 -314 975 1196 912 -3963 -9260
11233 -9260 1515 18909 22466 16358 18430 27767 25262 23327 26607 13412 8330 2656 -4953 -8516
11219 -8516 -6471 -3665 -5300 -3230 50 -405 2460 -3876 -15633 -10905 267 -2649 -1850 6528 21309
11204 21309 14617 -7070 -597 -3017 -6523 -15512 -21773 -22245 -16700 -22576 -22553 -25271 -26731 -10421 879
11189 879 94 4129 4574 8328 22066 30814 19319 3496 3190 -595 2843 3633 15793 12601 47
11174 47 7342 6469 4294 13285 24561 30037 35117 32811 27108 30164 23270 10686 16525 30764 27682
11159 27682 24106 20774 17541 3202 -739 -1664 -5021 -1124 -3731 -1986 7902 15303 11791 8933
11145 8933 -13084 -18111 -6644 10583 7054 9056 871 933 6439 3624 9583 13761 20728 23184
11131B3184J1700K286J512k18j1462n279p680n025L03q950M047J359k297p168
11117c688q44J4346K634q726q1K913L064M129M351J7555m770m260m044J7691J7362
11102E7632q127j7142q798P144M697j0394j0665N979j2044M937J2111K730k957
11089B5103Q19l534p161K24J8438k60J268j253j6400n007Q077K1577R268J1918
11075F3077o4j868j1086n868L920n731k981L490M860J0885n660m298qK697j2704
11060C8661R63J1814K080l214p553Q976P485p664j3634J1222R676J1089L229N233
11046G8363K0328K1219J0856M455k1617l6691j6365k657J0022M093J609J3681
11034H7296j051r681j6163K423j1101j04M423O96p933l325N283K279j911L070
$$ plain form
11131 23184 34884 37170 38682 38464 27002 21723 14043 9018 9321 371 4418 5777 3480 -3688
11117 -3688 -4532 9814 12448 3722 3641 6554 9618 13747 18098 35653 30883 26623 22579 40270 57632
11102 57632 49505 32363 23565 30709 35406 25012 14347 20326 8282 13219 25330 28060 25103
11089 25103 25922 22388 15227 15451 33889 33629 34897 33644 17244 12237 20314 41891 51159 63077
11075 63077 63013 61145 50059 44191 48111 42380 39399 42889 47749 58634 52974 48676 48668 51365 38661
11060 38661 39624 51438 53518 50304 42751 51727 59212 51548 37914 49136 58812 69901 73130 78363
11046 78363 98691 119910 130766 135221 113604 76913 60548 57891 67913 72006 73615 87296
11034 87296 86245 76564 60401 62824 51723 51619 56042 56738 48805 45480 50763 53042 51131 54201
11020E4201J2142J5982m328j1987o504p8O996M954q454r530j4321M702K22J239
11006D5236j6749p144J3177O675J1L812R057K134j267o092j181J0895K975j0808
10992E0731Q437n094p305j9412N636P498j671k450j0013J399J277R484r985k090
10978B6442J6944k09j1446n156j5151m342N296j014K239L510p5q19J1052p35M76
10963B7012L511R361L929l021p605q301j382n560J1106J3575N976l126n66k010
10949D2899j5642j1442o266R566J978L44n187l207Q900M064j7732j3103J0128
10936E300J4316l041r875o977N540N133m208j334K022R942P084l059N576P421
10922C3840J474J1549q577l547L742M272J3873M135j0693l849K282L802J838r895
$$ plain form
11020 54201 66343 82325 77997 66010 59506 59428 66424 71378 62924 53394 39073 43775 43997 45236
11006 45236 28487 21343 34520 41195 41206 45018 54075 56209 54942 48850 47669 58564 61539 50731
10992 50731 59168 54074 46769 27357 32993 40491 38820 36370 26357 27756 29033 38517 28532 26442
10978 26442 43386 43177 31731 26575 11424 7082 12378 11364 13603 17113 17038 16219 27271 26536 27012
10963 27012 30523 39884 43813 40792 33187 24886 23504 17944 29050 42625 48601 45475 44909 42899
10949 42899 27257 15815 9549 19115 21093 21437 16250 13043 21943 26007 8275 -4828 5300
10936 5300 19616 16575 6700 -277 5263 10396 6188 4854 6876 16818 23902 20843 26419 33840
10922 33840 35314 46863 38286 34739 38481 42753 56626 60761 50068 46219 48501 52303 54141 44246
10908D4246j2131J1867O766L508J35R413k071M961l967J7768K4936K3126J5724
10895A44281n983k9819k1392k2011p752o552Q22j3719n310N095K150K898l475
10882C9233l619J2817m749j1042J863J2963L728p63o901N384N30r880L652O756
10868D9972k662Q311J4064R064M455p447N222Q747L037N825J6246O044p495K1819
10854A35202N1130P9966Q7202L9007k9845q3164q2124o6680l2092q179j5393j1481
10842F3549L247j435q823n51l128j4448r147n722P914J9739O469P89j4672q769
10828C5012r32q467p468J0381N327J893J2061Q566k138r753j432k86J1008P311
10814F1083K811L104J7891L4179K9735M0296P0933R1156M9597k4049q8559q5087
$$ plain form
10908 44246 32115 43982 50748 54256 54391 63804 61733 66694 62727 80495 105431 128557 144281
10895 144281 138298 108479 87087 65076 57324 50772 51594 37875 32565 37660 39810 42708 39233
10882 39233 35614 48431 43682 32640 34503 47466 51194 50431 43530 48914 49444 39564 43216 49972
10868 49972 47310 55621 69685 78749 83204 75757 80979 89726 92763 98588 114834 120878 113383 135202
10854 135202 186332 266298 353500 392507 362662 279498 197374 130694 98602 90423 75030 63549
10842 63549 66796 65361 56538 55987 52859 38411 29264 23542 31456 51195 57664 58453 43781 35012
10828 35012 34080 25613 18145 28526 33853 35746 47807 56373 54235 44482 43050 42764 53772 61083
10814 61083 63894 66998 84889 119068 148803 189099 260032 351188 400785 376736 288177 203090
10802B03090n4127m2988l2558j2806n660L762n469l100k514k533j2839j4362l698
10789A4198N127J1438R677r89K90j2799n317n98M620l010J0155K914N109q019
10775C2796n682J0258N881j693o18J6094J0085Q341K887J1589O199O248L2049
10762A34434K5068O154j3817l4986l6724k2966q447j0598j29n657q657P766n64
10749C0877l209j2043k658J1000o634j0650j0486Q300J1148n057r817R480J5916
10736B6167O687N351o574n018n608k733J123L70k635j1889k595l222j5611L153
10722a3034O794R553k307Q61J1599n409n527J42n965M835j2844n989m989K647
10708a9633J2825M633J2719r853j2812K37O202J169R757k775j2025l151J2117
$$ plain form
10802 203090 148963 105975 73417 60611 54951 58713 53244 50144 47630 45097 32258 17896 14198
10789 14198 19325 30763 40440 39451 39741 26942 21625 21027 25647 22637 32792 35706 40815 32796
10775 32796 27114 37372 43253 41560 40942 57036 67121 75462 78349 89938 96137 102385 134434
10762 134434 159502 165656 151839 116853 80129 57163 48716 38118 37989 32332 23675 31441 30877
10749 30877 27668 15625 12967 23967 17333 6683 -3803 4497 15645 10588 771 10251 26167
10736 26167 32854 38205 31631 26613 21005 18272 19395 19765 17130 5241 2646 -576 -16187 -13034
10722 -13034 -6240 3313 1006 1867 13466 8057 2530 2672 -3293 1542 -11302 -17291 -22280 -19633
10708 -19633 -6808 -2175 10544 691 -12121 -11884 -5682 -4513 5244 2469 -9556 -12707 -590
10695e90K0150P15K621P95j843j42o609O525J712n003j169j5335n175j063O85
10680c726J553j0325n109J4078K354n688j979K617K17m036j1216O332J0510N661
10666A243K114O952Q626L705q549n132J818M807R909m02p522j1242r779n777j0385
10651a9614P47o561M15K1886J6134J2181k522L461j4148o3J1711N721o004P22
10637B4066J3528l587N542m930j0886o167k099N292R080j3003j7241j237J0936
10624I294p732m096O780J9724P140J4042J2720K4359L0548K1146o501N950j7957
10611A15417k6939j3646q591j5663j4725p305J4873o529j2646q640L018O150N062
10598B9836q477j6581j3064N850O756J0793J698q190o745n299l874l956J6969
$$ plain form
10695 -590 19560 20275 22896 23691 21848 21706 15097 21622 23334 18331 17162 1827 -3348 -4411 -3726
10680 -3726 -2173 -12498 -17607 -3529 -1175 -6863 -8842 -6225 -6008 -10044 -21260 -14928 -4418 1243
10666 1243 3357 10309 18935 22640 14091 8959 10777 15584 25493 25091 17569 6327 -3452 -9229 -19614
10651 -19614 -18867 -25428 -25013 -3127 13007 25188 22666 26127 11979 11916 23627 29348 23344 24066
10637 24066 37594 34007 39549 34619 23733 17566 15467 20759 29839 16836 -405 -1642 9294
10624 9294 1562 -2534 4246 23970 31110 45152 57872 82231 112779 133925 127424 133374 115417
10611 115417 88478 74832 66241 50578 35853 28548 43421 36892 24246 15606 18624 24774 29836
10598 29836 21359 4778 -8286 -2436 4320 15113 16811 8621 1876 -3423 -7297 -11253 5716
10585E716k428j8349M835Q189j1031m911J8406J4310J377j0649j5879o666J6720
10572c60L75J018J1686L085m843M486L091m326k2354j4432m419K618J2761J2146
10558E32n72n003M408k816N967k970j0711M91J5362J2400J2393J239j8720p569
10544D431n0N895l813q855q870q002J2153J0682j1450n637J4169N668j71l74R007
10529A4783P698q026K374j049j4407N564P36N095n209j521n925p376O411P303
10515F451J5896J4062j154n982j103l363l52J5794R830P981l26q447q129j7335
10501B3823j2391l189N16j2587p965N594o18K465K202o543M748N473j35o389K159
10486b837q167m33O508J0812N996M124j880N281o821j0373j2384K308R38K660
$$ plain form
10585 5716 3288 -15061 -10226 -2037 -13068 -17979 427 14737 16114 5465 -10414 -17080 -360
10572 -360 15 1033 12719 15804 10961 15447 18538 14212 -8142 -22574 -26993 -24375 -11614 532
10558 532 -40 -5043 -635 -3451 2516 -454 -11165 -10674 4688 17088 29481 30720 12000 4431
10544 4431 4381 10276 6463 -2392 -11262 -19264 -7111 3571 -7879 -13516 653 6321 6150 5776 14783
10529 14783 22481 14455 16829 15780 1373 6937 7673 12768 7559 6038 113 -7263 -852 6451
10515 6451 22347 36409 35255 29273 28170 24807 24455 40249 50079 58060 57734 49287 41158 23823
10501 23823 11432 8243 8759 -3828 -11793 -6199 -6817 -4352 -2150 -8693 -3945 1528 1393 -4996 -2837
10486 -2837 -11004 -11437 -4929 5883 11879 16003 14123 19404 12583 2210 -10174 -7866 -6928 -4268
10472d268L939p36j782l043R792j603k557J3651O488M216J9775K8252M2991O1128
10458A76243R1796J04275N0895l8649r6089r4986p0043m4716l3755j9348q111
10447A7512j1166j0297M284J6905l091n347K788j332j843J0827K450o929K821
10434A7582q480Q408O07R135Q822n412l387O64q667j0159n700M961l065O52L904
10419I865J1567L612k832J3732K01q631J026J4979p050j7985j441j57K7977K4372
10405F9235M99J523m085K704K574K944J7915J3360O55J4439J5065J2279N026J7616
10391A71749L7862L6567L9878L0364L6109M5614M6079N8384Q2784J38961J81707
10380I06058K52094L88457N56688P40037Q35425Q98408R20660Q53185P45757N49686
$$ plain form
10472 -4268 -329 -1065 -2847 -5890 3902 2299 -258 13393 19881 24097 43872 72124 115115 176243
10458 176243 268039 372314 423209 384560 288471 193485 123442 78726 44971 25623 17512
10447 17512 6346 -3951 333 17238 14147 8800 11588 10256 8413 19240 21690 14761 17582
10434 17582 9102 17510 18117 27252 36074 30662 27275 27939 19272 9113 3413 8374 5309 5961 9865
10419 9865 21432 25044 22212 35944 36145 27514 28540 43519 36469 18484 17043 16886 44863 69235
10405 69235 69734 71257 67172 69876 72450 75394 93309 106669 107324 121763 136828 149107 154133 171749
10391 171749 209611 246178 286056 316420 352529 398143 444222 502606 585390 724351 906058
10380 906058 1158152 1546609 2103297 2843334 3678759 4577167 5497827 6351012 7096769 7646455
10370G646455K73945j37512m63069o77780q31658q93234r15209q55001p59432
10361B387505o43311m53331k69329j77266j28912q4910o3232o5472m7384m1782
10351D12576l7946l8822m2400l3521j5351k8221k5634j1763j2861j5269j6472
10340A34316j4292j3815r211j2229j0047K382N427j2188l692M970r065l605O050
10327F5001j039o40k345K309J11M997J0422L179J43q017o234j060n326m692J961
10312E8770m19r443k917K626r261M066N607R86p92r687j2596q055m101j18k096
10297A2570J128K52r94J361J0175q850J799R091q044r571m616J6217K013J0677
10283C3208J827o246M081p262j6231m417j778R972N225L033J21p126O946J1249
$$ plain form
10370 7646455 7920400 7782888 7319819 6642039 5810381 4917147 4001938 3146937 2387505
10361 2387505 1744194 1290863 1021534 844268 715356 630446 567214 501742 454358 412576
10351 412576 374630 335808 293408 259887 244536 216315 190681 178918 166057 150788 134316
10340 134316 120024 106209 96998 84769 74722 77104 82531 70343 66651 71621 62556 58951 65001
10327 65001 63962 63322 60977 63286 63397 68394 78816 81995 82138 74121 67887 66827 61501 56809 58770
10312 58770 58351 48908 45991 48617 39356 43422 49029 50015 49223 39536 26940 18885 14784 14666 12570
10297 12570 13698 13950 12956 14317 24492 15642 17441 26532 18488 8917 4301 20518 22531 33208
10283 33208 35035 28789 32870 25608 9377 4960 3182 13154 18379 21412 21533 14407 21353 32602
10269C2602J7067J1106q084j3393j0165m105J002P986K97O601R569j676J069o065
10255D3811K531L98J333n79k858J1874J4306q889l757M259l073J480O361J963
10241F9160j2491j5983m103L368p322k0949L182J5387M225o838K232Q091q336
10228B9623J117M821j3234j0651j512j34N321l99J1011P046O85J8857M498r145
10214D7904J376o119p752m041p921P95J674M744L466j2008j1103r285j157J1415
10200A1988Q600J52N127M67l032J92J0002q307l054J0847j203n366Q746J14R197
10185D4470k438r026k750N193j472o738j0131J42j2095j6346n637R001P419N226
10171D818Q82j3768L755J1430K267J555J917R43L111q698L152Q120M26j917J427
$$ plain form
10269 32602 49669 60775 52691 39298 29133 25028 26030 34016 34313 40914 50483 48807 49876 43811
10255 43811 46342 46740 48073 47494 44636 56510 70816 61927 58170 62429 59356 60836 67197 69160
10241 69160 56669 40686 36583 39951 32629 11680 14862 30249 34474 27636 29868 37959 29623
10228 29623 30740 35561 22327 11676 10164 10030 15351 14952 25963 33009 33694 52551 57049 47904
10214 47904 49280 43161 35409 31368 23447 24242 25916 30660 34126 22118 11015 1730 573 11988
10200 11988 20588 20740 25867 26334 23302 23494 33496 25189 22135 32982 31779 26413 35159 35273 44470
10185 44470 42032 33006 30256 35449 33977 27239 17108 17250 5155 -11191 -16828 -7827 -408 4818
10171 4818 5700 -8068 -4313 7117 9384 10939 12856 13799 16910 8212 11364 19484 19910 17993 19420
10156A9420n834j0911O393k158l0O476m236l477k905j6631O0L103j663p042n742
10141b5177M602J044J3166J2530L985J0092R663n382n771j5880m410O928o232
10128h42j8164p404O97J110K7708j253p233Q666K3085j3484j0070L199O883M31
10114A3329l338P136l68j5519q107M926P195j3112O880N756P592O63j1135M469
10100F367J4403j0948j8244k557J4265J2716p453j1877L261P445J442J570K873
10087A3263J102j22j624k881N798K1717J7379M51J6044J1889j5532p163m184k258
10073E3879R632J059k638k3891k5545m582j333J0611m825j6095k1334Q992K7254
10060A1184J2486p459m005P766K317n403j1002q0p502J268N158m23k159J846O899
$$ plain form
10156 19420 13586 2675 9068 6910 6880 13356 9120 5643 2738 -13893 -13833 -10730 -12393 -19435 -25177
10141 -25177 -20575 -19531 -6365 6165 10150 20242 29905 24523 18752 2872 -1538 5390 -842
10128 -842 -19006 -26410 -25713 -24603 3105 1852 -5381 3285 26370 12886 2816 6015 12898 13329
10114 13329 9991 17127 16759 1240 -6867 -1941 5254 -7858 -978 4778 12370 13033 1898 6367
10100 6367 20770 9822 -8422 -10979 3286 16002 8549 -3328 -67 7378 8820 10390 13263
10087 13263 14365 14243 12619 9738 15536 37253 54632 55083 71127 83016 67484 60321 56137 53879
10073 53879 63511 64570 61932 38041 12496 7914 6581 17192 12367 -3728 -25062 -16070 11184
10060 11184 23670 16211 12206 19972 22289 16886 5884 5804 -1698 -430 4728 4305 2146 3992 10891
10045A0891j1n106j1570o405Q635L481m125j0431q936R709P782J229r522N6K410
10030a1913P207N769k050K174j140O254L764j570l155j2637k0211j2183N021J8065
10016a6605M189p938R892Q485m10O678j1914Q514O195K623K191j3451o012L256
10002d307O894J2147p188o344J1961K666p442M544j215O310J4477M315j2334l548
9988B0936o465n399k297m046n939n96N860n53M327N053K090J865P709M806N759
9973C3110M159l936k624J960O269j075p479K58J1531j852j8921j0161m15J0766
9959B1590Q804j876P12J4648l498j5321k434j729L751r557l702Q826k619K546
9945B0141Q631r808l978k621l111j241o537l799P094N655J749pK396J105L927
$$ plain form
10045 10891 10880 5774 -5796 -12201 -3566 -85 -4210 -14641 -23577 -13868 -6086 -4857 -14379 -14323 -11913
10030 -11913 -4706 1063 -987 1187 47 6301 10065 8495 5340 -7297 -27508 -39691 -34670 -16605
10016 -16605 -12416 -20354 -10462 -1977 -2387 4291 -7623 891 7086 9709 11900 -1551 -7563 -4307
10002 -4307 2587 14734 7546 1202 13163 15829 8387 12931 11716 18026 32503 36818 24484 20936
9988 20936 14471 9072 6775 2729 -3210 -3806 2054 1501 5828 10881 12971 14836 22545 27351 33110
9973 33110 37269 33333 30709 32669 38938 37863 30384 30642 42173 40321 21400 11239 10824 21590
9959 21590 30394 28518 29230 43878 40380 25059 22625 20896 24647 15090 11388 20214 17595 20141
9945 20141 28772 18964 14986 12365 9254 8013 1476 -2323 4771 10426 12175 12168 14564 15669 19596
9930A9596R370jj1001p26n762o632P831J732N995M509o712N563R441J676j0652
9915B4227q582J0448R743R316K1440Q88l393j080K2663K5745K8690K4552L3295
9902A97952L1475K5969J4718J7638L800J1308L1050K2748L0894L3195K5021j910
9890D43858j5890l6884k8064k4772j9462k3325j0418k5923l5811j6295k7026l2475
9878A47513r633q460k0641j4787l540l996j7270j5389m599J74L58l704j0087j915
9864C4024J3873j0566p985j305R744j4299j583N738J0462j109n199P682J421J951
9850D2849k779l564o743k430k149l068l903r28O252q361j762R616j1700p056n845
9835a571J949L787m526J1388M259j326P809J6999Q043o139p5K608k720k1461K060
$$ plain form
9930 19596 28966 28965 17964 17238 11476 4844 12675 14407 20402 24911 18199 23762 33203 34879 24227
9915 24227 15645 26093 35836 45152 66592 67480 64087 63007 85670 111415 140105 164657 197952
9902 197952 229427 255396 270114 287752 291552 302860 333910 356658 387552 420747 445768 443858
9890 443858 427968 391084 363020 338248 318786 295461 285043 259120 223309 207014 179988 147513
9878 147513 137880 129420 108779 93992 90452 86456 69186 53797 49198 49372 49730 46026 35939 34024
9864 34024 47897 37331 29346 28041 37785 23486 21903 27641 38103 36994 31795 39477 40898 42849
9850 42849 40070 36506 29763 27333 25184 22116 18213 17285 23537 15176 13414 23030 11330 4274 -1571
9835 -1571 378 4165 -361 11027 15286 13960 21769 38768 46811 40672 40597 43205 40485 19024 21084
9820B1084k409Q202O293l698l456l120l262O089L979j5119N812J2686j1304K292
9806B4069K2923J2425N436j1060Q95J1028J0659Q082l662p010l428K442J2196
9793H4995J0112k283p197p294j6992J886J8857l604l326j3714n292o157j1335
9780C8656M95j422n637M114J1916O384j17L269O253K371l326j182J2007J0034
9766H3815J5960J2138J333J2562J1916j255j6997r969n030j2368j2655n578K473
9753G6345P748P81L548j9335o626M256n959m432J394R774R248o219j3003q422
9739D9098j0628q195Q175j469N678K425J2590R125j622J2580J0479p976p667j2478
9725F0115j0213m77L82M729p881r111J0917p22n174j1309o693M747Q789N816Q641
$$ plain form
9820 21084 18675 26877 33170 29472 26016 22896 19634 25723 29702 14583 20395 33081 21777 24069
9806 24069 46992 59417 64853 53793 54688 65716 76375 84457 80795 73785 70357 72799 84995
9793 84995 95107 92824 85627 78333 61341 63227 82084 78480 75154 61440 56148 49991 38656
9780 38656 39151 37729 32092 36206 48122 54506 54389 57658 63911 66282 62956 61774 73781 83815
9766 83815 99775 111913 113246 125808 137724 136469 119472 109503 104473 92105 79450 73872 76345
9753 76345 84093 84874 88422 69087 62461 66717 60758 56326 57720 67494 76742 70523 57520 49098
9739 49098 38470 30275 38450 36981 42659 45084 57674 66799 65177 77757 88236 80260 72593 60115
9725 60115 49902 49425 49807 54536 46655 37544 48461 47739 42565 31256 24563 29310 38099 43915 52556
9710E2556l701K486p304j0138j933Q024L524j0252K993P972M507k683P702m112
9696D9641J937J1862Q538N800P212p57k109J243j4078r224n732j8910k843L925
9682C6505R647M970R382J0127p78r180k952q751l346R011M085K0147J261L71n327
9667G5172J350j038j0182J3128N963Q418R200k611n755L379J447L774j160K818
9653A03903m131m722n582o688L215j571Q483J5739R375n36j1426R023J0453J3512
9639A39047P960l772P838J3961O655L081m984J0206K1522J0750J1000K4338K0993
9626B68595K5859N0731M8659N6361N5894N9828M2373O0852M4566K1859j555k7148
9614G06874l2213n3446o8674n5166m3551n2316l9404k5130k5614k9557k3084o447
$$ plain form
9710 52556 48855 51341 44037 33899 31966 39990 43514 33262 36255 44227 48734 46051 53753 49641
9696 49641 51578 63440 71978 77778 84990 84233 82124 83367 69289 60065 54333 35423 32580 36505
9682 36505 46152 51122 60504 70631 69853 60673 57721 48970 45624 54635 58720 78867 80128 80499 75172
9667 75172 76522 75484 65302 78430 84393 92811 102011 99400 93645 97024 98471 102245 101085 103903
9653 103903 99772 95050 89468 82780 85995 84424 92907 108646 118021 117485 106059 115082 125535 139047
9639 139047 147007 143235 151073 165034 171689 174770 169786 179992 201514 212264 223264 247602 268595
9626 268595 294454 345185 393844 450205 506099 565927 608300 669152 713718 735577 734022 706874
9614 706874 674661 621215 552541 497375 453824 401508 362104 336974 311360 281803 258719 252272
9602B52272j648n444j3252j1621j2372k346j0697j1549K167P432J0512l784j408
9589A98262k193m461J498K997j135j5483r668R908j3961j2298m287J640O591M490
9575A61900N696k092j1833J286L019n787L47j2686m145L840L295J0768j462l893
9561A48253J880R830L799R37m264k446k306q811q584p956j8826o887R395J7309
9547A31323M283o511m967j4J736J558P751K148J0900N194j796j38j4345o313M501
9532A35310K50j329n40k854j1486j1297j75j496r333q127J999N609K553j804M653
9517A01933M787k625K185j3881m093k828k775j739j4844p950O644L579P443L225
9503G9061k31q825R455R00l192k743K031P728K872K405M498j2911J462Q527J0312
$$ plain form
9602 252272 250624 245180 231928 220307 207935 205589 194892 183343 185510 192942 203454 199670 198262
9589 198262 196069 191608 193106 196103 194968 179485 169817 179725 165764 153466 149179 150819 157410 161900
9575 161900 167596 165504 153671 154957 157976 152189 152536 139850 135705 139545 142840 153608 152146 148253
9561 148253 150133 159963 163762 164699 160435 157989 155683 146872 138288 130332 111506 104619 114014 131323
9547 131323 135606 129095 124128 124114 125850 127408 135159 137307 148207 153401 151605 151467 137122 130809 135310
9532 135310 135560 134231 133691 130837 119351 108054 107879 106383 97050 88923 90922 96531 99084 97280 101933
9517 101933 106720 104095 106280 92399 88306 85478 82703 80964 66120 58170 64814 68393 75836 79061
9503 79061 78830 70005 79460 80360 77168 74425 76456 84184 87056 89461 93959 81048 82510 91037 101349
9488A01349O679o688l328o518j0008o64m628k730r042K177l027q443L397R831
9474F8357J6655k287k738o563L364P913M52l845N671p92n486N999M674N222o719
9459H9877m834r803K015q795j0576k103o921k106L455O073k85P320n459K551J0773
9444G1182K838J2381J3208p890j5883m656j053O297Q560L663L078l90o22q569
9430H2144j0268k869J2530J1379P020J1683Q626j0765j3184n596Q945J5722j1508
9417A03859o5P051r621q034J314J2142J2368R99j628K00m892p219n592M091J0386
9402A15359k629j2742J1316j888M190J5207l544k359l223J0083k797j1477q018
9389A07478R11q587M963J5259P962N970n853k2078l413J845P686J4847n553K64
$$ plain form
9488 101349 108028 101340 98012 91494 81486 80822 76194 73464 64422 66599 63572 55129 58526 68357
9474 68357 85012 82725 79987 73424 76788 84701 85153 81308 86979 86187 80701 86700 91374 96596 89877
9459 89877 85043 75240 77255 68460 57884 55781 48860 46754 50209 56282 55997 63317 57858 60409 71182
9444 71182 74020 86401 99609 91719 75836 71180 70127 76424 84984 88647 91725 91335 90713 82144
9430 82144 71876 69007 81537 92916 99936 111619 120245 109480 96296 90700 99645 115367 103859
9417 103859 103794 110845 101224 93190 94504 106646 119014 120013 118385 118585 113693 106474 100882 104973 115359
9402 115359 112730 99988 111304 109416 113606 128813 125269 122910 119687 129770 126973 115496 107478
9389 107478 108389 99802 104765 120024 127986 133956 128103 106025 102612 104457 112143 126990 121437 121701
9375A21701j258J0141Q915q113r151N257k357m977M723L923r39M221P72R007J2867
9360A54732l867j3237j2822o202p137J3424J0429K888j593k986J0939J2671R42
9347A58181j5784j8202j7625J1275M934R49O512k53l691K477k931O035J8164j204
9333A48837n499k482j369J1198J5983p179m522j013J6322N455j3427P189K6575
9320A96068j218r992j208M905K6161K4280J4707k75j9592k6618m867l127J831
9307B01055N336j8607n607r958j039p75l836J4267J7410J0169m265q002o178j432
9293A88538L894N981p98N401M000j1203j38J2693q053n858J0406O962m403J7452
9279B24874O918j357P207J6795P974J823l286l357L085M611J0999O857k021J930
$$ plain form
9375 121701 120443 130584 139499 131386 122235 127492 125135 120158 124881 128804 127865 132086 132858 141865 154732
9360 154732 150865 137628 124806 118604 111467 124891 135320 138208 136615 133629 144568 157239 158181
9347 158181 142397 124195 106570 117845 122779 123728 130240 129987 126296 128773 125842 131877 150041 148837
9333 148837 143338 140856 139487 150685 166668 159489 154967 153954 170276 175731 162304 169493 196068
9320 196068 194850 184858 183650 188555 214716 238996 253703 253428 233836 207218 202351 199224 201055
9307 201055 206391 187784 182177 172219 171180 170405 166569 180836 198246 208415 204150 196148 189970 188538
9293 188538 192432 198413 197615 203016 207016 195813 195675 208368 200315 194457 204863 211825 207422 224874
9279 224874 231792 230435 237642 254437 262411 264234 260948 257591 260676 265287 276286 283143 281122 283052
9265B83052J0471J2876j548O316J7267J3337J6343r65P631J3088J1808m16O674
9252C95934J1045k203L474J2916J8445l197q852n278N353J5757M758r652j1525
9239D26975j1116j9226l556R328L195R731P312K4397K8008p811j9798k3521j6598
9226D07320r184K54L194O562J1271l775P768R269j4601j4344N53J3365K3799J949
9212D43400k64P625J79k2956J363O525k026p112n316N4o258m48Q359l272K053
9197D21906J1709Q533N447M009M023P02j501k324p097Q879J7529K4024j423R503
9183E03919o756q014k070P381L252j146K171K3934J6219J1116J2261M222J8123
9170E84612P519j2331n087O690M630Q561J0510J764M393l994N263J9979j000M84
$$ plain form
9265 283052 293523 306399 304851 311167 328434 341771 358114 357149 364780 377868 389676 389260 395934
9252 395934 406979 404776 408250 421166 439611 436414 427562 422284 427637 443394 448152 438500 426975
9239 426975 415859 396633 393077 402405 405600 415331 422643 447040 475048 467237 447439 423918 407320
9226 407320 398136 398390 401584 408146 419417 415642 423410 432679 418078 403734 404287 417652 441451 443400
9212 443400 443136 450761 450940 427984 429347 435872 433846 426734 421418 421472 415214 414766 423125 419853 421906
9197 421906 433615 442148 447595 451604 455627 456329 454828 452504 445407 454286 471815 495839 494416 503919
9183 503919 497163 489149 487079 494460 497712 496566 498737 522671 538890 550006 562267 566489 584612
9170 584612 592131 579800 574713 581403 586033 594594 605104 606868 611261 607267 612530 632509 631509 631993
9156F31993K2008Q527l824J6732K5528J2850l853J3698J9351J0982J3335K1960
9144G89287J4297K3310J1359J4062K2000J8455J6669J6951K5826L5596K8622K2000
9132A038434J8733K6088J2888J8277L2175K3436K0036J0714Q540P011K0556K2658
9120A259546M96o63J4008L919N72N868J8350J9717K4732J7819J6068K6792J9894
9107A427118R068J3853K5066L1665K4354M7019K9112O090K4592M1104L6893M5982
9095A761916L8218M0631M1688M7689L5845L6169M3195N6218N0957M7565L7543
9084B237634M5180M8094N0642N5617O2733O7348O7444P4658N1860O0975P2304
9073B894489Q4547Q7282Q7556P8207N8963Q6973R7819J03781J09599J08257J11775
$$ plain form
9156 631993 654001 662528 658704 675436 700964 713814 709961 723659 743010 753992 767327 789287
9144 789287 803584 826894 838253 852315 874315 892770 909439 926390 952216 987812 1016434 1038434
9132 1038434 1057167 1083255 1096143 1114420 1146595 1170031 1190067 1200781 1209321 1216332 1236888 1259546
9120 1259546 1260042 1259379 1273387 1277306 1277878 1283746 1302096 1321813 1346545 1364364 1380432 1407224 1427118
9107 1427118 1436186 1450039 1475105 1506770 1531124 1578143 1607255 1613345 1637937 1679041 1715934 1761916
9095 1761916 1800134 1840765 1882453 1930142 1965987 2002156 2045351 2101569 2152526 2200091 2237634
9084 2237634 2282814 2330908 2381550 2437167 2499900 2567248 2634692 2709350 2761210 2822185 2894489
9073 2894489 2979036 3066318 3153874 3232081 3291044 3378017 3475836 3579617 3689216 3797473 3909248
9062C909248J21760J25256J25974J28093J36523J48302J50954J54307J67884J85397
9052E353698J93982J86629J94844J99511K17253K45771K46832K49013K76934K84502
9042G648969L09063L34687L51820L71264M00909M18843M51166M84688N13490N41514
9032A1826413N81064O29828O72654P21145P91690Q60803R20727R97103J086546
9023A9087973J177995J281274J409477J538096J673527J836100K052217K251194
9015C2307853K490532K767134L081794L435129L836419M277705M793920N356170
9007F2346656N993199O680361P419017Q203264R007286R752951J0365413J0802716
8999A30570863J0923680J0620830R750418Q237039O114482L464239M90852k540101
$$ plain form
9062 3909248 4031008 4156264 4282238 4410331 4546854 4695156 4846110 5000417 5168301 5353698
9052 5353698 5547680 5734309 5929153 6128664 6345917 6591688 6838520 7087533 7364467 7648969
9042 7648969 7958032 8292719 8644539 9015803 9416712 9835555 10286721 10771409 11284899 11826413
9032 11826413 12407477 13037305 13709959 14431104 15222794 16083597 17004324 18001427 19087973
9023 19087973 20265968 21547242 22956719 24494815 26168342 28004442 30056659 32307853
9015 32307853 34798385 37565519 40647313 44082442 47918861 52196566 56990486 62346656
9007 62346656 68339855 75020216 82439233 90642497 99649783 109402734 119768147 130570863
8999 130570863 141494543 152115373 161865791 170102830 176217312 179681551 180172403 177632302
8991A77632302n301573p581456r244054j0267340j0708563j0684922j0302259
8984A13542135r731873r032313q263652p496324o758978o091452n473808m919482
8976E5774253m432934l973409l567856l229519k921587k610370k372038k162038
8968C0504502j967607j800717j629294j482984j363085j258892j159666j071603
8960A8770654r86443q91750q36550p76989p20007o83783o32873n93056n55510
8951A2093693n14777m82686m51627m14234l80273l74552l61201l35227l08856
8942H470260k97218k73918k57722k55669k53472k35550k16607k04475k00560j92607
8932F082462j97034j79681j60499j57567j52287j40576j40789j22661j28497j31918
$$ plain form
8991 177632302 172330729 164749273 155505219 145237879 134529316 123844394 113542135
8984 113542135 103810262 94777949 86514297 79017973 72258995 66167543 60693735 55774253
8976 55774253 51341319 47367910 43800054 40570535 37648948 35038578 32666540 30504502
8968 30504502 28536895 26736178 25106884 23623900 22260815 21001923 19842257 18770654
8960 18770654 17784211 16892461 16055911 15278922 14558915 13875132 13242259 12649203 12093693
8951 12093693 11578916 11096230 10644603 10230369 9850096 9475544 9114343 8779116 8470260
8942 8470260 8173042 7899124 7641402 7385733 7132261 6896711 6680104 6475629 6275069 6082462
8932 6082462 5885428 5705747 5545248 5387681 5235394 5094818 4954029 4831368 4702871 4570953
8922D570953j18958j13837j11546j08983r7646q5561p5687q5263q8177q6463q1727
8911C517105o2942p2223q2573q4850o3112m8934p1467o4359n8529n7359o3840
8900B786917o4024m9306m4034l1880l6404l0814l7699l9768o2601k2380l5179
8889B332828l6836l6377l6231l7835l2694k9478k3412l2690k6792k5630n047k891
8877B006915k9703k6322j7459j3056o636m237j8412l3246l0572k9810m6871l7504
8865A713087l2936l1200l0953k5634l4811m0103l7813m5668k3857k3654j5699
8854A370759j3175r471j7858k2768k3320k4059o799m191o177j1187j7614n395
8842A208745j1978l2756j0777j4841j2997o018m752J263j4557k2055l0985k3316
$$ plain form
8922 4570953 4451995 4338158 4226612 4117629 4019983 3934422 3858735 3773472 3685295 3598832 3517105
8911 3517105 3454163 3381940 3299367 3214517 3151405 3102471 3031004 2966645 2908116 2850757 2786917
8900 2786917 2722893 2673587 2629553 2597673 2561269 2530455 2492756 2452988 2390387 2368007 2332828
8889 2332828 2295992 2259615 2223384 2185549 2152855 2123377 2099965 2067275 2040483 2014853 2009806 2006915
8877 2006915 1977212 1950890 1933431 1920375 1913739 1909502 1891090 1857844 1827272 1797462 1750591 1713087
8865 1713087 1680151 1648951 1617998 1592364 1557553 1517450 1479637 1433969 1410112 1386458 1370759
8854 1370759 1357584 1348113 1330255 1307487 1284167 1260108 1253309 1249118 1242941 1231754 1214140 1208745
8842 1208745 1196767 1164011 1153234 1138393 1125396 1119378 1114626 1115889 1101332 1079277 1048292 1024976
8830A024976n897m477K926r058j9526k0456j2731m053j3667r85m253j0320j4192
8817I08287o427P171P093N326o637l613o110n448j9585j4617j7545j8620j7790
8804H11485j3982L578p076j3038j3733k8140j7264n52l779j598o925J701o056
8791G04621j7377j8559o672K90j1496j4624j7638Q329k504j8626k0235j4972p037
8778E63500l860Q401J4502j0312j6401l428K309J0796P139L45m164j5112m563
8765E49152l293j0851j0629J90L877n623p281m652j2284p385J9262K1622n344
8752E26761j3107J05O011j689j4425j2638l448j089n422j7737m484R253j179j5833
8738D51079j5847K86j630j3459K823L998l482j1386M788J847j11p551q000O888
$$ plain form
8830 1024976 1019079 1014602 1017528 1008470 988944 968488 955757 951704 938037 937052 932799 922479 908287
8817 908287 901860 909031 916124 921450 914813 911200 905090 899642 880057 865440 847895 829275 811485
8804 811485 797503 801081 794005 780967 767234 739094 721830 721278 717499 715901 708976 710677 704621
8791 704621 687244 668685 662013 662303 650807 636183 618545 626874 624370 605744 585509 570537 563500
8778 563500 559640 568041 582543 572231 555830 552402 554711 565507 572646 572991 568827 553715 549152
8765 549152 545859 535008 524379 524569 528446 522823 515542 510890 498606 491221 510483 532105 526761
8752 526761 513654 513759 519770 518081 503656 491018 487570 486481 481059 463322 458838 468091 466912 451079
8738 451079 435232 435518 433888 420429 423252 427250 423768 412382 417170 419017 418906 411355 403355 410243
8724D10243J623p028o723O376o340k0274k789K267p487k251J0774l728m554J723
8710C71832M443K475N851j8152r528R77K154K47m843L562m80j0371q675R32l152
8695C37272M133O706l843j1858j2617M564J2000J0481q781j5060N672J1533Q335
8682C48537Q328o803r953p944q076P307J3819L4m930q898N288j306p060k4339
8668C04004j0394m144O009N843l753O241R15r468j952R736n784N03J676P20r165
8653B90987J5300Q965O39q708j1173N275P354j934r452j106R69j454j7276l464
8639B74922J1164J361m6j8370j5617o466J875n252j0587J800Q784J2854K836O663
8625B65921j9647j3512O832J3390R51k382l619m593j1013J904Q075L778K674N569
$$ plain form
8724 410243 411866 404838 398115 404491 398151 377877 375088 377355 369868 367617 378391 374663 370109 371832
8710 371832 376275 378750 384601 366449 356921 357898 360052 360299 355456 359018 358538 348167 339492 340424 337272
8695 337272 341405 348111 344268 332410 319793 324357 336357 346838 338057 322997 328669 340202 348537
8682 348537 356865 350062 340109 332165 324089 331396 345215 345249 340319 331421 336709 335403 328343 304004
8668 304004 293610 289466 295475 301318 297565 303806 304721 295253 293301 303037 297253 297756 299432 300152 290987
8653 290987 306287 315252 315891 307183 296010 301285 308639 306705 297253 296147 297116 295662 278386 274922
8639 274922 286086 287447 287401 269031 253414 246948 248823 243571 232984 234784 243568 256422 259258 265921
8625 265921 246274 232762 239594 252984 253935 251553 247934 243341 232328 234232 242307 246085 248759 254328
8611B54328m577l884p057M762J4141J7476l973q404k132k853N40J998M334J113
8597B65812p831N40L871Q927J7111l807j8587j2142o059O609L661M54O192p017
8583B57734P513J0277J2410n977j3990j8877l933m387M690J0088Q288J848J5531
8570B81215j728r675J032O221J50N916m742j0509J0711J3546K505L888Q727j1148
8556B96109J5439Q227j065J9354J8622J3280J5222K3268J7239N537O302L2796
8544D70330K4365K6794K5672K0699M2524L2961J9600K6493J6149J2888j9997l2870
8532F65608l6331l7843k8652l8714l5481k3760q011j1537k8884l2469j7913r730
8520C56283p422j7302k3958j1256J7064K4501K8053L4489Q4424P1333k7377p5079
$$ plain form
8611 254328 249751 245867 238810 243572 257713 275189 271216 262812 260680 257827 258367 260365 264699 265812
8597 265812 257981 258521 262392 271319 288430 284623 266036 253894 247835 254444 258105 258559 264751 257734
8583 257734 265247 275524 287934 281957 267967 249090 245157 240770 245460 255548 263836 265684 281215
8570 281215 279487 269812 270844 277065 277215 283131 278389 267880 278591 292137 294642 298530 307257 296109
8556 296109 311548 319775 318710 338064 356686 369966 385188 408456 425695 431232 437534 470330
8544 470330 494695 521489 547161 567860 610384 643345 662945 689438 705587 718475 698478 665608
8532 665608 629277 591434 562782 524068 488587 464827 456816 445279 416395 383926 366013 356283
8520 356283 348861 331559 307601 296345 313409 337910 365963 400452 484876 556209 528832 453753
8508D53753p3749n4629k8354j2907p690q634j6050j9962k5386m898K846L356P492
8495B15188M505n274n981J2146o337m897Q04Jm919j447k593K51p382k519J5633
8480B07179M60k276k45P415J0266Q270N672J1538J6360K2708M9960R3285J33137
8467E63729J61931P3601j03969j66119j22614o8178m5849k4481k1101j9522l31
8456B27097o939j6720n847M478j494j5168j2666q173r386n636K207q56k272M249
8442A52874J5284L547r340j2649l582j983R730M729l892N045J4316l691r689K83
8428A60982J4523L0224K5791M5429N8571Q1745O7138j0446p0929p7546n2377l3416
8416B39689j4798k335Q290J0053J4804L1334L9121N8499P3481M8917j4102o2213
$$ plain form
8508 453753 380004 325375 297021 284114 276424 267790 251740 231778 206392 201494 204340 207696 215188
8495 215188 219693 214419 208438 220584 214247 209350 210154 210155 205236 203789 201196 201447 194065 191546 207179
8480 207179 207639 205363 205118 212533 222799 231069 236741 248279 264639 287347 337307 430592 563729
8467 563729 725660 799261 695292 529173 406559 338381 292532 268051 246950 227428 227097
8456 227097 220158 203438 197591 202069 200575 185407 172741 164568 155182 149546 151753 150897 148625 152874
8442 152874 168158 171705 162365 149716 146134 144151 153881 158610 154718 159763 174079 170388 160699 160982
8428 160982 175505 205729 231520 276949 335520 417265 484403 473957 403028 325482 273105 239689
8416 239689 224891 222556 230846 240899 255703 287037 326158 384657 458138 507055 492953 430740
8404D30740r8527p2400l5169k7221j9876m451j0723q946j710p694j1197J789J1912
8391A46527L841p740q774j1353n703n08J3083J1640O078p443k946L020L647Q046
8377A51415K5730L773o684nJ9749J5603P685R788J5604K1785L1001N8346Q9125
8364D42915J27065J77554J47694k0732j54813j76811j40687q5662n7499l7859
8354B21165j8238q668q117j7233q112m620m867O153J1473o567j2741j2638r139
8341A27851p022q818M998O977j41O213J6026J2718R811Q310L959J1445K9014M8923
8327B70264L2797Q501k8089m3299r527J996R782L1499O2937O3861N8682J6790
8315D76194n1842q3830o7006m2274n1052k2902k2720j1308p594K727l499r51M1
$$ plain form
8404 430740 332213 259813 224644 197423 177547 173096 162373 153427 151717 144023 132826 134615 146527
8391 146527 150368 142628 133854 122501 116798 116290 129373 141013 147091 139648 136702 139722 143369 151415
8377 151415 177145 180918 174234 174229 193978 209581 217266 227054 242658 264443 295444 353790 442915
8364 442915 569980 747534 895228 874496 719683 542872 402185 316523 259024 221165
8354 221165 202927 194259 186142 168909 160797 156177 151310 157463 168936 162369 149628 136990 127851
8341 127851 120829 112011 117009 123986 123845 130058 146084 158802 168613 176923 180882 192327 221341 270264
8327 270264 303061 311562 283473 240174 230647 232643 242425 273924 336861 400722 459404 476194
8315 476194 424352 340522 273516 231242 180190 157288 134568 123260 115666 118393 114894 113943 113984
8302A13984N84n142J4532L059o990l124J5723L906j6803j7600K562K1092R787
8289A35570K0990K0730K5358O996k4877j7734k4224j5160M212q546j3302j2356
8277I7657m331P944n87L199m67J399j2331l935K1648J3109m198j7200k2373P887
8263H7421j0492l902o927q801M350N161R671J0970J1961m410q584Q29J039K461
8249I0747K332L8o818j0733l56J3291P30K34K325k212q520j4113k387J322M090
8234F9970N097N010q126k269n846P017N629j324N373J551o662J488K520J7931
8220I7359m679o635j8634k367P781J6481O65j8392j8575l517J9754J3131q266
8207G4106j1006J4352M693L107J6006P053q617q201j4175j516K877J0172Q26j2846
$$ plain form
8302 113984 114568 109426 123958 127017 120027 116903 132626 136532 119729 102129 104691 125783 135570
8289 135570 156560 177290 202648 209644 184767 167033 142809 127649 131861 123315 110013 97657
8277 97657 93326 101270 100683 103882 103415 104814 92483 88548 110196 123305 119107 101907 79534 87421
8263 87421 76929 73027 66100 57299 61649 66810 76481 87451 99412 95002 86418 87247 88286 90747
8249 90747 93079 93117 86299 75566 75210 88501 89231 89465 91790 89578 81058 66945 64558 65880 69970
8234 69970 75067 80077 71951 69682 63836 70853 76482 75158 80531 82082 75420 76908 79428 97359
8220 97359 92680 86045 67411 65044 72825 89306 89971 71579 53004 49487 69241 82372 74106
8207 74106 63100 77452 82145 85252 101258 108311 99694 91493 77318 75802 78679 88851 89677 76831
8193G6831o411n155J591K131l793n058j8765K618O839O713J3753M966r06m979
8179G0375n828J1492J1798j2481j1919J1230J8063K776n228J130n868j4220j609
8166F9711l27k228J6121O559j5251k835N578m561j853J72j0646j4329o285q127
8152C1699P726N52Q303J0930Q132J4328q136l946L737O788n847l846L417J4935
8138H8772J4041j735r114O464R56Q29M202J143o0j6003j0966j634q480j1451j3
8123E6951N922P985o583o237k095J6177n612j6069n069J0971L612L75J4768J178
8109G6274l628M384p499j0097q965J1078J5982k717J287o17Q125J184m600j9143
8095F1048l699J3862j544l115O887N974k0450l879N323J982J5383K3824j853k0584
$$ plain form
8193 76831 70420 65265 66856 68987 65194 60136 41371 43989 50828 57541 71294 76260 75354 70375
8179 70375 64547 76039 87837 75356 63437 74667 92730 95506 90278 91408 85540 71320 69711
8166 69711 69384 67156 83277 89836 74585 71750 77328 72767 70914 71086 60440 46111 39826 31699
8152 31699 39425 39977 48280 59210 67342 81670 73534 69588 73325 80113 74266 70420 73837 88772
8138 88772 102813 101078 91964 98428 99384 100213 104415 105558 105498 89495 78529 76895 68415 56964 56951
8123 56951 62873 70858 64275 58038 55943 72120 66508 50439 45370 56341 59953 60328 75096 76274
8109 76274 72646 77030 69531 59434 50469 61547 77529 74812 76099 75482 83607 84791 80191 61048
8095 61048 57349 71211 69667 66552 73439 79413 58963 55084 60407 62389 77772 101596 99743 79159
8081G9159j2531O12L317l923l858o180Q023N310R230J60o975r614k535Q29l20
8066F0704o085m114N499J1940L659k290o419j4119M24K5158J2515L549j5741j1533
8052F3147m028Q410l992l94r81j1256q692q11Q982J940K438n752L489O692J1784
8037G0976j2011r17P533p90j2920J1207J0605k685R88q83j811n63j5081k883K446
8022E3211R240J140N418q083P587J633l153j2421M095J6581m357J1672k568p692
8008G2303Q096o83k402J988N729n746r145M126J805J5546N92j3698K859M777m192
7993H1955O104O507n621o297K15J2383J454j525j04k451Q009Q309q059j166K279
7978A01992j122L971N337o597m940L785l977l529j1782R416J0159O081l802k219
$$ plain form
8081 79159 66628 67240 70557 66634 62776 56596 64619 69929 79159 79319 72344 62730 60195 61024 60704
8066 60704 54619 50505 56004 67944 71603 69313 62894 48775 49199 74357 86872 90421 74680 63147
8052 63147 59119 67529 63537 63143 62162 50906 42214 41403 50385 52325 54763 49011 52500 59192 70976
8037 70976 58965 58048 65581 64791 51871 63078 73683 70998 71986 71103 69292 68729 53648 50765 53211
8022 53211 62451 63591 69009 60926 68513 70146 66993 54572 58667 75248 70891 82563 79995 72303
8008 72303 80399 79716 77314 79302 85031 79285 70140 74266 76071 91617 92209 78511 81370 86147 81955
7993 81955 88059 94566 88945 82648 82863 95246 96700 95175 95071 92620 100629 108938 100879 99713 101992
7978 101992 100870 104841 110178 103581 98641 102426 98449 94920 83138 92554 102713 108794 104992 102773
7964A02773l265K894Q369l340k0073j743P724O407o79J061O142J3425m353n597
7950A09745O544R098r05M967O301O318Q080o46q392Q920R076m033k3756r919J975
7935A23373l211m649R62K96j3928q484j526Q048Q402M010o180k212k1958L40J2781
7920I6064R631P864J7108l213k2121N316M789J432k494J059M639J0405n60r054
7906A20865m955L944J0178J438j6442O644J5269J908r821J4030R088m442l838
7893A43866j2271l96p197n147p166j9645o058k010M909J5437j489j0875K93P446
7879I9697P278M342j447m509q831n079j161N950M411m981q506J0918l048q545
7865H6489J3065N535k834r871q272J4264P801j130p976o184O911r524j7228j2016
$$ plain form
7964 102773 99508 102402 110771 107431 87358 85615 93339 99746 99067 100128 106270 119695 115342 109745
7950 109745 116289 125387 124482 129449 135750 142068 150148 149502 141110 150030 159106 155073 131317 121398 123373
7935 123373 120162 115513 116475 116771 102843 94359 92833 100881 109283 113293 107113 104901 82943 83283 96064
7920 96064 105695 113559 130667 127454 105333 110649 115438 116870 114376 115435 120074 130479 129919 120865
7906 120865 115910 119854 130032 131470 115028 121672 136941 138849 129028 143058 152146 147704 143866
7893 143866 131595 131199 124002 118855 111689 92044 85986 83976 88885 104322 102833 91958 92251 99697
7879 99697 106975 111317 109870 105361 96530 91451 90290 96240 100651 95670 87164 98082 95034 86489
7865 86489 99554 105089 102255 92384 84112 98376 106177 105047 97071 90887 97798 88274 71046 59030
7851E9030N798J1217K916k486l813L613L215k144j1897r793l143O2j984n910n165
7836C9516M670j821m265N888O219j243K637q781N895K292q314j0324Q647J8307
7822E9323K882o315N243O238q022m440j332k082M888J0942J423o043j3957o362
7808D2386l69J171o107j1535J1187R118N63p264n573p746j810J4416m211p720
7794B6506l572j2899n432O987K8108L522j0855k154r63L089O972o033k634J2805
7780D3447k787j1968O284q233p848J0505J997j2045L423J0066J2783n346r117
7767C1161o805k522R545R908q219j276J309j932N586L02k89p411r569L48R202
7752B9338J844N249K107r681n985k096n079J541J964j476L118l086J5428n698
$$ plain form
7851 59030 64828 76045 78961 76475 72662 76275 79490 77346 65449 55656 52513 52575 50591 44681 39516
7836 39516 44186 42365 38100 43988 50207 48964 51601 42820 48715 51007 42693 32369 41016 59323
7822 59323 62205 55890 61133 67371 59349 54909 53577 51495 56383 67325 68748 62705 48748 42386
7808 42386 42017 43188 37081 25546 36733 45851 46414 39150 33577 25831 24021 38437 34226 26506
7794 26506 22934 10035 4603 11590 39698 43220 32365 30211 29248 32337 39309 33276 30642 43447
7780 43447 40660 28692 34976 26743 18895 29400 31397 19352 22775 32841 45624 40278 31161
7767 31161 24356 21834 31379 41287 33068 31792 33101 31169 36755 37057 36768 29357 19788 20136 29338
7752 29338 31182 36431 38538 28857 22872 20776 15697 17238 19202 17726 20844 17758 33186 27488
7738B7488j1264Q931o264m787O889j382j0655j0383Q124O561M603M149m388j79
7724A7443n394l972n010K660m09J1163k333n045M439L280R513k184q449K630L776
7709B2108k69N893R668R171o690j0067o636j4108o690P811J2573O592j058l023
7695B5275O139P033O988j2951K007J245j1053k51J7j424n20M480k91R12o019L990
7679B5577N26j5648j6202P796J6359m382k903R465J461K61j5676j6402N569O904
7665B705O891p967r005J2578J1540N462O707P638j3097m781m95o129j7595Q903
7651C355J1377o322j1846J3402Q963k836Q64q203j5395L893P366l41R055J9966
7637C3298j1802j6065n32P774l430m655j1m115K462J3483K747o99J2817q149n580
$$ plain form
7738 27488 16224 25155 18891 14104 20993 19611 8956 -1427 6697 13258 17861 22010 17622 17443
7724 17443 12049 8077 3067 5727 5318 16481 14148 9103 13542 16822 26335 24151 15702 18332 22108
7709 22108 21839 27732 37400 46571 39881 29814 23178 9070 2380 10191 22764 29356 28298 25275
7695 25275 31414 38447 45435 32484 34491 35736 24683 24432 24449 23025 22505 26985 26694 27606 21587 25577
7679 25577 26103 10455 -5747 2049 18408 14026 11123 20588 22049 22310 6634 -9768 -4199 2705
7665 2705 9596 1629 -7376 5202 16742 22204 28911 36549 23452 18671 18176 12047 -5548 3355
7651 3355 14732 8410 -3436 9966 18929 16093 16957 8754 -6641 -2748 4618 4277 13332 33298
7637 33298 21496 5431 4899 12673 9243 4588 4577 462 2924 16407 19154 18455 31272 23123 17543
7622A7543j345j363l382K605n226j097j7919m630J7878J9370K570r04L736r051
7608A8785j3782n15m773O097J1424N811p816k423J702M776J563p621Q62n10L047
7593A6627j070j0555M121K225k118K487k679k031J917Q60j239l727M245m554p688
7578c179J2158M833L262O390m918j3096j3175q235j869L802J5562L716l997J600
7564B854N294j65L335O258J947p782l547l003L049m492J77J2034j785R627j380
7549B2421k914O889j1696n364R880P120J343Q40L469r316k288r94J278N449j701
7534B4416n837O33K069J361M665n212j813N910N146q904j032k367l209l20r855
7519E651p106J0372n675l509P600P405R957J2073j2471j6613L353j311M6O171
$$ plain form
7622 17543 16198 14835 11453 14058 8832 7735 -10184 -14814 3064 22434 25004 24100 27836 18785
7608 18785 5003 4488 -285 5812 17236 23047 15231 12808 14510 19286 20849 13228 14090 13580 16627
7593 16627 15557 5002 9123 11348 9230 11717 9038 7007 8924 9784 8545 4818 9063 4509 -3179
7578 -3179 8979 13812 17074 23464 18546 5450 -7725 -15960 -17829 -14027 1535 5251 1254 2854
7564 2854 8148 7983 11318 17576 19523 11741 8194 5191 8240 3748 3925 15959 14174 23801 22421
7549 22421 19507 26396 14700 9336 19216 26336 27679 28519 31988 22672 20384 19390 20668 26117 24416
7534 24416 18579 19212 21281 22642 27307 22095 20282 26192 31338 22434 21402 19035 15826 15506 5651
7519 5651 -1455 8917 3242 -267 7333 14738 24695 36768 24297 7684 11037 9726 9772 15943
7505A5943J3029L951K518k398j2996l816J4287L371n873M264j290k835N472m039
7491B9588l182o105O958N702j0091r909Q88L482p581r708n056J3923J654M35m806
7476F192J0311N058J121l584L384N36o682r90q332O253j0591j2574O696Q602r321
7461c921R942N451j0400j4285n822J5371J4776P109j223K022L957J1565l88k5533
7447H621q698p305p982m513J0019L28Q567J5861j489r410K616Q334j3190j449
7433C10J3310r163O360l331q865J1635J579j574m710p593k486m69L263N096m498
7418a136J0244J5017k962j5276J541R815p114j3248J2260J0735J982j6214q411
7405b767j2088J2245J0437M402j2213o205j2650m273N609J9325J1186j0679M082
$$ plain form
7505 15943 28972 32923 35441 33043 20047 16231 30518 33889 28016 32280 30990 28155 33627 29588
7491 29588 26406 20301 27259 32961 22870 12961 13849 17331 9750 42 -5014 8909 10563 10998 6192
7476 6192 16503 21561 22682 19098 22482 23018 16336 15346 7014 13267 2676 -9898 -3202 5400 -3921
7461 -3921 6021 11472 1072 -13213 -19035 -3664 11112 18221 16998 19020 22977 34542 34154 8621
7447 8621 -77 -7382 -15364 -19877 -9858 -9530 -963 14898 13409 3999 6615 14949 1759 310
7433 310 13620 4457 10817 7486 -1379 10256 11835 10261 5551 -2042 -4528 -4997 -1734 3362 -1136
7418 -1136 9108 24125 21163 5887 7428 17243 10129 -3119 9141 19876 21858 5644 -2767
7405 -2767 -14855 -2610 7827 12229 16 -6189 -18839 -23112 -17503 1822 13008 2329 6411
7392F411J3445l293o03n881j0079j9893m189J0689J3907J4511J1210r627j0760
7379E848k821k986J1021Q138n563j5285m634N98m382j91k982J483J0658R501J4241
7364B2644M851J80j6386r284k853p923O769O405J375m04r980l969j745k585M048
7349h857M912J372j167J564M361P507J4880k002j2870j301m686q345N045p114
7335f701O961J3672n260N680L974k695l685p363J952M055J736q857j0354Q62J547
7320d476n612n351j2339J7004Q565Q226m95j2850j2584j6046o629J3027J5365
7307a4195J6987m269Q120P254j3093k361o345j181N211J036M516Q134l592j6318
7293a0096o824P14N717J0768P598m190R150p676n316J1980M80j972k156J186k781
$$ plain form
7392 6411 19856 16563 15960 10079 0 -19893 -24082 -13393 514 15025 26235 16608 5848
7379 5848 3027 41 11062 19200 13637 -1648 -6282 -5684 -10066 -10257 -13239 -11756 -1098 8403 22644
7364 22644 27495 27675 11289 2005 -848 -8771 -2002 4403 5778 5374 -4606 -8575 -10320 -12905 -8857
7349 -8857 -3945 -2573 -3740 -2176 2185 9692 24572 22570 9700 8399 3713 -4632 413 -6701
7335 -6701 260 13932 8672 14352 18326 15631 11946 4583 6535 10590 12326 3469 -6885 -6023 -4476
7320 -4476 -10088 -15439 -27778 -10774 -2209 6017 5522 -7328 -19912 -35958 -42587 -29560 -14195
7307 -14195 2792 -1477 6643 13897 804 -1557 -7902 -9083 -3872 -2836 1680 9814 6222 -10096
7293 -10096 -16920 -16206 -10489 279 7877 3687 12837 5161 -155 11825 12305 10333 8177 9363 6582
7278F582j1389q041j421N042O171J5877P646J0467r58o601l157K936J4225J442
7264C8821j0951p989R643r373k3002K37J04n576J890N921P598O403n079n444J710
7249D913o027j119j181J566J270M15j036L748l497M840L207L689p77j934m683
7234C394J462n562r484L490m097M702O855J2226J3775q388L239O107q486j8280
7220I53j1925j425j337J6716J2457j970j4280n887l981j782J654M745o131j676
7206a3869n265N942J4386k14o112p059n767n8J3627Q934j234L767n008k550L239
7191B759n102o658p650n934l070M924R043o979m443J089k094P16J0374O547J397
7176e081p925p136J3032K364q732N738J561P028J955n821j989N771j0647r373
$$ plain form
7278 6582 -4807 -12848 -14269 -9227 -3056 12821 20467 30934 29976 23375 20218 23154 37379 38821
7264 38821 27870 19881 29524 20151 -2851 -2614 -2510 -8086 -6196 -275 7323 13726 8647 3203 4913
7249 4913 -1114 -2233 -3414 -1848 -578 -163 -1199 2549 -948 3892 7099 10788 10011 8077 3394
7234 3394 4856 -706 -10190 -6700 -10797 -6095 760 12986 26761 18373 21612 27719 19233 953
7220 953 -10972 -12397 -13734 2982 15439 13469 -811 -6698 -10679 -12461 -10807 -6062 -12193 -13869
7206 -13869 -19134 -13192 1194 980 -5132 -12191 -17958 -18016 -4389 4545 3311 7078 2070 -480 2759
7191 2759 -2343 -9001 -16651 -22585 -25655 -20731 -11688 -18667 -23110 -22021 -24115 -23399 -13025 -6478 -5081
7176 -5081 -13006 -20142 -7110 -4746 -13478 -7740 -6179 849 2804 -3017 -5006 765 -9882 -19255
7162a9255Q931J0263J0115j026j0263l129O581q023q98m314j4419j773P919M170
7148a5121L069O555O774l943m541J161J4082J041j677J284k901m996N305k055
7134D037j3035R802J4503j384o914m366O87K732K857j612l046j8239j1504L303
7120b2179J5380L498O709J110n206q823p731P796L730l48k385j3304J364J483
7106a8906j087k204O377p544r897J4562J3755K77L455j4425p064P466L602k568
7092a4201N831J449l942p747l899M768J1832J0407n189J1743l588n144L725M566
7078A0611r93K919m437n174l436m134k306P864p437p698Q703J1406O778P651M410
7063B4727j7390r299L603J3572Q618Q077n125p469J991r857j596j0072j625L496
$$ plain form
7162 -19255 -10324 -61 10054 9028 -1235 -4364 2217 -5806 -6704 -11018 -25437 -27210 -19291 -15121
7148 -15121 -12052 -5497 1277 -2666 -7207 -6046 8036 9077 7400 8684 5783 787 6092 4037
7134 4037 -8998 804 15307 13923 7009 2643 3330 6062 8919 7307 4261 -13978 -25482 -22179
7120 -22179 -6799 -3301 3408 4518 -688 -9511 -17242 -9446 -5716 -6064 -8449 -21753 -20389 -18906
7106 -18906 -19993 -22197 -15820 -23364 -33261 -18699 -4944 -4667 -1212 -15637 -22701 -15235 -11633 -14201
7092 -14201 -8370 -6921 -10863 -18610 -22509 -17741 -5909 4498 -691 11052 7464 2320 6045 10611
7078 10611 9618 12537 8100 2926 -510 -4644 -6950 914 -6523 -14221 -5518 5888 12666 20317 24727
7063 24727 7337 -1962 1641 15213 23831 31908 26783 19314 21305 11448 9852 -220 -1845 1651
7049A651K390k316j0680P174R133L581j335n907j4327j5424k180Q767m92J4506
7035e459N213M788l967m140N264Q761l491j1162n759O669K520J723M166P935N067
7020A8128r997r591n478P741l491j56J0736n338p053j0548J0730N028q24k230
7006b343M957j92n731k42k63M54J4068J1386k652l624p877m200j0255j4568j671
6991b2753J877L406J3600M518L075q6P812J4421o396j3784j2904l740J691o97
6977i960J728J846K470n62m739O232O622K069m355L348M149M232m025j3615j2534
6962a7094l936J799O622J808m359K383k774p441R017N711R092n313r593L61m537
6947a8254J242k511m522k012n53J1105R316R045o022M607J816O720J2507O654
$$ plain form
7049 1651 4041 1725 -8955 -1781 7352 10933 9598 3691 -10636 -26060 -28240 -19473 -19965 -5459
7035 -5459 -246 4542 575 -3565 1699 10460 6969 -4193 -9952 -3283 -763 960 5126 13061 18128
7020 18128 8131 -1460 -6938 803 -2688 -2844 7892 2554 -4499 -15047 -4317 711 -113 -2343
7006 -2343 2614 2422 -3309 -3551 -3814 -3360 10708 22094 19442 15818 7941 3741 -6514 -21082 -22753
6991 -22753 -20876 -17470 -3870 648 3723 3637 11449 25870 19474 5690 -7214 -10954 -9263 -9960
6977 -9960 -8232 -6386 -3916 -4478 -9217 -2985 3637 5706 1351 4699 8848 13080 9055 -4560 -17094
6962 -17094 -21030 -19231 -12609 -10801 -15160 -12777 -15551 -22992 -13975 -8264 828 -4485 -14078 -13717 -18254
6947 -18254 -17012 -19523 -24045 -26057 -26610 -15505 -6189 2856 -3166 1441 3257 9977 22484 29138
6933B9138q418r974m055N658r247j1999Q625K460l564Q151J0851l928m951K308
6919A1055r790O261o477m628N431L285J822P49q473j286m210j0388m403R010Q382
6904c660P140J7836n52j0088Q724N349j6507o116J0892o001k761n477K202P63
6890A744K646R604N836n756m868L74l583K549j7068k502J0500l724j3679P779
6876a0148J4404k188o155p6q972L072J7641O256r341r32q276j4049J6299K567
6862A02p277K887K0154j927J790J64p425j2596k060L095m6j1641j2546j267Q216
6847b0377J7227o780K045j580J724J028q4l0J0586O256o747k857L211n017o572
6832g967J5729L999l912r377K074P870n400L06m798j2382n765K406P431J9843
$$ plain form
6933 29138 20720 10746 6691 12349 3102 -8897 -272 2188 -1376 6775 17626 13698 8747 11055
6919 11055 1265 7526 1049 -3579 1852 5137 6959 7708 -765 -2051 -6261 -16649 -21052 -12042 -3660
6904 -3660 3480 21316 20764 10676 19400 24749 8242 2126 13018 7017 4256 -1221 981 1744
6890 1744 4390 13994 19830 14074 9206 9580 5997 8546 -8522 -11024 -524 -4248 -17927 -10148
6876 -10148 4256 2068 -4087 -4163 -13135 -10063 7578 13834 4493 3561 -4715 -18764 -2465 102
6862 102 -7175 -4288 15866 13939 15729 15893 8468 -4128 -6188 -3093 -3139 -14780 -27326 -28593 -20377
6847 -20377 -3150 -9930 -7885 -9465 -7741 -6713 -6797 -6827 3759 10015 3268 411 3622 -1395 -7967
6832 -7967 7762 11761 7849 -1528 546 8416 3016 3322 -1476 -13858 -19623 -17217 -9786 10057
6818A0057k093q487L629J478j2133N75K091Q861j0618r997R051O431P074J0305
6804A6224o23m493l759L950n294p045j516M52r149P48K3507N239K120j660j2337
6789F364l814K033L289K584P363q015J329m930n590P212O560l997p845p829o065
6774a1351K897o884r97O954N997P953N380j0111j0344J5693K455m88J4078l486
6760A7746j5615j0526N641M062o907k425m450J597k317P519J185n691l048L868
6746i361M113q604M141k449oK0234q215n722O644j1880l273J487l829P623J0356
6731A259l095p575J212k968J2700K1199r312j2640M412M704k934J0158J7437l578
6717C0979q854m964K14p999Q009L758n286o523L35k6p549m25P053o872o2J199
$$ plain form
6818 10057 7964 -523 3106 4584 -7549 -6974 -4883 3978 -6640 -16637 -7586 -1155 5919 16224
6804 16224 15601 11108 7349 11299 6005 -1040 -2556 -2104 -11253 -10505 13002 18241 20361 18701 6364
6789 6364 2550 4583 7872 10456 17819 9804 11133 6203 613 7825 14385 10388 2543 -5286 -11351
6774 -11351 -8454 -15338 -16335 -9381 -3384 4569 9949 -162 -10506 5187 7642 7154 21232 17746
6760 17746 2131 -8395 -2754 1308 -5599 -8024 -12474 -10877 -13194 -5675 -4490 -10181 -13229 -9361
6746 -9361 -5248 -13852 -9711 -12160 -12166 8068 -147 -5869 775 -11105 -14378 -12891 -16720 -9097 1259
6731 1259 -1836 -9411 -8199 -11167 1533 22732 13420 780 5192 9896 6962 17120 34557 30979
6717 30979 22125 17161 17375 9376 17385 21143 15857 9334 9669 9643 2094 1669 8722 1850 1788 2987
6701B987L887j16O097M471K7451L1146K2989J0992j788k2016l2998K349j0426
6688D5025j1003k4499q843J377q922K606R859J8580j1966j5072k16o689k991O892
6674e862m169n270J4591J0324l101j2327K537n114o026l384K9293J2385r381j6091
6660a595j0290o232N806o000P00P217J4226J1667j5320r401J0934M8m36m183m385
6645g244J916P116J1831k816m000n682N413N951J1834n96K364O86j434r667m187
6630A1485m815J187r607p508N623R668j3433r706o939O624n317J6824J1871j2206
6616f249m730K3854p592p767N892l340q308r60J6104J6903p09j4755o025P076
6602I394r385j2625j2717k751J1764P085O823P376j0894n72J0485J0647N697k705
$$ plain form
6701 2987 6874 6758 12855 17326 44777 75923 98912 109904 108116 86100 53102 55451 45025
6688 45025 34022 9523 680 2057 -6865 -4259 5600 24180 12214 -2858 -3074 -9763 -12754 -5862
6674 -5862 -10031 -15301 -710 9614 6513 -5814 -3277 -8391 -14417 -17801 11492 23877 14496 -1595
6660 -1595 -11885 -18117 -12311 -18311 -17611 -10394 3832 15499 179 -9222 1712 1760 1324 -2859 -7244
6645 -7244 -5328 1788 13619 10803 6803 1121 6534 12485 24319 23723 26087 26773 25339 15672 11485
6630 11485 6670 7857 -1750 -9258 -3635 6033 -7400 -17106 -24045 -17421 -22738 -5914 5957 -6249
6616 -6249 -10979 12875 5283 -2484 3408 68 -8240 -9200 6904 23807 23098 8343 2318 9394
6602 9394 9 -12616 -25333 -28084 -16320 -9235 -2412 4964 -5930 -6502 3983 14630 20327 17622
6588A7622j5756j3706o160N178Q94K931K323N476O862j3287j1740J0711J156l737
6574a1233Q54n03k095O760P770L095o103j3109O061O063j036o409j9568M241O433
6559a8779l122J0930J0924Q929K538o228j1916n710K742K38k743r65J2149n055
6545f068j0292M824k721j0453N082L830N014L405p420j3280j944R699P405q757
$$ plain form
6588 17622 1866 -11840 -18000 -12822 -11928 -8997 -6674 -1198 5664 -7623 -19363 -8652 -7496 -11233
6574 -11233 -10379 -10882 -12977 -6217 1553 4648 -1455 -14564 -8503 -2440 -3476 -9885 -29453 -25212 -18779
6559 -18779 -21901 -10971 -47 8882 11420 5192 -6724 -12434 -9692 -9454 -12197 -13162 -1013 -6068
6545 -6068 -16360 -11536 -14257 -24710 -19628 -15798 -10784 -7379 -14799 -28079 -30023 -20324 -12919 -21676
$$ [...]
##END NTUPLES=NMR SPECTRUM
##END=
