##TITLE=Analysis number 328317
Compound Code cc 56214
Book Reference 513/73/12
Project Code adrs
Chemist Name ronp
##JCAMPDX= 6.0         $$ Bruker NMR JCAMP-DX V2.0
##DATA TYPE= NMR SPECTRUM
##DATA CLASS= NTUPLES
##ORIGIN= Bruker BioSpin GmbH
##OWNER= nmr
$$ XWIN-NMR		Version 3.5
$$ Thu May 24 09:05:17 2007 GMT Daylight Time (UT+1h)  MAYBRIDGE\nmr@NMR_250MHZ
##.OBSERVE FREQUENCY= 250.131544655141
##.OBSERVE NUCLEUS= ^1H
##.ACQUISITION MODE= SIMULTANEOUS (DQD)
##.ACQUISITION SCHEME= undefined
##.AVERAGES= 16
##.DIGITISER RES= 18
##SPECTROMETER/DATA SYSTEM= dpx250
##.PULSE SEQUENCE= zg30
##.SOLVENT NAME= CDCl3
##.SHIFT REFERENCE= (INTERNAL, CDCl3, 0, 16.4499)
##AUDIT TRAIL= $$ (NUMBER, WHEN, WHO, WHERE, WHAT)
$$ ##TITLE= Audit trail, XWIN-NMR		Version 3.5
$$ ##JCAMPDX= 5.01
$$ ##ORIGIN= Bruker BioSpin GmbH
$$ ##OWNER= nmr
$$ C:\u/data/dgb/nmr/ADRS/1420/pdata/1/auditp.txt
$$ ##AUDIT TRAIL=  $$ (NUMBER, WHEN, WHO, WHERE, WHAT)
(   1,<2007-05-24 09:04:53.04 +100>,<MAYBRIDGE\nmr>,<NMR_250MHZ>,
      <created by zg, POWCHK disabled, PULCHK disabled
       configuration hash MD5:
       76 6E 9A 78 1E 09 19 81 EC 84 63 8F B0 6A 59 2D
       data hash MD5: 64K
       5B 90 43 7F 6E 7E 01 62 85 FB 53 27 6F D4 BE AB>)
(   2,<2007-05-24 09:05:09.23 +100>,<MAYBRIDGE\nmr>,<NMR_250MHZ>,
      <Start of raw data processing
       ef LB = 0.3 FT_mod = 6 PKNL = 1 SI = 32K 
       data hash MD5: 32K
       ED F5 61 50 02 67 36 17 D0 64 F8 88 74 F4 34 81>)
(   3,<2007-05-24 09:05:10.92 +100>,<MAYBRIDGE\nmr>,<NMR_250MHZ>,
      <apk 
       data hash MD5: 32K
       41 68 BF B6 0D AC 33 BC 1C D5 07 E5 BC 1D FD FD>)
(   4,<2007-05-24 09:05:11.60 +100>,<MAYBRIDGE\nmr>,<NMR_250MHZ>,
      <abs ABSG = 5 
       data hash MD5: 32K
       B2 10 A8 9E 84 55 1D 31 E7 2A 68 34 CA F3 1B 1E>)
$$ ##END=
$$ 
$$ hash MD5
$$ 10 9F FE 32 47 2B CD 16 91 AE 5E 19 01 E8 8C B8
##$RELAX= 
##$RELAX= 
##$RELAX= 
##$RELAX= 
##$RELAX= 
##$RELAX= 
##$RELAX= 
$$ Bruker specific parameters
$$ --------------------------
##$DU= <C:\u>
##$EXPNO= 1420
##$NAME= <ADRS>
##$PROCNO= 1
##$TYPE= <nmr>
##$USER= <dgb>
##$AMP= (0..31)
100 100 100 100 100 100 100 100 100 100 100 100 100 100 100 100 100 100 
100 100 100 100 100 100 100 100 100 100 100 100 100 100 
##$AQSEQ= 0
##$AQ_mod= 3
##$AUNM= <au_zg>
##$AUTOPOS= <56 >
##$BF1= 250.13
##$BF2= 250.13
##$BF3= 250.13
##$BF4= 250.13
##$BF5= 500.13
##$BF6= 500.13
##$BF7= 500.13
##$BF8= 500.13
##$BYTORDA= 1
##$CFDGTYP= 0
##$CFRGTYP= 5
##$CHEMSTR= <none>
##$CNST= (0..31)
1 1 145 1 1 1 1 1 1 1 1 1 1 1 1 1 1 1 1 1 1 1 1 1 1 1 1 1 1 1 1 1 
##$CPDPRG= <>
##$CPDPRG1= <>
##$CPDPRG2= <>
##$CPDPRG3= <>
##$CPDPRG4= <mlev>
##$CPDPRG5= <mlev>
##$CPDPRG6= <mlev>
##$CPDPRG7= <mlev>
##$CPDPRG8= <mlev>
##$CPDPRGB= <>
##$CPDPRGT= <>
##$D= (0..31)
0 1 0 0 0 0 0 0 0 0.06 0 0 0 0 0 0 0.0002 0 0 0 0 0 0 0 0 0 0 0 0 0 0 
0 
##$DATE= 1179993891
##$DBL= (0..7)
120 120 120 120 120 120 120 120 
##$DBP= (0..7)
150 150 150 150 150 150 150 150 
##$DBP07= 0
##$DBPNAM0= <>
##$DBPNAM1= <>
$$ [...]
##$SUBNAM7= <"">
##$SUBNAM8= <"">
##$SUBNAM9= <"">
##$SW= 20.6930455092707
##$SWIBOX= (0..15)
0 0 3 0 0 0 0 0 0 0 0 0 0 0 0 0 
##$SW_h= 5175.983436853
##$TD= 65536
##$TD0= 1
##$TE= 683.16
##$TE2= 300
##$TE3= 300
##$TEG= 300
##$TL= (0..7)
0 120 120 120 120 120 120 120 
##$TP= (0..7)
150 150 150 150 150 150 150 150 
##$TP07= 0
##$TPNAME0= <>
##$TPNAME1= <>
##$TPNAME2= <>
##$TPNAME3= <>
##$TPNAME4= <>
##$TPNAME5= <>
##$TPNAME6= <>
##$TPNAME7= <>
##$TPOAL= (0..7)
0.5 0.5 0.5 0.5 0.5 0.5 0.5 0.5 
##$TPOFFS= (0..7)
0 0 0 0 0 0 0 0 
##$TUNHIN= 0
##$TUNHOUT= 0
##$TUNXOUT= 0
##$USERA1= <user>
##$USERA2= <user>
##$USERA3= <user>
##$USERA4= <user>
##$USERA5= <user>
##$V9= 5
##$VALIST= <valist>
##$VCLIST= <CCCCCCCCCCCCCCC>
##$VD= 0
##$VDLIST= <DDDDDDDDDDDDDDD>
##$VPLIST= <PPPPPPPPPPPPPPP>
##$VTLIST= <TTTTTTTTTTTTTTT>
##$WBST= 1024
##$WBSW= 4
##$XGAIN= (0..3)
0 0 0 0 
##$XL= 0
##$YL= 0
##$YMAX_a= 344700
##$YMIN_a= -214621
##$ZGOPTNS= <>
##$ZL1= 120
##$ZL2= 120
##$ZL3= 120
##$ZL4= 120
##$ABSF1= 16.44988
##$ABSF2= -4.243292
##$ABSG= 5
##$ABSL= 3
##$ALPHA= 0
##$AQORDER= 0
##$ASSFAC= 0
##$ASSFACI= 0
##$ASSFACX= 0
##$ASSWID= 0
##$AUNMP= <proc_1d>
##$AZFE= 0.1
##$AZFW= 0.1
##$BCFW= 0
##$BC_mod= 0
##$BYTORDP= 0
##$COROFFS= 0
##$CY= 12.5
##$DATMOD= 1
##$DC= 0
##$DFILT= <>
##$DTYPP= 0
##$F1P= 14.0000005364418
##$F2P= -0.99999901652339
##$FCOR= 0.5
##$FTSIZE= 32768
##$FT_mod= 6
##$GAMMA= 0
##$GB= 0
##$INTBC= 1
##$INTSCL= 1
##$ISEN= 128
##$LB= 0.3
##$LEV0= 0
##$LPBIN= 0
##$MAXI= 10000
##$MC2= 0
##$MEAN= 0
##$ME_mod= 0
##$MI= 0
##$NCOEF= 0
##$NC_proc= -5
##$NLEV= 6
##$NOISF1= 0
##$NOISF2= 0
##$NSP= 0
##$NTH_PI= 0
##$NZP= 0
##$OFFSET= 16.44988
##$PC= 1
##$PHC0= -53.51806
##$PHC1= 15.98048
##$PH_mod= 1
##$PKNL= yes
##$PPARMOD= 0
##$PSCAL= 4
##$PSIGN= 0
##$REVERSE= no
##$SF= 250.130018038467
##$SI= 32768
##$SIGF1= 0
##$SIGF2= 0
##$SINO= 400
##$SIOLD= 32768
##$SREGLST= <1H.CDCl3>
##$SSB= 0
##$STSI= 32768
##$STSR= 0
##$SW_p= 5175.98343685301
##$SYMM= 0
##$S_DEV= 0
##$TDeff= 65536
##$TDoff= 0
##$TI= <Analysis number 999999
Compound Code 99
Book Reference 9
Project Code 9>
##$TILT= no
##$TM1= 0
##$TM2= 0
##$TOPLEV= 0
##$USERP1= <user>
##$USERP2= <user>
##$USERP3= <user>
##$USERP4= <user>
##$USERP5= <user>
##$WDW= 1
##$XDIM= 32768
##$YMAX_p= 444971697
##$YMIN_p= -726476
$$ End of Bruker specific parameters
$$ ---------------------------------
##NTUPLES= NMR SPECTRUM
##VAR_NAME=  FREQUENCY,     SPECTRUM/REAL,   SPECTRUM/IMAG
##SYMBOL=    X,             R,               I
##VAR_TYPE=  INDEPENDENT,   DEPENDENT,       DEPENDENT
##VAR_FORM=  AFFN,          ASDF,            ASDF
##VAR_DIM=   32768,         32768,           32768
##UNITS=     HZ,            ARBITRARY UNITS, ARBITRARY UNITS
##FACTOR=    0.157963299565203, 1,           1
##FIRST=     4114.60893120252, 0,            0
##LAST=      -1061.37450565049, 0,           0
##MIN=       -1061.37450565049, -726476,     0
##MAX=       4114.60893120252, 444971697,    0
$$ Real data points
##PAGE= N=1
##DATA TABLE= (X++(R..R)), XYDATA
$$ [...]
25658b7910j22356m6502M9042q4901P0412J71826O9108o7913k7409L0277K4792
$$ -27910 -150266 -196768 -147726 -232627 -162215 9611 78719 10806 -16603 13674 38466
25647C8466m6492j47302K4761J53279j4882q0110j23914O7569K5877j38969Q8587
$$ 38466 -8026 -155328 -130567 22712 7830 -72280 -196194 -128625 -102748 -241717 -153130
25636a53130j26258L7859N0297M1238N6106J86863p6440N7623Q3257k2402j01397
$$ -153130 -279388 -241529 -191232 -149994 -93888 92975 16535 74158 157415 135013 33616
25625C3616k08708J60516J53373o0504J1643j46254n2159J59392o3322q8055l6252
$$ 33616 -175092 -14576 138797 78293 89936 -56318 -108477 50915 -12407 -100462 -136714
25614a36714M1848K57275L0554k677J32507k0606j16674n8543p4565j284J56200
$$ -136714 -94866 162409 192963 190286 322793 302187 185513 126970 52405 51121 207321
25603B07321J25474j54584m0354j08691j18665r395J61463J2164j77665J66462
$$ 207321 332795 178211 137857 29166 -89499 -98894 62569 74733 -102932 63530
25593F3530J54579r6921j46287R076O9624k1566L9807N5510j79963K6223J78301
$$ 63530 218109 121188 -25099 -16023 53601 32035 71842 127352 -52611 -26388 151913
25582A51913J6769L8250n2219l8872j04340l6308j17143m2311Q427p4669j22575
$$ 151913 168682 206932 154713 115841 11501 -24807 -141950 -184261 -175834 -250503 -373078
25571c73078N2014J86083q379j31212R5331J98040Q9704m0340j21752j02203j26
$$ -373078 -321064 -134981 -143360 -274572 -179241 18799 108503 68163 -53589 -155792 -155918
25560a55918K8493R5613Q8146P4404n1038j58514n5830J31916Q0849o679j43401
$$ -155918 -127425 -31812 56334 130738 79700 -78814 -134644 -2728 78121 71442 -71959
25549g1959r9523k26426k3100J32298n918O848J44449O3345o539k7819M7947J438
$$ -71959 -171482 -397908 -421008 -288710 -294628 -287780 -143331 -79986 -86525 -114344 -66397 -64959
25537f4959J12695P0684k5747r2761l638m238J48308k9345n7040r7701j38127
$$ -64959 47736 118420 92673 -88 -3726 -7964 140344 110999 53959 -43742 -181869
25526a81869J30623J80865M1713Q1112J9906m8002l2061q4506L056m6910k07755
$$ -181869 -51246 129619 171332 252444 272350 224348 192287 107781 110837 63927 -143828
25515a43828L80O9324j34207Q102P7637J24081P0438J1782r7592L4288o3570p0585
$$ -143828 -143448 -74124 -208331 -200229 -122592 1489 71927 83709 -13883 20405 -43165 -113750
25503a13750R0794m1485n2634m2967J58558J86207K2520J09438m5427P643q567
$$ -113750 -22956 -64441 -117075 -160042 -1484 184723 207243 316681 271254 278897 270330
25492B70330o7097j40328n5982j173l1306J29443l7112j27294p2051K1833J9605
$$ 270330 203233 62905 6923 5750 -25556 103887 66775 -60519 -132570 -110737 -91132
25481i1132Q2127L2194l9145Q2416P182m5119j20406k6564O7093P4122r6040R2889
$$ -91132 -9005 23189 -15956 66460 73642 28523 -91883 -118447 -51354 22768 -73272 19617
25469A9617Q0592m7248j46065j23755Q654L0776J74467J84997o8903j17568O8662
$$ 19617 100209 52961 -93104 -216859 -208205 -177429 -2962 182035 113132 -4436 64226
25458F4226j41285K8546P3088O4338J78701M5565j70517j81030r4045L8780L169
$$ 64226 -77059 -48513 24575 88913 267614 313179 142662 -38368 -132413 -93633 -90464
25447i0464L0086Q7873N3507M0799J4249L7430j76960j42999J44664n5411o367
$$ -90464 -60378 27495 81002 121801 136050 173480 -3480 -146479 -1815 -57226 -63593
25436f3593Q7798N9605J1426l6077j04298J01458l2167J25420M8582n0209p9986
$$ -63593 24205 83810 95236 59159 -45139 56319 24152 149572 198154 147945 67959
25425F7959K9085k3067j99525K2028N6164j10445J5454K07119J37533l426q1291
$$ 67959 97044 73977 -125548 -103520 -47356 -157801 -142347 64772 202305 198879 117588
25414A17588j68886K508k1242o9567j5695K71221M434n8321j91199q2722R3647
$$ 117588 -51298 -48790 -70032 -139599 -155294 115927 120361 62040 -129159 -211881 -118234
25403a18234J34597O9157Q7929q8565q0220j04795K3342n3637l9211J68156j402
$$ -118234 16363 85520 173449 84884 4664 -100131 -76789 -130426 -169637 -1481 -2883
25392b883M212J11185n8850j09091o9318O4607R6259P8924L1153p7663j17911
$$ -2883 1329 112514 53664 -55427 -124745 -60138 36121 115045 146198 68535 -49376
25381d9376N5869l5985j15484q7996P9878J51742j4557L2226J23130Q7649q9936
$$ -49376 6493 -29492 -144976 -232972 -153094 -1352 -15909 16317 139447 227096 137160
25370A37160q5327J640J6975j45014J6384j18667O7450k2729Q3801N2625O7038
$$ 137160 51833 53473 70448 -74566 -58182 -176849 -109399 -132128 -48327 4298 71336
25359G1336M077J7365q148N1038l1834l0510o5251Q9598j49233j09894J02974
$$ 71336 75413 92778 84630 135668 103834 73324 8073 97671 -51562 -161456 -58482
25348e8482R3668J64471j46065p8049K32395k4251k5626k3263k50465L2915Q9428
$$ -58482 35186 199657 53592 -24457 207938 183687 158061 134798 -115667 -82752 6676
25337F676L6494N5537j32244p5732l4593J5906J17837J8027o3810J02335j1985
$$ 6676 43170 98707 -33537 -109269 -143862 -127956 -10119 7908 -55902 46433 34448
25326C4448j32217o511K4224j35582J12403J52684l685m0810j42754l2082L3850
$$ 34448 -97769 -104280 -80056 -215638 -103235 49449 45764 4954 -137800 -169882 -136032
25315a36032M1332K659l573L1228j29045M572K9116R4921J9989m1800J57129R3704
$$ -136032 -94700 -92041 -95614 -64386 -193431 -188859 -159743 -64822 -44833 -86633 70496 164200
25303A64200J31440r3813j63143P965P0638j6759j23136K4951O2096J9564J0066
$$ 164200 295640 201827 38684 46649 117287 100528 -22608 2343 64439 84003 94069
25292I4069m058k5415J17765M0797N2911j97566j34321J60205K0172l3563L2093
$$ 94069 90011 64596 182361 223158 276069 78503 -55818 104387 124559 90996 123089
25281A23089L5205p7149N6864o2673O0118Q9892r422J1938j08277n6881L5407
$$ 123089 158294 81145 138009 75336 135454 225346 215924 227862 119585 62704 98111
25270I8111J3663m3785N584R7768J72163n7672m7081o0232k07876Q6752J51673
$$ 98111 111774 67989 73573 171341 343504 285832 238751 178519 -29357 57395 209068
25259B09068J5622K07916k4858q3347n0012o5083k02256j18480J81230o0215n8713
$$ 209068 224690 432606 407748 324401 274389 209306 7050 -111430 69800 9585 -49128
25248d9128R4073n8463k25456n1329J38833J33080k4042j67778O3124K44133q3050
$$ -49128 44945 -13518 -238974 -290303 -151470 -18390 -42432 -210210 -147086 97047 13997
25237A3997j73705P8895j1638r9503j02488P3322j1996o2430K30127q4840j35343
$$ 13997 -159708 -80813 -92451 -191954 -294442 -221120 -233116 -295546 -65419 -150259 -285602
25226b85602j6722K21880J34284l2663m224l2663L6745q5711r142M922j3957J48886
$$ -285602 -302324 -80444 53840 21177 16953 -15710 21035 -64676 -73818 -68896 -82853 66033
25214F6033J52015j35115j36036l8055J11655J51389N7072q9429P1924k4747l3256
$$ 66033 218048 82933 -53103 -91158 20497 171886 228958 139529 211453 186706 153450
25203A53450j08327n8094Q1280J9155j38339j47147k3188J35177Q0507J00255
$$ 153450 45123 -12971 68309 87464 -50875 -198022 -221210 -86033 -5526 94729
25193I4729P3420J60080m6570q2001o0642l17496k9215j67046l4889J01821n5570
$$ 94729 168149 328229 281659 199658 139016 -178480 -207695 -374741 -409630 -307809 -363379
25182c63379Q5000O0210j5N1398k8228R7293K1943J12556K1669j97692Q2803J07828
$$ -363379 -278379 -218169 -218184 -166786 -195014 -97721 -75778 36778 58447 -139245 -56442 51386
25170E1386J00754q017n9010r9929O7302J9188j01710L3978N719j17160R2601
$$ 51386 152140 144123 85113 -14816 52486 71674 -30036 3942 9661 -107499 -14898
25159a4898m8422N0870J45610M1644j11082j00192M5581J05715J88329j03608
$$ -14898 -63320 -12450 133160 174804 63722 -36470 9111 114826 303155 199547
25149A99547j06092R2591r6787K8480n7751M9028q9677j99420K7933K52036J051
$$ 199547 93455 186046 89259 117739 59988 109016 19339 -180081 -152148 99888 100939
25138A00939j81686O82N4259Q5804N3060K6006M9844J7838j40248k93547J6877
$$ 100939 -80747 -80065 -25806 59998 113058 139064 188908 206746 66498 -227049 -210172
25127b10172J20042L8218M2080Q356n0206K23372M3668j84805J5931M4426Q6492
$$ -210172 -90130 -51912 -9832 -1476 -51682 171690 215358 30553 46484 90910 177402
25116A77402n6524j28252k60830J21702J35140O1244K10116N9542l2956l16276
$$ 177402 120878 -7374 -268204 -146502 -11362 49882 259998 319540 286584 -29692
25106b9692j70897O5161j5598J09996K48915L8374j50768n5236n1339j19417Q6921
$$ -29692 -200589 -135428 -151026 -41030 207885 246259 95491 40255 -11084 -130501 -43580
25095d3580j0451j20866J86377M4012k1483j935L7614o977N4322K81469p2642
$$ -43580 -54031 -174897 11480 55492 34009 32074 69688 62711 117033 398502 325860
25084C25860q9809n6977q1340k03051K8915O3694m9424k7893j74648k73008j34349
$$ 325860 236051 179074 97734 -105317 -76402 -12708 -62132 -90025 -264673 -537681 -672030
25073f72030J98270J37304Q6057N6145J49205J91418J74154l4144j38617m4416
$$ -672030 -473760 -336456 -250399 -194254 -45049 146369 320523 286379 147762 103346
25063A03346J5408j22299L787j12639J09229R235p4470k2492J08709J27064J76861
$$ 103346 118754 -3545 242 -112397 -3168 6067 -68403 -90895 17814 144878 321739
25052C21739L0717J08635k63708k75042m0736J13564J30510o5056m2372m1992
$$ 321739 352456 461091 197383 -77659 -118395 -4831 125679 60623 18251 -23741
25042b3741j21394k7233k6404M7157j8036M2394K395J0829J77431L7138M207o0312
$$ -23741 -145135 -172368 -198772 -151615 -169651 -127257 -124862 -114033 63398 100536 104743 44431
25030D4431j59203n544r2825k42643J70957m793r0726j0362J57727R6204J33687
$$ 44431 -114772 -120316 -213141 -455784 -284827 -289620 -380346 -390708 -232981 -136777 -3090
25019c090J45164k2277j19457J35004J67691k23751j62700O8337r2680j39319
$$ -3090 142074 119797 340 135344 303035 79284 -83416 -15079 -107759 -247078
25009b47078J34262L16659j1747J13514o8115j43865j62712R2024K4661j88739
$$ -247078 -112816 203843 192096 305610 237495 93630 -69082 22942 47603 -141136
24999a41136j24455k1972l8832K22644J50518M4490J59261Q6772l6771j12912
$$ -141136 -265591 -287563 -326395 -103751 46767 91257 250518 337290 300519 187607
24989A87607j01293n1599j06950j17403N4304J20236J15432J23160j80464o5432
$$ 187607 86314 34715 -72235 -189638 -135334 -15098 100334 223494 43030 -22402
24979b2402q770j70605p8147k5506K1007N4981m985m3407J25945Q5154J39797
$$ -22402 -31172 -201777 -279924 -305430 -284423 -229442 -234427 -277834 -151889 -66735 73062
24968G3062J44911o168j00858N3897n1179j04095k9244j8842n1517J02488j8181
$$ 73062 217973 211805 110947 164844 113665 9570 -19674 -38516 -90033 12455 -5726
24957e726J61034O3959r0329J66006L5744j98106n8581J3462N9427n2919j38540
$$ -5726 155308 219267 128938 294944 330688 132582 74001 87463 146890 93971 -44569
24946d4569M5520P6778n7071j39624l0401J49484P1196k862j06587k2696L7239
$$ -44569 951 77729 20658 -118966 -149367 117 71313 68451 -38136 -60832 -23593
24935b3593j80269r1232J37730m6651k1580O4029k12100Q3259J06597l2819P6747
$$ -23593 -203862 -295094 -157364 -204015 -225595 -161566 -373666 -290407 -183810 -216629 -139882
24924a39882J01753n6398m1092j09676l7136N9548k090j46562l235m2914K28399
$$ -139882 -38129 -94527 -135619 -245295 -282431 -222883 -224973 -371535 -374770 -417684 -189285
24913a89285J05986Q1389p9086n2791j1738j19319k0595K4533J15181J3233j2855
$$ -189285 -83299 -1910 -80996 -133787 -145525 -264844 -285439 -260906 -145725 -132492 -145347
24902a45347J61164N3489p6346m1306J32151O9054N9728j37588p7512M8623Q1012
$$ -145347 15817 69306 -7040 -48346 83805 152859 212587 74999 -2513 46110 127122
24891A27122k4861P5850q7579l5996K1734k2399l0160j62777J13136J71429K06059
$$ 127122 102261 178111 90532 54536 76270 53871 23711 -139066 -25930 145499 351558
24880C51558j08077r3733r7997j01344q7171O4823K17327J25347q0062o7309o697
$$ 351558 243481 149748 51751 -49593 -136764 -71941 145386 270733 190671 123362 116665
24869A16665p5004p5700k5900n602K939P5564J43145N8351n4794j28917l3299
$$ 116665 41661 -34039 -59939 -65541 -62602 12962 156107 214458 159664 30747 -2552
24858b552p0733j12467L5898M5672J66940l0625j03310l2306j78125m8111J92590
$$ -2552 -73285 -185752 -149854 -104182 62758 32133 -71177 -103483 -281608 -329719 -137129
24847a37129K26199M2950P022l6199N8588K7269J40831n8676j07941k8914j01375
$$ -137129 89070 132020 139042 102843 161431 188700 329531 270855 162914 134000 32625
24836C2625q4634K4745l3206p5301J56370K0411r552P2401q6682k00247n4289
$$ 32625 -52009 -27264 -60470 -135771 20599 41010 31458 103859 17177 -183070 -237359
24825b37359J59525k0990K369N6544J43844M7295L1480j04723k14022q9920J44769
$$ -237359 -77834 -98824 -96455 -39911 103933 151228 182708 77985 -136037 -225957 -81188
24814h1188J47397O3004j54149k0952k7550M674P8592N6875L741k4287K0534l0310
$$ -81188 66209 129213 -24936 -45888 -73438 -68764 9828 66703 70444 46157 66691 36381
24802C6381l3670J65682k9014r9438P240J74616R0492Q1380j20140r3323o3667
$$ 36381 2711 168393 139379 39941 47181 221797 312289 393669 273529 180206 116539
24791A16539p6338k6565l4390M2065Q7164R3603k0575o2916n7044p6631J44629
$$ 116539 40201 13636 -20754 21311 108475 202078 181503 118587 61543 -15088 129541
24780A29541R3371K7470j36155m2416N8331P2517j44292j15312k44522J5606K73341
$$ 129541 222912 250382 114227 71811 130142 202659 58367 -56945 -301467 -285861 -12520
24769a2520J06139J5037j1213J8666J23543L0534k20366j4091o5019j4160k0088
$$ -12520 93619 108656 97443 116109 239652 270186 49820 35729 -29290 -43450 -63538
24758f3538p7575J20151L9644J37171j6450j26035j91078j4784k675l4724J9241
$$ -63538 -141113 -20962 18682 155853 139403 13368 -177710 -192494 -195169 -229893 -210652
24747b10652J29842J22397j44816r3016J2410J15453n6949p4163M9818J38273
$$ -210652 -80810 41587 -103229 -196245 -183835 -68382 -125331 -199494 -149676 -11403
24737a1403j26305O4636P6109j15647p3054j58025Q5790R1128O1392J27667q1446
$$ -11403 -137708 -73072 3037 -112610 -185664 -343689 -257899 -166771 -105379 22288 -59158
24726e9158j29120j08932n2189J07481N3229o2391K02139J76246k6622k41137
$$ -59158 -188278 -297210 -349399 -241918 -188689 -251080 -48941 127305 100683 -140454
24716a40454K717L9235J91330P3596j19505n1738j75372P6130N8866K3953l1564
$$ -140454 -137737 -98502 92828 166424 46919 -4819 -180191 -104061 -45195 -21242 -52806
24705e2806N271k8858J94564k4012r3946q7380q912M7168O6040J5392j04368k5946
$$ -52806 -47535 -76393 118171 94159 213 -87167 -96079 -48911 17129 32521 -71847 -97793
24693i7793K26448J84870P6372n2164l90935p9937J76339J10043j21612k25417
$$ -97793 128655 313525 389897 337733 -53202 -133139 43200 153243 31631 -193786
24683a93786M3507k2235j32600O8340K00224j19237j055J01714L1909l7683J56299
$$ -193786 -150279 -172514 -305114 -236774 -36550 -155787 -156842 -55128 -23219 -60902 95397
24672I5397m2467L6426Q3730M4499o3859J6165L5315j10810j66902j965j14999
$$ 95397 52930 89356 173086 217585 153726 169891 205206 94396 -72506 -74471 -189470
24661a89470O5495j52565j5005J03543L8550M0301m57N0184m8731J115O7181J27367
$$ -189470 -123975 -276540 -291545 -188002 -149452 -109151 -109608 -59424 -108155 -107040 -39859 87508
24649H7508n6729O3961k33247L4980K15585J1268m3650L3839R5345O6362k8831
$$ 87508 30779 94740 -138507 -103527 112058 123326 79676 113515 208860 275222 246391
24638B46391n6136q5968j443k3631K232k1299p6238o2995j637o6219j49046J6494
$$ 246391 190255 104287 102844 79213 81445 60146 -16092 -79087 -80724 -146943 -295989 -279495
24626b79495j7072l1058K4184J98062J54376j16708j47743N3174P9371K3674K55446
$$ -279495 -296567 -327625 -303441 -105379 48997 -67711 -215454 -162280 -82909 -59235 196211
24615A96211K28515N9473j01486q8760j07637j48839j06378M6999N9898j12820
$$ 196211 424726 484199 382713 293953 186316 37477 -68901 -21902 37996 -74824
24605g4824m3144P7683J8826K6342q2774n3591L1612j00864N8432M9128r5684
$$ -74824 -117968 -40285 -21459 4883 -77891 -131482 -99870 -200734 -142302 -93174 -188858
24594a88858j24742J41176J81203j4486j68669j35534J9099J12671J27391Q6268
$$ -188858 -313600 -172424 8779 -5707 -174376 -309910 -290811 -178140 -50749 35519
24584C5519N9682R7282j25163j59310m2623k8979l1421j3191J38364J1168n7444
$$ 35519 95201 192483 67320 -91990 -134613 -163592 -195013 -208204 -69840 -58672 -116116
24573a16116J533M170J38777K43370n3203j19153k65483j62047n0678O517J6312
$$ -116116 -114583 -110413 28364 271734 218531 99378 -166105 -328152 -378830 -372313 -356001
24562c56001J0307K67296K83142k2225j06766j07588K2664M5037l9819N7076m6046
$$ -356001 -345694 -78398 204744 182519 75753 -31835 -9171 35866 -3953 53123 7077
24551G077j13340J3025j410q114P2289N2508j1178m9830q3661O1955J41784m3111
$$ 7077 -106263 -93238 -94648 -102762 -30473 22035 10857 -38973 -122634 -60679 81105 37994
24539C7994j34157J60466J7945r5327J39875m4088j11474Q975k0341J64301k9343
$$ 37994 -96163 64303 82248 -13079 126796 82708 -28766 -19791 -40132 124169 94826
24528I4826j01623o5262l6768K15017n5657n3360j05450Q0890j40968j50086k0828
$$ 94826 -6797 -72059 -108827 106190 50533 -2827 -108277 -27387 -168355 -318441 -339269
24517c39269J13974K11312j28854o5643J91865J8513n517j1124O1203l8372k34438
$$ -339269 -225295 -13983 -142837 -208480 -16615 1898 -3619 -14743 46460 8088 -226350
24506b26350n6075O231R0544r379n8445l2410N8206m0173Q2602J01334N7567p1099
$$ -226350 -282425 -276194 -185650 -195029 -253474 -285884 -227678 -267851 -185249 -83915 -26348 -97447
24494i7447r5223j03778K4521J02610J84466O4703q5020j13706k86758J81551
$$ -97447 -192670 -296448 -271927 -169317 15149 79852 -5168 -118874 -405632 -224081
24484b24081j3775K6678J59813J35388R5362J80582J9608O6243j08718j83902
$$ -224081 -237856 -211178 -51365 84023 179385 359967 379575 445818 337100 153198
24474A53198r9139J29355j56424k26795O5239K19261L9032p7570l9972M3728k9251
$$ 153198 54059 183414 26990 -199805 -134566 84695 123727 46157 6185 49913 20662
24463B0662L3582J40909J5412j08419r5588P398J3388m7771L0150p9359L6762
$$ 20662 54244 195153 210565 102146 6558 13956 27344 -20427 9723 -69636 -32874
24452c2874J05008M7574Q0573k9182q5005j43745J16483j0959p788q2491j68200
$$ -32874 72134 119708 200281 171099 86094 -57651 58832 47873 40085 -42406 -210606
24441b10606l2056j14238m2430N8382K51097P3526j8989o7837j759J29283o0251
$$ -210606 -242662 -356900 -399330 -340948 -89851 -16325 -35314 -103151 -104910 24373 -35878
24430c5878j42150K8839R1665M3862J9402K66321r4190o2533j8920k20984k23094
$$ -35878 -178028 -149189 -57524 -13662 5740 272061 177871 115338 96418 -124566 -347660
24419c47660N5766K89819n1769n5064p3917l2586Q1231J07274N4767n0186O5761
$$ -347660 -291894 -2075 -53844 -108908 -182825 -215411 -134180 -26906 27861 -22325 43436
24408D3436m8276j45316O227J30223M6998L4991p278o5168L475R0878M4204l7345
$$ 43436 -4840 -150156 -143929 -13706 33292 68283 61005 -4163 -688 90190 134394 97049
24396I7049J48314O4021K6485n7247r275j38461k31695K937J52668M0299q7988
$$ 97049 245363 309384 335869 278622 269347 130886 -100809 -97872 54796 95095 7107
24385G107j39907R3835j08387J50040P6620N865p3390j62422j56407L7196J55055
$$ 7107 -132800 -38965 -147352 2688 79308 85173 11783 -150639 -307046 -269850 -114795
24374a14795P0339R2535K9362l296Q9034L7949o2123p7627o2350O7308M5643q3981
$$ -114795 -44456 48079 77441 74145 163179 201128 139005 61378 -972 66336 111979 27998
24362B7998j01735l5138m0455n3360J14603P0259p1702j35250R7992J42245J17742
$$ 27998 -73737 -108875 -149330 -202690 -88087 -17828 -89530 -224780 -126788 15457 133199
24351A33199J11099q3212j79358m2673L2284K0617p3097j09294m769o5859J67673
$$ 133199 244298 161086 -18272 -60945 -28661 -8044 -81141 -190435 -195204 -261063 -93390
24340i3390R9601q1209N5802J05825m6686J0613L7314k294o4913O2211O9611j86578
$$ -93390 6211 -74998 -19196 86629 39943 50556 87870 85576 20663 82874 152485 -34093
24328c4093l9492j9009j4213K7227q2352j34687Q1143L99981n957l6266R1699
$$ -34093 -73585 -92594 -106807 -79580 -161932 -296619 -215476 184505 178548 142282 233981
24317B33981o4759J5993P0851L2117K0527j23427O50j80242j43006P7982Q4208
$$ 233981 169222 185215 256066 288183 308710 185283 185933 5691 -137315 -59333 24875
24306B4875l8413j332J17152q5230j12924J17758K28306M4482l4283j64947q6001
$$ 24875 -13538 -14870 102282 17052 -95872 21886 250192 294674 260391 95444 9443
24295I443J18933n02O5284p7850k4894M3765j95175j77544j71294o4765J55467
$$ 9443 128376 127874 193158 115308 90414 134179 -60996 -238540 -409834 -474599 -319132
24284c19132J27684J54869l996O1656p9449q9161p6604j9303k2997j3908n1693
$$ -319132 -191448 -36579 -40575 21081 -58368 -147529 -224133 -243436 -266433 -280341 -332034
24273c32034k469K9122k2934J9648j9218J08519Q1380n1290K4384J89281n3527
$$ -332034 -334503 -305381 -328315 -308667 -327885 -219366 -137986 -189276 -164892 24389 -29138
24262b9138m0591n2954j24564J8859L7798J79743q8059p2082k2574J43121J37701
$$ -29138 -69729 -122683 -247247 -228388 -190590 -10847 -98906 -170988 -193562 -50441 87260
24251H7260k74408n3139J63180l4457N0091J27627j13735m1175M1774Q3853K9534
$$ 87260 -187148 -240287 -77107 -111564 -61473 66154 -47581 -88756 -46982 36871 66405
24240F6405R1207J50264j38835k8561l634o8993N9305j50658r1959j3080J86574
$$ 66405 157612 307876 169041 140480 136846 67853 127158 -23500 -115459 -128539 58035
24229E8035N1101K0229j26764j25445K6950J39150o7728J0831m448p3783M0434
$$ 58035 109136 129365 2601 -122844 -95894 43256 -24472 -13641 -18089 -91872 -51438
24218e1438j00052k09327J64114J6472O7473M7930j36040K26700J72592k16146
$$ -51438 -151490 -360817 -196703 -180231 -112758 -64828 -200868 25832 198424 -17722
24208a7722j28903q4883M9965O9831K35953N5755j23724k54968j27390Q8724R9124
$$ -17722 -146625 -231508 -181543 -111712 124241 179996 56272 -198696 -326086 -237362 -138238
24197a38238M6165J39373L7467p2463j50036p9152J38584J02731L0992r16K0232
$$ -138238 -92073 47300 84767 12304 -137732 -216884 -78300 24431 55423 54507 74739
24186G4739k8679n1403L6139k41158q8841J16097Q1605K61601K9657J18238n1802
$$ 74739 46060 -5343 30796 -210362 -299203 -183106 -101501 160100 189757 307995 256193
24175B56193l59778j50996K4457R7177O2179m5544O5600N9206j476l682j5732
$$ 256193 -103585 -254581 -230124 -132947 -70768 -116312 -50712 8494 7018 3336 -12396
24164a2396L6404J247K11804N8702q5298j75804o703m2926k0281l1336R1160J44312
$$ -12396 24008 25255 237059 295761 210463 34659 27956 -14970 -35251 -66587 24573 168885
24152A68885Q8485J4275p5719m402N8408r1479p8798J08906j8147K8226K8907
$$ 168885 257370 271645 195926 191524 249932 158453 79655 188561 170414 198640 227547
24141B27547p3496q3897o3106l982k6421J14870J6905o1499o9571K1492m1983
$$ 227547 154051 70154 7048 3066 -23355 91515 108420 46921 -22650 -1158 -43141
24130d3141O603P1182m9086j52175L8401K97101K9988j20258k4570K782L2812
$$ -43141 -36538 34644 -14442 -166617 -128216 168885 198873 78615 54045 56827 89639
24119H9639J16959m7423l15888Q326K46255J21667q1224J6562M3848r0563K42
$$ 89639 206598 159175 -156713 -148387 97868 219535 138311 154873 198721 108158 108400
24108A08400j59279n1535n8742j37365o3359M3063J28592l3216m6875k1970q4696
$$ 108400 -50879 -102414 -161156 -298521 -361880 -318817 -190225 -223441 -270316 -292286 -376982
24097c76982K0833J67838O3845j5921n2751J10491J66653k1006j61052P0r660
$$ -376982 -356149 -188311 -124466 -140387 -193138 -82647 84006 63000 -98052 -97982 -107642
24086a07642p0165r6115O3643J50899j6564P1704Q9571r5896j91641J32070L8997
$$ -107642 -177807 -273922 -210279 -59380 -75944 -4240 85331 -10565 -202206 -70136 -31139
24075c1139j38887j0885P6243J350K648J1933J7096J2692L9082J65322L9990k22371
$$ -31139 -170026 -180911 -104668 -103318 -100670 -88737 -71641 -58949 -19867 145455 185445 -36926
24063c6926M8414R0253j87974l0389M1718j45316j01767P2469L1825J40436L5869
$$ -36926 11488 101741 -86233 -116622 -74904 -220220 -321987 -249518 -217693 -77257 -41388
24052d1388L8684k7678j77230j51508J37892J11369J12885R7685O369j40664j04547
$$ -41388 -2704 -30382 -207612 -359120 -221228 -109859 3026 100711 107080 -33584 -138131
24041a38131J1603m6198J2153J4075n1285j18175J82451J10869j01323J30218
$$ -138131 -126528 -172726 -160573 -146498 -197783 -315958 -133507 -22638 -123961 6257
24031F257N092j3715m7179M13P4490m1489Q5227J4606J11247P654k36326L3226
$$ 6257 11349 -2366 -49545 -49132 25358 -16131 69096 83702 194949 202603 -33723 -497
24019d97J22977j45333J9550P3257Q4133j29463j07761N1349n6007J67127J7201
$$ -497 122480 -22853 -3303 69954 154087 24624 -83137 -31788 -87795 79332 96533
24008I6533n8670M0077j25951p9132R4843R684M7853J02411O3652N1826r951n6217
$$ 96533 37863 77940 -48011 -127143 -32300 -22616 25237 127648 191300 243126 233175 176958
23996A76958K700k3933k6112n0899r2713k5795l686o4444q83J15817o612J60986
$$ 176958 179658 155725 129613 78714 -13999 -39794 -43480 -107924 -108807 7010 398 161384
23984A61384m9847r9584P1539J93082R9201j72961j73051l0593j06826Q2235P0045
$$ 161384 111537 11953 83492 276574 375775 202814 29763 -830 -107656 -25421 44624
23973D4624J6161q620p373O8003N2621M6838J70228o4893r6256q3107j28229r6582
$$ 44624 60785 52165 44792 112795 165416 212254 382482 317589 221333 138226 9997 -86585
23961h6585Q7165j1333k0465M0786k8180K2753k4314k5856n6020o1541k2978R0168
$$ -86585 580 -10753 -31218 9568 -18612 4141 -20173 -46029 -102049 -163590 -186568 -96400
23949i6400J21226j4797l2492j06994m3677N4843m8417O1816K5564J42053K0155
$$ -96400 24826 10029 -22463 -129457 -173134 -118291 -166708 -104892 -79328 62725 82880
23938H2880j1750J5715l3123m4481N2583J9144m7848O1600L484n2334m3345L026
$$ 82880 71130 86845 53722 9241 61824 80968 33120 94720 98204 45870 2525 5551
23926E551J9494N3557j6876j33257j5682J37504Q2392o3624J7131q7102R3760
$$ 5551 25045 78602 61726 -71531 -87213 50291 132683 69059 86190 -912 92848
23915I2848Q025j16663k2170L1846L6065K1260P6662r1905K26538O553j01214
$$ 92848 100873 -15790 -37960 -6114 29951 51211 127873 35968 262506 269059 167845
23904A67845q7326J06661l2012k6696o6983j33673j29234l0347J21173j3332R5781
$$ 167845 80519 187180 155168 128472 61489 -72184 -201418 -231765 -110592 -123924 -28143
23893b8143P2324j04730l16804P6008R1042P6655j6248J2883k5775q862r3174
$$ -28143 44181 -60549 -377353 -301345 -210303 -133648 -149896 -137013 -162788 -171650 -264824
23882b64824P2102M9066J01475J5742o094L0904j08844j40960m0987Q5478J11182
$$ -264824 -192722 -143656 -42181 -26439 -32533 -1629 -110473 -251433 -292420 -206942 -95760
23871i5760K7933P0667j6780j2747K02689n311k54064j5186J20963K06252N9293
$$ -95760 -67827 2840 -13940 -26687 176002 170691 -83373 -98559 22404 228656 287949
23860B87949k6483J43310O6655j88013j90722l1865k2845N4132k9951r9217Q6623
$$ 287949 261466 404776 471431 283418 92696 60831 37986 92118 62167 -37050 49573
23849D9573L2668O9395n6044r2534k5693j0572j33983L7280N3610J06114K28542
$$ 49573 82241 151636 95592 3058 -22635 -33207 -167190 -129910 -76300 29814 258356
23838B58356j28967j43447r564j37720j02674J97635J34557J8347O3969j2719
$$ 258356 129389 -14058 -23622 -161342 -264016 -66381 68176 86523 150492 137773
23828A37773n123j36989j25995N2545M8673J04628m8839N1398K6102Q0349k5026
$$ 137773 132650 -4339 -130334 -77789 -29116 75512 26673 78071 104173 184522 159496
23817A59496l340K1297j69403k2925k38880o5460O2746J56507Q7071j39661j1649
$$ 159496 156156 177453 8050 -14875 -253755 -319215 -256469 -99962 -12891 -152552 -164201
23806a64201K30464J7939J08888J30114o8156j72530j1131J14579M327p1545P6614
$$ -164201 66263 84202 193090 323204 255048 82518 71387 185966 190293 118748 195362
23795A95362p3952p5902J672J02035Q9895K0157J08015J07121q2998k04405r9829
$$ 195362 121410 45508 47180 149215 239110 259267 367282 474403 391405 187000 87171
23784H7171N7895j13971p0293p1162K4216j27640J15250m5344k0555J1875L5701
$$ 87171 145066 31095 -39198 -110360 -86144 -213784 -98534 -143878 -164433 -152558 -116857
23773a16857J4417n3452r453j22657p6047m1356K55358K05458j1753J2661n1390
$$ -116857 -102440 -155892 -165345 -288002 -364049 -405405 -150047 55411 43658 56319 4929
23762D929p3832L6789K9946o8517j3440M6474J50176M5979j6577l8111o0767l6885
$$ 4929 -68903 -32114 -2168 -70685 -84125 -37651 112525 158504 141927 103816 43049 6164
23750F164J09840J4400o9651K2061N3988N4030k79141k33908J222n4332Q7796
$$ 6164 116004 130404 60753 82814 136802 190832 -88309 -322217 -320995 -375327 -287531
23739b87531K07066J17499P2467j29444m9623n1833k6262P6061o8531P6699J98796
$$ -287531 -80465 37034 109501 -19943 -69566 -121399 -147661 -71600 -140131 -63432 135364
23728A35364J30636J0295k09152n3218O0427m245O9948J06556n7066p2266J4462
$$ 135364 266000 276295 67143 13925 74352 70107 140055 246611 189545 117279 131741
23717A31741j17257P37l9378q6050R6801q8989r465o3298J58808J81229J11287
$$ 131741 14484 15221 -24157 -110207 -13406 -102395 -111860 -175158 -16350 164879 276166
23706B76166l6714j02719q7421r3231j68988m9257O5932L4582r3247m3711K1624
$$ 276166 239452 136733 49312 -43919 -212907 -262164 -196232 -161650 -254897 -298608 -276984
23695b76984Q7362M222q1600N652J18581J02252J42366J10166p9430M6841o1348
$$ -276984 -189622 -185400 -267000 -261348 -142767 -40515 101851 212017 132587 179428 118080
23684A18080j58701q9426J24044K6288J20549L7648n1475r8810n3765J67714j31139
$$ 118080 -40621 -130047 -6003 20285 140834 178482 127007 28197 -25568 142146 11007
23673A1007l32779P4633l609j13071Q2941L38808m7898M7117J16014j39365r3071
$$ 11007 -321772 -247139 -250748 -363819 -280878 57930 10032 57149 173163 33798 -59273
23662e9273o7687n3584j02291Q311R67R0754J31256J42773Q4031q5336K0194L7364
$$ -59273 -126960 -180544 -282835 -274524 -273557 -182803 -51547 91226 175257 89921 110115 147479
23650A47479M3214L2962J08824j5605j00662l3850j03214P149j1219k2204k8238
$$ 147479 190693 223655 332479 316874 216212 182362 79148 86297 75078 52874 24636
23639B4636r0343K55500Q6023j39928o5114J33403j02856r7355K0955j3258p3706
$$ 24636 -65707 189793 275816 135888 70774 204177 101321 3966 24921 11663 -62043
23628f2043m4537r7867J02770J15524J44562o2832P8691l2418j1854L4286J8442
$$ -62043 -106580 -204447 -101677 13847 158409 95577 174268 141850 129996 164282 182724
23617A82724o3434k459R1141n8139j06289Q7465J91585J9692k1402j34203j44569
$$ 182724 119290 116831 207972 149833 43544 131009 322594 342286 320884 186681 42112
23606D2112j10256N8918k06798J594q3364j76107O8835J58140K9460j07783j09023
$$ 42112 -68144 -9226 -216024 -214430 -297794 -473901 -405066 -246926 -217466 -325249 -434272
23595d34272J62645J40933m0359k7980J04493L5285O7412O8893n3576p4260M4385
$$ -434272 -271627 -130694 -171053 -199033 -94540 -59255 8157 77050 23474 -50786 -6401
23584f401O9675o2514q5671N3554M9850n2454J16580J42278J19213j16986P7729
$$ -6401 63274 760 -84911 -31357 18493 -33961 82619 224897 344110 227124 304853
23573C04853m1204q4931j18334k3675N7218j72752j74249J54273k367R7308p3102
$$ 304853 263649 178718 60384 36709 93927 -78825 -253074 -98801 -101168 -3860 -76962
23562g6962p3077k0666n8963k4375J60237Q4659j86248J44329L9825j09364j07482
$$ -76962 -150039 -170705 -229668 -254043 -93806 -9147 -195395 -51066 -11241 -120605 -228087
23551b28087L9173j2605n287J19003J10804K628j57459M7419J75782m0070l0938
$$ -228087 -188914 -201519 -206806 -87803 23001 25629 -131830 -84411 91371 51301 20363
23540B0363J5393r4903J3417Q0168K5495p5650j65843J1363P626J55828P3239
$$ 20363 35756 -59147 -45730 34438 59933 -15717 -181560 -170197 -162571 -6743 66496
23529F6496J8060K3980q783r6781o896j18664j19622J40769J24122J74389k36448
$$ 66496 84556 108536 99753 2972 -3924 -122588 -242210 -101441 22681 197070 -39378
23518c9378j85979p6600Q8908N200K15216K67187l4156L3142R0137j0941j37857
$$ -39378 -225357 -301957 -213049 -207849 7367 274554 240398 273540 363677 352736 214879
23507B14879j20264o0438r5907J1464J73983J05352k37471p0910O8102J52792
$$ 214879 94615 34177 -61730 -50266 123717 229069 -8402 -79312 -11210 141582
23497A41582M0240k2311q7442M9452R2909J02946l2484k78910r7094J9281k4838
$$ 141582 181822 159511 72069 121521 214430 317376 284892 5982 -91112 -71831 -96669
23486i6669n6297J16785O8042K13899k2791j42733j25976j97485j3481Q9920N8731
$$ -96669 -152966 -36181 31861 245760 222969 80236 -45740 -243225 -256706 -166786 -108055
23475a08055L3761K0281J28286L6648r1654j75370K742J18095m8200O811J19145
$$ -108055 -74294 -54013 74273 110921 19267 -156103 -153361 -35266 -83466 -76655 42490
23464D2490l2274P291q879M3510J36368j9209k20444j36759J37823l8140m8930
$$ 42490 10216 17507 8628 52138 188506 169297 -51147 -187906 -50083 -88223 -137153
23453a37153k4272J67472K43988J26611m5134j18938p3152n8131j34344k1513
$$ -137153 -161425 6047 250035 376646 331512 212574 139422 81291 -53053 -74566
23443g4566J6958M799P0741m5312R591O2485J10300k8312j43880j60685R2264
$$ -74566 -57608 -52809 17932 -27380 -17789 44696 154996 126684 -17196 -177881 -85617
23432h5617J71748N2174j0692J36752q3952j12602k79382r6956R7586J11903O9925
$$ -85617 86131 138305 127613 264365 180413 67811 -211571 -308527 -210941 -99038 -29113
23421b9113N1645m5646n5645l9825R0034P6679K4177j15117j5008j04865j38284
$$ -29113 22532 -23114 -78759 -118584 -28550 48129 72306 -42811 -57819 -162684 -300968
23410c00968R0352j3525n4856K517J65809J91462j08510L8274j02019j59393R1328
$$ -300968 -210616 -224141 -278997 -276480 -110671 80791 -27719 10555 -91464 -250857 -159529
23399a59529O0863K9531m9704Q5285J50180K1948j67397P2083K2018m6198p8729
$$ -159529 -98666 -69135 -118839 -33554 116626 138574 -28823 43260 65278 19080 -59649
23388e9649k1266J24625r099K3132O4529j02353k9536M8276n1650k29443j20202
$$ -59649 -80915 43710 34611 57743 122272 19919 -9617 38659 -12991 -242434 -362636
23377c62636L2768K44841J15735o9794J4432l7162n8415J28467Q549l4151J41591
$$ -362636 -329868 -85027 30708 -39086 -24654 -61816 -120231 8236 16785 -17366 124225
23366A24225o9290k10045j26149k8942k215R2192J03941j04792O6946J57486L866
$$ 124225 54935 -155110 -281259 -310201 -312416 -220224 -116283 -221075 -154129 3357 7223
23355G223j21129p6334j99310Q967K33828J88522M8640p1914N0402l9683j59447
$$ 7223 -113906 -190240 -389550 -380583 -146755 41767 90407 18493 68895 29212 -130235
23344a30235r2566J06314j29686K2458R0280R8867J52783J00719n0888j70122
$$ -130235 -222801 -116487 -246173 -223715 -133435 -34568 118215 218934 168046 -2076
23334b076k050J58671l8944n12j2061j07413n2174L9891L67473j5825m7884j19000
$$ -2076 -4126 154545 115601 115089 103028 -4385 -56559 -16668 350805 334980 287096 168096
23322A68096k09418j61787J97779q8042J5360J00923J26063j7133j0253K8535
$$ 168096 -41322 -203109 -5330 -93372 -78012 22911 148974 131841 121588 150123
23312A50123K7102j2096q629K5579J7133k820o3046j20872m7743J94132O8418
$$ 150123 177225 165129 156500 182079 199212 196392 133346 12474 -35269 158863 227281
23301B27281r36j7043k5810k86792k4475J51553Q7098n3530k05092o0107L2608
$$ 227281 226345 209302 183492 -103300 -127775 23778 110876 57346 -147746 -207853 -175245
23290a75245P4662J79851p2427n1742k6981J03184q7445n0840J13173L9662Q5091
$$ -175245 -100583 79268 6841 -44901 -71882 31302 -56143 -106983 6190 45852 130943
23279A30943n6492J9689p5362j48543n1461N4750L7109m2934P2728J25963O9437
$$ 130943 74451 94140 18778 -129765 -181226 -126476 -89367 -132301 -59573 66390 135827
23268A35827P8292j77964j53180j13762M021Q3525J55528J46233p0186n1860j37079
$$ 135827 214119 36155 -117025 -230787 -226766 -143241 12287 158520 88334 36474 -100605
23257a00605j04083Q1034N2307j7647o5613m8180Q560l3233j37556J9709R5963
$$ -100605 -204688 -123654 -71347 -88994 -154607 -202787 -194227 -227460 -365016 -345307 -249344
23246b49344J95560o341m4382N7246m860l3585L7644j35621n9950J56976P3634
$$ -249344 -53784 -60125 -104507 -47261 -52121 -85706 -48062 -183683 -243633 -86657 -13023
23235a3023m6592j23113O5157j5408M3205L50j47825L0o3101R0659O4346j5403
$$ -13023 -59615 -182728 -117571 -132979 -89774 -89424 -237249 -237219 -300320 -209661 -145315 -160718
23223a60718m857j23419N2366J13796k0184K579o9973m5912n9211p0157j2713
$$ -160718 -165575 -288994 -236628 -122832 -143016 -140437 -210410 -256322 -315533 -385690 -398403
23212c98403Q3116N0022J50043N2391o4900j40733J85884J30326P9180L7108k56995
$$ -398403 -315287 -265265 -115222 -62831 -127731 -268464 -82580 47746 126926 164034 -92961
23201i2961M2982n6961j36697L9298J03970Q36m4449L9735J14948l0352j92366
$$ -92961 -49979 -106940 -243637 -204339 -100369 -99533 -143982 -104247 10701 -19651 -212017
23190b12017n2947J11965O4242J70155Q2417j21333M0900m7596j20751J72482
$$ -212017 -264964 -152999 -88757 81398 163815 42482 83382 35786 -84965 87517
23180H7517J10716j41286j50277K29916K00956q0730m220q9128j27074R6727o7839
$$ 87517 198233 56947 -93330 136586 337542 256812 252592 163464 36390 133117 65278
23169F5278k4970Q4451Q2733j00148P658J62930j70676j01096M1975J21504J18221
$$ 65278 40308 124759 207492 107344 115002 277932 107256 6160 48135 169639 287860
23158B87860L6913J09374P4455j58746n8278M9601m6779j77409n7485o542J922
$$ 287860 324773 434147 508602 349856 291578 341179 294400 116991 59506 52964 54886
23147E4886l7838M3824n541R3851L2519K8334j91753j68372K0220J29668J25112
$$ 54886 17048 60872 55331 149182 181701 210035 18282 -150090 -129870 -202 124910
23136A24910M5351o5935j55795N6109O625r0059j16766O8924J14226n6220n0261
$$ 124910 170261 104326 -51469 4640 11265 -78794 -195560 -126636 -12410 -68630 -118891
23125a18891J53475l3640j36941j7056J6450j25027j18897j0423J48851J44051
$$ -118891 34584 944 -135997 -153053 -136603 -261630 -380527 -390950 -242099 -98048
23115i8048n8254L7693K7878m6610Q4545n7851O0255K44667m4337j19479j21192
$$ -98048 -156302 -118609 -90731 -137341 -52796 -110647 -50392 194275 149938 30459 -90733
23104i0733J538J01511P5566P7281O0023J1253M044o3153m6106r0680m125P6028
$$ -90733 -89195 12316 87882 165163 225186 236439 240483 177330 131224 40544 36419 112447
23092A12447K2433j32779j34669J7355q1469K7483J62976N0658k9548Q2960J74821
$$ 112447 134880 2101 -132568 -115213 -196682 -169199 -6223 44435 14887 97847 272668
23081B72668j7547j71471R1672m5695p9236k008q6641j64004k1130P5151J78363
$$ 272668 255121 83650 175322 129627 50391 48383 -38258 -202262 -223392 -148241 30122
23070C0122M7993p3476j22443k3671O8826M2076M0385n7184k3421Q6960P571q8749
$$ 30122 78115 4639 -117804 -141475 -72649 -30573 9812 -47372 -70793 16167 23738 -65011
23058f5011l3249J7197Q2239K57356N6562j15912j51043o0329L4955l4473j02434
$$ -65011 -98260 -81063 1176 258532 315094 199182 48139 -12190 22765 -11708 -114142
23047a14142k36375M7406n0706l5188j42432J58330J14148P5579J58622J8286
$$ -114142 -350517 -303111 -353817 -389005 -531437 -373107 -258959 -183380 -24758 -6472
23037f472j87102J06660O7275k2490M8387R3737j1238l2407N4753l125l5307j2796
$$ -6472 -193574 -86914 -19639 -42129 6258 99995 88757 56350 111103 107978 72671 59875
23025E9875N3318P0939J7294q3926j19760K8915L7614m4834j04233q1099M1680
$$ 59875 113193 184132 201426 117500 -2260 26655 64269 19435 -84798 -165897 -124217
23014a24217O238j0869j48500k61096J18501L30324o4844q7789K52479M4597M5100
$$ -124217 -117979 -128848 -277348 -538444 -419943 -89619 -154463 -242252 10227 54824 99924
23003I9924J7354M4646R8291m753Q758k6389j26452j83762L3665J96225o8911
$$ 99924 117278 161924 260215 255462 264220 237831 111379 -72383 -38718 157507 88596
22992H8596l4765l0617K3765o2549j22361j06890L5595N4850O8251R0299J15632
$$ 88596 53831 23214 46979 -15570 -137931 -244821 -209226 -154376 -86125 4174 119806
22981A19806q98r800j16370k5700R4638M5807j60810q7247J731J11833K7180L6956
$$ 119806 118908 109108 -7262 -32962 61676 107483 -53327 -140574 -138843 -27010 170 37126
22969C7126l224k7669r8645K9745P9796o1127L160J01865O0428O0256o9379n9346
$$ 37126 33902 6233 -92412 -62667 17129 -43998 -40838 61027 121455 181711 112332 52986
22957E2986K7099J50109j30403k25163K913K09087Q5685r9126j44465j50647j50308
$$ 52986 80085 230194 99791 -125372 -122459 86628 172313 73187 -71278 -221925 -372233
22946c72233J88196J46634k8559j58368j02149k5413J6972j3124O9056K06169
$$ -372233 -184037 -37403 -65962 -224330 -326479 -351892 -334920 -348044 -278988 -72819
22936g2819L2539N4373k0807N3390Q6750R4792J05949O7892j80020q0175J6970
$$ -72819 -40280 14093 -6714 46676 133426 228218 334167 402059 222039 141864 158834
22925A58834j49155m5289K17434J4659p1574K8604j10797m3472j09086M3618Q1169
$$ 158834 9679 -35610 181824 196483 124909 153513 42716 -756 -109842 -66224 14945
22914A4945j98442j36027Q445P672L112Q0302J01783j12972n7980J28654Q6149
$$ 14945 -183497 -319524 -311079 -303407 -300295 -219993 -118210 -231182 -289162 -160508 -74359
22903g4359j00464K784J10298j91440J31093J83445n7327k42024p4500R3163J84650
$$ -74359 -174823 -172039 -61741 -253181 -122088 61357 4030 -237994 -312494 -219331 -34681
22892c4681J24643J8287k8540j47981Q1337M8516k3969j16394k0981J98537K80191
$$ -34681 89962 108249 79709 -68272 13065 61581 37612 -78782 -99763 98774 378965
22881C78965L2519l4306l7298j32808k12666j11129J7785O285L9773N9097p0928
$$ 378965 411484 377178 339880 207072 -5594 -116723 -98938 -92653 -52880 6217 -64711
22870f4711J32605P0160j0443k12806l5876J00785K8707j1014P0236M9951P564
$$ -64711 67894 138054 127611 -85195 -121071 -20286 8421 -2593 67643 117594 125158
22859A25158q9998j8111K63521P1489k0047j22182j24759J0492J72266p6242j09745
$$ 125158 35160 17049 280570 352059 332012 209830 85071 95563 267829 191587 81842
22848H1842j68137L5858P1466j5192M4884M1198N0950j14292N0980L0316j00982
$$ 81842 -86295 -50437 21029 5837 50721 91919 142869 28577 79557 109873 8891
22837H891J58787j27483j64997j12131Q8384J07061L8851J09105o4031l34461
$$ 8891 167678 40195 -124802 -236933 -148549 -41488 -2637 106468 42437 -292024
22827b92024p3778J40390K10439Q3758o3285J07059O6001q2860j72463J5688J95097
$$ -292024 -365802 -225412 -14973 68785 5500 112559 178560 95700 -76763 -61075 134022
22816A34022R877q4694n1863l7890J94779J10938j01693l17863j91759R4887K06318
$$ 134022 143899 59205 7342 -30548 164231 275169 173476 -144387 -336146 -241259 -34941
22805c4941L4217n7684N3795J40689N6896m5316m2766p9373o6867k22799J40953
$$ -34941 -724 -58408 -4613 136076 192972 147656 104890 25517 -41350 -264149 -123196
22794a23196Q5015n4678J0158k0276o4654j04816O2795m0370J0459N0182J82981
$$ -123196 -38181 -92859 -82701 -102977 -167631 -272447 -209652 -250022 -239563 -189381 -6400
22783f400P9551m6201m4862J9378J16531O2342j7375O92p719n9308J1243L2931
$$ -6400 73151 26950 -17912 1466 117997 180339 162964 163656 155937 96629 107872 140803
22771A40803j42227n18j45865p6450M2025p8276j6802o7699L7515K12563J54466
$$ 140803 -1424 -1942 -147807 -224257 -182232 -260508 -277310 -345009 -307494 -94931 59535
22760E9535O3193r1123m0714J74146j5613k62198q8999k1104J22438P3427M2329
$$ 59535 122728 31605 -9109 165037 149424 -112774 -201773 -222877 -100439 -27012 15317
22749A5317j33801L5439N579N4029R8880j17169r1827j16586l4737J65016M3211
$$ 15317 -118484 -83045 -77466 -23437 75443 -41726 -133553 -250139 -284876 -119860 -76649
22738g6649J41147n5755r7776N3045M4136j04466J60001l0792j41579J06373L2584
$$ -76649 64498 8743 -89033 -35988 8148 -96318 63683 32891 -108688 -2315 30269
22727C0269k9792N3129M3118o9240j56823j9063J86974n4877m2944L1128J17579
$$ 30269 477 53606 96724 27484 -129339 -148402 38572 -16305 -59249 -28121 89458
22716H9458L4933j39907m1651L297m3303J14669Q6627N5052J02521O208M338q7591
$$ 89458 124391 -15516 -57167 -53870 -97173 17496 104123 159175 261696 267904 272242 184651
22704A84651k08726j38033l8443J26353r0777k3652J5869Q2277J32510j15936
$$ 184651 -24075 -162108 -200551 -74198 -164975 -188627 -172758 -90481 42029 -73907
22694g3907j14927r6625k8886K53535J1565j19480n8772m935J08229K47396m6856
$$ -73907 -188834 -285459 -314345 -60810 -49245 -168725 -227497 -232432 -124203 123193 76337
22683G6337r566j33002k8382n3653K32272J15853j46835j68973m426Q497P8580
$$ 76337 66771 -66231 -94613 -148266 84006 199859 53024 -115949 -120375 -111878 -33298
22672c3298J38923P7053J1955M688p5124j09692n624J97562l7605m5868q6722
$$ -33298 105625 182678 194633 199321 124197 14505 8881 206443 168838 122970 36248
22661C6248o9716J12444p0194j57500n71K7625R8909R6095j6198K1107m1757P3811
$$ 36248 -33468 78976 8782 -148718 -149289 -121664 -22755 73340 57142 78249 36492 110303
22649A10303j75948k8197j924J21485o6294J5782L4526K1974J63808q1289j34670
$$ 110303 -65645 -93842 -95766 25719 -40575 -24793 9733 31707 195515 114226 -20444
22638b0444p1903k9686P8156M0773k26J35512j51443k85380O3212J99118p6067
$$ -20444 -92347 -122033 -43877 -3104 -3330 132182 -19261 -304641 -241429 -42311 -118378
22627a18378l6473n5623n2142J83707q3730r8302M4230K0190J2011P7204K6728
$$ -118378 -154851 -210474 -262616 -78909 -162639 -260941 -216711 -196521 -184510 -107306 -80578
22616h0578J03640K4652L7180J20262Q8309q6030n305j09321q3620J09324J16986
$$ -80578 23062 47714 84894 205156 293465 207435 202130 92809 9189 118513 235499
22605B35499k5645k6682l5538O6053k35313k02282J53428J83485k0360p5171J05887
$$ 235499 209854 183172 147634 213687 -21626 -223908 -70480 113005 92645 17474 123361
22594A23361J14102j95613l4620j9904l2828o3076k7562r7354J15110J62995O9347
$$ 123361 237463 41850 7230 -12674 -45502 -108578 -136140 -233494 -118384 44611 113958
22583A13958j8050O242m3619j95092l076P1312Q4919n541J41942j1776q8145j34433
$$ 113958 95908 102150 58531 -136561 -139637 -68325 16594 11053 152995 141219 53074 -81359
22571h1359P1140M2706J32587N1737j16106j132L2530k403k7776p065M5126L205
$$ -81359 -10219 32487 165074 216811 100705 99573 132103 129700 101924 94859 139985 143190
22559A43190j1839l4078j57363M4443k3528n9773L9710K665k9350m3442l6462
$$ 143190 131351 97273 -60090 -15647 -39175 -98948 -59238 -56573 -85923 -129365 -165827
22548a65827j14740O8304J82608K8742O4250k7095Q3405P488m6478q0989K0190
$$ -165827 -280567 -212263 -29655 -913 63337 36242 119647 127135 80657 -332 19858
22537A9858j00222k20248k9117L2226K54840K28970o3774p6460j5652j02436J1258
$$ 19858 -80364 -300612 -329729 -297503 -42663 186307 122533 46073 30421 -72015 -60757
22526f0757K30703p0935k12122K2519O8581L1317r967q1011j11049O8290K32244
$$ -60757 169946 99011 -113111 -90592 -22011 9306 -661 -81672 -192721 -124431 107813
22515A07813N4503K9287j77849j28620j8232P5493m6144m0120n7066q8237k1835
$$ 107813 162316 191603 13754 -114866 -133098 -57605 -103749 -143869 -200935 -289172 -311007
22504c11007J50561R5857P1596j80834M3344K81537P1325j30862j38214q5837
$$ -311007 -160446 -64589 7007 -173827 -130483 151054 222379 91517 -46697 -132534
22494a32534n4942L0102N8300R843m6169N810N2967R9458R6863k3468l2842n0081
$$ -132534 -187476 -157374 -99074 -89231 -135400 -129590 -76623 22835 119698 96230 63388 13307
22482A3307o7442K07800r3559k05263l9820q4737K5699j21158l08852m8542L80168
$$ 13307 -54135 153665 60106 -145157 -184977 -269714 -244015 -365173 -674025 -722567 -342399
22471c42399J38552j04714l5478J14193m2657l4552k1825L6830Q6004p73j20260
$$ -342399 -203847 -308561 -344039 -229846 -272503 -307055 -328880 -292050 -206046 -206819 -327079
22460c27079J05859K31089P1041K76k1779m2595Q4088J5241k1100p6210K8549
$$ -327079 -221220 9869 80910 81186 59407 16812 100900 116141 95041 18831 47380
22449D7380L9219L3154m8664q8114K0678m0545j24987j71716k8737O4971J76469
$$ 47380 86599 119753 71089 -17025 3653 -36892 -161879 -333595 -362332 -297361 -120892
22438a20892K00920Q9555j09298o5659Q7787Q5986k2767J14645j51212O8578J15536
$$ -120892 80028 169583 60285 -5374 82413 168399 145632 260277 109065 177643 293179
22427B93179P2027j65925p933j57844K0759N8737M2320n4268N795K0124N876n5978
$$ 293179 365206 199281 191348 33504 54263 113000 155320 101052 106847 126971 132847 76869
22415G6869j39969K26611J07157n2340R4355K6175j15995j29788j08963j61106
$$ 76869 -63100 163511 270668 218328 312683 338858 222863 93075 -15888 -176994
22405a76994N2714J18838J45178O3312m4218j38992r6449J2676J9734j40521Q9173
$$ -176994 -124280 -5442 139736 203048 158830 19838 -76611 -63935 -44201 -184722 -95549
22394i5549J1851m0168J20916J17153o5356j08987J07310k7850k7961J00288j83824
$$ -95549 -83698 -123866 -2950 114203 48847 -60140 47170 19320 -8641 91647 -92177
22383i2177R6549R0276n5875j14951n7334L5732Q3932M0785k2834n584l8206R2942
$$ -92177 4372 94648 38773 -76178 -133512 -97780 -13848 26937 4103 -1481 -39687 53255
22371E3255L5192j95714j03788O5417J36767K07206J16973j23639j52698j9906
$$ 53255 88447 -107267 -211055 -145638 -8871 198335 315308 191669 38971 19065
22361A9065J04503K7787j07094j35381O6827j522j28655J32020J64982J9303p3770
$$ 19065 123568 151355 44261 -91120 -24293 -25815 -154470 -22450 142532 161835 88065
22350H8065p9671j08300K9378m6437m4049J92088J24586J4700k5889j14582k33061
$$ 88065 8394 -99906 -70528 -116965 -161014 31074 155660 170360 144471 29889 -203172
22339b03172j48476K03438Q0880J10065N7073j07102k33336m3593K03472J81307
$$ -203172 -351648 -148210 -67330 42735 99808 -7294 -240630 -284223 -80751 100556
22329A00556j28408j05796p1881J45179J75570j21050O117p52l3365P659P1586
$$ 100556 -27852 -133648 -205529 -60350 115220 -5830 287 -465 -33830 -26171 45415
22318D5415J66709o0751k85003j35948J30199J22640J5503j0293O4957l3834L5233
$$ 45415 212124 151373 -133630 -269578 -139379 -16739 -1236 -11529 53428 19594 54827
22307E4827K20448j40301l96307m5041J3678K41442N6847M3576k5443N5285J35718
$$ 54827 275275 134974 -261333 -306374 -292696 -51254 5593 49169 23726 79011 214729
22296B14729l8482j42605O1240Q252n4106l9833J16972j21018J00913J60828p2320
$$ 214729 176247 33642 94882 103134 49028 9195 126167 5149 106062 266890 194570
22285A94570l73629k7561J73495J31859M3879j83136k0188q4367N2718J91497
$$ 194570 -179059 -206620 -33125 98734 142613 -40523 -60711 -145078 -92360 99137
22275I9137o1097o7255L4180L0390k2308k6197N9216l8245N7315j6837j38553
$$ 99137 38040 -29215 4965 35355 13047 -13150 46066 7821 65136 48299 -90254
22264i0254Q2835Q3509K8385N5348p6616k486k3454j23478o8325J30839r1985
$$ -90254 -7419 76090 104475 159823 83207 80721 57267 -66211 -134536 -3697 -95682
22253i5682n5376r0070M3846R8072k5552o3014J51081j71271J378J74748J8778
$$ -95682 -151058 -241128 -197282 -99210 -124762 -187776 -36695 -207966 -206588 -31840 -13062
22242a3062q4813m2128M8961j0887l9702P3781M20j21458O069L9335O6323M6905
$$ -13062 -97875 -140003 -91042 -101929 -141631 -67850 -67430 -188888 -182819 -143484 -77161 -30256
22230c0256J26951N5640n0407O3006p8825j07331O0189M2297k5379j54626r1691
$$ -30256 96695 152335 101928 164934 86109 -21222 38967 81264 55885 -98741 -190432
22219a90432L5861L173Q5038n7226q1451o5323J50338J04827j10454j78201L3493
$$ -190432 -154571 -151398 -66360 -123586 -205037 -270360 -120022 -15195 -125649 -303850 -270357
22208b70357J55510J50951K8104j72330p8769j8195L9739K8483L6878K9280O7560
$$ -270357 -114847 36104 64208 -108122 -186891 -205086 -165347 -136864 -99986 -70706 -3146
22197c146n1087P9289M5001J12773j10998j00714j35492j60565l3939N6266J95658
$$ -3146 -54233 25056 70057 182830 71832 -28882 -164374 -324939 -358878 -302612 -106954
22186a06954N5220M5267J8186p5881O1291L6726J03819m9567m1082O6561m807
$$ -106954 -51734 -6467 11719 -64162 -2871 33855 137674 88107 47025 113586 108779
22175A08779j26572j82411r8407O530J39686J21250K7250j21297L1755q7304j0783
$$ 108779 -17793 -200204 -298611 -292081 -152395 -31145 -3895 -125192 -93437 -180741 -191524
22164a91524R6661P9652k6214j2790q8637l1390j41096q626O7183R4099J8133
$$ -191524 -94863 -15211 -41425 -54215 -142852 -174242 -315338 -323964 -256781 -162682 -144549
22153a44549l3855j39578j23065J72853p8M3588J65060l8814M9984J41111M3068
$$ -144549 -178404 -317982 -441047 -268194 -268272 -224684 -59624 -98438 -48454 92657 135725
22142A35725l01449J7730J04937O3799j5775l1038m2444j06117J05629J58341
$$ 135725 -165724 -147994 -43057 20742 4967 -26071 -68515 -174632 -69003 89338
22132H9338o5920n8109k09380j8296K90210M1279j0437l1208j15884m6471M1540
$$ 89338 23418 -34691 -244071 -262367 27843 69122 58685 27477 -88407 -134878 -93338
22121i3338J08164J8430J25878K5193q6633q5141p5711L4708M3262R3273J77438
$$ -93338 14826 33256 159134 184327 97694 12553 -63158 -28450 14812 108085 285523
22110B85523m7333j64994r4683P2665o4215j15712J30415N4064j85904J0657J6990
$$ 285523 238190 73196 -21487 51178 -13037 -128749 1666 55730 -130174 -119517 -102527
22099a02527j15022r4674O175K0777J26673J68280k3352m1388j03460O7353R3457
$$ -102527 -217549 -312223 -306048 -285271 -158598 9682 -13670 -55058 -158518 -91165 2292
22088B292K23745o6104k9032j83388n9809j01035L8176R4749L2107n7266l8024
$$ 2292 226037 159933 130901 -52487 -112296 -213331 -175155 -80406 -48299 -105565 -143589
22077a43589K56874j00558k27582k2386N147k3666J76925L7002J26361J90757
$$ -143589 113285 12727 -214855 -237241 -232094 -255760 -78835 -41833 84528 275285
22067B75285J42733j46953j74445j44863R3343r13o1801R6264Q1179J54862j04177
$$ 275285 418018 271065 96620 -48243 45100 44187 -17614 78650 159829 314691 210514
22056B10514J6221j48317j06886j6020J08751j01179r7792j1407r097m8987J7597
$$ 210514 226735 78418 -28468 -44488 64263 -36916 -134708 -146115 -155212 -204199 -186602
22045a86602L8805J09563J56117j18229j12836j05138J26910Q2990q44n7624j6236
$$ -186602 -147797 -38234 117883 -346 -113182 -218320 -91410 -8420 -9264 -66888 -83124
22034h3124J38970j7928j06147n9626j02776k2470j2733J4854MJ38032J79514
$$ -83124 55846 37918 -68229 -127855 -230631 -253101 -265834 -250980 -250976 -112944 66570
22023F6570M7053p0940q795k9998K924o9981q5553P6631J56928j7453L5431J082
$$ 66570 113623 42683 33888 3890 6814 -63167 -148720 -72089 84839 67386 102817 103899
22011A03899j42768r0261n6036O2297l0835L5235J13171J00052j03997q9512k3424
$$ 103899 -38869 -129130 -185166 -122869 -153704 -118469 -5298 94754 -9243 -98755 -122179
22000a22179J25185K26310k8554n413L5461k9644K153j08833K8883p1983j21599
$$ -122179 3006 229316 200762 195349 230810 201166 203319 94486 123369 51386 -70213
21989g0213r53p8182k7234R6685J10762K16177r4499j71562j72176P7794J94553
$$ -70213 -71166 -149348 -176582 -79897 30865 247042 152543 -19019 -191195 -113401 81152
21978H1152Q4024o7656k425L8495M7420J23734N8326j30476j45497j27392N8516
$$ 81152 165176 97520 95095 133590 181010 304744 363070 232594 87097 -40295 18221
21967A8221j3279j28018K0244J38489K0777K0681k5753J9384j5989k87419J20570
$$ 18221 4942 -123076 -102832 35657 56434 77115 51362 70746 54757 -232662 -112092
21956a12092J33529r2417R476N6351r2286n0887L5129j25359J32378J51252J0888
$$ -112092 21437 -70980 -61504 -5153 -97439 -148326 -113197 -238556 -106178 45074 55962
21945E5962q7113n3744J45191J29075o6760L7614K16125l9864M4051q063j51436
$$ 55962 -31151 -84895 60296 189371 122611 160225 376350 336486 380537 372474 221038
21934B21038k34477m1866J26781n8711j17223M8954o308m1617l8498L7496O1516
$$ 221038 -13439 -55305 71476 12765 -104458 -55504 -61812 -103429 -141927 -104431 -42915
21923d2915p370M5560p9831j06511J97691j14598j07417j06614J58028L13616
$$ -42915 -50285 -4725 -84556 -191067 6624 -107974 -215391 -322005 -163977 149639
21913A49639l2954l2758K269J47403k0314L506K13698j4557r9646k37954k20036
$$ 149639 116685 83927 86196 233599 213285 216791 430489 415932 316286 78332 -141704
21902a41704r6322n47o082K18193J48188M4008M8032k880o0489j57484K46l1240
$$ -141704 -238026 -238573 -244655 -26462 121726 165734 213766 210886 150397 -7087 -6841 -38081
21890c8081n6528j3229j21785N1782M3809O7843Q434K7242J0748o5600l8721N8180
$$ -38081 -94609 -107838 -229623 -177841 -134032 -66189 -57755 -30513 -19765 -85365 -124086 -65906
21878f5906O0060j5095j43244R2951K51404P7409r8821m8746J9495j6381k2374
$$ -65906 -5846 -20941 -164185 -71234 180170 257579 158758 110012 129507 113126 90752
21867I0752J21536J72910j07586o0813q8860k28505j39601J23473J66519J04538
$$ 90752 212288 385198 277612 216799 127939 -100566 -240167 -116694 49825 154363
21857A54363L5027j28212q6378n0617k4111O3244J77720p2035n7488L0621j27934
$$ 154363 189390 61178 -25200 -75817 -99928 -36684 141036 69001 11513 42134 -85800
21846h5800j20353L1131k06535j6207K04069P9909j5005J02490N186p540j094
$$ -85800 -206153 -175022 -381557 -397764 -193695 -113786 -128791 -26301 -21115 -28655 -29749
21835b9749p5517L2105J21863O0180J71399J2694j61779r2206R1536K4786n4207
$$ -29749 -105266 -73161 48702 108882 280281 292975 131196 38990 130526 155312 101105
21824A01105j91817j41528j14793Q7847K5110K27166J44757q9347j86201P8014
$$ 101105 -90712 -232240 -347033 -259186 -234076 -6910 137847 48500 -137701 -59687
21814e9687N2476N4440m2770r6149k02930J08032Q2603J11325j0057r7608N727
$$ -59687 -7211 47229 4459 -91690 -294620 -186588 -103985 7340 -2717 -100325 -94598
21803i4598n1941L3505J16877n1280R1001n0478k472P1191o7203m4833M9868L7800
$$ -94598 -146539 -113034 3843 -47437 43564 -6914 -9386 61805 -5398 -50231 -363 37437
21791C7437l7539O246m643j56917j52796K72511J61908j76332M8382N9046M5700
$$ 37437 -102 6144 1501 -155416 -308212 -35701 126207 -50125 -1743 57303 103003
21780A03003K3008q8393j1007K3431n6310M9018M8977Q7172L228m7927j34613
$$ 103003 126011 37618 26611 50042 -6268 42750 91727 178899 182127 134200 -413
21769d13j48566J25486P8436N5427l8305j21067j47718j304L7966Q0346J6133
$$ -413 -148979 -23493 54943 110370 72065 -49002 -196720 -198024 -160058 -79712 -63579
21758f3579J33814J39402j30927o2538J2296P851o1403R502j10943P6318J59000
$$ -63579 70235 209637 78710 16172 28468 36319 -25084 -15582 -126525 -50207 108793
21747A08793R2316n3704r4145J19691J23935j51348l22267p8765R5845J18204
$$ 108793 201109 147405 53260 172951 296886 145538 -176729 -255494 -159649 -41445
21737d1445R8932K2064j80505M7952P4814J64672P7443m1859R463n9529j11125
$$ -41445 57487 79551 -100954 -53002 21812 186484 263927 222068 231531 172002 60877
21726F0877k44393p6077P5773Q0668p904L8756J06606J24588K0810p9456j44266
$$ 60877 -183516 -259593 -183820 -103152 -111056 -72300 34306 158894 179704 100248 -44018
21715d4018m0136j36573q2669J16385J32981R9751R0943P5395L3714j23228n4286
$$ -44018 -84154 -220727 -303396 -187011 -54030 45721 136664 212059 245773 122545 68259
21704F8259J1174m1068o8623j66872o9475K4045l6800q5467J06400J21067l3734
$$ 68259 79433 38365 -30258 -197130 -266605 -242560 -279360 -364827 -258427 -137360 -171094
21693a71094j11469Q6036L9815J05068K4014j53156J62184O2528j38906M102J39395
$$ -171094 -282563 -196527 -156712 -51644 -27630 -180786 -18602 43926 -94980 -90878 48517
21682D8517p9725q5935J33581J22415J03525o3268R8392J8517j42187j40059j12720
$$ 48517 -31208 -117143 16438 138853 242378 179110 277502 296019 153832 13773 -98947
21671i8947K9664P9465M0952j7258n5606J96097J97950o9465n5659J04941L588
$$ -98947 -69283 10182 51134 33876 -21730 174367 372317 302852 247193 352134 355722
21660C55722j59804j08724l3226J3714k2117l2180K9038N7887J2731j36777p5488
$$ 355722 195918 87194 53968 67682 45565 13385 42423 100310 113041 -23736 -99224
21649i9224j06808j18665R68J27900J38082L627l2105L496J05439j2603O8089
$$ -99224 -206032 -324697 -323729 -195829 -57747 -54120 -86225 -82729 22710 10107 78196
21638G8196q0907k3665M6829j09724l3026k9753J63499L4465J6052j6742j35703
$$ 78196 -2711 -26376 20453 -89271 -122297 -152050 11449 45914 61966 45224 -90479
21627i0479n2391j12238J02905J23740J01939o5558K317N1866O0283j65112k46537
$$ -90479 -142870 -255108 -152203 -28463 73476 7918 10235 62101 122384 -42728 -289265
21616b89265Q3346J70975r6704j7194J42506J3204n5990J10766p2424j24909m408
$$ -289265 -205919 -34944 -131648 -148842 -6336 6868 -49122 61644 -10780 -135689 -140097
21605a40097R7991M9605o9379R020K222K6785k3676J11233M1859m7300j5288P170
$$ -140097 -42106 7499 -61880 -52860 -50638 -23853 -47529 63704 105563 58263 42975 50145
21593E0145j04083q9294m2334K9896o5488P2776J84247J5327j1513J19277j6421
$$ 50145 -53938 -143232 -185566 -155670 -221158 -148382 35865 51192 39679 158956 142535
21582A42535k00774m7930o4530L761j08338J02431J01908J07657J94514m6021
$$ 142535 -58239 -106169 -170699 -166938 -275276 -172845 -70937 36720 231234 185213
21572A85213j15893n3308r6366O6349J04084K1836J22390M3069R9345j18107k20852
$$ 185213 69320 16012 -80354 -14005 90079 111915 234305 277374 376719 258612 37760
21561C7760k68422M7329J32591J36858J18453J32559q2394j2829k18080j4453
$$ 37760 -230662 -183333 -50742 86116 204569 337128 254734 241905 23825 9372
21551I372O3567K4336M6321J1531r9797N252J60843k55929l4015O7763J44498
$$ 9372 72939 97275 143596 155127 55330 60582 221425 -34504 -68519 -756 143742
21540A43742J32909k6836j58723O7018K5993J0871j52354r3663L0284m0196o7449
$$ 143742 276651 249815 91092 158110 184103 194974 42620 -51043 -20759 -60955 -128404
21529a28404J10707M2659O3042m6829J93086L3798j21692P1098L7071j31738o5645
$$ -128404 -17697 24962 88004 41175 234261 268059 146367 217465 254536 122798 57153
21518E7153o8894r8429L7006J13917R9636R2479j06896j13067j50208q1186K92820
$$ 57153 -11741 -110170 -73164 40753 140389 232868 125972 12905 -137303 -218489 74331
21507G4331K22592P3739R0155K6840j23202q3997p3229R2180Q7164j45464k08773
$$ 74331 296923 370662 460817 487657 364455 280458 207229 299409 386573 241109 32336
21496C2336J3483O5005k20950p1100l540R6711M0306k1758n9474J70596J35682
$$ 32336 45819 110824 -110126 -181226 -184766 -88055 -47749 -69507 -128981 41615 177297
21485A77297j49770o1900O4415q6237r887L704K21126P0373q2216k93518M3391
$$ 177297 27527 -34373 30042 -56195 -66082 -62378 158748 229121 146905 -146613 -103222
21474a03222L49603K14498o05k24206j74572j68082Q5070O5129m584j05692q1416
$$ -103222 246381 460879 460274 236068 61496 -106586 -21516 43613 39029 -66663 -148079
21463a48079P2793J15813K9750J14129K6987j19155j37345r2758N8627o0637r9415
$$ -148079 -75286 40527 70277 184406 211393 92238 -45107 -137865 -79238 -139875 -239290
21452b39290N0269J00885j18508J5987J41043m3529o1733m2408k9595J92084Q7620
$$ -239290 -189021 -88136 -206644 -190657 -49614 -93143 -154876 -197284 -226879 -34795 52825
21441E2825j15111Q57O437k9854K1101j07469k2623q410P1903J09633J4078J820
$$ 52825 -62286 -61429 -54992 -84846 -63745 -171214 -193837 -202247 -130344 -20711 -6633 -4813
21429d813N6745P924J07213m0893l2651J42580p5287j7714p283l2597M2545j70370
$$ -4813 51932 59856 167069 126176 93525 236105 160818 143104 135821 103224 145769 -24601
21417b4601k3865j02312Q118O4025N6686J46128k3034p8496M9818M1445k4419
$$ -24601 -48466 -150778 -142660 -78635 -21949 124179 101145 22649 72467 113912 89493
21406H9493m8710J4504O0529M0996q6451j03199O1677m0171j7914j13079L7831
$$ 89493 40783 55287 115816 156812 70361 -32838 28839 -11332 -29246 -142325 -104494
21395a04494l172m6812j2960q9277l7253J17288N279R0488L9393j45725N7935
$$ -104494 -107666 -154478 -167438 -256715 -293968 -176680 -171401 -80913 -41520 -187245 -129310
21384a29310K3825j50005M2364J25809n1378m5515J71557P1000j33911R6292L5593
$$ -129310 -105485 -255490 -213126 -87317 -138695 -184210 -12653 58347 -75564 20728 56321
21373E6321p3246r7444j57334K06902K16808k4377p9709r6656O8496j13272j0392
$$ 56321 -16925 -114369 -271703 -64801 152007 127630 47921 -48735 19761 -93511 -103903
21362a03903K84464N8914J459j97398q9332J90928L1200j71364o932R9812L0640
$$ -103903 180561 239475 240934 43536 -45796 145132 176332 4968 -1964 97848 128488
21351A28488J92328p9874j33399j08085r4292M757J58314O9889k59197o9800K05068
$$ 128488 320816 240942 107543 -542 -94834 -90077 68237 138126 -121071 -190871 14197
21340A4197N3601P8159Q2743o6759j78283l8714j04217K32463j8499l1676J7654
$$ 14197 67798 145957 228700 161941 -16342 -55056 -159273 73190 54691 23015 40669
21329D0669j7088p9539J22259J0620m7206j29880K0550J76185L2881j84337N3918
$$ 40669 23581 -55958 66301 76921 29715 -100165 -79615 96570 129451 -54886 -968
21318i68j51869J05159K55437m925n420q4148j22665o3272o3057j2885J32529
$$ -968 -152837 -47678 207759 202834 197414 113266 -9399 -72671 -135728 -148613 -16084
21307a6084Q5592K0553J07362j31815r0904j4217J13465J05651J3777j27931J044
$$ -16084 69508 90061 197423 65608 -25296 -39513 73952 179603 193380 65449 66493
21296F6493k6395k2695o2820N5769k9598m2191J12455J69300n0012o8058j1209
$$ 66493 40098 17403 -45417 10352 -19246 -61437 51018 220318 170306 102248 91039
21285I1039L6867J136r1101L1228P9431J8316N7226n7395O0591k6935k57819R2421
$$ 91039 127906 129042 37941 69169 148600 166916 224142 166747 227338 200403 -57416 35005
21273C5005K63371O7721l4791j69984k35235P171Q3245K02859j3149j62015k5612
$$ 35005 298376 366097 331306 161322 -73913 -66742 16503 219362 206213 44198 18586
21262A8586M9366K8576o181m3114J4233j50129j39816J38547J9500N0340J53134
$$ 18586 67952 96528 90347 47233 61466 -88663 -228479 -89932 -70432 -20092 133042
21251A33042l2956K866p8058o3349J01336N7985l8287M231j31058j44241Q1766
$$ 133042 100086 102952 24894 -38455 62881 120866 82579 86810 -44248 -188489 -106723
21240a06723J00433m7733j34980q2376j5989R7997L0040J10153j3981L1991j09173
$$ -106723 -6290 -54023 -189003 -271379 -287368 -189371 -159331 -49178 -63159 -31168 -140341
21229a40341j1311n9897N6379J83473O6987j80127O7212K67077O7342n8523Q0162
$$ -140341 -151652 -211549 -155170 28303 95290 -84837 -17625 249452 316794 258271 338433
21218C38433l8316j97276j60824J2524o4511M7299R1837J9626R6283p8300j95447
$$ 338433 300117 102841 -57983 -45459 -109970 -62671 29166 48792 145075 66775 -128672
21207a28672M6546J9142K5834L275j37195J48566J02708j7025P1522Q9438L0659
$$ -128672 -82126 -62984 -37150 -33875 -171070 -22504 80204 63179 134701 224139 254798
21196B54798l2547p4392k2399J1160n6332j67588P3438m995J1295m5778j48335
$$ 254798 222251 147859 125460 136620 80288 -87300 -13862 -18857 -7562 -53340 -201675
21185b01675J39048J7208n5366J43986o6586k37583j11209J82155P8656j53582
$$ -201675 -62627 -45419 -100785 43201 -23385 -260968 -372177 -190022 -111366 -264948
21175b64948j03432J82676J28965J2471k3427J32018j20359J3046J4606j24009
$$ -264948 -368380 -185704 -56739 -44268 -67695 64323 -56036 -42990 -28384 -152393
21165a52393m8714J65833J70427j0663j31889J42644n7097k4265j56714j15723
$$ -152393 -201107 -35274 135153 124490 -7399 135245 78148 53883 -102831 -218554
21155b18554M2777O8641K55283J81431k18849j96874L6180L7274K45206J80465
$$ -218554 -175777 -107136 148147 329578 110729 -86145 -49965 -12691 232515 412980
21145D12980j28164j85225m9199O4469R6796p5703j05755l3454N2170M6681p6515
$$ 412980 284816 99591 50392 114861 211657 135954 30199 -3255 48915 95596 19081
21134A9081p7792L1766J66883j4551M3373J8365k9204j60745q1681J40420J19032
$$ 19081 -58711 -26945 139938 125387 168760 187125 157921 -2824 -84505 55915 174947
21123A74947J7901o1273q8693k2255j9023P7709j78839k1639J08763J04800l7773
$$ 174947 192848 131575 42882 20627 1604 79313 -99526 -121165 -12402 92398 54625
21112E4625K8569J6451Q9580o6750q272L4773J1270k58045l0485J27688J19102
$$ 54625 83194 99645 189225 122475 114203 148976 160246 -97799 -128284 -596 118506
21101A18506P9336R0372r2311J1730p752j60381k912K32579m1072j6638j29285
$$ 118506 197842 288214 195903 207633 199881 39500 36588 269167 228095 211457 82172
21090H2172n2239J42517j8676q9800N1371J04589j43659j29279M7236j45201l4221
$$ 82172 29933 172450 153774 63974 115345 219934 76275 -53004 -5768 -150969 -185190
21079a85190L17543J58811o8956j53968P0552J4222L1209Q1886j31390j6482J41005
$$ -185190 132353 291164 222208 68240 138792 153014 184223 266109 134719 118237 259242
21068B59242k9511N7725K3821j84801q2282P145M0887P2150j4318j25639m0552
$$ 259242 229731 287456 311277 126476 44194 51339 92226 164376 150058 24419 -16133
21057a6133K4074L6589K1046N006r7221m8006J45630N0022P1219M2159k1167r9801
$$ -16133 7941 44530 65576 70582 -26639 -74645 70985 121007 192226 234385 213218 113417
21045A13417m7878J25750J82300J65418j52001o0469J8314M5659p606p1557j8357
$$ 113417 65539 191289 373589 539007 387006 326537 344851 390510 382904 311347 292990
21034B92990j27317j50129j90113Q8139K10640k4138L2523j49404j17775K0630
$$ 292990 165673 15544 -174569 -86430 124210 100072 132595 -16809 -134584 -113954
21024a13954N5468j24767l6386k9034R5839P7115m551L5543M3439J53914l0012
$$ -113954 -58486 -183253 -219639 -248673 -152834 -75719 -80270 -44727 -1288 152626 122614
21013A22614k54265m6678N0510J18972j5499K7668J69867P3601J20098J41099
$$ 122614 -131651 -178329 -127819 -8847 -24346 3322 173189 246790 366888 507987
21003E07987j2737J7822J90075J98913N2936R860J9505j68853k50931M9953m9809
$$ 507987 495250 513072 703147 902060 954996 964856 984361 815508 564577 614530 564721
20992E64721j16807L0889J99998J04987n2434P4650l4710Q7138J60598J48911
$$ 564721 447914 478803 678801 783788 731354 806004 771294 858432 1019030 1167941
20982A167941J31040J51530N2636l06752k61311j79887k16200r6650m828Q7854
$$ 1167941 1298981 1450511 1503147 1196395 935084 755197 538997 442347 437519 525373
20972E25373K06892m3717O0158K22842K98102M9131j25824k25504l59080r1763
$$ 525373 732265 688548 748706 971548 1269650 1318781 1192957 967453 608373 516610
20962E16610R4547J02743j48789l52926O6039l3816Q0371O8803J88078J16388
$$ 516610 611157 713900 565111 212185 278224 244408 324779 393582 581660 698048
20952F98048K88163n6118O1790q4039k27303j51723l45731j3419R0260J22946
$$ 698048 986211 930093 991883 907844 680541 528818 183087 169668 259928 382874
20942C82874J7119o1427Q669j65468q5779l4538Q901P081j0338P9820j58148k4902
$$ 382874 399993 338566 347235 181767 95988 61450 70351 77432 67094 146914 -11234 -36136
20930c6136K06443J86300n9622j07865k55799m4192n846R3528k7858m6402L8934
$$ -36136 170307 356607 296985 189120 -66679 -110871 -116717 -23189 -51047 -97449 -58515
20919e8515N7086Q8058o0712p487P201R4616J50639k2451j94415J5521J2138k3940
$$ -58515 -1429 86629 25917 18430 25631 120247 270886 248435 54020 69541 81679 57739
20907E7739R1096L7199j68939Q7040J16637L258L9149r5435P2647o316r165o6568
$$ 57739 148835 186034 17095 104135 220772 224030 263179 167744 240391 234075 224910 158342
20895A58342j13131M9908K9078N7350j39113O4765J14483j16299N8386L0336p102
$$ 158342 45211 95119 124197 181547 42434 107199 221682 105383 163769 194105 187003
20884A87003N0982R054j25549n9840R8219L2978r7743j77815Q1296J85734q4215
$$ 187003 237985 247039 121490 61650 159869 192847 95104 -82711 -1415 184319 100104
20873A00104j94968k7863N4135J71724J38524J85948J32113q2510o8259j95464
$$ 100104 -94864 -122727 -68592 103132 241656 427604 559717 477207 408948 213484
20863B13484k8700j49133J1622P9762N6241j54328J29569M7052j30386J47222
$$ 213484 184784 35651 47273 127035 183276 28948 158517 205569 75183 222405
20853B22405j16091q4090J93725J50097p1093q2073J66750P3024j24111j46494
$$ 222405 106314 22224 215949 366046 294953 212880 379630 452654 328543 182049
20843A82049J0347Q7510n0709j88388L263p429n0986j37449j21268l8498o6348
$$ 182049 192396 279906 229197 40809 44072 36643 -14343 -151792 -273060 -311558 -377906
20832c77906P5865K15287M0421j44066L7201J66259O1504M080q3823j99107L6094
$$ -377906 -302041 -86754 -46333 -190399 -153198 13061 74565 78645 -5178 -204285 -168191
20821a68191Q5814O2387R9543m7335j96696n1389J28579L5398P023J52737P7210
$$ -168191 -82377 -19990 79553 32218 -164478 -215867 -87288 -51890 -44867 107870 185080
20810A85080R851N8948p1219R4817m0862O839j07432j22031q6350R2310J46592
$$ 185080 194931 253879 182660 277477 236615 243454 136022 13991 -72359 19951 166543
20799A66543r6099n5500J74592N1122n8621N8070l0012p6882n7483k3601m5501
$$ 166543 70444 14944 189536 240658 182037 240107 210095 133213 75730 52129 6628
20788F628j20182l3965K8937j17874k7824P5294J09237M7523R7570l7707J52699
$$ 6628 -113554 -147519 -118582 -236456 -264280 -188986 -79749 -32226 65344 27637 180336
20777A80336K4300j36674J13528N1950j63456k43297j5694J56141J61776j81966
$$ 180336 204636 67962 181490 233440 69984 -173313 -189007 -32866 128910 -53056
20767e3056q1876M5771J60886m061j2875J05172P8064j33219Q064J48015J5833
$$ -53056 -134932 -89161 71725 67664 54789 159961 238025 104806 112870 260885 276718
20756B76718r6079j24348L4453J02478k9939n832J9412J45482q991k73748k32813
$$ 276718 180639 56291 90744 193222 163283 157451 176863 322345 313354 39606 -193207
20745a93207j03828J70576J97748Q994J10118o574j0086l4Q5047J69755J19038
$$ -193207 -297035 -126459 71289 80283 190401 183827 173741 173707 258754 428509 547547
20734E47547r6625k66004n5773l5583k07950O10J83901Q1059L551k4278q452N3670
$$ 547547 450922 184918 129145 93562 -114388 -113778 70123 151182 154733 130455 122003 175673
20722A75673l3882j40039j37136O4515P9188j3381k25055k3110J26457J32256
$$ 175673 141791 1752 -135384 -70869 8319 -5062 -230117 -253227 -126770 5486
20712E486J41667M8854j12050J7081J39271j4276Q0042j56791q2773O627P7353
$$ 5486 147153 196007 83957 101038 240309 226033 306075 149284 66511 73138 150491
20701A50491l0260j67453l5217K58470J36723L1172r9957k49472K5651K4998L06077
$$ 150491 120231 -47222 -82439 176031 312754 343926 243969 -5503 20148 45146 351223
20690C51223Q3554j87104k32160p294N2139K20852Q9144l5948j9025J71609K9074
$$ 351223 434777 247673 15513 8219 60358 281210 370354 334406 315381 486990 516064
20679E16064m3561Q3606K0301j95427l50052J9053M9582J19683J43694Q3215M4736
$$ 516064 472503 556109 576410 380983 30931 49984 99566 219249 362943 446158 490894
20668D90894n5023j86665k17059R070J64018m7737p1974N4704L05196O5222k33750
$$ 490894 435871 249206 32147 41217 205235 157498 85524 140228 445424 510646 276896
20657B76896j0965Q6088O1615p2629o2805J0894R4291N961k02354n0954J75166
$$ 276896 265931 352019 413634 341005 278200 289094 383385 389346 186992 136038 311204
20646C11204K12151l8534j9460Q8320M8527k24358j08332J80913Q2644j27189
$$ 311204 523355 484821 465361 553681 602208 377850 269518 450431 533075 405886
20636D05886r7433J27219J06729j43779r57P3002K018N1867o2682k34092k20944
$$ 405886 308453 435672 542401 398622 397665 470667 472685 524552 461870 227778 6834
20625F834R1511K70958L6638j28868Q599R7535K40167J01581j21667j47447p1684
$$ 6834 98345 369303 405941 277073 285672 383207 623374 724955 603288 455841 384157
20614C84157k2207P4816r2478j329q8595j27932r7778J01568M7368n3441p9386
$$ 384157 361950 436766 344288 342959 254364 126432 28654 130222 177590 124149 44763
20603D4763M519L9342L7953L3271j0377J29546K13869n8127j21727K777j16035
$$ 44763 49282 88624 126577 159848 149471 279017 492886 434759 313032 315809 199774
20592A99774j48520P3078M9251J24400j29317J00114M3692N2146n4811M3381J58135
$$ 199774 51254 124332 173583 297983 168666 268780 312472 364618 309807 353188 511323
20581E11323n8730K5662q8700J224j7859K11929K08670L4289j6436J28268m7583
$$ 511323 452593 478255 389555 390779 372920 584849 793519 827808 811372 939640 892057
20570H92057k20069j20380j13693l9321m0652O2307K65794L02512j59502q3940
$$ 892057 671988 551608 437915 398594 357942 420249 686043 988555 829053 745113
20560G45113q2615R5988J9054l961r5152l1836J54315N8353j39878l6157P9484
$$ 745113 662498 758486 777540 773579 678427 646591 800906 859259 719381 683224 762708
20549G62708J39835M7223J1488J27644o6498j63083l5222N8683J41428J40642
$$ 762708 902543 949766 961254 1088898 1022400 859317 824095 882778 1024206 1164848
20539A164848J31468k02799j61173k18106N0282J07871N1473L6850P8764R8819
$$ 1164848 1296316 1093517 932344 714238 764520 872391 923864 960714 1039478 1138297
20529A138297R5325Q243P5646J50243K01028r2094j8051N0967M02778L31392K52182
$$ 1138297 1233622 1241865 1317511 1467754 1668782 1576688 1558637 1609604 2012382 2343774 2595956
20518B595956N83313O31667O79595R78174P13652o20647j200399j147957o33148
$$ 2595956 3179269 3810936 4490531 5468705 6182357 5561710 4361311 3213354 2580206
20509B580206n21800j01000j52416n4094J06040j17897j16528n8388j77225m6501
$$ 2580206 2058406 1957406 1804990 1750896 1856936 1739039 1622511 1564123 1386898 1340397
20499A340397N2378J20918J56557Q2607K5218K04005J34459K21917L2556J49295
$$ 1340397 1392775 1513693 1670250 1752857 1778075 1982080 2116539 2338456 2371012 2520307
20489B520307J12433M38785P46202Q65496Q44332P96448L00529o71182j133042
$$ 2520307 2632740 3071525 3817727 4683223 5527555 6324003 6624532 5953350 4820308
20480D820308q56500n12740l52263j77821k2783N0858j4262R8796J78781L9466
$$ 4820308 3963808 3451068 3098805 2920984 2898201 2949059 2934797 3033593 3212374 3251840
20470C251840O6626N7432K17133L01210K27163n515P3620L01386K23479M33144
$$ 3251840 3318466 3375898 3593031 3894241 4121404 4115889 4189509 4490895 4714374 5147518
20460E147518M11844M00403P68966Q44411N46788K50446m9164J64429L89246M82446
$$ 5147518 5559362 5959765 6728731 7573142 8119930 8370376 8321212 8485641 8874887 9357333
20450I357333N17625N21353N32305N12732O28085L40512L99749P41231J058217
$$ 9357333 9874958 10396311 10928616 11441348 12069433 12409945 12809694 13550925 14609142
20441A4609142J367085J809031K331811L144720L702985M590062N607998P315892
$$ 14609142 15976227 17785258 20117069 23261789 26964774 31554836 37162834 44478726
20433D4478726R915877J2978576J6758688K2552616L1266914M3066884N2908370
$$ 44478726 54394603 67373179 84131867 106684483 137951397 181018281 233926651
20426B33926651N8937952O6104869O3139323J1153562p5445613j04735765q0526163
$$ 233926651 292864603 358969472 422108795 433262357 357816744 253080979 172554816
20419A72554816n0796727l1197901j9761314j3031656r135971o743554m678602
$$ 172554816 121758089 90560188 70798874 57767218 48631247 41887693 37209091
20412C7209091l179333j872471q79616J01395J032522K167412L218563M188092
$$ 37209091 34029758 32157287 31277671 31379066 32411588 34579000 37797563 41985655
20404D1985655N613671Q169103J0995178J4381560J8970481K5902114L5847581
$$ 41985655 47599326 55768429 66763607 81145167 100115648 126017762 161865343
20397A61865343M7280706N5136901O1289126O8288431N1111190k5303581r9525841
$$ 161865343 209146049 264282950 325572076 393860507 444971697 419668116 320142275
20390C20142275j02372239p1280084m4225626k7741190j8012566j2134797q551346
$$ 320142275 217770036 146489952 102264326 74523136 56510570 44375773 35824427
20383C5824427o310850m748497l703599k842152k173626j733519j205504j035339
$$ 35824427 29513577 24765080 21061481 18219329 16045703 14312184 13106680 12071341
20375A2071341r35717n76448k78232j44028m7620O1587l1642k84198m56676n31174
$$ 12071341 11135624 10559176 10280944 10136916 10089296 10150883 10119241 9835043 9378367 8847193
20365H847193p18172o81381m44781l43029j84357k74265o63201p92298p13760
$$ 8847193 8129021 7447640 7002859 6659830 6475473 6201208 5538007 4745709 4031949
20356D031949o84744l80871k89306j24671j27354o6104o7710J2430L9195j65157
$$ 4031949 3347205 2966334 2677028 2552357 2425003 2358899 2291189 2303619 2342814 2177657
20346B177657j27160r6471l4699O5004m7657k03565n8149n9687N1929j49667j42313
$$ 2177657 2050497 1954026 1919327 1984331 1936674 1733109 1674960 1615273 1667202 1517535 1375222
20335A375222l2857j78089j03226L9552N2324n9857j76668L079j65439j94010
$$ 1375222 1342365 1164276 1061050 1100602 1152926 1093069 916401 919480 754041 560031
20325E60031k10432l0752P7420N7454K47377J49823n9749m8066j40146j8437m6156
$$ 560031 349599 318847 396267 453721 701098 850921 791172 743106 602960 584523 538367
20314E38367J19635P6312l8720j29759m7201p4692J8480m2011r553Q5347R8499
$$ 538367 658002 734314 695594 565835 518634 443942 462422 420411 410858 496205 594704
20303E94704j58530K9104J70176l8148l2151j07706j10140M9080O1267Q9761j64975
$$ 594704 436174 465278 635454 597306 565155 457449 347309 396389 457656 547417 382442
20292C82442k63365K629J09021O3517N490j10793R1911J13153j1886j02072o3260
$$ 382442 119077 121706 230727 294244 299734 188941 280852 394005 382119 280047 216787
20281B16787q2797Q337J65301J78831j27910p3445o3569K608o393k22130o4636
$$ 216787 133990 142327 307628 486459 358549 285104 221535 224143 217750 -4380 -69016
20270f9016K61635K77581P0966j95774N7389Q3644O4590k27369k06077m7575L621
$$ -69016 192619 470200 541166 345392 402781 486425 551015 323646 117569 69994 73615
20259G3615J4176M3056o5063p6373M0932J59298Q6807o8630o1978J1634P4184
$$ 73615 87791 130847 65784 -10589 30343 189641 276448 207818 145840 157474 231658
20248B31658R0729K34440Q8757k60193j11163O6586j39844J6491m6204K57435
$$ 231658 322387 556827 645584 385391 274228 340814 200970 217461 171257 428692
20238D28692K92087J18189l9604K88626Q1304j22454k14573L1643m8756R7276
$$ 428692 720779 838968 799364 1087990 1169294 1046840 832267 863910 815154 912430
20228I12430J40804j38615k491J9405J3425L3827J69464R7932j4957j47696k43897
$$ 912430 1053234 914619 912128 931533 944958 978785 1148249 1246181 1231224 1083528 839631
20217H39631j22040k4297Q4507r1581p686N522o6040j65354q9155j70363j0849
$$ 839631 717591 693294 777801 686220 678534 684056 618016 452662 363507 193144 182295
20206A82295K6585P4351m9798P4022J36108j37366j21703j833o7812J14776J09406
$$ 182295 208880 283231 233433 307455 443563 306197 184494 182661 114849 229625 339031
20195C39031o5402N9419L0549J65860J72189Q5930j39613L3587n1580k20129j03474
$$ 339031 273629 333048 363597 529457 701646 787576 647963 681550 629970 409841 306367
20184C06367M4601N2194o3532J4925J59518J80976K05800k2085J20231j8420M5445
$$ 306367 350968 403162 339630 354555 514073 695049 900849 878764 998995 980575 1026020
20173A026020k5556o2772j26995q530l03004j71641R436K17817K39846N3753l5848
$$ 1026020 1000464 937692 810697 802167 499163 327522 336958 554775 794621 848374 812526
20162H12526j80377J9874j6733j14626r1918q7424J42790j8329j01005k38003
$$ 812526 632149 652023 635290 520664 428746 341322 484112 465783 364778 126775
20152A26775j72667L192k7822J5413j80845k2441j340o6247Q2668P7004j27230
$$ 126775 -45892 -42700 -70522 -55109 -235954 -258395 -259735 -325982 -243314 -166310 -293540
20141b93540j0562J2037m1810K32626K7764l6694N8080J63677J58216l7923j94882
$$ -293540 -304102 -292065 -333875 -101249 -73485 -110179 -52099 111578 269794 231871 36989
20130C6989j87253L218K09357Q5968j27294J8639L6390j11647j5896m0084Q6468
$$ 36989 -150264 -147046 62311 148279 20985 39624 76014 -35633 -51529 -91613 -5145
20119e145L096K2880j05720K12192J28888p6690j76253n4451J34672J48426k16703
$$ -5145 -2049 20831 -84889 127303 256191 179501 3248 -51203 83469 231895 15192
20108A5192j34074m8484P908J17769k6721q8712R0316J31384r756k2569n809R6016
$$ 15192 -118882 -167366 -159458 -41689 -68410 -157122 -66806 64578 54822 32253 26444 122460
20096A22460r5404j7436J4706m1558J7765J00591J1488r7263J53729R9726j43449
$$ 122460 27056 9620 24326 -17232 533 101124 112612 15349 169078 268804 125355
20085A25355N3202R3910j09414l1115M2681L7385J3227M7090q1052j66392J34834
$$ 125355 178557 272467 163053 131938 174619 212004 225231 272321 191269 24877 159711
20074A59711k7828n6688J43543R6819o510j37094r5228L3079k4947o4894j014
$$ 159711 131883 75195 218738 315557 309047 171953 76725 109804 84857 19963 18949
20063A8949J44291L1846l6072R3348K87250n2524j14158j6862J74300L55784J55198
$$ 18949 163240 195086 159014 252362 539612 487088 372930 356068 530368 886152 1041350
20052A041350R2184J88975K44598L09709M02682M26569Q15240P48268K73331m74014
$$ 1041350 1133534 1322509 1567107 1876816 2279498 2706067 3521307 4269575 4542906 4068892
20042D068892r89519r91061q13048l32623k35068j91394l9641k1866j07384j52265
$$ 4068892 3079373 2088312 1275264 942641 707573 516179 476538 454672 347288 195023
20032A95023K6618p0796j22867R3525L27061r5953q9741L08188K62827O9939J72765
$$ 195023 221641 150845 27978 121503 448564 352611 262870 571058 833885 903824 1076589
20021A076589K15707L94433M03493M69128M99886N89888O87710N00391j94016
$$ 1076589 1292296 1686729 2090222 2559350 3059236 3649124 4336834 4837225 4643209
20012D643209q70162r46736p33299m18426k58193k2781K70746K90282L92603M60470
$$ 4643209 3773047 2826311 2093012 1674586 1416393 1393612 1664358 1954640 2347243 2807713
20002B807713M33217J25554k65834m24721l37507l89465n11915l75769l5745Q3672
$$ 2807713 3240930 3366484 3100650 2675929 2338422 1948957 1437042 1061273 1025528 1109200
19992A109200Q295j01750k8148K15564L0993j59394l20916k36355p3253k39498
$$ 1109200 1117495 1015745 987597 1203161 1234154 1074760 753844 517489 444236 204738
19982B04738K9668R1442P3855o7251k23736k137l853L1748J21313Q0327K5821
$$ 204738 234406 325848 399703 332452 108716 106579 102726 134474 255787 336114 361935
19971C61935L9164o286P2550J24938p985q3970l324J59091N9863O0153Q8400m277
$$ 361935 401099 394813 467363 592301 584316 500346 497022 656113 715976 776129 864529 860252
19959H60252K13287J06229K15708n9573j30342r2586j47731K63621K81550L51266
$$ 860252 1073539 1179768 1395476 1335903 1205561 1112975 965244 1228865 1510415 1861681
19949A861681K90650K94194M24362J96420J53852n859l76092o55429n38928m43585
$$ 1861681 2152331 2446525 2870887 3067307 3221159 3215300 2839208 2183779 1644851 1201266
19939A201266l62980j74163j69657j61252K4029m5640J23381L3172N9566N5778
$$ 1201266 838286 664123 494466 333214 357243 311603 434984 468156 527722 583500
19929E83500K1169j28608q0257l1409K8116j29145j67688n8493p7315n6982N9023
$$ 583500 604669 476061 395804 364395 392511 263366 95678 37185 -40130 -97112 -38089
19918c8089j13985R4734M1893P5053L1758q0592J1727R9240n4482N6388r3664
$$ -38089 -152074 -57340 -15447 59606 91364 10772 22499 121739 67257 123645 29981
19907B9981m4774J22221p901k8994o5374j83945o8645J55485K24726j2347K1747
$$ 29981 -14793 107428 99527 70533 5159 -178786 -247431 -91946 132780 120433 142180
19896A42180n3438L2478J2769J23139M2071n1454j14426N71j01881m119N1656
$$ 142180 88742 121220 133989 257128 299199 247745 133319 133890 32009 27890 79546
19885G9546J05293J36811N470p0612J9655Q746P8112j64986M0574j14n7300J84571
$$ 79546 184839 321650 327120 256508 276163 284909 363021 198035 238609 238495 181195 365766
19873C65766Q845l2793L4591N1620K6753j37345K4401J51417O4005P6671K49873
$$ 365766 374611 341818 376409 428029 454782 317437 341838 493255 557260 633931 883804
19862H83804J64079J66333J55423K68375K95707k80425l51392l13973p3857p550
$$ 883804 1047883 1214216 1369639 1638014 1933721 1653296 1301904 987931 914074 906524
19852I06524r2583l8455l0815j09237O6541K87063J14158K5199R2546J63745J13704
$$ 906524 813941 775486 744671 635434 701975 989038 1103196 1128395 1220941 1384686 1498390
19841A498390Q7533j27628j84682k79580j20747J09407n2728J15708m3291p5340
$$ 1498390 1585923 1458295 1273613 994033 873286 982693 929965 1045673 1002382 927042
19831I27042N3469J31732K15020K43391R4155k12880P278m6238k36203q8042N3274
$$ 927042 980511 1112243 1327263 1570654 1664809 1451929 1459207 1412969 1176766 1088724 1141998
19820A141998o0106n9738J55709L73111K88818K08077O3482K1032J82868Q0614
$$ 1141998 1081892 1022154 1177863 1550974 1839792 2047869 2111351 2132383 2315251 2395865
19810B395865j5189j92775l73638j82588p2183o2559J05553L5505k04335o6697
$$ 2395865 2380676 2187901 1814263 1631675 1559492 1496933 1602486 1637991 1433656 1366959
19800A366959J89105N1068p1250k31697P4206J02726N6271j47901q8128n5540
$$ 1366959 1556064 1607132 1535882 1304185 1378391 1481117 1537388 1389487 1301359 1245819
19790A245819o9966o0859k8988R8843r2127K03828P4297m3720L3404r4996J78429
$$ 1245819 1175853 1114994 1086006 1184849 1092722 1296550 1370847 1327127 1360531 1265535 1443964
19779A443964K21994J29661R7876n112J4110l6549k09734m2182l091J09489J26064
$$ 1443964 1665958 1795619 1893495 1888383 1902493 1865944 1656210 1614028 1610937 1720426 1846490
19768A846490J4383J80454K83661M7494M0668J33401J15475M8871K12198K79783
$$ 1846490 1860873 2041327 2324988 2372482 2413150 2546551 2662026 2710897 2923095 3202878
19758C202878J82058J66669M35313O63287P38342O76253M55895O95327O85823
$$ 3202878 3384936 3551605 3986918 4650205 5388547 6064800 6520695 7216022 7901845
19749G901845O60827M47795O77781J160826J654920K238868K845385L723198M387152
$$ 7901845 8562672 9010467 9688248 10849074 12503994 14742862 17588247 21311445 25698597
19740B5698597M739842M397629K654813o8883k157818k474263j097519R95895
$$ 25698597 30438439 34836068 37490881 37421998 35264180 32789917 31692398 32688293
19732C2688293L383474N888390Q806443J2605806J7751879K4284874L2094099
$$ 32688293 36071767 41960157 50766600 63372406 81124285 105409159 137503258
19725A37503258L8976211M4049530M3403052K8282165k277772l1355445m3661813
$$ 137503258 176479469 220528999 263932051 292214216 289936444 258580999 214919186
19718B14919186m2027169l6075978k8848833k0083097j0970474l226613K475705
$$ 214919186 172892017 136816039 107967206 87884109 76913635 73687022 76162727
19711G6162727N964959O633718L407609m231105j2505266j6344734j4734908j0845736
$$ 76162727 82127686 88761404 92169013 87937908 75432642 59087908 44353000 33507264
19703C3507264p227230m712156k765556j678255p64177l29852O9748K71057M47357
$$ 33507264 26280034 21567878 18802322 17124067 16359890 16030038 16099786 16370843 16818200
19694A6818200M01168K01304l0622L29294J013742J450930K185308L547526M954418
$$ 16818200 17219368 17420672 17390050 17719344 18733086 20184016 22369324 25916850 30871268
19685C0871268O524543Q519298J0970692J2865269J3934387J2341555O570154
$$ 30871268 37395811 45915109 56885801 69751070 83685457 96027012 102597166
19678A02597166k008958p094935n879348j845P905564J6060970K4254425L1938803
$$ 102597166 100588208 93493273 87613925 87612080 95517644 111578614 135833039 167771842
19670A67771842L6945747L6479346L1390283K2271375K974562k7520300n4101048
$$ 167771842 204717589 241196935 272587218 294858593 297833155 270312855 216211807
19663B16211807n9766936m8415400l2910073k0513682j2369870p371853m465109
$$ 216211807 156444871 108029471 75119398 54605716 42235846 34863993 30398884
19656C0398884k277960l65657Q82900J700330K234834K172311R17162k192090
$$ 30398884 28120924 27755267 28638167 30338497 32573331 34745642 35662804 33470714
19648C3470714n338685o299726n263200l731237k307693j405811j163664o55373
$$ 33470714 28132029 21832303 16569103 12837866 10530173 9124362 7960698 7305325
19640G305325m64678l81428l58089o71647o75514o26755n68423m73647m89051
$$ 7305325 6840647 6459219 6101130 5429483 4753969 4127214 3558791 3085144 2596093
19631B596093j91396p3812o5859j20877k45960j95399j11290m9638q8359N9937
$$ 2596093 2404697 2330885 2265026 2144149 1898189 1702790 1591500 1541862 1453503 1513440
19621A513440n8217q9923M2028p5867L0675o9559l03186j20524m9186j49583j64693
$$ 1513440 1455223 1365300 1407328 1331461 1362136 1292577 989391 868867 819681 670098 505405
19610E05405l3310J15686M4784k9965J0266J2775M4930l0900k9364n1302j22439
$$ 505405 472095 587781 632565 602600 612866 625641 670571 639671 610307 559005 436566
19599D36566j06471l1651j15407N4456m4940N3985J48611l6195K0013j99108M3247
$$ 436566 330095 298444 183037 237493 192553 246538 395149 358954 378967 179859 223106
19588B23106M3932n5142P8054P0457L335k3584j10932j10994p2601L6483r0285
$$ 223106 267038 211896 289950 360407 363742 340158 229226 118232 45631 82114 -8171
19577h171J1012O0835J4294j13138O6814R0159J84195J00573q6354m1326N4099
$$ -8171 2841 63676 77970 -35168 31646 121805 306000 406573 320219 278893 332992
19566C32992p5129q8619K2491j07285j80223J50139L8948m5402K1701j07914p0370
$$ 332992 257863 169244 191735 84450 -95773 54366 93314 47912 69613 -38301 -108671
19555a08671J51493K01594J6155j4035j07361j43099K25366J19618J26369j03641
$$ -108671 42822 244416 260571 246536 139175 -3924 221442 341060 467429 363788
19545C63788j87198k835J15588M1834j28948m8883n1179j13352K8113J76317J0755
$$ 363788 176590 173755 289343 331177 202229 153346 102167 -11185 16928 193245 204000
19534B04000j04074Q7862M5238j07150j44731l0864Q6874n6278N0218O5640r5204
$$ 204000 99926 187788 233026 125876 -18855 -49719 37155 -19123 31095 96735 1531
19523A531o3851J6459J4017R2917O4536m4108K6847n1478o0100P3220J10444R6775
$$ 1531 -62320 -45861 -31844 61073 125609 81501 108348 56870 -3230 69990 180434 277209
19511B77209O4906O5802m3511k2469L6487M286p7414j73085j71222k4595J34673
$$ 277209 342115 407917 364406 341937 378424 382710 305296 132211 -39011 -63606 71067
19500G1067j7094j4656Q7235m2350k17949q5767R5905L6135J61202K2287R3744
$$ 71067 53973 39317 126552 84202 -133747 -219514 -123609 -87474 73728 96015 189759
19489A89759J83267M8195j19866j64490k5676r9880j24590j7188O3985L5523o362
$$ 189759 373026 421221 301355 136865 111189 11309 -113281 -130469 -66484 -30961 -37323
19478c7323P1235J40444n2926K1072j48966o0170P3750L8995O2493k00080j49237
$$ -37323 33912 174356 121430 142502 -6464 -66634 7116 46111 108604 -91476 -240713
19467b40713J03453M4599l781J31967k2512m0377j07451r1706j5614J37591j9097
$$ -240713 -137260 -92661 -96442 35525 13013 -27364 -134815 -226521 -242135 -104544 -123641
19456a23641M0319K197Q2803m7323J36783N861j60584R2339m2379q3466o4666
$$ -123641 -83322 -81125 1678 -45645 91138 96999 -63585 28754 -13625 -97091 -161757
19445a61757o3869Q2518K3306j7052j70903o1993p7509J81106J04115R1674Q0568
$$ -161757 -225626 -143108 -119802 -136854 -307757 -369750 -447259 -266153 -162038 -70364 10204
19434A0204j76488p1846P2729m5560j3726m9956Q0719N0985Q0892l5638j27539
$$ 10204 -166284 -238130 -165401 -210961 -224687 -274643 -193924 -142939 -62047 -97685 -225224
19423b25224n7573L4203J81233K24216P3145k00388L374Q0683K4374m0360j332
$$ -225224 -282797 -248594 -67361 156855 230000 29612 32986 113669 138043 97683 96351
19412I6351K3264j55635j14504J34162M3083r3045o4865j09992N19K62033M9522
$$ 96351 119615 -36020 -150524 -16362 26721 -66324 -131189 -241181 -240662 21371 70893
19401G0893J6656j03225k01164j51554P8541P1450J36923R461j64010L9731K0004
$$ 70893 87549 -15676 -216840 -368394 -289853 -218403 -81480 -72019 -236029 -196298 -176294
19390a76294n1559k333J60709M5476K4280j62802j13987p9530N4623J22338m2695
$$ -176294 -227853 -230186 -69477 -24001 279 -162523 -276510 -356040 -301417 -179079 -221774
19379b21774P0317r6946L2179r5111q9228k9708J64981K9433J50711K040m9066
$$ -221774 -151457 -248403 -216224 -311335 -400563 -430271 -265290 -235857 -85146 -83106 -132172
19368a32172L4300J20279K5916R0387l5919l7244r380k14459K3146J46363Q4659
$$ -132172 -97872 22407 48323 138710 102791 65547 56167 -158292 -135146 11217 95876
19357I5876o6525m3732j856M7939K0485j61605k2190k7696l717J4977J78570J23900
$$ 95876 29351 -14381 -16237 31702 52187 -109418 -131608 -159304 -163021 -148044 30526 154426
19345A54426j61297l2136M9N0470m2999q1090O5564l9747j33224r8559j91507
$$ 154426 -6871 -39007 -38958 11512 -31487 -112577 -47013 -86760 -219984 -318543 -510050
19334e10050J5529Q8376N3828J19129j4747m0345L146k8299J27519J06858j61572
$$ -510050 -494521 -406145 -352317 -233188 -247935 -288280 -285134 -313433 -185914 -79056 -240628
19323b40628R219j10679J4194J18551P7261m6813j08504k76688j4974J77045K45009
$$ -240628 -231409 -342088 -327894 -209343 -132082 -178895 -287399 -564087 -579061 -402016 -157007
19312a57007k7568O5907M0931j86840O9074O1303J7087K0017O9942J24134j66785
$$ -157007 -184575 -118668 -77737 -264577 -195503 -134200 -117113 -97096 -27154 96980 -69805
19301f9805j63654P5356J01726m7338r0905L1479n2014n7304K06028K35376P205
$$ -69805 -233459 -158103 -56377 -103715 -194620 -163141 -215155 -272459 -66431 168945 176150
19290A76150r0764j36742K7980q6623j4837j1894J41372M6107j31833O8901K2921
$$ 176150 85386 -51356 -23376 -109999 -124836 -136730 4642 50749 -81084 -12183 10738
19279A0738r8242p0599j61419L5183Q0417l0146n1501j71061J16698K01782J3743
$$ 10738 -87504 -158103 -319522 -284339 -203922 -234068 -285569 -456630 -339932 -138150 -124407
19268a24407j3111n6947k46152l4949K10699m755J1376o8409k53340J51820J51528
$$ -124407 -137518 -194465 -440617 -475566 -264867 -269622 -258246 -326655 -579995 -428175 -276647
19257b76647M9957M6044q4287L4424l5744K0791M2155J44556j0365j88178p7262
$$ -276647 -226690 -180646 -264933 -230509 -266253 -245462 -203307 -58751 -69116 -257294 -334556
19246c34556m8128L0174M7552J38713J73236l791J80354M6067j15852j7742p2042
$$ -334556 -382684 -352510 -304958 -166245 6991 3200 183554 229621 113769 96027 23985
19235B3985j27929n0744J86790J32199K6464r8543N3273m2665n7185k5108j1213
$$ 23985 -103944 -154688 32102 164301 190765 92222 145495 102830 45645 20537 9324
19224I324K36869J93821J31733J5539R3176m3119M1108N7124o0808O2493p2810
$$ 9324 246193 440014 571747 587286 680462 637343 678451 735575 674767 737260 664450
19213F64450j29845K5442K33417R3951O275j45554j08298m3709l6312q2967l2629
$$ 664450 534605 560047 793464 887415 893690 748136 639838 596129 559817 476850 444221
19202D44221o9896p5884L5161j99733r5727K4699J3358J2212r027N2907n963J58061
$$ 444221 374325 298441 333602 133869 38142 62841 76199 88411 79384 132291 126328 284389
19190B84389N2201r7457O546j78939j97879p3125j8097P4048N6211P1355l3262
$$ 284389 336590 239133 245679 66740 -131139 -204264 -222361 -148313 -92102 -20747 -54009
19179e4009o0892p2100j9378O8854J94473J67002N8752l1979P3042K7098P329
$$ -54009 -114901 -187001 -206379 -137525 56948 223950 282702 250723 323765 350863 358192
19168C58192o6974j04285N1838P4644K38071J5287L0538L7796q1155n4924o5266
$$ 358192 291218 186933 238771 313415 551486 566773 597311 635107 553952 499028 433762
19157D33762j64394j95313J05178K22209O5798o1624n7359J25973K07413Q0611
$$ 433762 269368 74055 179233 401442 467240 405616 348257 474230 681643 762254
19147G62254k3651j41648o4882j81544j26469p2886J5936k5926q2344o2577o9187
$$ 762254 738603 596955 532073 350529 224060 151174 167110 141184 58840 -3737 -72924
19136g2924M5595M9979k2408J96282J01279q2470j23112J096o8498j34291j8909
$$ -72924 -27329 22650 242 196524 297803 215333 92221 93317 24819 -109472 -128381
19125a28381n3575k08479j7308K08892J22921m6166m3078J38399m4102n5911K2506
$$ -128381 -181956 -390435 -407743 -198851 -75930 -122096 -165174 -26775 -70877 -126788 -104282
19114a04282K00920O5341n413j73469k22707o85J72873k13729j44271J94307L8448
$$ -104282 96638 161979 156566 -16903 -239610 -240295 -67422 -281151 -425422 -231115 -192667
19103a92667q9702j0726p0729J83212Q9435r9204O573K7168J27480l4232j52788
$$ -192667 -282369 -293095 -363824 -180612 -91177 -190381 -183808 -156640 -29160 -63392 -216180
19092b16180O1916J05574K4384j76225L5194L9085p3063j69467J21601J46527
$$ -216180 -154264 -48690 -24306 -200531 -165337 -126252 -199315 -368782 -247181 -100654
19082a00654o0248n1966N9985K2613j2383p4556J45891J14500M4478N1717j56810
$$ -100654 -160902 -212868 -152883 -130270 -142653 -217209 -71318 43182 87660 139377 -17433
19071a7433j47287J0771p2353J97926K0041M7219k574o6121j4932J1993R0188
$$ -17433 -164720 -153949 -226302 -28376 -8335 38884 36310 -29811 -44743 -32750 57438
19060E7438J01446j69923j28300M8559l4449o0116o2768p5088r579K8603J05826
$$ 57438 158884 -11039 -139339 -90780 -125229 -185345 -248113 -323201 -332780 -304177 -198351
19049a98351r468m3938j0486j5826L2523R6460J22501L2415k46574O6774K20686
$$ -198351 -207819 -251757 -262243 -278069 -245546 -149086 -26585 5830 -240744 -173970 46716
19038D6716K4497j15149j41965J5062p565r2517L5187J39121J4896l57713j78883
$$ 46716 71213 -43936 -185901 -170839 -178404 -270921 -235734 -96613 -81717 -439430 -618313
19027f18313J21136J26442P0102m7943M5714M3601j90927M0527K77562Q7399Q6027
$$ -618313 -497177 -370735 -300633 -348576 -302862 -259261 -450188 -409661 -132099 -44700 41327
19016D1327k7792q7393o086K0007q1828R1419j27596k20869J42733m4607q4908
$$ 41327 13535 -73858 -79944 -59937 -141765 -50346 -177942 -398811 -256078 -300685 -385593
19005c85593J33339l1851K6095j0829j90613p4363K37501J40566J6307K34631
$$ -385593 -252254 -284105 -258010 -268839 -459452 -533815 -296314 -155748 -139441 95190
18995I5190J27843r2805j80055Q0035J05907k2813J57112j01217j39148n0923
$$ 95190 223033 130228 -49827 30208 136115 113302 270414 169197 30049 -20874
18985b0874j70773j02154J38383Q1295q7373J9974J51641J13172m517n4292P5952
$$ -20874 -191647 -293801 -155418 -74123 -161496 -141522 10119 123291 118774 64482 140434
18974A40434L8952J3834J44771J2186r5725q8662J46019J85598M9637K46449M44052
$$ 140434 179386 193220 337991 350177 254452 165790 311809 497407 547044 793493 1237545
18963A237545L33778M06078N54081N40091K00736k14609o53848o27759m36470
$$ 1237545 1571323 1977401 2531482 3071573 3272309 3057700 2403852 1776093 1339623
18954A339623j45433j92719j81914r5724l9196j34185J18896J32943J18336j38398
$$ 1339623 1194190 1001471 819557 723833 684637 550452 669348 802291 920627 782229
18944G82229k42985n7617r8465j04939m3548r4555m7032j58513r3696J26915O8539
$$ 782229 539244 481627 383162 278223 234675 140120 93088 -65425 -159121 -32206 36333
18933C6333J59597m7222j50135o8279l1404o1421N5318J12793K395k09682M4387
$$ 36333 195930 148708 -1427 -69706 -101110 -162531 -107213 5580 7975 -201707 -157320
18922a57320L30698J84518Q1307J71543Q8751K03607J59422j04926j72413k13718
$$ -157320 173378 357896 439203 610746 699497 903104 1062526 957600 785187 571469
18912E71469J7978M6246K08726K87531L01514L15885K79148L79947J40804O2380
$$ 571469 589447 635693 844419 1131950 1433464 1749349 2028497 2408444 2549248 2611628
18902B611628j25897l79095m33355o35385m62159j58767j61395q1776L0445j4116
$$ 2611628 2485731 2106636 1673281 1037896 575737 416970 255575 173799 204244 190128
18892A90128k92133N9839J54232J38555J21488J44581Q9270N0213j27456q8037
$$ 190128 -102005 -42166 112066 250621 372109 516690 605960 656173 528717 440680
18882D40680j27838j75882q9595j1677o3430j42039l9982l6940j01522P5369J36625
$$ 440680 312842 136960 47365 35688 -27742 -169781 -209763 -246703 -348225 -272856 -136231
18871a36231j0784k07914p2695L9265N1623K07444R5112j3719p7205p2258O3625
$$ -136231 -147015 -354929 -427624 -388359 -336736 -129292 -34180 -47899 -125104 -197362 -133737
18860a33737L210n8154P160J02828l5915o1857J09465Q4827l2116j36379N1557
$$ -133737 -130527 -188681 -181521 -78693 -114608 -176465 -67000 17827 -14289 -150668 -99111
18849i9111J40175m5768O0136P7053n2780o3555n3471M6k6188J68725J9689j61637
$$ -99111 41064 -4704 55432 132485 79705 16150 -37321 -37275 -63463 105262 124951 -36686
18837c6686n959J81543J04206j55597j26167k54054k74956J58318P9556j6778
$$ -36686 -42645 138898 243104 87507 -38660 -292714 -567670 -409352 -329796 -346574
18827c46574J01443Q0759O0730q6640j7291R7911m1468J01356P9787q245J2472
$$ -346574 -245131 -164372 -103642 -190282 -207573 -109662 -151130 -49774 30013 21768 34240
18816C4240o3918j68920O0589O6474m6116l0741J27294N9755n8019m5102j59394
$$ 34240 -29678 -198598 -138009 -71535 -117651 -148392 -21098 38657 -19362 -64464 -223858
18805b23858M9243R8512L5262M7407L6985j18324j08188N2795R7163M8120J19957
$$ -223858 -174615 -76103 -40841 6566 43551 -74773 -182961 -130166 -33003 15117 135074
18794A35074j4416k223M2351J10292M3490n356j6233K1901Q7060O3603q1702j17578
$$ 135074 120658 118435 160786 271078 314568 309212 292979 314880 401940 465543 383841 266263
18782B66263k60157o021N6861N1965L7269n4443k3989p3970K35749J27724m6777
$$ 266263 6106 85 56946 108911 146180 91737 67748 -6222 229527 357251 310474
18771C10474n5037K14934L5428L9256M13374N30438L50945l27785m14397n17886
$$ 310474 255437 470371 505799 545055 958429 1488867 1839812 1512027 1097630 579744
18761E79744l96025j37985J04286l7616L7573P2416R4342l5328o3457m9177m9119
$$ 579744 183719 45734 150020 112404 149977 222393 316735 281407 217950 168773 119654
18750A19654j39635n212m5262n4628k33888N7891J42884o3760K0872J53085R1584
$$ 119654 -19981 -25193 -70455 -125083 -358971 -301080 -158196 -221956 -201084 -47999 43585
18739D3585j14206j20912M3560J24920J21883Q0096L884L2679J84073k99303j59449
$$ 43585 -70621 -191533 -147973 -23053 98830 178926 182810 215489 399562 100259 -59190
18728e9190P0562k3983j19763Q5767l6355J03688M7444J23777j2347l00983p6623
$$ -59190 11372 -12611 -132374 -46607 -82962 20726 68170 191947 179600 -121383 -198006
18717a98006l6994J50452N3669m1229j48802k694P4616J59772Q9754j9198O0501
$$ -198006 -235000 -84548 -30879 -72108 -220910 -223604 -148988 10784 100538 81340 141841
18706A41841k38625j72229L8170Q5020j8072J59514m1058K49J72700m4888j4022
$$ 141841 -96784 -269013 -230843 -145823 -163895 -4381 -45439 -45190 127510 82622 68600
18695F8600J7236j8869M7077J00726k4802j32747j7500O0508j35641j1470N4993
$$ 68600 85836 66967 114044 214770 189968 57221 39721 100229 -35412 -46882 8111
18684H111J8245j08499j21339O9426L0177q1800L5928k8251q3489N3714n6432
$$ 8111 26356 -82143 -203482 -134056 -103879 -185679 -149751 -178002 -261491 -207777 -264209
18673b64209o9588J0099m7099K8908o1008l579J19199N0603Q7352R9606j05371
$$ -264209 -333797 -323698 -370797 -341889 -402897 -406476 -287277 -236674 -149322 -49716 -155087
18662a55087O5066N7850j23865p3488k1421J0298j0277p1390L8083J28592J98230
$$ -155087 -90021 -32171 -156036 -229524 -250945 -240647 -250924 -322314 -284231 -155639 42591
18651D2591j26613j9800j60320k45026l8339K15860J64163R196r2515Q9173J45804
$$ 42591 -84022 -103822 -264142 -509168 -547507 -331647 -167484 -158288 -250803 -161630 -15826
18640a5826j27248q9242o0118M2356m757J75895P1862j3993j05229j09720k8054
$$ -15826 -143074 -232316 -292434 -250078 -254835 -78940 -7078 -21071 -126300 -236020 -264074
18629b64074J07975M9107q7054M1220K19204P6236r7515j56806k66365n1253L42698
$$ -264074 -156099 -106992 -194046 -152826 66378 142614 45099 -111707 -378072 -429325 -86627
18618h6627J87979p7596j43932k2090k9088K19235J0820j81951R7108K37449q1914
$$ -86627 101352 23756 -120176 -142266 -171354 47881 58701 -123250 -26142 211307 129393
18607A29393n1945Q4343j14500j511j07888l8359l7810j05831N1657J54540K1060
$$ 129393 77448 161791 47291 45780 -62108 -100467 -138277 -244108 -192451 -37911 -16851
18596a6851n7367o9384J43911J97722j209j12218J45124n2941O573j27173j78917
$$ -16851 -74218 -143602 309 198031 196822 84604 229728 176787 183360 56187 -122730
18585a22730k456J82668L7692L7953J7072o9250K350O4624K44493K7673l11962
$$ -122730 -125186 57482 95174 133127 150199 80949 83299 147923 392416 420089 108127
18574A08127k45205l238N2671J55243p288O8952P8615J13092O5183j47216k49271
$$ 108127 -137078 -140316 -87645 67598 60310 129262 207877 320969 386152 238936 -10335
18563a0335p4545n4722o1776J31751J45389j51335r9372K34556R6520l0042O5444
$$ -10335 -84880 -139602 -201378 -69627 75762 -75573 -174945 59611 156131 126089 191533
18552A91533o094J7238j8447o5617M2095N4844n9580K6452j1725r8573j32166
$$ 191533 185439 202677 184230 118613 160708 215552 155972 182424 170699 72126 -60040
18541f0040r4214k4896Q4879j12048J22212o6833Q168n8416l7188m0818J05445
$$ -60040 -154254 -179150 -94271 -206319 -84107 -150940 -142772 -201188 -238376 -279194 -173749
18530a73749Q4710n3004K8267J49920k1040q158m1532M7786J53663j9894r3054
$$ -173749 -89039 -142043 -113776 36144 15104 6946 -34586 13200 166863 146969 53915
18519E3915o4621J01754R7203k4656j21985p8141j9868j24136r1315j94333K6896
$$ 53915 -10706 91048 188251 163595 41610 -36531 -56399 -180535 -271850 -466183 -439287
18508d39287J70818J11716R6928m2599m7016K5379j6636P9018m4620Q8956R9940
$$ -439287 -268469 -156753 -59825 -102424 -149440 -124061 -140697 -61679 -106299 -17343 82597
18497H2597R3357r1557j1037n8002N483J36538r7312j46411J6965M794L84k5089
$$ 82597 175954 84397 73360 15358 20841 157379 60067 -86344 -69379 -64585 -64201 -89290
18485h9290r2810m3443n091Q9339R6288J21261N967J49594R2691o6192k15270
$$ -89290 -182100 -225543 -230634 -141295 -45007 76254 82221 231815 324506 258314 43044
18474D3044r4888j26604k2222R5860j1373P3782J3102p9240p5316L2506j38016
$$ 43044 -51844 -178448 -200670 -104810 -116183 -42401 -29299 -108539 -183855 -151349 -289365
18463b89365M1261K68358L6081q0422q4629p190J51935O2034k502m658n6989n339
$$ -289365 -248104 20254 56335 -24087 -108716 -115906 36029 98063 95561 90903 33914 28575
18451B8575j46361j80100l4301P2861J00238l7806R9855N5066j45941p339J60453
$$ 28575 -117786 -297886 -332187 -259326 -159088 -196894 -97039 -41973 -187914 -195253 -34800
18440c4800l6206q7351N1388P1630O428j69485N9022j3221K6448m1497m3629O0618
$$ -34800 -71006 -158357 -106969 -35339 -28911 -198396 -139374 -152595 -126147 -167644 -211273 -150655
18428a50655q3911K59253K46928j80625j53372j84675J44715J9387k40696n8492
$$ -150655 -234566 24687 271615 90990 -62382 -247057 -102342 -82955 -323651 -382143
18418c82143J92421N8184k8636n5537R5840L9953r8476R7609o887P985L9401k2741
$$ -382143 -189722 -131538 -160174 -215711 -119871 -79918 -178394 -80785 -87672 -79687 -40286 -63027
18406f3027J359q5321M4169J36702N891r6321J15199K9828k02377q841J91333
$$ -63027 -61668 -146989 -102820 33882 39773 -56548 58651 88479 -113898 -122739 68594
18395F8594K9644K5146n2403j05137k1396p2457j68648L6699R8042M8940j0622
$$ 68594 98238 123384 70981 -34156 -55552 -128009 -296657 -259958 -161916 -112976 -123598
18384a23598m1561k0278q6882l8959J46300J98866N8680n5948j61498k5905J14958
$$ -123598 -165159 -185437 -272319 -311278 -164978 33888 92568 36620 -124878 -150783 -35825
18373c5825K9349R6445J32868o2993J2390K2998Q6242J32766P2186K9099n7746
$$ -35825 -6476 89969 222837 159844 172234 195232 281474 414240 486426 515525 457779
18362D57779j47026j19556m1499p1070j23274N2068M6125K3649J07898k3942q7284
$$ 457779 310753 191197 149698 78628 -44646 7422 53547 77196 185094 161152 73868
18351G3868J85568K97064O8459M7032l7773n6873M8546O779k4010o7533k26944
$$ 73868 259436 556500 624959 671991 634218 577345 625891 632670 608660 541127 314183
18340C14183l15462k0912P593J47561q979O1981J23066k0209n3868L3148O816
$$ 314183 -1279 -22191 -14598 132963 123984 185965 309031 288822 234954 268102 274918
18329B74918M5839m0359j31209L7425p4613j13176L1754K22317J30345J70562
$$ 274918 320757 280398 149189 186614 112001 -1175 30579 252896 383241 553803
18319E53803J82177J61262L84936j57021k98508k41514j72685j02766j48362j32004
$$ 553803 735980 897242 1282178 1125157 826649 585135 412450 309684 161322 29318
18309B9318j49923K2498o5658J9150k8943J2144K8724L1758J09457k0454J903
$$ 29318 -120605 -98107 -163765 -144615 -173558 -161414 -132690 -100932 8525 -11929 -10026
18298a0026j9379J42109J65n5600l8247P9144J19327L17867J74530k68080O194
$$ -10026 -29405 112704 112869 57269 19022 98166 217493 535360 709890 441810 448004
18287D48004J95067L523l5198j01555l57276k46239J6995R5651Q943j62498q2811
$$ 448004 643071 646594 611396 509841 152565 -93674 -76679 18972 27915 -134583 -217394
18276b17394L07006J1523P3014K7742l2723k68747o9228J14352J48314j17149
$$ -217394 89612 101135 174149 201891 169168 -99579 -168807 -54455 93859 -23290
18266b3290N0981J38235J09786N7838L7506q0772p7166j11554Q1236J0544m7180
$$ -23290 27691 165926 275712 333550 371056 290284 213118 101564 182800 193344 146164
18255A46164M1169l8363k79911j1216O2318J02250J53514N1800p046Q3587O2308
$$ 146164 187333 148970 -130941 -142157 -79839 22411 175925 227725 220679 304266 366574
18244C66574j42107j07163J06905L6732P0311j24672P4338p4768R3688L6675m8524
$$ 366574 224467 117304 224209 260941 331252 206580 280918 206150 299838 336513 287989
18233B87989j00681r955J49552o2146j46659L7585p4119m8165j8663J1754N7247
$$ 287989 187308 177353 326905 264759 118100 155685 81566 33401 14738 26492 83739
18222H3739n5941n9697M6776O6142m2038J73598J49692m5886j41931k36312o9965
$$ 83739 27798 -31899 14877 81019 38981 212579 362271 316385 174454 -61858 -131823
18211a31823M6522n37l7964R9202J31667J73159J11529k1141J34870O0751j17082
$$ -131823 -85301 -85838 -123802 -24600 107067 280226 391755 370614 505484 566235 449153
18200D49153j44752N4683P4159q3968O134J34515J22853j56871j570j06086j38355
$$ 449153 304401 359084 433243 349275 355409 489924 612777 455906 454336 348250 209895
18189B09895j47534M6498J15157J21295K5213P4978P5946L3905K2487M1111r6618
$$ 209895 62361 108859 224016 345311 370524 445502 521448 555353 577840 618951 522333
18178E22333j53205R9955P7179N402R701R7117M5826r5625p6459L6286N2672k41616
$$ 522333 369128 469083 546262 551664 561365 658482 704308 608683 532224 568510 621182 379566
18166C79566K714J9483N7602K06064M9613j7703K23742P0975r1078p5133J28859
$$ 379566 382280 401763 459365 665429 715042 697339 921081 992056 900978 825845 954704
18155I54704J20636L437N7274R7265j5069p5392J2912L03660J62856K0060m807
$$ 954704 1075340 1078777 1136051 1233316 1218247 1142855 1155767 1459427 1622283 1642343 1637536
18144A637536m4470J51021J43435J23963J25290J46694n6487M6444J15522K44344
$$ 1637536 1593066 1744087 1887522 2011485 2136775 2283469 2226982 2273426 2388948 2633292
18134B633292O2886J06614L06413L85252J51160J79574L30206N77033N72201O73851
$$ 2633292 2696178 2802792 3109205 3494457 3645617 3825191 4155397 4732430 5304631 5978482
18124E978482O12928Q38839J175282J552152K094608K358032K907831M318708
$$ 5978482 6591410 7430249 8605531 10157683 12252291 14610323 17518154 21836862
18116B1836862O112873Q073865J0853173J5325172K3543768L3904869L8609050
$$ 21836862 27949735 36023600 46876773 62201945 85745713 119650582 158259632
18109A58259632M3467102N8492540N8028643k8505758r9312356p8215708m3003975
$$ 158259632 201726734 260219274 318247917 289742159 190429803 112214095 69210120
18102F9210120k3180175j3486498q121450n453325m132808k853186k023487j531202
$$ 69210120 46029945 32543447 24421997 18968672 14835864 11982678 9959191 8427989
18094H427989j075873q41703o35927k93197o01331n78792m86473l46006l77267
$$ 8427989 7352116 6510413 5874486 5581289 4979958 4401166 3914693 3568687 3191420
18085C191420l58038k59562j56349K4357k04864o0023l10574l90754k3243l2971
$$ 3191420 2833382 2573820 2417471 2441828 2236964 2176941 1866367 1475613 1452370 1419399
18075A419399j41732k9039j9526j39517j0303p8473o4436q4117l9588o3489P4265
$$ 1419399 1277667 1248628 1229102 1089585 1079282 1000809 936373 852256 812668 749179 823444
18064H23444r3019J7543M8924k71671j08824L5926P1769k5830K4374J61992K910
$$ 823444 730425 747968 796892 525221 416397 452323 524092 498262 522636 684628 687538
18053F87538P7367k6426N8602n770k37004j67644j93935M5923Q1007J16496k624
$$ 687538 764905 738479 797081 791311 554307 386663 192728 238651 319658 436154 433530
18042D33530q9196J9525K8528j52235j3671J4206o3263J15239P0991K1110k9822
$$ 433530 344334 363859 392387 240152 226481 240687 177424 292663 363654 384764 354942
18031C54942j06893j42453O3806N7768R9546j15302j44453m4483K8595j1488L0259
$$ 354942 248049 105596 169402 227170 326716 211414 66961 22478 51073 39585 69844
18020F9844o322o0353M6256J46427J52052K9744q5653M9219Q3923j24001p718
$$ 69844 63522 3169 49425 195852 347904 377648 291995 341214 425137 301136 293418
18009B93418k58702j27127N9972J52125N1845n1188K2088O359j81909J446J38133
$$ 293418 34716 -92411 -32439 119686 171531 120343 142431 148790 -33119 -31673 106460
17998A06460J20872j45211r2346m1801J79540L1524J7747R0746o6270J6147K6769
$$ 106460 227332 82121 -10225 -52026 127514 159038 176785 267531 201261 217408 244177
17987B44177r1200k74903n1076P3685J2622K2479J14484J5977Q0357r612p5298
$$ 244177 152977 -121926 -173002 -99317 -86695 -64216 50268 66245 146602 136990 61692
17976F1692k6742M4527k8687l6698j66934j2411r2160J4326K2149J57499J56280
$$ 61692 34950 79477 50790 14092 -152842 -165253 -257413 -243087 -220938 -63439 92841
17965I2841J21859j06430k95140j84219K0561J558K22240J28889l1047K246k3553
$$ 92841 214700 108270 -186870 -371089 -350528 -348970 -126730 2159 -28888 -26642 -50195
17954e0195K19060M3353K3922L6811Q7507N4864r7753m3807J24126J19408j52342
$$ -50195 168865 212218 236140 272951 360458 415322 317569 273762 397888 517296 364954
17943C64954J00399J20831n9073J234j56079n3711j58031N2263J53268L3022r1558
$$ 364954 465353 586184 527111 528345 372266 318555 160524 212787 366055 399077 307519
17932C07519J3029K68480K49970J58355M10598q279l26967k16908j88260q4036
$$ 307519 320548 589028 838998 997353 1407951 1399672 1072705 855797 667537 583501
17922E83501n924j66039j68791K059Q5419r0318J03877J36886o065m3211r0697
$$ 583501 577577 411538 242747 244806 330225 239907 343784 480670 474605 431394 340697
17911C40697q4135R7729K09974K30598q2270p6621k4337K13993J8129Q0534K70447
$$ 340697 256562 354291 564265 794863 712593 635972 611635 825628 843757 924291 1194738
17900A194738L90902M44628K92966K84407j92677m58785l89378l29939l29277
$$ 1194738 1585640 2030268 2323234 2607641 2414964 1956179 1566801 1236862 907585
17891I07585k71874o8025r8899r2463j02082J24460J7990O6977o8509j09573R8418
$$ 907585 635711 567686 468787 376324 274242 398702 416692 483669 415160 305587 404005
17880D04005Q3517m0165j9271R8874J30743j35968J18281J37809R5495K63173
$$ 404005 487522 447357 428086 526960 657703 521735 640016 777825 873320 1136493
17870A136493J39719J95576K09301J11157R7852k13542l32258k21309k7135N9159
$$ 1136493 1276212 1471788 1681089 1792246 1890098 1676556 1344298 1122989 1095854 1155013
17860A155013j5370M498r6465j80227P964J90995o3172J00815r8873J9390J30422
$$ 1155013 1139643 1144141 1047676 867449 875413 1066408 1003236 1104051 1005178 1024568 1154990
17849A154990K0747O6160K60271J45874K02236L80880L26931J72233K0954N3297
$$ 1154990 1175737 1241897 1502168 1648042 1850278 2231158 2558089 2730322 2751276 2804573
17839B804573K02080K91444K33349K68758L53070N85203P72025Q39089J124607
$$ 2804573 3006653 3298097 3531446 3800204 4153274 4738477 5510502 6349591 7474198
17830G474198J466994K127305K779542L213360M223299N625485Q035445J1867733
$$ 7474198 8941192 11068497 13848039 17061399 21284698 26910183 34945628 46813361
17822D6813361J5374407J7212751K0556842K4015302R841049k4519172l6544145
$$ 46813361 62187768 79400519 99957361 123972663 133813712 109294540 72750395
17815G2750395k6040247j4955994q602974m968599l160501k029919j201980m75390
$$ 72750395 46710148 31754154 23151180 18182581 15022080 12992161 11790181 11314791
17807A1314791l14638l04730j20267L02142O13951J124309J717963K407560K868398
$$ 11314791 11000153 10695423 10575156 10877298 11491249 12615558 14333521 16741081 19609479
17798A9609479L923739N247876P093636R334894J2401524J8143993K6013017L1487653
$$ 19609479 23533218 28781094 35874730 45209624 57611148 75755141 101768158 133255811
17790A33255811L4857885M2818192M1093445p442187o3958615o4645089m0975331
$$ 133255811 168113696 210931888 252025333 244583146 180624531 115979442 75004111
17783G5004111k3544366j3916508q539423n413671l619503k398320j560327j396774
$$ 75004111 51459745 37543237 29003814 23590143 19970640 17572320 16011993 14615219
17775A4615219j434177j220876o33144p5552K2412N14957J003783J259637J913191
$$ 14615219 13181042 11960166 11327022 11251470 11273882 11788839 12792622 14052259 15965450
17766A5965450K764161L707018M687137O548380J0187210J4102298J5676290J8077662
$$ 15965450 18729611 22436629 27123766 33672146 43859356 57961654 73637944 91715606
17758I1715606K2297293J4345484j7508172l5689279k7744377j6333744r540824
$$ 91715606 114012899 128358383 110850211 75160932 47416555 31082811 21541987
17751B1541987n587512l386912k196396j676282j195898q62864p96842p30372
$$ 21541987 15954475 12567563 10371167 8694885 7498987 6636123 5839281 5108909
17743E108909o74119m21870k83600l31589j69268j68820k44099k20417l18280
$$ 5108909 4434790 4012920 3729320 3397731 3228463 3059643 2815544 2595127 2276847
17734B276847k60273J7928j6641j39664j55038j15391l6368J4993j53512k75936
$$ 2276847 2016574 2034502 2017861 1878197 1723159 1607768 1571400 1586393 1432881 1156945
17724A156945k40193p7031m2697R1840l4905l1281r1311R1938O1481K1129J24663
$$ 1156945 916752 839721 797024 888864 853959 822678 731367 823305 884786 905915 1030578
17713A030578q757j4279p2963L4671j65935m4383j6728j05356j29287J11159M9742
$$ 1030578 1021821 1007542 934579 969250 803315 758932 742204 636848 507561 618720 668462
17702F68462K5133r0004p0488K8186j52271k8537j01974J21727m4437j25298R9731
$$ 668462 693595 603591 533103 561289 409018 380481 278507 400234 355797 230499 330230
17691C30230R7198O6531J867j33027j4929p8367j56909K63471J06557j12177m9598
$$ 330230 427428 493959 495826 362799 347870 269503 112594 376065 482622 370445 320847
17680C20847k0140j9216q1800R2502P659O6125o859N5484N4308L4974j50346j82435
$$ 320847 300707 281491 199691 292193 299852 365977 359118 414602 468910 503884 353538 171103
17668A71103M4325q7807J52932r635J9869R5320O9361j01419M6740J01636j34689
$$ 171103 215428 127621 280553 270918 290787 386107 455468 354049 400789 502425 367736
17657C67736o6L3558j07446j22470j51340L3730K2491n8924M8277Q6079j09815
$$ 367736 367670 401228 293782 171312 19972 53702 76193 17269 65546 151625 41810
17646D1810j8734Q0086R0686p3668j55609j80724l727J56713J26831J62928J24820
$$ 41810 23076 103162 193848 120180 -35429 -216153 -219880 -63167 63664 226592 351412
17635C51412r2298j02990k0740Q6232j5330j10671m3212O6036p9929m3118M8391
$$ 351412 259114 156124 135384 221616 206286 95615 52403 118439 38510 -4608 43783
17624D3783O1268J41095j8334j5326n3019P3745R7181K7774k07784j15239n5947
$$ 43783 105051 246146 227812 212486 159467 233212 330393 358167 150383 35144 -20803
17613b0803K66476R2194q9103o9133K57653J07338j47548k67074k11605l824k8175
$$ -20803 245673 337867 248764 179631 437284 544622 397074 130000 -81605 -85429 -113604
17602a13604o8645J38307J79204J07403j21007l8444j36534q436P9196j9230p4250
$$ -113604 -182249 -43942 135262 242665 121658 83214 -53320 -61756 17440 -1790 -76040
17591g6040J12184K18778j15991j60970j25201R8074K67432J03626p4287j4265
$$ -76040 36144 254922 138931 -22039 -147240 -49166 218266 321892 247605 233340
17581B33340q1199j24707q8782k9315J36339N4432l6967j13649J13874J02215
$$ 233340 152141 27434 -61348 -90663 45676 100108 63141 -50508 63366 165581
17571A65581R5323K8502j07159r520J38393j02591J8715j2811j29932j14797Q9006
$$ 165581 260904 289406 182247 172727 311120 208529 227244 214433 84501 -30296 58710
17560E8710J60533j35348o0984J01693j79525o0242J81719o6947L5498R1191o8675
$$ 58710 219243 83895 22911 124604 -54921 -115163 66556 -391 35107 126298 57623
17549E7623m5352N0000p292k14507P0300Q6033M7372n864o0001J14517J20767
$$ 57623 12271 62271 54979 -159528 -89228 -3195 44177 38313 -21688 92829 213596
17538B13596L2716p19j47512j8461K48274J3043j9222m5592j55569j51408J94968
$$ 213596 246312 245593 98081 79620 327894 340937 321715 276123 120554 -30854 164114
17527A64114K6737q3014o4039P7732L8572o7263J01276J25497l1061l26096K066
$$ 164114 190851 107837 43798 121530 160102 92839 194115 319612 288551 -37545 -35479
17516c5479K12840j2679o1208N9478j36699j21154l0756r7010L820J43822Q5279
$$ -35479 177361 164682 103474 162952 26253 -94901 -125657 -222667 -218847 -75025 10254
17505A0254j62778o3280K47072J04900R3824k6586r7322j11700J08429J70858
$$ 10254 -152524 -215804 31268 136168 229992 203406 106084 -5616 102813 273671
17495B73671p6027q0231m1331l3691o3487J69867R5849L0514r0867j38707j75599
$$ 273671 197644 117413 76082 42391 -21096 148771 244620 275134 184267 45560 -130039
17484a30039j96414M8136m7225M3640R7423Q5612J68454R6879M7023J5021L8823
$$ -130039 -326453 -278317 -325542 -281902 -184479 -98867 69587 166466 213489 228510 267333
17473B67333R1236J92989P3042j66504k10952M4533p3904q9651j0596p1583O2646
$$ 267333 358569 551558 624600 458096 247144 291677 217773 128122 117526 45943 108589
17462A08589o4516R7741J43939J03385N3901l4750j14343q0689l03512K8993K62710
$$ 108589 44073 141814 285753 389138 443039 408289 293946 213257 -90255 -61262 201448
17451B01448J91026P3272N809R1143L9978j27182Q435K31673L44552K92092L27551
$$ 201448 392474 465746 471555 562698 602676 475494 483929 715602 1060154 1352246 1679797
17440A679797J30872k88029m72319l70646n8274m684n3221n6148k4100k1765j9714
$$ 1679797 1810669 1522640 1050321 679675 621401 616717 563496 507348 483248 461483 441769
17429D41769k337J7927J48817n8821j64983J00007L9442L7641J34264O5045R6926
$$ 441769 439432 457359 606176 547355 382372 482379 521821 559462 693726 758771 855697
17418H55697j01464j23671l3424O8461O8155J58610Q9904L1828q6598j00272j0384
$$ 855697 754233 630562 597138 665599 733754 892364 982268 1014096 927498 827226 816842
17407H16842q8764P8033L6410K2710o1922j68305j88374r8570K09524K04791r792
$$ 816842 728078 806111 842521 865231 803309 635004 446630 348060 557584 762375 752583
17396G52583N9233P8062K08185L21433J61100k6205j43179J07634J60207J21006
$$ 752583 811816 889878 1098063 1419496 1580596 1554391 1411212 1518846 1679053 1800059
17386A800059o649m74J86884M4726j400J2561J08056K63399K82824L37236K67028
$$ 1800059 1793410 1792936 1979820 2024546 2023146 2035707 2143763 2407162 2689986 3027222 3294250
17375C294250K50038K62250m335j42673k62809J83908L60391M78485L54157M96352
$$ 3294250 3544288 3806538 3802203 3659530 3396721 3580629 3941020 4419505 4773662 5270014
17365E270014N93212Q11202R71242J170831J358898J580638J916890K651355L443449
$$ 5270014 5863226 6674428 7645670 8816501 10175399 11756037 13672927 16324282 19767731
17356A9767731M226228N069060N636795N541698J719107l657603m764250k248799
$$ 19767731 23993959 29063019 34699814 40241512 41960619 38303016 33538766 31289967
17348C1289967N64198L021856N571588P977503J1030386J5319997K1599997L0632270
$$ 31289967 31854165 34876021 40447609 48425112 59455498 74775495 96375492 127007762
17340A27007762L8966460M6332391N5613861N5824774J8400830l7292196n8472369
$$ 127007762 165974222 212306613 267920474 323745248 342146078 304853882 246381513
17333B46381513n0135595m1113907l5623924k5496288j4204606n248155J371457
$$ 246381513 196245918 155132011 119508087 94011799 79807193 74559038 75930495
17326G5930495N320591Q116479R205887L138845j1793011k0952979j8781796j2853247
$$ 75930495 81251086 89367565 98573452 101712297 89919286 68966307 50184511 37331264
17318C7331264q037241m961456k876198j558113r93698o81462q24232r81563p02247
$$ 37331264 29294023 24332567 21456369 19898256 18904558 18223096 17398864 16417301 15715054
17309A5715054l59561r1943L53664Q52572J276759J590493J838201K525259L587134
$$ 15715054 15355493 15263550 15617214 16469786 17746545 19337038 21175239 23700498 27287632
17300B7287632M960123P045066R665589J1790143J3737761J5706972J3637454
$$ 27287632 32247755 39292821 48958410 60748553 74486314 90193286 103830740
17293A03830740K073312j0144136j1051782l866673M709831J2394280J9746626
$$ 103830740 105904052 95759916 84708134 80841461 85551292 97945572 117692198
17286A17692198K8122645L6845754L9762800L3887379K9692083K3525552n916197
$$ 117692198 145814843 182660597 222423397 256310776 286002859 309528411 303612214
17279C03612214n5978612p5353610n8067389l5958958k1176652j2671251p873364
$$ 303612214 247633602 172279992 114212603 78253645 57076993 44405742 36532378
17272C6532378m982126l100058j604429l02967J062047K055619K906774L224629
$$ 36532378 31550252 28450194 26845765 26542798 27604845 29660464 32567238 35791867
17264C5791867R41630m630280p250149n947844l855083k419128j251294j006305
$$ 35791867 36733497 32103217 24853068 18905224 15050141 12631013 11379719 10373414
17256A0373414j213348j191653q76067n02841n84336m24946n17970m00095m81043
$$ 10373414 9160066 7968413 7092346 6589505 6005169 5580223 5062253 4662158 4181115
17247D181115l20771k75506j64576k00154j54931j82013j29238j98991l64154
$$ 4181115 3860344 3584838 3420262 3220108 3065177 2883164 2753926 2554935 2190781
17238B190781j12253n2142m2667k10937r7472N3840o3149K19j83480r0397j0532
$$ 2190781 2078528 2026386 1983719 1772782 1675310 1729150 1666001 1666220 1482740 1392343 1381811
17227A381811M6647P0295R9283j4681j20644J14151J10353j524j13745k42984
$$ 1381811 1428458 1498753 1598036 1583355 1462711 1576862 1687215 1685691 1571946 1328962
17217A328962q4259q9j56473j91301j00397l5206R0571J22491N5210j86373j82726
$$ 1328962 1244703 1244614 1088141 896840 796443 761237 851808 974299 1029509 843136 660410
17206F60410K6235J04059Q9016L1285j45114j46683j30449o8703P5167J13797
$$ 660410 686645 790704 879720 911005 765891 619208 488759 420056 495223 609020
17196F09020J66244q4437J50118O1323j2483p1796j55478r9314n3131m2409r8668
$$ 609020 775264 690827 840945 902268 889785 817989 662511 563197 510066 467657 368989
17185C68989j93759J18130K55123j82584k33509L5131M00445J26881j10626r7718
$$ 368989 175230 293360 548483 365899 132390 167521 567966 694847 584221 486503
17175D86503j8681J18747R3155j97415J8279L615o0844J01384J47179M7931J3351
$$ 486503 467822 586569 679724 482309 500588 504203 443359 544743 691922 739853 753204
17164G53204l0682j2967n6323q1738P7959K7020P5377J86057K8621j2632R5728
$$ 753204 722522 709555 653232 571494 649453 676473 751850 937907 966528 953896 1049624
17153A049624R3467q0778k98502j72615j7977j07520j17944Q6956J2171j44987
$$ 1049624 1143091 1062313 763811 591196 573219 465699 347755 434711 446882 301895
17143C01895J13119K5677l2480p7241P659K15421o3777q1066n6633J10569o3884
$$ 301895 415014 440691 408211 330970 338629 554050 490273 409207 352574 463143 399259
17132C99259k16894o3938j1880M0409k4192l0152K2573J04964N7061l2263N8273
$$ 399259 182365 118427 106547 146956 122764 92612 115185 220149 277210 244947 303220
17121C03220J2488p4454J30309K17194O9389j59317n1690r0606q5155n7222o6086
$$ 303220 315708 241254 371563 588757 658146 498829 447139 356533 271378 214156 148070
17110A48070p4018P7700M0792l1987l7256J30235K02744J55k4937p7574J46376
$$ 148070 74052 151752 192544 160557 123301 253536 456280 456435 431498 353924 500300
17099E00300J42142k9571k1210r2281j49747l55551j27423J7404K07887J56924
$$ 500300 642442 612871 591661 499380 349633 -5918 -133341 -115937 91950 248874
17089B48874j64686j32231J72825o9465J0077J56547P2679j69405j6381j16615
$$ 248874 84188 -48043 124782 55317 65394 221941 294620 125215 108834 -7781
17079g781K4908J0504P1747O5605j01989j30210J1521L598M9406r4063J60897
$$ -7781 17127 27631 99378 164983 62994 -67216 -55695 -52097 -2691 -96754 64143
17068F4143J10876j6468r0896R382M269J17710r6980l25508N6015K01585J76138
$$ 64143 175019 158551 67655 77037 81306 199016 102036 -223472 -167457 34128 210266
17057B10266J52665J2387N7287n4838k43813r8907J43395k2919o8989L0671K10550
$$ 210266 362931 375318 432605 377767 133954 35047 178442 155523 86534 117205 327755
17046C27755j26205k04418j59455P2682o2815j28318J58760P4611Q0455j07126
$$ 327755 201550 -2868 -162323 -89641 -152456 -280774 -122014 -47403 33052 -74074
17036g4074P6115M7197k9398J99264P2263O8430p595j38159r7046R628R4700m882
$$ -74074 2041 49238 19840 219104 291367 359797 352202 214043 116997 126625 221325 216443
17024B16443o0963k0384j3500j06924k104J06349m8127O6848M4302k2300l5892
$$ 216443 155480 135096 121596 14672 12568 118917 70790 137638 181940 159640 123748
17013A23748k7959l833j79237r852O2366J2412P3241J98965K374m11295k5085
$$ 123748 95789 91956 -87281 -97133 -34767 -22355 50886 249851 252225 -159070 -184155
17002a84155R2348r4875M8809K40156J6586j73757l2064q676M2663j194n5116
$$ -184155 -91807 -186682 -137873 102283 118869 -54888 -86952 -95628 -52965 -54159 -109275
16991a09275J4950O0607O2162o789j5273j28141k12141l5159J34871J60324R6612
$$ -109275 -94325 -33718 28444 21655 6382 -121759 -333900 -369059 -234188 -73864 22748
16980B2748R1084K6506j7480j31328j00662N1414N3242q6199n3668J77262K5529
$$ 22748 113832 140338 122858 -8470 -109132 -57718 -4476 -90675 -144343 32919 58448
16969E8448O0800K01528o015j67093p1671m5399J48583j93466j08925J65894j973
$$ 58448 119248 320776 314761 147668 75997 30598 179181 -14285 -123210 42684 40711
16958D0711O2880J17392k1625j58073j5322j02959J4354j56024K50165L8592j40334
$$ 40711 103591 220983 199358 41285 25963 -76996 -62642 -218666 31499 70091 -70243
16947g0243P7079P52j5649j02101l9114J40443J48808p2127j03870J85189j07414
$$ -70243 6836 7588 -8061 -110162 -149276 -8833 139975 67848 -36022 149167 41753
16936D1753q3607J41129J9976J6729M3760R821k9853J71272J26805j16743k72439
$$ 41753 -41854 99275 119251 135980 179740 189561 159708 330980 457785 341042 68603
16925F8603n8435o962J70337P4093p2896j49368m9469J03542m0069p4566j1916
$$ 68603 10168 3206 173543 247636 174740 25372 -24097 79445 39376 -35190 -47106
16914d7106m2668m3835P6609n5077R614Q2603m4528p0108K4071P6095J31641l3291
$$ -47106 -89774 -133609 -57000 -112077 -102463 -19860 -64388 -134496 -110425 -34330 97311 64020
16902F4020j96650j76839J38457J49526N8271K6017o901J13181m1536j29348M0015
$$ 64020 -132630 -309469 -171012 -21486 36785 62802 55901 169082 127546 -1802 38213
16891C8213j2114m3111m0511J00137J01874l1318k711K03836Q3057j55763r3508
$$ 38213 26099 -17012 -57523 42614 144488 113170 110459 314295 397352 241589 148081
16880A48081l3973J20874p4729p4175j00859l1438J31848n758p1301j84450P2581
$$ 148081 114108 234982 160253 86078 -14781 -46219 85629 79871 8570 -175880 -103299
16869a03299K27581O0863K00910J54812j48343k38561q917j07447Q989Q2237P4514
$$ -103299 124282 185145 386055 540867 392524 153963 145046 37599 46588 128825 203339
16858B03339O1764q2024r0083q3123Q2933J69964M1338N2946m143J02393m0769
$$ 203339 265103 183079 92996 9873 92806 262770 304108 357054 352911 455304 414535
16847D14535j41765K01121K49096J28597Q1321k2987l9272q7901j57844R1695
$$ 414535 272770 473891 722987 851584 932905 909918 870646 782745 624901 716596
16837G16596P2557k5024k4782n1238l4647J39636N9068O9456O5588k34574k94432
$$ 716596 789153 764129 739347 688109 653462 793098 852166 921622 987210 752636 458204
16826D58204r088R014j63738j77687m5028J57011M5045r0573l1425R8967o5801
$$ 458204 449116 458130 294392 116705 71677 228688 273733 183160 151735 250702 184901
16815A84901j18193L7273J16676m3976j8939j22044r1406l1148L5045J15910K2376
$$ 184901 66708 103981 220657 176681 157742 35698 -55708 -86856 -51811 64099 86475
16804H6475j8548k0862R1066L2519J17551j9811O363L7079m251O0118J86753K57558
$$ 86475 67927 47065 138131 170650 288201 268390 274753 311832 307581 367699 554452 812010
16792H12010m8150k30250j90626R9246J26413J30777q2087k05963j62264j91438
$$ 812010 763860 533610 342984 442230 568643 699420 617333 411370 249106 57668
16782E7668J58241R730R1029J40135n6090j28708J51005O1317J33227N3823N962
$$ 57668 215909 225639 316668 456803 400713 272005 423010 484327 617554 671377 677339
16771F77339K8078j59493n4345R6276j28340j43021n6437j85871j52554P0305
$$ 677339 705417 545924 491579 587855 459515 316494 260057 74186 -78368 -8063
16761h063j39541k16072K7782J44548m618J09868K35788M3370q5556j59374n041
$$ -8063 -147604 -363676 -335894 -191346 -195964 -86096 149692 193062 107506 -51868 -56909
16750e6909N6881K43042p069k77516r4901J21266L2861l4817j35745J9064R5656
$$ -56909 -28 243014 235945 -41571 -136472 -15206 17655 -17162 -152907 -133843 -38187
16739c8187R9649q1234l9341J87286J33874p712Q2704k05889j32138l2211j26356
$$ -38187 61462 -19772 -59113 128173 262047 254335 337039 131150 -988 -33199 -159555
16728a59555J05201M6752k3949K7068L5182M1960J2300l8599M2542R0135k37012
$$ -159555 -54354 -7602 -31551 -4483 30699 72659 84959 46360 88902 179037 -57975
16717e7975j41537o497J04196Q9393p6505m44N1410n8688J9648o7520O262p8969
$$ -57975 -199512 -206009 -101813 -12420 -88925 -89369 -37959 -96647 -76999 -144519 -138257 -217226
16705b17226J5157Q013O0701P5802J68743q2477j9723M7591j4383n4628l8959
$$ -217226 -202069 -194056 -133355 -57553 111190 28713 8990 56581 42198 -12430 -51389
16694e1389M5204J9515J09051n5471j10820J17664K03317j38658j10915j01698
$$ -51389 -6185 13330 122381 66910 -43910 73754 277071 138413 27498 -74200
16684g4200J6921k6850j36533n1388R9037J10355j7174o8845L4492M6131q5562
$$ -74200 -57279 -84129 -220662 -272050 -173013 -62658 -79832 -148677 -114185 -68054 -153616
16673a53616j02937m5928N3756K33759j9432k5318j72417j22019K49499J74319
$$ -153616 -256553 -302481 -248725 -14966 -34398 -59716 -232133 -354152 -104653 69666
16663F9666l1470o7401p9182O6552J35197j3153j64163j23325n8968J42719q076
$$ 69666 38196 -29205 -108387 -41835 93362 80209 -83954 -207279 -266247 -123528 -131604
16652a31604j01087m8703P9847R7898j43851k5515J10332j8931P4421Q5389K4076
$$ -131604 -232691 -281394 -201547 -103649 -247500 -273015 -162683 -181614 -107193 -21804 2272
16641B272k4933j38463k8335J16113p91N0639R6425m7005O571j28317p8830J34687
$$ 2272 -22661 -161124 -189459 -73346 -74137 -23498 72927 25922 32493 -95824 -174654 -39967
16629c9967J88705r8999k83170Q7120n5790n3472J9830Q5723J24463R6179J61833
$$ -39967 148738 49739 -233431 -146311 -202101 -255573 -235743 -150020 -25557 70622 232455
16618B32455q6488k01003l9518J23879r0521j23694J00933J5468J35700J29678
$$ 232455 145967 -55036 -94554 29325 -61196 -184890 -83957 -68489 67211 196889
16608A96889J1889j88647k7511M1293N8616j85711q4985r5283Q3014J32352P1700
$$ 196889 208778 20131 -7380 33913 92529 -93182 -178167 -273450 -190436 -58084 13616
16597A3616k2119J4171l6451o2217j93991O4142J44589o6169K08775J23072M6433
$$ 13616 -8503 5668 -30783 -93000 -286991 -222849 -78260 -144429 64346 187418 233851
16586B33851J5532j43226k46816L3082J5959l2122p0740J63415O0557o6987k3174
$$ 233851 249383 106157 -140659 -107577 -91618 -123740 -194480 -31065 29492 -37495 -60669
16575f0669l9596K6626K5661L0833J4436j55503k2157m6383R8005J33748J5515
$$ -60669 -100265 -73639 -47978 -17145 -2709 -158212 -180369 -226752 -128747 5001 20516
16564B0516M144N1643N9668J48213N6742j72951j69456o8594R1212J42540O9512
$$ 20516 24660 76303 135971 284184 340926 167975 -1481 -70075 21137 163677 233189
16553B33189O0916k25453j19277j22559j7232J39252M9949j4303J47913J58591
$$ 233189 294105 68652 -50625 -173184 -190416 -51164 -1215 -15518 132395 290986
16543B90986j58069l9493j32727j77998r4278O827J28637j4667m3415r186O1923
$$ 290986 132917 93424 -39303 -217301 -311579 -304752 -176115 -190782 -234197 -243383 -181460
16532a81460L9132Q7859J66738k1449k5348o0537j87623k7115p6024p8211j8825
$$ -181460 -142328 -54469 112269 90820 65472 4935 -182688 -209803 -285827 -364038 -382863
16521c82863J42164L9898j53806p1069K0012M0242J23620P7724J44621J02017
$$ -382863 -240699 -200801 -354607 -425676 -405664 -365422 -241802 -164078 -19457 82560
16511H2560j2176j1320r6243O1896M0702q8043j99454j45516r9925P8865J27489
$$ 82560 70384 59064 -37179 24717 65419 -22624 -222078 -367594 -467519 -388654 -261165
16500b61165k5004j53235q4266o5028j37778K06712K61916K28784j24098L600
$$ -261165 -286169 -439404 -523670 -588698 -726476 -519764 -257848 -29064 -153162 -149562
16490a49562J78308o4688j09069Q6644m5894N2896O0229k7050j556m3099o1387
$$ -149562 28746 -35942 -145011 -58367 -104261 -51365 8864 -18186 -19742 -62841 -124228
16479a24228m7663p0397O2098R1612j06506M3024J21359N3966J1635L3944q2826
$$ -124228 -171891 -242288 -180190 -88578 -195084 -152060 -30701 23265 34900 68844 -13982
16468a3982J29838J20162O68j86939n0055R4234L5401l9549L4159n4596O2900
$$ -13982 115856 236018 236686 49747 -308 93926 129327 89778 123937 69341 132241
16457A32241n9568L7734j50344L3567j18405j22984l2780J11166J55660P3707
$$ 132241 72673 110407 -39937 -6370 -124775 -247759 -280539 -169373 -13713 59994
16447E9994L7849j64845k4093J3169O0822J86517N7068j83810j78057L1956R7828
$$ 59994 97843 -67002 -91095 -77926 -17104 169413 226481 42671 -135386 -103430 -5602
16436e602L1415j5338p7200M8438Q3203p6738p7037P2441j82063l4105N2698R2156
$$ -5602 25813 10475 -66725 -18287 64916 -11822 -88859 -16418 -198481 -232586 -179888 -87732
16424h7732l4026n458J2027j08191J06476n6126r1781J10312K36398M6120m7794
$$ -87732 -121758 -127216 -115189 -223380 -116904 -173030 -264811 -154499 81899 128019 80225
16413H0225N3557p8200r2247j89715j43273r4009R8687M9565m917r8808J51099
$$ 80225 133782 55582 -36665 -226380 -369653 -463662 -364975 -315410 -320327 -419135 -268036
16402b68036K6830m4299l4791p0510R0564J6315J33494Q0391m5334j4416o4598
$$ -268036 -241206 -285505 -320296 -390806 -300242 -283927 -150433 -70042 -115376 -129792 -194390
16391a94390P838K0695Q7796j19697j3068P0530j24406l3398K6546J33916R8746
$$ -194390 -186552 -165857 -78061 -197758 -210826 -140296 -264702 -298100 -271554 -137638 -38892
16380c8892J244N474J8130J3105M2774p6395J72985O2712J17935p3585j90286
$$ -38892 -37648 -32174 -14044 -939 41835 -34560 138425 201137 319072 245487 55201
16369E5201j00397l2727J4572J24366m685k19372j92175J44919K72643l0445k61545
$$ 55201 -45196 -77923 -63351 61015 56330 -163042 -355217 -210298 62345 31900 -229645
16358b29645p9237J02088J38130n0682K0819j317j02996P3894J17951K8178k525
$$ -229645 -308882 -206794 -68664 -119346 -98527 -99844 -202840 -128946 -10995 17183 14658
16347A4658M7030j30227M8772K06785K0900o5018m7747p8126j54361j05550l6611
$$ 14658 61688 -68539 -19767 187018 207918 142900 95153 17027 -137334 -242884 -279495
16336b79495j33228j09733r7902K22776J54651L9216q638q7079N721o4546l2966
$$ -279495 -412723 -522456 -620358 -397582 -242931 -203715 -212353 -299432 -293711 -358257 -391223
16325c91223J45059J06005j5653K975k2974l1405K505K8638K86M8290J17899J34870
$$ -391223 -246164 -140159 -155812 -152837 -175811 -207216 -204711 -176073 -175787 -127497 -9598 125272
16313A25272q7563J51210K20800n2468j47754j79387p5294k40q2913r2622n1911
$$ 125272 37709 188919 409719 357251 209497 30110 -45184 -45424 -128337 -220959 -272870
16302b72870P9591K50935M2913k1261j32851j23179j6913r8366L8960L808l0947
$$ -272870 -193279 57656 100569 79308 -53543 -176722 -193635 -292001 -253041 -249233 -280180
16291b80180J43323K25080L0058j2504m2666o2518j39247L6847n808k8219O7781
$$ -280180 -136857 88223 118281 105777 63111 593 -138654 -101807 -107615 -135834 -68053
16280f8053j3170M0392R4622L6134m8059j81144n8257M7417q900L6879O6741M4681
$$ -68053 -81223 -40831 53791 89925 41866 -139278 -197535 -150118 -159018 -122139 -55398 -10717
16268a0717p9464k9615Q677j4297p5565j31395K580n6040J71509K31776J58629
$$ -10717 -90181 -119796 -111119 -125416 -200981 -332376 -329796 -385836 -214327 17449 176078
16257A76078n382o594K0822j00959j41843j82238Q7668m7581O3038J13364N6826
$$ 176078 170696 164102 184924 83965 -57878 -240116 -152448 -200029 -136991 -23627 33199
16246C3199k1431n0889K3535R9797N4030j57617J03770R195j29636J6658k2422
$$ 33199 11768 -39121 -15586 84211 138241 -19376 84394 93589 -36047 -19389 -41811
16235d1811J7713J04404R46j60132j1392P3475j41236p2324P3147P6483R7070
$$ -41811 -24098 80306 81252 -78880 -90272 -16797 -158033 -230357 -157210 -80727 16343
16224A6343J92986l5131m8737k154N1510j26941k57390j74629J497J84572k9248
$$ 16343 209329 174198 125461 123307 174817 47876 -209514 -384143 -382646 -198074 -227322
16213b27322p0461O4151q3853L3192J63953k1446R0166l7142p0129K5582j0200
$$ -227322 -297783 -233632 -317485 -284293 -120340 -141786 -51620 -88762 -158891 -133309 -143509
16202a43509j7983O5537K2984M1016j31039l632J68618J78027j407p5126j22643
$$ -143509 -161492 -95955 -72971 -31955 -162994 -166626 1992 180019 178612 103486 -19157
16191a9157r2601O7092J60798N9207j60947j25459j3506J9224O2988J28775k1093
$$ -19157 -111758 -44666 116132 175339 14392 -111067 -124573 -105349 -42361 86414 65321
16180F5321j06130j60228J62076N491M4686O9513P3142j42214q9677l9340o9076
$$ 65321 -40809 -201037 -38961 -33470 11216 80729 153871 11657 -78020 -117360 -186436
16169a86436j5145O4868L7227j14144N3662J06770K42366P2772j13047q2800J9106
$$ -186436 -201581 -136713 -99486 -213630 -159968 -53198 189168 261940 148893 66093 85199
16158H5199J2149O7532k1475r1803j17493n0883J82632L6784q5610K53521n375
$$ 85199 97348 164880 143405 51602 -65891 -116774 65858 102642 17032 270553 265178
16147B65178j63435r6643o4246j4543J63625p9990L8276m5706n1146p8133J2862
$$ 265178 101743 5100 -59146 -73689 89936 9946 48222 2516 -48630 -126763 -113901
16136a13901k5681n3159K8467P6253o7025Q9102J15707L8799k04764j33085P4704
$$ -113901 -139582 -192741 -164274 -88021 -155046 -65944 49763 88562 -116202 -249287 -174583
16125a74583m7559R767O7996Q4161R9708j42273R3548J65105p8488r799q450j22625
$$ -174583 -222142 -212375 -144379 -60218 39490 -102783 -9235 155870 77382 67583 59133 -63492
16113f3492k16640k9070Q27k3956n5018J63153J54869p8389k7426P7103p674K00383
$$ -63492 -280132 -309202 -308375 -332331 -387349 -224196 -69327 -147716 -175142 -98039 -105713 94670
16101I4670p96j69408P7911O1666O2m2358p8964K1164P1333k6996K00157M4425
$$ 94670 93874 -75534 2377 64043 64105 21747 -57217 -36053 35280 8284 208441 252866
16089B52866l3354n0061J2249J09329J08960Q3699m9892j32048k42693N6353R5669
$$ 252866 219512 169451 181700 291029 399989 483688 433796 301748 59055 115408 211077
16078B11077n7253R2701N8435j78532j62734O1192O336j7814m7033O6284P0611
$$ 211077 153824 246525 304960 126428 -36306 24886 31222 13408 -33625 32659 103270
16067A03270k6032p3892O900J14896J46045j08764j21645o1927N804N4146o9350
$$ 103270 77238 3346 10246 125142 271187 162423 40778 -21149 -15345 38801 -30549
16056c0549o7701J34041M9924m9645n5635J3834j13304L8911O6017j03032j340
$$ -30549 -98250 35791 85715 36070 -19565 -5731 -119035 -80124 -14107 -117139 -118479
16045a18479j39610p6308O8236M6574N1033J11308p328n3397J7802l7935q2449
$$ -118479 -258089 -334397 -266161 -219587 -168554 -57246 -64574 -117971 -100169 -138104 -220553
16034b20553P3092K9312r1664p6740q7517K6274J13222L7183P2833J43351J20913
$$ -220553 -147461 -118149 -209813 -286553 -374070 -347796 -234574 -197391 -124558 18793 139706
16023A39706j13858j05004m0034J56822P7966K3878j15435q1577j5332j85352
$$ 139706 25848 -79156 -119190 37632 115598 139476 24041 -57536 -72868 -258220
16013b58220q1341K10798J70456L5437K4759j06462k19729O8340J03378M6725
$$ -258220 -339561 -128763 41693 77130 101889 -4573 -224302 -155962 -52584 -5859
16003e859P9766j0944n3158m3045k505j782n36K05749P3608k97108j66886Q2000
$$ -5859 73907 62963 9805 -33240 -35745 -37527 -38063 167686 241294 -55814 -222700 -140700
15991a40700O4266l1283N481q9835K4204k2635l2361O4719L2118j13168K2205
$$ -140700 -76434 -107717 -102236 -192071 -167867 -190502 -222863 -158144 -126026 -239194 -216989
15980b16989J86400P0574j8908K6673j3205j61502j42948J4511J68859K25015
$$ -216989 -30589 39985 21077 47750 34545 -126957 -269905 -255394 -86535 138480
15970A38480M1302J8158q7193q0662o0997m8905q1469l9451J0334J00542q1183
$$ 138480 179782 197940 110747 30085 -30912 -79817 -161286 -200737 -190403 -89861 -171044
15959a71044k2742o8450j25275J9098K72052O5551n6608P2967k924M0445k6428
$$ -171044 -193786 -262236 -387511 -368413 -96361 -30810 -87418 -14451 -17375 23070 -3358
15948c358m876P4973m3986M9548M8692j24395q2614O8523m6756P7767j23618l9274
$$ -3358 -8234 66739 22753 72301 120993 -3402 -86016 -17493 -64249 13518 -110100 -149374
15936a49374J17013J71977j63028N8607l156j12149j6767q544J05409J03302q9309
$$ -149374 -32361 139616 -23412 35195 32039 -80110 -96877 -105421 -12 103290 13981
15925A3981l1859K7051r5161o4087j95402R7816J7027K3487P8814r4109J5485
$$ 13981 -17878 9173 -85988 -150075 -345477 -247661 -230634 -207147 -128333 -222442 -206957
15914b06957K8539J99218R4963j36019M3067j4185L4437j24966n9136J73237l2806
$$ -206957 -178418 20800 115763 -20256 22811 8626 43063 -81903 -141039 32198 -608
15903f08p540p7160p0253N2700P7533Q8215p2057j32826o8873J00897j6323l6615
$$ -608 -8148 -85308 -155561 -102861 -25328 62887 -9170 -141996 -210869 -109972 -126295 -162910
15891a62910N6987O0105J9384J9819m8705q9462M8688p1004L9360J47843k8181
$$ -162910 -105923 -45818 -26434 -6615 -55320 -144782 -96094 -167098 -127738 20105 -8076
15880h076p6379l2409P5748n8336l5037J20510M2618j253Q1880O3091R068M095
$$ -8076 -84455 -116864 -41116 -99452 -134489 -13979 28639 27386 109266 172357 181425 185520
15868A85520o0271k9488j22923j24872O833N6188j53083q760K10234J15636m8585
$$ 185520 125249 95761 -27162 -152034 -145201 -89013 -242096 -250856 -40622 75014 26429
15857B6429Q3720P8514j78198p6581R5546k5373n2384N3771j07899M8441K38859
$$ 26429 110149 188663 10465 -66116 29430 4057 -48327 5444 -102455 -54014 184845
15846A84845l8321j34745j95745q0231j19035k4385K41064R4999j4499J4201P5770
$$ 184845 146524 11779 -183966 -264197 -383232 -407617 -166553 -71554 -86053 -71852 3918
15835C918P2130L922l8904K4988j65366p0791O9463J195M8247q4529Q259P4412
$$ 3918 76048 79970 41066 66054 -99312 -170103 -100640 -99445 -51198 -135727 -127468 -53056
15823e3056j2820p6479L0184j4908j3941o128j6691O4636o1479r2277K12630J62513
$$ -53056 -65876 -142355 -112171 -127079 -141020 -147148 -163839 -99203 -160682 -252959 -40329 122184
15811A22184p2792J66345k5599q7496N192o2312j24838j7313P0124M9733N9685
$$ 122184 49392 215737 190138 102642 107834 45522 -79316 -96629 -26505 23228 82913
15800H2913K01109N0448j51632Q243j12078n9701M2276j06411j22785p1561q5061
$$ 82913 284022 334470 182838 191081 79003 19302 61578 -44833 -167618 -239179 -324240
15789c24240m3552r10P6406J30052l4814q1368J9928M899r4475m4023J14367M1124
$$ -324240 -367792 -368702 -292296 -162244 -197058 -278426 -258498 -253599 -348074 -392097 -277730 -236606
15777b36606J5452N8268K6272j24276J34690R7336j23520k13355L9461J1221P148
$$ -236606 -221154 -162886 -136614 -260890 -126200 -28864 -152384 -365739 -326278 -315057 -307909
15766c07909J28008N8226N9716n5804J27378p383N7730J68449Q6151P0544j1445
$$ -307909 -179901 -121675 -61959 -117763 9615 2232 59962 228411 314562 385106 373661
15755C73661m6223j50619k06473L5183P6612J0665k9817r1859r7106r9798n7731
$$ 373661 327438 176819 -29654 5529 82141 92806 62989 -28870 -125976 -225774 -283505
15744b83505J17076R8699p9641k52749N4192J2396O2604n9426j28336Q5808J01435
$$ -283505 -166429 -67730 -147371 -400120 -345928 -333532 -270928 -330354 -458690 -372882 -271447
15733b71447L8060N7969K58978R3386j46822k66822j33050K18259J75869p4671
$$ -271447 -233387 -175418 83560 176946 30124 -236698 -369748 -151489 24380 -50291
15723e0291L653p6527M5458Q5286m6518k05565l7503J3015J6138M3166j0984L828
$$ -50291 -46638 -123165 -77707 7579 -38939 -244504 -282007 -268992 -252854 -209688 -220672 -216844
15711b16844J69913J51317j24214k3264J21721J3480q6745m6563N6825J38228
$$ -216844 -46931 104386 -19828 -43092 78629 92109 5364 -41199 15626 153854
15701A53854k48659k55301K35731O9908j85544J07476J502M9562K7669R456n2836
$$ 153854 -94805 -350106 -114375 -44467 -230011 -122535 -121033 -71471 -43802 -34346 -87182
15690h7182M7930n7521p4357O3205R2582k5286o5260p974L8380j98071j09726
$$ -87182 -39252 -96773 -171130 -107925 -15343 -40629 -105889 -113863 -75483 -273554 -383280
15679c83280J61468J86374q7564j2152J1091J96196K58608j70723j00422p6873
$$ -383280 -221812 -35438 -123002 -135154 -124063 72133 330741 160018 59596 -17277
15669a7277K70016J5956j16673o4688n4396J18032O8346j45782j09673J7777o9591
$$ -17277 252739 268695 152022 87334 32938 150970 219316 73534 -36139 -18362 -87953
15658h7953k5265J59131j2205K3327p6490l0467r7055J5783o4452O723J03225
$$ -87953 -113218 45913 33708 57035 -19455 -49922 -146977 -131194 -195646 -188923 -85698
15647h5698J8387o654k6942k34625J7411J95681L0824K8536J9482J9383R8157
$$ -85698 -67311 -73965 -100907 -335532 -318121 -122440 -91616 -63080 -43598 -24215 73942
15636G3942J50836k14615j57233J44370P3740N0791j13411l3305j61249j72363
$$ 73942 224778 10163 -147070 -2700 71040 121831 8420 -24885 -186134 -358497
15626c58497N1438J66959Q970J52046n0211J481J1775R626j7115j32745k740J6837
$$ -358497 -307059 -140100 -131130 20916 -29295 -27814 -16039 -6413 -23528 -156273 -159013 -142176
15614a42176k32578J5255M5228J67207L9464k8099M0197R6064p2401j14609P0221
$$ -142176 -374754 -359499 -314271 -147064 -107600 -135699 -95502 562 -71839 -186448 -116227
15603a16227Q7370Q4741J4295k36664O4102J0245j76261l9914l827m3845M5812
$$ -116227 -28857 55884 70179 -166485 -102383 -92138 -268399 -308313 -312140 -355985 -310173
15592c10173R6401M9001j39090J37661N7675M8258n3551L5097m6844L9201m4932
$$ -310173 -213772 -164771 -303861 -166200 -108525 -60267 -113818 -78721 -125565 -86364 -131296
15581a31296r2821Q3998R4404J2778j6835J48512j38339k2201R3479n1707m5097
$$ -131296 -224117 -140119 -45715 -32937 -49772 98740 -39599 -61800 31679 -20028 -65125
15570f5125Q760J0448j58416j78734k8713K05596P5730m4143n0164j44842J01694
$$ -65125 -56365 -45917 -204333 -383067 -411780 -206184 -130454 -174597 -224761 -369603 -267909
15559b67909Q9416J98119J26305l9757j69865p071k859O6784N5759j2217n8470
$$ -267909 -178493 19626 145931 106174 -63691 -70762 -73621 -6837 48922 36705 -21765
15548b1765N9561J56337L9182j1886j02226j47620p9373k3760M4621k8280j51215
$$ -21765 37796 194133 233315 221429 119203 -28417 -107790 -131550 -86929 -115209 -266424
15537b66424J38294J26371m5285Q4675O1874K6620p608j2244r1858k5596R2559
$$ -266424 -128130 -1759 -47044 37631 99505 126125 118517 106273 14415 -11181 81378
15526H1378r2060J18604N081n7558N5830K739Q89n0785N9396n3668j08092M6001
$$ 81378 -10682 107922 113003 55445 111275 114014 114903 64118 123514 69846 -38246 7755
15514G755m9393Q8283J55900L3366j32071k03694j1128J01400Q9948N4912O538
$$ 7755 -41638 46645 202545 235911 103840 -99854 -110982 -9582 80366 135278 141816
15503A41816j28657o6823j03257J1466J83273J7401n0999l4162N3646J23073q073
$$ 141816 13159 -53664 -156921 -145455 37818 55219 4220 -29942 23704 146777 138704
15492A38704m4502n5646n84o035N8223J46362p9151q3489p2870K9685M5714M4488
$$ 138704 94202 38556 37972 31937 90160 236522 157371 73882 1012 30697 76411 120899
15480A20899p1105N3015q0504J1902m6076k2321J78682O1652l0533o5706q0181
$$ 120899 49794 102809 22305 34207 -11869 -34190 144492 206144 175611 109905 29724
15469B9724j91597k04924K0129J59075O9091O6135q7454j10296l6630j4322k6874
$$ 29724 -161873 -366797 -346668 -187593 -118502 -52367 -139821 -250117 -286747 -301069 -327943
15458c27943P9135o5309J40980o488j10364p7431M4119J18382J1368l0889K04380
$$ -327943 -248808 -314117 -173137 -179625 -289989 -367420 -323301 -204919 -193551 -224440 -20060
15447b0060P8128j76099j3843J48597J59176n351j14061j67816q9073m7352l4079
$$ -20060 58068 -118031 -131874 16723 175899 170548 56487 -111329 -200402 -247754 -281833
15436b81833N9501Q938K8220J53328O8623j47844k0242Q5343J32288R3013j34839
$$ -281833 -222332 -213394 -185174 -31846 36777 -111067 -131309 -45966 86322 179335 44496
15425D4496l00160o0417J21197J89187J18128l37232J4076J33235J51492J2216
$$ 44496 -255664 -316081 -194884 -5697 112431 -224801 -210725 -77490 74002 86218
15415H6218J0399K9110n857n1429j35573n2979k24475j16609J05672J7985l5687
$$ 86218 96617 125727 119870 68441 -67132 -120111 -344586 -461195 -355523 -337538 -373225
15404c73225J29082K53378K3377K740j44189q1324n442J55217J12149k8580j69380
$$ -373225 -244143 9235 32612 35352 -108837 -190161 -195603 -40386 71763 43183 -126197
15393a26197j40875m6340K92359Q8437j90912K8183J51741N9342p2659q6031K300
$$ -126197 -267072 -313412 -21053 67384 -123528 -95345 56396 115738 43079 -42952 -40652
15382d0652j2431O3582P725Q1079j21028r6261j95396l1805O9066N6142O1752
$$ -40652 -53083 10499 18224 99303 -21725 -117986 -313382 -345187 -276121 -219979 -158227
15371a58227j31935j24198J31653K50133J31267O915j29830k13556j30849M895
$$ -158227 -290162 -414360 -282707 -32574 98693 105608 -24222 -237778 -368627 -363732
15361c63732M6373K65212m7752j54167M2298J37853O5513K5840p8374Q8185q4797
$$ -363732 -317359 -52147 -99899 -254066 -211768 -73915 -8402 17438 -60936 27249 -57548
15350e7548l7168O9917k6333k7734j38r5820J19020J43779j2196p5574P3865q587
$$ -57548 -94716 -24799 -51132 -78866 -79004 -174824 -55804 87975 75779 205 74070 65483
15338F5483k77225o2674Q947K8061J20727R3611j35842N1338L4206P3810n4063
$$ 65483 -211742 -274416 -265469 -237408 -116681 -23070 -158912 -107574 -73368 442 -53621
15327e3621O0000j8765k36067j36362J57153J99587N3102N8391J96232l1519r7179
$$ -53621 6379 -12386 -248453 -384815 -227662 -28075 25027 83418 279650 248131 150952
15316A50952J2254P2368j82386j02595p6867j03943k27779K08144J28443q5364
$$ 150952 163206 235574 53188 -49407 -126274 -230217 -457996 -249852 -121409 -206773
15306b06773q5823O8161J21480o6710K67187P2872r9790k42028k21900J49795
$$ -206773 -292596 -224435 -102955 -169665 97522 170394 70604 -171424 -393324 -243529
15296b43529R5590K3570O4339n7889l2409J12327L2965r1427n1759p4055J16380
$$ -243529 -147939 -124369 -60030 -117919 -150328 -38001 -5036 -96463 -148222 -222277 -105897
15285a05897J51688j99537k995P7990J32850K28889J46845N7405j38830j95517
$$ -105897 45791 -153746 -156741 -78751 54099 282988 429833 487238 348408 152891
15275A52891j14629l7967j12354r4042K3573r7642r549J15374K23945o5894P2782
$$ 152891 38262 295 -112059 -206101 -182528 -280170 -289719 -174345 49600 -16294 56488
$$ [...]
##END NTUPLES=NMR SPECTRUM
##END=
