##TITLE=Analysis number 326953
Compound Code cc 56224
Book Reference 513/49/36
Project Code adrs
Chemist Name ronp
##JCAMPDX= 6.0         $$ Bruker NMR JCAMP-DX V2.0
##DATA TYPE= NMR SPECTRUM
##DATA CLASS= NTUPLES
##ORIGIN= Bruker BioSpin GmbH
##OWNER= nmr
$$ XWIN-NMR		Version 3.5
$$ Mon Mar  5 09:11:50 2007 GMT Standard Time (UT+0h)  MAYBRIDGE\nmr@NMR_250MHZ
##.OBSERVE FREQUENCY= 250.131544655141
##.OBSERVE NUCLEUS= ^1H
##.ACQUISITION MODE= SIMULTANEOUS (DQD)
##.ACQUISITION SCHEME= undefined
##.AVERAGES= 16
##.DIGITISER RES= 18
##SPECTROMETER/DATA SYSTEM= dpx250
##.PULSE SEQUENCE= zg30
##.SOLVENT NAME= CDCl3
##.SHIFT REFERENCE= (INTERNAL, CDCl3, 0, 16.522)
##AUDIT TRAIL= $$ (NUMBER, WHEN, WHO, WHERE, WHAT)
$$ ##TITLE= Audit trail, XWIN-NMR		Version 3.5
$$ ##JCAMPDX= 5.01
$$ ##ORIGIN= Bruker BioSpin GmbH
$$ ##OWNER= nmr
$$ C:\u/data/dgb/nmr/ADRS/210/pdata/1/auditp.txt
$$ ##AUDIT TRAIL=  $$ (NUMBER, WHEN, WHO, WHERE, WHAT)
(   1,<2007-03-05 09:11:26.22 +000>,<MAYBRIDGE\nmr>,<NMR_250MHZ>,
      <created by zg, POWCHK disabled, PULCHK disabled
       configuration hash MD5:
       49 4B E0 1D 92 C2 6B 37 9F E6 65 BC 52 41 86 1D
       data hash MD5: 64K
       1B A3 DA BA 96 F8 F1 ED EE 99 87 94 7B D4 87 9E>)
(   2,<2007-03-05 09:11:40.15 +000>,<MAYBRIDGE\nmr>,<NMR_250MHZ>,
      <Start of raw data processing
       ef LB = 0.3 FT_mod = 6 PKNL = 1 SI = 32K 
       data hash MD5: 32K
       DA 8B 53 79 DB 48 6F 6B 1E 60 2F F5 2C 29 D8 FB>)
(   3,<2007-03-05 09:11:41.89 +000>,<MAYBRIDGE\nmr>,<NMR_250MHZ>,
      <apk 
       data hash MD5: 32K
       22 83 D3 F3 FC E0 E8 B0 54 DF 26 64 8F DE 6C 8E>)
(   4,<2007-03-05 09:11:42.57 +000>,<MAYBRIDGE\nmr>,<NMR_250MHZ>,
      <abs ABSG = 5 
       data hash MD5: 32K
       D5 85 01 CE 9B 3D 2B 45 2C 6A 35 66 94 75 94 E4>)
$$ ##END=
$$ 
$$ hash MD5
$$ 48 2B F9 C8 B4 25 01 AF 6E 53 1C 82 32 D8 5C 49
##$RELAX= 
##$RELAX= 
##$RELAX= 
##$RELAX= 
##$RELAX= 
##$RELAX= 
##$RELAX= 
$$ Bruker specific parameters
$$ --------------------------
##$DU= <C:\u>
##$EXPNO= 210
##$NAME= <ADRS>
##$PROCNO= 1
##$TYPE= <nmr>
##$USER= <dgb>
##$AMP= (0..31)
100 100 100 100 100 100 100 100 100 100 100 100 100 100 100 100 100 100 
100 100 100 100 100 100 100 100 100 100 100 100 100 100 
##$AQSEQ= 0
##$AQ_mod= 3
##$AUNM= <au_zg>
##$AUTOPOS= <3 >
##$BF1= 250.13
##$BF2= 250.13
##$BF3= 250.13
##$BF4= 250.13
##$BF5= 500.13
##$BF6= 500.13
##$BF7= 500.13
##$BF8= 500.13
##$BYTORDA= 1
##$CFDGTYP= 0
##$CFRGTYP= 5
##$CHEMSTR= <none>
##$CNST= (0..31)
1 1 145 1 1 1 1 1 1 1 1 1 1 1 1 1 1 1 1 1 1 1 1 1 1 1 1 1 1 1 1 1 
##$CPDPRG= <>
##$CPDPRG1= <>
##$CPDPRG2= <>
##$CPDPRG3= <>
##$CPDPRG4= <mlev>
##$CPDPRG5= <mlev>
##$CPDPRG6= <mlev>
##$CPDPRG7= <mlev>
##$CPDPRG8= <mlev>
##$CPDPRGB= <>
##$CPDPRGT= <>
##$D= (0..31)
0 1 0 0 0 0 0 0 0 0.06 0 0 0 0 0 0 0.0002 0 0 0 0 0 0 0 0 0 0 0 0 0 0 
0 
##$DATE= 1173085884
##$DBL= (0..7)
120 120 120 120 120 120 120 120 
##$DBP= (0..7)
150 150 150 150 150 150 150 150 
##$DBP07= 0
##$DBPNAM0= <>
##$DBPNAM1= <>
$$ [...]
##$SUBNAM7= <"">
##$SUBNAM8= <"">
##$SUBNAM9= <"">
##$SW= 20.6930455092707
##$SWIBOX= (0..15)
0 0 3 0 0 0 0 0 0 0 0 0 0 0 0 0 
##$SW_h= 5175.983436853
##$TD= 65536
##$TD0= 1
##$TE= 295.16
##$TE2= 300
##$TE3= 300
##$TEG= 300
##$TL= (0..7)
0 120 120 120 120 120 120 120 
##$TP= (0..7)
150 150 150 150 150 150 150 150 
##$TP07= 0
##$TPNAME0= <>
##$TPNAME1= <>
##$TPNAME2= <>
##$TPNAME3= <>
##$TPNAME4= <>
##$TPNAME5= <>
##$TPNAME6= <>
##$TPNAME7= <>
##$TPOAL= (0..7)
0.5 0.5 0.5 0.5 0.5 0.5 0.5 0.5 
##$TPOFFS= (0..7)
0 0 0 0 0 0 0 0 
##$TUNHIN= 0
##$TUNHOUT= 0
##$TUNXOUT= 0
##$USERA1= <user>
##$USERA2= <user>
##$USERA3= <user>
##$USERA4= <user>
##$USERA5= <user>
##$V9= 5
##$VALIST= <valist>
##$VCLIST= <CCCCCCCCCCCCCCC>
##$VD= 0
##$VDLIST= <DDDDDDDDDDDDDDD>
##$VPLIST= <PPPPPPPPPPPPPPP>
##$VTLIST= <TTTTTTTTTTTTTTT>
##$WBST= 1024
##$WBSW= 4
##$XGAIN= (0..3)
0 0 0 0 
##$XL= 0
##$YL= 0
##$YMAX_a= 440236
##$YMIN_a= -537548
##$ZGOPTNS= <>
##$ZL1= 120
##$ZL2= 120
##$ZL3= 120
##$ZL4= 120
##$ABSF1= 16.522
##$ABSF2= -4.171173
##$ABSG= 5
##$ABSL= 3
##$ALPHA= 0
##$AQORDER= 0
##$ASSFAC= 0
##$ASSFACI= 0
##$ASSFACX= 0
##$ASSWID= 0
##$AUNMP= <proc_1d>
##$AZFE= 0.1
##$AZFW= 0.1
##$BCFW= 0
##$BC_mod= 0
##$BYTORDP= 0
##$COROFFS= 0
##$CY= 12.5
##$DATMOD= 1
##$DC= 0
##$DFILT= <>
##$DTYPP= 0
##$F1P= 14.0000005364418
##$F2P= -0.99999901652339
##$FCOR= 0.5
##$FTSIZE= 32768
##$FT_mod= 6
##$GAMMA= 0
##$GB= 0
##$INTBC= 1
##$INTSCL= 1
##$ISEN= 128
##$LB= 0.3
##$LEV0= 0
##$LPBIN= 0
##$MAXI= 10000
##$MC2= 0
##$MEAN= 0
##$ME_mod= 0
##$MI= 0
##$NCOEF= 0
##$NC_proc= -3
##$NLEV= 6
##$NOISF1= 0
##$NOISF2= 0
##$NSP= 0
##$NTH_PI= 0
##$NZP= 0
##$OFFSET= 16.522
##$PC= 1
##$PHC0= 227.1225
##$PHC1= 7.935421
##$PH_mod= 1
##$PKNL= yes
##$PPARMOD= 0
##$PSCAL= 4
##$PSIGN= 0
##$REVERSE= no
##$SF= 250.13
##$SI= 32768
##$SIGF1= 0
##$SIGF2= 0
##$SINO= 400
##$SIOLD= 32768
##$SREGLST= <1H.CDCl3>
##$SSB= 0
##$STSI= 32768
##$STSR= 0
##$SW_p= 5175.98343685301
##$SYMM= 0
##$S_DEV= 0
##$TDeff= 65536
##$TDoff= 0
##$TI= <Analysis number 999999
Compound Code 99
Book Reference 9
Project Code 9>
##$TILT= no
##$TM1= 0
##$TM2= 0
##$TOPLEV= 0
##$USERP1= <user>
##$USERP2= <user>
##$USERP3= <user>
##$USERP4= <user>
##$USERP5= <user>
##$WDW= 1
##$XDIM= 32768
##$YMAX_p= 327704024
##$YMIN_p= -105856
$$ End of Bruker specific parameters
$$ ---------------------------------
##NTUPLES= NMR SPECTRUM
##VAR_NAME=  FREQUENCY,     SPECTRUM/REAL,   SPECTRUM/IMAG
##SYMBOL=    X,             R,               I
##VAR_TYPE=  INDEPENDENT,   DEPENDENT,       DEPENDENT
##VAR_FORM=  AFFN,          ASDF,            ASDF
##VAR_DIM=   32768,         32768,           32768
##UNITS=     HZ,            ARBITRARY UNITS, ARBITRARY UNITS
##FACTOR=    0.157963299565203, 1,           1
##FIRST=     4132.6476996994, 0,             0
##LAST=      -1043.33573715361, 0,           0
##MIN=       -1043.33573715361, -105856,     0
##MAX=       4132.6476996994, 327704024,     0
$$ Real data points
##PAGE= N=1
##DATA TABLE= (X++(R..R)), XYDATA
$$ [...]
19921A208993m3047l0173m5565m4555m9189n2616n3051o5989m9289n9097n9041
$$ 1208993 1165946 1135773 1090208 1045653 996464 943848 890797 824808 775519 716422 657381
19910F57381m7067q364l83l0378j0357j9201m1911j9960j0307j7888j8728j2485
$$ 657381 610314 601950 601567 571189 560832 541631 499720 479760 469453 451565 432837 420352
19898D20352k1348J390L1083K882j4434l7766m5340j9248O258m625p690N412L1303
$$ 420352 399004 400394 431477 434359 419925 382159 336819 317571 323829 319204 311514 316926 348229
19885C48229O201j604j4470k3813Q63L245k936J0281k1521m0263m3898O682K8004
$$ 348229 354430 352826 338356 314543 315406 318651 315715 325996 304475 264212 220314 226996 255000
19872B55000J1643j7807j398P160J381m7037k1893p994K96m410j2055p915j6019
$$ 255000 266643 248836 247438 254598 255979 208942 187049 179055 179351 174941 162886 154971 138952
19859A38952k661J1381l104Q576K7749l505j5322j065l0770O407J3726l606J4288
$$ 138952 136291 147672 144568 153144 180893 177388 162066 161001 130231 136638 150364 146758 161046
19846A61046K0467j0400m884J3811J4264J9987R037m3316l5455K6152J1570J326
$$ 161046 181513 171113 166229 180040 194304 214291 223328 180012 144557 170709 182279 183605
19834A83605J955J8789K4000K944r109l148J482M344J0686j5226k9634l4731j3974
$$ 183605 185560 204349 228349 231293 222184 219036 220518 224862 235548 220322 190688 155957 141983
19821A41983j4561k3227J7499j4593j2701M091l1543k222K2832J2255j1229N355
$$ 141983 127422 104195 121694 107101 94400 98491 66948 64726 87558 99813 88584 93939
19809I3939N464Q072n565k795k3148l0496R020M236j3691N381M511K6545P326
$$ 93939 99403 107475 101910 99115 75967 45471 54491 58727 45036 50417 54928 81473 88799
19796H8799L203l0031k2179J4484R559k907Q577L236l8001j6859J3277K0453l657
$$ 88799 92002 61971 39792 54276 63835 60928 69505 72741 34740 17881 31158 51611 47954
19783D7954Q00J7400J5753j1584o270J0378K833M262o68j4314k880q812K7647
$$ 47954 48754 66154 81907 70323 64053 74431 77264 81526 80858 66544 63664 54852 82499
19770H2499J3993l3402k0962K564K3813j9495j345K789P637q014M927L3864j0606
$$ 82499 96492 63090 42128 44692 68505 49010 47665 50454 58091 50077 55004 88868 78262
19757G8262l1166J4373l915k3696J58K4877K6520J2786q922l2165K788j2583j7671
$$ 78262 47096 61469 57554 33858 34016 58893 85413 98199 89277 57112 59900 47317 29646
19744B9646l788j8598j8549m622n787K5827L872J4959o702J650J6339o911J5827
$$ 29646 25858 7260 -11289 -15911 -21698 4129 8001 22960 16258 17908 34247 27336 43163
19731D3163K3334l6722j1011J9720q181J3570j4201j7503l626Q008K6526J1201
$$ 43163 66497 29775 18764 38484 30303 43873 29672 12169 8543 16551 43077 54278
19719E4278J3174k6766j9974j3520n676N043M37L223P512K5436j5929K006J0432
$$ 54278 67452 40686 20712 7192 1516 6559 6996 10219 17731 43167 27238 29244 39676
19706C9676k359Q166R639J0817j3851j3024j3907r081j8164K5728K579j3730K892
$$ 39676 37317 45483 55122 65939 52088 39064 25157 16076 -2088 23640 26219 12489 15381
19693A5381J2119M543M367j5520r130J7218K8210J5335j7654L247j453M857J5783
$$ 15381 27500 32043 36410 20890 11760 28978 57188 72523 54869 58116 56663 61520 77303
19680G7303j1862J3034l101q625l1926j7233r670j1762r602o637R400J4681p501
$$ 77303 65441 78475 75374 66749 34823 17590 7920 -3842 -13444 -20081 -10681 4000 -3501
19667c501J484j8978J6226J7497L4856j5707k801N035j4134n4006j0532M8012
$$ -3501 -2017 -20995 -4769 12728 47584 31877 29076 34111 19977 -34029 -44561 3451
19655C451Q301N188K0356J2111R686L079k4030l6552j4211q288J7088k659O871
$$ 3451 11752 16940 37296 49407 59093 62172 38142 1590 -12621 -20909 -3821 -6480 391
19642C91j1974N665K2455J6499P431J9557j0114o985j7121M149k1062j4571Q147
$$ 391 -11583 -5918 16537 33036 40467 60024 49910 42925 25804 29953 8891 -5680 2467
19629B467j3597O88J6157j4894J3426L1784l4599j300N53k486k8064j7521K7620
$$ 2467 -11130 -10442 5715 -9179 4247 36031 1432 132 685 -1801 -29865 -47386 -19766
19616a9766K6283K1026q782l1371J4133m268j5257j331l3741J0216J5439J7981
$$ -19766 6517 27543 18761 -12610 1523 -2745 -18002 -19333 -53074 -42858 -27419 -9438
19604i438J1089j3438N233J703N675J4571J3790k2464k5136K608M4646j0700j3661
$$ -9438 1651 -11787 -6554 -4851 824 15395 29185 6721 -18415 -15807 28839 18139 4478
19591D478k4415K726K9651K269j1317m430K4971K573J700j2620L298j1024J9202
$$ 4478 -19937 -17211 12440 14709 3392 -1038 23933 26506 28206 15586 18884 7860 27062
19578B7062K4716K5576j4675k1328l6398J0586j2929j295J5561J3780o663j6586
$$ 27062 51778 77354 62679 41351 4953 15539 2610 1315 16876 30656 23993 7407
19566G407k712j608J6719p619K0371L1156j6874j9155l2448q524j5453M785O4696
$$ 7407 4695 3087 19806 12187 32558 63714 46840 27685 -4763 -13287 -28740 -23955 40741
19553D0741J4764k5278j0427o54J6425J4201m760j2153j7697J3420P388k0220
$$ 40741 55505 30227 19800 19146 35571 49772 45012 32859 15162 28582 35970 15750
19541A5750P30r170J547O70j9075J2002K4261K8659j4679l4910k7784O408M0620
$$ 15750 16480 7310 8857 9527 -9548 2454 26715 55374 40695 5785 -21999 -15591 25029
19528B5029j7782l220j8439J3772K8877j0216o140K0807j069p722j2669j2980
$$ 25029 7247 4027 -14412 -640 28237 18021 11881 32688 31619 23897 11228 -1752
19516a752j528J6865M5337L3946l5925o090J2053K1537j396j2587m091p293J4783
$$ -1752 -3280 13585 58922 92868 56943 50853 62906 84443 83047 70460 66369 59076 73859
19503G3859M5789O6507M8117L6099L4514K0689K835q680J7180K8456L3057j233
$$ 73859 119648 186155 234272 270371 304885 325574 328409 319729 336909 365365 398422 397189
19491C97189J7283J8308M6422K7668j2926q9118r8999p3934q5007n3978n903J0514
$$ 397189 414472 432780 479202 506870 493944 404826 305827 231893 146886 92908 87005 97519
19479I7519p710J5255K008j928J2195J0974J0481L686m0321k6198m25p958k0404
$$ 97519 89809 105064 107072 105144 117339 128313 138794 142480 102159 75961 75536 67578 47174
19466D7174k9294k2430m535J3733k3303L9390l099j2585Q598L6109K0140J3023
$$ 47174 17880 -4550 -9085 4648 -18655 20735 17636 5051 13649 49758 69898 82921
19454H2921N8712O8631O9406M3174J9640M163K3478J4585L4933L7989l5768o4200
$$ 82921 141633 210264 279670 322844 342484 346647 370125 384710 419643 457632 421864 357664
19442C57664r8101n7921K705j3674k767K3488N5458Q2793R6978R6546J3013p5349
$$ 357664 259563 201642 204347 190673 187906 211394 266852 349645 446623 543169 556182 480833
19430D80833j11540j15297p5117l6332j4490k7680j7559l6517l2696j1537P778
$$ 480833 369293 253996 178879 142547 128057 100377 82818 46301 13605 2068 9846
19419I846J1019k0207l0014J6758M059j2874j5718N543j6473M228K2029Q450J590
$$ 9846 20865 658 -29356 -12598 -8539 -21413 -37131 -31588 -48061 -43833 -21804 -13354 -11764
19406a1764Q762J5844O688k6849j0502J9754J8362J817p020Q645l250j8850j5738
$$ -11764 -3002 12842 19530 -7319 -17821 1933 20295 22112 15092 23737 20487 1637 -14101
19393a4101j2426K642j4341M2870J3165j839O412l2244n993J561L0528q414K665
$$ -14101 -26527 -23885 -38226 4644 17809 15970 22382 -9862 -15855 -14294 16234 7820 10485
19380A0485K310j910n1122k3754K8503K0192J8292J746J3415j7734O902K3139
$$ 10485 12795 10885 -40237 -63991 -35488 -15296 2996 4742 18157 423 7325 30464
19368C0464k1439k6622p479L362q988J5716J7175j0111N410L518J5168R526p613
$$ 30464 9025 -17597 -25076 -21714 -30702 -14986 2189 -7922 -2512 1006 16174 25700 18087
19355A8087k7319L587L2982J7082J0458N154j5747j3845k495k1006J544J3353
$$ 18087 -9232 -5645 27337 44419 54877 60031 44284 30439 27944 6938 8482 21835
19343B1835J149K897K2967J9723j2094p786m991L775k5523j2592M004p858q269
$$ 21835 22984 25881 48848 68571 56477 48691 43700 47475 21952 9360 13364 5506 -2763
19330b763L3973l326p574k0105j9965j2117J9741J4120K5776n061k1289j8629
$$ -2763 31210 27884 20310 205 -19760 -31877 -12136 1984 27760 22699 1410 -17219
19318a7219j6490l45L4823M0730r643j5594L178o26j3825J999p693q697n206J9693
$$ -17219 -33709 -34054 769 41499 31856 16262 19440 18814 4989 6988 -705 -9402 -14608 5085
19304E085O555j4310k1053J4479J0894J1138j014k2270n669j2577M277J4928J0225
$$ 5085 11640 -2670 -23723 -9244 1650 12788 11774 -10496 -16165 -28742 -24465 -9537 688
19291F88K5970L3509r518l9287k2436K4256J6403k4065k2254N581N920J1491P350
$$ 688 26658 60167 50649 11362 -11074 13182 29585 5520 -16734 -11153 -5233 6258 13608
19278A3608p922j4407o53J7645J7241p458q743j5588j5561L321j3933K4030K1727
$$ 13608 5686 -8721 -9374 8271 25512 18054 9311 -6277 -21838 -18517 -32450 -8420 13307
19265A3307K3381J0809k5544l5942J1221k731q665l6622N247J3351L5553r16j0611
$$ 13307 36688 47497 21953 -13989 -2768 -5499 -14164 -50786 -45539 -32188 3365 2449 -8162
19252h162j6029p005O722M09j7582K0560J6267J1874r93J4994N376k025k3630
$$ -8162 -24191 -31196 -24474 -24065 -41647 -21087 -4820 7054 6061 21055 26431 24406 776
19239G76Q525j8848j7520K2954K0388j0944r756j4575M824J0225J6476q509N354
$$ 776 9301 -9547 -27067 -4113 16275 5331 -4425 -19000 -14176 -3951 12525 4016 9370
19226I370R961j5726k1386R969R070J4983r317j8305k8984Q217q148J7561J7683
$$ 9370 19331 3605 -17781 -7812 1258 16241 6924 -11381 -40365 -32148 -40296 -22735 -5052
19213e052K1597j7375K674K6093L1370m697P81j8737j4277r960M222k364j5607
$$ -5052 16545 -830 1844 27937 59307 54610 55391 36654 22377 12417 16639 14275 -1332
19200a332N32N785l0203K140L3624L9116l705k453j7248k5725o669l270J184J9690
$$ -1332 -800 4985 -25218 -23078 10546 49662 45957 43504 26256 531 -6138 -9408 -8224 11466
19186A1466J1710k2782l667N181L889J8996j8146j8217j8923J6994O642j517j7265
$$ 11466 23176 394 -3273 1908 5797 24793 6647 -11570 -30493 -13499 -6857 -8374 -25639
19173b5639P200o688J315k858K3246L038k0617K6999K2692n218k4248P167p310
$$ -25639 -18439 -25127 -23812 -26670 -3424 -386 -21003 5996 28688 23470 -778 6389 -921
19160i21J8060J363j2314k4585l308J2726l129k3182J288m436J0424l686q8j9457
$$ -921 17139 18502 6188 -18397 -21705 -8979 -12108 -35290 -34002 -38438 -28014 -31700 -31788 -51245
19146e1245J5801m974p455J9040K0006J0612K900P358l1513J2962k9258j7715
$$ -51245 -35444 -40418 -47873 -28833 -8827 1785 4685 12043 -19470 -6508 -35766 -53481
19134e3481J0418M5753O981m2092o917K7827J1660j6872m079J3004K9328n245
$$ -53481 -43063 2690 9671 -32421 -39338 -11511 149 -16723 -20802 -7798 21530 16285
19122A6285l0246l2823J4017K9445P599k1041n223R738q599j5908K4050J5811
$$ 16285 -13961 -46784 -32767 -3322 4277 -16764 -21987 -12249 -20848 -36756 -12706 3105
19110C105N363l622J8155q881j5419K1182J9720P427l6215j7068K8533K5923j9375
$$ 3105 8468 4846 23001 14120 -1299 19883 39603 47030 10815 -6253 22280 48203 28828
19097B8828l2546J0254J1328m979J3677k2688j6363K2732J2008o341r036o731
$$ 28828 -3718 6536 17864 12885 26562 3874 -12489 10243 22251 15910 6874 143
19085A43j2501n811r9J6200k806M352K0204J2858J8689l26k941k9679j2237L703
$$ 143 -12358 -18169 -18268 -2068 -4874 -522 19682 32540 51229 50903 47962 18283 6046 9749
19071I749O926k874J9423O191K559n161R780P728J0466q489l8727L200N287K0338
$$ 9749 16675 13801 33224 39415 41974 36813 46593 54321 64787 56298 17571 20771 26058 46396
19057D6396L7102K6795M2449P0862N1935N0849O3150K9982K6403j5389m8025n5243
$$ 46396 83498 110293 152742 223604 275539 326388 389538 419520 445923 430534 382509 327266
19045C27266j2333l2702l6453L206L4444M2112K6156K5146L3153K0198l9104j1666
$$ 327266 314933 282231 245778 248984 283428 325540 351696 376842 409995 430193 391089 379423
19033C79423N709l0478l6433k0261j8437l4380k8196l1082m1517m9361l1406L738
$$ 379423 385132 354654 318221 297960 279523 245143 216947 185865 144348 94987 63581 67319
19021F7319K1106K373k9277j9194K479J6806K6302M029R048Q734k7967j4788L1902
$$ 67319 88425 90798 61521 42327 44806 61612 87914 91943 100991 109725 81758 66970 98872
19008I8872L2004J2580j4753l1082j149j8870k6425j8606M0129O5451O7370O6066
$$ 98872 130876 143456 128703 97621 96472 77602 51177 32571 72700 138151 205521 271587
18996B71587N7554P6989P0380K7497l2854n9165k9581j2662k8689l6043j5446
$$ 271587 329141 406130 476510 504007 471153 411988 382407 369745 341056 305013 289567
18985B89567N511m693j8595K8491j6486n4892k5310o470n6428k4497J847k9158
$$ 289567 295078 290385 271790 300281 283795 228903 203593 197123 140695 116198 118045 88887
18973H8887p940j0272l832O230N362J212n973j7289j0852o936j0813K086J224
$$ 88887 80947 70675 66843 73073 78435 79647 73674 56385 45533 38597 27784 29870 31094
18960C1094K4506K792l0649m3195o782O504J6303p942L532j1817m686O201J0816
$$ 31094 55600 58392 27743 -15452 -22234 -15730 573 -7369 -3837 -15654 -20340 -14139 -3323
18947c323K2817N716r596P536J5274o047j9034o120J1724q691j9618K2844j2142
$$ -3323 19494 25210 15614 23150 38424 32377 13343 7223 18947 10256 -9362 13482 1340
18934A340j3382R154J3699J3246J7928j9277j0895o641o464R452J659r902m446
$$ 1340 -12042 -2888 10811 24057 41985 22708 11813 5172 -1292 8160 9819 -83 -4529
18921d529j0402k7891O969M771j659J2321K1150P279k953j6039o009M468P943
$$ -4529 -14931 -42822 -35853 -31082 -32741 -20420 730 8009 5056 -10983 -16992 -12524 -4581
18908d581j0112j6648J5045K0657r06o241J7610r738L354J6944q075j5292P925
$$ -4581 -14693 -31341 -16296 4361 3455 -2786 14824 5086 8440 25384 17309 2017 9942
18895I942N45L445k135k901j2125j7276K678K3551J1741p173p418j0392j4563
$$ 9942 10487 13932 11797 8896 -3229 -20505 -17827 5724 17465 10292 2874 -7518 -22081
18882b2081J1712J8181l0722P58o907O509M3833L6596j3546j0547R77P865j3350
$$ -22081 -10369 7812 -22910 -22152 -29059 -22550 21283 57879 44333 33786 34763 42628 29278
18869B9278j7015k3284n476N236Q189o99k4875n00M5810L709J216N821j5473j0407
$$ 29278 12263 -11021 -16497 -11261 -3072 -3771 -28646 -29146 16664 20373 21589 27410 11937 1530
18855A530l393R99J8677J0457j9090J6735k5791l5496q119J0695J2609K6989K339
$$ 1530 -1863 -864 17813 28270 9180 25915 124 -35372 -43491 -32796 -20187 6802 9141
18842I141q848l998L7471M4031j641k0851j0350j9868j3947o179j7745o998M6426
$$ 9141 293 -3705 33766 77797 76156 55305 44955 25087 11140 4961 -12784 -19782 26644
18829B6644R458j7101k5932J696O45k292n111r080n010J9258P947J4134J7115
$$ 26644 36102 19001 -6931 -5235 -4590 -6882 -11993 -21073 -26083 -6825 1122 15256 32371
18816C2371J4519j5206l3952K621O571K4259J8949n054r099m0212r1L1762O013
$$ 32371 46890 31684 -2268 353 6924 31183 50132 45078 35979 -4233 -4324 27438 33451
18803C3451k7581K587J7629N570J8874m273q190J2831M1876L2658K2229k3124
$$ 33451 5870 8457 26086 31656 50530 46257 38067 50898 92774 125432 147661 124537
18791A24537k8270l2757n519m74n036O133R588J4977m1097r771J0542N762Q151
$$ 124537 96267 63510 57991 57517 52481 58614 68202 83179 42082 32311 42853 48615 56766
18778E6766l5900k2905R804p077J0868N063J8964J5147J5424M3408R8967J24869
$$ 56766 20866 -2039 7765 688 11556 16619 35583 50730 66154 109562 208529 333398
18766C33398P9723n6341j42533q4108m1265k7779n380J1851O509O719j5449k2637
$$ 333398 413121 356780 214247 130139 88874 61095 55715 67566 74075 80794 65345 42708
18754D2708j5202K9337o248l7337J3826l48P622O868Q663N196K8499K3988n77
$$ 42708 27506 56843 50595 13258 27084 26736 34358 41226 49889 55085 83584 107572 106995
18741A06995r860L690J734k281j8913k0496j9806j2687j082J166M95j3082j607
$$ 106995 97135 100825 102559 100278 81365 60869 41063 28376 27294 28460 28955 15873 14266
18728A4266M714k7195J3860J6256O82l09o395O195N204P116J9307J9388J7089
$$ 14266 18980 -8215 5645 21901 22583 22274 15879 22074 27278 34394 53701 73089 90178
18715I0178J0039N951j8416l5072J1102Q381k3802L0395j3874j2753j1297J5638
$$ 90178 100217 106168 87752 52680 63782 72163 48361 78756 64882 52129 40832 56470
18703E6470P064K475J499J2099J8980j0560j7765Q216j3942k8688Q24j297p398
$$ 56470 63534 66009 67508 79607 98587 88027 70262 78478 64536 35848 36672 35375 27977
18690B7977K6183J3167n23q0j2166j3179K657J6070J3352J2521k920J998O58j834
$$ 27977 54160 67327 66804 66724 54558 41379 44036 60106 73458 85979 83059 85057 85715 83881
18676H3881l405k0518J1534M1509J9100l649J2723K8614J9201j3259p617M13j1135
$$ 83881 80476 59958 71492 113001 132101 128452 141175 169789 188990 175731 168114 168527 157392
18663A57392l4962o365n249l549j62l16N880J371M394k588Q89k5319P648m126
$$ 157392 122430 116065 110816 107267 107105 106789 112669 114040 118434 115846 116735 91416 99064 94938
18649I4938o280K0643J6626Q078L0546K9306n563j2589j0606K433N469P709J2085
$$ 94938 88658 109301 125927 134005 164551 193857 188294 175705 165099 167532 173001 180710 192795
18636A92795L3258J2273p490k5844j7754j006O017L649J3436k186j8362p067J6532
$$ 192795 226053 238326 230836 204992 187238 186232 192249 195898 209334 207148 188786 181719 198251
18623A98251K3372j7392l193O644J2632J1048R423M494K084M4585L4954J8872
$$ 198251 221623 204231 201038 207682 220314 231362 240785 245279 247363 291948 326902 345774
18611C45774r036o534m1723n3611j0829K575J9146K4166J9492J1713L1184K9994
$$ 345774 336738 330204 288481 234870 224041 226616 245762 269928 289420 301133 332317 362311
18599C62311k2459L0508M9231M346J9638k7071p5093j8138J3260J2869K1231q80
$$ 362311 339852 370360 419591 423937 443575 416504 341411 323273 336533 349402 370633 369753
18587C69753K3921L7147O1009N1816O0390P6933N1196K8110J6546J114L3235O0018
$$ 369753 393674 430821 491830 543646 604036 680969 732165 760275 776821 777935 811170 871188
18575H71188M5127R0554J15253J34223J90016K62133L16738K75410J37935J68592
$$ 871188 916315 1006869 1122122 1256345 1446361 1708494 2025232 2300642 2438577 2607169
18565B607169K29107J40930J79015L51769M58248O72296J093183J714510K377986
$$ 2607169 2836276 2977206 3156221 3507990 3966238 4638534 5731717 7446227 9824213
18556I824213K364295J997004K368965K014187K9463n90975K92626J040016K652663
$$ 9824213 12188508 14185512 16554477 18568664 18598127 18007152 18299778 19339794 21992457
18547B1992457O437295J2389366J7722515J6883480J6719244K2874345J4478889
$$ 21992457 28429752 40819118 58541633 75425113 92144357 115018702 129497591
18540A29497591n208792o347858m346515j6378562k1076645j4576376j0140525
$$ 129497591 124288799 117940941 113594426 97215864 76139219 61562843 51422318
18533E1422318p423247l482271r82076O09572K096323l12479m490390n145643
$$ 51422318 43999071 40516800 39534724 40144296 42240619 41928140 37437750 32292107
18525C2292107m819139n541658n179022l710669k437807j544421r71338n95310
$$ 32292107 27472968 21931310 16752288 13041619 10603812 9059391 8088053 7492743
18517G492743m04794k71877j19959k4493q7922j14130j3117J39114K92108N22425
$$ 7492743 7087949 6816072 6696113 6671620 6583698 6469568 6456451 6595565 6887673 7410098
18507G410098Q98715J478629K429540L855240N145500N039603M560705N202535
$$ 7410098 8308813 9787442 12216982 16072222 21217722 26257325 30818030 36020565
18499C6020565L388402r39313j737371J47923J790324M688636P572946J0326794
$$ 36020565 39408967 38469654 36732283 36880206 38670530 43359166 50932112 61258906
18491F1258906J6953462J9506384Q953961M074435Q965369k053599j9115332j7946351
$$ 61258906 78212368 97718752 106672713 110747148 119712517 117658918 98543586 80597235
18483H0597235j4091202j6601090j4769309r076680m407202j789719q70900j59358
$$ 80597235 66506033 49904943 35135634 26058954 21651752 19862033 18991133 18831775
18475A8831775N04974p01538k196008k056283j988226k344986k152202j479556
$$ 18831775 19336749 18635211 16439203 14382920 12394694 10049708 7897506 6417950
18467F417950r21286o38683n16024l68248k60444k68107k49806k07095j76619
$$ 6417950 5496664 4857981 4341957 3973709 3713265 3445158 3195352 2988257 2811638
18458B811638j80417j84561j69677j15974q8232k5009o3653j03069m7570j4663
$$ 2811638 2631221 2446660 2276983 2161009 2072777 2047768 1984115 1881046 1833476 1818813
18448A818813p2801j73969j65722j26397r0950j20958r6629r8208p8810k9189
$$ 1818813 1746012 1572043 1406321 1279924 1188974 1068016 971387 873179 794369 765180
18438G65180l7068m7927m0689m2942l1283L278M55k3801l0623k5607r459j0170
$$ 765180 728112 680185 639496 596554 565271 568549 569004 545203 514580 488973 479514 469344
18426D69344k6773p892j4957n045L9375J5633m7566j4786K9303K2377L1534q248
$$ 469344 442571 434679 419722 414677 454052 469685 422119 407333 436636 459013 490547 482299
18414D82299j2396N894P221J1463J0395j4742L0055K8623K0743k2346L6341L2142
$$ 482299 469903 475797 483018 494481 504876 490134 520189 548812 569555 547209 583550 615692
18402F15692l9981o1257j9252n034l3318k5248o0181p2180k7320j2060p612J0557
$$ 615692 575711 514454 495202 490168 456850 431602 371421 299241 271921 259861 252249 262806
18390B62806k6608l0320o941r680k3368k8986K7843P906J0766J6222j0303j5992
$$ 262806 236198 205878 198937 189257 165889 136903 164746 172652 183418 199640 189337 173345
18378A73345j4916q249r31p856m857K806L3606J5271l3901o250J7274N352J44
$$ 173345 158429 150180 149249 141393 136536 139342 172948 188219 154318 148068 165342 170694 170838
18365A70838L5305R935L839m65l0906m817q093L858j2345l187o590m0684l1239
$$ 170838 206143 216078 219917 219452 188546 183729 175636 179494 167149 163962 157372 116688 85449
18352H5449O189L8133j3207k55J4995r719j1733J2856J2585j2036m373J2130J0952
$$ 85449 91638 129771 116564 116309 131304 121585 109852 122708 135293 123257 118884 131014 141966
18339A41966o551l3923R560j674J4975K1468J439J212j4499k1090l430k001l4326
$$ 141966 135415 101492 111052 109378 124353 145821 147260 148472 133973 112883 109453 107452 73126
18326G3126r428j1454R063q183K8288j089J9776J9163K3500n310m1085k6707k94
$$ 73126 63698 52244 61307 53124 81412 80323 100099 119262 142762 137452 96367 69660 69366
18313F9366K5414J4780J2176k6906o759L0221p922L2J2972M348o161k2916k1367
$$ 69366 94780 109560 121736 94830 88071 118292 110370 110402 123374 127722 121561 98645 77278
18300G7278P572J3731j128o66L553K2821J27o737K1106N994J6816J0015k0959
$$ 77278 84850 98581 97453 96787 100340 123161 123288 116551 137657 143651 160467 170482 149523
18287A49523l416q141j2220j5261K2289j940q618j6783M829J8748p600j6807j5848
$$ 149523 146107 137966 125746 110485 132774 130834 122216 105433 110262 129010 121410 104603 88755
18274H8755o965J8333M007j4665l157n71j5183J5541K2265K1311J8291R752J597
$$ 88755 81790 100123 104130 89465 86308 85737 70554 86095 108360 129671 147962 157714 159311
18261A59311j8394j0320J1839M645l6900o53k7856k5445J7106L4399l418j9902
$$ 159311 140917 130597 142436 147081 110181 109528 81672 56227 73333 107732 104314 84412
18249H4412p129m98J0224O374j4859j3631j7074K8223Q55j3829K751j202M2146
$$ 84412 77283 76785 87009 93383 78524 64893 47819 76042 76897 63068 65819 64617 106763
18236A06763J0785P439L7417m1358j6208l890L424m879j34j4349J2048j3513j572
$$ 106763 117548 124987 162404 121046 104838 100948 104372 99493 99359 85010 97058 83545 81973
18223H1973J4044J851j3188J3697l991k1293j1449p887j7124K2545K9567m513
$$ 81973 96017 97868 84680 98377 94386 73093 61644 53757 36633 59178 88745 84232
18211H4232P039j1966K6356P488k9073k1505j2736K2468j3570m203K4940J159
$$ 84232 91271 79305 105661 113149 84076 62571 49835 72303 58733 54530 79470 80629
18199H0629l168j4131m757j8913L1680K0791j8818k7851K0335m429K6j5132K2313
$$ 80629 77461 63330 58573 39660 71340 92131 73313 45462 65797 61368 61394 46262 68575
18186F8575L2150L0785q90k8731l0030J2136J6033R899N492K1600L254q089J8344
$$ 68575 100725 131510 130620 101889 71859 83995 100028 109927 115419 137019 140273 132184 150528
18173A50528O86n787l819m4652j7844J973N115J1544K0880R001l363k6736k7059
$$ 150528 151214 145427 141608 96956 79112 81085 86200 97744 118624 127625 124262 97526 70467
18160G0467k1111O433K8890L9133j7657q560Q566j0889l3933O122N575L5139Q430
$$ 70467 49356 55789 84679 123812 106155 97595 106161 95272 61339 67461 73036 108175 116605
18147A16605J6798M1093J4918l1347k0727K8607L8384J3317K5377L0835j2096
$$ 116605 133403 174496 189414 158067 137340 165947 204331 217648 243025 273860 261764
18136B61764n400J5059N3579L2019n403j4245j1284J2176M4269M7613O3366L2044
$$ 261764 256364 271423 325002 357021 351618 337373 326089 338265 382534 430147 493513 525557
18124E25557M0818N8408R4851J55088J57210J97839K52292L47043M97330O94103
$$ 525557 566375 624783 719634 874722 1031932 1229771 1482063 1829106 2326436 3020539
18114C020539J013449J662865L032389O073264J2702373K2574539J9996679j0003732
$$ 3020539 4033988 5696853 8729242 14802506 27504879 50079418 70076097 60072365
18106F0072365k4495911j5980235p680491l881073k258887j432599r20894o33920
$$ 60072365 35576454 19596219 11915728 8034655 5775768 4343169 3422275 2788355
18098B788355m35901l10813j98170j62972j76766j56694j46248j70158j14954
$$ 2788355 2352454 2041641 1843471 1680499 1503733 1347039 1200791 1030633 915679
18089I15679j02014o9771n5980p2951n3129m5003n5798k4245j1163n422o438j8702
$$ 915679 813665 743894 687914 614963 561834 516831 461033 436788 425625 420203 413765 395063
18077C95063Q057j0868j9913n132M877l307N002K3594K3171r826K3062K6761K8074
$$ 395063 403120 392252 372339 367207 372084 368777 373779 397373 420544 410718 433780 460541 488615
18064D88615K0227L015K6367L9656L6726K8800j053M8937R7850P7453O7494P0429
$$ 488615 508842 511857 538224 577880 614606 643406 642353 691290 789140 866593 934087 1004516
18052A004516J26903K18780K68703L70636N26553O75290Q73419R89621J309402
$$ 1004516 1131419 1350199 1618902 1989538 2516091 3191381 4064800 5054421 6363823
18043F363823K199169L947295P280218J3702473K2037161J8773527n641715k2244395
$$ 6363823 8562992 12510287 19790505 33492978 55530139 74303666 68661951 46417556
18035D6417556j8254510j0075073n438068l133235j892036j186965p56693m17334
$$ 46417556 28163046 18087973 12649905 9516670 7624634 6437669 5680976 5263642
18027E263642k56471l37976l72225k83542r8939N4458R0882J13894K96508N75592
$$ 5263642 5007171 4669195 4296970 4013428 3914489 3968947 4059829 4173723 4470231 5045823
18017E045823R15376J337341J670608J964721K853105N052534R192292J7159016
$$ 5045823 5961199 7298540 8969148 10933869 13786974 18839508 28031800 45190816
18009D5190816L1379506M4103780K4044636k4694006m3242595l0269612j6404212
$$ 45190816 76570322 120674102 144718738 120024732 76782137 46512525 30108313
18002C0108313r133758n416334l339379k137127j323633p78966o23540p74370
$$ 30108313 20974555 15558221 12218842 10081715 8758082 7979116 7355576 6581206
17994F581206p54798m63107k25724j15130j52194k71488j56170Q0416L00430M98162
$$ 6581206 5826408 5363301 5137577 5022447 4870253 4598765 4442595 4523011 4823441 5321603
17984E321603O75151Q89310J507580K802571N219457R935139J7816395K1696458
$$ 5321603 5996754 6886064 8393644 11196215 16415672 26350811 44167206 65863664
17976F5863664N178562j7761652k0675431j2534829o642826l816122k352340j489840
$$ 65863664 71042226 53280574 32605143 20070314 13427488 9611366 7259026 5769186
17968E769186r74364o04822l80218l45393m62153m03106k95439j69153j36425
$$ 5769186 4794822 4190000 3809782 3464389 3002236 2599130 2303691 2134538 1998113
17959A998113k01806k88150k07001j50109j34201j14358r3664o1804m6723p6812
$$ 1998113 1796307 1508157 1301156 1151047 1016846 902488 808824 747020 700297 623485
17949F23485o3529j7892R857k9779n0659o8610l4151p999k4522Q63K5121r462
$$ 623485 559956 542064 551921 522142 471483 402873 368722 360723 336201 337064 362185 352723
17937C52723k3874k3001k1688J2553R726p001q15p884l627J0938P713R840q962
$$ 352723 328849 305848 284160 296713 306439 299438 298623 290739 287112 298050 305763 315603 306641
17924C06641n5032m2330j0233p378j5038j6645k164K2179K5631N889j8770j457
$$ 306641 251609 209279 199046 191668 176630 159985 157821 180000 205631 211520 192750 191293
17912A91293l032J1206n807n6836k3138L3800J4864J6300j5864r530m746Q073
$$ 191293 188261 199467 193660 136824 113686 147486 162350 178650 162786 153256 148510 156583
17900A56583j2418q011J0326K4387N532k0842l9817j9388J3310j6397n797j4692
$$ 156583 144165 136154 146480 170867 176399 155557 115740 96352 109662 93265 87468 72776
17888G2776K2017J9561o523K550j1506q443K9389J5806M488j5029k4361j7826
$$ 72776 94793 114354 107831 110381 98875 90432 119821 135627 140115 125086 100725 82899
17876H2899K2826j220j769O134K4090L56k7376j3800J4931k2014j421J5836j4913
$$ 82899 105725 104505 102736 108870 132960 133316 105940 92140 107071 85057 83636 99472 84559
17863H4559r25j0371N043J417J2463N076k0710k1901M384j2396j9114O725M492
$$ 84559 83634 73263 78306 79723 92186 97262 76552 54651 59035 46639 27525 34250 38742
17850C8742j084K7164L126l767J9011M515J2808k97k5966p797n044m765j0514
$$ 38742 37658 64822 67948 64181 83192 87707 100515 100218 74252 66455 61411 56646 46132
17837D6132k259J9884p799P664J6818k4789R808j6185k4766j318J9826J6803j3880
$$ 46132 43873 63757 55958 63622 80440 55651 65459 49274 24508 23190 43016 59819 45939
17824D5939j8957j616j025J3969J1264m642Q097k919q783k7794q395K2728N112
$$ 45939 26982 25366 24341 38310 49574 44932 53029 50110 41327 13533 5138 27866 32978
17811C2978P097p533j5985k0611j5179K9297J8333K0155j8194J4116J2886j453
$$ 32978 40075 32542 16557 -4054 -19233 10064 28397 48552 30358 44474 57360 55907
17799E5907J2795j3780n669J5071M09J326j5117l0509L663K1280M933o507l22
$$ 55907 68702 54922 49253 64324 64733 66059 50942 20433 24096 45376 50309 43802 43480
17786D3480j0909p838l3431o484J884K294K2109K7740K5946J6992o620j2763k847
$$ 43480 32571 24733 -8698 -15182 -13298 -11004 11105 38845 64791 81783 75163 62400 59553
17773E9553n071m627j7730L235l194j6045k8366N687j008O923J3937R69Q192K691
$$ 59553 54482 49855 32125 35360 32166 16121 -12245 -6558 -7566 -643 13294 14263 22455 25146
17759B5146R834K6752M1146R402o804o299j9644j3012j1431k631o620m9187o366
$$ 25146 34980 61732 102878 112280 105476 99177 79533 66521 55090 52459 45839 -3348 -9714
17746i714K1610J3544j5646L92K6227j5968q140j837Q738J5414M436o430m181
$$ -9714 11896 25440 9794 10186 36413 20445 12305 10468 19206 34620 39056 32626 28445
17733B8445j717L3193K440l5399q378j2057k5073J4204K0820K1163J4127K078
$$ 28445 26728 59921 62361 26962 18584 6527 -18546 -4342 16478 37641 51768 53846
17721E3846m8976l4226J0123K9674L2005M221n315l4376l1422J0942o02l096m954
$$ 53846 4870 -29356 -19233 10441 42446 46667 41352 6976 -24446 -13504 -14106 -17202 -22156
17708b2156M466K560M899q160J5743K1629P928j0776K1746N18j1324J0532J7948
$$ -22156 -17690 -15130 -10231 -18391 -2648 18981 26909 16133 37879 38397 27073 37605 55553
17695E5553J7335Q77n441M249K414o88j0000j6986J904J7643k0988j9879J1317
$$ 55553 72888 73765 68324 72573 74987 74299 64299 47313 49217 66860 45872 25993 37310
17682C7310j1085N061J768L772o062r031j0044j5989J4240K9554Q456O363k5926
$$ 37310 26225 31286 33054 36826 30764 21733 11689 -4300 9940 39494 47950 54313 28387
17669B8387k4423j1341j2040K506r75p127M81M2189R112k7986k337r253M930K9076
$$ 28387 3964 -7377 -19417 -16911 -17886 -25013 -24532 17657 26769 -1217 -3554 -12807 -7877 21199
17655B1199R268p709j2331k158j6992n884J4487J631J2146P108m3804m472K3027
$$ 21199 30467 22758 10427 8269 -8723 -14607 -120 1511 13657 20765 -23039 -27511 -4484
17642d484K739Q779j3173j7499J8730K1823k64J0858J1540j825J5088J0935p725
$$ -4484 -1745 7034 -6139 -23638 -4908 16915 16651 27509 39049 37224 52312 63247 55522
17629E5522q246m4181q601P524O776L5124J4898n1346j6301J302K540k470K3385
$$ 55522 47276 3095 -5506 2018 8794 43918 58816 7470 -8831 -7529 -4989 -7459 15926
17616A5926j1726k7813J2622K4969j231j860n000q626J764J7982J0729L235J0690
$$ 15926 4200 -23613 -10991 13978 12747 10887 5887 -2739 -975 17007 27736 30971 41661
17603D1661M178o216R839K7049j001l2658J228J601N668l9770l078K8249J2444
$$ 41661 45839 39623 49462 76511 75510 42852 44080 45681 51349 11579 8501 36750 49194
17590D9194k775m0572n918N706q003Q615K5965K7056k5453k3652K898j5625o160
$$ 49194 46419 5847 -71 5635 -2368 6247 32212 59268 33815 10163 13061 -2564 -8724
17577h724J9864Q711J9581P445j8393l3433n151K5614p420k5737K309r345M515
$$ -8724 11140 19851 39432 46877 28484 -4949 -10100 15514 8094 -17643 -15334 -24679 -20164
17564b0164M826o10j446L2013J5323K1957l773l320j7640p315K0197R161K1575
$$ -20164 -15338 -15948 -17394 14619 29942 51899 48126 44806 27166 19851 40048 49209 70784
17551G0784j9841p884m6186j1674P774J328j9730j9297p59L2241M6674K0538l6764
$$ 70784 50943 43059 -3127 -14801 -7027 -5699 -25429 -44726 -45485 -13244 33430 53968 17204
17538A7204m3853O012K0177p354j4044K253K2232j836Q630L5j0926L599j9325
$$ 17204 -26649 -20637 -460 -7814 -21858 -19605 2627 791 9421 9456 -1470 2129 -17196
17525a7196j1906j38J3488J803J0794p205q077j5023M649P390j8735K190K2759
$$ -17196 -29102 -29240 -15752 -13949 -3155 -10360 -18437 -33460 -28811 -21421 -40156 -37966 -15207
17512a5207J1293J4632Q915k8399J7659O258L3962J9444L3178O7326M2074P8771
$$ -15207 -3914 10718 19633 -8766 8893 15151 49113 68557 101735 169061 211135 289906
17500B89906J1988o1806q8215n4035m5624M096J278j750l574j4595r188K1041
$$ 289906 301894 240088 151873 97838 52214 56310 57588 55838 52264 37669 28481 49522
17488D9522o290j7364R118o260l0315k1856J9372L8545J6731k3202K843J2450
$$ 49522 43232 25868 34986 28726 -1589 -23445 -4073 34472 51203 28001 30844 43294
17476D3294m238L8378N5839P3716J15910J70170J69630j2703j64383j60621j14205
$$ 43294 39056 77434 133273 206989 322899 493069 662699 649996 485613 324992 210787
17465B10787n7791k5686j6496j5992j5922l3462K3318M736k310Q317r526j51k3730
$$ 210787 152996 127310 110814 94822 78900 45438 68756 73492 71182 79499 69973 69822 46092
17452D6092l4164K458K9514R049P761J9658K5678K4141N1663J28629J75148Q0170
$$ 46092 11928 14386 43900 52949 60710 80368 106046 130187 181850 310479 485627 565797
17440E65797j6436p1699r1787j31277j19070o7241j09j0056J048k751k2110j8317
$$ 565797 549361 477662 385875 254598 135528 68287 68178 58122 59170 56419 34309 15992
17428A5992J061K6923L837K927Q247k2488j9666M118l42J6350j1786n730J1190
$$ 15992 17053 43976 47813 50740 58987 36499 16833 20951 20609 36959 25173 19443 30633
17415C0633p40j4800j3752j7046k790K4133M133L669K2588j8584l6434J2486J4173
$$ 30633 29893 15093 1341 -15705 -18495 5638 9771 13440 36028 17444 -18990 -6504 7669
17402G669J7486L152j1290k5081k2029J4895J1249J5462J13o213j8182m28O03
$$ 7669 25155 28307 17017 -8064 -30093 -15198 -3949 11513 11626 5413 -12769 -13197 -12594
17389a2594j6122M90Q051J7411K0946k0481m694J4546L867K252J7195k5060k3271
$$ -12594 -28716 -28226 -20175 -2764 18182 -2299 -6993 7553 11420 13672 30867 5807 -17464
17376a7464J9143j0324J5185M99J6629j2647k2819r413j3960K3298J0322j0894
$$ -17464 1679 -8645 6540 7039 23668 11021 -11798 -21211 -35171 -11873 -1551 -12445
17364a2445K3493J9056J8129k5183k553j8240j6330j5929J5390J6835j8731k518
$$ -12445 11048 30104 48233 23050 20497 2257 -14073 -30002 -14612 2223 -16508 -19026
17352a9026K7699l6378j8790L12j6596l280r711K0227L0929J3798j2871J2202
$$ -19026 8673 -27705 -46495 -46183 -62779 -66059 -75770 -55543 -24614 -10816 -23687 -11485
17340a1485J4758l1904r478M4251J3757k3934j7094J6591K0262j8286m478L038
$$ -11485 3273 -28631 -38109 6142 19899 -4035 -21129 -4538 15724 -2562 -7040 -4002
17328d002j3087k8110J2630N380q423m36J6298L312J3023J8481k5385j6924j6534
$$ -4002 -17089 -45199 -32569 -27189 -35612 -36048 -19750 -16438 -3415 15066 -10319 -27243 -43777
17315d3777J8142R460j8544o858j4K2409J2728J816r959j2535j3816j7326J3037
$$ -43777 -25635 -16175 -34719 -41577 -41591 -19182 -6454 -4638 -14597 -27132 -40948 -58274 -45237
17302d5237L2310j8337j4305j2821K2290J8296m734J1629R170K4197o089p372
$$ -45237 -12927 -31264 -45569 -58390 -36100 -17804 -22538 -10909 -1739 22458 16369 8997
17290H997R346j9359m676l671J0913q337K340J415J1821J5236q823l856l3727
$$ 8997 18343 -1016 -5692 -9363 1550 -6787 -4447 -3032 8789 24025 15202 11346 -22381
17277b2381k2454K463K5963J3074J7177k4491k7088M870J3306L930k1031j2549
$$ -22381 -44835 -42372 -16409 -3335 13842 -10649 -37737 -32867 -19561 -15631 -36662 -49211
17265d9211j1076j6077J8695J8957K8660j9419k7476J0619J7275l247P879J6112
$$ -49211 -60287 -76364 -57669 -38712 -10052 -29471 -56947 -46328 -29053 -32300 -24421 -8309
17253h309n450J8362J0554l326K148J6147k9929j7762j2375J0681m89l6449o439
$$ -8309 -13759 4603 15157 11831 13979 30126 197 -17565 -29940 -19259 -19748 -56197 -62636
17240f2636K4840K5230O484N138R211R997j7431j1116j2359K4137P196k4469o288
$$ -62636 -37796 -12566 -6082 -944 8267 18264 833 -10283 -22642 1495 8691 -15778 -22066
17227b2066l007m983N484J3071j363l50K875j6648r213K1325L4010k787j2090
$$ -22066 -25073 -30056 -24572 -11501 -12864 -13214 -10339 -26987 -36200 -14875 19135 16348 4258
17214D258M257J8253J1928j1802Q945N951k9131k4003p003J7148R719j3983k801
$$ 4258 8515 26768 38696 26894 35839 41790 12659 -11344 -18347 -1199 8520 -5463 -8264
17201h264P640J3580k5439j3925N611J137J072j1693j3611J9165R515P008N811
$$ -8264 -624 12956 -12483 -26408 -20797 -19660 -18588 -30281 -43892 -24727 -15212 -8204 -2393
17188b393L4802K7185M591j4134l8776j3995J508R51J0199n901K896J9683k566
$$ -2393 32409 59594 64185 50051 11275 -2720 -1212 -261 9938 4037 6933 26616 24050
17175B4050k5568k9701l962N574q054P590J5826j2467R158j2100r630L2152L5760
$$ 24050 -1518 -31219 -35181 -29607 -37661 -30071 -14245 -26712 -17554 -29654 -39284 -7132 28628
17162B8628J3210k4340r869J4453j510j6871j9498J0649J60L374J9648J0708j7871
$$ 28628 41838 17498 7629 22082 20572 3701 -15797 -5148 -4988 -1614 18034 28742 10871
17149A0871j1612j1758j7321N898K1293R235j1750l0437l708L1047K6430J0064
$$ 10871 -741 -12499 -29820 -23922 -2629 6606 -5144 -35581 -39289 -8242 18188 28252
17137B8252J1241k347l6558l080N691j3813p534l4805R36K379J5307J7774K5318
$$ 28252 39493 37146 588 -2492 3199 -10614 -18148 -52953 -52017 -49638 -34331 -16557 8761
17124H761J0673j0927j1207J4711m431k4491j4107Q191p496M627N875K408J1485
$$ 8761 19434 8507 -2700 12011 7580 -16911 -31018 -22827 -30323 -25696 -19821 -17413 -5928
17111e928J6185q339j0239K3896R53l683r412J4058j7843k0058Q009n276N484
$$ -5928 10257 1918 -8321 15575 16528 12845 3433 17491 -352 -20410 -12401 -17677 -12193
17098a2193J6530K724j3515K6138O829R581J5184j1256j7414l4585j2872R090
$$ -12193 4337 7061 -6454 19684 26513 36094 51278 40022 22608 -11977 -24849 -15759
17086a5759P786j259J7183k16p653Q133j5348p848q048k3452o063J5084Q457K6885
$$ -15759 -7973 -9232 7951 7735 82 8215 -7133 -14981 -23029 -46481 -52544 -37460 -29003 -2118
17072b118J5517k2188j8818k1260j0814m944n167K9722K6009M753K0824J8271
$$ -2118 13399 -8789 -27607 -48867 -59681 -64625 -69792 -40070 -14061 -9308 11516 29787
17060B9787J3751N599k3605k2340k289j1633P434J891l2946O519K694O515P841
$$ 29787 43538 49137 25532 3192 903 -10730 -3296 -1405 -34351 -27832 -25138 -18623 -10782
17047a0782j824K5304j028O022o076j2314j0104j8472j175L3794J0228j2107l187
$$ -10782 -12606 12698 11670 17692 11616 -698 -10802 -29274 -30449 3345 13573 1466 -1721
17034a721n098k2009m286K152N333j3242p117j033r241k1067j2121R868L7060
$$ -1721 -6819 -28828 -33114 -30962 -25629 -38871 -45988 -47021 -56262 -77329 -89450 -79582 -42522
17021d2522O276j1189L3200K3790J2464k0893j8520K677j017p346M363Q705n808
$$ -42522 -36246 -47435 -14235 9555 22019 1126 -17394 -14717 -15734 -23080 -18717 -10012 -15820
17008a5820J5378m02r579m776K5904J8369N706j6335l5449K308L0113r661j2485
$$ -15820 -442 -844 -10423 -15199 10705 29074 34780 18445 -17004 -14696 15417 5756 -6729
16995f729n729J4947J8257j1984o773p310j7178q186r120J5375N138j3094r220
$$ -6729 -12458 2489 20746 8762 1989 -5321 -22499 -30685 -39805 -24430 -19292 -32386 -41606
16982d1606L1233K043N044O804P210o883q293n83j3223l547N924K7535o782j5378
$$ -41606 -10373 -8330 -3286 3518 10728 3845 -4448 -5031 -18254 -21801 -15877 11658 4876 -10502
16968a0502J2746L316K552m609k8463l0056J2949J4172J0505K2205q787J9207
$$ -10502 2244 5560 8112 3503 -24960 -55016 -42067 -27895 -17390 4815 -3972 15235
16956A5235j2259N728K998j4554l0085M236j9211K369o511J3220J988l378O848
$$ 15235 2976 8704 11702 -2852 -32937 -28701 -47912 -45543 -52054 -38834 -36846 -40224 -33376
16943c3376J3240J1886J7608j8754j0795K4091K2324j8971k0484Q688J6492o781
$$ -33376 -20136 -8250 9358 -9396 -20191 3900 26224 7253 -13231 -4543 11949 5168
16931E168n5053R760K5427J3750m947j449L642M153J4948J7038J3688j0943k5991
$$ 5168 -49885 -40125 -14698 -948 -5895 -7344 -3702 451 15399 32437 46125 35182 9191
16918I191J4879k3512m112j8902O114J1553J1838n862J21j175j4671K580R331
$$ 9191 24070 558 -3554 -22456 -16342 -4789 7049 1187 1308 133 -14538 -11958 -2627
16905b627P059J4706K5071L276j7904j4167k6632j2928K228L3820n704l7857O409
$$ -2627 4432 19138 44209 47485 29581 15414 -11218 -24146 -21918 11902 6198 -31659 -25250
16892b5250l900J8696J9474p350J28K4943J7573j0042k1398l2296J0314k3457
$$ -25250 -29150 -10454 9020 1670 1798 26741 44314 34272 12874 -19422 -9108 -32565
16880c2565j0262K6858k982J5663K7683P19j7413O234k3712l2286r963K1700k9759
$$ -32565 -42827 -15969 -18951 -3288 24395 25114 7701 13935 -9777 -42063 -52026 -30326 -60085
16867f0085K0945K4764L350j7092l841l05Q141J3376J1527j0139k5281o302J6613
$$ -60085 -39140 -14376 -11026 -28118 -31959 -32264 -24123 -10747 780 -9359 -34640 -40942 -24329
16854b4329J3377J4155Q524J236k5056l3555j647O261M0967Q682K725k3043Q073
$$ -24329 -10952 3203 11727 12963 -12093 -45648 -47295 -41034 -67 8615 11340 -11703 -3630
16841c630L6797k252j2929o971m3835r410J0405R041L70k4307L376K1251K2558
$$ -3630 33167 30915 17986 11015 -32820 -42230 -31825 -22784 -22414 -46721 -43345 -22094 464
16828D64r947j1257L1819m751j1925J0602P545j5836K2156L9188l4652M33N148
$$ 464 -9483 -20740 11079 6328 -5597 5005 12550 -3286 18870 58058 23406 23839 28987
16815B8987o664l1538j1925K4431K9540J2751j3211o357q578l13J2j3098K076
$$ 28987 22323 -9215 -21140 3291 32831 45582 32371 26014 17436 17123 17135 4037 6113
16802F113q82k5812J1127J5884L7759J850j7695j5061P575j832j4441k6561k1421
$$ 6113 5231 -20581 -9454 6430 44189 46039 28344 13283 20858 19026 4585 -21976 -43397
16789d3397j3955o16L4612K6055J3194j5919j7667N547K143k0456p638j1817n853
$$ -43397 -57352 -57968 -23356 2699 15893 -26 -17693 -12146 -10003 -30459 -38097 -49914 -55767
16776e5767J4065P735l7454N466J1937o936J6918R469J5340J2378Q41K991r372
$$ -55767 -41702 -33967 -71421 -65955 -54018 -60954 -44036 -34567 -19227 -6849 -6008 -3017 -12389
16763a2389j4474k2835J0837L3028m484j9554o047J4774k810M36O022N483J5370
$$ -12389 -26863 -49698 -38861 -5833 -10317 -29871 -35918 -21144 -23954 -23518 -17496 -12013 3357
16750C357Q384q984J5590J5548Q451K245m349j1644o789k0363k9807k1524j516
$$ 3357 11741 2757 18347 33895 42346 44591 40242 28598 21809 1446 -28361 -49885 -51401
16737e1401j7990J0320M5268J1247j2283p266J8972L158j4005p946r307j4092
$$ -51401 -69391 -59071 -13803 -2556 -14839 -22105 -3133 25 -13980 -21926 -31233 -45325
16725d5325M7500q456r365M417J1981r302N038J7359o963m207k9463q269J5526
$$ -45325 2175 -6281 -15646 -11229 752 -8550 -3512 13847 6884 2677 -26786 -35055 -19529
16712a9529k1774k9926o26L893n755L3879L790j0647P578o7K0807K2691l1379
$$ -19529 -41303 -71229 -71855 -67962 -73717 -39838 -36048 -46695 -39117 -39184 -18377 4314 -27065
16699b7065r91Q418K4080P112k5076m8888k5905K9009L0551J4203j2738j1612
$$ -27065 -28056 -19638 4442 11554 -13522 -62410 -88315 -59306 -28755 -14552 -27290 -38902
16687c8902K6696K1304o667j8320K122J3311k5322k4462J106m941k0432J1918
$$ -38902 -12206 9098 2431 -15889 -13767 -456 -25778 -50240 -49134 -54075 -74507 -62589
16675f2589N355p277N356K2997J8088J4347k502l3326m695K2525O07L0595J641
$$ -62589 -57234 -64511 -59155 -36158 -18070 -3723 -6225 -39551 -44246 -21721 -21114 9481 11122
16662A1122J5974J8627J2805k214l9394k5726M44J2619j2798j2135L5500l741
$$ 11122 27096 45723 58528 56314 16920 -8806 -8362 4257 -8541 -20676 14824 11083
16650A1083k1048K5509L7934J619k8419l071J2135j8057l5606j016m275J0048
$$ 11083 -9965 15544 53478 55097 26678 23607 35742 17685 -17921 -18937 -23212 -13164
16638a3164N87o290K3539J1033J5992J5922k1853r634K0523k2882R754N882J891
$$ -13164 -12577 -18867 4672 15705 31697 47619 25766 16132 36655 13773 23527 29409 31300
16625C1300P39r323M050K1308J5371l089J747j0021k0312j9860J25j238j6631
$$ 31300 32039 22716 26766 48074 63445 60356 62103 52082 31770 11910 12035 10797 -5834
16612e834K70N285l91J8230l794K1227k0859j3794Q463L346K0390q899l6230k0496
$$ -5834 -5564 -279 -670 17560 13766 34993 14134 340 8803 12149 32539 23640 -12590 -33086
16598c3086M856n44O955k6268J1702J6081j082j1036n920L9860L0208N683k0257
$$ -33086 -28230 -28774 -21819 -48087 -36385 -20304 -21386 -32422 -38342 1518 31726 37409 17152
16585A7152m3363k6823J958J8910J7399j833P441J978K332k1587K3244M252l5773
$$ 17152 -26211 -53034 -51076 -32166 -14767 -16600 -9159 -7181 -4849 -26436 -3192 1060 -34713
16572c4713j9505j0975J0015L0544q646N029Q014K8123P565j1566j3235j1238
$$ -34713 -54218 -65193 -55178 -24634 -33280 -28251 -20237 7886 15451 3885 -9350 -20588
16560b0588J638J9701L0166m4008k8277J3096K6073q494n882K0002J9492M839
$$ -20588 -18950 751 30917 -13091 -41368 -28272 -2199 -10693 -16575 3427 22919 27758
16548B7758M656p248j8194J0342o910k8036p157n355L9161L0600l1141k2142J8730
$$ 27758 32414 25166 6972 17314 10404 -17632 -24789 -30144 9017 39617 8476 -13666 5064
16535E064k5303j8945Q374J554K509p91K5732j8696j8785K8845J5677j5078R172
$$ 5064 -20239 -39184 -30810 -29256 -26747 -27538 -1806 -20502 -39287 -10442 5235 -9843 -671
16522f71O516p172l536K5349m895q691J5471P933J304o122N630Q587K347l436
$$ -671 5845 -1327 -4863 20486 15591 6900 22371 30304 31608 25486 31116 39703 42050 38614
16508C8614M412o205P911o904k3027k9732l628Q505L0079l043j245n26j8863J68
$$ 38614 43026 36821 44732 37828 14801 -14931 -18559 -10054 20025 16982 15737 15211 -3652 -3484
16494c484J6437J1614m700j7595L926Q647j7750j1898R488j6597k6577R903M370
$$ -3484 12953 24567 19867 2272 6198 14845 -2905 -14803 -5315 -21912 -48489 -38586 -34216
16481c4216o327J9160j131m598j7310n377n053k723M2632N182K910q979J4318
$$ -34216 -40543 -21383 -22514 -27112 -44422 -49799 -54852 -57575 -14943 -9761 -6851 -15830 -1512
16468a512J6175o488K1889m42J9198K582m4186L715Q885j3402l698K6811J5049
$$ -1512 14663 8175 30064 29622 48820 51402 7216 10931 19816 6414 2716 29527 44576
16455D4576j4314k8576l804J6977j4627R116J2269j6687j8270J2804m671q529
$$ 44576 30262 1686 -2118 14859 232 9348 21617 4930 -13340 -536 -5207 -13736
16443a3736m830J0027j8397j8568K2913K6503N268j9448R509K1800K7779Q29l1315
$$ -13736 -18566 -8539 -26936 -45504 -22591 3912 9180 -10268 -759 21041 48820 49649 18334
16430A8334k5365n529j5793p094p585P41K0352K4319N273M496M703j5908J1387
$$ 18334 -7031 -12560 -28353 -35447 -43032 -42291 -21939 2380 7653 12149 16852 944 12331
16417A2331J5326q262j5778j3132k8492J725M330p029L0825K6639L198n982R185
$$ 12331 27657 19395 3617 -9515 -38007 -36282 -31952 -38981 -8156 18483 21681 15699 24884
16404B4884j7136q467l646J7927r472K624M140m618k130l039k5070p264O785J9918
$$ 24884 7748 -719 -4365 13562 4090 6714 10854 6236 4106 1067 -24003 -31267 -24482 -4564
16390d564n25q758n541M088k422j7588o615L6998L1494j1705p890J0037J2738
$$ -4564 -5089 -13847 -19388 -15300 -17722 -35310 -41925 -4927 26567 14862 6972 17009 29747
16377B9747m733k6149l4622k3893R608J6130J6298J5553J4619q897Q747J2849
$$ 29747 25014 -1135 -35757 -59650 -50042 -33912 -17614 -2061 12558 3661 12408 25257
16365B5257o884k1289l7075j9985J8723K4459K0426J561Q67m42j3436r929L3834
$$ 25257 18373 -2916 -39991 -59976 -41253 -16794 3632 5193 6060 5618 -7818 -17747 16087
16352A6087J3164R121m24m320k5917j9658K2417J5683j8565N885K2432m778r673
$$ 16087 29251 38372 37948 33628 7711 -11947 10470 26153 7588 13473 35905 31127 21454
16339B1454k9867J6681j2671j2527J9761k5540j8127j8927J3766L9715j807k6386
$$ 21454 -8413 8268 -4403 -16930 2831 -22709 -40836 -59763 -45997 -6282 -8089 -34475
16327c4475N423j6372j9370J1074O109O2796L4833K128o2582m1636L089L865n321
$$ -34475 -29052 -45424 -64794 -53720 -47611 15185 50018 52146 -10436 -52072 -48983 -45118 -50439
16314e0439k4825J6513J8980m928Q770M1905K2389j2426k0541p771J3830Mp106
$$ -50439 -75264 -58751 -39771 -44699 -35929 5976 28365 15939 -4602 -12373 1457 1461 -5645
16301e645q337N038Q812R345r065m042p794J2471J9586q942j4051J2087K0448
$$ -5645 -13982 -8944 -132 9213 148 -3894 -11688 783 20369 11427 -2624 9463 29911
16288B9911J703p332k4365k1561Q529L554K0231K2062l5682l8635J5406N2684
$$ 29911 31614 24282 -83 -21644 -13115 -9561 10670 32732 -2950 -41585 -26179 26505
16276B6505J1720p108J0895q504l7975j7566K346l090l082j488J8910J0927L5914
$$ 26505 38225 31117 42012 33508 -4467 -22033 -19687 -22777 -25859 -27347 -8437 2490 38404
16263C8404l3585j9663P235j8973O17O965o454p741J102J4847o321p271K3150
$$ 38404 4819 -14844 -7609 -26582 -25965 -19000 -25454 -33195 -32093 -17246 -23567 -30838 -7688
16250g688J4581K9481M2543j8973l8429l733q010m317O545n965J6275J7660l6382
$$ -7688 6893 36374 78917 59944 21515 17782 9772 5455 12000 6035 22310 39970 3588
16237C588j5845J3005L7114J8097l7470J5220K0832k9662j9092j7225J7427L9837
$$ 3588 -12257 748 37862 55959 18489 33709 54541 24879 5787 -11438 5989 45826
16225D5826O285k7234j8279l2022q325m332J9610K8857k9560l2921r42L413J5452
$$ 45826 52111 24877 6598 -25424 -33749 -38081 -18471 10386 -19174 -52095 -53037 -49624 -34172
16212c4172J2440J009J910K2053j2322j5285R50n345J2033J6463j6806k5569J2905
$$ -34172 -21732 -20723 -18813 3240 -9082 -24367 -23417 -28762 -16729 -266 -17072 -42641 -29736
16199b9736K505L480N659N381J3384q672j6782K700o475l183p348J9709N827R800
$$ -29736 -27231 -23751 -18092 -12711 673 -7999 -24781 -22081 -28556 -31739 -39087 -19378 -13551 -3751
16185c751J7133Q453k361l0369j3817j0616j6963J8214K3106L971L73J1082K5316
$$ -3751 13382 21835 19474 -10895 -24712 -35328 -52291 -34077 -10971 -7000 -6627 4455 29771
16172B9771K0080p717j8342j0049o987k4758k090j0486K1378j6884k0033k782
$$ 29771 49851 42134 23792 13743 6756 -18002 -20092 -30578 -9200 -26084 -46117 -48899
16160d8899j4321J0648M2312Q869M206J8206k7002j0502Q584J6905k9715k3455
$$ -48899 -63220 -52572 -10260 -1391 2815 21021 -5981 -16483 -7899 9006 -20709 -44164
16148d4164L046J2088J5618M343J1909R807j4800J4021J0777k2661m825k7438
$$ -44164 -41118 -29030 -13412 -9069 2840 12647 -2153 11868 22645 -16 -4841 -32279
16136c2279j4490K435m107J1081K8379M2810n957l2173l3866l9722M77K5651K5554
$$ -32279 -46769 -44334 -48441 -37360 -8981 33829 27872 -4301 -38167 -77889 -77412 -51761 -26207
16123b6207l618J6465L6971M0125J3604m0294n2469M497K5975r135k3553k505
$$ -26207 -29825 -13360 23611 63736 77340 37046 -15423 -10926 15049 5914 -17639 -20144
16111b0144L8441j702p050J2421j7506J3365q717k1272L037q927J4313J853j4437
$$ -20144 18297 16595 9545 21966 4460 17825 9108 -12164 -9127 -18054 -3741 -1888 -16325
16098a6325P086J6181K438j7501l569L542j0646Q735K7381k574j0766j0005M632
$$ -16325 -9239 6942 9380 -8121 -11690 -8148 -18794 -10059 17322 14748 3982 -6023 -1391
16085a391K359m149M781j6667j1852J9870J4239Q33k5401L776L0726K2208p075
$$ -1391 968 -3181 1600 -15067 -26919 -7049 7190 8023 -17378 -13602 17124 39332 32257
16072C2257M448j0146j8038l3042k2819K6909O822m722K8890J5416j5034j1987
$$ 32257 36705 26559 8521 -24521 -47340 -20431 -13609 -18331 10559 25975 10941 -1046
16060a046K5896j3914J9265J6703l634j8725j727j8393J0063k2600q528O683O910
$$ -1046 24850 10936 30201 46904 43270 24545 22818 4425 14488 -8112 -16640 -9957 -3047
16047c047n565k2077K162k3375J0134J8881L7235k406L5354R53k3240l1520j0655
$$ -3047 -8612 -30689 -28527 -51902 -41768 -22887 14348 11942 47296 48249 25009 -6511 -17166
16034a7166p803m529K8684k496j1868P977L441N370L1598j190O105J38k4580J2032
$$ -17166 -24969 -29498 -814 -3310 -15178 -7201 -3760 1610 33208 32018 38123 38261 13681 25713
16020B5713q563k367Q933j9401N572K11J1725N388j6674p842k81m417L160P783
$$ 25713 17150 14783 23716 4315 9887 10098 21823 27211 10537 2695 2414 -2003 1157 8940
16006H940j3917M178j369j1892K176N652j1214j5622K3980J2231o485K1692j9728
$$ 8940 -4977 -799 -2168 -14060 -11884 -6232 -17446 -33068 -9088 3143 -3342 18350 -1378
15993a378j9100K1955N248J307j5598J8433o820o464j2180J2593L4903K4925k2871
$$ -1378 -20478 1477 6725 8032 -7566 10867 4047 -2417 -14597 -2004 32899 57824 34953
15980C4953l0685o508o587J457j1399R907l324J6996K6623J8748l977k7643N451
$$ 34953 4268 -2240 -8827 -7370 -18769 -8862 -12186 4810 31433 50181 46204 18561 24012
15967B4012N673j5545l6866J6302K7608J2375J244k666j0829q413j1757j2072
$$ 24012 29685 14140 -22726 -6424 21184 33559 34803 32137 21308 12895 1138 -10934
15955a0934R921J7442j5238j4348r250j5044K2235K1056j1827o290r342l261j531
$$ -10934 -1013 16429 1191 -13157 -22407 -37451 -15216 5840 -5987 -12277 -21619 -24880 -26411
15942b6411j0794J0203j288K369M853l517n975J8454k249N742K3685J2322k0294
$$ -26411 -37205 -27002 -28290 -25921 -21068 -24585 -30560 -12106 -14355 -8613 15072 27394 7100
15929G100j2498R759L4021qk8172j5300J0755r082j2868l864K1989l208k404L3012
$$ 7100 -5398 4361 38382 38374 10202 -5098 5657 -3425 -16293 -20157 1832 -1376 -3780 29232
15915B9232j3951k1437N377J3195Q400k6626j1816J1631Q03q395o732m006R090
$$ 29232 15281 -6156 -779 12416 20816 -5810 -17626 -5995 -5192 -13587 -20319 -24325 -15235
15902a5235L381P041J0509m314l731j3799j5419q021r681K7339L64K7908N420
$$ -15235 -11854 -4813 5696 1382 -2349 -16148 -31567 -39588 -49269 -21930 -21566 6342 11762
15889A1762J6954k4936p923J4075o351m06J4550Q759J0521m2347j8321k79N0j188
$$ 11762 28716 3780 -4143 9932 3581 3175 17725 26484 37005 -5342 -23663 -23942 -23892 -25080
15875b5080J8172J1265j2657j0138J6640l95L7872j6473k8363K8444K2412q405
$$ -25080 -6908 4357 -8300 -18438 -1798 -2193 35679 19206 -9157 19287 41699 33294
15863C3294j0243R531j4180p046J001k4303R496q88k5688j7960N764K1814J2531
$$ 33294 23051 32582 18402 11356 12357 -11946 -2450 -3338 -29026 -46986 -41222 -19408 -6877
15850f877P700k452j317J5413J2505J8142J1581j2498m3933O17J0376k005J1922
$$ -6877 823 -1629 -2946 12467 24972 43114 54695 42197 -1736 -1119 9257 7252 19174
15837A9174K661n555j6521j7830j094K6831L6164k4558l6435J1894J045l9013
$$ 19174 21835 16280 -241 -18071 -19165 7666 43830 19272 -17163 -5269 -4224 -43237
15825d3237k3207k3917J2740K2366J1145L4565j135j2273j792J4914p637j1178
$$ -43237 -66444 -90361 -77621 -55255 -44110 -9545 -10680 -22953 -24745 -9831 -17468 -28646
15813b8646J1573L631K5714j0151j0535l2884J4575K0661J5466R031k1946j2024
$$ -28646 -17073 -13442 12272 2121 -8414 -41298 -26723 -6062 9404 18435 -3511 -15535
15801a5535L29k3165j6505o971O938R967L3421J9764o38p394j1947p531j076n5229
$$ -15535 -15206 -38371 -54876 -61847 -54909 -44942 -11521 8243 7605 211 -11736 -19267 -20343 -75572
15787g5572j5527N4146K5326K4090M272p568n949m521J1822o440K3683j6863j2837
$$ -75572 -91099 -36953 -11627 12463 16735 9167 3218 -1303 10519 4079 27762 10899 -1938
15774a938K9024O669l0859l3593n522R62j4440j5677K0269L7184K597k1584j6347
$$ -1938 27086 33755 2896 -30697 -36219 -35257 -49697 -65374 -45105 -7921 -5324 -26908 -43255
15761d3255k2145J805L4311J2246o965L5366R361j1489j178k6669j1804O903n357
$$ -43255 -65400 -63595 -29284 -17038 -24003 11363 20724 9235 8057 -18612 -30416 -23513 -28870
15748b8870N15O632Q810Q199J4999l7934j5402J5314L6869J9588j594k3349J1939
$$ -28870 -28355 -21723 -12913 -4714 10285 -27649 -43051 -27737 9132 28720 27126 3777 15716
15735A5716J9551m050O332M379j0619j8380r138r976l4616k2153L1856Q109J134
$$ 15716 35267 31217 37549 41928 31309 12929 3791 -6185 -40801 -62954 -31098 -22989 -21855
15722b1855J4996J4666J6306r3j5031k2284j722o364j268k650J8090J5792K381
$$ -21855 -6859 7807 24113 24020 8989 -13295 -15017 -21381 -22649 -25299 -7209 8583 10964
15709A0964o531j1624j0042k2344L796P6P427N826L7279J0925K6141k8462j9847
$$ 10964 4433 -7191 -17233 -39577 -35781 -35705 -28278 -22452 14827 25752 51893 23431 3584
15696C584R33p528n715Q606K4779K2337M45m994p080j6374p694j092j8989l400
$$ 3584 4517 -3011 -8726 -120 24659 46996 47441 42447 35367 18993 11299 10207 -8782 -12182
15682a2182J7699K3978L093J3169j9232k1702j7124J6648J4963j923m829M437
$$ -12182 5517 29495 32588 45757 26525 4823 -12301 4347 19310 17387 12558 16995
15670A6995o021O240o784k9017J1882Q201j9693l0695K4858J2778o871k1038k0337
$$ 16995 10974 17214 10430 -18587 -6705 1496 -18197 -48892 -24034 -11256 -18127 -39165 -59502
15657e9502J8178K1667J3034n754P295L876N218q169k6475J1775L5253k6295k7526
$$ -59502 -41324 -19657 -6623 -12377 -5082 -1206 4012 -4157 -30632 -18857 16396 -9899 -37425
15644c7425J0637J562N95J2613J2045L35M585q056J7687K0904j638N799m5640
$$ -37425 -26788 -25226 -24631 -12018 27 362 4947 -3109 14578 35482 33844 39643 -5997
15631e997k9941O758k920l6482p520J3245J4040M459l049k0156L1925J3161l306
$$ -5997 -35938 -29180 -32100 -68582 -76102 -62857 -48817 -44358 -47407 -67563 -35638 -22477 -25783
15618b5783j1734J8151K7535O247N869p480L628j0140P977K2637J1044j1755J185
$$ -25783 -37517 -19366 8169 14416 20285 12805 16433 6293 14270 36907 47951 36196 37381
15605C7381r24n915r812j2202j2210Q206m063o079N242J1181r359j2096m718j3442
$$ 37381 36457 30542 20730 8528 -3682 4524 461 -5618 -376 10805 1446 -10650 -15368 -28810
15591b8810J2920q72K4633J5272K4259R562k2320k4257q211j651O323J7904R61
$$ -28810 -15890 -16762 7871 23143 47402 56964 34644 10387 2176 525 6848 24752 25713
15578B5713m46j8832l0474J2043Q939j8059m2089l05J7826J5470J2900M825l223
$$ 25713 25267 6435 -24039 -11996 -3057 -21116 -63205 -63510 -45684 -30214 -17314 -12489 -15712
15565a5712Q611L4921J6294j3952l5090k2629N764J2381j687J6944N782J670J9449
$$ -15712 -7101 27820 44114 30162 -4928 -27557 -21793 -9412 -11099 5845 11627 13297 32746
15552C2746o204j6081K861p270p763K304j6103J2832K7781J5503m685k4686k9791
$$ 32746 26542 10461 13322 6052 -1711 593 -15510 -2678 25103 40606 35921 11235 -18556
15539a8556k5207J9372J8642K002P599J3181n66m453l6675j3550L7516m429R281
$$ -18556 -43763 -24391 -5749 -3747 3852 17033 16467 12014 -24661 -38211 -695 -5124 4157
15526D157m756q182J3767j8564o750J4648J2287r461k5729j5779L509n39q22M363
$$ 4157 -599 -8781 4986 -13578 -20328 -5680 6607 -2854 -28583 -44362 -40853 -41392 -42214 -37851
15512c7851K1121N613Q911M669P346N706k4931o17o144p187j588K3190K9203k502
$$ -37851 -16730 -11117 -2206 2463 9809 15515 -9416 -10033 -16177 -23364 -24952 -1762 27441 24939
15498B4939J070k883k5971l0918m215m008J3936n322J2496J8230k8035L691P736
$$ 24939 26009 23126 -2845 -33763 -37978 -41986 -28050 -33372 -20876 -2646 -30681 -26990 -19254
15485a9254l0804q41R275J6013k088M398q623Q926J4359j3807K889j277j4647
$$ -19254 -50058 -50899 -41624 -25611 -27699 -23301 -31924 -22998 -8639 -22446 -19557 -20834 -35481
15472c5481R218J8806k5913j7609J58L1597L8974o601r972l025M009J9944p849
$$ -35481 -26263 -7457 -33370 -50979 -50821 -19224 19750 13149 3177 152 4161 24105 16256
15459A6256j8951j5159j9086j3333M5397K4112j4507k95j3415K048j716m2486
$$ 16256 -2695 -17854 -36940 -50273 -4876 19236 4729 4434 -8981 -6933 -8649 -51135
15447e1135k8645K44K9473K5497J1929J7537l920K116J6928l533k9336J1813j6707
$$ -51135 -79780 -79536 -50063 -24566 -12637 4900 980 3096 20024 16491 -12845 -1032 -17739
15434a7739j7680l3744k328N649j7154p078N7314K046O28K0795k9835k3600m731
$$ -17739 -35419 -69163 -71491 -65842 -82996 -90074 -32760 -30714 -30086 -9291 -39126 -62726 -67457
15421f7457J8350K5681K1783P133r790L921J6741J7444l013k8892o013j529k1954
$$ -67457 -49107 -23426 -1643 5490 -4300 -379 16362 33806 30793 1901 -4112 -5641 -27595
15408b7595J2570k744j5238M801J4948Q295k1318o342k303K2684K5886j0901R817
$$ -27595 -15025 -17769 -33007 -28206 -13258 -4963 -26281 -32623 -34926 -12242 13644 2743 12560
15395A2560N090l094o273o37m735k4588O678J0010J3726K7618j167k5745J0625
$$ 12560 17650 14556 8283 7646 2911 -21677 -14999 -4989 8737 36355 35188 9443 20068
15382B0068k8020j0972O408J9991j5102r732m213N501l063J0312k142r312j4365
$$ 20068 -7952 -18924 -12516 7475 -7627 -17359 -21572 -16071 -19134 -8822 -10964 -20276 -34641
15369c4641j1254n529M936j0412R859J5866J3067J8184j5513j2011j4490j9338
$$ -34641 -45895 -51424 -46488 -56900 -47041 -31175 -18108 76 -15437 -27448 -41938 -61276
15357f1276J0324K6302n121N490M871L0893O976o691J1558l258k0236P944M423
$$ -61276 -50952 -24650 -29771 -24281 -19410 11483 18459 11768 23326 20068 -168 7776 12199
15344A2199n94j447P361P21J9585j0033j3352J2416J449k0419k5750j2678O415
$$ 12199 11605 10158 17519 18240 37825 27792 14440 26856 28305 7886 -17864 -30542 -24127
15331b4127j5369Q896J3295o87J5864J5749M7j5749l3920P446J6171j112j815
$$ -24127 -39496 -30600 -17305 -17992 -2128 13621 13668 -2081 -36001 -28555 -12384 -13496 -15311
15318a5311J0515M174j4715j4048K1811n687n643k2046J2433J4222N208J919R578
$$ -15311 -4796 -622 -15337 -29385 -7574 -13261 -18904 -40950 -28517 -14295 -9087 -7168 2410
15305B410J0267k0811k2691o629j2088K439J5722P656N628L692J0620J1927r353
$$ 2410 12677 -8134 -30825 -37454 -49542 -47103 -31381 -23725 -18097 -14405 -3785 8142 -1211
15292a211j7140j5174o12K6225K1496L131o56K9961l321k3268k8618j457J0570
$$ -1211 -18351 -33525 -34137 -7912 13584 16715 16059 46020 42699 19431 -9187 -10644 -74
15279g4o235P967L5295J513L035j3837r524k0655l334J9288M873J6574m35k1448
$$ -74 -6309 1658 36953 38466 41501 27664 18140 -2515 -5849 13439 18312 34886 34451 13003
15265A3003k7537K5361K6818j4064J1454j0510j1192O380r747k4065L987J3231
$$ 13003 -14534 10827 37645 23581 35035 24525 13333 19713 9966 -14099 -10112 3119
15253C119L461N329R009j0091k0216j3868p985n905O048K3429j6319l944k67J7874
$$ 3119 6580 11909 20918 10827 -9389 -23257 -31242 -37147 -31099 -7670 -23989 -27933 -28200 -10326
15239a0326O746M825K2271j828l6562j426J7259l021o477J8003Q755o702J0388
$$ -10326 -3580 1245 23516 21688 -14874 -16300 959 -2062 -8539 9464 18219 11517 21905
15226B1905J2704L3691j6777k9542j9294j0563N239P502J190J4326j1767j3295
$$ 21905 34609 68300 51523 21981 2687 -7876 -2637 4865 6055 20381 8614 -4681
15214d681j2651J2212J1184M746p115O115J7520q078k9764j7138L193L3269j9604
$$ -4681 -17332 -5120 6064 10810 3695 9810 27330 19252 -10512 -27650 -24457 8812 -10792
15201a0792m0505K2886J4818K830J6311m868j9900m431Q429j8791K0184O753M508
$$ -10792 -51297 -28411 -13593 -10763 5548 680 -19220 -23651 -15222 -34013 -13829 -7076 -2568
15188b568j3474k0993j1971m870J3454J5209L1628K779p475j2474L605l1432k3985
$$ -2568 -16042 -37035 -49006 -53876 -40422 -25213 6415 9194 1719 -10755 -7150 -38582 -62567
15175f2567J9775J4811m438J8074J0516J0976n473J9666m020J927J5216l691l9367
$$ -62567 -42792 -27981 -32419 -14345 -3829 7147 1674 21340 17320 19247 34463 30772 -8595
15162h595l6224k6158J4217J9853j9278k1914L3105L4701K4442J8961k3848k1166
$$ -8595 -44819 -70977 -56760 -36907 -56185 -78099 -44994 -10293 14149 33110 9262 -11904
15150a1904k8222O132K807j7506J0623j981Q73R593J0960M432r443R739j571k7292
$$ -11904 -40126 -33994 -31187 -48693 -38070 -40051 -39178 -29585 -18625 -14193 -23636 -13897 -15468 -42760
15136d2760K367O560J9144O599r32k1512l3037L253K217L3784J8276n59j4365
$$ -42760 -40393 -33833 -14689 -8090 -9022 -30534 -63571 -60318 -58101 -24317 -6041 -6600 -20965
15123b0965J3442P300k9303r498j955p032L986N558J9089K2769k693N420L268
$$ -20965 -7523 -223 -29526 -39024 -40979 -48011 -44025 -38467 -19378 3391 698 6118 9386
15110I386k2679j4915K9765r78J621j2437K6297K1468j7047l53J593j1876J076
$$ 9386 -13293 -28208 1557 579 2200 -10237 16060 37528 20481 20128 21721 9845 10921
15097A0921j4503O496J0654j0956j1427r204K475l065l614n304P179M118R597
$$ 10921 -3582 2914 13568 2612 -8815 -18019 -15544 -18609 -22223 -27527 -20348 -16230 -6633
15084f633P447J8254J759k9606L35J5714l443j5461r423k1108r319K9406J8431
$$ -6633 814 19068 20827 -8779 -8444 7270 3827 -11634 -21057 -42165 -51484 -22078 -3647
15071c647M790j3641k0257M804L7920J1293j0987l120j144j4330k481K6869m516
$$ -3647 1143 -12498 -32755 -27951 9969 21262 10275 7155 6011 -8319 -10800 16069 11553
15058A1553J3368K640k237j9468R189K486j5672p427Q061J4258J5073l3850P710
$$ 11553 24921 27561 25324 5856 15045 17531 1859 -5568 2493 16751 31824 -2026 5684
15045E684J8056j9257J4753p884m865q189P389Q024m761R515J6679j3706l1629
$$ 5684 23740 4483 19236 11352 6487 -1702 5687 13711 8950 18465 35144 21438 -10191
15032a0191j9917p410K7187Q752J0378J5879j0360j8370K321J0388M284p499l385
$$ -10191 -30108 -37518 -10331 -1579 8799 24678 14318 -4052 -1731 8657 12941 5442 2057
15019B057J220o690o044L988j4611K1906M3422j2104k1944M957K3728o451l1518
$$ 2057 3277 -3413 -9457 -5469 -20080 1826 45248 33144 11200 16157 39885 33434 1916
15006A916j0395K2397K4283m05k6941j7780L080j8852N674L4190Q526n439J5511
$$ 1916 -8479 13918 38201 37796 10855 -6925 -3845 -22697 -17023 17167 25693 20254 35765
14993C5765k395O936q019j9664k1785L840j3980K009K4500O937K2707J7908j4578
$$ 35765 33370 40306 32287 12623 -9162 -5322 -19302 -17293 7207 14144 36851 54759 40181
14980D0181l4187m1240Q60r737J3789J8103k3587j1818K6991L6068l77m0987J1664
$$ 40181 5994 -35246 -34386 -44123 -30334 -12231 -35818 -47636 -20645 15423 15046 -25941 -14277
14967a4277J9270N510j435k6378l2111j1386L2025L0306l0324q201j3843k874
$$ -14277 4993 10503 9068 -17310 -49421 -60807 -28782 1524 -28800 -37001 -50844 -53718
14955e3718K8790K146l13K1550J0639j4893j8445P852J5920n010k5948r975N162
$$ -53718 -24928 -22782 -23095 -1545 9094 -5799 -24244 -16392 -472 -5482 -31430 -41405 -36243
14942c6243N565J5035J2597j9985L0474L3321l676k6279j8055l1063M021M724
$$ -36243 -30678 -15643 -3046 -23031 7443 40764 37088 10809 -7246 -38309 -34288 -29564
14930b9564L7338L233p386k4868P034Q038l920m806J3415L745j1820l411k6062
$$ -29564 7774 11007 3621 -21247 -14213 -6175 -10095 -14901 -1486 2259 -9561 -12972 -39034
14917c9034K837K5730j6892j3272j1079Q349K4851K734K2194J4723j1374k4517
$$ -39034 -36197 -10467 -27359 -40631 -51710 -43361 -18510 -15776 6418 21141 9767 -14750
14905a4750n347r188L1201L5171N491p665j1120r678j8940l898M222j3071p333
$$ -14750 -20097 -29285 1916 37087 42578 34913 23793 14115 -4825 -8723 -4501 -17572 -24905
14892b4905j0535j0845M731L2236P439k174n555K1395J9447o606M6M719m857j599
$$ -24905 -35440 -46285 -41554 -9318 -1879 -4053 -9608 11787 31234 24628 24674 29393 24536 22937
14878B2937k7391m5436O567L8314L3630J1341l5470j5077J8913M7243J2935k4447
$$ 22937 -4454 -49890 -43323 -5009 28621 39962 4492 -10585 8328 55571 68506 44059
14866D4059k0245j0655K478K19p613m003J1609k2891Q932J2409k4066o327L405
$$ 44059 23814 13159 15637 15856 8243 4240 15849 -7042 1890 14299 -9767 -16094 -12689
14853a2689o821j636O886J6703p874k1027J34j3296j1772K8473L1157l275q747
$$ -12689 -19510 -21146 -14260 2443 -5431 -26458 -26324 -39620 -51392 -22919 8238 4963 -3784
14840c784Q391L000M794Q854K5202M814K137o326j5849m5283k1606J4459K7688
$$ -3784 4607 7607 12401 21255 46457 51271 53408 47082 31233 -14050 -35656 -21197 6491
14827F491K5861P593K3899J4063L377j9662j9309l2382j5378J6109R033p918o410
$$ 6491 32352 39945 63844 77907 81284 61622 42313 9931 -5447 10662 19695 11777 5367
14814E367J4050J0910j5094j0810k1315p89N346j175L4866j1262j0052l215m325
$$ 5367 19417 30327 15233 4423 -16892 -17681 -12335 -13510 21356 10094 42 -3173 -7498
14801g498m345M97J3126j902P161R586j3212j4267K503k970q564J177j1458N77
$$ -7498 -11843 -11346 1780 -122 7039 16625 3413 -10854 -8351 -11321 -19885 -18708 -30166 -29589
14787b9589L5944J6506J2420L1478l1904k2144n736L121L980J0938j500m517n353
$$ -29589 6355 22861 35281 66759 34855 12711 6975 10096 14076 25014 23514 18997 13644
14774A3644J1282m341k4578K8655j0189k6688L025j7460o689K7787Q815k0764
$$ 13644 24926 20585 -3993 24662 14473 -12215 -9190 -26650 -33339 -5552 3263 -17501
14762a7501n862K2225K022l86J3714J6010K1853K8775J9264Q484J0385j5423j5238
$$ -17501 -23363 -1138 884 498 14212 30222 52075 80850 100114 108598 118983 103560 88322
14749H8322o741k079q694k4175m0895j0216K1872n47m169K8615j6540j2821j2401
$$ 88322 81581 79502 70808 46633 5738 -4478 17394 16847 12678 41293 24753 11932 -469
14736d69o310K5302J0670J645k709l2233k6180L9226p14k1909j205o86N997J6705
$$ -469 -6779 18523 29193 30838 28129 -4104 -30284 8942 8228 -13681 -14886 -15572 -9575 7130
14722G130J0267M692p677n274j2813k0775k6305K3795K2291j2369j0569r168j4126
$$ 7130 17397 22089 14412 9138 -3675 -24450 -50755 -26960 -4669 -17038 -27607 -36775 -50901
14709e0901l900J2638J7367Q452m852l0142j4043K8996L874N620J1021K5651J5888
$$ -50901 -54801 -42163 -24796 -16344 -21196 -51338 -65381 -36385 -32511 -26891 -15870 9781 25669
14696B5669k0588p691J8185J0997l930J1499P156m219q058n594r499K017K0308
$$ 25669 5081 -2610 15575 26572 22642 34141 41297 37078 29020 23426 13927 15944 36252
14683C6252K5827K5389K6530L7371M0298M5772K3300L1226K1260l0505l0270j1970
$$ 36252 62079 87468 113998 151369 191667 237439 260739 291965 313225 282720 252450 240480
14671B40480l2309n0840n2269k8429k8381P977K6013k1985k6621m6855m1610L5176
$$ 240480 208171 157331 105062 76633 48252 56229 82242 60257 33636 -13219 -54829 -19653
14659a9653N751p923J4236m967K879R772J121n441O405j4881k0057K3722J6506
$$ -19653 -13902 -21825 -7589 -12556 -9677 95 1216 -4225 2180 -12701 -32758 -9036 7470
14646G470p396p188R188j1374j3566j4312K2912K4969J4378J1623j0610o467j527
$$ 7470 74 -7114 2074 -9300 -22866 -37178 -14266 10703 25081 36704 26094 19627 18100
14633A8100K6818L333j3908J1164p24p989o224j519k3780p521n189J1627m477
$$ 18100 44918 48251 34343 45507 44783 36794 30570 29051 5271 -2250 -7439 4188 -289
14620b89N548m684j5978P985K1306R757j2939k4567k0037J3641N637J2799j6956
$$ -289 5259 575 -15403 -7418 13888 23645 10706 -13861 -33898 -20257 -14620 -1821 -18777
14607a8777j5946Q907K7953p610L6361J9838o492j307O594L922l163Q572M3477
$$ -18777 -34723 -25816 2137 -5473 30888 50726 44234 42927 49521 53443 50280 58852 102329
14594A02329M2969L9552N8742K2686J9191r33k1676m3180m4397j9223j4547m3942
$$ 102329 145298 184850 243592 266278 285469 284536 262860 219680 175283 156060 141513 97571
14582I7571m6758l6113k3432L2538M5036m668k4931K168j9497k3874O883K6879
$$ 97571 50813 14700 -8732 23806 68842 64174 39243 41411 21914 -1960 4923 31802
14570C1802J8104Q254J0113K052j9508K104l526l9525j2988J6209K3674J2235
$$ 31802 49906 58160 68273 70325 50817 52921 49395 9870 -3118 13091 36765 49000
14558D9000O23p437m330j7863k4133O383k2846j5710R315J8661l7407k247K1526
$$ 49000 49623 42186 37856 19993 -4140 2243 -20603 -36313 -26998 -8337 -45744 -47991 -26465
14545b6465N326K50o805o714O884K3856L146j7419j6252J0559p943k544J9543
$$ -26465 -21139 -20889 -27694 -34408 -27524 -3668 -522 -17941 -34193 -23634 -31577 -34121 -14578
14532a4578p616q608k678J8354m153J1804M449m957j4132Q835J6608L522k666
$$ -14578 -22194 -30802 -33480 -15126 -19279 -7475 -3026 -7983 -22115 -13280 3328 6850 4184
14519D184P211j9758J8379L8917K5802O853K2605J2809l835k9237j6159M979j1641
$$ 4184 11395 -8363 10016 48933 74735 81588 104193 117002 113167 83930 67771 72750 61109
14506F1109l1361J0238j0774o887j569J5831J1139k9375L286r492q911r646j4532
$$ 61109 29748 39986 29212 22325 20756 36587 47726 18351 21637 12145 3234 -6412 -20944
14493b0944Q691K2885J3267Q27j5293K7219r962J1489K8337O649O879j4486m298
$$ -20944 -12253 10632 23899 24726 9433 36652 26690 38179 66516 73165 80044 65558 61260
14480F1260o49P389k1101j7271K935p19J3466k6797n230L4278K1284j7893R284
$$ 61260 60611 68000 46899 29628 32563 31844 45310 18513 13283 47561 68845 50952 60236
14467F0236J6696K9637J1937q742J2628O1617O4883R7426J69276K03983K63553
$$ 60236 76932 106569 118506 109764 122392 184009 248892 346318 515594 719577 983130
14456I83130K78081K10556J55117R9435q070j43960k07377k69414k68037k49435
$$ 983130 1261211 1471767 1626884 1726319 1718249 1574289 1366912 1097498 829461 580026
14446E80026j63278r2434n4458m5983l7707j9686r921k2496j3523q214k1886m302
$$ 580026 416748 324314 269856 223873 186166 166480 156559 134063 120540 112326 90440 86138
14434H6138j5181j8011j3141n409J1207K7368j7585l1887J7181j8553l187o386
$$ 86138 70957 52946 39805 34396 45603 72971 55386 23499 40680 22127 18940 12554
14422A2554l2888J4748K0641J4514m719n677L06j5717o211m993k2882K7561Q265
$$ 12554 -20334 -5586 15055 29569 24850 19173 19479 3762 -2449 -7442 -30324 -2763 5502
14409E502O344J5030l3871n25L714N854q660l0328o720J2183J9344R996r321k0482
$$ 5502 11846 26876 -6995 -7520 -3806 2048 -6612 -36940 -43660 -31477 -12133 -2137 -11458 -31940
14395c1940k872K4490J4132K1737j9283k5073K6786J9015j2344j5314k0652J8087
$$ -31940 -34812 -10322 3810 25547 6264 -18809 7977 26992 14648 -666 -21318 -3231
14383c231n691J7573J1951m2258M085J3773r549k3869L161O895L413J131n082
$$ -3231 -8922 8651 20602 -21656 -17571 -3798 -13347 -37216 -34055 -27160 -23747 -22616 -27698
14370b7698M746k1183n466N2051K4332M191M154o177j5223k0576l5693p732K6856
$$ -27698 -22952 -44135 -49601 2450 26782 30973 35127 28950 13727 -6849 -42542 -50274 -23418
14357b3418K0527m20K915J2254p393k3026J2142j6223k0252q732J6997N8585O907
$$ -23418 -2891 -3311 -396 11858 4465 -18561 -6419 -22642 -42894 -51626 -34629 23956 30863
14344C0863q143o159r380k248m090J184k0329j3299J2320L6470J3125r441k0450
$$ 30863 22720 16561 7181 4933 843 2027 -18302 -31601 -19281 17189 30314 20873 423
14331D23q104m599P616M15l0903j0945q189J6091n236J6154m865j3463P926K0888
$$ 423 -7681 -12280 -4664 -4249 -35152 -46097 -54286 -38195 -43431 -27277 -32142 -45605 -37679 -16791
14317a6791M113J9053J284j8003K2821K6511k926k7083p811l267O92j1996j1479
$$ -16791 -12678 6375 7659 -10344 12477 38988 36062 8979 1168 -2099 -1407 -13403 -24882
14304b4882L7394j6515j6189j1700L884P220Q049J3793J5558r117o052m621j3528
$$ -24882 12512 -4003 -20192 -31892 -28008 -20788 -12739 1054 16612 7495 1443 -3178 -16706
14291a6706J95J7062k4355r537J5700K1114K4273M0526l289k4479k1882j7873
$$ -16706 -16511 551 -23804 -33341 -17641 3473 27746 68272 64983 40504 18622 749
14279G49k0490o681j1193J7373L5547J4248m31o615l644q973r960J9526K0743
$$ 749 -19741 -26422 -37615 -20242 15305 29553 29122 22507 18863 9890 -70 19456 40199
14266D0199J8894j2658L3712M421k2171L862J2654k7447l5749k943r636J9985
$$ 40199 59093 46435 80147 84568 62397 66259 78913 51466 15717 12774 3138 23123
14254B3123K3350j1133l0725j541M927K1081J590J3257K951J5577n651P836L2774
$$ 23123 46473 35340 4615 3074 8001 29082 30672 43929 46880 62457 56806 64642 97416
14241I7416j246k3428O0M0580K8938J0109J9941M3618L7167M030p171j8782l4075
$$ 97416 96170 72742 72802 113382 142320 152429 172370 215988 253155 257185 250014 231232 197157
14228A97157k8925n4613k4696Q315K2241j6574l64k0056M117J1314r454J0773
$$ 197157 168232 113619 88923 97238 119479 102905 102541 82485 86602 97916 88462 99235
14216I9235J781R523L5386R453J7989j0399J5555J8461J4920Q230K7241L9558
$$ 99235 101016 110539 145925 155378 173367 162968 178523 196984 211904 220134 247375 286933
14204B86933N4221K4889m0457j574j936K1048K4841J6696j7044m3017J2992K66
$$ 286933 341154 366043 325586 324012 322076 343124 367965 384661 367617 324600 337592 337858
14192C37858Q616j9601j7783k4374o776j5984k4557L750J2322J2205L1949j182
$$ 337858 346474 326873 309090 284716 277940 261956 237399 241149 253471 265676 297625 296443
14180B96443K8720L9974J3202k27o805k8339n462n675j4051r967j6982k3866k2169
$$ 296443 325163 365137 378339 378112 371307 342968 337506 331831 317780 307813 290831 266965 244796
14167B44796j912J2547r336r676O768j1484m3327l1572J2535J236N994j7342L130
$$ 244796 242884 255431 246095 236419 243187 231703 188376 156804 169339 170575 176569 159227 162357
14154A62357J824m6788m3786j1716O058J1313q746o072j1215M808r268l03k181
$$ 162357 164181 117393 73607 61891 67949 79262 70516 64444 53229 58037 48769 48466 46285
14141D6285j6547j4299r974K1033L1907K1475J3904K098J0359P834m550j1826
$$ 46285 29738 15439 5465 26498 58405 79880 93784 95882 106241 114075 109525 97699
14129I7699j9617J1678J4853m661j8669j3839J75j2695J0156K2175k9657j9687
$$ 97699 78082 89760 104613 99952 81283 67444 67619 54924 65080 87255 57598 37911
14117C7911l48K934j121J9347M0858J7285N276M960J8261N0368L6390J6601k2842
$$ 37911 37563 40497 39376 58723 99581 116866 122142 127102 145363 195731 232121 248722 225880
14104B25880o938J0651j9290l0425j1059n1291l2055j6885p44j2490J1220Q1011
$$ 225880 218942 229593 210303 179878 168819 117528 85473 68588 67844 55354 66574 147585
14092A47585K4563m2246n4507j9471j1471k109J5739K6056Q889L4290J1367l5475
$$ 147585 172148 129902 75395 55924 44453 42344 58083 84139 93028 127318 138685 103210
14080A03210j2275J9567L0466N748J2908k317j7634K8455q6k5960l0769k1420
$$ 103210 90935 110502 140968 146716 159624 157307 139673 168128 168042 142082 111313 89893
14068H9893m1686k928n424j3586J6939J3718J4646P0378M3452q073q441j0341
$$ 89893 48207 45279 39855 26269 43208 56926 71572 141950 185402 177329 168888 158547
14056A58547O171K4920j3137k7186J581R01L641K1597K2628Q482K2235J0975J5704
$$ 158547 164718 189638 176501 149315 150896 151797 155438 177035 199663 208145 230380 241355 257059
14043B57059n529m33J6991O011P6L0144N8512L0597P169k805j6195K7939J9617
$$ 257059 251530 251097 268088 274099 274175 304319 362831 393428 400597 397792 381597 409536 429153
14030D29153Q847M965J6539Q380J726M785K6349J7392Q457L1368N1103Q7183O7672
$$ 429153 438000 442965 459504 467884 469610 474395 500744 518136 526593 557961 609064 696247 763919
14017G63919R9417J04090P4151Q7580R3065J15252R3177R1679J68134J37888J47764
$$ 763919 863336 967426 1041577 1129157 1222222 1337474 1430651 1522330 1690464 1828352 1976116
14006A976116J61578J77162J88164K70510L41916M45455N94578P98880J037808
$$ 1976116 2137694 2314856 2503020 2773530 3115446 3560901 4155479 4954359 5992167
13997E992167J217022J364804J466843J524730J484885J576178J823840K303446
$$ 5992167 7209189 8573993 10040836 11565566 13050451 14626629 16450469 18753915
13989A8753915L415708N432791R142048J5849786K6336659L7942845M6785532
$$ 18753915 22169623 27602414 36744462 52594248 78930907 116873752 163659284
13982A63659284N2798016N0053390L8699536K2493798k006828k4513153l9719217
$$ 163659284 216457300 266510690 305210226 327704024 325697196 301184043 261464826
13975B61464826m9940177n0467592m4233740l5343659k4032384j4523663q703821
$$ 261464826 211524649 161057057 116823317 81479658 57447274 42923611 34219790
13968C4219790n453138l539149k460336j982993j816215j864639j887144j867581
$$ 34219790 28766652 25227503 22767167 20784174 18967959 17103320 15216176 13348595
13960A3348595j823034j673262j430227j167503q91815o62899n44968m69087l88862
$$ 13348595 11525561 9852299 8422072 7254569 6362754 5699855 5154887 4685800 4296938
13951D296938l50721l01360l07077k75104k43399k20347j82968j55020j43697
$$ 4296938 3946217 3644857 3337780 3062676 2819277 2598930 2415962 2260942 2117245
13942B117245j41805q7427p1619m3297p0562m6328o7655r4314n6445q1744q4896
$$ 2117245 1975440 1888013 1816394 1773097 1702535 1656207 1588552 1494238 1437793 1356049 1271153
13931A271153p0010l9741l4584k5287m7143p7987n2337k5371k7867n2901k9242
$$ 1271153 1201143 1161402 1126818 1101531 1054388 976401 924064 898693 870826 817925 788683
13920G88683m824k745k2512j8873j7104k5616k3147j1809q285J1234p247l4885
$$ 788683 783859 781114 758602 739729 722625 697009 673862 662053 653768 665002 657755 622870
13908F22870r991j8144l1852l4305m604P291j0483l6486k6049j4097j5552j0558
$$ 622870 612879 594735 562883 528578 523974 531265 520782 484296 458247 444150 428598 418040
13896D18040q193L605J2154Q786N589J1753n494j5325o320J32m3522l5129N738
$$ 418040 409847 413452 425606 434392 439981 451734 446240 430915 424595 424727 381205 346076 351814
13883C51814m7657l8077R732K514K1782r130j3556r084J1781J7424J9651O524
$$ 351814 304157 266080 275812 278326 300108 290978 277422 268338 280119 297543 317194 323718
13871C23718r800P813p472J1888K4776j6904j7938j607j2759l543J3184j2443
$$ 323718 313918 321731 314259 326147 350923 334019 316081 314474 301715 298172 311356 298913
13859B98913K145K0322L2796M5638N438J9264r52Q056j7404m6046n5126j8885
$$ 298913 301058 321380 354176 399814 405252 424516 423564 431620 414216 368170 313044 294159
13847B94159j8939J484l3082l9915j7982l557M8915K2246j6990J3256l247J2580
$$ 294159 275220 276704 243622 203707 185725 182168 231083 253329 236339 249595 246348 258928
13835B58928l171M068j7420j5884o187l983k2373l0602k9267J9489J8059k3494
$$ 258928 255757 259825 242405 226521 220334 216351 193978 163376 134109 153598 171657 148163
13823A48163l6178K1370K1647j0322r167P908R888j9145j4247N320j6147k3280
$$ 148163 111985 133355 155002 144680 135513 143421 153309 134164 119917 125237 109090 85810
13811H5810J187L503K7614L916p937K3070J2730N2r107l6250j0232r939J5004
$$ 85810 86997 90500 118114 122030 114093 137163 149893 149945 140838 104588 94356 84417 99421
13798I9421j6536m0988q369J3333K5989K8027K7337r837Q790q88o479P309J1573
$$ 99421 82885 41897 33528 46861 72850 100877 128214 118377 127167 126279 119800 127109 138682
13785A38682P418J3j4944k0120k7504q423K5934K8176J4321J986k3196J4805P116
$$ 138682 146100 146113 131169 111049 83545 75122 101056 129232 143553 145539 122343 137148 144264
13772A44264j4999r033j9302n676K182k049k4727k0772J4358o349l9377j3081
$$ 144264 129265 120232 100930 95254 97436 95387 70660 49888 64246 57897 18520 5439
13760E439M1780K7960o077l385J1828Q407J2518l224K235p229p943K1789J3230
$$ 5439 47219 75179 69102 65717 77545 85952 98470 95246 97481 90252 82309 104098 117328
13747A17328j5058M775q275j5220j4400j0281P9k430k091j0455k3878j081K1826
$$ 117328 102270 107045 98770 83550 69150 58869 58948 56518 54427 43972 20094 19013 40839
13734D0839K0771O636J4062Q197J7907p777j8212O941J6565K228K160N499o755
$$ 40839 61610 68246 82308 90505 108412 100635 82423 89364 105929 108157 110317 115816 109061
13721A09061j7847l60k5878r045J1798K9447J9171K1436m2225k6434J813k2311
$$ 109061 91214 90854 64976 55931 67729 97176 116347 137783 95558 69124 70937 48626
13709D8626N951j1547j1409O557J9134J6157j2021m871K559l5093J9118m256K3885
$$ 48626 54577 43030 31621 38178 57312 73469 61448 56577 59136 24043 43161 38905 62790
13696F2790K6826o735q388k94l728l5133k2032J3726K0257J6301j8541j9445N735
$$ 62790 89616 82881 74493 74199 70471 35338 13306 27032 47289 63590 45049 25604 31339
13683C1339J3r982P102J1603M977K1675l718j3914J174K4045j6519j1886l848
$$ 31339 31352 21370 28472 40075 45052 66727 63009 49095 50269 74314 57795 45909 42061
13670D2061J0487J0478j9852P800J2510L8665J5949j4333J1971q557l6715p226
$$ 42061 52548 63026 43174 50974 63484 102149 118098 103765 115736 107179 70464 63238
13658F3238O674j2932k7148k3838k0854K1457K171j8614J6470L7066K9846J2693
$$ 63238 69912 56980 29832 5994 -14860 6597 8768 -9846 6624 43690 73536 86229
13646H6229N999J0748M465j2407q036l4365m0460q624p124K8090J3996k300k6320
$$ 86229 92228 102976 107441 95034 86998 52633 12173 3549 -3575 24515 38511 36211 9891
13633I891p238M0824n515j2343m1394k424P644K6098R091K0300M321j4910J4928
$$ 9891 2653 43477 37962 25619 -15775 -18199 -10555 15543 24634 44934 49255 34345 49273
13620D9273j5877m154p26M8169J6505k1108j2583k3524K7009l5P552J3525j8031
$$ 49273 33396 29242 28516 76685 93190 72082 59499 35975 62984 62949 70501 84026 65995
13607F5995j8352M686K2099N0003j4115k3048j6100Q531l0497j9291q635J1910
$$ 65995 47643 52329 74428 124431 110316 87268 71168 79699 49202 29911 21276 33186
13595C3186O743J574P227q667J9883K572j6401M04P539J0115j0006j582q949k2400
$$ 33186 39929 41503 48730 40063 59946 62518 46117 46521 54060 64175 54169 52587 43638 21238
13581B1238J9400K0216m663p187r121K87j2319j5213m006k613m191J5091q4n386
$$ 21238 40638 60854 56191 49004 39883 40170 27851 12638 8632 6019 1828 16919 16835 11449
13567A1449L282L05K467l771M156L3742J9956k8361j0835J1821L574m541j3809
$$ 11449 14731 15036 17503 13732 17888 51630 71586 43225 32390 44211 47785 43244 29435
13554B9435J9130J2322j8910r153P229j1622j3873J8244M0964J2458k2201j1081
$$ 29435 48565 60887 41977 32824 40053 28431 14558 32802 73766 86224 64023 52942
13542E2942l804o300J5603J123j3753N127j0606K1274J5955n93j3920m3694k9748
$$ 52942 49138 42838 58441 59564 45811 50938 40332 61606 77561 76968 63048 19354 -10394
13529a0394q806j7369P507J7778J8125J3603j119K1335J8539p848J2176L6097
$$ -10394 -19200 -36569 -29062 -11284 6841 20444 19325 40660 59199 51351 63527 99624
13517I9624k0433o125j0489j115L4090M1704r586k384j4476J9413J6563K9845
$$ 99624 79191 73066 62577 61462 95552 137256 127670 125286 110810 130223 146786 176631
13505A76631N6784J46244J94744K49909K63593K60074K26352J54596M7362o7191
$$ 176631 233415 379659 574403 824312 1087905 1347979 1574331 1728927 1776289 1709098
13495A709098j72857k34824k89152k40968k03424j80793j23463o3082j1679l38
$$ 1709098 1536241 1301417 1012265 771297 567873 387080 263617 200535 188856 188518
13485A88518k0752n922o485j7628k4840Q788J2755j4283K494j197l477k9786j6039
$$ 188518 167766 161844 155359 137731 112891 121679 134434 120151 122645 121448 117971 88185 72146
13472G2146O438j597J324M354j0757q047j1270J6699N667k598o085k7228O639
$$ 72146 78584 76987 78311 82665 71908 63861 52591 69290 74957 72359 66274 39046 45685
13459D5685J7133J3510J1522j9119j0425j476j0382l7629J2648q30k4482k3694
$$ 45685 62818 76328 87850 68731 58306 56830 46448 8819 21467 20637 -3845 -27539
13447b7539K2721L5747R782R214k0295j1469K2439j4489j6561j9429r901J6349
$$ -27539 -4818 30929 40711 49925 29630 18161 40600 26111 9550 -9879 -19780 -3431
13435c431K8659J5577J7628K734o025k3505m1531M526J5880r698l630k891k9791
$$ -3431 25228 40805 58433 61167 55142 31637 -9894 -5368 10512 814 -2816 -5707 -35498
13422c5498j635L4881Q376J0554J2465m240k632K0802J3488j5026K3184J1650
$$ -35498 -37133 -2252 6124 16678 29143 24903 22271 43073 56561 41535 64719 76369
13410G6369j2066l8586k0453Q014p762k2506K8315M5657j9551j315K3250k485
$$ 76369 64303 25717 5264 13278 5516 -16990 11325 56982 37431 36116 59366 56881
13398E6881j3500K0022J0506o816J8413M270k2756k1505k4846j9727J5890q15
$$ 56881 43381 63403 73909 67093 85506 89776 67020 45515 20669 942 16832 16017
13386A6017j4261j1056m707p109K7552L4378K0235k2653r574j5608m6147M29K694
$$ 16017 1756 -9300 -14007 -21116 6436 40814 61049 38396 28822 13214 -32933 -32504 -29810
13373b9810o56P856J4296J4192j7819l219K2010P45J7070P063k5546L3517J7927
$$ -29810 -30466 -22610 -8314 5878 -11941 -15160 6850 7595 24665 31728 6182 39699 57626
13360E7626l813j4942j2804k749j0737j5011K3621K2604P539m496q613j7312j5512
$$ 57626 53813 38871 26067 23318 12581 -2430 21191 43795 51334 46838 38225 20913 5401
13347E401l050P601k6257k2899J1519K3664K8168P930K2035J1328l2767j7100
$$ 5401 2351 9952 -16305 -39204 -27685 -4021 24147 32077 54112 65440 32673 15573
13335A5573P512K9395N648k8569l2947j2490q97J9867L8620k202j677J4702P22
$$ 15573 23085 52480 58128 29559 -3388 -15878 -16775 3092 41712 39510 37833 52535 53257
13322E3257j0654k8122j5176n325M553O953j7639j2075L2518J0291j972j2193
$$ 53257 42603 14481 -695 -6020 -1467 5486 -12153 -24228 8290 18581 16609 4416
13310D416j0801q542j852K0659K8876R40k9313o564K800J0374O138J1716k1764
$$ 4416 -6385 -14927 -16779 3880 32756 33696 4383 -2181 619 10993 17131 28847 7083
13297G083m64N342k696K259k6270O381L3639N975R207M991P124p64k4917k3380
$$ 7083 6619 11961 9265 11524 -14746 -8365 25274 31249 40456 45447 52571 51807 26890 3510
13283C510J1628K094L798K936J472O304j2311J0977n935J401l50k5341l8705K0734
$$ 3510 15138 17232 21030 23966 25438 31742 19431 30408 24473 25874 25524 183 -38522 -17788
13269a7788M5000P575k1800O910k4741q944L8473p831p754J5465J5498L528j8328
$$ -17788 27212 34787 12987 19897 -4844 -13788 24685 16854 9100 24565 40063 43591 25263
13256B5263j7944L1624J1203o906J2311J6374M399l979J356k344j478j858j5418
$$ 25263 7319 38943 50146 43240 55551 71925 76324 72345 73701 71357 69879 68021 52603
13243E2603q827r940L3J0604j6831j0282j8608j349J8349P64J9126J8679k4150
$$ 52603 43776 33836 33869 44473 27642 17360 -1248 -2597 15752 16516 35642 54321 30171
13230C0171l7668J050L3338l194j9348j5089J399K1997N465L732M335p535r903
$$ 30171 -7497 -6447 26891 23697 4349 -10740 -9341 12656 18121 21853 26188 18653 8750
13217H750k6608o582l53K3845P374k977M34K3289J0703n865N310l7598K087J6684
$$ 8750 -17858 -24440 -24793 -948 6426 3449 3883 27172 37875 32010 37320 -278 1809 18493
13203A8493J932l492l621K3654r694k5708k1713j7284j8658P73K3790J5297J6215
$$ 18493 20425 16933 13312 36966 27272 1564 -20149 -37433 -56091 -55318 -31528 -16231 -16
13190a6M2094j8570r507M630J7162k2613j4120O068J8858j019J1445K149l937
$$ -16 42078 23508 14001 18631 35793 13180 -940 5128 23986 22967 34412 36561 32624
13177C2624m912k7638p290K832J7706J11j3028J7326J1145K1236K9674J210l7261
$$ 32624 27712 74 -7216 -4384 13322 13433 405 17731 28876 50112 79786 80996 43735
13164D3735j6827p054J2187j4013k1004M244l60k5451J452l069J5435J8399q302
$$ 43735 26908 19854 32041 18028 -2976 1268 908 -24543 -23091 -26160 -10725 7674 -628
13151f28J567K0705J85K7641j2978n520m690l40j5018J6946J5894j0928l048j2269
$$ -628 939 21644 21829 49470 36492 30972 26282 25942 10924 27870 43764 32836 29788 17519
13137A7519m335q63N723K106j1890j5765j768L259L5676j1195j0328J844K4j9288
$$ 17519 13184 12321 18044 20150 8260 -7505 -9273 -6014 29662 18467 8139 9983 10007 -9281
13123i281k183P296L962p728J1531p399O893L7941j0208Q364J7131m81j6909j4601
$$ -9281 -11464 -4168 -206 -7934 3597 -3802 3091 41032 30824 39188 56319 55838 38929 24328
13109B4328M583j0608j9894j5983j1427k648J1672L8242J4148M618K4391K8401
$$ 24328 28911 18303 -1591 -17574 -29001 -31649 -19977 18265 32413 37031 61422 89823
13097H9823j2351o2368m1788p155k959J6145L0483L113J9126J0838Q206P176j3036
$$ 89823 77472 15104 -26684 -33839 -36798 -20653 9830 12943 32069 42907 51113 58289 45253
13084D5253k1750p265m584j6213r293q524R550j2342k0767n447P393J9106P073
$$ 45253 23503 16238 11654 -4559 -13852 -22376 -12826 -25168 -45935 -51382 -43989 -24883 -17810
13071a7810P905P756n47j0495o661J1455l287J7504j395l0285j7526K5990K5152
$$ -17810 -9905 -2149 -2696 -13191 -19852 -8397 -11684 5820 4425 -25860 -43386 -17396 7756
13058G756N453J4857J6732l7029j0814Q670k2931q309K2421J3809J9885O919m293
$$ 7756 13209 28066 44798 7769 -3045 5625 -17306 -25615 -3194 10615 30500 37419 33126
13045C3126j2295j5133J2060L2527J8580l239L264j1821j7587J0191o591k1051
$$ 33126 20831 5698 17758 50285 68865 65626 68890 57069 39482 49673 43082 22031
13033B2031l3314L947Q100J1054J0102j4876L016P108K2774p129k5414j7297J0440
$$ 22031 -11283 -7336 764 11818 21920 7044 10060 17168 39942 32813 7399 -9898 542
13020E42J9252R153j572m138l0270n424J4990J8055r263j3622J3785k1519m005
$$ 542 19794 28947 27375 23237 -7033 -12457 2533 20588 11325 -2297 11488 -10031 -14036
13007a4036J1248J288M475J4876J3941l197j8071m395l24J536K1145j5825j6214
$$ -14036 -2788 -1500 2975 17851 31792 28595 10524 6129 5805 7341 28486 12661 -3553
12994c553o527J0913j7816Q138M996o815k4472K1939J6066l4104k8011P628M9919
$$ -3553 -10080 833 -16983 -8845 -3849 -10664 -35136 -13197 2869 -31235 -59246 -51618 -1699
12981a699M5218M238O280l83J0570j0006l6156l210J928j3217J6096k00j1471
$$ -1699 43519 47757 54037 53654 64224 54218 18062 14852 16780 3563 19659 19459 7988
12968G988M721N500o625K2228L214J5939k7004j7304M214K493j2916J4181o111
$$ 7988 12709 18209 11584 33812 37026 52965 25961 8657 12871 15364 2448 16629 10518
12955A0518j7072Q95P652j7005J7038J3934j3946k3045j4454J9264K9407o331
$$ 10518 -6554 -5659 1993 -15012 2026 15960 2014 -21031 -35485 -16221 13186 6855
12943F855j6034M231J4970k1656j5778l135K0837L3524K1489J015k1725j7539
$$ 6855 -9179 -4948 10022 -11634 -27412 -30547 -9710 23814 45303 46318 24593 7054
12931G054J3526M206k0502j9172K9920m1620p775K0351J7777L7093O468p451j4385
$$ 7054 20580 24786 4284 -14888 15032 -26588 -34363 -14012 3765 40858 47326 39875 25490
12918B5490k5020k676j1204M435k1235l909K077J4827L1956R959j6823j0978n969
$$ 25490 470 -2206 -13410 -8975 -30210 -34119 -32042 -17215 14741 24700 7877 -3101 -9070
12905i070J7979r156n936K1460K2862j971l6299m585k4263n272R763K9261l046
$$ -9070 8909 -247 -6183 15277 38139 36168 -131 -4716 -28979 -34251 -24488 4773 1727
12892A727r646o759l095r013J5018K2629p832N635l046K096p778j1552k0540p70
$$ 1727 -7919 -14678 -17773 -26786 -11768 10861 3029 8664 5618 7714 -64 -11616 -32156 -32926
12878c2926K6763L6343J2791l3205k9559j4316J7545L0022N812k5474P148l001
$$ -32926 -6163 30180 42971 9766 -19793 -34109 -16564 13458 19270 -6204 944 -2057
12866b057k0289J622K063J2341K3292q374k5087j8670l434j1944J0226J1076J0395
$$ -2057 -22346 -20724 -18661 -6320 16972 8598 -16489 -35159 -38593 -50537 -40311 -29235 -18840
12853a8840Q010K5953r597j4436P358P093M097j4988j1403J5187J4714M584r832
$$ -18840 -10830 15123 5526 -8910 -1552 5541 9638 -5350 -16753 -1566 13148 17732 7900
12840G900j4876J592n593R232M064Q117K0822P75j9995N208r219l9329K3253L131
$$ 7900 -6976 -5384 -10977 -1745 2319 10436 31258 32033 12038 17246 8027 -31302 -8049 -4918
12826d918N535Q066Q981l5019j2004q095K3257K5426j0335l0589J1249M88J766
$$ -4918 617 8683 17664 -17355 -29359 -37454 -14197 11229 894 -29695 -18446 -17958 -16192
12813a6192O948j1959J4143K0957k7164J0085j616J3456K335j2513k5096L385
$$ -16192 -9244 -21203 -7060 13897 -13267 -3182 -4798 8658 10993 -1520 -26616 -23231
12801b3231K6737L1152l35j2371m504k0005l443J2404k902K58N137M080Q557K2080
$$ -23231 3506 34658 34323 21952 17448 -2557 -6000 6404 3502 3760 8897 12977 21534 43614
12787D3614K3274k5997k3482j9162J9912J949k1265N111M741j6596J1133J9755
$$ 43614 66888 40891 17409 -1753 18159 20108 -1157 3954 8695 -7901 3232 22987
12775B2987l0550J4340M672J3597O991j7202o942J8382j4256k4551L525N530l031
$$ 22987 -7563 6777 11449 25046 32037 14835 7893 26275 12019 -12532 -9007 -3477 -6508
12762f508J5418M675j6586n685O331Q32J2606R73j748j6567q162q017Q146N624
$$ -6508 8910 13585 -3001 -8686 -2355 -1523 11083 12056 10308 -6259 -14421 -22438 -14292 -8668
12748h668J8801r971J609J8471k5231j9849j0896J410J7782K4631n976k317j8843
$$ -8668 10133 162 1771 20242 -4989 -24838 -35734 -34324 -16542 8089 2113 -204 -19047
12735a9047j9038K6784J7943P283j8894l553M413j7713k3019L655K0155K4653
$$ -19047 -38085 -11301 6642 13925 -4969 -8522 -4109 -21822 -44841 -41186 -21031 3622
12723C622k5317k704J3500J5582j4293J2446K2196O081K1928K47k0442k4474l8678
$$ 3622 -21695 -24399 -10899 4683 -9610 2836 25032 31113 53041 53288 32846 8372 -30306
12710c0306j7125K5922l842k4530K3868J1915j1775p140k8353q070K4655N353
$$ -30306 -47431 -21509 -25351 -49881 -26013 -14098 -25873 -33013 -61366 -69436 -44781 -39428
12698c9428K5648J9521R688k640k2287k1291J3778j0129K2759J1191k4360R130
$$ -39428 -13780 5741 15429 12789 -9498 -30789 -17011 -27140 -4381 6810 -17550 -8420
12686h420K272l427m048P652r464p854J0846J4519n307J279K0886J215J056k9850
$$ -8420 -6148 -9575 -13623 -5971 -15435 -23289 -12443 2076 -3231 -1952 18934 20149 21205 -8645
12672h645j4022l855J6741L695j8485Q878K7023j2726j1639J0716q811O856J3308
$$ -8645 -22667 -26522 -9781 -6086 -24571 -15693 11330 -1396 -13035 -2319 -11130 -4274 9034
12659I034Q835j766K1135J4292k3355J507m864k7621k6159J1248K4596J6315q228
$$ 9034 17869 16103 37238 51530 28175 29682 24818 -2803 -28962 -17714 6882 23197 14969
12646A4969k6468j9244m44j0435K7888j5052J831L9783l9408k2459k0878P338
$$ 14969 -11499 -30743 -31187 -41622 -13734 -28786 -26955 12828 -26580 -49039 -69917 -62579
12634f2579K7500J3164L261j3615p457J2464L588j9738j2478K9553J5378J6908
$$ -62579 -35079 -21915 -18654 -32269 -39726 -27262 -23674 -43412 -55890 -26337 -10959 5949
12622E949j10m6175m346K3971K4624j1052J4373N930L324k214L515j3858J4702
$$ 5949 5839 -40336 -44682 -20711 3913 -7139 7234 13164 16488 14274 17789 3931 18633
12609A8633M4245l905k4540j1646o682r24n130J4232M144M5201j0636k8561r774
$$ 18633 62878 58973 34433 22787 16105 15181 10051 24283 28427 73628 62992 34431 24657
12596B4657j9667o369R354k479J0125J6236K0654r936j7033J0641k4448k0753
$$ 24657 4990 -1379 7975 5496 15621 31857 52511 42575 25542 36183 11735 -9018
12584i018O747m825j6410p059k2334j6954K2846K7544J2300r369q518k00K0643
$$ -9018 -2271 -7096 -23506 -30565 -52899 -69853 -47007 -19463 -7163 -16532 -25050 -25250 -4607
12571d607j224p066K3688m335j3457M927k2434j8521L8567L8518p293m934n151
$$ -4607 -5831 -12897 10791 6456 -7001 -2074 -24508 -43029 -4462 34056 26763 21829 16678
12558A6678j7498q874J8146L0318l2165o988n04J3795R616r397K3097J0455R183
$$ 16678 -820 -9694 8452 38770 6605 -383 -887 12908 22524 13127 36224 46679 55862
12545E5862j124j6019j8005p764k8040j2370R223J9389J6092j6346J0701l636
$$ 55862 54738 38719 20714 12950 -15090 -27460 -18237 1152 17244 898 11599 7963
12533G963k4358N330o851k3010Q702K7788K3621r534j1438n287k196K3796k0347
$$ 7963 -16395 -11065 -17916 -40926 -32224 -4436 19185 9651 -1787 -7074 -9270 14526 -5821
12520e821j2225J0594J4022o31j3845j3831J3673j7467j1962J3132J7870Q459
$$ -5821 -18046 -7452 6570 5939 -7906 -21737 -8064 -25531 -37493 -24361 -6491 1968
12508A968J2103L0961J5262j7556K4626J7650j6314k4248l4226j0804l970p154
$$ 1968 14071 45032 60294 42738 67364 85014 68700 44452 10226 -578 -4548 -11702
12496a1702J5340K9129K0228j159l1854r15m834J2659Q44k0859j6787l984L335
$$ -11702 3638 32767 52995 51836 19982 19067 14233 26892 27736 6877 -9910 -13894 -10559
12483a0559j4593j0253p557J7459J814j1780l189K2174J4681J3013p505k298j7226
$$ -10559 -25152 -35405 -42962 -25503 -23689 -35469 -38658 -16484 -1803 11210 3705 1407 -15819
12470a5819J2553O61n602j7581l48J1573J1692K3996K6495J8173K0409n036k7432
$$ -15819 -3266 -2605 -8207 -25788 -26136 -14563 -2871 21125 47620 65793 86202 81166 53734
12457E3734j2719K176l066p128J8593R292m6831k0389L0051J8956R665j7627J4656
$$ 53734 41015 43191 40125 32997 51590 60882 14051 -6338 23713 42669 52334 34707 49363
12444D9363J4830j3735R39j2698r671q695j4808j4031j5684n129N097J9678P295
$$ 49363 64193 50458 51397 38699 29028 20333 5525 -8506 -24190 -29319 -24222 -4544 2751
12431B751r90P439J4146j5608r724J4429n740K692K628k9453o272J2563N4m394
$$ 2751 1761 9200 23346 7738 -1986 12443 6703 9395 12023 -17430 -23702 -11139 -11085 -15479
12417a5479N219k5259r048L4896K5254O707K136q787L175j2248j254n316J802
$$ -15479 -10260 -35519 -44567 -9671 15583 22290 24426 15639 18814 6566 5312 -4 1798
12404A798k4063l4546K7364J5185K472k1629L385O56J5763L0615L615k028j7150
$$ 1798 -22265 -56811 -29447 -14262 -11790 -33419 -30034 -29378 -13615 17000 20615 18587 1437
12391A437J020j0413j1103K9065J7277j474m1040O112j4696k3081K0010K3494
$$ 1437 2457 -7956 -19059 10006 27283 25809 -15231 -9119 -23815 -46896 -26886 -3392
12379c392J0853j6425j1400R677J7198J7735K6973j1138k9512j5386L889L0229
$$ -3392 7461 -8964 -20364 -10687 6511 24246 51219 40081 10569 -4817 -928 29301
12367B9301l5509l6027Q460J0304J1898J5214K2109J4464k0301k3500l5177J4739
$$ 29301 -6208 -42235 -33775 -23471 -11573 3641 25750 40214 19913 -3587 -38764 -24025
12355b4025P982K1793P762j7348j4045K740J4504J7846K9881M415R691j528J2088
$$ -24025 -16043 5750 13512 -3836 -17881 -15141 -637 17209 47090 51505 61196 59668 71756
12342G1756j1679k0426o776k0286k7211L001j7355p409K696J5119p966m663n152
$$ 71756 60077 39651 32875 12589 -14622 -11621 -28976 -36385 -33689 -18570 -26536 -31199 -36351
12329c6351J4974K1388J0498N196O932L4083j0526l5600p659K951j0037j9199
$$ -36351 -21377 11 10509 15705 22637 56720 46194 10594 2935 5886 -4151 -23350
12317b3350J2226J0711J2850l9668l1089N383J1731K8318J7600l523L811k800
$$ -23350 -11124 -413 12437 -27231 -58320 -52937 -41206 -12888 4712 1189 5000 2200
12305B200Q195l652k531L3338k701Q52J330l3365j0772J402j6373k62R646J506
$$ 2200 10395 6743 4212 37550 34849 35701 37031 3666 -7106 -5704 -22077 -22339 -12693 -11187
12291a1187J6813K2739l660k3856M733J323k787J0204J4712K85k4468k2418P560
$$ -11187 5626 28365 24705 849 5582 6905 4118 14322 29034 29319 4851 -17567 -10007
12278a0007L8029O367j5888l4933o883N344k94o666K636N899m830j9371j2013
$$ -10007 28022 34389 18501 -16432 -23315 -17971 -18265 -24931 -22295 -16396 -21226 -40597 -52610
12265e2610K631K1486J0303J8547J7949m50k0087l338k8468N180M0694P660M858
$$ -52610 -49979 -28493 -18190 357 18306 17856 -2231 -5569 -34037 -28857 11837 19497 24355
12252B4355k4833k0925q241J0788N415J6516j2187j3788p276K251K3060n145n399
$$ 24355 -478 -21403 -29644 -18856 -13441 3075 -9112 -22900 -30176 -27925 -4865 -10010 -15409
12239a5409J4657J3009n795j7850J1716Q151P772n88j9956l792K570Q776J252
$$ -15409 -752 12257 6462 -11388 328 8479 16251 15663 -4293 -8085 -5515 3261 4513
12226D513P947j8147n383P822O119J1644j0028p048N639k67P949J1530k0234J209
$$ 4513 12460 -5687 -11070 -3248 2871 14515 4487 -2561 3078 2811 10760 22290 2056 3265
12212C265j1136j7760l7866J5589K4769M477k419J6393R905n815q948l6276j2900
$$ 3265 -7871 -25631 -63497 -47908 -23139 -18662 -21081 -4688 5217 -598 -9546 -45822 -58722
12199e8722J3652J8741l403J1528P742q423K5397q487k254Q902k1482o425O59
$$ -58722 -45070 -26329 -29732 -18204 -10462 -18885 6512 -1975 -4229 4673 -16809 -23234 -22575
12186b2575q304J3912m698k489j051J1584M53M580M475L4508q316l3072j2355
$$ -22575 -30879 -16967 -21665 -24154 -25205 -13621 -13168 -8588 -4113 30395 22079 -10993 -23348
12173b3348K3246L0829J9064m253k860n879j2983j7158j4370j719m938J5226J8694
$$ -23348 -102 30727 49791 45538 42678 36799 23816 6658 -7712 -9431 -14369 857 19551
12160A9551k8913L8q918J4003K4170J2218k063k9910j7880R063L4300j7912M368
$$ 19551 -9362 -9324 -18242 -4239 19931 32149 30086 176 -17704 -8641 25659 7747 12115
12147A2115M8419J0851k0213j0965l477O013j3551r554J1132k3168j7969l4517
$$ 12115 60534 71385 51172 40207 36730 42743 29192 19638 30770 7602 -10367 -44884
12135d4884k2286K1550L8991N701J75J9385n358j7995l1071j335K9456j7986n240
$$ -44884 -67170 -45620 -6629 -928 -753 18632 13274 -4721 -35792 -37127 -7671 -25657 -30897
12122c0897Q486j9355K59l666k506o175n450K5239K4362j425J3423j5509L988
$$ -30897 -22411 -41766 -41507 -45173 -47679 -53854 -59304 -34065 -9703 -11128 2295 -13214 -9226
12109i226J9720K927K3708j9942l9469R463L2385J6212k6366k587q018J0535j01
$$ -9226 10494 13421 37129 17187 -22282 -12819 19566 35778 9412 6825 -1193 9342 9241
12096I241J0049q325k5087r243r265q933M689J4359O074M955J1049J6623k8472
$$ 9241 19290 10965 -14122 -23365 -32630 -41563 -36874 -22515 -16441 -11486 -437 16186 -12286
12083a2286j228J6132j2296N476J5236o069K5555j8597j7765K0665J5973K450
$$ -12286 -13514 2618 -9678 -4202 11034 4965 30520 11923 -5842 14823 30796 33246
12071C3246J0697L732k2019l5558O814L638K0470J958j7528m893M1027K3171J028
$$ 33246 43943 47675 25656 -9902 -3088 550 21020 22978 5450 557 41584 64755 65783
12058F5783L859r867j1503m1037m2372R008K0031J4835J77k1596m023L2516L222
$$ 65783 69642 59775 48272 7235 -35137 -26129 -6098 8737 8914 -12682 -16705 15811 19033
12045A9033j8548j6769k0314J4317j7057j06M8531K2906p077m6948N411L9591
$$ 19033 485 -16284 -36598 -22281 -39338 -39444 9087 31993 24916 -22032 -16621 22970
12033B2970p213k825J876l2405l0165K7J4413K3343r992k2523M508J327J7319
$$ 22970 15757 12932 14808 -17597 -47762 -47735 -33322 -9979 -19971 -42494 -37986 -36659 -19340
12020a9340L0413K9885m101r122j8052j9591N688K3131J6736r364j8285q921J5421
$$ -19340 11073 40958 36857 27735 9683 -9908 -4220 18911 35647 26283 7998 -923 14498
12007A4498K1182l081j1729j2944j6441J8798J620J0450K3714J053j5803j144
$$ 14498 35680 32599 20870 7926 -8515 10283 11903 22353 46067 47120 31317 30173
11995C0173k6912l7208o327p736l586J3537J5967q194J1203K125l936k2031Q289
$$ 30173 3261 -33947 -40274 -48010 -51596 -38059 -22092 -30286 -19083 -16958 -20894 -42925 -34636
11982c4636M1455L1226O438j7606K37p800j1709J1867N133J9041k592j6201J2593
$$ -34636 6819 38045 44483 26877 27114 19314 7605 19472 24605 43646 41054 24853 37446
11969C7446k50n244j6662j9095q451n900m729J5612K4404N399l0524K073K3632
$$ 37446 37196 31952 15290 -3805 -12256 -18156 -22885 -7273 17131 22530 -7994 -5921 17711
11956A7711j333K5486J6947k0940j3421k0376k5733J4961J4585P071o334l051
$$ 17711 16378 41864 58811 37871 24450 4074 -21659 -6698 7887 14958 8624 5573
11944E573j5199J6213J516j7952R006R360j2505q480k166K6313J7542o502p018
$$ 5573 -9626 6587 8103 -9849 -843 8517 -3988 -12468 -14634 11679 29221 22719 15701
11931A5701k9332m504j2271N413p90J2591J6729K084L530j3570L43J3015M96J8003
$$ 15701 -13631 -18135 -30406 -24993 -25783 -13192 3537 5621 9151 -4419 -4076 8939 9435 27438
11917B7438L001r379l0539O235k6621R009K4126J9107J905j9868l212L636j4247
$$ 27438 30439 21060 -9479 -3244 -29865 -20856 3270 22377 24282 4414 1202 4838 -9409
11904i409j5104N280J1012j2850J9857J36o541k0521R312L7367J5632j3899j799
$$ -9409 -24513 -19233 -8221 -21071 -1214 -1078 -7619 -28140 -18828 18539 34171 20272 18473
11891A8473J7877K2652k029j8195m4347n4466j5427L9074K0587j660K866P334
$$ 18473 36350 59002 56973 38778 -5569 -60035 -75462 -36388 -15801 -17461 -14595 -7261
11879g261j7910O496K191J3424p300p77J1583J6377j2754J1004J0129o697k1587
$$ -7261 -25171 -18675 -16484 -3060 -10360 -11137 446 16823 4069 15073 25202 18505 -3082
11866c082P438J7399n020M665Q747K3004m915k8916r735j1130j2567J250J2866
$$ -3082 4356 21755 16735 21400 30147 53151 48236 19320 9585 -1545 -14112 -12862 4
11853DO626k494J4012O155j9486l1906J3232J8945K951k1011j3464m903O621M388
$$ 4 6630 4136 18148 24303 4817 -27089 -13857 5088 8039 -12972 -26436 -31339 -24718 -20330
11839b0330K6200L885J1700M6883J4144j3556l6998K192k456q144j7115J536k2816
$$ -20330 5870 9755 21455 68338 82482 68926 31928 34120 31664 23520 6405 7941 -14875
11826a4875j1484j7795R903K8755L7322l758l894q132k1425M824K2074k2031N904
$$ -14875 -26359 -44154 -34251 -5496 31826 28068 24174 16042 -5383 -559 21515 -516 5388
11813E388K6611K322l31q857j2197j3211j781J9659K627m231m114k584n133j5029
$$ 5388 31999 34321 33990 25133 12936 -275 -2056 17603 20230 15999 11885 9301 4168 -10861
11799a0861l3292n792L0069Q632j3337L60K4898J5995m960j7612j417J4005p758
$$ -10861 -44153 -49945 -19876 -11244 -24581 -24221 677 16672 11712 -5900 -7317 6688 -1070
11786a070K1666L0639j7025j9627n825J1181r916j0794l4879M014M645P48p62
$$ -1070 20596 51235 34210 14583 8758 19939 10023 -771 -35650 -31636 -26991 -26243 -27005
11773b7005M1842j8303j3603M99k5444j5024J9101K2822l739j0289J3484J9391
$$ -27005 14837 -3466 -17069 -16570 -42014 -57038 -37937 -15115 -18854 -29143 -15659 3732
11761C732j4562Q591m714l3513m480J2671J6479K2363j3788J5826K6845k1790
$$ 3732 -10830 -2239 -6953 -40466 -44946 -32275 -15796 6567 -7221 8605 35450 13660
11749A3660l5363k8003m473K565K1798K3006K7024j7866l1539p26K1645J5051
$$ 13660 -21703 -49706 -54179 -51614 -29816 -6810 20214 2348 -29191 -29917 -8272 6779
11737F779j6509j9332p74K913N488M536J2164K2699m882l9199K2752P762j2264
$$ 6779 -9730 -29062 -29836 -26923 -21435 -16899 -4735 17964 13082 -26117 -3365 4397 -7867
11724g867j1827J454J2235o213k2290J1902k257K736L2174J9627O177r47K842
$$ -7867 -19694 -18240 -6005 -12218 -34508 -22606 -24863 -22127 10047 29674 35851 34904 37746
11711C7746o44k4438J362O927j241j426Q75J4111j7919j5595K0432j835J658J1743
$$ 37746 37102 12664 14026 20953 19712 18286 19161 33272 15353 -242 20190 18355 20013 31756
11697C1756r543k4964O888l7001J3682K1655j2960K537j1811l245l6415N904j0075
$$ 31756 22213 -2751 4137 -32864 -19182 2473 -10487 -7950 -19761 -23006 -59421 -53517 -63592
11684f3592J912O068K5966J0181K1982l269j0966n091M608J4008K6189K0765j1179
$$ -63592 -61680 -55612 -29646 -19465 2517 -752 -11718 -16809 -12201 1807 27996 48761 37582
11671C7582n866p843j5201J7936J9266Q128k275p517k3623l6919o248J1827k5033
$$ 37582 31716 23873 8672 26608 45874 54002 51727 44210 20587 -16332 -22580 -10753 -35786
11658c5786p09k035K0280Q279k9202j7999N725L1135K8356M98j8966J1010k8752
$$ -35786 -36495 -38530 -18250 -9971 -39173 -57172 -51447 -20312 8044 8542 -10424 586 -28166
11645b8166l120K2401J7891Q994J036l240l013j2298p076r614J6340K8731J5214
$$ -28166 -31286 -8885 9006 18000 19036 15796 12783 485 -6591 -16205 135 28866 44080
11632D4080M045k1297m0428r545N149K607N975J1123K9089J5915m95l2931J0835
$$ 44080 48125 26828 -13600 -23145 -17996 -15389 -9414 1709 30798 46713 46218 13287 24122
11619B4122K6562K2457K099k2285k440q455Q892p224j1543j6949j5682r352J8362
$$ 24122 50684 73141 75240 52955 50515 42060 50952 43728 32185 15236 -446 -9798 8564
11606H564J2613j7865j6121j5241J2703j553p977p343K305J4244P900L6262K7051
$$ 8564 21177 3312 -12809 -28050 -15347 -16900 -24877 -32220 -29915 -15671 -7771 28491 55542
11593E5542l2015k4863q687L7274L0612L03k6180k5421L594j308j6231Q647k6784
$$ 55542 23527 -1336 -10023 27251 57863 58166 31986 6565 10159 8851 -7380 1267 -25517
11580b5517r29K631J3021l181J6049K1949q151J1374K1165K1007N268K3613m1654
$$ -25517 -26446 -23815 -10794 -13975 2074 24023 15872 27246 48411 69418 74686 98299 56645
11567E6645l4967j3430k9547l4170O191L7673J6520Q314j8328k1518K5267L380
$$ 56645 21678 8248 -21299 -55469 -49278 -11605 4915 13229 -5099 -26617 -1350 2030
11555B030J2163j3692J1334M200k9020O089M0582j1469p553k8328k8716j2551
$$ 2030 14193 501 11835 16035 -12985 -6896 33686 22217 14664 -13664 -42380 -54931
11543e4931M6803J6630k5181J679k4903N611M285K2569m190k0089k7355J5999
$$ -54931 -8128 8502 -16679 -15000 -39903 -34292 -30007 -7438 -11628 -31717 -59072 -43073
11531d3073J5144K3709k0306m4710j0207K2933K6771K6413q575K689r783k2351
$$ -43073 -27929 -4220 -24526 -69236 -79443 -56510 -29739 -3326 -11901 -9212 -18995 -41346
11519d1346J2208J7323j5966O388M0514J9498O095q182n821j9076L334j2810k557
$$ -41346 -29138 -11815 -27781 -21393 19121 38619 44714 36532 30711 11635 14969 2159 -398
11506c98J8786m365j4952k1936j4505M817J4410J3404J2687O18l6787k345J4698
$$ -398 18388 14023 -929 -22865 -37370 -32553 -18143 -4739 7948 8566 -28221 -30566 -15868
11493a5868j4858J9154Q536N956K7720p56k9495n004J7762J3107k2761j682j0701
$$ -15868 -30726 -11572 -3036 2920 30640 29884 389 -4615 13147 26254 3493 1811 -8890
11480h890l5781K6750J5475o224o799J0245j5466L1156k336j7890L621j406N3
$$ -8890 -44671 -17921 -2446 -8670 -15469 -5224 -20690 10466 8130 -9760 -6139 -7545 -7492
11467g492j2451J8120R604L5819l030k1077j9454l611j4292j4821J6188K7659
$$ -7492 -19943 -1823 7781 43600 40570 19493 39 -3572 -17864 -32685 -16497 11162
11455A1162K0205k0327l3953k5360J3090L6345K4871K1768k4630j1710O295R061
$$ 11162 31367 11040 -22913 -48273 -35183 1162 26033 47801 23171 11461 17756 26817
11443B6817j9655r131j6919M228J7265j2815k5181J8957L9312J904J883m0822
$$ 26817 7162 -1969 -18888 -14660 2605 -10210 -35391 -16434 22878 24782 26665 -14157
11431a4157n258j3789o840l095K0461Q92k968M1285K3571k4933K5642m796j2623
$$ -14157 -19415 -33204 -40044 -43139 -22678 -21786 -24754 16531 40102 15169 40811 36015 23392
11418B3392J1622L6848L6748p511j7093L138r135j4406j7264l6115k7686j3540
$$ 23392 35014 71862 108610 101099 84006 87144 78009 63603 46339 10224 -17462 -31002
11406c1002k4496k408L0941K844j3923M411J8361P466j3751M217O273J3024Q053
$$ -31002 -55498 -57906 -26965 -24121 -38044 -33633 -15272 -7806 -21557 -17340 -11067 1957 10010
11393A0010J1510N229O230p090j0458k9786O080L72N658j7359L531Q141m580K1482
$$ 10010 21520 26749 32979 25889 15431 -14355 -8275 -7903 -2245 -19604 -16073 -7932 -12512 8970
11379H970K1389K7702J0125k6912q251p212k492k7778J8413L824k0186o540K5493
$$ 8970 30359 58061 68186 41274 33023 25811 23319 -4459 13954 17778 -2408 -8948 16545
11366A6545J5849N225k3265K3653J3031l5102k4848j7656Q338L195J0349J5403
$$ 16545 32394 37619 14354 38007 51038 15936 -8912 -26568 -18230 -15035 -4686 10717
11354A0717j690o156J64k411J7995M315l2859j3224J0198P789l467L120J048o912
$$ 10717 9027 2871 3035 624 18619 22934 -9925 -23149 -12951 -5162 -8629 -5509 -4461 -11373
11340a1373n206L7994M588j4602k5205j1322j0609K4879M44m288R882K294j0290
$$ -11373 -16579 21415 26003 11401 -13804 -25126 -35735 -10856 -10412 -14700 -4818 -2524 -12814
11327a2814o473J2581M574m085l62k3613n597L3945M88o774j8963K3889K1903
$$ -12814 -19287 -6706 -2132 -6217 -6579 -30192 -35789 -1844 -1356 -8130 -27093 -3204 18699
11314A8699r769l825L843k1742J8163j9170j2326q314j941P87n757j1157J1149
$$ 18699 8930 5105 8948 -12794 5369 -13801 -26127 -34441 -36382 -35595 -41352 -52509 -41360
11301d1360p355l857O514J4460R205P825o03M374j8710j7384M243L9566J6688
$$ -41360 -48715 -52572 -46058 -31598 -22393 -14568 -15171 -10797 -29507 -46891 -42648 -3082 13606
11288A3606J2630R286k8100j2265k1590L012r19R573J6634l079k58j4321K3802
$$ 13606 26236 35522 7422 -4843 -26433 -23421 -24340 -14767 1867 -1212 -1470 -15791 8011
11275H011k253j5872M105q409r186j9256J2183P296j5425J836J2934K2131L5181
$$ 8011 5758 -10114 -6009 -14418 -23604 -42860 -30677 -23381 -38806 -36970 -24036 -1905 33276
11262C3276N163n455l736n209j0240L116J7146R32k2372k6335j0647J7388k310
$$ 33276 38439 32984 29248 24039 13799 16915 34061 34993 12621 -13714 -24361 -6973 -9283
11249i283j2173n080j1074J5035n967M470J4833P261j1883l1202j0909K8492l958
$$ -9283 -21456 -26536 -37610 -22575 -28542 -24072 -9239 -1978 -13861 -45063 -55972 -27480 -31438
11236c1438M048p580j2526P425Q331J4417J1300K2645k7659l8400L7656L2690
$$ -31438 -27390 -34970 -47496 -40071 -31740 -17323 -6023 16622 -11037 -49437 -11781 20909
11224B0909j8026o383M856J0637L669k5294k8681j16K0317K4234J719k0005q213
$$ 20909 2883 -3500 1356 11993 15662 -9632 -38313 -38429 -18112 6122 7841 -12164 -20377
11211b0377j1710K869J0532o043j920K136K4971J175j70Q261K1331P803j8339
$$ -20377 -32087 -29218 -18686 -24729 -26649 -24513 458 1633 1463 9724 31055 38858 20519
11198B0519l324j816k0231l946J6493l3384k1149j080K5872K1990P412P841O183
$$ 20519 17195 15379 -4852 -8798 7695 -25689 -46838 -47918 -22046 -56 7356 15197 21380
11185B1380p546N192r792q669K0128R859L241K269p562p627J2803m501l2673k1643
$$ 21380 13834 19026 9234 565 20693 30552 33793 36062 28500 20873 33676 29175 -3498 -25141
11171b5141J0595o771j5634j1418K0944J3769o652J7247J7097k132J837o708M008
$$ -25141 -14546 -21317 -36951 -48369 -27425 -13656 -20308 -3061 14036 11904 13741 7033 11041
11158A1041j7282M18j9982j5940p239K1915K0272j1117J3817J4304P225j9232
$$ 11041 -6241 -5823 -25805 -41745 -48984 -27069 -6797 -17914 -4097 10207 17432 -1800
11146a800O174K4280J7980j144m134L846r422k6312j1515j7922j3402J2737K2020
$$ -1800 4374 28654 46634 45490 41356 45202 35780 9468 -2047 -19969 -33371 -20634 1386
11133A386K4681J2708j8775p845J0406N295R608m839j4783j089q611M006m0245
$$ 1386 26067 38775 20000 12155 22561 27856 37464 32625 17842 16753 8142 12148 -28097
11120b8097n044Q868M84J8993J5211J9387J2941j7553j3340K393M305L426o754
$$ -28097 -33141 -24273 -23789 -4796 10415 29802 42743 25190 11850 14243 18548 21974 15220
11107A5220k8234K6408J1375k2622Q0k3517l3184k770p450j6656J9565O682n788
$$ 15220 -13014 13394 24769 2147 2227 -21290 -54474 -57244 -64694 -81350 -61785 -55103 -60891
11094f0891K6719o115K8240R616K4060q0l4344k6479n228L6090P590k6313j2756
$$ -60891 -34172 -40287 -12047 -2431 21629 21549 -12795 -39274 -44502 -8412 -822 -27135 -39891
11081c9891P903O159j4297k22r555J1233J1502p041o358K2538J7219q679R35N334
$$ -39891 -31988 -25829 -40126 -40348 -49903 -38670 -27168 -34209 -40567 -18029 -810 -9489 -8554 -3220
11067c220P864k3181k829O117J7519K1463l7522j9336j4985M9947K0592k0702
$$ -3220 4644 -18537 -21366 -15249 2270 23733 -13789 -33125 -48110 1837 22429 1727
11055A727k0277j0902K360j7445K0719L5426m23j9277r588K781K038K5684J4091
$$ 1727 -18550 -29452 -27092 -44537 -23818 11608 11185 -8092 -17680 -14899 -12861 12823 26914
11042B6914J571l3049k5151R272M1960J8448M936J8120j4927j4877l646k8543
$$ 26914 28485 -4564 -29715 -20443 21517 39965 44901 63021 48094 33217 29571 1028
11030A028n1064j3093O731M7404K6078K5381k6627k5530q928N110K0279j5423
$$ 1028 -50036 -63129 -56398 -8994 17084 42465 15838 -9692 -18620 -13510 6769 -8654
11018h654k23L2172J6184K331j4435P404j333j5174l4743r193K825R455K274M036
$$ -8654 -8877 23295 39479 41810 27375 34779 33446 18272 -16471 -25664 -22839 -13384 -11110 -7074
11004g074K0239Q588n972P42M902q159o649k282k1821L507L2785K9165k8179l2409
$$ -7074 13165 21753 15781 16523 21425 13266 6617 4335 -17486 -13979 18806 47971 19792 -12617
10990a2617K7370m804k1291J9345K3700r028l156J0281L6134j3069N55p295l0605
$$ -12617 14753 9949 -11342 8003 31703 22675 19519 29800 65934 52865 53420 46125 15520
10977A5520R609j1869P018q135j3631J1215J8928j3329k3492k3400j1153L6305
$$ 15520 25129 13260 20278 12143 -1488 9727 28655 15326 -8166 -31566 -42719 -6414
10965f414J6677n230k814O690L858j1695k0809J402j7635K0983K6732J3290r746
$$ -6414 10263 5033 2219 8909 12767 1072 -19737 -18335 -35970 -14987 11745 25035 15289
10952A5289P546J3905l0385l1912L6238K4251q786m1824J1001N077j1437K1728
$$ 15289 22835 36740 6355 -25557 10681 34932 26146 -15678 -4677 400 -11037 10691
10940A0691O79q159J4299J352n377j324j6838L757J9157J3178L874L284K57l0963
$$ 10691 11370 3211 17510 18862 13485 12161 -4677 -920 18237 31415 35289 38573 38830 7867
10926G867j4297n016m891o022n633J3718R816J9758l688l5067r32j8136r478J4903
$$ 7867 -6430 -11446 -16337 -22359 -27992 -14274 -4458 15300 11612 -23455 -24387 -42523 -52001 -37098
10912c7098J3814P147L1021r47J1556N449m318k8825j1724L701J8639o762j1083
$$ -37098 -23284 -16137 14884 13937 25493 30942 26624 -2201 -13925 -10224 8415 1653 -9430
10899i430j0233P627P4L859l80j1850k261j8962k2705K5114K4357M871J578N104
$$ -9430 -19663 -12036 -11962 -8103 -8483 -20333 -22594 -41556 -64261 -39147 -14790 -9919 -8341 -3237
10885c237J1245j0522j095J143P987J8878j8117j1958l3332P152J7787K7710J292
$$ -3237 8008 -2514 -3609 -2466 5521 24399 6282 -5676 -39008 -31856 -14069 13641 14933
10872A4933N191J0891J0728k189j4939j4792r753l847J7702N779M301N5M730k6656
$$ 14933 20124 31015 41743 39554 24615 9823 70 -3777 13925 19704 24005 24060 28790 2134
10858B134j6474K500Q582K2200r859k5793J1062J9922n201O74j032R094O036N716
$$ 2134 -14340 -11840 -3258 18942 9083 -16710 -5648 14274 9073 9747 8715 17809 23845 29561
10844B9561J3414J263j0202j7387M981K4751K2400q10j3444j9914J5680K7181
$$ 29561 42975 44238 34036 16649 21630 46381 68781 67971 54527 34613 50293 77474
10832G7474q029o412k6277k0628j0803j5561r161j1724K3897K7981M122l2855
$$ 77474 69445 63033 36756 16128 5325 -10236 -19397 -31121 -7224 20757 24879 -7976
10820g976n449K5559J0572j3849j1538J2094O789k405j2968l717J7062J0876k056
$$ -7976 -13425 12134 22706 8857 -2681 9413 16202 13797 829 -2888 14174 25050 22994
10807B2994J437M94j1791k8124r197J8083J2868j1710P917L1594K2821j4514k8810
$$ 22994 24431 24925 13134 -14990 -24187 -6104 6764 -4946 2971 34565 57386 42872 14062
10794A4062K702J0010J0975K6697k1300j2053j7293J2638L4822O236k8747n419
$$ 14062 16764 26774 37749 64446 43146 31093 13800 26438 61260 67496 38749 33330
10782C3330l213j1471q452o876j9537l1546J2436L502j5500k638J2768n649K2173
$$ 33330 30117 18646 10194 3318 -16219 -47765 -35329 -31827 -47327 -49965 -37197 -42846 -20673
10769b0673j0936k0200K1774P846k3040P421L5370J3521K1007j651M512l2661
$$ -20673 -31609 -51809 -30035 -22189 -45229 -37808 -2438 11083 32090 30439 34951 2290
10757B290m6056m198J9502P986J6193L016j2552r414J9197J3409l197k1081l395
$$ 2290 -43766 -47964 -28462 -20476 -4283 -1267 -13819 -23233 -4036 9373 6176 -14905 -18300
10744a8300M374j254j0453m5J3417K41k358m171q359J0500k0125n82L038r156
$$ -18300 -13926 -15180 -25633 -25678 -12261 -12020 -14378 -18549 -26908 -16408 -36533 -37115 -34077 -43233
10730d3233J5318K860K2425K0473l50n537j6241L803k1688j8610j26K6187J3744
$$ -43233 -27915 -25055 -2630 17843 17493 11956 -4285 -482 -22170 -40780 -40906 -14719 -975
10717i75J4285J0866l6895l335K4954J1470l094M346j1306m416R444K9485n095
$$ -975 13310 24176 -12719 -16054 8900 20370 17276 21622 10316 5900 15344 44829 39734
10704C9734l6933l9651q858j5126J4614J3176J1426Q653J8060M1530Q0m5796l3612
$$ 39734 2801 -36850 -45708 -60834 -46220 -33044 -21618 -12965 5095 46625 46705 909 -32703
10691c2703J3369J0541P188R171l110k4988k3519K5760O495J7268o850k4053m331
$$ -32703 -19334 -8793 -1605 7566 4456 -20532 -44051 -18291 -11796 5472 -1378 -25431 -29762
10678b9762M291J7981K363j5853J137J2477L594K5700j113l6174p152l172R348
$$ -29762 -25471 -7490 -5127 -20980 -19843 -7366 -3772 21928 20815 -15359 -22511 -25683 -16335
10665a6335j4248Q862P262O86o908J6074K3388J3340l0239o429P493J2167K6249
$$ -16335 -30583 -21721 -14459 -13773 -20681 -4607 18781 32121 1882 -4547 2946 15113 41362
10652D1362L932j5772m834L012k0466q044k1221M023J5704J2073K5464n632r712
$$ 41362 45294 29522 24688 27700 7234 -810 -22031 -18008 -2304 9769 35233 29601 19889
10639A9889l860M355R901j1929m20J4540J273k7781k1700l486q975P099P265l214
$$ 19889 16029 20384 30285 18356 17936 32476 33749 5968 -15732 -19218 -28193 -21094 -13829 -17043
10625a7043K4372r21k0468j3165K2482K154j6378r029J9101J6695J77j4605J1511
$$ -17043 7329 6408 -14060 -27225 -4743 -2589 -18967 -27996 -8895 7800 7977 -6628 4883
10612D883K6229k6265l1722L824k2085l946K1845K2652l064p720J6850k1430j2442
$$ 4883 31112 4847 -26875 -23051 -45136 -49082 -27237 -4585 -7649 -15369 1481 -19949 -32391
10599c2391n772r197P080M5494K9840j5781m0257O231K4838j627M703l469k467
$$ -32391 -38163 -47360 -40280 5214 35054 19273 -20984 -14753 10085 8458 13161 9692 7225
10586G225k0977J5387J8651L245k2861j5524k0027J2389N6278L4589l5433k2678
$$ 7225 -13752 1635 20286 23531 670 -14854 -34881 -22492 33786 68375 32942 10264
10574A0264k135O757m025M066J4351L396j0598k3371N60K5009J2042P461n462
$$ 10264 8129 14886 10861 14927 29278 32674 22076 -1295 -735 24274 36316 43777 38315
10561C8315k8382l8764j0207J0764J6622J6750J9126k2543R549K7822j0270l1621
$$ 38315 9933 -28831 -39038 -28274 -11652 5098 24224 1681 11230 39052 28782 -2839
10549b839k1548o28j0839J6196K9005l30Q080l0208J8272J1461j7522m004j0451
$$ -2839 -24387 -25015 -35854 -19658 9347 9017 17097 -13111 5161 16622 -900 -4904 -15355
10536a5355o394L0172Q078j1537k5201j8035j8211M818L2261K9803M854J071M825
$$ -15355 -21749 8423 16501 4964 -20237 -38272 -56483 -51665 -19404 10399 15253 16324 21149
10523B1149j9603m2432m319j1200K1721J9100K3812j8194J122P737J8842o652
$$ 21149 1546 -40886 -45205 -56405 -34684 -15584 8228 -9966 -8844 -1107 17735 11083
10511A1083l4053j0194O2160J2697j4651j349l7683k4640l78O427M180J9036L3029
$$ 11083 -22970 -33164 28996 41693 27042 25693 -11990 -36630 -37008 -30581 -26401 -7365 25664
10498B5664p044o94l044J4483r680j5683l5625P912J897Q781J7223N817r071j6233
$$ 25664 18620 17926 14882 29365 19685 4002 -31623 -23711 -21814 -13033 4190 10007 936 -15297
10484a5297K1161K4933r954k1332l4609J615N926J9752J0785k5333p083J076K9301
$$ -15297 5864 30797 20843 -489 -35098 -33483 -27557 -7805 2980 -22353 -29436 -28360 941
10471I41L5826J6078o378k3721j0085P265J1446k3666k508K3064k9271j8507K8548
$$ 941 36767 52845 46467 22746 12661 19926 31372 7706 5198 28262 -1009 -19516 9032
10458I032P553l0544j3423l461j380J922J2054K439J3445p26n022j613j6213K1974
$$ 9032 16585 -13959 -27382 -30843 -32223 -30301 -18247 -15808 -2363 -3089 -8111 -9724 -25937 -3963
10444c963L1705k4003M575r20Q952k452Q725k5601k169j9228j8255m862p286K9337
$$ -3963 27742 3739 8314 7394 16346 13894 22619 -2982 -5151 -24379 -42634 -47496 -54782 -25445
10430b5445L1788Q264M4262j6079j4891J7139j0059l0253k7132N110J3609P856
$$ -25445 6343 14607 58869 42790 27899 45038 34979 4726 -22406 -17296 -3687 4169
10418D169j3531m582K130J6136k430k154m659k454J0924J965Q772K3398l5093
$$ 4169 -9362 -13944 -11814 4322 1892 -262 -4921 -7375 3549 5514 14286 37684 2591
10405B591k5239N919J9729k819J7602j415j2437J6698l0011P081J4133j109K774
$$ 2591 -22648 -16729 3000 181 17783 16368 3931 20629 -9382 -2301 11832 10723 13497
10392A3497j1472J0264q692j3293R412j7982p836j6449k3580J3106J5533J4425
$$ 13497 2025 12289 3597 -9696 -284 -18266 -26102 -42551 -66131 -53025 -37492 -23067
10380b3067j767J2525K5092J3732o491l788R397m456L455k6255l2542j428K694
$$ -23067 -24834 -12309 12783 26515 20024 16236 25633 21177 24632 -1623 -34165 -35593 -32899
10367c2899K7178J2892q711J3031q831O421j972j9992J3072J1678J4237k5337
$$ -32899 -5721 7171 -1540 11491 2660 9081 7109 -12883 189 11867 26104 767
10355G67j1613J4614J4131L848j2942k8762m267J6295J1903M197Q277J9047M510
$$ 767 -10846 3768 17899 21747 8805 -19957 -24224 -7929 3974 8171 16448 35495 40005
10342D0005n468k0246j7197j1142J4858k2367J7205R91K988k5719M369J1700J6814
$$ 40005 34537 14291 -2906 -14048 810 -21557 -4352 -3361 -373 -26092 -21723 -10023 6791
10329F791M567J22k1669o064J948J4217n759l543L0044o349L168J1717j184k323
$$ 6791 11358 11480 -10189 -16253 -14305 -88 -5847 -9390 20654 14305 17473 29190 28006 25683
10315B5683k3374k8527j7078j419m956P434N30j2893K6189K3516O609j3257m423
$$ 25683 2309 -26218 -43296 -44715 -49671 -42237 -41707 -54600 -28411 -4895 1714 -11543 -15966
10302a5966k2090l090n315M64L0185Q791J0228J2270L403J2882K355K702J1065
$$ -15966 -38056 -41146 -46461 -45997 -15812 -7021 3207 15477 18880 31762 34117 36819 47884
10289D7884l2113k7340r538k646k29J7251J5330j5090k041j9448j0229Q707P580
$$ 47884 15771 -11569 -21107 -23753 -23982 -6731 8599 -6491 -8532 -27980 -38209 -29502 -21922
10276b1922O164m105j430K0400o22j2762K275Q935R517L972J2162L285k1296n371
$$ -21922 -15758 -19863 -21293 -893 -1515 -14277 -12002 -3067 6450 10422 22584 25869 4573 -798
10262g98j5776O850J6966j2265j0096m291j0831L095J3181k348J721o978o509
$$ -798 -16574 -9724 7242 -5023 -15119 -19410 -30241 -27146 -13965 -16313 -14592 -21570 -28079
10249b8079R689m744J3644J665P503q644j1512P853K7027R7j2004j7080j3846
$$ -28079 -18390 -23134 -9490 -7825 -322 -8966 -20478 -12625 14402 14499 2495 -14585 -28431
10236b8431L0106L6521o327l4430j8716P351J498k078j0372p333q253P34p341
$$ -28431 1675 38196 31869 -2561 -21277 -13926 -12428 -14506 -24878 -32211 -40464 -39730 -47071
10223d7071k383J5707j3830L7552K3658Q098j8375l084J4207J067M790K877p231
$$ -47071 -49454 -33747 -47577 -10025 13633 21731 3356 272 14479 15546 20336 23213 15982
10210A5982K1500J5211J1124o975l4427k7424j488P376J0623J6231l5846j5629
$$ 15982 37482 52693 63817 56842 22415 -5009 -6497 879 11502 27733 -8113 -23742
10198b3742O491n185j2840K2073J2200J68Q199R494k5097p979k9624P629L3536
$$ -23742 -17251 -22436 -35276 -13203 -1003 -835 7364 16858 -8239 -16218 -45842 -38213 -4677
10185d677J1696j0160J5939j726j6193J444J1181Q329k4420N140j1942r67p780
$$ -4677 7019 -3141 12798 11072 -5121 -3677 7504 15833 -8587 -3447 -15389 -16356 -24136
10172b4136k1157l046N801J6181j442k4733j038N890K7536J8045K4373j8624k8851
$$ -24136 -45293 -48339 -42538 -26357 -27799 -52532 -53570 -47680 -20144 -2099 22274 3650 -25201
10159b5201K935L6580M4420k621k6669l6989m701p226j5557j4789R244O283J6442
$$ -25201 -22266 14314 58734 56113 29444 -7545 -12246 -19472 -35029 -49818 -40574 -34291 -17849
10146a7849K4904m568k1918m6013O543J9834K5174R724J3896J1773k0732k0785
$$ -17849 7055 2487 -19431 -65444 -58901 -39067 -13893 -4169 9727 21500 768 -20017
10134b0017j1947K7790K3358L789l008k2390L218J3989j2983J6077L1592l841
$$ -20017 -31964 -4174 19184 22973 19965 -2425 793 14782 1799 17876 49468 45627
10122D5627j6551r856K325J7390k461l623j0264j8747j1181K4721P736k183j7969
$$ 45627 29076 19220 21545 38935 36474 32851 22587 3840 -7341 17380 25116 22933 4964
10109D964k201o997o614K9816k1232l3762K5972L1350P835J8337k694l7769m3388
$$ 4964 2763 -4234 -10848 18968 -2264 -36026 -10054 21296 29131 47468 44774 7005 -36383
10096c6383J820r146K1349O844k806j8062r811L4437J152J4468O293j1180k558
$$ -36383 -34563 -43709 -22360 -15516 -18322 -36384 -46195 -11758 -10606 3862 10155 -1025 -3583
10083c583n055k735J3759J3697j5593J7292k03j5544q492K735m118n19J181J3523
$$ -3583 -8638 -11373 2386 16083 490 17782 17579 2035 -6457 -3722 -7840 -8359 -7178 6345
10069F345O605J5949n868j8241K271r286j4946J2216M847J9131r337k5392K737
$$ 6345 12950 28899 23031 4790 7061 -2225 -17171 -4955 -108 19023 9686 -15706 -12969
10056a2969m581K0014j7483J1936L667N405k3552j6927K8531K6750r47n701K348
$$ -12969 -17550 2464 -15019 -3083 584 5989 -17563 -34490 -5959 20791 19844 14143 16491
10043A6491k4077k0576n510J3145J948j8350L6163J2666k699m979k935r139j4025
$$ 16491 -7586 -28162 -33672 -20527 -18579 -36929 -766 11900 9201 4222 1287 -7852 -21877
10030b1877k6969j6795k609K3484K9251J5576O696k9882K5424K4062m648j4837
$$ -21877 -48846 -65641 -68250 -44766 -15515 61 6757 -23125 2299 26361 21713 6876
10018F876J374N228q707r015J146l6729j1999R356L439J9198K0316l474J6836
$$ 6876 8250 13478 4771 -4244 -3098 -39827 -51826 -42470 -39031 -19833 483 -2991 13845
10005A3845o593j0659q490O257k222O230K270q43J209n07J3521L056J375j13o674
$$ 13845 7252 -3407 -11897 -5640 -7862 -1632 638 -205 1004 497 14018 17074 18449 18336 11662
9990A1662L460l899j1780j7571k3116J4946M451Q992K244p832N077K1553n409
$$ 11662 15122 11223 -557 -18128 -41244 -26298 -21847 -12855 -10611 -18443 -13366 8187 2778
9977B778m3K3071j2580k2908K3158J2052M633q009p114l1699J1825K6699n011
$$ 2778 2735 25806 13226 -9682 13476 25528 30161 22152 15038 -16661 -4836 21863 16852
9964A6852j4513j9260j9650j0158k6930J6316L3939l935n315q335L2693k264j0869
$$ 16852 2339 -16921 -36571 -46729 -73659 -57343 -23404 -27339 -32654 -40989 -8296 -10560 -21429
9951b1429M4589J195p357n126K0501J2882k2820l8595p023J7327L462K30P51J9206
$$ -21429 23160 24355 16998 11872 32373 45255 22435 -16160 -23183 -5856 -2394 -2164 -1413 17793
9937A7793K1987N620m512l154K628k3411k8386k0107J8736J1141K0387J3632q530
$$ 17793 39780 45400 40888 37734 40362 16951 -11435 -31542 -12806 -1665 18722 32354 23824
9924B3824J9362o850k6168j9786K5384m988k1644m97K635L339k0316l160M061
$$ 23824 43186 36336 10168 -9618 15766 10778 -10866 -11363 -8728 -5389 -25705 -28865 -24804
9911b4804m598l603J2430J4583J9313J294O03j414j1925j2210J0312O158q862
$$ -24804 -29402 -33005 -20575 -5992 13321 14615 15218 13804 1879 -10331 -19 6139 -2723
9898b723k5375l767K175j3770L0578K6330L344r290J2040K0344J4443O249J391
$$ -2723 -28098 -31865 -29690 -43460 -12882 13448 16792 7502 19542 39886 54329 60578 61969
9885F1969k2677J507j1449k3r503k8357r046j3546n000R392K0879K28p890K5925
$$ 61969 39292 40799 29350 29327 19824 -8533 -17579 -31125 -36125 -26733 -5854 -5626 -13516 12409
9871A2409J5414j0922n315l574q04L568O467J7503J877j6760L433P41o945M586
$$ 12409 27823 16901 11586 8012 7208 10776 17243 34746 36623 19863 23296 24037 17092 21678
9857B1678j2496k1467O810K4315j6667n583M740J5913L5456J5976L765j403o228
$$ 21678 9182 -12285 -5475 18840 2173 -3410 1330 17243 52699 68675 72440 71037 64809
9844F4809j713q206j0353j651o507Q21k9348j6061J1320J236J2126m218J1852
$$ 64809 63096 54890 44537 42886 36379 37200 7852 -8209 3111 4347 16473 12255 24107
9831B4107J3863j8333l2452J4940P751r970O066L9014L8223m052j855p680k8241
$$ 24107 37970 19637 -12815 2125 9876 -94 5972 44986 83209 79157 77302 69622 41381
9818D1381J1644j0293L44J5789K6200k5975l3539Q012L7375Q376j7786j2876J2387
$$ 41381 53025 42732 43076 58865 85065 59090 25551 33563 70938 79314 61528 48652 61039
9805F1039l3k5529L199L978k334m925J4568l502j6893j3030j1525k4267L542K1182
$$ 61039 61006 35477 38676 42654 40320 35395 49963 46461 29568 16538 5013 -19254 -15712 5470
9791E470J3582J1133J7922J1100J8976R59k4803p481L61N256l010L5247M0224
$$ 5470 19052 30185 48107 59207 78183 79142 54339 46858 47219 52475 49465 84712 124936
9778A24936K2316j3524j5949j9334r878L7934J8620j4913k7830k4153j8029J5157
$$ 124936 147252 133728 117779 98445 88567 126501 145121 130208 102378 78225 60196 75353
9766G5353J38K5662J6439J2423k4826k3741J6008j774k3754j1474K395j704k4934
$$ 75353 75491 101153 117592 130015 105189 81448 97456 95682 71928 60454 62849 61145 36211
9753C6211j9957K9234K5835n611k0076J5014n09J2589p145j4804N690J5800j0343
$$ 36211 16254 45488 71323 65712 45636 60650 60141 72730 65585 50781 56471 72271 61928
9740F1928j2423l6910J7475K1051J4524j913l768K2120l050j0158j3083K606M5827
$$ 61928 49505 12595 30070 51121 65645 63732 59964 82084 79034 68876 55793 58399 104226
9727A04226p352k2564q378J41p952R062K3213j1289j626k9007k1581m379P712
$$ 104226 96874 74310 65932 66073 58121 67183 90396 79107 77481 48474 26893 22514 30226
9714C0226k0051L190M298M054l917j4951j5805J3511K4956L0852l057j5646j719
$$ 30226 10175 13365 17663 21717 17800 2849 -12956 555 25511 56363 53306 37660 35941
9701C5941r372P708O227k5429n538J0793j3358Q288j4757L742R058J519J560O268
$$ 35941 26569 34277 40504 15075 9537 20330 6972 15260 503 4245 13303 14822 16382 22650
9687B2650n230N78J968r36j5187j1083l0208l554K0916L4223K1432j2701k9640
$$ 22650 17420 17998 19966 19030 3843 -7240 -37448 -41002 -20086 14137 35569 22868 -6772
9674f772k7013j6165J0636M702K4691q751P157K0368N104J899M716K3176j7801
$$ -6772 -33785 -49950 -39314 -34612 -9921 -18672 -11515 8853 13957 15856 20572 43748 25947
9661B5947k9285r922j7180J1283J4978k9863K1158J8688k0712j4173n745J892
$$ 25947 -3338 -13260 -30440 -19157 -4179 -34042 -12884 5804 -14908 -29081 -34826 -32934
9649c2934L1928R415j818k2785j5255P547N914p105k6764k211K0342K5625R373
$$ -32934 -1006 8409 6591 -16194 -31449 -23902 -17988 -25093 -51857 -54068 -33726 -8101 1272
9636A272N094M48K1928j7421k1256p405J9952k0077J4170K4534j3289j8933j7014
$$ 1272 6366 6814 28742 11321 -9935 -17340 2612 -17465 -3295 21239 7950 -10983 -27997
9623b7997J3297J0303n317J4396N055n885k6596M605J5267l757n023P643k422
$$ -27997 -14700 -4397 -9714 4682 9737 3852 -22744 -18139 -2872 -6629 -11652 -4009 -6431
9610f431j5729L424R173K7457o194j618Q976o903J3474N500o695k2808j0946J5324
$$ -6431 -22160 -18736 -9563 17894 11700 10082 19058 12155 25629 31129 24434 1626 -9320 6004
9596F004j6886j7399j505J7422J7280l36K467J0670J1088p073l9193j343K2723
$$ 6004 -10882 -28281 -29786 -12364 4916 4580 7047 17717 28805 21732 -17461 -18804 3919
9583C919K440j6494L105K0203m757j2895m461j7545j7815J5654L5283R512j9034
$$ 3919 6359 -10135 -7030 13173 8416 -4479 -8940 -26485 -44300 -28646 6637 16149 -2885
9570b885M75L8817J3975J063k9895l7354j2947J4852J0368l102J142K4993l825
$$ -2885 -2410 36407 50382 51445 21550 -15804 -28751 -13899 -3531 -6633 -5491 19502 15677
9557A5677r748j0583N253J4770J890J4636k1733q824j3040N796j1193k843j5084
$$ 15677 5929 -4654 599 15369 17259 31895 10162 1338 -11702 -5906 -17099 -19942 -35026
9544c5026k479J5800k870o352K2885L0129N014O241j976l8058k3260K3709j1607
$$ -35026 -37505 -21705 -24575 -30927 -8042 22087 27101 33342 31366 -6692 -29952 -6243 -17850
9531a7850J822K5162P289o203k0506N855k177q099k1882J1431O116J5704j1741
$$ -17850 -16028 9134 16423 10220 -10286 -4431 -6608 -14707 -36589 -25158 -19042 -3338 -15079
9518a5079j1412M062J7806o783K2097J0772L050k6063m1273K7484r413j4617O592
$$ -15079 -26491 -22429 -4623 -11406 10691 21463 24513 -1550 -42823 -15339 -24752 -39369 -32777
9505c2777J5449L7074k0524P81K6011j5531k1619j1774L597O747K1414q055N702
$$ -32777 -17328 19746 -778 3 26014 10483 -11136 -22910 -19313 -12566 8848 793 6495
9492F495k849k1146N059M4922N188n0805j473J0080j9216Q41K0583K2508j0352
$$ 6495 3646 -17500 -12441 32481 37669 -13136 -14609 -4529 -23745 -22904 -2321 20187 9835
9479I835j3511J0542R450k8680l5761K407J7196J4954J1644J9886j4697k5317
$$ 9835 -3676 6866 16316 -12364 -48125 -45718 -28522 -13568 -1924 17962 3265 -22052
9467b2052m13j0324J3414j94J4961N906n94J6800j1292k1384j1161P376J2264
$$ -22052 -22465 -32789 -19375 -19569 -4608 1298 704 17504 6212 -15172 -26333 -18957 -6693
9454f693K0039N656o118j0453j3245j0538J2218j8563J8783J5400j2886j3737
$$ -6693 13346 19002 12884 2431 -10814 -21352 -9134 -27697 -8914 6486 -6400 -20137
9442b0137l3290J505N8543M0101j0380k5423k8987k271K5617J5436j4686l7124
$$ -20137 -53427 -51922 6621 46722 36342 10919 -18068 -20339 5278 20714 6028 -31096
9430c1096N556L4239J2576j773j1044K1749J9296j766O470L581k3350j904k1389
$$ -31096 -25540 8699 21275 19502 8458 30207 49503 47737 54207 57788 34438 32534 11145
9417A1145m659J4615M452M417J3701k5085l1117L388r400k8205Q408k190Q21J146
$$ 11145 6486 21101 25553 29970 43671 18586 -12531 -9143 -18543 -46748 -38340 -40530 -39709 -38563
9403c8563N110O048p800j1873J7670J229J0673N142R912j8347J1634K1704j54
$$ -38563 -33453 -27405 -35205 -47078 -29408 -28179 -17506 -12364 -2452 -20799 -9165 12539 12385
9390A2385k068K820j5896m853K5040j5854k1315q127K931K6598K5608j8269j2430
$$ 12385 10317 13137 -2759 -7612 17428 1574 -19741 -27868 -24937 1661 27269 9000 -3430
9377c430j9123k5701K6890j6315k36J3173K6757l333J3651O192K727K841p610
$$ -3430 -22553 -48254 -21364 -37679 -37915 -24742 2015 -1318 12333 18525 21252 24093 16483
9364A6483J275J4695j7973r267k791J8625K2203j6196k521J1210P088j8477p687
$$ 16483 17758 32453 14480 5213 2422 21047 43250 27054 24533 35743 42831 24354 16667
9351A6667j5132k095Q069K6694J4207N747K5237o448l4230l6127J6011j4332j7368
$$ 16667 1535 -560 7509 34203 48410 54157 79394 72946 38716 2589 18600 4268 -13100
9338a3100J6956J3968j6216P741J7369K3321k593Q339J8833J335p779j8766j7984
$$ -13100 3856 17824 1608 9349 26718 50039 47446 55785 74618 75953 68174 49408 31424
9325C1424j4375N36K26j088R506K417P705J7216L8783L2024P110J5427j2090K893
$$ 31424 17049 17585 17811 16723 26229 28646 36351 53567 92350 124374 131484 146911 134821 137714
9311A37714J0556p324J376m687j136N440J8977n666r796j7615O688Q404r826Q655
$$ 137714 148270 140946 142322 137635 136499 141939 160916 155250 145454 127839 134527 142931 133105 141760
9297A41760K0661j429M593J9993K5544j472K2653K2573L5933K1923K6127J3805
$$ 141760 162421 160992 165585 185578 211122 209650 232303 254876 290809 312732 338859 352664
9285C52664K9108M5216M8911M7081N0229M3692O7332J04262J08123P7039J23185
$$ 352664 381772 426988 475899 522980 573209 616901 684233 788495 896618 973657 1096842
9274A096842J64368J86081J86985J75121J91768J71318J55816O3932L2762k3036
$$ 1096842 1261210 1447291 1634276 1809397 2001165 2172483 2328299 2392231 2424993 2401957
9264B401957q0533j16736j48146j33542j80158j64618j63430j26943j34232j31476
$$ 2401957 2321424 2204688 2056542 1923000 1742842 1578224 1414794 1287851 1153619 1022143
9254A022143r8077r8130r3181p8596m2295k4656m0035o4022l5884k4568o2533
$$ 1022143 924066 825936 732755 654159 611864 587208 547173 483151 447267 422699 360166
9243C60166l3504j9967j6293J2433q211j8240j1298J3723M601j0238l3325j8362
$$ 360166 326662 306695 290402 302835 294624 276384 265086 278809 283410 273172 239847 221485
9231B21485j2243J5745M5671J7092L713Q289j9590m4760l1212k3512l3462j2470
$$ 221485 209242 224987 270658 287750 291463 299752 280162 235402 204190 180678 147216 134746
9219A34746N172J8875j4876k1105J0261l2146l1249m739n195j975N425J1886K9237
$$ 134746 139918 158793 143917 122812 133073 100927 69678 64939 59744 57769 63194 75080 104317
9206A04317j409k192R11j4910o664J6209r182O881J0285o530L1910L5218J4884
$$ 104317 102908 100716 101627 86717 80053 96262 87080 93961 104246 97716 129626 164844 179728
9193A79728J857j0616p415j5067k5983J1904K2030K4181L4723k4353k0272n0741
$$ 179728 181585 170969 163554 148487 122504 134408 156438 180619 215342 190989 170717 119976
9181A19976q738m605j4737l9864r525j2546K274R175j5576j6793q336j0153L5446
$$ 119976 111238 106633 91896 52032 42507 29961 32235 41410 25834 9041 705 -9448 25998
9168B5998J2029r703J1420N92l6322j1154K0353R470j4803L232K925N062J3706
$$ 25998 38027 28324 39744 40336 4014 -7140 13213 22683 7880 11112 14037 19099 32805
9155C2805j6286J8488L5768K0836K762j1910k0081j4716l381P966n317K7131K0613
$$ 32805 16519 35007 70775 91611 94373 82463 62382 47666 44285 52251 46934 74065 94678
9142I4678n927j8414P28l7319m5244l629J8001N418r03p058J5179j5599k7496
$$ 94678 88751 70337 71065 33746 -11498 -15127 2874 8292 7389 331 15510 -89 -27585
9129b7585m854L4610k540K2078J1505k2199k5136K142K6378J6013q850k8763r026
$$ -27585 -32439 2171 -369 21709 33214 11015 -14121 -11979 14399 30412 21562 -7201 -16227
9116a6227L1485J9036l341m4850Q366L6833l893l633P707K0058j795o354j7183
$$ -16227 15258 34294 30953 -13897 -5531 31302 27409 23776 31483 51541 49746 43392 26209
9103B6209M198J4262l3764m8958L823R577K3360n099n294L0062J9958j8444R354
$$ 26209 30407 44669 10905 -38053 -34230 -24653 -1293 -6392 -11686 18376 38334 19890 29244
9090B9244J6206l883j3740k8659j0481Q442L7191N644l3477j4102J0000Q40J9927
$$ 29244 45450 41567 27827 -832 -11313 -2871 34320 39964 6487 -7615 2385 3225 23152
9077B3152J3766j0957j7164J6576J3787j9246r905P881q798K0108j5773j5914
$$ 23152 36918 25961 8797 25373 39160 19914 10009 17890 9092 29200 13427 -2487
9065b487k594L0889K2736L114l7408P993K5229l903m2021m0128J0751k3511Q345
$$ -2487 -5081 25808 48544 51658 14250 22243 47472 43569 1548 -38580 -27829 -51340 -42995
9052d2995J5398N718R766p672O963J6902j6047J2114J0334K065l4091Q809J8022
$$ -42995 -27597 -21879 -12113 -19785 -12822 4080 -11967 147 10481 12546 -21545 -12736 5286
9039E286j5644m445Q514J742l083N346j0770L9232M019q270r624K2741n589j3028
$$ 5286 -10358 -14803 -6289 -4547 -7630 -2284 -13054 26178 30197 21927 12303 35044 29455 16427
9025A6427q342j6186j8458P317j188J2995K6421J0748J6765J270o342P756J576
$$ 16427 8085 -8101 -26559 -19242 -20430 -7435 18986 29734 46499 47769 41427 49183 50759
9012E0759m8859l0578K1594K0825J1541J67j0823k6821r062k995j595R267L757
$$ 50759 1900 -28678 -7084 13741 25282 25449 14626 -12195 -21257 -24252 -25847 -16580 -12823
8999a2823M644j9919j4740L0809J2015j5685j976J6368R345J3669L7264m771l7113
$$ -12823 -8179 -28098 -42838 -12029 -14 -15699 -17675 -1307 8038 21707 58971 54200 17087
8986A7087l4148k1629P276J9486M269m355K661K5087M127r737j4037o604J5008
$$ 17087 -17061 -38690 -31414 -11928 -7659 -12014 -9353 15734 19861 10124 -3913 -10517 4491
8973D491j5059k3084J1527J829J5974N056K0818J1913M110p258k0627l001n395
$$ 4491 -10568 -33652 -22125 -20296 -4322 734 21552 33465 37575 30317 9690 6689 1294
8960A294K4115l988j7403j6363K2981j8864L323K4383k1416m6724j2471K5187
$$ 1294 25409 21421 4018 -12345 10636 -8228 -4905 19478 -1938 -48662 -61133 -35946
8948c5946K8114L0926P045K008j7626M919k836j7629r990k259j8306q359O807
$$ -35946 -7832 23094 30139 32147 14521 19440 16604 -1025 -11015 -13274 -31580 -39939 -33132
8935c3132J7219K3750m17K0564m032j2077j7744m877l997m694j6720p23p598Q067
$$ -33132 -15913 7837 7420 27984 23952 11875 -5869 -10746 -14743 -19437 -36157 -36880 -44478 -36411
8921c6411J8481J3640J3836j3516m813J0817j7952L315J4435j6879J3675J6333
$$ -36411 -17930 -4290 9546 -3970 -8783 2034 -15918 -12603 1832 -15047 -1372 14961
8909A4961k334K1924J0581j1859q494j5195O379O084m7459j9755p736J0071L1496
$$ 14961 12627 34551 45132 33273 24779 9584 15963 22047 -25412 -45167 -52903 -42832 -11336
8896a1336J9799l2525j1222p821l1690R991J4510M3233L9885o24j7500j8022l2442
$$ -11336 8463 -24062 -35284 -43105 -74795 -64804 -50294 -7061 32824 32200 14700 -3322 -35764
8883c5764m25J9331M0980j3175k1186k4436J6171L8301J757j3156l854j3558P872
$$ -35764 -36189 -16858 24122 10947 -10239 -34675 -18504 19797 21554 8398 4544 -9014 -1142
8870a142K826l36q069J7700R953k8465j4176J7900k594l6582j6095L1829L0654
$$ -1142 1684 1348 -6721 10979 20932 -7533 -21709 -3809 -6403 -42985 -59080 -27251 3403
8857C403K5562Q286j2546k1641J2352O357k9199o589J8203p945k9084j9313M622
$$ 3403 28965 37251 24705 3064 15416 21773 -7426 -14015 4188 -3757 -32841 -52154 -47532
8844d7532J2171j4334J9932J7767p513l5405M220L1167K0332l086j0876J1837
$$ -47532 -35361 -49695 -29763 -11996 -19509 -54914 -50694 -19527 805 -2281 -13157 -1320
8832a320J6099k0427j4649m271K7778L2702j2452N66m740R92K4527J1423q29r726
$$ -1320 14779 -5648 -20297 -24568 3210 35912 23460 24026 19286 20278 44805 56228 55399 45673
8818D5673k5442k3616k6527L4940j8419j6564K3841J3283k931L118j5010n9l310
$$ 45673 20231 -3385 -29912 5028 -13391 -29955 -6114 7169 4238 7356 -7654 -7713 -11023
8805a1023P238J9121q856k8557J7258L7791p322k238p648k6333j3908J5239J2640
$$ -11023 -3785 15336 6480 -22077 -4819 32972 25650 23412 15764 -10569 -24477 -9238 3402
8792C402j3529k2168K4734O370l2049J29l142j7840M612K0469K2859K7031J5971
$$ 3402 -10127 -32295 -7561 -1191 -33240 -33111 -36253 -54093 -49481 -29012 -6153 20878 36849
8779C6849P586j1968k4895j3663k2790m249J8013J343K684K1606K5764J5659j9098
$$ 36849 44435 32467 7572 -6091 -28881 -33130 -15117 -13774 -11090 10516 36280 51939 32841
8766C2841l4500j5666q033j1290R049J0197J4464J3611p196n767K9951j3914P865
$$ 32841 -1659 -17325 -25358 -36648 -27599 -17402 -2938 10673 3477 -2290 27661 13747 21612
8753B1612J5566k4221j0259J5273P582j514k0775k5042k7778L143J3107Q068L38
$$ 21612 37178 12957 2698 17971 25553 24039 3264 -21778 -49556 -46413 -33306 -25238 -24900
8740b4900J3879K7085K013j5368j3530R073J2824k378m162j6943k1743O2k27O232
$$ -24900 -11021 16064 18077 2709 -10821 -1748 11076 8698 4536 -12407 -34150 -34088 -34315 -28083
8726b8083J0786o589J5763J238q55m04K601M542K1436K479k6672k6154J4439J8683
$$ -28083 -17297 -23886 -8123 -6885 -7740 -8144 -5543 -1001 20435 22914 -3758 -29912 -15473 3210
8712C210l558o451O659M5002n833l2960l253p521j0597j7109K0603L4772j2137
$$ 3210 -348 -6799 -140 44862 39029 6069 2816 -4705 -15302 -32411 -11808 22964 10827
8699A0827j8205J157j8735k0066K451J6117L6493R030o105k0929j7056R247o548
$$ 10827 -7378 -6221 -24956 -45022 -42571 -26454 10039 19069 12964 -7965 -25021 -15774 -22322
8686b2322J4143L2171K0527J8523K521J254j5195j0639l364k3813k810L581l098
$$ -22322 -8179 23992 44519 63042 65563 66817 51622 40983 37619 13806 10996 14577 11479
8673A1479p073j4446N811K0680N018J8635j6363j9755k9641P402Q524Q885J3553
$$ 11479 4406 -10040 -4229 16451 21469 40104 23741 3986 -25655 -18253 -9729 -844 12709
8660A2709j611l87j505p837l0745J1817K2918L6403k2290O277l119q553m034P882
$$ 12709 11098 10711 9206 1369 -29376 -17559 5359 41762 19472 25749 22630 14077 10043 17925
8646A7925O526k4186q279p044J2862J9667o92J565J9579p370l50L152N596r295
$$ 17925 24451 265 -8014 -15058 -2196 17471 16779 18344 37923 30553 30203 33355 38951 29656
8632B9656j2345J815k3189j1965K4384J2271K1953l0131n409l3051j0135j457
$$ 29656 17311 19126 -4063 -16028 8356 20627 42580 12449 7040 -26011 -36146 -37603
8620c7603J4551K4185K2974J5536q662K443M956j5074r597L0974J118o630j4498
$$ -37603 -23052 1133 24107 39643 30981 33424 38380 23306 13709 44683 45801 39171 24673
8607B4673Q96J0017O162q574l8759j2323J0868L453o937Q795q27L945J4180O181
$$ 24673 25569 35586 41748 33174 -5585 -17908 -7040 -3587 -10524 -1729 -2556 1389 15569 21750
8593B1750j885L168J5659k1934k4117K1552O086o698k4426M663j0786j4426M70
$$ 21750 19865 23033 38692 16758 -7359 14193 20279 13581 -10845 -6182 -16968 -31394 -30924
8580c0924K009J3504L623L106L786J9658p552J9835q293K2570l601j0841q041
$$ -30924 -28915 -15411 -11788 -8682 -4896 14762 7210 27045 18752 41322 37721 26880 18839
8567A8839L3030N240j8356k9739j0276N545J1577m896j9086L939J9029j7956L499
$$ 18839 51869 57109 38753 9014 -1262 4283 15860 10964 -8122 -4183 14846 -3110 389
8554C89j561j650j8256M783k73J2460O314R467j7984p245r777q443j7259N914
$$ 389 -1172 -2822 -21078 -16295 -16568 -4108 2206 11673 -6311 -13556 -23333 -31776 -49035 -43121
8540d3121J4659L80J0640J2531r146K5371K9656j1624j6148j8478L699q440j1373
$$ -43121 -28462 -28082 -17442 -4911 -14057 11314 40970 29346 13198 -5280 -1581 -10021 -21394
8527b1394N410L2569J6061j6085m4261R050M0354o313O910L42N221R819j625j7411
$$ -21394 -15984 16585 32646 16561 -27700 -18650 21704 15391 22301 22643 27864 37683 36058 18647
8513A8647k1915l0933j2912R307K1940J0787k692k139p191l639R665J2753P382
$$ 18647 -3268 -34201 -47113 -37806 -15866 -5079 -7771 -9910 -17101 -20740 -11075 1678 9060
8500I060l997J0075O928k5299k186Q837Q106j5263k3042j4373J9062J0882L1723
$$ 9060 5063 15138 22066 -3233 -5419 3418 11524 -3739 -26781 -41154 -22092 -11210 20513
8487B0513J0678l4274l4401J7130J2040j3983L680K7092K1425k7315j0901J3562
$$ 20513 31191 -3083 -37484 -20354 -8314 -22297 -18617 8475 29900 2585 -8316 5246
8475E246K0046J6920j8692k4806k4293P35J1050J0180l204o517M141j1705o655
$$ 5246 25292 42212 23520 -1286 -25579 -24844 -13794 -3614 -6818 -13335 -9194 -20899 -27554
8462b7554Q841N970m241j2802n962M39k733P461K8642P972O51r307J5031k4002
$$ -27554 -18713 -12743 -16984 -29786 -35748 -35309 -38042 -30581 -1939 6033 6684 -2623 12408 -11594
8448a1594j266K1001J674j7500l549p263o596m804j5232J7169M7699p601O253
$$ -11594 -12860 8141 9815 -7685 -11234 -18497 -25093 -29897 -45129 -27960 19739 12138 18391
8435A8391j269J8268p224j9481j5143q499K3887J2895k7859j2794J236m872N871
$$ 18391 17122 35390 28166 8685 -6458 -14957 8930 21825 -6034 -18828 -17592 -22464 -16593
8422a6593n374r757k2535O322R639J2746n075J1170J4682N3243J2407r192P011
$$ -16593 -21967 -31724 -54259 -47937 -38298 -25552 -30627 -19457 -4775 48468 60875 51683 58694
8409E8694J5992L2651K2385J4062m176j0888k6526j3177k8746N573M2736M9603
$$ 58694 74686 107337 129722 143784 139608 128720 102194 89017 60271 65844 108580 158183
8397A58183J27918J58665K19116K68902K31039N9356j73694k58878k29009j98785
$$ 158183 286101 444766 663882 932784 1163823 1223179 1049485 790607 561598 362813
8387C62813j18220o0604p9849o1111k8845J5032L1410p911L349J1311J7885L1482
$$ 362813 244593 183989 104140 43029 14184 29216 60626 52715 56064 67375 85260 116742
8375A16742J1050m9661k1226m447K1165J0763k1505l425o981K988J8328M6094
$$ 116742 127792 78131 56905 52458 73623 84386 62881 59456 52475 55463 73791 119885
8363A19885J12935J98108K58263K55760J54951j7784j39370k37430k45089j93659
$$ 119885 232820 430928 689191 944951 1099902 1082118 942748 705318 460229 266570
8353B66570j07028l0213r262l6643l9860L707K2144O847j3422n353j1949O195
$$ 266570 159542 129329 120067 83424 43564 47271 69415 76262 62840 57487 45538 51733
8341E1733p985j9501J2919k49j0432Q155j1163k6266L194K5358J0817K4211j8570
$$ 51733 43748 24247 37166 36917 26485 34640 23477 -2789 405 25763 36580 60791 42221
8328D2221m7479j043q25P143Q081M101J8188j0516j5768k5135L807K0956J9004
$$ 42221 -5258 -6301 -7126 17 8098 12199 30387 19871 4103 -21032 -17225 3731 22735
8315B2735q094o123K9731K3043j6657n9363j7046K0677K4608l491J295k148M707
$$ 22735 14641 8518 38249 61292 44635 -14728 -31774 -11097 13511 10020 11315 9167 13874
8302A3874o08R809k6016j5818L012J0331j7458j7361L1335L1231k6090J603J1031
$$ 13874 13266 23075 -2941 -18759 -15747 -5416 -22874 -40235 -8900 22331 -3759 -2156 8875
8289H875K113n610L089n661j9387K8669J1042J2953j076q17m735J2942j5376k7051
$$ 8875 10988 5378 8467 2806 -16581 12088 23130 36083 35007 34190 29455 42397 27021 -30
8275c0j8791j2581J1838R706J0210k918N950M815k2002M343j661J2141K7354l601
$$ -30 -18821 -31402 -19564 -9858 352 -2566 3384 8199 -13803 -9460 -11121 1020 28374 24773
8261B4773l1136R96O808k2902Q014J7162K990K934j3661l6891j1280J1272k016
$$ 24773 -6363 -5367 1441 -21461 -13447 3715 6705 9639 -4022 -40913 -52193 -40921 -42937
8248d2937k4517J2911J6556L6904K1939l0963Q569M1308L2047k1549j1614j8881
$$ -42937 -67454 -54543 -37987 -1083 20856 -10107 -1538 39770 71817 50268 38654 19773
8236A9773J3159R926o322k5368l9224L469J5357r738J0275N993j4156k11j5811
$$ 19773 32932 42858 36536 11168 -28056 -24587 -9230 -18968 -8693 -2700 -16856 -17067 -32878
8223c2878k1429J1782O829J5161j994N572j648O777J3369j2103j2716L650l1564
$$ -32878 -54307 -42525 -35696 -20535 -22529 -16957 -18605 -11828 1541 -10562 -23278 -19628 -51192
8210e1192j1986p834j022J7335M1255R010o588K4097L2510K4800j1007j9443j6267
$$ -51192 -63178 -71012 -72034 -54699 -13444 -4434 -11022 13075 45585 70385 59378 39935 23668
8197B3668l2482k2105J9451O694R208P514L1060q056k7933M979K0116K7190o184
$$ 23668 -8814 -30919 -11468 -4774 4434 11948 43008 34952 7019 11998 32114 59304 53120
8184E3120j0963j0425M883q290Q351J2736L1847k3301l1109l622J9120L743K0161
$$ 53120 42157 31732 36615 28325 36676 49412 81259 57958 26849 23227 42347 46090 66251
8171F6251n963l1083k8767n952n674k700o718J232J529R495o118j368J9496P246
$$ 66251 60288 29205 438 -5514 -11188 -13888 -20606 -19374 -17845 -8350 -14468 -15836 3660 10906
8157A0906j1246L858K9682J0165n1719m0513l027K6541J024j3739L033q933j705
$$ 10906 -340 3518 33200 43365 -8354 -48867 -51894 -25353 -24329 -38068 -35035 -43968 -45673
8144d5673M1275Q272K3446L3697l4299k8851k1652n804j453L289k121J4237j3670
$$ -45673 -4398 3874 27320 61017 26718 -2133 -23785 -29589 -31042 -27753 -29874 -15637 -29307
8131b9307l8739K535L4586K1884r286K6020J6818P467M054l1256K634j3376J5152
$$ -29307 -68046 -65511 -30925 -9041 -18327 7693 24511 31978 36032 4776 7410 -5966 9186
8118I186J635m0498k6595R72K7466K5336J7054k459N110j0326Q586l817Q280L696
$$ 9186 10821 -29677 -56272 -55300 -27834 -2498 14556 12097 17207 6881 15467 11650 19930 23626
8104B3626j0542j3068J6300J9165P372l2287r312P022q398J60P710K2011L5602
$$ 23626 13084 16 16316 35481 42853 10566 1254 8276 -122 38 7748 29759 65361
8091F5361j0062j2277o513M569K3123L022o786r991J6487j2623Q733J3121p158
$$ 65361 55299 43022 36509 41078 64201 67223 60437 50446 66933 54310 63043 76164 69006
8078F9006M045k1638j0799J8975J1053K6551K7996R379J149L0042N5021O9412
$$ 69006 73051 51413 40614 59589 70642 97193 125189 134568 135717 165759 220780 290192
8066B90192R9572J51273L56590O30209J081750J364728O31167p33370j321644
$$ 290192 389764 541037 897627 1527836 2609586 3974314 4605481 3872111 2550467
8057B550467j012477n60693l12952j71042j14433q8097n0691l6585k3845n419
$$ 2550467 1537990 977297 664345 493303 378870 290773 240082 203497 179652 174233
8047A74233J696J0309l721j5007o055j5268j83Q240K4760j2848k1083K0328J6842
$$ 174233 175929 186238 182517 167510 161455 146187 146004 154244 179004 166156 145073 165401 182243
8034A82243O2599N4934K9100L8550O2353O7952P0322N4991M7690O6080J61449
$$ 182243 244842 299776 328876 367426 429779 497731 568053 623044 670734 736814 898263
8023H98263K98083N04494R52601J684541K594637L285439L463410K116298j411166
$$ 898263 1196346 1700840 2653441 4337982 6932619 10218058 13681468 15797766 14386600
8014A4386600m167635l959562k430843j274236p08282m55287k84930j55642r0317
$$ 14386600 10218965 6259403 3828560 2554324 1846042 1390755 1105825 950183 859866
8005H59866n6222j8972K070k7015p8740r3574q5239q7526o5713p7254m3193o355
$$ 859866 803644 784672 786742 759727 680987 587413 502174 414648 348935 271681 228488 222133
7993B22133j7186m7383j3768j3831j9505J900o276l4254J9939J1524k0773j2174
$$ 222133 204947 157564 143796 129965 110460 112360 106084 71830 91769 103293 82520 70346
7981G0346j8957j9197j302K0024m367j3496q225j1206L3140m059M682J4568p455
$$ 70346 51389 32192 30890 50914 46547 33051 24826 13620 46760 42701 47383 61951 54496
7968E4496m5646m966J1535j4145J4500L37l592P433p397j5526j7933M4975M3936
$$ 54496 8850 3884 15419 1274 15774 16111 12519 19952 12555 -2971 -20904 24071 68007
7955F8007J3878M405q637k8288j4315J9226j2981k4011j0984k4120Q525K728J182
$$ 68007 81885 86290 77653 49365 35050 54276 41295 17284 6300 -17820 -9295 -6567 -5385
7942e385K9444J7322M926l9462m951P413m740L2152J5847k5791p700L090L584
$$ -5385 24059 41381 46307 6845 1894 9307 4567 36719 52566 26775 19075 22165 25749
7929B5749l80O395m279J7347j002R137j0800O2j936l1336j5727n081K5261K2793
$$ 25749 25369 31764 27485 44832 43830 52967 42167 42229 40293 8957 -6770 -11851 13410 36203
7915C6203K1477O88k9055r603R475k0366j2586J4672q52R907K070k4857m240k2128
$$ 36203 57680 58368 29313 19710 29185 8819 -3767 10905 10053 19960 22030 -2827 -7067 -29195
7901b9195K099J0339q756J546J5577k380j5655J245M489L3011K8640j8468m680
$$ -29195 -27096 -16757 -25513 -23967 -8390 -10770 -26425 -25180 -20691 12320 40960 22492 17812
7888A7812K039J7055l276j8700n14O400l107p323K6384k7675k7764J8934k083
$$ 17812 19851 36906 33630 14930 14416 20816 17709 10386 36770 9095 -18669 265 -1818
7875a818p040q521P770k354j3184J4882J1034L435k198N406J4761K989j1528k5388
$$ -1818 -8858 -17379 -9609 -11963 -25147 -10265 769 4204 2006 7412 22173 25162 13634 -11754
7861a1754k324n103M8436L414l1448K0188P12j4841r372n361K0349j3578Q079
$$ -11754 -14078 -19181 29255 32669 1221 21409 22121 7280 -2092 -7453 12896 -682 7397
7848G397J2993n129O113J1457j9010q535M293P895K702O62K1275m342l042q308
$$ 7397 20390 15261 21374 32831 13821 5286 9579 17474 20176 20838 42113 37771 34729 26421
$$ [...]
##END NTUPLES=NMR SPECTRUM
##END=
