##TITLE=Analysis number 327720
Compound Code cc 56346
Book Reference 510/58
Project Code adrs
Chemist Name ronp
##JCAMPDX= 6.0         $$ Bruker NMR JCAMP-DX V2.0
##DATA TYPE= NMR SPECTRUM
##DATA CLASS= NTUPLES
##ORIGIN= Bruker BioSpin GmbH
##OWNER= nmr
$$ XWIN-NMR		Version 3.5
$$ Mon Apr  2 13:09:40 2007 GMT Daylight Time (UT+1h)  MAYBRIDGE\nmr@NMR_250MHZ
##.OBSERVE FREQUENCY= 250.131544655141
##.OBSERVE NUCLEUS= ^1H
##.ACQUISITION MODE= SIMULTANEOUS (DQD)
##.ACQUISITION SCHEME= undefined
##.AVERAGES= 16
##.DIGITISER RES= 18
##SPECTROMETER/DATA SYSTEM= dpx250
##.PULSE SEQUENCE= zg30
##.SOLVENT NAME= CDCl3
##.SHIFT REFERENCE= (INTERNAL, CDCl3, 0, 16.522)
##AUDIT TRAIL= $$ (NUMBER, WHEN, WHO, WHERE, WHAT)
$$ ##TITLE= Audit trail, XWIN-NMR		Version 3.5
$$ ##JCAMPDX= 5.01
$$ ##ORIGIN= Bruker BioSpin GmbH
$$ ##OWNER= nmr
$$ C:\u/data/dgb/nmr/ADRS/170/pdata/1/auditp.txt
$$ ##AUDIT TRAIL=  $$ (NUMBER, WHEN, WHO, WHERE, WHAT)
(   1,<2007-04-02 13:09:12.56 +100>,<MAYBRIDGE\nmr>,<NMR_250MHZ>,
      <created by zg, POWCHK disabled, PULCHK disabled
       configuration hash MD5:
       49 4B E0 1D 92 C2 6B 37 9F E6 65 BC 52 41 86 1D
       data hash MD5: 64K
       55 38 A4 9C 39 7D F5 6C AB 2A D9 4B 39 9A B4 9D>)
(   2,<2007-04-02 13:09:29.84 +100>,<MAYBRIDGE\nmr>,<NMR_250MHZ>,
      <Start of raw data processing
       ef LB = 0.3 FT_mod = 6 PKNL = 1 SI = 32K 
       data hash MD5: 32K
       AD D1 FB 22 1B C6 31 4B 06 6A 04 AE 6B 56 C5 38>)
(   3,<2007-04-02 13:09:32.01 +100>,<MAYBRIDGE\nmr>,<NMR_250MHZ>,
      <apk 
       data hash MD5: 32K
       5D E5 AF 96 EF 08 5C 70 3D A5 68 99 41 CB B4 88>)
(   4,<2007-04-02 13:09:32.92 +100>,<MAYBRIDGE\nmr>,<NMR_250MHZ>,
      <abs ABSG = 5 
       data hash MD5: 32K
       2A F2 32 3A 9E E9 98 C6 8C 49 68 F5 68 08 E5 C3>)
$$ ##END=
$$ 
$$ hash MD5
$$ D1 A6 42 1E BC CB 46 CC 81 FD BF FA 33 91 92 69
##$RELAX= 
##$RELAX= 
##$RELAX= 
##$RELAX= 
##$RELAX= 
##$RELAX= 
##$RELAX= 
$$ Bruker specific parameters
$$ --------------------------
##$DU= <C:\u>
##$EXPNO= 170
##$NAME= <ADRS>
##$PROCNO= 1
##$TYPE= <nmr>
##$USER= <dgb>
##$AMP= (0..31)
100 100 100 100 100 100 100 100 100 100 100 100 100 100 100 100 100 100 
100 100 100 100 100 100 100 100 100 100 100 100 100 100 
##$AQSEQ= 0
##$AQ_mod= 3
##$AUNM= <au_zg>
##$AUTOPOS= <29 >
##$BF1= 250.13
##$BF2= 250.13
##$BF3= 250.13
##$BF4= 250.13
##$BF5= 500.13
##$BF6= 500.13
##$BF7= 500.13
##$BF8= 500.13
##$BYTORDA= 1
##$CFDGTYP= 0
##$CFRGTYP= 5
##$CHEMSTR= <none>
##$CNST= (0..31)
1 1 145 1 1 1 1 1 1 1 1 1 1 1 1 1 1 1 1 1 1 1 1 1 1 1 1 1 1 1 1 1 
##$CPDPRG= <>
##$CPDPRG1= <>
##$CPDPRG2= <>
##$CPDPRG3= <>
##$CPDPRG4= <mlev>
##$CPDPRG5= <mlev>
##$CPDPRG6= <mlev>
##$CPDPRG7= <mlev>
##$CPDPRG8= <mlev>
##$CPDPRGB= <>
##$CPDPRGT= <>
##$D= (0..31)
0 1 0 0 0 0 0 0 0 0.06 0 0 0 0 0 0 0.0002 0 0 0 0 0 0 0 0 0 0 0 0 0 0 
0 
##$DATE= 1175515751
##$DBL= (0..7)
120 120 120 120 120 120 120 120 
##$DBP= (0..7)
150 150 150 150 150 150 150 150 
##$DBP07= 0
##$DBPNAM0= <>
##$DBPNAM1= <>
$$ [...]
##$SUBNAM7= <"">
##$SUBNAM8= <"">
##$SUBNAM9= <"">
##$SW= 20.6930455092707
##$SWIBOX= (0..15)
0 0 3 0 0 0 0 0 0 0 0 0 0 0 0 0 
##$SW_h= 5175.983436853
##$TD= 65536
##$TD0= 1
##$TE= 683.16
##$TE2= 300
##$TE3= 300
##$TEG= 300
##$TL= (0..7)
0 120 120 120 120 120 120 120 
##$TP= (0..7)
150 150 150 150 150 150 150 150 
##$TP07= 0
##$TPNAME0= <>
##$TPNAME1= <>
##$TPNAME2= <>
##$TPNAME3= <>
##$TPNAME4= <>
##$TPNAME5= <>
##$TPNAME6= <>
##$TPNAME7= <>
##$TPOAL= (0..7)
0.5 0.5 0.5 0.5 0.5 0.5 0.5 0.5 
##$TPOFFS= (0..7)
0 0 0 0 0 0 0 0 
##$TUNHIN= 0
##$TUNHOUT= 0
##$TUNXOUT= 0
##$USERA1= <user>
##$USERA2= <user>
##$USERA3= <user>
##$USERA4= <user>
##$USERA5= <user>
##$V9= 5
##$VALIST= <valist>
##$VCLIST= <CCCCCCCCCCCCCCC>
##$VD= 0
##$VDLIST= <DDDDDDDDDDDDDDD>
##$VPLIST= <PPPPPPPPPPPPPPP>
##$VTLIST= <TTTTTTTTTTTTTTT>
##$WBST= 1024
##$WBSW= 4
##$XGAIN= (0..3)
0 0 0 0 
##$XL= 0
##$YL= 0
##$YMAX_a= 397277
##$YMIN_a= -522495
##$ZGOPTNS= <>
##$ZL1= 120
##$ZL2= 120
##$ZL3= 120
##$ZL4= 120
##$ABSF1= 16.522
##$ABSF2= -4.171173
##$ABSG= 5
##$ABSL= 3
##$ALPHA= 0
##$AQORDER= 0
##$ASSFAC= 0
##$ASSFACI= 0
##$ASSFACX= 0
##$ASSWID= 0
##$AUNMP= <proc_1d>
##$AZFE= 0.1
##$AZFW= 0.1
##$BCFW= 0
##$BC_mod= 0
##$BYTORDP= 0
##$COROFFS= 0
##$CY= 12.5
##$DATMOD= 1
##$DC= 0
##$DFILT= <>
##$DTYPP= 0
##$F1P= 14.0000005364418
##$F2P= -0.99999901652339
##$FCOR= 0.5
##$FTSIZE= 32768
##$FT_mod= 6
##$GAMMA= 0
##$GB= 0
##$INTBC= 1
##$INTSCL= 1
##$ISEN= 128
##$LB= 0.3
##$LEV0= 0
##$LPBIN= 0
##$MAXI= 10000
##$MC2= 0
##$MEAN= 0
##$ME_mod= 0
##$MI= 0
##$NCOEF= 0
##$NC_proc= -3
##$NLEV= 6
##$NOISF1= 0
##$NOISF2= 0
##$NSP= 0
##$NTH_PI= 0
##$NZP= 0
##$OFFSET= 16.522
##$PC= 1
##$PHC0= 232.1561
##$PHC1= 6.137918
##$PH_mod= 1
##$PKNL= yes
##$PPARMOD= 0
##$PSCAL= 4
##$PSIGN= 0
##$REVERSE= no
##$SF= 250.13
##$SI= 32768
##$SIGF1= 0
##$SIGF2= 0
##$SINO= 400
##$SIOLD= 32768
##$SREGLST= <1H.CDCl3>
##$SSB= 0
##$STSI= 32768
##$STSR= 0
##$SW_p= 5175.98343685301
##$SYMM= 0
##$S_DEV= 0
##$TDeff= 65536
##$TDoff= 0
##$TI= <Analysis number 999999
Compound Code 99
Book Reference 9
Project Code 9>
##$TILT= no
##$TM1= 0
##$TM2= 0
##$TOPLEV= 0
##$USERP1= <user>
##$USERP2= <user>
##$USERP3= <user>
##$USERP4= <user>
##$USERP5= <user>
##$WDW= 1
##$XDIM= 32768
##$YMAX_p= 483564162
##$YMIN_p= -96321
$$ End of Bruker specific parameters
$$ ---------------------------------
##NTUPLES= NMR SPECTRUM
##VAR_NAME=  FREQUENCY,     SPECTRUM/REAL,   SPECTRUM/IMAG
##SYMBOL=    X,             R,               I
##VAR_TYPE=  INDEPENDENT,   DEPENDENT,       DEPENDENT
##VAR_FORM=  AFFN,          ASDF,            ASDF
##VAR_DIM=   32768,         32768,           32768
##UNITS=     HZ,            ARBITRARY UNITS, ARBITRARY UNITS
##FACTOR=    0.157963299565203, 1,           1
##FIRST=     4132.6476996994, 0,             0
##LAST=      -1043.33573715361, 0,           0
##MIN=       -1043.33573715361, -96321,      0
##MAX=       4132.6476996994, 483564162,     0
$$ Real data points
##PAGE= N=1
##DATA TABLE= (X++(R..R)), XYDATA
$$ [...]
16582B123J2295p552k164M673J3122J9520K902j6851j5087j2757K2497J6847O107
16569D5675n951j5890l395j6502k3851P449j4269K4116K87k6479n552j3891j260
16556d9513K3759J3400l568J7738Q922O979K470n921j8776n928P328j0336O009
16543g437J6573Q67j5117N504n152p475k2867j7015L166J5042N668o045Q926K4671
16529f91L233L803p637j8930J475k1596q24J5193J3825J380J5972J1444j5088
16516A559R178j1146j934k290O114n526J8594l478j7271N122R796n287j3104j6811
16502b6484K564J2284J7296N703J6124k3398n480L65n404j6779J4423J9040k854
16489G400Q389J1844j2820l3941k0337p334K3092K7936J850k7349j7518P511L424
$$ plain form
16582 2123 14418 6866 4702 9375 22497 42017 44919 28068 12981 224 22721 39568 45675
16569 45675 39724 23834 20439 3937 -19914 -12465 -26734 -2618 -2331 -28810 -34362 -48253 -49513
16556 -49513 -25754 -12354 -15922 1816 10738 17717 20187 14266 -4510 -10438 -3110 -13446 -7437
16543 -7437 9136 10003 -5114 390 -4762 -12237 -35104 -52119 -48953 -33911 -28243 -34288 -25362 -691
16529 -691 2542 6345 -1292 -20222 -18747 -40343 -41167 -25974 -12149 -10769 5203 16647 1559
16516 1559 10737 -409 -2343 -4633 1481 -4045 14549 11071 -6200 -1078 8718 3431 -9673 -26484
16502 -26484 -23920 -11636 5660 11363 27487 4089 -1391 -1026 -6430 -23209 -8786 10254 7400
16489 7400 15789 27633 14813 -19128 -39465 -46799 -23707 4229 6079 -21270 -38788 -31277 -27853
16476b7853k1558O044K5869o459j8117K7154J3536j3687j4321L449J0363j5329
16464c0909j4696J7867K4513K8538J7021L558k1493k874N886k4508K669K102k5276
16451a7602M66R53J1006J4912Q114n394j8461J7550O614p330m8885m191L0818
16438a1430K4820J44Q507k4659j0895J3071k1101q472Q817L545K5315J1215k5555
16425f678j6496j2055J0232o040j7301K9222J9365Q384j8610j372J7098J0981
16413A6730n506k1257L510J2357j3901j3431R704P442j4829l8425j915L3171J4173
16400a2177r43Q725r365O835P362n597k4731J670J9734M424J4733j1530k1713
16387b2573j0289p387K81K5297k0884r63J0266J673L4497M605k5095j1303K6949
$$ plain form
16476 -27853 -49411 -43367 -17498 -23957 -42074 -14920 -1384 -15071 -29392 -25943 -15580 -30909
16464 -30909 -45605 -27738 -3225 25313 42334 45892 24399 21525 27411 2903 5572 7674 -17602
16451 -17602 -17136 -16183 -5177 9735 17849 12455 -6006 11544 18158 10828 -38057 -42248 -11430
16438 -11430 13390 13534 22041 -2618 -13513 -442 -21543 -30015 -21198 -17653 7662 18877 -6678
16425 -6678 -23174 -35229 -24997 -31037 -48338 -19116 249 8633 -9977 -11349 5749 16730
16413 16730 11224 -10033 -6523 5834 -8067 -21498 -11794 -4352 -19181 -57606 -59521 -26350 -12177
16400 -12177 -13120 -4395 -13760 -6925 437 -5160 -29891 -28221 -8487 -4063 10670 -860 -22573
16387 -22573 -32862 -40249 -39968 -14671 -35555 -36518 -26252 -24579 9918 14523 -10572 -21875 5074
16374E074O253p312J2477k289k0584m574l1173K905J6866j3746j376J7612K6271
16361F404J7438k0848j5201q007P143Q244j3030o243J8122J4301j4039k9330j0638
16348d5684Q493J0806Q744M572O453k5876j1469J7465J2525K4578k1321j3697
16336b4411r974J0592K9099o64j4571M668j3387o193K4070o655K3615K0715q894
16323B8010j2991j5835l2174k2776j6245k2830P203N912j573m787L7655K2203
16311b8228P978r103o0j5437j0738r636R943R277J6250J0171p165J5697J5347
16298D296j6609m959J5928k0201r366J109J2752j4367j3203m166N637k771K6871
16285a9049K1754P595J2638q074k6992k2406M193R422j6135J158J8996k22j6197
$$ plain form
16374 5074 11327 4015 16492 14203 -6381 -10955 -42128 -39223 -22357 -36103 -37479 -19867 6404
16361 6404 23842 2994 -12207 -20214 -13071 -4827 -17857 -24100 -5978 8323 -5716 -35046 -45684
16348 -45684 -37191 -26385 -17641 -13069 -6616 -32492 -43961 -26496 -13971 10607 -10714 -24411
16336 -24411 -34385 -23793 5306 4642 -9929 -5261 -18648 -24841 -771 -7426 16189 36904 28010
16323 28010 15019 -816 -32990 -55766 -72011 -94841 -87638 -81726 -83299 -88086 -50431 -28228
16311 -28228 -20250 -29353 -29413 -44850 -55588 -65224 -55281 -46004 -29754 -19583 -26748 -11051 4296
16298 4296 -12313 -17272 -1344 -21545 -30911 -29802 -17050 -31417 -44620 -48786 -43149 -45920 -19049
16285 -19049 2705 10300 22938 14864 -12128 -34534 -30341 -20919 -37054 -35896 -16900 -17122 -33319
16272c3319R353J4369J1111l0479J061N117L2445J6881m576J2142j0853P896j1038
16259B0110k773l140j7633j1262N443J4605n768Q789L518o793J2074j7344r287
16246i461j3419o369K1800j0372j3459J6827K2636k767j1403n508J317J5145j8155
16233a3188o339j7473l3265m488K1721J8293J7407R79m588k072O31K0105K0537
16220A8260K72j5515k3330m997J2093m116m507O946k6194k0553J0264Q11j5525
16207f6091j011R363M088J4782L6082p053j9234j831P719M0285J9154M982n2M164
16193D5347K431j4667n711P803n569O032j797l7515k0606l888Q74m127Q040J2466
16179a0887P36p825q64q079J3114J9585J318m033K0358J2052j7658j9438l4471
$$ plain form
16272 -33319 -23966 -9597 1514 -28965 -27904 -22787 9658 26539 21963 34105 23252 31148 20110
16259 20110 17337 14197 -3436 -14698 -9255 5350 -418 8371 11889 5096 17170 -174 -9461
16246 -9461 -22880 -29249 -7449 -17821 -31280 -14453 8183 5416 -5987 -11495 -10178 4967 -13188
16233 -13188 -19527 -37000 -70265 -74753 -53032 -34739 -17332 -16353 -20941 -23013 -22382 -2277 18260
16220 18260 18532 3017 -20313 -25310 -13217 -17333 -21840 -14894 -41088 -61641 -51377 -50566 -66091
16207 -66091 -67102 -57739 -53651 -38869 -2787 -9840 -29074 -30905 -23186 17099 36253 41235 41183 45347
16193 45347 47778 33111 27400 35203 29634 35666 33869 -3646 -24252 -28140 -27266 -31393 -23353 -10887
16179 -10887 -10151 -17976 -18840 -26919 -13805 5780 7098 3065 23423 35475 17817 -1621 -36092
16166c6092k5333n210L1347j7988k4472K3045J6445K1745J4433K6313k1435j5454
16154a2656N365J5000J2503q760j5499J446p615M268J8687k0321J4649L965j5694
16141d662p42J9443J8865m385r4o156m288j7642j5168j0176j2229j0776R962K2666
16127a5382J2928J7852r393K3318j5331j4896M400R081r848k8651J6570O534j1780
16114a4598O472J3914l1813k1528Q086l648K844K5464J2258j7519k3662P991J6622
16101a9117J3662N386R121q769J827J8194K40j1730J1335J5383J2474j7371m003
16088B6632M57k0268R450r411k6022m673O886J6399N551Q749p228n315q933q930
16074a6656j0142j1191p31K7364J9000j4524k710K1456j0150m802j0603K176P60
$$ plain form
16166 -36092 -61425 -66635 -35288 -53276 -77748 -54703 -38258 -16513 -2080 24233 2798 -12656
16154 -12656 -7291 7709 20212 11452 -4047 -2601 -10216 -5948 12739 -7582 7067 11032 -4662
16141 -4662 -5404 14039 32904 28519 28425 22269 17981 339 -14829 -25005 -37234 -48010 -38048 -15382
16127 -15382 -2454 15398 6005 29323 13992 -904 3496 12577 2729 -25922 -9352 -2818 -14598
16114 -14598 -8126 5788 -26025 -47553 -39467 -43115 -40271 -14807 -2549 -20068 -43730 -35739 -19117
16101 -19117 -5455 -69 9052 283 2110 20304 20544 8814 20149 35532 48006 30635 26632
16088 26632 27089 6821 16271 6860 -19162 -23835 -16949 -550 5001 13750 6522 1207 -7726 -16656
16074 -16656 -26798 -37989 -38720 -11356 7644 -6880 -9590 11866 1716 -3086 -13689 -11513 -10753
16061a0753J3558j1197K8375J5311m997j1612j619n427p852L1867p566k1078j4086
16048g076J9121J0690k676k6656k2259J069P668J8007k959J297j78Q763q405R958
16034F364j7032j2695j2394J2872J9142p204o770j0146l2055K6966J0018J0506
16022a2428J9315o344k1094j848L411M932q053J670K2238J1965j1144m491J1621
16009I750j3983J9191j3041P235R413J510j3516j3782J4880K7298J9363j1980
15997D2338l1688k9608q843l2573k1581J6961L7213J8839K0122P5R30M05o320
15984F270P334J2144J3957n716k3821p722j1917N699j4951O14J8113j2236R907
15971b325q308J2425M913r63J2626L970J7981l259l5573m371O407j5724J1358
$$ plain form
16061 -10753 2805 -8392 19983 35294 30297 18685 17066 11639 3787 35654 28088 7010 -7076
16048 -7076 12045 22735 20059 -6597 -28856 -27787 -20119 -2112 -5071 -3774 -3952 4811 -3594 6364
16034 6364 -10668 -23363 -35757 -22885 -3743 -10947 -17717 -27863 -59918 -32952 -22934 -12428
16022 -12428 6887 543 -20551 -22399 -18988 -14056 -22109 -20439 1799 13764 2620 -1871 9750
16009 9750 -4233 14958 1917 9152 18565 20075 6559 -7223 7657 34955 54318 42338
15997 42338 10650 -18958 -27801 -60374 -81955 -64994 -27781 -8942 11180 11255 12185 12590 6270
15984 6270 13604 25748 39705 33989 10168 2446 -9471 -3772 -18723 -18109 4 -12232 -2325
15971 -2325 -10633 1792 6705 5742 18368 22338 40319 37060 1487 -2884 3523 -12201 -843
15958h43K5553J2935o046o461q137r103p493j310j0080o670J7968J2068Q474K614
15944B3469l1403N563J6734j6851J9016k0768p549l192J2197J6799q157K075j3481
15931e548Q014Q991j1647o25L90N575P483l424j7450J2207J0247K717n762q974
15917B194n902J0664p712j8050k3750j4864m714j1255K5129J2595M2J4728M650
15904a6245k255l732K0534j20j0979q171O747P19q439m332J4435k248K365K631
15890i090j2996j1428N504M171L0807K2869k3562k2257j8148j2942K7631K3490
15878D049J778j7568P816K4525o325j3514N595K2713J1051j6140q752k7045j071
15865a2888J3357r722J6044J2255J1184K834M462k9484l6054L811L718J8409J5571
$$ plain form
15958 -843 24710 37645 31599 25138 17001 7898 405 -905 -10985 -17655 313 12381 20855 23469
15944 23469 -7934 -2371 14363 -2488 16528 -4240 -11789 -14981 -2784 14015 5858 7933 -5548
15931 -5548 2466 11457 -190 -815 -425 5150 12633 9209 -8241 3966 14213 16930 11168 2194
15917 2194 -3708 6956 -756 -18806 -42556 -57420 -62134 -73389 -48260 -35665 -35623 -20895 -16245
15904 -16245 -18500 -22232 -1698 -1818 -12797 -20968 -14221 -13502 -21941 -26273 -11838 -14086 -11721 -9090
15890 -9090 -22086 -33514 -28010 -23839 6968 29837 6275 -15982 -34130 -47072 -19441 4049
15878 4049 5827 -11741 -3925 20600 14275 761 6356 29069 40120 23980 15228 -11817 -12888
15865 -12888 469 -9253 6791 19046 30230 33064 37526 8042 -28012 -24201 -20483 -2074 13497
15852A3497r457J7212j4271l981N49j8442k9359P235l621j5822P412K3087P826
15839a8135K069N816J5827L47L389J1283J760p112O661O889n851k4815k2607J5931
15825h548O461N350k044j4226J206k762k2287l679J1318o385j693K0117L573j3773
15811b7372M382Q451N49R09O406j03p328l337J3262n920m589J3636J3111o846
15797E211q734q23O624o464J295O741j488j2029K661n678p048j812k6582P906
15783d0220K2656p580j2067K9452K0515J0316j7918l013P704M538K0509q51j4175
15770A9866K841k4249o289J8068m803o589j4936J7381K1685M566k3287k6811L748
15757a8809j3018K0526J7767j8742j4071K7903k6523N267L0320J1456j1443j5843
$$ plain form
15852 13497 4040 21252 6981 3000 3549 -14893 -44252 -37017 -40638 -56460 -49048 -25961 -18135
15839 -18135 -16066 -10250 5577 5924 9313 20596 22356 15244 21905 28794 22943 -1872 -24479 -8548
15825 -8548 -2087 3263 1219 -13007 -11801 -14563 -36850 -40529 -29211 -35596 -37289 -17172 -13599 -27372
15811 -27372 -22990 -14539 -13990 -13081 -6675 -6778 -14106 -17443 -4181 -10101 -14690 -1054 12057 5211
15797 5211 -3523 -4346 2278 -4186 -2891 3850 2362 -9667 -7006 -12684 -19732 -21544 -48126 -40220
15783 -40220 -17564 -25144 -37211 -7759 12756 23072 5154 2141 9845 14383 34892 34041 19866
15770 19866 22707 -1542 -7831 10237 5434 -1155 -16091 1290 22975 27541 4254 -22557 -18809
15757 -18809 -31827 -11301 6466 -12276 -26347 1556 -24967 -19700 10620 22076 10633 -5210
15745e210q072K1921R019l0974k695J1481J0226m66j0628k1986l145M073J8077
15732h379p83N875J5862j5531L637q496N481J4440R713J025l3297J3332O43j6002
15718a2480o255M578j1144r504m984Q135K1901L605l6784p634K1189J6391N565
15705g421j7243k1477K3837L232l356p9J2190q05p335K126j0118J0352Q067j551
15691i581k7938r655Q742K7052L0111K3601j2872j8716j9088l2835m290N399J4152
15678b5918J5779j2730m213p699J1208J0493n25j5033K3232m828m440o043J9859
15665h58k1559j5787R502m75j593K3552K2739K654k1571J269r143j1186q28J3970
15651i314Q793L0245m261j2897O764N102j4403l1203R671m122n757K1267J0338
$$ plain form
15745 -5210 -13282 8639 17658 -13316 -16011 -4530 5696 5230 -5398 -27384 -30529 -26456 -8379
15732 -8379 -9162 -3287 12575 -2956 681 -7815 -2334 12106 21819 22844 -10453 2879 3522 -12480
15718 -12480 -18735 -14157 -25301 -34805 -39789 -31654 -9753 -6148 -42932 -50566 -29377 -12986 -7421
15705 -7421 -24664 -46141 -22304 -19072 -22428 -22507 -10317 -11122 -18457 -16331 -26449 -16097 -8030 -9581
15691 -9581 -37519 -47174 -38432 -11380 18731 42332 29460 10744 -8344 -41179 -45469 -40070 -25918
15678 -25918 -10139 -22869 -27082 -34781 -23573 -13080 -13605 -28638 -5406 -10234 -14674 -20717 -858
15665 -858 -22417 -38204 -28702 -29177 -30770 -7218 15521 18175 -3396 -2127 -11270 -22456 -23284 -9314
15651 -9314 -521 29724 25463 12566 19330 24432 10029 -21174 -11503 -15625 -21382 -115 10223
15638A0223J954k3074k7692L313J78R963j1529m732J7607J8282q826L245N280
15625e808J8219j8970q994O20K1047L0327p312j3194p739n899r542j9652q534
15612c5431J2471J8408K8848J367r881o289j0650k977p508j6235K0623K3048j2060
15599C734m927K8869k92k7023P728r274R808J0919j2430k1240l719j553J0059
15586i341M597N535J696k4534O398m001k1884O2O508P41M951K6500j0910j4550
15572b8232J9706R607k711K204j3758j6096K0988Q897J58L645r642j8872j5625
15559c9731K9501j1029j9546k225R728J0912O049J0560L604Q5j0455k500j4261
15546b9308p464J8416K2190j148P592J7426J2685J3915q749q862J3843q217j276
$$ plain form
15638 10223 12177 -10897 -38589 -35276 -35098 -25135 -36664 -41396 -23789 -5507 -14333 -11088 -5808
15625 -5808 12411 -6559 -15553 -14933 6114 36441 29129 15935 8196 2297 -7245 -26897 -35431
15612 -35431 -22960 -4552 24296 25663 15782 9493 -1157 -4134 -11642 -27877 -7254 15794 3734
15599 3734 -1193 27676 27384 361 8089 -1185 8623 19542 7112 -14128 -17847 -19400 -9341
15586 -9341 -4744 791 2487 -22047 -15649 -19650 -41534 -41472 -34964 -34223 -29272 -2772 -13682 -28232
15572 -28232 -8526 1081 -1630 574 -13184 -29280 -8292 605 763 4408 -5234 -24106 -39731
15559 -39731 -10230 -21259 -40805 -43030 -33302 -22390 -16341 -5781 -2177 -2092 -12547 -15047 -29308
15546 -29308 -36772 -18356 3834 2686 10278 27704 40389 54304 45555 36693 50536 42319 41043
15533D1043r425k9688j7137m703M273r63M437P343m435J0956J1720j2366j5282
15520a4227l140N663K162p097j3407k1911l576N645J7134J5141K748k7513j2272
15507e4650j843K5573L3405J5148l0197l2264o187K2866K2338J1036K470J353
15495I048j0927k1257j0939J4395J9367K226j1987j5654oq315p788K3138K3459
15482D760L259K4660j2056j9120R736m520K0682J5680j5962j6346j1399j0422
15470a1048k1077k2439j1274J5471K4900J9412P742Q994N233J2594J5704n604
15458C8608j0707j0812k4087j5511j7333N07J1475O049K3435J0934J3466k65k8619
15445b860K567J6755M402m173n68q023j8444j8039J3721M661j7046j174L2K6994
$$ plain form
15533 41043 31618 1930 -15207 -19910 -15637 -16600 -12163 -4820 -9255 1701 13421 1055 -14227
15520 -14227 -17367 -11704 -9542 -16639 -30046 -51957 -55533 -49888 -32754 -17613 -14865 -42378 -54650
15507 -54650 -56493 -30920 2485 17633 -12564 -44828 -51015 -28149 -5811 5225 7695 9048
15495 9048 -1879 -23136 -34075 -19680 -313 1913 -10074 -25728 -25734 -34049 -41837 -18699 4760
15482 4760 8019 32679 20623 1503 11239 6719 27401 43081 27119 10773 -626 -11048
15470 -11048 -32125 -54564 -65838 -50367 -25467 -6055 1687 10681 15914 28508 44212 38608
15458 38608 27901 17089 -6998 -22509 -39842 -39335 -27860 -21811 1624 12558 26024 25759 -2860
15445 -2860 -293 16462 20864 16691 16123 8100 -10344 -28383 -14662 -10001 -27047 -28221 -28189 -1195
15431a195o266m604l446J5254m862M359Q485M2j4760o47J2430j9107j1187J0155
15417a5349L034r874m344j128K5027K1378k1362j9785J4408K1724J8483K956j7286
15404A7882j8464l898J3175n078R62n566n233J2828J0769L17k3563j0137m879
15391b0885M797K214L332K443L71K2469j787l248N835L432j0278j1345j0033k252
15377a4935j5983o957o688P385O769K0266R592J079k4190p318l477m60J617K9310
15363c990J5013l190j1988R97P132q147o880k8987j0998P566K7042J5228M264
15350C062J7417J5523r176j8285j6245k0333Q023K1010J1786l413j6874O452j0966
15337a2019q430J4515J0451j0231j9153o471m09o245l058m048m317J9376K3260
$$ plain form
15431 -1195 -7461 -12065 -15511 -257 -5119 -760 7725 7767 -6993 -7640 4790 -14317 -25504 -15349
15417 -15349 -12315 -22189 -26533 -27661 -2634 18744 -2618 -22403 -7995 13729 32212 35168 17882
15404 17882 -582 -4480 8695 3617 4579 -987 -6220 6608 17377 17694 -5869 -16006 -20885
15391 -20885 -16088 -13874 -10542 -8099 -7728 14741 12954 9706 15541 18973 8695 -2650 -12683 -14935
15377 -14935 -30918 -37875 -44563 -37178 -30409 -10143 -551 528 -23662 -30980 -34457 -34917 -33300 -3990
15363 -3990 11023 7833 -4155 -3158 3974 -4173 -11053 -40040 -51038 -43472 -16430 -1202 3062
15350 3062 20479 36002 26826 8541 -7704 -28037 -20014 996 12782 9369 -7505 -1053 -12019
15337 -12019 -20449 -5934 4517 -5714 -24867 -31338 -31747 -37992 -41050 -45098 -49415 -30039 -6779
15324f779Q924j1394j2806l6366J1912J5604K233J498k6097J1120L3601K51p07
15311i006r519J3942L5155q594K643o34l344N191j4534K1274K963k1305p874j9833
15297a3475j3749J1435L0037n176k1942j3701O549L2603O022k6593j0361l64J4172
15284d543p964m364K5502O466j0051k2978k019L134K462o224M129L6691O592j2817
15270A4016l1912L779Q184j2918N840J3653R298j9121j6516k1086l5663l341K007
15257h3780p15J1346K3991J5387L7476P865k7538l0404P152m223R806j738k182
15244c7557l1896o350J5461K3096L018j394j6782j4567J9400K6431j7875j3316
15232e2331K6165p13l004K6584l932L833N5077K5314l2043n4244k8771L1924m924
$$ plain form
15324 -6779 2145 -9249 -22055 -58421 -46509 -30905 -28672 -27174 -53271 -42151 -8550 -8299 -9006
15311 -9006 -18525 -4583 30572 21978 24621 23987 20643 25834 11300 32574 35537 14232 6358 -13475
15297 -13475 -27224 -15789 14248 9072 -12870 -26571 -20022 12581 18603 -7990 -18351 -18715 -4543
15284 -4543 -12507 -16871 8631 15097 5046 -17932 -19951 -16817 -14355 -20579 -16450 20241 26833 14016
15270 14016 -17896 -14117 -5933 -18851 -13011 642 9940 -9181 -25697 -46783 -82446 -85787 -83780
15257 -83780 -84495 -73149 -49158 -33771 3705 11570 -15968 -46372 -39220 -43443 -33637 -35375 -37557
15244 -37557 -69453 -75803 -60342 -37246 -34228 -35622 -52404 -66971 -47571 -21140 -39015 -52331
15232 -52331 -26166 -26879 -29883 -3299 -7231 -3398 51679 76993 44950 -9294 -38065 -6141 -11065
15219a1065k947o723J4320K6800j2720j6604j1394j0724j8361J0783J9813K4537
15207E715K4964j5604j6623J3331j8108j8113M164J0836O893m604j152j2103O575
15194a3829j2881l223k775j5920M933j0824j0425J8577L5915M908O610R208L160
15181A3434J050O181k5154j2435j7580k5320K3921J3469O89k3122K0852K7820
15169C805J8163k7095j764J5959K4702N847j7708r153j3918J6669K680J9376p594
15156B9969j3234N17p295p845j445j6725J1187k3k3092l2228O391J9469j05K7868
15142f591Q188j4502M101o502J7767J3974Q095k8277l216K728k5636j3594p843
15129e1308J1696L3456J4482j0171j4357q308k168l101M621K6402K4623l693j7667
$$ plain form
15219 -11065 -14012 -20735 -6415 20385 7665 -8939 -20333 -31057 -49418 -38635 -18822 5715
15207 5715 30679 15075 -1548 11783 -6325 -24438 -20274 -9438 -2545 -7149 -8301 -20404 -13829
15194 -13829 -26710 -29933 -32708 -48628 -43695 -54519 -64944 -46367 -10452 -5544 1066 10274 13434
15181 13434 14484 20665 -4489 -16924 -34504 -59824 -35903 -22434 -21745 -44867 -24015 3805
15169 3805 21968 -5127 -6891 9068 33770 39617 21909 12756 -1162 15507 18187 37563 29969
15156 29969 16735 17252 9957 2112 667 -16058 -4871 -4894 -27986 -60214 -53823 -34354 -34459 -6591
15142 -6591 1597 -12905 -8804 -15306 2461 16435 24530 -3747 -6963 -4235 -29871 -43465 -51308
15129 -51308 -39612 -6156 8326 -1845 -16202 -24510 -26678 -29779 -25158 1244 25867 22174 4507
15116D507l301n411r524j3226L343k2012m43J287J1131J3763j8286p201J8136
15103b7237K325q158J0405J6846P056r935j7018P781p414J4598k1524k4598J1025
15090d5848n296l08K1937L1214l463o922r810q792J2598N101J2546N015p579k497
15076b104r012l6899j3719L0875L8712J3655J49J4900l5013r348o445j0216P013
15063a7452M886J3374n962j8075j8702n105J5052Q244O777o992P976K4468L936
15050A2425P699J82j4725j3190k6805M508J4419L1384J692j7148p360r686m725
15037b1330j9639q607j350J0275k47J0307J5033J6261L48j2246o235j454j2696
15024c1580P132J8597k68J5167K5954j0538m621j2214j0482N887J2892J358j5641
$$ plain form
15116 4507 1206 -4205 -13729 -26955 -23612 -45624 -46067 -44780 -33649 -19886 -38172 -45373 -27237
15103 -27237 -24912 -33070 -22665 -5819 1237 -8698 -25716 -17935 -25349 -10751 -32275 -56873 -45848
15090 -45848 -51144 -51452 -29515 1699 -1764 -8686 -18496 -27288 -14690 -9589 2957 7972 393 -2104
15076 -2104 -11116 -48015 -61734 -30859 7853 21508 21657 36557 1544 -7804 -14249 -24465 -17452
15063 -17452 -12566 808 -5154 -23229 -41931 -47036 -31984 -23740 -16963 -23955 -15979 8489 12425
15050 12425 20124 20306 5581 -7609 -34414 -29906 -15487 15897 17589 441 -6919 -16605 -21330
15037 -21330 -40969 -49576 -50926 -40651 -40898 -30591 -15558 703 1051 -11195 -17430 -18884 -31580
15024 -31580 -24448 -5851 -6119 9048 35002 24464 19843 7629 -2853 3034 15926 17284 1643
15011A643l273K6461n438k6075j5781m087J1317J8600j8582q167j6355j075J9504
14998b1308J0573K786J688k821p53p651J8827j6346k207Q245Q647k6622k0330
14985d7272j4468K2860K5658K9328L2934j8883k1378J383k5010j5703l662N082
14973b9131R558K1948J712j5336K834R732k259o354Q875j0753j5147N1829J7773
14960D5281k6461j9676p154n585j6994l886l765o89J8078N380k864o586K2352
14947b569O963r598j0023m875R661O852r989O868J647k5935j7418J5133J541j1213
14933d2955L825K5045K037k872r92P597O068j2045J66q77P155n533l652J0542
14919f491J6862k7407k3654L356J8793J6428J571k557j3420l3814P656K1089J587
$$ plain form
15011 1643 -1630 24831 19393 -6682 -22463 -26550 -15233 3367 -15215 -23382 -39737 -40812 -21308
14998 -21308 -10735 -7949 -6261 -9082 -9835 -17486 1341 -15005 -17212 -8967 -320 -26942 -47272
14985 -47272 -61740 -38880 -13222 16106 49040 30157 8779 10162 -14848 -30551 -34213 -29131
14973 -29131 -19573 2375 4087 -11249 -8415 1317 -942 -7296 1579 -9174 -24321 27508 45281
14960 45281 18820 -856 -8010 -13595 -30589 -34475 -38240 -38929 -20851 -15471 -18335 -24921 -2569
14947 -2569 4394 -5204 -15227 -20102 -10441 -3589 -13578 -6710 -5063 -30998 -48416 -33283 -31742 -42955
14933 -42955 -39130 -14085 -12048 -14920 -15912 -8315 -2247 -14292 -14126 -15003 -7848 -13381 -17033 -6491
14919 -6491 10371 -17036 -40690 -37334 -18541 -2113 -542 -3099 -16519 -50333 -42677 -21588 -20001
14906b0001M510J1102n056j1031Q42L689n998R447Q465K5573l541j9399j9540
14893b0938m507N865r004L33J7918J9340J5452p215q277Q724J4585j2010k6923
14880f657j8677m727K2966L074j7437q124J3168K3358q897j105K143K285K2206
14867B3576p078j8176J1592n54J053j6803r822k0269J9050J1756P983N371J34
14854G813j1270j6929M605J8818q43j7851K1747J1537k758j3240k2908j2925K4358
14841i846j0577J1700J6476K609L94L410O468j3985P15m993n812r678P041l503
14827i581p628R64j6255q659J8832J7134J3071J5017J4396n973j4461l0991k1700
14814c5834Q732Q005J3122K160k7660K376K0097O08k57J439N673l5j74j6380m305
$$ plain form
14906 -20001 -15491 -4389 -9445 -20476 -19634 -15945 -21943 -12496 -4031 21542 18001 -1398 -20938
14893 -20938 -25445 -19580 -28584 -28251 -10333 9007 24459 17244 8967 17691 32276 20266 -6657
14880 -6657 -25334 -30061 -7095 -4021 -21458 -29582 -16414 6944 -1953 -3058 -915 1370 23576
14867 23576 16498 -1678 9914 9360 10413 -6390 -16212 -36481 -17431 -5675 2308 7679 7813
14854 7813 -3457 -20386 -15781 3037 2194 -15657 6090 17627 14869 1629 -21279 -34204 -9846
14841 -9846 -20423 -8723 7753 10362 10756 14166 20634 6649 7364 2371 -3441 -13119 -6078 -9581
14827 -9581 -17209 -16245 -32500 -41159 -22327 -5193 7878 22895 37291 31318 16857 -14134 -35834
14814 -35834 -27102 -19097 -5975 -3815 -31475 -29099 -9002 -8394 -8651 -7212 -1539 -1574 -1748 -18128 -22433
14799b2433j5926o135L335J5457O129j2222p892K4284R995n770j2826J8937J717
14786c350J2280k742j9663k611n309J4594J4964Q321M475j9624j1666r143j031
14773b0505J782o237J7530o903l111R255l1354j4537J051l335J3520J7658R895
14760a5291J6458k9282j8136O990J2559K3690j5786L3J1446J0003n200j8005j0764
14747c1285m145N278N237K1265J043p751N33q315j9292K897J3655n544j582K0448
14733g558J7510j1716J472l258k281m080q064P988o565k5571Q648K0713L868K608
14719f286R07rJ5512J7357J0532L065k140j8770k4278L460p36n803N255k7494
14705b9428p14K9525J8665k33J0438o976l0191j279L5711m130n885p593j2495
$$ plain form
14799 -22433 -38359 -44494 -41159 -25702 -19573 -31795 -39687 -15403 -5408 -11178 -24004 -5067 -3350
14786 -3350 8930 6188 -13475 -16086 -21395 -6801 8163 16484 20959 1335 -10331 -19474 -20505
14773 -20505 -18723 -24960 -7430 -14333 -17444 -8189 -39543 -54080 -53029 -56364 -42844 -25186 -15291
14760 -15291 1167 -28115 -46251 -39261 -26702 -3012 -18798 -18765 -7319 2684 -2516 -20521 -31285
14747 -31285 -35430 -30152 -24915 -3650 -2607 -10358 -9825 -18140 -37432 -34535 -20880 -26424 -28006 -7558
14733 -7558 9952 -1764 -292 -3550 -5831 -9911 -17975 -9987 -16552 -42123 -33475 -12762 -8894 -6286
14719 -6286 -5379 -5388 10124 27481 38013 41078 38938 20168 -4110 -650 -1386 -7189 -1934 -29428
14705 -29428 -30142 -617 18048 17815 28253 21277 -8914 -10193 25518 21388 15503 7910 -4585
14692d585J791j813M973K005J8053O33j587j2407j5974K2673m400l9322J6187
14679a3773K2227Q54k6579j0720L1613J7197j4446l657J4199R536j3718j2970
14667b37k6056l3165j096K0600J8547P802m152Q26N825k8517n459J6015J9048
14654a0019J4548L22j1417k8858K922J6528M839j4298l680j7364P407K4780J0820
14641c470K9708j1900p240J9353l331Q001J3807j9631R100J149m186J34J7146
14628D8640K1100j9366k4123k8213k1283R782M782p344N819J2760r560r366o581
14615b2953J3296L0562j3802j5088R991J8077J94l8644k0750J4126J8773j4416
14603b0634o680L1268Q573j848K670K1441Q617o150l8226l4702K2094N162k709
$$ plain form
14692 -4585 -2794 -4607 366 2371 20424 21057 19470 7063 -8911 13762 9362 -29960 -13773
14679 -13773 8454 9308 -17271 -27991 3622 20819 6373 2716 16915 26451 12733 -237
14667 -237 -26293 -59458 -60554 -39954 -21407 -13605 -17757 -16931 -11106 -39623 -45082 -29067 -10019
14654 -10019 4529 4851 -6566 -35424 -32502 -15974 -11135 -25433 -29113 -46477 -39070 -14290 -3470
14641 -3470 26238 14338 7098 26451 23120 31121 44928 25297 34397 35546 31360 31494 48640
14628 48640 69740 50374 26251 -1962 -23245 -13463 -8681 -16025 -10206 2554 -7006 -16372 -22953
14615 -22953 -9657 20905 7103 -7985 2006 20083 20277 -18367 -39117 -24991 -6218 -20634
14603 -20634 -27314 3954 12527 10679 13349 34790 43407 37257 -969 -35671 -13577 -8415 -11124
14590a1124j3164l754M940k2145L137J1298K0812k0793l212J450j3931J374J5603
14577b9509R529J8172J7780q833j673j1004j5617J3476k015k1745K0273K0362
14565I196n226o563N098q375J2412J2949r974j6927q325R816k0042J8057L144
14552d760j013j3962J559P119M237J854k6590M789k28J9898J3573k0447n596Q270
14538a1297Q174n689j1786l824K1227J5909j5262l1898n59K0793L08M555L39O823
14524b187j67Q27j408j7469j1292K8401Q165q761Q058k1352l4599L0605K5038
14511C859k3354j6545m183P994K674r009K6101Q863K849L071j7877k6234n5K0306
14497b1540J9048j1795J0242K8929O535j0208r413K3402m193j2188J4778j0553
$$ plain form
14590 -11124 -24288 -28042 -23102 -45247 -42110 -30812 -10000 -30793 -34005 -32555 -46486 -45112 -29509
14577 -29509 -19980 -1808 15972 7139 5466 -5538 -21155 -7679 -9694 -31439 -11166 9196
14565 9196 3970 -2593 2505 -5870 6542 19491 9517 -7410 -15735 -5919 -25961 -7904 -4760
14552 -4760 -5773 -19735 -18176 -11057 -6820 -4966 -31556 -26767 -26995 -7097 6476 -13971 -19567 -11297
14538 -11297 -3123 -8812 -20598 -24422 -3195 12714 -2548 -34446 -35005 -14212 -13904 -9349 -9010 -2187
14524 -2187 -2354 -1527 -2935 -20404 -31696 -3295 4870 -3891 4167 -17185 -51784 -21179 3859
14511 3859 -19495 -36040 -40223 -32229 -29555 -38564 -12463 -3600 -751 2320 -15557 -41791 -41846 -21540
14497 -21540 -2492 -14287 -4045 24884 31419 21211 11798 35200 31007 18819 33597 23044
14485B3044p649J1680n618m4927k685L8181K1003q723n416j3914j0479R404P731
14472A1632l225R586k1000l704J3319n992k94j921Q765Q24j3783o431j0453N95
14458b2082k898p708l988K5628K1259j3010L748p41J3655K759K1109j4149K306
14445B5888l7077k9112J8500J695K7967l638K836K6846j2806j7397o689k461J0872
14432E424q767p000J1427k101j374n57N598L152j8937j2919K3840J7498O234j8433
14418C085k8534j147j0773J9682l177m469J281K8033j3744q349j7804j9069K5412
14405b9573N558J3457N035o686J725k8050r484K361K8835J0877j8475Q376K5335
14392I291J089j6759N06J553j0563L327R433m074J0308p350l1225J2181J826J0926
$$ plain form
14485 23044 15395 27075 21457 -23470 -26155 12026 33029 24306 18890 4976 -5503 3901 11632
14472 11632 8407 17993 -3007 -6711 6608 616 322 -1599 7166 7990 -5793 -12224 -22677 -22082
14458 -22082 -24980 -32688 -36676 -11048 10211 -2799 949 208 13863 16622 37731 23582 25888
14445 25888 -11189 -40301 -21801 -20106 7861 4223 7059 33905 21099 3702 -2987 -5448 5424
14432 5424 -3343 -10343 1084 -1017 -2391 -2948 2650 5802 -13135 -26054 -2214 15284 21518 3085
14418 3085 -25449 -26596 -37369 -17687 -20864 -25333 -24052 3981 -9763 -18112 -35916 -54985 -29573
14405 -29573 -24015 -10558 -5523 -12209 -10484 -38534 -48018 -45657 -16822 -5945 -24420 -16044 9291
14392 9291 10380 -6379 -5873 -4320 -14883 -11556 -2123 -6197 4111 -3239 -34464 -22283 -20457 -9531
14378i531J678p030L944L54J2722r510k0351r538j204M766m64O095J9700L095
14364e274m819m860q686k4172k5396j476K1801L1718K9539j4219R6K5031q065
14351A1218j9514k9499J099P280n187J0960q872K571P871J5540m524j626j5923
14338b8606j1213P137K0236K7780K909m784Q367k7182k4977l569J2558O143j2836
14325b8037K1324J3791K5070l537k3912k854J0638N775j1532r081Q897J7913l8452
14312a3997j2086n748K4134L426k1821l43K2848J2267k1654K994j2534J1699q648
14299a9463j4807R729J5555R541O487Q046M575o566n389l930j1645n110j7862
14286c0839o26l0j8880O744o090M671l339M982J6236L1493q93n03Q158r126j3323
$$ plain form
14378 -9531 -7853 -14883 -10939 -10585 2137 -7373 -27724 -37262 -38466 -33700 -34164 -28069 -8369 -5274
14364 -5274 -10093 -14953 -23639 -47811 -73207 -74683 -52882 -21164 8375 -5844 -5748 19283 11218
14351 11218 -8296 -37795 -36696 -29416 -34603 -23643 -32515 -29944 -22073 -6533 -11057 -12683 -28606
14338 -28606 -39819 -32682 -12446 15334 18243 13459 21826 -5356 -30333 -33902 -21344 -15201 -28037
14325 -28037 -6713 7078 32148 28611 4699 1845 12483 18258 6726 -2355 6542 24455 -13997
14312 -13997 -26083 -31831 -7697 -4271 -26092 -26435 -3587 8680 -12974 -9980 -22514 -10815 -19463
14299 -19463 -34270 -24541 -8986 555 7042 15088 19663 13097 7708 3778 -7867 -12977 -30839
14286 -30839 -31465 -31495 -50375 -43631 -49721 -45050 -48389 -43407 -27171 4322 3429 2926 11084 1958 -11365
14271a1365J342M93K638p608P555P80P050L459Q709N116k2118k6849p611N473
14257c2936nm714R424J1872k287m540O158Q825l35P679K1079j1228k3934l417
14243a8359N342J666L1450O069j9917R083o969j226R24P960J194k698j2935j3609
14229a2025j0324L298P49J0117r20O175J270j6960j5052j1595J586J546j1760
14216e3895r695K3453J5272J9390K1871K4374R854p055k2692j7402J1037J1194
14204B5706n449l810K346J6900L5145J3108k2810K6018M3562L1827O0524J06153
14192C29220J41769J90750K09739J86005K18169K95104K47671Q0488p456m8406
14182A843053j09207k16669k36687k55952k64002k01890j43501q7590m8187l9950
$$ plain form
14271 -11365 -10023 -9530 -6892 -14500 -6945 -6165 885 4344 13053 18169 -3949 -30798 -38409 -32936
14257 -32936 -32941 -37655 -28231 -16359 -18646 -23186 -17028 -8203 -8538 -859 20220 8992 -14942 -18359
14243 -18359 -13017 -11351 20099 26168 6251 15334 8365 7139 8063 16023 17217 14519 1584 -12025
14229 -12025 -22349 -19051 -18302 -8185 -9105 -2930 -1660 -18620 -33672 -45267 -43681 -42135 -53895
14216 -53895 -63590 -40137 -24865 -5475 16396 40770 50624 43569 20877 3475 14512 25706
14204 25706 20257 16447 18793 35693 70838 83946 61136 87154 130716 162543 223067 329220
14192 329220 470989 661739 871478 1057483 1275652 1570756 1818427 1898915 1891459 1843053
14182 1843053 1733846 1517177 1280490 1024538 760536 558646 415145 327555 279368 239418
14172B39418n6528j9875l2823r645L141J8433m974l3189k4920j9833n353q062
14160D5790l1233j6751K3068j2917j873J5948J7802Q234n621j8040j9438k6401
14148b1432Q609P174j2064m297J1034k527J536j3428P58J1218K6183M179l640
14135A3303k4827j9813K7518J4974k7383p013j5060J238k987N533J9027K8792
14123A3302M975m722M734q307l8282q413L9758L5980L671p154r811j036j6674
14110H021l1377J4226N138J2369J1201j2801J6773j957k026k596j1203j9064q857
14097b2153J864k260J7641k6508J095J3992r994R505J2173R342o906R710n266
14084B235j4810N308K6295j6742Q55P112j272j8382q991j2525J706j551l135j9484
$$ plain form
14172 239418 182890 163015 130192 120547 123688 142121 137147 103958 79038 59205 53852 45790
14160 45790 14557 -2194 20874 7957 6084 22032 39834 48068 42447 24407 4969 -21432
14148 -21432 -12823 -5649 -17713 -22010 -10976 -13503 -11967 -25395 -24637 -13419 12764 16943 13303
14135 13303 -11524 -31337 -3819 11155 -16228 -23241 -38301 -37063 -40050 -34517 -15490 13302
14123 13302 18277 13555 18289 9982 -28300 -36713 3045 39025 42696 35542 25731 24695 8021
14110 8021 -23356 -9130 -3992 8377 19578 6777 23550 21593 19567 16971 5768 -13296 -22153
14097 -22153 -20289 -22549 -4908 -31416 -30321 -16329 -26323 -16818 -4645 4697 -2209 7501 2235
14084 2235 -12575 -7267 19028 2286 3141 10253 8981 -9401 -18392 -30917 -29211 -30762 -33897 -53381
14070e3381Q655K9914o562n254P846P348j4701K125J1919j2292O807J409J2678
14057c489K269l4118j9091K3285J0952J2908J4173l5695j1584q0K0109J2193J884
14044f284n829J4490K4938R564k5709q675n94P294Q680R50K6598M041j3252J600
14030C7812K0939j3075l5396j2281p99J5928J0101J3278p574j2572n994j1912
14018a545l552M742N403K4298q953k2221K1300J0246j6349j5523j7284J5349L553
14005e36k3835K3928J7251K182o653j6233k0621l190J2520j3241J0992J3370j976
13992f042j519j3774r770p173N833j915N328J7406J8592J8004p197N029j4455
13979H347p962n749J7259j3547k4065j2693m658J0989l915K0155O691N586j3251
$$ plain form
14070 -53381 -44726 -14812 -21374 -26628 -18782 -11434 -26135 -24010 -12091 -24383 -17576 -16167 -3489
14057 -3489 -1220 -35338 -54429 -31144 -20192 -7284 6889 -28806 -40390 -40470 -20361 -8168 -6284
14044 -6284 -12113 2377 27315 36879 11170 2495 1901 9195 17875 18825 45423 49464 36212 37812
14030 37812 58751 45676 10280 -2001 -2800 13128 23229 36507 28933 16361 10367 -1545
14018 -1545 -5097 -355 5048 29346 20393 -1828 19472 29718 13369 -2154 -19438 -4089 -536
14005 -536 -24371 -443 16808 18990 12337 -3896 -24517 -27707 -15187 -28428 -17436 -4066 -6042
13992 -6042 -7561 -21335 -31105 -38278 -32445 -34360 -29032 -11626 6966 24970 17773 22802 8347
13979 8347 385 -5364 11895 -1652 -25717 -38410 -43068 -32079 -35994 -15839 -9148 -3562 -16813
13966a6813j1754J3662K5071J0465Q723k065k853K770r372Q997l579k0382q176
13953e306J6643r175j5289l700J6854j840l783o466j177J513j1913l652K8222
13940I31j995J2856P570j1927K403J0209r890l3203k5304n546p061J3595M3032
13927d330L2857N436j7868J5182M920j3647R903R885q182j9939l0073j1953O722
13914b1087O18L3021L2322O110k0319r373j1532j0099j3284m022j5693q326O405
13901c5259J106p230J2209K7606J8862j3310M972j5925K0758q363j8110j3455
13889b6139o623J745K1785K4201J3997k1143Q00Q483K473O694q559o304o840O978
13875A1548M958Q454j5072j525k368j5206j5813j241R214n431p143O468j0423
$$ plain form
13966 -16813 -28567 -14905 10166 20631 29354 27289 24436 27206 17834 26831 23252 2870 -5306
13953 -5306 11337 2162 -13127 -16827 27 -1813 -5596 -12062 -13239 -11726 -23639 -27291 931
13940 931 -1064 11792 19362 7435 9838 20047 10157 -23046 -48350 -53896 -60957 -47362 -4330
13927 -4330 28527 33963 16095 31277 36197 22550 32453 42338 34156 14217 -15856 -27809 -21087
13914 -21087 -20469 12552 44874 50984 30665 21292 9760 -339 -13623 -17645 -33338 -41664 -35259
13901 -35259 -34153 -41383 -29174 -1568 17294 3984 8956 -6969 13789 5426 -12684 -26139
13889 -26139 -32762 -31017 -9232 14969 28966 7823 8623 17106 19579 26273 17714 11410 4570 11548
13875 11548 16506 24960 9888 8363 5995 -9211 -25024 -26265 -17051 -22482 -29625 -23157 -33580
13862c3580k051k6428j2703K6766J4814K8437j018j3257O801J1139K6684P253
13850C2857J4941n574l5228R118l43j6230r44j6503j1029j181m696R65L1153J2407
13836I713j1316l4639J873N542L2216m459j0372P342J9547j1557l9715Q114K6857
13823h54m208j4773K1845K6421p950j675k3541k3666p823L14O705j0647r185J7000
13809c2037K1293j4262P159R665Q218j667O665O52O446o723M178k4654j9320J4409
13795a9978k22j2143q575r650J6214K9133K2357o320k9770o796M804N049j4732
13782c0629n184N417K7437J6270n828l038j9657l458j420L387O134n822J2051
13769d340Q553K0659j4782j2040J1699L331k6192K861k6484j7080J473K0217L2816
$$ plain form
13862 -33580 -35631 -62059 -74762 -47996 -33182 -4745 -5763 -19020 -12219 -1080 25604 32857
13850 32857 47798 42224 6996 16114 15771 -459 -1403 -17906 -28935 -30116 -34812 -33847 -2694 9713
13836 9713 -1603 -36242 -34369 -28827 3389 -1070 -11442 -4100 15447 3890 -35825 -27711 -854
13823 -854 -5062 -19835 2010 28431 20481 18806 -4735 -28401 -36224 -35910 -29205 -39852 -49037 -32037
13809 -32037 -10744 -25006 -17847 -8182 36 -1631 5034 5686 12132 5409 9587 -15067 -34387 -19978
13795 -19978 -20200 -32343 -40918 -50568 -34354 -5221 17136 10816 -18954 -25750 -20946 -15897 -30629
13782 -30629 -35813 -30396 -2959 13311 7483 4445 -15212 -18670 -20090 -16703 -10569 -16391 -4340
13769 -4340 4213 24872 10090 -1950 9749 13080 -13112 -10251 -36735 -53815 -52342 -32125 691
13756F91Q10j7692o965J4898K496M622J6739j449L096P865j7579J2155J095k8177
13742g395k164L4540Q406j2202q114l351k1891k096J260J0970K317l812N380j711
13728A37J683L0882J1755k1878k0323j2611K1328Q969j1996J1851o600l6012J3735
13715i080J6787O64l0069r086K9515J7631J680L309l780j7872k0609K3652P902
13702A0644j581L066J801q155j1301N073j3932k5798q599K559K7455L009K5578
13689I819J3447p133j4041j542n100m839K2478K127j0625n314K0641N867J4029
13676C9814J0627J0689K605j2663p910j5341j5494j733j5645R620J9653j766k0610
13663A846j1531J82r115L149j2589No748n443J715k53M130k790J56J2805j8975
$$ plain form
13756 691 1501 -16191 -23156 -8258 -5762 -1140 15599 14150 17246 25111 7532 19687 20782 -7395
13742 -7395 -9559 24981 33387 21185 13071 9720 -12171 -14267 -13007 -2037 280 -3532 1848 137
13728 137 1820 32702 44457 22579 2256 -10355 10973 19942 7946 19797 13197 -22815 -9080
13715 -9080 7707 8371 -21698 -30784 -1269 16362 18042 21351 17571 -301 -20910 2742 10644
13702 10644 9063 12129 13930 5775 -5526 -453 -14385 -40183 -48782 -46223 -18768 -15759 9819
13689 9819 23266 16133 2092 550 -4550 -9389 13089 15216 4591 -723 19918 25785 39814
13676 39814 50441 61130 63735 51072 43162 27821 12327 10594 -5051 4569 24222 22456 1846
13663 1846 -9685 -9503 -18618 -15469 -28058 -28053 -34801 -40244 -38529 -38782 -34652 -37442 -37286 -24481 -43456
13648d3456q681L2795L9266P598j2921K0470l379l7069j6529N476J6642j0077
13636i865J8953j3174j1509j6047r739L440J8268q047O738J7785J2557L736K704
13623A5800j3225J1280K3047m296n176j8639K682j5373P523K5668J0587m02j1717
13610B7759k8476l4877m872J4717L030L047P290K116j1810J4882M758J7971M6983
13597F2518J6315n191j6237l0656k2294p344P35P471J4882p679j3431j5263j0023
13584b6197j331L032J8547p77J142R680J8798J2197n203K0437P318m0262l9256
13571b1875O708K0692J616m570j3340q237K308j1568n196J4882J1106j322k2299
13558c1095O672K9317L045j6253j6972j1031K5953r109n291J6662q875J1346O061
$$ plain form
13648 -43456 -52137 -19342 19924 27522 14601 35071 31692 -5377 -21906 -16430 212 -9865
13636 -9865 9088 -4086 -15595 -31642 -41381 -37941 -19673 -27720 -20982 -3197 9360 13096 15800
13623 15800 2575 13855 36902 32606 27430 8791 11473 -3900 3623 29291 39878 39476 27759
13610 27759 -717 -35594 -40466 -25749 -22719 -19672 -12382 -10266 -22076 -7194 -2436 15535 62518
13597 62518 78833 73642 57405 26749 4455 -2889 -2154 5317 20199 12520 -911 -16174 -26197
13584 -26197 -27528 -24496 -5949 -6726 -5584 4096 22894 35091 29888 50325 57643 17381 -21875
13571 -21875 -15167 5525 7141 2571 -10769 -19006 -16698 -28266 -33462 -18580 -7474 -8796 -31095
13558 -31095 -24423 4894 7939 -8314 -25286 -36317 -10364 -19473 -24764 -8102 -16977 -5631 430
13545D30j1392o612L922o971j30j8672O142J608p430k0532Q36J2715L2880J4737
13531A531p846k5917m051J5540r589R627K9747J5463j9991j8961j2343K2K1794
13518d974j0060n403j4587O628K7010n598J7092m44j3649q880J6762L0752J03
13505C4752r523j8721j0914j3076k728J3233j0743P859J2097r690n673k103J494
13492a3736J2875M818K0094p927l1951j5338j0300m182P334J3905m72R397l006
13479a8489J6611J3147p716j0133p590K4690J077l1983J0215l199j8584Q376q309
13466c1887j2792J4776J4809P064k379N490L3138j6378p156q722J2378K2316k3162
13453G495k2252j621O273n529j8878j727O848L238J1434J2410J0805m924n625
$$ plain form
13545 430 -10962 -17574 -13652 -20623 -20753 -39425 -33283 -31675 -39105 -59637 -58801 -46086 -13206 1531
13531 1531 -6315 -32232 -36283 -20743 -30332 -20705 9042 24505 4514 -14447 -26790 -26768 -4974
13518 -4974 -15034 -20437 -35024 -28396 -1386 -6984 10108 9664 -3985 -12865 3897 34649 34752
13505 34752 25229 6508 -4406 -17482 -20210 -6977 -17720 -9861 2236 -7454 -13127 -15230 -13736
13492 -13736 -861 3957 24051 16124 -15827 -31165 -41465 -45647 -38313 -24408 -24880 -15483 -18489
13479 -18489 -1878 11269 3553 -6580 -14170 10520 11597 -20386 -10171 -13370 -31954 -23578 -31887
13466 -31887 -44679 -29903 -15094 -8030 -10409 -4919 28219 11841 4685 -4037 8341 30657 7495
13453 7495 -14757 -16378 -10105 -15634 -34512 -36239 -29391 -26153 -14719 -2309 8496 3572 -2053
13440b053K5207P66j7138n675J3484N754j2817M698j3210j5510k648J2047j7172
13427b4267J934P461O319Q997j5959j9538K1038q55M855K2194k632L900l127j7110
13413f790j5363j662j01j3060J2823M653l800J0761n725M15J6080j1270j3142
13400b6181k3153L141L5391J5442n065L722j3127P619L2390m186j7188k4001K3863
13387H667P452q907K5446J6111k5821m144j2959N437m989j805k384j7252K9412
13374A4264P727j6032j0148j2445K6274K6270J4314o763j985M490n332Q824J0959
13361F0417k3166k6728Q550J165l2807j5998L6567Q386l4943K322q446l0829n713
13348f1223J9960K6834j8580L054L2553k423k8275j4994P074J319J0316L155J4796
$$ plain form
13440 -2053 23154 23920 6782 1107 14591 20345 7528 12226 -984 -16494 -19142 -7095 -24267
13427 -24267 -22333 -14872 -8553 444 -15515 -35053 -14015 -14870 -10015 12179 9547 13447 10320 -6790
13413 -6790 -22153 -23815 -23916 -36976 -24153 -19500 -23300 -12539 -18264 -17849 -1769 -13039 -26181
13400 -26181 -49334 -46193 -10802 4640 -425 3297 -9830 -2211 30179 25993 8805 -15196 8667
13387 8667 16119 7212 32658 48769 22948 18804 5845 11282 6293 4488 2104 -15148 14264
13374 14264 21991 5959 -4189 -16634 9640 35910 50224 43461 41476 45966 40634 49458 60417
13361 60417 37251 10523 19073 20238 -12569 -28567 8000 16386 -18557 -16235 -24681 -55510 -61223
13348 -61223 -41263 -14429 -33009 -29955 2598 175 -28100 -43094 -36020 -34701 -24385 -21230 -6434
13335f434P169j5206j0127O901L181j0542l0020Q809j5464J0371K8386J7102O039
13322A65J1316k6318n412J106l055J0042R423q471p653k0506K5087J4880m058
13309c454j2533o817J7000j0360m777o48j4936j1207J1882J817J8846M0865m048
13296B1630j2582r260q751K7841j0281K510q726J1681j3688M341K12M801j2104
13283b376m524N675J0783k8453j3433K8522K1275K0961J1277k8690j6576j0600
13271f159j0108n136p229K25M8M015q359j6323J1313R858L209J3050J4768J3647
13257A6819n902J9627m818j7437l966L616L652Q986r851L737P430J6948k3360
13244A5481m2209j3153k568Q079P185J3549q200R338l97Q654R293K0961j153l9909
$$ plain form
13335 -6434 735 -14471 -24598 -17697 -14516 -25058 -55078 -46269 -61733 -51362 -22976 -5874 165
13322 165 11481 -14837 -20249 -19143 -22198 -12156 -2733 -11204 -18857 -39363 -14276 604 -3454
13309 -3454 -15987 -22804 -5804 -16164 -20941 -21589 -36525 -47732 -35850 -34033 -15187 25678 21630
13296 21630 9048 -212 -8963 18878 8597 11107 2381 14062 374 4715 4927 9728 -2376
13283 -2376 -6900 -1225 9558 -18895 -32328 -3806 17469 38430 49707 21017 4441 -6159
13271 -6159 -16267 -21403 -28632 -28407 -28359 -24344 -32703 -49026 -37713 -27855 -24646 -11596 3172 16819
13257 16819 10917 30544 25726 8289 4323 7939 11591 20577 10726 14463 21893 38841 15481
13244 15481 -26728 -39881 -42449 -34370 -27185 -13636 -21836 -12498 -12895 -4241 5052 26013 24860 -15049
13230a5049q120K8237l291j0013j3963R264J5525j2963j5187J6403N424J5479
13218A1746O479O291L0551j1311p825N150J1288j205M03J2862m092J25l3282k0596
13204F584j1523M547J2763q591L735R281n340n993P91J2399k301l0565K15n881
13190a9879k8899k928K1207J5705P791m302r729N969J8270j3050K2587n326k3148
13177a5732k7644j7084K2161M3125l347j2707r052J9524J8404J7038J6511k8823
13165B2374l3019l475O49O127k7028J370J2227J1523N453J1253N036Q19m324N331
13151A4316k865Q798M575p80P274K0317J8461J0328J6337j791k0686N746j6772
13138F3258o574K1820L9531Q065K8203J6206L8238O9284R5844J09407J15072J63790
$$ plain form
13230 -15049 -23169 5068 1777 -8236 -22199 -12935 2590 -10373 -25560 -9157 -3733 11746
13218 11746 18225 24516 55067 43756 35931 41081 52369 51164 51567 64429 60337 60462 27180 6584
13204 6584 -4939 -392 12371 3780 7515 16796 11456 5463 6254 18653 16352 -14213 -13998 -19879
13190 -19879 -48778 -51706 -30499 -14794 -7003 -11305 -21034 -15065 3205 -9845 12742 7416 -15732
13177 -15732 -43376 -60460 -38299 4826 1479 -11228 -20280 -756 17648 34686 51197 22374
13165 22374 -10645 -14120 -13471 -7344 -34372 -33002 -20775 -9252 -3799 7454 12490 13309 8985 14316
13151 14316 11451 20249 24824 24044 31318 51635 70096 80424 96761 94970 74284 80030 63258
13138 63258 56684 78504 118035 126100 154303 170509 208747 278031 373875 483282 598354 762144
13126G62144J40406J02121M2258J4889n6881j00199j03680j36017j34673r2940
13116D37428r5932q8848o1310l2276l052J9953M412k5744l3287n051j6240k0774
13104G9279j7889j3661J7206K6188m606k0776j1167K393k3205o415p454j7544
13092B349j1315J787L0075J3021p094k7244m254k2747m778J6040N41l604J7436
13079B13K6607J5364q144m7750j5932L6717K8062l835j8325j4446k996O010q722
13066g177r653J8532K2059m816j9708k571J0928j136O635n83k0175N175p793j1186
13052b1469J0779o595j6736j129L9365J9034M676k0366l2754N425k127J1286n666
13039a6277M021L2927K0144p519m613o367k3647p014J4324J810R403J2219m921
$$ plain form
13126 762144 902550 1004671 1046929 1061818 1004937 904738 801058 665041 530368 437428
13116 437428 341496 252648 191338 159062 156010 175963 180375 154631 121344 116293 100053 79279
13104 79279 61390 47729 64935 91123 86517 65741 54574 56967 33762 27347 19893 2349
13092 2349 -8966 -7179 22896 35917 28823 1579 -2675 -25422 -30200 -14160 -13619 -17223 213
13079 213 26820 42184 34040 -13710 -29642 7075 35137 31302 12977 -1469 -4465 1545 -7177
13066 -7177 -16830 1702 23761 18945 -763 -3334 7594 6458 13093 12510 -7665 -2490 -10283 -21469
13052 -21469 -10690 -17285 -34021 -35150 4215 23249 27925 7559 -25195 -19770 -21897 -10611 -16277
13039 -16277 -12256 20671 40815 33296 28683 22316 -1331 -8345 5979 7789 17192 29411 24490
13026B4490r78K577n518j6404P24r681k5540j52L2995J0355l237K0227k2384j4712
13012g238k4782k5659J3441K3478J4532Q264K1727n316p574K267l414P572j1338
12999E960p8J0004p341J6659J6771r119j9349J5269M1375M3368M9087K0210J206
12986A84022j8151m2857n263k6693l2691k123K078Q501L574j89l5761k9277K8030
12973C3200L7219J1633j1387M586J2047m92k0595m0604J0007J5316K6392L0202
12961A07524K8349L0587K4595N9430P4261M0306Q220k6598k8839l0116m4158o1687
12949A81874m2547k4660L554k1081q558m034k6135k5500k434q973m3509J3091
12937h912o352J6527Q897j654k3558P185J8677k3433j3150Q533o200K2281J5053
$$ plain form
13026 24490 23512 26089 20571 4167 4891 -4790 -30330 -30482 2513 12868 9631 29858 7474 -7238
13012 -7238 -32020 -57679 -44238 -20760 -6228 2036 23763 18447 10873 13140 9726 17298 5960
12999 5960 5882 15886 8545 25204 41975 32856 13507 28776 70151 113519 162606 182816 184022
12986 184022 165871 123014 117751 91058 58367 56244 58322 66823 70397 70208 34447 5170 33200
12973 33200 70419 82052 70665 75251 87298 86806 66211 25607 35614 50930 77322 107524
12961 107524 135873 166460 191055 250485 324746 365052 373272 346674 317835 287719 243561 181874
12949 181874 139327 114667 118221 97140 88582 84548 58413 32913 30479 21506 -22003 -8912
12937 -8912 -15264 1263 10160 8506 -15052 -7867 10810 -12623 -25773 -17240 -23440 -1159 13894
12924A3894J1651J0139l2374o20j995j0956J2422R718R804j1294J0523Q408l391
12911B5929o913k2599J5452P214K4979R260N27j2562R01L0083L095o041J104j7591
12897E2838r635O237j4956k7362p215k68L278O610M443K0363J2862n885j1149
12884C0161n669M602j894q055K7432N034J866J7467k4169j3528J9431O978K999
12871F2655M437K0770m304k6221k1192j921J884j1502Q117L3190J0713J5053L4147
12858A25826j140M295p437o135J7176K217K0808j0124K79J1856m206l31M411J3359
12844A70854K5891Q379q62K3451J0404J0056K5789k024J3135L0013N38q70L2935
12831C47689j0561m6871l5571n3104m5593n2052k3551m9190q072J3977l582j6652
$$ plain form
12924 13894 25545 35684 3310 2690 695 -10261 2161 11879 21683 10389 20912 29320 25929
12911 25929 19016 -3583 11869 19083 44062 53322 53849 41287 42188 72271 75366 69325 70429 52838
12897 52838 43203 49440 34484 7122 -93 -361 2917 9527 13970 34333 47195 41310 30161
12884 30161 24492 29094 27200 19145 46577 51611 53477 70944 46775 33247 52678 59656 62655
12871 62655 67092 87862 83558 57337 36145 34224 36108 24606 32723 65913 76626 91679 125826
12858 125826 124686 128981 121544 115409 132585 134802 155610 145486 145765 157621 153415 153084 157495 170854
12844 170854 196745 205124 204262 227713 238117 248173 273962 271938 285073 315086 315624 314754 347689
12831 347689 337128 290257 254686 201582 155989 103937 80386 31196 23124 37101 33519 16867
12819A6867P7K1176O120L792q544n144O456o489J8035j2824j624N025L6825J6780
12805I6528M056r028j1759N522K0904R218O71j9306j8154K4583K486n230K0218
12792A20709K0859o712J5596K8884m994P682Q369p837K4850M4784O128j4609p477
12779B36232k902L389j4047J840M779L45m337L7238K3229J0897J9496R114L6310
12766C61583K6032J2038J8540K1243L1877N0862L5369K2215J4986L950J6699P943
12754F23337M7298N3778L6138K1032J0888K3335L4521L2506K4542K9771N2831
12743I89977Q2601Q0090R0084J04994J03733J23830J32776J74045J69294J70540
12733B221964J96020K24549K37226K54819K87015L26066L92052N13723O46555
$$ plain form
12819 16867 16944 38120 44240 48032 39488 34344 40800 34311 52346 39522 37898 42923 79748 96528
12805 96528 100584 91556 79797 85319 106223 115441 116112 96806 78652 103235 105721 100491 120709
12792 120709 141568 134856 150452 179336 174342 182024 190393 182556 207406 252190 258318 243709 236232
12779 236232 233330 236719 222672 224512 229291 229636 225299 262537 285766 296663 316159 325273 361583
12766 361583 387615 399653 418193 439436 471313 522175 557544 579759 594745 598695 615394 623337
12754 623337 670635 724413 760551 781583 792471 815806 850327 882833 907375 937146 989977
12743 989977 1072578 1152668 1242752 1347746 1451479 1575309 1708085 1882130 2051424 2221964
12733 2221964 2417984 2642533 2879759 3134578 3421593 3747659 4139711 4653434 5299989
12724E299989Q05649R30278J129808J292332J411037J528521J636146J735232
12716A5768992J968914K429795L179223M342897O251808R275428J3629490J9025798
12708G5872345K4006947K6884041K6916085K3094431J5057988N427415l020807
12701A94238445j0547111j8213562k4724072k7470741k5368350k0194296j4644572
12694E3075741j0209279p136814n159488l839275l006815k502200k160879j994367
12686A7066624j875091j725763j578841j432443j258702j063715q83489p21730
12678F526850o36126n45507m66860l73954l18569l09789k60601k07938j82237
12669C225269j51787j61859j51812j17177j18908j41416j38956j06165r7291p0858
$$ plain form
12724 5299989 6105638 7035916 8165724 9458056 10869093 12397614 14033760 15768992
12716 15768992 17737906 20167701 23346924 27689821 33941629 43217057 56846547 75872345
12708 75872345 99879292 126763333 153679418 176773849 191831837 197259252 194238445
12701 194238445 183691334 165477772 140753700 113282959 87914609 67720313 53075741
12694 53075741 42866462 35729648 30570160 26730885 23724070 21221870 19060991 17066624
12686 17066624 15191533 13465770 11886929 10454486 9195784 8132069 7248580 6526850
12678 6526850 5890724 5345217 4878357 4504403 4185834 3876045 3615444 3407506 3225269
12669 3225269 3073482 2911623 2759811 2642634 2523726 2382310 2243354 2137189 2039898 1969040
12659A969040p9573p5662m3554n1800l8116m2434k7892p679J0048N006J6043M2137
12647A675564O1633O3190N9156L9391L3512L0868j2496n7831p1104q7694j19858
12636A614331j19623j33867j01504j12732j07972q9824m6099m5530m4308l1644
12626G81228n3602j9788j0914n8852m8022k4275K423k0946k2627J8713l60j4596
12614E28382J2237p325R905k5575k8297K624K787M707R200k1621k6260j1570j0125
12601D39069r563J6401j3132p53l552Q239P174J408N947n062j0543k194K5596
12588D59035J6001j1513j041J0665L359o115J5375j9781l4863l2312r515m1286
12576C48009l6703m0377m6069k7077n502J0603L2331j3874q412P977K5900K0579
$$ plain form
12659 1969040 1889467 1813805 1770251 1718451 1680335 1637901 1610009 1602330 1612378 1617384 1633427 1675564
12647 1675564 1737197 1800387 1859543 1898934 1932446 1963314 1950818 1892987 1821883 1734189 1614331
12636 1614331 1494708 1360841 1259337 1146605 1038633 948809 902710 857180 812872 781228
12626 781228 727626 707838 696924 638072 590050 565775 568198 547252 524625 543338 542978 528382
12614 528382 540619 533294 543199 517624 489327 491951 494738 499445 508645 487024 460764 449194 439069
12601 439069 429506 445907 432775 432022 428470 436709 443883 445291 451238 446176 435633 433439 459035
12588 459035 475036 463523 462482 473147 476506 470391 485766 465985 431122 398810 389295 348009
12576 348009 311306 270929 224860 197783 192281 202884 235215 221341 212929 220906 246806 267385
12564B67385k824n285Q793k722j0259K532o587M603K2020M717l264L1220J6238
12551C26567K0130M6105K6453M3939L6013N4428Q8311P3995J00570J24125J59613
12540A100249K13334K09598K55904L52630L63059L78409L93035L54480K45795
12531C866493J59689L2031m9608j38122k60141l61798m26978l67615l39528l07552
12521A806871k80847k44645j78765j32795j17768q8528n7053m4548p0802p6251
12511E14869m7955j5549k9998m1884k4409l760k4023k8946l0807j7998k4739l6287
12499A88514l4317j7648K1823K9274P795J892j2482Q037P686k6466o037j569m407
12486A62095J632m327J2147m597k3863j5200M238J539k102M52L0599K9862q965
$$ plain form
12564 267385 264561 259276 268069 265347 255088 257620 251033 255636 277656 282373 279109 310329 326567
12551 326567 346697 392802 419255 463194 499207 553635 641946 715941 816511 940636 1100249
12540 1100249 1313583 1523181 1779085 2131715 2494774 2873183 3266218 3620698 3866493
12531 3866493 4026182 4058213 4008605 3870483 3610342 3248544 2821566 2453951 2114423 1806871
12521 1806871 1526024 1281379 1102614 969819 852051 763523 706470 661922 591120 514869
12511 514869 466914 451365 421367 379483 355074 351314 327291 298345 267538 249540 224801 188514
12499 188514 154197 136549 158372 187646 195441 197333 184851 192888 200574 174108 168071 166502 162095
12486 162095 163727 159400 171547 166950 143087 127887 132125 133664 131562 132014 162613 192475 183510
12473A83510p209k5634j2493K6299J7887k3793k3568j9547j683L183r230k2859
12461H4863P797J601J545O38M997J272J8105J8870j1340n893J7218L462k5376
12448A17759Q890Q54O850l20j0841k5132K1725o079q470L334p95K108J8927N695
12434A34505p53r367j8931k205L954p08l270n659K0975K9813Q255J3050J2677
12421A82336P704J1176m367J1740m297j9686m669j7291k8206k1719p687K2979
12409A28013K9543q184l0061l3323k6803j7899K3684J5734L294l348j3086K932
12397G0496M560j8252N214J8749N3n527q425k667r112K6187J838j4850m404p969
12383E5891n390M896K4715J5003o748j2917j5245M03K4288M3125L8288J1692J3156
$$ plain form
12473 183510 176301 150667 138174 164473 182360 158567 134999 115452 113769 116952 107722 84863
12461 84863 92660 94261 95806 96444 101441 102713 120818 139688 128348 122455 139673 143135 117759
12448 117759 126649 127503 134353 134033 123192 98060 119785 113706 105236 108570 107775 109883 128810 134505
12434 134505 133752 124385 105454 103249 107203 106495 103225 97566 118541 148354 156609 169659 182336
12421 182336 190040 201216 196849 208589 204292 184606 179937 162646 134440 112721 105034 128013
12409 128013 157556 149372 119311 85988 59185 41286 64970 80704 83998 80650 67564 70496
12397 70496 75056 56804 62018 80767 80820 75293 66868 64201 55089 81276 83114 68264 63860 55891
12383 55891 50501 55397 80112 95115 88367 75450 60205 60608 84896 128021 166309 178001 191157
12370A91157L00q882l5016M167Q473l6706k9220q704k1345l7317p611N343m980
12357A9659J768Q519Q468k864M749m003j1122j3004J9946J7458M870O862O78k2467
12343C9517k677J837q717n557j3155J3490Q049K4493J0124r977l548o598N691
12330E2972j395j8218r776j3758j3509Q228K5308M089k5696p38J7293M577J7056
12317D6433O938j3222j0959N380n254q029k4053J1958K4802L2082J2451N110p910
12304G5727k8386k2270n904P553J6925O475p23R638J7827J3950M982j969R287
12291A03112J8684j7711J1973K3761j381K7242N8646N5078O1978J27974J39817
12280F09173J21415J25221J01038N4921L1738k646n6070j27959j15093j27704
$$ plain form
12370 191157 191457 182575 147559 151726 160199 123493 94273 85569 64224 26907 19296 24639 19659
12357 19659 21427 29946 38414 35550 40299 36296 25174 12170 32116 49574 54444 61306 61984 39517
12343 39517 36840 38677 29960 24403 11248 24738 32787 57280 67404 57427 53879 47281 52972
12330 52972 51577 33359 23583 9825 -3684 4544 29852 33941 8245 7507 24800 29377 46433
12317 46433 53371 40149 29190 34570 29316 21287 -2766 9192 33994 66076 78527 83637 75727
12304 75727 47341 25071 19167 26720 43645 50120 49397 59035 76862 90812 95794 93825 103112
12291 103112 121796 104085 116058 139819 138438 165680 224326 279404 341382 469356 609173
12280 609173 730588 855809 956847 1011768 1043506 1040860 984790 856831 741738 614034
12270F14034j42582j01740n2986o1004k4326k262l0022l0708k0896r458l538k5490
12258A09022k5535N864k887q85k6434p858O423j8753j7101r472M866Q631j9795
12245F086J1297K4423J34P948j0619k2352O070M494o465J0414K612j1610j5477
12232F955M329R363l540l334K8466J718K803R262q566k1711j3362J1677L784j1304
12218A6540Q691J6432k459j1883J5222N855K4251j4423k3641O531k0615p564R220
12205B2157k837j7142n038J7029K1914k908j2416q744r262J040J5625N322k8711
12192c971j6541j280P513J0490p957J0900O455j2675k8327j6951J6255L4405M21
12179a263j1720L449K7724J939P591J128j4981j7375M044j1944l522J5171m77
$$ plain form
12270 614034 471452 369712 316726 255722 231396 229134 199112 168404 147508 138050 134512 109022
12258 109022 83487 89351 86464 85579 59145 51287 57710 38957 21856 12384 17250 25881 6086
12245 6086 17383 41806 41940 49888 39269 16917 22987 27481 21016 31430 34042 22432 6955
12232 6955 11284 20647 17107 13773 42239 43957 46760 56022 47456 25745 12383 24060 27844 16540
12218 16540 25231 41663 39204 27321 42543 48398 72649 58226 34585 41116 20501 12937 22157
12205 22157 19320 2178 -2860 14169 36083 33175 20759 12015 2753 3793 19418 24740 -3971
12192 -3971 -20512 -21792 -14279 -3789 -11746 -846 5609 -7066 -35393 -52344 -36089 -1684 -1263
12179 -1263 -12983 -9534 18190 20129 27720 28848 13867 -3508 536 -11408 -14930 241 -236
12166b36J0933m744k6016O272K822q672P286J5997j3583m58L519P555M715k2945
12152a7555J410K2998J4423l827j930M198j3049l933p89k8289R222K4912N029
12139A2820k4801j7273L0844m855j7640k486N663j4437L797K0086J3595n973o081
12126f741k2188Q88J4036K809R661R088N707J9575J826j2467j4080o595j0871
12113i352l454J1627K2780j3583l9072J2250M0713Q521k6158J889j3215k4691
12101c1745J6582J5653J0285J3404L950K070j0772k8931j7158J4327O775J8423
12089A2863j6362j7940n096L903J3502l993J5566J3338j4034L583K2852P080k4501
12076A0761o490J174m374j5771l182K0045J2230m629n950j4241k9523J1989K6465
$$ plain form
12166 -236 10697 5953 -20063 -13791 -10969 -19641 -12355 3642 -9941 -10399 -6880 675 5390 -17555
12152 -17555 -16145 6853 21276 17449 15519 19717 6668 2735 1946 -26343 -17121 7791 12820
12139 12820 -11981 -29254 1590 -3265 -20905 -23391 -17728 -32165 -28368 -8282 5313 -660 -6741
12126 -6741 -28929 -28041 -14005 -11196 -1535 7553 13260 32835 34661 22194 8114 1519 -9352
12113 -9352 -12806 -1179 21601 8018 -31054 -18804 21909 30430 4272 6161 -7054 -31745
12101 -31745 -15163 490 10775 24179 28129 30199 19427 -9504 -26662 -12335 -5560 12863
12089 12863 -3499 -21439 -26535 -22632 -9130 -13123 2443 15781 1747 5330 28182 35262 10761
12076 10761 4271 5445 1071 -14700 -17882 2163 14393 9764 3814 -10427 -39950 -27961 -1496
12063a496j5629j4435J5048N983m607K8328K417l074O362M522j239n345l657J3797
12049B6975k1249l3020l726m227L1474L2083j6413k6010r456K378J2125R49j4076
12036b2193r597R962J8064J4181J1836q823k8265m136K062J805J879J8848N425
12023A1048r72P553O319J949L0737K732k9233j4099l085j3609J2666n102j2624
12010e720j2155J8870J640k9024J94L985J1579J3696j603J3277j0644k0170k6504
11997d2579J1813J0974J6880P638n513j2652j2555J4770R315J1254K421p545j7740
11984a3519K761l906k223n468q980L179K5136L2974J0068k0766N437j5098r591
11971DJ9146k2755j5370O69p630K4623J9810J838k5870J0473O820J2499K5311
$$ plain form
12063 -1496 -17125 -31560 -16512 -10529 -15136 13192 15609 12535 18897 23419 22180 16835 13178 26975
12049 26975 5726 -27294 -31020 -35247 -3773 28310 11897 -14113 -23569 -21191 -9066 -8117 -22193
12036 -22193 -31790 -21828 -3764 10417 22253 13430 -14835 -18971 -16909 -15104 -13225 5623 11048
12023 11048 10076 17629 23948 25897 56634 59366 30133 16034 12949 -660 12006 6904 -5720
12010 -5720 -17875 995 2635 -26389 -26195 -22210 -10631 3065 1462 14739 4095 -16075 -42579
11997 -42579 -30766 -19792 -2912 4726 -787 -13439 -25994 -11224 -1909 9345 11766 4221 -13519
11984 -13519 -10758 -14664 -16887 -22355 -31335 -28156 -3020 29954 40022 19256 24693 9595 4
11971 4 19150 -3605 -18975 -18306 -25936 -1313 18497 20335 -5535 4938 11758 24257 49568
11958D9568k1321l6302k1827o46j355L233K1168P617j7840K616K5942M217n139
11945I931J1691R126j5325j4574j0465K1563J6239O770J3302J4255j9057j9933
11933B3523j8366k521j3200j1424K2176O376k629O575K112l296p65o535l591k377
11919c942k3629o563K7215J1016l965p474k846M448J1123J2818r701r209j369
11906b078q388R602J0302L126K2655m902j6811j1207j3636O650j665J8683K6470
11893C8801J7326J5116K393j3267q742L751n838o869k5851j936p954n794J0482
11880A1618j644j5763K1530J8148L228j4685k7361o947J6194J2072j1454j2547
11868g611l118K3571l0459k2573J3167L0626k309j0208P520r551k849L0458Q403
$$ plain form
11958 49568 28247 -8055 -29882 -30528 -31883 -28650 -7482 135 -17705 -15089 10853 15070 9931
11945 9931 21622 30748 15423 849 -9616 11947 28186 34956 48258 62513 43456 23523
11933 23523 5157 2636 -10564 -21988 188 6564 3935 10510 12622 9326 8561 2026 -1565 -3942
11919 -3942 -27571 -34134 -6919 4097 132 -7342 -10188 -5740 5383 18201 8500 -709 -2078
11906 -2078 -10466 -864 9438 12564 35219 30317 13506 2299 -11337 -4687 -6352 12331 38801
11893 38801 56127 71243 73636 60369 51627 55378 49540 42671 16820 14884 6930 1136 11618
11880 11618 9974 -5789 15741 33889 37117 22432 -4929 -11876 4318 16390 4936 -7611
11868 -7611 -10729 12842 -17617 -40190 -27023 3603 1294 -8914 -1394 -10945 -13794 16664 25067
11855B5067J6K757j3401n629l069q812r250j4074l81Q242K923O395k71k3908k077
11840c5472K9526M761J337j7001j5829P445J3102j662J370N631j3841n753K3593
11827b793J0668k458N798k0469k2505K2256J6250K1745m18q664q6J479l672r349
11813G782r144j612J0659m699P465Q219k444J8720J1753l0695j7308j5360J136
11800a5528J8708R926j2089R02o766p477K777M189r480k095O629J8920r694j0987
11786a2065J4858l67J1185J1797O913k0921j1451K086m883n077j292J333j4510
11773b2394l0296k1341J5213L2771J4273q010j0769m614K597L2242o610j7480
11761b4418r967J8058J3398O10r199l5666j0528R956L863O069K0286R452J9902
$$ plain form
11855 25067 25083 27840 14439 8810 5741 -3071 -12321 -26395 -26776 -18534 -15611 -9216 -9487 -33395 -35472
11840 -35472 -5946 -1185 152 -16849 -32678 -25233 -12131 -13793 -12423 -6792 -20633 -26386 -2793
11827 -2793 7875 5417 11215 -9254 -31759 -9503 6747 28492 28074 19410 19324 20803 17131 7782
11813 7782 -1362 -2974 7685 2986 10451 18670 16226 34946 46699 16004 -1304 -16664 -15528
11800 -15528 3180 13106 1017 1919 -4847 -12324 -9547 -5358 -14838 -16933 -10304 8616 -1078 -12065
11786 -12065 2793 2426 13611 25408 32321 11400 -51 2035 -2848 -7925 -9217 -7884 -22394
11773 -22394 -52690 -74031 -58818 -26047 -11774 -19784 -30553 -35167 -32570 -328 -6938 -24418
11761 -24418 -34385 -16327 -2929 -2319 -11518 -47184 -57712 -47756 -43893 -37824 -17538 -8086 11816
11748A1816J6088ml4293j9614K3477K4355J5375k4536k3055J2328J7667k194k3081
11735e671j5866J4260N040J3744J8322P538M48l007Q323o60l5376l0593J8546
11722d952j5497L860Q686j6377N552J4684l568n457O811R724N409j8946R844K1891
11708B1664m2o285l784o859j1964P416j4226l463K885k2084J2796M0837M657K855
11694B4403M455j6523j4134K0896n14j3112m0090j1017K6003m992p130J0419N512
11681a5824j4936K6610J1614J589J0690K025l056o534p780j5011j9622N581R732
11668a4922J9553J7227o642k9379J0982R019R158r242q128q49o090J1614P117
11655I418J1762J3406K172k9480k537L5349J4682j5499L160o284k6328o405l324
$$ plain form
11748 11816 27904 27900 -6393 -26007 -2530 21825 37200 12664 -10391 1937 19604 17410 -5671
11735 -5671 -21537 -7277 -2237 11507 29829 37367 37815 34808 43131 42471 7095 -23498 -4952
11722 -4952 -20449 -16589 -7903 -24280 -18728 -4044 -7612 -13069 -6258 3466 8875 -10071 -227 21664
11708 21664 21622 15337 11553 4694 -7270 146 -14080 -17543 -14658 -36742 -23946 16891 21548 24403
11694 24403 28858 12335 -1799 19097 18583 5471 -34619 -45636 -19633 -24625 -31755 -21336 -15824
11681 -15824 -30760 -4150 7464 9053 19743 21768 18712 12178 4398 -10613 -30235 -24654 -14922
11668 -14922 4631 21858 15216 -14163 -3181 5838 14996 5754 -2374 -3223 -9313 2301 9418
11655 9418 21180 34586 36758 7278 4741 40090 54772 39273 42433 36149 9821 3416 92
11642I2j2500m714K1478K4041o951m7843k6971j4115Q658Q836J9151R904J0374
11629a0560J8784L849N699J2464R087J502p824j8064j0705J011P29O966j6323
11616c385J215l188k371Q55J9386O904O467r917n211j5866j996k891M981J1725
11602F708M322q889K591J8850N716k6577j8471L1663N906l3666j9509m116J6571
11589a8901J5584P892j313m398l66n428k5125j239J7074J0155Q749r503J0036
11576C217l247K393O65J2858J1994N679k1760j7032p837J1819k413J4107J7483
11563B7926j491j9718j7986m198N377J3095r207K464k5110l953J6694K9462n262
11550H093j655p247J3212K993o568j7427J0214K4997K1898l494k8238O12M826
$$ plain form
11642 92 -12408 -17122 4356 28397 21446 -26397 -53368 -67483 -58825 -49989 -30838 -20934 -10560
11629 -10560 8224 12073 17772 30236 39323 40825 33001 14937 4232 5243 5972 12938 -3385
11616 -3385 -2170 -5358 -7729 -6874 12512 19416 25883 15966 10755 -5111 -7107 -9998 -5017 6708
11602 6708 11030 2141 4732 23582 29298 2721 -15750 15913 21819 -11847 -31356 -35472 -18901
11589 -18901 -3317 4575 3262 -1136 -1502 -6930 -32055 -33294 -16220 -6065 2684 -6819 3217
11576 3217 -30 2363 3028 15886 27880 33559 11799 -5233 -13070 -1251 -3664 10443 27926
11563 27926 26435 6717 -11269 -15467 -10090 3005 -6202 -3738 -28848 -32801 -16107 13355 8093
11550 8093 6438 -809 12403 15396 8828 -8599 1615 26612 48510 45016 16778 17390 22216
11537B2216j5157N650Q59L2783L5318Q371l6707M402L1835L6775M6339K4781O931
11524B04396K3708K0392K9657J6711N3428P7216N5546R8053J34991J92387K69603
11513A176088L66566M14295M13366K99341N3009j95651l61483m04008l39335k69416
11503A152772k17900j64268j08642q4127p9800n0940o0318p4575m3746k6512j7888
11492B24056k0609m2514j7432n266l662q534l3569j2115K3397R860j4897k01k1438
11479G7076j0798m218N741j763j1148j2680j383L263j4519k398m770L804j284
11466B4923o033k337M10k500r032J0163p238k37R600p974o310J3904K3479n311
11452C5507j0337O658q187j3450j7425o541J2566K441J8529Q629p424M465J3153
$$ plain form
11537 22216 7059 12709 13568 46351 81669 90040 53333 57735 89570 126345 172684 197465 204396
11524 204396 228104 248496 278153 294864 348292 425508 481054 579107 714098 906485 1176088
11513 1176088 1542654 1956949 2370315 2669656 2722665 2527014 2165531 1761523 1422188 1152772
11503 1152772 934872 770604 661962 577835 498035 447095 386777 312202 268456 241944 224056
11492 224056 203447 160933 143501 138235 134573 126039 92470 80355 103752 113612 98715 98514 77076
11479 77076 66278 62060 67801 66038 54890 42210 40827 44090 29571 27173 22403 26207 24923
11466 24923 18890 16553 16963 14463 5431 15594 8356 8119 17719 9745 3435 17339 40818 35507
11452 35507 25170 31828 23641 10191 -7234 -13775 -1209 1232 19761 28390 20966 25431 38584
11439C8584r662M01J6070O480J8307J9956k0996p395Q4l3275l527M13j842j717
11425B1881K776P867j4770k7254j2823j1986j3340n388J2382K3595J7476J4595
11413A5011K327L3j3125n585L762R40K8854O845K5921J5349Q537j3754l2450l4806
11399G859n42J7451J2644m046j3553P52J2780K39o249j594k3020J0035L751m2826
11385b6319P714J6874J3517m973q105J2330K1031O324p243j9598j0385p612j4500
11372b0945j7712J0984K328j0377R378o311J6226L0439K393j9458k9894l321J5013
11359b1257J7910J9449J2546l579L212N047j1283r37K347k827j7175j6344J2780
11346a11J4668K9864m695k510K518K351J4046k838j4599l5199k6227m056L6796
$$ plain form
11439 38584 28922 29323 45393 51873 70180 90136 69140 61745 61829 28554 25027 25440 23598 21881
11425 21881 24657 32524 17754 -9500 -22323 -34309 -47649 -53037 -40655 -17060 416 15011
11413 15011 17338 17371 4246 -1339 2423 3363 32217 39062 64983 80332 88869 75115 42665 7859
11399 7859 7317 24768 37412 33366 19813 20565 33345 33584 27335 25741 2721 12756 16507 -26319
11385 -26319 -18605 -1731 11786 6813 -1292 11038 32069 38393 31150 11552 1167 -6445 -20945
11372 -20945 -38657 -27673 -25345 -35722 -26344 -32655 -16429 14010 16403 -3055 -32949 -36270 -21257
11359 -21257 -3347 16102 28648 25069 28281 33328 22045 21108 23455 20628 3453 -12891 -111
11346 -111 14557 44421 39726 37216 39734 42085 56131 53293 38694 3495 -22732 -26788 10008
11333A0008J1638j0782j5721K8397j2543k3074O913m344K3135K5014Q265j0443
11321C6463k4968m452K124k8018O789K7727K1252j705j8939j9937j2531J1015
11309e180O167K859n633k6896R559J9966o780Q59n729J2620L406P596J972l0919
11295a6133R946J0563j3409P858L4889J9736q93n464r021l7335J0683L4727J4757
11282F0904L938n851o811o431J2761J4144k4665l5347M705J1389K153j2355J4824
11269C3358m449L440L980J0524P55m40j5759N4j0391l783j09K6211j293j1312
11255C0786J1303J9862k2003k9036J789J736k144L548j0335j3534J7414J2201
11243B1587J8980P298k4717j2296N125l1127k9092K6364Q106J0834P118Q03P171
$$ plain form
11333 10008 21646 10864 -4857 23540 10997 -12077 -5164 -9508 13627 38641 46906 36463
11321 36463 11495 7043 9167 -18851 -12062 15665 36917 35212 16273 -3664 -16195 -5180
11309 -5180 987 3846 -1787 -28683 -19124 842 -5938 -5079 -10808 1812 5218 12814 14786 -16133
11295 -16133 -6187 4376 -9033 -1175 33714 53450 52557 47093 38072 737 11420 46147 60904
11282 60904 64842 58991 52180 45749 58510 72654 47989 12642 17347 28736 30889 18534 33358
11269 33358 28909 32349 36329 46853 47608 47168 31409 31463 21072 17289 17180 43391 42098 30786
11255 30786 42089 61951 39948 10912 12701 14437 12293 15841 5506 -8028 9386 21587
11243 21587 40567 47865 23148 10852 15977 -15150 -44242 -17878 -9772 1062 8180 8983 16154
11230A6154l750j072N188J7165j2183J3695p909O192r096j6187m965K3369j1877
11217A4724J509j7754r666P102j923O321K1038k2406J3150K763J1766j4669j0480
11204A475O455m123M030J2686q542j5037J6526K4186p423O619P982l1959j3735
11191h60j1706J5433K2372R256J3510k2949M985R551p055r021j1160p123o283
11178a050k1766l594J3118R771J9133J3748j076p496N522J0008J0824j2684j7064
11165A7394p446k7865O427J6397r9j1518K932L3360K1347o985j7244k1717k1530
11152a6547J3745J3997J0302M072Q100o361j8223n507N155J8422P476m329j3952
11139A6350j4907J1730j4438k548r853l677K0944O437j1810r675J986o200O401
$$ plain form
11230 16154 12404 11332 16520 33685 21502 35197 27288 33480 24384 8197 3232 26601 14724
11217 14724 16233 -1521 -11187 -4085 -6008 313 21351 -1055 12095 14858 26624 11955 1475
11204 1475 7930 3807 7837 20523 11981 -3056 13470 37656 30233 36852 44834 12875 -860
11191 -860 -12566 2867 25239 34495 48005 25056 30041 39592 32537 23516 12356 5233 -1050
11178 -1050 -22816 -26410 -13292 -3521 15612 29360 28284 20788 26310 36318 47142 34458 17394
11165 17394 9948 -17917 -11490 4907 4808 -6710 -3778 29582 50929 43944 26700 4983 -16547
11152 -16547 -2802 11195 21497 25569 33669 27308 9085 3578 8733 27155 34631 30302 16350
11139 16350 1443 13173 -1265 -3813 -13666 -17343 3601 10038 -1772 -11447 -9461 -15661 -9260
11126i260n851j8067q858j1324m332K4390K9927j323k0723P296L170O089k834
11113a1700r321L146P84l798J5634n032l0742m466K645j349j4990J7322J5501
11100b6366L1588l030j5873m626j151P531J2624o902l835J5300K2676O023N278
11087C9237j6953j4740j2046l323J5718K1704o643O311O738J597r24k783r597
11074B4296k4953K046q96k3218o797L3310J9606j9871K1476J2986j8520O731j8706
11061G490j8638k049J244j433j2358L9537K9032k7700q468O369J0415N255P518
11048C6214o981J2663o917N563j3627j1703q457j2593j5836J5601J5358r717k034
11035b466J6211J2982J2136j4532j6998J1644J0917p733J4666J2038j2991J1863
$$ plain form
11126 -9260 -15111 -33178 -42036 -53360 -57692 -33302 -3375 -4698 -25421 -18125 -14955 -8866 -11700
11113 -11700 -21021 -17875 -17091 -20889 -5255 -10287 -41029 -45495 -42850 -44199 -59189 -41867 -26366
11100 -26366 5222 2192 -13681 -18307 -19458 -11927 697 -6205 -10040 5260 27936 33959 39237
11087 39237 22284 7544 -4502 -7825 7893 29597 22954 29265 36003 37600 36676 33893 24296
11074 24296 -657 1389 493 -22725 -29522 3788 23394 3523 24999 37985 19465 26196 7490
11061 7490 -11148 -13197 -11953 -13386 -25744 13793 42825 15125 6657 13026 23441 28696 36214
11048 36214 29233 41896 34979 40542 26915 15212 6755 -5838 -21674 -6073 9285 -432 -2466
11035 -2466 13745 26727 38863 24331 7333 18977 29894 22161 36827 48865 35874 47737
11023D7737O91j2067j5503j0022J3146o194k898j1012j5789j443J6315K4991J1918
11010C9870p995k3143j1446j870M863j1204r378N939J5927L311l887r908o291
10997a5212J4398J3741N65o326N726K3715K5407k895j3536k0726l1323L698N440
10984B672J6147q205m137L596M195J4610o782l454P260K4603k705j7170L780O294
10970D0704j1112N802J0794R54k1346O342K3618L7184L8806K6140o724J6110K5152
10957A92424n047P339K5915M9478O7811P9052J01975J81471K96464M79773N73040
10946B049695L73989r6937m56236m86348l64497k61503k06316j33680r5747n9107
10936B63313k4417m5871l1185l0608j6296M59J2413j610j4614k0262j7196n657
$$ plain form
11023 47737 48428 36361 20858 10836 23982 17788 14890 3878 -11911 -13354 2961 27952 39870
11010 39870 31875 8732 -2714 -4584 279 -10925 -20303 -14364 1563 4874 987 -8921 -15212
10997 -15212 -814 12927 13492 7166 12892 36607 62014 59119 45583 24857 -6466 -2768 2672
10984 2672 18819 10614 6477 10073 14268 28878 22096 18642 25902 50505 47800 30630 34410 40704
10970 40704 29592 35394 46188 47142 25796 32138 55756 92940 131746 157886 151162 167272 192424
10957 192424 187377 194716 220631 270109 337920 416972 518947 700418 996882 1476655 2049695
10946 2049695 2423684 2326747 1870511 1384163 1019666 758163 551847 418167 322420 263313
10936 263313 238896 193025 161840 131232 114936 115395 127808 126198 111584 91322 74126 68469
10924F8469J3830k0338l812j7839l3018j0250O735J9167M700j11K000Q590Q887
10911D7010J0239N178m512k1516o406K112P018j4189j1163N638l335k6292o752
10898a6970Q052o145o584M419J8495j5002J1467K1029n497L3685J8983l6515l5481
10885f064K483L941m522o783N850K1797L1539K934k829k3j1243L658O171k1516
10871B5393k5024k7474L357K773K4259J4239j5388j9682P794R079J7214M847l505
10858A7882l503P735l763l111j0847j5634j4203K1096J0307J540L1410J4251r472
10845D3688k3427O919K892M087j8381N518J2684K2802K780P193j9974J4151L7178
10832I8110j5345l9488m1555k2867j1210J6521M347j8276L388K1199l644r125
$$ plain form
10924 68469 82299 61961 58149 40310 7292 -2958 3777 22944 27644 27533 29533 38123 47010
10911 47010 57249 62427 57915 36399 29993 32105 39123 24934 13771 19409 16074 -10218 -16970
10898 -16970 -8918 -15063 -21647 -17228 1267 -13735 -2268 18761 13264 46949 65932 29417 -6064
10885 -6064 -3581 360 -4162 -10945 -5095 16702 48241 51175 48346 48323 37080 40738 46909 25393
10871 25393 369 -27105 -23748 -20975 3284 17523 2135 -17547 -9753 -674 16540 21387 17882
10858 17882 14379 22114 18351 15240 4393 -11241 -25444 -4348 5959 7499 38909 53160 43688
10845 43688 20261 27180 30072 34159 15778 21296 33980 56782 59562 66755 46781 60932 98110
10832 98110 82765 43277 1722 -21145 -32355 -15834 -11487 -29763 -26375 -5176 -8820 -17945
10820a7945M268n53o560J5451K2118J4802k495L268j4999M425l88j1184j6116
10807e908p873j3502j939J8256J4224J674J7707M575j0395l311K6382l643k749
10794C3498K6439K3977j0086j2383P574m590K7479J62J031J4152M0355O5252O9700
10781B82560P4020N1493k424m0762p8142p5869o6431n4230p200L237j7631q010
10769F0611N826J4247j3706k5991r669o245J0201j916j7885j3912M30j2431M166
10756f274Q149Q044M798L766j0305k2692N597L9993Q634j2397j4341l596L9497
10743D8873l741R862r16j5830j4867m449k244l646J6140J4190M802J922J3368
10730F3464O089P372K1032K5124L218m3950r540o965k8250l3683J1676j4905L763
$$ plain form
10820 -17945 -13677 -14230 -20790 -5339 16779 31581 29086 32354 17355 21780 21392 10208 -5908
10807 -5908 -13781 -27283 -29222 -10966 3258 4932 22639 27214 16819 13508 39890 36247 33498
10794 33498 59937 83914 73828 61445 69019 64429 91908 92070 93101 107253 147608 212860 282560
10781 282560 356580 408073 405649 364887 286745 210876 144445 90215 83015 86252 68621 60611
10769 60611 66437 80684 66978 40987 31318 25073 35274 33358 15473 1561 1991 -10440 -6274
10756 -6274 1875 9919 14717 18483 8178 -14514 -8917 31076 39710 27313 12972 9376 48873
10743 48873 45132 54994 54078 38248 23381 18932 16688 13042 29182 43372 48174 50096 63464
10730 63464 69553 76925 97957 123081 126299 82349 72809 65844 37594 3911 15587 682 4445
10717D445J7976Q824p298j5997N154k628K5867K40p048K5955K0151j052K1151
10704I5740j2563M730J7291K6672P492K4172J0896k0113j1058p013l0100n1403
10692E4743k0967K402o675N779J8088q65J7094N0132M4879n73r87J3622L216j9212
10678A60676j0648J0635K3503l78M302J4303k638R463J5058Q851l964p192M1103
10665B63074O5357J4490K718K1776M6342L9527P3832O6408Q1140P8783J3008q5404
10653F81051k03746k79322j98601m4682J344K3095J8722K660J437J4163L1765
10642D7886L2195K8302j071k0701j5887r197j9697J648O512J8108K7316K5720
10630A21134L082J5058J7383K7481J8688Q338k4201l3465k5880j2370R658K9132
$$ plain form
10717 4445 22421 31245 23947 7950 13104 10476 36343 36583 29535 55490 75641 74589 95740
10704 95740 83177 87907 105198 131870 139362 163534 174430 154317 143259 136246 106146 54743
10692 54743 33776 36178 29503 35282 53370 52505 69599 119731 164610 164037 163050 176672 179888 160676
10678 160676 150028 160663 184166 183788 188090 202393 199755 209218 224276 233127 229163 221971 263074
10665 263074 328431 342921 345639 367415 413757 453284 527116 593524 674664 753447 766455 681051
10653 681051 477305 197983 -618 -45300 -43956 -20861 -2139 521 1958 16121 47886
10642 47886 80081 108383 107312 86611 70724 61527 41830 43478 49990 68098 95414 121134
10630 121134 124216 139274 156657 184138 202826 211164 186963 153498 127618 115248 124906 154038
10618A54038K3163J6963J1973K2983J445L4960j6163m876Q992O075J1700O518
10606B77771J329J8903L3392j9457r198J3304j735n651J7284L4735n679q410J7934
10593C64522J6742L6615K6577K9976L6979J1788J2428K3519J4233K3447M2176
10582F39002O7394O3255M8909K8322J8214J4922O553L9830O7850N8232N1279P4488
10570A178250L4305K4613N1007P2895R9725J33243J51816J55416J53402J83312
10560B237984K40389K85213K87560K44547K38047K65086L08218L43230L70217
10551D820491M90674O42425P76581J013427J273022J544006J635441J509646J414774
10542A5120487J675063K165560K538789K629114L114811M256188O206384R130713
$$ plain form
10618 154038 177201 194164 206137 229120 230565 265525 249362 244486 253478 259553 271253 277771
10606 277771 279100 298003 331395 311938 302740 316044 314309 308658 325942 360677 354998 346588 364522
10593 364522 381264 417879 444456 474432 511411 523199 535627 559146 573379 596826 639002
10582 639002 706396 769651 818560 846882 865096 880018 886571 926401 994251 1052483 1103762 1178250
10570 1178250 1212555 1237168 1288175 1361070 1460795 1594038 1745854 1901270 2054672 2237984
10560 2237984 2478373 2763586 3051146 3295693 3533740 3798826 4107044 4450274 4820491
10551 4820491 5311165 5953590 6730171 7743598 9016620 10560626 12196067 13705713 15120487
10542 15120487 16795550 18961110 21499899 24129013 27243824 31500012 37706396 46837109
10534D6837109J3413457J9791327L0181870M7768914P5540896J06588046J06490305
10527D46611924L6952238o1267543j05866931r3494536o4818908m1573137k6822491
10520H9720616j8067747j2900555r788156p712925o092645m817896l805589l020828
10512B3514275k337709j773606j462134j548967j736628j750117j507161j201327
10504A0196626r91654q30089p65211o80526n74469m71912l82700l59983l28971
10495D811111k78891k09810j50867j58632j56752j46111j77517j68322j67113
10486C197096j76653j83443j63815j57572j52818r7948m3990n3901r9522j25926
10476A941508j13899r7678p6150l9513j2537l8268m6253n8268m0049l1685k6632
$$ plain form
10534 46837109 60250566 80041893 110223763 157992677 233533573 340121619 446611924
10527 446611924 483564162 422296619 316429688 222935152 158116244 116543107 89720616
10520 89720616 71652869 58752314 48964158 41251233 35158588 30340692 26535103 23514275
10512 23514275 21176566 19402960 17940826 16391859 14655231 12905114 11397953 10196626
10504 10196626 9204972 8374883 7609672 6929146 6354677 5882765 5500065 5140082 4811111
10495 4811111 4532220 4322410 4171543 4012911 3856159 3710048 3532531 3364209 3197096
10486 3197096 3020443 2837000 2673185 2515613 2362795 2264847 2220857 2166956 2067434 1941508
10476 1941508 1827609 1729931 1653781 1614268 1601731 1563463 1517210 1458942 1418893 1387208 1360576
10465A360576L0340K1871J0326J1341o802j6717l1540j8147m3882q1731p4604
10454A161031p8599n4371m5738l3469j9646j1227j9767l2881k6457k8578k8147
10443G82151k7185j5031l3811j5818J917r333j356l884J0752o091j0897r885l7954
10430F23575r225p606k51k7806j0427K8551L322k6405K0613K0781j2236k1413
10418E81473M1346J7333m4211k6742M70J5706J2244J5355M627K0778L9281q83
10406F76777K547L9655R547k2022j36563j79437j46313j02870j9317N024M734
10395A31762K1854k347j0254K2800M8978j5270r768K4454L7172L075p11J5255
10383B67000N541N888K3322K8795N187N8966J11843Q4245O9575O3219L8419m4562
$$ plain form
10465 1360576 1390916 1412787 1423113 1434454 1427652 1410935 1379395 1361248 1317366 1235635 1161031
10454 1161031 1082432 1028061 982323 948854 929208 917981 898214 865333 838876 810298 782151
10443 782151 754966 739935 706124 690306 692223 682890 681534 677650 688402 682311 671414 661529 623575
10430 623575 614350 606744 606493 578687 568260 596811 600133 573728 594341 615122 602886 581473
10418 581473 622819 640152 595941 569199 569669 585375 597619 612974 617601 638379 677660 676777
10406 676777 679324 718979 728526 706504 569941 390504 244191 141321 122004 127028 131762
10395 131762 153616 151269 141015 163815 212793 197523 187755 212209 249381 252456 251745 267000
10383 267000 272541 278429 301751 330546 335733 394699 506542 590787 660362 723581 762000 717438
10371G17438q3124o1050m8859k5484j2367k762M1906L3897N3377R2588J05604
10360H11164o080q0500j21489j14234o4916l5106l4210k1206k6210j6668j9081
10349B71464k383j186j2978Q542n029L707J5579j400L105k6743k2236n250P866
10336B33058L8187O980p164k3616j1909j0701K0722J1446j8857m1052k5261j777
10324A70056J4731j617K3570J0638k9968j5450J4478j2167q8J8590j3141R356
10312A88988k0450m330O762j6899l323o46Q660L722K0754M680j1115m554J825
10299A74074n307j3309m084M629J4039K5531O681l4084j0639n26l993M442P219
10286A64673j8439j3070O836K144Q388n502K553J0014K3546J8201K5191j8907
$$ plain form
10371 717438 634314 573264 524405 498921 486554 483792 525698 559595 612972 705560 811164
10360 811164 805084 724584 603095 488861 423945 388839 354629 333423 307213 290545 271464
10349 271464 269081 267895 254917 263459 258430 262137 277716 276316 279421 252678 230442 225192 233058
10336 233058 271245 278225 271061 247445 235536 224835 245557 257003 238146 197094 171833 170056
10324 170056 184787 183170 206740 217378 187410 171960 186438 174271 174183 192773 179632 188988
10312 188988 168538 164208 170970 154071 150748 150102 158762 162484 183238 187918 176803 172249 174074
10299 174074 168767 155458 151374 156003 170042 195573 202254 168170 157531 157005 153012 157454 164673
10286 164673 146234 133164 140000 142144 150532 145030 147583 157597 181143 199344 224535 205628
10274B05628k4302M450p000R609J096O248l673k5472n363o953L750j8513N044
10261A44549K7038K7419K0897j3694q181N484k424L859J9799m368l799k2109j854
10248A92616K3269K2075K5349J1832K2314J2823L2098J8628L0887N4140P5351
10237E21382N0970O0715M8947P0019R9125R3832J66773K12393K84658L87267N19139
10226B515220P02582R59638J213004J349299J243584P16782j45817q74608j227816
10217F451868j239688j064152q52454o41738m96539l50822k34075j99552j73614
10208A199234j27651j02715q7356p3805o2914o8218m1265j4417l9447n4250m4309
10197D82887l5930k3160k7859n9247l3243j5572k0804j2025j926K3627K638k8117
$$ plain form
10274 205628 181326 185776 178776 188385 189481 195729 192056 166584 161221 154268 158018 139505 144549
10261 144549 171587 199006 219903 206209 198028 203512 201088 204947 224746 220378 216579 194470 192616
10248 192616 215885 237960 263309 275141 297455 310278 342376 361004 391891 446031 521382
10237 521382 572352 633067 682014 752033 851158 944990 1111763 1324156 1608814 1996081 2515220
10226 2515220 3217802 4177440 5390444 6739743 7983327 8700109 8554292 7679684 6451868
10217 6451868 5212180 4148028 3295574 2653836 2157297 1806475 1572400 1372848 1199234
10208 1199234 1071583 968868 881512 807707 744793 676575 635310 620893 581446 527196 482887
10197 482887 446957 423797 395938 336691 303448 287876 267072 255047 253121 276748 279386 251269
10185B51269k4240k7446j4854j2445k8972M092L374n122k634j5332R04j6515Q932
10172A21011L5132m317j7293j4389l1574J3504K0808L288k3752q582J6736q165
10160A02407k925P276K5760M627j6669J2988P861M476R826q090M629Q399K3447
10147A84012M3807L4987J531o285q073m1492k5587l0156Q977j7959k626J5536
10135A56672j7684j3199M518j664q039L2601j2217J4395M0426k4623l9620N619
10123A37185R790K2181P043J6007J8495K6284o244j1208K5900L4353M9632M2130
10111C71548L6004P7223J16657J53727J79429K62539L97861N27764M73241J11070
10101B707063l51816n46755m68017l49325k12517j37118j07311o9092n3760m7768
$$ plain form
10185 251269 227029 199583 184729 172284 143312 147404 150778 145656 143022 127690 128594 112079 121011
10172 121011 156143 151826 134533 120144 88570 102074 122882 126170 102418 93836 110572 102407
10160 102407 99482 106758 132518 137145 120476 133464 141325 145801 155627 147537 152166 160565 184012
10147 184012 227819 262806 264337 258052 249979 208487 182900 152744 161721 143762 141136 156672
10135 156672 138988 125789 130307 128643 120604 153205 140988 155383 195809 171186 131566 137185
10123 137185 146975 169156 176199 192206 210701 236985 230741 219533 245433 279786 329418 371548
10111 371548 407552 484775 601432 755159 934588 1197127 1594988 2122752 2595993 2707063
10101 2707063 2355247 1808492 1340475 991150 778633 641515 534204 465112 411352 363584
10091C63584n6754m5692k3555n276n533j2110n741k5234m5136j3798J4124K9565
10079A68444k1081q629J958j933m6154j3796n480O924O937J5735J9358k746J7665
10066A37202j3299m4688O885J0015R616l396l866P554p180K352J276M470J4081
10053A21022k3641k6128N9M4499K4091j3473j3884k0352Q347J0174M562o928k9449
10040G8899j8558J3105o191j1072N361R296j7986k51J124l516r93j984M838J9508
10026G1580P494r894j0581j2225q780j0707j001L62J5630K6703j2743q523L0605
10013G7920K6628J181n901k2183j9646N129k1283l3848J4045R325K1077l659M507
10000E3292J6928k6872r475K215K8951K4668k5632j4267J4359K5883k7154j5908
$$ plain form
10091 363584 306830 261138 237583 232307 226774 214664 208923 183689 138553 124755 138879 168444
10079 168444 147363 138734 140692 138759 92605 78809 73329 80253 87190 102925 122283 119537 137202
10066 137202 123903 79215 86100 96115 105731 102335 98469 106023 98843 101195 102471 106941 121022
10053 121022 97381 71253 71312 115811 139902 126429 112545 92193 100540 110714 115276 108348 78899
10040 78899 60341 73446 67255 56183 61544 70840 52854 52603 53727 50211 49218 47234 52072 71580
10026 71580 79074 69180 58599 46374 37594 26887 25886 26248 41878 68581 55838 47315 77920
10013 77920 104548 105729 99828 77645 57999 63128 41845 7997 22042 31367 52444 48785 53292
10000 53292 70220 43348 33873 36088 65039 89707 64075 49808 64167 90050 62896 46988
9988D6988L863j1857j8320k0068k0176P913k839J9017M1626J4343j6981j1553
9976C1956k914J5677O481j5818r189R988J3906m304r82j0719k7164m323K1218
9963B3813J3544K872n99K8365L702p888j5090j8968j0627K796K4235J950j9143
9950B8962k4345O437K3227j804j2153Q54K3818k765l424o358K5072J4800j703
9937G0618k3663j4393l491j8946k0361J9528J5298l022J1333j1812k2243p194
9925h348K2378J3072P965o436j1495J495j7591K607J2455o993J592Q153p149J4951
9911B6656r542p334r741N234M53j5015j277j8676K907J5340K3872R250j595j5815
9897D717j4334M944O399J208N119K7480O854k7978j3851J9890J1488k8335k6931
$$ plain form
9988 46988 50851 38994 20674 606 -19570 -11657 -14496 4521 46147 60490 43509 31956
9976 31956 29042 44719 51200 35382 26193 36181 50087 45783 44801 34082 6918 2595 23813
9963 23813 37357 40229 39630 67995 71697 63809 48719 29751 19124 21920 46155 48105 28962
9950 28962 4617 11054 34281 32477 20324 21178 44996 42231 38807 32449 57521 72321 70618
9937 70618 46955 32562 29071 10125 -10236 9292 24590 21568 32901 21089 -1154 -8348
9925 -8348 14030 27102 35067 28631 17136 18631 1040 3647 16102 9109 10701 18854 11705 26656
9911 26656 17114 9780 39 5273 5726 -9289 -10566 -29242 -26335 -10995 12877 22127 20532 4717
9897 4717 -9617 -4673 1726 2934 8053 35533 42387 14409 558 20448 31936 3601 -23330
9884b3330j6101N535L0580N1570r04k3178k69J9916n332l0808o947J8800m728
9871A4804O417N667j0986j4668m047M601J805J2272K1262P975L996Q054l2461
9858B4691l3708J894K2034J6650o346L7156l496p847n1n447j004J591k152n273
9844C8692J1527J1568J6439j099K0076K3838K2638j4449Q017M921K342l2031k6411
9831H6068J111q003M125j214M259r449k2075K058j3336k0703m682J5882M98j1111
9817B3428L550J1588Q299j4748L941J7614m464j6161L375M1241k836k5282j0177
9804C9368J202J7955J0631l1345q703L1241J1307K3282j8268j9986J4565n488
9792F5761J0155J3361K6738K3734J0421L1918l291J463n6319k2258j5516l4409
$$ plain form
9884 -23330 -39431 -33896 -3316 48254 47350 24172 23903 43819 38487 7679 732 19532 14804
9871 14804 21221 26888 15902 1234 -2813 1788 3593 15865 37127 45102 49098 57152 24691
9858 24691 -9017 -7123 14911 31561 25215 62371 58875 51028 50977 45530 44526 46117 43965 38692
9844 38692 50219 61787 78226 77127 97203 121041 143679 129230 137247 142168 144510 112479 86068
9831 86068 87179 79176 83301 82087 86346 76897 54822 56880 43544 22841 18159 34041 34539 23428
9817 23428 26978 38566 46865 32117 36058 53672 49208 33047 36422 77663 74827 49545 39368
9804 39368 40570 58525 69156 37811 29108 60349 71656 94938 76670 56684 71249 65761
9792 65761 75916 89277 116015 139749 150170 182088 178797 180260 123941 101683 86167 51758
9780E1758p703L800o123j0488K2903j0253k0099m0386j1713K5697O017J0057o097
9767G370j1647L923p547j0759j051R732P402J725m151L6572K3151L239L943N451
9753F7353j2723O408p864m940M312j5277Q369N243k3684k1519j7584K0703J3073
9740B1870l334j2329l623K2488J4327k6364j5060K9800K400R832J9954O658J947
9727F8566j0046r308L137N051q80p291R62k7802k604j089k5168L379J7025k016
9713A1916J0490j9395P023O408j193J18J5421l0626J4195L935j3519j55q77p806
9699d065p429J0973Q760J4323N709k506o69Q078L846n29k9257l868O211J2606
9685B2183k0991j2708K1698K5642P512p521K421o638q994k6112m741M407K550
$$ plain form
9780 51758 44055 47855 41732 31244 54147 43894 23795 -16591 -28304 -2607 3410 13467 7370
9767 7370 -4277 -354 -7901 -18660 -19711 -9979 -2577 -852 -5003 31569 54720 57959 61902 67353
9753 67353 54630 61038 53174 48234 52546 37269 45638 50881 27197 5678 -11906 8797 21870
9740 21870 18536 6207 2584 25072 39399 13035 -2025 27775 30175 40007 59961 66619 68566
9727 68566 58520 49212 52349 57400 56520 49229 50191 22389 19785 18696 -6472 -3093 13932 11916
9713 11916 22406 3011 10034 16442 15249 15367 30788 162 14357 18292 4773 4618 3741 -4065
9699 -4065 -11494 -521 8239 22562 28271 25765 25096 33174 37020 36491 7234 3366 9577 22183
9685 22183 1192 -11516 10182 35824 43336 35815 38236 31598 22604 -3508 -8249 -3842 -1292
9672a292r454l29Q819Q036j237q15P368J219R226P179J4515l1425L414K6750Q64
9657D2838k7901o2m914J8997P702J2575l0598j6537J0416j2280K249R385J091
9644A2961J0106N317p740k467O957J2006M938l612r701K0427L490p060k686R817
9630E2753m513j5310n898l457k796j077J9947q28o522L58J809k232J0588P073
9616D9895J0878j8166k3017q238N17j5113j0871J6080r949q306K857J1937R53
9603e43k1355J4567K7916P51J1167J0779Q670j0491k8232k071K6042l869K446
9590C5777J3703K286L514l532k728j8622J3586J5329j6704j5522j755K4389j6482
9577C3239r45N143k8760l0585o39J8366R056n900M407J2413L2589M2370l2800
$$ plain form
9672 -1292 -10746 -11075 -2256 5780 4543 3728 11096 12315 21541 28720 43235 11810 15224 41974 42838
9657 42838 14937 14875 9961 28958 36660 49235 18637 2100 12516 236 2485 11870 12961
9644 12961 23067 28384 20644 18177 25134 37140 42078 38466 28765 49192 52682 45622 42936 52753
9630 52753 48240 32930 27032 23575 20779 19702 39649 38821 32299 32657 34466 32234 42822 49895
9616 49895 60773 42607 19590 11352 11869 -3244 -14115 1965 -7984 -16290 -13433 -1496 -543
9603 -543 -21898 -7331 20585 21336 32503 43282 51952 41461 13229 11158 37200 33331 35777
9590 35777 49480 51766 55280 51748 49020 30398 43984 59313 42609 27087 25332 49721 33239
9577 33239 32294 37437 8677 -21908 -22547 -4181 4875 -1025 3382 15795 48384 90754 57954
9564E7954m7113q351K1185J5606K3951j7479l2057O601L9796k0799k2489m075
9552A2730L412J4879j2545N885l2q788m498J6663j174O169J1742n269q713J2892
9538D3353J6706j0520l725j4207K5984R004k468j4469j7413j1686k457K693N280
9525B6075j8679j0918J9345K229M520m06k0168j3148J8341j2013M97K8872J6839
9512D1386N119n801l8155k4860q528Q213k419K488J7223K760J6765J3954N511
9499C3656j9318j6008r781J5992J4830O823k7158j9108L720K2629O810J3745p396
9486A9436M235p53K5380o371k4980k833J5034o245j119l69L5296M430j7233j5327
9472B8581j4016o7n325j9705R68P832J5570r448m812j0266l082J6168J307j0859
$$ plain form
9564 57954 10841 2490 23675 39281 63232 45753 13696 20297 60093 39294 16805 12730
9552 12730 16142 31021 18476 24361 24329 15541 11043 27706 26532 32701 44443 39174 30461 43353
9538 43353 60059 49539 45814 31607 57591 66595 64127 49658 32245 20559 18102 20795 26075
9525 26075 7396 -3522 15823 18052 22572 22166 1998 -11150 7191 -4822 -4325 24547 41386
9512 41386 46505 40704 2549 -22311 -30839 -22626 -25045 -22557 -5334 -2574 14191 28145 33656
9499 33656 14338 -1670 -11451 4541 19371 26194 -964 -20072 -16352 6277 13087 26832 19436
9486 19436 23671 22918 48298 41927 16947 14114 29148 22903 21784 21415 56711 61141 43908 28581
9472 28581 14565 14498 9173 -10532 -9564 -1732 13838 4390 -422 -10688 -13770 2398 3705 -7154
9458g154k0827J885J0601R205N988k435k5301J1585J9319k6823p471J4887K4785
9445H244K3027r009k1508N16k4203j002r725q426K9996K459P078l477j1498l63
9431a7891Q967K2494J0541j4953r042N588Q477n102J807J4472K2941j2006J2057
9418D8350o4k3761n40l068J2428j1171l308n323r485J2021k005n633J4012K0630
9404D3083M727k1819N953O750P761o44l856n407j6159Q162J7612J6434j5732j6868
9390B9997o503O222q247j6111j2491P405j176o860K0058P343j3701j6430P379
9377c115L2150R951j2181P94o93m350O552q977j0543L316J1228p00k415l740L840
9362B1117J1756J0086M309p606J0479L29k5189J812j5373j7278L077K9686K8420
$$ plain form
9458 -7154 -27981 -26096 -15495 -6290 -302 -2737 -28038 -16453 2866 -23957 -31428 -16541 8244
9445 8244 31271 22262 754 1270 -22933 -23935 -33660 -42086 -12090 -9631 -2553 -6030 -17528 -17891
9431 -17891 -8924 13570 24111 9158 116 5704 14181 9079 10886 25358 48299 36293 48350
9418 48350 48286 24525 23985 20917 33345 22174 18866 13543 4058 16079 14074 8441 22453 43083
9404 43083 47810 25991 31944 38694 46455 45811 41955 36548 20389 28551 46163 62597 46865 29997
9390 29997 23494 29716 21469 5358 -7133 272 -904 -7764 12294 19637 5936 -10494 -3115
9377 -3115 29035 38986 26805 27599 26906 22556 29108 20131 9588 12904 24132 23432 21017 17277 21117
9362 21117 32873 42959 47268 39662 50141 50470 25281 27093 11720 -5558 -2481 27205 55625
9349E5625N269j3696j5017k3181q848L023P812J2888Q503L085L5002J1502j9490
9336F2477l786k4182j2401l0441m255J7500o856K4705J7026K773M725O444o663
9323D7066P264j7951o232R361K252j1148j5193J9406q83k3856k170j2646j0307
9310a5037J5177K9579J939p056P538Q165J2701K897J602p427j0624m838J1371
9297D5987M045k296j0940j3517J5973O004j6842k0335m432j3706R850K7356J3106
9284D0253j769j8588K135J4376J7633K0580k114j1843l7978K853j2686j3388J3166
9271A2630K4744k0271j3315N343J2075K8204o484r804j1155o284L98J311M648
9258B2040N850K5368J2324k4136O465r327l0509J1058K3497J0970m265r68o292
$$ plain form
9349 55625 60894 47198 32181 9000 152 3175 10987 23875 32378 35463 70465 81967 62477
9336 62477 58691 34509 22108 -8333 -12588 4912 -1944 22761 39787 42560 47285 53729 47066
9323 47066 54330 36379 30147 39508 41760 30612 15419 34825 33942 10086 7916 -4730 -15037
9310 -15037 140 29719 31658 24602 32140 40305 53006 55903 57505 50078 39454 34616 45987
9297 45987 50032 47736 36796 23279 39252 45256 28414 8079 3647 -10059 -209 27147 40253
9284 40253 38484 19896 22031 36407 54040 74620 72506 60663 22685 25538 12852 -536 12630
9271 12630 37374 17103 3788 9131 21206 49410 42926 33122 21967 15683 16081 17392 22040
9258 22040 27890 53258 65582 41446 47911 38584 8075 19133 42630 53600 49335 48367 42075
9245D2075j3818j3209j4948k402M497J9753K4225j1430k81J6221L3622K636k4397
9232F2544l5808k7489k292K8041N513J9057J517j8740l058j5107K343J6272r670
9219B3123k0525P30P418m53j2536j4712J6098R521J0331L798k591r740N879O061
9205B2402J0723j2781j6805k154J4079J9169J1599k670j7533l299J9290J6078
9193E8098n174p073n259j4043K4197J7409M721j7886j4846j0063L877K713j655
9180C5016P723q03J1018J6528K652l12k6984j1761Q906J9151J0936K0139j6173
9167G6036j1587R950j0046R566l19q93J8599K410l0590j5841L425Q14P508J8560
9153G7592l340j9404r80l458q19J2022J7114q88j3518j1717P905J7743O837K0293
$$ plain form
9245 42075 28257 15048 100 -2302 2195 21948 46173 34743 34462 50683 84305 86941 62544
9232 62544 26736 -753 -3045 24996 30509 49566 51083 32343 29285 14178 16521 32793 23123
9219 23123 2598 3328 10746 10293 -2243 -16955 -857 8664 18995 22793 20202 10462 16341 22402
9205 22402 33125 20344 3539 1385 15464 34633 46232 43562 26029 22730 42020 58098
9193 58098 52924 45851 40592 26549 50746 68155 72876 54990 40144 30081 33958 36671 35016
9180 35016 42739 41936 52954 69482 72134 71822 44838 33077 41983 61134 72070 92209 76036
9167 76036 64449 74399 64353 73919 73600 72707 91306 93716 63126 47285 50710 51524 59032 77592
9153 77592 74252 54848 53868 50410 49591 61613 78727 77839 64321 52604 60509 78252 85089 105382
9139A05382J1303J6559j2275k3211o708M377J6194k0643k0582K0567p225q721
9127G5017K4634N320j3281k1406J526J3479K2423L0507l291j260k1267r885j157
9114A01359j4283J1311J7264O935J7713j3055j1960j7583J59J9487P113k8700
9102I5760P658L2793j1957k451L5141L162M663j2563j4264l106P575K900n709
9089A39602k544o742J4208N652P936k7023k5321J513M04J1693Q462R335J308J1960
9075A50443n734M931R823R101m11J8208p676j1709k1428l1298Q423K6730L877
9062A53280J7670Q386L369j5737k997l751m97k1373J754J3216j2762M743n309
9049A39992J4843L6360k256l1263j3133L1430J8131R383j102o98O395M316K078
$$ plain form
9139 105382 116685 133244 120969 97758 91050 95427 111621 90978 70396 90963 83738 75017
9127 75017 99651 104971 91690 70284 71810 85289 107712 138219 134928 133668 112401 102516 101359
9114 101359 87076 98387 115651 122586 140299 127244 115284 97701 97860 117347 124460 95760
9102 95760 103418 136211 124254 121803 156944 160106 164769 152206 137942 134836 142411 145311 139602
9089 139602 137058 130316 144524 150176 158112 131089 105768 107281 107685 119378 127840 137175 138483 150443
9075 150443 144709 149640 159463 168564 168153 186361 178685 166976 145548 114250 122673 149403 153280
9062 153280 170950 179336 182705 166968 163971 160220 159723 138350 140104 153320 140558 145301 139992
9049 139992 154835 191195 188939 157676 144543 175973 194104 203487 202385 201687 208082 212398 214476
9036B14476J769r3j2613J94K92L275J8609J0746J5329L496j9006j8746j1017M003
9022B10714M0897K5835J805J3540J9384P3k5554k277J1575M551J0772p350m220
9009B99745L502J2995J4710j6302r357K3086J7273J1813k343J1398R021R528J1254
8996C96323J9919n13N216J0568J5376K0345p40j0948j9426j536k484J4825j2190
8983D34735j4988K2027K821j1763J4139J9288O207K663K1171J2210j0002n49R442
8970E07401l026l3254L7343K5157K1289J2502J145K3767J0746l730k7928M839
8958E76251K4028J9174K5699K3212J3534J4664K8392Q771K122L6847K1684J5168
8946H09546L1096J3762K4027K3954K1575N282J2795L2268L6810K4103M4626M2830
$$ plain form
9036 214476 216245 216152 203539 203733 204025 207300 225909 236655 251984 255480 236474 217728 206711 210714
9022 210714 251611 277446 279251 292791 312175 312248 286694 284417 295992 300543 311315 303965 299745
9009 299745 303247 316242 330952 314650 305293 328379 345652 357465 355122 366520 375541 385069 396323
8996 396323 416242 415729 420945 431513 446889 467234 466494 455546 436120 434584 432100 446925 434735
8983 434735 419747 441774 444595 432832 446971 466259 472466 475129 496300 508510 498508 497959 507401
8970 507401 504375 471121 508464 533621 554910 567412 568557 592324 603070 599340 571412 576251
8958 576251 600279 619453 645152 668364 681898 696562 724954 733725 735847 772694 794378 809546
8946 809546 840642 854404 878431 902385 923960 929242 942037 974305 1011115 1035218 1079844 1122674
8934A122674L4047M2396J0171K8131K5055L1662L6354M3112L0355L2280L5042
8923A471279N0596N0047M5492N0172N9465O4121O4769Q1931R0183O9665O7139
8912B164859O1969R0637R1517J29850J34540J19473R5775R4923J26716J44367
8902C254626J56282J63121J75820J98792J79167J98556K13297K42018K83693K67775
8892E333147K73533L19624L66819L66440L84657M36434M82728N20380N84466O15882
8882I684110O73742P09621P80769Q49288R48133J037402J132140J220694J296377
8873A8332276J380733J466921J553219J619784J670618J681494J660443J578269
8865C0943757J422186J271019J051113P40743L94971O2385k50613o04445q82125
$$ plain form
8934 1122674 1156721 1199117 1209288 1237419 1262474 1294136 1330490 1373602 1403957 1436237 1471279
8923 1471279 1521875 1571922 1617414 1667586 1727051 1791172 1855941 1937872 2028055 2097720 2164859
8912 2164859 2226828 2317465 2408982 2538832 2673372 2792845 2888620 2983543 3110259 3254626
8902 3254626 3410908 3574029 3749849 3948641 4127808 4326364 4539661 4781679 5065372 5333147
8892 5333147 5606680 5926304 6293123 6659563 7044220 7480654 7963382 8483762 9068228 9684110
8882 9684110 10357852 11067473 11848242 12697530 13645663 14683065 15815205 17035899 18332276
8873 18332276 19713009 21179930 22733149 24352933 26023551 27705045 29365488 30943757
8865 30943757 32365943 33636962 34688075 35428818 35823789 35886174 35635561 35031116 34148991
8856C4148991j096273j335832j493648j583385j597439j613784j599267j576114
8848B2253249j493985j386238j301629j210655j101326j045643j002129r06917
8840A2804727q07187p67982p03085o50354o21870n51930m94651m37658m03533
8831G366477l87618l78498l34728l18065k95290k92193k67424k42405k03087k09576
8821D437593k12864j92283j84233j65747j24057j52762j26215j07387j18391j13972
8811B939682j01303r6642q9320j00826q0996p0524q4774p5515r4963r8396o6209
8800A980214p6325m0009l2469m2489k3778l1434m7806o5229n7609n3127m1817
8789A468122m7176o0510n1626k8139k7543l2494k9507j0962j5582k9479m0634
$$ plain form
8856 34148991 33052718 31716886 30223238 28639853 27042414 25428630 23829363 22253249
8848 22253249 20759264 19373026 18071397 16860742 15759416 14713773 13711644 12804727
8840 12804727 11997540 11229558 10526473 9876119 9254249 8702319 8207668 7770010 7366477
8831 7366477 6978859 6600361 6265633 5947568 5652278 5360085 5092661 4850256 4647169 4437593
8821 4437593 4224729 4032446 3848213 3682466 3558409 3405647 3279432 3172045 3053654 2939682
8811 2939682 2838379 2741737 2652417 2551591 2470595 2400071 2315297 2239782 2144819 2046423 1980214
8800 1980214 1903889 1863880 1831411 1788922 1765144 1733710 1685904 1620675 1563066 1509939 1468122
8789 1468122 1420946 1360436 1308810 1280671 1253128 1220634 1191127 1180165 1164583 1135104 1094470
8778A094470k2149q446j5773l5452m2797q810m456k4356j4508k7931j7020n321
8766H67451k7177k9318r113M146L360j6528k0313p351k7485l5058o396l271j5488
8753F77459J6942j59l926j0056j5849k225j9079j7656j7469j9188M676J6633k9146
8740E80957k3798j1475l0256j3575k045O968J7478m900m5107l2121k8470j9101
8728C94555n121K4254Q54j8586p250J2800j2094l786J2022Q972j5528k4461N046
8715C71677K603r699j4160o317j1577k498j523k4520N716o945j6000M373K1508
8702C12638n970j5017Q120Q689k6951J432j0550n178J1008p691J1607J3078J8473
8689C13688k235j3861q087j6009l5360l2181n67L6929J6800j3930k0983l916R502
$$ plain form
8778 1094470 1072321 1063875 1048102 1012650 969853 961043 956587 932231 917723 889792 872772 867451
8766 867451 840274 810956 801843 805989 809349 792821 772508 765157 737672 702614 696218 692947 677459
8753 677459 694401 694242 690316 680260 664411 662186 643107 625451 607982 588794 593470 610103 580957
8740 580957 557159 545684 515428 501853 499808 506776 524254 519354 474247 442126 413656 394555
8728 394555 389434 413688 414542 395956 388706 401506 389412 385626 397648 406620 391092 366631 371677
8715 371677 374280 364581 350421 344104 332527 330029 328506 303986 309702 302757 286757 291130 312638
8702 312638 306668 291651 299771 308460 281509 282941 272391 267213 278221 270530 282137 295215 313688
8689 313688 311453 297592 289505 273496 238136 205955 205388 242317 259117 245187 224204 220288 229790
8676B29790q88l0773j7675K0115J6266J222r611n620o663J6767J4348l210J963
8663B26031K2258j7542k1645l178J3144N203j1979k5728j475J0296J1840o696
8651B00529p403m011k5840R553L8179J2454j3139j0466p418j5245J4069j3120
8639A78142j1805R689Q910J6701j1270o852M776j3280N443q804P596j7581p864
8626A53801O358j2143q143K9976Q356l5782k6579K5999L9913m303j0550N551J9272
8613A91726q389j5677L90O895j1348k945j1847J0015N626N561J862P48J5205K079
8599A89901p233j8435J579l560M280J4603J2515L1277J4701K1461J7806L612K853
8586B85360J2028J1219j7834k2527p515j7599l5851p048o166k8534j4790q15k2187
$$ plain form
8676 229790 228902 198129 180454 200569 216835 218057 208446 202826 196163 212930 227278 224068 226031
8663 226031 248289 230747 209102 205924 219068 224271 212292 186564 185089 195385 207225 200529
8651 200529 193126 189115 163275 172828 211007 223461 210322 199856 192438 177193 191262 178142
8639 178142 166337 176026 184936 201637 190367 183515 188291 175011 180454 171650 179246 161665 153801
8626 153801 160159 148016 139873 169849 178205 142423 115844 141843 181756 177453 166903 172454 191726
8613 191726 183337 167660 168050 174945 163597 160652 148805 158820 164446 170007 171869 172617 187822 189901
8599 189901 182668 164233 165812 162252 166532 181135 193650 224927 239628 261089 278895 282507 285360
8586 285360 297388 308607 290773 268246 260731 243132 207281 200233 194067 165533 150743 149928 127741
8573A27741J0368K102K350J5937K461o857O776j121r598m263j5543j8427J088
8560A13014J7349J9121j576p702k679l660p902o536j1481K2284o476k7583J7547
8547A13720R920Q864p111j0729J8561j0282j5161j8819R052K5312M663l366k927
8534A21697m3220K3963p161m074j2501k4980O268J5213L551J8259j4781j3093
8522F9141n594k776n06n384m603J7617M56Q401J1035j8869J6174K1780j0238j2237
8508H4397m085J1285O559P548q837l2391j0496J0205J4430N689k3923k9258J5260
8495D6383L3300K0109k0797j8501K2497P333Q492k9331k4423j013Q253K5405j0774
8482F6933n401P099k068O622j8065j8505j9633J3256K7440N191R201R351j1149
$$ plain form
8573 127741 138109 140211 142561 158498 160959 154102 160878 159757 150159 145896 130353 111926 113014
8560 113014 130363 149484 147908 140206 137527 133867 125965 119429 107948 130232 123756 96173 113720
8547 113720 123640 132504 125393 114664 133225 122943 107782 88963 98015 123327 127990 124624 121697
8534 121697 78477 102440 95279 91205 78704 53724 59992 75205 78756 97015 82234 69141
8522 69141 63547 60771 60265 54881 50278 67895 68351 76752 87787 68918 85092 106872 96634 84397
8508 84397 80312 91597 98156 105704 96867 64476 53980 64185 78615 84304 60381 31123 46383
8495 46383 79683 99792 78995 60494 82991 90324 98816 69485 45062 44049 52302 77707 66933
8482 66933 61532 68631 66563 73185 55120 36615 16982 30238 57678 62869 72070 81421 70272
8469G0272K420j7006j3695J7525j4767q583L821R331O911K7054o548M968J5517
8456I7220p309O782k3747n675J0734j6362J6534J7569j3585l0948l8323j105J4709
8443B6494K6032K3708K475j7107r177j7151K046M1007P882n0953j5654K17O078
8430B5897K2155J0201J8296j4011L059j0j7064J242k988J5437r320P11l367K7815
8416G8053j1165k7475L177K4493K0100k6374j3809J7706N53j9332l66l446J3187
8403E5302J0499j80J06j7990J9098j1160j4350n491R019J5980j5571p413o450
8390C1399L873k735m224J1961j3827J6446L932j9452k720p450o497J3699J4050
8377C8455J72K722J5719J8699k5864k8537J3642L5405k1874l8620l5671J1684
$$ plain form
8469 70272 72692 55686 41991 59516 44749 36166 39987 49318 56229 83283 76735 81703 97220
8456 97220 89911 96693 72946 67271 78005 61643 78177 95746 82161 51213 12890 11785 26494
8443 26494 52526 76234 78709 61602 52425 35274 37320 78327 86209 35256 19602 19819 25897
8430 25897 48052 58253 76549 62538 65597 65587 48523 49765 46777 62214 52894 53605 50238 78053
8416 78053 66888 39413 42590 67083 87183 60809 47000 64706 65259 45927 45561 42115 55302
8403 55302 65801 65621 65727 47737 66835 55675 41325 35834 44853 60833 45262 37849 31399
8390 31399 35272 32537 28313 40274 26447 42893 46825 27373 24653 17203 10706 24405 38455
8377 38455 38627 41349 57068 75767 49903 21366 35008 70413 48539 9919 -25752 -14068
8365a4068N3850K0562k0225j2016J3023K1200j9305k5280m388J9027R082N184
8353D6646J4052j7384o376R6K3991Q984m565j00L543p055K424k3241l2767Q765
8339A7013J835j2987j1969J2392j9342n958K7521J8783J0573l893j2375K3627
8327D5220j8451j436J2196L402k6030j5814m361l644K903K8560o02O202j229J1961
8313C8877K0712j984j9043L956J3006m869k1794k7846K655K0604M028K4J2149
8300D0475q523M530k769J3508Q986j2328J2624R130K330q270j1967j0596j2356
8287B4774J8681o174j0070J4233L0994J330j1056j3968j5477j2087Q884M363q311
8274B6116O643J8884q093l2544o91p240j8285J6668J3555J0746J1456O218N637
$$ plain form
8365 -14068 39782 60344 40119 28103 41126 62326 43021 17741 13353 32380 41462 46646
8353 46646 60698 43314 36938 37034 61025 70009 65444 65344 68887 61832 64256 41015 8248 17013
8339 17013 18848 5861 -6108 6284 -13058 -19016 8505 27288 37861 33968 21593 45220
8327 45220 26769 25333 37529 40931 14901 -913 -5274 -8918 -6015 22545 21943 28145 26916 38877
8313 38877 59589 57605 38562 42518 55524 50655 28861 1015 3670 24274 28302 28326 40475
8300 40475 31952 36482 33713 47221 56207 43879 56503 65633 67963 59693 47726 37130 24774
8287 24774 43455 37281 27211 41444 72438 73768 62712 48744 33267 21180 30064 34427 26116
8274 26116 32759 51643 43550 11006 10315 3075 -15210 1458 15013 25759 37215 43433 49070
8261D9070p752j5953r768L3453p094j8642q151Q428J5280n71p147k1236q098j0117
8247h298J3522J6973J923q41k108O767l3509k0152M467J7500p2p494O148M19J8398
8232A3643P734P505J2581p238n626n600j8650K661k3872l0043o320K0720L7972
8219E467k743K368N303J2503J3149j2063m396j355O89J0553J815j9289l3910J490
8205b0419J1183O762L281K4143r122j867L2765K0417l860r538m761j1516j3929
8192B3539j1617o43j51J6799K2416k156l4041m964J5706n642O876R544j6032j0638
8178H996R989N97O248l744k168N971J9134j0706n871L041j4219r20J9998k5k6875
8163I446j2090J6805j4872j5236n610J1148J9996Q074K803q39P28J8372L70j7680
$$ plain form
8261 49070 41318 25365 15597 49050 41956 23314 15163 23591 38871 38300 31153 9917 1819 -8298
8247 -8298 5224 22197 24120 23279 21171 27938 -5571 -25723 -21256 -3756 -3828 -11322 -5174 -4755 13643
8232 13643 21377 28882 41463 34225 28599 22999 4349 7010 -16862 -46905 -53225 -32505 5467
8219 5467 2724 5092 10395 22898 36047 23984 19588 18233 18922 29475 31290 12001 -21909 -20419
8205 -20419 -9236 -2474 807 24950 15828 13961 46726 67143 63283 53745 48984 37468 23539
8192 23539 11922 11279 11128 27927 50343 48187 14146 9182 24888 19246 26122 35666 19634 8996
8178 8996 18985 19582 25830 22086 19918 25889 45023 34317 28446 31487 17268 16348 36346 36321 9446
8163 9446 -2644 14161 -711 -15947 -21557 -10409 9587 17661 20464 19625 20353 38725 39095 21415
8149B1415j8364j775q614L667J3401O937n46k2284j5487J4635J44K1680K1783
8136C6592j6943j5294j082m331J7226l462P405K1621N394j8316l5452j3893K0314
8123b21J2555J4712r204L948q57m346o694L705k675l7261k4738q314J4611J2797
8109c1982N295K9585K5039r778J5628K9452Q157l5852k0472q544J5665O129l1027
8096b705j2302K0167O773j1252J836J2524K2757L099p176j4263k2511q246j7893
8083b9192K955K4348q154j5446J1029L3718J0783N765j3050q986j8065K888k3071
8070b4478m391L288J1796L1419O674K599k32J110M114J0879j9954j1178j7418
8057e772K0061o425l686m699J055J5144N459J2178J5971k2800k6140J6517o82
$$ plain form
8149 21415 3051 1276 -7338 -3671 9730 16667 16121 -6163 -21650 -7015 -6871 14809 36592
8136 36592 19649 4355 3273 -1058 16168 12706 20111 41732 47126 28810 -6642 -20535 -221
8123 -221 12334 27046 17842 21790 20933 16587 9893 13598 10923 -26338 -51076 -59390 -44779 -31982
8109 -31982 -26687 2898 27937 18159 33787 63239 71396 35544 15072 6528 22193 28322 -2705
8096 -2705 -15007 5160 11933 681 2517 15041 37798 40897 33721 19458 -3053 -11299 -29192
8083 -29192 -26237 -1889 -10043 -25489 -14460 19258 30041 35806 22756 13770 -4295 -1407 -24478
8070 -24478 -28869 -25581 -13785 17634 24308 26907 26675 27785 31899 42778 22824 11646 -5772
8057 -5772 14289 7864 4178 -521 534 15678 21137 33315 49286 26486 346 16863 16181
8044A6181k8052l020O148M483J914J4586J3970O430P848m085Q194l5853k3071
8031a4327J4439K3187k105J3536O204k7955o296p064K0020K9041M500n061j0482
8018C7637K127j2991k5080M794M657n86Q287m655r367k380r445L0162J3455k6801
8004I814l40J6824J6347J6550j40r829J7650J9950r29N896k6098k2205P360J5235
7990F6085J0686k5160l4111J2377K3234J0244o592K046N519j4620k5752l371K6535
7977D7120q52R07m165k2050j1862R878j3741M486q87n894P621J3535k4243q349
7963h496K2334J5221j548j2596K564K4744J2560J145p690M516k77j3496J6187
7950E5168J7651m130p334R323J3021n764j2370j9323K745J9346k916k1806j2453
$$ plain form
8044 16181 -11871 -14891 -8743 -4260 -2346 12240 26210 32640 40488 36403 44597 8744 -14327
8031 -14327 112 23299 21194 34730 40934 12979 6683 -381 19639 48680 53180 48119 37637
8018 37637 39764 26773 1693 6487 11144 10558 18845 14190 4823 2443 -7002 23160 36615 9814
8004 9814 9474 26298 42645 59195 59055 49226 66876 86826 85897 91793 65695 43490 50850 66085
7990 66085 76771 51611 17500 29877 53111 63355 56763 58809 64328 49708 23956 20585 47120
7977 47120 46268 47175 43010 20960 9098 18976 5235 9721 8834 2940 10561 24096 -147 -8496
7963 -8496 13838 29059 27511 14915 17479 42223 54783 55928 48238 52754 52477 38981 55168
7950 55168 72819 68689 61355 70678 83699 77935 65565 46242 48987 68333 65417 43611 31158
7937C1158k523n246j3684p187k1461k619L3127L6060M875k2400L284K7292p537
7924E3139k8481k2196k1042M100K2841J4509R123N764r643j3509M373J3709j411
7911C1276J1832J2113k4149k232R883O790j076R912jj0682j0459K4036J3195L455
7897G3893k2597k4436j9910Q339L1638J6837r068k5423j2992L018p632P105L211
7884B1983k0753K743K1379L5749L70j8094j4039m3907o211P314J9000N679k1483
7871a0270j8977p647R492J9951M6421K4039j619m443o217l5001k1802j2038J4953
7858c158K1951l148n947r875J0497J7613O490j0575K553r40j8739L0019O616q479
7844C4878k5326j4501P32R446M518J832K537n716k1226l532P780j139J4252j2649
$$ plain form
7937 31158 28635 23389 9705 2518 -18943 -21562 11565 47625 52500 30100 33384 60676 53139
7924 53139 24658 2462 -18580 -14480 8361 22870 31993 37757 28114 14605 18978 32687 31276
7911 31276 43108 55221 31072 28840 38723 45513 44437 54349 54348 43666 33207 57243 70438 73893
7897 73893 51296 26860 6950 15289 46927 63764 54696 29273 16281 19299 11667 18772 21983
7884 21983 1230 3973 25352 61101 61471 43377 29338 -14569 -20780 -13466 5534 11213 -10270
7871 -10270 -29247 -36894 -27402 -7451 38970 63009 61390 56947 50730 15729 -6073 -18111 -3158
7858 -3158 18793 15645 9698 -177 10320 27933 34423 23848 26401 25461 6722 36741 43357 34878
7844 34878 9552 -4949 -4217 5229 9747 11579 14116 8400 -12826 -16358 -8578 -9717 4535 -8114
7830h114l132J7397J4932r320K3946l791j2787K087k476j6214k85j5303k9675
7817d2735J4640K7333R289k3113p899P434l665K2836k584L578N767K438N984O450
7803B5753m528k3221J4524j5k15j1494o711L485K9291L1268J2814j4339j1040
7790D5572l5068j7628Q387J5714m265j1895k300L439j2707M476N704n908j2547
7777a9026j2352P183K826J1103Q691j5191M43J6214J176J7128L1240l801l4681
7764A0953k4143J6994R419r559p560K3255J8585l4905j5792j88r69L560J1806
7751A456O821k5356K0990M8225o82k998j2513N403k2533J2460J565j2664m819
7738A5355k8918j380J3783l985N221J0175L746M752J4727o32m065K554o612M427
$$ plain form
7830 -8114 -11246 6151 21083 11763 35709 31918 19131 21218 18742 2528 2243 -13060 -42735
7817 -42735 -28095 -762 8527 -14586 -22485 -15051 -18716 4120 1536 5114 10881 13319 19303 25753
7803 25753 21225 -1996 12528 12513 12298 804 -5907 -2422 26869 58137 70951 56612 45572
7790 45572 10504 -7124 1263 16977 12712 817 -1483 1956 -10751 -6275 -571 -6479 -19026
7777 -19026 -31378 -24195 -21369 -10266 -1575 -16766 -16323 -109 1067 18195 49435 45634 10953
7764 10953 -13190 3804 13223 3664 -3896 19359 37944 3039 -12753 -12941 -13910 -10350 1456
7751 1456 8277 -17079 3911 52136 51454 48456 35943 41346 18813 31273 32838 20174 15355
7738 15355 -13563 -14943 -1160 -5145 76 10251 13997 18749 33476 32844 28779 31333 24721 29148
7724B9148k534j0706k721k2822n590P831L040J3329L5988j1175j7156j2368n931
7711a667j2370j4318K2874J3539K9114k2984k4207k0903L3006K1532o290O065
7699B3391l176n918j6192o745Q099J6583J2982k0105j2460J675j0701J4764k1132
7686a8935j1635P511P798K1854m570l355L3386J9283m7656k0043J0965K2623K2940
7673D0166j9200r113O752l88j2943r842j6479L1200j7127j0609K4428J6125K3038
7660D6008N062j484k3576j839j6076r921M119r264K029l70J2107J100J8344K3276
7646D9515o65l1780k9641j4400P782J0169k615k3019j4838q589K8247L5362O660
7633A2188n885j6131r3m411n97O517J2096J3748k8798k300N913j5752k061L1317
$$ plain form
7724 29148 26614 15908 13187 -9635 -15225 -7394 -4354 8975 44963 33788 16632 4264 -1667
7711 -1667 -14037 -28355 -5481 8058 37172 14188 -10019 -30922 2084 23616 17326 23391
7699 23391 20215 14297 -1895 -8640 -541 16042 29024 8919 -3541 -1866 -12567 2197 -18935
7686 -18935 -30570 -23059 -15261 6593 2023 -1332 32054 51337 3681 -16362 -5397 17226 40166
7673 40166 20966 11853 18605 18217 5274 -4568 -21047 10153 -6974 -17583 6845 22970 46008
7660 46008 51070 49586 26010 24171 8095 -1826 2293 -6971 -4942 -5312 6795 7895 26239 49515
7646 49515 48850 17070 -12571 -26971 -19189 -9020 -11635 -34654 -49492 -58081 -29834 5528 12188
7633 12188 6303 -9828 -9921 -14332 -14929 -8412 3684 17432 -11366 -13666 -7753 -23505 -25566 5751
7619E751P184Q952J216l127L627L053k1623n706N958L559J0183K387M256j666
7605B4004Q814j5824n75k1798j5023l763J4739J3017J9018L569p184j7748P019
7592H265l631Q45p664N896N131p33Q382j902K107k676K5787o199k7679n486j1122
7577a0679P895K4668l639O21J0088O115R22j2674l0866m268J1821L1047K952m439
7563B9564k057k9712j1251j8895j184k667j801O696n786P052J8410K7394m772
7550A0991J1607j8181N0K1835n606r188k0581R348L396n417j8932j0103O037O928
7536a7816J351N20J3267J0184q00n057j414O74r097k0031q266R701P043J3773
7522e968K2831N537m947j3246J1015l792j4678r466l835K651l179J1139n861k3927
$$ plain form
7619 5751 12935 21887 23103 19976 23603 26656 5033 -673 5285 8844 19027 21414 25670 24004
7605 24004 32818 16994 16419 -5379 -20402 -24165 -9426 3591 22609 26178 18994 1246 8265
7592 8265 4634 5479 -2185 3711 8842 8109 16491 14589 16696 14020 39807 33608 5929 443 -10679
7577 -10679 -2784 21884 18245 18866 28954 35069 35991 23317 -7549 -11817 4 31051 34003 29564
7563 29564 27507 -2205 -13456 -32351 -33535 -36202 -38003 -31307 -37093 -30041 -11631 15763 10991
7550 10991 22598 4417 4467 26302 20696 11508 -9073 275 3671 -1746 -20678 -30781 -24744 -17816
7536 -17816 -16465 -15945 -2678 7506 6706 1649 235 909 -8188 -28219 -36485 -26784 -19741 -5968
7522 -5968 16863 22400 17453 4207 15222 11430 -3248 -12714 -16549 -13898 -17077 -5938 -11799 -35726
7508c5726L408J0767O849l190k8929l777J7105K7029k884L532P914J3005j2292
7495B811j7718j399J8281J7593Q149o717o323j3832n898K9321K8656n183o748
7482D0993k4424l3922j6R344O806m7254j8927M568L6365M9408N976n936P07j817
7468B1871J2085J0504j6828l3501j816J9412k461m9527j7013J5964J4670K1858
7456d782K078j3101J6915k6742j2078j2315J0130J4079R511J2970J3445p668p862
7443e420j5005Q074Q179Q027o031K266k6895Q590O761n364r901J1988q834j449
7429b5014P276l767Q806j912l026K7329N871Q565j2088q015j3943L940K296k0495
7415b4177p751o99l730r065o779M2896J4969J1891k314j3623j9226j8491j5276
$$ plain form
7508 -35726 -32318 -21551 -14702 -17892 -46821 -50598 -33493 -6464 -9348 -5816 2098 15103 2811
7495 2811 -14907 -16306 1975 19568 27717 21000 14677 845 -5053 24268 52924 47741 40993
7482 40993 16569 -17353 -17369 -8025 -1219 -48473 -67400 -62832 -26467 22941 28917 22981 23688 21871
7468 21871 33956 44460 27632 -5869 -7685 11727 9266 -40261 -57274 -41310 -26640 -4782
7456 -4782 -2704 -15805 1110 -25632 -37710 -50025 -39895 -25816 -16305 -3335 10110 2442 -5420
7443 -5420 -20425 -12351 -4172 3855 -2176 90 -26805 -18215 -11454 -16818 -26719 -14731 -23565 -25014
7429 -25014 -17738 -21505 -12699 -14611 -17637 9692 15563 24128 12040 4025 -9918 -5978 -3682 -24177
7415 -24177 -31928 -32627 -36357 -45422 -52201 -9305 5664 17555 15241 1618 -17608 -36099 -51375
7402e1375J7341K1942j1903L287j085O716j8903o177J5799M059J6780P513j0442
7389f448J8454n647o03K1541K4800j1787m1622q705L558r11j0232j6740o647m849
7375d5838J7291J9500j3856j9269l135J2929K2769K3911p842o296o690K961j7082
7362b0647j2139o76j291L0983J5927j1521L213j2574p954K0024O347k293K0004
7349B7403J5192M593k1069l952K093j855k376r388O598j5284m818O826J4662j0409
7335H216k2922k3041j265M870j6898j0444J9160K4419o13J3283J5999j1349k3413
7322b3998L492J6289p898J8545K5313j972k5601k4374M048J5313l269l9575L183
7309d0504N699J6913M349M344j247j6315j9800m324J4604J3252l716j4621l836
$$ plain form
7402 -51375 -34034 -12092 -23995 -20708 -21793 -15077 -33980 -40157 -24358 -20299 -3519 3994 -6448
7389 -6448 12006 6359 5756 27297 52097 40310 -1312 -10017 -6459 -7370 -17602 -34342 -40989 -45838
7375 -45838 -28547 -9047 -22903 -42172 -45307 -32378 -9609 14302 6460 164 -6526 -3565 -20647
7362 -20647 -32786 -33462 -34753 -3770 12157 636 3849 -8725 -16679 3345 9692 7399 27403
7349 27403 42595 47188 26119 22167 24260 22405 20029 10641 17239 1955 -2863 3963 18625 8216
7335 8216 -14706 -37747 -39012 -34142 -51040 -61484 -42324 -17905 -18518 -5235 10764 -585 -23998
7322 -23998 -20506 -4217 -12115 6430 31743 29771 4170 -20204 -16156 -843 -4112 -43687 -40504
7309 -40504 -34805 -17892 -13543 -9199 -10446 -26761 -46561 -50885 -36281 -23029 -26745 -41366 -45202
7296d5202O023k948Q601K985K2380M738K4185o12j2786N005O794k6634k0024l102
7282c0597m885R829R247J9944P953J5056J337j2113j4142K524K932k1510j1190
7269b5615K2218J3637n928J1110J2511k3981j4722j676l703Q928K0284N145l424
7256A4784k90k3694j2358n502p396K667m901J1044K6865n551k6672L782J1280
7243a5942k534n075P898M111K939k0414N024J0000K7286M332j2349k3636J2957
7230e403q99J1480K3101o89k1284l922k476p065k5866j0710J1502J7033M2288
7217B7090J3053L26q961k2437J5116K4112P556j4075j5267l2922k5882k2877J8654
7204c6514J8723K3502R59j1682K312k199j9962M946Q082j4534o299K3139P281
$$ plain form
7296 -45202 -39179 -42127 -33526 -30541 -8161 -3423 20762 20150 7364 12369 19163 -7471 -27495 -30597
7282 -30597 -35482 -25653 -16406 3538 11491 26547 27884 15771 1629 4153 7085 -14425 -25615
7269 -25615 -3397 10240 4312 15422 27933 3952 -10770 -12446 -16149 -7221 13063 18208 14784
7256 14784 14494 -9200 -21558 -27060 -34456 -31789 -36690 -25646 1219 -4332 -31004 -27222 -15942
7243 -15942 -18476 -23551 -15653 -11542 -8603 -29017 -23993 -13993 13293 17625 5276 -18360 -5403
7230 -5403 -6302 5178 28279 27590 6306 2384 -92 -7157 -33023 -43733 -32231 -15198 27090
7217 27090 40143 40469 31508 9071 24187 48299 55855 41780 26513 -6409 -32291 -55168 -36514
7204 -36514 -17791 5711 6670 -5012 -2700 -4899 -24861 -19915 -11833 -26367 -32666 -9527 -2246
7191b246j4006l1144J5872K4800j359K891M505R437J0240p715l759J511n908m5222
7177d2103j6819J3532N270p981P292J8045o505o017j0719p869J7227J9730o901
7164b3818J4518K4114j5965p477J1814o935J5746k368J1654r029n913j0830k2131
7151b6620q181J2842O404j921J1604L3579K3386K091l0765k5920k3622m101J7940
7138a3284J3581k178j1116j692k989M302J3593J5569M083j8539r753m874m167
7125a7464J6302L445M017r996O635Q780j2385k1829M640O532l689R128Q591J4682
7111A7389p593j003j3176k3182Q0L1017N287j4983j4941Q243k175j0570N523J8670
7097a414J6448L505o317j492K505l554O894M429n728k1921m095K7633n25j014
$$ plain form
7191 -2246 -16252 -47396 -31524 -6724 -8083 -5192 -687 8750 18990 11275 7516 9027 3119 -42103
7177 -42103 -58922 -45390 -40120 -48101 -40809 -22764 -29269 -35286 -46005 -53874 -36647 -16917 -23818
7164 -23818 -9300 14814 -1151 -8628 3186 -3749 11997 9629 21283 12254 6341 -4489 -26620
7151 -26620 -34801 -21959 -15555 -17476 -5872 27707 51093 53184 22419 -3501 -27123 -31224 -13284
7138 -13284 297 -1881 -12997 -14689 -17678 -13376 217 15786 19869 1330 -8423 -13297 -17464
7125 -17464 -1162 2283 6300 -3696 2939 11719 -666 -22495 -17855 -11323 -15012 -5884 2707 17389
7111 17389 9796 8793 -4383 -27565 -27485 3532 8819 -6164 -21105 -12862 -15037 -25607 -20084 -1414
7097 -1414 15034 18539 12222 10730 13235 9681 16575 21004 15276 -6645 -10740 16893 16368 15354
7083A5354l892k9016k9554R881K4714J2912j1498q78j426k2615J5445o43J3983
7070g233l361J9164J1760k3146p887N6313K3753q272k1084R605q222j3875o926
7057B0589k679n255j5312k0739K8483K4278k3292J0196L799k4242Q301k078L872
7044E921j1217o379j0691j2194j4638J5611J6488p232p183q82m140k3192j5947
7031g5675J7672K8859O430J360R277k983r839M104P984j0796k1805j04j1812J5078
7017d2250P826K2985J1963M824j7235L78L185j3536l155N827M978j0727K8863
7004C926M525n323m992L693J0296j6523l1149k1980K2154K4521K690n76O704j4622
6990a6656j6417n753P045K3345J962n474K3243j548J548j4014j9237J5454j7262
$$ plain form
7083 15354 11462 -17554 -47108 -37227 -12513 399 -11099 -11977 -13403 -36018 -20573 -21216 -7233
7070 -7233 -10594 8570 20330 -2816 -10703 45610 69363 61091 40007 49612 41390 27515 20589
7057 20589 17910 12655 -2657 -23396 5087 29365 6073 16269 20068 -4174 4127 2049 5921
7044 5921 -5296 -11675 -22366 -34560 -49198 -33587 -17099 -24331 -31514 -32396 -36536 -59728 -75675
7031 -75675 -58003 -29144 -22714 -21354 -12077 -15060 -24899 -20795 -12811 -23607 -45412 -45516 -57328 -42250
7017 -42250 -34424 -11439 524 5348 -11887 -11509 -8324 -21860 -25015 -19188 -14210 -24937 3926
7004 3926 8451 3128 -1864 1829 12125 -4398 -35547 -57527 -35373 -10852 -8162 -8738 -2034 -16656
6990 -16656 -33073 -38826 -31781 -8436 -6474 -11948 11295 9747 11295 -2719 -21956 -6502 -23764
6977b3764J8285L328N471M099k5346l057K2091J343J5663Q464p137K37R423k1279
6963G821k4376k546j25j9198J5679L731K640m772j1817K2085N783J5360J643k7870
6949a5962N390K1760j6228j6239J3633j2756l0080J7277R290l2014j2321J9036
6937d9214L5021k766O330o15O66K672k7089k5736L430J7834J0409P403K693m485
6923b3447K1926J2580J1023j0729j5510r568O103L2512M596j7586J495J4176j622
6910B5949k1745k9210J2872J7877j3375j9501J5731J8079K0446L826r469k0347
6898A133P542L2067q039k3601n678j0314J6718p710J9967M0498k4301j5651j4591
6885H040j0326k4920J8847M1279K4024j0270j5651L230K5035j2060j5699j3848
$$ plain form
6977 -23764 -5479 -2151 3320 7419 -17927 -20984 1107 2450 18113 26577 19440 19677 29100 7821
6963 7821 -16555 -19101 -19226 -38424 -22745 -19014 -16374 -21146 -32963 -10878 -5095 10265 11908 -15962
6949 -15962 -10572 11188 -5040 -21279 -7646 -20402 -50482 -33205 -23915 -55929 -68250 -49214
6937 -49214 -14193 -16959 -10629 -11244 -10578 -7906 -34995 -60731 -57301 -39467 -29058 -21655 -18962 -23447
6923 -23447 -1521 11059 22082 11353 -4157 -13725 -7622 24890 29486 11900 13395 27571 25949
6910 25949 4204 -25006 -12134 5743 -7632 -27133 -11402 6677 27123 30949 21480 1133
6898 1133 8675 40742 32703 9102 3424 -6890 9828 2118 22085 62583 38282 22631 8040
6885 8040 -2286 -27206 -8359 32920 56944 46674 31023 34253 59288 47228 31529 17681
6873A7681k110k2956l91K3903j457l0014O545J2145j3759O654L06k1119J6334
6860h238K1485j867J0598j3041j0673n155r955J1571O934j4747r423P196p814
6847b3129l459j597M753J9935l182L540j3192J2022J2605J1710k3045K340J0377
6834I678P112j3043k3120J3595L507j0157j9508J2140q030n094J3142J2891K0933
6821A4046O541q440j094J0090j0070j1757O84j3675j1179n326M8950K2084L471
6808D4325o761J7980r133O02K57p552k8607p395N429J1685O725j8688k463n003
6794A401M512J7517k61O985j9498p237l891P077L039j1436J4362o260j1103o51
6780e444j1261l893N679l717J5135j2005Q209l489O261M672j4718J3836J0439
$$ plain form
6873 17681 15571 -7385 -7776 16127 14670 -15344 -8799 3346 -10413 -3759 -3453 -24572 -8238
6860 -8238 13247 11380 21978 8937 -1736 -6891 -16846 -5275 1659 -13088 -22511 -15315 -23129
6847 -23129 -26588 -28185 -23432 -3497 -6679 -3139 -16331 -4309 8296 20006 -3039 -699 9678
6834 9678 16790 3747 -19373 -5778 -2271 -12428 -31936 -19796 -27826 -32920 -19778 -6887 14046
6821 14046 20587 12147 11053 21143 11073 -684 0 -13675 -24854 -30180 18770 40854 44325
6808 44325 37564 55544 46411 47013 47270 39718 11111 3716 9145 20830 27555 8867 6404 1401
6794 1401 5913 23430 23169 30154 10656 3419 -472 6605 9644 -1792 12570 6310 -4793 -5444
6780 -5444 -16705 -20598 -14919 -18636 -3501 -15506 -7297 -10786 -4525 147 -14571 -735 9704
6767I704j7850k66P677J3415o288j6984j9510J2343L1355m720m262j3320Q889
6754A83J7752k4798j842M489K6740J3720j036r238j4745J0884j4654j2841j4813
6741b0199L6098K6783k260k0986k6227N019K5223J18P106q061M277N895r52j2192
6727A9642j1033J6027R334L62n168J8564J073k5607J2908j218J5479L0001r846
6714G0518k5926j6460l1008k1203J9265M0265j3087j7931P768O81j7746l0161
6702c5025P374J0007Q197q588j2436J2179Q008J8803K3826J4652k0631m7164r869
6689c0667J1486P510K1906J9333j1275J696J8808J796j4165M19j4359j125j0019
6676A344o443j2986N89j0194P852J1847k482J5007J043o366r888L5452J0903J257
$$ plain form
6767 9704 -8146 -8412 -735 12680 6392 -10592 -30102 -17759 13596 8876 4614 -8706 183
6754 183 17935 -6863 -8705 -4216 22524 36244 35208 25970 11225 22109 7455 -5386 -20199
6741 -20199 15899 42682 40422 19436 -6791 -1772 23451 23569 30675 22614 26891 32786 31834 19642
6727 19642 8609 24636 33970 34332 29164 47728 48801 23194 36102 34884 50363 80364 70518
6714 70518 44592 28132 -2876 -24079 -4814 35451 22364 4433 12201 12882 -4864 -35025
6702 -35025 -27651 -17644 -9447 -18035 -30471 -18292 -10284 8519 32345 46997 26366 -20798 -30667
6689 -30667 -19181 -11671 10235 29568 18293 19989 38797 40593 26428 26847 12488 11363 1344
6676 1344 -5099 -18085 -17496 -27690 -19838 -7991 -10473 4534 5577 -789 -10677 24775 35678 36935
6662C6935j7568j8811P126R251j5812j5259j2294q23J8434J3555K683j595j006
6649D816K6452J8916j6514j3223j4476O366P118J950K342j4655O845l569j8941
6636f573L2922j6044k0115m223R341J1659R02j294j0560k6130j2862J4041J3724
6623a5212Q947R422m757l990o498J469k1882q403m490p078J7758L0346K383j218
6609c203o893k0097J538J4322J2998j9753N827L1327K8356K3003j4939l3964l1465
6596a2943k4004P503K9571l364R871J4505J7590k2099k5500j734p501J4094k009
6583f020m740J4309j5683r084P378Q541Q15m113R699J3071p811p689K961R925
6569A1559l968j8843k1704Q929K5663J6322J4759j2986k4299J0950r595j8511
$$ plain form
6662 36935 19367 556 7682 16933 1121 -14138 -26432 -27255 -8821 4734 7417 5822 4816
6649 4816 31268 50184 33670 20447 5971 12337 19455 21405 23747 9092 15937 12368 -6573
6636 -6573 26349 10305 -9810 -14033 -4692 6967 7869 6575 -3985 -30115 -42977 -28936 -15212
6623 -15212 -6265 3157 -1600 -5590 -12088 -10619 -32501 -40904 -45394 -52472 -34714 -4368 -1985 -3203
6609 -3203 -10096 -30193 -28655 -14333 -1335 -21088 -15261 16066 44422 67425 52486 18522 -12943
6596 -12943 -36947 -29444 127 -3237 6634 21139 38729 16630 -8870 -10604 -18105 -4011 -6020
6583 -6020 -10760 3549 -12134 -21218 -13840 -5299 -4484 -8597 1102 14173 6362 -1327 1634 11559
6569 11559 7591 -11252 -32956 -24027 1636 17958 32717 19731 -4568 6382 -3213 -21724
6557b1724J2906K3317k7646k0563Q449J3276r413K156j4174k6820Q883J0961J3790
6544b6602J1108J840j4538J4411m53r107j8066P18K7438n662m645j3535o874k0119
6530f4086n686J5671m527M070J1970j0542K4559M177n109j731R24R370l848j8244
6516d3032L0534j3771j8757K6143J1484K7577j3431k0045m516J317J789N045k057
6503a1720J1208o803J2752L3429m065j9379l278l440k944n597r464M718l549J454
6489f678k0231q135M3828K456j5218O364j586J2910j2736k3320l45j142j5253
6476c9086k5878J5811J5348K2750j59P348j7192Q938L510L0877K7262j4215k8183
6463G131j1011M432k411j8902J3820J1860J2655k421O937j8l9564k9097L1146
$$ plain form
6557 -21724 -8818 14499 -13147 -33710 -25261 -11985 -21398 -19242 -33416 -60236 -51353 -40392 -26602
6544 -26602 -15494 -13654 -28192 -13781 -14234 -23341 -41407 -40689 -13251 -18913 -23558 -37093 -43967 -64086
6530 -64086 -69772 -54101 -58628 -54558 -42588 -53130 -28571 -24394 -29503 -31234 -30310 -20940 -24788 -43032
6516 -43032 -12498 -26269 -45026 -18883 -7399 20178 6747 -13298 -17814 -16497 -14708 -9663 -11720
6503 -11720 -512 -7315 5437 38866 34801 15422 12144 8704 5760 163 -9301 -4583 -8132 -6678
6489 -6678 -26909 -35044 8784 11240 -3978 2386 800 13710 974 -22346 -22691 -23833 -39086
6476 -39086 -64964 -49153 -33805 -11055 -11214 -3866 -21058 -12120 -8610 22267 49529 35314 7131
6463 7131 -3880 552 -1859 -20761 -6941 4919 17574 15153 22090 22072 -17492 -46589 -15443
6450a5443K7579J7374j523K091m69j9353j5184n972J2922J6414M993k083K3277
6437D4623j1208p619J1503Q701Q050j1637k8930k9572k4443K07K0779J5323l892
6424h115K541L681K7464q130j9474Q208R132q083J8412k0242j1076J0598j789
6411C127k5393j883P840Q372k382r421J0879j052J9487J8568k8346l0654J178
6398b9680N693J3693j8577j347r710k426p595j210r552m64J4400K7959r696Q842
6384a9670O846P629R331k0195p118K4178j1610k087K2323p926k9264O437L3174
6371A2048R930r118j909k1047r73K4873N982M341L234Q470k1698j7924J8321j6152
6357a622j8599R637R367j8401O744L932M877K281K0933J4140J129O384j1405j5495
$$ plain form
6450 -15443 12136 29510 27987 30078 29609 10256 -4928 -10900 2022 18436 23429 21346 44623
6437 44623 33415 25796 37299 46000 54050 42413 13483 -16089 -40532 -40325 -19546 -4223 -8115
6424 -8115 -5574 -1893 25571 17441 -2033 6175 15307 7224 25636 5394 -5682 4916 3127
6411 3127 -22266 -24149 -16309 -7937 -10319 -19740 -8861 -9913 9574 28142 -204 -30858 -29680
6398 -29680 -23987 -10294 -28871 -30218 -39928 -42354 -49949 -51159 -60711 -61175 -46775 -18816 -28512 -19670
6384 -19670 -12824 -5195 4136 -16059 -23177 1001 -10609 -12696 9627 1701 -27563 -21126 12048
6371 12048 21978 12860 10951 -10096 -11069 13804 19786 24127 27361 35831 14133 -3791 14530 -1622
6357 -1622 -20221 -10584 -1217 -19618 -12874 -8942 -4065 -1784 19149 33289 34418 40802 29397 13902
6343A3902k2289K033j8751J3120Q575o264j1616O121L8798l772j4907k310J195
6330C835O773Q213O336k53k469P754q017l956L998n057k708m185n285O63p337
6315a695J7668Q315j001j9063o712J2018J3547J344J3843j4020P020q5J53K993
6301C4325j2374p9M578j4116j7556q176p297J0251N34p441m703j407J3553K3761
6287A3853K0485k995k0685n4920j6227J8291K6329N344J8342J289j460K7331M578
6274C9555q932K179j9597j6870j41m05r785J5369j5928l2129J8009N535k65J430
6260b1975N77O736m557J7890K405J3829j3079n43J7092j4660Q93K7039M560L617
6246C9824L62k7757k432K78j2709o205K9720o33q406j5740r634j4459R059J3690
$$ plain form
6343 13902 -8387 -6354 -25105 -11985 -3410 -9674 -21290 -15169 23629 19857 4950 2640 3835
6330 3835 10608 18821 25157 24904 22435 30189 22172 18216 22214 17157 14449 10264 4979 5642 -1695
6315 -1695 15973 24288 23287 4224 -2488 9530 23077 24421 38264 24244 31264 31179 31332 34325
6301 34325 21951 21872 26450 12334 -5222 -13398 -20695 -10444 -9910 -17351 -22054 -23461 -9908 13853
6287 13853 34338 31343 10658 -44262 -60489 -42198 -15869 -10525 7817 9106 7646 34977 39555
6274 39555 30623 32802 13205 -3665 -3806 -4211 -13996 1373 -14555 -46684 -28675 -23140 -23405 -21975
6260 -21975 -21398 -14662 -19219 -1329 1076 14905 1826 1283 18375 3715 4608 31647 36207 39824
6246 39824 40186 12429 9997 10275 -2434 -8639 21081 20448 12042 -3698 -13332 -27791 -18732 -5042
6232e042p646j496q673M254r119M576l10j3786j2717J1942K1134J0657j7553J894
6218b1885r485K0719J8337n839j2218J7116J8746o974j0786J629k2978j370J1734
6205c254j3372j3244O471j204j4560J0561J0279J1382J0140k4047P77J4907k8879
6192c4043R029m532K346M906J7297r234j1314j0277N500J6666M108l97k3985k625
6178c6555K29J2633K9345j286O886J4298r079k6576k2304K8188J2725j2808r840
6165a4144j1540P90J0279j0128N217j2392P806K0807k9J3245J2743j0262M209
6152A6601j2365k4441j0549K3383J8045j3979Q068K952o91j3279J2284J556r317
6139a732L970j973j1404N578n902J1899Q585j380j0804k2987P578K847r460j7947
$$ plain form
6232 -5042 -12688 -14184 -22857 -18603 -27722 -23146 -23456 -37242 -49959 -38017 -16883 -6226 -23779 -21885
6218 -21885 -31370 -10651 7686 1847 -10371 6745 25491 18517 7731 9360 -13618 -14988 -3254
6205 -3254 -16626 -29870 -23399 -24603 -39163 -28602 -18323 -6941 3199 -20848 -20071 -5164 -34043
6192 -34043 -25014 -29546 -27200 -22294 -4997 -14231 -25545 -35822 -30322 -13656 -9548 -9945 -33930 -36555
6178 -36555 -36326 -23693 5652 4366 11252 25550 16471 -10105 -32409 -4221 8504 -4304 -14144
6165 -14144 -25684 -24894 -14615 -24743 -19526 -31918 -24112 -3305 -3334 9911 22654 12392 16601
6152 16601 4236 -20205 -30754 -7371 10674 -3305 4763 7715 7024 -6255 6029 7585 -1732
6139 -1732 2238 265 -11139 -5561 -11463 436 9021 7641 -3163 -26150 -18572 -15725 -25185 -43132
6125d3132k118K0607J8303J1221N250Q818N512m1828q00J6208J632j105k4464
6112b5896r852J2286L3694K1915p371J843l0829N96J4367L952j7696j1867r712
6099b4570j8800l328J5273K8232n70O708k4435m429M359j2134l1877P046K5260
6086c3265L119n658L926M510n082K1131L93L014r231j936j015l164k717o439K4521
6071g893J0576j0255j5355J7726K9676J8560j8234k2982L034J8445P277j6654
6059A3921J1568r126n381O267m451l0348q556J0050k5109J2508L0573J4489j0809
6046E596k6704N359j313P682N514K240L118o976q714j189K678K2433j2204k2950
6032b5430j4266M424K0771j7700q591K5725J9836k810o175J433j4234k8662O249
$$ plain form
6125 -43132 -45250 -24643 -6340 4881 10131 18949 24461 -17367 -18167 -1959 -327 -1432 -25896
6112 -25896 -35748 -23462 10232 32147 24776 26619 -4210 -3614 10753 14705 -2991 -14858 -24570
6099 -24570 -43370 -46698 -31425 -3193 -3763 2945 -21490 -25919 -21560 -33694 -65571 -58525 -33265
6086 -33265 -30146 -35804 -31878 -27368 -32450 -11319 -10926 -7912 -17143 -19079 -20094 -23258 -25975 -32414 -7893
6071 -7893 2683 -7572 -22927 -5201 24475 43035 24801 1819 4853 23298 30575 13921
6059 13921 25489 16363 10982 17249 12798 -17550 -26106 -16056 -41165 -28657 1916 16405 5596
6046 5596 -21108 -15749 -17062 -9380 -3866 -1626 1492 -5484 -14198 -15387 -12709 9724 -2480 -25430
6032 -25430 -39696 -35272 -14501 -32201 -40792 -15067 4769 1959 -4216 -2783 -17017 -45679 -39430
6019c9430K6918J6562j5221l283k1942j5925J1612N2883J5784k2626j9196R843
6007d021J880O832l192l3100J762l271k4432O005J435o441J3960J7472j847K1535
5993e423N938j873R150J198j8579j8217L121l848M028k426K6600J4673k6142j889
5979a3689R48N155m731m029l1218k397N1248K5027p323j1701k6181j341N560J0383
5965d289m760J2445k1181M659J1794K5910j1743m0254j7668r94J1210N068J2764
5952a7039j0739j7636n045K7687J5634m863j9998R536K9739L1741j1639l0503
5940c125j7885P694l53r078M017J4511K10j8863j3977J5454n45l762J5854J4687
5926D839O279m426j7474k534K015q067J5715K5198j4844j2904K0730J1348L351
$$ plain form
6019 -39430 -12512 4050 -11171 -14454 -36396 -52321 -40709 12174 27958 5332 -13864 -4021
6007 -4021 -2141 4691 1499 -31601 -29839 -33110 -57542 -51537 -50102 -56543 -42583 -25111 -26958 -5423
5993 -5423 515 -1358 7792 8990 -9589 -27806 -24685 -28533 -24505 -26931 -331 14342 -11800 -13689
5979 -13689 -12741 -7586 -12317 -16346 -47564 -49961 1287 26314 18991 7290 -18891 -20232 -14672 -4289
5965 -4289 -9049 3396 -17785 -13126 -1332 24578 12835 -27419 -45087 -46081 -34871 -29803 -17039
5952 -17039 -27778 -45414 -50459 -22772 -7138 -12001 -31999 -22463 7276 39017 27378 -3125
5940 -3125 -21010 -13316 -13669 -22747 -18730 -4219 -4009 -22872 -36849 -21395 -21940 -25702 -9848 4839
5926 4839 11118 6692 -10782 -13316 -11301 -19368 -3653 21545 6701 -6203 14527 25875 29226
5913B9226j5788L887Q693l733j8401r400l492j9394M864J8282K4194N611l4069
5900i520j8961P225r97m298K804J4094K5929K0058K772k0670l5034j6876R629
5887b3845J9664N441j690p896k7005n915K192K347J0016j1896L202J6863L216
5874a5306J7543k575j9591J3682J1332M915N002Q031N385q674k7869J14P812j8351
5860a8550Q403m327J8723M171j9361P124J5545m635j8056J3947N950m330Q735
5847A3339j5549J1609L0831J0470j8808r142j3585r477k3678l0663J5241o614
5835d6026K5092L7323J9923L524j3843l2082P428J236J4141j2314j4279J6263
5823F386j0690P519n424k8606j4855K0326J7764J4931j1570j3610K546P793l981
$$ plain form
5913 29226 13438 17325 26018 22285 3884 -5516 -9008 -28402 -23538 -5256 18938 24549 -9520
5900 -9520 -28481 -21256 -22253 -26551 -23747 -9653 16276 36334 39106 18436 -16598 -33474 -23845
5887 -23845 -4181 1260 -430 -8326 -35331 -41246 -39054 -36707 -26691 -38587 -35385 -18522 -15306
5874 -15306 2237 -338 -19929 -6247 5085 10000 15002 23033 28418 19744 -8125 -8011 -199 -18550
5860 -18550 -10147 -14474 4249 8420 -10941 -3817 11728 7093 -10963 2984 8934 4604 13339
5847 13339 -2210 9399 40230 50700 31892 22750 9165 -312 -23990 -54653 -39412 -46026
5835 -46026 -20934 16389 36312 39836 25993 -6089 1339 2575 16716 4402 -9877 6386
5823 6386 -4304 3215 -2209 -30815 -45670 -25344 -7580 7351 -4219 -17829 -15283 -7490 -11471
5810a1471R89K945q449k435l041j2764m814J3290K2298J1522R255Q397j0005j4451
5796A266J2408J0954r94J3548k2081k3884K3210J0477r497k507p613j5691p966
5783a8370J0014K3329k1105k6428J0317p164m049J3679n81M710Q865J7451J8852
5770B9520Q457k7031j8669k1009l952J5034K1088n582J85L762M881n856j7774
5757a6946J3462J5433K3968k7111j556m927k0480L1987J7351q271j8096k4345
5745a9531k1800P562P33l156J415J3788K391J2286r582j9140n815J2890J6021
5732a1938k6333j6627M2552N105M741K1067q504k3625j0563P37J0353Q1R882q715
5718a1787j2929J0036j8803j6212l801k80Q278K8047K8267j1475J663J1988m855
$$ plain form
5810 -11471 -10482 -7537 -15986 -18421 -21462 -34226 -39040 -25750 -3452 8070 17325 25722 15717 1266
5796 1266 13674 24628 23634 37182 15101 -8783 14427 24904 15407 12900 5287 -10404 -18370
5783 -18370 -8356 14973 -6132 -32560 -22243 -29407 -33456 -19777 -20358 -15648 -6783 10668 29520
5770 29520 37977 10946 -7723 -28732 -32684 -17650 3438 -2144 -1959 1803 6684 828 -16946
5757 -16946 -3484 11949 35917 8806 7250 2323 -18157 13830 31181 22910 4814 -19531
5745 -19531 -41331 -33769 -33036 -36192 -34777 -20989 -18598 -6312 -15894 -35034 -40849 -27959 -11938
5732 -11938 -38271 -54898 -12346 -7241 -2500 18567 10063 -13562 -24125 -23388 -13035 -12954 -3072 -11787
5718 -11787 -24716 -14680 -33483 -49695 -53496 -53776 -45498 -17451 10816 -659 1004 12992 8137
5705H137K412k2268N034j0584R899o394m5458q257L6213Q525K308k0437j1621
5692e2491J1015J0909P814J4290Q834P037j9399q068j1271K067K9212N498N673
5679A1120J62M212o526j0837j7822P85k095K4974m992l227q186k5147K2330K2854
5665G605k737l78p790o690j76K3337n210Q87P694j1762j0844r303R36n149J9802
5650B22j533q665M672J1849M244j4103j6291p710m553J3377k3910k98K2659r183
5636b9223p586J9699o545j8785J2853J6613J2291j2921l807j3533K257P362k580
5623b3905q376J1591N861J2524q04n223O425k4918k182j543r38o61L560J6114
5609a2475Q044q661O178J6309j1494o408K8080M244r04j3742J5612K430j7554
$$ plain form
5705 8137 10549 -11719 -6685 -17269 -7370 -13764 -59222 -67479 -31266 -22741 -20433 -40870 -52491
5692 -52491 -41476 -30567 -22753 -8463 371 7408 -11991 -20059 -31330 -29263 -51 5447 11120
5679 11120 11282 15494 8968 -1869 -19691 -18906 -21001 3973 -1019 -4246 -12432 -37579 -15249 7605
5665 7605 4868 4490 -3300 -9990 -10166 13171 7961 8848 16542 4780 -6064 -15367 -14431 -19580 222
5650 222 -1311 -9976 -5304 6545 10789 -3314 -19605 -27315 -31868 -18491 -42401 -42699 -20040 -29223
5636 -29223 -36809 -17110 -23655 -42440 -29587 -12974 -683 -13604 -17411 -30944 -28687 -21325 -23905
5623 -23905 -32281 -20690 -14829 -2305 -3109 -8332 -1907 -26825 -29007 -30550 -31488 -32149 -28589 -12475
5609 -12475 -4431 -13092 -6914 9395 -2099 -8507 19573 23817 22913 9171 24783 27213 9659
5596I659j3017O596p922j0445O446k818J2537j1602j473J4722l783O79j898n354
5582g673k568Q39J3616K1101k2208l608J4674o209k455P792j7006j552J0267M663
5568I673K873N042j0417k2135o173j2234j388r957J987K6027J4678J2814J1861
5555B2651o767l3306p543K3909K4347k316j5254M210j8004k217J0734R173L428
5542A3045N090r509j8230r918J2178J6279j1541M603K027o978j4390J022P109
5529i213n637K8452m123o646m626M828l105j7465j2406r901O440K2800P955n458
5515h105j9082N435Q852j1181j7076K1429J0522j4844q94Q280J1689O129k8900
5502b7746l85R739k0316k0722l426Q10M582P704K0013J1109o070j6654j3149j3181
$$ plain form
5596 9659 -3358 3238 -4684 -15129 -8683 -11501 1036 -10566 -12039 2683 -1100 -421 -2319 -7673
5582 -7673 -10241 -9402 4214 25315 3107 -501 14173 7964 5509 13301 -3705 -5257 5010 9673
5568 9673 12546 17588 7171 -14964 -21137 -33371 -34759 -44716 -42729 -16702 -2024 10790 22651
5555 22651 15884 -17422 -24965 -1056 23291 20975 5721 9931 -8073 -10290 444 9617 13045
5542 13045 18135 8626 -9604 -19522 -7344 8935 -2606 1997 4024 -2954 -17344 -16322 -9213
5529 -9213 -14850 13602 9479 2833 -1793 3035 -70 -17535 -29941 -39842 -33402 -10602 -2647 -8105
5515 -8105 -27187 -21752 -12900 -24081 -41157 -19728 -9206 -24050 -24944 -16664 -4975 1154 -27746
5502 -27746 -28131 -18392 -38708 -59430 -62856 -62046 -57464 -49760 -29747 -18638 -24708 -41362 -54511 -67692
5488f7692J1857L8632M0056l1107q051j978j597K4906p004J88K0181J0164k4027
5475D528K66r827j9199j1707L8827J3230j7477J1637K3233L838l771k324l0146
5462A108j0461k1402m687K4137q704j2743J7173K5734R611n528k7870k929O047
5449a0514k4186j9483j1046M772J2629R497M198N106N16P830K6225Q292l2803
5436a8967J1604K308P908m90j7058k9079o571L408J1704J4499L891J2032O345
5423A534L335j1073p085l2194l700L853K2368K5174j1617j900o458j5296q053
5410d1112L63j0793o025m177m457J2644l060M744J2203L372J3442L5345j3653
5397a164j4612j0007K1491R551J7382J1360j4009j8946o834J0113j453Q492J7037
$$ plain form
5488 -67692 -55835 -17203 22853 -8254 -16305 -18283 -19880 5026 -1978 -1790 18391 28555 4528
5475 4528 4794 -5033 -24232 -35939 2888 16118 -1359 10278 33511 37349 33578 31254 1108
5462 1108 -9353 -30755 -35442 -11305 -20009 -32752 -15579 10155 19766 14238 -13632 -16561 -10514
5449 -10514 -34700 -54183 -65229 -60457 -47828 -38331 -34133 -29027 -28511 -20681 5544 13836 -18967
5436 -18967 -7363 -5055 2853 2363 -14695 -43774 -50345 -46937 -35233 -20734 -16843 -4811 1534
5423 1534 4869 -6204 -13289 -45483 -49183 -45330 -22962 2212 -9405 -11305 -17763 -33059 -41112
5410 -41112 -40749 -51542 -57567 -61744 -66201 -53557 -56617 -51873 -39670 -36298 -22856 12489 -1164
5397 -1164 -15776 -25783 -4292 5259 22641 34001 19992 1046 -5788 4325 2872 11364 28401
5384B8401n228j9714M291J726q937R795l948j9211j4547m288k7733j2053K5415
5371d6031n963L836R915J7875k998j6435j001K0747O537O175J476J6690j0717
5358A06M767O109k7730j6295m902J0619J2028J4038R323J1189p099j0677j0563
5345i087N201M850j0895O500j3971r287j0769J0490J1434K9995K9148j8549j727
5332B3333j6019R62Q519j8k093j9457j5995J135O088j8631k127L5976J1604L29
5318A3606L635p095j6896n805J0718j0597r551O687j7603O408J3399l615l164
5305a9873o097J0436K4246l075j749m926j0821q701o344j5932N745K7298r621
5292a9414o399K5037J8672m576o634o573j0162j337q8K0403Q312k4553J4564M835
$$ plain form
5384 28401 23173 3459 7750 9476 539 10334 6386 -12825 -27372 -31660 -59393 -71446 -46031
5371 -46031 -51994 -48158 -38243 -20368 -23366 -39801 -40802 -20055 -13518 -7343 -5867 10823 106
5358 106 4873 10982 -16748 -33043 -37945 -27326 -15298 -1260 8063 19252 12153 1476 -9087
5345 -9087 -3886 964 -9931 -3431 -17402 -26689 -37458 -26968 -15534 14461 43609 25060 23333
5332 23333 7314 8276 16795 16777 14684 -4773 -20768 -19633 -13545 -32176 -34303 1673 13277 13606
5318 13606 17241 10146 -6750 -12555 -1837 -12434 -21985 -15298 -32901 -26493 -13094 -16709 -19873
5305 -19873 -25970 -15534 8712 5637 3888 -1038 -11859 -20560 -26904 -42836 -37091 -9793 -19414
5292 -19414 -25813 -776 17896 13320 6686 113 -10049 -11386 -11474 8929 17241 -7312 7252 12087
5278A2087j8115j1849j3301M526M460p395j2481j8798J5115K7174P302n972k0607
5265c7854J3041K3355N660r87J3685J7455j1552o583j4441k2732j0103J0313o274
5252b7017R810M477J3417r54J2746J2457J6521j1044m958j0649k3953n763M038
5239a0872r184j1908j0725K7233p126q311l1644K683K1196L8049L466j414J1169
5226A2612p092k3547O663L6j0401M015j8410l790J4983j284J3392N629j0165j6532
5212c3891m578L440J6340K560k43K2927p483K0776P916l0716j8947R83N018k536
5198a8434o923N37J2105Q385j144J3254k9131m078J2158q485K9433J8982o102
5185B0557m72L687m141L380j2324o961Q008K856n450j5926n556j8669m953J1518
$$ plain form
5278 12087 -6028 -17877 -31178 -26652 -22192 -29587 -42068 -60866 -45751 -18577 -11275 -17247 -37854
5265 -37854 -24813 -1458 4202 3215 16900 34355 22803 16220 1779 -20953 -31056 -20743 -27017
5252 -27017 -17207 -12730 687 -267 12479 24936 41457 30413 25455 14806 -9147 -14910 -10872
5239 -10872 -20056 -31964 -42689 -15456 -22582 -30893 -62537 -59854 -38658 -609 2857 1443 12612
5226 12612 5520 -18027 -11364 -11328 -21729 -17714 -36124 -39914 -24931 -26215 -12823 -7194 -17359 -33891
5212 -33891 -38469 -35029 -18689 -16129 -16372 6555 -928 19848 27764 -2952 -21899 -20916 -15898 -18434
5198 -18434 -25357 -24820 -12715 -4330 -5474 7780 -21351 -25429 -13271 -21756 7677 26659 20557
5185 20557 20085 23772 19631 23011 10687 3726 11734 14590 9140 -6786 -12342 -31011 -35964 -24446
5171b4446J3647j9426j5151L96J0243P990O017K6592N730j5687j7466k5150o933
5158e3644P610P227j1995q161J8642M6r048m343K0504J6978k426k1863R643J0878
5144a9952n122o252j5066j381L3762K7444J6132q448J3964J0474j8033j7016j5585
5131e079l041o124m97P841Q358j1863p55j0326K3836J9138k278r75j8863k1509
5117b2137J0294J9553N141k3286N449j0217K349J632J2729N536J9713J288k2242
5104E802j302j0602P775j3255j4322k743J0209j595K525L2915j3243j6204k6231
5091d0271R302N531J7766P218k808j146R427l3277j991J1380J9517L6600l070
5078C4178J950l6820j2389K718K7052J9877J0702j8711k6646j1269j6829j9797
$$ plain form
5171 -24446 -10799 -30225 -45376 -44980 -34737 -26747 -20730 5862 11592 -4095 -21561 -46711 -53644
5158 -53644 -46034 -38807 -50802 -58963 -40321 -40275 -49323 -53666 -33162 -16184 -18610 -40473 -30830 -19952
5144 -19952 -25074 -31326 -46392 -47773 -14011 13433 29565 21117 35081 45555 27522 10506 -5079
5131 -5079 -8120 -14244 -14741 -6900 1458 -10405 -11160 -21486 2350 21488 19210 18235 -628 -22137
5117 -22137 -11843 7710 12851 -10435 -4986 -15203 -12854 -11222 1507 7043 26756 28044 5802
5104 5802 4500 -6102 1673 -11582 -25904 -28647 -18438 -20033 -17508 15407 2164 -14040 -40271
5091 -40271 -30969 -25438 -7672 -454 -3262 -4408 5019 -28258 -30249 -18869 648 37248 34178
5078 34178 36128 -692 -13081 -10363 16689 36566 47268 28557 1911 -9358 -26187 -45984
5066d5984o865J7994J4828q43J9615R731k2940k6407M555o41J170K1657K7855
5053A3725j5369o651J9174O182k3528K3986Q499k4636j5979J96o101J238j6943
5040c6207p791K282L040M735J7101n376J9740L0277j1811l5528J1692J5134R88
5027H276M774j4168j7013K323J1817q246J321J5513j0277j1005k459j5922o256
5014d1322L504J9989R78j6318L5609p45j4615j7755m298K2190J8522j4995j3747
5001b3003R615K6877R788m1109Q412K6774r54j7153j996l815j9615k0802J8709
4988b8272K0741j2819j1671k224J5215K2032q092j0026P18K2169n110j0817J2859
4975D703K6407r046j2184J991m390J5422l018j0836J5440j3632k0169l1124k134
$$ plain form
5066 -45984 -52849 -34855 -20027 -20870 -1255 8476 -14464 -40871 -36316 -36957 -35787 -14130 13725
5053 13725 -1644 -8295 10879 17061 -6467 17519 26018 1382 -14597 -14401 -20502 -19264 -36207
5040 -36207 -43998 -41716 -38676 -33941 -16840 -22216 -2476 27801 15990 -19538 -7846 7288 8276
5027 8276 13050 -1118 -18131 -15808 -3991 -12237 -10916 4597 -5680 -16685 -19144 -35066 -41322
5014 -41322 -37818 -17829 -16851 -33169 2440 1695 -12920 -30675 -34973 -12783 5739 -9256 -23003
5001 -23003 -13388 13489 23277 -17832 -9420 17354 16400 -753 -2749 -6564 -26179 -46981 -28272
4988 -28272 -7531 -20350 -32021 -34245 -19030 3002 -5090 -15116 -14398 7771 2661 -8156 4703
4975 4703 31110 22064 9880 11871 7481 22903 19885 9049 24489 10857 -9312 -40436 -42570
4962d2570j2689J3409L2631N520j4789k543P656L290k042J7424M632j1357m7029
4949d8457k6136K0238L6881K5070q416j2877R894J6298J5545R002l336j2206K732
4936B4232K019N412j2767l128k8140m6420N843K7093J2586J8521J6974Q382p912
4923B2695R199O341q176j6649L968j3564l5525o87K2490K3864K1756J560p387
4910B9885j5118j3485J2464j1328j8254j5808K557K0135k1287Q897K7804j9768
4898a3306q224J1794n767J6814J0096r855l529N710R091L513j3891k1819q308
4885b7681J1643l265j242J6121L0753j422j1196p820Q116J8338r688j8260k30
4872D167J4086n000k2874L385J8222O745J201j3837J2422j0547j0619j9794r685
$$ plain form
4962 -42570 -55259 -41850 -9219 -3699 -18488 -21031 -13375 -10085 -12127 5297 9929 -1428 -48457
4949 -48457 -74593 -54355 -17474 7596 -820 -13697 -3803 12495 28040 37042 33706 21500 24232
4936 24232 26251 31663 18896 15768 -12372 -58792 -52949 -25856 -13270 5251 22225 30607 22695
4923 22695 31894 38235 30059 13410 17378 3814 -31711 -32398 -9908 13956 35712 37272 29885
4910 29885 14767 1282 13746 2418 -15836 -31644 -29087 -8952 -30239 -21342 6462 -13306
4898 -13306 -21530 -9736 -15503 1311 11407 1552 -1977 3733 12824 16337 2446 -19373 -27681
4885 -27681 -16038 -19303 -20545 -4424 26329 24907 13711 5891 14007 32345 22657 4397 4167
4872 4167 18253 13253 -9621 -6236 11986 18731 19932 6095 18517 7970 -2649 -22443 -32128
4859c2128J2698Q240j312n872j5224l338J7611R998K1205K143j3293j0775P513
4846b534J8096J5281J3435N19J1200m564n0861l4643j5871j106J4521k2034J1903
4833d6658O900K656J2595J3042P530O009r409j4436O505L660l508j0420l426K689
4819b6271K4617j8229q654J9665J09J52l276J74P072J7225K370Q432P514j3292
4805A7608m206K6106Q560j2168k2459k0138m777J4597K260J180k0081k4019j6371
4792e3908o114J51L6349J4199j2367K751r45k757j2917n577Q85J4823K3695M831
4778C099q276K1464j1160J019j9376m822R564q460J941J8134l679r940j955J5932
4764C485k234k0914j3218R035J9267J8265l1972J576J5370J4595L128j4264k3529
$$ plain form
4859 -32128 -19430 -11190 -12502 -18374 -33598 -36936 -19325 -9327 11878 14021 728 -10047 -2534
4846 -2534 15562 30843 44278 44797 55997 51433 572 -34071 -49942 -51048 -36527 -58561 -46658
4833 -46658 -39758 -37102 -24507 -11465 -3935 2074 -7335 -21771 -15266 -11606 -15114 -25534 -28960 -26271
4819 -26271 -1654 -19883 -28537 -8872 -8763 -8611 -11887 -11713 -4641 12584 14954 23386 30900 17608
4805 17608 13402 39508 48068 35900 13441 -6697 -11474 3123 5383 6563 -13518 -37537 -53908
4792 -53908 -60022 -59871 -23522 -9323 -21690 -18939 -19884 -22641 -35558 -41135 -40250 -25427 -1732 3099
4778 3099 -5177 16287 5127 6146 -13230 -18052 -8488 -16948 -15007 3127 -552 -10492 -12447 3485
4764 3485 1251 -19663 -32881 -23846 -4579 13686 -18286 -16710 -1340 13255 16383 2119 -21410
4751b1410K5888j353J1754J7480k1546j7814K5196K0626j5420Q990L36k8346l1302
4738b6921j4123m599K7370J3016r367r577J4262L4612k279P598j0438j8962m866
4725d274M741r948J987M0034j8139k1990Q643k238k3939p232J3985J2042K3301
4712A6973K8515j1450k8413l659J740q463l813m214j4192m084K3994K8796P097
4699B8827j9481K854K3039J3458k7531k5844j6915J0475J4283J0692K848l2454
4687a5749k4340K9457L1513N413P247j3599j7217o49K735M1K531n638M552J702
4673G999o696J2949L937o325j6132J585M727j4941o296Q94J1524k3359M815J0179
4659a5140J8208M804m171J3591J4974j9785m605M221o188j2368k7183j6509J3070
$$ plain form
4751 -21410 4478 3125 14879 32359 10813 -7001 18195 38821 23401 32391 32727 4381 -26921
4738 -26921 -41044 -45643 -18273 -5257 -14624 -24201 -9939 24673 22394 29992 19554 592 -4274
4725 -4274 467 -9481 -7494 32540 14401 -7589 1054 -1184 -25123 -32355 -18370 -6328 16973
4712 16973 45488 34038 5625 1966 3706 -4757 -8570 -12784 -26976 -31060 -7066 21730 28827
4699 28827 9346 12200 35239 48697 21166 -4678 -21593 -11118 3165 13857 16705 -15749
4687 -15749 -40089 -10632 20881 26294 33541 19942 2725 2076 4811 4852 7383 1745 6297 7999
4673 7999 1303 14252 18189 11864 -4268 -2683 2044 -12897 -19193 -18299 -6775 -30134 -25319 -15140
4659 -15140 3068 7872 3701 17292 32266 12481 7876 12097 5909 -6459 -33642 -50151 -37081
4646c7081J636K0416J6012k7065q816q054L9J8948k034R148O284k9263J4355K3650
4632a825k0596k3291J0107k352L248J5455N600k6356j3660J8993J603j7861K145
4619d8790K0355K2382Q441R066q260j1544K8427j7563p85k201J348M804L337j6632
4605g615J6092K8984J236j9898l5120L081p177Q088M977n900J5736J2785k4314
4592i045k6283j1454L3592K2965N571j1256j0799K484J7818P163Q628l3533j0488
4579a4637n571K575R093M232J0815J254K68n480k2149q705K5136J7483p269k2776
4565a5731j8223l332K2972N652o399j223o530j4014o693r336J3474r226q047M211
4551e2445m900m709J3596J9402M896l895l420R951Q39M739J1422L2797J6427r654
$$ plain form
4646 -37081 -35445 -15029 983 -26082 -34898 -42952 -42913 -23965 -25999 -16851 -10567 -39830 -25475 -1825
4632 -1825 -22421 -45712 -35605 -37957 -34709 -19254 -13654 -40010 -53670 -34677 -33074 -50935 -48790
4619 -48790 -28435 -6053 2388 11454 3194 -8350 20077 2514 1729 -472 876 5680 9017 -7615
4605 -7615 8477 37461 38697 18799 -16321 -13240 -20417 -12329 -7352 -13252 2484 15269 -9045
4592 -9045 -35328 -46782 -13190 9775 15346 4090 -6709 -4225 13593 20756 29384 -4149 -14637
4579 -14637 -20208 -17633 -8540 -4308 6507 7761 8029 2549 -19600 -28305 -3169 14314 7045 -15731
4565 -15731 -33954 -37286 -14314 -8662 -15061 -16284 -22814 -36828 -43521 -52857 -39383 -48609 -56656 -52445
4551 -52445 -57345 -62054 -48458 -29056 -24160 -28055 -31475 -21524 -20685 -15946 -4524 28273 44700 35046
4537C5046Q576j396l5684n161N054j6570o750N957K5274K6071n344k2870k5449
4524a3246q678J2977p132j0045O411p032J0856n834k700o458J2573n854J5092
4511i070K3910k856k2798j5776J2472p014m741K3723K9191o484O040j8873J5553
4498B3277r58l7099k692n168n997j441O440k4173k530K9151L6370K245R75j2497
4484E903P811L76k929j0985K5640j6546j9539K632M206J0836k1480j5131K5037
4471d169J0920m471k2148r448J7817K299j1791N686J7627n566o095k564M389m151
4457a1665N134J3421k217L026j9305N543R173o547o235R734J7133r006l854K396
4443F731J580P718P487R992j7998k5422k315q067k1434M113J8701J6314O421j4917
$$ plain form
4537 35046 43622 42226 6542 1381 6435 -10135 -16885 -10928 14346 40417 35073 12203 -13246
4524 -13246 -21924 -8947 -16079 -26124 -19713 -26745 -15889 -21723 -24423 -30881 -18308 -24162 -9070
4511 -9070 14840 11984 -10814 -26590 -14118 -21132 -25873 -2150 27041 20557 26597 7724 23277
4498 23277 22319 -14780 -17472 -22640 -28637 -30078 -23638 -47811 -50341 -21190 15180 17425 18400 5903
4484 5903 13714 14090 11161 176 25816 9270 -10269 -7637 -3431 7405 -14075 -29206 -4169
4471 -4169 6751 2280 -19868 -29316 -11499 -9200 -20991 -15305 2322 -3244 -9339 -11903 -7514 -11665
4457 -11665 -6531 6890 4673 7699 -11606 -6063 3110 -3437 -9672 62 17195 8189 4335 6731
4443 6731 8311 16029 23516 33508 15510 -9912 -12227 -20294 -41728 -37615 -18914 -2600 3821 -11096
4429a1096l471N355J123J4051P569R564j7029k2075M203k989j9880j6990J4024
4416c7641J8812J9761J53m280j5677j8666N791j6651M240K2076L725N93N3652
4403C5888Q83j6497J0462j7730j7770j0485J2258k617m620J7179J7576k0598j8115
4390a4186J180L7253p379j5212J3080M207L028k0013k6580l742j5463j8169K1006
$$ plain form
4429 -11096 -14567 -9212 -8089 5962 13531 23095 6066 -16009 -11806 -14795 -34675 -51665 -37641
4416 -37641 -18829 932 1085 -3195 -18872 -37538 -31747 -48398 -44158 -22082 -18357 -17764 35888
4403 35888 36771 20274 30736 13006 -4764 -15249 -2991 -5608 -10228 6951 24527 3929 -14186
4390 -14186 -13006 24247 16868 1656 14736 18943 21971 1958 -24622 -28364 -43827 -61996 -40990
$$ [...]
##END NTUPLES=NMR SPECTRUM
##END=
