##TITLE=Analysis number 327909
Compound Code cc 58306
Book Reference 467/142
Project Code adrs
Chemist Name benw
##JCAMPDX= 6.0         $$ Bruker NMR JCAMP-DX V2.0
##DATA TYPE= NMR SPECTRUM
##DATA CLASS= NTUPLES
##ORIGIN= Bruker BioSpin GmbH
##OWNER= nmr
$$ XWIN-NMR		Version 3.5
$$ Tue Apr 17 11:24:11 2007 GMT Daylight Time (UT+1h)  MAYBRIDGE\nmr@NMR_250MHZ
##.OBSERVE FREQUENCY= 250.131544655141
##.OBSERVE NUCLEUS= ^1H
##.ACQUISITION MODE= SIMULTANEOUS (DQD)
##.ACQUISITION SCHEME= undefined
##.AVERAGES= 16
##.DIGITISER RES= 18
##SPECTROMETER/DATA SYSTEM= dpx250
##.PULSE SEQUENCE= zg30
##.SOLVENT NAME= CDCl3
##.SHIFT REFERENCE= (INTERNAL, CDCl3, 0, 16.522)
##AUDIT TRAIL= $$ (NUMBER, WHEN, WHO, WHERE, WHAT)
$$ ##TITLE= Audit trail, XWIN-NMR		Version 3.5
$$ ##JCAMPDX= 5.01
$$ ##ORIGIN= Bruker BioSpin GmbH
$$ ##OWNER= nmr
$$ C:\u/data/dgb/nmr/ADRS/1600/pdata/1/auditp.txt
$$ ##AUDIT TRAIL=  $$ (NUMBER, WHEN, WHO, WHERE, WHAT)
(   1,<2007-04-17 11:23:47.35 +100>,<MAYBRIDGE\nmr>,<NMR_250MHZ>,
      <created by zg, POWCHK disabled, PULCHK disabled
       configuration hash MD5:
       49 4B E0 1D 92 C2 6B 37 9F E6 65 BC 52 41 86 1D
       data hash MD5: 64K
       11 48 95 55 07 FE 26 0C 24 FE 51 56 CC 8D A1 A6>)
(   2,<2007-04-17 11:24:00.13 +100>,<MAYBRIDGE\nmr>,<NMR_250MHZ>,
      <Start of raw data processing
       ef LB = 0.3 FT_mod = 6 PKNL = 1 SI = 32K 
       data hash MD5: 32K
       BC 5D D4 7B 74 B3 4A 58 E1 EC 6D 35 78 92 D8 85>)
(   3,<2007-04-17 11:24:01.78 +100>,<MAYBRIDGE\nmr>,<NMR_250MHZ>,
      <apk 
       data hash MD5: 32K
       58 5B CC 80 CA 3E 6D 90 0B 2B 53 FB 5E AD 4C C4>)
(   4,<2007-04-17 11:24:02.52 +100>,<MAYBRIDGE\nmr>,<NMR_250MHZ>,
      <abs ABSG = 5 
       data hash MD5: 32K
       84 3A F6 4C EB 98 18 58 D1 34 4D E0 17 A5 9B E0>)
$$ ##END=
$$ 
$$ hash MD5
$$ F0 8D 37 61 3B F4 F0 40 7F E3 FD 5D 30 78 02 05
##$RELAX= 
##$RELAX= 
##$RELAX= 
##$RELAX= 
##$RELAX= 
##$RELAX= 
##$RELAX= 
$$ Bruker specific parameters
$$ --------------------------
##$DU= <C:\u>
##$EXPNO= 1600
##$NAME= <ADRS>
##$PROCNO= 1
##$TYPE= <nmr>
##$USER= <dgb>
##$AMP= (0..31)
100 100 100 100 100 100 100 100 100 100 100 100 100 100 100 100 100 100 
100 100 100 100 100 100 100 100 100 100 100 100 100 100 
##$AQSEQ= 0
##$AQ_mod= 3
##$AUNM= <au_zg>
##$AUTOPOS= <14 >
##$BF1= 250.13
##$BF2= 250.13
##$BF3= 250.13
##$BF4= 250.13
##$BF5= 500.13
##$BF6= 500.13
##$BF7= 500.13
##$BF8= 500.13
##$BYTORDA= 1
##$CFDGTYP= 0
##$CFRGTYP= 5
##$CHEMSTR= <none>
##$CNST= (0..31)
1 1 145 1 1 1 1 1 1 1 1 1 1 1 1 1 1 1 1 1 1 1 1 1 1 1 1 1 1 1 1 1 
##$CPDPRG= <>
##$CPDPRG1= <>
##$CPDPRG2= <>
##$CPDPRG3= <>
##$CPDPRG4= <mlev>
##$CPDPRG5= <mlev>
##$CPDPRG6= <mlev>
##$CPDPRG7= <mlev>
##$CPDPRG8= <mlev>
##$CPDPRGB= <>
##$CPDPRGT= <>
##$D= (0..31)
0 1 0 0 0 0 0 0 0 0.06 0 0 0 0 0 0 0.0002 0 0 0 0 0 0 0 0 0 0 0 0 0 0 
0 
##$DATE= 1176805426
##$DBL= (0..7)
120 120 120 120 120 120 120 120 
##$DBP= (0..7)
150 150 150 150 150 150 150 150 
##$DBP07= 0
##$DBPNAM0= <>
##$DBPNAM1= <>
$$ [...]
##$SUBNAM7= <"">
##$SUBNAM8= <"">
##$SUBNAM9= <"">
##$SW= 20.6930455092707
##$SWIBOX= (0..15)
0 0 3 0 0 0 0 0 0 0 0 0 0 0 0 0 
##$SW_h= 5175.983436853
##$TD= 65536
##$TD0= 1
##$TE= 683.16
##$TE2= 300
##$TE3= 300
##$TEG= 300
##$TL= (0..7)
0 120 120 120 120 120 120 120 
##$TP= (0..7)
150 150 150 150 150 150 150 150 
##$TP07= 0
##$TPNAME0= <>
##$TPNAME1= <>
##$TPNAME2= <>
##$TPNAME3= <>
##$TPNAME4= <>
##$TPNAME5= <>
##$TPNAME6= <>
##$TPNAME7= <>
##$TPOAL= (0..7)
0.5 0.5 0.5 0.5 0.5 0.5 0.5 0.5 
##$TPOFFS= (0..7)
0 0 0 0 0 0 0 0 
##$TUNHIN= 0
##$TUNHOUT= 0
##$TUNXOUT= 0
##$USERA1= <user>
##$USERA2= <user>
##$USERA3= <user>
##$USERA4= <user>
##$USERA5= <user>
##$V9= 5
##$VALIST= <valist>
##$VCLIST= <CCCCCCCCCCCCCCC>
##$VD= 0
##$VDLIST= <DDDDDDDDDDDDDDD>
##$VPLIST= <PPPPPPPPPPPPPPP>
##$VTLIST= <TTTTTTTTTTTTTTT>
##$WBST= 1024
##$WBSW= 4
##$XGAIN= (0..3)
0 0 0 0 
##$XL= 0
##$YL= 0
##$YMAX_a= 157276
##$YMIN_a= -276376
##$ZGOPTNS= <>
##$ZL1= 120
##$ZL2= 120
##$ZL3= 120
##$ZL4= 120
##$ABSF1= 16.522
##$ABSF2= -4.171173
##$ABSG= 5
##$ABSL= 3
##$ALPHA= 0
##$AQORDER= 0
##$ASSFAC= 0
##$ASSFACI= 0
##$ASSFACX= 0
##$ASSWID= 0
##$AUNMP= <proc_1d>
##$AZFE= 0.1
##$AZFW= 0.1
##$BCFW= 0
##$BC_mod= 0
##$BYTORDP= 0
##$COROFFS= 0
##$CY= 12.5
##$DATMOD= 1
##$DC= 0
##$DFILT= <>
##$DTYPP= 0
##$F1P= 14.0000005364418
##$F2P= -0.99999901652339
##$FCOR= 0.5
##$FTSIZE= 32768
##$FT_mod= 6
##$GAMMA= 0
##$GB= 0
##$INTBC= 1
##$INTSCL= 1
##$ISEN= 128
##$LB= 0.3
##$LEV0= 0
##$LPBIN= 0
##$MAXI= 10000
##$MC2= 0
##$MEAN= 0
##$ME_mod= 0
##$MI= 0
##$NCOEF= 0
##$NC_proc= -5
##$NLEV= 6
##$NOISF1= 0
##$NOISF2= 0
##$NSP= 0
##$NTH_PI= 0
##$NZP= 0
##$OFFSET= 16.522
##$PC= 1
##$PHC0= 240.6557
##$PHC1= 0.09101509
##$PH_mod= 1
##$PKNL= yes
##$PPARMOD= 0
##$PSCAL= 4
##$PSIGN= 0
##$REVERSE= no
##$SF= 250.13
##$SI= 32768
##$SIGF1= 0
##$SIGF2= 0
##$SINO= 400
##$SIOLD= 32768
##$SREGLST= <1H.CDCl3>
##$SSB= 0
##$STSI= 32768
##$STSR= 0
##$SW_p= 5175.98343685301
##$SYMM= 0
##$S_DEV= 0
##$TDeff= 65536
##$TDoff= 0
##$TI= <Analysis number 999999
Compound Code 99
Book Reference 9
Project Code 9>
##$TILT= no
##$TM1= 0
##$TM2= 0
##$TOPLEV= 0
##$USERP1= <user>
##$USERP2= <user>
##$USERP3= <user>
##$USERP4= <user>
##$USERP5= <user>
##$WDW= 1
##$XDIM= 32768
##$YMAX_p= 358662035
##$YMIN_p= -696555
$$ End of Bruker specific parameters
$$ ---------------------------------
##NTUPLES= NMR SPECTRUM
##VAR_NAME=  FREQUENCY,     SPECTRUM/REAL,   SPECTRUM/IMAG
##SYMBOL=    X,             R,               I
##VAR_TYPE=  INDEPENDENT,   DEPENDENT,       DEPENDENT
##VAR_FORM=  AFFN,          ASDF,            ASDF
##VAR_DIM=   32768,         32768,           32768
##UNITS=     HZ,            ARBITRARY UNITS, ARBITRARY UNITS
##FACTOR=    0.157963299565203, 1,           1
##FIRST=     4132.6476996994, 0,             0
##LAST=      -1043.33573715361, 0,           0
##MIN=       -1043.33573715361, -696555,     0
##MAX=       4132.6476996994, 358662035,     0
$$ Real data points
##PAGE= N=1
##DATA TABLE= (X++(R..R)), XYDATA
$$ [...]
23354B09268j76353k06328Q8215R8300Q0417N9228k3727N4722j16410r4924j10790
23343a38382o9001R0633K16120j18776k25671R7172J32988l2131j00236L794R4182
23332d9308n9022r0117L6209p994L3999J92773J43836q3540L3617K20432l8101
23321C32784j35374m0516P5116M3699R5847q0933n4388P977j27988o1873j19825
23310f5474L3690o2926N6093R5513K4108j61385O2622Q2952j48718J0728N099
23299f7698n4248K9071l7467J2694o8910q8589o9125J86896J56671N8359Q4078
23288A41732r5719Q8046j27521j12555O8709j82834Q56N0123J68526m0123o1794
23277a02554J24937k9541R9531N8440k5789J594N8162K126j98941K7717O3031
$$ y = [209268, 32915, -173413, -85198, 13102, 93519, 152747, 129020, 183742, 67332, -27592, -138382, -207383, -116750, 99370, -19406, -245077, -147905, -14917, -47048, -147284, -143490, -49308, -108330, -198447, -162238, -170232, -136233, 56540, 200376, 116836, 150453, 370885, 332784, 197410, 156894, 232010, 275709, 371556, 290623, 236235, 244212, 116224, 54351, -65474, -31784, -94710, -38617, 56896, 81004, -80381, -17759, 65193, -83525, -72797, -67698, -121946, -92875, -130342, -117648, -186558, -275147, -344272, -157376, -705, 57654, 141732, 46013, 134059, 6538, -106017, -37308, -220142, -219286, -169163, -637, -40760, -102554, 22383, -7158, 92373, 150813, 125024, 126618, 184780, 186906, -12035, 15682, 78713]
23266G8713j66992j36632J82032J16278J42991J04007k27976l3942j1636j31986
23256h5143J92340J13355j9252J45849N3909n7488j31664r816m2233p6174M4367
23245A28050P6769J3418j04270N534p1268n0338J19806k037k2014N4293J37569
23234B85512r7309n2425n3963j06013n019m2117L3159k22342J6240J30052P2042
23223d2183L5883P0789k07294n6983K24588r5511j32522m5073L4535J29097p5553
23212a60227m6983m0747l071J96184J7321P3898K5579k37770j13156J64596L07759
23201A83383J17529j87146j08994J10429k1013j7929M9611j04024K1002J19705
23191A62553l5472J88649J55395Q8375K3012k71083j08530l4892P167n4870l5091
$$ y = [78713, -88279, -224911, -42879, 73399, 216390, 320397, 92421, 58479, 46843, -85143, 107197, 220552, 201300, 347149, 401058, 343570, 211906, 202090, 159857, 83683, 128050, 204819, 218237, 113967, 119501, 48233, -2105, 117701, 115664, 93650, 147943, 285512, 188203, 135778, 81815, -24198, -29217, -71334, -38175, -260517, -244277, -114225, -42183, -6300, 64489, -142805, -199788, 24800, -70711, -203233, -248306, -213771, -84674, -160227, -207210, -247957, -251028, -54844, -37523, 36375, 61954, -175816, -288972, -124376, 183383, 300912, 113766, 4772, 115201, 94188, 76259, 125870, 21846, 42848, 162553, 127081, 315730, 471125, 559500, 582512, 311429, 202899, 168007, 175174, 120304, 85213]
23180H5213O0556o5865n6017r5535J28080l6633k53051J53228K02357M7963l4523
23169A35773o4986m5830k15733j06764N1633J53702L3226n8837n166q1053J06201
23158i7834p4893L8317Q898p083J40411K5981N911K7297K6965R248Q0302j24579
23146E8941o4571N1093r2478O5938m9370J594j6235j29572N9225J30651J6456
23135C1672r3764R6699M2989J70365R79j28619j83856j87171M7925L9576J63076
23124a29J67233J18142r8472j49396k29997k16043J13625O0956J40927L5614k7804
23113h5344J42333Q5910q7068r01J08409J20406k5690j86838j18202M0139K9519
23102B2673P193j03971J460j30871J15072J92088l2198m9469p2050j2789M5103
$$ y = [85213, 145769, 79904, 23887, -71648, 56432, 19799, -233252, -80024, 122333, 170296, 135773, 70787, 24957, -190776, -297540, -245907, -92205, -58979, -117816, -122982, -204035, -97834, -172727, -134410, -125512, -132595, 7816, 33797, 39708, 67005, 93970, 103218, 183520, 58941, -5630, 45463, -47015, 18923, -30447, -28853, -45088, -174660, -115435, 15216, 31672, -62092, 34607, 77596, 247961, 248940, 120321, -63535, -250706, -202781, -163205, -129, 167104, 285246, 186774, 37378, -192619, -408662, -295037, -234081, -93154, -57540, -85344, 56989, 142899, 55831, 54930, 163339, 283745, 258055, 71217, -46985, -6846, 22673, 29866, -74105, -72645, -203516, -88444, 103644, 71446, 21977, -50073, -62862, -17759]
23091a7759Q5360J55436N6854j10407r4591p6339N805p7333o1951Q155J03662
23080b3108P2463o3543q0781l7887p0395l6749O4551K4638J71561l2765q5624
23069i7639J17993J38973P6099q0876m9408K3272k7259j35650m4740J3964Q4185
23058A8914n6610j09783O7967R738Q7425r5642k29008j56104J39916J54629N9969
23047a08589n057m9834q7794N0790N8211J22844L3019k3776n8335K08820J27863
23036B68162O2803p2144j78523j15283j56466m468J0965K7599J0737O6837L9943
23025c9838M319o5781J15796o8690r8570k493J29794m8195j2948J09909J61920
23014A85223j71362k10753o450M4165J5686R3504J76220p0595L0067N8447p9640
$$ y = [-17759, 67601, 223037, 279891, 169484, 74893, -1446, 4359, -72974, -134925, -126770, -23108, 49355, -14188, -94969, -132856, -203251, -240000, -175449, -150811, 20750, -12015, -97639, 20354, 159327, 235426, 154550, 105142, 128414, 101155, -34495, -79235, -65271, 18914, -37696, -147479, -79512, -69774, 17651, -77991, -306999, -463103, -323187, -168558, -108589, -113646, -163480, -251274, -200484, -142273, -19429, 13590, -10186, -68521, 140299, 268162, 330965, 258821, 80298, -34985, -191451, -195919, -184954, -157355, -146618, -79781, -39838, -35519, -101300, 14496, -54194, -152764, -155257, -25463, -73658, -86606, 23303, 185223, 13861, -196892, -203342, -159177, -143491, -49987, 126233, 55638, 85705, 144152, 64512]
23003F4512J23954j5035j44487j38328k9559O7223K3480l9053p2545K10639R8464
22992A49265o6971Q3225M3608j50518k11155J17023K35622q9044p7924r6383l4041
22981i7293J00966P5900m867J50063J2461j27946j58684q0735J00679Q8909Q9756
22970A49209K648o1144Q199j00287j45165r0484J15277J81678K9437n3960j30657
22959i5249l2228P765K8218J09575K69501J21221k31199p8369J1404k6302j23025
22948c8688m8018K2438J37250K37889Q0552j93273j4279j82653j89206R4171J77239
22937H3422K6713j09304j16718n9003Q8670K1071j6619K18822J6307j05862L4559
22926H2058k0429k37523J546J85463K6116l0438O9049q7659j83501m9905M7254
$$ y = [64512, 188466, 173431, 28944, -109384, -138943, -71720, -48240, -87293, -159838, 50801, 149265, 82294, 165519, 209127, 58609, -152546, -35523, 200099, 111055, 33131, -63252, -97293, 3673, 79573, 74706, 224769, 237230, 109284, -49400, -130135, -29456, 59453, 149209, 151857, 90713, 98912, -1375, -146540, -237024, -121747, 59931, 89368, 35408, -95249, -127477, -119712, -91494, 18081, 287582, 408803, 177604, 99235, 110639, 84337, -38688, -86706, -64268, 72982, 310871, 391423, 198150, 183871, 1218, -187988, -93817, 83422, 110135, 831, -115887, -174890, -86220, -65149, -81768, 137054, 153361, 47499, 82058, 61629, -175894, -174348, 11115, 37231, 6793, 75842, -11817, -195318, -245223, -197969]
22915a97969R7259J26092o1286N63N1751J08005k5113J04891J20938j60899j79740
22904a5508O9811J27679J6789j48166l25916p4988N6683Q2039J67776O6695N4718
22893G7612N4499n7724l9251Q8588R3567j51441j8589M0016K2754k36201j16636
22882b42806L5820J75482K21360P5062j64150j17963O5585K301O5270o9926j74830
22871a28795j05470L6960P6767J13110j7261l0885Q665j56763m1608M3038r9305
22860c01547J41380n0567N6474K5530J36993M666M0300N570n0017P5447J10712
22849A94941j39111r1160o8485o1855J29092J35593o8281o2408k5739j0667J68232
22838A00152M6227j90798l7077J78450j2391J56101j72912m5415N7018K4411Q78
$$ y = [-197969, -100710, 25382, -35904, -35341, 16410, 124415, 99302, 204193, 325131, 164232, -15508, 54303, 181982, 198771, 50605, -275311, -350299, -293616, -211577, -43801, 22894, 77612, 132111, 74387, 35136, 123724, 217291, 65850, 47261, 87277, 110031, -126170, -242806, -206986, -31504, 189856, 264918, 100768, -17195, 48390, 50691, 115961, 46035, -128795, -234265, -197305, -120538, -7428, -24689, -55574, -46909, -203672, -245280, -202242, -301547, -160167, -210734, -154260, -128730, 8263, 12929, 53229, 58799, 8782, 84229, 194941, 55830, -35330, -103815, -165670, -36578, 99015, 30734, -31674, -57413, -68080, 100152, 146379, -44419, -81496, 96954, 84563, 240664, 67752, 22337, 79355, 103766, 104644]
22827A04644M2948j23079l4850L7856o3242j51267O0443n5575n1608M2177K01817
22816A0264J61231j9928R9727j20046R666O8528n0005q8265p195j805N56R2910
22804A55638O0363o7199m7999j28923k4615K105O7187l6203p6161m4008j08192
22793b48007j50772M2596O3701J21750K62323P0872k0738Q3627J98598J31097
22783E55047l16740k03737o1019j4296J60414O289k0053l0644K2420P6711J19003
22772B93395L1547J36520j58863l34207J1976K1363K5396M5290q3943j11973J40298
22761A6799M7019j91558k3286M5884q9334R2461K5727o8716N9133K9527Q1155
22750B4811M2710j34557N3678l1986j79293p359N6465P839l1404J23636K336J37056
$$ y = [104644, 147592, 24513, -10337, 27519, -35723, -186990, -126547, -182122, -233730, -191553, 10264, 171495, 151567, 251294, 131248, 140914, 209442, 159437, 71172, 63977, 62172, 62728, 155638, 216001, 148802, 100803, -28120, -52735, -50630, 16557, -19646, -95807, -139815, -248007, -398779, -356183, -292482, -170732, 91591, 162463, 141725, 225352, 423950, 555047, 238307, 34570, -26449, -40745, 119669, 125958, 105905, 75261, 97681, 174392, 293395, 324942, 461462, 302599, -31608, -19632, 1731, 27127, 72417, -11526, -123499, 16799, 63818, -127740, -151026, -105142, -194476, -102015, -76288, -145004, -85871, -56344, 24811, 67521, -67036, -13358, -45344, -224637, -231996, -175531, -167692, -199096, -75460, -73124, 63932]
22738F3932J39362J75277k01551m0454L1193j82966l7890L5568j43801r3648m7037
22727c02015m671k094J48417J99309J96306K0087k77136j90519P5106K37763J1948
22716A12501q1046j19135M5333q5180O7872k2370k1675n8708O0087L2099R0256
22705B0034J41432l9981j18402r0074J76464J26810o9280n45k5144Q3349q4571
22694A20092o8488k3678K8812J00562K937p4142k50475l5619O8284J79553k4135
22683B3703j44172j84065p2535J70252J38616P8117r7362K8672J59859N9994n7103
22672A03976l0181N5978k66905k68939N3679J23156k5190P1418J19484L3802p80
22661c0502o296M3798J08118q783j14560r1234R0105m6967R3110J55905j43935
$$ y = [63932, 203294, 378571, 177020, 136566, 167759, -15207, -53097, -17529, -161330, -254978, -302015, -306686, -308780, -160363, 38946, 235252, 255339, -21797, -212316, -137210, 100553, 112501, 31455, -87680, -42347, -127527, -59655, -82025, -103700, -162408, -102321, -70222, 20034, 161466, 121485, 3083, -86991, 89473, 216283, 147003, 146458, 121314, 204663, 120092, 51604, 27926, 56738, 157300, 160237, 86095, -164380, -199999, -131715, 47838, 23703, -120469, -304534, -377069, -206817, -68201, 9916, -87446, -58774, 101085, 161079, 103976, 73795, 129773, -137132, -406071, -352392, -229236, -254426, -183008, -63524, -29722, -30502, -36798, 7000, 115118, 106335, -8225, -99459, -9354, -56321, 36789, 192694, 48759]
22650D8759k5424J54252o4247j94196Q5937N7970p2625j5747J51399q2366J2710
22639E6422J53081M3109M446k19830j27822p190p310K03262J58635O7424j74882
22628A49345j31880L235Q7689J10970N6235J58140K6410k28365j79591N9641j1183
22617A00646R481n116j13132l7026r7168n7233J58767q7789p4202Q3928k5165
22606a44009p252k2641O2054K15537J1910j75686k477j9329J58002Q8104K3843
22595A88056j01386j53582J80395J24468m1368l02962p3782O5777N4251K3004
22585c7129O5068J18351Q8411r5649k0711j9601k8393k0002L2328j51117p11P2666
22573C511n504n13n751Q3852J13951L9139J32087n5347k65316j08978o2500q2723
$$ y = [48759, 23335, 177587, 113340, -80856, 5081, 63051, -9574, -25321, 126078, 43712, 56422, 209503, 252612, 257058, 37228, -90594, -97784, -105094, 98168, 256803, 324227, 149345, 17465, 20700, 108389, 219359, 275594, 433734, 460144, 231779, 52188, 111829, 100646, 110127, 105011, -8121, -45147, -142315, -199548, -40781, -128570, -202772, -118844, -144009, -151261, -173902, -111848, 103689, 115599, -60087, -62564, -81893, 76109, 164213, 188056, 86670, -66912, 113483, 237951, 196583, -106379, -180161, -114384, -60133, -37129, 27939, 146290, 234701, 139052, 118341, 98740, 70347, 50345, 82673, -68444, -69155, 3511, -1993, -2506, -8257, 75595, 189546, 228685, 360772, 305425, 40109, -68869, -131369, -214092]
22561b14092l0133J01047L1718N8919k8685r309J60734M8519J6741j73192j16912
22550a54645L3038J16672N3419j72468q5399n5176R5149K58864o125J47613R3419
22539C24361j44981j78650P4825L2403j44217j63697k3104q118o5566K7422J68580
22528a00742J4312l4233J02856J32225m5938J8218K09832J0810j67045j0063m0832
22517H9400j00343r4744j00848J13265k4400M3942J10211j7288j29710n9334J12161
22506e7688Q0451K3866l4411j14867j9218l508P5110o679J85538J29288m350j56399
22494I7133L0024J22965j05471o5213q8220l612J6694o8554M5975o8403j07834
22483a94516K71201J60672j37852n0531J10807K2812k18815p4646R5857k0384
$$ y = [-214092, -244225, -143178, -111460, -52541, -81226, -90535, 70199, 118718, 135459, -37733, -154645, -121607, -4935, 48484, -123984, -209383, -264559, -169410, 89454, 83329, 230942, 324361, 179380, 730, 75555, 107958, -36259, -199956, -223060, -231178, -296744, -269322, -100742, -86430, -120663, -17807, 114418, 68480, 86698, 296530, 307340, 140295, 130232, 89400, -10943, -105687, -206535, -93270, -117670, -73728, 36483, 19195, -110515, -169849, -57688, 22763, 46629, 12218, -102649, -121867, -125375, -50265, -56944, 128594, 257882, 253532, 97133, 127157, 250122, 144651, 79438, -8782, -12394, 4300, -64254, -18279, -86682, -194516, 76685, 237357, 99505, 48974, 159781, 182593, -36222, -110868, -15011, -35395]
22473c5395O4946K84510M1124k99229J7611J14950r8892m5068o3197r8689K21492
22462A04163j6464p7879p5714p4282n6464O6409J29598K5773j20831j70695L7594
22451b28792M7667Q82J04956J53337p1430k220O2144K0422Q1169Q1304p9326n0121
22439A19992j3297l9729M5047k4462N2768J5197J0693j53710k73921M3923J47562
22428f9937j6507n9811o1972K25304J6037m5464j0047n6739K4307O2529j4123
22417f423m5249j47074K3593K9760N8474K2663J13358J22901j88075q5568L1023
22406g0617r8261j3670R4982J68049L3264j90512j06721N6435J06071J26698p0197
22395C5521P277o7725J8647L0042J72917p254J9308L3146O8044K2062l4257k01705
$$ y = [-35395, 29551, 314061, 355185, 55956, 73567, 188517, 89625, 44557, -18640, -117329, 104163, 87699, 9820, -65894, -140176, -196640, -130231, -633, 25140, -95691, -266386, -228792, -181125, -180243, -75287, 78050, 6620, 4400, 66544, 86966, 168135, 249439, 170113, 119992, 106695, 66966, 112013, 87551, 140319, 155516, 166209, 12499, -261422, -217499, -69937, -86444, -146255, -208227, 17077, 33114, -12350, -22397, -79136, -54829, 7700, -6423, -51672, -198746, -175153, -145393, -86919, -64256, 49102, 172003, -16072, -101640, -70617, -168878, -182548, -87566, 80483, 113747, -76765, -183486, -127051, -20980, 105718, 35521, 42798, -24927, -6280, 23762, 196679, 189425, 208733, 241879, 309923, 331985, 297728, 96023]
22383I6023k1798R7834O9396k62429j86681R8055J09458q5608L8773M5947o7036
22372f8066o7005L1219M4746k03959k1088J54971N6901j18567j14182j43346J27345
22361c21031R6350l986J37515m905q4879J34686J47581j40428l8028J79561J78590
22350B81026j2491p7640j12967q9818N2268L960m975K1910M1548O4371j2750k6579
22338A27863j08020j12655P198l6647j65497k3796Q4089K37969J52997j32505
22328C0996j47126M2572P7762O3061M454j87125P4915k6804k519O6314L36K8757
22316B5593N7045P9956Q3433n1421j99914J7152K07106p2545k36196Q7612J56787
22305A54608L325k40427j1447Q5157k6028l4990Q2426l8718j60375L9113r4716
$$ y = [96023, 74225, 172059, 241455, -20974, -207655, -109600, -142, -85750, -46977, -1030, -68066, -135071, -103852, -59106, -263065, -284153, -129182, -72281, -190848, -305030, -448376, -321031, -224681, -228667, -91152, -96057, -180936, -46250, 101331, -39097, -77125, 102436, 281026, 268535, 190895, 77928, -11890, 40378, 44338, 39363, 61273, 102821, 167192, 154442, 127863, 19843, -92812, -85614, -122261, -287758, -311554, -227465, 10504, 163501, 30996, -116130, -73558, 4204, 67265, 71719, -115406, -40491, -67295, -69814, -3500, -3164, 25593, 82638, 162594, 246027, 194606, -5308, 11844, 218950, 146405, -89791, -2179, 154608, 157933, -82494, -93941, -8784, -34812, -69802, 12624, -26094, -186469, -147356, -242072]
22294b42072M4306J53733J84160p1735j06486p5036k00943k6414J78480J18073
22284d3934R8017K8596l5369l8811j823r5937r3236J68247K86366j33996j23926
22273A4194l652M8354l7727k01397k4992K32928J61611J9182j65313K3745j53643
22262h6710j12530J67861o5484Q013J12128k2849l79144r6528L27022Q8826k231
22251f1626K0214k9348J10722O8902K2016j428q3742N178K0433P519k8143j27267
22239g6570j30768m699j2835J38946J4506J5863k0106l6649L6101J11707n7500
22228b2004l2839n7871J06809J55935j40859j0145P1706N6828m0728o5394J27700
22217A49138J10369j4034l9532j27532p7718k10213n4317J24433j9099N1492M9993
$$ y = [-242072, -197766, -44033, 140127, 68392, -38094, -113130, -314073, -340487, -162007, -43934, 54083, 82679, 47310, 8499, 6676, -89261, -182497, -14250, 272116, 138120, 14194, 10542, 58896, 21169, -180228, -205220, 27708, 189319, 208501, 43188, 66933, -86710, -199240, -31379, -96863, -88850, 23278, 429, -378715, -475243, -148221, -59395, -61626, -41412, -70760, 39962, 108864, 130880, 129452, 45710, 50888, 71321, 78840, 50697, -76570, -207338, -212037, -224872, -85926, -71420, -55557, -75663, -112312, -76211, 35496, -22004, -54843, -112714, -5905, 150030, 9171, -974, 70732, 127560, 86832, 21438, 149138, 259507, 245473, 205941, 78409, 691, -209522, -263839, -139406, -158505, -107013, -57020]
22206e7020L7521k904Q9360J47027K8340r6299j85301o7040L0405l9532q498J57034
22194C3093M3127p7883r7960M5474N954n8606L7622P0659n403n6785o4223l5344
22182a60275k01503J20469J19691m524n6362p2051N7996K135O7379r4487l9304
22171b60836p331O3456J68726M0201j73238o7375J93781N5439k6067K9812J1938
22160B8506Q1340o5260j87769k142J37772q8939M1655K18842j43360j41778k2764
22149a43897r7574r305p25J51323J61311k6195O4980J12835k00032l3607Q5749
22138F4863J9635q319m9440j62543J1785J07364Q6558j26625j98741O8657j3356
22127b00162K0567J01589K00368o6251m9114p298O1976J56057m3677o7857j45779
$$ y = [-57020, -19499, -22403, 66957, 213984, 242324, 146025, -39276, -106316, -75911, -115443, -123941, 33093, 76220, -1663, -99623, -54149, -48195, -106801, -69179, 1480, -3923, -60708, -124931, -160275, -361778, -241309, -121618, -126142, -182504, -254555, -196559, -194424, -127045, -221532, -260836, -268167, -204711, -35985, 4216, -169022, -236397, -42616, 12823, -13244, 16568, 28506, 109846, 44586, -143183, -145325, -7553, -96492, -54837, 164005, 20645, -121133, -143897, -241471, -250776, -251501, -100178, 61133, 34938, 99918, 212753, 12721, -20886, 64863, 84498, 76179, 26739, -135804, -124019, -16655, 69903, -56722, -255463, -186806, -200162, -179595, -78006, 122362, 56111, 6997, -301, 61675, 217732, 174055, 106198, -39581]
22116c9581j8070j8761J61575j52474j67713L5310J56193N6552j19821J11608
22106D818p8677k73634L552j6175m9085K32671J68937o7107j24250K8589M4862
22095a25499n7519j75511j03581M5256J5667K42566K43566J57370j62745q3708
22085d138j7616q1717o15J75013K38259L6259j62794j80737o4878m5523K00152
22074I1665R9600J17602l0771j57049j06451j0541m554q3578l6311J03904R7953
22063H1469K6786p7113J879J26735J7580m5119O3064n020m919n2137j3757j51587
22051c2139j04410N8016J8210J19291j05933K3290J20463p9501J03054L62k2526
22040I8177N2429J42289J4816j57064l53l9533j41986j27870n3588P773q9218
$$ y = [-39581, -57651, -76412, 85163, -67311, -235024, -199714, -43521, 13031, -106790, 4818, -73859, -347493, -343941, -360116, -409201, -176530, -7593, -74700, -198950, -170361, -125499, -183018, -358529, -462110, -416854, -401187, -158621, 84945, 242315, 79570, -4138, -21754, -103471, -104086, 70927, 309186, 345445, 182651, 1914, -62964, -108487, 91665, 191265, 308867, 278096, 121047, 14596, 4055, -499, -84077, -120388, -16484, 81469, 108255, 31142, 33021, 159756, 177336, 132217, 195281, 190261, 185342, 133205, 119448, -32139, -136549, -78533, -60323, 58968, -46965, -23675, 96788, 17287, 120341, 120703, 98177, 150606, 292895, 307711, 150647, 150294, 110761, -31225, -159095, -212683, -204910, -294128]
22029b94128J85347Q5904J90546J06335j33736J352J5009j45418P7290K1589J65993
22018B76083J02530k49932j73483m6481N7778k2464o0418n7953j71789j34042
22008d80171K39844K90514P8934k1330j89146O6331r3956j22352J14351l3721
21998a50702P2170j1031o8087J3755p6183K10487L6983K3874j21055J04046N1690
21987H5947n2936K48333n1083k13491p9620o2264K09399K03536q4406l21427R1713
21976b6299j17506N49K4275j69821m6684m131k1438K00625J64762n5447l2552
21965h3667j02785N2445Q5351J12583J83995m5575j82088o1099O9768J7816J06013
21954A52757j43153o9932k3356P5253Q9740L1286O796M056L2587M608n523j18556
$$ y = [-294128, -108781, -22877, 167669, 274004, 140268, 141620, 156629, 11211, 88501, 110090, 276083, 378613, 128681, -44802, -91283, -33505, -55969, -116387, -174340, -346129, -480171, -240327, 50187, 129121, 107791, -81355, -15024, -108980, -231332, -116981, -150702, -78532, -89563, -157650, -143895, -220078, -9591, 27392, 51266, -69789, 34257, 85947, 33011, 281344, 230261, 16770, -62850, -125114, 84285, 287821, 203415, -118012, -26299, -143805, -143256, -118981, -288802, -335486, -339617, -361055, -160430, 4332, -51115, -83667, -186452, -134007, -48656, 63927, 247922, 202347, 20259, -40840, 28928, 46744, 152757, 9604, -60328, -83684, -8431, 81309, 112595, 119391, 123447, 156034, 160642, 155119, 36563]
21942C6563j39452N9522l3758j39032J17277J07283j8243o6721Q6024M8998J46529
21931B04990K783j05555m2540J9049k0230n4043n3551L5878M8504O4300P9770
21920A79355O0201J3053j32777k43634m156l6105J11699J07903j10259k3341K8779
21909d9282j34507Q8533K34483J70619j16105p7613R8013j2116k05302J7358j8885
21898d804k07306j16465J48193K10200J37349q8259j41216j48095R1202J66328
21888D7127L2750n1343j96502n4820J36691K8135j20103R8044M9367J68442k4950
21877A12838o240o1104j48484Q0606L0681j6591j70505l8014M6101Q0911J6153
21866g3648l9885j0649J23149J6574r5067p7577m1528j11700N3575K3340J22305
$$ y = [36563, -102889, -43367, -77125, -216157, -98880, 8403, -9840, -76561, 9463, 58461, 204990, 207773, 102218, 59678, 78727, 58497, 4454, -49097, -13219, 35285, 99585, 179355, 239556, 252609, 119832, -123802, -127958, -164063, -52364, 55539, -54720, -78061, -49282, -183789, -95256, 139227, 309846, 193741, 116128, 214141, 202025, -3277, 14081, -4804, -212110, -328575, -180382, 29818, 167167, 78908, -62308, -210403, -119201, 47127, 79877, 28534, -167968, -222788, -86097, -57962, -178065, -80021, -30654, 137788, 112838, 106598, 45494, -102990, -22384, 8297, -8294, -178799, -216813, -170712, -89801, -73648, -113533, -124182, -1033, 15541, -79526, -157103, -198631, -310331, -256756, -233416, -111111]
21855a11111M0713J0577m4939o1613J1127J07347j5062J23373Q8454m0009m1441
21844F7416p8382j18869j73970j26119P7344J40666J960q4922j27297K1754k4752
21833d25171J93352J64973K235K0281l973l200l4412O1200j5884l770j31099Q4161
21821i1307J83497j42877j51199p5799o548L5303O425J75298Q0462L8002j23112
21810g1855J29602L2676j3882p645j05459J7091O7657q7162j44940q4028O1301
21799b06644L18715J46523j00723m3472k8844r5403j36142m0633m3367J36818
21789i3172J40785N6604l1259j08908N424j21567r8826K0714O4891P610K4821
21778a32883K05011Q7j270k32226l11396L4810K57501J07125m9280J66759Q1731
$$ y = [-111111, -70398, -59821, -104760, -166373, -155246, -47899, -62961, 60412, 148866, 108857, 67416, -10966, -129835, -303805, -429924, -352580, -211914, -209954, -294876, -422173, -400419, -425171, -231819, -66846, -64611, -44330, -48303, -51503, -85915, -24715, -40599, -44369, -175468, -91307, 92190, -50687, -201886, -277685, -284233, -248930, -242505, -67207, 13255, 51257, -71855, 57747, 90423, 76541, 68896, -36563, -19472, 48185, -38977, -183917, -267945, -206644, 112071, 258594, 157871, 114399, 85555, -9848, -145990, -186623, -229990, -93172, 47613, 104217, 72958, -35950, -30526, -152093, -250919, -230205, -165314, -157704, -132883, 72128, 72215, 70945, -161281, -472677, -437867, -180366, -73241, -122521, 44238, 125969]
21767A25969J57522j79486n5754M3343q2012J5168K0721p9771N8957J8294k9188
21756A3763m7779j26929j24717j27069p481J06802m2937J16227K24628Q3366l8277
21745B9597P8887O2290r1376K22952J38206j37693j17485J36558j10573k05816
21735E547j48860o9745P0505J04796m5780j6970k5995Q7358j2130j05541n4888
21724b11703K37990J34777K5259j29044o9473j6745N1979o8213j96335M5722Q3564
21713a12222P1983L1008k0584M0556L9793o5874o5766J8082L8490J38299N5443
21702A69208Q0790j50445j73271p8583L2673K35628K4633L9234l2599j09293k29571
21691a91596p6526J16876J69163J48319j17726p2851J09779P0495R26j07165p2201
$$ y = [125969, 283491, 104005, 48251, 91594, 9582, 24750, 45471, -34300, 24657, 42951, 13763, -34016, -160945, -285662, -412731, -420212, -313410, -356347, -240120, -15492, 67874, 29597, 108484, 170774, 79398, 302350, 440556, 302863, 185378, 321936, 211363, 5547, -143313, -213058, -142553, -37757, -83537, -100507, -126502, -39144, -51274, -156815, -211703, 26287, 161064, 186323, 57279, -12194, -28939, 23040, -45173, -241508, -195786, -112222, -40239, -9231, -29815, 10741, 50534, -15340, -81106, -63024, -24534, 113765, 169208, 249998, 99553, -73718, -152301, -119628, 116000, 140633, 179867, 147268, 37975, -191596, -268122, -151246, 17917, 166236, 48510, -24341, 85438, 155933, 156859, 49694, -22507]
21680b2507n8458M3229N4128J18205J00060k2566o1321o2828R265q9317k5376
21669a7486j56720L9284k6906Q507J96906J55213k0755N290N082j2816n7047j02399
21657A6153r2254k35161J73428O0310J5592J31363J83689j87059j49679O3404
21647b0214P3894j69753k36398K33330P5834j20834r7668J5998O1114M8130q0696
21636b17263J04250J94475N5442m0808J11100n4976j94006M7619M5497j9283k0062
21625A1985M1537j80069q8524J28508K25838N7457k00878l7448m2306m9321r4766
21614b27987p685k167N9559q921O5728j59730Q0059J04120J19189l61l2321o6876
21602g7393p8469O333O9096N5471M3693J12913l1311O5232q8932r6892N5049J35913
$$ y = [-22507, -80965, -37736, 16392, 134597, 234657, 212091, 150770, 87942, 97207, 7890, -17486, -174206, -134922, -161828, -153321, 43585, 198798, 178043, 183333, 188415, 175599, 118552, 16153, -76101, -311262, -137834, -77524, -61932, 69431, 253120, 66061, -83618, -20214, 53680, -116073, -352471, -119141, -43307, -164141, -261809, -245811, -184697, -136567, -217263, -113013, 81462, 136904, 96096, 207196, 152220, -41786, 5833, 51330, 32047, 11985, 53522, -126547, -215071, -86563, 139275, 196732, -4146, -41594, -83900, -133221, -227987, -235672, -237839, -178280, -187201, -121473, -281203, -201144, -97024, 22165, 21804, -10517, -77393, -155862, -149529, -80433, -24962, 18731, 131644, 100333, 165565, 76633, -20259, 34790, 170703]
21590A70703l7045j69914j42349Q7912J15834O0733q3491L4549j32914K3285R5226
21579B2529j53808o5846o6772p4939O2463k238r1088L01108O7581j46775O1448
21568h6337L7137l8877R611N2554j5273M2919J02708l8417J405J5397q2930r8595
21556i8698j21222j00298q9362j1543J56060J62788R9659P0004M6725m7142p0661
21545c690j19333n3180O5846J44333Q1912M7169j13390k9456m5873J26888k1517
21534G9709j958J24540j71811j65260J19012q7031l9154r8778M2095M7944L2925
21523a17767p2384L763K37095J08196j73238l109O442p8118l1191O5703j20483
21512a75091q7478r0455j09609J16305p9495j6702P0533K9994J7696K48079J62529
$$ y = [170703, 133658, -36256, -178605, -90693, 25141, 85874, 2383, 36932, -95982, -72697, 22529, -131279, -197125, -263897, -338836, -276373, -278611, -369699, -68591, -1010, -147785, -86337, -49200, -88077, -78466, -25912, -41185, 1734, 104442, 66025, 67430, 82827, -103, -98698, -219920, -320218, -409580, -421123, -265063, -102275, -2616, 67388, 114113, 66971, -3690, -123023, -176203, -110357, 33976, 115888, 163057, 49667, 20211, -25662, 101226, 79709, 77751, 202291, 30480, -134780, -15768, -102799, -141953, -240731, -198636, -150692, -117767, -190151, -186388, 50707, 158903, -14335, -17444, -11002, -89120, -120311, -54608, -175091, -262569, -353024, -462633, -346328, -425823, -442525, -371992, -341998, -324302, -76223, 86306]
21501H6306j67679r4547O9708J02952N1909R1329Q2247L08002n3528j87393q5426
21490B03880j87199j41128j19708k52O7962L2746l8084J11524O9334j2737l5932
21479d9594j29034l5736J38651O9778j5055O1097O8170m8671m029j42276m0060
21468a26759N2563n4449J50203M6452q7163K0745J5703p1260j45646q5294J44663
21457a40242J51089P9509L1711O8914J1066P0884j79709k46735o8909J62419l0615
21446i0618L7100J8790j28318L7391L0657j0047p0516O5189j5616l6853n28J61627
21434a742O9941k22433n7445N36q4774N8361K51077k00765j40532J4979K3661
21423b89136J0840N0354P3528K5233q331j30434l0149N9480J68119O1914j46635
$$ y = [86306, -81373, -175920, -106212, -3260, 48649, 139978, 222225, 530227, 476699, 289306, 203880, 16681, -124447, -244155, -244407, -176445, -143699, -181783, -70259, -925, -13662, -49594, -178628, -214364, -75713, -5935, -20990, 40107, 108277, 59606, 55577, -86699, -126759, -74196, -128645, 21558, 68010, -19153, 1592, 17295, -53965, -199611, -284905, -140242, 10847, 90356, 122067, 190981, 202047, 272931, 93222, -153513, -222422, -60003, -90618, -53518, -34728, -163046, -125655, -94998, -105045, -175561, -110372, -125988, -162841, -163369, -1742, 68199, -154234, -211679, -211143, -295917, -237556, 13521, -187244, -327776, -312797, -289136, -278296, -227942, -154414, -129181, -137512, -267946, -298095, -238615, -70496, -8582, -155217]
21412a55217j43652N8304P2200J41994J02057o1067n4277o3909k9589J54041l1149
21401a0264r3331j57485O3900K35186n5228j8932J15799K5378j28058j45464R8114
21390g0385j8466P5068R0330o098O220k3138J4686j763k5771L4788q6418l3171
21378d4118J77429o6062k2377P95j11575P4821N2072j57116q6777O39J93137n080
21366E788r8671j58358L7624K74230J35471j18905j06593L0751J15436o7781n6265
21355g273o0231J75812j8576M8233J28601r8831j93755l1480k9250L0339l1854
21344h8265k5493J4201j45853r5520j3689J31997J30341Q9216N2856N5214J09175
21333B14180R6865r6868j96420j65619r6438P7875K3115j0653L7554n9261L7844
$$ y = [-155217, -298869, -240565, -168365, -26371, 75686, 14619, -39658, -103567, -133156, 20885, -10264, -103595, -261080, -197180, 38006, -17222, -36154, 79645, 105023, -23035, -168499, -70385, -88851, -13783, 76547, 70449, 76669, 53531, 68217, 66454, 40683, 75471, -10947, -44118, 133311, 67249, 44872, 45667, -65908, 8913, 60985, -96131, -182908, -182269, 10868, 5788, -92883, -251241, -213617, 60613, 196084, 77179, -29414, 1337, 116773, 48992, -7273, -67504, 108308, 89732, 137965, 266566, 167735, -26020, -57500, -86750, -56411, -88265, -113758, -99557, -245410, -340930, -354619, -222622, -92281, -3065, 49791, 105005, 214180, 311045, 214177, 17757, -147862, -244300, -166425, -143310, -153963, -116409, -175670, -137826]
21322a37826j4578L3884J54145j09238r3335O8788J25170Q8750j54133q7743j13674
21311b39790m195j48614j7603M0417J26462J0046K2004J38743J20556j53489O0520
21300d4943k0015j28030O8344j11809k0350L39823j36828j09240R9089q4879o2356
21289b11194m1741J17699J59869k4161M7281K1854K5430L8531q3419k41332r5370
21278b86553n458j4726P8128J517n0597J46880N2191o2352P8689J51140P6057
21267A64916l450k04816l13678O6173K6451J21637N7761N0794J849j84574J30803
21256h6134J34222J04370j7584j88154N7821N3046J0033j49726J93170J12258
21246B23322N6592N2431j57834k60660r9130O289K9576Q97P5502L9520p5479p2505
$$ y = [-137826, -152404, -118520, 35625, -73613, -166948, -98160, 27010, 115760, -38373, -126116, -239790, -243985, -392599, -410202, -369785, -243323, -233277, -211273, -72530, 48026, -105463, -44943, -64958, -192988, -124644, -236453, -256803, 83020, -53808, -163048, -63959, -148838, -211194, -252935, -135236, 24633, 472, 47753, 69607, 95037, 133568, 50149, -191183, -286553, -292011, -306737, -228609, -227092, -277689, -130809, -78618, -140970, -62281, 88859, 164916, 161466, -43350, -357028, -290855, -264404, -142767, -85006, -34212, -32363, -216937, -86134, 48088, 152458, 134874, -53280, 4541, 57587, 67620, -82106, 111064, 223322, 279914, 332345, 174511, -86149, -185279, -178990, -149414, -148517, -73015, -33495, -108974, -181479]
21234a81479K8979J69090J33070k5071J34306l0678j2315o6821j55615m8347l5825
21223i0706j9117J4945j16638O9616J13114P6267J27570j80211o3367J71762n622
21212I7613j5601k3840o5533j04481k7004l610J1692J53375R4868r8468o1340
21201d2329J31186k01525r1406J76430P2998m7528j5954k21686l2418O4968j01499
21190c08763J26527O4083k8050o5162m5528j38879J1158J27691P9890M583R0828
21179h1622j664o167p2679n1577Q1895M8243l6845n7806r487j31965j4619J98840
21167a35453J90281N8676K8962j40267m4334q1374j67048K10501N3737k18921
21157b45240P0440r481M4994R1619J29985J5337j06342j50830j54047M4090J92409
$$ y = [-181479, -152500, 16590, 149660, 124589, 258895, 228217, 215902, 149081, -6534, -54881, -90706, -109823, -94878, -211516, -141900, -28786, 47481, 175051, -5160, -68527, 103235, 97613, 82012, 58172, -7361, -111842, -138846, -142456, -130764, 22611, 117479, 19011, -42329, 88857, -112668, -204074, -27644, 45354, -2174, -18128, -239814, -272232, -207264, -308763, -182236, -118153, -146203, -211365, -256893, -395772, -384614, -256923, -177033, -172450, -81622, -83286, -89453, -162132, -213709, -131814, -83571, -120416, -178222, -187709, -319674, -334293, -135453, 54828, 113504, 142466, 2199, -42135, -123509, -290557, -80056, -26319, -245240, -174800, -184281, -139287, -47668, 82317, 97654, -8688, -159518, -313565, -269475, -77066]
21146g7066l8518n6590J57642J909k72486j26746L7585R7545J04881J7352n7402
21135b11894Q9558L4071q4755p1449l4530J97680Q4580k9868R4986N9123j23225
21124D277k15188l2543N4704J65509j10302k52276Q1473J83937R5238k8730l0226
21113h4127o8606r0134k4985J73116p2878j9876P4468p5176k10912J89163K66725
21102E6778l366j39704K998J97488O6714k3512R0733r6584N2946q3349k44064
21091a22922k22407J66461l1587j42002M7111J87730J21418Q9913j6869j2231
21081F4615r3708J64411J36943j66159j67751p0818Q9093L992o0853J30716J30402
21070A60883m8057j08573k123l848j16106k3940J21159Q4764K0293j04233J9588
$$ y = [-77066, -115584, -172174, -14532, -12623, -285109, -411855, -374270, -276725, -171844, -154492, -211894, -122336, -88265, -173020, -244469, -278999, -81319, 3261, -26607, 68379, 127502, 4277, -210911, -243454, -188750, -23241, -133543, -385819, -304346, -120409, -25171, -53901, -84127, -152733, -242867, -267852, -94736, -167614, -187490, -113022, -188198, -399110, -209947, 56778, 53412, -86292, -83294, 114194, 180908, 157396, 248129, 151545, 204491, 121142, -122922, -345329, -178868, -210455, -352457, -305346, -117616, 3802, 93715, 76846, 64615, -29093, 135318, 272261, 106102, -61649, -132467, -43374, -39382, -100235, 30481, 160883, 112826, 4253, 2130, -1718, -117824, -141764, -20605, 64159, 84452, -19781, -193]
21059a93j6269j5102q5312j90642p6407J67739K59905N9257k00163J5164M2635
21048c9388j00098L6204P6017r9786k59621k11184N1029J62068M9019J10846J42050
21037h2844J74264k1348j26308P5116j14499j27474K9272P005L8897R3799M5421
21026h699j63271j15052J94812P6339k69223P0170K15142J32332M7986m9403k69572
21015a38439j57349P4746K8471J53530R9215j06527J8950K2165N1880j3675j25378
21004i2411q9464J10275L5225K2103p8922P2958N8183j2581L2919J2318J6685
20993H7288k6151r0464j28732k8746J15292Q1661Q9606q6108q343J01948l3682
20982G3569L8543L6182k9096j22967o5736J7511R5314M5105j50159j28530O8814
$$ y = [-193, -16462, -31564, -116876, -307518, -383925, -216186, 43719, 102976, -97187, -82023, -39388, -139486, -103282, -27265, -127051, -386672, -597856, -546827, -384759, -335740, -224894, -82844, 91420, 70072, -56236, 18880, -95619, -223093, -193821, -186816, -147919, -54120, -8699, -171970, -287022, -92210, -15871, -285094, -214924, 218, 132550, 180536, 131133, -138439, -295788, -221042, -192571, -39041, 60174, -46353, -27403, -5238, 46642, 32967, -92411, -181875, -71600, -36375, -14272, -93194, -20236, 37947, 25366, 58285, 70603, 87288, 61137, -29327, -158059, -186805, -71513, 10148, 99754, 13646, 5303, 107251, 73569, 112112, 148294, 119198, -3769, -69505, -51994, 43320, 88425, -61734, -190264, -121450]
20971a21450P4687j06788P6986M2284p6498q1692O3738R8874Q1169K2545L2976
20960A06831J12055q9111k33010P8200L4962J6547J652m9190R9967j99257m8325
20949a68679k6093K1714r1469L9631J93082l7330p0988J05510L8488O6742n0775
20938A9833k21947Q5438N057l53136o8473L552J58778J27361m141p315Q9708J64274
20926a011L5976J09887J14129j3942k88164l06803j36745J05480K33681J76309
20916B8797K45293P4432j19851l4373o31m8180j70725j16862Q3676K32331R321
20905A83228j30383p1124J70363J99040Q0222j38607k16732O693m9694j14751
20895h1745O5192j31863j25384O3309n822j30739J8751n8724J35455J38034j07735
$$ y = [-121450, -46763, -153551, -76565, -34281, -110779, -192471, -128733, -29859, 51310, 73855, 106831, 218886, 129775, -103235, -25035, 9927, 26474, 28126, -21064, 78903, -120354, -168679, -194772, -173058, -264527, -224896, -31814, -69144, -140132, -34622, 3866, 70608, 19833, -202114, -116676, -111619, -464755, -533228, -529676, -370898, -243537, -247678, -254993, -165285, -1011, 34965, 144852, 258981, 245039, -43125, -349928, -486673, -381193, -147512, 28797, 274090, 348522, 228671, 194298, 193667, 145487, -25238, -142100, -58424, 173907, 183228, 52845, -18279, 152084, 351124, 431346, 292739, 76007, 82700, 33006, -81745, -16553, -148416, -273800, -210491, -216313, -347052, -328301, -387025, -251570, -113536, -221271]
20884b21271l4346J86785l1591o6645K8000m89l7931m2913J1013K05632Q5906
20873H2150n7160l6873P2268j31819j55024q6335P1645N7422l1755j40975j6183
20862c72639J86032J08126J25064l1044P0749k6318O8807L5749m3158r4764p7403
20851e0799p2954P026m6991j63543r4533o4577J61012l8776Q8651K49736N6648
20840C0900j20060r0486n8255P4427j7941M9238J1394n6655L3424J72814J30511
20829A59311j29639q0981J44153R2310O843k07876m9298N660p7273j07800j07932
20818c52522R0762P4203Q2672Q3328K6362q6372n5672j26565O7084K7317l5955
20807b05358j5972J3875j00126j58969R0801Q7157Q5002N7188J50296k3469m3657
$$ y = [-221271, -255617, -68832, -100423, -167068, -139068, -139557, -177488, -220401, -209388, -3756, 82150, 24990, -11883, 60385, -71434, -226458, -312793, -241148, -183726, -215481, -356456, -372639, -186607, -78481, 46583, 15539, 86288, 59970, 128777, 164526, 121368, 26604, -50799, -123753, -116727, -163718, -327261, -421794, -486371, -325359, -364135, -275484, -25748, 30900, -89160, -179646, -237901, -163474, -181415, -132177, -120783, -177438, -144014, 28800, 159311, 29672, -51309, 92844, 185154, 191997, -15879, -65177, -59517, -136790, -244590, -352522, -261760, -187557, -104885, -21557, 4805, -81567, -137239, -263804, -196720, -169403, -205358, -221330, -207455, -307581, -466550, -375749, -288592, -203590, -146402, 3894, -19575, -63232]
20796f3232O9092J73466l9678j5751j01034l1002Q3674J7879j55628o5444m3709
20785a71367P4667J05173K8762N5063K30348O7075j23774J258j07588j79478j63315
20774a83176k917J13904P1467J01247k8484j18825n7426j01355j06750j41225
20764d53540J43463K06971L3766J51655j25693k78969J3217Q0531N0984n7232
20754b34847p3105J64783J76095p0575j55323P0866r8711j33672j2591J02166
20744b64914J02853J04387o9308j42128n0806K3244J68981K23884l292k42405
20734a49504j27703q0826J91647J85490p3094N5851P46m8683o1288R7214j54078
20723a64228N2274K4091j35497O0375J68159K6770j16910k61913n4388J77318
$$ y = [-63232, 5860, 179326, 139648, 123897, 22863, -8139, 75535, 93414, -62214, -127658, -171367, -96700, 8473, 37235, 92298, 322646, 389721, 265947, 267205, 159617, -19861, -183176, -186093, -72189, -722, 100525, 72041, -46784, -104210, -205565, -312315, -453540, -310077, -103106, -69340, 82315, -43378, -322347, -309130, -228599, -177615, -234847, -307952, -143169, 32926, -37649, -192972, -122106, -220817, -354489, -367080, -264914, -162061, -57674, -126982, -269110, -319916, -296672, -127691, 96193, 92901, -149504, -277207, -358033, -166386, 19104, -53990, 1861, 2607, -46076, -107364, -10150, -164228, -111954, -87863, -223360, -162985, 5174, 31944, -84966, -346879, -401267, -223949]
20713b23949J38804J37818N5891P0300q9054j35393P2763l360j68321p5372L8516
20702a81357J33159N9941k10j24756q662O5354J75357N8574j3093j0908j58864
20691e465k7152j64152q8543r2048n1364J60297J49656P610l2743J09767P7019
20680D2882J14386j49867j08352k12393l3456L33648J42885K8036j73292k00869
20670b16392k7055n4893p5096M1632l1278j23265J21936K23384p3831k75669p9466
20659e69993K57673p8622J23680J43700N5820J1265M206j67202o5427Q5927J92419
20648f554j6923j60599j45550Q0816J18338O5536J93591J12878p4015k35188J2278
20637e5392P5151p3479j23461N4856K26576J04489j7186k2562l0092j25165m393
$$ y = [-223949, -85145, 52673, 108564, 178864, 89810, -45583, 27180, 23820, -144501, -219873, -181357, -48198, 11743, 11533, -113223, -121885, -56531, 118826, 177400, 164307, 153399, -5465, -32617, -196769, -285312, -377360, -428724, -268427, -118771, -111161, -143904, -34137, 42882, 157268, 7401, -100951, -313344, -346800, -13152, 129733, 157769, -15523, -216392, -243447, -298340, -373436, -331804, -363082, -486347, -364411, -141027, -214858, -490527, -569993, -312320, -390942, -267262, -123562, -67742, -56477, -52271, -219473, -284900, -198973, -6554, -23477, -184076, -329626, -248810, -130472, -64936, 128655, 241533, 167518, -67670, -55392, 19759, -53720, -177181, -122325, 104251, 208740, 191554, 168992, 138900, 13735, 9342]
20626I342N1981L9550J58963J043j36114j05727p2731r1182J10989K3429J41721
20615A31264k18327j80092P6728p324R4995n858j22733K8691O8621K8393J54106
20604D8464J2096r8807m6103q462j15646j1331Q0680j12432j7111J31112J50149
20593A2609n5132k65196J8575N4227O5500P4288r571K9217m8499J26761r1445
20582h8666l756J76454r2250n9393r0660m7306p53Q7354P2710p150j19076J3452
20570a59040M8620q1410m0955m5205k593r061Q0335K93050m4646j04291L2123
20559c3073N6510j19872M0229l5192J35314j09826o3399n6313j9914J06428L1583
20548f7525Q014p6350k31716p013Q3556R8546J82451R7715L2663M0697J17882
$$ y = [9342, 61323, 100873, 259836, 260879, 124765, 19038, -53693, -144875, -33886, -10457, 131264, -87063, -267155, -190427, -197751, -102756, -108614, -231347, -202656, -134035, -105642, 48464, 60560, -38247, -84350, -92812, -208458, -219789, -139109, -251541, -268652, -137540, 12609, -42523, -307719, -289144, -234917, -169417, -95129, -104700, -75483, -123982, 2779, -88666, -92422, 84032, -8218, -67611, -158271, -205577, -206330, -118976, -46266, -53416, -172492, -159040, -110420, -191830, -232785, -277990, -280583, -289644, -209309, 83741, 39095, -65196, -33073, 23437, -96435, -56206, -91398, 43916, -65910, -129309, -185622, -205536, -99108, -67525, -59511, -135861, -367577, -374590, -291034, -192488, -10037, 87678, 120341, 161038, 278920]
20537B78920m2652j10766j67991O1936K2143K1259J13079k4344J1373j4850j16979
20526C1128m8922l4465p6970j64197R7559J33233k7054q0492R0281j4624M4040
20515e0483n2186q0670p2629n8586J33009J46951m6494K251r3518k10643Q3219
20504b99779L27349M2398K4482l1688j4615r3558K4242j13698j29365P8252K43651
20493E7671J36497j32924m4409J0283k25452p9556K4572L5918J89524J11901O6175
20482A50200j9401j82120k605k9118m4807j38310m6003M5143j07146M6981J83353
20471a43833j19550j04325O6244R3846J10406J69927j09927j20529j02034K0972
20461b38803m3976m9099J46741Q8490k7933j30546J00486K5871l5371N7774M1204
$$ y = [278920, 236268, 125502, -42489, 19447, 41590, 62849, 175928, 151584, 162957, 148107, 31128, -17794, -52259, -129229, -293426, -195867, -62634, -89688, -170180, -79899, -94523, -50483, -102669, -183339, -255968, -314554, -181545, -34594, -81088, -78837, -172355, -382998, -299779, 27570, 69968, 94450, 62762, 48147, -45411, -21169, -134867, -264232, -185980, 57671, 194168, 61244, 16835, 27118, -198334, -277890, -253318, -217400, -27876, 84025, 150200, 130799, -51321, -53926, -83044, -127851, -266161, -312164, -267021, -374167, -327186, -143833, -263383, -367708, -301464, -207618, -97212, 72715, -37212, -157741, -259775, -238803, -282779, -331878, -185137, -96647, -124580, -255126, -154640, -128769, -164140, -106366, -65162]
20450f5162o1623j47963o059J78121R1808j9659k9572K2402N8741k3065j3676
20439a5707j87778k9510N0682j2542o4407M9926l8161J82782q3795l18939j12461
20428e79910J30838J35761J9567O6499N1743J1481K1336K8200o0307k9428L10406
20417A06186n3369j99258o6757J5590j24137j24966J58061L0091o4910O5664K55516
20406b289K7816j20164k14423O5866J06619J40832J36045k7891q1854k4840N8959
20395F4676l1306q5110r7357j6376n6524J66515J38719j850j42684j83082K19
20384b44160K61762J39069j1543k30663p6760m3807m243K3742l4665L3590J23761
20373f3917J42783Q98k6135q1930R720q068p2631l7047l9578k0185L0323O3068
$$ y = [-65162, -126785, -274748, -280807, -102686, -10878, -30537, -60109, -37707, 21034, -2031, -15707, -203485, -232995, -182313, -194855, -259262, -209336, -247497, -64715, -148510, -467449, -579910, -449072, -313311, -293744, -227245, -175502, -164021, -142685, -114485, -174792, -204220, 106186, 52817, -146441, -213198, -197608, -321745, -446711, -288650, -258559, -323469, -257805, -2289, 25527, -94637, -309060, -243194, -136575, 4257, 140302, 112411, 30557, 5717, 64676, 33370, -51740, -149097, -165473, -221997, -55482, 83237, 81387, -61297, -244379, -244160, 17602, 156671, 145128, -85535, -162295, -206102, -210345, -186603, -221268, -187678, -63917, 78866, 79764, 53629, -28301, -18581, -26649, -99280, -136327, -175905, -196090, -165767, -102699]
20361a02699l5339O2745J03986M1363J02830P395j8515O2753j47213k4723j91143
20350a38560j88909j3544J51868Q4265J2012P8014j87942j57277O9892J0484N3383
20339b26314P2794J6903J03160R337j50591M5084L1895N810r5873J39005m4996
20328i3786m6851J6333n7358r8411J15677N7531r2177J55025J09070p6053J55590
20317A44590l6342j11521K9531k2940n0344M9823M0036m6687m2524j35956K8682
20306a53652J43376J1260j15933L5860J56327M5845l4105o1637q1096l4287j21188
20295b09230k0085K6460J85826J30052J33933J11554o2473p1951k34030n1264
20285f1208M8442K0149k2498K2730q2327j1655k5563K09622N5478j56073q4178
$$ y = [-102699, -138038, -75293, 28693, 70056, 172886, 180281, 161766, 224519, 77306, 52583, -138560, -327469, -341013, -189145, -104880, -92868, -14854, -202796, -360073, -290181, -279697, -226314, -153520, -136617, -33457, -24120, -174711, -129627, -97732, -91922, -187795, -48790, -93786, -140637, -124304, -181662, -280073, -164396, -106865, -199042, -44017, 65053, -11000, 144590, 108248, -3273, 26258, 3318, -47026, 2797, 42833, -3854, -46378, -182334, -153652, -10276, 984, -114949, -79089, 77238, 123083, 88978, 27341, -53755, -88042, -209230, -229315, -202855, -17029, 113023, 246956, 358510, 296037, 224086, -9944, -61208, -12766, 7383, -15115, 7615, -74712, -86367, -111930, 97692, 153170, -2903, -87081]
20274h7081Q6414M7047p2655k81396J6587j36918J47802J84869J22954N7277K3272
20263A08172M4605O28o2602J40139l448Q377j59883j7840P013J11779J13119n8032
20251B32027k02488n1773m5318O7709L2305j45499n6413J38155J13967j0264o7199
20240E209j8227m0853m7662o6515K3124r9102M9209j21952K3670J51084p4805
20229b16820j266J34196J30972J76791O9640l3897j51026j70333N0716P4131j72023
20218a08919R6300J50620O5167k8273j31779o5533M7291N129k5583Q750K2847
20207C6017j30840j58629m52J24088M0805R1331l054k08335k36119P0220N4017
20196c20951R3726J83518r6955q5678P7974N7596Q0633K23815O9770k7678k5541
$$ y = [-87081, -667, 46380, -26275, -307671, -291084, -428002, -280200, -95331, 27623, 84900, 108172, 152777, 153405, 90803, 230942, 227494, 235871, 75988, 58148, 65161, 176940, 290059, 232027, 29539, -22234, -67552, 157, 32462, -113037, -169450, -31295, 82672, 72408, 5209, -13018, -53871, -101533, -168048, -144924, -244026, -194817, -316769, -293099, -142015, -216820, -218086, -83890, 47082, 223873, 293513, 259616, 108590, -61743, -11027, 63104, -108919, -12619, 138001, 203168, 174895, 43116, -22417, 24874, 30003, 4420, 13170, 36017, -94823, -253452, -253904, -129816, -89011, 2320, -734, -209069, -445188, -374968, -320951, -227225, -43707, -140662, -226340, -148366, -90770, -10137, 213678, 283448, 255770, 230229]
20185B30229j86938k35399j92317O1807Q1953n0558N7931J09895M0880J08360
20175B5843J44456J07706J001l2113j18341j52575J32475P5234j18876J13723
20165A78533r6643j93262l2135k0115J6262M3938l2255o0826j74455l2275K7562
20154c75671K90488R7711m9979O2847N0103j07174O2478k7569j19699J07831N5223
20143D6589M5228k2384j9208m9510n1132L6601j24460k7987l3506l330N8609J65991
20131B1501J19827K8346k07425J6515K7057p6622n6211M0087N685M8836J8175
20120a4229p6700J37837Q5945k9157j25115j48310j5560J00253N3258R5707m2234
20109B1695J1817j19278j88910Q6300L2074P407M1003J33220J42500J2691L4829
$$ y = [230229, 43291, -192108, -384425, -322618, -240665, -291223, -233292, -123397, -82517, 25843, 170299, 278005, 279006, 246893, 128552, -24023, 108452, 183686, 64810, 178533, 81890, -111372, -143507, -163622, -147360, -103422, -135677, -196503, -370958, -403233, -375671, -85183, 12528, -37451, 25396, 75499, -31675, 30803, 3234, -116465, -8634, 46589, 91817, 69433, 50225, 715, -50417, -13816, -138276, -166263, -199769, -203099, -144490, 21501, 141328, 169674, -37751, -21236, 5821, -70801, -127012, -86925, -81240, -32404, -14229, -90929, 46908, 132853, 103696, -21419, -169729, -185289, -85036, -31778, 63929, 21695, 33512, -85766, -274676, -188376, -156302, -148895, -107892, 25328, 167828, 180519, 215348]
20098B15348j21978l4765K4989j0564J73476J55826j24125K1844m6513m2244r3296
20087A17998k4091P07k8600k57535k04582N2836J03221J36136j389j98686j04279
20076d08264J41525L6941j14847J89687P7535j56010p236n1604J24227J50303
20066a7743J00324K4356q3391J5857P9178p0066k8282J45927p1552k1911R3862
20055A66559K4678M5304n8487J27354o0190k40428j77809Q9630N5720R1382j1276
20044E2437p6255M0503k0469J76418n5059k79179j23375M4521R0727J6654J0379
20033a22698K3659N4677Q6050k3940j07350Q5619J24936P2875K51322j35831o7926
20022B41393M8791j67104j36934m3558l4794j583M1805l8240J0310r5756k0412
$$ y = [215348, 93370, 58605, 83594, 73030, 246506, 402332, 278207, 300051, 253538, 211294, 117998, 93907, 94614, 66014, -191521, -396103, -343267, -240046, -103910, -105299, -303985, -408264, -266739, -229798, -344645, -154958, -77423, -233433, -240669, -292273, -168046, -17743, 82581, 106937, 23546, 39403, 118581, 48515, 20233, 166160, 94608, 72697, 166559, 191237, 236541, 178054, 305408, 245218, 4790, -173019, -83389, -27669, 63713, 52437, -23818, 16685, -3784, 172634, 117575, -161604, -284979, -240458, -149731, -133077, -122698, -99039, -44362, 41688, 17748, -89602, -3983, 120953, 193828, 445150, 309319, 241393, 290184, 123080, -13854, -57412, -92206, -93789, -51984, -90224, -79914, -175670, -196082]
20011a96082P0917k0960k9126o7845l2956K93814j64031n4433L7171j975M0501
20000a25005O0661J23227K9684J32027K1180q4049K9009K7673q4341m6793l176
19989H0097j09002J20980J70267j25961m5225K0266j13248O7990P0483j39164
19979b517R3408p6423N3528j65562k8868K2360O364m1397q0707K8571M9516R0208
19967e1519O3778l7453k4345n9346k02000r461N7620j22191R5863j7235o4478
19956c70767K4734O0047J39653o7239R1293P5347p9857q5706j1816K2211m2107
19945b44207j24829l7744N9001J04676K08572l2119J2394R8384j71243K4225m0232
19934a43122o4059J1903m0366P7737Q0218P313L6480N407R5542j5855k66658j20222
$$ y = [-196082, -125165, -146125, -175251, -243096, -276052, 17762, -146269, -200702, -163531, -165506, -125005, -64344, 58883, 88567, 220594, 241774, 157725, 186734, 214407, 130066, 83273, 80097, -28905, 92075, 262342, 136381, 91156, 111422, -1826, 66164, 136647, -2517, 90891, 14468, 67996, -97566, -126434, -104074, -97710, -139107, -219814, -191243, -141727, -51519, 12259, -25194, -49539, -108885, -310885, -320346, -262726, -384917, -289054, -306289, -370767, -346033, -285986, -146333, -213572, -122279, -46932, -126789, -212495, -224311, -202100, -244207, -369036, -406780, -347779, -243103, -34531, -66650, -54256, 44128, -127115, -102890, -143122, -207181, -195278, -235644, -157907, -77689, -70376, -33896, -28489, 67053, 51198, -215460, -335682]
19922c35682J47037P9213L2609l2860r0715J6411J08440r3664o193R9756N7760
19911a7888n0340J9236m9652j8181o0712R2330J95806J15789O0838k81165j00729
19900i4668J69571k7729m4192j72039j1847M331j7758j5717J30351L0404o6571
19889a15864J28248K1059m2630M5906M0243q2459q926j7139R3596M8519j25255
19878a4702n0155p0080l0075l6252j1295j49326J48439M979m1941m2868J32097
19867a61179K5902J64874J78136n1383p7524m7604j4437J9659q8958k17813Q3657
19856a86670J85151J15369o0025q0821j50132r3455M9678l8064K5927K54798P6728
19845I8484k08787q098J0403J1594O8986J99881N7063k62126k43136J43562j1429
$$ y = [-335682, -188645, -109432, -76823, -109683, -200398, -183987, -75547, -169211, -175404, -75648, -17888, -68228, -48992, -98644, -116825, -177537, -85207, 110599, 226388, 287226, 6061, -94668, 74903, 47174, 2982, -169057, -180904, -176573, -194331, -210048, -79697, -49293, -115864, 12384, 33443, -9187, 36719, 76962, -5497, -14423, -31562, 62034, 110553, -14702, -64857, -134937, -165012, -201264, -212559, -361885, -213446, -208467, -250408, -293276, -161179, -135277, 29597, 207733, 156350, 78826, 31222, 16785, 36444, -52514, -270327, -186670, -1519, 113850, 53825, -26996, -177128, -270583, -220905, -258969, -233042, 21756, 98484, -110303, -118401, -107998, -96404, -27418, 172463, 229526, -32600, -275736, -132174, -143603]
19834a43603J8571J11853j26332M8816O121j0809K7352J31801k1892o1968R8638
19823G8548o8364j27976K46581M5029j61931P742j9141j25857j243N101M0783
19812h0728J86904j38030l2835l0826J6201R0879n2680m8706k01020j31375J9857
19801d02359J95236K00254J1121j62148k0658J45218j9276O4284k4943k25342
19791b38613j69845K8898J97881O7967o0672k5718K3607M5171j42231k6279M1362
19780b58472Q1844k5292j5960m0499j08269J06460J18986K63709m0874j60887
19770g9254M5507q6777j8467m9639j5962P5317L2525j42062K9501P7023j46240
19759b78528N9158L119j15012j57639K35946K11408J1885j58755k6765j1036K6193
$$ y = [-143603, -125032, -13179, -139511, -90695, -84574, -95383, -68031, 63770, 41878, -20090, 78548, 10184, -117792, 128789, 173818, 11887, 19629, 488, -125369, -126612, -121511, -80728, 106176, -31854, -64689, -95515, -79314, 11565, -41115, -89821, -290841, -422216, -402359, -207123, -6869, 4252, -157896, -178554, -33336, -52612, 11672, -13271, -238613, -408458, -379560, -181679, -113712, -174384, -200102, -176495, -131324, -273555, -299834, -258472, -176628, -201920, -217880, -258379, -366648, -260188, -141202, 122507, 81633, -79254, -33747, -120524, -138991, -188630, -204592, -129275, -96750, -238812, -209311, -132288, -278528, -219370, -216251, -331263, -488902, -252956, -41548, -29663, -188418, -215183, -226219, -200026]
19748b00026P7275j28158j65751M2894J7711L8976J48476K01786P2744k55044
19738a49117p3220N4516k9932J72029J88550K63955J11691q9886k64133m7424
19728A37029l9269J55220K8690L2768m0125j96734N8516P6368j706J30734O4042
19717D05533J49243K0476j07377p8032p1864Q0673K00228J47302k37927k70032
19707B38223o2530K326j30500j36307N8000J99764m7670o9054k10851p3663l2227
19696b64489J12206J66170J4071n8429M567p5342k64745j12859P864O1605J06900
19685c02481R0762P0118L0321J00543n3314k5003M3518K60583o4889p1650q9320
19674a0812N7355j19078p704K7864r0635o9287q2448Q8553k1997O7092P5679j43526
$$ y = [-200026, -122751, -250909, -416660, -373766, -356055, -317079, -168603, 33183, 105927, -149117, -222337, -167821, -197753, -25724, 162826, 426781, 538472, 448586, 184453, 137029, 97760, 252980, 281670, 314438, 274313, 77579, 136095, 212463, 210757, 341491, 405533, 554776, 575252, 467875, 389843, 317979, 398652, 598880, 746182, 508255, 238223, 175693, 178019, 47519, -88788, -30788, 168976, 121306, 52252, -158599, -232262, -264489, -152283, 13887, 27958, -30471, -25904, -101246, -365991, -478850, -470986, -409381, -302481, -211719, -141601, -111280, -10737, -64051, -89054, -45536, 215047, 150158, 78508, -10812, 46543, -72535, -80239, -52375, -143010, -212297, -294745, -206192, -228189, -161097, -85418, -228944]
19662b28944p3642L6697r024J25505R0337J03205N7377Q9726p8660j78778M2148
19651b4053q9121k71519k5563K02508O4689p865k8865J30466J31967j01165j58723
19640a77244k9530J4593J67654K49878Q7215j28781l27035J48510R4996P5369
19630A75625l4296N0475j11044j20503L6919o0010j47812M166Q3007J04937k25003
19619b43539J24579J08832k2630k8416j88138J4290l8044r4123R4828K4615J47081
19608a00665N2898J09563Q5927L0872n8259j80549j10973o5117o3009J02988J56207
19597d0117J66282j30365j30145j8339k27602M3880K03956J20516N1877M3228
19587H3171n1158j04238J5310q0286j49647l6265J33732O2407R57j6193L936Q6709
$$ y = [-228944, -302586, -265889, -274913, -149408, -59071, 44134, 101511, 191237, 112577, -66201, -24053, -113174, -384693, -410256, -207748, -143059, -150924, -179789, -49323, 82644, -18521, -177244, -206774, -192181, -24527, 225351, 312566, 183785, -143250, 5260, 100256, 175625, 141329, 191804, 80760, -39743, -2824, -62834, -210646, -206480, -123473, -18536, -243539, -118960, -10128, -32758, -61174, -249312, -235022, -273066, -367189, -272361, -247746, -100665, -47767, 61796, 147723, 178595, 120336, -60213, -171186, -236303, -299312, -196324, -40117, 126165, -4200, -134345, -152684, -380286, -336406, -132450, -11934, 39943, 83171, 32013, -72225, -56915, -137201, -286848, -323113, -189381, -126974, -126017, -142210, -138274, -51565]
19575e1565J1087J22883m121K1584m4705j25128j31686R4181J14502l0942K5760
19564A850J06223P7398N5073k00367j22677L1347j6443j31979k27345r1678j7144
19553e35742K16555J80263Q453p9636o7715k9091J18882Q7423O1608l8743L730
19542g4013j02447k4907M6539Q9784m8090k5380J7677M2630P805P6416m88N8111
19530F3637M918J53926k4854j36273k08848l2682K29264L8354M8241R896r6156
19519D9423m5921m6640k6551j66136l0483L2947l1801K78212J17055J06377p8083
19508A58399J21594p0677q9391m6064l3503N2926Q2022j8925k22806j63538j31974
19497c61937J29129J34803r7067J09679O1355q3405M115p1350j11131P6127J30752
$$ y = [-51565, -40478, 82405, 78284, 99868, 55163, -69965, -201651, -107470, 7032, -23910, 1850, 108073, 185471, 240544, 40177, -82500, -51153, -67596, -199575, -426920, -518598, -535742, -319187, -138924, -130471, -210107, -277822, -306913, -188031, -100608, -39000, -77743, -74013, -176460, -201367, -154828, -65044, -113134, -138514, -120837, -78207, -70402, 6014, 5526, 63637, 68555, 222481, 197627, 61354, -147494, -180176, 49088, 87442, 135683, 145579, 49423, 3502, -43138, -69689, -235825, -266308, -233361, -265162, 13050, 130105, 236482, 158399, 279993, 209316, 119925, 73861, 40358, 93284, 175306, 156381, -66425, -229963, -361937, -232808, -98005, -195072, -85393, -24038, -107443, -103328, -174678, -285809, -209682, -78930]
19486g8930L0564j38701k9973k3318J01317P8910p4164Q6579K8178p3375Q5919
19475f994M1910P804O4882j34485J6899N4017j8410M8924m4358N4562j420p4676
19463H655j08913k9075n2481P4008l1387m0842O1049J63820k689r4458k7400P541
19451g2172j08096j04060j479l7442J9895J57108J04391O9855p4105k8314M9714
19440b4705n689n4863J13315p893R4298r4676k53815j32077l9812j0645r1348
19429e07910K9545K21951J68418m7410k33641l8468K75483M8773O6980m0335j40744
19418a97358M7663n459N0285r1830N2120L8626j5883o2714J24073N4053p4094
19407h0518j14271J39798j18208l9107N4480N6513O7244k3681m2276j2157J39408
$$ y = [-78930, -48366, -187067, -217040, -240358, -139041, -60131, -134295, -47716, -19538, -92913, -6994, 34916, 42720, 107602, -26883, -9984, 44033, 25623, 74547, 30189, 84751, 83331, 8655, -100258, -129333, -181814, -107806, -139193, -180035, -118986, 44834, 42145, -52313, -79713, -72172, -180268, -284328, -285807, -323249, -303354, -146246, -41855, 28000, -46105, -74419, -24705, -30394, -85257, 28058, 20165, 114463, 19787, -234028, -366105, -405917, -416562, -507910, -478365, -256414, -87996, -135406, -369047, -407515, -132032, -83259, -16279, -56614, -197358, -149695, -155154, -104869, -196699, -144579, -105953, -121836, -184550, -60477, -6424, -80518, -194789, -54991, -173199, -212306, -157826, -101313, -34069, -57750, -100026, -112183, 27225]
19396B7225J55059j9471j2818N2287m9186L5705J01580k58125j66928o7439k5250
19385b27361N7079Q0385L8440M744o5346L0279J32333L5690J53208r4073j63781
19374a8403k64610q9046J0529J575J36718J43732l6892p089j59140r6635Q1263
19363b97998L1233j33290O1895N0648K10856J99581n0146k24361j06110Q5385
19353a72307J99801O648q125J23133J23430l557m7629o7729j36163r7325j41713
19342b21536N8020P2803k3312J36511O8866L08952J36307j98661j34781m2333
19332A60836J04263J41052K9970O0108j60341q6270l8660r9935O5591m8444n3179
19321G4991r9705k4880j8629j5847N3491j14771M6291J15041n7986R106K7957
$$ y = [27225, 182284, 162813, 149995, 202282, 153096, 188801, 290381, 32256, -134672, -202111, -227361, -170282, -89897, -51457, -46713, -112059, -81780, 50553, 86243, 239451, 145378, -18403, -283013, -372059, -361530, -359955, -223237, -79505, -116397, -123486, -282626, -379261, -297998, -266765, -400055, -338160, -287512, -76656, 122925, 72779, -151582, -257692, -172307, 27494, 34142, 26017, 149150, 272580, 269023, 221394, 153665, 17502, -79823, -221536, -163516, -90713, -114025, 22486, 91352, 400304, 536611, 337950, 203169, 160836, 265099, 406151, 436121, 496229, 335888, 249618, 210958, 111023, 176614, 128170, 74991, -24714, -49594, -68223, -84070, -30579, -145350, -99059, 15982, -42004, -32898, -4941]
19310d941j66782j8978K13765J23754n7209l5770l7639j11680q463P8524M9218
19299B3799o3100j69276O0969J02189J55492N83J981j25136r1177J54475P173
19288E7972K2555m905M9103r3676j84572r4722l7739k1841Q1366o9844M3440R497
19276b43366K1027J6209m6353M7833J57045r0110L087q9248j6114o2550r3676
19265c96216q0272k0963n5434J48691J03075K3526j00694p2973j75660o9635K06634
19254d89921J57335O2503M0214j06934j0884k30161N7896J4508J3551q64P3735
19243d19022J23607J40553J64429J11045O733j26010j37710k30036J16145Q0316
19233a69950P5852k2574K913j2921J3040m3195J39283K1742L8838O144k14908
$$ y = [-4941, -171723, -190701, 23064, 146818, 89609, 53839, 16200, -95480, -103943, -25419, 23799, -39301, -208577, -147608, -45419, 110073, 110656, 112637, -12499, -103676, 50799, 57972, 80527, 75622, 124725, 31049, -153523, -248245, -285984, -307825, -226459, -296303, -252863, -243366, -222339, -206130, -252483, -204650, -47605, -137715, -134628, -223876, -239990, -302540, -396216, -476488, -497451, -552885, -404194, -301119, -277593, -378287, -451260, -626920, -696555, -489921, -332586, -270083, -229869, -336803, -347687, -577848, -519952, -505444, -491893, -492757, -419022, -295415, -154862, 9567, 120612, 127345, 1335, -136375, -366411, -250266, -169950, -94098, -116672, -113759, -126680, -113640, -156835, -17552, 4190, 43028, 49172, -165736]
19222a65736j03558M1701J18561J3653m147O4542l1902K63492J49480l2932j38472
19211A74682j00755J49493N6494p0182n016M2398K1483M0556p5451J25741J99946
19200E59389J60413J78204L41523N31724N80384L00014p3177j90229J00184j5555
19190B472874k36922m03764k34541j32991n0895L66734L53368Q8847K15781K45670
19180B684161O83053P30141N81208M78236K96681L58561N68117P39155O30063
19171G749376P83230J520635K474992L867282O167082Q412118J0010446J1151712
19163E2136873J3268378J8852513K2630943R731987r823087q945964K090373J738860
19155A01680876j6688624k4174371j6182476q016434k913180J055480M724673
$$ y = [-165736, -269294, -227593, -109032, -95379, -99526, -34984, -66886, 196606, 346086, 313154, 174682, 73927, 223420, 279914, 209732, 204716, 247114, 268597, 309153, 233702, 359443, 559389, 719802, 898006, 1239529, 1771253, 2351637, 2651651, 2578474, 2388245, 2488429, 2472874, 2235952, 1832188, 1597647, 1464656, 1413761, 1780495, 2133863, 2222710, 2438491, 2684161, 3367214, 4097355, 4678563, 5156799, 5453480, 5812041, 6380158, 7119313, 7749376, 8532606, 10053241, 12528233, 16395515, 22562597, 30974715, 40985161, 52136873, 65405251, 84257764, 106888707, 116620694, 106797607, 97851643, 99942016, 101680876, 84992252, 60817881, 44635405, 36618971, 33705791, 34761271, 39485944]
19148C9485944P855386R568007J0805867J4980328K1701557J8982559l300874
19141A20078774j4762192n360318L020236p914374k5149380k3292082j4288534
19134C2332130q322559n197902l618087k504916j533114j180250j113488q09301
19126H052513n70012m33489n11381n49833p48924n54614l84096m84584k86351
19117C529229l34395k47218j35750k16473j94997q6906J26773j5087J07336R7821
19107B630333M0722j99894p4850K3268j74729j88374j64645q4587j8088p5914
19097A713242k73343j99126L6350O0017j51932j60336R6874j71377m3100o850
19087I00419M0510j62202M7720J70390j33573k36005l877q4561J22764P0422J00045
$$ y = [39485944, 47341330, 56909337, 67715204, 82695532, 104397089, 123379648, 120078774, 105316582, 99956264, 102976500, 95062126, 69912746, 46620664, 32332130, 24009571, 18811669, 15193582, 12688666, 11155552, 9975302, 8861814, 8052513, 7482501, 7049012, 6537631, 5987798, 5238874, 4684260, 4300164, 3815580, 3529229, 3194834, 2947616, 2811866, 2595393, 2400396, 2313490, 2440263, 2425176, 2532512, 2630333, 2671055, 2471161, 2396311, 2419579, 2244850, 2056476, 1891831, 1807244, 1789156, 1713242, 1439899, 1240773, 1277123, 1337140, 1185208, 1024872, 1121746, 950369, 907269, 900419, 940929, 778727, 826447, 996837, 863264, 627259, 623382, 538821, 661585, 732007, 832052]
19076H32052k2342J17803m715j93071n6981n9108p5029K7205P1170J6337J3394
19065F66715n6446M829n7244j22417J03501J859o2087o682k8356r2759j14725
19054B36188Q129R6964l2239K285j1927O270q0640N7562L9233K39083K71211j18996
19042G13123j61950j29396K6955K13274r2663k46928K279q5608M098J45679R1652
19031D80515r9278l7359K03087O4665k47719j65211P9804J65658n9934l3139p2389
19020B78700l6784j38674j9035J96331q8228M2490J53669j93511j80750j01329
19010h7121l9812J58128L9209L8702O3473j55577j22541J14195J401k3784N0201
18999C6474L0393j0269l5895k6695k2476N1657J50594M381J14513j6k7407R2410
$$ y = [832052, 809710, 927513, 922798, 729727, 672746, 613638, 538609, 565814, 636984, 653321, 666715, 610269, 615098, 557854, 435437, 538938, 540797, 478710, 472028, 443672, 350913, 236188, 244317, 341281, 309042, 311327, 299400, 305670, 225030, 282592, 321825, 560908, 832119, 713123, 551173, 421777, 448732, 662006, 569343, 322415, 324694, 239086, 243184, 388863, 480515, 381237, 343878, 546965, 611630, 363911, 198700, 278504, 444162, 384228, 351089, 278700, 241916, 103242, 84207, 280538, 192310, 234800, 388469, 194958, 14208, -87121, -126933, 31195, 70404, 109106, 172579, 17002, -105539, 8656, 10057, -13727, 36474, 66867, 56598, 20703, -5992, -28468, 23189, 173783, 178164, 292677, 292661, 265254, 357664]
18987C57664k46488k9648o5844k44652q023J85248J36846J31292k3974m6902o2500
18976H3019j19688N8162K7209n047K8251q844l9333j89163k6865Q9212O3412P2822
18964C3147j15757l6809J45672J36320l9024K4287j20303K4404m9621k8530M7094
18953B0880j29533N1791K3854K3534j0751J259L9226J13309Q8325q1503J9228
18942A59619Q8834J2789j9861q9693J6850L5815K0229j02441q7732m0834p0122
18931g6547J1269q2863j10297j26663N3698K98023j382O7545J14643L9910l9352
18920A47984P5L0171k4326j38159m531J66499L7731J8238k438j06831k1102L3850
18908A37161l1911j47387l5440q0206J6765K89318R6010R0280n1039j62002m339
$$ y = [357664, 111176, 81528, 15684, -228968, -236991, -51743, 85103, 216395, 192421, 145519, 83019, -36669, 21493, 48702, 43655, 71906, 63062, 23729, -165434, -192299, -103087, -39675, 33147, -82610, -119419, 26253, 162573, 123549, 147836, 27533, 51937, 2316, -26214, 20880, -108653, -56862, -33008, -9474, -20225, -18966, 20260, 133569, 221894, 140391, 159619, 248453, 261242, 241381, 151688, 168538, 204353, 224582, 122141, 34409, -6425, -76547, -65278, -148141, -258438, -385101, -331403, -33380, -34762, 32783, 147426, 187336, 147984, 148059, 178230, 153904, 15745, 11214, 177713, 215444, 233682, 231244, 124413, 103311, 137161, 105250, -42137, -77577, -157783, -141018, 148300, 244310, 334590, 283551, 121549, 117210]
18897A17210l1468K31313n9865J6236r1490j45277J09822n8495q5730P0994N4783
18886A28033N4524j65980r7912M5320K5085j4300L0248J76498n4715J0879R3398
18875B31078Q385k5344j09177j30757p3207L2474j26319j09433J44422J86231
18865B8353j82012J5038K23178J49089n7736M1315Q0202J33057J03129M4387j13491
18854D64509j5326j29596n8693q0773m9716l8929j45529q5466K811P6924j6948
18843g6732M067R7434L2527N875J0837K21566K38079j47282l7349j19922P5731
18832C04831R9418n9675j31452k04221l0336o480J03315K0844j11533l1823L5413
18821a1699J03112J22950j64809m6971k8201P4050j08186j07083o234Q7764l0837
$$ y = [117210, 85742, 317055, 257190, 273426, 181936, 36659, 146481, 87986, 2256, 73250, 128033, 182557, 16577, -81335, -36015, -10930, -25230, 5018, 181516, 126801, 137680, 231078, 239463, 214119, 104942, -25815, -99022, -66548, -192867, -302300, -157878, 28353, -153659, -138621, 84557, 233646, 175910, 217225, 297427, 430484, 533613, 578000, 464509, 449183, 319587, 260894, 180121, 130405, 91476, -54053, -139519, -136708, -59784, -76732, -72665, 24769, 57296, 63171, 74008, 295574, 533653, 386371, 349022, 229100, 304831, 404249, 344574, 213122, 8901, -21435, -27915, 75400, 96244, -15289, -47112, -11699, 91413, 214363, 49554, 2583, -25618, 48432, -59754, -166837, -173071, -85307, -116144]
18810a16144L658J08551J27904l0910K4783P3299k46660l3963J49904l0125o7155
18799c6858K69095J19109o2929L4858L572k00817q1734M627k6337Q4811P837L8498
18787A53732R7162k6397j13108p1335P896O9462J00447Q7060K9085k33196k2533
18776G8275j88299r870K2691O243J97619J51900J01340J25751J82499K86803M85574
18765A440526L53869k79008p80237m34313o1616J30813l1269j84027r6194j30109
18755g1565Q6987l1495j04738k6530M8145k03764j14278K26341J70622J81210
18745A60935J77852O0632J25223K07156k6565k69407k31648m9043p3795j50135
18735f8795L9185J9368J39325P5281Q8978k0477N0918j93875Q7429k8844O0630
$$ y = [-116144, -112486, -3935, 123969, 93059, 117842, 191141, -55519, -89482, 60422, 30297, -36858, 232237, 351346, 288417, 323275, 326847, 126030, 44296, 48923, 22586, 107397, 115234, 153732, 250894, 224497, 111389, 40054, 47950, 117412, 217859, 304919, 334004, 100808, 78275, -110024, -119894, -97203, -90960, 106659, 258559, 359899, 485650, 668149, 954952, 1440526, 1794395, 1515387, 735150, 300837, 239221, 370034, 338765, 154738, 58544, -71565, 15422, -16073, -120811, -147341, -99196, -302960, -417238, -190897, -20275, 160935, 338787, 399419, 524642, 731798, 705233, 435826, 204178, 155135, 81340, -68795, -29610, -10242, 129083, 204364, 293342, 272865, 323783, 129908, 217337, 188493, 249123]
18724B49123J550j09299k6801k06421m2656j0612K103P1709k8604J2608k6167
18713a13467o0763J07734m8655l1419n5100j05377K16088J49537N6406j65001
18703e0017j2750L1095j10092j88717j1262O5976K05571O561l7460j18638J21465
18692i8268J42657l523J17003J29092J66290O9977O7547j95653k73260L008k5766
18681I9104J86872N3976j9711m6331o241j00787j54281Q468K01972J23847J14914
18670D61802R2864l2177o6399p4199k31136j48287r5969K8486r570M1148m2081
18659g5518P751Q527Q9474n3205j4706l6046k3492M8938q7570O2500l5744j3029
18647a22120R7952R1779J23554l4409j75796K3063M2015J9634q182J26028L8581
$$ y = [249123, 250673, 141374, 114573, -91848, -134504, -145116, -143013, -71304, -99908, -87300, -113467, -174230, -66496, -115151, -146570, -201670, -307047, -90959, 58578, 114984, -50017, -62767, -31672, -141764, -330481, -341743, -275767, -70196, -63635, -101095, -219733, -98268, 44389, 40866, 157869, 286961, 453251, 523228, 590775, 395122, 121862, 124870, 99104, 285976, 339952, 320241, 273910, 267669, 166882, 12601, 21069, 223041, 346888, 461802, 554666, 522489, 456090, 381891, 150755, 2468, -93501, -65015, -74585, -33437, -75518, -67767, -59240, 30234, -22971, -37677, -73723, -97215, -48277, -135847, -73347, -109091, -122120, -24168, 67611, 191165, 156756, -19040, 4023, 46038, 65672, 57490, 183518, 222099]
18636B22099j30811Q6973M9496j37487j60766r5710J7268k789n3438M6040J7254
18625a41871K4663M0705L0174J07908k3801r0161K686N3925J24848n7959j73170
18614a02053j19879j87636J32306J91765J15612R2373j39735p5180m0948j28013
18604b61388k2749P9524q3726J34723P0773p318K7553n8806J02463K3647N2188
18593E6884l0492O7916K1143k57317m0207O5303J03588J38160k496J80338J73589
18582D76409N8953l9947J791l689p2966K7163j1231p6598j89857j35615J7788
18571E2201k6335N3308J74591Q402J66970Q5606J74980j08981j42418p3159q025
18560C57140j9368J27831o2082r0446q4778k64128j72629k4235M9275P1334N3844
$$ y = [222099, 91288, 178261, 227757, 90270, -70496, -166206, -148938, -151727, -205165, -159125, -141871, -117208, -76503, -46329, 61579, 37778, -52383, -49697, 4228, 129076, 71117, -102053, -221932, -409568, -277262, -85497, 30115, 122488, -17247, -92427, -133375, -261388, -284137, -204613, -288339, -153616, -82843, -90161, -62608, -121414, -18951, 4696, 56884, 26392, 94308, 115451, -141866, -182073, -116770, -13182, 124978, 122482, 302820, 476409, 535362, 495415, 497206, 493517, 420551, 447714, 436483, 359885, 170028, 34413, 52201, 25866, 79174, 253765, 262167, 429137, 514743, 689723, 580742, 438324, 365165, 357140, 337772, 465603, 403521, 313075, 228297, -35831, -208460, -232695, -183420, -112086, -58242]
18549e8242N5426J17322L241M0389m1952k72906j19323J54157K70619j0425j64369
18538b6063r7912k2623J91083m6328o1779m7429j47592j7342n596o2415Q547K6492
18526c08957J34749J79011o5936r9170j12993p2954Q2531N5834K62296j5504j26906
18515h7999O0215j74570m5319J43016P3636m2653K2115J08393l3582j39415J3387
18504a02776k291k1182K3089m6710q32p5956P9526K6927N0093m4952M5712m6797
18492a16149Q1300l3061j51663k4172K8063O640R7892O0408j14375L861n4640
18481b15896q104R3867m512n6676R9645K5109k4654M9777J10609k7668J13913
18470A55410l8241j79075j54752n6687N366J53538n816k558k2515j11726o0612
$$ y = [-58242, -2816, 114506, 117747, 158136, 116184, -156722, -276045, -121888, 148731, 138306, -26063, -123975, -146598, 44485, -1843, -63622, -111051, -258643, -275985, -281581, -343996, -335449, -308957, -174208, 4803, -61133, -160303, -273296, -346250, -263719, -207885, 54411, 38907, -87999, -27784, -202354, -247673, -104657, -31021, -73674, -51559, 56834, 23252, -116163, -102776, -105067, -126249, -103160, -149870, -150702, -226658, -147132, -120205, -70112, -115064, -69352, -116149, -34849, -67910, -219573, -243745, -215682, -209042, -111150, -50742, -165117, -161256, -215896, -224000, -130133, -134645, -191321, -91676, -66567, -91221, -41444, 69165, 41497, 155410, 117169, -61906, -216658, -273345, -267979, -114441, -120257, -122815, -145330, -257056, -317668]
18459c17668Q7756R3841P215J32419j89194k02665J4824J99519J62422j5580J3498
18448a3613Q4090J24250o2701k5814r8979p7774M8416M0686q3734o4136O8886
18437f0423Q400J40831L4396j39496l497j625j35000m5482k13113N9332R3622
18426b62055j03852R2012J05852J696k7364L0129M8385p8551K2799O2023Q0686
18415b8240K5283o7335n3522M8539O2667o9377j17380n5809m9098j9803Q3755
18404b40320m5120K226P9590J0865m3632j2068K8347k522J59574J24282o8249
18393g027j40250P7252M9832K1278J78636J5109l5396M1706O5370k9744j48428
18382H8338j55195p1227q8501n5777o9366o7043K0348J66228K31801J71087p7278
$$ y = [-317668, -229912, -136071, -128856, 3563, -185631, -388296, -373472, -173953, -11531, -27111, -13613, 70477, 194727, 132026, 106212, 7233, -70541, -22125, 18561, -65173, -129309, -60423, -52023, 88808, 123204, -16292, -19789, -21414, -156414, -201896, -415009, -355677, -262055, -365907, -273895, -168043, -166347, -193711, -163582, -115197, -193748, -170949, -108926, -28240, -2957, -70292, -123814, -75275, -12608, -81985, -199365, -255174, -304272, -324075, -240320, -285440, -283214, -203624, -192759, -236391, -248459, -220112, -222634, -63060, 61222, -7027, -147277, -70025, -20193, 1085, 179721, 194830, 159434, 201140, 266510, 236766, 88338, -66857, -138084, -226585, -282362, -351728, -418771, -398423, -232195, -394, 170693, 93415]
18371I3415O5498j37111n6399O3053o4119o0602Q7586j53853p4145J14840J6293
18360a05544J13876m2517q9489J23948Q5197J03328j88862j33454k3868R0785
18350f6600P0441o3318k1971k23747n744p1829P7057J49681L0108J12632Q8343
18339G5053k3124k33710j2339j2449j18806j8973P0757J82615o4913m7150R2691
18328a10348o3555J33292J79740O9787j43256l03742j62284j5269J25941K0654
18318b69040k9475O9946q1701n1188K03295J97246j32967J13711N0422p1495j33767
18307a35013j21178L1866K50711k2558k0436Q348l4566k10868j81110r2361K9616
18296d97549J89873K49531M6003P5464L259J25770L7571l7350r0216q8039o2515
$$ y = [93415, 158913, 21802, -34597, 28456, -35663, -96265, -8679, -162532, -236677, -121837, -105544, 8332, -34185, -123674, 274, 85471, 188799, -63, -133517, -157385, -66600, 3841, -59477, -81448, -305195, -310939, -382768, -305711, -156030, -125922, -13290, 75053, 51929, -181781, -194120, -206569, -325375, -344348, -273591, -90976, -155889, -203039, -110348, -173903, -40611, 139129, 208916, 65660, -238082, -400366, -415635, -289694, -269040, -298515, -228569, -310270, -361458, -158163, 39083, -93884, 19827, 70249, -1246, -135013, -256191, -224325, 26386, 3828, -16608, -8260, -42826, -253694, -434804, -527165, -497549, -307676, -58145, -12142, 63322, 66581, 192351, 229922, 192572, 102356, 14317, -48198]
18285d8198j09113p8102R7834R9887J35055L1611j01185j41040k0290Q6201J361
18274d5979j48219r4688o4878J7580J43289J1318N2621J33292N0599J18708k7576
18263A46067J58942J33880r8781p386O4346J62400P1198j50571q6520N3952P0426
18252E17953K5208q0100L81366L79946N9821r7430J32742K60666L74918M56377
18242B411467J68693K88900M29309L93851N28609J088431J512362K229923L952654
18233A3004199N940268Q040009Q945413Q254152R803711J6890789K0775327p011782
18225H4642086l0436936k1649974j0973215n630537k767197j323837k64982J037027
18217A2632435K373122M263206O358477Q049684Q168388Q048167J1643945J8864900
$$ y = [-48198, -157311, -235413, -137579, -37692, 97363, 128974, 27789, -113251, -133541, -47340, -45979, -194198, -288886, -353764, -336184, -192895, -181577, -128956, 4336, 54935, 173643, 146067, 305009, 438889, 340108, 332722, 397068, 559468, 630666, 480095, 393575, 447527, 517953, 543161, 463061, 844427, 1224373, 1284194, 1186764, 1319506, 1580172, 1955090, 2411467, 2580160, 2869060, 3298369, 3692220, 4220829, 5309260, 6821622, 9051545, 13004199, 18944467, 26984476, 35929889, 44184041, 53987752, 70878541, 91653868, 84642086, 54205150, 32555176, 21581961, 15951424, 13184227, 11860390, 11595408, 12632435, 15005557, 19268763, 25627240, 33676924, 41845312, 49893479, 61537424, 80402324]
18209H0402324J0101916k2817240k7518369j5150434p795062m236489k606198
18202A0380448j529597j006598r83746r32795n30654j74822k16656k09026K1899
18193D818453l26615n27243j86304k2458J7276J72307M6679O8418M95717O78521
18183E234751N90554P07668J408042K148250L247095N347794Q048056R721143
18175C6453353R518456R552004J4555492K3188213J0512111k7260710l0487386
18168D6031533j6462612q462172m458629k146508o95439M43076J817573L412184
18160A9479006N892901Q518069R397084Q768176J0360453J7302063K0837003r117175
18152I1437580l3807262k3611265j1885067o340040l612303k084235j386877r57428
$$ y = [80402324, 90504240, 67687000, 40168631, 25018197, 17223135, 12986646, 10380448, 8850851, 7844253, 6860507, 5927712, 5397058, 5222236, 5005580, 4796554, 4818453, 4491838, 3964595, 3778291, 3755833, 3773109, 3945416, 3992095, 4060513, 4556230, 5234751, 5825305, 6532973, 7941015, 10089265, 13336360, 18684154, 26732210, 36453353, 45971809, 55523813, 70079305, 93267518, 103779629, 76518919, 46031533, 29568921, 21106749, 16648120, 14501612, 13806173, 14249249, 16066822, 19479006, 25371907, 33889976, 43287060, 52055236, 62415689, 79717752, 100554755, 91437580, 57630318, 34019053, 22133986, 15793946, 12181643, 10097408, 8710531, 7753103]
18144G753103p49024m38663l30264m49088m75645N4912j84086p71451m81690m59334
18134C468770l06624j24774J23474j30107K9442J97463K35362K64830K69010M41740
18124D468586N13710M10434L15417M91238J049714J741843K472404L237881M834567
18115A9535794Q120000J4109113K3854048L2920386L4519807K9035289L4077985
18108A96172422O7123966R5365647l5368526j37405739q3919354l8781692j9584477
18101D3602247j1378371p291506n295968l516350k494116k126228j460421j082804
18093H956483j243769p71210n82729n09656n17226l70205l64733l36874k42365
18084D017716l21005j26860k24369k79143o7380l5823l7773j04078j20294l7766
$$ y = [7753103, 7004079, 6565416, 6235152, 5786064, 5310419, 5365331, 5181245, 4409794, 3928104, 3468770, 3162146, 3037372, 3160846, 3030739, 3060181, 3257644, 3493006, 3757836, 4026846, 4468586, 4982296, 5392730, 5708147, 6199385, 7249099, 8990942, 11463346, 14701227, 19535794, 27655794, 41764907, 65618955, 98539341, 133059148, 162094437, 196172422, 263296388, 358662035, 323293509, 185887770, 101968416, 63186724, 43602247, 32223876, 24932370, 19636402, 16120052, 13625936, 11499708, 10039287, 8956483, 7712714, 6941504, 6358775, 5849119, 5331893, 4961688, 4596955, 4260081, 4017716, 3696711, 3569851, 3345482, 3066339, 2998959, 2963136, 2925363, 2821285, 2700991, 2663225]
18074B663225j63907J3848K2264j44891k3977l2361j0227j10026j51785K3534
18064B085697J29034J5922j59105j45265k11970m3674m5558Q6816J73553m6024
18054A839426j43273j20410M440Q3356N5947r5393j84596n0181p5732M3701Q4587
18043A441872j53279j02303q4799j11838j88223Q777K02846J86584Q5590R4261
18033A379488N0232j59487J6894j73187k45749N6445K92997j142m7392k00644
18023I68455o3040M8429N1955J0201l1867r3547k64007j16420k5443J46449J16291
18012G47456L4257J3593j45351k07937n0194k7137Q8499M7618J07578P2741j6998
18001F64125P1213M5032j71714j23645J12739P9319O0245j00111J2840r6184j02547
$$ y = [2663225, 2499318, 2513166, 2535430, 2390539, 2366562, 2334201, 2323974, 2213948, 2062163, 2085697, 2214731, 2230653, 2071548, 1926283, 1714313, 1670639, 1625081, 1711897, 1885450, 1839426, 1696153, 1575743, 1580183, 1663539, 1719486, 1624093, 1439497, 1389316, 1313584, 1357285, 1441872, 1288593, 1186290, 1101491, 989653, 801430, 810207, 1013053, 1199637, 1285227, 1379488, 1429720, 1270233, 1287127, 1113940, 868191, 924636, 1217633, 1216491, 1169099, 968455, 905415, 953844, 1005799, 1016000, 984133, 890586, 626579, 510159, 484716, 631165, 747456, 781713, 795306, 649955, 442018, 391824, 364687, 453186, 500804, 608382, 681123, 664125, 735338, 780370, 608656, 485011, 597750, 677069, 737314, 637203, 650043, 553859, 451312]
17990D51312J9220n6583J21783P8039q12j55990j32985N6674K3718m2480n5800
17979C06096M5673K1546J33172j01205j98651O3900M3680k5720O8281J46596J31548
17968F34916k04893j53099q5843o5506O5405R3618j56740m2844k4732j52882n956
17957i8556J38920J64958P37j78017j67663N0650J72412j25883M2444N6113m3509
17946A2606J4609J09364K2069J22702J20740J06053j29162k28483N2221J18739
17936C21458q8822O9331J048k6998l088L6492j18581n5073P8813L3771j5654j93014
17924C9683j61145r1824p552J33281L8514O7763P7424O0513j36350q0235N1303
17913h625J52355O8778n4193o6021j92682K4820K40351J59748r2234J3521R4467
$$ y = [451312, 470532, 413949, 535732, 613771, 612959, 456969, 323984, 380658, 404376, 361896, 306096, 351769, 373315, 506487, 405282, 206631, 270531, 314211, 288491, 356772, 503368, 634916, 430023, 276924, 191081, 125575, 190980, 284598, 127858, 85014, 60282, -92600, -98556, 40364, 205322, 206059, 28042, -139621, -88971, 83441, -42442, 2, 56115, 12606, 27215, 136579, 158648, 281350, 402090, 508143, 378981, 150498, 202719, 321458, 232636, 301967, 303015, 276017, 272929, 309421, 190840, 135767, 214580, 248351, 232697, 39683, -121462, -213286, -220838, -87557, -49043, 18720, 96144, 156657, 20307, -59928, -8625, 143730, 212508, 158315, 92294, -100388, -75568, 164783, 324531, 232297, 245818, 340285]
17902C40285o821M3013k81064k3747O1951j54597r2737J24622J61754l774Q1330
17891B50215j84378m2664J22574k502j05324k7199O9456R4204r6893P359k28827
17880a43979q6041o526O9563p9754O460J82299K0506J09811l2523J23889P8441
17869B42146J14632q841j90790M831j39966O0602M8461o6371k29841L0205K21166
17858H6234R3889P6208J61101j00965k01243n6527N2108j45543P5641J54487r9932
17847I5458j35975J39886p7032Q942J40047O0432j16537r4840j52080J35363J58572
17836A62236M8333J7174q023Q4586j52623j59187J07845R7563J1765N851j52027
17825F3493n5347L1305m6126j9994L0632Q4922l3571m6895N7887P1464J28953
$$ y = [340285, 333464, 376477, 95413, 71666, 133617, -20980, -113717, 10905, 172659, 168885, 250215, 65837, 23173, 145747, 143245, 37921, 10722, 80178, 174382, 77489, 84848, -143979, -230020, -236546, -166983, -246737, -240277, -57978, -37472, 72339, 39816, 163705, 242146, 356778, 347937, 157147, 161978, 22012, 82614, 131075, 64704, -165137, -134932, 86234, 180123, 256331, 417432, 316467, 115224, 58697, 110805, -34738, 40903, 195390, 95458, -40517, 99369, 22337, 31279, 171326, 231758, 115221, 20381, -131699, 3664, 162236, 210569, 227743, 219720, 304306, 151683, -7504, 100341, 197904, 209669, 215520, 63493, 8146, 39451, -6675, -26669, 3963, 88885, 55314, 8419, 66306, 137770, 266723]
17814B66723J445k29300P1067n0693j34088K3377J03349j9847j42250o4386K40603
17803F6000O1386p7523j93376J67661K04107K64942j04570j17228j9878p1348
17793A80173j31805k8858q0288j5909J45776K45629l897k08855j15316J36757
17783A23407N5581l1016K6837q7954j39353K7868r3588L6645K10933O3007N8297
17772B50664k3070n1153o2924p2903r0515k0790j03108O3072N9865J0433k8086
17761f8515Q8062n527J62605K11537k26476p8694L24292K97530K69827L4819k92422
17750G17038k12264l7872J09338L6315o7915o1746l19322r4577m4670k2044j46178
17739a43897R2017J70730P6646l951N9797p6522j48872q9261m0283J07374O9279
$$ y = [266723, 268168, 38868, 109935, 59242, -74846, -51469, 51880, 32033, -110217, -174603, 66000, 127386, 49863, -143513, 24148, 228255, 493197, 388627, 271399, 251521, 180173, 48368, 19510, -60778, -76687, 69089, 314718, 310821, 101966, -13350, 123407, 178988, 147972, 174809, 86855, -52498, -24630, -118218, -81573, 129360, 192367, 250664, 227594, 176441, 113517, 40614, -49901, -70691, -173799, -110727, -50862, -40429, -68515, 19547, 14020, 176625, 388162, 161686, 82992, 407284, 704814, 974641, 1009460, 717038, 504774, 466902, 576240, 612555, 544640, 482894, 163572, 68995, 24325, 2281, -143897, -51880, 118850, 195496, 191545, 251342, 174820, 25948, -63313, -103596, 3778, 73057]
17728G3057m466n4691m7995k1509J50225J25593j7374M1176k5617n5641j2525
17717A50233O6349j46876j86412J12578N5555m8955K8689J21600P4661J72786
17707D00208J94612j16358j29703M8441N864O9390J75952J23196J3738K04892
17697I90232J87078j99334j77960J759j47553k24255j54061J54289Q8523j8429
17687E00289n4187j34736p8975o2697j12436k3782N6299n2334o4307j27543O6191
17676h8218K30516J33518m1802j25337J20438Q6230j2817M1887Q6246M3836j87872
17665B86625m2172r3185n779J52084r5595m4254O1994J3287j74492l2026K28766
17654B55253R1080J28683J53377k7237r9291j89216k8513n9108L4189R5879m4884
$$ y = [73057, 68591, 13900, -34095, -55604, 94621, 220214, 202840, 244016, 218399, 162758, 150233, 216582, 69706, -116706, -4128, 51427, 2472, 31161, 152761, 227422, 400208, 594820, 478462, 348759, 397200, 403064, 472454, 648406, 771602, 785340, 990232, 1177310, 977976, 800016, 801775, 654222, 429967, 275906, 430195, 518718, 500289, 446102, 311366, 232391, 169694, 57258, 33476, 89775, 37441, -26866, -154409, -88218, 142298, 275816, 234014, 108677, 229115, 315345, 302528, 344415, 430661, 474497, 286625, 244453, 151268, 145489, 297573, 201978, 157724, 219718, 233005, 58513, 26487, 255253, 346333, 475016, 628393, 601156, 501865, 312649, 284136, 225028, 259217, 355096, 310212]
17643C10212P7380M8159k14675j98101N0516K15408J07589J44344k6450M275l8849
17632D79808j52224j59821O840M1753J21133n3524r9690j02637N7216q9274L7139
17621H6719P2355l2965J32957P5405m7372m2494K9834j00842j85614O3489K14148
17610B65620j7434M1318J00277j0438J00868k5933j33049o7505q5002N1369J63250
17599C83341J51492j86791j57808O7609k01723j42654J07240k5256K0097R3134
17589A08681l9869J47182K6413L8706q7910n5495O0469j9596l8531J399j49673
17578h224j32789R744L4737Q6312M1185j30757Q848j3444j77089L2783J84830
17567f3864K1741j30935J1582J69949P233P4273p650O6983p7685L2253J9859j69384
$$ y = [310212, 387592, 435751, 221076, 22975, 73491, 288899, 396488, 540832, 514382, 518657, 479808, 327584, 167763, 174603, 216356, 337489, 283965, 184275, 81638, 138854, 49580, 86719, 159074, 126109, 259066, 334471, 287099, 244605, 274439, 173597, -12017, 51472, 265620, 248186, 289504, 389781, 379343, 480211, 454278, 321229, 253724, 168722, 220091, 383341, 534833, 348042, 190234, 257843, 56120, -86534, 20706, -4550, 15547, 108681, 68812, 215994, 242407, 281113, 193203, 137708, 198177, 178581, 140050, 141449, -8224, -141013, -131269, -96532, -10220, 30965, -99792, -90944, -104388, -281477, -248694, -63864, -42123, -173058, -161476, 8473, 15706, 89979, 82329, 149312, 71627, 103880, 123739, -45645]
17555d5645L7316m0888M9762O6750k153K3723J4750j1723o0219p6299m443Q6790
17543C7721o048m5311Q8026O9189J69497m4640M782j32136j03627p4602m6570
17532h3719J41878Q4491J25840R04m0176n0032k19238k0830L8736P7953k2835
17521C2972J00453J812R386p2743p9894m1422K28520J18570j20593K6514j8464
17510A85111p0307j57429J7766J10310j6880j28555r6810j16229J9207J58733
17500i5083K11078K35585k34244j94381J97286J57831j08720j08801j0276k20775
17490a70500R9448J27758j6028j1336L9849K2177O617k6397l7735J18535M8884
17479B01272j32683n1303j28799N6870n9770j22534J62273J70729j80438j65216
$$ y = [-45645, -8329, -49217, 545, 67295, 65142, 88865, 103615, 91892, 31673, -44626, -49069, 37721, 31673, -13638, 74388, 143577, 313074, 268434, 273216, 141080, 37453, -37149, -83719, 58159, 142650, 268490, 269394, 229218, 179186, -40052, -60882, -22146, 55807, 32972, 133425, 135237, 144623, 71880, -8014, -49436, 179084, 297654, 177061, 203575, 185111, 114804, -42625, -24859, 85451, 68571, -59984, -156794, -273023, -253816, -95083, 115995, 351580, 117336, -77045, 120241, 278072, 169352, 60551, 50275, -170500, -71052, 56706, 40678, 29342, 69191, 91368, 97985, 71588, 33853, 152388, 201272, 68589, 17286, -111513, -54643, -114413, -236947, -74674, 96055, -84383, -249599]
17469b49599L6884R5594J82071N8051j0228m7314K5527P9182l3519R6398k3041
17458B10006p1100J43265p884K0688R4542j6258n1514q3879k1948k064J18583
17447C32437J32418J55912L68398K35225J42419L29088M40922n2744p53980m95593
17437H34502l57879p7641l4355j8213k72392k8453Q931m7004J7203j02797r255
17426h7353O990Q7738p6412l7739P823N6820J38286J68004J20536N7318M6823
17415D88834j09615k64279q9602O3720k31494j49460j18040o0763J29991Q5847
17405b54861l6842J01619L0817k6962P5959M6919r4127M4396K98927P1065r4226
17394A62684q6552p9219j8615P11L840m9555Q7800Q359m5533J77110O2888K7038
$$ y = [-249599, -212715, -117121, 64950, 123001, 112773, 65459, 90986, 170168, 136649, 233047, 210006, 138906, 282171, 274287, 294975, 389517, 373259, 321745, 237866, 215918, 213854, 332437, 464855, 620767, 989165, 1224390, 1366809, 1695897, 2136819, 2084075, 1330095, 834502, 476623, 398982, 364627, 346414, 74022, 45569, 54500, 7496, 24699, -78098, -87353, -80363, 7375, -69037, -106776, -98953, -42133, 96153, 264157, 384693, 442011, 488834, 379219, 114940, 25338, 89058, -142436, -291896, -409936, -470699, -340708, -254861, -291703, -190084, -159267, -186229, -110270, -63351, -157478, -113082, 185845, 256910, 162684, 76132, -3087, -21702, -20991, -17151, -66706, 21094, 29453, -16080, 161030, 223918, 250956]
17382B50956p5591m5308J05938J35189K9166k6262O7346j74789j79654p7742j28976
17371a19727p7633J26765J84221J5697J36358j10758j67902r3377K0409r18k3361
17360a10226O4696M7406m1243j07719O037J56719q1315O16J41229m6241M0555
17349G0514j14691j77263o5272o4857j03440M8111J07468P9789j3592j17708M0235
17338c10706K38687o0431P664J13261l3742J01568O7934J8960O824l6104q7970
17327B5945J50624p2591o9336P1107Q4011p957J12462J0739r5117j20780k3868
17316F5239L880j79738J2055J83073J36051p0865p6891M7799k5231k5970M6988
17305A16390R3883k8674J98613J22757K3805n2515n5477k20069N8121J61143o9491
$$ y = [250956, 175365, 130057, 235995, 371184, 400350, 374088, 441434, 266645, 86991, 9249, -119727, -197360, -70595, 113626, 129323, 265681, 154923, -12979, -106356, -85947, -86865, -110226, -45530, 1876, -39367, -147086, -141049, 15670, -65645, -65029, 76200, 29959, 70514, -44177, -221440, -286712, -351569, -455009, -406898, -299430, -219641, -233233, -350941, -310706, -72019, -132450, -124786, -11525, -45267, 56301, 124235, 143195, 150019, 113915, 25945, 176569, 103978, 34642, 105749, 189760, 181803, 294265, 305004, 209887, 89107, 65239, 69119, -110619, -98564, 84509, 220560, 149695, 72804, 120603, 95372, 69402, 116390, 210273, 181599, 380212, 502969, 526774, 474259, 418782, 198713, 256834, 417977, 348486]
17294C48486k78979j57116O3482J9077J00355j22222j40869j22002J8930j03269
17284c74127J27621J68647J86511l0032R1364m1762j74253J8728N5522k288n5591
17273b9660O4344M953P4398Q5462J35474J12180K1252J12100J01061j10961j09807
17262D60796J87081K8586J48160J21574l7609L1529J45972L29193J72966m1463
17252A546785J2682P4708J45418J1509q7694r154K08341K55295J48484J62864
17242B469238J70299K30793K03505O02264J217656J757216K231106L379764N670790
17233A7932631Q651733J1213178J2517274J3325799J8511889K9868898L0292088
17226A42313490o640767k3313974n099238J1738671n793110l6293944k9220055
$$ y = [348486, 69507, -87609, -24127, -5050, 95305, -26917, -167786, -289788, -270858, -374127, -246506, -77859, 108652, 78620, 169984, 128222, -46031, -27303, 28219, 25931, -29660, 34684, 39637, 114035, 199497, 334971, 447151, 468403, 580503, 681564, 570603, 460796, 647877, 676463, 824623, 946197, 908588, 940117, 1086089, 1415282, 1588248, 1546785, 1559467, 1634175, 1779593, 1791102, 1703408, 1694254, 1902595, 2157890, 2306374, 2469238, 2639537, 2870330, 3073835, 3676099, 4893755, 6650971, 8882077, 12261841, 17932631, 26584364, 37797542, 50314816, 63640615, 82152504, 112021402, 142313490, 135672723, 112358749, 107259511, 118998182, 113205072, 76911128, 47691073]
17219D7691073j6036197r060335n138967l100548k520144k338319j597262j092288
17211F807013r84070r27873n01737l43812l08032q5310r3566j41383j50835m3342
17201C227053J76907K25047O5072k46687k31228P1785n3261k50667k60068l0582
17191B693371K59196l73n948P0255J19576K57150L73473N91766Q74876J168293
17181F401635J610826K500392M007225O311752R154772J0886044J1199988J3556073
17173F5628707K1511561L0760798J1667357k0360314j3562488N610023P579601
17166A08835245k3804549l2213435j8812903j0486770o090020l597696k142189
17159A1687683j997524j970467j335589j059812p63802l90691l90346l83678k10061
$$ y = [47691073, 31654876, 22594541, 17455574, 14355026, 11834882, 9496563, 7899301, 6807013, 5822943, 4895070, 4393333, 4049521, 3741489, 3656179, 3562613, 3421230, 3270395, 3227053, 3403960, 3629007, 3694079, 3447392, 3216164, 3287949, 3234688, 2984021, 2723953, 2693371, 2952567, 2952194, 2946246, 3016501, 3136077, 3393227, 3766700, 4358466, 5233342, 6401635, 8012461, 10512853, 14520078, 20831830, 29986602, 40872646, 52072634, 65628707, 87140268, 117901066, 129568423, 109208109, 95645621, 101255644, 108835245, 85030696, 52817261, 34004358, 23517588, 17427568, 13829872, 11687683, 9690159, 7719692, 6384103, 5324291, 4560489, 4169798, 3779452, 3395774, 3185713]
17150C185713k47509j53730j40877j35986r2727R4422j8511k22487j23241k47793
17140A897274j91792j90017k13202m0022p2126n1278j80559r1702Q4600n8741
17130H92435l3910M0223L863n0429l1737L7963J03593J4972R040P8785O808q3344
17118I88262j42012J84153m9287o0709n3041k14873l1155L9185N1042O229M6061
17107G63855k6320J22084R3445j79055o8632j08581j37255j50150r5549J8602
17097B32444R2482J23829L8238R3124Q5930J84637J68982j08600l30642n7366
17087E23058M4990L5402j9916l7224J99426J5605k45378j07929J37974J1055J75781
17076G32844J18880k00721j98759k34558j0227N1399J6018M3842p8515Q910p124
$$ y = [3185713, 2938204, 2784474, 2643597, 2507611, 2414884, 2509306, 2490795, 2268308, 2145067, 1897274, 1705482, 1515465, 1302263, 1262241, 1190115, 1138837, 958278, 866576, 951176, 892435, 858525, 898748, 902611, 852182, 820445, 858408, 962001, 976973, 986013, 1064798, 1071606, 988262, 846250, 1030403, 981116, 920407, 867366, 652493, 621338, 660523, 711565, 717794, 763855, 737535, 859619, 953064, 774009, 705377, 596796, 459541, 309391, 213842, 232444, 324926, 448755, 486993, 580117, 666047, 850684, 1019666, 911066, 580424, 523058, 568048, 603450, 583534, 546310, 745736, 761341, 515963, 408034, 546008, 557063, 732844, 851724, 651003, 452244, 217686, 207459, 258858, 274876, 318718, 240203, 249113, 241989]
17065B41989p2038J32515k1115l7656L4642l1115j54493j7770P0224J8505N4431
17054B18119K30660R6453k2088j60356k80382J29819L0020J73649m031m9582r2166
17043B70115n7840j91483j46021J46020Q0010K0375R8623J46326l1386l7357m6401
17032B50981j05055J64524j4934j19705j05876j27647M0451L0597K5327j44900
17022a06237j01606j47586o2334J74133J02558m7994Q6637q8746m1867J62420
17012g0622O092o0131N8572J05455J81186J04254m4197k25355J5477P0047q6615
17001E4163J5583J06237O1918m163k8191r0909J7429k753N47J22908j07198k1149
16989A24422j44851j46911K03584N0799j26493o1846L5709K1547J3951J34730
$$ y = [241989, 169951, 302466, 281351, 243695, 278337, 247222, 92729, 74959, 145183, 163688, 218119, 448779, 545232, 523144, 362788, 82406, 212225, 242245, 415894, 411863, 362281, 270115, 212275, 20792, -125229, 20791, 100801, 121176, 219799, 366125, 334739, 297382, 250981, 145926, 310450, 295516, 175811, 69935, -57712, -17261, 13336, 38663, -106237, -207843, -355429, -417763, -243630, -141072, -189066, -102429, -191175, -233042, -70622, -64530, -124661, -66089, 39366, 220552, 324806, 280609, 55254, 70731, 140778, 54163, 69746, 175983, 237901, 233738, 205547, 114638, 132067, 129314, 129861, 252769, 145571, 124422, -20429, -167340, 36244, 87043, -39450, -101296, -65587, -44040, -30089, 104641]
16979A04641n9359k2169j02604l7129o93j45623J45807K38708P2955r0256M593
16968A08871j00065p2461K14820P643j21924J61911Q0281L899k61443N515J6721
16957D3768J5244j87072l8876Q4954n8800l9697Q9027J34592j06791O1363J62115
16946A59827J11882O0601p2036j51961n5618R6796l0716j25291P599P361j0717
16935b273M7616j88324P1242R6940O1395k7729j00860K5308L344n8209r5589P0432
16923i6707O2127N4735R0769o6491j39784j04866j01603J31350K15551m9213j7114
16912b1246K11515J81896j3136k45863k41545J31096K4262R2710K2328j71999
16902b9982k1733O7648P0690J03474j53468N4811R2164j03239j60606l139J91296
$$ y = [104641, 45282, 23113, -79491, -116620, -117313, -262936, -117129, 121579, 194534, 104278, 108871, 8806, -63655, 151165, 158808, 36884, 198795, 279076, 282975, 21532, 27047, 43768, 59012, -128060, -166936, -81982, -140782, -180479, -91452, 43140, -63651, -2288, 159827, 271709, 332310, 260274, 108313, 52695, 149491, 118775, -6516, 1083, 8444, -2273, 45343, -142981, -71739, 25201, 86596, 58867, -41993, -16685, -13341, -71550, -167139, -96707, -34580, 20155, 110924, 44433, -95351, -200217, -301820, -170470, 45081, -4132, -21246, 190269, 372165, 359029, 113166, -128379, 2717, 26979, 119689, 142017, -29982, -51715, 15933, 86623, 190097, 36629, 91440, 183604, 80365, -80241, -83380, 107916]
16891A07916R4020O8179j24575N7970m7146j94461L32Q6585O6187o8679k7629
16880A8699N5178k2603r3983k1480n9691l8028J99367m1481k46080J82303J74745
16869A06946K47566l4995j18316k04935r4535J2990p2598k0771Q2208P7399P7679
16858E8638q113j77199N5456J14744j3234p4040J34712N574j23645P7870j18692
16847f7929j2589J05434k8115L9456J02992R5120n8199q3547Q3241n1394q3556
16836D0914L2601l2204o0008K34557J40062k645k7802k48118j85333P295P579
16825i3102L4466L3212l254k8303n7680J31138J13115k39199j20815R6590K0714
16814a13118K0436L5931R213O9236J59491J60209j55798j90084n4034N9975J79694
$$ y = [107916, 201936, 270115, 145540, 203510, 156364, -38097, -37765, 48820, 115007, 46328, 18699, 73877, 51274, -42709, -64189, -123880, -161908, 37459, -4022, -250102, -67799, 106946, 354512, 319517, 201201, -3734, -98269, -85279, -157877, -178648, -96440, -19041, 58638, 50525, -126674, -71218, 43526, 30292, -43748, 90964, 96538, -27107, 50763, -67929, -80518, 24916, -3199, 36257, 139249, 234369, 176170, 92623, 175864, 124470, 40914, 73515, 41311, -18697, 215860, 355922, 353277, 325475, 77357, -107976, -100681, -93102, -58636, -25424, -28678, -56981, -114661, 16477, 129592, -109607, -230422, -133832, -113118, -92682, -56751, -47538, 21698, 181189, 341398, 185600, -4484, -58518, 1457, 181151]
16803A81151q3354j34773J263n8254Q1992J64175l3938M4199L7333l6690l5248
16792A27856Q544r4446K7785k7432k9948j34692j07916O9772J07029J7033r4373
16781a30788n6975P2633J13821j10292j05484k106k04487K61750J91055J1322
16771D0449j43032j07667o3343J30801K0112J51830J87427J13560j86316j6382
16761A27439L6389j55216j05598m6384J51951R3523N6449J74574j7933j70359
16751A44835k62903n7408Q6001P2850l319j1p0332k2580O6343J24903O3955J1343
16739A53677J2800j64179k73515K95219Q4655n2975m3049j531L5907Q5158o5629
16728F6538j30099m8792k225l5209L6265J3615k216j133p5987J41438K9106J03228
$$ y = [181151, 97797, -36976, -35713, -93967, -11975, 152200, 118262, 162461, 199794, 163104, 127856, 136400, 41954, 69739, 42307, 12359, -122333, -230249, -160477, -53448, -36415, -130788, -187763, -115130, -1309, -111601, -217085, -219191, -423678, -161928, 29127, 40449, -102583, -210250, -273593, -142792, -122680, 29150, 216577, 330137, 143821, 127439, 163828, 8612, -96986, -143370, 8581, 102104, 158553, 333127, 315194, 144835, -118068, -175476, -89475, -16625, -19944, -19955, -90287, -112867, -46524, 78379, 142334, 153677, 166477, 2298, -271217, 24002, 108657, 55682, 12633, 11102, 47009, 132167, 66538, -63561, -112353, -114578, -149787, -113522, -99907, -102123, -103256, -179243, -37805, -8699, 94529]
16716I4529j02978k18885Q5311R9305j08951Q0688J46985J99817o7144j66963
16706D1714j45930j11406K30185J77238L756k12819j433Q5891J88671K34860L41406
16695H32133j75M72k33228r6991Q7404j69589j55135R9096O0593j14652j75349
16684A34579j7260R3429L9688l0956l7929K6608R7963j72314j21456q8823N6210
16673b0261J25415k3471p0095R201J14978O5970k8378j57893J98361K651j82609
16662C3869j80730J17154J7475M7283K2746J7636o8857P2316R2541L0423m1087
16651A60769p4786p2261L3389q5882o3938O3394J27279R6689L8480L1099J98470
16640D52702K54182R6575j86135K8867J75410q5102k74414k52049k34902j17777
$$ y = [94529, -8449, -227334, -142023, -42718, -151669, -70981, 76004, 275821, 208677, 41714, -104216, -215622, 14563, 191801, 195557, -17262, -18695, 67196, 255867, 490727, 832133, 831958, 832430, 599202, 502211, 589615, 420026, 264891, 363987, 424580, 309928, 134579, 117319, 210748, 250436, 219480, 181551, 208159, 306122, 133808, 12352, -76471, -20261, 105154, 81683, 11588, 20789, 135767, 201737, 173359, 15466, 213827, 216478, 33869, -146861, -29707, -12232, 35051, 57797, 75433, 6576, 78892, 171433, 201856, 160769, 85983, 13722, 47111, -38771, -102709, -39315, 87964, 184653, 223133, 254232, 452702, 706884, 803459, 617324, 646191, 821601, 736499, 462085, 210036, -24866, -142643]
16630a42643k9580J86044J39613O6371p1498j40196J5081p3626q3527j06418q8410
16619c28789N7393M1489M476L082j16052o1233O1046L2841J54399J28237k2613
16608d5724M3797J48137N6192k39947p3148L0163J2785J17345l6653M6358M292
16597F3597m0273k30214j46015K5188J00361Q1243N5052J4994k5305J48729J17013
16586A64370o2873j35577J14222m722m6258M0572o4744n0903r8673P1667N115
16575f7804j7538O7627R7050O2098J39063j2716m2684M4949O8405o4281P2001
16564C46170k08233j80855q6101j44690N8309J02826K21595J05788n4631K51827
16554D12005j31662l00253k660J47292J1882q326j7803L501J45842J2384j75754
$$ y = [-142643, -172223, 13821, 153434, 219805, 148307, 8111, 23192, -50434, -133961, -240379, -328789, -271396, -229907, -225431, -222349, -338401, -399634, -338588, -305747, -151348, -23111, -45724, -1927, 146210, 202402, -37545, -110693, -80530, -67745, 49600, 12947, 59305, 63597, 23324, -206890, -352905, -327717, -227356, -146113, -91061, -76067, -101372, 47357, 164370, 101497, -34080, 80142, 75420, 29162, 69734, 4990, -45913, -144586, -72919, -67804, -85342, -17715, 79335, 141433, 280496, 267780, 225096, 270045, 338450, 274169, 346170, 137937, -42918, -129019, -273709, -215400, -112574, 109021, 214809, 160178, 412005, 280343, -19910, -22570, 124722, 136604, 128278, 110475, 113976, 259818, 272202, 96448]
16543I6448o8992N092p4541o2678L0897k3983p4251O2393P9364j68229J29741
16532f8739J64685j24775q0217L187J51498J62616J11984q1062n0033k16411k19964
16521b47231K4920q0035J19986M7448N0251J10926j05030Q7581N1091o7671J32084
16510A24320m732o2298L7596m1008o8984j81220N1421l4518m4778l2607j32882
16499c89690P7530P6397J43496M5892K3444R074N8051P3779n7436m7084R5701
16488A09154M8197k05658J02559m3863j05340r8342R8862J56489O0034o5121L5868
16477I2839p7857k01717n2467J91306J32537p7955j30765K5369J07394j467l570
16466C647p4978j5743n8753J12909M2205n1307J7527J19589k52J11933n0097j8268
$$ y = [96448, 27456, 32548, -41993, -104671, -73774, -97757, -172008, -109615, -30251, -198480, -68739, 95946, -28829, -109046, -105859, 45639, 208255, 320239, 239177, 189144, -27267, -247231, -222311, -302346, -182360, -134912, -84661, 26265, -78765, 8816, 59907, -7764, 124320, 119588, 57290, 94886, 53878, -15106, -196326, -144905, -179423, -224201, -256808, -389690, -312160, -235763, -92267, -46375, -22931, -13857, 44194, 117973, 60537, 13453, 109154, 157351, -48307, 54252, 10389, -94951, -193293, -94431, 62058, 122092, 56971, 92839, 14982, -186735, -239202, -47896, 84641, 6686, -124079, -98710, 8684, 7217, 3647, -71331, -87074, -145827, -32918, 9287, -42020, -24493, 95096, 94844, 206777, 156680, 138412]
16454A38412p6523j4397O0488j00045N575M5834j6501j61709N6412L041K4211
16443c5202J50372l1771j76480k10576J42768J35516Q2412l6348L869K2545l2977
16432A4128P2634j43569m9348Q0244Q9080J13842j8725j4544j8683j47899J96709
16421A73869J56011j01580l4056M3474O317J88999l8079R620K22584K15717j15957
16410G26919k01462j61293j07365l1498O3360O4443M5256J3118M9194M1353q1628
16399D20397j12415l4922M6257q9710j66487k76426R9644J90964J54021J25082
16389C56405L9988M2757j12484o2389J12055N1414k8218R937o683j02244N2040
16378C52578k0545j54296M49K4857K5277M2155n0887l3252q4118j79408m3338
$$ y = [138412, 61889, 47492, 107980, 7935, 13510, 59344, 42843, -118866, -62454, -59413, -35202, 115170, 83399, -93081, -303657, -160889, -25373, 57039, 20691, 24560, 47105, 14128, 86762, -56807, -106155, -25911, 63169, 177011, 158286, 143742, 125059, -22840, 173869, 329880, 228300, 194244, 237718, 244035, 433034, 394955, 404575, 627159, 842876, 726919, 525457, 364164, 256799, 225301, 288661, 353104, 398360, 411478, 460672, 502025, 420397, 307982, 273060, 319317, 229607, 63120, -213306, -113662, 77302, 231323, 356405, 396393, 439150, 326666, 264277, 376332, 427746, 399528, 409465, 402782, 300538, 352578, 332033, 177737, 178186, 203043, 228320, 270475, 219588, 186336, 102218, -77190, -120528]
16367a20528K3843R7756l1555j80833K7840J41683r224k70303j78590K6308J99516
16356b74087L4239J7989J7791R4498N8275j9884Q4717R1336n6709j6617o7014
16345c5466J90929P4778J99553l3441j14286k5703j11466q4000j14764j55032
16335b08898O0845J24353N9891J61180j15129k8433l4686j48800p4678m0838J01935
16324a43258N4671M1670N6595K19640K5974r7880l11547L172j3671j27709R2490
16313a99853K45096n9354m6526j8842j6233J2233j9411P5421J02175n3187j35626
16302a14107j15059n5140J66187J32540k5470L022r1610J2812M7718k973j2424
16291e4504j5938K8626r6408K2726Q7981K9521o3524L4534J4285o795k4989q7357
$$ y = [-120528, -96685, 1071, -30484, -211317, -183477, -41794, -51018, -321321, -499911, -473603, -274087, -239848, -221859, -204068, -109570, -51295, -71179, 13538, 104874, 48165, 31548, -35466, 155463, 230241, 429794, 396353, 282067, 256364, 144898, 60898, -53866, -208898, -148053, -23700, 36191, 197371, 82242, 53809, 19123, -129677, -204355, -245193, -143258, -88587, -46917, 9678, 229318, 255292, 157412, -154135, -150963, -164634, -292343, -199853, 45243, -14111, -60637, -79479, -95712, -83479, -102890, -27469, 74706, 21519, -114107, -229166, -284306, -118119, 14421, -11049, -8027, -99637, -86825, -39107, -42080, -54504, -70442, -41816, -138224, -115498, -27517, 2004, -61520, -26986, -12701, -19496, -44485, -131842]
16279a31842k0196n8207P7091N5608j32242M9763J31367j27064J07957J52338
16269A04573l6000J18588l2412o0871r9261Q4423n1999m5925j51885k226J25202
16258d7793J97250j68849N1871M1967j33723j25032j52969K1584M3853Q2110L3505
16247a56226j2942J4601J21958J44685k4582l8062j09364q4223n4617K0392K1074
16236a57306n1824k05334j3107J52412J28935J10635r6153o3059P013J32407k1602
16225g6983n1521K11336J55790j15050q7677r7098J41743m4865k00301R182J17407
16214c8037m10l0488j14098j78550m2546J94238R9114k1193K8456J05519J11239
16203A13244p3352j33094j00087M9935J18744J04059p3889j37751j83534J1998
$$ y = [-131842, -152038, -210245, -133154, -77546, -209788, -160025, -28658, -155722, -47765, 104573, 68573, 187161, 154749, 93878, -5383, 79040, 27041, -18884, -170769, -172995, -47793, 149457, -19392, 32479, 74446, -59277, -184309, -337278, -315694, -271841, -189731, -156226, -169168, -154567, -32609, 112076, 87494, 49432, -59932, -144155, -198772, -178380, -157306, -209130, -414464, -427571, -275159, -146224, -35589, -131742, -194801, -187788, -55381, -76983, -128504, 82832, 238622, 123572, 35895, -61203, 80540, 35675, -164626, -155444, -38037, -38447, -68935, -183033, -361583, -404129, -209891, -110777, -131970, -103514, 2005, 113244, 39892, -93202, -193289, -143354, -24610, 79449, 5560, -132191, -315725, -303727]
16193c03727J1302n8560L9547J45352K5019J44772J50468O9396J10753k45411
16183H8911j02620L4400j3121l8731j29981J12079J85831o264j05115l2854L8028
16172C0563P7672M4181J08948K1472L8889k05017q6193k8338K3969J39558r8201
16161F7503j20076k1332J867l215M7491j60982k26588J82138L15963J53345p9038
16150A57076o2344m9904k7622L0470r9702j15352m206Q5661J03754j30725j04219
16139b17113Q9061N3129r6055k6853Q2525J66582k8973j16475P6643J61396j4551
16128A29316j19513J01923L7936j49194j69794J43537J16991o4175j39654j11163
16118b23790J0240N8178J99543Q2252Q256m6105j38131j28199p4934l6741J5668
$$ y = [-303727, -292425, -350985, -311438, -166086, -141067, 3705, 154173, 223569, 334322, 88911, -13709, 20691, 7570, -31161, -161142, -49063, 136768, 130504, 25389, -7465, 30563, 108235, 152416, 261364, 282836, 321725, 116708, 30515, 2177, 26146, 165704, 67503, -52573, -73905, -72038, -75253, -27762, -188744, -415332, -233194, 82769, 236114, 157076, 94732, 44828, 17206, 47676, -52026, -167378, -171584, -85923, 17831, -112894, -217113, -128052, -74923, -170978, -197831, -115306, 51276, 22303, -94172, -17529, 143867, 129316, 9803, 111726, 149662, 468, -169326, -25789, 91202, 27027, -112627, -223790, -213550, -155372, 44171, 126423, 134679, 88574, -49557, -177756, -252690, -289431, -273763]
16107b73763K7136m433J53279K12799r841k39610m6404q33j2548R7831J23304
16096B6917j84401j34612R4174J28160j11J8410o1618k355K7779N9249M3262j3318
16084A536p108j13949p3845O3621M6407R7957J61858p0833n4307J06250P5146
16073B32733o4755j33121n2880L7526J7118l1599l3113j26602j78115m078P1765
16062b65121N7616J4687m4732r4190K1471J94397P0749K8614J3314M6012M7696
16051I0513N8823n9129j02177j363J23952k5796p6430q388j5740R9745K08855
16040B92865j08349j84993K6965Q5691p9757L3118M5029N7011j22612k06971j1306
16029a73309J78478J21049n7685k01318m7068M7214j2469J75915j3245j25381
$$ y = [-273763, -246627, -251060, -97781, 115018, 105177, -134433, -180837, -181670, -194218, -96387, 26917, -157484, -292096, -197922, -69762, -69873, -51463, -113081, -115436, -87657, -28408, 14854, 1536, -5572, -119521, -193366, -129745, -83338, 14619, 176477, 105644, 51337, 157587, 232733, 167978, 34857, -18023, 19503, 36621, 5022, -28091, -154693, -332808, -336886, -265121, -207505, -192818, -237550, -331740, -310269, -115872, -45123, -16509, -3195, 42817, 90513, 149336, 90207, -11970, -13333, 110619, 84823, 8393, 5, -15735, 84010, 292865, 184516, -477, 26488, 112179, 32422, 65540, 110569, 167580, 44968, -162003, -173309, 5169, 126218, 68533, -132785, -179853, -132639, -145108, 30807, 17562, -107819]
16019a07819q5620n3848p2995J85282J31859j62765k2893J27166P5937l8646N1581
16008B7239K9922j5255K784l2442j0124O7675p399o6513j8373q8889P2405J11287
15996G2317q1681R9129r682o6286r4045Q7291J14828K340j06043j7574J30659
15985A31253k01391j69615J2415L9319j2885Q777J2856o5247J35920L215K3638
15974h1745o6851j31216K4875J55397P6984k6172l1590k9905q4140j60081J39669
15963b14775J43032M0813J49264j01668k46426o1552J59893q2331o3695J94467
15953h2978K85132O0098j6710j9670j64955k44899L1952M2989l6145k8365j28426
15942c01977J31332J77242P4236p858K5707k3671J3985J4359o1683o5879j39596
$$ y = [-107819, -193439, -247287, -320282, -135000, -3141, -165906, -188799, -61633, 14304, -24342, 27239, 57161, 41906, 44690, 12248, 2124, 69799, 62400, -4113, -22486, -111375, -38970, 72317, -9364, 89765, 80083, 13797, -80248, 7043, 121871, 124211, 18168, 594, 131253, -70138, -239753, -227338, -188019, -200904, -192127, -179271, -244518, -108598, -105383, -81745, -148596, -279812, -254937, -99540, -22556, -48728, -80318, -110223, -194363, -354444, -214775, -71743, -30930, 118334, 16666, -229760, -291312, -131419, -213750, -277445, -82978, 202154, 262252, 245542, 225872, 60917, -183982, -152030, -109041, -145186, -173551, -301977, -170645, 6597, 80833, 72975, 98682, 75011, 88996, 103355, 41672, -24207, -163803]
15931a63803K4072Q2955m8540M0370o9854Q4761L37299K8781k0720q9269j73343
15920C2709j47013L7765J2201J15290M8158k17102K0022J9707R3480L2532j62221
15909a14472j8573j1635J7712J05043M0714n9210m8345n1013l8136M5705j4866
15898a47076J144n1839L2373K40893J8923R7148k1680l44956r7814R864J113P7400
15886a84507J04513K4937m5564n3936j23832p3469Q3916M5898K31327J27149O0557
15875A96989q8394O1480k4475j74077k9430j30917j1069K09092J70902k38408
15865e8307k04819M3159J35562j9837P7868O1010l6602q7233J0946n8909J6051
15854a21111m973R4192j1921j70526J5775K05244k2060q5409q7462j10323m9778
$$ y = [-163803, -139731, -56776, -105316, -64946, -134800, -50039, 287260, 316041, 295321, 206052, 32709, -114304, -76539, -64338, 50952, 99110, -117992, -97970, -78263, 15217, 47749, -114472, -133045, -144680, -126968, -21925, 18789, -40421, -88766, -139779, -177915, -132210, -147076, -145932, -197771, -165398, 75495, 94418, 191566, 169886, -175070, -272884, -263020, -261907, -184507, -79994, -55057, -100621, -154557, -278389, -351858, -267942, -222044, 9283, 136432, 196989, 108595, 170075, 145600, -28477, -57907, -188824, -199893, 9199, 180101, -58307, -263126, -219967, -84405, -104242, -26374, 34636, -1966, -89199, -78253, -137162, -121111, -126084, -31892, -43813, -214339, -198564, 6680, -15380, -100789, -188251, -298574, -348352]
15843c48352J39749j3644Q7767J48302N7694j01387J8703j6818Q7129O185O4265
15832A29593j8577M6906m3830k5015r8013r4586n4647j05759J18202J53079L10208
15821C17561K08996j29625j52850j83617k41421M4789O5027O8984N5730J5382
15811F8956k77783J56381P5901j71812p6482k366j6084Q5836P3992m6782J4849
15800a15394l7928q244L8419O0622J47037L5803k0510p8267p9783M406o8898j8996
15788a41733M1295J04089l5231P3572K2931k9933j22644j06186k2401L8676r8444
15777b76009k0519K9957L6355M4778m8353R0858o9296J32718K5332j20478q370
15766a83027N9577k8547j7114J71806K29917l203k57580L5776J59841l962K6903
$$ y = [-348352, -208603, -222247, -134480, 13822, 71516, -29871, -11168, -27986, 59143, 65328, 129593, 111016, 157922, 114092, 89077, -8936, -103522, -158169, -263928, -145726, 7353, 317561, 526557, 396932, 244082, 60465, -180956, -136167, -71140, -2156, 53574, 68956, -208827, -52446, 23455, -148357, -224839, -227205, -243289, -157453, -83461, -130243, -115394, -153322, -161566, -123147, -62525, 84512, 120315, 99805, 21538, -58245, -53839, -122737, -141733, -100438, 3651, -31580, 41992, 64923, 34990, -87654, -193840, -216241, -177565, -276009, -296528, -266571, -230216, -185438, -233791, -142933, -212229, -79511, -54179, -174657, -183027, -123450, -151997, -169111, 2695, 232612, 229409, -28171, 7605, 167446, 163484, 190387]
15755A90387P7487k7482k19833k71009J59191O609m8049K1376Q0523l1664n9733
15744a22197j4801N5587k9555j15341N8860K19864Q2123J9976K1756j1329r8966
15733F5977m6600N0619J20336R2622j32658j50991o2742l8220M6510J00084l60
15722D4577j59283J00947N0257K5057o0496j30662O0265j18594L0781r97M467
15711a53681Q6607J37544o5949j03563Q1953L3552L3748m042Q7541j00183n8049
15700b4522J01058l3042n3292Q0555K6009q9606R9414O9897j24877L5271O3287
15689A50152J41450N4012j63078j17413j45655k6846J24225j00532l4181K3363
15679i4503J902J15226o378o3840p3455p6481l9629J79809J16278j34569O8413
$$ y = [190387, 267874, 240392, 20559, -250450, -91259, -84650, -132699, -111323, -30800, -62464, -122197, -136998, -81411, -110966, -226307, -167447, 52417, 134540, 154516, 176272, 164943, 65977, 19377, 69996, 190332, 282954, 150296, -695, -63437, -101657, -55147, 44937, 44577, -114706, -13759, 36498, 61555, 1059, -129603, -69338, -187932, -157151, -158148, -153681, -67074, 70470, 4521, -99042, -17089, 16463, 50211, 46169, 133710, 33527, -24522, 76536, 43494, -9798, 70757, 96766, 7160, 106574, 176471, 51594, 86865, 150152, 291602, 345614, 182536, 65123, -80532, -107378, 16847, -83685, -117866, -94503, -92601, 22625, 16247, -47593, -121048, -197529, -237158, -57349, 58929, -75640, -7227]
15668g227N2546j09009p1915k7893J02529J6364l8378m0174m7292l6924j6119
15657b23492n7123N1671R3632k9590K4051J66408K40209J39055q1960j78895o9906
15646G4060J63281m0686j16140n1746j17887P3785J86405o9274q3265j08831O0820
15635b9478P8549j60279q9235j72257m8161J20695J75308J33441k6131o3138n8481
15624a39167k8586K2165J42958n5228N355O7636n1570q2048m2992O8316J17425
15613B4264J10722r638k4444q6750m3863p6661Q9925J32417k12142r258L4437
15602g0991j17944j39856J46874R8849n4932J42660L2242l6546J67436O563j54946
15591A9409J9129k340j25987L325J2009P0279O2672R059m7482J30985Q1469j09439
$$ y = [-7227, 45319, -63690, -135605, -163498, -60969, -44605, -82983, -123157, -170449, -207373, -223492, -280615, -228944, -135312, -164902, -140851, 25557, 265766, 404821, 322861, 143966, 74060, 237341, 196655, 80515, 28769, -89118, -15333, 171072, 101798, 18533, -90298, -29478, 49071, -111208, -200443, -372700, -420861, -300166, -124858, 8583, -17548, -80686, -139167, -167753, -145588, -2630, -57858, -52503, 15133, -36437, -118485, -161477, -93161, 24264, 134986, 125348, 100904, 14154, -29709, -106370, -16445, 115972, -96170, -105428, -70991, -188935, -328791, -181917, -83068, -138000, 4660, 36902, 356, 167792, 174355, 19409, 38538, 36198, -89789, -86464, -74455, -4176, 58496, 67555, 20073, 151058, 232527, 123088]
15579A23088m5677o232q4158N7609j1609j72702L6953J35262Q4896J30878k1757
15568B26551j23226n1010L5224N6261j6031L7228k11227j0477k8779j11785M6092
15557a51179J30780j2668j00967j41437J48227J00020L8491M3480k0318j10687
15547g6258J9143J15764K1678j70500o3505J2285R6904K4562P5255P4267P3277
15536B02872l6182k25196q3039m5166J15769l509J7468J7864k57586N0092J87112
15525e9501k6832J73854M6172n601p7659N8279j15882r0189O3802o425j31148
15514a71130K8102N6888Q0892J41317J79183J26258j93471k55317N1977J9355
15504F4054j3924l0680j66497j8877N1099J24819l5597M7972Q4098j53943j53463
$$ y = [123088, 77411, 71179, -12979, 44630, 33021, -139681, -102728, 32534, 117430, 248308, 226551, 103325, 52315, 87539, 143800, 127769, 164997, -46230, -56707, -85486, -197271, -151179, -20399, -33067, -134034, -275471, -127244, -27224, 11267, 54747, 34429, -76258, -57115, 58649, 80327, -90173, -153678, -141393, -44489, -19927, 55328, 129595, 202872, 166690, -58506, -141545, -186711, -70942, -74451, -56983, -39119, -296705, -246613, -59501, -86333, 87521, 133693, 128092, 50433, 108712, -7170, -97359, -33557, -39982, -171130, -143028, -86140, -5248, 136069, 315252, 441510, 248039, -7278, 44699, 64054, 50130, 19450, -147047, -165924, -114825, 9994, -25603, 22369, 106467, -47476, -200939]
15493b00939m0706J8940K73405P4280q9746J02629P8629k36935m8094j730j11140
15482a81407j8752K6436K14596P3108q0194K7195q5933j4374J3196N3960J00468
15471A28299o8616j03467r0460j35515J08060J41180O2092j14405r6460o0487
15461b29779K23736N7079l4196j4038m4077j46210J46688L23514q6769j56881
15451C9067j68949j20778P0873J00422R2162k8647j6570J09643j18562k3107R4385
15440B9939O5389j6563N2934k5710k685p7572l3415n7140j02945J16405P6068
15429B4705P0766K1684j0214j53381j39896K7678M8739j3112N5335J62J30006
15418F2472J76179j31050o6284r0521p7671J30249J59823j0672j42454O8411m1087
$$ y = [-200939, -241645, -222705, 50700, 124980, 35234, 137863, 216492, -20443, -68537, -70267, -181407, -200159, -173723, 40873, 113981, 33787, 60982, -24951, -39325, -26129, 27831, 128299, 59683, -43784, -134244, -269759, -161699, -20519, 41573, -72832, -169292, -229779, -6043, 51036, 16840, 2802, -41275, -187485, -40797, 282717, 195948, 39067, -129882, -250660, -179787, -79365, 12797, -15850, -32420, 77223, -41339, -64446, 29939, 95328, 78765, 131699, 105989, 103304, 25732, -7683, -64823, -167768, -51363, 24705, 95471, 117155, 106941, -46440, -186336, -158658, -109919, -123031, -67696, -67534, 62472, 238651, 107601, 41317, -49204, -126875, 3374, 163197, 152525, 10071, 78482, 37395]
15407C7395L3853L0469K9834l7133M1479j13362K9327K24217j44639j59646r055
15396c7261j07114p6487J55859N2056l5731j2845j26702o9246J47702J15890l1505
15385b5384r5494j18029l9917J20263N0833O2176J17961O3803K0928j8167o0701
15374G8272r941J1685q6676k26046j208L1376L8503M4520J49218n2504j98371
15363b21172o4499O9223M5690m5002J05938J2413q0596k9227l3640P3231O0873
15352a06768j16690p4874p709L3602M3842N5950J31545J73698q6507n5925L1102
15341B1266M0600K3977J32479m213j61841j588m4703n4331N3223p0337j37305
15330b02773J25600J78363J46043m6408N3965K6126n5669P205j9652O981M5785
$$ y = [37395, 71248, 101717, 131551, 94418, 135897, 22535, 51862, 276079, 131440, -28206, -37261, -144375, -220862, -65003, -12947, -48678, -61523, -188225, -257471, -109769, 6121, -25384, -120878, -238907, -278824, -158561, -107728, -45552, 72409, 136212, 157140, 138973, 78272, 68331, 80016, -6660, -232706, -233914, -202538, -164035, -119515, 29703, -22801, -221172, -285671, -216448, -170758, -215760, -109822, -97409, -178005, -207232, -240872, -167641, -106768, -223458, -298332, -306041, -272439, -228597, -172647, -41102, 132596, 46089, -9836, 21266, 61866, 85843, 218322, 214109, 52268, 50680, 5977, -48354, 4869, -65468, -202773, -77173, 101190, 247233, 200825, 254790, 280916, 225247, 232452, 212800, 219781, 265566]
15319B65566L5626p3290J7916k56606m5332O875j22635N331R0323J65896O186
15308I5856j16076J51708J09029K3419P1378p8874j56129j62946n1050K5288m4240
15297a32637J17884J42708n0283M5866Q9883k4491j23454j28513J68602P6259
15287A81824R492O854j85636j02442J623J24845j5989M6146J64066r4960o0463
15276G5360P5572l9281l1320j7177P2825L293m4058J30024P7111J46668J0602
15265D59619r885k01186k0770J7420j30575m9895K1950o6690p4671j7653m0838
15254a13174K00785J7817q2824o7244M2496J7162n971J2727j7919j34433j2461
15243a43039p1825Q5271J20534J80718J79864K2971l15808k68444J64710L8470
$$ y = [265566, 301192, 227902, 245818, -10788, -56120, -49245, -171880, -166549, -76226, 89670, 95856, -20220, 131488, 240517, 263936, 335314, 256440, 100311, -62635, -113685, -88397, -132637, -14753, 127955, 77672, 123538, 213421, 188930, 65476, -63037, 105565, 181824, 191316, 198170, 12534, -89908, -88285, 36560, 20571, 66717, 230783, 135823, 75360, 150932, 111651, 80331, 63154, 135979, 139272, 95214, 225238, 302349, 449017, 459619, 449734, 248548, 227778, 245198, 114623, 64728, 86678, 19988, -54683, -72336, -113174, 87611, 105428, 22604, -44640, -2144, 15018, 9047, 21774, 3855, -130578, -143039, -214864, -129593, -9059, 171659, 351523, 374494, 58686, -209758, -45048, -6578]
15233f578j17166J84875j48135o1056L773r1986K38281K01762j42883q108J48726
15222B01505Q0968j43168J71262j03058j44644j562Q1772P3031j24979Q9985J53480
15211C34592k07254n7820J24489o3012J8498L6827j5741M8045O9745n7842J3193
15200B43720k71130j18514J06289J46364j08028r194J29610l896l8351j27116
15190e0246j3223R9122n732n1404M5511k4951M019p2569j38136K64515K25743
15179B82649n845o5757k2451l839j76762j29487o448N363j9212O5623J43945J925
15167F9704j01433L8261o8107j40343j8206J38433J59633R9416m6383j18011j35363
15156a22399o9191M8544J29519K8906r3705j06378K494J39828Q3907j35170L9108
$$ y = [-6578, -123744, 61131, -87004, -148060, -144287, -236273, 2008, 203770, 60887, 52779, 201505, 282473, 139305, 310567, 207509, 62865, 61303, 143075, 216106, 91127, 181112, 334592, 127338, 69518, 194007, 130995, 149493, 186320, 170579, 218624, 288369, 230527, 243720, -27410, -145924, -39635, 106729, -1299, -10493, 119117, 115221, 76870, -50246, -63469, 35653, 29921, -21483, 24028, -923, 3096, -69473, -207609, 56906, 282649, 276804, 211047, 188596, 184757, 7995, -121492, -127940, -122577, -141789, -76166, 67779, 69704, -31729, 6532, -61575, -201918, -220124, -81691, 77942, 177358, 130975, 12964, -122399, -191590, -143046, -13527, 15379, -78326, -184704, -182210, -42382, 41525, -93645, -54537]
15145e4537O7251k9072Q4111J17130M5003n1575j62508M5018Q1584L496j61181
15134a5280K2436R3890J8858j0321k595o3533q0093L578m961l1971j25211J24800
15122g0403K83678J76188j93131j37340o783M3177l2438j799q8100j19855k3399
15111a70205J5693J87812M9010o7438j19217J00019k1490o8084K0733O6595j0430
15100a7002k9865p7194n3906J07851R6663K66041M8186o8749p41j22471j41212
15089G601l4757N1777j24346o9192O7228J44911j73384L1337J93816N7240k0787
15078A31444j24340j49012J0815R9527o8885q7553Q470O1961j8506J08397j4732
15067d2414j2571k0381J10113q1775q0977j34024P5620J46577M1767q4719k7612
$$ y = [-54537, 12714, -16358, 67753, 184883, 229886, 178311, 15803, 60821, 142405, 145901, -15280, 7156, 101046, 119904, 109583, 106988, 43455, -36638, -33060, -38021, -69992, -195203, -70403, 213275, 389463, 196332, 58992, 52209, 95386, 62948, 61149, -26951, -146806, -170205, -154512, 33300, 82310, 14872, -104345, -4326, -25816, -93900, -73167, -6572, -17002, -46867, -124061, -177967, -70116, 26547, 292588, 340774, 272025, 271284, 148813, 7601, -27156, 24621, -99725, -168917, -101689, 43222, -130162, -98825, 94991, 152231, 131444, 7104, -141908, -131093, -31566, -100451, -188004, -179534, -117573, -136079, -27682, -42414, -54985, -75366, 34747, -47028, -128005, -262029, -186409, -39832, 1935, -82784, -110396]
15056a10396J23828r468j06780l0264J14818J26409L3602l7872m9627p0416M6281
15045C0115L8360n9545K0603N9084L8199p8237j76399n8292L6024M4693j8396
15034a23791j6911L9432k1422K2732O8706J41798O4174j3310j4977r9428J25160
15023A72163Q4449J9109o7593k20583K2787p7426q706J0367r9892j1646J07858
15012f9113K14271N8108K1621k0895k6811j05437P835J06825m5235j35548O3808
15001F9429J15903J2716l4868j97830j08938l0005K1487J65108m764p8048L1839
14990c7971J63211J20735j84664j08376n0370j71916m8055K37048m7317r432M1782
14979i5325J50750J44295O1214j28706J2297o6582m9268j9116J66416J28237m7060
$$ y = [-110396, 13432, 3964, -102816, -133080, -18262, 108147, 141749, 103877, 54250, -16166, 30115, 68475, 8930, 29533, 88617, 126816, 48579, -127820, -186112, -150088, -105395, -123791, -140702, -101270, -122692, -99960, -31254, 110544, 174718, 161408, 146431, 47003, 172163, 256612, 275721, 208128, -12455, 10332, -67094, -75800, -65433, -165325, -176971, -69113, 145158, 203266, 224887, 203992, 177181, 71744, 79579, 186404, 141169, 5621, 69429, 185332, 198048, 163180, -34650, -143588, -173593, -152106, 13002, 8238, -69810, -37971, 125240, 245975, 61311, -47065, -97435, -269351, -317406, -80358, -127675, -137107, -95325, 55425, 199720, 260934, 132228, 144525, 77943, 28675, 9559, 175975, 304212, 257152]
14968B57152K0835P8665n9471o4162j06795J589J15451m0316j72259j0560O5994
14957H6123K3613P0843Q2034J5703o5605r7570P6736P1727j58955O817Q818j10213
14945A0071k810K33780J0458N544j2070j3948m6963L1028p358q5136j02040j07626
14933h7070J37657r965l6665P5843J15135j2236k6697k6172r940k04009j48916
14922b33035L0766r799n6447q399R7872L0191j33137O1643Q2135m3154p001J29094
14910e9271J77367J68457m726O8611J30586O185j58851m309j2712o0956J46926
14899C97307K25586R2911J17846O1925J25286K45748M40440L95720N38837Q71107
14889C512713R26133J179635J554693J773346J684038J143510Q10483M95810j93157
$$ y = [257152, 277987, 356652, 297181, 233019, 126224, 127813, 243264, 202948, 30689, 20129, 86123, 109736, 180579, 262613, 278316, 212711, 115141, 191877, 263604, 104649, 111466, 120284, 10071, 7261, 241041, 251499, 257043, 244973, 231025, 184062, 215090, 207732, 122596, 20556, -87070, 50587, 40622, 3957, 79800, 194935, 182699, 156002, 129830, 119890, -84119, -233035, -202269, -212068, -268515, -276914, -179042, -148851, -281988, -220345, -138210, -181364, -188365, -59271, 118096, 286553, 281827, 350438, 481024, 487209, 328358, 324049, 311337, 250381, 397307, 622893, 715804, 833650, 895575, 1020861, 1266609, 1707049, 2102769, 2641606, 3512713, 4438846, 5618481, 7173174, 8946520, 10630558, 11774068, 12584551, 13080361, 12887204]
14880A2887204j004320j555193j485487j610845j462788j073763p80656l12529
14872C601623j27775j24583N5381K73911L83962M86278O81921J042188J570913
14863G843819K195274K631201K956671L329298L250649K467998J874264J059826
14855B7609000q64965k637940l154903l249779l548018l081327k246049j450326
14847G375693j031756p39983n30456l17243J75819K49365L16145N97230J052508
14838G147322J432861J902476K575882L234530L918976M471842M737260M525126
14830C3946275L627168J996832L10192r16935l326508n016250m832474m483002
14822B1305298m571086l778874k253553j172012r39188p28589l68946o124M34418
$$ y = [12887204, 11882884, 10327691, 8842204, 7231359, 5768571, 4694808, 3914152, 3601623, 3473848, 3349265, 3404646, 3678557, 4062519, 4548797, 5230718, 6272906, 7843819, 10039093, 12670294, 15626965, 18956263, 22206912, 24674910, 26549174, 27609000, 26744035, 24106095, 20951192, 17701413, 14153395, 11072068, 8826019, 7375693, 6343937, 5603954, 5073498, 4756255, 4932074, 5181439, 5497584, 6094814, 7147322, 8580183, 10482659, 13058541, 16293071, 20212047, 24683889, 29421149, 33946275, 37573443, 39570275, 39880467, 38963532, 35637024, 30620774, 25788300, 21305298, 16734212, 12955338, 10701785, 9529773, 8590585, 7861996, 7493050, 7486926, 7921344]
14813G921344O95663J116669J825956K701822L585992M271024N070414O583302
14805C3772186P338735O426792M339652L125825J305309l238284o588123o667649
14797C9814443o761378p147554o093622m440240k926789j791879j305592r72009
14789H375380n50944j80389R1583N33129R80888J388529K098220K592306L165910
14780A8494612M119319M738028M803287L914354L242100J905055n33957k437553
14772C8245245l364944m852507n559959m815079m037111l302426k417961j843336
14764H051922j344491o67039l91619k89527j24403J83969L94997O86739J038924
14755G539472J374389J905203K440285K750572L217528L597978L099134J874878
$$ y = [7921344, 8617007, 9733676, 11559632, 14261454, 17847446, 22118470, 27188884, 33772186, 41110921, 47537713, 51877365, 55003190, 56308499, 53070215, 46482092, 39814443, 33053065, 25905511, 19811889, 15371649, 12444860, 10652981, 9347389, 8375380, 7824436, 7644047, 7735630, 8268759, 9249647, 10638176, 12736396, 15328702, 18494612, 22613931, 27351959, 32155246, 36069600, 39311700, 41216755, 40682798, 38245245, 34880301, 30027794, 24467835, 19652756, 15615645, 12313219, 9895258, 8051922, 6707431, 6040392, 5648773, 5359246, 5234843, 5418812, 5813809, 6500548, 7539472, 8913861, 10819064, 13259349, 16009921, 19227449, 22825427, 25924561, 27799439]
14747B7799439J294563k25090k443054l433237l408609l688016l529033k695538
14739I671425j921195j387814j001947o32804n83925l27269m431p8404K75185
14730D008821M73814N55709Q26963J179591J343826J541783J792186J543083R18814
14721A4184590M24743O2336j088321j799968j919279j802532j648530j381023
14713E032016r81557q51049o75834m36249k23631j82652j24469k20455j27353
14704A208767j91075j61410m5810P4724M8861J40158l15299o5134N1256J56892
14694I01930j22850k24505O5341k0006J81176j0389k02865N5420M0547k24340
14684D39459j70822n8259J07060K4772K9661N5095J47132o0796j14363M0023j33768
$$ y = [27799439, 29094002, 28868912, 26425858, 22992621, 19584012, 15895996, 12366963, 9671425, 7750230, 6362416, 5360469, 4727665, 4143740, 3816471, 3812040, 3733636, 4008821, 4482635, 5038344, 5865307, 7044898, 8388724, 9930507, 11722693, 13265776, 14184590, 14609333, 14671669, 13583348, 11783380, 9864101, 8061569, 6413039, 5032016, 4050459, 3199410, 2523576, 2087327, 1863696, 1681044, 1556575, 1336120, 1208767, 1017692, 856282, 810472, 885196, 934057, 1074215, 758916, 693782, 745038, 901930, 779080, 554575, 619916, 599910, 781086, 770697, 567832, 623252, 663799, 439459, 268637, 210378, 317438, 342210, 371871, 426966, 574098, 513302, 398939, 438962, 305194]
14673C05194j01713q1132J13982j11399M9180J85L5773j4925k09407J79882J16873
14662B82493N175j08571k28340N4029J10691J94022Q871l3503q7135j45117r480
14651D3135J60172J94345J02881P0055k5911j32640j58522o0733M6516M8984r2278
14640A96004p8935m886r2837R1837O1336M0642M6329o4493o0920Q9407r009j62374
14628E2101r1226j44957J5891J12265K48553p863j17950O496N9084P3347O2665
14617B68406j585r0197R2329j3089N6396j512j08305q6110J17231Q4600r2216
14606B25948m7443l8232m2588R9853Q2558r6493j51023M3509P860q8149J02208
14595I8008J77409O8969j62885j71576J04591Q6481n053j9733N7222Q2586q6525
$$ y = [305194, 203481, 122349, 236331, 124932, 174112, 174297, 210070, 195145, -14262, 165620, 282493, 287668, 179097, -49243, 4786, 115477, 309499, 318370, 284867, 197732, 52615, 43135, 203307, 397652, 500533, 570588, 544677, 412037, 253515, 192782, 239298, 288282, 196004, 117069, 112183, 19346, 111183, 172519, 213161, 259490, 194997, 134077, 223484, 214475, 52101, -39125, -184082, -168191, -55926, 192627, 184764, 66814, 73310, 132394, 205741, 268406, 266821, 176624, 268953, 255864, 312260, 310748, 202443, 116333, 233564, 318164, 225948, 178505, 140273, 97685, 197538, 280096, 183603, 32580, 76089, 83949, -4200, 98008, 275417, 344386, 181501, 9925, 114516, 200997, 195944, 176211, 233433, 316019, 229494]
14584B29494l8528o5432k054p6852o0430N9251n6859O9639j512R3775Q5080q8499
14572A47073k29441M1574R4460q446n224J6241J51656J97989l9574j48224k4016
14561A94068M3560m4648j82718j17213J52523Q1886k21188l3393J91877Q6135
14551A50889j53088m4536r849J86600J70430j6696j35519j77465J45300K58471
14541C74537m6592j4564J44938N8998l16059j43199K7176q6226j04692q3326J88293
14530g16L59132J51827j45447k38592J4551J0430j54597j74492N1301J35848N4982
14519F4227k04634O6187N2343K24613p2283p2497r850j10067K35254Q6456P2455
14508C32204k47472j58703n3459P5673J46217K7817j48527J08802Q4241J16944
$$ y = [229494, 190966, 125534, 123480, 46628, -13802, 45449, -11410, 58229, 56717, 150492, 235572, 147073, -82368, -40794, 53666, 45220, 39996, 56237, 207893, 405882, 366308, 218084, 194068, 237628, 192980, 10262, -106951, 45572, 127458, -93730, -127123, 64754, 150889, -2199, -46735, -56584, 130016, 300446, 283750, 148231, -29234, 116066, 374537, 327945, 313381, 458319, 517317, 201258, 58059, 85235, -991, -105683, -189009, -716, 358416, 510243, 364796, 126204, 140755, 151185, -3412, -177904, -126603, 9245, 64227, -140407, -74220, -21877, 202736, 130453, 57956, 48106, -61961, 173293, 259749, 332204, 84732, -73971, -127430, -51757, 94460, 122277, -26250, 82552, 166793, 283737]
14498B83737j69664l14021j2409J79789l6651J6993Q609j69789J84375J62173
14488A33142p3440J02176J35701L3409j19834j06929R6630Q1585q4982n5481m7085
14477I4892p0127k7178K8407J60278n2369m8561n3714k5239R3117o7599p9613
14466d7706j37411J10547O9934J4573m1021L0775O6157J2984Q6940l1292q9460
14455D5020J14704r8874K4013o0519m7364l1576j12505P681m7018r227J64872
14444e0793P6432L1798K7806K7999l3945j98356J05375L199k947l3548M741j03851
14432a46090J15085K970n4579R2753J81788r3577j27670j9268J05940O7145J14856
14421B39353Q6770p3060k87579o9243J06848j9311m5626J56310J42388O7442p8111
$$ y = [283737, 114073, -199948, -212357, -32568, -69219, -52226, -43617, -213406, -29031, 133142, 59702, 161878, 297579, 330988, 211154, 104225, 200855, 282440, 197458, 141977, 94892, 24765, -2413, 25994, 186272, 133903, 85342, 31628, 6389, 99506, 31907, -47706, -185117, -74570, -4636, 9937, -31084, -309, 65848, 78832, 165772, 134480, 45020, 159724, 60850, 84863, 24344, -23020, -54596, -167101, -159420, -206438, -215665, -50793, 25639, 57437, 85243, 113242, 79297, -119059, -13684, -10485, -13432, -46980, -42239, -146090, -31005, -28035, -82614, 10139, 191927, 98350, -29320, -48588, 57352, 124497, 239353, 326123, 253063, -34516, -103759, 3089, -16222, -61848, 94462, 236850, 304292, 226181]
14410B26181j49995P8933K06922r5731j91901J826o234O0583o4158j09273J32975
14399I0128L456o4312N7226K08513n1575J85233j46218j60004p3037J6335O3461
14388A29206K7707p4803L605J03920P8401M1998L5303L2320j06372q2674q3290
14377A05321J1261J23993j52314j21399L7967O6868J9838Q8072j24724p1401M0476
14366B3958j01106j02221l0935m317P9506L22452J59285Q7855n2656m0345j20591
14355B20885M8317l4429p8869j13427M526J40686o7187p7893j79456j74864P5288
14344b36423l2834O5874J68535J97981J00458o6048p8990J4160P8715m0606L6628
14333B07450o8853Q710J07309o5081r1372n1418J50413J11044j22676Q2621N1451
$$ y = [226181, 76186, 155119, 362041, 266310, 74409, 76235, 70001, 130584, 66426, -42847, 90128, 93584, 29272, 86498, 295011, 243436, 428669, 282451, 122447, 49410, 65745, 129206, 156913, 82110, 85715, 189635, 268036, 310034, 345337, 377657, 271285, 188611, 105321, 116582, 240575, 88261, -33138, 4829, 71697, 91535, 179607, 54883, -16518, 23958, -77148, -179369, -210304, -214621, -135115, 187337, 346622, 434477, 381821, 341476, 220885, 269202, 234773, 155904, 42477, 47003, 187689, 120502, 42609, -136847, -311711, -236423, -269257, -203383, -34848, 163133, 263591, 197543, 118553, 132713, 211428, 170822, 207450, 138597, 147307, 254616, 189535, 98163, 46745, 197158, 308202, 185526, 268147, 319598]
14322C19598q1462J7242o5473O026j8710k9445J6150J1896N5587n7979k01122
14311b7692J01707J28389q6454l6211m4307r908J31409M0886n4667L5980J83823
14300C62955k5584k15153o0254L0970l9794r9277N2757M5908Q9954J9766p0588
14289I1660L2303j22885j6038k4823L4658j7544J9258q3280m6524J55003K06851
14278B28639l2324j58771Q2275J49588p4858o9760r5611N2789N6833N72N5492
14267A94864p5383m209n0013o3705K29576P6474o8919p3072j08379p9035J38949
14256A17148L9817J14800R2573j40393j6821R1285L9089m5341l0656J04610j11965
14245B54146j50277k50085j26003m5835Q7964J24623J978J74201K00210R1604
$$ y = [319598, 238136, 255378, 189905, 195931, 177221, 147776, 163926, 175822, 231409, 173430, -27692, 74015, 202404, 115950, 79739, 35432, 25524, 156933, 197819, 143152, 179132, 362955, 337371, 122218, 61964, 92934, 53140, -46137, 6620, 52528, 142482, 162248, 91660, 123963, 1078, -14960, -39783, -5125, -22669, -3411, -86691, -133215, 21788, 228639, 196315, 37544, 119819, 269407, 194549, 124789, 29178, 81967, 138800, 139372, 194864, 119481, 115272, 65259, 1554, 231130, 307604, 238685, 165613, 57234, -21801, 117148, 156965, 271765, 364338, 223945, 207124, 298409, 337498, 292157, 261501, 366111, 254146, 103869, -146216, -272219, -318054, -230090, -105467, -103489, 70712, 270922, 362526]
14235C62526r4757j52178o9783m2237j6180J42482J50655N6237n1729J2658j51833
14224A45861l12042j61862O4746K12841R9587p3764L2335m6928j31864j00434
14214b71524M3436K18060Q2634j42838j70503J12512J05976J10765J14709Q022
14204B11249p4193j01721O7888K4984r991l2027n4034N0293p9264j15654j7068
14193a29538K2916R7598L1704m3254n7203L1212o2294R0832J52332R1013j47975
14182G7343Q1605N6783n2899l0901J21346L575O4321K39190p2801j85542m3157
14171B58863j3771j25839N418o1290Q2998k25253q8359j3271J03406R5750j81822
14160a63170K2587j05682Q7189j08301j13921O6494J797L4824J36963Q2497M1770
$$ y = [362526, 267769, 115591, 45808, 3571, -12609, 129873, 280528, 336765, 285036, 297694, 145861, -166181, -328043, -263297, -50456, 49131, -24633, 7702, -39226, -171090, -271524, -228088, -10028, 72606, -70232, -240735, -128223, -22247, 88518, 203227, 211249, 137056, 35335, 103223, 128207, 118216, 86189, 32155, 82448, 3184, -112470, -129538, -106622, -9024, 22680, -20574, -77777, -46565, -108859, -18027, 134305, 225318, 77343, 158948, 215731, 162832, 131931, 253277, 256852, 321173, 560363, 487562, 302020, 258863, 245092, 119253, 124671, 63381, 146379, -78874, -167233, -180504, -77098, 18652, -163170, -140583, -246265, -159076, -267377, -381298, -314804, -313007, -278183, -141220, -58723, -16953]
14149a6953N7176J67620m5260p1805n1677k9307j31425p1668J09980O6456n8575
14138g5438j0697P3260r0378r394l300k9822j02264j34463L9102J59051J11403
14127g2940J2202m1681J17089J03449P2766k13076q5029o9574m1055j91340R6104
14116c13085K24484J03153Q892L3349m7297O1277l8933j75346j45151R4036N8265
14105a36356J16077J06626P88O8172j00482j67212j62002q3156L9279Q0011K12242
14094b6013m2061j68455O3741J02571L5794O9059J947N9245l5739N593J1553J96256
14082B73491R2171m3234n4830j24836J6953p136O2239j70325o5509l4622P3285
14071A7647r8362n6287N3544N211Q4384J5169M3967J25112n2279n0999O6179j9921
$$ y = [-16953, 40223, 207843, 162583, 90778, 39101, 9794, -121631, -193299, -83319, -16863, -75438, -86135, -12875, -103253, -112647, -115947, -145769, -248033, -382496, -343394, -184343, -72940, -60738, -102419, 14670, 118119, 190885, -22191, -107220, -176794, -217849, -409189, -313085, -88601, 14552, 23444, 56793, 9496, 70773, 31840, -143506, -288657, -194621, -136356, -20279, 86347, 87135, 155307, 54825, -112387, -274389, -357545, -318266, -238255, -26013, -68074, -236529, -172788, -70217, -34423, 34636, 36583, 95828, 60089, 65682, 77235, 273491, 365662, 322428, 267598, 142762, 159715, 152579, 214818, 44493, -21016, -55638, 17647, -80715, -137002, -83458, -78247, 6137, 21306, 65273, 190385, 138106, 87107, 153286, 133365]
14059A33365j17080J9299J3052O4483r7211p1312J01212M0560J10631o8204k97797
14048a69002j92438L47477J49412Q4834R4819l8848q0479j04194j52437M8160
14038a2696p3516j26997J62748L10462K1440j58407j83176j72106j6836J96130
14028e2954J15722j4511k29614O2403K5484P5015k3076j00220L9284R5638R466
14017B637J01784l5324q0293j48966J17505J78003R3345j07073k2579M2977L1768
14006A73784o0709n6995L5729j3906m6747O355N4621K7048l55784k33568R5073
13995c75099J16028J72885o8239o8161L89R6646K26530Q8147l9170j74150j77266
13984b01460j40086J1761N8485K64524K35185Q309m9570k51000k8148r8343O7729
$$ y = [133365, 16285, 35584, 48636, 113119, 15908, -55404, 45808, 86368, 196999, 128795, -169002, -361440, -13963, 135449, 220283, 315102, 276254, 195775, 91581, -60856, -12696, -86212, -213209, -50461, 260001, 281441, 123034, -60142, -232248, -249084, -52954, 62768, 48257, -181357, -118954, -93470, -18455, -41531, -141751, -102467, -6829, 2637, 104421, 69097, -11196, -160162, -42657, 135346, 228691, 121618, 99039, 142016, 173784, 113075, 56080, 91809, 77903, 31156, 37511, 92132, 119180, -236604, -470172, -375099, -259071, -86186, -154425, -222586, -222197, -125551, 100979, 189126, 149956, -24194, -201460, -341546, -329785, -271300, -6776, 228409, 236718, 187148, -63852, -92000, -190343, -122614]
13973a22614L5560o1816J26465J85459L6914q4813q4287j58389J03806N0533j0320
13962A6498q3826k0670K1526J30283L91o4815n6807o4754r70L8496J08337R3880
13950A17569j00738k12610j05385k3963q1953J60589J48055L8258j74739K07072
13940b7845r4796k3069m6017J23355o9082J44987o8529m3895j26720J6575m941
13929b19977M5124J88016K2014j6726J7648l6925l141K0572k2664o2956J50997
13918H1982J10787J07740j21911k47408J3592P0799N9421j13605j9186p4938R8049
13907c4678J59384J5473q8377m5006o5974j51637j4816J19068R5378j47086l9257
13896a97528L3878L5718r9112j35195j5445j2814Q8207K09278K40751J63874p6137
$$ y = [-122614, -87054, -148870, -22405, 163054, 199968, 115155, 30868, -127521, -23715, 26818, 16498, -67328, -87998, -66472, 63811, 64202, -613, -57420, -122174, -123144, -84648, 23689, 117569, 16831, -195779, -301164, -325127, -407080, -246491, -98436, -60178, -234917, -27845, -122641, -145710, -191727, -68372, -137454, 7533, -60996, -104891, -231611, -215036, -219977, -174853, 13163, 35177, 18451, 36099, -826, -3967, 16605, -6059, -69015, 81982, 192769, 300509, 178598, -68810, -55218, 15581, 75002, -38603, -57789, -132727, -34678, 124706, 140179, 51802, 6796, -59178, -210815, -225631, -106563, -11185, -158271, -197528, -163650, -127932, -227044, -362239, -377684, -390498, -302291, -93013, 147738, 311612, 235475]
13885B35475k52974j65475J13751J462j2963Q626j67474J4653K50087N5429J5964
13874I6561k2604m0091n155L3538k9848k7561J44627K9163j52929K7993j97811
13863a44117l2330J49446K01082J29426r3534n6374J3933l6659j18399p4561j09745
13852a71832J1489J46729L694J10614q0576j01414j040K1778j14322j03502J79681
13841i8701J11592J1916N2553p5165j9915J7365P3248P3341j839O9396p6161m8453
13829H9177P4504j00066k32467j75168o6133J11473J11466Q0685J53642o5765
13819a8652j88529p2241P2877N5175k9180J15391J23446J68626K2323j12274J1246
13808A48208n1158M6832o4532l3778j68319r7719J61935J63969j08405N3405P4970
$$ y = [235475, -17499, -182974, -69223, -67761, -80724, -72098, -239572, -224919, 25168, 80597, 96561, 73957, 33866, 28711, 62249, 32401, 4840, 149467, 178630, 25701, 53694, -144117, -176447, -27001, 174081, 303507, 209973, 153599, 167532, 130873, 12474, -62087, -171832, -160343, -13614, -9920, 100694, 20118, -81296, -82336, -60558, -174880, -278382, -98701, 12891, 24807, 77360, 2195, -17720, -355, 72893, 146234, 144395, 213791, 137630, 89177, 163681, 63615, -168852, -344020, -410153, -298680, -187214, -106529, 47113, -18652, -207181, -279422, -206545, -151370, -180550, -65159, 58287, 226913, 249236, 136962, 148208, 97050, 143882, 79350, 45572, -122747, -220466, -58531, 105438, -2967, 50438, 125408]
13797A25408J1490q5107j7110o3093K9703O842j31987l3934J9309j39879r2677
13786c71035Q598O3054m6262N1629J41231K0694l1807q0416O8481N0566J0585
13775a14682L6964P3088q156N3097r2052J3493m8662J4404O0052J21604j00207
13764H943J9818l2082j77242K78737K01374j44639k36974n5928m5745M7798K05853
13753F9913J4746j18511N1027j66305k01565J69685K63654J36362j716l9327j19114
13742E8849j14618R814P9792j29257Q9219n311j49294J11496P7183j72641J6651
13731a28117P0075m2220J39374M6646o8593l8989q1553j47132q1580k8963J70251
13720a90801O6051p371m9700o634K2748Q1045j8279J55547J16381q5502j16306
$$ y = [125408, 136898, 51791, 34681, -28412, 1291, 8133, -123854, -157788, -138479, -278358, -371035, -362437, -299383, -345645, -294016, -152785, -132091, -163898, -244314, -175833, -125267, -114682, -77718, -4630, -12786, 40311, -51741, -38248, -86910, -72506, -12454, 109150, 8943, 28761, -3321, -180563, 98174, 299548, 154909, -82065, -137993, -183738, -135940, 69913, 84659, -33852, 17175, -149130, -350695, -181010, 82644, 219006, 217290, 177963, 58849, -55769, -45955, 33837, -95420, -6201, -11512, -160806, -49310, 27873, -144768, -128117, -58042, -100262, 39112, 85758, 17165, -21824, -103377, -250509, -332089, -361052, -190801, -124750, -132121, -181821, -188455, -165707, -84662, -102941, 52606, 168987, 83485, -32821]
13709c2821j9267J05569M0607P3523P1629L6540J9184m6469o6792O05r9863j76235
13697i3790j12423N4279J43203N891j75002j23708Q1446J05565j20884m3523K41152
13686c7794J60263L4631p8374j90431P6389K4547p5436M4765O7107q543k1903
13675d779m6723r6009J1090J02207Q4444j8429q2703J2105K14162r6970j85195
13664a06800M5086J63682P478q2808j10772J5280k61J63854J45231q4714l0273
13653A24983J07005j09156p7765j17194J74579J79187K7403j70889j79155k1655
13643f2657j07549m9638j8029J97764J32881j65116k4941J4373m1807j6076J61875
13632B1080J22564o8923m0643j66859j73551p1436L1971K27345r1K1787Q1315
$$ y = [-32821, -52088, 53481, 94088, 167611, 239240, 275780, 294964, 248495, 181703, 182308, 82445, -93790, -206213, -151934, -8731, -2840, -177842, -301550, -220104, -114539, -235423, -278946, -37794, 122469, 157100, 78726, -111705, -35316, -10769, -86205, -41440, 25667, 17124, -4779, -51502, -147511, -136421, -34214, 50230, 31801, -50902, -38797, 175365, 78395, -106800, -61714, 101968, 109446, 26638, -84134, -68854, -69115, 94739, 239970, 155256, 124983, 231988, 122832, 45067, -72127, 102452, 281639, 309042, 138153, -41002, -62657, -170206, -219844, -237873, -40109, 92772, -72344, -97285, -82912, -124719, -140795, 21080, 143644, 74721, 34078, -132781, -306332, -377768, -345797, -118452, -118543, -96756, -15441]
13621a5441J0026o4397R0207J6581j8050j07800N296R0173Q9502r3888J39862
13610A42071L0682k00271p2514R3902M5131l7788J54989P576q2315l7047o7630
13599b3214o420l4629o2874k7334J3121N7514r1646J51390N8629o7676Q0334M8076
13587I5271n6783j19442R058J28652j2579r326J3100k952P0871J4612j14859m1080
13575b5457J3099j34610J3134J12426N8938n7901P8122l6001j935J68330J1036
13564A99181j22238L2259j94052m4785k565K7061M2302n7798r4817l2464M7786
13553b00130n0556j0434K0259k9629P5999j51804j29586O1232Q5468K63833L6678
13542b8670P0961J70190k0370J14315L2683r9932m4451n8755K2761q212j25914
$$ y = [-15441, -5415, -69812, 20395, 36976, 18926, -88874, -83578, 6595, 96097, 2209, 142071, 172753, -27518, -100032, -6130, 39001, 1213, 156202, 163778, 81463, 44416, -23214, -29634, -64263, -127137, -154471, -141350, -83836, -175482, -24092, 34537, -33139, 47195, 95271, 38488, -80954, -71896, 56756, 44177, 34851, 47951, 44999, 115870, 130482, 15623, -25457, -12358, -146968, -133834, -21408, 37530, -20371, 57751, 21750, 19815, 188145, 199181, 76943, 109202, -84850, -129635, -132200, -105139, -62837, -120635, -215452, -247916, -200130, -250686, -261120, -240861, -270490, -194491, -346295, -475881, -414649, -329181, -65348, -28670, 42291, 212481, 192111, 306426, 339109, 239177, 194726, 135971, 158732, 150520, 24606]
13531B4606p7994j28812R194k8981N9028N5370Q8287J34938R8361q9522L6059
13520A80534J54380K09311J91591K31594K49087q2276n41503k18949k0969k61922
13510I0878l9537J17309J8293q4154m9651J26041M0346p2350m3564j06140r9527
13499a02056n3806J61796K8064n6422k3560R9469R5421o7644M2442l5677j61284
13488g3257N9733J74383j5740n2487J67110m2044M0508J30568K2404J33649J67481
13477G12308J54708K69098M72871O30959N15200N78479M79911o14427j286059
13468A913048n70399l46098k04856Q9754j5629j34762j20737j50724J6731n4335
13458D21993l9743j00677j53609j16445R8235K4494L8040l6032J48817M9618r6785
$$ y = [24606, -53388, -182200, -173006, -201987, -142959, -87589, 698, 135636, 233997, 144475, 180534, 334914, 544225, 735816, 967410, 1216497, 1134221, 592718, 373769, 352800, 90878, 51341, 168650, 186943, 102789, 53138, 179179, 219525, 147175, 103611, -2529, -102056, -155862, 5934, 33998, -22424, -45984, 53485, 148906, 81262, 123704, 88027, -73257, -13524, 160859, 145119, 92632, 259742, 217698, 258206, 388774, 411178, 544827, 712308, 867016, 1136114, 1608985, 2239944, 2755144, 3333623, 3813534, 3199107, 1913048, 1342649, 996551, 791695, 881449, 865820, 731058, 610321, 459597, 476328, 421993, 382250, 281573, 127964, 11519, 109754, 134248, 172288, 136256, 285073, 334691, 237906]
13447B37906P3895n7808j01874K260J46764j08437L8893L7956J1998J74411J45880
13436F01844l7771m1152J73316J01309K18178M89166N29805M52409O15272O27849
13426C730225L7562r10091r75770o69829l47157k31938o7830k1478J8934j29544
13416D33084q1844N646p4276L3052Q5806n8232n9099Q2288P420r1429L2550J67687
13404D82653P4489J06372O083m4091K23444j6639l14698l04345j28548j23547
13394c8827o8145j6457J73441J23607K0399O1123P8794J54240J43422J92517K23287
13383A047401K73572Q9977j77539l95131k70643n3194p2857L1033J4181N8392
13373E45192J10141N6594j67116j05369O0035j07824j46198j21847O8864J85484
$$ y = [237906, 311801, 253993, 152119, 154379, 301143, 192706, 231599, 269555, 281553, 455964, 601844, 564073, 522921, 696237, 797546, 1015724, 1504890, 2034695, 2487104, 3102376, 3730225, 3767787, 2857696, 1881926, 1212097, 864940, 633002, 565172, 543694, 562628, 433084, 351240, 356886, 282610, 315662, 401468, 343236, 284137, 366425, 373845, 282416, 314966, 482653, 557142, 663514, 669597, 625506, 848950, 832311, 517613, 213268, 84720, -38827, -106972, -123429, 50012, 173619, 194018, 255141, 333935, 488175, 631597, 824114, 1047401, 1320973, 1410950, 1233411, 838280, 567637, 514443, 441586, 472619, 486800, 545192, 655333, 711927, 544811, 439442, 499477, 391653, 245455, 123608, 192472, 377956]
13363C77956Q3391j72333j5116J06453k3052j29079j40185l9305o2411N842k3423
13352c1262K08531N943m2137Q1787K8365r5433j33220j11748Q2197J53025J77895
13341C23943J69387j57180j07634J51189o2529j04879O5325P360m7352J3309p7575
13330A73364n3589Q5939Q8582O877m7325K0430K7446j49510L7149J48634K4411
13319C62408j86304j07967J77869J41391o1772k14392p5933P6288P6241o4175
13309A23654j22759R5097n185q2675j16891K04871p335n4537J2936P0757N2816
13298A70749K03776Q045p5640m2958l1546j44845K5373M8704j37361L8150R8909
13287A61356j6350l9336n5500k16748r0065j26123O5422J1437J89438J44128o7714
$$ y = [377956, 461347, 289014, 273898, 380351, 357299, 228220, 88035, 48730, -13681, -7839, -31262, 177269, 183212, 141075, 222862, 251227, 155794, 22574, -89174, -6977, 146048, 323943, 493330, 336150, 228516, 379705, 317176, 212297, 277622, 284982, 237630, 250939, 173364, 119775, 205714, 294296, 301173, 253848, 274278, 301724, 152214, 189363, 337997, 362408, 176104, 68137, 246006, 387397, 325625, 111233, 35300, 111588, 187829, 123654, 895, 95992, 90807, 8132, -108759, 96112, 88777, 34240, 47176, 117933, 170749, 374525, 382570, 306930, 263972, 232426, 87581, 112954, 161658, 24297, 62447, 161356, 145006, 105670, 50170, -166578, -256643, -382766, -317344, -305907, -116469, 27659, -40055]
13276d0055M108L8762M0849J41026R9706n3194q5461L9001k340q8908p7514N7950
13264G3930P0949Q601N3897j43211r4381N3413m2382j9121n1274p5457l8861M2899
13252a60998o0042r885o586n168P3319K93874o2090k30202j15541l2848l2528
13241c48695Q1544P4338O5036P0350J089Q6018N4404q5728p9932J48464J16844
13230A83732N8213p0504k013k6611j85463K0444O7608q3309n5714K7647J02076
13219C6106P6345j74570j97476j8358N3236j12117j54496J12270k7211n0591R8856
13208c58006J09185J0071P9624k2139j32400n2013P1337J60648r7751O471Q4666
13197a40307J97227Q9975o7675p9991P7411J50330o5136p2525O5523J38121M8663
$$ y = [-40055, -35947, 2815, 43664, 184690, 284396, 231202, 145741, 184742, 182402, 93494, 15980, 73930, 144879, 153480, 207377, 64166, -30215, 23198, -19184, -38305, -89579, -165036, -203897, -160998, -221040, -230925, -237511, -242679, -169360, 124514, 62424, -167778, -283319, -316167, -348695, -267151, -192813, -127777, -57427, -56338, 29680, 84084, -1644, -81576, 66888, 183732, 241945, 171441, 169428, 142817, -42646, -22202, 45406, -37903, -93617, -65970, 36106, 112451, -62119, -259595, -277953, -224717, -336834, -491330, -379060, -406271, -456862, -358006, -248821, -238750, -159126, -181265, -313665, -365678, -294341, -133693, -231444, -224973, -140307, 56920, 146895, 79220, -771, 76640, 226970, 161834, 89309, 154832, 292953, 341616]
13186C41616j54159j29223p4558k6353J07534Q8970j2804q4612l0861P7206j30308
13175b7552m8641R805L8669J5252n8418j14052p0815K5812J23993Q3047K6109
13164C209J26887L9352m6108k35481M579P7428Q568R4516J06019Q1360r8216k8232
13152A33881m3187j9022j00650n7628J57066P3860L2752J32621j02323j28670
13142G8700p6819j54854J51817J21856K9102L7164j20914j83946Q3417n4579N3242
13131c5814J57399L4517j0056n5610j1450k8428J75073l9547r9210j47405M9538
13120a0993M1709L7687n6079n8512J14973L424n6989P5688K19187m4249R5581
13109C61427J17782n9099j04476k9703j91370N7232R0085M0579j15509j62088
$$ y = [341616, 187457, 58234, -16324, -42677, 64857, 153827, 141023, 56411, 25550, 102756, -27552, -76193, -66388, -27719, -12467, -70885, -184937, -255752, -229940, -105947, -22900, 3209, 130096, 169448, 123340, -112141, -107562, -30134, -21566, 72950, 178969, 260329, 162113, 133881, 90694, 71672, -28978, -86606, 70460, 144320, 177072, 309693, 207370, 78700, 1881, -152973, -1156, 120700, 149802, 186966, 66052, -117894, -34477, -89056, -35814, 121585, 156102, 146046, 90436, 78986, 50558, 225631, 186084, 86874, -60531, -10993, 30716, 68403, 12324, -46188, 68785, 72209, 15220, 90908, 310095, 265846, 361427, 479209, 420110, 315634, 285931, 94561, 151793, 241878, 282457, 166948, 4860]
13099D860K0886j3114n1840l2664N7570K17127K30669p6516J876J10714m9669
13088D19899p1891m7426R7638K06703o9742p2512k16836n4704Q2678P7224N1119
13077D02150o9372p4725p3369J0216R3800l5267k8070R4713l294o2602j62057
13066I2123j30361J67758J91607p2209j49777q6826j6741R3312P9362K9550p4693
13055A23105j12647j71538Q4702k3177q6366J23046J14589j34690R8982J85376
13045B01382l3999Q8765N0003L5391p7412j83188l9762m6795R7665J71400P6086
13034C39536L0040m9348K3109p026j4818j46792j13339p9415k937q5938K951J99495
13022I5518K02196L8520O260j1374l3227j75152k690P9386K45904O9987R679M0070
$$ y = [4860, 25746, 12632, -39208, -71872, -14302, 202825, 433494, 356978, 358854, 469568, 419899, 348008, 300582, 398220, 604923, 535181, 462669, 245833, 191129, 273807, 351031, 402150, 332778, 258053, 184684, 194900, 288700, 253433, 225363, 320076, 316782, 254180, 92123, -38238, 129520, 321127, 248918, 99141, 12315, -4426, 88886, 168248, 197798, 123105, 10458, -161080, -76378, -99555, -185921, -62875, 51714, -82976, 16006, 201382, 167383, 256148, 306151, 341542, 264130, 80942, 41180, -5615, 92050, 263450, 339536, 369576, 320228, 343337, 336311, 321493, 174701, 61362, -18053, -20990, -106928, -103977, 95518, 297714, 336234, 342494, 331120, 297893, 122741, 120051, 199437, 445341, 515328, 525007, 565077]
13010E65077Q0546o9966M2392j00618J90790J58632P337k5534J46460K00803K80545
12999A476464K59523J74700p4591R9076N8665j88298M1700K31075M5741J93965
12989B318020M14169N49466O97911P47619J029350J358521J934759K162895K675850
12980A3888560L260305L991573M532842M685535L971582K620625J829500P84838
12972C9565360o20071k143791k842200l030259l262912l430472l486554l235055
12964A7514046k554914j868667j141846m13057L16004P70434J237462J761306
12956A5620768K549325L246198M006527M754826N583506N990555O207625N677486
12948E3636816M617931M245324L420888J313215l82707j318983k637850l876703
$$ y = [565077, 645623, 575657, 618049, 517431, 708221, 866853, 874190, 848656, 995116, 1195919, 1476464, 1735987, 1910687, 1836096, 1935172, 1993837, 1805539, 1847239, 2078314, 2124055, 2318020, 2732189, 3281655, 3979566, 4727185, 5756535, 7115056, 9049815, 11212710, 13888560, 17148865, 21140438, 25673280, 30358815, 34330397, 36951022, 38780522, 39565360, 38945289, 36801498, 33959298, 30929039, 27666127, 24235655, 20749101, 17514046, 14959132, 13090465, 11948619, 11535562, 11851566, 12622000, 13859462, 15620768, 18170093, 21416291, 25422818, 30177644, 35761150, 41751705, 47959330, 53636816, 58254747, 62500071, 65920959, 67234174, 66851467, 65532484, 62894634, 59017931]
12940E9017931m796967m589618m198790m197052m430366m097995l686794l346899
$$ y = [59017931, 54220964, 49631346, 45432556, 41235504, 36805138, 32707143, 29020349, 25673450]
$$ [...]
##END NTUPLES=NMR SPECTRUM
##END=
