##TITLE=Analysis number 328145
Compound Code cc 58826
Book Reference 508/92
Project Code adrs
Chemist Name antons
##JCAMPDX= 6.0         $$ Bruker NMR JCAMP-DX V2.0
##DATA TYPE= NMR SPECTRUM
##DATA CLASS= NTUPLES
##ORIGIN= Bruker BioSpin GmbH
##OWNER= nmr
$$ XWIN-NMR		Version 3.5
$$ Tue May  8 14:17:44 2007 GMT Daylight Time (UT+1h)  MAYBRIDGE\nmr@NMR_250MHZ
##.OBSERVE FREQUENCY= 250.131544655141
##.OBSERVE NUCLEUS= ^1H
##.ACQUISITION MODE= SIMULTANEOUS (DQD)
##.ACQUISITION SCHEME= undefined
##.AVERAGES= 16
##.DIGITISER RES= 18
##SPECTROMETER/DATA SYSTEM= dpx250
##.PULSE SEQUENCE= zg30
##.SOLVENT NAME= CDCl3
##.SHIFT REFERENCE= (INTERNAL, CDCl3, 0, 16.4482)
##AUDIT TRAIL= $$ (NUMBER, WHEN, WHO, WHERE, WHAT)
$$ ##TITLE= Audit trail, XWIN-NMR		Version 3.5
$$ ##JCAMPDX= 5.01
$$ ##ORIGIN= Bruker BioSpin GmbH
$$ ##OWNER= nmr
$$ C:\u/data/dgb/nmr/ADRS/540/pdata/1/auditp.txt
$$ ##AUDIT TRAIL=  $$ (NUMBER, WHEN, WHO, WHERE, WHAT)
(   1,<2007-05-08 14:17:23.01 +100>,<MAYBRIDGE\nmr>,<NMR_250MHZ>,
      <created by zg, POWCHK disabled, PULCHK disabled
       configuration hash MD5:
       76 6E 9A 78 1E 09 19 81 EC 84 63 8F B0 6A 59 2D
       data hash MD5: 64K
       8F 1C C5 C6 FA A8 D1 17 B6 75 7D 11 46 4A 9A 72>)
(   2,<2007-05-08 14:17:34.28 +100>,<MAYBRIDGE\nmr>,<NMR_250MHZ>,
      <Start of raw data processing
       ef LB = 0.3 FT_mod = 6 PKNL = 1 SI = 32K 
       data hash MD5: 32K
       F0 0E 5A 13 B3 F8 E0 91 45 D8 AA 4B D1 F6 1C 3F>)
(   3,<2007-05-08 14:17:35.85 +100>,<MAYBRIDGE\nmr>,<NMR_250MHZ>,
      <apk 
       data hash MD5: 32K
       12 76 43 2D 21 7A 62 11 CC 0A 45 1E B0 8E 69 26>)
(   4,<2007-05-08 14:17:36.56 +100>,<MAYBRIDGE\nmr>,<NMR_250MHZ>,
      <abs ABSG = 5 
       data hash MD5: 32K
       B4 B0 AF DC 74 7E 6E 01 71 E0 D5 E4 AE A0 2C 84>)
$$ ##END=
$$ 
$$ hash MD5
$$ 33 2C CD B3 E7 56 7C 12 BE F1 97 E4 72 16 DF 44
##$RELAX= 
##$RELAX= 
##$RELAX= 
##$RELAX= 
##$RELAX= 
##$RELAX= 
##$RELAX= 
$$ Bruker specific parameters
$$ --------------------------
##$DU= <C:\u>
##$EXPNO= 540
##$NAME= <ADRS>
##$PROCNO= 1
##$TYPE= <nmr>
##$USER= <dgb>
##$AMP= (0..31)
100 100 100 100 100 100 100 100 100 100 100 100 100 100 100 100 100 100 
100 100 100 100 100 100 100 100 100 100 100 100 100 100 
##$AQSEQ= 0
##$AQ_mod= 3
##$AUNM= <au_zg>
##$AUTOPOS= <23 >
##$BF1= 250.13
##$BF2= 250.13
##$BF3= 250.13
##$BF4= 250.13
##$BF5= 500.13
##$BF6= 500.13
##$BF7= 500.13
##$BF8= 500.13
##$BYTORDA= 1
##$CFDGTYP= 0
##$CFRGTYP= 5
##$CHEMSTR= <none>
##$CNST= (0..31)
1 1 145 1 1 1 1 1 1 1 1 1 1 1 1 1 1 1 1 1 1 1 1 1 1 1 1 1 1 1 1 1 
##$CPDPRG= <>
##$CPDPRG1= <>
##$CPDPRG2= <>
##$CPDPRG3= <>
##$CPDPRG4= <mlev>
##$CPDPRG5= <mlev>
##$CPDPRG6= <mlev>
##$CPDPRG7= <mlev>
##$CPDPRG8= <mlev>
##$CPDPRGB= <>
##$CPDPRGT= <>
##$D= (0..31)
0 1 0 0 0 0 0 0 0 0.06 0 0 0 0 0 0 0.0002 0 0 0 0 0 0 0 0 0 0 0 0 0 0 
0 
##$DATE= 1178630241
##$DBL= (0..7)
120 120 120 120 120 120 120 120 
##$DBP= (0..7)
150 150 150 150 150 150 150 150 
##$DBP07= 0
##$DBPNAM0= <>
##$DBPNAM1= <>
$$ [...]
##$SUBNAM7= <"">
##$SUBNAM8= <"">
##$SUBNAM9= <"">
##$SW= 20.6930455092707
##$SWIBOX= (0..15)
0 0 3 0 0 0 0 0 0 0 0 0 0 0 0 0 
##$SW_h= 5175.983436853
##$TD= 65536
##$TD0= 1
##$TE= 683.16
##$TE2= 300
##$TE3= 300
##$TEG= 300
##$TL= (0..7)
0 120 120 120 120 120 120 120 
##$TP= (0..7)
150 150 150 150 150 150 150 150 
##$TP07= 0
##$TPNAME0= <>
##$TPNAME1= <>
##$TPNAME2= <>
##$TPNAME3= <>
##$TPNAME4= <>
##$TPNAME5= <>
##$TPNAME6= <>
##$TPNAME7= <>
##$TPOAL= (0..7)
0.5 0.5 0.5 0.5 0.5 0.5 0.5 0.5 
##$TPOFFS= (0..7)
0 0 0 0 0 0 0 0 
##$TUNHIN= 0
##$TUNHOUT= 0
##$TUNXOUT= 0
##$USERA1= <user>
##$USERA2= <user>
##$USERA3= <user>
##$USERA4= <user>
##$USERA5= <user>
##$V9= 5
##$VALIST= <valist>
##$VCLIST= <CCCCCCCCCCCCCCC>
##$VD= 0
##$VDLIST= <DDDDDDDDDDDDDDD>
##$VPLIST= <PPPPPPPPPPPPPPP>
##$VTLIST= <TTTTTTTTTTTTTTT>
##$WBST= 1024
##$WBSW= 4
##$XGAIN= (0..3)
0 0 0 0 
##$XL= 0
##$YL= 0
##$YMAX_a= 320033
##$YMIN_a= -221238
##$ZGOPTNS= <>
##$ZL1= 120
##$ZL2= 120
##$ZL3= 120
##$ZL4= 120
##$ABSF1= 16.44825
##$ABSF2= -4.244923
##$ABSG= 5
##$ABSL= 3
##$ALPHA= 0
##$AQORDER= 0
##$ASSFAC= 0
##$ASSFACI= 0
##$ASSFACX= 0
##$ASSWID= 0
##$AUNMP= <proc_1d>
##$AZFE= 0.1
##$AZFW= 0.1
##$BCFW= 0
##$BC_mod= 0
##$BYTORDP= 0
##$COROFFS= 0
##$CY= 12.5
##$DATMOD= 1
##$DC= 0
##$DFILT= <>
##$DTYPP= 0
##$F1P= 14.0000005364418
##$F2P= -0.99999901652339
##$FCOR= 0.5
##$FTSIZE= 32768
##$FT_mod= 6
##$GAMMA= 0
##$GB= 0
##$INTBC= 1
##$INTSCL= 1
##$ISEN= 128
##$LB= 0.3
##$LEV0= 0
##$LPBIN= 0
##$MAXI= 10000
##$MC2= 0
##$MEAN= 0
##$ME_mod= 0
##$MI= 0
##$NCOEF= 0
##$NC_proc= -5
##$NLEV= 6
##$NOISF1= 0
##$NOISF2= 0
##$NSP= 0
##$NTH_PI= 0
##$NZP= 0
##$OFFSET= 16.44825
##$PC= 1
##$PHC0= -50.89206
##$PHC1= 7.342216
##$PH_mod= 1
##$PKNL= yes
##$PPARMOD= 0
##$PSCAL= 4
##$PSIGN= 0
##$REVERSE= no
##$SF= 250.130018446012
##$SI= 32768
##$SIGF1= 0
##$SIGF2= 0
##$SINO= 400
##$SIOLD= 32768
##$SREGLST= <1H.CDCl3>
##$SSB= 0
##$STSI= 32768
##$STSR= 0
##$SW_p= 5175.98343685301
##$SYMM= 0
##$S_DEV= 0
##$TDeff= 65536
##$TDoff= 0
##$TI= <Analysis number 999999
Compound Code 99
Book Reference 9
Project Code 9>
##$TILT= no
##$TM1= 0
##$TM2= 0
##$TOPLEV= 0
##$USERP1= <user>
##$USERP2= <user>
##$USERP3= <user>
##$USERP4= <user>
##$USERP5= <user>
##$WDW= 1
##$XDIM= 32768
##$YMAX_p= 510281205
##$YMIN_p= -645061
$$ End of Bruker specific parameters
$$ ---------------------------------
##NTUPLES= NMR SPECTRUM
##VAR_NAME=  FREQUENCY,     SPECTRUM/REAL,   SPECTRUM/IMAG
##SYMBOL=    X,             R,               I
##VAR_TYPE=  INDEPENDENT,   DEPENDENT,       DEPENDENT
##VAR_FORM=  AFFN,          ASDF,            ASDF
##VAR_DIM=   32768,         32768,           32768
##UNITS=     HZ,            ARBITRARY UNITS, ARBITRARY UNITS
##FACTOR=    0.157963299565203, 1,           1
##FIRST=     4114.20103010444, 0,            0
##LAST=      -1061.78240674857, 0,           0
##MIN=       -1061.78240674857, -645061,     0
##MAX=       4114.20103010444, 510281205,    0
$$ Real data points
##PAGE= N=1
##DATA TABLE= (X++(R..R)), XYDATA
$$ [...]
$$ plain form
22051 -98661 -219372 -227305 -116510 -5501 16347 -25483 -101939 -202575 -422176 -401887 -153353
22040 -153353 -165476 -129101 -1248 17221 -123168 -168961 -247716 -284661 -333391 -231904 -379174
22029 -379174 -498371 -331638 -179016 -241808 -158798 -144174 -114655 -56428 6321 29649 -89021
22018 -89021 -121396 -18506 52821 92848 -117061 -230350 -159077 -122606 4317 51604 -40482
22007 -40482 -73156 -183057 -273605 -268535 -274918 -294380 -164380 21489 -191550 -114200 54766
21996 54766 46780 100715 23264 -110826 -125257 99345 12305 -120040 -25189 102288 33769
21985 33769 93017 102388 10909 -57884 62335 248588 385399 247136 186665 55309 -37905
21974 -37905 -95520 -125966 -57399 2595 -12412 -88609 -150980 -38206 28313 35752 66490 -16836
$$ packed form
22051i8661j20711p933J10795J11009K1848m1830p6456j00636k19601K0289K48534
22040a53353j2123L6375J27853J8469j40389m5793p8755l6945m8730J01487j47270
22029c79174j19197J66733J52622o2792Q3010J4624K9519N8227O2749K3328j18670
22018h9021l2375J02890P1327M0027k09909j13289P1273L6471J26923M7287r2086
22007d0482l2674j09901r0548N070o383j9462J30000J85869k13039P7350J68966
21996E4766p986N3935p7451j34090j4431K24602q7040j32345R4851J27477o8519
21985C3769N9248R371r1479o8793J20219J86253J36811j38263o0471j31356r3214
21974c7905n7615l0446O8567N9994j5007p6197o2371J12774O6519P439L0738q3326
$$ plain form
21962 -16836 -145713 -179635 -108292 -79029 66369 148043 108329 99892 50986 -50193 -116776
21951 -116776 -85880 28402 -90833 -138326 -126441 -83485 -146567 -23917 -15510 -79093 -118819
21940 -118819 -1153 47590 -52837 -147262 -227416 -263329 -248006 -280346 -421645 -241247 -12910
21929 -12910 54652 46429 120142 151201 169291 150311 29851 10785 -83049 -54823 -10301 -51970
21917 -51970 -22384 31644 126341 262673 220150 134345 -55309 -203912 -144294 -16518 70361
21906 70361 48860 -207860 -197019 -23985 80916 60365 -31677 4237 122631 245895 103608
21895 103608 76971 30912 -83263 -134593 -146083 -139219 -168944 -164811 -144685 -18455 -26662 -137902
21883 -137902 -158264 -151506 -128681 -123559 -93655 88728 -22067 -138918 -111830 -49856 10785
$$ packed form
21962a6836j28877l3922P1343K9263J45398Q1674l9714q437m8906j01179o6583
21951a16776L0896J14282j19235m7493J1885M2956o3082J22650Q407o3583l9726
21940a18819J17666M8743j00427r4425q0154l5913J5323l2340j41299J80398K28337
21929a2910O7562q223P3713L1059J8090j8980j20460j9066r3834K8226M4522m1669
21917e1970K9586N4028R4697J36332m2523q5805j89654j48603N9618J27776Q6879
21906G0361k1501k56720J0841J73034J04901k0551r2042L5914J18394J23264j42287
21895A03608k6637m6059j14175n1330j1490O864k9725M133K0126J26230q207j11240
21883a37902k0362O758K2825N122K9904J82383j10795j16851K7088O1974O0641
$$ plain form
21872 10785 -27025 -76223 -188515 -148878 -92567 -68344 -92063 -89181 -49402 -189172 -142150
21861 -142150 76268 130406 79041 57047 325 50335 -109505 -322571 -332984 -197422 -228387
21850 -228387 -172884 43628 -62727 -122776 -49321 -113500 -221129 -157775 -81883 24726 104580
21839 104580 49427 -46778 -188945 -279972 -68290 -50530 -45000 -69360 -51076 -7252 73929
21828 73929 -85899 -295590 -272476 -161026 -237531 -221747 -254630 -50943 -23926 -16346 25862
21817 25862 3445 17087 84283 13541 -42462 -45427 93541 140101 65063 179524 229720
21806 229720 216316 -481 5863 50462 -29887 -148345 -157621 -248434 -84243 74135 4557
21795 4557 -114673 -269775 -265115 -162996 -204422 -165105 -195099 -186450 -250034 -160849 5596
$$ packed form
21872A0785l7810m9198j12292L9637N6311K4223k3719K882L9779j39770M7022
21861a42150K18418N4138n1365k1994n6722N0010j59840k13066j0413J35562l0965
21850b28387N5503K16512j06355o0049P3455o4179j07629O3354P5892J06609P9854
21839A04580n5153r6205j42167r1027K11682J7760N530k4360J8284M3824Q1181
21828G3929j59828k09691K3114J11450p6505J5784l2883K03687K7017P580M2208
21817B5862k2417J3642O7196p0742n6003k965J38968M6560p5038J14461N0196
21806B29720j3404k16797O344M4599q0349j18458r276r0813J64191J58378o9578
21795D557j19230j55102M660J02119m1426L9317k9994Q649o3584Q9185J66445
$$ plain form
21784 5596 44250 -111505 -274420 -283729 -210977 -184930 -109564 -140315 -205918 -164226 -247158 -332038
21772 -332038 -346094 -232949 -16817 -2562 106088 -136 -141263 -135482 -147402 -172690 -33303
21761 -33303 -30379 -184356 -184277 -75203 2470 -30289 -2363 105859 32624 -13983 -76745 108326
21749 108326 294291 134175 -23862 -141322 -88498 -136909 -188632 -300450 -219300 -16340
21739 -16340 13290 -202770 -269163 -279411 -163471 -220440 -43986 167003 108643 -183317 -263592
21728 -263592 -232162 -120215 -90401 186494 159728 -16155 -226419 -375014 -233518 -120314
21718 -120314 5504 -41757 -11421 -97552 -235350 -328020 -366578 -349349 -100881 -33266 42094
21707 42094 125198 77989 90087 210289 158362 254321 485313 569966 225363 67705 -43887
$$ packed form
21784E596L8654j55755j62915r309P2752K6047P5366l0751o5603M1692q2932q4880
21772c32038j4056J13145K16132J4255J08650j06224j41127N781j1920k5288J39387
21761c3303K924j53977P9J09074P7673l2759K7926J08222p3235m6607o2762J85071
21749A08326J85965j60116j58037j17460N2824m8411n1723j11818Q1150K02960
21739a6340K9630k16060o6393j0248J15940n6969J76454K10989n8360k91960q0275
21728b63592L1430J11947K9814K76895k6766j75883k10264j48595J41496J13204
21718a20314J25818m7261L0336q6131j37798r2670l8558J7229K48468O7615P5360
21707D2094Q3104m7209J2098J20202n1927R5959K30992Q4653l44603j57658j11592
$$ plain form
21696 -43887 -163739 -80159 -32563 -146234 -324547 -263736 -137460 -34076 -187147 -77291
21686 -77291 81472 84798 51576 -31477 49712 33591 -101587 -168674 -101830 -99723 72610
21675 72610 147677 11672 -2016 26398 -30789 -79660 -159268 -87832 -52367 -121095 -140517
21664 -140517 -106982 -119777 -248753 -420181 -488152 -486344 -383607 -101053 -14522 -16812 -160497
21653 -160497 -370608 -283465 -213344 -137865 -182214 -6616 149403 235934 135956 50963 15779
21642 15779 -79140 -48142 117037 28062 -69928 -121735 -123780 -141791 -88473 -127392 -182481 -166935
21630 -166935 -122918 -32498 -62462 43742 140272 126779 9136 -112913 -97117 -52978 -39436
21619 -39436 -89211 -28104 45260 163710 14018 -53772 179590 111735 -124531 -225822 -201325
$$ packed form
21696d3887j19852Q3580M7596j13671j78313O0811J26276J03384j53071J09856
21686g7291J58763L326l3222q3053Q1189j6121j35178o7087O6844K107J72333
21675G2610P5067j36005j3688K8414n7187m8871p9608P1436L5465o8728j9422
21664a40517L3535j2795j28976j71428o7971J808J02737K82554Q6531k290j43685
21653a60497k10111Q7143P0121P5479m4349J75598J56019Q6531r9978q4993l5184
21642A5779r4919L0998J65179q8975r7990n1807k045j8011N3318l8919n5089J5546
21630a66935M4017R0420k9964J06204R6530j3493j17643j22049J5796M4139J3542
21619c9436m9775O1107P3364J18450j49692o7790K33362o7855k36266j01291K4497
$$ plain form
21608 -201325 -136348 -118762 -102042 -226490 -238993 -206243 46023 119587 22477 -149022 -165040
21597 -165040 -209736 -258104 -115821 93562 82207 -79175 -95297 -94108 -102571 -212069 -2327
21586 -2327 -12836 -53591 -25784 82291 107992 94625 266934 260454 177614 290297 327171
21575 327171 183059 28837 -128033 -256588 -212291 -120875 -5179 -104551 -239847 -310271
21565 -310271 -383972 -450654 -472799 -280726 -138409 -100480 -99777 -166862 -246263 -340031 -198405
21554 -198405 -67991 -69402 -74992 1989 -21939 -54930 -33249 136376 -4579 -42351 16939
21543 16939 -63129 -65197 -31681 -55214 -59890 35031 -62715 -89193 -30156 58770 -21288 -127253
21531 -127253 -136557 -336249 -231529 -155169 -149040 -122719 -52601 -48724 90773 87042 65650 131812
$$ packed form
21608b01325O4977J7586J6720j24448j2503L2750K52266P3564r7110j71499j6018
21597a65040m4696m8368J42283K09383j1355j61382j6122J189q463j09498K09742
21586b327j0509m0755K7807J08075K5701j3367J72309o480q2840J12683L6874
21575C27171j44112j54222j56870j28555M4297R1416J15696r9372j35296p0424
21565c10271p3701o6682k2145J92073J42317L7929P03o7085p9401r3768J41626
21554a98405J30414j411n590P6981k3928l2991K1681J69625j40955l7772N9290
21543A6939q0068k068L3516k3533m676R4921r7746k6478N9037Q8926q0058j05965
21531a27253r304j99692J04720P6360O129K6321P0118L877J39497l731k1392O6162
$$ plain form
21519 131812 242008 152346 29133 -267158 -169351 34969 -5942 32676 -72254 -116260
21509 -116260 66853 152866 293656 169097 106346 194984 115144 84681 112953 72567 -142166
21498 -142166 -151089 70333 200304 231399 119315 22906 -63594 3298 58847 36941 -37116
21487 -37116 34561 -89080 -119964 46409 65431 74556 18961 -141073 -110700 -270505 -349418
21476 -349418 -170988 -95418 -214172 -260250 -161062 -19456 -125542 -174924 -123728 -159897 -97553
21465 -97553 -149979 149567 278131 176711 34167 -83584 -118011 -101674 65413 195622
21455 195622 196039 90803 -52417 -120200 -239950 -222572 -136030 -115311 -257108 -318503 -97734
21444 -97734 1070 -40255 30856 133884 145442 319627 302923 44377 -259655 -276764 -74370
$$ packed form
21519A31812J10196q9662j23213k96291R7807K04320m0911L8618j04930m4006
21509a16260J83113Q6013J40790j24559o2751Q8638p9840l0463K8272m0386k14733
21498a42166q923K21422J29971L1095j12084r6409q6500O6892N5549k1906p4057
21487c7116P1677j23641l0884J66373J9022R125n5595j60034L0373j59805p8913
21476c49418J78430P5570j18754m6078R9188J41606j06086m9382N1196l6169O2344
21465i7553n2426K99546J28564j01420j42544j17751l4427J6337J67087J30209
21455A95622M17j05236j43220o7783j19750J7378Q6542K0719j41797o1395K20769
21444i7734R8804m1325P1111J03028J1558J74185j6704k58546l04032j7109K02394
$$ plain form
21433 -74370 -74619 -108232 3290 175118 206967 -3154 -190128 -109959 -86677 -8253 142316
21422 142316 181241 146153 40491 -133811 -209621 -168713 -131636 -142101 -133167 -173418 -292711
21411 -292711 -370205 -241957 -138718 -128974 -152019 -241582 -297811 -340750 -239309 -82648 -39686
21400 -39686 25491 15474 -38082 -126223 -249679 -95965 99341 6273 -35084 -130419 -103787
21389 -103787 182463 144990 -107188 -128891 -64264 -84394 -176155 -143425 -144767 -134308 -145803
21378 -145803 -27661 66496 100001 204151 202162 278851 262710 101715 70290 61424 146720
21367 146720 196560 152855 210109 131965 160549 323033 157071 44094 -162589 -231768 -222782
21356 -222782 -68359 155481 152656 165930 268 -93114 -3789 82388 59851 39714 79596
$$ packed form
21433g4370k49l3613J11522J71828L1849k10121j86974Q0169K3282P8424J50569
21422A42316L8925l5088j05662j74302p5810M0908L7077j0465Q934m0251j19293
21411b92711p7494J28248J03239R744k3045q9563n6229m2939J01441J56661M2962
21400c9686O5177j0017n3556q8141j23456J53714J95306r3068m1357r5335K6632
21389a03787K86250l7473k52178k1703O4627k0130r1761L2730j342J0459j1495
21378a45803J18142R4157L3505J04150j989P6689j6141j60995l1425q866Q5296
21367A46720M9840m3705N7254p8144K8584J62484j65962j12977k06683o9179Q986
21356b22782J54423K23840k825J3274j65662r3382Q9325Q6177k2537k0137L9882
$$ plain form
21345 79596 -25262 -116248 -258175 -378141 -408517 -195245 -186276 -107782 -123106 -185768 -23244
21334 -23244 -3642 -142788 -182157 -115225 -54387 -154270 -187545 -146410 -53695 -54070 -207514 -448299
21322 -448299 -407704 -247562 -135553 -213725 -10180 28756 9538 48953 95891 57285 280068
21311 280068 347653 233735 143833 10894 -45096 -24432 -132514 -193368 -121087 -16241 -150755
21300 -150755 -120946 -167416 -174095 -166563 -246430 -308750 -209791 -202970 -280678 -272828 -196616 -159947
21288 -159947 -184032 -106878 -69494 3097 -88203 93813 141051 11591 179341 231472 -6194
21277 -6194 -24766 -140931 -330881 -263566 -172810 -219832 -352526 -356918 -160367 -9601 -17316
21266 -17316 -125549 -204964 -143717 -120057 -95541 -1576 -33370 -208122 -311967 -256279 -187004
$$ packed form
21345G9596j04858r0986j41927j19966l0376K13272Q969P8494j5324o2662J62524
21334b3244J9602j39146l9369O6932O0838r9883l3275M1135R2715l75j53444k40785
21322d48299M0595J60142J12009p8172K03545L8936j9218L9415M6938l8606K22783
21311B80068O7585j13918q9902j32939n5990K0664j08082o0854P2281J04846j34514
21300a50755K9809m6470o679P532p9867o2320R8959O821p7708P850P6212L6669
21288a59947k4085P7154L7384P2591r1300J82016M7238j29460J67750N2131k37666
21277f194j8572j16165j89950O7315R0756m7022j32694m392J96551J50766p715
21266a7316j08233p9415O1247K3660K4516R3965l1794j74752j03845N5688O9275
$$ plain form
21255 -187004 -60700 -134691 -172317 -55057 22503 -151036 -263616 -211258 -160445 -304952
21245 -304952 -369317 -230497 -158210 -35349 -22975 -26566 -39800 13499 -151289 -21704 27997
21234 27997 -118320 -179978 -76505 94074 98962 91353 30319 7268 -20605 26197 147522
21223 147522 131786 123285 21499 -40878 -826 53398 85147 17101 -137205 -205776 -5088
21212 -5088 -106121 -176256 -378600 -339659 -136999 80616 9008 -146193 -43130 -7831 135973
21201 135973 157378 -56383 -244163 -228299 -48293 95714 53929 84252 48774 -19660 -117042
21190 -117042 -140258 -223626 -325475 -297689 -213841 31046 152976 29723 -28656 49634 88633
21179 88633 -50725 -108153 40203 -48636 -52237 -77248 -278978 -342547 -286764 -229334 -2535
$$ packed form
21255a87004J26304p3991l7626J17260P7560j73539j12580N2358N0813j44507
21245c04952o4365J38820P2287J22861J2374l591j3234N3299j64788J29585M9701
21234B7997j46317o1658J03473J70579M888p609o1034k3051k7873M6802J21325
21223A47522j5736q501j01786o2377M0052N4224L1749o8046j54306o8571K00688
21212e088j01033p0135k02344L8941K02660K17615p1608j55201J03063L5299J43804
21201A35973K1405k13761j87780J5864J80006J44007m1785L0323l5478o8434r7382
21190a17042k3216q3368j01849K7786Q3848K44887J21930j23253n8379P8290L8999
21179H8633j39358n7428J48356q8839l601k5011k01730o3569N5783N7430K26799
$$ plain form
21168 -2535 233358 101298 57024 26695 -294330 -324190 -333303 -300619 -103877 -17368 -29974
21157 -29974 -85390 -64943 -91454 -7615 72425 128860 133527 21026 -48375 -52402 138000 64723
21145 64723 -148553 -285770 -75874 24300 32006 -76896 -105004 -218773 -282312 -166471
21135 -166471 -26449 -18124 -22956 98058 111638 -98406 -45466 -173579 -127867 -70120 -156221
21124 -156221 -216504 -136336 -150122 -164463 -238611 -185489 -126639 -1424 -27852 106122 178949
21113 178949 192236 247849 272817 184959 83356 -74604 -47949 22315 -139017 -271463 -190770
21102 -190770 -31394 -171474 -289937 -140117 19715 145497 117418 -25564 -24278 8251
21092 8251 -73331 -115244 70096 -5795 -210149 -315571 -330355 -439035 -424279 -422519 -322752
$$ packed form
21168b535K35893j32060m4274l0329l21025k9860r113L2684J96742Q6509j2606
21157b9974n5416K0447k6511Q3839Q0040N6435M667j12501o9401m027J90402p3277
21145F4723k13276j37217K09896J00174P706j08902k8108j13769o3539J15841
21135a66471J40022Q325m832J21014J3580k10044N2940j28113M5712N7747q6101
21124a56221o0283Q0168j3786j4341p4148N3122N8850J25215k6428J33974P2827
21113A78949J3287N5613K4968q7858j01603j57960K6655P0264j61332j32446Q0693
21102a90770J59376j40080j18463J49820J59832J25782k8079j42982J286L2529
21092H251q1582m1913J85340p5891k04354j05422j4784j08680J4756J760R9767
$$ plain form
21081 -322752 -102867 -141007 -159826 -50706 -353 -4144 -75336 -23460 6039 -61296 -71911
21070 -71911 58752 176406 107459 -114398 -217041 -159721 17499 59947 -119731 -143421
21060 -143421 -52420 -121539 -265600 -201201 8913 179723 359728 361432 -42932 -253231
21050 -253231 -270705 -101361 -61727 -160933 -222690 -335181 -177576 64738 109365 57154 136185
21039 136185 45629 -121140 -254245 -237100 -314407 -324223 -156681 -203364 -191537 -95443 -59753
21028 -59753 -94403 -57330 25175 73139 -1773 -59663 -98180 -102162 53980 137915 159783 204640
21016 204640 286006 245243 165238 80651 97566 205194 177898 56065 -27581 -49093 -74665
21005 -74665 -184607 -313340 -469054 -395894 -213178 -119968 -87833 -199868 -167199 -205457 -133729
$$ packed form
21081c22752K19885l8140j8819J09120N0353l791p1192N1876K9499o7335j0615
21070g1911J30663J17654o8947k21857j02643N7320J77220M2448j79678k3690
21060a43421R1001o9119j44061O4399K10114J70810J80005J704m04364k10299
21050b53231j7474J69344L9634r9206o1757j12491J57605K42314M4627n2211P9031
21039A36185r0556j66769j33105J7145p7307r816J67542m6683J1827R6094L5690
21028e9753l4650L7073Q2505M7964p4912n7890l8517l982J56142Q3935K1868M4857
21016B04640Q1366m0763q0005q4587J6915J07628k7296j21833q3646k1512k5572
21005g4665j09942j28733j55714P3160J82716R3210L2135j12035L2669l8258P1728
$$ plain form
20994 -133729 -3096 138417 134581 65661 138460 189814 17535 -46131 89235 124676 159811
20983 159811 -31573 -174401 -63282 89728 195217 157691 85718 85047 157825 139240 -42978
20972 -42978 -138026 -102259 -68058 -100174 -47328 -57838 -277947 -161055 -14364 -124945 -202886
20961 -202886 -200644 1211 168161 237275 150790 26064 -133075 -49979 -50007 31890 -75679
20950 -75679 -99515 -57918 60611 73350 853 41963 15559 -24050 -171276 -158564 -13245
20939 -13245 -1013 -63771 -175557 -204469 -203501 -51651 -156020 -252735 -199747 -153378 -173326
20928 -173326 -149750 -77040 -55617 -107557 49088 -118804 -292562 -78785 -124737 -52218 -82131
20917 -82131 -222733 -209316 -83151 15405 15476 111316 200880 83054 -16098 -158421 -214610
$$ packed form
20994a33729J30633J41513l836o8920P2799N1354j72279o3666J35366L5441L5135
20983A59811j91384j42828J11119J53010J05489l7526p1973o71P2778j8585j82218
20972d2978r5048L5767L4201l2116N2846j0510k20109J16892J46691j10581p7941
20961b02886K242K01855J66950O9114q6485j24726j59139Q3096k8Q1897j07569
20950g5679k3836M1597J18529J2739p2497M1110k6404l9609j47226J2712J45319
20939a3245J2232o2758j11786k8912R68J51850j04369r6715N2988M6369j9948
20928a73326K3576P2710K1423n1940J56645j67892j73758K13777m5952P2519k9913
20917h2131j40602J3417J26165R8556P1R5840Q9564j17826r9152j42323n6189
$$ plain form
20906 -214610 -195985 -181485 -140364 14918 -35633 -178240 -158714 -162091 -171255 -49205 28347
20895 28347 -89042 -108503 -19981 108473 100779 -3222 -80874 69143 192310 73483 -35038
20884 -35038 38252 108753 134937 -19124 -72789 176937 142985 -83532 -21379 -203120 -348479
20873 -348479 -368308 -308384 -141058 -11791 65659 52982 92593 91258 -101547 -248257 -170776
20862 -170776 28943 132786 88028 42359 203613 108360 -16995 20715 63098 -64083
20852 -64083 -296831 -457404 -442863 -241992 -25650 -85031 -205382 -241557 -287769 -381713 -330887
20841 -330887 -257953 -245013 -197259 -73225 -18631 23599 119617 132746 25286 76477 148064
20830 148064 71703 31364 126293 181770 118776 -69077 -189765 -191293 -147922 -264388 -305830
$$ packed form
20906b14610J8625J4500M1121J55282n0551j42607J9526l377r164J22050P7552
20895B8347j17389j9461Q8522J28454p694j04001p7652J50017J23167j18827j08521
20884c5038P3290P0501K6184j54061n3665K49726l3952k26517O2153j81741j45359
20873c48479j9829N9924J67326J29267P7450j2677L9611j335j92805j46710P7481
20862a70776J99719J03843m4758m5669J61254r5253j25355L7710M2383j27181
20852f4083k32748j60573J4541K00871K16342n9381j20351l6175m6212r3944N0826
20841c30887P2934J2940M7754J24034N4594M2230R6018J3129j07460N1191P1587
20830A48064p6361m0339R4929N5477o2994j87853j20688j528M3371j16466m1442
$$ plain form
20819 -305830 -100545 -107078 -96969 -155947 -359039 -290194 -89099 179115 128870 86960 1731
20808 1731 -65697 -104854 -168692 -174677 -90175 -34867 -157493 -410959 -392283 -276389 -191702
20797 -191702 -89391 -216687 -154209 62565 120910 143435 124846 -5044 -169084 -86642
20787 -86642 144800 230497 118500 45303 52187 84899 184444 207216 32550 -58426 -34923
20776 -34923 -76844 -143893 -21495 -43225 -152638 -267306 -213372 -171903 -201248 -198301 -63607
20765 -63607 -75395 -244931 -263391 -254004 -251215 -196547 -156629 -227263 -293610 -269849 -225534 -317348
20753 -317348 -212098 -106609 48087 -47887 -116866 -274342 -195946 -53974 -12867 -141719
20743 -141719 -91624 -79932 -32453 -66098 -112117 -213798 -130927 -46914 -80643 -64080 -68720
$$ packed form
20819c05830K05285o533J0109n8978k03092O8845K01095K68214n0245m1910q5229
20808A731o7428l9157o3838n985Q4502N5308j22626k53466J8676J15894Q4687
20797a91702J02311j27296O2478K16774N8345K2525j8589j29890j64040Q2442
20787h6642K31442Q5697j11997p3197O884L2712R9545K2772j74666r0976K3503
20776c4923m1921o7049J22398k1730j09413j14668N3934M1469k9345K947J34694
20765f3607j1788j69536j8460R387K789N4668L9918p0634o6347K3761M4315r1814
20753c17348J05250J05489J54696r5974o8979j57476P8396J41972M1107j28852
20743a41719N0095J1692M7479l3645m6019j01681Q2871Q4013l3729J6563m640
$$ plain form
20732 -68720 -124954 -167698 -218915 -181640 -30731 19025 22530 -178852 -173510 -70900 -109850
20721 -109850 -71585 8855 58876 182247 230808 122758 -28760 -44352 152448 170407 153493
20710 153493 110004 -13795 -84521 -117333 -198272 -119248 -36494 49486 -26625 -120188 -164496
20699 -164496 -62065 -19504 19492 -25369 3111 199145 26015 -255479 -393390 -321234
20689 -321234 -302506 -258619 -29262 23513 36880 62004 23272 112086 23319 43911 123997
20678 123997 11220 -24034 110988 117496 -109782 -188328 -29477 26694 128019 55638 -16284
20667 -16284 98997 189211 66794 -70430 -188214 33255 242312 254829 248824 183343 98759
20656 98759 82798 166225 100330 -32452 115838 205691 55173 79036 114287 128583 147922
$$ packed form
20732f8720n6234m2744n1217L7275J50909M9756L505k01382N342J02610l8950
20721a09850L8265Q0440N0021J23371M8561j08050j51518j5592J96800J7959j6914
20710A53493m3489j23799p0726l2812q0939P9024Q2754Q5980p6111r3563m4308
20699a64496J02431M2561L8996m4861K8480J96034j73130k81494j37911P2156
20689c21234J8728M3887K29357N2775J3367K5124l8732Q8814q8767K0592Q0086
20678A23997j12777l5254J35022O508k27278p8546J58851N6171J01325p2381p1922
20667a6284J15281R0214j22417j37224j17784K21469K09057J2517o005o5481q4584
20656I8759j5961Q3427o5895j32782J48290Q9853j50518K3863L5251J4296J9339
$$ plain form
20645 147922 129899 46259 1182 -72657 53479 133542 -44991 -165780 -44142 -72723 -67095
20634 -67095 -16295 52165 69145 -2932 -12458 -49668 -20370 -34738 -73855 -159418 -212462 -340097
20622 -340097 -189933 -78802 -53690 37489 -63438 5415 76163 36035 75981 167925 105872
20611 105872 -29246 -30641 44520 113053 119734 125797 29925 20912 75716 125004 139271 153718
20599 153718 -23692 -168058 -287387 -341381 -320269 -191975 35570 180816 75926 -80551
20589 -80551 -50800 -38072 -128637 -233778 -56007 -58027 -132019 -101497 60912 106659 -95256
20578 -95256 -40415 21977 -77631 -26673 -53697 -48111 -34542 -30900 40927 2469 -134590 -5068
20566 -5068 82677 140499 -15057 -321188 -269111 -48258 -50450 -22293 -82377 -180838 -102967
$$ packed form
20645A47922j8023q3640m5077p3839J26136Q0063j78533j20789J21638k8581N628
20634f7095N0800O8460J6980p2077r526l7210K9298j4368l9117q5563n3044j27635
20622c40097J50164J11131K5112R1179j00927O8853P0748m0128L9946R1944o2053
20611A05872j35118j395P5161O8533O681O063r5872r013N4804M9288J4267J4447
20599A53718j77410j44366j19329n3994K1112J28294K27545J45246j04890j56477
20589h0551K9751J2728r0565j05141J77771k020p3992L0522J62409M5747k01915
20578i5256N4841O2392r9608N0958k7024N586J3569L642P1827l8458j37059J29522
20566e068Q7745N7822j55556l06131N2077K20853k192K8157o0084r8461P7871
$$ plain form
20555 -102967 -76856 -5865 48902 374214 496612 435912 328964 147533 -87634 -54384
20545 -54384 -124512 -150217 -115150 88223 21830 120012 63088 -133311 -219862 -368127 -392649
20534 -392649 -360186 -321205 -182516 -223859 -164159 -80141 -50491 -133204 -171122 10333 62992
20523 62992 -30446 -163311 -336352 -468107 -335810 -136768 -67933 -10999 -116929 -128700
20513 -128700 -45872 2308 43901 -111 -144400 -70352 49888 113468 104940 128920 141994
20502 141994 194104 -3117 -92945 68570 -48694 -61396 -25644 169116 71104 -92911
20492 -92911 -137822 -65737 -118449 -306456 -283449 -161377 -93338 -84899 -128532 -29981 11645
20481 11645 99322 -10387 -62169 -164965 -129963 -57526 -40596 -192537 -209989 -140174 -124964
$$ packed form
20555a02967K6111P0991N4767L25312J22398o0700j06948j81431k35167L3250
20545e4384p0128k5705L5067K03373o6393R8182n6924j96399q6551j48265k4522
20534c92649L2463L8981J38689m1343N9700Q4018K9650q2713l7918J81455N2659
20523F2992r3438j32865j73041j31755J32297J99042O8835N6934j05930j1771
20513a28700Q2828M8180M1593m4012j44289P4048J20240O3580q528K3980J3074
20502A41994N2110j97221q9828J61515j17264j2702L5752J94760r8012j64015
20492i2911m4911P2085n2712j88007K3007J22072O8039Q439m3633R8551M1626
20481A1645Q7677j09709n1782j02796L5002P2437J6930j51941j7452O9815J5210
$$ plain form
20470 -124964 -129419 -98116 -110362 -5402 -24575 -171419 -172171 -237098 -226351 -64200 137194
20459 137194 82001 -946 35070 -76782 -263189 -266842 -125986 -12902 117181 107037 146985
20448 146985 169638 252652 355623 386432 260696 150443 107350 -25155 -101298 -42260 223801
20437 223801 362999 181099 -37025 132313 339644 362245 197777 -13835 41855 4319
20427 4319 97850 9489 -84406 -47887 -87987 -136125 -269625 -156059 91031 197060 173044
20416 173044 86525 -56283 -76833 21882 194906 68954 103088 9864 -165611 -222390 -244396
20405 -244396 -172093 -136088 -73247 64165 139985 151803 124105 69792 106679 77617 79600
20394 79600 83624 159404 101801 56761 -2347 -37469 -116751 -11825 34382 -6272 -132681
$$ packed form
20470a24964m455L1303j2246J04960j9173j46844p52o4927J0747J62151K01394
20459A37194n5193q2947L6016j11852j86407l653J40856J13084J30083j0144L9948
20448A46985K2653Q3014J02971L0809j25736j10253m3093j32505p6143N9038K66061
20437B23801J39198j81900k18124J69338K07331K2601j64468k11612N5690l7536
20427D319R3531q8361r3895L6519m0100m8138j33500J13566K47090J06029k4016
20416A73044q6519j42808k0550R8715J73024j25952L4134r3224j75475n6779k2006
20405b44396P2303L6005O2841J37412P5820J1818k7698n4313L6887k9062J983
20394G9600M024P5780n7603m5040n9108l5122p9282J04926M6207m0654j26409
$$ plain form
20383 -132681 -52898 72767 54360 98701 125678 30505 154787 206845 153250 69957 145289
20372 145289 167970 135712 21022 -43111 -206542 -180100 -60772 83473 257415 254423 154240
20361 154240 127520 13940 -91642 -84855 1374 36842 22760 -143491 -193131 -190647 -35548
20350 -35548 136971 162044 105918 50886 7314 -47154 -186014 -152842 -65402 -56832 15846
20339 15846 69216 -106687 34788 93488 39272 5124 -61094 -148444 -209530 -94217 200537
20328 200537 196675 60586 80040 84101 -30045 -136835 -168655 -121433 -181933 -284405 -293157
20317 -293157 -294841 -120807 133746 145979 78349 158371 7904 -73742 31343 132152 200344
20306 200344 140113 138803 211621 117898 69052 61278 127831 177926 176738 155237 186516 1726
$$ packed form
20383a32681P9783J25665j8407M4341K6977r5173J24282N2058n3595q3293P5332
20372A45289K2681l2258j14690o4133j63431K6442J19328J44245J73942k992j00183
20361A54240k6720j13580j05582O787Q6229L5468j4082j66251m9640K484J55099
20350c5548J72519K5073n6126n5032m3572n4468j38860L3172Q7440Q570P2678
20339A5846N3370j75903J41475N8700n4216l4148o6218q7350o1086J15313K94754
20328B00537l862j36089J9454M061j14146j06790l1820M7222o0500j02472q752
20317b93157j684J74034K54553J2233o7630Q0022j50467q1646J05085J00809O8192
20306B00344o0231j310P2818r3723m8846p774O6553N0095j188k1501L1279j84790
$$ plain form
20294 1726 -143670 -146552 71840 65069 -12781 -146898 -162403 -102340 -28437 94491 -56587
20283 -56587 -58766 82265 -5907 -67443 -113734 -266149 -172719 -101419 -96253 -738 69074 177569
20271 177569 100800 -72684 -165814 -59800 -110104 -142406 -209866 -213691 -129404 -240178 -341589
20260 -341589 -367199 -410832 -319933 -42481 -128024 -43675 77502 148383 -89592 -266266 -260703
20249 -260703 -328154 -272324 -159645 -180697 15239 44617 39504 84317 194571 314570 133434
20238 133434 78934 96042 243417 309937 166607 94933 87874 -4376 -193110 -152841 -217974
20227 -217974 -247561 -298079 -141701 -11656 -115503 -80407 -17833 55032 -49442 -116782 -89801
20216 -89801 33226 79175 -53592 -174026 -41084 -39863 -117691 -183393 -214343 -204922 -199200
$$ packed form
20294A726j45396k882K18392o771p7850j34117j5505O0063P3903J22928j51078
20283e6587k179J41031q8172o1536m6291j52415R3430P1300N166R5515O9812J08495
20271A77569p6769j73484r3130J06014n0304l2302o7460l825Q4287j10774j01411
20260c41589k5610m3633R0899K77452q5543Q4349J21177P0881k37975j76674N563
20249b60703o7451N5830J12679k1052J95936K9378n113M4813J10254J19999j81136
20238A33434n4500J7108J47375O6520j43330p1674p059r2250j88734M0269o5133
20227b17974k9587n0518J56378J30045j03847L5096O2574P2865j04474o7340K6981
20216h9801J23027M5949j32767j20434J32942J221p7828o5702l0950R421N722
$$ plain form
20205 -199200 -112109 119975 200912 231622 138142 89336 181251 326848 253439 89200 -147179
20194 -147179 -256488 -69064 44981 113158 52904 -64367 -213565 -399917 -381989 -303684
20184 -303684 -84803 48860 43644 89300 16391 26363 9272 35257 6042 -86211 -105793
20173 -105793 -190135 -175834 -73931 -125472 -228051 -198383 -46627 -38052 -73486 7838 100934
20162 100934 36013 -41841 91950 276371 168126 123972 53737 -42894 -74311 -125160 -81617
20151 -81617 -135733 -219081 -261507 -271966 -23125 35236 94076 163531 134375 229458 173561
20140 173561 -27062 -45798 -73507 -177511 -333933 -343181 -128576 84495 105932 18754 13801
20129 13801 105449 -72816 -86557 -244937 -300111 -319886 -432517 -351074 -273823 -345568 -319749
$$ packed form
20205a99200Q7091K32084Q0937L0710r3480m8806R1915J45597p3409j64239k36379
20194a47179j09309J87424J14045O8177o0254j17271j49198j86352J7928P8305
20184c03684K18881J33663n216M5656p2909R972j7091K5985k9215r2253j9582
20173a05793q4342J4301J01903n1541j02579K9668J51756Q575l5434Q1324R3096
20162A00934o4921p7854J33791J84421j08245m4154p0235r6631l1417n0849M3543
20151h1617n4116q3348m2426j0459K48841N8361N8840O9455k9156R5083n5897
20140A73561k00623j8736k7709j04004j56422r248K14605K13071K1437q7178m953
20129A3801R1648j78265j3741j58380n5174j9775j12631Q1443P7251p1745K5819
$$ plain form
20118 -319749 -146114 27200 161071 97538 -53469 -56083 -128542 -94323 -82040 -117714 -86505
20107 -86505 9230 49298 82531 -92919 -369627 -589255 -422942 -360817 -257907 -117327
20097 -117327 -64058 -34252 -163631 -281341 -171324 -158958 -145470 -55371 74618 20869 106941
20086 106941 76826 140685 206161 68193 36341 -55424 -242004 -211050 -3890 82518 62361
20075 62361 -146269 -286529 -267263 -166467 -179487 -125693 -195745 -194407 -246978 -172229 -130476
20064 -130476 -221264 -129988 10147 45638 33505 -65816 -60889 85998 8277 6046 68972
20053 68972 -77736 -306962 -330893 -183278 -157317 -4760 -30994 -136250 -275183 -326267
20043 -326267 -12968 282176 318608 247689 138518 100418 -62626 -89182 36202 5079
$$ packed form
20118c19749J73635J73314J33871o3533j51007k614p2459L4219J2283l5674L1209
20107h6505R5735M0068L3233j75450k76708k19628J66313O2125J02910J40580
20097a17327N3269K9806j29379j17710J10017J2366J3488R0099J29989n3749Q6072
20086A06941l0115O3859O5476j37968l1852r1765j86580L0954K07160Q6408k0157
20075F2361k08630j40260J9266J00796j3020N3794p0052J338n2571P4749M1753
20064a30476r0788R1276J40135L5491j2133r9321M927J46887p7721k231O2926
20053F8972j46708k29226k3931J47615K5961J52557k6234j05256j38933n1084
20043c26267L13299K95144L6432p0919j09171l8100j63044k6556J25384l1123
$$ plain form
20033 5079 8462 146977 203047 33041 -86188 -81512 -138237 -54136 101615 167170 99300
20022 99300 58887 215634 222698 146652 187577 234037 -58586 -209009 -144918 -67310 -36528
20011 -36528 -138608 -202870 -110450 -126659 -198477 -195238 -43658 -67142 34819 34862 -11945 143645
19999 143645 47613 -45210 -61427 -118660 -2009 -67024 220413 268797 186259 169694 212684
19988 212684 61695 105995 139494 284529 221615 214869 177595 -31199 -21764 -127681 -183367
19977 -183367 -165476 -110245 -65965 63549 109563 171092 11872 -200138 -306592 -93813
19967 -93813 63723 46910 10810 -67399 -216 -46936 -175210 -220008 -141781 6973 96812
19956 96812 77262 69472 154038 6022 -103185 -269419 -180262 15389 -57548 -87732 10581
$$ packed form
20033E079L383J38515N6070j70006j19229M676n6725Q4101J55751O5555o7870
20022I9300m0413J56747P064p6046M0925M6460k92623j50423O4091P7608L0782
20011c6528j02080o4262R2420j6209p1818L239J51580k3484J01961M3m6807J55590
19999A43645r6032r2823j6217n7233J16651o5015K87437M8384q2538j6565M2990
19988B12684j50989M4300L3499J45035o2914o746l7274k08794R435j05917n5686
19977a83367J7891N5231M4280J29514M6014O1529j59220k12010j06454K12779
19967i3813J57536j6813l6100p8209O7183m6720j28274m4798P8227J48754Q9839
19956I6812j9550p790Q4566j48016j09207j66234Q9157J95651p2937l0184R8313
$$ plain form
19945 10581 -143258 -222304 -366597 -228400 -106829 -172666 -104552 -82872 84983 37554 96665
19934 96665 40472 971 129932 111385 -136553 -153157 -212147 -467608 -434200 -328746 -454680
19923 -454680 -402865 -262034 -222890 -16207 49812 188237 247141 97664 -30013 -70132
19913 -70132 -212774 -215166 -173475 -110712 -66064 -191573 -113537 114847 -65056 -359460 -330488
19902 -330488 -276119 -253733 -229888 -3639 157828 38126 130954 112400 -60923 -227771
19892 -227771 -259724 -150203 -25600 152415 25343 -92440 -152939 4212 143533 4073
19882 4073 -142235 -63917 11256 44349 -3191 -133215 -173154 -100611 -42758 107829 238681
19871 238681 174785 8178 39819 89776 98805 15932 -17326 6827 12281 -13613 -23828 86806
$$ packed form
19945A0581j53839p9046j44293J38197J21571o5837O8114K1680J67855m7429N9111
19934I6665n6193l9501J28961j8547k47938j6604n8990k55461L3408J05454j25934
19923d54680N1815J40831L9144K06683O6019J38425N8904j49477j27677m0119
19913g0132j42642k392M1691O2763M4648j25509P8036K28384j79903k94404K8972
19902c30488N4369K2386K3845K26249J61467j19702R2828j8554j73323j66848
19892b27771l1953J09521J24603J78015j27072j17783o0499J57151J39321j39460
19882D073j46308P8318P5173L3093m7540j30024l9939P2543N7853J50587J30852
19871B38681o3896j66607L1641M9957R029q2873l3258K4153N454k5894j0215J10634
$$ plain form
19859 86806 168985 79085 128894 67580 228384 240873 262101 285953 207762 309299 248294
19848 248294 152405 183742 260640 273239 102760 -34735 17650 92432 -96219 -175365 -26737
19837 -26737 9700 33236 35689 -98489 -220257 -134843 -24700 -38357 59704 97218 51930
19826 51930 -13544 2483 106747 202698 186630 126973 166035 68159 -2110 53435 -33754
19815 -33754 -126121 -120268 -211942 -88968 -5432 48996 52664 242724 73786 -111515 -48296
19804 -48296 -30045 14266 91080 137368 63673 86423 135550 147767 -22020 19532 23104 80451
19792 80451 117674 24143 -12089 -30257 54375 1745 -50952 -50399 -240789 -290503 -229811 -131595
19780 -131595 -24947 110397 178408 6130 -133929 -213036 -202877 -197575 -205777 -121695 -75405
$$ packed form
19859H6806Q2179q9900M9809o1314J60804J2489K1228K3852p8191J01537o1005
19848B48294r5889L1337P6898J2599j70479j37495N2385P4782j88651p9146J48628
19837b6737L6437K3536K453j34178j21768Q5414J10143j3657R8061L7514m5288
19826E1930o5474J6027J04264R5951j6068n9657L9062r7876p0269N5545q7189
19815c3754r2367N853r1674J22974Q3536N4428L668J90060j68938j85301O3219
19804d8296J8251M4311P6814M6288p3695K2750M9127J2217j69787M1552L572N7347
19792H0451L7223r3531l6232j8168Q4632n2630n2697N53j90390m9714O0692R8216
19780a31595J06648J35344O8011j72278j40059p9107J0159N302q202Q4082M6290
$$ plain form
19769 -75405 -214836 -253573 -254172 -406431 -140514 -5535 64645 -26190 -204221 -199212 -53205
19758 -53205 -122678 -74327 -141822 2152 284505 219165 -12191 -6310 43248 1285 -92040
19747 -92040 -152295 -272225 -113152 -27015 34036 -31343 -70832 49934 54954 43067 -107316
19736 -107316 -150602 -56590 -171070 -203402 -198334 -134228 -25326 -17666 -32499 -53313 -157839
19725 -157839 -8800 52414 -48205 -164793 -97406 -106645 -159023 -154884 66456 191657 157680
19714 157680 -10155 -158722 -117980 60496 59155 31806 33012 -138702 -15439 26425 220066
19703 220066 349059 222403 46978 55351 136906 91668 -71007 -151171 -166646 -145489 -204325
19692 -204325 -375110 -383947 -206443 -140212 -161411 -126389 -28794 -101296 -154424 -32799 -27406
$$ packed form
19769g5405j39431l8737n99j52259K65917J34979P0180r0835j78031N009J46007
19758e3205o9473M8351o7495J43974K82353o5340k31356N881M9558m1963r3325
19747i2040o0255j19930J59073Q6137O1051o5379l9489J20766N020j1887j50383
19736a07316m3286R4012j14480l2332N068O4106J08902P660j4833k0814j04526
19725a57839J49039O1214j00619j16588O7387r239n2378M139K21340J25201l3977
19714A57680j67835j48567M0742J78476j341k7349J206j71714J23263M1864J93641
19703B20066J28993j26656j75425Q373Q1555m5238j62675q0164j5475K1157n8836
19692b04325j70785q837J77504O6231k1199L5022R7595p2502n3128J21625N393
$$ plain form
19681 -27406 48817 67047 140470 186161 170275 101712 8689 -50387 39824 152451 145346 67113
19669 67113 -27852 -82175 -13240 -37596 -101057 -45598 55137 116332 41781 -27510 -104637
19658 -104637 -172849 -330662 -336425 -213481 -166090 -115117 -59706 -75949 55178 49121 67818
19647 67818 105535 67721 45806 -31294 -86313 -199110 -81129 128612 247268 228251 37511
19636 37511 -137848 -1543 131237 96361 175004 119278 -37290 -21988 115482 310289
19626 310289 305871 291479 253583 31068 -3371 57029 156675 164282 -59473 -97247 -176877
19615 -176877 -195797 -114716 -60400 -78176 -148143 -213191 -82570 29263 -96128 -156696 -161562
19604 -161562 -309766 -427612 -268161 -16585 160544 27882 -66028 14101 -20215 -128285
$$ packed form
19681b7406P6223J8230P3423M5691j5886o8563r3023n9076R0211J12627p105p8233
19669F7113r4965n4323O8935k4356o3461N5459J00735O1195p4551o9291p7127
19658a04637o8212j57813n763J22944M7391N0973N5411j6243J31127o057J8697
19647F7818L7717l7814k1915p7100n5019j12797J17981K09741J18656j9017j90740
19636C7511j75359J36305J32780l4876P8643n5726j56568J5302J37470J94807
19626C10289m418j4392l7896k22515l4439O0400R9646P607k23755l7774p9630
19615a76877j8920Q1081N4316j7776o9967o5048J30621J11833j25391o0568m866
19604a61562j48204j17846J59451K51576J77129j32662r3910Q0129l4316j08070
$$ plain form
19594 -128285 -18543 103938 93457 195222 43983 -174375 -115700 -161224 -143110 -39027
19584 -39027 143200 153150 130124 73612 -16482 -75492 -8984 -4026 -27272 99274 363365
19573 363365 327890 112055 41287 96976 172112 197735 250235 309127 343438 244546 29530
19562 29530 58605 10910 10854 -62907 -199098 -136995 -60555 4980 -61625 -212542 -156172 -100645
19550 -100645 39427 10090 -129644 -231534 -308684 -277189 -91105 -81781 -119779 -180635 -231869
19539 -231869 -287748 -143001 -113536 -62497 52926 145295 45354 47107 40522 -14018 58454
19528 58454 106227 10550 146188 86250 29779 -141293 -248558 -60134 82632 -42641
19518 -42641 67717 191177 193926 85414 11851 -192755 -330267 -268120 -231342 -107733 -16960
$$ packed form
19594a28285J09742J22481j0481J01765j51239k18358N8675m5524J8114J04083
19584c9027J82227R950k3026n6512r0094n9010O6508M958k3246J26546K64091
19573C63365l5475k15835p0768N5689P5136K5623N2500N8892L4311r8892k15016
19562B9530K9075m7695n6p3761j36191O2103P6440O5535o6605j50917N6370N5527
19550a00645J40072k9337j39734j01890p7150L1495J86084R324l7998o0856n1234
19539b31869n5879J44747K9465N1039J15423R2369r9941J753o585n4540P2472
19528E8454M7773r5677J35638n9938n6471j71072j07265J88424J42766j25273
19518d2641J10358J23460K749j08512p3563k04606j37512O2147L6778J23609R0773
$$ plain form
19507 -16960 53830 39977 156376 170943 3672 -53635 -42775 -71968 47893 139013 33413
19496 33413 -61972 20601 257871 12642 -119460 -79063 -57048 155404 96273 31924 85027
19485 85027 170584 73599 26495 -171033 -249450 -126736 -203048 -304451 -237237 -251650 -334821
19474 -334821 -368220 -346983 -218924 -152951 -166586 -143712 -256225 -287534 -271208 -53649 160712
19463 160712 143489 80528 -49629 -121217 -137148 -191658 -360863 -207981 73567 100174 174448
19452 174448 340240 277213 90008 45337 -8899 23169 72179 79317 153248 23641 20739
19441 20739 -43726 -141150 -136870 126064 22293 -34593 100225 126904 88372 53552 -156499
19430 -156499 -201353 -265542 -227852 -4150 33208 73765 117318 -5827 -175858 -215182 -128953
$$ packed form
19507a6960P0790j3853J16399J4567j67271n7307J0860k9193J19861R1120j05600
19496C3413r5385Q2573K37270k45229j32102M0397K2015K12452n9131o4349N3103
19485H5027Q5557r6985m7104j97528p8417J22714p6312j01403O7214j4413q3171
19474c34821l3399K1237J28059O5973j3635K2874j12513l1309J6326K17559K14361
19463A60712j7223o2961j30157p1588j5931n4510j69205J52882K81548K6607P4274
19452A74448J65792o3027j87205m4671n4236L2068M9010P138P3931j29607k902
19441B0739o4465r7424M280K62934j03771n6886J34818K6679l8532l4820k10051
19430a56499m4854o4189L7690K23702L7358M0557M3553j23145j70031l9324Q6229
$$ plain form
19419 -128953 77371 155540 -94469 -162548 -220577 -268867 -350882 -287498 -171832 -174429 -27711
19408 -27711 35389 30392 -135346 -68955 180937 283827 156481 148623 297794 256029 88395
19397 88395 104644 -41978 -56195 17639 -5660 123201 175150 61750 -40746 -36816 -81702
19386 -81702 -195727 -195318 -17204 93600 274660 392524 332069 184277 142918 138050 -5511
19375 -5511 -57807 13225 159590 214937 242967 182240 226997 322096 481727 700955 1017247
19364 1017247 1204681 1108689 1012174 963903 738150 369327 67788 14215 39655 31594 11285
19353 11285 107236 2600 56916 -61579 -70364 68719 101002 93146 244715 292509 153900
19342 153900 13253 75734 71195 134770 194552 220253 274545 483187 822564 1116615 1182263
$$ packed form
19419a28953K06324P8169k50009o8079n8029m8290q2015O3384J15666k597J46718
19408b7711O3100m997j65738O6391K49892J02890j27346p858J49171m1765j67634
19397H8395J6249j46622j4217P3834k3299J28861N1949j13400j02496L930m4886
19386h1702j14025M09J78114J10804J81060J17864o0455j47792m1359m868j43561
19375e511n2296P1032J46365N5347K8030o0727M4757R5099J59631K19228L16292
19364A017247J87434r5992r6515m8271k25753l68823l01539n3573K5440q061k0309
19353A1285R5951j04636N4316j18495q785J39083L2283p856J51569M7794j38609
19342A53900j40647O2481m539O3575N9782K5701N4292K08642L39377K94051O5648
$$ plain form
19331 1182263 1171185 1337894 1422231 1232221 857883 485121 320761 331883 274497 264615
19321 264615 248289 87642 -133001 -44790 137758 85289 -8357 -31145 84484 246666
19311 246666 197863 187066 92168 35546 -9927 -3077 43081 112437 196128 159140 182518 227815
19299 227815 147581 170213 126141 185890 260094 377577 395542 291144 144152 21897 91157
19288 91157 235625 392131 429684 345443 312427 314613 361014 402190 395271 305708 81348
19277 81348 176449 81913 -144695 -96727 46055 123340 84145 -71704 -1256 29888 47234
19266 47234 164110 261795 144233 -4660 -14791 -55592 -74396 -74028 -139639 -220070 -227107 -2122
19254 -2122 -15432 -7408 93485 -34065 -195436 -338324 -230046 -227834 -185716 -124327 33438
$$ packed form
19331A182263j1078J66709Q4337j90010l74338l72762j64360J1122n7386r882
19321B64615j6326j60647k20643Q8211J82548n2469r3646k2788J15629J62182
19311B46666m8803j0797r4898n6622m5473O850M6158O9356Q3691l6988K3378M5297
19299B27815q0234K2632m4072N9749P4204J17483J7965j04398j46992j22255O9260
19288I1157J44468J56506L7553q4241l3016K186M6401M1176o919q9563k24360
19277H1348R5101r4536k26608M7968J42782P7285l9195j55849P0448L1144J7346
19266D7234J16876R7685j17562j48893j0131m0801j8804L68o5611q0431p037K24985
19254b122j3310Q024J00893j27550j61371j42888J08278K212M2118O1389J57765
$$ plain form
19243 33438 -169266 -247526 -153699 -10525 175226 272208 226877 2406 -144548 -131826 -30133
19232 -30133 -46907 91138 206897 156272 191469 130304 146090 198448 135538 208841 165287
19221 165287 -132673 -28791 117386 177987 408974 260581 -18362 -261904 -241405 -92460
19211 -92460 -67046 -14911 9818 36689 26132 224073 453422 264833 1690 -141750 -121420
19200 -121420 -91355 -83427 -71951 41802 238578 364981 181490 93787 68963 180178 305741
19189 305741 194514 49860 168267 380356 290410 -17090 -107508 -1900 72258 53364
19179 53364 -52898 -110369 7669 55854 -97776 -214459 -230399 -82675 -194311 -206704
19169 -206704 8451 99012 189345 5344 -64316 3297 66181 119218 94292 77434 24636
$$ packed form
19243C3438k02704p8260R3827J43174J85751R6982m5331k24471j46954J2722J01693
19232c0133j6774J38045J15759n0625L5197o1165J5786N2358o2910P3303m3554
19221A65287k97960J03882J46177O0601K30987j48393k78943k43542K0499J48945
19211i2460K5414N2135K4729K6871j0557J97941K29349j88589k63143j43440K0330
19200a21420L0065P928J1476J13753J96776J26403j83491q7703k4824J11215J25563
19189C05741j11227j44654J18407K12089q9946l07500r0418J05608P4158j8894
19179E3364j06262n7471J18038M8185j53630j16683j5940J47724j11636j2393
19169b06704K15155R0561R0333j84001o9660O7613O2884N3037k4926j6858n2798
$$ plain form
19158 24636 50728 64666 -74302 16481 116419 54615 -5339 -131851 -165243 -80588 -68520
19147 -68520 -168077 -171875 328 91959 102092 94939 8710 -30195 -80362 -89269 -113876 -42071
19135 -42071 59965 142011 119386 235328 351377 290828 231832 170474 3983 20093 86183
19124 86183 52882 -86589 -95565 -3820 -205491 -290393 -223051 -178279 -201992 -78913 30738
19113 30738 77025 18219 21119 -54385 -183988 -141054 88352 222832 308183 240707 -18007
19102 -18007 -95701 -31436 116152 222649 188289 88970 -74248 99429 219497 129951 -37988
19091 -37988 6828 52693 50268 88235 -52746 -183500 -200089 -100574 -163017 29715 170501
19080 170501 108640 -85527 -293875 -274345 -103366 -99188 -29922 58812 42768 124817 103565
$$ packed form
19158B4636K6092J3938j38968R0783R9938o1804n9954j26512l3392Q4655J2068
19147f8520r9557l798J72203R1631J0133p153q6229l8905n0167q907k4607P1805
19135d2071J02036Q2046k2625J15942J16049o0549n8996o1358j66491J6110O6090
19124H6183l3301j39471q976R1745k01671q4902O7342M4772k3713J23079J09651
19113C0738M6287n8806K900p5504j29603M2934K29406J34480Q5351o7476k58714
19102a8007p7694O4265J47588J06497l4360r9319j63218J73677J20068q9546j67939
19091c7988M4816M5865k425L7967j40981j30754j6589R9515o2443J92732J40786
19080A70501o1861j94167k08348J9530J70979M178O9266Q8734j6044Q2049k1252
$$ plain form
19069 103565 51467 8535 141398 142837 -117599 -151162 -125028 -120265 -165143 -113928 -68899
19058 -68899 15593 95846 200006 164677 65930 23465 146726 152475 246476 392905 367353
19047 367353 272233 224285 166286 175086 237863 257742 311749 186460 216000 207052 235342 228215
19035 228215 244040 212080 128998 333503 453574 304950 117026 26386 137981 313668
19025 313668 435939 501050 274144 139263 85011 211684 369970 624551 1017839 1025646
19015 1025646 884243 714566 557048 371771 359330 419597 421370 294091 220645 164341
19005 164341 165458 248978 164618 46294 107246 119974 278284 363872 480477 538434 378178
18994 378178 317093 305291 212397 258043 194688 182993 360943 765104 1011625 841156 596546
$$ packed form
19069A03565n2098m2932J32863J439k60436l3563K6134M763m4878N1215M5029
19058f8899Q4492Q0253J04160l5329r8747m2465J23261N749R4001J46429k5552
19047C67353r5120m7948n7999Q800O2777J9879N4007j25289K9540q948K8290p127
19035B28215J5825l1960q3082K04505J20071j48624j87924r0640J11595J75687
19025C13668J22271O5111k26906j34881n4252J26673J58286K54581L93288P807
19015A025646j41403j69677j57518j85277j2441O0267J773j27279p3446n6304
19005A64341J117Q3520q4360j18324O0952J2728J58310Q5588J16605N7957j60256
18994C78178o1085j1802r2894M5646o3355j1695J77950M04161K46521j70469k44610
$$ plain form
18983 596546 377924 371906 53668 40906 100508 68352 22996 -10936 -18511 -37370 -37511 145310
18971 145310 124070 30138 192806 186686 87141 140748 32571 -24501 64220 118324 168671
18960 168671 131016 -13080 -3638 9564 -43437 -91062 21188 92717 62768 120246 207864
18949 207864 159186 15119 36740 126759 8054 29852 27884 7128 252275 430813 518197
18938 518197 518898 288871 97563 78237 75088 84841 51490 108520 260715 276724 288988 388665
18926 388665 410908 222136 87416 226899 390023 440390 551301 699164 808996 912583
18916 912583 891299 929809 1121006 1399851 1479513 1459179 1397154 1236885 911927 562094
18906 562094 375071 168415 237413 75364 110931 112846 119687 136834 231722 475438 652339
$$ packed form
18983E96546k18622o018l18238j2762N9602l2156m5356l3932p575j8859j41J82821
18971A45310k1240r3932J62668o120r9545N3607j08177n7072Q8721N4104N0347
18960A68671l7655j44096R442J3202n3001m7625J12250P1529k9949N7478Q7618
18949B07864m8678j44067K1621R0019j18705K1798j968k0756K45147J78538Q7384
18938E18197P01k30027j91308j9326l149R753l3351N7030J52195J6009J2264R9677
18926C88665K2243j88772j34720J39483J63124N0367J10911J47863J09832J03587
18916I12583k1284L8510J91197K78845P9662k0334o2025j60269l24958l49833
18906E62094j87023k06656O8998j62049L5567J915O841J7147R4888K43716J76901
$$ plain form
18895 652339 503894 471078 455832 504961 619603 581538 531069 606906 680104 671415 659752
18884 659752 783716 1071110 1438815 1825072 2310986 2793683 3009676 2919299 2479829 1826372
18874 1826372 1326349 1045628 829775 699587 529905 520371 582510 653982 750270 832507
18864 832507 912175 874096 782525 721284 899095 943316 716772 757952 868493 739581 724203
18853 724203 859113 1042721 1228475 1351801 1569825 1922345 2656004 3547298 3903304 3522341
18843 3522341 2789321 2038210 1628343 1504187 1364316 1078482 1021165 1013244 1166760 1266337
18833 1266337 1405045 1555761 1874650 2233740 2769461 3084508 2864209 2763020 3057048
18824 3057048 3250157 3024184 2459221 2229097 2061393 2009915 1947184 1988967 2001982 1867251
$$ packed form
18895F52339j48445l2816j5246M9129J14642l8065n0469P5837P3198q689j1663
18884F59752J23964K87394L67705L86257M85914M82697K15993r0377m39470o53457
18874A826372n00023k80721k15853j30188j69682r534O2139P1472R6288Q2237
18864H32507P9668l8079r1571o1241J77811M4221k26544M1180J10541j28912j5378
18853G24203J34910J83608J85754J23326K18024L52520P33659Q91294L56006l80963
18843C522341p33020p51111m09867j24156j39871k85834n7317p921J53516R9577
18833A266337J38708J50716L18889L59090N35721L15047k20299j01189K94028
18824C057048J93109k25973n64963k30124j67704n1478o2731M1783J3015j34731
$$ plain form
18814 1867251 1780323 1830883 2073258 2306227 2585896 2860692 3143390 3739726 4291543 4377362
18804 4377362 4447894 4571140 4554099 4609586 4731528 5027394 5485004 6147360 6684044 7125315
18794 7125315 7706746 8315492 8999390 9700780 10632277 11973764 13566736 15928548 18919389
18785 18919389 22712729 27790501 34840259 45181625 63205317 95909106 153017425
18778 153017425 222069004 250651209 246318602 254521733 244539272 186565128 122023227
18771 122023227 79912888 56096810 42414068 34026616 29018581 25967017 23671592
18764 23671592 21758827 20304555 19151650 18527540 18143173 18014591 18130763 18424852 19307784
18755 19307784 21075772 23425520 26347085 30700078 37395377 47136539 62576888 89025896
$$ packed form
18814A867251q6928N0560K42375K32969K79669K74796K82698N96336N51817Q5819
18804D377362P0532J23246j7041N5487J21942K95866M57610O62356N36684M41271
18794G125315N81431O08746O83898P01390R31497J341487J592972K361812K990841
18785A8919389L793340N077772P049758J0341366J8023692L2703789N7108319
18778A53017425O9051579K8582205m332607Q203131r982461n7974144o4541901
18771A22023227m2110339k3816078j3682742q387452n008035l051564k295425
18764B3671592j912765j454272j152905o24110l84367j28582J16172K94089Q82932
18755A9307784J767988K349748K921565M352993O695299R741162J5440349K6449008
$$ plain form
18747 89025896 137036223 214231614 281720791 291825249 287780105 295923168 259313421
18740 259313421 181418069 114710902 74924888 52525194 39328425 30852130 25051869
18733 25051869 21041045 18186528 16116661 14431342 12980449 11835041 10922268 10029774
18725 10029774 9086768 8146738 7401172 6729193 5949425 5286656 4967817 4856840 4930700
18716 4930700 4715644 4443336 4332780 4091227 3722470 3149895 2773694 2489993 2344473
18707 2344473 2200163 2114838 1903648 1725101 1335605 1230120 1391493 1418896 1327047 1191410
18697 1191410 1260375 1243497 1239551 1161360 1233715 1092488 1118101 1150869 1131627 1021105 833603
18686 833603 758882 784897 886185 996476 944865 778451 854195 904933 808935 714701 725853
$$ packed form
18747H9025896M8010327P7195391O7489177J0104458m045144Q143063l6609747
18740B59313421p7895352o6707167l9786014k2399694j3196769q476295n800261
18733B5051869m010824k854517k069867j685319j450893j145408r12773q92494
18725A0029774r43006r40030p45566o71979p79768o62769l18839j10977P3860
18716D930700k15056k72308j10556k41553l68757n72575l76201k83701j45520
18707B344473j44310q5325k11190j78547l89496j05485J61373K7403r1849j35637
18697A191410O8965j6878l946p8191P2355j41227K5613L2768j9242j10522j87502
18686H33603p4721K6015J01288J10291n1611j66414P5744N0738r5998r4234J1152
$$ plain form
18675 725853 725009 644834 592953 562470 559136 721177 718622 669766 869986 764298 594316
18664 594316 556986 482471 395276 379987 613201 760543 641378 545475 529394 629080 669073
18653 669073 813936 935220 926102 852612 1012810 1071140 955798 827600 647401 689609
18643 689609 600840 537185 528158 535170 693208 642885 517119 378917 510240 406373 316359
18632 316359 395643 456797 459196 332347 362357 443060 377711 529540 587581 606643 725060
18621 725060 811416 830281 782228 892381 938735 714017 728670 806011 572186 404724 256413
18610 256413 201157 175588 286266 413302 242760 28884 121504 154877 -3121 -130331
18600 -130331 -110637 95577 51986 -47764 59089 198601 275537 464550 442719 359190 351902
$$ packed form
18675G25853q44q0175n1881l0483l334J62041k555m8856K00220j05688j69982
18664E94316l7330p4515q7195j5289K33214J47342j19165r5903j6081R9686L9993
18653F69073J44863J21284r118p3490J60198N8330j15342j28198j80199M2208
18643F89609q8769o3655r027P012J58038n0323j25766j38202J31323j03867r0014
18632C16359P9284O1154K399j26849L0010Q0703o5349J51829N8041J9062J18417
18621G25060Q6356J8865m8053J10153M6354k24718J4653P7341k33825j67462j48311
18610B56413n5256k5569J10678J27036j70542k13876R2620L3373j57998j27210
18600a30331J9694K06214m3591r9750J06853J39512P6936J89013k1831q3529p288
$$ plain form
18589 351902 374983 249944 26376 -3846 38857 166147 293067 295537 339418 341899 354988
18578 354988 524295 470338 435526 323450 250405 130075 29084 82575 88880 159223 133466
18567 133466 81113 -14972 -11722 26977 79317 94698 -62079 -82027 -40939 -6150 -82290
18556 -82290 -148925 -81045 80144 241527 349456 239871 124294 47674 134598 284452
18546 284452 293618 181089 197204 216667 59318 -26638 100326 218842 261285 255881 369766
18535 369766 193776 41398 165248 186339 276540 227483 246406 311706 353616 390164 370287
18524 370287 323085 343601 278464 325667 261776 236675 122546 -47504 92253 318300 427395
18513 427395 505412 568503 525717 337748 187701 286641 218546 146961 379424 575270 406117
$$ packed form
18589C51902K3081j25039k23568l0222M2703J27290J26920K470M3881K481J3089
18578C54988J69307n3957l4812j12076p3045j20330j00991N3491O305P0343k5757
18567A33466n2353r6085L250L8699N2340J5381j56777j9948M1088L4789p6140
18556h2290o6635O7880J61189J61383J07929j09585j15577p6620Q6924J49854
18546B84452R166j12529J6115J9463j57349q5956J26964J18516M2443n404J13885
18535C69766j75990j52378J23850K1091R0201m9057J8923O5300M1910L6548j9877
18524C70287m7202K0516o5137M7203o3891k5101j14129j70050J39757K26047J09095
18513D27395P8017O3091m2786j87969j50047R8940o8095p1585K32463J95846j69153
$$ plain form
18502 406117 329958 271092 281204 248788 109853 108936 172048 125078 -63546 -112999 -87364
18491 -87364 -107819 -76076 113923 173728 134517 65458 176586 278378 327769 291595 332816
18480 332816 379214 547748 449460 438722 351025 391740 320219 363036 453385 244785 220973
18469 220973 213859 384787 302022 280480 349984 440027 409852 369317 231093 224792 180775
18458 180775 152798 216578 248986 233661 355079 360659 423104 491471 592487 625138 507768
18447 507768 423516 341483 339976 479693 666072 756228 548613 535326 646914 544389 495583
18436 495583 285730 452136 543633 549280 562461 789692 1019112 966353 929363 1010527 1133663
18425 1133663 1060764 881023 853897 781759 994115 1190396 1259903 1335056 1375476 1407013 1550138
$$ packed form
18502D06117p6159n8866J0112l2416j38935r17O3112m6970j88624m9453K5635
18491h7364k0455L1743J89999N9805l9211o9059J11128J01792M9391l6174M1221
18480C32816M6398J68534r8288j0738q7697M0715p1521M2817R0349k08600k3812
18469B20973p114J70928q2765k1542O9504R0043l0175m0535j38224o301m4017
18458A80775k7977O3780L2408j5325J21418N580O2445O8367J01016L2651j17370
18447E07768q4252q2033j507J39717J86379R0156k07615j3287J11588j02525m8806
18436D95583k09853J66406R1497N647J3181K27231K29420n2759l6990Q1164J23136
18425A133663p2899j79741k7126p2138K12356J96281O9507P5153M0420L1537J43125
$$ plain form
18414 1550138 1636582 1317642 1272060 1419170 1583743 1537002 1535561 1592448 1623872 1529988 1560398
18403 1560398 1820035 2029228 2049082 2078281 2126521 2173667 2363563 2683832 3114762 3606087
18393 3606087 3967977 4579352 5078536 5350538 5182023 5214285 5305600 5634383 6062125 6436903
18383 6436903 6848108 7275070 7759774 8105694 8694639 9556403 10924012 12558540 14333193
18374 14333193 16457863 19361011 22635747 27006075 33412412 42847478 57331783 81547377
18366 81547377 124993347 199524134 283265730 319477493 326306558 315856117 252647612
18359 252647612 169127039 109284337 74986804 54975618 42076308 33740039 28259160
18352 28259160 24760657 22400651 20541863 19335471 18078793 16833216 15939426 15721836
$$ packed form
18414A550138Q6444l18940m5582J47110J64573m6741j441N6887L1424r3884L0410
18403A560398K59637K09193J9854K9199M8240M7146J89896L20269M30930M91325
18393C606087L61890O11375M99184K72002j68515L2262R1315L28783M27742L74778
18383F436903M11205M26962M84704L45920N88945Q61764J367609J634528J774653
18374A4333193K124670K903148L274736M370328O406337R435066J4484305K4215594
18366H1547377M3445970P4530787Q3741596L6211763O829065j0450441o3208505
18359B52647612q3520573n9842702l4297533k0011186j2899310q336269n480879
18352B8259160l498503k360006j858788j206392j256678j245577q93790k17590
$$ plain form
18344 15721836 16453018 17711614 19182512 20711964 22768218 25482161 29295855 35414112
18336 35414112 45133487 59949908 85435070 131977084 204547877 263523895 277933151
18329 277933151 279571555 252598631 184438315 117934570 76238535 52700594 38520503
18322 38520503 29202258 22992059 18971819 16401370 14409067 12522543 11113546 9955138
18314 9955138 8808606 7838370 7213786 6935493 6609426 6192765 5983813 5832407 5481770
18305 5481770 5003347 4855943 4785859 4643523 4502265 4134174 3324830 2652450 2305798 2153371
18295 2153371 2131677 1969946 1774311 1869297 1918545 1804367 1726427 1743104 1651214 1581900 1495561
18284 1495561 1259683 1159284 1329606 1235269 1114873 1122961 1126254 974843 981768 1041965 1031738
$$ packed form
18344A5721836P31182J258596J470898J529452K056254K713943L813694O118257
18336C5414112R719375J4816421K5485162M6542014P2570793N8976018J4409256
18329B77933151J638404k6972924o8160316o6503745m1696035k3537941j4180091
18322C8520503r318245o210199m020240k570449j992303j886524j408997j158408
18314I955138j146532r70236o24584k78293l26067m16661k08952j51406l50637
18305E481770m78423j47404p0084j42336j41258l68091q09344o72380l46652j52427
18295B153371k1694j61731j95635R4986M9248j14178p7940J6677r1890o9314q6339
18284A495561k35878j00399J70322r4337j20396Q088L293j51411O925O0197j0227
$$ plain form
18273 1031738 993068 846832 872698 793143 742569 703170 640845 460829 536225 715473 774315
18262 774315 1002994 899287 771725 1014899 967295 935760 953017 914875 737151 716796
18252 716796 753826 660823 590594 475085 287678 345858 623785 773149 725575 688763 481687
18241 481687 530660 764330 806094 829768 588562 639520 620807 605418 607766 556740 605629
18230 605629 804651 804796 808653 694004 699878 807081 849109 624258 390728 438735 418945
18219 418945 414471 509794 612112 691423 411986 88729 -18222 141674 408269 521295
18209 521295 816303 807264 922887 957622 842225 858796 856304 664169 561498 486094 437608
18198 437608 512044 628644 542015 598269 774674 737532 686144 564350 498229 327517 239729
$$ packed form
18273A031738l8670j46236K5866p9555n0574l9399o2325j80016P5396J79248N8842
18262G74315K28679j03707j27562K43174m7604l1535J7257l8142j77724k0355
18252G16796L7030r3003p0229j15509j87407N8180K77927J49364m7574l6812k07076
18241D81687M8973K33670M1764K3674k41206N0958j8713j5389K348n1026M8889
18230F05629J99022J45L857j14649N874J07203M2028k24851k33530M8007j9790
18219D18945m474R5323J02318P9311k79437l23257j06951J59896K66595J13026
18209E21295K95008r039J15623L4735j15397J6571k492j92135j02671p5404m8486
18198D37608P4436J16600q6629N6254J76405l7142n1388j21794o6121j70712q7788
$$ plain form
18187 239729 307654 379444 563948 857229 1050683 1210740 1456370 1808487 2022660 2060174
18177 2060174 2006899 1894610 1594800 1286288 1141989 951120 956079 981890 936492 898747
18167 898747 998333 901693 765233 800119 906295 810681 660508 653186 702540 821913 970367
18156 970367 1054582 1026357 1025568 910504 783142 971582 1106185 1381819 1747159 2077206
18146 2077206 2374405 2377493 2353005 2280561 2183395 2232085 2227464 2293582 2320959 2365082 2621178
18135 2621178 2792222 2826706 2750087 2850787 2963990 3035413 3349160 3663309 3966856 4555966
18125 4555966 5147353 5663362 6427324 7273285 8341177 9780661 11359086 13312796 16009697
18116 16009697 19711040 24865278 32132482 42780394 60892304 93960020 157798353
$$ packed form
18187B39729O7925P1790J84504K93281J93454J60057K45630L52117K14173L7514
18177B060174n3275j12289k99810l08512j44299j90869M959K5811m5398l7745
18167H98747R9586r6640j36460L4886J06176r5614j50173p322M9354J19373J48454
18156I70367Q4215k8225p89j15064j27362J88440J34603K75634L65340L30047
18146B077206K97199L088k4488p2444r7166M8690m621O6118K7377M4123K56096
18135B621178J71044L4484p6619J00700J13203P1423L13747L14149L03547N89110
18125D555966N91387N16009P63962Q45961J067892J439484J578425J953710K696901
18116A6009697L701343N154238P267204J0647912J8111910L3067716O3838333
$$ plain form
18109 157798353 274888005 392854510 369964328 246912583 143959664 87323555
18103 87323555 57558278 40570920 29945621 23016879 18343994 15141098 12528482 10401118
18095 10401118 8949227 7910553 6636998 5601470 4891854 4603300 4317557 3886857 3344136
18086 3344136 2849761 2633851 2416140 2289145 2316351 2181444 1892262 1664315 1543466 1408659
18076 1408659 1219497 1213273 1231041 1205580 1049781 999213 1018551 1201783 1039189 938023
18066 938023 1035358 1051521 985284 957216 844144 635333 658365 732435 930077 759424 575667
18055 575667 590789 580692 565032 537282 512451 490747 601392 593615 546616 643526 588422
18044 588422 485843 390016 466970 485387 335295 213136 223000 165965 63087 16743 73896
$$ packed form
18109A57798353J17089652J17966505k2890182j23051745j02952919n6636109
18103H7323555k9765277j6987358j0625299o928742m672885l202896k612616k127364
18095A0401118j451891j038674j273555j035528p09616k88554k85743m30700n42721
18086C344136m94375k15910k17711j26995K7206j34907k89182k27947j20849j34807
18076A408659j89162o224J7768k5461j55799n0568J9338J83232j62594j01166
18066I38023R7335J6163o6237k8068j13072k08811K3032P4070J97642j70653j83757
18055E75667J5122j0097j5660k7750k4831k1704J10645p777m6999R6910n5104
18044E88422j02579r5827P6954J8417j50092j22159R864n7035j02878m6344N7153
$$ plain form
18033 73896 208412 119235 104637 152811 3609 -24093 122262 163376 106253 102166 210703
18022 210703 279026 183071 60131 129680 141555 139446 166809 204426 286069 98916 -82796
18011 -82796 -1197 176118 342710 330545 303645 158996 257189 419787 414044 268754 235144
18000 235144 210956 154828 243956 219007 256266 334096 281280 232918 288172 302088 117982
17989 117982 45283 15938 43578 283076 416633 452507 490774 519345 450268 429999 496516
17978 496516 535652 318850 127327 199051 218663 137275 47896 -99577 -176715 -66934 23082
17967 23082 -9271 -120842 -178120 -104656 -162986 -24499 166984 220669 228140 180111 -68318
17956 -68318 -346809 -212795 -93110 -148065 -241680 -259625 -28928 -25716 -82841 -129907 45566
$$ packed form
18033G3896J34516q9177j4598M8174j49202k7702J46355M1114n7123m087J08537
18022B10703O8323r5955j22940O9549J1875k109K7363L7617Q1643j87153j81712
18011h2796Q1599J77315J66592j2165k6900j44649R8193J62598n743j45290l3610
18000B35144k4188n6128Q9128k4949L7259P7830n2816m8362N5254J3916j84106
17989A17982p2699k9345K7640K39498J33557L5874L8267K8571o9077k0269O6517
17978D96516L9136k16802j91523P1724J9612q1388q9379j47473p7138J09781R0016
17967B3082l2353j11571n7278P3464n8330J38487J91483N3685P471m8029k48429
17956f8318k78491J34014J19685n4955r3615j7945K30697L212n7125m7066J75473
$$ plain form
17945 45566 83127 66377 -19236 -79387 -58236 -67567 -168166 -253751 -107656 -67693 -140445
17934 -140445 -129416 -20230 47397 -18115 13165 -72043 -49934 -52322 -79686 -81400 -138011 -183550
17922 -183550 -196926 -247246 -210667 15200 -5303 -24451 138983 39721 -108618 -168101 -127801
17911 -127801 -59043 -106196 -193343 -260427 -212790 -230555 -204416 -137047 53116 90291 69199
17900 69199 -76277 -83390 -63905 -107245 -40709 -39750 11975 -54276 -236126 -279461 -478903 -384152
17888 -384152 -393859 -408211 -432646 -208158 -23661 -82343 -35545 116189 57180 177372 234190
17877 234190 216341 53742 39305 123369 162129 289543 427906 673984 659071 521995
17867 521995 330433 75750 8207 -26484 55281 133841 66874 83982 86886 -63911 74101
$$ packed form
17945D5566L7561j6750q5613o0151K1151r331j00599q5585J46095L9963p2752
17934a40445J1029J09186O7627o5512L1280q5208K2109k388k7364j714n6611m5539
17922a83550j3376n0320L6579K25867k0503j9148J63434r9262j48339n9483M0300
17911a27801O8758m7153q7147o7084M7637j7765K6139O7369J90163L7175k1092
17900F9199j45476p113J9485m3340O6536R59N1725o6251j81850m3335j99442R4751
17888c84152r707j4352k4435K24488J84497n8682M6798J51734n9009J20192N6818
17877B34190j7849j62599j4437Q4064L8760J27414J38363K46078j4913j37076
17867E21995j91562k54683o7543l4691Q1765P8560o6967J7108K904j50797J38012
$$ plain form
17856 74101 200832 152489 131507 -81498 -47090 -26834 -245906 -105212 2516 84563 94132
17845 94132 157578 182507 173551 195139 142351 -38943 98945 181958 135166 143961 151496 200101
17833 200101 165695 159055 167426 297617 370873 449444 654873 646649 568418 474971 360862
17822 360862 346569 335656 109946 156217 328655 485448 619164 706085 916698 1303311
17812 1303311 1515068 1467829 1487653 1631300 1372710 977839 677073 483576 344497 341019
17802 341019 325055 436284 692681 694671 549806 303770 153779 166771 208718 201430 344009
17791 344009 513650 487755 459456 243810 212422 212166 324146 570485 634100 761348 1041195
17780 1041195 1454952 1616579 1622890 1555888 1264845 1083795 956760 742028 564403 525558
$$ packed form
17856G4101J26731m8343k0982k13005L4408K0256k19072J40694J07728Q2047R569
17845I4132O3446K4929q956K1588n2788j81294J37888Q3013m6792Q795P535M8605
17833B00101l4406o640Q371J30191P3256P8571K05429q224p8231r3447j14109
17822C60862j4293j0913k25710M6271J72438J56793J33716Q6921K10613L86613
17812A303311K11757m7239J9824J43647k58590l94871l00766j93497j39079l478
17802C41019j5964J11229K56397J990j44865k46036j49991J2992M1947p288J42579
17791C44009J69641k5895k8299k15646l1388k56J11980K46339O3615J27248K79847
17780A041195M13757J61627O311o7002k91043j81050j27035k14732j77625l8845
$$ plain form
17770 525558 334831 171552 239477 412823 582156 873655 943947 947418 931322 752797
17760 752797 700620 456173 232860 194674 146730 248946 350963 274810 106993 114534 153501
17749 153501 335240 390261 224979 109838 88110 237223 99088 54762 174114 6183
17739 6183 50280 70672 239985 318644 210108 205535 181052 198879 103894 -12624 -51988
17728 -51988 -13991 12379 67418 67805 -58250 243559 601610 846848 1226494 1405080 1302598
17717 1302598 1117657 830206 485573 492843 660925 478979 365632 426712 383007 77759
17707 77759 -86041 -98606 -82666 103485 318357 577001 651024 542130 476735 385762 289244
17696 289244 290251 426068 713951 802199 569842 336588 314306 297303 119382 49580 -28515
$$ packed form
17770E25558j90727j63279O7925J73346J69333K91499P0292L471j6096j78525
17760G52797n2177k44447k23313l8186m7944J02216J02017p6153j67817P541L8967
17749A53501J81739N5021j65282j15141k1728J49113j38135m4326J19352j67931
17739F183M4097K0392J69313P8659j08536m573k4483J7827r4985j16518l9364
17728e1988L7997K6370N5039L87j26055L01809L58051K45238L79646J78586j02482
17717A302598j84941k87451l44633P270J68082j81946j13347O1080m3705l05248
17707G7759j63800j2565J5940J86151K14872K58644P4023j08894o5395r0973r6518
17696B89244J007J35817K87883Q8248k32357k33254k2282j7003j77921o9802p8095
$$ plain form
17685 -28515 -9871 66727 -60049 99477 214904 376136 529600 358898 88293 -33535
17675 -33535 27772 31727 -102712 -195696 -29035 52077 126788 81729 -18152 -100183 -150905
17664 -150905 -79922 -63083 -56034 -14370 -68183 -39099 -30055 81917 210403 204349 195579 -37421
17652 -37421 -253549 -236518 -214976 -138528 -66393 8400 -70417 -126815 -109458 -23542 -15004 -56194
17640 -56194 -31207 -136774 -178864 -49123 38367 -70465 -41335 47026 -65989 -132191 -8831
17629 -8831 135056 235079 341071 307849 254572 318340 366163 275073 239572 348155 249225
17618 249225 171378 -19701 24610 83290 53151 47219 98703 113301 35301 103049 170332
17607 170332 39610 -79191 -56047 10160 21067 17689 -25462 -6623 73427 142621 160664
$$ packed form
17685b8515J8644P6598j26776J59526J15427J61232J53464j70702k70605j21828
17675c3535O1307L955j34439r2984J66661Q1112P4711m5059r9881q2031n0722
17664a50905P0983J6839P049M1664n3813K9084R044J11972J28486o054q770k33000
17652c7421k16128J7031K1542P6448P2135P4793p8817n6398J7357Q5916Q538m1190
17640e6194K4987j05567m2090J29741Q7490j08832K9130Q8361j13015o6202J23360
17629h831J43887J00023J05992l3222n3277O3768M7823r1090l5501J08583r8930
17618B49225p7847j91079M4311N8680l0139n932N1484J4598p8000O7748O7283
17607A70332j30722j18801K3144O6207J0907l378m3151J8839Q0050O9194J8043
$$ plain form
17596 160664 313925 228478 73032 -20295 44254 92767 33749 73925 186586 272354 276866
17585 276866 160671 -117912 -148182 -52535 -70446 172299 224433 161292 70949 57835 246924
17574 246924 295466 174891 -77052 -96983 -86258 -106177 28788 86463 58586 -38804 -49731
17563 -49731 -163680 -306136 -192166 -65376 -143717 -141729 -101758 -165663 -264212 -431540 -378384
17552 -378384 -286600 -243451 -185312 -175695 -232550 -333090 -93367 115067 13459 -124470 -147516
17541 -147516 -250139 -267285 -303356 -385587 -412437 -314618 -240206 -81504 97014 58138 74797
17530 74797 160374 273151 240650 49078 102728 169170 196582 187797 130562 -20712 -248022
17519 -248022 -378821 -157655 -89918 -271028 -150910 -137337 -66479 -21161 63091 33460 88816
$$ packed form
17596A60664J53261q5447j55446r3327O4549M8513n9018M0176J12661Q5768M512
17585B76866j16195k78583l0270R5647j7911K42745N2134o3141r0343j3114J89089
17574B46924M8542j20575k51943j9931J0725j9919J34965N7675k7877r7390j0927
17563d9731j13949j42456J13970J26790p8341J988L9971o3905r8549j67328N3156
17552c78384R1784M3149N8139R617n6855j00540K39723K08434j01608j37929k3046
17541a47516j02623j7146l6071q2231k6850R7819P4412J58702J78518l8876J6659
17530G4797Q5577J12777l2501j91572N3650O6442K7412q785n7235j51274k27310
17519b48022j30799K21166O7737j81110J20118J3573P0858M5318Q4252k9631N5356
$$ plain form
17508 88816 61780 69763 169590 -58007 -220859 -201397 -167515 -27160 57423 -76746 -228659
17497 -228659 -362324 -256405 -82798 2082 -136875 -220500 -175257 -76169 -59382 21481 -32668
17486 -32668 24350 178593 281011 206691 63598 13611 -86866 -606 154852 138675 25171
17475 25171 120586 170590 11258 -148942 -142856 -150824 -170439 -48181 127843 36872 108240
17464 108240 257984 194856 -101148 -282709 -324425 -209391 -140967 -155327 -87248 -103846 -8214
17453 -8214 48977 14646 -88924 67825 206399 -41145 41005 332657 552017 813661
17443 813661 1298219 1929370 2015664 1433151 876340 692245 536067 498560 426188 442774
17433 442774 490677 507918 536061 579367 727093 1022401 1633645 2157717 2399947 2646646
$$ packed form
17508H8816k7036P983R9827k27597j62852J9462L3882J40355Q4583j34169j51913
17497b28659j33665J05919J73607Q4880j38957q3625M5243R9088J6787Q0863n4149
17486c2668N7018J54243J02418p4320j43093m9987j00477Q6260J55458j6177j13504
17475B5171R5415N0004j59332j60200O086p968j9615J22258J76024r0971P1368
17464A08240J49744o3128k96004j81561m1716J15034O8424j4360O8079j6598R5632
17453h214N7191l4331j03570J56749J38574k47544Q2150K91652K19360K61644
17443H13661M84558O31151Q6294n82513n56811j84095j56178l7507p2372J6586
17433D42774M7903J7241K8143M3306J47726K95308O11244N24072K42230K46699
$$ plain form
17423 2646646 2758801 2556617 2332451 2066786 1776498 1289128 974587 643311 441345
17414 441345 300297 317973 228443 128330 41127 -20094 -41888 -126832 -25321 76366 75840
17403 75840 64302 199934 246547 274475 391536 330241 29622 -4287 32330 346 19360
17392 19360 177927 212247 110105 -74373 -41386 -19921 142251 53152 35133 -56875 -33251
17381 -33251 4560 -131 32600 42534 121225 67475 178648 135087 -14012 2380 6638 28330
17369 28330 90920 20716 -118682 -256396 -182186 2543 31701 60039 -5653 76065 -47702
17358 -47702 -181620 -160526 -125835 -198687 -266871 -99584 51295 -1828 148571 238685 214215
17347 214215 279669 244284 -24923 -319299 -319734 -291638 -331531 -273051 -240630 -210938 -83034
$$ packed form
17423B646646J12155k02184k24166k65665k90288m87370l14541l31276k01966
17414D41345j41048J7676q9530j00113q7203o1221k1794q4944J01511J01687n26
17403G5840j1538J35632M6613K7928J17061o1295l00619l3909L6617l1984J9014
17392A9360J58567L4320j02142j84478L2987K1465J62172q9099j8019r2008K3624
17381c3251L7811m691L2731R934P8691n3750J11173m3561j49099J6392M258K1692
17369B8330O2590p0204j39398j37714P4210J84729K9158K8338o5692Q1718j23767
17358d7702j33918K1094L4691p2852o8184J67287J50879n3123J50399R0114k4470
17347B14215O5454l5385k69207k94376m35K8096l9893N8480L2421K9692J27904
$$ plain form
17336 -83034 114240 320453 320896 227466 163348 107593 123744 21874 -71695 -15573 -1474
17325 -1474 12724 -94816 -173202 52135 95290 233823 116215 44079 229934 276715 142086
17314 142086 19282 -44576 -241483 -150294 -202486 -152926 3112 -32122 -162689 -287517
17304 -287517 -389450 -289598 -263486 -127545 35174 -128003 -326566 -306681 -72243 -12893
17294 -12893 -165379 -269952 -235606 -266289 -385405 -158412 146929 22627 22702 19216 50129
17283 50129 162805 80042 -23583 -43797 -137317 -39566 12483 53423 81028 189576 107669
17272 107669 46858 -9993 -45771 -98092 -129377 -206126 -262614 -180069 -102595 -39019 153177
17261 153177 47505 -145461 -160112 -343542 -390156 -432883 -324289 -85973 3179 -88305
$$ packed form
17336h3034J97274K06213M43r3430o4118n5755J6151j01870r3569N6122J4099
17325a474J4198j07540p8386K25337M3155J38533j17608p2136J85855M6781j34629
17314A42086j22804o3858j96907R1189n2192M9560J56038l5234j30567j24828
17304b87517j01933R9852K6112J35941J62719j63177j98563J9885K34438N9350
17294a2893j52486j04573L4346l0683j19116K26993L05341j24302P5l486L0913
17283E0129J12676q2763j03625k0214r3520R7751N2049M0940K7605J08548q1907
17272A07669o0811n6851l5778n2321l1285p6749n6488Q2545P7474O3576J92196
17261A53177j05672j92966j4651j83430m6614m2727J08594K38316Q9152r1484
$$ plain form
17251 -88305 -53990 70456 -74179 -73928 18175 10181 -20868 -33264 -7971 -37274 -140231 -185266
17239 -185266 -187932 -151622 -250969 -270132 -80907 171460 248734 164512 100918 74177 -40232
17228 -40232 -51460 87692 8487 -93969 -114533 -153762 -100009 72567 128429 133558 78638
17217 78638 55386 63756 63283 1860 62203 22786 22091 43156 -18472 242542 363641 496013
17205 496013 532442 486379 253149 180923 187762 118266 133770 52108 9140 123464 203959
17194 203959 -34202 -206029 -37549 61864 38297 -35378 -22383 -9377 17652 3511 11160
17183 11160 -47191 -192344 -239213 -151319 -88517 -81333 -67672 -60305 57192 119931 -210
17172 -210 -4942 -75400 -173340 -196384 -74394 7044 -32486 35373 162327 257279 269197 133108
$$ packed form
17251h8305L4315J24446j44635K51R2103p994l1049j2396K5293k9303j02957m5035
17239a85266k666L6310r9347j9163J89225K52367P7274q4222o3594k6741j14409
17228d0232j1228J39152p9205j02456k0564l9229N3753J72576N5862N129n4920
17217G8638k3252Q370m73o1423O0343l9417o95K1065o1628K61014J21099J32372
17205D96013L6429m6063k33230p2226O839o9496J5504q1662m2968J14324Q0495
17194B03959k38161j71827J68480R9413k3567p3675J2995J3006K7029j4141P649
17183A1160n8351j45153m6869Q7894O2802P184J3661P367J17497O2739j20141
17172b10m732p0458r7940k3044J21990Q1438l9530O7859J26954R4952J1918j36089
$$ plain form
17160 133108 107296 192678 322577 141949 -102540 -84262 -18960 -92847 77329 152482 188078
17149 188078 212760 188468 26062 -74512 -276994 -232245 -17956 8450 36024 126237 -35645
17138 -35645 -16004 61216 92880 -14367 124233 354418 346625 27166 -97821 6361 56018
17127 56018 125511 268409 248023 259554 231587 227514 142775 94939 71978 213 88749 -22298
17115 -22298 -26085 58230 22486 -79220 -303094 -228431 -27887 91438 186907 256927 109807
17104 109807 44448 -43149 -57120 -86084 89875 231556 305554 271919 114458 113542 187541
17093 187541 246248 230252 202989 219641 163161 152655 72193 51115 -12590 27405 127394
17082 127394 58926 -38872 -111689 -94809 25408 73334 -50937 16987 36563 -124046 -135303
$$ packed form
17160A33108k5812Q5382J29899j80628k44489J8278O5302p3887J70176P5153L5596
17149A88078K4682k4292j62406j00574k02482M4749K14289K6406K7574R0213j61882
17138c5645J9641P7220L1664j07247J38600K30185p793l19459j24987J04182M9657
17127E6018O9493J42898k0386J1531k7967m073q4739m7836k2961p1765Q8536j11047
17115b2298l787Q4315l5744j01706k23874P4663K00544J19325R5469P0020j47120
17104A09807o5359q7597j3971k8964J75959J41681P3998l3635j57461r16P3999
17093A87541N8707j5996k7263J6652n6480j0506q0462k1078o3705L9995R9989
17082A27394o8468r7798p2817J6880J20217M7926j24271O7924J9576j60609j1257
$$ plain form
17071 -135303 104403 214298 187750 266051 211370 215195 36943 -77492 -104652 -286740 -268954
17060 -268954 -110776 -173690 -231660 -140493 -19696 51580 82689 308478 336545 222928 250375
17049 250375 389796 494177 449436 316972 222933 82533 214993 349742 347109 212619
17039 212619 80042 63255 267529 406668 464595 375049 417546 451405 53002 -98180
17029 -98180 98707 311902 431037 477428 301368 228798 343085 255798 174774 75383 25768
17018 25768 26716 63242 164918 200575 163341 128859 321614 426198 510028 539527 564381
17007 564381 416615 261564 53825 -94959 31833 -8279 -47481 -109652 -198532 -131172
16997 -131172 -15593 22413 28680 -31673 -15183 91590 214417 132935 90379 272061 245709
$$ packed form
17071a35303K39706J09895k6548P8301n4681L825j78252j14435k7160j82088J7786
17060b68954J58178o2914n7970R1167J20797P1276L1109K25789K8067j13617K7447
17049B50375J39421J04381m4741j32464r4039j40400J32460J34749k633j34490
17039B12619j32577j6787K04274J39139N7927q9546M2497L3859l98403j51182
17029i8180J96887K13195J19135M6391j76060p2570J14287q7287q1024r9391m9615
17018B5768R48L6526J01676L5657l7234l4482J92755J04584Q3830K9499K4854
17007E64381j47766j55051k07739j48784J26792m0112l9202o2171q8880O7360
16997a31172J15579L8006O267o0353J6490J06773J22827q1482m2556J81682k6352
$$ plain form
16986 245709 349365 532310 628033 695778 689004 494777 392722 330943 374704 243220 270482
16975 270482 470115 485923 380793 354300 330282 503388 674563 538383 268639 135710
16965 135710 178266 195874 91458 157664 296681 505616 516667 516587 564101 625499 419919
16954 419919 356301 410385 376169 419777 318502 464875 516401 477317 599783 639845 677530
16943 677530 720297 601513 464582 414126 372820 441344 410166 422988 566182 802655 796918
16932 796918 642320 633124 761333 864860 918401 952774 1008306 1105601 1252047 1202265 1281426
16921 1281426 1252633 1435018 1625206 1655213 1747014 1851846 1949748 1860499 2035771 2227977
16911 2227977 2406660 2522019 2643539 2750586 2999697 3194663 3467107 3897119 4183924
$$ packed form
16986B45709J03656J82945R5723O7745o774j94227j02055o1779M3761j31484K7262
16975B70482J99633J5808j05130k6493k4018J73106J71175j36180k69744j32929
16965A35710M2556J7608j04416O6206J39017K08935J1051q0M7514O1398k05580
16954D19919o3618N4084l4216M3608j01275J46373N1526l9084J22466M0062L7685
16943F77530M2767j18784j36931n0456m1306O8524l1178J2822J43194K36473n737
16932G96918j54598r196J28209J03527N3541L4373N5532R7295J46446m9782P9161
16921A281426k8793J82385J90188L0007R1801J04832R7902q9249J75272J92206
16911B227977J78683J15359J21520J07047K49111J94966K72444M30012K86805
$$ plain form
16902 4183924 4521353 5052103 5743925 6315325 6978337 7532849 7961049 8325329 8833835
16893 8833835 9383399 9780047 10146766 10626202 11535114 12936256 14577038 16992585 19925827
16884 19925827 23189026 26795500 31293033 36910953 44344171 55187397 72023633 99607070
16876 99607070 145628549 214974495 298474517 378521136 449529088 502118610 510281205
16869 510281205 470679584 406928484 330626808 246490856 170267092 115249556 81044901
16862 81044901 60372095 47239698 38645479 32634789 28108390 24308830 21192415 18556590
16854 18556590 16002453 13955010 12040442 10432901 9113209 7802923 6964099 6258919
16846 6258919 5591432 5160842 4755983 4323845 3996467 3928282 3951095 3709597 3196685 2862489
$$ packed form
16902D183924L37429N30750O91822N71400O63012N54512M28200L64280N08506
16893H833835N49564L96648L66719M79436R08912J401142J640782K415547K933242
16884A9925827L263199L606474M497533N617920P433218J0843226J6836236K7583437
16876I9607070M6021479O9345946Q3500022Q0046619P1007952N2589522Q162595
16869E10281205l9601621o3751100p6301676q4135952p6223764n5017536l4204655
16862H1044901k0672806j3132397q594219o010690m526399l799560l116415k635825
16854A8556590k554137k047443j914568j607541j319692j310286q38824p05180
16846F258919o67487m30590m04859m32138l27378o8185K2813k41498n12912l34196
$$ plain form
16836 2862489 2805539 2704776 2512067 2388466 2273550 2259161 2194857 1899313 1780395 1742148
16826 1742148 1812971 1804572 1838010 1807277 1678683 1610702 1457457 1374953 1374997 1331444 1345418 1222467
16814 1222467 1179603 1176809 1061162 920604 861302 798832 834369 944598 732380 665587 619871
16803 619871 512007 458172 418313 513133 377748 303341 368989 691152 702382 722514 667561
16792 667561 544639 464025 429861 408328 533281 589879 606325 482808 481560 693986 790775
16781 790775 671819 667058 623959 576312 469681 355959 315335 315825 386896 367333 345463
16770 345463 495533 680363 634070 494497 419489 439399 465888 505577 422697 325895 330154
16759 330154 423285 549833 550973 433214 132193 -18262 37153 138630 51837 237881
$$ packed form
16836B862489n6950j00763j92709j23601j14916j4389o4304k95544j18918l8247
16826A742148P0823q399L3438l0733j28594o7981j53245q2504M4m3553J3974j22951
16814A222467m2864k794j15647j40558n9302o2470L5537J10229k12218o6793m5716
16803F19871j07864n3835l9859R4820j35385p4407O5648L22163J1230K0132n4953
16792F67561j22922q0614l4164k1533J24953N6598J6446j23517j248K12426R6789
16781G90775j18956m761m3099m7647j06631j13722m0624M90P1071j9563k1870
16770C45463J50070J84830m6293j39573p5008J9910K6489L9689q2880r6802M259
16759C30154R3131J26548J140j17759l01021j50455N5415J01477q6793J86044
$$ plain form
16749 237881 568807 885087 1010957 1105092 1167004 954976 815575 728236 729561 699622 726300
16738 726300 627664 343219 291362 193597 151307 8464 -14481 29808 26597 93622 140622
16727 140622 6229 -68664 -47638 -106574 -109819 35088 34381 86999 -170315 -140195 -100811
16716 -100811 -105633 -6625 -8727 131505 334459 261571 189249 159345 50829 66445 186071
16705 186071 105036 212714 195737 52218 -79097 -163908 -109129 -136551 -191681 -203508 -241318
16694 -241318 -274644 -400349 -450867 -354569 -321710 -236809 -83566 116669 195816 196193 246523
16683 246523 213410 134071 215496 218974 235470 196284 103274 -11088 9232 -10610 37572
16672 37572 162069 183861 254930 435632 262300 97142 123273 139047 159862 149810 32570
$$ packed form
16749B37881L30926L16280J25870R4135O1912k12028j39401q7339J325k9939K6678
16738G26300r8636k84445n1857r7765m2290j42843k2945M4289l211O7025M7000
16727A40622j34393p4893K1026n8936l245J44907p07N2618k57314L0120L9384
16716a00811m822R9008k102J40232K02954p2888p2322k9904j08516J5616J19626
16705A86071q1035J07678j6977j43519j31315q4811N4779k7422n5130j1827l7810
16694b41318l3326j25705n0518R6298L2859Q4901J53243K00235P9147L77N0330
16683B46523l3113p9339Q1425L478J6496l9186r3010j14362K0320j9842M8182
16672C7572J24497K1792P1069J80702j73332j65158K6131J5774K0815j0052j17240
$$ plain form
16661 32570 116563 88874 132073 300486 339456 329474 105176 5846 111733 102007 22821
16650 22821 7412 8408 -50569 -47521 125599 145228 -98710 -295983 -404798 -451542 -262940
16639 -262940 -130066 -238746 -263736 -188291 -195408 -149825 -125235 -86166 -213402 -61593 -43131
16628 -43131 -163183 -122009 -85322 -188634 -198447 -52767 20345 -8736 -82709 105327 322183
16617 322183 276416 224919 223596 365811 317623 255803 85584 1258 -82387 -107739 -53605
16606 -53605 -41662 51067 -6625 -12298 105087 117643 28653 -27373 -76980 -136504 -167157 -78271
16594 -78271 -18236 52567 198913 -5885 -154934 -144996 -131400 -212253 -303252 -475226 -402157
16583 -402157 -269711 -268029 -296939 -289115 -166110 -114502 -231017 -146167 -203390 -228296 -29085
$$ packed form
16661C2570Q3993k7689M3199J68413L8970r982k24298r9330J05887r726p9186
16650B2821j5409R96n8977L048J73120J9629k43938j97273j08815m6744J88602
16639b62940J32874j08680k4990P5445p117M5583K4590L9069j27236J51809J8462
16628d3131j20052M1174L6687j03312r813J45680P3112k9081p3973J88036K16856
16617C22183m5767n1497j323J42215m8188o1820j70219q4326q3645k5352N4134
16606e3605J1943R2729n7692n673J17385J2556q8990n6026m9607n9524l0653Q8886
16594g8271O0035P0803J46346k04798j49049R938J3596q0853r0999j71974P3069
16583d02157J32446J682k8910P824J23005N1608j16515Q4850n7223k4906J99211
$$ plain form
16572 -29085 86767 141224 89859 10521 -13880 -70100 -135796 -36824 -60231 -81911 -21464
16561 -21464 67127 33679 -43589 -46342 -63488 -65903 -153085 -133584 -124776 -210685 -133506 19059
16549 19059 -72271 -46607 -12021 -79197 -176396 -292484 -254068 -288928 -433971 -364096 -256631
16538 -256631 -254031 -401462 -469519 -175013 -14279 -118137 -107730 -73853 -15383 95264 15435
16527 15435 -61050 -147998 -208310 -192559 -201113 -212319 -215908 -122692 -120440 -203565 -102887 49426
16515 49426 221759 229899 199158 54993 -161682 -276381 -206251 -214251 -249690 -241686 -213629
16504 -213629 -312563 -303210 -102296 -178252 -321748 -309713 -188129 -160878 -123187 -108315 5038
16493 5038 97521 -17609 -314506 -442457 -275009 -175933 -147919 -45871 149595 119454 61329
$$ packed form
16572b9085J15852N4457n1365p9338k4401n6220o5696R8972k3407k1680O0447
16561b1464Q8591l3448p7268k753j7146k415q7182J9501Q808q5909P7179J52565
16549A9059r1330K5664L4586o7176r7199j16088L8416l4860j45043O9875J07465
16538b56631K600j47431o8057K94506J60734j03858J0407L3877N8470J10647p9829
16527A5435p6485q6948o0312J5751q554j1206l589R3216K252q3125J00678J52313
16515D9426J72333Q140l0741j44165k16675j14699P0130q000l5439Q004K8057
16504b13629r8934R353K00914p5956j43496J2035J21584K7251L7691J4872J13353
16493E038R2483j15130k96897j27951J67448R9076K8014J02048J95466l0141n8125
$$ plain form
16482 61329 42856 54435 2626 -99465 -212025 -178505 -88911 -53601 -78628 -50757 -20032
16471 -20032 -62402 -52829 -18476 -38523 30899 36205 5685 -33022 -42791 -115674 -122571 -224408
16459 -224408 -150238 129736 248863 256439 240161 281904 82917 -198091 -185861 -181022 35468
16448 35468 -24243 -9228 76004 -70863 -172250 -258094 -133179 -230728 -224134 -76284 -69159
16437 -69159 -70084 34063 234278 340054 160236 178906 285229 134667 -22711 -38621 -44509
16426 -44509 -150398 -229093 -318030 -149044 -102149 -148386 -151733 -52188 -66194 2830 161028
16415 161028 183403 328993 319062 38200 -2518 -69030 -52100 -124248 -252584 -170277 12755
16404 12755 53619 -69746 -20804 -94166 -174569 -147824 -141526 -176479 -123677 -80923 101474
$$ packed form
16482F1329j8473J1579n1809j02091j12560L3520Q9594L5310k5027K7871L0725
16471b0032m2370R573L4353k0047O9422N306l0520l8707r769p2883o897j01837
16459b24408P4170K79974J19127P576j6278M1743j98987k81008J2230M839K16490
16448C5468n9711J5015Q5232j46867j01387q5844J24915r7549O594J47850P125
16437f9159r25J04147K00215J05776j79818J8670J06323j50562j57378j5910n888
16426d4509j05889p8695q8937J68986M6895m6237l347R9545j4006O9024J58198
16415A61028K2375J45590r931k80862m0718o6512J6930p2148j28336Q2307J83032
16404A2755M0864j23365M8942p3362q0403K6745O298l4953N2802M2754J82397
$$ plain form
16393 101474 267285 152499 9274 -68853 -44609 73907 119746 14843 71336 229259
16383 229259 355570 277692 245463 190969 99403 65680 -7170 -70541 -124706 -86941 142539
16372 142539 222642 152440 312687 296811 222269 105097 27664 111289 -100942 -221701 -131932
16361 -131932 -74407 -45488 106364 181817 274903 154451 107300 -49300 -211618 -198126 -59724
16350 -59724 86274 131255 144898 -8466 -174054 -12848 184555 105811 -33478 -62004
16340 -62004 -148987 -275639 -268018 -217796 -239708 -208134 -128528 -147399 -30902 177579 55126
16329 55126 -100148 63670 182853 70014 37522 -155819 -171525 -151285 -109215 100810
16319 100810 298039 360652 575492 890882 1036142 1215186 1538112 1886376 2220354 2489549
$$ packed form
16393A01474J65811j14786j43225p8127K4244J18516M5839j04903N6493J57923
16383B29259J26311p7878l2229n4494r1566l3723p2850o3371n4165L7765K29480
16372A42539Q0103p0202J60247j5876p4542j17172p7433Q3625k12231j20759Q9769
16361a31932N7525K8919J51852P5453R3086j20452m7151j56600j62318J3492J38402
16350e9724J45998M4981J3643j53364j65588J61206J97403p8744j39289k8526
16340f2004q6983j26652P621N0222k1912L1574P9606j8871J16497K08481j22453
16329E5126j55274J63818J19183j12839l2492j93341j5706K0240M2070K10025
16319A00810J97229O2613K14840L15390J45260J79044L22926L48264L33978K69195
$$ plain form
16309 2489549 2674424 2586199 2219513 1687375 1332161 901359 558137 363094 398848 477372
16299 477372 359141 234253 10177 -28742 20321 36696 86185 177645 79299 -36784 -39823
16288 -39823 35766 80361 242881 293539 295490 273872 149528 224029 299499 148906 -28507
16277 -28507 -59261 -102894 -106277 4181 -24468 -191234 -207877 -192208 -162401 -34901 76227
16266 76227 241438 271684 119194 39760 -4601 -60729 -73423 44223 145510 233325 327275
16255 327275 215420 70313 -166920 -140034 -108356 -29208 -11699 40460 239879 311402 297106
16244 297106 269117 213597 192406 180141 309228 309017 325280 450002 438096 241740 82320
16233 82320 52477 -80612 -293761 -216977 -54706 -170436 -166001 -159463 -150136 -71070 15683
$$ packed form
16309B489549J84875q8225l66686n32138l55214m30802l43222j95043L5754P8524
16299D77372j18231j24888k24076l8919M9063J6375M9489R1460r8346j16083l039
16288c9823P5589M4595J62520N0658J951k1618j24344P4501P5470j50593j77413
16277b8507l0754m3633l383J10458k8649j66766j6643J5669K9807J27500J11128
16266G6227J65211L0246j52490p9434m4361n6128j2694J17646J01287Q7815R3950
16255C27275j11855j45107k37233K6886L1678P9148J7509N2159J99419P1523j4296
16244B97106k7989n5520k1191j2265J29087k11J6263J24722j1906j96356j59420
16233H2320k9843j33089k13149P6784J62271j15730M435O538R327P9066Q6753
$$ plain form
16222 15683 79690 64410 148165 136613 31840 -27038 -12095 -95194 -241416 -183109 -165427
16211 -165427 -21895 -51319 -126114 -101030 -102844 -48464 -56698 -18543 -33832 -107128 99521
16200 99521 106706 -51462 -75504 -153283 -320254 -319225 -183783 -14359 -38268 -131707 -90114
16189 -90114 -147842 -278203 -490148 -559998 -552845 -433370 -30554 -36944 -198328 -239356 -152008
16178 -152008 -54119 165505 250671 50340 48588 -53072 -155643 -42281 -36691 -157673 -263898
16167 -263898 -315436 -246137 -132300 -174442 -99422 25348 -64936 -58552 -43072 42940 165771
16156 165771 396172 513607 460439 192003 71176 17242 -119785 -156026 -136503 -208919
16146 -208919 -163524 -112220 -192392 -108375 -257156 -215036 -186744 -129243 -103443 -216088 -237116
$$ packed form
16222A5683O4007j5280Q3755j1552j04773n8878J4943q3099j46222N8307J7682
16211a65427J43532k9424p4795K5084j814N4380q234L8155j5289p3296K06649
16200I9521P185j58168k4042p7779j66971J029J35442J69424k3909r3439M1593
16189i0114n7728j30361k11945o9850P153J19475M02816o390j61384m1028Q7348
16178a52008R7889K19624Q5166k00331j752j01660j02571J13362N590j20982j06225
16167b63898n1538O9299J13837m2142P5020J24770r0284O384J5480Q6012J22831
16156A65771K30401J17435n3168k68436j20827n3934j37027l6241J9523p2416
16146b08919M5395N1304q0172Q4017j48781M2120K8292N7501K5800j12645k1028
$$ plain form
16135 -237116 -56446 56863 -77983 -8699 -13398 -73815 -40144 -118603 -191674 -128135 -136126
16124 -136126 -57544 -43061 -131764 -243501 -444330 -406444 -456407 -362744 -233962 -192603 -193007
16113 -193007 -197497 -191959 -246447 -352290 -323767 -283328 -66148 148507 190871 82206 68796
16102 68796 -126965 -42454 -78411 -109288 -151503 -227682 -201171 -129653 -110795 -99471 -199061
16091 -199061 -234505 -218460 -130333 -163628 -29742 134330 101908 84415 83540 150942 54959
16080 54959 77389 182314 -12008 -151242 -107031 -68540 -96433 -39110 -57771 -97872 -66175
16069 -66175 -87289 -84208 39231 158190 132708 -3516 73261 82119 -4255 -141524 -302781
16058 -302781 -197830 35488 138989 18840 -73150 -321850 -110976 -12003 -1563 -133805
$$ packed form
16135b37116J80670J13309j34846O9284m699o0417L3671p8459p3071O3539p991
16124a36126P8582J4483q8703j11737k00829L7886m9963R3663J28782M1359m04
16113a93007m490N538n4488j05843K8523M0439K17180K14655M2364j08665j3410
16102F8796j95761Q4511l5957l0877m2215p6179K6511P1518J8858J1324r9590
16091a99061l5444J6045Q8127l3295J33886J64072l2422j7493q75O7402r5983
16080E4959K2430J04925j94322j39234M4211L8491k7893N7323j8661m0101L1697
16069f6175k1114L081J23439J18959k5482j36224P6777Q858q6374j37269j61257
16058c02781J04951K33318J03501j20149r1990k48700K10874R8973J0440j32242
$$ plain form
16048 -133805 -38848 -7568 126191 187852 -87857 -108020 -1420 3741 34748 12282 65862
16037 65862 223389 359837 343968 224205 31726 165198 131304 34274 -252088 -290777
16027 -290777 -379649 -230817 -126379 -145151 -180852 -94792 -156607 -34288 39699 65761 90562
16016 90562 1591 -117774 124385 235101 141994 -91409 -124790 37920 107319 238205
16006 238205 64168 -330 -163495 -352068 -395153 -310125 -275294 -83729 -82053 -38854 55186
15995 55186 92348 152429 271550 262309 135552 -44302 -41262 -114000 -249537 -360338 -389058
15984 -389058 -486402 -418311 -433804 -390758 -311720 -344197 -328794 -167634 61896 168940 361456
15973 361456 368183 333693 265556 54955 -92133 -37214 156730 11676 -6726 129924 132642
$$ packed form
16048a33805R4957L1280J33759O1661k75709k0163J06600N161L1007k2466N3580
16037F5862J57527J36448j5869j19763j92479J33472l3894r7030k86362l8689
16027b90777q8872J48832J04438j8772l5701Q6060o1815J22319P3987K6062K4801
16016I0562q8971j19365K42159J10716r3107k33403l3381J62710O9399J30886
16006B38205j74037o4498j63165j88573m3085Q5028L4831J91565J676M3199R4040
15995E5186L7162O0081J19121r241j26757j79854L040p2738j35537j10801k8720
15984c89058r7344O8091j5493M3046P9038l2477J5403J61160K29530J07044J92516
15973C61456O727l4490o8137k10601j47088N4919J93944j45054j8402J36650K718
$$ plain form
15962 132642 -87653 -186038 -60562 -63350 -289000 -286637 -356372 -125397 67216 103907 98505
15951 98505 131131 236558 220142 239181 8714 -59678 95556 228148 317592 365748 151210
15940 151210 -58969 20010 180356 253702 73625 88048 1729 23541 -109705 -194829 -209610
15929 -209610 -223146 -188609 -160330 -87375 -100790 -65178 -77045 -60226 -48736 -4472 63652
15918 63652 54140 86087 103286 -33765 -102030 -164342 -121579 -167311 -323267 -241524 -92173
15907 -92173 32405 -21839 -13623 -29118 -81204 -214494 -198314 31359 185607 86828 199323
15896 199323 139218 -187715 -282088 -185665 -144036 -117917 47163 -26551 -39531 60937 230628
15885 230628 283596 109172 21247 -83537 -53828 -161930 -278842 -275577 -68391 45818
$$ packed form
15962A32642k20295r8385J25476k788k25650K363o9735K30975J92613L6691n402
15951I8505L2626J05427j6416J9039k30467o8392J55234J32592Q9444M8156k14538
15940A51210k10179P8979J60346P3346j80077J4423q6319K1812j33246q5124j4781
15929b09610j3536L4537K8279P2955j3415L5612j1867J6819J1490M4264O8124
15918F3652r512L1947J7199j37051o8265o2312M2763m5732j55956Q1743J49351
15907i2173J24578n4244Q216j5495n2086j33290J6180K29673J54248r8779J12495
15896A99323o0105l26933r4373R6423M1629K6119J65080p3714j2980J00468J69691
15885B30628N2968j74424q7925j04784K9709j08102j16912L265K07186J14209
$$ plain form
15875 45818 112175 5730 19969 18149 -2528 31732 -58865 -46675 -15046 -112192 -94128 -158392
15863 -158392 -221232 -43604 44305 20625 -155534 -127009 122671 67187 -131728 -246776
15853 -246776 -211224 -127263 -192034 -148144 1633 -97132 -257756 -202487 -86886 31013 99768
15842 99768 -22894 -224336 -164197 -50985 -101228 -27308 11532 13490 -123776 -266750 -371248
15831 -371248 -304412 -307915 -247835 -129651 21814 87842 -32025 -59144 -121734 -96704 -62716
15820 -62716 -92637 100408 323124 410580 229992 -77692 -163438 -323404 -209234 -87563
15810 -87563 -135682 -239194 -180333 -9049 9153 -33555 -47267 49101 107450 208471 177888
15799 177888 124347 -30385 -38995 -227253 -222150 -84577 -8608 90649 94722 143682 62258
$$ packed form
15875D5818O6357j06445J4239j820k0677L4260r0597J2190L1629r7146J8064o4264
15863a58392o2840J77628Q7909k3680j76159K8525K49680n5484j98915j15048
15853b46776L5552Q3961o4771M3890J49777r8765j60624N5269J15601J17899O8755
15842I9768j22662k01442O0139J13212n0243P3920L8840J958j37266j42974j04498
15831c71248O6836l503O0080J18184J51465O6028j19867k7119o2590K5030L3988
15820f2716k9921J93045K22716Q7456j80588l07684q5746j59966J14170J21671
15810h7563m8119j03512N8861J71284J8202m2708j3712R6368N8349J01021l0583
15799A77888n3541j54732q610j88258N103J37573P5969R9257M073M8960q1424
$$ plain form
15788 62258 -116450 -21395 -85970 -164931 -3334 40049 24882 -72538 -61221 -79871 -136917
15777 -136917 -73305 -197032 -262677 -287043 -173957 -42077 -19458 -35025 -37662 -5459 91839
15766 91839 294550 963 -212537 -258631 -219246 -4902 35482 -93146 -202238 -104989
15756 -104989 48100 172623 53595 67444 97976 106061 125141 -67752 -37442 9605 -138653
15745 -138653 -271569 -164080 -6579 -158052 -174873 14297 271780 317959 223947 -84987
15735 -84987 -109172 -20012 -56104 -16757 -69048 -104689 -97903 -193870 -117671 -176143 -57219 -125500
15723 -125500 -152959 -75224 -26606 83320 235350 288329 263592 236153 241332 242749 112890
15712 112890 88328 -14859 -149067 -204411 -329304 -286079 -153230 -322196 -347724 -272929
$$ packed form
15788F2258j78708R5055o4575p8961J61597M3383j5167r7420J1317j8650n7046
15777a36917O3612j23727o5645k4366J13086J31880K2619j5567k637L2203R7298
15766I1839K02711k93587k13500m6094L9385K14344M0384j28628j09092R7249
15756a04989J53089J24523j19028J3849L0532Q085J9080j92893L0310M7047j48258
15745a38653j32916J07489J57501j51473j6821J89170K57483M6179r4012l08934
15735h4987k4185Q9160l6092L9347n2291l5641O786r5967P6199n8472J18924o8281
15723a25500k7459P7735M8618J09926J52030N2979k4737k7439N179J417j29859
15712A12890k4562j03187j34208n5344j24893M3225J32849j68966k5528P4795
$$ plain form
15702 -272929 -305992 -209064 -315685 -449915 -337866 -249080 -56055 75466 27041 20084 -134526
15691 -134526 -151729 -40350 -151439 -234512 -374723 -298227 -221337 -115008 109153 111865 231759
15680 231759 188325 51435 141283 350130 297008 125680 -19398 33235 82492 -63450
15670 -63450 -186873 -235163 -180498 11870 -7697 44686 83889 -155739 -160232 -15322 5909
15659 5909 -37811 -43710 -41681 -88670 -153273 -106613 -79823 -70946 69299 -109141 -354645 -254399
15647 -254399 -228854 -212427 12069 -31360 -3997 239714 284652 174055 108640 215470 83843
15636 83843 -135685 -30163 -19720 -59238 -223985 -146868 -161366 99896 156284 33142 16514
15625 16514 -71104 -71746 -50350 -82108 -50236 -56601 -147723 -46700 -26100 -115039 -76953 -91262
$$ packed form
15702b72929l3063R6928j06621j34230J12049Q8786J93025J31521m8425o957j54610
15691a34526j7203J11379j11089q3073j40211P6496P6890J06329K24161K712J19894
15680B31759m3434j36890Q9848K08847n3122j71328j45078N2633M9257j45942
15670f3450j23423m8290N4665J92368j9567N2383L9203k39628m493J44910K1231
15659E909m3720n899K029m6989o4603M6660K6790Q877J40245j78440k45504J00246
15647b54399K5545J6427K24496m3429K7363K43711M4938j10597o5415J06830j31627
15636H3843k19528J05522J0443l9518j64747P7117j4498K61262N6388j23142j6628
15625A6514q7618o42K1396l1758L1872o365r1122J01023K0600q8939L8086j4309
$$ plain form
15613 -91262 -236788 -347454 -448702 -271320 -106358 145308 258059 261679 101130 -55543
15603 -55543 -204784 -155017 -22830 -23679 -102469 -308858 -391049 -222823 -275052 -251728 -79226
15592 -79226 -125009 -77341 97457 37266 -237232 -285542 -271927 -61281 -84545 -197109 -304084
15581 -304084 -314609 -59991 -41191 -154963 -223102 -38337 69618 179976 -18640 -128356
15571 -128356 -139606 -218238 -176640 -88481 -48642 9596 -144363 -156314 -12501 23503 3802
15560 3802 177805 166552 48145 23462 -81139 -156694 13300 161754 211671 124982 -124928
15549 -124928 -269846 -257940 -12125 68560 159938 269697 227458 186716 62622 2703 38175
15538 38175 71625 104722 67033 70466 49811 -43595 -30958 199067 263315 64052 35373
$$ packed form
15613i1262j45526j10666j01248J77382J64962K51666J12751L620j60549j56673
15603e5543j49241M9767J32187q49p8790k06389q2191J68226n2229K3324J72502
15592g9226m5783M7668J74798o0191k74498m8310J3615K10646k3264j12564j06975
15581c04084j0525K54618J8800j13772o8139J84765J07955J10358j98616j09716
15571a28356j1250p8632M1598Q8159L9839N8238j53959j1951J43813L6004j9701
15560C802J74003j1253j18407k4683j04601p5555J69994J48454M9917q6689k49910
15549a24928j44918J1906K45815Q0685R1378J09759m2239m0742j24094n9919L5472
15538C8175L3450L3097l7689L433k0655r3406J2637K30025O4248j99263k8679
$$ plain form
15527 35373 31120 -116211 -154521 -122106 -35037 60067 -22989 -70804 -94642 -62847 -74296 -135917
15515 -135917 -177523 -98758 -39628 71861 48885 39401 68003 6162 122349 144037 -44490
15504 -44490 -7248 66709 121117 88291 107029 171420 205761 193198 164176 76360 151808 102665
15492 102665 192124 -8776 -54859 15295 -38396 -168532 -160759 -169572 -92355 8926 -50750
15481 -50750 -137517 -157982 -37376 45991 97232 99627 162651 60212 -72847 -8216 137954
15470 137954 4869 -78035 -150865 -113291 -150426 124451 291181 335178 216691 38989
15460 38989 -56088 -34492 53799 -30160 -142116 18122 84905 211873 10377 -164078 -206182
15449 -206182 -291659 -363274 -141965 -135818 -55382 255695 153180 4408 -13806 -79148 -139491
$$ packed form
15527C5373m253j47331l8310L2415Q7069R5104q3056m7815k3838L1795j1449o1621
15515a35917m1606P8765N9130J11489k2976r484K8602o1841J16187K1688j88527
15504d4490L7242P3957N4408l2826J8738O4391L4341j2563k9022q7816P5448m9143
15492A02665Q9459k00900m6083P0154n3691j30136P773q813P7217J01281n9676
15481e0750q6767k0465J20606Q3367N1241K395O3024j02439j33059O4631J46170
15470A37954j33085q2904p2830L7574l7135K74877J66730M3997j18487j77702
15460C8989r5077K1596Q8291q3959j11956J60238O6783J26968k01496j74455m2104
15449b06182q5477p1615K21309O147Q0436L11077j02515j48772j8214o5342o0343
$$ plain form
15438 -139491 -281273 -352865 -156200 -67333 46795 138302 132114 90059 1937 -56605 122281
15427 122281 90809 180368 140883 -50126 93856 147443 132812 19837 49945 7761 -238926
15416 -238926 -281348 -31962 98079 273698 310713 174064 84203 145878 201638 80185
15406 80185 71311 70132 65461 120409 123666 50509 44262 23252 61208 180086 307621 209960
15394 209960 54453 12179 26487 97179 47755 -122845 -53238 98579 125049 85894 79393
15383 79393 130642 72175 184157 122336 152072 291488 306903 258019 193687 65422 -102999
15372 -102999 -91561 64990 35825 -65481 -220799 -127748 -41336 183747 87337 134947 50390
15361 50390 41661 -110229 -201766 -149295 -27891 -24505 20085 213800 76257 87017 36588
$$ packed form
15438a39491j41782p1592J96665Q8867J14128R1507o188m2055q8122n8542J78886
15427A22281l1472Q9559l9485j91009J43982N3587j4631j12975L0108m2184k46687
15416b38926m2422K49386J30041J75619L7015j36649q9861O1675N5760j21453
15406H0185q874j179m671N4948L257p3157o247k1010L7956J18878J27535r7661
15394B09960j55507m2274J4308P0692m9424j70600O9607J51817K6470l9155o501
15383G9393N1249n8467J11982o1821K9736J39416J5415m8884o4332j28265j68421
15372a02999J1438J56551k9165j01306j55318R3051Q6412K25083r6410M7610q4557
15361E0390q729j51890r1537N2471J21404L386M4590J93715j37543J0760n0429
$$ plain form
15350 36588 -85765 -110677 -246255 -188831 -308703 -480955 -460049 -280960 -130300 -70703
15340 -70703 -11051 31077 -4254 -116906 -145242 -163001 -173021 -1178 79292 156730 116905
15329 116905 57224 99693 58567 -5299 86095 -95517 -287484 -226608 -104747 33202 54880
15318 54880 -29058 -238809 -200654 -64415 118722 162176 -37459 -89956 -62707 108154 146960
15307 146960 79793 109163 267306 420548 429200 310366 151661 48006 -46308 6507 49426
15296 49426 52858 11563 195177 179947 -32920 -119726 -141963 -158990 -67334 -76395 -143529 -3068
15284 -3068 85901 191690 94521 -7645 -45140 36209 134891 -64412 -68867 -121442 -255025
15273 -255025 -289197 27673 123533 25245 37026 -1712 87590 132007 139775 116700 105263
$$ packed form
15350C6588j22353k4912j35578N7424j19872j72252K0906J79089J50660N9597
15340g0703N9652M2128l5331j12652k8336j7759j0020J71843Q0470P7438l9825
15329A16905n9681M2469m1126o3866R1394j81612j91967O0876J21861J37949K1678
15318E4880q3938k09751L8155J36239J83137M3454j99635n2497K7249J70861L8806
15307A46960o7167K9370J58143J53242Q652j18834j58705j03655r4314N2815M2919
15296D9426L432m1295J83614j5230k12867q6806k2237j7027R1656r061o7134J40461
15284c068Q8969J05789r7169j02166l7495Q1349R8682j99303m455n2575j33583
15273b55025l4172L16870R5860r8288J1781l8738Q9302M4417P768k3075j1437
$$ plain form
15262 105263 88823 56263 98456 180801 27134 -126383 -106079 61696 20324 -152025 -130449
15251 -130449 -104038 -48661 3551 236946 347331 241967 15282 1689 6167 135038 195644
15240 195644 163555 149680 1044 -41032 -89204 6989 116647 31699 -53414 -162547 -324221
15229 -324221 -424606 -332197 -164879 -145084 -103816 -175240 -331509 -265330 -171626 -212647 -200113
15218 -200113 -302618 -283023 -279133 -215341 -79154 27824 167954 198772 47571 40868 -131781
15207 -131781 -260322 -155344 -1546 111579 152524 159074 312246 293399 164748 263757
15197 263757 338629 403561 275851 255688 54787 539 81011 -93924 -225446 -157412 -37190
15186 -37190 116385 85748 -50586 -77431 -25348 -50688 57133 239048 304982 130331 124334
$$ packed form
15262A05263j6440l2560M2193Q2345j53667j53517K0304J67775m1372j72349K1576
15251a30449K6411N5377N2212K33395J10385j05364k26685j3593M478J28871O0606
15240A95644l2089j3875j48636m2076m8172R6193J09658q4948q5113j09133j61674
15229c24221j00385R2409J67318J9795M1268p1424j56269O6179R3704m1021J2534
15218b00113j02505J9595L890O3792J36187J06978J40130L0818j51201o703j72649
15207a31781j28541J04978J53798J13125M0945O550J53172j8847j28651R9009
15197B63757P4872O4932j27710k0163k00901n4248Q0472j74935j31522O8034J20222
15186c7190J53575l0637j36334k6845N2083k5340J07821J81915O5934j74651n997
$$ plain form
15175 124334 -27881 -218751 -338059 -84467 49371 117362 84175 15919 -78331 -122168
15165 -122168 81678 321588 240477 166335 149324 171156 85001 -63734 77640 142880 85421
15154 85421 114749 195851 320203 356570 384308 308135 239782 217575 175383 186710 208586
15143 208586 165558 178588 162242 64138 64750 -14160 -22921 -26909 -94039 -163905 -31853 140410
15131 140410 48457 39943 42350 -4867 -35941 3714 -57029 -310339 -240527 -163955 -97927 -112602
15119 -112602 -91342 -133115 -103154 270279 427149 459704 548207 492320 474756 379397 277805
15108 277805 88916 -96071 -120682 -26254 175567 202218 69542 64595 39658 1389 100994
15097 100994 140696 -88334 -103487 -53772 -79472 16246 -120645 -170548 -184193 49481 181318
$$ packed form
15175A24334j52215j90870j19308K53592J33838O7991l3187o8256r4250m3837
15165a22168K03846K39910q1111p4142j7011K1832q6155j48735J41374O5240n7459
15154H5421K9328Q1102J24352L6367K7738p6173o8353k2207m2192J1327K1876
15143B08586m3028J3030j6346r8104O12p8910q761l988o7130o9866J32052J72263
15131A40410r1953q514K407m7217l1074L9655o0743k53310O9812P6572O6028j4675
15119a12602K1260m1773K9961L73433J56870L2555Q8503n5887j7564r5359j01592
15108B77805j88889j84987k4611R4428K01821K6651j32676m947k4937l8269R9605
15097A00994L9702k29030j5153M9715k5700R5718j36891m9903j3645K33674J31837
$$ plain form
15086 181318 130072 189992 242350 191417 58041 -73517 -73291 95016 186663 267337 405141
15075 405141 335934 218277 102893 5482 -158638 -202163 -292325 -224661 -150355 -138241 -48713
15064 -48713 170578 148421 211552 152785 15298 58915 -137198 -208581 -95648 -208424 -149810
15053 -149810 76112 96528 -70189 -201235 -162496 -123625 65151 22019 -101412 -110809 -42673
15042 -42673 -64894 62538 123051 179527 219235 116026 -6713 -92448 46076 70208 33716
15031 33716 -11205 -81665 -108782 27356 315477 392612 331164 246554 224656 214440 71992
15020 71992 72462 45885 48080 -27558 -122151 -12795 186916 156593 344086 329229 260532 72645
15008 72645 53251 14785 -108990 -145633 -137693 -74463 28866 83024 76554 -29584 -117062
$$ packed form
15086A81318n1246N9920N2358n0933j33376j31558K26J68307R1647Q0674J37804
15075D05141o9207j17657j15384r7411j64120m3525r0162O7664P4306J2114Q9528
15064d8713K19291k2157O3131n8767j37487M3617j96113p1383J12933j12776N8614
15053a49810K25922K0416j66717j31046L8739L8871J88776m3132j23431r397O8136
15042d2673k2221J27432O0513N6476L9708j03209j22739q5735J38524K4132l6492
15031C3716m4921p0460k7117J36138K88121P7135o1448q4610k1898j0216j42448
15020G1992M70k6577K195p5638r4593J09356J99711l0323J87493j4857o8697j87887
15008G2645j9394l8466j23775l6643P940O3230J03329N4158o470j06138q7478
$$ plain form
14997 -117062 -137601 -143685 -131137 -92042 -77344 -70405 -200894 -199265 -71689 76004 112866
14986 112866 34751 7863 142840 137369 99719 85624 153636 144830 99564 122866 189328 190522
14974 190522 242368 74043 -162273 -110105 -30403 -21679 -65411 -33426 -75193 -19475 -79284
14963 -79284 -159395 -24637 204259 167556 -100757 -463752 -425154 -121676 9310 -28727
14953 -28727 39539 162990 95501 -44873 -186692 -282984 -254081 -143285 -41469 -25479 151791
14942 151791 94435 -32495 -146818 -205512 -186400 -199630 -194923 -153695 -47911 -98907 -157920
14931 -157920 -259653 -184363 -85885 -31764 -30060 142437 34201 -5354 84836 3141 -27990
14920 -27990 101576 49302 33818 87415 16676 -20052 -178569 -250452 -87720 -25151 -76281
$$ packed form
14997a17062k0539o084J2548L9095J4698O939j30489J629J27576J47693L6862
14986A12866p8115k6888J34977n471l7650j4095O8012q806m5266K3302O6462J194
14974A90522N1846j68325k36316N2168P9702Q724m3732L1985m1767N5718n9809
14963g9284q0111J34758K28896l6703k68313l62995L8598L03478J30986l8037
14953b8727O8266J23451o7489j40374j41819r6292K8903J10796J01816J5990J77270
14942A51791n7356j26930j14323n8694J9112j3230M707M1228J05784n0996n9013
14931a57920j01733P5290R8478N4121J704J72497j08236l9555R0190q1695l1131
14920b7990J29566n2274j5484N3597p0739l6728j58517p1883J62732O2569n1130
$$ plain form
14909 -76281 -186921 -131862 93211 192658 189996 215294 154812 -10486 -213096 -173441 -250900
14898 -250900 -216760 -162245 -174163 -158848 -152331 -181318 -142273 -173413 -15842 173273 69427
14887 69427 -43270 -36853 86953 8323 -148852 -171222 -1789 59119 147538 166833 -29273
14876 -29273 -44591 68764 38590 18346 46449 25350 22021 72199 -61402 -8847 30400
14865 30400 38337 -128472 -233120 -97691 158006 82715 130399 90354 97338 11857 123041
14854 123041 205243 213834 93648 -94124 -146413 -173128 -110713 -154356 -160322 -281543 -81108
14843 -81108 -47855 -15813 -1727 -51999 10954 16846 -11174 -45781 -63979 -156596 -266258 -81483
14831 -81483 114593 108521 148639 95913 -19850 -55294 -252493 -202452 16422 116520 68170
$$ packed form
14909g6281j10640N5059K25073R9447k662K5298o0482j65298k02610L9655p7459
14898b50900L4140N4515j1918J5315O517k8987L9045l1140J57571J89115j03846
14887F9427j12697O417J23806p8630j57175k2370J69433O0908Q8419J9295j96106
14876b9273j5318J13355l0174k0244K8103k1099l329N0178j33601N2555L9247
14865C0400P937j66809j04648J35429K55697p5291M7684m0045O984q5481J11184
14854A23041Q2202Q591j20186j87772n2289k6715O2415m3643n966j21221K00435
14843h1108L3253L2042J4086n0272O2953N892k8020l4607j8198r2617j09662J84775
14831h1483J96076o072M0118n2726j15763l5444j97199N0041K18874J00098m8350
$$ plain form
14820 68170 -29314 -18102 -33616 7115 60467 68849 25095 103324 -82891 -164449 -316160
14809 -316160 -272238 -48063 -5379 -58664 -127501 -24732 139770 47414 -178193 -114693 19290
14798 19290 135004 131682 -23584 -146493 -199031 -142264 -65847 -21200 -86614 -90521 -67140
14787 -67140 -160997 -232611 -107976 140347 219546 180115 122818 -7203 -125476 -282395 -197761
14776 -197761 -189143 -141425 -159817 -113049 -11824 -92974 -119117 -42589 -39471 -130255 65636
14765 65636 -8264 -137375 -197813 -239917 -323517 -280320 -138566 -126820 -89786 -607 -139056
14754 -139056 -312132 -268745 -265494 -372713 -215165 -114685 -50540 -67705 149956 82684 -250482
14743 -250482 -329024 -273052 -236983 -376642 -274758 -104391 53116 291058 328548 158256
$$ packed form
14820F8170r7484J1212j5514M0731N3352Q382m3754P8229j86215q1558j51711
14809c16160M3922K24175M2684n3285o8837J02769J64502r2356k25607O3500J33983
14798A9290J15714l322j55266j22909n2538N6767P6417M4647o5414l907K3381
14787f7140r3857p1614J24635K48323P9199l9431n7297j30021j18273j56919Q4634
14776a97761Q618M7718j8392M6768J01225q1150k6143P6528L118r0784J95891
14765F5636p3900j29111o0438m2104q3600M3197J41754J1746L7034Q9179j38449
14754a39056j73076M3387L251j07219J57548J00480O4145j7165K17661o7272l33166
14743b50482p8542N5972L6069j39659J01884J70367J57507K37942L7490j70292
$$ plain form
14733 158256 23635 30658 -61221 -31314 -12432 -149055 -115928 -126284 1692 149606 147882
14722 147882 155993 95205 197446 -252 -96137 -8729 77941 -78598 -81270 -16457 -54918
14711 -54918 -180071 103940 287196 203506 114852 59700 9849 98556 298644 363530 463562
14700 463562 444023 257031 17031 17206 5670 -2151 -77148 -14714 22385 -10206 53498 3768
14688 3768 -26006 -18173 7170 -71792 -126420 -57292 125335 182548 -4180 -76066 -9973 29531
14676 29531 315592 405268 424768 393830 324715 187243 114155 25144 18780 120105 77183
14665 77183 61223 255386 87850 -44244 102260 155546 -35919 -128397 -173438 -150976 -57147
14654 -57147 43798 215439 135709 252939 432664 250711 -35959 -65532 -113559 -121040 -150636
$$ packed form
14733A58256j34621P023r1879K9907J8882j36623L3127j0356J27976J47914j724
14722A47882Q111o0788J02241j97698r5885Q7408Q6670j56539k672O4813l8461
14711e4918j25153K84011J83256q3690q8654n5152m9851Q8707K00088O4886J00032
14700D63562j9539j86992k40000J75j1536p821p4997O2434L7099l2591O3704m9730
14688C768k9774P833K5343p8962n4628O9128J82627N7213j86728p1886O6093L9504
14676B9531K86061Q9676J9500l0938o9115j37472p3088q9011o364J01325m2922
14665G7183j5960J94163j67536j32094J46504N3286j91465r2478m5041K2462R3829
14654e7147J00945J71641p9730J17230J79725j81953k86670k9573m8027p481k9596
$$ plain form
14643 -150636 -40163 134433 -61585 -337189 -204577 13327 73696 -64500 19785 225359
14633 225359 449898 300943 -63189 -174792 -65462 793 -154560 -260938 -318666 -349381
14623 -349381 -423958 -282465 -31347 9559 66249 129845 52266 -1056 -75463 -137773 -136250
14612 -136250 -52009 108758 151160 55304 11676 37648 104994 70763 49027 49536 34597 100920
14600 100920 85295 25540 66111 134807 -35827 -90951 81964 205550 189844 50097 8015
14589 8015 101440 199343 181495 234319 110352 61002 35224 18505 169859 109427 -182281
14578 -182281 -353306 -425292 -315722 -72297 79476 84041 4778 -149587 -70116 66667
14568 66667 77974 152683 155414 171215 -95662 -131988 76588 163764 288655 277848 27038
$$ packed form
14643a50636J10473J74596j96018k75604J32612K17904O0369j38196Q4285K05574
14633B25359K24539j48955l64132j11603J09330O6255j55353j06378n7728l0715
14623c49381p4577J41493K51118M0906N6690O3596p7579n3322p4407o2310J523
14612a36250Q4241J60767M2402r5856m3628K5972O7346l4231k1736N09j4939O6323
14600A00920j5625n9755M0571O8696j70634n5124J72915J23586j5706j39747m2082
14589H015R3425R7903j7848N2824j23967m9350k5778j6719J51354o0432k91708
14578a82281j71025p1986J09570K43425J51773M565p9263j54365P9471J36783
14568F6667J1307P4709K731J5801k66877l6326K08576Q7176J24891j0807k50810
$$ plain form
14557 27038 -135122 -81572 -17693 61067 46641 -32192 -160918 -50494 220600 379207 473550
14546 473550 321352 147883 121733 236164 246913 73701 -62781 -236160 -70953 113745
14536 113745 140616 160266 85068 17008 -134352 -287940 -340105 -307437 -60454 -1203 -28152
14525 -28152 11611 201895 178234 89608 -18664 -68657 20258 -166195 -160094 -126932 -83761
14514 -83761 -69500 -49003 -64873 25792 7521 29635 -50669 -38879 6424 110987 211022
14503 211022 234848 198101 18472 -1210 -87207 -78970 -102227 -98744 -22426 115606 177958
14492 177958 110099 266444 389347 110996 -86324 -147585 81868 206439 104459 155295
14482 155295 100421 -36995 -67226 28849 261842 259157 168120 41812 -152534 -212988 -236620
$$ packed form
14557B7038j62160N3550O3879P8760j4426p8833j28726J10424K71094J58607R4343
14546D73550j52198j73469k6150J14431J0749j73212j36482j73379J65207J84698
14536A13745K6871J9650p5198o8060j51360j53588n2165L2668K46983N9251k6949
14525b8152L9763J90284k3661q8626j08272m9993Q8915j86453O101L3162M3171
14514h3761J4261K0497j5870R0665j8271K2114q0304J1790M5303J04563J00035
14503B11022K3826l6747j79629j9682q5997Q237k3257L483P6318J38032O2352
14492A77958o7859J56345J22903k78351j97320o1261K29453J24571j01980N0836
14482A55295n4874j37416l0231R6075K32993k685r1037j26308j94346o0454k3632
$$ plain form
14471 -236620 -37327 19439 -116389 -89721 4606 30084 -17709 50261 51233 -114212 -218077
14460 -218077 -264049 -155966 -112170 5260 3221 -81086 -133637 99043 218940 119261 -3770
14449 -3770 71792 48521 104653 237790 235842 154239 166376 26910 7515 -13006 52598 100793
14437 100793 -32633 -311169 -293035 -245542 -133740 -48471 -10778 26177 170446 114050 99831
14426 99831 63706 -55573 -125514 -252830 -364214 -293577 -246905 -270782 -274292 -384836 -565206
14415 -565206 -395545 -200975 -42197 179995 150316 31069 138154 234789 77871 88342
14405 88342 129679 20626 10668 -115189 -321867 -322517 -327157 -300501 -131303 -78480 -211522
14394 -211522 -113943 -132887 -207724 -138111 -219824 -100444 -212784 -263238 -40706 -8283 -58997
$$ packed form
14471b36620J99293N6766j35828K6668R4327K5478m7793O7970R72j65445j03865
14460b18077m5972J08083M3796J17430k039q4307n2551K32680J19897r9679j23031
14449c770P5562k3271N6132J33137j948q1603J2137j39466j9395k0521O5604M8195
14437A00793j33426k78536J8134M7493J11802Q5269L7693L6955J44269n6396j4219
14426I9831l6125j19279o9941j27316j11384P0637M6672k3877l510j10544j80370
14415e65206J69661J94570J58778K22192k9679j19247J07085R6635j56918J0471
14405H8342M1337j09053r958j25857k06678o50m640K6656J69198N2823j33042
14394b11522R7579j8944p4837O9613q1713J19380j12340n0454K22532L2423n0714
$$ plain form
14383 -58997 63475 42461 -136424 -161481 -51060 69984 114398 90848 126279 129730 81839
14372 81839 115696 -4813 88518 99211 -55659 -53288 128133 197516 51384 -45336 58856
14361 58856 93122 -3920 -7693 -24932 -34079 -283982 -345384 -120296 -31663 -49552 -117481 4208
14349 4208 63154 101530 89385 152736 218282 267928 232509 208331 109342 -25759 27346 25325
14337 25325 79360 166368 153692 253317 223448 84320 48368 21036 -67506 -70733 -97223 -99585
14325 -99585 -239179 -360602 -430449 -140493 12756 -38685 -919 102075 61709 -119798
14315 -119798 -93930 -62275 15257 43172 -34453 -42641 11245 80967 94229 78317 29195 -88799
14303 -88799 -18338 -71242 -82178 38412 41620 26479 101391 30573 -30810 -8813 53942 -88564
$$ packed form
14383e8997J22472k1014j78885k5057J10421J21044M4414k3550L5431L451m7891
14372H1839L3857j20509R3331J0693j54870K371J81421O9383j46132r6720J04192
14361E8856L4266r7042l773j7239r147k49903o1402K25088Q8633j7889o7929J21689
14349D208N8946L8376j2145O3351O5546M9646l5419k4178r8989j35101N3105k021
14337B5325N4035Q7008j2676R9625k9869j39128l5952k7332q8542l227k6490k362
14325i9585j39594j21423o9847K89956J53249n1441L7766J02994m0366j81507
14315a19798K5868L1655P7532K7915p7625q188N3886O9722J3262j5912m9122j17994
14303h8799P0461n2904j0936J20590L208j5141P4912p0818o1383K1997O2755j42506
$$ plain form
14291 -88564 18612 171379 184619 258219 351082 336541 58476 -37171 -50819 18015 17034
14280 17034 -63922 -282199 -436083 -502485 -344727 -162659 -153458 -239520 -295157 -331986 -163591
14269 -163591 62978 -51498 11844 -123624 -156195 -181694 -18012 111148 219787 66988
14259 66988 -102716 -176988 -146654 -74730 -74921 -83184 700 45093 99313 143292 193203 174978
14247 174978 -703 -78167 -188472 -124829 -86748 26668 34127 66173 85926 71534 165707
14236 165707 110720 129316 189878 78969 6504 -7624 40107 78318 65991 61827 -35085
14225 -35085 96744 206584 226603 250417 205782 100149 -20983 27893 68740 36638 18388
14214 18388 -34781 -201261 -112420 -55264 -99542 -154830 -63890 36851 216060 235237 114875
$$ packed form
14291h8564J07176J52767J3240P3600R2863j4541k78065r5647j3648O8834r81
14280A7034q0956k18277j53884o6402J57758J82068R201q6062n5637l6829J68395
14269a63591K26569j14476O3342j35468l2571k5499J63682J29160J08639j52799
14259F6988j69704p4272L0334P1924j91q263Q3884M4393N4220M3979M9911j8225
14247A74978j75681p7464j10305O3643L8081J13416P459L2046J9753j4392R4173
14236A65707n4987J8596O0562j10909p2465j4128M7731L8211j2327m164r6912
14225c5085J31829J09840K0019K3814m4635j05633j21132M8876M0847l2102j8250
14214A8388n3169j66480Q8841N7156m4278n5288R0940J00741J79209J9177j20362
$$ plain form
14203 114875 44956 -122696 -227987 -83002 -69027 -218525 -241398 -146950 -46919 34395
14193 34395 -65142 -302042 -263792 -74882 -147958 -195621 -300745 -282988 -203456 -187849 -183945
14182 -183945 -59250 119488 313819 257038 141941 61021 128212 198207 249169 247229 344515
14171 344515 160228 -19209 -104983 18073 71124 117175 264332 344158 349567 304484 325154
14160 325154 240341 301937 346040 24946 1210 32583 175280 238097 23184 -74585 -41870
14149 -41870 135092 202470 365690 267101 32011 -68564 -100798 -188896 -202295 -104472 -62391
14138 -62391 -57734 21905 24148 -15829 44786 25985 80102 -507 -14258 23381 81928 127144
14126 127144 129054 192260 131028 23331 5163 -60681 36277 118555 216732 276416 156501
$$ packed form
14203A14875o9919j67652j05291J44985J3975j49498k2873R4448J00031Q1314
14193C4395r9537k36900L8250J88910p3076m7663j05124J7757P9532J5607L904
14182a83945J24695J78738J94331n6781j15097q0920O7191O9995N0962j940R7286
14171C44515j84287j79437q5774J23056N3051M6051J47157P9826N409m5083K0670
14160C25154q4813O1596M4103l21094k3736L1373J42697O2817k14913r7769L2715
14149d1870J76962O7378J63220r8589k35090j00575l2234q8098j3399R7823M2081
14138f2391M657P9639K243l9977O0615j8801N4117q0609j3751L7639N8547M5216
14126A27144J910O3206o1232j07697j8168o5844R6958Q2278R8177N9684j19915
$$ plain form
14115 156501 -111993 -153551 -133575 -95524 -42546 62318 64136 204723 340813 229734 89504
14104 89504 88499 75237 30228 5386 81174 97187 117748 5015 21779 -41651 35901 88469
14092 88469 4579 -50105 -74755 7971 57614 55551 59588 -69546 -167010 -48326 143889
14081 143889 146014 -16579 10205 41419 48744 184109 99387 38562 76913 27793 77177
14070 77177 94418 164146 348283 396909 227535 94413 26283 23949 114251 126148 76550
14059 76550 112869 24601 -48525 -182976 -237975 -129079 -158710 -175295 -116772 43701 86604
14048 86604 47594 72434 -34985 -127962 -246070 -127239 -20222 20998 -16857 -60468 18412
14037 18412 42222 -38966 -87488 -99446 -87649 -49681 92931 124573 55231 -144933 -192295
$$ packed form
14115A56501k68494m1558J9976L8051N2978J04864J818J40587J36090j11079j40230
14104H9504j005j3262m5009k4842P5788J6013K0561j12733J6764o3430P7552N2568
14092H8469q3890n4684k4650Q2726M9643k063M037j29134r7464J18684J92215
14081A43889K125j62593K6784L1214P325J35365q4722o0825L8351m9120M9384
14070G7177J7241O9728J84137M8626j69374j33122o8130k334R0302J1897m9598
14059G6550L6319q8268p3126j34451n4999J08896k9631j6585N8523J60473M2903
14048H6604l9010K4840j07419r2977j18108J18831J07017M1220l7855m3611P8880
14037A8412K3810q1188m8522j1958J1797L7968J42612L1642o9342k00164m7362
$$ plain form
14026 -192295 -334834 -214328 -41928 -89026 -10452 53081 211665 211779 208131 144706 25306
14015 25306 41603 -36252 91998 215488 25142 42531 134329 -45577 -215919 -270707 -264253
14004 -264253 -107089 158821 262218 170477 224101 86477 197 13378 -52683 -35457 134449
13993 134449 69725 -73743 31780 237526 312321 134454 -197162 -327803 -321030 -152591
13983 -152591 -86848 -98051 -106374 -118855 22095 102812 171326 65420 -181706 -306221 -254724
13972 -254724 -195438 -203519 -12034 115755 75708 -29276 -68632 -31377 63692 185537 110883
13961 110883 39678 -10426 -31494 119470 293493 288555 169273 196903 281328 368221 304568
13950 304568 161989 11042 54942 95557 100749 75378 172795 146603 128351 138148 8656
$$ packed form
14026a92295j42539J20506J72400m7098P8574O3533J58584J14l648o3425j19400
14015B5306J6297p7855J28250J23490j90346J7389R1798j79906j70342n4788O454
14004b64253J57164K65910J03397r1741N3624j37624q6280J3181o6061J7226J69906
13993A34449o4724j43468J05523K05746P4795j77867l31616j30641O773J68439
13983a52591O5743j1203q323j2481J40950Q0717O8514j05906k47126j24515N1497
13972b54724N9286q081J91485J27789m0047j04984l9356L7255R5069J21845p4654
13961A10883p1205n0104k1068J50964J74023m938j19282K7630Q4425Q6893o3653
13950C04568j42579j50947M3900M0615N192k5371R7417k6192j8252R797j29492
$$ plain form
13939 8656 -30101 -48566 -273227 -218995 -70241 -31671 2763 122526 350594 332847 120144
13928 120144 78886 110863 -63420 -126091 2109 82152 -95976 -261267 -143373 -94660
13918 -94660 -108942 -60986 115772 66962 -5933 -124771 -224062 -114842 -206031 -403400 -540863
13907 -540863 -290716 -44305 7056 83391 129594 27798 -171520 -248338 -301863 -150579
13897 -150579 -103830 -127990 -79659 31278 169327 254546 235563 -47338 -177526 -138359 -100982
13886 -100982 -147572 -225743 -149350 -54308 -135396 -120467 -132070 -145434 -2425 -3907 77340
13875 77340 260654 446266 498292 382055 372922 221049 280455 316485 5338 -79593 -158222
13864 -158222 -263502 -233332 7432 50032 37502 -42794 -218936 -236111 14373 42352 -22281
$$ packed form
13939H656l8757j8465k24661N4232J48754L8570L4434J19763K28068j7747k12703
13928A20144m1258L1977j74283o2671J28200Q0043j78128j65291J17894M8713
13918i4660j4282M7956J76758m8810p2895j18838r9291J09220r1189j97369j37463
13907e40863K50147K46411N1361P6335M6203j01796j99318p6818n3525J51284
13897a50579M6749k4160M8331J10937J38049Q5219j8983k82901j30188L9167L7377
13886a00982m6590p8171P6393R5042q1088J4929j1603j3364J43009j482Q1247
13875G7340J83314J85612N2026j16237r133j51873N9406L6030l11147q4931p8629
13864a58222j05280L0170K40764M2600j2530q0296j76142j7175K50484K7979o4633
$$ plain form
13853 -22281 -30236 60533 30564 100504 20517 -74681 48854 22362 86043 -41519 57207
13842 57207 49750 17677 3309 -98773 -104909 36234 146334 160439 10914 -45968 -56754
13831 -56754 -147064 -262988 -223603 -143387 -302724 -365669 -327622 -326554 -241395 -133478 -174483
13820 -174483 -186493 -157480 -87410 60732 209197 144142 68336 -89656 -159451 -131496 -15200
13809 -15200 80760 63850 20040 -91342 -165417 -125570 -50077 44128 191875 265033 235629
13798 235629 130508 103927 73030 6012 -110349 -67250 485 -69977 -79262 -12558 -41222
13787 -41222 -87766 30393 -142011 -229805 43997 155458 103221 221464 253477 168036 164368
13776 164368 144560 145469 240506 343337 298335 226653 173961 17177 32135 252130 302522
$$ packed form
13853b2281p955R0769k9969O9940p9987r5198J23535k6492O3681j27562R8726
13842E7207p457l2073j4368j02082o136J41143J10100J4105j49525n6882j0786
13831e6754r0310j15924L9385Q0216j59337o2945L8047J068Q5159J07917m1005
13820a74483j2010K9013P0070J48142J48465o5055p5806j57992o9795K7955J16296
13809a5200R5960j6910m3810j11382p4075L9847P5493R4205J47747P3158k9404
13798B35629j05121k6581l0897o7018j16361M3099O7735p0462r285O6704k8664
13787d1222m6544J18159j72404q7794K73802J11461n2237J18243L2013q5441l668
13776A64368j9808R09R5037J02831m5002p1682n2692j56784J4958K19995N0392
$$ plain form
13765 302522 491905 598665 449562 197899 109245 207081 351592 378080 221940 286234
13755 286234 173822 89305 176927 224166 78879 31702 7846 126329 26215 -34788 107812
13744 107812 217528 310000 263463 223481 160446 57086 -88066 -159980 -79266 11044 10218
13733 10218 124928 210908 114702 62066 107964 50346 41184 224297 398122 341292 435994
13722 435994 490112 554746 571361 537467 364777 180681 102269 245025 247908 130976 -87349
13711 -87349 -244241 -300876 -162858 -174850 12291 186447 210455 117248 93184 54625 -52536
13700 -52536 -115798 -41899 -959 274538 580083 526638 616135 536820 395480 290257 187630
13689 187630 108637 -44295 -83694 153033 192017 209081 290671 564245 1021034 1395221
$$ packed form
13765C02522J89383J06760j49103k51663q8654R7836J44511K6488j56140O4294
13755B86234j12412q4517Q7622M7239j45287m7177k3856J18483j00114o1003J42600
13744A07812J09716R2472m6537l9982o3035j03360j45152p1914Q0714R0310q26
13733A0218J14710Q5980r6206n2636M5898n7618r162J83113J73825n6830R4702
13722D35994N4118O4634J6615l3894j72690j84096p8412J42756K883j16932k18325
13711h7349j56892n6635J38018j1992J87141J74156K4008r3207k4064l8559j07161
13700e2536o3262P3899M0940K75497L05545n3445Q9497p9315j41340j05223j02627
13689A87630p8993j52932l9399K36727L8984J7064Q1590K73574M56789L74187
$$ plain form
13679 1395221 1699744 1826199 1380201 1085453 891312 958690 966238 1109090 1127864 1044334
13669 1044334 790640 457708 448897 336981 240253 180596 154941 211885 375387 292044 268622
13658 268622 325473 351803 212116 151410 146990 324377 481837 499609 508522 313547 242957
13647 242957 237763 237986 114292 152284 297611 325179 450113 578189 770815 812549 847328
13636 847328 861068 778875 858147 1092326 1516801 2045589 2348406 2190686 1816928 1480682
13626 1480682 1168307 909066 797562 488419 363707 338669 266276 237320 378687 337089
13616 337089 312701 237237 151192 198750 239063 225141 248792 319686 292565 242226 212984
13605 212984 214305 275590 280044 288603 284015 160563 202531 234912 383081 497005 506051 584742
$$ packed form
13679A395221L04523J26455m45998k94748j94141O7378P548J42852J8774q3530
13669A044334k53694l32932q811j11916r6728n9657k5655N6944J63502q3343k3422
13658B68622N6851K6330j39687o0706m420J77387J57460J7772Q913j94975p0590
13647B42957n194K23j23694L7992J45327K7568J24934J28076J92626M1734L4779
13636H47328J3740q2193P9272K34179M24475N28788L02817j57720l73758l36246
13626A480682l12375k59241j11504l09143j24712k5038p2393k8956J41367m1598
13616C37089k4388p5464q6045M7558M0313j3922K3651P0894k7121n0339k9242
13605B12984J321O1285M454Q559m588j23452M1968L2381J48169J13924R046P8691
$$ plain form
13593 584742 681953 894971 1231261 1547551 1611282 1422533 1116771 928480 620217 537509
13583 537509 431820 431201 436597 527139 541399 511514 613743 811183 1036927 1315025 1276663
13572 1276663 1152868 1026325 891416 594616 355491 331315 328289 312319 347424 267554
13562 267554 158179 222409 231148 352670 357484 134931 138885 334684 388074 346278 220215
13551 220215 78320 22569 -92689 2695 83985 -33841 -171153 -35227 190360 324745
13541 324745 457206 543356 714766 812934 917319 1329576 1741644 1630780 1447506 1321252
13531 1321252 1251087 1330556 1636720 1794209 1770691 1398333 1152981 902585 768986 592403
13521 592403 425336 249672 201538 262018 340452 221997 277972 372445 249756 322333 446318
$$ packed form
13593E84742R7211K13018L36290L16290O3731j88749l05762j88291l08263q2708
13583E37509j05689o19N396R0542J4260k9885J02229J97440K25744K78098l8362
13572A276663j23795j26543j34909k96800k39125k4176l026j5970L5105p9870
13562B67554j09375O4230Q739J21522M814k22553L954J95799N3390m1796j26063
13551B20215j41895n5751j15258R5384Q1290j17826j37312J35926K25587J34385
13541C24745J32461Q6150J71410R8168J04385M12257M12068j10864j83274j26254
13531A321252p0165P9469L06164J57489k3518l72358k45352k50396j33599j76583
13521E92403j67067j75664m8134O0480P8434j18455N5975R4473j22689P2577J23985
$$ plain form
13510 446318 491236 325204 252752 296485 150524 90156 108216 27449 14217 231118 406104
13499 406104 557776 689758 548915 632736 833941 1082713 1130708 1359649 1581006 1503143
13489 1503143 1366434 1273913 1062612 1102110 904601 838013 681423 570598 683642 868835
13479 868835 830679 807017 770728 840315 744916 615968 557641 521797 392201 313368 316791
13468 316791 191385 96288 228800 386956 417437 327441 234508 402052 510581 499241
13458 499241 483536 436579 447770 419693 347428 355527 429617 493136 428710 463841 399137 257200
13446 257200 354849 413003 462183 612360 749937 831506 751764 568868 362243 267742 190627
13435 190627 110727 193853 441691 515039 434914 460336 237792 97109 294759 311600 210396
$$ packed form
13510D46318M4918j66032p2452M3733j45961o0368J8060q0767j3232K16901J74986
13499D06104J51672J31982j40843Q3821K01205K48772M7995K28941K21357p7863
13489A503143j36709r2521k11301L9498j97509o6588j56590j10825J13044J85193
13479H68835l8156k3662l6289O9587r5399j28948n8327l5844j29596p8833L423
13468C16791j25406r5097J32512J58156L0481q9996r2933J67544J08529j1340
13458D99241j5705m6957J1191k8077p2265Q099P4090O3519o4426L5131o4704j41937
13446B57200R7649N8154M9180J50177J37577Q1569p9742j82896k06625r4501p7115
13435A90627p9900Q3126K47838P3348q0125K5422k22544j40683J97650J6841j01204
$$ plain form
13424 210396 135573 305315 493515 432110 477942 529097 707919 670721 488425 413276 262038
13413 262038 296412 406321 558554 570118 606155 466948 396267 554872 610016 469120
13403 469120 440238 366389 359115 106949 138980 360478 396654 287002 260438 218031 247584
13392 247584 253147 347159 392203 334748 357455 394097 381916 276090 227039 252551 423050
13381 423050 507826 487199 507430 513709 414853 185500 234348 139981 149396 103986 256105
13370 256105 462515 462357 490178 440116 303797 310165 214791 282549 407301 431214 644063
13359 644063 733836 803248 787237 727932 766180 807322 745052 671090 504759 448597 539772
13348 539772 783782 919436 919805 811721 703184 711828 1007101 1434447 1604582 1627657 1444799
$$ packed form
13424B10396p4823J69742J88200o1405M5832N1155J78822l7198j82296p5149j51238
13413B62038L4374J09909J52233J1564L6037j39207p0681J58605N5144j40896
13403D69120k8882p3849p274k52166L2031K21498L6176j09652k6564m2407K9553
13392B47584N563R4012M5044n7455K2707L6642j2181j05826m9051K5512J70499
13381D23050Q4776k0627K0231O279r8856k29353M8848r4367R415m5410J52119
13370B56105K06410j58K7821n0062j36319O368r5374O7758J24752K3913K12849
13359F44063Q9773O9412j6011n9305L8248M1142o2270p3962j66331n6162R1175
13348E39772K44010J35654L69j08084j08537Q644K95273M27346J70135K3075j82858
$$ plain form
13337 1444799 1210307 1060550 909940 878442 681668 593754 653171 756527 955530 966237
13327 966237 908717 918263 822724 772761 725146 695124 709938 724326 733183 744550 698602 703567
13315 703567 673086 560937 533979 503010 744582 852724 867527 891166 955249 904293 829281
13304 829281 1065781 1164218 1083234 1090052 1116081 938709 874753 949514 1019683 960159 930980
13293 930980 1027487 1056742 947899 742245 771451 937129 1223189 1493807 1433782 1495290
13283 1495290 1518413 1288396 1305538 1405544 1445017 1500717 1490809 1522490 1613149 1647232 1537096
13272 1537096 1515908 1438011 1598953 1959420 2083319 2362512 2696946 2918347 3478161 4438812
13262 4438812 5907815 8028611 10007692 10990740 10370064 8561215 6847641 5447972
$$ packed form
13337A444799k34492j49757j50610l1498j96774q7914N9417J03356J99003J0707
13327I66237n7520R546r5539m9963m7615l0022J4814J4388Q857J1367m5948M965
13315G03567l0481j12149k6958l0969K41572J08142J4803K3639O4083n0956p5012
13304H29281K36500R8437q0984O818K6029j77372o3956P4761P0169n9524k9179
13293I30980R6507K9255j08843k05654K9206J65678K86060K70618o0025O1508
13283A495290K3123k30017J7142J00006L9473N5700r908L1681R0659L4083j10136
13272A537096k1188p7897J60942L60467J23899K79193L34434K21401N59814R60651
13262D438812J469003K120796J979081R83048o20676j808849j713574j399669
$$ plain form
13254 5447972 4818685 4637049 4611703 4764087 4834970 4787322 4914306 5236046 5848099 6511700
13244 6511700 7007424 7730927 8936482 10579741 12984005 17274874 24391841 36192385
13236 36192385 52945003 69082784 77654194 75095945 62363755 45299999 31031134
13229 31031134 22058691 16813273 13405593 11193789 9872156 9189052 8952983 8919744 8975460
13220 8975460 9048622 9147610 9480555 9943142 10510594 11263625 12248044 13619420 15254869
13211 15254869 17326804 20335711 24278109 30033339 38900345 52306442 71231092 89620641
13203 89620641 96261048 88471986 76132761 68818654 70048092 80963042 103377416 135772812
13195 135772812 168571530 192462680 208452716 214827741 200169364 165321731 129381678
$$ packed form
13254E447972o29287j81636k5346J52384P0883m7648J26984L21740O12053O63601
13244F511700M95724P23503J205555J643259K404264M290869P116967J1800544
13236C6192385J6752618J6137781Q571410k558249j2732190j7063756j4268865
13229C1031134q972443n245418l407680k211804j321633o83104k36069l3239N5716
13220H975460P3162R8988L32945M62587N67452P53031R84419J371376J635449
13211A5254869K071935L008907L942398N755230Q867006J3406097J8924650J8389549
13203H9620641O640407p789062j2339225p314107J229438J0914950K2414374L2395396
13195A35772812L2798718K3891150J5990036O375025j4658377l4847633l5940053
$$ plain form
13188 129381678 106025574 96983464 100842715 117551931 146783720 176539175 185061780
13181 185061780 164167817 129652171 100742089 84240569 78634026 82610116 97733275
13174 97733275 126625468 166757196 198945308 200301905 170049950 130570377 100087765
13167 100087765 82047646 73458087 72041352 77871780 92407691 119107097 158993747
13160 158993747 200130559 216761058 195235246 151736062 111914610 85882450 71930456
13153 71930456 66740880 68191807 76996740 96076877 130714708 180921219 230163104
13146 230163104 258589979 254939678 217818805 161466512 110995179 77407358 57406927
13139 57406927 45581177 38056910 33382899 30649609 29341428 29220279 29837303 31511336
$$ packed form
13188A29381678k3356104r042110L859251J6709216K9231789K9755455Q522605
13181A85061780k0893963l4515646k8910082j6501520n606543L976090J5123159
13174I7733275K8892193M0131728L2188112J356597l0251955l9479573l0482612
13167A00087765j8040119q589559j416735N830428J4535911K6699406L9886650
13160A58993747M1136812J6630499k1525812m3499184l9821452k6032160j3951994
13153G1930456n189576J450927Q804933J9080137L4637831N0206511M9241885
13146B30163104K8426875l650301l7120873n6352293n0471333l3587821k0000431
13139E7406927j1825750p524267m674011k733290j308181j21149O17024J674033
$$ plain form
13131 31511336 34358256 38836520 46747227 60436146 83448852 119715985 162750053
13124 162750053 184015839 164027284 122743503 86543384 62800031 48395915 40058481
13117 40058481 35555299 33753446 33328867 32148710 29491813 26210156 23312438 21542401
13109 21542401 20806499 20548549 20613473 20981932 21781960 23080247 25272832 28743505 34022112
13100 34022112 42166010 54856403 75475914 108254888 149971154 178182667 169837633
13093 169837633 133361393 95030233 67880906 51189466 40895814 34641311 30952237
13086 30952237 29199533 28823804 29438583 31255676 33979042 37704650 43434401 52375096
13078 52375096 67433275 93313195 136630886 195324017 243991544 266091361 255758569
$$ packed form
13131C1511336K846920M478264P910707J3688919K3012706L6267133M3034068
13124A62750053K1265786j9988555m1283781l6200119k3743353j4404116q337434
13117D0058481m503182j801853m24579j180157k656897l281657k897718j770037
13109B1542401p35902k57950O4924L68459Q00028J298287K192585L470673N278607
13100C4022112Q143898J2690393K0619511L2778974M1716266K8211513q345034
13093A69837633l6476240l8331160k7149327j6691440j0293652o254503l689074
13086C0952237j752704l75729O14779J817093K723366L725608N729751Q940695
13078E2375096J5058179K5879920M3317691N8693131M8667527K2099817j0332792
$$ plain form
13071 255758569 208535711 150917556 109067898 84925571 72352677 67380488 68658998
13064 68658998 77245078 95653347 128512401 175453695 212368616 205890574 165555131
13057 165555131 123893181 95812352 80079911 72553326 71387315 76412469 89423481
13050 89423481 114456594 154256656 197275514 209992776 181141931 138115106 104962202
13043 104962202 85971380 78061571 79397728 90991040 115905337 154511980 189041749
13036 189041749 189470877 158622816 124572879 103103446 95147526 98946230 116076501
13029 116076501 149984455 193490692 218568491 215170385 202890181 183400856 149182664
13022 149182664 112582400 86134047 71879414 67530263 71942846 83863152 94924827
$$ packed form
13071B55758569m7222858n7618155m1849658k4142327j2572894m972189J278510
13064F8658998Q586080J8408269L2859054M6941294L6914921o478042m0335443
13057A65555131m1661950k8080829j5732441p526585j166011N025154J3011012
13050H9423481K5033113L9800062M3018858J2717262k8850845m3026825l3152904
13043A04962202j8990822p909809J336157J1593312K4914297L8606643L4529769
13036A89041749M29128l0848061l4049937k1469433p955920L798704J7130271
13029A16076501L3907954M3506237K5077799l398106j2280204j9489325l4218192
13022A49182664l6600264k6448353j4254633m349151M412583J1920306J1061675
$$ plain form
13015 94924827 92354562 75364755 55681595 40809565 31009072 24659001 20532875 17511226
13007 17511226 15590918 14037687 12636581 11491003 10555059 9905902 9322290 8847574 8710479
12998 8710479 8676983 8868292 9082385 9639968 10342255 11330865 12876638 15137526 19084485
12989 19084485 26306167 38954229 57622486 74213480 79897932 74484640 59057034
12982 59057034 41007147 27493275 19417623 15061526 12419401 10518427 9109798 7925144
12974 7925144 6959943 6095234 5754185 5593758 5442943 5240627 5252928 5307935 5416840 5366091
12964 5366091 5739591 6752715 8258266 10545864 11997786 11002114 8520311 6274764
12956 6274764 4836836 4030519 3487047 3210873 2802298 2612536 2442695 2196574 2033533
$$ packed form
13015I4924827k570265j6989807j9683160j4872030r800493o350071m126126l021649
13007A7511226j920308j553231j401106j145578r35944o49157n83612m74716j37095
12998H710479l3496J91309K14093N57583P02287R88610J545773K260888L946959
12989A9084485P221682J2648062J8668257J6590994N684452n413292j5427606
12982E9057034j8049887j3513872q075652m356097k642125j900974j408629j184654
12974G925144r65201q64709l41049j60427j50815k02316J2301N5007J08905n0749
12964E366091L73500J013124J505551K287598J451922r95672k481803k245547
12956F274764j437928q06317n43472k76174m08575j89762j69841k46121j63041
$$ plain form
12947 2033533 2126353 2109206 1882212 1869101 1770909 1678777 1673161 1800717 1764403 1720833 1708565
12936 1708565 1639613 1501327 1603546 1639079 1726859 1679038 1558107 1525779 1349526 1241299
12926 1241299 1268075 1317727 1256560 1304646 1410666 1227966 1099517 1039556 986215 854411
12916 854411 845326 912590 911019 811648 890759 1048265 1057835 872470 857512 938564 1207667
12905 1207667 1308143 1048525 925761 1020197 1057059 1116578 965256 762962 745526 744211
12895 744211 665361 621222 534052 444059 592823 614262 662170 773010 735567 734721 637234
12884 637234 849769 1014409 1186304 1502231 1547468 1421901 1240754 866922 896941 935325
12874 935325 880233 757077 638293 584463 465512 461180 552505 451005 368090 284132 332786
$$ packed form
12947B033533R2820j7147k26994j3111r8192r2132n616J27556l6314m3570j2268
12936A708565o8952j38286J02219L5533Q7780m7821j20931l2328j76253j08227
12926A241299K6776M9652o1167M8086J06020j82700j28449n9961n3341j31804
12916H54411r085O7264j571r9371P9111J57506R570j85365j4958Q1052K69103
12905A207667J00476k59618j22764R4436L6862N9519j51322k02294j7436j315
12895G44211p8850m4139q7170q9993J48764K1439M7908J10840l7443q46r7487
12884F37234K12535J64640J71895L15927M5237j25567j81147l73832L0019L8384
12874I35325n5092j23156j18784n3830j18951m332R1325j01500q2915q3958M8654
$$ plain form
12863 332786 284255 202010 310886 466333 539997 554446 496037 672409 460187 131009
12853 131009 47527 276035 391644 567118 470959 343278 321133 144334 21594 105363
12843 105363 78927 161803 9370 -56394 84349 145025 33585 -15280 35929 133034 83017
12832 83017 -90479 114756 207069 101367 160207 213068 422984 439957 297340 219828 254020
12821 254020 236267 206665 157441 139652 264964 375002 323505 436518 633001 595363 499193
12810 499193 396774 281670 186277 -34357 10426 242131 378238 335596 360047 426769
12800 426769 469032 317909 151775 138247 247433 359329 414849 483695 451376 442562 402043
12789 402043 352945 319597 567576 440997 386415 299347 234314 231194 137524 218915 297082
$$ packed form
12863C32786m8531q2245J08876J55447P3664J4449n8409J76372k12222l29178
12853A31009q3482K28508J15609J75474r6159j27681k2145j76799j22740Q3769
12843A05363k6436Q2876j52433o5764J40743O0676j11440m8865N1209R7105n0017
12832H3017j73496K05235R2313j05702N8840N2861K09916J6973j42617p7512L4192
12821B54020j7753k9602m9224j7789J25312J10038n1497J13013J96483l7638r6170
12810D99193j02419j15104r5393k20634M4783K31705J36107m2642K4451O6722
12800D26769M2263j51123j66134j3528J09186J11896N5520O8846l2319q814m0519
12789D02043m9098l3348K47979j26579n4582q7068o5033l120r3670Q1391P8167
$$ plain form
12778 297082 477002 541312 459299 384904 348122 149357 138641 170046 169886 139791 203410
12767 203410 385239 515630 649731 609063 432849 362019 488783 467572 577782 482419
12757 482419 326755 308325 461112 440796 228995 136712 253561 412965 372554 317185
12747 317185 344325 356961 291072 362435 326664 286956 291486 212758 310680 411216 335981
12736 335981 361098 407181 289193 323029 411918 421177 479502 659786 897191 994015 1058955
12725 1058955 1053484 1038448 1084411 1060885 825351 692796 771782 918836 1204807 1453624
12715 1453624 1475754 1249837 1051727 740086 482390 315888 258154 311218 228336 151061
12705 151061 100542 112061 115854 189569 100852 205858 200143 198863 263288 372832 470626 429527
$$ packed form
12778B97082J79920O4310q2013p4395l6782j98765j0716L1405j60l0095O3619
12767B03410J81829J30391J34101m0668j76214p0830J26764k1211J10210r5363
12757D82419j55664j8430J52787k0316k11801r2283J16849J59404m0411n5369
12747C17185K7140J2636o5889P1363l5771l9708M530p8728R7922J00536p5235
12736C35981K5117M6083j17988L3836Q8889R259N8325J80284K37405R6824O4940
12725A058955n471j5036M5963k3526k35534j32555P8986J47054K85971K48817
12715A453624K2130k25917j98110l11641k57696j66502n7734N3064q2882p7275
12705A51061n0519J1519L793P3715q8717J05006n715j280O4425J09544R7794m1099
$$ plain form
12693 429527 272208 243343 243128 442856 477679 489135 572814 670859 691405 776277 813731
12682 813731 783072 991177 1305318 1770728 2115370 2211175 2116117 1861650 1606514 1642071
12672 1642071 1403134 1013750 780752 480621 261256 233202 389141 309956 430745 387520
12662 387520 196771 191537 443723 303017 106472 80270 66534 98895 76342 100558 48666
12651 48666 57687 109488 -35563 -100190 129781 273049 423226 522947 552309 472462 318161
12640 318161 331229 364270 597756 1099742 1401043 1407165 1246870 914211 802107 810560 959565
12629 959565 1066691 1263802 1412442 1182048 715016 364926 283353 254759 289629 266010
12619 266010 260181 285699 191777 140397 192247 206676 68566 -149872 -112652 -123104 -32358
$$ packed form
12693D29527j57319k8865k15J99728L4823J1456Q3679R8045K0546Q4872L7454
12682H13731l0659K08105L14141M65410L44642R5805r5058k54467k55136L5557
12672A642071k38937l89384k32998l00131k19365k8054J55939p9185J20789m3225
12662C87520j90749n234K52186j40706j96545k6202j3736L2361k2553K4216n1892
12651D8666R021N1801j45051o4627K29971J43268J50177R9721K9362p9847j54301
12640C18161J3068L3041K33486N01986L01301O122j60295l32659j12104Q453J49005
12629I59565J07126J97111J48640k30394m67032l50090q1573k8594L4870k3619
12619B66010n829K5518r3922n1380N1850J4429j38110k18438L7220j0452R0746
$$ plain form
12608 -32358 76843 128754 211001 234609 239597 225983 149410 250377 300750 267151 195314
12597 195314 153791 180050 243251 235328 171055 295623 735176 866054 1040463 1356889 1563820
12586 1563820 1467958 1581914 1691603 1784581 1682705 1593952 1363865 1223517 1055661 838885
12576 838885 579896 366320 250877 181740 297469 215039 181973 94807 55453 255111
12566 255111 294528 201123 262097 283851 220183 106237 -5943 40220 145830 158967 8561
12555 8561 -35981 152851 242825 368239 465611 347940 268433 321440 466646 748734 921329
12544 921329 1185999 1153225 1059941 967218 1079349 1110929 1089237 950135 922142 946524 1015474
12533 1015474 885537 662868 502568 251364 363796 508834 470827 375139 239964 145649
$$ packed form
12608c2358J09201N1911Q2247K3608M988j3614p6573J00967N0373l3599p1837
12597A95314m1523K6259O3201p923o4273J24568M39553J30878J74409L16426K06931
12586A563820r5862J13956J09689R2978j01876q8753k30087j40348j67856k16776
12576H38885k58989k13576j15443o9137J15729q2430l3066q7166l9354J99658
12566B55111L9417r3405O0974K1754o3668j13946j12180M6163J05610J3137j50406
12555H561m4542J88832Q9974J25414R7372j17671p9507N3007J45206K82088J72595
12544I21329K64670l2774r3284r2723J12131L1580k1692j39102k7993K4382O8950
12533A015474j29937k22669j60300k51204J12432J45038l8007r5688j35175r4315
$$ plain form
12523 145649 229939 156322 221940 93329 -23940 -95612 -42941 47032 61306 8271 197978
12512 197978 364420 391191 365274 213481 2548 -14279 27244 -20548 104374 187270 77266
12501 77266 70858 282175 315634 208689 100420 185350 566341 697719 649494 463327 71149
12490 71149 -137162 -14601 -70570 -148018 -206258 -173955 -190833 -192854 -114281 -28757 207822
12479 207822 239123 86150 26251 37752 64486 133488 322354 421161 344853 424342 236008
12468 236008 37141 -28662 106717 158257 86813 20688 -196013 -123611 101806 272157
12458 272157 241295 92570 -25258 -130541 -109920 -39917 -92206 -72074 -8675 -83478 -253913
12447 -253913 -316371 -249067 -160806 -49389 96649 151340 92211 -45949 47753 16399 -97990
$$ packed form
12523A45649Q4290p3617O5618j28611j17269p1672N2671Q9973J4274n3035J89707
12512A97978J66442K6771k5917j51793k10933j6827M1523m7792J24922Q2896j10004
12501G7266o408K11317L3459j06945j08269Q4930L80991J31378m8225j86167l92178
12490G1149k08311J22561n5969p7448n8240L2303j6878k021P8573Q5524K36579
12479B07822L1301j52973n9899J1501K6734O9002J88866R8807p6308P9489j88334
12468B36008j98867o5803J35379N1540p1444o6125k16701P2402K25417J70351
12458B72157l0862j48725j17828j05283K0621P0003n2289K0132O3399p4803j70435
12447b53913o2458O7304Q8261J11417J46038N4691n9129j38160R3702l1354j14389
$$ plain form
12436 -97990 -148451 -157579 -321752 -195040 -107651 -22985 -2857 57130 211839 -40912 -214789
12425 -214789 -209629 -55446 147397 292203 356890 200590 189639 245446 147098 55271 597
12414 597 -31748 -85546 -56300 169015 24659 62924 166216 204161 264098 206076 289482
12403 289482 159682 93716 56765 178710 297699 258587 149240 67256 42321 162113
12393 162113 146441 84207 -124580 -232107 -136561 -107140 -130172 -41360 -78502 1630 -32851
12382 -32851 51847 186112 220990 170612 9303 -117260 -99468 -102388 -100952 -674 31589
12371 31589 43160 42974 -26799 -13766 -63638 -40026 -30258 -62531 27795 144086 173568 145174
12359 145174 86964 21374 -46304 -88576 -50235 -38676 6096 2650 8098 83059 242733 313652
$$ packed form
12436i7990n0461r128j64173J26712Q7389Q4666K0128N9987J54709k52751j73877
12425b14789N160J54183K02843J44806O4687j56300j0951N5807r8348r1827n4674
12414E97l2345n3798K9246K25315j44356L8265J03292L7945N9937n8022Q3406
12403B89482j29800o5966l6951J21945J18989l9112j09347q1984k4935J19792
12393A62113j5672o2234k08787j07527R5546K9421k3032Q8812l7142Q0132l4481
12382c2851Q4698J34265L4878n0378j61309j26563J7792k920J436J00278L2263
12371C1589J1571j86o9773J3033m9872K3612R768l2273R0326J16291K9482k8394
12359A45174n8210o5590o7678m2272L8341J1559M4772l446N448P4961J59674P0919
$$ plain form
12347 313652 311329 253262 -3186 -131182 -65396 -97293 -90868 -100517 -115720 -168186 -76606 17128
12335 17128 73442 111305 98409 36063 -20461 -7127 -78169 45130 178518 218605 159499
12324 159499 2040 44535 -6902 -173093 -67514 82914 76283 -58000 8914 126730
12314 126730 232859 172946 121785 123685 73962 47952 -72245 32523 102243 239177 333651
12303 333651 215556 249891 228823 85391 79358 -152413 -180418 -131122 -148026 -295385 -131615
12292 -131615 196336 312707 293639 248204 183941 -129909 -172395 -91820 -95968 180131 304440
12281 304440 146141 33580 183331 184981 131080 168008 110224 -14727 -31560 -95799 -81006
12270 -81006 -165803 -224639 -205419 -140447 -230604 -346358 -83004 -117481 -62696 -83623 -121745
$$ packed form
12347C13652k323n8067k56448j27996O5786l1897O425r649j5203n2466R1580R3734
12335A7128N6314L7863j2896o2346n6524J3334p1042J23299J33388M0087n9106
12324A59499j57459M2495n1437j66191J05579J50428o631j34283O6914J17816
12314A26730J06129n9913n1161J900m9723k6010j20197J04768O9720J36934R4474
12303C33651j18095L4335k1068j43432o033k31771k8005M9296j6904j47359J63770
12292a31615L27951J16371j9068m5435o4263l13850m2486Q0575m148K76099J24309
12281C04440j58299j12561J49751J650n3901L6928n7784j24951j6833o4239J4793
12270h1006q4797n8836J9220O4972r0157j15754K63354l4477N4785k0927l8122
$$ plain form
12259 -121745 -183158 -321024 -341637 -252176 -101254 51217 32213 -47051 -100292 -30261 47183
12248 47183 83649 -103401 -219934 -224910 -282292 -195907 -109860 -55605 22902 157162 353176
12237 353176 324263 224903 116841 239294 207380 96105 185318 165969 84887 18002 -41759
12226 -41759 -70833 -4687 65307 -64706 -44978 133891 285230 237170 105428 -24512 -76505
12215 -76505 -76068 -97740 -4635 13918 87528 156200 30764 -39683 -158680 -19118 1274
12204 1274 -3038 -48852 -35187 -113926 -137644 -238245 -350815 -411289 -308139 -133136 -208120
12193 -208120 -281270 -211783 -212170 -61496 24095 -31696 38266 1974 -104470 590 -140103
12182 -140103 -158248 -114066 -323411 -429288 -271107 -190970 -376483 -305042 -190055 -103675
$$ packed form
12259a21745o1413j37866k0613Q9461J50922J52471j9004p9264n3241P0031P7444
12248D7183L6466j87050j16533m976n7382Q6385Q6047N4255P8507J34260J96014
12237C53176k8913r9360j08062J22453l1914j11275Q9213j9349q1082o6885n9761
12226d1759k9074O6146O9994j30013J9728J78869J51339m8060j31742j29940n1993
12215g6505M37k1672R3105J8553P3610O8672j25436p0447j18997J39562K0392
12204A274m312m5814J3665p8739k3718j00601j12570o0474J03150J75003p4984
12193b08120p3150O9487l87J50674Q5591n5791O9962l6292j06444J05060j40693
12182a40103j8145M4182k09345j05877J58181Q0137j85513P1441J14987Q6380
$$ plain form
12172 -103675 -42673 -57165 -53715 -37540 15630 171839 209725 286333 160601 -29296 -21771
12161 -21771 43931 100066 42987 -53939 -82995 -49961 59082 101071 88018 121191 15001
12150 15001 -61970 -120889 -137417 -50576 -42460 -26744 10163 30065 -104060 -156289 11581
12139 11581 -31734 -198562 -200906 -83337 -195897 -300060 -255176 -106409 -114547 -208107 -46288
12128 -46288 62646 88823 178504 85752 70245 75581 84318 -24712 -202624 -29649 -9916
12117 -9916 -144466 -158875 -69158 12176 49199 50287 40104 50238 -43742 -78439 14948 -3855
12105 -3855 -146845 -171717 -129191 -49248 1600 85462 177873 137638 92374 103192 34464 -50651
12093 -50651 61417 281527 183962 120553 107581 50211 38414 114021 -15112 -46617 -65188
$$ packed form
12172a03675O1002j4492L450J6175N3170J56209L7886P6608j25732j89897P525
12161b1771O5702N6135n7079r6926k9056L3034J09043M1989j3053L3173j06190
12150A5001p6971n8919j6528Q6841Q116J5716L6907J9902j34125n2229J67870
12139A1581m3315j66828k344J17569j12560j04163M4884J48767q138r3560J61819
12128d6288J08934K6177Q9681r2752j5507N336Q737j09030j77912J72975J9733
12117i916j34550j4409Q9717Q1334L7023J088j0183J0134r3980l4697R3387j8803
12105c855j42990k4872M2526P9943N0848Q3862R2411m0235m5264J0818o8728q5115
12093e0651J12068K20110r7565o3409j2972n7370j1797P5607j29133l1505j8571
$$ plain form
12082 -65188 -174021 -59880 -65259 -139454 -93702 -91413 -169129 -120142 23856 150980 81471
12071 81471 85155 57258 248551 289208 225573 168682 233012 115302 -79856 -66603 146013
12060 146013 118604 -27178 -40353 -5169 55765 179517 319677 379839 318706 270557 108239
12049 108239 175336 233366 56227 -99696 -113193 28755 46623 82415 89500 45934 -36357
12038 -36357 -240901 -187969 31835 192082 26607 40453 199241 89242 46032 84803
12028 84803 125651 146975 108847 119026 155288 148509 107143 -31482 92957 208890 128980
12017 128980 -21485 -6164 134698 172941 85407 27688 116806 108898 55544 256406 355049
12006 355049 306818 274014 126828 55752 22346 -31769 -35459 18954 1815 -208417 -113177
$$ packed form
12082f5188j08833J14141n379p4195M5752K289p7716M8987J43998J27124o9509
12071H1471L684k7897J91293M0657o3635n6891O4330j17710j95158J3253K12616
12060A46013k7409j45782j3175L5184O0934J23752J40160O0162o1133m8149j62318
12049A08239O7097N8030j77139j55923j3497J41948J7868L5792P085m3566q2291
12038c6357k04544N2932K19804J60247j65475J3846J58788j09999m3210L8771
12028H4803M0848K1324l8128J0179L6262o779m1366j38625J24439J15933p9910
12017A28980j50465J5321J40862L8243q7534n7719Q9118p908n3354K00862R8643
12006C55049m8231l2804j47186p1076l3406n4115l690N4413j7139k10232R5240
$$ plain form
11995 -113177 69648 135516 220875 247895 124459 -115103 -181831 -172343 -55913 -34901 -93649
11984 -93649 -210021 -158408 -115221 -94026 -177135 -74320 -11208 -190198 -141744 85208 77855
11973 77855 17263 9156 -19424 -64121 -7286 -26918 -106654 -314668 -349260 -240286 -240399 -230377
11961 -230377 -53022 14411 111875 180881 236406 168479 207880 74060 -49513 -182454 -142429
11950 -142429 -83360 107204 273756 190679 267573 460155 501447 374893 351921 247577
11940 247577 82311 63257 29201 31851 59385 -27468 41668 176714 263903 303120 231023
11929 231023 232154 219970 36923 4211 -17020 -45840 12674 -228748 -256664 -122357 -136298
11918 -136298 -176229 -185286 -214840 -98847 76618 64106 -109476 -7766 216204 260586 195264
$$ packed form
11995a13177J82825O5868Q5359K7020j23436k39562o6728R488J16430K1012n8748
11984i3649j16372N1613M3187K1195q3109J02815O3112j78990M8454K26952p353
11973G7855o0592q107k8580m4697N6835j9632p9736k08014l4592J08974j13J0022
11961b30377J77355O7433R7464O9006N5525o7927L9401j33820j23573j32941M0025
11950a42429N9069J90564J66552q3077P6894J92582M1292j26554k2972j04344
11940B47577j65266j9054l4056K650K7534q6853O9136J35046Q7189L9217p2097
11929B31023J131j2184j83047l2712k1231k8820N8514k41422k7916J34307j3941
11918a36298l9931r057k9554J15993J75465j2512j73582J01710K23970M4382o5322
$$ plain form
11907 195264 134250 -41399 -208596 -326268 -357361 -128414 111273 184146 133526 45702
11897 45702 62975 72164 73251 -172612 -214547 -177948 -281948 -188255 9648 129001 89370
11886 89370 112236 87399 7215 -75055 -217154 -302502 -350607 -236465 -185650 -149815 -93802
11875 -93802 7539 -3047 191384 213174 4687 -143820 2518 71155 4475 -130920
11865 -130920 -298174 -380706 -320756 -38832 -102433 -80982 73032 -14895 -7522 56510 72672
11854 72672 -22916 29812 -97788 -64506 -214064 -182131 -141770 91369 166471 57319 188031
11843 188031 276213 188494 -5307 -117811 -107988 -3824 53731 137327 12609 21237 107837
11832 107837 84053 87533 -208460 -187590 -82023 8655 111278 109777 3925 -183662 -259045
$$ packed form
11907A95264o1014j75649j67197j17672l1093K28947K39687P2873n0620q7824
11897D5702J7273R189J087k45863m1935L6599j04000R3693J97903J19353l9631
11886H9370K2866k4837q0184q2270j42099q5348m8105J14142N0815L5835N6013
11875i3802J01341j0586J94431K1790k08487j48507J46338O8637o6680j35395
11865a30920j67254q2532N9950K81924o3601K1451J54014q7927P373O4032J6162
11854G2672r5588N2728j27600L3282j49558L1933M0361K33139P5102j09152J30712
11843A88031Q8182q7719j93801j12504R823J04164N7555Q3596j24718Q628Q6600
11832A07837k3784L480k95993K0870J05567R0678J02623j501j05852j87587p5383
$$ plain form
11821 -259045 -346781 -376197 -264399 -154765 -175350 -59312 -17815 -239901 -237218 -259633 -164658
11810 -164658 -210848 -264690 -160698 -190544 -99839 -174689 -179828 -174813 -27694 -1018 36291
11799 36291 169289 69620 75725 133286 203494 173417 148530 215940 226644 149083 21751
11788 21751 100158 -21753 -114206 -115529 -170576 -204697 -234416 -202695 -185985 -109081 -97252 -250593
11776 -250593 -183610 -60313 40990 42978 31822 -17095 -110787 -181044 -212058 -95912 -36322
11765 -36322 -37586 -178071 -333538 -178201 -157874 -121540 -73154 -96950 -115194 39202 120567
11754 120567 44874 34639 12529 -94143 -60737 -5413 -139991 -31959 136636 184657 52023
11743 52023 54643 38781 -193774 -220648 -240452 -262304 -173224 191425 267788 140073 73421
$$ packed form
11821b59045q7736k9416J11798J09634k0585J16038M1497k22086K683k2415R4975
11810a64658m6190n3842J03992k9846R0705p4850n139N015J47119K6676L7309
11799C6291J32998r9669O105N7561P0208l0077k4887O7410J0704p7561j27332
11788B1751P8407j21911r2453j323n5047l4121k9719L1721J6710P6904J1829j53341
11776b50593O6983J23297J01303J988j1156m8917r3692p0257l1014J16146N9590
11765c6322j264j40485j55467J55337K0327L6334M8386k3796j8244J54396Q1365
11754A20567p5693j0235k2110j06672L3406N5324j34578J08032J68595M8021j32634
11743E2023K620j5862k32555k6874j9804k1852Q9080L64649P6363j27715o6652
$$ plain form
11732 73421 -2077 -76748 50480 -138042 -238945 -228284 -173503 15197 12490 -32214 -95203
11721 -95203 -167932 -108765 -5775 -82961 7712 104564 63566 -9104 58251 6766 -61291
$$ packed form
11732G3421p5498p4671J27228j88522j00903J0661N4781J88700k707m4704o2989
11721i5203p2729N9167J02990p7186R0673R6852m0998p2670O7355n1485o8057
$$ [...]
##END NTUPLES=NMR SPECTRUM
##END=
